
##TITLE=AC1109_Colombia_5835779_yvp2IzYgP9
##JCAMPDX= 6.0         $$ Bruker NMR JCAMP-DX V2.0
##DATA TYPE= NMR SPECTRUM
##DATA CLASS= NTUPLES
##ORIGIN= BRUKER
##OWNER= Administrator
$$ 1.72 TOPSPIN		Version 2.1
$$ 2012-03-28 11:05:21.890 -0500  Administrator@TOPSPIN
$$ Compression mode = diff/dup
##.OBSERVE FREQUENCY= 400.13188235
##.OBSERVE NUCLEUS= ^1H
##.ACQUISITION MODE= SIMULTANEOUS (DQD)
##.ACQUISITION SCHEME= undefined
##.AVERAGES= 64
##.DIGITISER RES= 22
##SPECTROMETER/DATA SYSTEM= spect
##.PULSE SEQUENCE= noesygpps1d.comp
##.SOLVENT NAME= COFFEE_meoh
##.SHIFT REFERENCE= INTERNAL, COFFEE_meoh, 1, 14.96833
##AUDIT TRAIL= $$ (NUMBER, WHEN, WHO, WHERE, PROCESS, VERSION, WHAT)
$$ ##TITLE= Audit trail, TOPSPIN		Version 2.1
$$ ##JCAMPDX= 5.01
$$ ##ORIGIN= Bruker BioSpin GmbH
$$ ##OWNER= Administrator
$$ $$ C:\Bruker\TOPSPIN/data/COFFEE/nmr/AC1109_Colombia_5835779_yvp2IzYgP9/22/pdata/1/auditp.txt
$$ ##AUDIT TRAIL=  $$ (NUMBER, WHEN, WHO, WHERE, PROCESS, VERSION, WHAT)
(   1,<2012-03-27 20:21:42.593 -0500>,<Administrator>,<TOPSPIN>,<go>,<TOPSPIN 2.1>,
      <created by zg
	started at 2012-03-27 20:10:10.578 -0500,
	POWCHK enabled, PULCHK disabled,
       configuration hash MD5:
       1A 1E CE 29 27 FD 77 03 67 4E F0 E3 C4 B2 CB 90
       data hash MD5: 64K
       81 D0 44 9D 7A 8D 71 30 10 73 57 DA 1F EC 05 F1>)
(   2,<2012-03-27 20:21:46.015 -0500>,<Administrator>,<TOPSPIN>,<proc1d>,<TOPSPIN 2.1>,
      <Start of raw data processing
       efp LB = 0.3 FT_mod = 6 PKNL = 1 PHC0 = 0 PHC1 = 0 SI = 128K 
       data hash MD5: 128K
       85 D2 0A 45 5F F9 68 93 C6 BA 98 10 33 17 AF 3D>)
(   3,<2012-03-27 20:21:47.609 -0500>,<Administrator>,<TOPSPIN>,<proc1d>,<TOPSPIN 2.1>,
      <pk PHC0 = 38.93005 PHC1 = 0 
       data hash MD5: 128K
       9C 02 27 C3 D4 90 AC 23 B0 B8 E6 47 73 12 87 A2>)
(   4,<2012-03-27 20:21:47.984 -0500>,<Administrator>,<TOPSPIN>,<proc1d>,<TOPSPIN 2.1>,
      <abs ABSG = 1 
       data hash MD5: 128K
       EC 55 B7 AE EC 75 4D DC EB 5B E4 C3 1C A1 68 28>)
(   5,<2012-03-27 20:21:48.078 -0500>,<Administrator>,<TOPSPIN>,<proc1d>,<TOPSPIN 2.1>,
      <abs ABSG = 2 
       data hash MD5: 128K
       65 3A 55 0B 01 3B 33 3D 3C EA 5C 80 3D 66 56 88>)
(   6,<2012-03-27 20:21:48.140 -0500>,<Administrator>,<TOPSPIN>,<proc1d>,<TOPSPIN 2.1>,
      <abs ABSG = 3 
       data hash MD5: 128K
       A5 F0 32 52 B8 FA 25 0A A0 B2 E7 41 17 88 A7 9B>)
(   7,<2012-03-27 20:21:48.234 -0500>,<Administrator>,<TOPSPIN>,<proc1d>,<TOPSPIN 2.1>,
      <abs ABSG = 4 
       data hash MD5: 128K
       39 E9 4F 04 8D B3 93 A1 03 03 5E F3 87 D7 C3 D3>)
(   8,<2012-03-27 20:21:48.328 -0500>,<Administrator>,<TOPSPIN>,<proc1d>,<TOPSPIN 2.1>,
      <abs ABSG = 5 
       data hash MD5: 128K
       DC 0D 95 3E 68 4B E7 6B BD F4 44 52 55 76 A1 E4>)
(   9,<2012-03-27 20:21:48.609 -0500>,<Administrator>,<TOPSPIN>,<audit>,<TOPSPIN 2.1>,
      <user comment:
       ICON-NMR User ID: COFFEE
       data hash MD5: 128K
$$ [...]
##$TP07= 0
##$TPNAME0= <>
##$TPNAME1= <>
##$TPNAME2= <>
##$TPNAME3= <>
##$TPNAME4= <>
##$TPNAME5= <>
##$TPNAME6= <>
##$TPNAME7= <>
##$TPOAL= (0..7)
0.5 0.5 0.5 0.5 0.5 0.5 0.5 0.5
##$TPOFFS= (0..7)
0 0 0 0 0 0 0 0
##$TUNHIN= 0
##$TUNHOUT= 0
##$TUNXOUT= 0
##$USERA1= <user>
##$USERA2= <user>
##$USERA3= <user>
##$USERA4= <user>
##$USERA5= <user>
##$V9= 5
##$VALIST= <valist>
##$VCLIST= <CCCCCCCCCCCCCCC>
##$VD= 0
##$VDLIST= <DDDDDDDDDDDDDDD>
##$VPLIST= <PPPPPPPPPPPPPPP>
##$VTLIST= <TTTTTTTTTTTTTTT>
##$WBST= 2048
##$WBSW= 25
##$XGAIN= (0..3)
0 0 0 0
##$XL= 0
##$YL= 0
##$YMAX_a= 13140977
##$YMIN_a= -5931056
##$ZGOPTNS= <>
##$ZL1= 120
##$ZL2= 120
##$ZL3= 120
##$ZL4= 120
##$ABSF1= 14.96833
##$ABSF2= -5.5842
##$ABSG= 5
##$ABSL= 3
##$ALPHA= 0
##$AQORDER= 0
##$ASSFAC= 0
##$ASSFACI= 0
##$ASSFACX= 0
##$ASSWID= 0
##$AUNMP= <proc_prof1d_extract.lims>
##$AXLEFT= 0
##$AXNAME= <>
##$AXNUC= <1H>
##$AXRIGHT= 0
##$AXTYPE= 0
##$AXUNIT= <>
##$AZFE= 0.1
##$AZFW= 0.1
##$BCFW= 0
##$BC_mod= 0
##$BYTORDP= 0
##$COROFFS= 0
##$CY= 15
##$DATMOD= 1
##$DC= 0
##$DFILT= <>
##$DTYPP= 0
##$F1P= 0
##$F2P= 0
##$FCOR= 0.5
##$FTSIZE= 131072
##$FT_mod= 6
##$GAMMA= 0
##$GB= 0
##$INTBC= 1
##$INTSCL= 1
##$ISEN= 128
##$LB= 0.3
##$LEV0= 0
##$LPBIN= 0
##$MAXI= 10000
##$MC2= 0
##$MEAN= 0
##$ME_mod= 0
##$MI= 0
##$NCOEF= 0
##$NC_proc= -3
##$NLEV= 6
##$NOISF1= 0
##$NOISF2= 0
##$NSP= 0
##$NTH_PI= 0
##$NZP= 0
##$OFFSET= 14.96833
##$PC= 1
##$PHC0= 38.93005
##$PHC1= 0
##$PH_mod= 1
##$PKNL= yes
##$PPARMOD= 0
##$PPDIAG= 0
##$PPIPTYP= 0
##$PPMPNUM= 2147483647
##$PPRESOL= 1
##$PSCAL= 4
##$PSIGN= 0
##$PYNMP= <proc.py>
##$REVERSE= no
##$SF= 400.130004913092
##$SI= 131072
##$SIGF1= 0
##$SIGF2= 0
##$SINO= 400
##$SIOLD= 131072
##$SPECTYP= <>
##$SREGLST= <1H.CDCl3>
##$SSB= 0
##$STSI= 131072
##$STSR= 0
##$SW_p= 8223.68421052632
##$SYMM= 0
##$S_DEV= 0
##$TDeff= 65536
##$TDoff= 0
##$TI= <>
##$TILT= no
##$TM1= 0
##$TM2= 0
##$TOPLEV= 0
##$USERP1= <user>
##$USERP2= <user>
##$USERP3= <user>
##$USERP4= <user>
##$USERP5= <user>
##$WDW= 1
##$XDIM= 131072
##$YMAX_p= 481404437
##$YMIN_p= -321490008
##$CURPLOT= <Network HP LaserJet P1505>
##$CURPRIN= <$Network HP LaserJet P1505>
##$DFORMAT= <normdp>
##$LAYOUT= <+/1D_H.xwp>
##$LFORMAT= <normlp>
##$PFORMAT= <normpl>
##$SURQMSG= 1
$$ End of Bruker specific parameters
$$ ---------------------------------
##NTUPLES= NMR SPECTRUM
##VAR_NAME=  FREQUENCY,     SPECTRUM/REAL,   SPECTRUM/IMAG
##SYMBOL=    X,             R,               I
##VAR_TYPE=  INDEPENDENT,   DEPENDENT,       DEPENDENT
##VAR_FORM=  AFFN,          ASDF,            ASDF
##VAR_DIM=   131072,        131072,          131072
##UNITS=     HZ,            ARBITRARY UNITS, ARBITRARY UNITS
##FACTOR=    0.0627417313425165, 1,          1
##FIRST=     8223.62146879498, 7237,         -98597
##LAST=      0,             11376,           -98073
##MIN=       0,             -321490008,      0
##MAX=       8223.62146879498, 481404437,    0
$$ Real data points
##PAGE= N=1
##DATA TABLE= (X++(R..R)), XYDATA
$$ [...]
$$ plain form
62945 2973820 2920162 2875966 2838832 2807242 2781913 2764645 2756422 2756663 2763712 2775729 2791311 2809526
62933 2809526 2829533 2850634 2872794 2896413 2921042 2944919 2966567 2986383 3005630 3024088 3039713
62922 3039713 3050522 3055671 3054551 3046094 3029616 3005408 2973723 2933722 2884217 2825252 2758460 2686175
62910 2686175 2610554 2533159 2454825 2376087 2298084 2222617 2150745 2081663 2013766 1946929 1883107
62899 1883107 1824461 1771331 1722273 1675714 1631178 1589131 1550226 1514876 1483273 1455427 1431105
62888 1431105 1409868 1391164 1374301 1358421 1342817 1327414 1312770 1299513 1287887 1277779 1268761
62877 1268761 1259891 1249859 1237826 1224094 1209812 1196245 1184387 1174753 1166988 1159940 1152572 1144572
62865 1144572 1135793 1125790 1114774 1104545 1097156 1092552 1088559 1083361 1076981 1070223 1063494 1057229 1052153
$$ packed form
62945B973820n3658m4196l7134l1590k5329j7268q223K41P049J2017J5582J8215
62933B809526K0007K1101K2160K3619K4629K3877K1648J9816J9247J8458J5625
62922C039713J0809N149j120q457j6478k4208l1685m0001m9505n8965o6792p2285
62910B686175p5621p7395p8334p8738p8003p5467p1872o9082o7897o6837o3822
62899A883107n8646n3130m9058m6559m4536m2047l8905l5350l1603k7846k4322
62888A431105k1237j8704j6863j5880j5604j5403j4644j3257j1626j0108r018
62877A268761q870j0032j2033j3732j4282j3567j1858r634p765p048p368q000
62865A144572q779j0003j1016j0229p389m604l993n198o380o758o729o265n076
$$ plain form
62852 1052153 1048168 1044037 1039240 1035138 1032965 1031563 1028914 1025452 1023746 1024693 1026188 1026447 1026745 1029314 1033769
62837 1033769 1037458 1038854 1038840 1038758 1038914 1039393 1040819 1043327 1045620 1046086 1044529 1042178 1040211 1038788 1037297 1035058
62821 1035058 1031960 1028660 1025909 1023406 1019860 1014756 1009546 1006160 1004495 1002381 998151 992407 986896 982397
62807 982397 978269 973591 968160 962529 957452 953174 949109 944355 938589 932213 925651 918958 912118 905189
62793 905189 898078 890841 884411 880201 878455 877646 876078 873582 871166 869651 869296 870047 871286 871922 871674
62778 871674 871798 873575 876622 879812 883309 888078 893705 898518 902194 906481 912684 920033 927447 935329
62764 935329 944275 953202 960477 966227 971945 978170 984161 989794 996146 1003797 1011831 1019165 1025943 1032971
62750 1032971 1040573 1048708 1057650 1067715 1078599 1089618 1100556 1111789 1123780 1137000 1152302 1170688
$$ packed form
62852A052153l985m131m797m102k173j402k649l462j706R47J495K59K98K569M455
62837A033769L689J396j4q2J56M79J426K508K293M66j557k351j967j423j491k239
62821A035058l098l300k751k503l546n104n210l386j665k114m230n744n511m499
62807I82397m128m678n431n631n077m278m065m754n766o376o562o693o840o929
62793I05189p111p237o430m210j746q09j568k496k416j515l55P51J239O36k48
62778H71674J24J777L047L190L497M769N627M813L676M287O203P349P414P882
62764I35329Q946Q927P275N750N718O225N991N633O352P651Q034P334O778P028
62750A032971P602Q135Q942J0065J0884J1019J0938J1233J1991J3220J5302J8386
$$ plain form
62738 1170688 1192365 1216393 1241628 1267827 1295604 1325595 1358243 1394358 1435092 1480745 1529939
62727 1529939 1580753 1632817 1687870 1748151 1814718 1887483 1966293 2051433 2143226 2241561 2345826
62716 2345826 2455188 2569252 2688670 2814774 2948058 3087020 3228700 3369990 3508027
62707 3508027 3639696 3761676 3871172 3965944 4043468 4100786 4135813 4148455 4139970 4111403 4063088
62696 4063088 3995518 3910181 3809495 3696334 3573634 3444017 3309432 3171301 3031191 2891246
62686 2891246 2753780 2620482 2492179 2369361 2252784 2143441 2041960 1948093 1860779 1778763
62676 1778763 1701292 1628504 1561302 1500738 1447125 1399511 1356159 1315871 1278912 1246481 1219150
62665 1219150 1195918 1174831 1154448 1134740 1116789 1101742 1089912 1080734 1073593 1068595 1066311 1066813
$$ packed form
62738A170688K1677K4028K5235K6199K7777K9991L2648L6115M0734M5653M9194
62727A529939N0814N2064N5053O0281O6567P2765P8810Q5140R1793R8335J04265
62716B345826J09362J14064J19418J26104J33284J38962J41680J41290J38037
62707C508027J31669J21980J09496R4772P7524N7318L5027J2642q485k8567m8315
62696D063088o7570q5337j00686j13161j22700j29617j34585j38131j40110j39945
62686B891246j37466j33298j28303j22818j16577j09343j01481r3867q7314q2016
62676A778763p7471p2788o7202o0564n3613m7614m3352m0288l6959l2431k7331
62665A219150k3232k1087k0383j9708j7951j5047j1830r178p141m998k284N02
$$ plain form
62653 1066813 1069341 1073145 1078316 1085496 1095126 1107331 1122170 1139447 1158585 1179443 1203201 1231618
62641 1231618 1265174 1302579 1342403 1384618 1430257 1480154 1534429 1592671 1654032 1717510 1782650
62630 1782650 1849773 1919028 1989378 2058858 2125583 2188136 2245174 2295045 2335768 2365367 2382552
62619 2382552 2387170 2379553 2359537 2327118 2284289 2234835 2181206 2122519 2056896 1984998 1909894 1834113
62607 1834113 1758628 1684407 1612819 1544052 1476914 1411010 1347692 1288195 1232301 1179862 1132165
62596 1132165 1090347 1053362 1018960 986080 955042 925997 898707 873567 851329 831631 812961
62585 812961 794303 775922 758394 741828 726257 711866 698435 685327 672477 660743 650834 642375
62573 642375 634457 626701 619310 612510 606525 601877 599108 598121 598212 598857 600152 602294 604917 607343 609454
$$ packed form
62653A066813K528L804N171P180R630J2205J4839J7277J9138K0858K3758K8417
62641A231618L3556L7405L9824M2215M5639M9897N4275N8242O1361O3478O5140
62630A782650O7123O9255P0350O9480O6725O2553N7038M9871M0723K9599J7185
62619B382552M618p617k0016l2419m2829m9454n3629n8687o5623p1898p5104p5781
62607A834113p5485p4221p1588o8767o7138o5904o3318n9497n5894n2439m7697
62596A132165m1818l6985l4402l2880l1038k9045k7290k5140k2238j9698j8670
62585H12961j8658j8381j7528j6566j5571j4391j3431j3108j2850j1734r909q459
62573F42375p918p756p391o800n985m648k769r87R1O45J295K142K623K426K111
$$ plain form
62558 609454 611858 614947 618216 621102 624288 629362 637024 646365 656301 667014 679286 693013 707364
62545 707364 722276 738867 758266 780725 806007 833905 864078 896061 929965 966893 1008262
62534 1008262 1054851 1106620 1163038 1223257 1286308 1351675 1419615 1490521 1563846 1637876 1710593
62523 1710593 1780443 1846016 1905178 1955050 1993355 2019817 2035882 2042751 2039879 2025699 1999814 1964090
62511 1964090 1921406 1873574 1820705 1762529 1700064 1635760 1572084 1510166 1449946 1391344 1334908
62500 1334908 1281361 1231018 1183886 1140088 1099904 1063516 1030782 1001079 973283 946322 920029
62489 920029 895186 872451 851497 831470 811888 792669 773680 755009 737557 722620 710598
62478 710598 700585 691448 683011 675996 671044 667858 665134 661435 656556 652107 650392 652553 658000 665508
$$ packed form
62558F09454K404L089L269K886L186N074P662R341R936J0713J2272J3727J4351
62545G07364J4912J6591J9399K2459K5282K7898L0173L1983L3904L6928M1369
62534A008262M6589N1769N6418O0219O3051O5367O7940P0906P3325P4030P2717
62523A710593O9850O5573N9162M9872L8305K6462J6065O869k872j4180k5885l5724
62511A964090m2684m7832n2869n8176o2465o4304o3676o1918o0220n8602n6436
62500A334908n3547n0343m7132m3798m0184l6388l2734k9703k7796k6961k6293
62489I20029k4843k2735k0954k0027j9582j9219j8989j8671j7452j4937j2022
62478G10598j0013r137q437p015m952l186k724l699m879m449j715K161N447P508
$$ plain form
62464 665508 674269 683796 693568 703447 714119 726522 740861 756622 773569 792274 813553 837785
62452 837785 864991 895227 928380 963726 1000194 1037239 1075065 1113749 1152517 1190255 1226360
62441 1226360 1260534 1291945 1319269 1341560 1358457 1369510 1374062 1372011 1363986 1350499 1331727 1308408
62429 1308408 1281896 1252685 1219915 1183390 1145329 1108876 1075367 1044298 1015367 988840 964124
62418 964124 939978 916667 896254 879838 865855 852101 838458 826566 817658 811752 808202 805879
62406 805879 803426 800630 799208 800930 805085 808977 811034 812321 814842 819499 826224 835050 846137 859073
62392 859073 872811 886220 898622 910182 922115 936042 952625 970855 988881 1005263 1019222
62381 1019222 1030165 1037625 1041632 1042537 1040216 1033815 1022621 1007136 988993 969708 949597 928046
$$ packed form
62464F65508Q761R527R772R879J0672J2403J4339J5761J6947J8705K1279K4232
62452H37785K7206L0236L3153L5346L6468L7045L7826L8684L8768L7738L6105
62441A226360L4174L1411K7324K2291J6897J1053M552k051q025j3487j8772k3319
62429A308408k6512k9211l2770l6525l8061l6453l3509l1069k8931k6527k4716
62418I64124k4146k3311k0413j6416j3983j3754j3643j1892q908n906l550k323
62406H05879k453k796j422J722M155L892K057J287K521M657O725Q826J1087J2936
62392H59073J3738J3409J2402J1560J1933J3927J6583J8230J8026J6382J3959
62381A019222J0943P460M007R05k321o401j1194j5485j8143j9285k0111k1551
$$ plain form
62369 928046 904851 881105 858613 838456 820311 803257 787056 772447 760198 750134 741244 732664
62357 732664 724421 717311 712210 709449 708625 708958 710107 712719 717859 725574 734315 742244 748991 755689 763417
62342 763417 772297 782178 793309 805743 818650 830982 842601 854012 865041 874569 881862 887606
62330 887606 893242 899434 905467 909922 911873 911655 910727 910524 911218 911780 911483 911108 912281 915803 921200 928031
62314 928031 937062 949697 966531 986989 1010346 1036687 1066770 1101325 1140626 1184488 1232503 1284577
62302 1284577 1341328 1403693 1471876 1544976 1621793 1701581 1783551 1866032 1946667 2023295 2094107
62291 2094107 2157242 2211008 2254603 2288078 2311635 2325474 2330072 2325615 2311110 2285197 2248298 2202967
62279 2202967 2151549 2094530 2032068 1966151 1899981 1835704 1773909 1714898 1659120 1606470 1556351
$$ packed form
62369I28046k3195k3746k2492k0157j8145j7054j6201j4609j2249j0064q890q580
62357G32664q243p110n101k761q24L33J149K612N140P715Q741P929O747O698P728
62342G63417Q880R881J1131J2434J2907J2332J1619J1411J1029R528P293N744
62330H87606N636O192O033M455J951k18r28k03O94N62k97l75J173L522N397O831
62314I28031R031J2635J6834K0458K3357K6341L0083L4555L9301M3862M8015N2074
62302A284577N6751O2365O8183P3100P6817P9788Q1970Q2481Q0635P6628P0812
62291B094107O3135N3766M3595L3475K3557J3839M598m457j4505k5913l6899m5331
62279B202967n1418n7019o2462o5917o6170o4277o1795n9011n5778n2650n0119
$$ plain form
62268 1556351 1508452 1462462 1417308 1372149 1328163 1287715 1251232 1216440 1181517 1147620 1117190
62257 1117190 1090963 1068000 1047716 1030242 1015261 1002135 991072 982769 976791 971667 966832 963270
62245 963270 961814 961850 962163 962113 961424 959688 956797 953240 949288 944416 938220 931420 925289 920267 915763 911075
62229 911075 906030 901026 897027 895401 897155 902124 909052 916453 923538 930811 939923 952294 967557 983945
62215 983945 1000682 1019119 1040742 1064812 1089223 1113320 1138601 1166739 1198245 1233191 1271814
62204 1271814 1313840 1358368 1405306 1456070 1511998 1572580 1636060 1701332 1768495 1837896 1909313
62193 1909313 1981653 2052510 2118188 2175114 2221628 2257929 2284240 2299691 2303223 2295025 2276510 2249024
62181 2249024 2212985 2168433 2116148 2058021 1996290 1932585 1867854 1802983 1739212 1677948 1620356
$$ packed form
62268A556351m7899m5990m5154m5159m3986m0448l6483l4792l4923l3897l0430
62257A117190k6227k2963k0284j7474j4981j3126j1063q303n978n124m835l562
62245I63270j456L6L13n0o89j736k891l557l952m872o196o800o131n022m504m688
62229I11075n045n004l999j626J754M969O928P401P085P273R112J2371J5263J6388
62215I83945J6737J8437K1623K4070K4411K4097K5281K8138L1506L4946L8623
62204A271814M2026M4528M6938N0764N5928O0582O3480O5272O7163O9401P1417
62193A909313P2340P0857O5678N6926M6514L6301K6311J5451L532q198j8515k7486
62181B249024l6039m4552n2285n8127o1731o3705o4731o4871o3771o1264n7592
$$ plain form
62170 1620356 1566942 1517207 1470065 1425289 1384510 1349928 1321799 1297953 1276105 1255878 1238075
62159 1238075 1222948 1210117 1199554 1191375 1184889 1178978 1173608 1170073 1169405 1171067 1173396 1174913 1175130 1174608
62145 1174608 1174406 1175135 1176449 1177674 1178821 1180636 1183863 1188906 1196024 1205264 1216212 1228381 1241772 1256602
62131 1256602 1272675 1289757 1308446 1329833 1354193 1380663 1408242 1436300 1463973 1490068 1514060
62120 1514060 1536598 1558690 1580953 1603939 1628475 1655235 1684413 1716069 1750206 1786379 1824157
62109 1824157 1864373 1908958 1958766 2012303 2067388 2123245 2179841 2235680 2287657 2333226 2371782
62098 2371782 2403828 2429674 2449312 2462931 2471007 2474043 2472327 2465809 2454260 2437758 2417008 2393097
62086 2393097 2367190 2340606 2314675 2289986 2265972 2241808 2217666 2194741 2174199 2156417 2141048
$$ packed form
62170A620356n3414m9735m7142m4776m0779l4582k8129k3846k1848k0227j7803
62159A238075j5127j2831j0563q179o486n911n370l535o68J662K329J517K17n22
62145A174608k02P29J314J225J147J815L227N043P118R240J0948J2169J3391J4830
62131A256602J6073J7082J8689K1387K4360K6470K7579K8058K7673K6095K3992
62120A514060K2538K2092K2263K2986K4536K6760K9178L1656L4137L6173L7778
62109A824157M0216M4585M9808N3537N5085N5857N6596N5839N1977M5569L8556
62098B371782L2046K5846J9638J3619Q076L036j716o518j1549j6502k0750k3911
62086B393097k5907k6584k5931k4689k4014k4164k4142k2925k0542j7782j5369
$$ plain form
62075 2141048 2127358 2114577 2102297 2090512 2079221 2068374 2058436 2050373 2044587 2040381 2037225 2035936
62063 2035936 2037717 2042426 2048891 2056727 2066622 2078755 2092133 2105866 2120224 2136103 2154317 2175659
62051 2175659 2200642 2228624 2258018 2288007 2319457 2353710 2391211 2431754 2475157 2521026 2568750
62040 2568750 2618603 2672031 2729750 2790149 2850632 2910012 2968352 3025160 3079634 3132756 3187231
62029 3187231 3244584 3303634 3362670 3421790 3481883 3542326 3601290 3658052 3713621 3769134 3824976
62018 3824976 3881821 3941224 4004130 4069276 4134043 4196982 4259040 4322289 4388014 4456341 4527301
62007 4527301 4601479 4679198 4759428 4840167 4919932 4998284 5074645 5147387 5214893 5277202 5335709
61996 5335709 5391200 5442963 5489913 5531766 5568742 5600954 5628755 5653099 5674815 5693817 5709734
$$ packed form
62075B141048j3690j2781j2280j1785j1291j0847r938q063n786m206l156j289
62063B035936J781M709O465P836R895J2133J3378J3733J4358J5879J8214K1342
62051B175659K4983K7982K9394K9989L1450L4253L7501M0543M3403M5869M7724
62040B568750M9853N3428N7719O0399O0483N9380N8340N6808N4474N3122N4475
62029C187231N7353N9050N9036N9120O0093O0443N8964N6762N5569N5513N5842
62018C824976N6845N9403O2906O5146O4767O2939O2058O3249O5725O8327P0960
62007D527301P4178P7719Q0230Q0739P9765P8352P6361P2742O7506O2309N8507
61996E335709N5491N1763M6950M1853L6976L2212K7801K4344K1716J9002J5917
$$ plain form
61985 5709734 5723039 5734948 5746410 5757872 5769798 5782549 5795764 5808711 5821390 5834497 5848106
61974 5848106 5861330 5873735 5886193 5899529 5913002 5925078 5935438 5945230 5955304 5965021 5973063 5978694
61962 5978694 5981791 5982166 5979493 5973882 5966108 5957171 5947863 5938774 5930349 5922617 5915002 5906903 5898605 5891234
61948 5891234 5885518 5880960 5876638 5872563 5869679 5868625 5869170 5870860 5873534 5877061 5881305 5886581 5893426 5901455
61934 5901455 5909105 5915076 5919493 5923044 5925525 5925950 5923673 5918517 5910047 5897684 5881570 5862673 5841980
61921 5841980 5820164 5797902 5775702 5753264 5729695 5704522 5678004 5650403 5621562 5591344 5559877
61910 5559877 5527159 5493003 5457550 5421346 5384720 5347550 5309756 5271399 5232207 5191743 5150373
61899 5150373 5109379 5069698 5031204 4993631 4957430 4923084 4890237 4858333 4827684 4799043 4772456
$$ packed form
61985E709734J3305J1909J1462J1462J1926J2751J3215J2947J2679J3107J3609
61974E848106J3224J2405J2458J3336J3473J2076J0360R792J0074R717Q042N631
61962E978694L097L75k673n611p774q937r308r089q425p732p615q099q298p371
61948E891234n716m558m322m075k884j054N45J690K674L527M244N276O845Q029
61934E901455P650N971M417L551K481M25k277n156q470j2363j6114j8897k0693
61921E841980k1816k2262k2200k2438k3569k5173k6518k7601k8841l0218l1467
61910E559877l2718l4156l5453l6204l6626l7170l7794l8357l9192m0464m1370
61899E150373m0994l9681l8494l7573l6201l4346l2847l1904l0649k8641k6587
$$ plain form
61888 4772456 4747413 4723943 4702653 4683815 4667383 4653954 4644650 4639671 4637823 4638041 4640738 4646940 4656630
61875 4656630 4668725 4682557 4698659 4718024 4741205 4768340 4799624 4835442 4876265 4922706 4975544
61864 4975544 5035460 5102751 5177493 5259952 5350750 5450748 5561093 5683477 5820087 5973044
61854 5973044 6143936 6334112 6545446 6780761 7043515 7337085 7664073 8026031 8423984
61845 8423984 8859655 9336373 9858546 10430046 11053026 11727995 12454110 13228343 14043532
61836 14043532 14886598 15737853 16571274 17355191 18053462 18628212 19044963 19278980 19319734
61827 19319734 19171099 18848233 18374072 17776701 17086482 16332513 15540143 14730627 13921422
61818 13921422 13125657 12352032 11606693 10895419 10223086 9591364 8998775 8444068 7928535
$$ packed form
61888D772456k5043k3470k1290j8838j6432j3429r304m979j848K18K697O202R690
61875D656630J2095J3832J6102J9365K3181K7135L1284L5818M0823M6441N2838
61864D975544N9916O7291P4742Q2459R0798R9998J10345J22384J36610J52957
61854E973044J70892J90176K11334K35315K62754K93570L26988L61958L97953
61845H423984M35671M76718N22173N71500O22980O74969P26115P74233Q15189
61836A4043532Q43066Q51255Q33421P83917O98271N74750M16751K34017M0754
61827A9319734j48635l22866m74161n97371o90219p53969p92370q09516q09205
61818A3921422p95765p73625p45339p11274o72333o31722n92589n54707n15533
$$ plain form
61809 7928535 7454005 7019385 6620665 6254211 5918729 5613810 5337750 5087481 4859829
61800 4859829 4652205 4462617 4289800 4133052 3991365 3862958 3746177 3640467 3545820 3461521
61790 3461521 3386268 3319273 3260136 3207549 3159284 3114010 3072172 3034345 2999559 2966272 2934434
61779 2934434 2905352 2879639 2856470 2835074 2815957 2800191 2788201 2779703 2774218 2771058 2769288 2768297
61767 2768297 2768290 2769857 2773316 2778787 2786471 2796266 2807342 2818756 2830548 2843729 2859161 2876890 2896694
61754 2896694 2918836 2944041 2973034 3006416 3044769 3088552 3137779 3191975 3250685 3314309 3384498
61743 3384498 3463357 3551888 3649353 3754693 3868420 3992435 4127748 4273114 4426682 4588833
61733 4588833 4762760 4952270 5159536 5385014 5628839 5891742 6174979 6480149 6809581
$$ packed form
61809G928535m74530m34620l98720l66454l35482l04919k76060k50269k27652
61800D859829k07624j89588j72817j56748j41687j28407j16781j05710r4647q4299
61790C461521p5253o6995n9137n2587m8265m5274m1838l7827l4786l3287l1838
61779B934434k9082k5713k3169k1396j9117j5766j1990q498n485l160j770r91
61767B768297pJ567L459N471P684R795J1076J1414J1792J3181J5432J7729J9804
61754B896694K2142K5205K8993L3382L8353M3783M9227N4196N8710O3624P0189
61743C384498P8859Q8531R7465J05340J13727J24015J35313J45366J53568J62151
61733D588833J73927J89510K07266K25478K43825K62903K83237L05170L29432
$$ plain form
61724 6809581 7166776 7556116 7981740 8446534 8952455 9502177 10100474 10753856 11468974
61715 11468974 12251685 13107345 14041055 15056995 16157900 17345614 18621464 19984620
61707 19984620 21428845 22939716 24493133 26054161 27576013 29000742 30262997 31296701
61699 31296701 32043595 32462249 32534795 32268360 31690960 30845003 29781421 28554450 27216123
61690 27216123 25811669 24377843 22943931 21533088 20162799 18845308 17588817 16398894
61682 16398894 15279310 14232308 13258604 12357321 11526239 10762430 10062666 9423085 8838872
61673 8838872 8304911 7816894 7371544 6965950 6597200 6262564 5959349 5684360 5434087
61664 5434087 5205652 4997075 4806329 4630722 4467672 4315721 4174417 4043555 3922898
$$ packed form
61724F809581L57195L89340M25624M64794N05921N49722N98297O53382P15118
61715A1468974P82711Q55660R33710J015940J100905J187714J275850J363156
61707A9984620J444225J510871J553417J561028J521852J424729J262255J033704
61699C1296701P46894M18654P2546k66435n77400q45957j063582j226971j338327
61690B7216123j404454j433826j433912j410843j370289j317491j256491j189923
61682A6398894j119584j047002r73704r01283q31082p63809o99764o39581n84213
61673H838872n33961m88017m45350m05594l68750l34636l03215k74989k50273
61664E434087k28435k08577j90746j75607j63050j51951j41304j30862j20657
$$ plain form
61655 3922898 3811987 3709416 3612607 3519280 3429275 3344172 3264980 3190928 3120826 3054666 2993097
61644 2993097 2935832 2881586 2829487 2779610 2731939 2685654 2639925 2594851 2550978 2508317 2466405
61633 2466405 2424985 2384026 2343472 2303826 2266611 2232959 2201538 2169233 2134585 2099571 2067170
61622 2067170 2038125 2011229 1985967 1963197 1943360 1925606 1909096 1893968 1880411 1867825 1855655
61611 1855655 1844319 1834521 1826050 1817909 1809369 1800335 1790900 1781039 1770615 1759425 1747456 1735344 1724174
61598 1724174 1714437 1705474 1696312 1686681 1676866 1666925 1656668 1646228 1636238 1627646 1621625 1619100 1619556 1620647
61584 1620647 1619965 1617330 1614623 1613330 1613176 1613402 1614298 1616486 1619302 1621027 1620937 1620343 1621219 1624302 1628902 1634266
61568 1634266 1640519 1648184 1657235 1666892 1676164 1684334 1691009 1696033 1699559 1702089 1704193 1705990 1706835 1705634
$$ packed form
61655C922898j10911j02571r6809r3327r0005q5103p9192p4052p0102o6160o1569
61644B993097n7265n4246n2099m9877m7671m6285m5729m5074m3873m2661m1912
61633B466405m1420m0959m0554l9646l7215l3652l1421l2305l4648l5014l2401
61622B067170k9045k6896k5262k2770j9837j7754j6510j5128j3557j2586j2170
61611A855655j1336r798q471q141q540r034r435r861j0424j1190j1969j2112j1170
61598A724174r737q963r162r631r815r941j0257j0440r990q592o021k525M56J091
61584A620647o82k635k707j293j54K26Q96K188K816J725r0n94Q76L083M600N364
61568A634266O253P665R051R657R272Q170O675N024L526K530K104J797Q45j201
$$ plain form
61554 1705634 1701736 1695627 1688571 1681404 1673850 1665224 1655544 1645565 1635831 1626165 1616127 1605503 1594177
61541 1594177 1581982 1569082 1556291 1544607 1534369 1525069 1516053 1507346 1499707 1493808 1489476 1486034 1483452
61528 1483452 1482763 1485001 1490122 1497408 1506505 1517270 1528873 1540236 1551619 1564887 1581696 1602159
61516 1602159 1625718 1652432 1682530 1715304 1749496 1784751 1821972 1862202 1905652 1951807 2000128
61505 2000128 2050570 2103388 2158055 2212388 2263699 2311356 2357409 2403726 2449256 2491292 2529067
61494 2529067 2564500 2599326 2632988 2663938 2691769 2717085 2740086 2760353 2777692 2792229 2803633
61483 2803633 2810862 2812805 2809017 2799990 2787089 2772040 2756042 2739328 2721818 2704155 2687792 2673968
61471 2673968 2662764 2653314 2644963 2638248 2634740 2635903 2642211 2653432 2669533 2690940 2718050 2751076
$$ packed form
61554A705634l898o109p056p167p554q626r680r979r734r666j0038j0624j1326
61541A594177j2195j2900j2791j1684j0238r300r016q707p639n899m332l442k582
61528A483452o89K238N121P286R097J0765J1603J1363J1383J3268J6809K0463
61516A602159K3559K6714L0098L2774L4192L5255L7221M0230M3450M6155M8321
61505B000128N0442N2818N4667N4333N1311M7657M6053M6317M5530M2036L7775
61494B529067L5433L4826L3662L0950K7831K5316K3001K0267J7339J4537J1404
61483B803633P229J943l788r027j2901j5049j5998j6714j7510j7663j6363j3824
61471B673968j1204r450q351o715l508J163O308J1221J6101K1407K7110L3026
$$ plain form
61459 2751076 2790630 2837971 2894168 2959249 3032693 3114711 3206576 3309623 3424550 3552164 3694255
61448 3694255 3852862 4028518 4220098 4426916 4650385 4892793 5154740 5434708 5730966
61439 5730966 6042487 6367144 6699585 7031503 7353385 7655383 7927384 8159834 8345182
61430 8345182 8478538 8557566 8582674 8557148 8486164 8375364 8230704 8059104 7867976 7663772
61420 7663772 7451698 7236808 7024261 6818085 6620560 6433324 6258345 6097412 5951553
61411 5951553 5821663 5708990 5614225 5536664 5475105 5429241 5399478 5385720 5387059 5402269 5429913
61400 5429913 5468353 5516581 5574782 5643083 5719758 5801578 5885989 5971984 6058737 6144595 6228062
61389 6228062 6309092 6388712 6467856 6546977 6626128 6704640 6781143 6854731 6925925 6995656 7063341
$$ packed form
61459B751076L9554M7341N6197O5081P3444Q2018R1865J03047J14927J27614J42091
61448C694255J58607J75656J91580K06818K23469K42408K61947K79968K96258
61439E730966L11521L24657L32441L31918L21882L01998K72001K32450J85348
61430H345182J33356P9028K5108k5526p0984j10800j44660j71600j91128k04204
61420G663772k12074k14890k12547k06176j97525j87236j74979j60933j45859
61411E951553j29890j12673r4765p7561o1559m5864k9763j3758J339J5210K7644
61400E429913L8440M8228N8201O8301P6675Q1820Q4411Q5995Q6753Q5858Q3467
61389F228062Q1030P9620P9144P9121P9151P8512P6503P3588P1194O9731O7685
$$ plain form
61378 7063341 7126784 7184218 7235807 7282792 7325668 7363681 7395687 7420951 7439207 7450611 7455782
61367 7455782 7455470 7449817 7438117 7419610 7394605 7364790 7332433 7299156 7265241 7229894 7192345 7153018
61355 7153018 7113854 7077396 7045408 7018202 6995130 6975426 6958419 6943078 6927819 6911155 6892579
61344 6892579 6872545 6851412 6828704 6803764 6777073 6750515 6726175 6705137 6687677 6674394 6666952
61333 6666952 6667820 6679537 6704090 6742816 6796842 6867736 6957679 7068952 7203362 7362049 7545443
61322 7545443 7753225 7984746 8239875 8519055 8821886 9145638 9485429 9835543 10189837
61313 10189837 10540786 10878781 11192728 11471316 11704256 11883751 12005836 12070276 12078807 12033561
61303 12033561 11937218 11793913 11609025 11387907 11135161 10855072 10552201 10231446 9897940
$$ packed form
61378G063341O3443N7434N1589M6985M2876L8013L2006K5264J8256J1404N171
61367G455782l12n653j1700j8507k5005k9815l2357l3277l3915l5347l7549l9327
61355G153018l9164l6458l1988k7206k3072j9704j7007j5341j5259j6664j8576
61344F892579k0034k1133k2708k4940k6691k6558k4340k1038j7460j3283p442
61333F666952Q68J1717K4553L8726N4026P0894Q9943J11273J34410J58687J83394
61322G545443K07782K31521K55129K79180L02831L23752L39791L50114L54294
61313A0189837L50949L37995L13947K78588K32940J79495J22085O4440Q531m5246
61303A2033561r6343j43305j84888k21118k52746k80089l02871l20755l33506
$$ plain form
61294 9897940 9557169 9214725 8875345 8541993 8216287 7900094 7596471 7308667 7038370
61285 7038370 6785634 6550724 6335297 6141066 5967653 5812718 5674292 5552316 5447766
61276 5447766 5361049 5291730 5239204 5202883 5181853 5174804 5180326 5197048 5223699 5259345 5303514 5355863
61264 5355863 5415726 5481882 5552399 5624686 5696316 5766202 5834528 5901102 5964294 6022259 6074795
61253 6074795 6123002 6167141 6205821 6237725 6263367 6284374 6301253 6312448 6315637 6309660 6295106 6273260
61241 6273260 6244728 6209113 6165958 6115869 6060579 6001893 5940517 5875777 5806426 5731908 5653108
61230 5653108 5572050 5490973 5411823 5336268 5265460 5199403 5137034 5077594 5021736 4970813 4925217
61219 4925217 4884054 4846418 4812273 4781686 4753636 4726018 4696739 4664844 4630898 4596474 4562947
$$ packed form
61294I897940l40771l42444l39380l33352l25706l16193l03623k87804k70297
61285G038370k52736k34910k15427j94231j73413j54935j38426j21976j04550
61276E447766q6717o9319n2526l6321k1030p049N522J6722K6651L5646M4169N2349
61264E355863N9863O6156P0517P2287P1630O9886O8326O6574O3192N7965N2536
61253F074795M8207M4139L8680L1904K5642K1007J6879J1195L189n977j4554k1846
61241F273260k8532l5615m3155n0089n5290n8686o1376o4740o9351p4518p8800
61230E653108q1058q1077p9150p5555p0808o6057o2369n9440n5858n0923m5596
61219D925217m1163l7636l4145l0587k8050k7618k9279l1895l3946l4424l3527
$$ plain form
61208 4562947 4530673 4499617 4470882 4446995 4430102 4420084 4414939 4413140 4415345 4423885 4440911 4467043
61196 4467043 4501538 4543593 4593603 4653314 4724846 4809623 4908068 5019787 5143573 5277332 5418462
61185 5418462 5564468 5712914 5860574 6002597 6132513 6242924 6326416 6376504 6388665 6361207
61175 6361207 6295565 6195762 6067244 5915694 5746423 5564471 5374895 5182619 4991785 4805158
61165 4805158 4624135 4449439 4282019 4123392 3975162 3838286 3712924 3598811 3495285
61156 3495285 3400861 3313441 3231650 3155870 3087382 3026570 2972596 2924997 2884760 2853199 2830057
61145 2830057 2813394 2801353 2793651 2791282 2795098 2804764 2818828 2835597 2853915 2873010 2891619 2907647
61133 2907647 2919182 2925846 2928831 2929525 2928328 2924735 2918075 2907978 2894520 2878325 2860409 2841476 2821251
$$ packed form
61208D562947l2274l1056k8735k3887j6893j0018n145j799K205Q540J7026K6132
61196D467043L4495M2055N0010N9711P1532Q4777R8445J11719J23786J33759J41130
61185E418462J46006J48446J47660J42023J29916J10411Q3492N0088J2161k7458
61175F361207o5642r9803j28518j51550j69271j81952j89576j92276j90834j86627
61165D805158j81023j74696j67420j58627j48230j36876j25362j14113j03526
61156C495285r4424q7420q1791p5780o8488o0812n3974m7599m0237l1561k3142
61145B830057j6663j2041p702k369L816R666J4064J6769J8318J9095J8609J6028
61133B907647J1535O664K985O94j197l593o660j0097j3458j6195j7916j8933k0225
$$ plain form
61120 2821251 2798675 2772894 2744082 2713315 2681705 2649666 2616901 2583000 2547832 2511378 2473520
61109 2473520 2434323 2394453 2354857 2315828 2276685 2236477 2194854 2152165 2109048 2066153 2023904
61098 2023904 1982189 1940565 1899236 1859661 1823550 1791090 1760539 1729692 1697392 1663550 1628370
61087 1628370 1592206 1555908 1520578 1486777 1454359 1423205 1393741 1366451 1341203 1317466 1295143
61076 1295143 1274938 1257970 1245171 1236740 1231697 1228137 1224597 1221426 1220373 1222650 1227832 1234804 1243019
61063 1243019 1252285 1261951 1271345 1280900 1291951 1305231 1320134 1335559 1350885 1365949 1380771 1395653
61051 1395653 1411043 1426843 1442197 1456328 1469323 1481729 1493556 1503954 1511871 1516995 1520186 1522803
61039 1522803 1525159 1525735 1522669 1516179 1508771 1502705 1498013 1493527 1489023 1485319 1482655 1480080 1476511 1471622
$$ packed form
61120B821251k2576k5781k8812l0767l1610l2039l2765l3901l5168l6454l7858
61109B473520l9197l9870l9596l9029l9143m0208m1623m2689m3117m2895m2249
61098B023904m1715m1624m1329l9575l6111l2460l0551l0847l2300l3842l5180
61087A628370l6164l6298l5330l3801l2418l1154k9464k7290k5248k3737k2323
61076A295143k0205j6968j2799q431n043l560l540l171j053K277N182O972Q215
61063A243019R266R666R394R555J1051J3280J4903J5425J5326J5064J4822J4882
61051A395653J5390J5800J5354J4131J2995J2406J1827J0398P917N124L191K617
61039A522803K356N76l066o490p408o066m692m486m504l704k664k575l569m889
$$ plain form
61025 1471622 1465600 1458733 1451531 1444717 1438697 1433305 1428291 1423759 1419820 1415874 1410614 1402966 1393028 1381951
61011 1381951 1370858 1360077 1349515 1339303 1329639 1320394 1311620 1304232 1299237 1296186 1293377 1289891 1286474
60998 1286474 1284110 1282843 1282664 1284373 1288396 1293571 1298348 1302759 1308098 1315107 1323625 1333628 1345268 1357978
60984 1357978 1370841 1384027 1398827 1416076 1435473 1456544 1479197 1503085 1527408 1551871 1577148
60973 1577148 1603996 1632532 1662735 1695071 1730176 1768159 1808517 1850754 1895185 1943227 1996450
60962 1996450 2054933 2117033 2181253 2247860 2318186 2393158 2473388 2559915 2653552 2754025 2860987
60951 2860987 2975374 3098502 3230454 3370949 3521181 3682852 3855731 4038381 4231438
60942 4231438 4438207 4662144 4906103 5174249 5471943 5802742 6167787 6569010 7010849
$$ packed form
61025A471622o022o867p202o814o020n392n014m532l939l946n260p648r938j1077
61011A381951j1093j0781j0562j0212r664r245q774p388m995l051k809l486l417
60998A286474k364j267j79J709M023N175M777M411N339P009Q518J0003J1640J2710
60984A357978J2863J3186J4800J7249J9397K1071K2653K3888K4323K4463K5277
60973A577148K6848K8536L0203L2336L5105L7983M0358M2237M4431M8042N3223
60962A996450N8483O2100O4220O6607P0326P4972Q0230Q6527R3637J00473J06962
60951B860987J14387J23128J31952J40495J50232J61671J72879J82650J93057
60942D231438K06769K23937K43959K68146K97694L30799L65045M01223M41839
$$ plain form
60933 7010849 7498351 8036768 8634611 9304330 10058316 10907242 11864452 12948807 14180624
60924 14180624 15578667 17165660 18974245 21043513 23412089 26114315 29161840 32490982
60916 32490982 35905513 39088226 41714251 43598076 44761946 45386136 45707669 45949922
60908 45949922 46288627 46805944 47427336 47908022 47923702 47223330 45735709 43565679 40913484
60899 40913484 37993131 34988555 32038120 29231140 26614270 24206034 22009432 20017073
60891 20017073 18214276 16584698 15114535 13791762 12604227 11540541 10591395 9748330
60883 9748330 9002068 8342856 7761171 7247150 6790627 6382822 6017050 5687259 5387441
60874 5387441 5113413 4863458 4635551 4425030 4226452 4036934 3856335 3684968 3522556
$$ packed form
60933G010849M87502N38417N97843O69719P53986Q48926R57210J084355J231817
60924A4180624J398043J586993J808585K069268K368576K702226L047525L329142
60916C2490982L414531L182713K626025J883825J163870O24190L21533K42253
60908D5949922L38705N17317O21392M80686J5680p00372j487621k170030k652195
60899D0913484k920353l004576k950435k806980k616870k408236k196602j992359
60891B0017073j802797j629578j470163j322773j187535j063686r49146q43065
60883I748330p46262o59212n81685n14021m56523m07805l65772l29791k99818
60874E387441k74028k49955k27907k10521j98578j89518j80599j71367j62412
$$ plain form
60865 3522556 3368721 3222820 3083361 2948847 2819381 2696601 2581951 2475355 2375257
60856 2375257 2279574 2187230 2099349 2018315 1945019 1877658 1813855 1753088 1696105 1642870 1592585
60845 1592585 1545333 1502200 1463622 1428749 1396586 1366808 1339181 1313050 1287867 1263792 1241389
60834 1241389 1220845 1201645 1183058 1165130 1149108 1136376 1126898 1119399 1113304 1109474 1108423 1108842 1109032
60821 1109032 1109111 1110555 1113977 1118657 1123990 1130000 1136369 1142347 1147958 1154116 1161113 1168037 1174160 1179858
60807 1179858 1185450 1190016 1192257 1192044 1190340 1188014 1185438 1182832 1180150 1176759 1172071 1166573 1161735 1158791
60793 1158791 1157943 1158508 1159316 1159220 1158188 1158061 1161301 1168435 1177412 1186133 1194955 1205775 1219021 1232802 1245253
60778 1245253 1256646 1268640 1282190 1296844 1311571 1325448 1337768 1348274 1357458 1366338 1375824 1386249
$$ packed form
60865C522556j53835j45901j39459j34514j29466j22780j14650j06596j00098
60856B375257r5683r2344q7881q1034p3296o7361o3803o0767n6983n3235n0285
60845A592585m7252m3133l8578l4873l2163k9778k7627k6131k5183k4075k2403
60834A241389k0544j9200j8587j7928j6022j2732r478p499o095l830j051M19J90
60821A109032P9J444L422M680N333O010O369N978N611O158O997O924O123N698
60807A179858N592M566K241k13j704k326k576k606k682l391m688n498m838k944
60793A158791q48N65Q08r6j032j27L240P134Q977Q721Q822J0820J3246J3781J2451
60778A245253J1393J1994J3550J4654J4727J3877J2320J0506R184Q880R486J0425
$$ plain form
60766 1386249 1397158 1407425 1416188 1424065 1432870 1443516 1454747 1464719 1473299 1481782 1490671 1499065 1506272
60753 1506272 1512821 1519467 1526181 1532553 1538292 1542852 1545355 1545462 1543695 1540448 1535328 1527970 1518790 1508311
60739 1508311 1496310 1482258 1466095 1448022 1428199 1407413 1387517 1370184 1355333 1341548 1327913
60728 1327913 1314746 1302704 1292106 1283301 1276932 1273317 1271870 1271507 1271637 1272725 1275922 1282096 1291106 1302025
60714 1302025 1313986 1326584 1339573 1352765 1366562 1382164 1400706 1422231 1445659 1469542 1492607
60703 1492607 1513995 1533491 1551523 1568623 1584969 1600604 1615825 1630882 1645290 1657888 1667981
60692 1667981 1676434 1685361 1696244 1708255 1718874 1726584 1732576 1739221 1747264 1755335 1761976 1766885 1769995
60679 1769995 1770591 1768259 1763979 1759476 1755757 1752724 1749727 1745989 1740891 1734397 1727019 1719096 1710452 1700941
$$ packed form
60766A386249J0909J0267Q763P877Q805J0646J1231R972Q580Q483Q889Q394P207
60753A506272O549O646O714O372N739M560K503J07j767l247n120p358r180j0479
60739A508311j2001j4052j6163j8073j9823k0786j9896j7333j4851j3785j3635
60728A327913j3167j2042j0598q805o369l615j447l63J30J088L197O174R010J0919
60714A302025J1961J2598J2989J3192J3797J5602J8542K1525K3428K3883K3065
60703A492607K1388J9496J8032J7100J6346J5635J5221J5057J4408J2598J0093
60692A667981Q453Q927J0883J2011J0619P710N992O645Q043Q071O641M909L110
60679A769995N96k332m280m503l719l033k997l738n098o494p378p923q644r511
$$ plain form
60665 1700941 1690841 1680523 1670335 1660937 1652950 1645919 1638422 1629704 1620475 1611769 1603950 1597298 1592227
60652 1592227 1588107 1583065 1576245 1569359 1564628 1561977 1559687 1557052 1554655 1552393 1549157 1544611 1539719 1535150
60638 1535150 1530519 1525503 1520517 1515948 1511866 1508788 1507514 1507722 1507873 1507099 1506264 1506562 1507894 1509167 1509369
60623 1509369 1507745 1503687 1497138 1488515 1477704 1463846 1446809 1428301 1410630 1394622 1379359 1363668
60611 1363668 1347241 1330480 1313925 1298008 1283122 1269887 1259150 1251317 1245557 1240224 1234443 1228918
60599 1228918 1224848 1222497 1221297 1221006 1222071 1224822 1228783 1232954 1236631 1239902 1243388 1247484 1251858 1255760
60585 1255760 1258748 1260924 1262624 1264217 1266143 1268557 1270748 1271482 1270345 1268577 1268229 1270574 1275512 1282228
60571 1282228 1289996 1298433 1307401 1317003 1327545 1339278 1352172 1366125 1381442 1398765 1418278 1439292
$$ packed form
60665A700941j0100j0318j0188r398p987p031p497q718r229q706p819o652n071
60652A592227m120n042o820o886m731k651k290k635k397k262l236m546m892m569
60638A535150m631n016m986m569m082l078j274K08J51p74q35K98J332J273K02
60623A509369j624m058o549q623j0811j3858j7037j8508j7671j6008j5263j5691
60611A363668j6427j6761j6555j5917j4886j3235j0737p833n760n333n781n525
60599A228918m070k351j200k91J065K751L961M171L677L271L486M096M374L902
60585A255760K988K176J700J593J926K414K191P34j137j768l48K345M938O716
60571A282228P768Q437Q968R602J0542J1733J2894J3953J5317J7323J9513K1014
$$ plain form
60559 1439292 1461133 1484216 1509538 1537104 1565664 1594313 1623528 1654277 1686871 1721141 1756657
60548 1756657 1791852 1823912 1850832 1872985 1891378 1904841 1910640 1907847 1898543 1885396 1869438 1850580
60536 1850580 1828962 1804961 1778901 1751412 1723397 1695279 1667193 1640342 1616958 1598152 1582692
60525 1582692 1568751 1556043 1545336 1536675 1529248 1522561 1516664 1511433 1506584 1502338 1499319 1497743 1497177
60512 1497177 1496906 1496172 1494402 1491830 1489636 1488913 1489654 1491188 1493322 1496563 1501630 1509215 1519707 1532427
60498 1532427 1545605 1558012 1570326 1584067 1599562 1616050 1633450 1652494 1672777 1692191 1709300
60487 1709300 1725587 1744286 1767213 1793421 1820886 1848896 1878745 1912397 1950636 1992463 2036222
60476 2036222 2081071 2126855 2172493 2215106 2251174 2278343 2295775 2303214 2300566 2288657 2269813 2247090
$$ packed form
60559A439292K1841K3083K5322K7566K8560K8649K9215L0749L2594L4270L5516
60548A756657L5195L2060K6920K2153J8393J3463N799k793r304j3147j5958j8858
60536A850580k1618k4001k6060k7489k8015k8118k8086k6851k3384j8806j5460
60525A582692j3941j2708j0707q661p427o687n897n231m849m246l019j576n66
60512A497177k71p34j770k572k194p23P41J534K134L241N067P585J0492J2720
60498A532427J3178J2407J2314J3741J5495J6488J7400J9044K0283J9414J7109
60487A709300J6287J8699K2927K6208K7465K8010K9849L3652L8239M1827M3759
60476B036222M4849M5784M5638M2613L6068K7169J7432P439k648j1909j8844k2723
$$ plain form
60464 2247090 2222863 2198402 2174770 2153709 2137212 2126219 2120065 2117472 2117976 2122215 2131012 2144523
60452 2144523 2162258 2183554 2207771 2234304 2262757 2293278 2326761 2364821 2409520 2462701 2525246
60441 2525246 2597115 2678534 2771192 2877942 3001233 3142091 3300670 3477246 3672244 3885631
60431 3885631 4116944 4366101 4634043 4922753 5234990 5573708 5940886 6336028 6754876
60422 6754876 7188055 7619591 8026991 8384562 8668445 8859752 8945097 8917571 8779563 8544094
60412 8544094 8231383 7862847 7457573 7032369 6602259 6179336 5771543 5383189 5016568
60403 5016568 4673090 4353516 4057859 3785495 3535598 3307641 3101300 2915731 2749221
60394 2749221 2599806 2465846 2345696 2237308 2138776 2049045 1967589 1893731 1826868 1766867
$$ packed form
60464B247090k4227k4461k3632k1061j6497j0993o154k593N04M239Q797J3511
60452B144523J7735K1296K4217K6533K8453L0521L3483L8060M4699N3181O2545
60441B525246P1869Q1419R2658J06750J23291J40858J58579J76576J94998K13387
60431C885631K31313K49157K67942K88710L12237L38718L67178L95142M18848
60422F754876M33179M31536M07400L57571K83883J91307Q5345k7526j38008k35469
60412H544094l12711l68536m05274m25204m30110m22923m07793l88354l66621
60403E016568l43478l19574k95657k72364k49897k27957k06341j85569j66510
60394B749221j49415j33960j20150j08388r8532q9731q1456p3858o6863o0001
$$ plain form
60384 1766867 1713405 1665180 1620715 1579807 1543230 1511033 1482016 1454958 1429427 1405287 1382425
60373 1382425 1361217 1342282 1325269 1308635 1291224 1273552 1257124 1242861 1230456 1218867 1207287
60362 1207287 1195946 1185891 1177538 1169763 1161229 1152353 1144952 1140050 1137328 1136692 1138790 1143431 1149035 1154514
60348 1154514 1160473 1167597 1175026 1181571 1187637 1194630 1202979 1211843 1220307 1227849 1234141 1239523 1245418 1253272
60334 1253272 1263205 1274378 1286193 1298091 1308703 1316574 1321839 1326124 1330699 1335555 1340327 1345048 1349698
60321 1349698 1353835 1357196 1360162 1363230 1366268 1368497 1369139 1368151 1366516 1365548 1365615 1365853 1365490 1365060 1365704 1367614
60305 1367614 1369815 1371343 1371956 1371870 1371631 1372379 1375506 1381585 1389879 1399047 1408268 1417716 1428121 1439806 1452154
60290 1452154 1464312 1476398 1489457 1504045 1519579 1535444 1551777 1568394 1583748 1596136 1605558
$$ packed form
60384A766867n3462m8225m4465m0908l6577l2197k9017k7058k5531k4140k2862
60373A382425k1208j8935j7013j6634j7411j7672j6428j4263j2405j1589j1580
60362A207287j1341j0055q353p775q534q876p401m902k722o36K098M641N604N479
60348A154514N959P124P429O545O066O993Q349Q864Q464P542O292N382N895P854
60334A253272R933J1173J1815J1898J0612P871N265M285M575M856M772M721M650
60321A349698M137L361K966L068L038K229O42r88j635r68O7K38l63m30O44J910
60305A367614K201J528O13q6k39P48L127O079Q294R168R221R448J0405J1685J2348
60290A452154J2158J2086J3059J4588J5534J5865J6333J6617J5354J2388R422
$$ plain form
60279 1605558 1613263 1619704 1624080 1625910 1625975 1625417 1624686 1623644 1622144 1620453 1619519 1620641 1624237 1629221 1634276
60264 1634276 1639293 1644436 1648172 1647954 1643369 1637113 1631868 1627204 1620619 1611071 1600348 1591080 1584237 1578695
60250 1578695 1572671 1565385 1557666 1551067 1546327 1542605 1538357 1532940 1527322 1523113 1520958 1520111 1519736 1520245 1522695
60235 1522695 1526975 1531459 1534766 1536955 1538412 1538530 1536559 1533260 1530554 1529724 1530815 1533487 1537343 1541588
60221 1541588 1545601 1549974 1555969 1563791 1572448 1581500 1591758 1603746 1616522 1628756 1640276 1651805
60209 1651805 1663669 1675492 1687005 1698666 1711429 1726007 1742304 1759750 1778403 1799188 1822576
60198 1822576 1847733 1874025 1902875 1936639 1975793 2018924 2065697 2117861 2176496 2240135 2307169
60187 2307169 2378846 2458150 2546412 2642707 2746167 2857200 2976364 3103615 3239150 3383839
$$ packed form
60279A605558P705O441M376J830O5n58p31j042j500j691r34J122L596M984N055
60264A634276N017N143L736k18m585o256n245m664o585r548j0723r268o843n542
60250A578695o024p286p719o599m740l722m248n417n618m209k155q47l75N09K450
60235A522695M280M484L307K189J457J18j971l299k706q30J091K672L856M245
60221A541588M013M373N995P822Q657R052J0258J1988J2776J2234J1520J1529
60209A651805J1864J1823J1513J1661J2763J4578J6297J7446J8653K0785K3388
60198A822576K5157K6292K8850L3764L9154M3131M6773N2164N8635O3639O7034
60187B307169P1677P9304Q8262R6295J03460J11033J19164J27251J35535J44689
$$ plain form
60177 3383839 3538150 3701260 3871604 4047673 4227742 4409200 4588794 4763716 4932317
60168 4932317 5093621 5245975 5386263 5510837 5617396 5705668 5776092 5828416 5862127 5877969
60158 5877969 5878390 5866463 5844727 5815059 5779409 5740571 5702247 5668053 5640363 5620405 5609553 5609892
60146 5609892 5623217 5650129 5690679 5745424 5815241 5900554 6001456 6118069 6249800 6394386
60136 6394386 6548588 6709706 6875407 7042084 7204549 7357931 7499148 7626084 7736120
60127 7736120 7826246 7894176 7938653 7958973 7954950 7927381 7878078 7809359 7723773 7624279 7514418
60116 7514418 7398367 7280977 7167400 7062046 6967774 6886330 6819448 6769037 6736323 6721531
60106 6721531 6724760 6746624 6787520 6846668 6922359 7012665 7114993 7225029 7337104 7446079 7548450
$$ packed form
60177C383839J54311J63110J70344J76069J80069J81458J79594J74922J68601
60168D932317J61304J52354J40288J24574J06559Q8272P0424N2324L3711J5842
60158E877969M21j1927k1736k9668l5650l8838l8324l4194k7690j9958j0852L39
60146E609892J3325K6912M0550N4745O9817Q5313J00902J16613J31731J44586
60136F394386J54202J61118J65701J66677J62465J53382J41217J26936J10036
60127G736120R0126O7930M4477K0320m023k7569m9303o8719q5586r9494j09861
60116G514418j16051j17390j13577j05354r4272q1444o6882n0411l2714j4792
60106F721531L229K1864M0896N9148P5691R0306J02328J10036J12075J08975J02371
$$ plain form
60095 7548450 7641636 7723129 7790950 7844384 7883720 7909683 7923661 7927964 7925100 7917167 7906730 7897966
60083 7897966 7895957 7904786 7927055 7965158 8021988 8100009 8200478 8324159 8472453 8647549 8851843
60072 8851843 9087432 9355641 9656732 9990257 10355768 10752863 11180636 11637628 12122122
60063 12122122 12631486 13160818 13702954 14250166 14795198 15330416 15846968 16335717 16788437
60054 16788437 17197407 17554529 17852109 18084637 18249121 18343703 18366634 18316667 18194057 18001240
60044 18001240 17743273 17427844 17064577 16663996 16236960 15794531 15347711 14906982 14481934
60035 14481934 14080778 13709629 13372335 13071466 12809598 12589476 12413029 12280450 12190045
60026 12190045 12138716 12122760 12138482 12181884 12247509 12327947 12415027 12501585 12581927 12650949 12703554
$$ packed form
60095G548450R3186Q1493O7821N3434L9336K5963J3978M303k864p933j0437q764
60083G897966k009Q829K2269L8103N6830P8021J00469J23681J48294J75096K04294
60072H851843K35589K68209L01091L33525L65511L97095M27773M56992M84494
60063A2122122N09364N29332N42136N47212N45032N35218N16552M88749M52720
60054A6788437M08970L57122K97580K32528J64484R4582K2931m9967j22610j92817
60044A8001240k57967l15429l63267m00581m27036m42429m46820m40729m25048
60035A4481934m01156l71149l37294l00869k61868k20122j76447j32579r0405
60026A2190045n1329j5956J5722M3402O5625Q0438Q7080Q6558Q0342O9022N2605
$$ plain form
60015 12703554 12735199 12742750 12724738 12680931 12611676 12517395 12398578 12256152 12091600 11906621
60005 11906621 11702941 11482649 11248484 11003603 10751434 10496036 10242134 9994106 9755071
59996 9755071 9527472 9314443 9119885 8947050 8797537 8671879 8570676 8494798 8444857 8420999
59986 8420999 8423273 8451864 8506718 8586917 8690510 8814739 8956040 9109779 9270520 9433071
59976 9433071 9593003 9745605 9884710 10003632 10097601 10164579 10203524 10212857 10191234 10138934 10057568
59965 10057568 9948952 9815126 9659185 9485208 9297576 9101101 8901395 8704131 8513983
59956 8513983 8335010 8171622 8027695 7904595 7801518 7718548 7658406 7624441 7617690 7636929
59946 7636929 7681131 7750961 7847927 7972848 8125130 8302820 8503027 8722565 8958224 9206211
$$ packed form
60015A2703554L1645P551j8012m3807o9255r4281j18817j42426j64552j84979
60005A1906621k03680k20292k34165k44881k52169k55398k53902k48028k39035
59996I755071k27599k13029j94558j72835j49513j25658j01203p5878m9941k3858
59986H420999K274K8591N4854Q0199J03593J24229J41301J53739J60741J62551
59976I433071J59932J52602J39105J18922R3969O6978L8945R333k1623n2300q1366
59965A0057568j08616j33826j55941j73977j87632j96475j99706j97264j90148
59956H513983j78973j63388j43927j23100j03077q2970o0142l3965o751J9239
59946G636929M4202O9830R6966J24921J52282J77690K00207K19538K35659K47987
$$ plain form
59936 9206211 9461361 9717224 9966978 10204115 10422462 10616351 10781323 10914400 11013170 11074692
59926 11074692 11095959 11075819 11016052 10920195 10791817 10634786 10454953 10260263 10058527 9855744
59916 9855744 9657081 9468426 9295589 9142148 9009308 8898074 8810625 8749246 8714836 8707109
59906 8707109 8725650 8770076 8839416 8931767 9044373 9173759 9316163 9468404 9628226 9793390
59896 9793390 9960449 10124739 10281708 10428299 10563275 10686460 10797757 10896952 10984577 11062678
59886 11062678 11134329 11202440 11269567 11338863 11414424 11500403 11600545 11719182 11862056 12035268
59876 12035268 12243492 12489622 12775655 13102953 13471760 13881279 14330176 14816102 15334300
59867 15334300 15877012 16433942 16992372 17536821 18049914 18514444 18914283 19233590 19457309
$$ packed form
59936I206211K55150K55863K49754K37137K18347J93889J64972J33077R8770O1522
59926A1074692K1267k0140n9767r5857j28378j57031j79833j94690k01736k02783
59916I855744j98663j88655j72837j53441j32840j11234q7449o1379l4410p727
59906H707109J8541M4426O9340R2351J12606J29386J42404J52241J59822J65164
59896I793390J67059J64290J56969J46591J34976J23185J11297R9195Q7625P8101
59886A1062678P1651O8111O7127O9296P5561Q5979J00142J18637J42874J73212
59876A2035268K08224K46130K86033L27298L68807M09519M48897M85926N18198
59867A5334300N42712N56930N58430N44449N13093M64530L99839L19307K23719
$$ plain form
59858 19457309 19574670 19582523 19484706 19288806 19004597 18644807 18225019 17761371 17268581 16760016
59848 16760016 16248184 15743972 15255823 14790366 14353606 13951160 13587883 13267738 12993523
59839 12993523 12766203 12585177 12450062 12361797 12321036 12325742 12371405 12453617 12569310 12715041
59829 12715041 12884862 13070414 13262479 13451645 13627719 13779396 13895300 13965755 13983668 13943979
59819 13943979 13843025 13679602 13456988 13182874 12866192 12514230 12133370 11731700 11319091
59810 11319091 10904411 10493747 10091390 9701109 9325811 8967380 8628015 8311047 8019424
59801 8019424 7753923 7513780 7298484 7107832 6940453 6793453 6663743 6548949 6446926
59792 6446926 6355140 6270930 6192087 6117113 6045320 5976795 5912032 5851612 5796340 5747283 5704884
$$ packed form
59858A9457309J17361P853r7817j95900k84209l59790m19788m63648m92790n08565
59848A6760016n11832n04212m88149m65457m36760m02446l63277l20145k74215
59839A2993523k27320j81026j35115q8265m0761M706M5663Q2212J15693J45731
59829A2715041J69821J85552J92065J89166J76074J51677J15904P0455J7913l9689
59819A3943979j00954j63423k22614k74114l16682l51962l80860m01670m12609
59810A1319091m14680m10664m02357l90281l75298l58431l39365l16968k91623
59801H019424k65501k40143k15296j90652j67379j47000j29710j14794j02023
59792F446926r1786q4210p8843p4974p1793o8525o4763o0420n5272m9057m2399
$$ plain form
59781 5704884 5667904 5633637 5599297 5563027 5523840 5481268 5435232 5385720 5332346 5274621 5213023
59770 5213023 5149603 5087266 5028416 4974081 4923886 4876612 4831181 4787743 4747948 4713924 4686828
59759 4686828 4666518 4652672 4645861 4647141 4656646 4673072 4694763 4721109 4752805 4791183 4837589 4892916
59747 4892916 4957059 5028816 5106630 5189259 5275451 5363420 5451233 5537307 5619840 5696239 5764296
59736 5764296 5823941 5876859 5924455 5967290 6006486 6044346 6083331 6125784 6174986 6234839 6307651
59725 6307651 6393584 6493176 6609100 6744463 6900829 7079218 7281714 7510596 7767258 8053840
59715 8053840 8374633 8733475 9130312 9562391 10027796 10524440 11044524 11571506 12082075
59706 12082075 12548808 12941943 13234206 13408757 13463324 13407058 13255627 13029527 12752588 12447024
$$ packed form
59781E704884l6980l4267l4340l6270l9187m2572m6036m9512n3374n7725o1598
59770E213023o3420o2337n8850n4335n0195m7274m5431m3438l9795l4024k7096
59759D686828k0310j3846o811J280R505J6426K1691K6346L1696L8378M6406N5327
59747D892916O4143P1757P7814Q2629Q6192Q7969Q7813Q6074Q2533P6399O8057
59736E764296N9645N2918M7596M2835L9196L7860L8985M2453M9202N9853P2812
59725F307651Q5933R9592J15924J35363J56366J78389K02496K28882K56662K86582
59715H053840L20793L58842L96837M32079M65405M96644N20084N26982N10569
59706A2082075M66733L93135K92263J74551N4567n6266j51431k26100k76939l05564
$$ plain form
59696 12447024 12128989 11809748 11499394 11206882 10937310 10692187 10472919 10282382 10123042
59687 10123042 9995554 9899861 9836252 9804920 9805781 9839208 9905823 10005253 10136333 10298977 10494502
59676 10494502 10723599 10985465 11280075 11610074 11979035 12388567 12838581 13329946 13865276
59667 13865276 14447024 15076312 15754226 16483142 17265831 18103728 18996693 19943891 20943579
59658 20943579 21991410 23079119 24195159 25326637 26460881 27585814 28689769 29762182
59650 29762182 30795744 31788785 32745698 33674632 34584368 35482697 36376346 37270441 38166884
59641 38166884 39063161 39952673 40825352 41667359 42461082 43187256 43828460 44371381 44807031
59632 44807031 45130467 45341215 45443771 45447628 45367148 45221073 45030634 44816671 44597993 44392158
$$ packed form
59696A2447024l18035l19241l10354k92512k69572k45123k19268j90537j59340
59687A0123042j27488r5693o3609l1332Q61L3427O6615R9430J31080J62644J95525
59676A0494502K29097K61866K94610L29999L68961M09532M50014M91365N35330
59667A3865276N81748O29288O77914P28916P82689Q37897Q92965R47198R99688
59658B0943579J047831J087709J116040J131478J134244J124933J103955J072413
59650B9762182J033562R93041R56913R28934R09736Q98329Q93649Q94095Q96443
59641C8166884Q96277Q89512Q72679Q42007P93723P26174O41204N42921M35650
59632D4807031L23436K10748J02556L857q0480j46075j90439k13963k18678k05835
$$ plain form
59622 44392158 44216817 44089314 44025035 44036628 44134702 44328599 44626262 45033641 45554519 46190938
59612 46190938 46943449 47810114 48783974 49850690 50988488 52169875 53362069 54524997
59604 54524997 55610122 56563609 57332548 57870152 58138883 58113736 57786043 57164872 56274490
59595 56274490 55150309 53835642 52378205 50825061 49218123 47593071 45980633 44406541
59587 44406541 42889244 41437932 40052645 38725481 37441655 36180938 34920511 33639366
59579 33639366 32323617 30970958 29591274 28202129 26822422 25469138 24157526 22900765
59571 22900765 21707665 20581815 19524201 18535778 17616727 16764712 15975893 15247336 14577022
59562 14577022 13962031 13398530 12883421 12414315 11987758 11599208 11245171 10923801 10632972
$$ packed form
59622D4392158j75341j27503o4279J1593R8074J93897K97663M07379N20878O36419
59612D6190938P52511Q66665R73860J066716J137798J181387J192194J162928
59604E4524997J085125R53487P68939N37604K68731k5147l27693o21171q90382
59595E6274490j124181j314667j457437j553144j606938j625052j612438j574092
59587D4406541j517297j451312j385287j327164j283826j260717j260427j281145
59579C3639366j315749j352659j379684j389145j379707j353284j311612j256761
59571B2900765j193100j125850j057614r88423r19051q52015p88819p28557o70314
59562A4577022o14991n63501n15109m69106m26557l88550l54037l21370k90829
$$ plain form
59553 10632972 10369413 10130431 9914667 9719874 9541231 9373285 9212667 9057674 8906183
59544 8906183 8755524 8603929 8450591 8294549 8134810 7971570 7806377 7641190 7478004
59535 7478004 7318865 7165165 7017241 6875753 6743029 6621676 6511992 6412195 6321369 6240850
59525 6240850 6172393 6116263 6071713 6038118 6014848 6000859 5995443 5998946 6011963 6033866 6062729 6096762
59513 6096762 6135626 6180252 6231374 6288164 6348574 6411246 6476826 6547145 6623635 6707113 6798621
59502 6798621 6899423 7010222 7131321 7263748 7409574 7570920 7749099 7944648 8157630
59493 8157630 8388101 8636995 8906428 9198301 9512782 9848994 10206744 10585975 10984262
59484 10984262 11396429 11817451 12244636 12676044 13107774 13533972 13948970 14348329 14727896
$$ packed form
59553A0632972k63559k38982k15764j94793j78643j67946j60618j54993j51491
59544H906183j50659j51595j53338j56042j59739j63240j65193j65187j63186
59535G478004j59139j53700j47924j41488j32724j21353j09684r9797r0826q0519
59525F240850o8457n6130m4550l3595k3270j3989n416L503J3017K1903K8863L4033
59513F096762L8864M4626N1122N6790O0410O2672O5580P0319P6490Q3478R1508
59502F798621J00802J10799J21099J32427J45826J61346J78179J95549K12982
59493H157630K30471K48894K69433K91873L14481L36212L57750L79231L98287
59484A0984262M12167M21022M27185M31408M31730M26198M14998L99359L79567
$$ plain form
59475 14727896 15082718 15407054 15695400 15944056 16152438 16322807 16458442 16562343 16637821
59466 16637821 16689489 16722682 16742115 16752086 16758222 16768245 16790294 16830565 16892909 16980475 17096682
59455 17096682 17243571 17419115 17616676 17826960 18039463 18241688 18418484 18553973 18634523
59446 18634523 18649738 18591757 18455341 18238832 17944059 17575400 17140075 16649168 16116817 15557483
59436 15557483 14984132 14408284 13839999 13287200 12755955 12251686 11779038 11340409 10936070
59427 10936070 10566419 10233091 9937439 9679246 9457658 9272202 9122007 9005212 8920298
59418 8920298 8867265 8846567 8857536 8898786 8969421 9068899 9196307 9350791 9532257 9740785
59408 9740785 9975573 10234856 10516015 10814819 11125092 11439970 11753018 12057346 12344193
$$ packed form
59475A4727896L54822L24336K88346K48656K08382J70369J35635J03901P5478
59466A6637821N1668L3193J9433R971O136J0023K2049M0271O2344Q7566J16207
59455A7096682J46889J75544J97561K10284K12503K02225J76796J35489Q0550
59446A8634523J5215n7981j36416k16509k94773l68659m35325m90907n32351n59334
59436A5557483n73351n75848n68285n52799n31245n04269m72648m38629m04339
59427A0936070l69651l33328k95652k58193k21588j85456j50195j16795q4914
59418H920298n3033k0698J0969M1250P0635R9478J27408J54484J81466K08528
59408I740785K34788K59283K81159K98804L10273L14878L13048L04328K86847
$$ plain form
59399 12344193 12603347 12824777 12999438 13119433 13178784 13174269 13105239 12973252 12782456 12539518
59389 12539518 12251984 11926956 11571768 11194878 10804591 10407188 10007407 9610400 9221834
59380 9221834 8845987 8484919 8139718 7811706 7502202 7211960 6941301 6690434 6459399
59371 6459399 6247901 6055207 5880156 5721660 5579390 5453465 5343148 5246519 5162026 5089689
59361 5089689 5029998 4982226 4944826 4917120 4899562 4892307 4894282 4903797 4919722 4942105 4971684 5008175
59349 5008175 5048673 5088501 5124422 5156703 5187834 5220262 5256058 5297623 5347281 5406596 5476975
59338 5476975 5560167 5656831 5764972 5880900 6001592 6125753 6253941 6389267 6537219 6702949
59328 6702949 6888827 7095767 7326138 7583530 7870157 8186595 8534223 8916055 9335040
$$ packed form
59399A2344193K59154K21430J74661J19995N9351m515o9030j31987j90796k42938
59389A2539518k87534l25028l55188l76890l90287l97403l99781l97007l88566
59380I221834l75847l61068l45201l28012l09504k90242k70659k50867k31035
59371F459399k11498j92694j75051j58496j42270j25925j10317r6629q4493p2337
59361E089689n9691m7772l7400k7706j7558p255J975R515J5925K2383K9579L6491
59349E008175M0498L9828L5921L2281L1131L2428L5796M1565M9658N9315P0379
59338E476975Q3192R6664J08141J15928J20692J24161J28188J35326J47952J65730
59328F702949J85878K06940K30371K57392K86627L16438L47628L81832M18985
$$ plain form
59319 9335040 9793421 10294089 10840687 11435619 12079413 12772407 13515213 14306352 15140475
59310 15140475 16009302 16902785 17808594 18712188 19599088 20456799 21274406 22042131 22752991
59301 22752991 23404286 23996349 24530128 25006423 25426166 25789838 26096593 26344430 26530655
59292 26530655 26651547 26702297 26678148 26575195 26389765 26118505 25760854 25321308 24808109 24229842
59282 24229842 23594124 22908940 22183302 21425779 20643330 19842426 19030894 18217970 17412601
59273 17412601 16622081 15852231 15108301 14395043 13715828 13072155 12464546 11893921 11361768
59264 11361768 10869137 10415924 10001074 9622931 9279347 8968076 8687346 8435701 8211269
59255 8211269 8011900 7836310 7684378 7555593 7447495 7356372 7279611 7217039 7169818 7138342
$$ packed form
59319I335040M58381N00668N46598N94932O43794O92994P42806P91139Q34123
59310A5140475Q68827Q93483R05809R03594Q86900Q57711Q17607P67725P10860
59301B2752991O51295N92063N33779M76295M19743L63672L06755K47837J86225
59292B6530655J20892N0750k4149j02953j85430k71260l57651m39546n13199n78267
59282B4229842o35718o85184p25638p57523p82449q00904q11532q12924q05369
59273A7412601p90520p69850p43930p13258o79215o43673o07609n70625n32153
59264A1361768m92631m53213m14850l78143l43584l11271k80730k51645k24432
59255H211269j99369j75590j51932j28785j08098r1123p6761o2572m7221l1476
$$ plain form
59245 7138342 7121537 7118130 7127970 7151470 7188070 7236425 7296445 7369898 7457778 7557767 7665747
59234 7665747 7779701 7900727 8029968 8165677 8303799 8440543 8573975 8704040 8831825
59225 8831825 8958371 9083610 9206539 9326627 9444770 9562924 9683159 9806996 9935033
59216 9935033 10067121 10203027 10342439 10483548 10622195 10753569 10874507 10982969 11075702 11148407
59206 11148407 11198566 11226221 11231042 11210285 11161149 11084224 10983336 10862818 10726221 10577131
59196 10577131 10419716 10258234 10096693 9938893 9788208 9647487 9519550 9407278 9312487
59187 9312487 9235080 9173965 9128641 9099466 9086821 9090524 9109572 9141782 9184071 9233892 9290244
59176 9290244 9352860 9420878 9493080 9569150 9650043 9737378 9833142 9939700 10059267 10193489 10344330
$$ packed form
59245G138342j6805l407R840K3500L6600M8355O0020P3453Q7880R9989J07980
59234G665747J13954J21026J29241J35709J38122J36744J33432J30065J27785
59225H831825J26546J25239J22929J20088J18143J18154J20235J23837J28037
59216I935033J32088J35906J39412J41109J38647J31374J20938J08462R2733P2705
59206A1148407N0159K7655M821k0757m9136p6925j00888j20518j36597j49090
59196A0577131j57415j61482j61541j57800j50685j40721j27937j12272r4791
59187I312487p7407o1115m5324k9175j2645L703J9048L2210M2289M9821N6352
59176I290244O2616O8018P2202P6070Q0893Q7335R5764J06558J19567J34222J50841
$$ plain form
59165 10344330 10515393 10711563 10937034 11194080 11483734 11807038 12165208 12558670 12985696
59156 12985696 13441187 13916126 14398172 14873088 15325904 15741189 16102943 16395144 16603258
59147 16603258 16715889 16725519 16628430 16424998 16120566 15725389 15252839 14717660 14135873 13524775
59137 13524775 12900630 12275492 11657031 11051555 10466132 9907381 9379437 8883908 8421078
59128 8421078 7990543 7591467 7223076 6884581 6574205 6289031 6026450 5785324 5565299
59119 5565299 5365708 5185619 5024104 4879602 4749649 4632055 4525849 4430417 4344473 4266929
59109 4266929 4198161 4139163 4089510 4047193 4010489 3979305 3954684 3937729 3928984 3928186 3934484 3947216
59097 3947216 3966377 3992040 4023742 4061011 4104113 4153590 4209231 4270243 4336403 4408428 4487052
$$ packed form
59165A0344330J71063J96170K25471K57046K89654L23304L58170L93462M27026
59156A2985696M55491M74939M82046M74916M52816M15285L61754K92201K08114
59147A6603258J12631R630r7089k03432l04432l95177m72550n35179n81787o11098
59137A3524775o24145o25138o18461o05476n85423n58751n27944m95529m62830
59128H421078m30535l99076l68391l38495l10376k85174k62581k41126k20025
59119E565299j99591j80089j61515j44502j29953j17594j06206r5432q5944p7544
59109D266929o8768n8998m9653m2317l6704l1184k4621j6955q745p98O298J2732
59097C947216J9161K5663L1702L7269M3102M9477N5641O1012O6160P2025P8624
$$ plain form
59086 4487052 4572182 4663063 4759192 4861101 4970085 5086621 5208949 5333995 5459978 5587398
59076 5587398 5717052 5848141 5978935 6108040 6233612 6352166 6460039 6556120 6641922 6718923
59066 6718923 6787059 6845942 6896210 6939126 6975855 7007930 7037949 7069155 7104362 7145306 7192753
59055 7192753 7247233 7309978 7382957 7467604 7563926 7671609 7791747 7926457 8076827 8242402
59045 8242402 8423015 8619958 8834506 9065865 9311334 9567920 9832887 10102854 10373057
59036 10373057 10637383 10888310 11116687 11312722 11468350 11578853 11641947 11655965 11620194 11537293
59026 11537293 11414004 11258176 11075314 10868723 10642135 10400516 10148213 9887940 9622129
59017 9622129 9353797 9085162 8816483 8547256 8277836 8009080 7741403 7475349 7212402
$$ packed form
59086D487052Q5130R0881R6129J01909J08984J16536J22328J25046J25983J27420
59076E587398J29654J31089J30794J29105J25572J18554J07873R6081Q5802P7001
59066F718923O8136N8883N0268M2916L6729L2075L0019L1206L5207M0944M7447
59055G192753N4480O2745P2979Q4647R6322J07683J20138J34710J50370J65575
59045H242402J80613J96943K14548K31359K45469K56586K64967K69967K70203
59036A0373057K64326K50927K28377J96035J55628J10503O3094J4018l5771q2901
59026A1537293j23289j55828j82862k06591k26588k41619k52303k60273k65811
59017I622129k68332k68635k68679k69227k69420k68756k67677k66054k62947
$$ plain form
59008 7212402 6954051 6700698 6452692 6211848 5980469 5759120 5546804 5343287 5149754
58999 5149754 4966964 4794114 4630018 4474368 4327308 4188722 4058520 3936936 3823946
58990 3823946 3718867 3620905 3529617 3444542 3364887 3289925 3219239 3152283 3088125 3025997 2965767
58979 2965767 2907629 2851637 2797812 2746370 2697549 2651414 2608103 2568217 2532693 2502104 2475920
58968 2475920 2452606 2430860 2410937 2394261 2381517 2371677 2363423 2356908 2353173 2352151 2352260 2352049 2351378
58955 2351378 2350763 2350377 2350184 2350527 2351953 2354557 2357831 2361195 2364611 2368646 2373935 2380599 2388291 2396760 2406068
58940 2406068 2416209 2426863 2437471 2447155 2454790 2460135 2464994 2472017 2481650 2491297 2498342 2503127 2508101
58927 2508101 2515134 2524980 2538260 2555028 2573661 2592034 2609856 2628335 2647598 2666296 2684085 2702661
$$ packed form
59008G212402k58351k53353k48006k40844k31379k21349k12316k03517j93533
58999E149754j82790j72850j64096j55650j47060j38586j30202j21584j12990
58990C823946j05079r7962r1288q5075p9655p4962p0686o6956o4158o2128o0230
58979B965767n8138n5992n3825n1442m8821m6135m3311l9886l5524l0589k6184
58968B475920k3314k1746j9923j6676j2744r840q254o515l735j022J09k11o71
58955B351378o15l86j93L43J426K604L274L364L416M035N289O664P692Q469R308
58940B406068J0141J0654J0608R684P635N345M859P023R633R647P045M785M974
58927B508101P033R846J3280J6768J8633J8373J7822J8479J9263J8698J7789J8576
$$ plain form
58915 2702661 2723480 2745896 2768583 2791686 2816571 2844225 2874783 2907958 2943150 2979724 3017898
58904 3017898 3058737 3102630 3148359 3194345 3240204 3286412 3333270 3381292 3431986 3486804 3545224
58893 3545224 3605087 3665204 3726865 3792328 3862549 3936994 4015220 4097823 4185777 4279517 4378966
58882 4378966 4484076 4595039 4712407 4837599 4972922 5120099 5278581 5446211 5622016
58873 5622016 5807672 6005782 6217700 6443934 6685854 6945671 7225086 7525194 7847541
58864 7847541 8193963 8565387 8962227 9386359 9841528 10331188 10856914 11419518 12020747
58855 12020747 12663118 13348758 14079200 14855615 15678341 16546385 17458030 18411382 19403240
58846 19403240 20427220 21473318 22529010 23579904 24608998 25595677 26515820 27343335
$$ packed form
58915B702661K0819K2416K2687K3103K4885K7654L0558L3175L5192L6574L8174
58904C017898M0839M3893M5729M5986M5859M6208M6858M8022N0694N4818N8420
58893C545224N9863O0117O1661O5463P0221P4445P8226Q2603Q7954R3740R9449
58882D378966J05110J10963J17368J25192J35323J47177J58482J67630J75805
58873E622016J85656J98110K11918K26234K41920K59817K79415L00108L22347
58864G847541L46422L71424L96840M24132M55169M89660N25726N62604O01229
58855A2020747O42371O85640P30442P76415Q22726Q68044R11645R53352R91858
58846A9403240J023980J046098J055692J050894J029094R86679R20143Q27515
$$ plain form
58838 27343335 28052552 28620698 29029591 29266448 29324617 29204701 28915106 28470661 27889735
58829 27889735 27191921 26397563 25528096 24605298 23649354 22677456 21703993 20741219 19799124
58820 19799124 18885163 18005134 17164240 16366432 15612751 14901564 14230987 13600276 13008536
58811 13008536 12453417 11932238 11443535 10986290 10558158 10155928 9777734 9423744 9094495
58802 9094495 8789348 8506638 8244661 8002333 7779257 7575009 7388129 7216270 7057791
58793 7057791 6912636 6781035 6662305 6555900 6462819 6384403 6320094 6267810 6226431 6196588
58783 6196588 6179149 6174296 6182041 6202193 6233683 6275273 6327167 6390704 6466515 6554475 6655495
58772 6655495 6771461 6902805 7047892 7205755 7378002 7567091 7774039 7998880 8242258
$$ packed form
58838B7343335P09217N68146M08893K36857N8169j19916k89595m44445n80926
58829B7889735o97814p94358q69467r22798r55944r71898r73463r62774r42095
58820A9799124r13961q80029q40894p97808p53681p11187o70577o30711n91740
58811A3008536n55119n21179m88703m57245m28132m02230l78194l53990l29249
58802I094495l05147k82710k61977k42328k23076k04248j86880j71859j58479
58793G057791j45155j31601j18730j06405r3081p8416o4309n2284m1379k9843
58783F196588j7439m853P745K0152L1490M1590N1894O3537P5811Q7960J01020
58772F655495J15966J31344J45087J57863J72247J89089K06948K24841K43378
$$ plain form
58763 8242258 8505422 8789520 9095951 9426683 9783398 10167217 10580079 11025335 11505913
58754 11505913 12022832 12576775 13170243 13806700 14488170 15215181 15988657 16810039 17679022
58745 17679022 18592047 19542936 20523689 21524011 22530728 23527961 24497120 25416252 26260128
58736 26260128 27002220 27617757 28086096 28391823 28525180 28482650 28267648 27890375 27366194
58727 27366194 26713378 25951804 25102807 24188683 23230910 22247990 21254549 20262167 19280955
58718 19280955 18320448 17388938 16492095 15632788 14812708 14033763 13297463 12603622 11950662
58709 11950662 11337058 10761603 10222538 9717596 9245099 8804121 8393387 8010831 7654390
58700 7654390 7322388 7012984 6724064 6453930 6201392 5965224 5744418 5538964 5349181
$$ packed form
58763H242258K63164K84098L06431L30732L56715L83819M12862M45256M80578
58754A1505913N16919N53943N93468O36457O81470P27011P73476Q21382Q68983
58745A7679022R13025R50889R80753J000322J006717R97233R69159R19132Q43876
58736B6260128P42092O15537M68339L05727J33357m2530k15002l77273n24181
58727B7366194o52816p61574q48997r14124r57773r82920r93441r92382r81212
58718A9280955r60507r31510q96843q59307q20080p78945p36300o93841o52960
58709A1950662o13604n75455n39065n04942m72497m40978m10734l82556l56441
58700G654390l32002l09404k88920k70134k52538k36168k20806k05454j89783
$$ plain form
58691 5349181 5174134 5011815 4861096 4722175 4594662 4476566 4365960 4262587 4166938 4078545
58681 4078545 3995936 3917691 3842975 3771605 3703952 3640152 3579293 3520337 3463861 3411417 3362795
58670 3362795 3315431 3267377 3219409 3173192 3128720 3084815 3040991 2997438 2953937 2910071 2865794
58659 2865794 2820636 2773180 2722602 2670046 2617215 2564296 2510616 2456696 2404003 2353029 2303182
58648 2303182 2254471 2207798 2163470 2120818 2079529 2040190 2003169 1968023 1934431 1902785 1873258
58637 1873258 1844925 1816451 1787462 1758843 1731750 1706449 1682205 1658312 1634985 1612837 1591589
58626 1591589 1570113 1547961 1526184 1506297 1489114 1474928 1463982 1456072 1450395 1446470 1444724 1445617
58614 1445617 1448862 1454124 1461692 1471630 1483017 1494849 1506963 1518969 1528891 1534288 1534694 1532013 1528559
$$ packed form
58691E349181j75047j62319j50719j38921j27513j18096j10606j03373r5649q8393
58681D078545q2609p8245p4716p1370o7653o3800o0859n8956n6476n2444m8622
58670C362795m7364m8054m7968m6217m4472m3905m3824m3553m3501m3866m4277
58659B865794m5158m7456n0578n2556n2831n2919n3680n3920n2693n0974m9847
58648B303182m8711m6673m4328m2652m1289l9339l7021l5146l3592l1646k9527
58637A873258k8333k8474k8989k8619k7093k5301k4244k3893k3327k2148k1248
58626A591589k1476k2152k1777j9887j7183j4186j0946p910n677l925j746Q93
58614A445617L245N262P568R938J1387J1832J2114J2006R922N397M06k681l454
$$ plain form
58601 1528559 1525424 1522372 1518297 1511826 1502413 1490974 1478980 1467167 1455827 1446030 1439527 1437332 1439057
58588 1439057 1443691 1450434 1458768 1468427 1479638 1493058 1509240 1528172 1549333 1572210 1596989 1624572
58576 1624572 1655516 1689139 1724407 1761619 1802266 1847096 1895451 1946941 2002594 2063682 2130445
58565 2130445 2202904 2282042 2369182 2464834 2569073 2682451 2805532 2938073 3079619 3230758
58555 3230758 3393183 3568852 3759478 3966121 4188626 4425934 4677335 4942699 5221130
58546 5221130 5510312 5807363 6108586 6407184 6692511 6953140 7180038 7365995 7503684
58537 7503684 7586584 7611707 7580232 7496114 7365416 7196112 6996482 6773402 6532962 6281948
58527 6281948 6027002 5772582 5521195 5275430 5038331 4812025 4597527 4396033 4209098
$$ packed form
58601A528559l135l052m075o471r413j1439j1994j1813j1340r797o503k195J725
58588A439057M634O743Q334R659J1211J3420J6182J8932K1161K2877K4779K7583
58576A624572L0944L3623L5268L7212M0647M4830M8355N1490N5653O1088O6763
58565B130445P2459P9138Q7140R5652J04239J13378J23081J32541J41546J51139
58555C230758J62425J75669J90626K06643K22505K37308K51401K65364K78431
58546E221130K89182K97051L01223K98598K85327K60629K26898J85957J37689
58537G503684Q2900K5123l1475q4118j30698j69304j99630k23080k40440k51014
58527F281948k54946k54420k51387k45765k37099k26306k14498k01494j86935
$$ plain form
58518 4209098 4037415 3880550 3738048 3609865 3495712 3394800 3306015 3227469 3156246 3089780
58508 3089780 3027372 2969356 2915066 2862839 2811842 2762581 2715464 2669912 2625028 2580346 2535857
58497 2535857 2492033 2449640 2408813 2368407 2326896 2283545 2238157 2190408 2140483 2089787 2039893
58486 2039893 1991178 1943597 1898210 1856636 1819212 1784936 1752977 1723093 1694643 1666454 1637819
58475 1637819 1608968 1580709 1554195 1530489 1509488 1489756 1470288 1451890 1436040 1423064 1412239
58464 1412239 1402706 1393275 1382450 1370137 1358430 1349262 1342218 1336055 1331146 1328376 1326628 1323822 1320043
58451 1320043 1317333 1316427 1315796 1314014 1311116 1307400 1302627 1296686 1289677 1281347 1271793 1262524 1255218 1249491
58437 1249491 1243280 1235246 1225487 1214521 1203277 1193537 1186329 1180112 1172532 1163853 1156728 1152720 1150917
$$ packed form
58518D209098j71683j56865j42502j28183j14153j00912q8785p8546p1223o6466
58508C089780o2408n8016n4290n2227n0997m9261m7117m5552m4884m4682m4489
58497B535857m3824m2393m0827m0406m1511m3351m5388m7749m9925n0696m9894
58486B039893m8715m7581m5387m1574l7424l4276l1959k9884k8450k8189k8635
58475A637819k8851k8259k6514k3706k1001j9732j9468j8398j5850j2976j0825
58464A412239r533r431j0825j2313j1707r168p044o163m909k770j748k806l779
58451A320043k710r06o31j782k898l716m773n941p009q330r554r269p306n727
58437A249491o211q034r759j0966j1244r740p208o217p580q679p125m008j803
$$ plain form
58424 1150917 1149745 1147993 1144219 1137530 1129342 1122385 1117591 1113605 1109294 1104811 1100206 1095148 1090153 1085993
58410 1085993 1081735 1075547 1067762 1061011 1056949 1054805 1053375 1052291 1050980 1048540 1045208 1042166 1039720 1037544
58396 1037544 1036516 1037877 1040627 1042540 1044107 1048542 1057245 1068209 1079775 1092901 1108162 1123315 1135771
58383 1135771 1145537 1154000 1161517 1167640 1172176 1174754 1174796 1172797 1169969 1165962 1158975 1148985 1138641 1129780
58369 1129780 1121214 1111295 1100614 1090623 1081346 1072052 1062719 1053524 1044273 1035471 1028567 1024174 1021458 1019957
58355 1019957 1020246 1022103 1024068 1025830 1029096 1034963 1042252 1049402 1056166 1062590 1068472 1074844 1083734 1095290
58341 1095290 1107248 1118312 1129730 1142346 1154754 1166043 1177907 1192053 1207564 1222676 1237250
58330 1237250 1251722 1265500 1278133 1290232 1301632 1310567 1316253 1320326 1324245 1327525 1330089 1333797 1339440
$$ packed form
58424A150917j172j752l774o689q188o957m794l986m311m483m605n058m995m160
58410A085993m258o188p785o751m062k144j430j084j311k440l332l042k446k176
58396A037544j028J361K750J913J567M435Q703J0964J1566J3126J5261J5153J2456
58383A135771R766Q463P517O123M536K578M2j999k828m007o987r990j0344q861
58369A129780q566r919j0681r991r277r294r333r195r251q802o904m393k716j501
58355A019957K89J857J965J762L266N867P289P150O764O424N882O372Q890J1556
58341A095290J1958J1064J1418J2616J2408J1289J1864J4146J5511J5112J4574
58330A237250J4472J3778J2633J2099J1400Q935N686M073L919L280K564L708N643
$$ plain form
58317 1339440 1344635 1347069 1347765 1348811 1349924 1349807 1348993 1348613 1347933 1345817 1343455 1343269 1346111 1351420 1358786
58302 1358786 1367554 1376491 1385677 1396891 1410282 1422794 1432175 1440339 1450144 1460885 1469882 1476627 1482334
58289 1482334 1487113 1490825 1495238 1501928 1509074 1513613 1515703 1517881 1520638 1522265 1522738 1524404 1528619 1534472
58275 1534472 1541127 1548997 1558189 1567759 1576877 1585470 1593946 1603491 1615908 1631646 1648718 1665006 1680856
58262 1680856 1698039 1717251 1738075 1760184 1782999 1805428 1827506 1850852 1876000 1900901 1923843
58251 1923843 1945996 1969076 1992350 2014321 2035728 2058405 2082438 2106775 2131448 2157117 2183639
58240 2183639 2210920 2239787 2270472 2302003 2334589 2370163 2408840 2447720 2485517 2525222 2569256
58229 2569256 2615060 2659022 2701962 2746812 2793374 2839599 2886072 2934889 2985626 3036636 3089143
$$ packed form
58317A339440N195K434O96J046J113j17q14l80o80k116k362j86K842N309P366
58302A358786Q768Q937R186J1214J3391J2512R381Q164R805J0741Q997O745N707
58289A482334M779L712M413O690P146M539K090K178K757J627M73J666M215N853
58275A534472O655P870R192R570R118Q593Q476R545J2417J5738J7072J6288J5850
58262A680856J7183J9212K0824K2109K2815K2429K2078K3346K5148K4901K2942
58251A923843K2153K3080K3274K1971K1407K2677K4033K4337K4673K5669K6522
58240B183639K7281K8867L0685L1531L2586L5574L8677L8880L7797L9705M4034
58229B569256M5804M3962M2940M4850M6562M6225M6473M8817N0737N1010N2507
$$ plain form
58218 3089143 3146071 3207799 3272659 3340459 3412020 3486577 3563246 3643768 3730235 3821308 3914024
58207 3914024 4008036 4104884 4204835 4307832 4415664 4529602 4647739 4768342 4893849 5027911
58197 5027911 5170583 5320176 5477411 5643718 5818013 5999498 6191184 6396213 6613299
58188 6613299 6840183 7078547 7330815 7595540 7871333 8161811 8470699 8795588 9133141
58179 9133141 9487187 9864618 10266414 10690225 11138912 11618387 12129343 12669416 13241772
58170 13241772 13853498 14507407 15203584 15947008 16745138 17599947 18511180 19485632 20534164
58161 20534164 21661584 22868912 24163567 25557598 27058486 28672644 30415628 32307021
58153 32307021 34356655 36567723 38952312 41533281 44335434 47389947 50745186 54457599
$$ packed form
58218C089143N6928O1728O4860O7800P1561P4557P6669Q0522Q6467R1073R2716
58207C914024R4012R6848R9951J02997J07832J13938J18137J20603J25507J34062
58197E027911J42672J49593J57235J66307J74295J81485J91686K05029K17086
58188F613299K26884K38364K52268K64725K75793K90478L08888L24889L37553
58179I133141L54046L77431M01796M23811M48687M79475N10956N40073N72356
58170A3241772O11726O53909O96177P43424P98130Q54809R11233R74452J048532
58161B0534164J127420J207328J294655J394031J500888J614158J742984J891393
58153C2307021K049634K211068K384589K580969K802153L054513L355239L712413
$$ plain form
58145 54457599 58573678 63136563 68207397 73862154 80170874 87202528 95052706 103852007
58137 103852007 113758799 124973255 137747421 152331279 168893123 187532625 208405951
58130 208405951 231848126 258402996 288723032 323203552 361229381 400359724 436260601
58123 436260601 463892208 479392757 481404437 471091129 451196870 424984131 395514396
58116 395514396 365243676 335835602 308199191 282697030 259364275 238050006 218525781
58109 218525781 200595113 184153428 169171096 155658307 143659448 133241356 124440391
58102 124440391 117217606 111480805 107128105 104010835 101817345 100019903 98002615 95301706
58094 95301706 91760471 87488229 82706496 77635660 72469718 67376577 62479421 57845871
$$ packed form
58145E4457599M116079M562885N070834N654757O308720P031654P850178Q799301
58137A03852007R906792J1214456J2774166J4583858J6561844J8639502K0873326
58130B08405951K3442175K6554870L0320036L4480520L8025829L9130343L5900877
58123D36260601K7631607J5500549K011680j0313308j9894259k6212739k9469735
58116C95514396l0270720k9408074k7636411k5502161k3332755k1314269j9524225
58109B18525781j7930668j6441685j4982332j3512789j1998859j0418092q800965
58102A24440391p222785n736801m352700l117270k193490j797442k017288k700909
58094I5301706l541235m272242m781733n070836n165942n093141m897156m633550
$$ plain form
58086 57845871 53508746 49489219 45793722 42404856 39293529 36437758 33822456 31429513
58078 31429513 29240204 27243017 25428519 23779300 22273693 20896561 19638174 18485362
58070 18485362 17422283 16438400 15528404 14685735 13902711 13175190 12500635 11873233 11286950
58061 11286950 10741340 10238086 9773466 9340200 8934701 8556062 8199455 7857214 7525855
58052 7525855 7206281 6897983 6598820 6309615 6033047 5768387 5512649 5266366 5032769
58043 5032769 4811867 4601029 4401180 4216721 4048745 3893359 3747178 3609780 3480341
58034 3480341 3356741 3238940 3129108 3027539 2932068 2841880 2758207 2680843 2607567 2537240
58024 2537240 2470106 2405063 2340297 2276556 2216144 2158684 2101662 2045132 1991869 1942628 1895330
$$ packed form
58086E7845871m337125m019527l695497l388866l111327k855771k615302k392943
58078C1429513k189309j997187j814498j649219j505607j377132j258387j152812
58070A8485362j063079r83883r09996q42669p83024p27521o74555o27402n86283
58061A1286950n45610n03254m64620m33266m05499l78639l56607l42241l31359
58052G525855l19574l08298k99163k89205k76568k64660k55738k46283k33597
58043E032769k20902k10838j99849j84459j67976j55386j46181j37398j29439
58034C480341j23600j17801j09832j01569r5471r0188q3673p7364p3276p0327
58024B537240o7134o5043o4766o3741o0412n7460n7022n6530n3263m9241m7298
$$ plain form
58013 1895330 1849547 1807841 1771635 1739335 1709409 1682080 1657044 1632798 1609212 1587871 1568992
58002 1568992 1550894 1533276 1518083 1506197 1495846 1485073 1473294 1459950 1444372 1427718 1412372
57991 1412372 1398722 1384965 1370505 1356829 1344514 1332320 1320085 1309651 1301795 1294729 1286765 1278201
57979 1278201 1269675 1260955 1252329 1245021 1239299 1234183 1229614 1226630 1224761 1221690 1216418 1210410 1204655 1198022
57965 1198022 1189710 1181011 1173211 1165715 1157541 1148855 1139764 1129421 1117694 1106157 1096173 1087329 1078651
57952 1078651 1069791 1060068 1048269 1034723 1021902 1011395 1001592 989988 976793 964650 955356 948186
57940 948186 941319 933952 926997 921909 918826 916141 912452 908380 905574 904637 905422 908654 915141 923523 931000
57925 931000 936578 941580 946652 950426 951914 952135 952398 952650 952530 952482 952854 953256 953672 954762 956058 955246 950372
$$ packed form
58013A895330m5783m1706l6206l2300k9926k7329k5036k4246k3586k1341j8879
58002A568992j8098j7618j5193j1886j0351j0773j1779j3344j5578j6654j5346
57991A412372j3650j3757j4460j3676j2315j2194j2235j0434p856p066p964q564
57979A278201q526q720q626p308n722n116m569k984j869l071n272o008n755o633
57965A198022q312q699p800p496q174q686r091j0343j1727j1537r984q844q678
57952A078651q860r723j1799j3546j2821j0507r803j1604j3195j2143r294p170
57940I48186o867p367o955n088l083k685l689m072k806r37P85L232O487Q382P477
57925I31000N578N002N072L774J488K21K63K52j20m8L72M02M16J090J296q12m874
$$ plain form
57908 950372 941870 931649 921213 911338 902376 894036 885766 877931 871598 866665 861415 854488 846241 837732
57894 837732 829712 823080 818820 816606 814790 812662 811531 812616 814933 816304 815655 813521 811040 809267
57880 809267 808920 810126 812658 816283 820105 821973 820097 815454 810995 808136 805566 801904 797664 793669
57866 793669 789198 782886 774291 763617 751204 738350 727423 719836 714661 710239 706369 704082 704062 706128
57852 706128 709568 713289 716403 719243 723036 728173 733759 739243 745201 751984 758900 765387 771723 777858
57838 777858 782928 786659 789741 791942 791549 787942 783104 779038 775073 769455 762291 754876 746967 737074
57824 737074 725291 713954 705130 698646 692727 685690 677168 668455 661436 656498 652211 647850 645247 646643
57810 646643 651405 656694 661190 666321 673426 681308 687575 691577 695140 700717 709211 719356 728802 735776
$$ packed form
57908I50372q502j0221j0436r875q962q340q270p835o333m933n250o927q247q509
57894H37732q020o632m260k214j816k128j131J085K317J371o49k134k481j773
57880H09267l47J206K532L625L822J868j876m643m459k859k570l662m240l995
57866G93669m471o312q595j0674j2413j2854j0927p587n175m422l870k287k0K066
57852G06128L440L721L114K840L793N137N586N484N958O783O916O487O336O135
57838G77858N070L731L082K201l93l607m838m066l965n618p164p415p909r893
57824G37074j1783j1337q824o484n919p037q522q713p019m938m287m361k603J396
57810F46643M762N289M496N131P105P882O267M002L563N577Q494J0145R446O974
$$ plain form
57796 735776 739903 741766 742085 741344 739653 736706 732157 726220 719484 712074 703526 693647 682887 671764
57782 671764 660576 649810 639993 630969 622210 614088 607768 603450 599792 595571 590826 585805 580103 573692
57768 573692 567559 562152 556269 548710 540103 531683 522986 512327 499314 485576 473046 462545 453936
57755 453936 446677 440205 434404 429687 426268 423788 421997 421087 420823 420261 419100 418473 419449 421592 424036
57740 424036 427149 431893 438247 445488 453369 461611 468879 473868 477039 479728 481815 481917 479818 477062
57726 477062 475041 473989 473984 475330 477458 478940 479286 479647 481141 483390 485124 485297 483137 478104 470476 461344
57710 461344 451554 441318 431108 421963 414362 407606 400966 394779 389819 386224 383780 382656 383030 384273
57696 384273 385428 386452 388320 391711 396133 400646 405113 410245 416381 422762 428495 433918 440222 447622
$$ packed form
57796G35776M127J863L19p41j691k947m549n937o736p410q548r879j0760j1123
57782F71764j1188j0766r817r024q759q122o320m318l658m221m745n021n702o411
57768E73692o133n407n883p559q607q420q697j0659j3013j3738j2530j0501q609
57755D53936p259o472n801m717l419k480j791r10k64n62j161o27R76K143K444
57740D24036L113M744O354P241P881Q242P268M989L171K689K087J02k099k756
57726D77062k021j052nJ346K128J482L46L61J494K249J734J73k160n033p628r132
57710D61344r790j0236j0210r145p601o756o640o187m960l595k444j124L74J243
57696C84273J155J024J868L391M422M513M467N132O136O381N733N423O304P400
$$ plain form
57682 447622 454884 461159 467328 474563 482276 488799 493761 498418 503636 509010 514293 520145 526683 532570
57668 532570 536768 540455 545972 554305 564705 576383 589088 602004 613723 624249 635958 651304
57656 651304 669955 689347 707947 726791 747513 770122 793482 817026 840841 864723 888635
57645 888635 913949 942710 975233 1009657 1044509 1080542 1119359 1161365 1206281 1254809 1308227
57634 1308227 1366594 1428778 1494387 1564563 1640521 1722348 1809906 1904333 2007957 2122812 2249570
57623 2249570 2387965 2538191 2701872 2881531 3079100 3295257 3530230 3784564 4058453
57614 4058453 4350597 4658269 4978195 5306699 5638993 5968563 6286509 6580243 6832793
57605 6832793 7024987 7140394 7170146 7115044 6984704 6794563 6561663 6300868 6023333 5737373
$$ packed form
57682D47622P262O275O169P235P713O523M962M657N218N374N283N852O538N887
57668E32570M198L687N517Q333J0400J1678J2705J2916J1719J0526J1709J5346
57656F51304J8651J9392J8600J8844K0722K2609K3360K3544K3815K3882K3912
57645H88635K5314K8761L2523L4424L4852L6033L8817M2006M4916M8528N3418
57634A308227N8367O2184O5609P0176P5958Q1827Q7558R4427J03624J14855J26758
57623B249570J38395J50226J63681J79659J97569K16157K34973K54334K73889
57614D058453K92144L07672L19926L28504L32294L29570L17946K93734K52550
57605F832793J92194J15407K9752n5102j30340j90141k32900k60795k77535k85960
$$ plain form
57595 5737373 5449873 5166646 4892013 4628767 4378923 4144470 3927279 3728228 3546735
57586 3546735 3381548 3231957 3097837 2978585 2872761 2779151 2697729 2629228 2574035 2531534
57576 2531534 2500017 2477181 2461617 2454038 2456167 2468022 2487431 2512877 2545489 2587121 2637739 2696325
57564 2696325 2763513 2841278 2930296 3029640 3139288 3261077 3396568 3545476 3706842 3880243
57554 3880243 4064771 4257826 4455927 4655799 4853470 5042692 5215239 5362683 5477378
57545 5477378 5552441 5582397 5564958 5502321 5400542 5267180 5108926 4930906 4737761 4534659
57535 4534659 4326665 4117368 3908809 3702814 3501888 3308801 3125774 2953966 2793241
57526 2793241 2642550 2501202 2369621 2248235 2136007 2031224 1933630 1844367 1763462 1688843
$$ packed form
57595E737373k87500k83227k74633k63246k49844k34453k17191j99051j81493
57586C546735j65187j49591j34120j19252j05824r3610q1422o8501n5193m2501
57576B531534l1517k2836j5564p579K129J1855J9409K5446L2612M1632N0618N8586
57564B696325O7188P7765Q9018R9344J09648J21789J35491J48908J61366J73401
57554C880243J84528J93055J98101J99872J97671J89222J72547J47444J14695
57545E477378P5063K9956j7439o2637j01779j33362j58254j78020j93145k03102
57535D534659k07994k09297k08559k05995k00926j93087j83027j71808j60725
57526B793241j50691j41348j31581j21386j12228j04783r7594q9263q0905p4619
$$ plain form
57516 1688843 1618710 1553736 1495757 1444995 1399743 1358373 1320504 1286236 1255297 1227264 1202026
57505 1202026 1179609 1159737 1141707 1124833 1109114 1095411 1084513 1075973 1068315 1060604 1053353 1047724
57493 1047724 1044468 1043996 1046721 1052611 1060771 1070206 1080847 1093342 1108087 1125061 1144358 1166258 1190801
57480 1190801 1217886 1247888 1281725 1320146 1363185 1410332 1460969 1514759 1572034 1633946 1701993
57469 1701993 1777123 1859258 1947722 2042275 2144035 2255318 2378089 2512179 2655271 2804814
57459 2804814 2959597 3119085 3281573 3443473 3600050 3746007 3875423 3982118 4060891 4108393
57449 4108393 4122846 4103546 4051292 3969130 3862016 3735489 3594769 3444859 3290666 3136277
57439 3136277 2984231 2835915 2692670 2556193 2427953 2308794 2199177 2099294 2008759 1926806
$$ packed form
57516A688843p0133o4974n7979n0762m5252m1370l7869l4268l0939k8033k5238
57505A202026k2417j9872j8030j6874j5719j3703j0898q540p658p711p251n629
57493A047724l256m72K725N890Q160R435J0641J2495J4745J6974J9297K1900K4543
57480A190801K7085L0002L3837L8421M3039M7147N0637N3790N7275O1912O8047
57469A701993P5130Q2135Q8464R4553J01760J11283J22771J34090J43092J49543
57459B804814J54783J59488J62488J61900J56577J45957J29416J06695P8773M7502
57449D108393J4453j9300n2254q2162j07114j26527j40720j49910j54193j54389
57439C136277j52046j48316j43245j36477j28240j19159j09617r9883r0535q1953
$$ plain form
57429 1926806 1853286 1789047 1734854 1690368 1654716 1627495 1608388 1596194 1589416 1587894 1592881 1605207
57417 1605207 1624209 1648723 1678220 1712514 1751169 1793934 1841198 1893366 1950251 2011707 2078421
57406 2078421 2151307 2230501 2315828 2408125 2509155 2619946 2739772 2866839 2999277 3135146
57396 3135146 3272022 3407023 3536749 3656466 3759560 3838671 3888096 3905186 3889608 3841982
57386 3841982 3763849 3658641 3531606 3388201 3232884 3069587 2902473 2735310 2570505 2409766
57376 2409766 2255464 2110023 1973615 1843755 1718293 1598240 1486763 1385708 1293976 1209123
57366 1209123 1129521 1054763 984931 920213 860904 807130 758483 714217 673809 637136 604048
57355 604048 573994 546208 520092 495176 470859 446587 422446 399246 377754 358024 339781
$$ packed form
57429A926806p3520o4239n4193m4486l5652k7221j9107j2194o778j522M987J2326
57417A605207J9002K4514K9497L4294L8655M2765M7264N2168N6885O1456O6714
57406B078421P2886P9194Q5327R2297J01030J10791J19826J27067J32438J35869
57396C135146J36876J35001J29726J19717J03094P9111M9425J7090j5578m7626
57386C841982p8133j05208j27035j43405j55317j63297j67114j67163j64805j60739
57376B409766j54302j45441j36408j29860j25462j20053j11477j01055r1732q4853
57366A209123p9602p4758o9832o4718n9309n3774m8647m4266m0408l6673l3088
57355F04048l0054k7786k6116k4916k4317k4272k4141k3200k1492j9730j8243
$$ plain form
57344 339781 323177 308582 295620 283001 269563 255152 240242 225083 209751 194828 181404
57333 181404 170040 160023 150028 139552 129328 120182 111905 103721 95644 88663 83439 79542 76310
57320 76310 73734 71933 70280 67919 64842 61657 58466 54800 50639 46630 43231 40451 38554 37963 38060
57305 38060 37034 33753 29234 25429 23009 21244 19799 19496 20864 22810 23571 22760 21681 21521 21997 22260
57289 22260 22513 23756 26170 28834 31257 34142 38143 42973 48516 55754 65324 75976 86009 95813
57275 95813 107288 120832 134676 147538 160090 172975 184995 194658 202448 210074 217913 224607 229188
57262 229188 232620 236849 242841 249799 256233 261750 267578 275026 283799 292636 301436 311551 323600 336176
57248 336176 347446 357093 365923 374431 382872 392076 402983 415638 429679 445619 464611 486858
$$ packed form
57344C39781j6604j4595j2962j2619j3438j4411j4910j5159j5332j4923j3424
57333A81404j1364j0017r995j0476j0224r146q277q184q077o981n224l897l232
57320G6310k576j801j653k361l077l185l191l666m161m009l399k780j897n91R7
57305C8060j026l281m519l805k420j765j445l03J368J946P61q11j079j60M76K63
57289B2260K53J243K414K664K423K885M001M830N543P238R570J0652J0033R804
57275I5813J1475J3544J3844J2862J2552J2885J2020R663P790P626P839O694M581
57262B29188L432M229N992O958O434N517N828P448Q773Q837Q800J0115J2049J2576
57248C36176J1270R647Q830Q508Q441R204J0907J2655J4041J5940J8992K2247
$$ plain form
57236 486858 511130 535991 560868 585933 611622 638454 666687 695968 725771 756347 788726
57225 788726 823398 859372 895076 930231 966473 1005648 1047551 1089729 1129667 1166700 1201435
57214 1201435 1233956 1263433 1289100 1310480 1326527 1335591 1336523 1329126 1313459 1289760 1259282 1224141
57202 1224141 1185895 1145233 1103275 1061807 1021620 982026 943012 906545 874486 846306 820365
57191 820365 796617 776359 759825 745734 733142 722222 713111 705345 698851 694506 693349 695800 701654
57178 701654 710132 719922 729728 738878 747159 754621 762054 770935 781898 793769 805107 816100 827729
57165 827729 839679 850838 861749 874750 891252 910340 930766 952989 978389 1007399 1039394
57154 1039394 1073813 1110386 1148407 1186589 1223901 1260378 1296954 1334390 1372437 1410482 1449169
$$ packed form
57236D86858K4272K4861K4877K5065K5689K6832K8233K9281K9803L0576L2379
57225G88726L4672L5974L5704L5155L6242L9175M1903M2178L9938L7033L4735
57214A201435L2521K9477K5667K1380J6047R064R32p397j5667k3699l0478l5141
57202A224141l8246m0662m1958m1468m0187l9594l9014l6467l2059k8180k5941
57191H20365k3748k0258j6534j4091j2592j0920r111p766o494m345j157K451N854
57178G01654Q478R790R806R150Q281P462P433Q881J0963J1871J1338J0993J1629
57165H27729J1950J1159J0911J3001J6502J9088K0426K2223K5400K9010L1995
57154A039394L4419L6573L8021L8182L7312L6477L6576L7436L8047L8045L8687
$$ plain form
57143 1449169 1490770 1537361 1589068 1644699 1703624 1766222 1832818 1903064 1976237 2051441 2127632
57132 2127632 2204028 2280093 2354462 2424519 2488151 2545616 2598733 2648699 2695967 2741760 2787895
57121 2787895 2834740 2880858 2925291 2969161 3014346 3061318 3108765 3154853 3198545 3240195 3281020
57110 3281020 3321746 3361859 3400306 3436308 3468883 3496504 3518372 3535520 3549504 3560690 3569186
57099 3569186 3576695 3585506 3595936 3606784 3618300 3632544 3650341 3669770 3688301 3704656 3717823 3726029
57087 3726029 3727697 3722048 3707771 3682477 3644658 3595164 3535578 3465811 3384141 3288966 3179768
57076 3179768 3056960 2921353 2773271 2611723 2434755 2240495 2027119 1792203 1533543
57067 1533543 1250755 944738 615332 260766 -120593 -529793 -969225 -1443798 -1959724
$$ packed form
57143A449169M1601M6591N1707N5631N8925O2598O6596P0246P3173P5204P6191
57132B127632P6396P6065P4369P0057O3632N7465N3117M9966M7268M5793M6135
57121B787895M6845M6118M4433M3870M5185M6972M7447M6088M3692M1650M0825
57110C281020M0726M0113L8447L6002L2575K7621K1868J7148J3984J1186Q496
57099C569186P509Q811J0430J0848J1516J4244J7797J9429J8531J6355J3167Q206
57087C726029J668n649j4277k5294l7819m9494n9586o9767q1670r5175j09198
57076C179768j22808j35607j48082j61548j76968j94260k13376k34916k58660
57067A533543k82788l06017l29406B60766a20593m09200m39432m74573n15926
$$ plain form
57058 -1959724 -2523672 -3143716 -3829676 -4591566 -5438502 -6379612 -7425397 -8588572 -9884958
57049 -9884958 -11333428 -12953555 -14763700 -16783360 -19037432 -21556410 -24372746 -27519240
57041 -27519240 -31030882 -34946439 -39310187 -44178305 -49627530 -55755659 -62667534 -70452352
57033 -70452352 -79168551 -88854960 -99568190 -111403364 -124440069 -138629969 -153751851
57026 -153751851 -169538812 -185886983 -202903685 -220681279 -238987269 -257174350 -274382316
57019 -274382316 -289806188 -302790594 -312755105 -319138872 -321490008 -319643809 -313845184 -304723671
57011 -304723671 -293134918 -279954756 -265920350 -251564569 -237225258 -223082971 -209200253
57004 -209200253 -195562601 -182123078 -168841878 -155711710 -142766829 -130077857 -117738273
$$ packed form
57058a959724n63948o20044o85960p61890q46936r41110j045785j163175j296386
57049i884958j448470j620127j810145k019660k254072k518978k816336l146494
57041b7519240l511642l915557m363748m868118n449225o128129o911875p784818
57033g0452352q716199r686409j0713230j1835174j3036705j4189900j5121882
57026a53751851j5786961j6348171j7016702j7777594j8305990j8187081j7207966
57019b74382316j5423872j2984406r964511o383767k351136J846199N798625R121513
57011c04723671J1588753J3180162J4034406J4355781J4339311J4142287J3882718
57004b09200253J3637652J3439523J3281200J3130168J2944881J2688972J2339584
$$ plain form
56997 -117738273 -105852551 -94530710 -83882382 -74003006 -64957920 -56775850 -49452556
56990 -49452556 -42956204 -37231722 -32208390 -27810415 -23964189 -20600233 -17654115 -15068203
56982 -15068203 -12791721 -10779344 -8992030 -7399931 -5982735 -4725796 -3615743 -2638346
56974 -2638346 -1778138 -1019465 -349087 241990 760063 1211639 1604087 1944481 2239809
56965 2239809 2497932 2726531 2931276 3116596 3287714 3449708 3604440 3750240 3884713
56956 3884713 4006306 4113524 4205290 4282904 4349856 4408780 4459911 4502779 4537806 4566090 4590009
56945 4590009 4614966 4647719 4689595 4730462 4749746 4723701 4633917 4473663 4250297 3981877 3689283
56934 3689283 3389495 3094170 2811490 2547144 2304172 2083686 1886004 1710438 1554571
$$ packed form
56997a17738273J1885722J1321841J0648328R879376R045086Q182070P323294
56990d9452556O496352N724482N023332M397975L846226L363956K946118K585912
56982a5068203K276482K012377J787314J592099J417196J256939J110053R77397
56974b638346Q60208P58673c49087B41990N18073M51576L92448L40394K95328
56965B239809K58123K28599K04745J85320J71118J61994J54732J45800J34473
56956C884713J21593J07218R1766P7614O6952N8924N1131M2868L5027K8284K3919
56945D590009K4957L2753M1876M0867J9284k6045q9784j60254k23366k68420k92594
56934C689283k99788k95325k82680k64346k42972k20486j97682j75566j55867
$$ plain form
56925 1554571 1415044 1289376 1176495 1075812 986557 907795 838037 774780 715446 659159
56915 659159 606917 559592 516255 474916 434396 394925 357298 322360 291385 266052 247342
56904 247342 234653 226461 221762 220647 223845 232084 245458 262503 279998 294592 304959 311771 315592
56891 315592 315791 311885 304799 295933 285682 273752 260527 247356 235793 227065 221816 219748 219983
56878 219983 222408 228099 237817 250849 266248 284436 306263 330992 356595 381726 405835 427240
56866 427240 442694 449553 447521 438037 422983 404384 384232 363786 343429 323524 304807 287740
56854 287740 272284 258706 247856 240045 234153 228365 221584 214038 206995 202017 199825 199521 199391 198740
56840 198740 198566 200377 204952 212381 222448 234492 247484 260762 274367 288439 302809 317514
$$ packed form
56925A554571j39527j25668j12881j00683q9255p8762o9758o3257n9334n6287
56915F59159n2242m7325m3337m1339m0520l9471l7627l4938l0975k5333j8710
56904B47342j2689q192m699j115L198Q239J3374J7045J7495J4594J0367O812L821
56891C15592J99l906p086q866j0251j1930j3225j3171j1563q728n249k068K35
56878B19983K425N691R718J3032J5399J8188K1827K4729K5603K5131K4109K1405
56866D27240J5454O859k032r484j5054j8599k0152k0446k0357j9905j8717j7067
56854B87740j5456j3578j0850p811n892n788o781p546p043m978k192l04j30o51
56840A98740j74J811M575P429J0067J2044J2992J3278J3605J4072J4370J4705
$$ plain form
56828 317514 333110 350090 368480 388364 410077 433187 455676 474863 489054 498015 502390 503367
56816 503367 502627 501719 501298 501541 503257 507827 515617 525102 534386 543510 554595 569572 588467 610388
56802 610388 635441 664520 697269 731417 764554 795510 823194 845008 857696 859756 852361 838270
56790 838270 820669 802595 786149 771909 759813 750645 745845 745924 750154 758116 770666 788834 812453
56777 812453 840408 871933 907409 948042 994486 1044861 1093898 1134713 1161908 1173080 1168379 1150207
56765 1150207 1123284 1093050 1062594 1031789 1000086 969208 942100 919953 901581 885689 872815
56754 872815 864843 863088 867065 875030 885862 900452 920815 947574 978540 1009656 1036543 1055082
56742 1055082 1061903 1055717 1038150 1012574 982175 949336 916097 884132 854166 826093 799762 775334
$$ packed form
56828C17514J5596J6980J8390J9884K1713K3110K2489J9187J4191Q961M375R77
56816E03367p40r08m21K43J716M570P790R485R284R124J1085J4977J8895K1921
56802F10388K5053K9079L2749L4148L3137L0956K7684K1814J2688K060p395j4091
56790H38270j7601j8074j6446j4240j2096r168m800P9M230P962J2550J8168K3619
56777H12453K7955L1525L5476M0633M6444N0375M9037M0815K7195J1172m701j8172
56765A150207k6923l0234l0456l0805l1703l0878k7108k2147j8372j5892j2874
56754H72815p972j755L977P965J0832J4590K0363K6759L0966L1116K6887J8539
56742A055082O821o186j7567k5576l0399l2839l3239l1965k9966k8073k6331k4428
$$ plain form
56730 775334 752999 732958 715774 702340 693318 688713 687964 690343 695364 702903 712775 724076 735019
56717 735019 743352 746793 743456 732684 715821 695691 674886 654573 634720 614926 595068 575780
56705 575780 558301 543095 528769 513438 497434 483347 472813 464520 456246 447715 440210 434369
56693 434369 429875 426727 425180 424639 424055 423354 423144 423063 421996 420196 419558 421019 422912 422873 420463 416944
56677 416944 413233 409230 404765 400148 395651 391155 386448 381440 376173 370997 366584 363231 360204 356330
56663 356330 351362 346267 342025 338572 335257 331943 329252 327791 327460 327444 326662 324413 320938 317327 314495
56648 314495 312329 310225 308320 307451 307686 307807 306889 305707 305610 306364 306248 304358 301795 300271 300419 301937
56632 301937 304548 308043 311860 315467 319035 323130 327744 332198 335985 339278 342377 345032 346693 347397
$$ packed form
56730G75334k2335k0041j7184j3434r022m605p49K379N021P539R872J1301J0943
56717G35019Q333L441l337j0772j6863k0130k0805k0313j9853j9794j9858j9288
56705E75780j7479j5206j4326j5331j6004j4087j0534q293q274q531p505n841
56693D34369m494l148j547n41n84p01k10q1j067j800o38J461J893l9k410l519
56677D16944l711m003m465m617m497m496m707n008n267n176m413l353l027l874
56663C56330m968n095m242l453l315l314k691j461l31j6p82k249l475l611k832
56648C14495k166k104j905q69K35J21r18j182r7P54j16j890k563j524J48J518
56632C01937K611L495L817L607L568M095M614M454L787L293L099K655J661P04
$$ plain form
56618 347397 348065 349564 351532 352630 352231 351369 351516 352772 354015 354624 355065 355572 355291 353364 350298 347641
56602 347641 346526 346869 347600 347321 345170 341506 337530 333957 330426 326446 322305 318502 314836 310781 306572
56587 306572 303149 301006 299617 298003 295469 291825 287449 283309 280561 279788 280658 282447 284850 288196 292801
56572 292801 298158 302985 306302 308401 310446 313195 316293 318761 319992 320413 321414 324334 329090 334011
56558 334011 337334 338509 337728 335033 330958 327399 326271 327307 328608 329434 330841 333240 335138 335293 334573
56543 334573 334469 334955 335250 335785 337850 341766 346685 351782 356430 359617 360655 360460 360942 362907 365419 367270
56527 367270 368196 368527 368453 367952 367028 365950 365517 366856 370317 374670 377950 379156 378872 378418 378870 380733 384163
56510 384163 389321 396376 404770 412842 419228 424861 432457 443503 456910 471231 486733 503975 521598
$$ packed form
56618C47397O68J499J968J098l99q62J47J256J243O09M41N07k81j927l066k657
56602C47641j115L43P31k79k151l664l976l573l531l980m141l803l666m055m209
56587C06572l423k143j389j614k534l644m376m140k748p73Q70J789K403L346M605
56572B92801N357M827L317K099K045K749L098K468J231M21J001K920M756M921
56558C34011L323J175p81k695m075l559j128J036J301Q26J407K399J898J55p20
56543C34573j04M86K95N35K065L916M919N097M648L187J038j95M82J965K512J851
56527C67270R26L31p4n01r24j078m33J339L461M353L280J206k84m54M52J863L430
56510C84163N158P055Q394Q072O386N633P596J1046J3407J4321J5502J7242J7623
$$ plain form
56497 521598 537383 550987 563982 577353 590543 602878 614519 625804 636736 647213 656723 663854
56485 663854 667288 667397 665852 663551 660007 654799 648436 641388 633271 623481 612049 599642 587236 575718
56471 575718 565149 554513 542945 531056 520187 510593 501391 492117 483127 474486 465799 457477 450949
56458 450949 446998 444703 442383 438906 433907 427710 421461 416491 413040 410106 406730 402820 398712 394782
56444 394782 391665 389938 389242 388476 387183 385976 385375 384958 384033 382441 380372 378042 375902 374598 374333 374563
56428 374563 374420 373192 370693 367740 365875 365752 366040 364926 362495 360583 360445 361772 363881 366459 368945
56413 368945 370665 372025 374298 377842 381766 385728 390630 396915 403598 409865 416377 423914 431786 438772
56399 438772 444911 451233 458166 465177 471650 477309 482068 486137 490153 494755 500064 505586 510191 512372
$$ packed form
56497E21598J5785J3604J2995J3371J3190J2335J1641J1285J0932J0477R510P131
56485F63854L434J09j545k301l544n208o363p048q117r790j1432j2407j2406j1518
56471E75718j0569j0636j1568j1889j0869r594r202r274q990q641q687q322o528
56458D50949l951k295k320l477m999o197o249m970l451k934l376l910m108l930
56444C94782l117j727o96p66j293j207o01m17r25j592k069k330k140j304k65K30
56428C74563j43j228k499k953j865j23K88j114k431j912j38J327K109K578K486
56413C68945J720J360K273L544L924L962M902O285O683O267O512P537P872O986
56399D38772O139O322O933P011O473N659M759M069M016M602N309N522M605K181
$$ plain form
56385 512372 511413 508543 506086 505263 505636 506694 508603 510851 511481 508786 503107 496280 489943 484869 481045
56370 481045 477682 473833 469585 465999 463421 460754 456906 452139 447504 443969 442509 443746 446549 448237
56356 448237 447261 444760 442455 440180 436830 432764 429595 428056 427598 427830 428972 430906 432873 434148 434269
56341 434269 433003 430985 429929 431009 433232 434512 434183 433291 432559 431426 429410 427254 426099 426188 426870 427501
56325 427501 428013 428892 430771 433902 437928 442310 446782 451299 455823 460444 465274 469971 473889 477178 481117
56310 481117 486606 492673 497406 500232 502518 505757 509817 513251 515006 515519 516260 518382 521917 526179 530516
56295 530516 534290 536629 537058 536427 536457 538188 541482 545920 551125 555985 558800 559007 558001 557460 557497 557174
56279 557174 556275 555676 556158 557536 558985 560043 561339 564173 568946 574363 579136 584219 591966 602862 614538
$$ packed form
56385E12372r59k870k457q23L73J058J909K248O30k695n679o827o337n074l824
56370D81045l363l849m248l586k578k667l848m767m635l535j460J237K803J688
56356D48237r76k501k305k275l350m066l169j539m58K32J142J934J967J275J21
56341D34269j266k018j056J080K223J280l29q92p32j133k016k156j155Q9O82O31
56325D27501N12Q79J879L131M026M382M472M517M524M621M830M697L918L289L939
56310D81117N489O067M733K826K286L239M060L434J755N13P41K122L535M262M337
56295E30516L774K339M29o31L0J731L294M438N205M860K815K07j006n41L7l23
56279E57174q99n99M82J378J449J058J296K834M773N417M773N083P747J0896J1676
$$ plain form
56264 614538 624617 633167 641694 651182 662179 675424 690843 706749 721474 735353 749899 765509
56252 765509 781167 796117 810691 825599 841257 857710 874574 891139 906859 921493 934720
56241 934720 946399 957389 969048 981530 993722 1005298 1017290 1029848 1041173 1050050 1057958 1067001
56229 1067001 1077009 1086647 1096479 1108754 1124619 1143531 1165191 1190040 1217773 1247236 1278228 1312015
56217 1312015 1349607 1390785 1435258 1483744 1537392 1596717 1661301 1730148 1802558 1879308 1962725
56206 1962725 2055040 2156993 2268659 2390804 2524324 2668966 2824028 2990244 3169753 3364142
56196 3364142 3573210 3795342 4028274 4269898 4519341 4776801 5041218 5308419 5572467
56187 5572467 5828261 6071553 6297200 6499280 6673076 6815655 6924747 6998827 7038655 7047297
$$ packed form
56264F14538J0079Q550Q527R488J0997J3245J5419J5906J4725J3879J4546J5610
56252G65509J5658J4950J4574J4908J5658J6453J6864J6565J5720J4634J3227
56241I34720J1679J0990J1659J2482J2192J1576J1992J2558J1325Q877P908R043
56229A067001J0008R638R832J2275J5865J8912K1660K4849K7733K9463L0992L3787
56217A312015L7592M1178M4473M8486N3648N9325O4584O8847P2410P6750Q3417
56206A962725R2315J01953J11666J22145J33520J44642J55062J66216J79509J94389
56196C364142K09068K22132K32932K41624K49443K57460K64417K67201K64048
56187E572467K55794K43292K25647K02080J73796J42579J09092P4080L9828Q642
$$ plain form
56177 7047297 7028089 6983473 6915806 6827816 6721776 6599391 6463142 6316765 6163610 6005155
56167 6005155 5841648 5673648 5502264 5328221 5151423 4971764 4790223 4608740 4428740
56158 4428740 4250133 4072391 3896401 3724190 3556854 3394103 3236267 3085232 2942420
56149 2942420 2807113 2678009 2555373 2440357 2333118 2233068 2140256 2054957 1976310 1902778
56139 1902778 1833764 1769662 1710731 1657033 1609025 1566901 1529416 1494447 1460786 1428883 1400219
56128 1400219 1376346 1357728 1342813 1329019 1315246 1302524 1291790 1282515 1274351 1268315 1264918 1262742
56116 1262742 1260598 1259684 1261823 1266726 1272831 1279658 1287520 1296155 1305641 1317556 1333150 1351486 1371301
56103 1371301 1393338 1418490 1445064 1470633 1495536 1521785 1549376 1576599 1603209 1630258 1657336
$$ packed form
56177G047297j9208m4616o7667q7990j06040j22385j36249j46377j53155j58455
56167F005155j63507j68000j71384j74043j76798j79659j81541j81483j80000
56158D428740j78607j77742j75990j72211j67336j62751j57836j51035j42812
56149B942420j35307j29104j22636j15016j07239j00050r2812q5299p8647p3532
56139A902778o9014o4102n8931n3698m8008m2124l7485l4969l3661l1903k8664
56128A400219k3873j8618j4915j3794j3773j2722j0734r275q164o036l397k176
56116A262742k144r14K139M903O105O827P862Q635R486J1915J5594J8336J9815
56103A371301K2037K5152K6574K5569K4903K6249K7591K7223K6610K7049K7078
$$ plain form
56092 1657336 1683035 1707770 1733150 1758983 1784117 1810051 1840433 1876873 1918504 1965764 2021138
56081 2021138 2085761 2158830 2241379 2337332 2449299 2575829 2713825 2860943 3014174 3168371
56071 3168371 3317770 3457732 3584886 3698007 3799572 3894257 3984842 4070902 4150961 4223059
56061 4223059 4282992 4325622 4349505 4357841 4353790 4337296 4307480 4265134 4210810 4142500 4057247 3954016
56049 3954016 3834208 3701107 3559912 3416571 3275283 3138125 3007240 2885449 2774094
56040 2774094 2672241 2578906 2494524 2419677 2354037 2296996 2247812 2205053 2167713 2136782 2113659
56029 2113659 2097101 2083887 2072238 2062186 2053021 2043308 2033294 2024203 2015275 2004796 1993993 1986110
56017 1986110 1981242 1975988 1969032 1963285 1961486 1963402 1968400 1976866 1987726 1998424 2009062 2022922 2041216
$$ packed form
56092A657336K5699K4735K5380K5833K5134K5934L0382L6440M1631M7260N5374
56081B021138O4623P3069Q2549R5953J11967J26530J37996J47118J53231J54197
56071C168371J49399J39962J27154J13121J01565R4685R0585Q6060Q0059P2098
56061D223059N9933M2630K3883Q336m051j6494k9816m2346n4324o8310q5253j03231
56049C954016j19808j33101j41195j43341j41288j37158j30885j21791j11355
56040B774094j01853r3335q4382p4847o5640n7041m9184m2759l7340l0931k3123
56029B113659j6558j3214j1649j0052r165r713j0014r091q928j0479j0803p883
56017A986110m868n254o956n747j799J916M998Q466J0860J0698J0638J3860J8294
$$ plain form
56004 2041216 2061037 2080290 2100945 2125183 2151875 2179307 2208171 2239321 2271372 2302877 2334467
55993 2334467 2366989 2400100 2434272 2471310 2511245 2551572 2591007 2630884 2671625 2711553 2750766
55982 2750766 2792346 2837787 2885113 2933520 2985647 3042762 3101759 3159873 3218725 3280844 3345854
55971 3345854 3413140 3484751 3562371 3644452 3729353 3818375 3912938 4011754 4113525 4219581 4331505
55960 4331505 4449137 4572978 4705238 4846471 4994728 5149740 5313875 5487268 5666867
55951 5666867 5852463 6048557 6257623 6476633 6702993 6938413 7183973 7437416 7699179
55942 7699179 7975345 8270380 8582264 8908806 9253090 9618393 10003504 10407754 10835139
55933 10835139 11289042 11768697 12275264 12815112 13392422 14005318 14654362 15347798 16092975
$$ packed form
56004B041216J9821J9253K0655K4238K6692K7432K8864L1150L2051L1505L1590
55993B334467L2522L3111L4172L7038L9935M0327L9435L9877M0741L9928L9213
55982B750766M1580M5441M7326M8407N2127N7115N8997N8114N8852O2119O5010
55971C345854O7286P1611P7620Q2081Q4901Q9022R4563R8816J01771J06056J11924
55960D331505J17632J23841J32260J41233J48257J55012J64135J73393J79599
55951E666867J85596J96094K09066K19010K26360K35420K45560K53443K61763
55942G699179K76166K95035L11884L26542L44284L65303L85111M04250M27385
55933A0835139M53903M79655N06567N39848N77310O12896O49044O93436P45177
$$ plain form
55924 16092975 16890031 17740092 18652002 19634399 20688845 21817612 23030453 24336984 25741244
55915 25741244 27251468 28886080 30661658 32584284 34661689 36914704 39368911 42047532
55907 42047532 44983678 48227888 51831903 55837335 60292958 65270244 70849166 77104443
55899 77104443 84121574 92011721 100898801 110917879 122249944 135134884 149825256
55892 149825256 166556507 185593183 207259344 231852515 259511793 290118842 323079647
55885 323079647 356847217 388532336 414267152 430459740 435164592 428614023 412732436
55878 412732436 390226570 363838560 335897492 308090714 281441623 256468471 233382896
55871 233382896 212209085 192849326 175158092 159002388 144269007 130851237 118657580
$$ packed form
55924A6092975P97056Q50061R11910R82397J054446J128767J212841J306531J404260
55915B5741244J510224J634612J775578J922626K077405K253015K454207K678621
55907D2047532K936146L244210L604015M005432M455623M977286N578922O255277
55899G7104443P017131P890147Q887080J0019078J1332065J2884940J4690372
55892A49825256J6731251J9036676K1666161K4593171K7659278L0607049L2960805
55885C23079647L3767570L1685119K5734816J6192588M704852o550569j5881587
55878D12732436k2505866k6388010k7941068k7806778k6649091k4973152k3085575
55871B33382896k1173811j9359759j7691234j6155704j4733381j3417770j2193657
$$ plain form
55864 118657580 107620751 97677795 88750207 80755823 73625474 67291185 61668456 56665829
55856 56665829 52204890 48220027 44649037 41438431 38551883 35961522 33635335 31541041
55848 31541041 29654450 27953324 26408329 24989173 23674960 22451141 21302504 20217529
55840 20217529 19194142 18232464 17325692 16464689 15646368 14870242 14131562 13425451 12753725
55831 12753725 12120472 11524414 10961945 10433573 9940452 9477954 9039337 8623017 8230320
55822 8230320 7859069 7505357 7169015 6851728 6552190 6268229 6000951 5751667 5517302
55813 5517302 5293774 5081291 4881543 4692527 4511111 4337918 4174494 4018089 3864506
55804 3864506 3714256 3571224 3437275 3312649 3199094 3097281 3002879 2910148 2818093 2728667
$$ packed form
55864A18657580j1036829r942956q927588p994384p130349o334289n622729n002627
55856E6665829m460939l984863l570990l210606k886548k590361k326187k094294
55848C1541041j886591j701126j544995j419156j314213j223819j148637j084975
55840B0217529j023387r61678r06772q61003q18321p76126p38680p06111o71726
55831A2753725o33253n96058n62469n28372m93121m62498m38617m16320l92697
55822H230320l71251l53712l36342l17287k99538k83961k67278k49284k34365
55813E517302k23528k12483j99748j89016j81416j73193j63424j56405j53583
55804C864506j50250j43032j33949j24626j13555j01813r4402r2731r2055q9426
$$ plain form
55794 2728667 2640951 2552354 2464268 2381183 2304442 2231316 2159979 2091252 2025564 1962028 1900775
55783 1900775 1843224 1790087 1741457 1698097 1660231 1626133 1594415 1566306 1543043 1522737 1502998
55772 1502998 1485147 1472341 1464585 1458966 1453924 1449855 1445959 1439686 1429275 1414494 1395321 1372132
55760 1372132 1346540 1320075 1292803 1264872 1237757 1211975 1185519 1157108 1128999 1103630 1079449
55749 1079449 1053576 1027071 1003835 985226 969463 955604 944316 934949 925470 915692 907600 902127
55737 902127 898129 894680 891895 889359 886013 881827 877571 872933 866757 858937 850223 840433 828848 816156
55723 816156 804115 793386 783256 773193 763209 753178 743132 733497 723828 712576 699577 687108
55711 687108 676468 665246 650569 633663 618316 605959 595307 586003 579213 574710 570404 565084
$$ packed form
55794B728667q7716q8597q8086q3085p6741p3126p1337o8727o5688o3536o1253
55783A900775n7551n3137m8630m3360l7866l4098l1718k8109k3263k0306j9739
55772A502998j7851j2806p756n619n042m069l896o273j0411j4781j9173k3189
55760A372132k5592k6465k7272k7931k7115k5782k6456k8411k8109k5369k4181
55749A079449k5873k6505k3236j8609j5763j3859j1288r367r479r778q092n473
55737I02127l998l449k785k536l346m186m256m638o176p820q714r790j1585j2692
55723H16156j2041j0729j0130j0063r984j0031j0046r635r669j1252j2999j2469
55711F87108j0640j1222j4677j6906j5347j2357j0652r304o790m503m306n320
$$ plain form
55699 565084 559215 552846 544959 534990 523023 508738 492282 475895 462463 452525 444628 438069 433022
55686 433022 428559 423236 417444 412578 407954 401264 392255 383308 376022 369689 363609 358457 354673 351687
55672 351687 349356 348110 347129 344561 340286 336337 333670 330500 324957 317763 311026 305610 300789 295593
55658 295593 289685 283554 278216 274034 269881 264533 258870 255367 255180 257005 259038 260840 262861 265316
55644 265316 268045 270801 273369 275812 278373 280571 281044 279272 276797 275467 275069 274107 272419 271370 271735
55629 271735 273088 275213 278464 282605 286682 290215 293389 296261 299043 302815 308547 315536 322220 328196
55615 328196 333913 338726 341072 340645 338711 336161 332707 328054 322359 315610 308030 301081 296533 294446
55601 294446 293483 293046 293556 294859 296178 297699 300325 303653 305949 306534 306633 307498 309125 311021 312757 313517
$$ packed form
55699E65084n869o369p887r969j1967j4285j6456j6387j3432r938p897o559n047
55686D33022m463n323n792m866m624o690r009q947p286o333o080n152l784k986
55672C51687k331j246r81k568m275l949k667l170n543p194o737n416m821n196
55658B95593n908o131n338m182m153n348n663l503j87J825K033J802K021K455
55644B65316K729K756K568K443K561K198M73j772k475j330l98r62j688j049L65
55629B71735J353K125L251M141M077L533L174K872K782L772N732O989O684N976
55615C28196N717M813K346m27j934k550l454m653n695o749p580o949m548k087
55601B94446r63m37N10J303J319J521K626L328K296N85R9Q65J627J896J736P60
$$ plain form
55585 313517 312550 310340 308062 305808 302657 298416 293826 289214 284553 280605 278029 275467 270613 263438
55571 263438 256214 249958 243057 234151 224354 215673 208842 203549 199302 195323 190847 186072 181623 177022
55557 177022 171363 165525 161523 159240 156152 151118 146200 143599 142989 143199 144343 146384 147355 145239 140806
55542 140806 136846 135188 135708 137411 139130 139747 139007 137832 137147 136926 136859 136919 136539 134331 129742 124263 120088
55525 120088 118049 117406 116958 115884 114311 113455 114209 115239 113862 109394 104311 101197 99868 98475 96199
55510 96199 93616 91442 90225 90584 92581 95235 97443 98840 99364 98996 98539 99469 102045 104568 105434 104934
55494 104934 104110 102919 100647 97192 92909 88097 83662 81151 80772 80344 77730 73646 70641 69973 70864
55479 70864 72241 73580 74414 74572 74863 76230 78324 80055 81261 82549 83734 83929 83293 83253 84587 86425
$$ packed form
55585C13517r67k210k278k254l151m241m590m612m661l948k576k562m854p175
55571B63438p224o256o901q906r797q681o831n293m247l979m476m775m449m601
55557A77022n659n838m002k283l088n034m918k601o10K10J144K041R71k116m433
55542A40806l960j658N20J703J719O17p40j175o85k21o7O0l80k208m589n479m175
55525A20088k039o43m48j074j573q56P54J030j377m468n083l114j329j393k276
55510I6199k583k174j217L59J997K654K208J397N24l68m57R30K576K523Q66n00
55494A04934q24j191k272l455m283m812m435k511l79m28k614m084l005o68Q91
55479G0864J377J339Q34J58K91J367K094J731J206J288J185J95o36m0J334J838
$$ plain form
55463 86425 87575 87795 87355 86354 85160 84783 85938 88061 89890 90863 91469 92251 92991 93114 92615 92142 92091
55446 92091 92041 91433 90472 89795 89406 88566 86776 84178 80924 76913 72463 68455 65222 61775 56822 50369
55430 50369 43881 38971 36200 34991 34337 33474 31965 29439 25802 21900 19352 19137 20720 23035 25678
55415 25678 28389 30202 30485 30340 31399 33350 34222 33194 31530 30434 29674 28905 28786 29841 31372 32406
55399 32406 32685 32002 29610 25288 20264 16316 14477 14933 17232 20110 22137 23172 24263 25679 26136
55384 26136 24540 21392 17869 14681 12437 11832 12682 13961 15459 18019 21426 23817 24323 24572 26124
55369 26124 28059 28906 29427 31291 34034 35768 36318 37287 39129 40266 39357 36745 33526 30736 29549 30672
55353 30672 33247 35668 37648 40140 42987 44221 42289 37865 32872 28770 26323 26045 27914 31089 34630
$$ packed form
55463H6425J150K20m40j001j194l77J155K123J829R73O06P82P40J23m99m73n1
55446I2091n0o08r61o77l89q40j790k598l254m011m450m008l233l447m953o453
55430E0369o488m910k771j209o54q63j509k526l637l902k548k15J583K315K643
55415B5678K711J813K83j45J059J951Q72j028j664j096p60p69j19J055J531J034
55399C2406K79o83k392m322n024l948j839M56K299K878K027J035J091J416M57
55384B6136j596l148l523l188k244o05Q50J279J498K560L407K391N06K49J552
55369B6124J935Q47N21J864K743J734N50R69J842J137r09k612l219k790j187J123
55353C0672K575K421J980K492K847J234j932m424m993m102k447k78J869L175L541
$$ plain form
55338 34630 38285 42187 45937 48400 48551 46478 43423 40617 38165 35451 32423 29778 27911 26728 26674
55323 26674 28652 32207 34990 35124 33281 31418 30315 29503 28798 28507 28597 28897 29777 31444 32975 33245 32450
55306 32450 31590 30886 29911 28872 28402 28358 28155 28080 28883 30266 31225 31809 33063 35091 36649 36890 36208 35131
55288 35131 33687 32196 31402 31339 31189 30672 30484 30909 31136 30569 29855 29922 30773 31838 32853 33737 34153 33841
55270 33841 33141 32827 33572 35561 38155 39879 39313 36269 31899 27798 25323 25244 27147 29353 30392 30562
55254 30562 31176 32414 32984 31992 30008 28032 26461 25478 25401 26105 26922 27609 28688 30382 32049 33250 34539
55237 34539 36374 37822 37339 34658 31154 28364 26762 26059 26102 26953 28190 28732 27885 26401 25918 27285
55221 27285 30018 33434 37296 40899 42684 41918 40045 39107 39212 38774 36976 34689 33045 32407 32831 34268
$$ packed form
55338C4630L655L902L750K463J51k073l055k806k452k714l028k645j867j183n4
55323B6674J978L555K783J34j843j863j103q12p05k91R0L00Q80J667J531K70p95
55306C2450q60p04r75j039m70m4k03p5Q03J383R59N84J254K028J558K41o82j077
55288C5131j444j491p94o3j50n17j88M25K27n67p14O7Q51J065J015Q84M16l12
55270C3841p00l14P45J989K594J724n66l044m370m101k475p9J903K206J039J70
55254C0562O14J238N70r92j984j976j571r83p7P04Q17O87J079J694J667J201J289
55237C4539J835J448m83k681l504k790j602p03M3Q51J237N42q47j484m83J367
55221B7285K733L416L862L603J785p66j873r38J05m38j798k287j644o38M24J437
$$ plain form
55205 34268 36008 36956 36762 35911 34607 32629 30446 29344 30001 31691 33159 33602 32780 31143 30009 30627
55189 30627 32762 34939 36098 36148 35070 32857 30476 29386 29654 29869 29431 29551 31273 33824 35776 36762
55173 36762 37199 37340 37488 38140 39035 39011 37719 36576 37002 38577 39940 40656 41139 41525 41809 42355 43045 42617
55155 42617 40195 36974 35013 34767 35176 35828 37382 39932 42585 44973 47648 50497 52150 51851 50903 51203
55139 51203 52885 54246 53712 51251 48130 45966 45920 48093 51395 54257 55776 56301 56926 58418 60583 62535
55123 62535 63392 62644 60152 56250 51908 48401 46575 46508 47810 49869 51771 52543 51824 50034 47788 45537
55107 45537 43862 43439 44221 45228 45665 45792 46125 46282 45519 44145 43466 44221 45793 47018 47096 45587 42344
55090 42344 37989 33951 31496 30822 31296 32229 33118 33550 33543 33891 35491 38080 40100 40201 38623 36676 35126
$$ packed form
55205C4268J740R48j94q51j304j978k183j102O57J690J468M43q22j637j134O18
55189C0627K135K177J159N0j078k213k381j090K68K15m38J20J722K551J952R86
55173C6762M37J41J48O52Q95k4j292j143M26J575J363P16M83L86K84N46O90m28
55155D2617k422l221j961k46M09O52J554K550K653K388K675K849J653k99r48L00
55139E1203J682J361n34k461l121k164m6K173L302K862J519N25O25J492K165J952
55123F2535Q57p48k492l902m342l507j826o7J302K059J902P72p19j790k246k251
55107D5537j675m23P82J007M37J27L33J57p63j374o79P55J572J225P8j509l243
55090D2344m355m038k455o74M74R33Q89M32pL48J600K589K020J01j578j947j550
$$ plain form
55073 35126 33723 32325 31635 32277 33602 34140 33166 31263 29394 28064 27581 28480 31174 35285 39704 43354
55057 43354 45839 47458 48762 50126 51732 53764 56275 58827 60662 61573 62266 63552 65523 67981 71129
55042 71129 75005 78529 80244 80161 79939 80870 82457 83398 83293 82892 83202 84837 87722 90856 92857 93390 93739
55025 93739 95263 97454 98231 96238 92358 88822 87251 87680 89078 90305 90645 89925 88585 87552 87537 88220
55009 88220 88532 88055 87676 88303 89355 89442 88451 87892 88882 90665 91754 91892 92106 93053 94033 93776 91834 89062
54991 89062 86847 85891 85764 85652 85349 85228 85443 85550 84887 83009 79868 76082 72953 71707 72533 74654 77151
54974 77151 79205 79899 78813 77056 76781 79108 82973 86368 88247 89017 89752 91348 93850 96154 96717 95065
54958 95065 92435 90736 91081 93308 96376 99026 100565 101337 102145 103155 103881 104294 105277 107595 110839 113691
$$ packed form
55073C5126j403j398o90O42J325N38r74j903j869j330m83Q99K694M111M419L650
55057D3354K485J619J304J364J606K032K511K552J835R11O93J286J971K458L148
55042G1129L876L524J715q3k22R31J587R41j05m01L10J635K885L134K001N33L49
55025I3739J524K191P77j993l880l536j571M29J398J227L40p20j340j033j5O83
55009H8220L12m77l79O27J052Q7r91n59R90J783J089J38K14R47R80k57j942k772
54991H9062k215r56j27j12l03j21K15J07o63j878l141l786l129j246Q26K121K497
54974G7151K054O94j086j757k75K327L865L395J879P70P35J596K502K304N63j652
54958I5065k630j699L45K227L068K650J539P72Q08J010P26M13R83K318L244K852
$$ plain form
54942 113691 114997 114586 113427 112912 113524 114392 114651 114820 115824 117081 116956 115027 112347 109394 105603 101530
54926 101530 99475 100677 103308 104669 104284 103564 103492 104138 105502 107284 108394 108203 107793 108641 110591 112482
54910 112482 114131 116048 117687 117860 116825 116217 116747 117618 118462 120150 123188 126800 130307 134053 138199
54895 138199 141840 144348 146747 150632 156255 162531 168634 174787 181676 189719 198926 209053 219805 231097
54881 231097 243203 256751 272527 290818 310431 328616 342600 351309 355214 354873 350436 342517 332514
54868 332514 321528 309469 295714 280437 264897 250336 236628 222312 206515 190840 178423
54857 178423 170553 165132 159421 153488 149564 148538 148855 148914 148919 149940 152610 157331 164447 173416 182915 192561
54841 192561 203457 216152 229110 240454 250578 261786 275617 291405 307121 320644 330462 336246
$$ packed form
54942A13691J306m11j159n15O12Q68K59J69J004J257j25j929k680k953l791m073
54926A01530k055J202K631J361l85p20p2O46J364J782J110j91m10Q48J950J891
54910A12482J649J917J639J73j035o08N30Q71Q44J688L038L612L507L746M146
54895A38199L641K508K399L885N623O276O103O153O889Q043R207J0127J0752J1292
54881B31097J2106J3548J5776J8291J9613J8185J3984Q709L905l41m437p919j0003
54868C32514j0986j2059j3755j5277j5540j4561j3708j4316j5797j5675j2417
54857A78423p870n421n711n933l924j026L17N9NJ021K670M721P116Q969R499R646
54841A92561J0896J2695J2958J1344J0124J1208J3831J5788J5716J3523R818N784
$$ plain form
54829 336246 338830 338951 336055 329082 318234 305022 290533 274718 257741 240962 225771 212083
54817 212083 198884 185979 174270 164297 155462 147076 139527 133767 129987 127451 125465 123841 122456
54804 122456 121037 119515 117978 116155 113629 110799 108908 108651 109418 110336 111225 111872 111326 109092 106394 104830
54788 104830 104042 102127 98441 94608 92451 92104 92665 93527 94268 94112 92441 89610 86677 84537 83497 83287
54772 83287 83247 82970 82850 83516 84729 85599 85998 86730 87994 88758 88289 87379 87236 87956 88979 90344 92416 94803
54754 94803 96602 97631 98601 100200 102616 105681 108829 111279 113013 115248 118999 123459 126891 129094 131786
54739 131786 136280 141875 147201 152280 158441 166559 176169 186265 196388 206813 217964 229953 242780
54726 242780 256800 272610 290203 308418 325563 340374 352035 359599 362250 360269 355210 348782
$$ packed form
54829C36246K584J21k896o973j0848j3212j4489j5815j6977j6779j5191j3688
54817B12083j3199j2905j1709r973q835q386p549n760l780k536j986j624j385
54804A22456j419j522j537j823k526k830j891k57P67R18Q89O47n46k234k698j564
54788A04830p88j915l686l833k157l47N61Q62P41j56j671k831k933k140j040k10
54772H3287m0k77j20O66J213Q70L99P32J264P64m69r10j43P20J023J365K072K387
54754I4803J799J029R70J599K416L065L148K450J734K235L751M460L432K203K692
54739A31786M494N595N326N079O161Q118R610J0096J0123J0425J1151J1989J2827
54726B42780J4020J5810J7593J8215J7145J4811J1661P564K651j981n059o428
$$ plain form
54714 348782 341931 335003 328167 321302 314001 306166 298278 290745 283378 275977 269034 263191 258326 253949
54700 253949 250388 248687 249149 250894 253165 256267 260581 265455 269979 274426 279903 286768 294509 303247
54686 303247 314329 328981 347175 368245 391748 417087 442965 468049 491740 513491 531751
54675 531751 544473 550643 550634 545225 535008 520758 503615 484655 464597 443872 422611 400782 378862
54662 378862 358088 339326 321978 304907 288182 272810 258907 245662 233431 224169 218824 215579
54650 215579 211918 207509 203677 200816 198018 194981 192489 190616 187934 183387 177967 173639 171205 170052
54636 170052 169605 170008 171307 172812 173749 174214 174957 176198 177044 176417 174470 172643 172046 172063 171112 168869 167149
54619 167149 167983 171048 173747 174143 173185 173379 175741 179123 182549 186894 193359 201145 207902 212358 215456
$$ packed form
54714C48782o851o928o836o865p301p835p888p533p367p401o943n843m865m377
54700B53949l561j701M62J745K271L102M314M874M524M447N477O865P741Q738
54686C03247J1082J4652J8194K1070K3503K5339K5878K5084K3691K1751J8260
54675E31751J2722O170rn409j0217j4250j7143j8960k0058k0725k1261k1829k1920
54662C78862k0774j8762j7348j7071j6725j5372j3903j3245j2231r262n345l245
54650B15579l661m409l832k861k798l037k492j873k682m547n420m328k434j153
54636A70052m47M03J299J505R37M65P43J241Q46o27j947j827n97J7r51k243j720
54619A67149Q34L065K699L96r58J94K362L382L426M345O465P786O757M456L098
$$ plain form
54604 215456 218881 223419 229007 235430 242432 249651 256848 263806 269904 274419 277465 279940 282211 283739
54590 283739 284598 286453 291009 297947 305391 312129 318348 324320 329587 333836 337798 342677 349182 357646
54576 357646 368724 383304 401560 422445 444367 466347 488341 510511 532533 553881 574285
54565 574285 593179 608818 618841 622048 618966 610366 596197 576653 553510 529260 505377 482389
54553 482389 461223 442961 427112 411559 394962 378399 363858 351786 340947 330377 320719 313545
54541 313545 309731 308435 307494 305027 300903 296421 292420 288215 282783 276428 270424 265200 259843 253662
54527 253662 247389 242193 238051 233841 228877 223581 218513 213350 207183 199549 190859 182049 174070 167576
54513 167576 162839 159809 158134 156942 154928 151367 147168 144177 143091 142832 142410 142423 143673 145209 145327
$$ packed form
54604B15456L425M538N588O423P002P219P197O958O098M515L046K475K271J528
54590B83739Q59J855M556O938P444O738O219N972N267M249L962M879O505Q464
54576C57646J1078J4580J8256K0885K1922K1980K1994K2170K2022K1348K0404
54565E74285J8894J5639J0023L207l082q600j4169j9544k3143k4250k3883k2988
54553D82389k1166j8262j5849j5553j6597j6563j4541j2072j0839j0570r658p174
54541C13545l814j296r41k467m124m482m001m205n432o355o004n224n357o181
54527B53662o273n196m142m210m964n296n068n163o167p634q690q810p979o494
54513A67576m737l030j675j192k014l561m199k991j086k59m22J3J250J536J18
$$ plain form
54498 145327 144189 143776 145005 146519 146846 146187 145267 143832 141561 139411 138581 138733 138581 137872 137607 138458 140061
54481 140061 141828 143538 145190 146973 149217 151786 153958 155709 158466 163426 169647 175268 180347 186854
54467 186854 195781 205911 215803 225387 235004 244427 253836 264566 277603 291962 305425 316315 323798
54454 323798 327277 326609 322628 316616 309359 301089 291921 281920 271320 261068 252387 245184 237705 228561
54440 228561 218467 209243 201840 196258 192494 190220 188088 184843 181034 178288 176888 175295 172152 167625
54426 167625 162705 158347 155453 154462 154589 154591 154674 156433 160376 164704 167414 168588 169657 171304 173335 175931
54410 175931 179591 183909 187710 190596 193378 196660 199921 202519 204887 207956 211649 214714 216132 216123 215568
54395 215568 214915 214129 213389 213095 213115 212747 211775 210904 210553 209854 207741 204642 201984 200127 197909 194401 189981
$$ packed form
54498A45327j138m13J229J514L27o59r20j435k271k150q30J52j52p09k65Q51J603
54481A40061J767J710J652J783K244K569K172J751K757M960O221N621N079O507
54467A86854Q927J0130R892R584R617R423R409J0730J3037J4359J3463J0890P483
54454C23798L479o68l981o012p257q270r168j0001j0600j0252q681p203p479r144
54440B28561j0094r224p403n582l764k274k132l245l809k746j400j593l143m527
54426A67625m920m358k894r91J27KQ3J759L943M328K710J174J069J647K031K596
54410A75931L660M318L801K886K782L282L261K598K368L069L693L065J418rn55
54395B15568o53p86p40k94K0l68r72q71l51o99k113l099k658j857k218l508m420
$$ plain form
54378 189981 185366 180732 176354 172981 170719 168560 165982 164068 163763 163871 162510 160175 159411 161091 162772
54363 162772 161694 158163 154839 153478 153675 154551 156263 159355 163410 167174 170025 172702 176173 180009 182616
54348 182616 183300 183482 185282 189368 194862 200914 207281 213448 218416 221819 224435 227097 229847 232682 236297
54333 236297 241253 246918 252045 256133 259455 262055 263604 264253 264748 265423 265617 264422 261594 257506 252635
54318 252635 247469 242673 238802 235786 232940 229583 225461 220487 214483 207568 200655 194958 190824 187541
54304 187541 184463 181679 179184 176271 172667 169690 168860 169532 169354 167423 165521 165574 167166 168602 169420 170504
54288 170504 172288 174217 175780 176992 177883 178459 179215 180907 183765 187498 191855 196514 200754 204202 207677
54273 207677 212164 216915 219807 219957 218892 218559 218975 218457 215583 210444 204500 199707 197196 196250 194949
$$ packed form
54378A89981m615m634m378l373k262k159k578j914l05J08j361k335p64J680J681
54363A62772j078l531l324j361J97Q76J712L092M055L764K851K677L471L836K607
54348A82616O84J82J800M086N494O052O367O167M968L403K616K662K750K835L615
54333B36297M956N665N127M088L322K600J549O49M95O75J94j195k828m088m871
54318B52635n166m796l871l016k846l357m122m974o004o915o913n697m134l283
54304A87541l078k784k495k913l604k977q30O72j78j931j902N3J592J436Q18J084
54288A70504J784J929J563J212Q91N76P56J692K858L733M357M659M240L448L475
54273B07677M487M751K892J50j065l33M16n18k874n139n944m793k511r46j301
$$ plain form
54258 194949 192161 188449 184695 180681 175784 170421 165605 161189 155721 148513 141157 136282 134934 135648
54244 135648 136123 135448 134463 134218 134662 135001 134743 133790 131880 128784 125117 122100 120181 118574 116530 114335
54228 114335 112467 110435 107545 104575 103493 105151 108100 110257 111150 111806 112842 113627 113542 113228 113936 116040
54212 116040 118823 121657 124609 127744 130406 131669 131238 129563 127376 125479 124722 125583 127657 129867 131408
54197 131408 132427 133832 136400 139894 143028 144656 145062 145696 147455 149772 151558 152362 152144 150711 148168
54182 148168 145368 142970 140462 137103 133606 131794 132564 135009 137474 138610 137596 134546 131029 129200
54168 129200 129950 132293 134639 136068 136555 136863 138157 140812 143683 145463 146560 148289 150419 151274 150573
54153 150573 150337 152230 155597 159015 162088 164483 164828 162370 158769 156517 156170 156597 157195 158115 158732 157816
$$ packed form
54258A94949k788l712l754m014m897n363m816m416n468p208p356m875j348P14
54244A35648M75o75r85k45M44L39k58r53j910l096l667l017j919j607k044k195
54228A14335j868k032k890k970j082J658K949K157Q93O56J036P85q5l14P08K104
54212A16040K783K834K952L135K662J263m31j675k187j897p57Q61K074K210J541
54197A31408J019J405K568L494L134J628M06O34J759K317J786Q04k18j433k543
54182A48168k800k398k508l359l497j812P70K445K465J136j014l050l517j829
54168A29200P50K343K346J429M87L08J294K655K871J780J097J729K130Q55p01
54153A50573k36J893L367L418L073K395L45k458l601k252l47M27N98R20O17r16
$$ plain form
54137 157816 155483 153459 152941 153149 152299 149273 144225 138316 132987 129030 126294 124480 123646 123451 122756 121005
54121 121005 119356 119223 120259 121080 121518 122437 123502 123075 120811 118679 118535 119898 121082 121484 121652 121711 120949
54104 120949 119032 116835 115750 116286 117453 117675 116398 114632 113751 114123 115189 116224 116378 114691 111177
54089 111177 107535 105504 104642 103008 100000 97080 95443 94519 93419 92482 92411 92899 93251 93660 94725 96158
54073 96158 96955 96655 95595 94060 91988 89540 87345 85964 85375 85042 84447 83667 83515 84877 87742 91110
54057 91110 93817 95177 94903 93144 90834 89362 89366 90085 90248 89344 87923 86967 87087 87908 88155 86959 85211
54040 85211 84948 86996 89943 91972 93081 94798 98174 102837 107731 111900 114535 115139 114122 112885 112759
54025 112759 113754 114478 113581 111310 109322 108717 108629 107448 105153 103507 103830 105472 106871 107289 107050 106793 107077
$$ packed form
54137A57816k333k024n18K08q50l026n048n909n329l957k736j814q34j95o95j751
54121A21005j649j33J036Q21M38R19J065m27k264k132j44J363J184M02J68N9p62
54104A20949j917k197j085N36J167K22j277j766q81L72J066J035J54j687l514
54089A11177l642k031q62j634l008k920j637r24j100r37p1M88L52M09J065J433
54073I6158P97l00j060j535k072k448k195j381n89l33n95p80j52J362K865L368
54057I1110K707J360k74j759k310j472MP19J63r04j421r56J20Q21K47j196j748
54040H5211k63K048K947K029J109J717L376M663M894M169K635O04j017j237j26
54025A12759R95P24q97k271j988o05q8j181k295j646L23J642J399M18k39k57K84
$$ plain form
54008 107077 108033 108799 108111 106242 105504 107558 110776 111885 110234 108955 111338 117220 123667 128200 130376
53993 130376 130985 131067 131761 133927 137371 140926 143677 145748 147573 148927 149297 149067 149665 152260 156682 161781
53977 161781 166566 170793 174745 178787 183060 187472 192136 197802 205469 215252 225966 236160 245340 253870
53963 253870 262099 270140 278235 286747 295690 304601 312788 319607 324917 329597 334959 341003 345791 347503
53949 347503 346601 344824 342527 338663 333515 329554 328553 329082 328099 324340 319051 313819 308923 303827 298402
53934 298402 293127 288259 283113 276509 268270 259977 253480 248696 243822 238059 233052 230918 231565 232819
53920 232819 232805 231415 229757 228964 229484 230871 232116 232370 231318 229029 226029 223603 223152 224666 226497 227249
53904 227249 227248 227442 227607 226820 225390 225051 227010 230569 233966 236102 237298 238730 241118 243719 244859 243852
$$ packed form
54008A07077R56P66o88j869p38K054L218J109j651j279K383N882O447M533K176
53993A30376O09Q2O94K166L444L555K751K071J825J354L70k30N98K595M422N099
53977A61781M785M227L952M042M273M412M664N666P667R783J0714J0194R180Q530
53963B53870Q229Q041Q095Q512Q943Q911Q187O819N310M680N362O044M788J712
53949C47503r02j777k297l864n148l961j001N29r83l759n289n232m896n096n425
53934B98402n275m868n146o604q239q293o497m784m874n763n007k134O47J254
53920B32819j4j390j658p93N20J387J245K54j052k289l000k426m51J514J831P52
53904B27249jJ94J65p87j430l39J959L559L397K136J196J432K388K601J140j007
$$ plain form
53888 243852 242109 241784 243580 246482 249321 251701 253503 254607 255567 257843 262685 270093 279173 289165 299612
53873 299612 309803 318746 325988 332073 337792 343031 346811 348634 349343 350158 351234 351841 351848 352107 353173 354532
53857 354532 355639 357154 360399 365793 372271 378046 381835 383801 385725 389800 396677 404918 412632 419325
53843 419325 425803 432719 439679 445517 449129 450372 450407 450668 451235 450890 449080 446911 445530 444304 441508
53828 441508 436246 428927 420448 411888 404427 398376 392531 385530 377655 370339 364123 358143 351523 344235
53814 344235 336623 329062 322045 315654 308940 300781 291423 282351 274736 268890 264903 262492 260143 255895
53800 255895 249446 242359 235831 229429 222585 216046 210888 206987 203504 200350 198223 197424 197344 196955 195371
53785 195371 192222 187940 183540 179865 177088 174855 172566 169663 166286 163625 162803 163351 163733 163521 163875
$$ packed form
53888B43852j743l25J796K902K839K380J802J104R60K276M842P408R080R992J0447
53873B99612J0191Q943P242O085N719N239L780J823P09Q15J076O07PK59J066J359
53857C54532J107J515L245N394O478N775L789J966J924M075O877Q241P714O693
53843D19325O478O916O960N838L612J243L5K61N67l45j810k169j381j226k796
53828D41508n262p319q479q560p461o051n845p001p875p316o216n980o620p288
53814C44235p612p561p017o391o714q159r358r072p615n846l987k411k349m248
53800B55895o449p087o528o402o844o539n158l901l483l154k127p99q0l89j584
53785A95371l149m282m400l675k777k233k289k903l377k661q22N48L82k12L54
$$ plain form
53770 163875 165367 166567 165781 163373 161155 159969 158996 157359 155376 154067 154057 155193 156869 158616 160453
53755 160453 162545 164496 165527 165692 166353 168845 172918 177123 180514 183350 186256 189392 192626 196029 199826
53740 199826 203980 208103 211908 215653 219957 225039 230428 235777 241626 248708 256607 263952 270018 275320
53726 275320 280369 284804 288266 291276 294582 298251 302120 306367 310762 313965 314738 313605 312326 311814 311451
53711 311451 310250 307694 303494 297729 291596 286990 284706 283596 281984 279345 276172 272814 269261 265852
53697 265852 263384 262215 261678 260791 259536 259068 260349 262740 264433 264386 263283 262300 261510 260223 258403 256806
53681 256806 255728 254631 253201 252038 251862 252613 253611 254057 253037 249795 244713 239574 236186 234875 234692
53666 234692 234593 233818 231634 227843 223586 220685 219842 220135 220525 221030 221970 222835 222811 222107 221868 222719 224137 225433
$$ packed form
53770A63875J492J200p86k408k218j186r73j637j983j309j0J136J676J747J837
53755A60453K092J951J031J65O61K492M073M205L391K836K906L136L234L403L797
53740A99826M154M123L805L745M304N082N389N349N849P082P899P345O066N302
53726B75320N049M435L462L010L306L669L869M247M395L203P73j133j279n12l63
53711C11451j201k556m200n765o133m606k284j110j612k639l173l358l553l409
53697B65852k468j169n37q87j255m68J281K391J693m7j103r83p90j287j820j597
53681B56806j078j097j430j163j76P51R98M46j020l242n082n139l388j311j83
53666B34692r9p75k184l791m257k901q43K93L90N05R40Q65k4p04k39Q51J418J296
$$ plain form
53648 225433 226758 228778 231775 235390 239027 242152 244416 245890 247204 249170 252105 255614 259037 261991
53634 261991 264480 266707 269023 272052 276505 282521 289222 295317 300322 304892 309702 314401 318197 321264
53620 321264 324743 329197 333687 336846 338356 338837 338593 337267 334858 332469 331470 331921 332209 330539 326757
53605 326757 322411 319055 316967 315784 315668 316939 318849 319873 319494 318751 318549 318264 316712 313822 310661
53590 310661 308249 307040 307078 307932 308810 309388 310126 311110 311189 309277 306093 303496 302374 302335 303208 305286 307865
53573 307865 309078 307971 305680 303911 303240 303669 305736 309801 314755 318781 321426 323984 327729 332484 337139
53558 337139 341032 344492 348281 352684 357093 360581 363028 365635 370010 376638 384291 391012 395733 398997
53544 398997 402108 405604 408893 411487 414134 418082 423479 429304 434889 440623 446783 452621 457392 461809
$$ packed form
53648B25433J325K020K997L615L637L125K264J474J314J966K935L509L423K954
53634B61991K489K227K316L029M453O016O701O095N005M570M810M699L796L067
53620C21264L479M454M490L159J510M81k44j326k409k389r99M51K88j670l782
53605C26757m346l356k088j183j16J271J910J024l79p43k02k85j552k890l161
53590C10661k412j209L8Q54Q78N78P38R84P9j912l184k597j122l9Q73K078K579
53573C07865J213j107k291j769o71M29K067M065M954M026K645K558L745M755M655
53558C37139L893L460L789M403M409L488K447K607M375O628P653O721M721L264
53544C98997L111L496L289K594K647L948N397N825N585N734O160N838M771M417
$$ plain form
53530 461809 467477 474860 482577 488891 493412 496991 500324 503297 505734 508244 511710 516072 520330 523936
53516 523936 527485 531525 535375 537968 539482 541035 542819 543632 542607 540527 538991 538876 539924 541214 541660
53501 541660 540752 539387 539437 541922 545885 549421 551500 552522 553633 555944 559936 565112 570406 575206 579701
53486 579701 584146 588458 592809 597891 604007 610484 616609 622564 628785 634904 640185 644749 649619 655696
53472 655696 663283 672374 682651 693336 703755 714031 724718 735840 746916 757773 768734 780061
53460 780061 791825 804381 818313 833769 850383 867895 886403 905991 926696 948909 973021
53449 973021 998380 1023340 1047088 1071091 1097893 1128476 1161438 1194977 1228897 1264035 1300277
53438 1300277 1336310 1371479 1406787 1443409 1481145 1519312 1558404 1599318 1641253 1682054 1721090
$$ packed form
53530D61809N668P383P717O314M521L579L333K973K437K510L466M362M258L606
53516E23936L549M040L850K593J514J553J784Q13j025k080j536j15J048J290M46
53501E41660r08j365N0K485L963L536K079J022J111K311L992N176N294M800M495
53486E79701M445M312M351N082O116O477O125N955O221O119N281M564M870O077
53472F55696P587R091J0277J0685J0419J0276J0687J1122J1076J0857J0961J1327
53460G80061J1764J2556J3932J5456J6614J7512J8508J9588K0705K2213K4112
53449I73021K5359K4960K3748K4003K6802L0583L2962L3539L3920L5138L6242
53438A300277L6033L5169L5308L6622L7736L8167L9092M0914M1935M0801L9036
$$ plain form
53427 1721090 1760229 1801189 1843252 1884639 1925032 1965372 2005885 2045825 2084941 2123774 2162478
53416 2162478 2200523 2237880 2275545 2314415 2354192 2393705 2431911 2468364 2503038 2535915 2566748
53405 2566748 2595371 2622269 2648275 2673268 2695627 2713563 2726657 2735531 2740569 2741872 2740087 2736172
53393 2736172 2730262 2721632 2709881 2695377 2678611 2659948 2640093 2619769 2598591 2575141 2548602 2519686
53381 2519686 2489607 2458795 2427096 2394581 2361523 2327939 2293815 2259621 2226169 2194021 2163355
53370 2163355 2134353 2107445 2083008 2060759 2039507 2017958 1996220 1976307 1960485 1949058 1940310
53359 1940310 1932701 1926420 1922518 1921256 1921919 1923991 1927803 1933970 1942529 1952846 1964298 1976980 1991725
53346 1991725 2009388 2030306 2054495 2081973 2112404 2144710 2177824 2212046 2249026 2290001 2334463
$$ packed form
53427A721090L9139M0960M2063M1387M0393M0340M0513L9940L9116L8833L8704
53416B162478L8045L7357L7665L8870L9777L9513L8206L6453L4674L2877L0833
53405B566748K8623K6898K6006K4993K2359J7936J3094Q874N038J303j785l915
53393B736172n910q630j1751j4504j6766j8663j9855k0324k1178k3450k6539k8916
53381B519686l0079l0812l1699l2515l3058l3584l4124l4194l3452l2148l0666
53370B163355k9002k6908k4437k2249k1252k1549k1738j9913j5822j1427q748
53359A940310p609o281l902j262O63K072L812O167Q559J0317J1452J2682J4745
53346A991725J7663K0918K4189K7478L0431L2306L3114L4222L6980M0975M4462
$$ plain form
53335 2334463 2380964 2428841 2478583 2530740 2585324 2642526 2703279 2768265 2836418 2905247 2973141
53324 2973141 3041017 3111241 3185189 3262341 3341484 3421935 3503391 3585381 3667252 3748262 3827428
53313 3827428 3903800 3977190 4048044 4116283 4180795 4240450 4294933 4344133 4387501 4424707 4456205
53302 4456205 4482295 4502247 4515301 4521971 4523254 4518945 4507929 4489847 4465186 4433827 4395074 4349468
53290 4349468 4299368 4247018 4192746 4135458 4074235 4009182 3941448 3872775 3804324 3735685 3665706
53279 3665706 3594474 3523661 3454604 3386952 3319744 3252992 3187493 3123679 3061420 3000616 2941363
53268 2941363 2883828 2828474 2776204 2727715 2682876 2640987 2601494 2564173 2528941 2495853 2465079
53257 2465079 2436550 2409740 2383986 2358817 2333833 2308576 2282941 2257655 2234058 2213267 2195398
$$ packed form
53335B334463M6501M7877M9742N2157N4584N7202O0753O4986O8153O8829O7894
53324B973141O7876P0224P3948P7152P9143Q0451Q1456Q1990Q1871Q1010P9166
53313C827428P6372P3390P0854O8239O4512N9655N4483M9200M3368L7206L1498
53302D456205K6090J9952J3054O670J283m309j1016j8082k4661l1359l8753m5606
53290D349468n0100n2350n4272n7288o1223o5053o7734o8673o8451o8639o9979
53279C665706p1232p0813o9057o7652o7208o6752o5499o3814o2259o0804n9253
53268B941363n7535n5354n2270m8489m4839m1889l9493l7321l5232l3088l0774
53257B465079k8529k6810k5754k5169k4984k5257k5635k5286k3597k0791j7869
$$ plain form
53246 2195398 2179522 2164472 2149937 2136747 2126001 2118105 2112804 2109790 2108813 2109469 2111456 2114990 2120511
53233 2120511 2128032 2137089 2147177 2157978 2169542 2182653 2198506 2217519 2239022 2262671 2289274 2319250
53221 2319250 2351272 2383951 2418091 2455216 2494232 2531838 2566572 2600132 2633866 2666125 2694491
53210 2694491 2719004 2741577 2763274 2783571 2801325 2815048 2823030 2824752 2821918 2817006 2811085 2803714
53198 2803714 2794196 2781770 2765201 2743461 2716744 2686145 2652886 2618495 2584680 2551694 2517473
53187 2517473 2479934 2439857 2400096 2362088 2324463 2285231 2244132 2202644 2162511 2124464 2087741
53176 2087741 2050938 2013874 1978075 1944669 1912519 1879822 1847059 1816613 1789434 1763768 1737687
53165 1737687 1711389 1686365 1663493 1642753 1623813 1606032 1588619 1571587 1556022 1542747 1531223
$$ packed form
53246B195398j5876j5050j4535j3190j0746p896n301l014r77O56J987L534N521
53233B120511P521R057J0088J0801J1564J3111J5853J9013K1503K3649K6603K9976
53221B319250L2022L2679L4140L7125L9016L7606L4734L3560L3734L2259K8366
53210B694491K4513K2573K1697K0297J7754J3723P982J722k834m912n921p371
53198B803714r518j2426j6569k1740k6717l0599l3259l4391l3815l2986l4221
53187B517473l7539m0077l9761l8008l7625l9232m1099m1488m0133l8047l6723
53176B087741l6803l7064l5799l3406l2150l2697l2763l0446k7179k5666k6081
53165A737687k6298k5024k2872k0740j8940j7781j7413j7032j5565j3275j1524
$$ plain form
53154 1531223 1520344 1509820 1500146 1491535 1483475 1475070 1465393 1453819 1440568 1426743 1413410 1400733
53142 1400733 1388222 1375579 1362888 1350103 1336825 1322688 1307775 1292599 1277774 1263771 1250949
53131 1250949 1239540 1229177 1218415 1205327 1189103 1170879 1152510 1134726 1116915 1098325 1078728
53120 1078728 1058073 1036514 1015040 995209 977664 961372 944766 927268 909278 891111 872616
53109 872616 853803 835317 818011 802106 786923 771521 755629 739888 725131 711490 698317
53098 698317 684814 670660 656238 642403 629721 617697 605104 591463 577852 565835 555868 547303
53086 547303 539529 532316 525234 517714 509814 502177 495038 487929 480570 473361 466724 460550 454616 448968
53072 448968 443594 438280 433069 428284 423676 418237 411469 404498 399258 396630 395650 394326 391022 385499
$$ packed form
53154A531223j0879j0524r674q611q060q405r677j1574j3251j3825j3333j2677
53142A400733j2511j2643j2691j2785j3278j4137j4913j5176j4825j4003j2822
53131A250949j1409j0363j0762j3088j6224j8224j8369j7784j7811j8590j9597
53120A078728k0655k1559k1474j9831j7545j6292j6606j7498j7990j8167j8495
53109H72616j8813j8486j7306j5905j5183j5402j5892j5741j4757j3641j3173
53098F98317j3503j4154j4422j3835j2682j2024j2593j3641j3611j2017r967q565
53086E47303p774p213p082p520p900p637p139p109p359p209o637o174n934n648
53072D48968n374n314n211m785m608n439o768o971n240k628r80j324l304n523
$$ plain form
53058 385499 379138 373935 370864 369276 368041 366826 365869 364998 363601 361458 358889 355979 352208 347143 341111
53043 341111 334921 329092 323688 318904 315510 314362 315435 317575 319520 321078 322948 325473 328078 330132
53029 330132 331870 334048 336964 340215 343286 345966 348312 350546 352962 355609 358133 360173 361849 363479
53015 363479 364810 364948 363294 360272 356946 354018 351326 348170 344037 339238 334988 332559 331970 331613 329637
53000 329637 325765 321380 317622 313875 308579 301285 293345 286586 281779 278518 276073 274003 272157 270403
52986 270403 268388 265548 261632 257228 253406 250590 248164 245427 242532 240020 237786 235177 232001 228846
52972 228846 226299 224326 222525 220592 218427 216157 214259 213276 213217 213479 213582 213751 214491 215754 216794 216892
52956 216892 215992 214596 213136 211627 210002 208619 208096 208512 209076 208861 207798 206687 206304 206748 207565 208174
$$ packed form
53058C85499o361n203l071j588j235j215r57q71j397k143k569k910l771n065o032
53043C41111o190n829n404m784l394j148J073K140J945J558J870K525K605K054
53029C30132J738K178K916L251L071K680K346K234K416K647K524K040J676J630
53015C63479J331J38j654l022l326k928k692l156m133m799m250k429n89l57j976
53000C29637l872m385l758l747n296p294p940o759m807l261k445k070j846j754
52986B70403k015k840l916m404l822k816k426k737k895k512k234k609l176l155
52972B28846k547j973j801j933k165k270j898r83n9K62J03J69P40J263J040R8
52956B16892r00j396j460j509j625j383n23M16N64k15j063j111l83M44Q17O09
$$ plain form
52940 208174 208075 207009 205219 203630 203545 205782 209785 213674 215617 215392 214353 213723 213370 212450 210731 208713
52924 208713 206848 205351 204576 204794 205552 206003 206081 206702 208509 210970 213056 214295 214727 214351 213369 212854 214318
52907 214318 218285 223616 228533 232064 234290 235495 235679 234991 234123 233900 234670 236343 238729 241476 243996
52892 243996 246085 248407 251574 254812 256602 256958 258038 261798 267748 273840 278870 283088 286978 290655
52878 290655 294337 298388 302832 307660 313533 321153 329794 337401 342515 345366 346903 347635 347844 348012 348237
52863 348237 347673 345391 341678 338021 335844 335457 336017 336190 335062 332755 330187 328038 326039 323397 319772
52848 319772 315706 312065 309171 306596 303930 301530 300108 299602 299079 298062 297272 297482 298243 298514 298140 297779
52832 297779 297695 297627 297712 298465 299743 300745 301112 301076 300456 298710 296367 295247 296532 299459 302501 304961 306731
$$ packed form
52940B08174r9j066j790j589q5K237M003L889J943k25j039o30l53r20j719k018
52924B08713j865j497p75K18P58M51P8O21J807K461K086J239M32l76r82n15J464
52907B14318L967N331M917L531K226J205J84o88q68k23P70J673K386K747K520
52892B43996K089K322L167L238J790L56J080L760N950O092N030M218L890L677
52878B90655L682M051M444M828N873P620Q641P607N114K851J537P32K09J68K25
52863C48237n64k282l713l657k177l87N60J73j128k307k568k149j999k642l625
52848C19772m066l641k894k575k666k400j422n06n23j017p90K10P61K71l74l61
52832B97779q4o8Q5P53J278J002L67l6o20j746k343j120J285K927L042K460J770
$$ plain form
52815 306731 307424 306823 305703 305172 305376 305667 305877 306544 307791 308796 308836 308473 309107 311150 313081 312871 310408
52798 310408 307817 307018 307762 308756 309895 312076 315302 318511 321221 323708 325467 325294 323543 322565 323921
52783 323921 326624 329223 332122 336356 341279 345248 347970 350477 353173 355413 356872 357892 358491 358216 357164
52768 357164 356213 356226 357722 361000 365611 369927 372285 372551 371814 370900 370142 370192 371716 374229 376370 377470
52752 377470 377984 378452 379008 379820 380902 381489 380673 378686 376471 374036 370446 365535 360393 355941 352221 349235
52736 349235 347095 345029 341609 336564 331122 326124 321170 316099 311696 307986 303419 297126 290736 286422
52722 286422 284091 282036 279559 277231 275062 272187 268364 264307 260504 256942 254022 252347 251415 249858
52708 249858 247398 245427 245153 246028 246453 245174 241623 235957 229533 224620 222680 223102 224047 224139 222968 220670
$$ packed form
52815C06731O93o01j120n31K04K91K10O67J247J005M0l63O34K043J931k10k463
52798C10408k591p99P44R94J139K181L226L209K710K487J759j73j751r78J356
52783C23921K703K599K899M234M923L969K722K507K696K240J459J020N99k75j052
52768C57164r51J3J496L278M611M316K358K66p37r14p58N0J524K513K141J100
52752C77470N14M68N56Q12J082N87q16j987k215k435l590m911n142m452l720k986
52736C49235k140k066l420n045n442m998m954n071m403l710m567o293o390m314
52722B86422k331k055k477k328k169k875l823m057l803l562k920j675r32j557
52708B49858k460j971k74Q75M25j279l551n666o424m913j940M22R45R2j171k298
$$ plain form
52692 220670 217812 215296 213548 211846 209084 205134 200922 197225 193992 190821 187504 183926 179933 175667
52678 175667 171729 168753 166913 165939 165434 165024 164367 163195 161373 158989 156484 154518 153402 152640 151423
52663 151423 149587 147754 146453 145587 144847 144130 143312 142261 141568 142499 145373 148474 149672 148941 148059 147772
52647 147772 146630 143305 138854 135609 134537 134815 135531 136492 137361 137254 135749 133640 132178 131849 132174 132457
52631 132457 132583 133242 135340 138876 142447 144287 143950 142662 142000 142552 143849 145124 145911 146267 146710 147865
52615 147865 150189 154033 159605 166373 172794 177445 180531 183628 187744 192313 196319 199530 202131 203817
52601 203817 204125 203300 202121 201083 200362 200339 201357 202900 203626 202468 199461 195513 191686 188618 186248 184075
52585 184075 181841 179811 178110 176184 173512 170556 168278 166794 165350 163678 162428 161948 161564 160625 159468
$$ packed form
52692B20670k858k516j748j702k762l950m212l697l233l171l317l578l993m266
52678A75667l938k976j840r74n05m10o57j172j822k384k505j966j116p62j217
52663A51423j836j833j301q66p40p17q18j051o93R31K874L101J198p31q82k87
52647A47772j142l325m451l245j072K78P16R61Q69j07j505k109j462l29L25K83
52631A32457J26O59K098L536L571J840l37j288o62N52J297J275P87L56M43J155
52615A47865K324L844N572O768O421M651L086L097M116M569M006L211K601J686
52601B03817L08q25j179j038p21k3J018J543P26j158l007l948l827l068k370k173
52585A84075k234k030j701j926k672k956k278j484j444j672j250m80l84r39j157
$$ plain form
52570 159468 158608 157595 155644 152961 150430 148200 145687 142982 141066 140214 139267 137242 134847 133468 133169
52555 133169 132835 132076 131820 132717 134045 134857 135505 137138 139948 142788 144512 145002 144677 143785 142669 142141 142799
52538 142799 144125 144933 144751 144125 143480 142471 140902 139652 139974 142149 145409 148894 151960 153850 154036 153011
52522 153011 151885 151042 150135 149684 151439 156216 162260 166922 169459 171038 172474 173493 174267 175997 179166
52507 179166 182335 183655 182907 181252 179489 177573 175655 174582 175107 177103 179757 182322 184590 186830 189277
52492 189277 191639 193221 193633 193153 192247 191117 190022 189616 190338 191611 192299 192144 192164 193397 195618 197713
52476 197713 199118 200553 203250 207689 213038 217657 220107 220004 218278 216659 216618 218505 221630 225074 228295
52461 228295 231031 233068 234395 235375 236363 237318 237972 238182 237808 236553 234421 232155 230641 229878 229119 228046
$$ packed form
52570A59468q60j013j951k683k531k230k513k705j916q52r47k025k395j379k99
52555A33169l34p59k56Q97J328Q12O48J633K810K840J724M90l25q92j116n28O58
52538A42799J326Q08j82o26o45j009j569j250L22K175L260L485L066J890J86j025
52522A53011j126q43r07m51J755M777O044M662K537J579J436J019P74J730L169
52507A79166L169J320p48j655j763j916j918j073N25J996K654K565K268K240K447
52492A89277K362J582M12m80r06j130j095m06P22J273O88j55K0J233K221K095
52476A97713J405J435K697M439N349M619K450j03j726j619m1J887L125L444L221
52461B28295K736K037J327R80R88R55O54K10l74j255k132k266j514p63p59j073
$$ plain form
52445 228046 227284 227650 229340 231869 234387 236102 236981 237991 239920 241982 242428 240670 237806 234821 231408
52430 231408 227347 224031 223433 225910 229899 233605 236269 237980 239046 239632 239646 238984 238035 237616 238136 239311
52414 239311 240872 242919 245125 246430 246317 245747 245969 246925 247725 248245 249133 250592 252257 254079 256197 257962
52398 257962 258326 257383 256468 256549 257501 259172 261916 265437 268193 268933 268243 267661 267607 267127 265686 264382 264923
52381 264923 267687 271173 273367 273518 272515 271819 272349 274160 276612 278633 279380 278989 278331 277874 277370 276920
52365 276920 277449 279407 281684 282819 282803 282623 282339 280846 277648 273939 271678 272097 274961 278533 280509 279986
52349 279986 278644 279169 282436 286906 290641 292949 294070 294404 294456 294725 295236 295760 296584 298421 301451 305063
52333 305063 308630 311890 314702 317209 320060 323575 326881 328911 330095 331826 334382 336769 338650 340843
$$ packed form
52445B28046p62L66J690K529K518J715Q79J010J929K062M46j758k864k985l413
52430B31408m061l316n98K477L989L706K664J711J066N86J4o62r49m19N20J175
52414B39311J561K047K206J305j13n70K22R56Q00N20Q88J459J665J822K118J765
52398B57962L64r43r15Q1R52J671K744L521K756P40o90n82n4m80j441j304N41
52381B64923K764L486K194J51j003o96N30J811K452K021P47l91o58m57n04m50
52365B76920N29J958K277J135j6j80k84j493l198l709k261M19K864L572J976n23
52349B79986j342N25L267M470L735K308J121L34N2K69N11N24Q24J837L030L612
52333C05063L567L260K812K507K851L515L306K030J184J731K556K387J881K193
$$ [...]
##END NTUPLES=NMR SPECTRUM
##END=
