
##TITLE=AC1109_Colombia_5835779_yvp2IzYgP9
##JCAMPDX= 6.0         $$ Bruker NMR JCAMP-DX V2.0
##DATA TYPE= NMR SPECTRUM
##DATA CLASS= NTUPLES
##ORIGIN= BRUKER
##OWNER= Administrator
$$ 1.72 TOPSPIN		Version 2.1
$$ 2012-04-16 19:08:14.015 -0500  Administrator@TOPSPIN
$$ Compression mode = diff/dup
##.OBSERVE FREQUENCY= 400.13188235
##.OBSERVE NUCLEUS= ^1H
##.ACQUISITION MODE= SIMULTANEOUS (DQD)
##.ACQUISITION SCHEME= undefined
##.AVERAGES= 8
##.DIGITISER RES= 22
##SPECTROMETER/DATA SYSTEM= spect
##.PULSE SEQUENCE= zg30
##.SOLVENT NAME= COFFEE_meoh
##.SHIFT REFERENCE= INTERNAL, COFFEE_meoh, 1, 14.98061
##AUDIT TRAIL= $$ (NUMBER, WHEN, WHO, WHERE, PROCESS, VERSION, WHAT)
$$ ##TITLE= Audit trail, TOPSPIN		Version 2.1
$$ ##JCAMPDX= 5.01
$$ ##ORIGIN= Bruker BioSpin GmbH
$$ ##OWNER= Administrator
$$ $$ C:\Bruker\TOPSPIN/data/COFFEE/nmr/AC1109_Colombia_5835779_yvp2IzYgP9/30/pdata/1/auditp.txt
$$ ##AUDIT TRAIL=  $$ (NUMBER, WHEN, WHO, WHERE, PROCESS, VERSION, WHAT)
(   1,<2012-04-15 15:20:28.296 -0500>,<Administrator>,<TOPSPIN>,<go>,<TOPSPIN 2.1>,
      <created by zg
	started at 2012-04-15 15:19:21.343 -0500,
	POWCHK enabled, PULCHK disabled,
       configuration hash MD5:
       1A 1E CE 29 27 FD 77 03 67 4E F0 E3 C4 B2 CB 90
       data hash MD5: 64K
       26 1F 5B B5 25 1A B2 90 58 9B 87 01 86 1B 15 92>)
(   2,<2012-04-15 15:20:31.093 -0500>,<Administrator>,<TOPSPIN>,<proc1d>,<TOPSPIN 2.1>,
      <Start of raw data processing
       efp LB = 0 FT_mod = 6 PKNL = 1 PHC0 = 0 PHC1 = 0 SI = 32K 
       data hash MD5: 32K
       9E 47 04 84 A2 8E DE 3B BB C9 98 D4 26 82 AD 55>)
(   3,<2012-04-15 15:20:31.453 -0500>,<Administrator>,<TOPSPIN>,<proc1d>,<TOPSPIN 2.1>,
      <pk PHC0 = 212.2723 PHC1 = 0 
       data hash MD5: 32K
       CF AE A0 AC 89 15 E8 10 B0 BB F9 3C E8 B4 C8 36>)
(   4,<2012-04-15 15:20:31.531 -0500>,<Administrator>,<TOPSPIN>,<proc1d>,<TOPSPIN 2.1>,
      <abs ABSG = 1 
       data hash MD5: 32K
       B3 0D 8C 3A 9D 78 F1 E5 DE 8E B6 D7 D1 09 F3 5F>)
(   5,<2012-04-15 15:20:31.562 -0500>,<Administrator>,<TOPSPIN>,<proc1d>,<TOPSPIN 2.1>,
      <abs ABSG = 2 
       data hash MD5: 32K
       29 F9 C3 97 ED 61 CE A6 65 4A 61 2B 56 B2 1E 81>)
(   6,<2012-04-15 15:20:31.593 -0500>,<Administrator>,<TOPSPIN>,<proc1d>,<TOPSPIN 2.1>,
      <abs ABSG = 3 
       data hash MD5: 32K
       55 2A A4 18 81 8C FA D1 72 D4 91 58 F1 77 DF 38>)
(   7,<2012-04-15 15:20:31.625 -0500>,<Administrator>,<TOPSPIN>,<proc1d>,<TOPSPIN 2.1>,
      <abs ABSG = 4 
       data hash MD5: 32K
       6B 2C F8 9B 03 00 D5 81 D8 AB 93 DC D7 24 CC 61>)
(   8,<2012-04-15 15:20:31.656 -0500>,<Administrator>,<TOPSPIN>,<proc1d>,<TOPSPIN 2.1>,
      <abs ABSG = 5 
       data hash MD5: 32K
       87 87 10 0B 2C F5 15 4D 0F 7B 24 11 8E 3F AB 13>)
(   9,<2012-04-15 15:20:35.609 -0500>,<Administrator>,<TOPSPIN>,<audit>,<TOPSPIN 2.1>,
      <user comment:
       ICON-NMR User ID: COFFEE
       data hash MD5: 32K
       87 87 10 0B 2C F5 15 4D 0F 7B 24 11 8E 3F AB 13>)
$$ ##END=
$$ 
$$ [...]
##$TP= (0..7)
150 150 150 150 150 150 150 150
##$TP07= 0
##$TPNAME0= <>
##$TPNAME1= <>
##$TPNAME2= <>
##$TPNAME3= <>
##$TPNAME4= <>
##$TPNAME5= <>
##$TPNAME6= <>
##$TPNAME7= <>
##$TPOAL= (0..7)
0.5 0.5 0.5 0.5 0.5 0.5 0.5 0.5
##$TPOFFS= (0..7)
0 0 0 0 0 0 0 0
##$TUNHIN= 0
##$TUNHOUT= 0
##$TUNXOUT= 0
##$USERA1= <user>
##$USERA2= <user>
##$USERA3= <user>
##$USERA4= <user>
##$USERA5= <user>
##$V9= 5
##$VALIST= <valist>
##$VCLIST= <CCCCCCCCCCCCCCC>
##$VD= 0
##$VDLIST= <DDDDDDDDDDDDDDD>
##$VPLIST= <PPPPPPPPPPPPPPP>
##$VTLIST= <TTTTTTTTTTTTTTT>
##$WBST= 2048
##$WBSW= 25
##$XGAIN= (0..3)
0 0 0 0
##$XL= 0
##$YL= 0
##$YMAX_a= 505584
##$YMIN_a= -614991
##$ZGOPTNS= <>
##$ZL1= 120
##$ZL2= 120
##$ZL3= 120
##$ZL4= 120
##$ABSF1= 14.98061
##$ABSF2= -5.57192
##$ABSG= 5
##$ABSL= 3
##$ALPHA= 0
##$AQORDER= 0
##$ASSFAC= 0
##$ASSFACI= 0
##$ASSFACX= 0
##$ASSWID= 0
##$AUNMP= <proc_prof1d_extract_pilot.lims>
##$AXLEFT= 0
##$AXNAME= <>
##$AXNUC= <1H>
##$AXRIGHT= 0
##$AXTYPE= 0
##$AXUNIT= <>
##$AZFE= 0.1
##$AZFW= 0.1
##$BCFW= 0
##$BC_mod= 0
##$BYTORDP= 0
##$COROFFS= 0
##$CY= 15
##$DATMOD= 1
##$DC= 0
##$DFILT= <>
##$DTYPP= 0
##$F1P= 0
##$F2P= 0
##$FCOR= 0.5
##$FTSIZE= 32768
##$FT_mod= 6
##$GAMMA= 0
##$GB= 0
##$INTBC= 1
##$INTSCL= 1
##$ISEN= 128
##$LB= 0
##$LEV0= 0
##$LPBIN= 0
##$MAXI= 10000
##$MC2= 0
##$MEAN= 0
##$ME_mod= 0
##$MI= 0
##$NCOEF= 0
##$NC_proc= -8
##$NLEV= 6
##$NOISF1= 0
##$NOISF2= 0
##$NSP= 0
##$NTH_PI= 0
##$NZP= 0
##$OFFSET= 14.98061
##$PC= 1
##$PHC0= 212.2723
##$PHC1= 0
##$PH_mod= 1
##$PKNL= yes
##$PPARMOD= 0
##$PPDIAG= 0
##$PPIPTYP= 0
##$PPMPNUM= 2147483647
##$PPRESOL= 1
##$PSCAL= 4
##$PSIGN= 0
##$PYNMP= <proc.py>
##$REVERSE= no
##$SF= 400.13
##$SI= 32768
##$SIGF1= 0
##$SIGF2= 0
##$SINO= 400
##$SIOLD= 32768
##$SPECTYP= <>
##$SREGLST= <1H.CDCl3>
##$SSB= 0
##$STSI= 32768
##$STSR= 0
##$SW_p= 8223.68421052632
##$SYMM= 0
##$S_DEV= 0
##$TDeff= 65536
##$TDoff= 0
##$TI= <>
##$TILT= no
##$TM1= 0
##$TM2= 0
##$TOPLEV= 0
##$USERP1= <user>
##$USERP2= <user>
##$USERP3= <user>
##$USERP4= <user>
##$USERP5= <user>
##$WDW= 1
##$XDIM= 32768
##$YMAX_p= 464565268
##$YMIN_p= -785881
##$CURPLOT= <Network HP LaserJet P1505>
##$CURPRIN= <$Network HP LaserJet P1505>
##$DFORMAT= <normdp>
##$LAYOUT= <+/1D_H.xwp>
##$LFORMAT= <normlp>
##$PFORMAT= <normpl>
##$SURQMSG= 1
$$ End of Bruker specific parameters
$$ ---------------------------------
##NTUPLES= NMR SPECTRUM
##VAR_NAME=  FREQUENCY,     SPECTRUM/REAL,   SPECTRUM/IMAG
##SYMBOL=    X,             R,               I
##VAR_TYPE=  INDEPENDENT,   DEPENDENT,       DEPENDENT
##VAR_FORM=  AFFN,          ASDF,            ASDF
##VAR_DIM=   32768,         32768,           32768
##UNITS=     HZ,            ARBITRARY UNITS, ARBITRARY UNITS
##FACTOR=    0.250966925370066, 1,           1
##FIRST=     8223.43324360095, -114108,      -49469
##LAST=      0,             -221482,         -38483
##MIN=       0,             -785881,         0
##MAX=       8223.43324360095, 464565268,    0
$$ Real data points
##PAGE= N=1
##DATA TABLE= (X++(R..R)), XYDATA
$$ [...]
$$ plain form
19497 41751 30985 -346290 -225933 119950 -82866 12253 -100994 52736 -429696 -79604 -104688
19486 -104688 -128059 -60313 77992 101227 -119296 -208730 -49940 174336 -196518 -412395 215997
19474 -46631 -86263 -202816 -187445 87297 -20154 -83603 -313763 -1132 -212422 76866 155882
19463 155882 -96732 95546 -241485 -32028 -8028 -102213 -352980 -239055 310171 74214 218189
19452 218189 -75729 -184669 -87099 -238890 39666 -72188 -229124 -332922 -251249 -317707 58931
19440 -105979 -75664 -101101 -4371 -106392 -58444 -302790 -324413 -150407 100842 83042 -290651
19428 -24622 9752 159338 -338642 184559 34165 -324299 -32259 114185 64754 -155720 -180428
19417 -180428 168910 -131863 -45329 -203735 92341 -133347 -324051 -279119 -126492 -26407
$$ packed form
19497D1751j0766c46290J20357A19950h2866A2253a00994E2736d29696g9604k5084
19486a04688k3371f0313G7992K3235a19296q9434d9940A74336a96518k15877B15997
19474d6631l9632j16553J5371H7297b0154o3449k30160a132k11290G6866P9016
19463A55882i6732I5546b41485c2028h028r4185k50767J13925C10171G4214J43975
19452B18189g5729j08940h7099j51791C9666g2188j56936j03798Q1673o6458E8931
19440a05979L0315k5437d371j02021M7948k44346k1623a50407A00842j7800b90651
19428b4622I752J49586c38642A84559C4165c24299c2259A14185m9431a55720k4708
19417a80428A68910a31863d5329j58406I2341a33347j90704M4932a26492b6407
$$ plain form
19406 -156274 -444579 162424 -317120 -240111 -118989 20836 88212 -227171 16281 75709
19396 75709 -154106 -211549 45283 -131395 35880 -137 -327746 171358 -128912 -155332 -78893
19385 -78893 -362156 18324 -190845 -185653 28597 59294 -94437 -162861 -168051 -9579 -319135 41821
19372 -416389 36173 193774 68296 -14557 2911 -51631 73317 -156166 -319536 -140553 70408
19360 -168998 -212460 -77682 64217 76663 -130053 -132706 339184 43295 12306 198702 117213
19349 117213 158113 -9275 -180742 112387 195392 -49481 -235199 38464 -38292 -59259 -305579
19338 -305579 241578 114574 -266942 -167249 -122874 152518 -353043 130328 103090 -77892
19327 -214433 216416 -265800 146120 118298 -74751 -118607 -104694 323139 87834 -149025
$$ packed form
19406a56274k88305A62424c17120P7009a18989B0836O7376b27171A6281N9428
19396G5709a54106n7443D5283a31395C5880a37l27609A71358a28912k6420P6439
19385g8893k83263A8324a90845N192B8597L0697i4437o8424n190i579l09556D1821
19372d16389C6173J57601F8296a4557B911e1631G3317a56166j63370a40553G0408
19360a68998m3462g7682F4217J2446a30053k653C39184D3295A2306J86396q1489
19349A17213M0900i275j71467A12387Q3005d9481j85718C8464c8292k0967k46320
19338c05579B41578A14574b66942R9693M4375A52518c53043A30328k7238g7892
19327b14433B16416b65800A46120k7822g4751m3856J3913C23139H7834a49025
$$ plain form
19316 100133 18167 91000 -95950 -208202 -130631 -13355 -249495 -294031 -35009 101754 -286027
19304 -39988 -49955 -5500 -136334 -199260 -84033 -67174 -331254 -309034 144920 -388861 234908
19292 95644 34039 -88457 -93491 -71839 237768 -110413 -164750 -59925 -348627 64604 -202490
19280 -79292 -332762 68799 -221939 -395224 139515 184289 -134616 -340821 75057 -248991
19269 188048 -121975 216480 -11854 -169109 -308017 132652 -199100 -162274 247084 -125464
19258 -260845 163960 -152052 -170222 -35574 -25759 -5814 -40902 70035 27176 202671 13392
19246 -18443 242483 -252122 -276938 -156574 -215505 65541 -122255 -190825 126943 -144272
19235 -472211 -322335 -199741 -128072 -244780 104905 -4423 -229819 -87481 -77937 81077 -297867
$$ packed form
19316A00133A8167P2833i5950j12252P7571a3355k36140m4536c5009A01754b86027
19304c9988r967e500j30834o2926h4033J6859k64080K2220A44920c88861B34908
19292I5644C4039h8457n034K1652B37768a10413n4337e9925k88702F4604b02490
19280g9292k53470F8799b21939j73285A39515M4774a34616k06205G5057b48991
19269A88048a21975B16480a1854j57255j38908A32652a99100L6826B47084a25464
19258b60845A63960a52052j8170c5574R815e814l5088G0035B7176J75495A3392
19246a8443B42483b52122k4816J20364n8931F5541a22255o8570A26943a44272
19235d72211J49876J22594P1669j16708A04905d423k25396h7481R544H1077b97867
$$ plain form
19223 84223 41446 -77915 54175 81730 93648 -264902 -65014 13558 39852 -293981 -280902
19212 -280902 2039 379924 -104571 -136233 -130034 -176207 -39712 -17519 106254 135295 168836
19201 168836 -245953 263024 -148360 -117060 -482180 -30211 -33625 -147342 -104075 -231684
19191 -231684 -46930 -113373 -306034 -9365 -106962 -121303 36234 -48551 -299548 -596875 224176
19179 -32209 163784 -157672 -6846 -139075 90487 -170184 19605 -284171 -13058 -3428 -85280
19168 -85280 -45089 45847 -2323 -68044 13458 -134541 111662 -194357 -168166 -260330 -91919
19156 -86893 44610 55384 58264 -48294 -138591 -60021 200923 -228630 81928 -27580 43054
19144 -299349 -121727 123036 -157467 -85683 152367 -171355 177302 -94572 -164860 -57172
$$ packed form
19223H4223D1446g7915E4175K7555J1918b64902f5014A3558K6294b93981J3079
19212b80902B039L77885a04571l1662O199m6173c9712a7519A06254K9041L3541
19201A68836b45953B63024a48360L1300l65120c0211l414j13717M3267j27609
19191b31684d6930o6443j92661i365r7597j4341C6234d8551k50997k97327B24176
19179c2209A63784a57672f846j32229I0487a70184A9605b84171a3058c428q1852
19168h5280M0191D5847b323o5721A3458a34541A11662a94357K6191r2164i1919
19156h6893D4610J0774K880d8294r0297f0021B00923b28630H1928b7580D3054
19144b99349a21727A23036a57467P1784A52367a71355A77302i4572p0288e7172
$$ plain form
19133 196500 -184535 -272147 -76051 -229380 -116584 -295200 206498 12775 -99740 -7268 -36520
19122 -36520 -76650 159014 2746 -161778 62662 233512 -88167 -39611 157419 142307 -537089
19110 -320874 -56563 -95916 139130 420 -316600 -41970 -18530 -40087 -123731 -412384 208634
19098 65380 39450 -216207 -13813 -1648 -152288 -14574 205966 -294470 -33667 -9134 -33318
19087 -33318 144600 101595 -168251 97104 -293312 -51758 99154 -193553 -87398 -169223 -164502
19076 -164502 -147397 16476 -108648 -335427 101311 26832 -145747 60996 -38544 -34561 137229
19064 -37326 248311 -297721 -116846 -12716 40240 172847 17883 354713 -103801 -13243
19053 12310 -305493 -78753 -135001 152481 -87415 464794 216173 81347 -138906 -16009 -273426
$$ packed form
19133A96500a84535q7612g6051j53329J12796j78616B06498A2775i9740g268k9252
19122c6520m0130A59014B746a61778F2662J70850h8167c9611A57419j5112e37089
19110c20874e6563l9353A39130D20c16600d1970a8530k1557q3644k88653B08634
19098F5380k5930b16207a3813a648j50640a4574B05966b94470c3667i134k4184
19087c3318A44600m3005a68251I7104b93312e1758I9154a93553h7398q1825M721
19076a64502J7105A6476a08648k26779A01311B6832a45747F0996c8544L983A37229
19064c7326B48311b97721a16846a2716D0240J32607A7883L36830a03801a3243
19053A2310c05493g8753n6248A52481h7415D64794B16173H1347a38906a6009k57417
$$ plain form
19042 -273426 -40734 -173566 -234572 -273609 -129443 -80757 78915 -222001 170960 -156975
19031 -108201 -340250 -82214 133678 37147 160108 -4931 228192 188457 -37442 188279 192600
19020 192600 -67942 63322 14205 37405 69195 -76873 -155948 77224 -90448 -153187 26182
19008 31435 -161026 187333 -246970 -312609 -61673 53858 246516 118195 -87908 125950
18997 -88585 158909 -416571 -177369 -93748 189283 -194086 -103830 -55940 -84221 407399
18986 76930 -61744 -202917 51877 184038 300825 42826 -90814 -240472 -267504 -589 164020
18974 -347150 8182 -275829 -196536 -92394 -176200 252827 134470 157230 212985 68688 50806
18963 50806 37806 -302802 -376314 -105367 204710 166110 17019 77448 46436 110474 340353
$$ packed form
19042b73426d0734j32832o1006l9037a29443M8686G8915b22001A70960a56975
19031a08201k32049h2214A33678C7147J22961d931B28192l9735c7442A88279M321
19020A92600f7942F3322A4205K3200L1790g6873p9075G7224i0448o2739B6182
19008C1435a61026A87333b46970o5639f1673E3858J92658A18195h7908A25950
18997h8585A58909d16571a77369Q3621A89283a94086R0256M7890k8281D07399
18986G6930f1744j41173E1877J32161J16787D2826i0814j49658k7032e89A64020
18974c47150H182b75829P9293i2394q3806B52827j18357K2760N5755F8688j7882
18963E0806j3000c02802p3512a05367B04710l8600A7019O0429l1012O4038K29879
$$ plain form
18952 340353 -191531 75452 -161927 -209509 384607 -354943 -106922 110727 -78090 -458530
18942 -458530 -6272 -185831 -56248 -71690 33817 48645 -272778 62076 -83330 23888 -126363
18930 -80952 101786 210090 -84312 90115 -287222 -287945 -442782 67245 373571 -103598 -83092
18919 -83092 -58105 -148920 -15070 158450 -157150 -120728 317176 -255156 -269635 42441 85969
18908 85969 109284 270819 -80292 -301482 -47605 -175704 -13746 26705 82038 63595 174422
18897 174422 -25236 -45211 378181 236300 264774 189481 15327 290442 -210005 47752 4094
18885 43114 171024 51197 -7221 44505 -715190 89205 -337370 14093 30325 -216029 -117687
18874 -117687 -335614 -193200 98968 -174750 -204993 -233140 95496 -258637 -181317 67172 44139
$$ packed form
18952C40353a91531G5452a61927m7582C84607c54943a06922A10727g8090l80440
18942d58530f272j79559e6248j5442C3817J4828b72778F2076h3330B3888a26363
18930h0952A01786J08304h4312I0115b87222p23j54837F7245L06326a03598K0506
18919h3092K4987r0815a5070A58450a57150L6422C17176b55156j4479D2441M3528
18908H5969K3315J61535h0292k21190d7605j28099a3746B6705N5333j8443J10827
18897A74422b5236j9975C78181j41881K8474p5293A5327K75115b10005D7752D094
18885D3114J27910E1197g221D4505g15190H9205c37370A4093J6232b16029R8342
18874a17687k17927J42414I8968a74750l0243k8147I5496b58637P7320F7172k3033
$$ plain form
18863 44139 -140222 -184577 -16037 253094 -51356 -38190 -149343 103352 232153 -25356 224271
18851 -453761 -208690 -76767 -75162 23861 -176821 -134932 -170233 -40404 -193267 32652 -127192
18839 -66842 105452 67428 -71839 -87180 20082 194035 -247394 -335639 303677 51754 -24695
18827 153104 8674 -272267 -191960 -168050 174381 -152352 -167467 41842 -304736 -54424 -107085
18816 -107085 -91607 -178899 276718 77190 -176107 -90572 -22262 210239 -310348 264165
18805 -65677 53917 -137606 76985 -98707 -145955 57634 -190070 -105961 -32722 358567 -57834
18793 90675 63825 122346 -69076 22705 102556 -162717 -106382 -166812 -337979 -8849 -233812
18782 -233812 371748 137343 -258398 -266285 403884 -94098 -30917 -141047 -8941 12107 162167
$$ packed form
18863D4139a40222m4355a6037B53094e1356J3166j11153A03352J28801b5356B24271
18851d53761b08690g6767J605B3861a76821M1889l5301d0404j52863C2652a27192
18839f6842A05452l8024g1839j5341B0082J73953b47394q8245C03677E1754b4695
18827A53104H674b72267Q0307K3910A74381a52352j5115D1842c04736e4424n2661
18816a07085J5478q7292B76718G7190a76107Q5535b2262B10239c10348B64165
18805f5677E3917a37606G6985i8707m7248E7634a90070Q4109c2722C58567e7834
18793I0675k6850N8521f9076B2705P9851a62717N6335o0430j71167h849k24963
18782b33812C71748A37343b58398p887D03884i4098c0917j10130h941A2107J50060
$$ plain form
18771 162167 -24572 -70582 -43689 -193922 216982 -171372 34298 -126739 -311150 -401973
18761 -401973 -20829 62973 101767 -86182 -320960 -27407 -241137 305334 40448 -112557 -346111
18750 -346111 -126646 -42493 -9725 -199256 -185307 -256315 -67308 -10553 45900 -170862 -58793
18738 59458 -50818 -230621 -161166 -177938 -29254 -91028 -220314 197490 45594 8577 50312
18727 50312 -177307 329614 -30259 -19765 191562 -183717 -312275 -15956 -58173 -139778 39253
18715 -265356 -89423 -333828 -66781 228062 -46616 100262 -4414 99648 152599 -1340 -126901
18704 -126901 153625 159060 376989 71102 -215001 -330689 -7349 231041 -253765 -96449 -12664
18692 -205892 -103358 -194655 -186687 -134867 -434318 -179187 105372 117976 278287 32157 -83710
$$ packed form
18771A62167b4572m6010K6893j50233B16982a71372C4298a26739j84411r0823
18761d01973b0829F2973L8794h6182k34778b7407k13730C05334D0448a12557k33554
18750c46111a26646d2493i725j89531J3949p1008f7308a0553D5900a70862e8793
18738E9458e0818j79803O9455j6772b9254o1774j29286A97490D5594H577M1735
18727E0312a77307C29614c0259J0494A91562a83717j28558a5956m2217q1605C9253
18715b65356h9423k44405f6781B28062d6616A00262d414I9648N2951a340j25561
18704a26901A53625N435K17929G1102b15001j15688g349B31041b53765i6449a2664
18692b05892J02534r1297P968N1820k99451a79187A05372J2604J60311C2157h3710
$$ plain form
18680 168507 45225 290098 -80529 -192471 285424 -79331 -231158 -203435 -65925 101547
18669 -190111 -429805 98114 172009 119794 132897 14427 188872 55684 -316489 6222 -81652
18657 -14314 -56305 -75900 -230546 -488006 -44396 65045 -174266 132143 101665 103756 66322
18646 66322 -36975 -157937 275067 -119896 -103719 -20832 -354044 83151 -104306 -61037 -78485
18635 -78485 -86995 -111894 -180738 -371664 -109810 -123086 -30531 -185378 -256804 -103557 117832
18623 -378243 -224075 -297107 -104247 29935 -40946 57377 139629 16598 -176405 -163344 -66325
18611 -353223 51031 -182292 -9077 -80354 -23633 -128896 -117320 -115085 297602 141530 -6249
18599 -70392 -629087 -135475 -110458 -124215 10136 -152419 -142684 -8881 435343 -27994 260237
$$ packed form
18680A68507D5225K44873h0529j11942B85424g9331j51827K7723f5925A01547
18669a90111k39694I8114P3895n2215J3103A4427J74445E5684c16489F222h1652
18657a4314m1991j9595j54646k57460d4396F5045a74266A32143l0478K091l7434
18646F6322c6975j20962B75067a19896J6177b0832l33212H3151a04306M3269j7448
18635g8485q510k4899o8844j90926a09810j3276c0531j54847p1426a03557A17832
18623c78243J54168p3032a04247B9935d0946E7377Q2252A6598a76405J3061f6325
18611c53223E1031a82292i077p1277b3633j05263J1576K235B97602A41530f249
18599g0392n58695a35475K5017j3757A0136a52419R735h881D35343b7994B60237
$$ plain form
18587 103756 -284130 46742 -261896 -39098 -438832 -66288 -96353 247245 51198 54526 236747
18576 236747 221385 -33662 -149618 -141647 -172686 -442366 -74999 -435691 144034 -33630 -151878
18565 -151878 -165945 -140580 126680 -230483 -25404 -22272 82739 37531 -13245 -329227 -157808
18553 -206285 -276267 -383121 292022 243116 -349920 -167148 20991 -4180 255560 -178063
18542 94208 54433 17470 -230814 -187048 -335951 44837 -16565 -328399 52799 67303 187597
18531 187597 -8156 -188282 -233558 146002 -481352 26204 51147 -439652 132331 99177 22647
18519 -191917 -173737 -255305 67921 -321180 267973 -49383 300646 -37924 132208 -164610
18508 -139095 39617 -30045 46069 -45900 78813 -79112 50438 -77581 -135051 -254505 -21377
$$ packed form
18587A03756b84130D6742b61896c9098l99734f6288l0065B47245E1198L328J82221
18576B36747j5362c3662j15956P971l1039k69680g4999l60692A44034c3630j18248
18565a51878j4067K5365A26680b30483b5404L132H2739C7531a3245l15982a57808
18553b06285o9982j06854B92022m8906c49920a67148B0991d180B55560a78063
18542I4208l9775A7470b30814M3766j48903D4837a6565l11834E2799J4504J20294
18531A87597h156j80126m5276A46002d81352B6204K4943d39652A32331l3154B2647
18519a91917J8180q1568F7921c21180B67973d9383C00646c7924A32208a64610
18508a39095C9617c0045D6069d5900G8813g9112E0438g7581n7470j19454b1377
$$ plain form
18496 -64701 10928 -87999 -220878 -74532 -247057 -60423 -156403 209652 203967 291328 15173
18484 -293118 -210329 94261 95 74606 -327382 82482 -221496 433337 -138519 186826 -98001
18472 23850 98990 97563 -38115 60259 37018 -97241 -24263 -294045 -121696 -268517 -154164
18461 -154164 -190726 -184817 -66675 -82588 322748 100876 -85637 -149084 172654 -35407 -424798
18450 -424798 -231759 59215 206953 122664 158042 -176039 -29566 -58343 21653 -81573 -36205
18438 45612 -11972 185763 -27441 -484330 142541 61605 -13497 92855 163971 305730 -80691
18426 -85664 -306047 72808 123947 262006 -129634 -169658 88193 270560 -191702 111867
18415 23507 -27548 -22734 -266597 233051 -70153 176380 -110557 100401 56393 -10278 -105760
$$ packed form
18496f4701A0928h7999j32879g4532j72525f0423r5980B09652n685Q7361A5173
18484b93118Q2789I4261I5P4511c27382H2482b21496D33337a38519A86826i8001
18472B3850P5140j427c8115F0259k3241i7241b4263k69782a21696j46821J14353
18461a54164l6562N909f6675j5913C22748A00876h5637o3447A72654c5407l89391
18450d24798J93039E9215J47738q4289L5378a76039b9566k8777B1653h1573c6205
18438D5612a1972A85763b7441m56889A42541F1605a3497I2855P1116J41759h0691
18426h5664k20383G2808N1139J38059a29634m0024H8193J82367a91702A11867
18415B3507b7548M814k43863B33051g0153A76380a10557A00401m4008a0278r5482
$$ plain form
18404 -105760 110544 98170 191068 497039 -187154 -448 35199 -389700 -80222 92705 -52601
18392 18593 -364011 -79499 161816 -28726 -237025 -50673 28767 -185294 -158613 -26077 220989
18380 -226208 77676 19172 -619597 -489224 -5448 -30198 -193350 287787 -145319 -29336 -166156
18369 -166156 59021 -2740 -380161 -328466 27699 -166204 -224100 -139368 -244915 292371 174473
18358 174473 -252891 31644 107784 -69479 122995 -230812 -195563 165599 95964 20731 -94091
18346 -293764 131032 -379883 106241 41892 17944 -28784 182778 -120696 126225 -78924
18335 -112507 40018 -42767 -25059 -183865 -221953 -71087 -30887 -100337 139805 244178 -18217
18323 -19508 -77515 -229867 -98206 -125623 204523 -148336 -370758 -146239 -115082 -134733 98892
$$ packed form
18404a05760A10544j2374R2898L05971a87154d48C5199c89700h0222I2705e2601
18392A8593c64011g9499A61816b8726k08299e0673B8767a85294K6681b6077B20989
18380b26208G7676A9172f19597J30373e448k4750j63152B87787a45319b9336j36820
18369a66156E9021b740l77421N1695B7699a66204n7896Q4732j05547B92371j17898
18358A74473b52891C1644P6140f9479A22995b30812L5249A65599o9635B0731i4091
18346b93764A31032c79883A06241D1892A7944b8784A82778a20696A26225g8924
18335a12507D0018d2767J7708j58806l8088g1087c0887o9450A39805J04373a8217
18323a9508n8007j52352i8206k7417B04523a48336k22422a46239L1157j9651I8892
$$ plain form
18311 -279410 236268 -17780 64122 367604 200810 -156439 244231 44674 -36824 179788
18300 -108925 -49538 159713 -75059 98455 270017 -320506 198272 -118872 244127 -98190
18289 -189437 -236780 -214976 -211101 -31363 -21926 -154716 -186 -60998 -283783 117622 41768 75612
18277 75612 217356 84223 35189 -296152 16513 -228835 47045 -218629 -18571 21730 150000
18266 150000 29766 184845 219531 48841 52610 -56167 -72615 -409706 -107799 145868 -269005
18254 34075 -385971 -489619 -186272 -96326 -398471 -205052 150178 141170 -55723 151366
18243 -200793 -169133 -153109 -7232 -320826 -24130 152708 99525 -115546 -197489 249220 -6353
18231 38435 326114 -99408 -12054 315833 -382603 -159282 -46665 -43145 -64686 16725 -145256
$$ packed form
18311b79410B36268a7780F4122L03482j66794a56439B44231D4674c6824A79788
18300a08925d9538A59713g5059I8455J71562c20506A98272a18872B44127i8190
18289a89437m7343K1804L875c1363R437j32790a86o0812k22785A17622D1768L3844
18277G5612J41744H4223C5189b96152A6513b28835D7045b18629a8571B1730J28270
18266A50000B9766J55079L4686D8841L769e6167j6448l37091a07799A45868b69005
18254C4075c85971j03648a86272Q9946l02145J93419A50178r008e5723A51366
18243b00793L1660J6024g232l13594b4130A52708n3183a15546q1943B49220f353
18231C8435K87679i9408a2054C15833c82603a59282d6665L520k1541A6725a45256
$$ plain form
18219 -87283 -21226 -166420 -67782 -29257 -8886 338719 -83513 -100187 -78920 9635 311140
18208 311140 126093 -25451 190320 -22699 74191 -261025 169429 -278847 119702 -12317
18197 -60876 -435445 -106716 -125141 100366 23627 -217609 126464 -296028 72157 256967
18187 256967 -122156 -160817 -70142 -64720 -201341 -25517 66678 102676 -5629 58637 -196324
18175 -7450 -96955 348013 -181141 -60067 -45508 -179768 -234702 109790 73199 -84664 22257
18163 191785 -25510 202991 148000 293301 -148565 147112 107432 183343 83580 159823 -148372
18151 -19402 57893 94726 -77194 6918 -24268 -81893 324123 -147576 121186 -175565 -200757
18140 -200757 -66407 59084 -76516 120408 55106 -180215 -74132 -144677 27726 -124385 53349
$$ packed form
18219h7283b1226j45194f7782b9257h886C38719h3513j6674K1267I635L01505
18208C11140A26093b5451A90320b2699G4191b61025A69429b78847A19702a2317
18197f0876l74569a06716j8425A00366B3627b17609A26464b96028G2157J84810
18187B56967a22156l8661g0142N422j36621b5517F6678L5998e629E8637a96324
18175g450q9505C48013a81141f0067J4559j34260n4934A09790l6591h4664B2257
18163A91785b5510B02991n4991J45301a48565A47112l9680P5911H3580P6243a48372
18151a9402E7893L6833g7194F918b4268n7625C24123a47576A21186a75565k5192
18140b00757f6407E9084g6516A20408E5106a80215g4132p0545B7726a24385E3349
$$ plain form
18128 -85790 -288799 8798 -61780 -185597 -83267 -168341 165934 -173111 393192 -247966 110414
18116 119367 21248 -121081 74273 134775 -164700 -31335 207468 -37886 85793 76856 19064
18104 -169803 -37550 221803 -189553 -246820 43166 -198916 -240576 204912 -50704 46237 -215086
18092 21857 143750 112000 -149844 28641 66329 -76290 -387682 213412 -205239 137302
18081 -94637 -28406 -75254 -122332 -79405 -173046 -31772 -10636 298869 -273182 -228071 -210791
18070 -210791 -405266 -167942 98514 -135886 -156500 -156977 6706 -14349 43128 110545 221813
18059 221813 -7315 360896 -43895 21804 84963 179151 250280 -78001 -54250 123409 -95236
18047 -30912 -99967 172108 154822 -24665 113445 -213491 -201239 -16462 -28828 368152 -357743
$$ packed form
18128h5790k03009H798f1780j23817h3267q5074A65934a73111C93192b47966A10414
18116A19367B1248a21081G4273O0502a64700c1335B07468c7886H5793q937A9064
18104a69803c7550B21803a89553n7267D3166a98916m1660B04912e0704D6237b15086
18092B1857J21893l1750a49844B8641L7688g6290l11392B13412b05239A37302
18081i4637b8406m6848m7078M2927r3641c1772a0636B98869b73182M5111J7280
18070b10791j94475a67942I8514a35886k0614m77F706a4349D3128O7417J11268
18059B21813g315C60896d3895B1804O3159R4188P1129g8001K3751A23409i5236
18047c0912o9055A72108j7286b4665A13445b13491J2252a6462j2366C68152c57743
$$ plain form
18035 20019 17707 5619 236045 -63066 36591 122837 207072 316725 -277400 -50109 145732
18023 27505 188553 -284795 113153 41951 62067 -195332 15615 -213433 52458 -21186 12181
18011 131722 -31032 -36607 50613 -38629 55643 -215055 89826 61161 69666 5727 -77720 157694
17998 11635 33620 5004 99527 -59149 -16380 50476 194172 25620 108986 -229056 20974
17986 -289833 235658 -144890 182522 -148116 223797 369987 -168441 107336 139886 -54082
17975 -280615 68503 -127772 -54605 140455 -55182 76123 36759 187379 -165413 10439 222434
17964 222434 -39580 -46057 212491 -115492 -222803 354741 -467287 5636 47390 -386680 8966
17952 -100540 99317 62637 209593 36664 -121335 -57212 -124016 -115647 288650 370597 -205128
$$ packed form
18035B0019k312E619K30426f3066C6591Q6246Q4235J09653b77400e0109A45732
18023B7505J61048b84795A13153D1951K0116a95332A5615b13433E2458b1186A2181
18011A31722c1032n575E0613c8629E5643b15055H9826k8665Q505E727g7720A57694
17998A1635K1985E004R4523e9149a6380E0476J43696B5620Q3366b29056B0974
17986b89833B35658a44890A82522a48116B23797J46190a68441A07336L2550e4082
17975b80615F8503a27772e4605A40455e5182G6123C6759J50620a65413A0439K11995
17964B22434c9580o477B12491a15492j07311C54741d67287E636M1754c86680H966
17952a00540I9317l6680J46956C6664a21335e7212o6804Q369B88650Q1947b05128
$$ plain form
17940 190762 -161623 -362833 68703 -146339 -78744 145376 -86276 -114887 -109053 217284 -9345
17928 -119059 304625 334959 -152598 -15224 -47221 273455 -44095 -54459 -238641 -104637
17917 -116098 -78306 329117 -30953 25786 -63075 289776 142045 -435057 26736 123548 -127445
17905 -18438 180503 -37712 -50019 -45898 -118798 -192236 -152072 -27577 346580 67501 -68673
17893 152718 219042 71023 155716 99985 88629 250869 88423 240408 -111125 -23590 60364
17881 -23511 -223404 -88193 397560 57797 216572 13275 149622 -55831 38677 -101413 -332451
17870 -332451 105845 45493 11542 24688 221301 -96140 -42290 -109712 132824 46909 -66381
17858 1481 138524 -166233 -25782 36601 213188 40912 -16708 216167 -135009 104106 -80756
$$ packed form
17940A90762a61623k01210F8703a46339O7595A45376h6276k8611N834B17284i345
17928a19059C04625L0334a52598a5224l1997B73455d4095j0364j84182a04637
17917a16098L7792C29117c0953B5786f3075B89776A42045d35057B6736R6812a27445
17905a8438A80503c7712j2307M121p2900p3438M0164b7577C46580F7501f8673
17893A52718O6324G1023Q4693n5731j1356J62240H8423J51985a11125b3590F0364
17881b3511j99893h8193C97560E7797J58775A3275J36347e5831C8677a01413k31038
17870c32451A05845D5493A1542J3146J96613i6140d2290o7422A32824D6909f6381
17858A481J37043a66233b5782C6601J76587D0912a6708B16167a35009A04106h0756
$$ plain form
17846 143071 -129313 185568 -48026 -17506 -437863 -256277 373606 298220 123493 -91249
17835 208468 134786 -162126 -18198 68530 44623 -52289 61755 108719 163120 -125349 129650
17823 492622 -295349 -244210 -1077 -57649 243397 28505 -784 38144 -307160 -141027 155458
17811 437921 3925 212788 220830 -97551 173965 -154221 60501 -282145 -372186 -161424 191292
17799 76571 117301 -218682 -19502 58181 -12355 172146 257254 -263199 -7681 -181065 98407
17787 58195 106499 -87488 -109767 154018 -83504 -46937 -23158 -91510 91693 283175 -153396
17775 -6768 217253 -179603 148434 -1092 -256795 43451 -145879 180230 239239 -116055 -45719
17763 -92327 -127379 118589 76191 -124195 -55336 -74706 -124835 98661 -83230 -251464 241816
$$ packed form
17846A43071a29313A85568d8026a7506m20357J81586C73606p5386A23493i1249
17835B08468p3682a62126a8198F8530k3907e2289F1755M6964N4401a25349A29650
17823D92622b95349N1139a077n6572B43397B8505g84C8144c07160a41027A55458
17811D37921C925K08863Q042i7551A73965a54221F0501b82145r0041a61424A91292
17799G6571M0730b18682a9502E8181a2355A72146Q5108b63199g681j73384I8407
17787E8195M8304h7488k2279A54018h3504L6567b3158o8352I1693J91482a53396
17775f768B17253a79603A48434a092k55703D3451a45879A80230N9009a16055d5719
17763i2327l5052A18589m2398a24195e5336j9370n0129I8661h3230j68234B41816
$$ plain form
17751 -315326 200288 -54415 -37772 398424 -208648 276928 313545 404064 -94607 -92017 -99354
17740 -99354 19455 121745 -64388 164014 -38105 138859 -31551 216520 415651 -33063 -290721
17729 -290721 -150687 154318 193590 -162131 26108 -49330 10427 34328 -66196 54886 -215469
17717 -76797 341758 87366 47375 30323 59146 65652 64275 67485 -40171 -42011 196409 354302
17705 354302 14349 320695 218738 -713 -148652 436990 99436 -46888 99632 -190509 -195695
17694 -195695 -30104 -131587 9241 82695 102612 85347 145130 70379 120277 -200527 -77732
17682 145440 11782 100198 5383 123088 89794 272593 42371 -112917 46448 356255 123224
17670 196095 -139739 104737 129052 14606 -29112 213534 1783 -22972 -15633 -139927 292555
$$ packed form
17751c15326B00288e4415J6643C98424b08648B76928L6617R0519i4607K590p337
17740i9354A9455J02290f4388A64014c8105A38859c1551B16520J99131c3063k57658
17729b90721J40034A54318L9272a62131B6108d9330A0427K3901f6196E4886b15469
17717g6797C41758H7366l9991j7052K8823O506j377L210d0171j840A96409J57893
17705C54302A4349L06346j01957g13j47939D36990I9436d6888I9632a90509n186
17694a95695c0104j01483I241P3454J9917j7265N9783G0379M9898b00527g7732
17682A45440A1782Q8416E383J17705l3294J82799D2371a12917D6448L09807A23224
17670A96095a39739A04737K4315A4606b9112B13534A783b2972P339j24294B92555
$$ plain form
17658 251100 188075 -209277 44445 265534 217280 448706 177464 -63484 37796 182228
17648 182228 341648 -119325 30468 272064 31276 144811 125148 -95923 7840 159533 -141660
17636 231265 -304856 -26606 390169 134498 176387 426668 172165 304029 65114 208286
17626 208286 41591 266786 127434 326017 243671 74268 343464 152934 99835 67981
17616 67981 49204 149166 38179 175527 134969 79062 -142432 113762 86780 21098 248194
17605 248194 119213 190936 141381 14865 220638 -31009 286038 -127657 -34442 147186
17594 -88544 -12832 290964 74788 217873 140178 140128 -154295 -106275 95220 12170 6144 273444
17582 273444 193711 -65968 227953 -14725 125635 -124838 274478 64060 79732 344687
$$ packed form
17658B51100o3025b09277D4445K21089m8254K31426A77464f3484C7796J44432
17648A82228J59420a19325C0468K41596C1276J13535j9663i5923G840J51693a41660
17636B31265c04856b6606C90169A34498M1889K50281A72165J31864F5114J43172
17626B08286D1591K25195A27434J98583q2346G4268K69196A52934n3099l1854
17616F7981j8777R9962C8179J37348m0558n5907a42432A13762k6982B1098K27096
17605B48194A19213P1723m9555A4865K05773c1009B86038a27657c4442A47186
17594h8544a2832B90964G4788J43085p7695n0a54295M8020I5220A2170o026K67300
17582B73444p9733f5968B27953a4725A25635a24838B74478F4060J5672K64955
$$ plain form
17572 344687 387621 53908 55899 87629 -50036 238761 671275 -173728 392465 8406 135875
17561 135875 -134296 -124019 88208 296345 362606 77854 123543 254693 -30852 184374 31743
17549 90541 -6859 170051 68134 144822 280000 203827 -17260 301245 221078 261337 62482
17537 219276 212884 161708 108027 84423 245147 275698 93605 35060 71561 357968 62809
17525 322183 247373 349343 179967 191511 168650 216948 278155 26262 493038 160056 -12942
17513 183389 291489 466349 628660 473207 691330 925070 734965 662923 693318 341148
17502 739049 511842 459531 636780 412238 697706 462055 358339 308481 678928 629640
17492 629640 557635 838034 735375 614035 769779 682331 131474 381121 437261 584317
$$ packed form
17572C44687M2934E3908J991L1730e0036B38761M32514a73728C92465H406J27469
17561A35875a34296J0277H8208K08137O6261G7854M5689J31150c0852A84374C1743
17549I0541f859A70051F8134P6688J35178p6173a7260C01245q0167M0259F2482
17537B19276o392n1176n3681k3604J60724L0551I3605C5060L6501K86407F2809
17525C22183p4810J01970j69376J1544k2861M8298O1207B6262M66776A60056a2942
17513A83389J08100J74860J62311j55453K18123K33740j90105p2042L0395C41148
17502G39049k27207n2311J77249k24542K85468k35651j03716m9858L70447m9288
17492F29640p2005K80399j02659j21340J55744q7448A31474K49647N6140J47056
$$ plain form
17482 584317 515483 365013 107933 40495 99573 390466 36633 -10336 71318 82137 -146854
17470 -72463 141542 297060 240522 345287 -60826 576884 120673 287972 92134 24853
17459 228071 233852 11475 -32882 59859 -176867 82780 465921 419355 -24924 194828 34563
17447 380468 152886 292423 412808 266966 68020 2236 278889 331627 375554 157181
17436 390174 551386 55188 294892 72298 147433 194235 95545 313581 473526 1984 -133831
17424 293234 51827 155503 286622 -16059 442210 277064 80638 378180 338770 417849
17414 417849 87140 274851 113154 429405 263663 488296 339292 459499 460782 338948
17404 338948 570452 327595 418555 131735 604206 138665 268912 409708 664989 329406
$$ packed form
17482E84317o8834j50470A07933D0495N9078K90893C6633a0336G1318J0819a46854
17470g2463A41542J55518n6538J04765f0826E76884A20673J67299I2134B4853
17459B28071N781A1475c2882E9859a76867H2780L83141m6566b4924A94828C4563
17447C80468A52886J39537J20385j45842F8020B236K76653N2738M3927A57181
17436C90174J61212E5188K39704G2298P5135M6802I5545K18036J59945A984a33831
17424B93234E1827J03676J31119a6059D42210j65146H0638K97542l9410P9079
17414D17849H7140J87711A13154L16251j65742K24633j49004J20207J283j21834
17404C38948K31504k42857R0960A31735M72471A38665J30247J40796K55281C29406
$$ plain form
17393 168616 -72253 440668 413180 325271 -242887 90174 51313 -86528 -133763 208073 -21814
17381 137464 121317 294843 269014 144683 38703 187492 144115 334319 642367 450742
17371 450742 301803 211850 16140 84638 167609 307966 25702 398739 120568 180183 362624
17360 362624 72252 306460 376240 302251 564313 144938 -16950 382117 276954 85832
17349 374047 332397 336800 287942 -147905 99128 -82923 349974 356973 -66537 244471 94809
17337 65774 65733 198211 11947 359624 43327 67035 415026 50759 354649 -2968 89964 269431
17325 269431 171246 512469 265505 524397 595730 535609 101816 132549 -41866 343027
17314 79929 217591 114274 138578 6060 -14504 349409 257595 125094 246423 77452 245851
$$ packed form
17393A68616g2253D40668k7488q7909b42887I0174l8861h6528m7235B08073b1814
17381A37464j6147J73526k5829j24331C8703J48789m3377J90204L08048j91625
17371D50742j48939q9953A6140O8498Q2971J40357B5702L73037A20568N9615J82441
17360C62624G2252K34208O9780p3989K62062A44938a6950C82117j05163H5832
17349C74047m1650M403m8858a47905I9128h2923C49974O999f6537B44471I4809
17337F5774m1J32478A1947L47677D3327K3708L47991E0759L03890b968H9964J79467
17325B69431r8185L41223k46964K58892P1333o0121A01816L0733d1866C43027
17314G9929J37662j03317K4304F060a4504C49409r1814A25094J21329G7452J68399
$$ plain form
17303 245851 349396 -46323 24205 297446 165094 153016 520574 348185 194706 132520
17293 132520 131643 365875 103392 385419 364596 333753 342720 229546 521730 402614 51328
17281 323565 414569 96630 216329 407667 240406 156208 507767 162970 509269 479190
17271 479190 255533 151571 258555 415611 313995 400353 717464 159024 512391 351821
17261 351821 148836 422201 418431 64028 214184 114482 56067 9997 315269 106887 205544
17250 205544 355542 374768 278149 612843 151284 463648 161268 463265 -11025 681927
17239 300505 168508 -91909 435434 496437 126158 63465 116220 376610 223552 212830
17229 212830 298571 598856 374076 319608 173550 410355 331773 309043 368710 208475
$$ packed form
17303B45851J03545d6323B4205K73241j32352j2078L67558j72389j53479o2186
17293A32520q77K34232A03392K82027k0823l0843Q967j13174K92184j19116E1328
17281C23565R1004I6630J19699J91338j67261q4198L51559A62970L46299l0079
17271D79190k23657j03962J06984J57056j01616Q6358L17111A59024L53367j60570
17261C51821A48836K73365l770F4028J50156r9702E6067I997L05272A06887R8657
17250B05544J49998J9226r6619L34694A51284L12364A61268L01997a1025F81927
17239C00505j31997i1909D35434O1003A26158o2693N2755K60390j53058j0722
17229B12830Q5741L00285k24780n4468j46058K36805p8582k2730N9667j60235
$$ plain form
17219 208475 132151 460770 419278 285232 419687 330647 274964 284286 180470 273728 266926
17208 266926 204200 364373 -40162 299399 345500 565596 436987 370063 258910 419792
17198 419792 445194 285733 71064 481781 252392 341280 339715 276075 369495 378615 467470
17187 467470 188313 266332 310057 277652 509038 307977 210503 190329 780749 147441
17176 704180 420575 420553 325820 514199 586580 129281 296995 463014 159667 395668 58195
17164 442849 627220 492620 407300 384164 562588 322047 80174 120560 341839 249211
17154 249211 418686 445708 165500 231898 362535 389447 351001 529543 245453 270560
17144 270560 406602 725922 643135 456267 210548 401256 543456 628568 158506 551548
$$ packed form
17219B08475p6324L28619m1492j34046J34455q9040n5683R322j03816R3258o802
17208B66926o2726J60173d0162B99399M6101K20096j28609o6924j11153J60882
17198D19792K5402j59461G1064M10717k29389Q8888j565o3640R3420R120Q8855
17187D67470A88313P8019M3725l2405K31386k01061r7474k0174N90420A47441
17176G04180k83605k2r4733J88379P2381A29281J67714J66019A59667K36001E8195
17164D42849J84371j34600q5320k3136J78424k40541H0174M0386K21279r2628
17154B49211J69475K7022A65500O6398J30637K6912l8446J78542B45453K5107
17144B70560J36042L19320q2787j86868B10548J90708J42200Q5112A58506L93042
$$ plain form
17134 551548 610545 516284 403498 422630 608516 419980 819134 406772 -9672 254966
17123 467158 709083 532064 632841 710833 641431 519356 283111 392184 379618 669099
17113 669099 202028 440439 352355 504097 505481 407916 244940 299887 55345 600250 571769
17102 571769 320560 287884 495294 405008 591601 446380 391224 403605 445036 547807
17092 547807 417549 684060 603075 383712 698853 661269 541339 293088 675632 410419
17082 410419 244901 599147 404028 177171 437450 459697 464801 387245 611939 647398
17072 647398 488844 445102 377442 571456 1035465 563317 674245 523560 598440 248266
17061 748787 448627 328933 610811 385403 443087 927011 745238 766407 770828 954468
$$ packed form
17134E51548N8997r4261j12786J9132J85886j88536L99154D06772i672B54966
17123D67158K41925j77019J00777P7992o9402j22075k36245J09073j2566K89481
17113F69099B02028K38411q8084J51742J384r7565j62976N4947E5345N44905k8481
17102E71769k51209l2676K07410r0286J86593j45221n5156J2381M1431J02771
17092E47807j30258K66511q0985k19363L15141l7584j19930k48251L82544k65213
17082D10419j65518L54246j95119A77171K60279K2247N104p7556K24694L5459
17072F47398j58554m3742o7660J94014M64009m72148J10928j50685P4880B48266
17061G48787l00160j19694K81878k25408N7684M83924j81773K1169M421J83640
$$ plain form
17051 954468 832896 824358 950570 757668 757943 662486 453554 814933 1020324 752630 634284
17040 634284 628435 517621 1229761 795849 683521 624618 1018715 1165057 895730 737146
17030 737146 862237 779492 1092852 504986 578273 810055 565551 941995 931643 673448
17020 673448 945234 1096658 955455 925659 666445 660195 551883 1025350 759706 883406
17010 883406 796520 1051761 1007707 1009213 720797 776865 1072024 987936 799744 1037674 534543
16999 534543 1174122 799846 909741 889496 1066980 945706 904688 1133258 628541 1164591
16989 1164591 975670 930210 1079976 1246969 1083841 1124151 1092890 1033423 1028084 911819
16979 911819 1098639 1440658 1227585 985368 1333115 1148219 894548 1187936 1089094 1260750
$$ packed form
17051I54468j21572q538J26212j92902K75r5457k08932L61379K05391k67694j18346
17040F34284n849j10814P12140m33912j12328n8903L94097J46342k69327j58584
17030G37146J25091q2745L13360E04986P3287K31782k44504L76444j0352k58195
17020F73448K71786J51424j41203k9796k59214o250j08312M73467k65644J23700
17010H83406q6886K55241m4054J506k88416N6068K95159q4088j88192K37930n03131
16999E34543O39579l74276J09895k0245J77484j21274m1018K28570n04717N36050
16989A164591j88921m5460J49766J66993j63128M0310l1261n9467n339j16265
16979I11819J86820L42019k13073k42217L47747j84896k53671K93388r8842J71656
$$ plain form
16969 1260750 1151030 1060472 1014303 1176388 990365 1169914 1283665 1121342 1426108 1121150
16959 1121150 1380566 1340702 999571 1175011 1288078 1194395 1634647 1348365 1151057 1325257
16949 1325257 1476512 1393848 1563456 1457838 1304444 1001520 1039780 1365747 1384967 1448685
16939 1448685 1517864 1585637 1337091 1380043 1410956 1655990 1573763 1832445 1803809 1646119
16929 1646119 1948782 1817919 1273048 1889101 1706636 1819873 1828740 1762996 1707429 1760730
16919 1760730 1749123 1780813 1508194 2050368 1503128 1590674 2135896 2069104 1961486 2430090
16909 2430090 1820244 2052906 2221639 2193593 2051314 2472443 2209123 2191509 1904643 2300336
16899 2300336 2184332 2148288 2262749 2476661 2247367 2271825 2584781 2404179 2301938 2402235
$$ packed form
16969A260750j09720r0558m6169J62085j86023J79549J13751j62323L04766l04958
16959A121150K59416l9864l41131J75440J13067r3683M40252k86282j97308J74200
16949A325257J51255q2664J69608j05618j53394l02924L8260L25967J9220O3718
16939A448685O9179O7773k48546M2952L0913K45034q2227K58682k8636j57690
16929A646119L02663j30863n44871O16053j82465J13237Q867o5744n5567N3301
16919A760730j1607L1690k72619N42174n47240Q7546N45222o6792j07618M68604
16909B430090o09846K32662J68733k8046j42279M21129k63320j7614k86866L95693
16899B300336j16004l6044J14461K13912k29294K4458L12956j80602j02241J00297
$$ plain form
16889 2402235 2578358 2687054 2493476 2772493 2636071 2637594 2449391 2526817 2879569 2664172
16879 2664172 2813203 2574845 2335365 2749549 2888579 3199549 2728406 2682711 2902754 2710299
16869 2710299 2980521 3140819 3290722 3155742 3377242 2988724 3477908 2826984 3411533
16860 3411533 3450627 3306614 3381949 3164124 3698033 3676830 3827250 3713609 3772311 3894671
16850 3894671 3862784 3963705 3876816 4365347 3834583 4186850 4277771 4069244 4080138 4270977
16840 4270977 4518792 4319217 4864051 4506706 4909032 4832816 4711244 4923521 4827850 5242690
16830 5242690 5007482 5254781 5196143 5770658 5242342 5490599 6554914 5541475 6103483
16821 6103483 6079276 5949872 6100144 6623634 6513791 6485601 6360297 7059443 7038059 7085584
$$ packed form
16889B402235J76123J08696j93578K79017j36422J523j88203P7426L52752k15397
16879B664172J49031k38358k39480M14184J39030L10970m71143m5695K20043j92455
16869B710299K70222J60298J49903j34980K21500l88518M89184o50924N84549
16860C411533L9094j44013P5335k17825N33909k1203J50420j13641N8702J22360
16850C894671l1887J00921q6889M88531n30764L52267R0921k08527J0894J90839
16840D270977K47815j99575N44834l57345M02326p6216j21572K12277r5671M14840
16830E242690k35208K47299n8638N74515n28316K48257J064315j013439N62008
16821F103483k4207j29404J50272N23490j09843k8190j25304O99146k1384M7525
$$ plain form
16811 7085584 7217689 7166664 7480583 7564653 7883040 8057242 7891228 8130332 8475388 8125490
16801 8125490 8806482 9104252 9189628 9097699 9325266 9795159 10085130 9907739 10225034 10637536
16791 10637536 10821813 10938872 11346968 11459015 11712842 11988450 12665509 12459773 12944181
16782 12944181 13182886 13382164 13613227 14185786 14745732 14685559 15251784 15806531 16029704
16773 16029704 16707598 17101302 17759627 18226948 18731043 19490731 19689415 20701931 21130012
16764 21130012 21345410 22522965 23191343 23667301 24612974 25549582 26455803 27214613 27982500
16755 27982500 29090316 29855037 31067850 32218272 33525709 34537076 36147191 37253987
16747 37253987 38450121 40055013 41507552 43105658 44996665 46609371 48365358 50555842
$$ packed form
16811G085584J32105n1025L13919Q4070L18387J74202j66014K39104L45056l49898
16801H125490O80992K97770Q5376r1929K27567M69893K89971j77391L17295M12502
16791A0637536J84277J17059M08096J12047K53827K75608O77059k05736M84408
16782A2944181K38705J99278K31063N72559N59946o0173N66225N54747K23173
16773A6029704O77894L93704O58325M67321N04095P59688J98684J012516M28081
16764B1130012K15398J177555O68378M75958R45673R36608R06221P58810P67887
16755B7982500J107816P64721J212813J150422J307437J011367J610115J106796
16747C7253987J196134J604892J452539J598106J891007J612706J755987K190484
$$ plain form
16739 50555842 52397867 54296978 56651241 58948103 61678050 64138951 66676509 69540246
16731 69540246 72280926 75256448 78552382 81266838 84645007 87701454 91191894 94572609
16723 94572609 98063350 101326477 104523902 107854702 111241101 114176346 117164991 119874785
16715 119874785 122333357 124098037 126207801 127674757 128992895 130038020 130316720 130247238
16707 130247238 130044917 129321236 128196235 126642855 124602578 122859866 120278360 117380089
16699 117380089 114596740 111446157 107825064 104751410 101342015 98200208 94755012 91143321
16691 91143321 87787711 84556014 81453715 78255371 74938930 72194280 68982062 66465711
16683 66465711 63665078 61154156 58946291 56145081 54162226 51819622 50052948 48241625
$$ packed form
16739E0555842J842025J899111K354263K296862K729947K460901K537558K863737
16731F9540246K740680K975522L295934K714456L378169L056447L490440L380715
16723I4572609L490741L263127L197425L330800L386399K935245K988645K709794
16715A19874785K458572J764680K109764J466956J318138J045125K78700o9482
16707A30247238k02321p23681j125001j553380k040277j742712k581506k898271
16699A17380089k783349l150583l621093l073654l409395l141807l445196l611691
16691I1143321l355610l231697l102299l198344l316441k744650l212218k516351
16683F6465711k800633k510922k207865k801210j982855k342604j766674j811323
$$ plain form
16675 48241625 46033832 44072721 42711529 41175251 39561717 38234910 36703134 35344592
16667 35344592 33752269 32937299 31555499 30743817 29725114 28583547 27662205 26492604
16659 26492604 25524283 24999337 24058803 23311009 22477834 22245224 21236106 20369235 20002820
16650 20002820 19196494 18856582 18165589 17889571 17350270 16731827 16462467 15946502 15414067
16641 15414067 15242855 14823501 14124298 14196013 13773907 13492935 13112690 12667569 12096156
16632 12096156 11964158 11674844 11351898 10940880 10851316 10501280 10218487 10700654 10168210
16623 10168210 9903357 9838563 9259846 9006550 9118620 8791878 8368346 8133350 8156687 7798589
16613 7798589 7807886 7994476 7725727 7606527 7872090 7692363 7154423 6794761 6916890 6694885
$$ packed form
16675D8241625k207793j961111j361192j536278j613534j326807j531776j358542
16667C5344592j592323q14970j381800q11682j018703j141567r21342j169601
16659B6492604r68321n24946r40534p47794q33175k32610j009118q66871l66415
16650B0002820q06326l39912o90993k76018n39301o18443k69360n15965n32435
16641A5414067j71212m19354o99203P1715m22106k80972l80245m45121n71413
16632A2096156j31998k89314l22946m11018q9564l50036k82793M82167n32444
16623A0168210k64853o4794n78717k53296J12070l26742m23532k34996K3337l58098
16613G798589R297J86590k68749j19200K65563j79727n37940l59662J22129k22005
$$ plain form
16603 6694885 6729734 6496533 6093228 6359407 5798207 6123691 6050664 5744196 5887091 5602101
16593 5602101 5603717 5154664 5175452 5100986 5342971 4962484 5053875 4796546 5073736 4643869
16583 4643869 4653758 4561087 4373813 4352697 4504324 4533206 4308823 4092115 4168248 4259994 3749033
16572 3749033 4210951 3637055 4063634 3842241 3809688 3611685 3571928 3411628 3480905 3733956
16562 3733956 3399766 3805132 3387355 3004981 3611544 3689442 3444561 3191723 2870630 2924831
16552 2924831 3131532 2923897 2995747 2802553 3073057 2786002 3021073 2864288 2492195 2902832
16542 2902832 2658021 2769159 2625127 2271625 2689395 2585991 2269738 2521424 2287891
16533 2287891 2738576 2585833 2473223 2357333 2428470 2424054 2282922 2086744 2113441 2089549
$$ packed form
16603F694885L4849k33201m03305K66179n61200L25484p3027l06468J42895k84990
16593E602101J616m49053K0788p4466K41985l80487R1391k57329K77190m29867
16583D643869R889r2671j87274k1116J51627K8882k24383k16708P6133R1746n10961
16572C749033M61918n73896M26579k21393l2553j98003l9757j60300O9277K53051
16562C733956l34190M05366m17777l82374O06563P7898k44881k52838l21093N4201
16552B924831K06701k07635P1850j93194K70504k87055K35071j56785l72093M10637
16542B902832k44811J11138j44032l53502M17770j03404l16253K51686k33533
16533B287891M50685j52743j12610j15890P1137m416j41132j96178K6697k3892
$$ plain form
16523 2089549 2116577 2225083 2433976 2159328 2098718 2062137 1990806 1831271 1850674 1828562
16513 1828562 1978587 2065923 1905767 1847189 2003431 1678097 2114487 2001493 1661019 1615374
16503 1615374 1562220 1937388 1330335 1787703 1550129 1803888 1970762 1813020 1549524 1839405
16493 1839405 1266543 1692340 1199299 1686495 1319495 1318477 1435682 1706086 1498215 1402404
16483 1402404 1542783 1559223 1457496 1141612 1551790 1581873 1559017 1326702 1362375 1377350
16473 1377350 1376958 1335693 1401787 1252371 1288462 1439012 1408103 1713135 1310020 1171585 951843
16462 951843 1535437 1302305 1228860 1348607 1403048 1120201 1284644 1399993 1533677 1218865
16452 1218865 1461409 1143462 1173837 1022214 952911 1202754 1085176 1236805 1135588 1113709
$$ packed form
16523B089549K7028J08506K08893k74648o0610l6581p1331j59535J9403k2112
16513A828562J50025Q7336j60156n8578J56242l25334M36390j12994l40474m5645
16503A615374n3154L75168o07053M57368k37574K53759J66874j57742k63496K89881
16493A839405n72862M25797m93041M87196l67000j018J17205K70404k07871r5811
16483A402404J40379J6440j01727l15884M10178L0083k2856k32315L5673J4975
16473A377350l92m1265O6094j49416L6091J50550l0909L05032m03115j38435k19742
16462I51843N83594k33132p3445J19747N4441k82847J64443J15349J33684l14812
16452A218865K42544l17947L0375j51623o9303K49843j17578J51629j01217k1879
$$ plain form
16442 1113709 1259606 929028 1062799 1002542 1375900 1126330 957971 979027 746128 900378
16432 900378 825385 895599 1115265 846732 928077 777848 1111078 1164653 1070079 1061560 997483
16421 997483 1164432 1061014 1000425 653459 1229343 931752 1066503 715655 834734 882571
16411 882571 571584 1045672 783571 807094 808172 852201 1115863 995128 523219 785758
16401 785758 1210848 814651 664390 1041740 944544 829597 941189 908222 588363 689496
16391 689496 742607 911390 695475 1065386 906153 1019467 603442 912180 575938 589507
16381 589507 878945 1004609 744942 988007 651403 504310 651482 893113 475522 707443
16371 707443 456408 429051 518235 435329 620261 470144 179294 577851 555886 621929
$$ packed form
16442A113709J45897l30578J33771o0257L73358k49570j68359K1056k32899J54250
16432I00378p4993P0214K19666k68533Q1345j50229L33230N3575r4574q519o4077
16421I97483J66949j03418o0589l46966N75884k97591J34751l50848J19079M7837
16411H82571l10987M74088k62101K3523J078M4029K63662j20735m71909K62539
16401G85758M25090l96197j50261L77350r7196j14947J11592l2967l19859J01133
16391F89496N3111J68783k15915L69911j59233J13314m16025L08738l36242J3569
16381E89507K89438J25664k59667K43065l36604j47093J47172K41631m17591K31921
16371G07443k51035k7357Q9184q2906J84932j50117A79294L98557k1965O6043
$$ plain form
16361 621929 643583 742325 609477 220541 430195 694158 643720 770658 810914 993476
16351 993476 484002 482338 727322 626854 839828 420208 459676 595132 523380 348371
16341 348371 507680 944422 592586 736338 129024 683332 384829 581943 517638 614251
16331 614251 336628 837478 309451 350806 679001 527682 508458 668471 257161 759429
16321 759429 559783 383411 396396 638824 307313 583662 537022 696371 295436 615448
16311 615448 630012 531307 640986 350240 581402 598455 204037 696650 316359 597523
16301 597523 430788 545203 343203 286011 570324 462173 297685 374679 437479 324001
16291 324001 467641 485626 737704 324470 558960 466198 259859 486806 421148 160080
$$ packed form
16361F21929K1654R8742j32848B20541K09654K63963n0438J26938M0256J82562
16351I93476D84002j664K44984j00468K12974m19620L9468J35456p1752j75009
16341C48371J59309M36742l51836J43752A29024N54308k98503J97114o4305R6613
16331F14251k77623N00850C09451M1355L28195j51319j9224J60013B57161N02268
16321G59429j99646j76372J2985K42428C07313K76349m6640J59349B95436L20012
16311F15448J4564r8705J09679k90746K31162J7053B04037M92613C16359K81164
16301E97523j66735J14415k02000n7192K84313j08151j64488P6994O2800j13478
16291C24001J43640J7985K52078C24470K34490r2762k06339K26947o5658A60080
$$ plain form
16280 233619 663562 496609 478514 409335 655536 413840 472221 -38504 522883 373800
16270 373800 467785 209426 344937 250938 301565 599650 744213 370822 187558 220594
16260 220594 416228 495517 182252 465611 153032 311656 428080 446418 302604 386401
16250 386401 57910 458101 269000 171988 230988 525018 252648 105870 548533 364590
16240 364590 294116 450020 64406 347767 144975 246041 134770 402933 298358 269444
16230 269444 425099 158812 310503 330588 358875 327388 439561 141892 79534 285101
16220 285101 436392 463163 290504 408200 204866 213666 425013 166852 167823 513695 360540
16209 360540 434483 274533 150201 322818 228014 88942 524991 396861 57941 190693
$$ packed form
16280B33619M29943j66953j8095o9179K46201k41696N8381c8504E22883j49083
16270C73800R3985B09426J35511r3999N0627K98085J44563C70822j83264L3036
16260B20594J95634P9289A82252K83359A53032J58624J16424J8338j43814Q3797
16250C86401E7910M00191j89101r7012N9000K94030B52648A05870M42663j83943
16240C64590p0474J55904F4406K83361A44975J01066j11271K68163j04575k8914
16230B69444J55655A58812J51691K0085K8287l1487J12173A41892o2358K05567
16220B85101J51291K6771j72659J17696k03334Q800K11347A66852R71L45872j53155
16209C60540P3943j59950j24332J72617r4804H8942M36049j28130E7941J32752
$$ plain form
16199 190693 266298 523993 207903 418871 209767 136838 374807 310148 313181 250330 343085
16188 343085 203228 171770 -108933 153361 242459 393020 206926 86945 148724 164942
16178 164942 225427 472959 346846 -68160 139327 234958 390534 479075 314430 287427
16168 287427 155811 -13753 -232013 224147 131635 506261 -163082 -158641 129071 227902
16158 227902 179984 276645 208911 178446 286280 -35344 121979 15207 -4179 104306 171469
16147 171469 242305 320831 223318 -111147 297362 223297 86973 125055 24091 267646 232630
16136 232630 297212 135678 138463 103009 -182306 115554 -68601 218756 221678 360650 126574
16124 -208061 143676 12877 3674 173575 52286 140846 40040 166205 -3963 89142 264048
$$ packed form
16199A90693P5605K57695B07903K10968k09104p2929K37969o4659L033o2851R2755
16188C43085j39857l1458a08933A53361Q9098J50561j86094H6945O1779J6218
16178A64942O0485K47532j26113f8160A39327R5631J55576Q8541j64645k7003
16168B87427j31616a3753k18260B24147r2512L74626a63082M441A29071R8831
16158B27902m7918R6661o7734l0465J07834c5344A21979A5207d179A04306O7163
16147A71469P0836P8526r7513a11147B97362p4065H6973L8082B4091K43555l5016
16136B32630O4582A35678K785l5454a82306A15554f8601B18756K922J38972A26574
16124b08061A43676A2877C674J69901E2286Q8560D0040J26165c963H9142J74906
$$ plain form
16113 264048 120123 439744 -148966 415131 40996 -21466 198850 -86382 -292591 221200
16102 52492 325375 202358 -20122 104608 232638 39813 370265 121415 29811 -11533
16091 181320 277250 164123 450820 346784 -76274 83744 7826 -104244 -170293 143479 283653
16080 283653 478652 117928 474461 263169 197470 -27680 -54834 -75645 262499 -315119
16069 -315870 5280 -381225 189202 93006 1679 324653 -48337 224728 26099 -46520 217599
16057 123804 69591 153078 -248050 131756 118741 157499 92122 -88194 -294801 43511 -23598
16045 105581 -272520 -3506 346175 -16272 -244042 374120 -153049 -93220 261740 -222081
16034 -244034 142019 231738 -1755 72545 153071 -210884 -53785 248822 219508 -144042 -127957
$$ packed form
16113B64048A20123L19621a48966D15131D0996b1466A98850h6382k06209B21200
16102E2492K72883j23017b0122A04608J28030C9813L30452A21415B9811a1533
16091A81320R5930j13127K86697j04036g6274H3744G826a04244o6049A43479J40174
16080B83653J94999A17928L56533k11292o5699b7680k7154k0811B62499c15119
16069c15870E280c81225A89202I3006A679L22974d8337B24728B6099d6520B17599
16057A23804n4213Q3487b48050A31756j3015L8758o5377h8194k06607D3511b3598
16045A05581b72520c506C46175a6272k27770C74120a53049N9829B61740b22081
16034b44034A42019Q9719a755G2545Q0526b10884e3785B48822k9314a44042J6085
$$ plain form
16023 -127957 -118382 225070 224537 -294925 -9419 -110370 154355 130060 36653 -165280 262341
16011 65499 147383 112759 -228928 35490 76468 -156927 121702 45347 -241856 -103732 -281376
16000 -281376 32070 -118338 -108958 -182773 -85131 42132 -3909 77630 179173 -23254 -33443
15989 -33443 -59910 -94213 378872 132328 145192 -74799 218177 -156711 -185350 224420 -64876
15977 167894 -58422 347313 123808 337098 367239 366737 913319 985106 877771 645799 936542
15966 936542 625870 191467 292917 298779 -185745 176007 -118367 -83237 129135 262821
15956 262821 -101410 306611 190691 -168549 -260775 -383242 68419 133811 142542 -77839 -140968
15945 -140968 -213034 -139896 46061 51393 201945 161783 -217426 71814 147313 -147837 -30137
$$ packed form
16023a27957R575B25070n33b94925i419j00951A54355k4295C6653a65280B62341
16011F5499Q1884l4624b28928C5490M0978a56927A21702D5347b41856a03732j77644
16000b81376C2070a18338R380p3815h5131D2132c909G7630J01543b3254j0189
15989c3443k6467l4303C78872A32328J2864g4799B18177a56711k8639B24420f4876
15977A67894e8422C47313A23808K13290L0141n02N46582P1787j07335k31972K90743
15966I36542l10672A91467J01450N862a85745A76007a18367L5130A29135J33686
15956B62821a01410C06611j15920a68549r2226j22467F8419O5392Q731g7839o3129
15945a40968p2066P3138D6061N332J50552m0162b17426G1814P5499a47837c0137
$$ plain form
15933 -323281 -130718 -196415 312280 -127758 184485 -130336 -6075 332433 -98566 -82338
15923 -82338 356 -10688 -125648 -3788 -113342 -46846 -15355 -61278 -64041 167277 -56078 -284200
15911 -284200 -162594 -135029 69494 164976 81309 11860 -170746 63585 -189053 -215766 -136093
15900 -136093 269223 9904 146836 -163229 78370 -403212 73582 -25315 -158183 -84459 159867
15888 -157889 98365 10938 270090 242964 211007 -105414 -202887 124123 -144488 25170 44318
15877 44318 5796 -134402 90178 -89537 37268 -70140 256332 48511 109138 -209366 201539
15865 287073 -74056 -254117 244543 -113641 126865 -71376 106147 -239170 -225312 -9338
15854 -105767 29061 255061 169985 -139111 -30456 -44160 -41174 57717 111796 -95990 69602
$$ packed form
15933c23281a30718o5697C12280a27758A84485a30336f075C32433i8566J6228
15923h2338C56a0688j14960c788j09554d6846a5355m5923k763A67277e6078k28122
15911b84200J21606K7565F9494R5482H1309A1860a70746F3585a89053k6713P9673
15900a36093B69223I904J36932a63229G8370d03212G3582b5315j32868P3724A59867
15888a57889I8365A0938K59152k7126l1957a05414r7473A24123a44488B5170J9148
15877D4318E796a34402I0178h9537C7268g0140B56332D8511O0627b09366B01539
15865B87073g4056j80061B44543a13641A26865g1376A06147b39170J3858i338
15854a05767B9061K26000q5076a39111c0456j3704K986E7717N4079i5990F9602
$$ plain form
15842 -67557 240888 -21704 -30125 192866 223107 -178798 -12075 249066 -143834 75171 -42701
15830 -96376 -80570 -140304 -194431 244495 -85246 -143275 -1812 -128520 -186421 130859 -298723
15818 68709 -67200 -349722 83294 92380 -230514 -244118 -92156 115362 -204259 93075 -49033
15806 -233946 84534 225635 81070 -20341 -20388 -9121 -27704 18707 167859 -174941 58709 -115624
15793 29394 -239392 -198236 -30686 117943 17306 303599 44990 -266763 14773 84188 -49611
15781 -191082 66207 124064 -265195 69989 2330 -35877 -113976 31407 86848 -282781 -12627
15769 -229926 103536 42125 -99723 16998 91802 -131088 -36382 69293 -277185 83739 -63735
15757 -34052 -70410 -4687 -163984 235927 -312949 -12165 264889 -56772 83885 179546 2926
$$ packed form
15842f7557B40888b1704q421A92866L0241a78798a2075B49066a43834G5171d2701
15830i6376J5806n9734n4127B44495h5246n8029a812j26708n7901A30859b98723
15818F8709f7200k82522H3294R086b30514j3604i2156A15362b04259I3075d9033
15806b33946H4534J41101H1070b0341m7i121j8583A8707J49152a74941E8709a15624
15793B9394b39392M1156c0686A17943A7306K86293D4990b66763A4773O9415d9611
15781a91082F6207N7857b65195F9989B330c5877p8099C1407N5441b82781a2627
15769b29926A03536D2125i9723A6998P4804a31088c6382F9293b77185H3739f3735
15757c4052l6358d687j59297B35927c12949a2165B64889e6772H3885R5661B926
$$ plain form
15745 -28452 9780 -46121 97670 140551 -140975 311375 -48125 44479 -51 -62454 9741 -52985
15732 37224 123105 102940 -77580 39922 290743 83092 225796 137389 -58178 -10473 -38354
15721 -38354 -123755 42266 -279708 107381 -253460 287882 -26133 -345986 94313 -171176
15710 -65132 -277947 -80002 -49007 -177936 2671 -44775 118180 -64360 -113234 233895 -42436
15698 -26261 -153250 -34575 -159795 -402591 94772 268043 103140 -313048 -169350 -63213
15687 -131138 -25323 146972 -289697 -171643 -248789 78667 -73620 -189246 60447 -12431 127558
15675 -111336 99964 570072 159166 -155763 -324435 -83269 30152 -97702 -153171 -370613
15665 -370613 -85667 359794 -374066 379749 -56174 -127590 29881 -7776 239080 -30704 117751
$$ packed form
15745b8452I780d6121I7670M2881a40975C11375d8125D4479e1o2403I741e2985
15732C7224Q5881k0165g7580C9922K50821H3092J42704q8407e8178a0473k7881
15721c8354q5401D2266b79708A07381b53460B87882b6133l19853I4313a71176
15710f5132k12815h0002L0995j28929B671d4775A18180f4360m8874B33895d2436
15698b6261j26989c4575j25220k42796I4772J73271A03140c13048J43698f3213
15687a31138b5323A46972b89697J18054p7146G8667g3620j15626F0447a2431A27558
15675a11336I9964M70108A59166a55763j68672h3269C0152i7702n5469k17442
15665c70613h5667C59794c74066C79749e6174p1416B9881g776B39080c0704A17751
$$ plain form
15653 -36402 23083 61139 -64086 -57718 101045 29796 -282177 -212841 162744 244406 -89836
15641 33061 32852 -99070 -348708 65622 201303 -121045 -198538 276963 -45094 -93155 69229
15629 445 93223 -38115 -140141 -152731 -255836 9305 8765 -85739 314 25504 -261523 -196532
15617 -196532 -30646 16764 -162254 -72962 -115762 141627 -85409 -297501 40178 -13205 -171771
15606 -171771 261564 -296913 3898 -103100 -233567 178951 54833 -411734 130259 -297299
15595 35712 -271985 234379 -65447 -49807 251499 92278 62070 67521 -103641 51610 -61278
15583 -67406 -23391 -101331 -141320 -195514 -91986 -19801 -22951 -216749 -66962 -29839 2838 -120554
15570 -95846 146749 -129804 93805 -295401 28358 157094 3032 -37387 183712 -336181 -370934
$$ packed form
15653c6402B3083L8056f4086O368A01045B9796b82177O9336A62744Q1662h9836
15641C3061k09i9070k49638F5622J35681a21045p7493B76963d5094m8061F9229
15629D45R2778c8115j02026j2590j03105I305n40h5739C14K5190b61523O4991
15617a96532c0646A6764a62254g2962m2800A41627h5409k12092D0178a3205j58566
15606a71771B61564b96913C898a03100j30467A78951E4833d11734A30259b97299
15595C5712b71985B34379f5447J5640B51499I2278l0208N451a03641E1610f1278
15583f7406b3391p7940l9989n4194i1986a9801l150j93798f6962b9839B838a20554
15570i5846A46749a29804I3805b95401B8358J28736C032c7387A83712c36181l4753
$$ plain form
15559 -370934 5918 -286079 -101251 168862 249609 76866 -110277 271493 81646 -57783 139067
15547 70176 262934 -182766 20481 -27068 -148661 -107974 -13357 29711 -256038 -6910 13623
15535 -130633 -33986 -175252 -54406 -205619 51958 -123635 -127732 -20386 -29212 -267682 201133
15523 195356 -116895 125293 8527 -102525 -373899 -351705 188793 415378 52458 16651
15512 -48875 -207255 73182 21648 176373 118739 55081 -115839 -68925 -62302 246954 43479
15500 92145 -156211 233805 -112909 179936 229096 -85602 351887 390392 60372 -218555
15489 -103447 212440 -28107 171019 51630 -3851 207585 -1101 186561 8795 214318 223672
15478 223672 217487 342494 -100227 34235 -15783 136946 177824 29739 140416 125377 53519
$$ packed form
15559c70934E918b86079a01251A68862Q0747G6866a10277B71493H1646e7783A39067
15547G0176J92758a82766B0481b7068j21593M0687a3357B9711b56038f910A3623
15535a30633c3986j41266e4406j51213E1958a23635m097b0386q826k38470B01133
15523A95356a16895A25293H527a02525k71374K2194A88793K26585E2458A6651
15512d8875j58380G3182B1648J54725n7634E5081a15839M6914O623B46954D3479
15500I2145a56211B33805a12909A79936M9160h5602C51887L8505F0372b18555
15489a03447B12440b8107A71019E1630c851B07585a101A86561H795K05523R354
15478B23672o185J25007a00227C4235a5783A36946M0878B9739J10677j5039E3519
$$ plain form
15466 12579 -149908 238074 97440 -3992 307897 69121 238954 261275 331316 466807 423944
15455 423944 407229 153955 -107292 130558 152526 342089 -179495 28305 9526 -218479
15444 136582 137463 -272789 100406 -30187 29592 28754 180548 186125 -83785 390031 89384 -127336
15431 -3110 355076 406720 345548 272575 774987 501195 908088 857016 551450 676997 30341
15419 389765 31654 197625 94315 131888 144728 198252 -36714 14128 -23892 225315 15545
15407 -36217 -16591 -102677 -79788 -201539 -139047 160135 -220178 277451 -223490 -132770 -102042
15396 -102042 -136351 -140976 -19573 -197845 -103608 8534 -56173 187825 -81742 35768 -158252
15384 -4112 16450 -56427 16567 -140567 -183303 -343156 16733 -188165 175105 155209 -178259
$$ packed form
15466A2579a49908B38074I7440c992C07897F9121J69833K2321P0041J35491m2863
15455D23944j6715A53955a07292A30558K1968J89563a79495B8305I526b18479
15444A36582Q81b72789A00406c0187B9592q38J51794N577h3785C90031H9384a27336
15431c110C55076N1644o1172p2973N02412k73792M06893n1072l05566J25547C0341
15419C89765C1654J65971I4315L7573J2840N3524c6714A4128b3892B25315A5545
15407c6217a6591q6086K2889j21751O2492A60135b20178B77451b23490R0720L0728
15396a02042l4309m625a9573j78272R4237H534e6173A87825h1742C5768a58252
15384d112A6450e6427A6567a40567m2736j59853A6733a88165A75105j9896a78259
$$ plain form
15372 78904 129045 119170 80434 -350370 50379 147982 304620 61654 -220753 -106249 92260
15360 69697 333874 182224 49489 424662 172730 106384 107412 -2179 208693 81514 -280
15348 289392 84039 -109627 154697 290027 37041 -107197 99893 79277 219302 -4711 344276
15336 235357 41499 389465 782 -45523 161147 204496 241907 320317 427655 -113462 167455
15324 -14018 -82318 397524 -143152 248811 124989 425075 165136 -70820 -19772 41165
15313 -71596 310203 185573 123933 230016 159769 16116 380223 206477 121452 60566 424095
15302 424095 -7806 -52474 39435 66635 79193 36685 9651 183585 68495 129082 320237
15291 320237 209179 -12747 -109742 496780 164436 -92955 22105 209113 16452 93747 -218079
$$ packed form
15372G8904N0141r875l8736c50370E0379R7603J56638F1654b20753a06249I2260
15360F9697K64177j51650D9489L75173A72730o6346J028b179B08693H1514b80
15348B89392H4039a09627A54697J35330C7041a07197I9893k0616J40025d711C44276
15336B35357D1499L47966G82d5523A61147M3349L7411P8410J07338a13462A67455
15324a4018o8300C97524a43152B48811j23822L00086A65136g0820a9772D1165
15313g1596C10203j24630o1640J06083p0247A6116L64107j73746q5025F0566L63529
15302D24095g806m4668C9435K7200J2558C6685I651J73934F8495O0587J91155
15291C20237j11058a2747r6995D96780A64436i2955B2105J87008A6452P7295b18079
$$ plain form
15279 160772 -14880 39450 117538 -181475 -102387 -73007 -250027 62089 -225969 118458 -175156
15267 157116 206188 154403 77131 -12547 24069 -65814 55525 -14767 -75073 -73269 322701
15255 -55883 120 87842 -26067 127162 217359 -160419 -88409 -41585 318201 -57685 42614
15243 140985 194105 -5844 34366 88254 130970 215842 -40170 -31644 61194 463032 257940
15232 257940 205489 -79213 425996 786144 1363842 1203999 1139542 1706412 496909 458299
15222 458299 266164 98531 145858 143858 231583 142047 -138470 106187 118185 -62068 88324
15210 48059 -37444 -30622 -73505 80713 -19714 98936 -76188 -189579 443947 -35984 -40627 -76614
15198 -76614 5114 45102 91740 281154 -254327 90825 44758 -14616 -236169 -148918 268111
$$ packed form
15279A60772a4880C9450P8088a81475P9088K9380j77020F2089b25969A18458a75156
15267A57116M9072n1785G7131a2547B4069f5814E5525a4767o0306J804C22701
15255e5883A20Q7722b6067A27162R0197a60419P2010d1585C18201e7685D2614
15243A40985N3120e844C4366N3888M2716Q4872d0170Q526F1194M01838k05092
15232B57940n2451g9213D25996L60148N77698j59843o4457N66870D96909l8610
15222D58299j92135I8531M7327k000Q7725q9536a38470A06187J1998f2068H8324
15210D8059c7444O822m2883H0713a9714I8936g6188j13391D43947c5984m643l5987
15198g6614E114L9988M6638J89414b54327I0825D4758a4616k21553Q7251B68111
$$ plain form
15186 110977 -206443 17336 152981 -183178 -29884 61367 251887 135796 -132570 -12416
15175 -18544 381253 -154357 94484 199235 279794 -61900 -329072 -294048 263242 3597 133058
15164 133058 -62898 -23423 47998 257570 -46351 340666 93242 478418 -55432 295383 149655
15153 149655 325910 -153746 292033 25926 45644 87111 120617 -55255 418627 121094
15142 102263 -99624 79684 32794 449410 -49140 102336 138252 8652 259523 -150119 72828
15130 260844 378781 182088 33686 14395 367156 261530 290003 129437 441452 -49307
15119 -142869 222736 -1432 27897 -24771 108621 -5079 435130 126680 -72295 121176 261908
15108 261908 250677 178181 145131 124794 533826 295684 417966 428495 48114 -40024 39803
$$ packed form
15186A10977b06443A7336J35645a83178b9884F1367J90520j16091a32570a2416
15175a8544C81253a54357I4484J04751Q0559f1900k67172L5024B63242C597J29461
15164A33058f2898b3423D7998K09572d6351C40666I3242L85176e5432B95383j45728
15153A49655J76255a53746B92033B5926J9718M1467L3506e5255D18627A21094
15142A02263i9624G9684C2794M16616d9140A02336L5916H652K50871a50119G2828
15130B60844J17937A82088C3686A4395L52761j05626K8473A29437L12015d9307
15119a42869B22736a432B7897b4771A08621e079D35130A26680g2295A21176J40732
15108B61908j1231p2496l3050k0337M09032k38142J22282J0529D8114d0024C9803
$$ plain form
15096 -37125 -169227 119471 -25039 131876 -70963 56692 154580 -303422 143358 192379 -170237
15084 136584 328212 195169 102545 133804 -190400 20189 -8333 164422 54097 107558 -28100
15072 73773 330006 356830 133024 121080 146328 -278895 205313 296558 174317 523262
15062 523262 2526 -78979 278797 -126409 -100143 116580 82277 133130 404440 391358 -264516
15050 91790 137317 208523 1232 292596 424504 -222568 261484 323896 351666 224119 685360
15039 685360 228677 159619 181391 180501 198950 252742 383932 192265 252813 529467 105674
15027 366725 331694 208911 321372 190273 319907 340080 229694 131268 112997 284867
15017 284867 613528 662735 420936 600425 649430 751510 784762 574428 814135 213595
$$ packed form
15096c7125j32102A19471b5039A31876g0963E6692R7888c03422A43358M9021a70237
15084A36584J91628j33043r2624L1259a90400B0189h333A64422E4097N3461b8100
15072G3773K56233K6824A33024j1944K5248b78895B05313R1245j22241L48945
15062E23262B526g8979B78797a26409K6266A16580l4303N0853K71310j3082b64516
15050I1790M5527P1206A232K91364J31908b22568B61484O2412K7770j27547M61241
15039F85360B28677o9058K1772q90J8449N3792J31190j91667O0548K76654A05674
15027C66725l5031j22783J12461j31099J29634K0173j10386r8426j8271J71870
15017B84867L28661M9207k41799J79489M9005J02080L3252k10334K39707B13595
$$ plain form
15006 590014 316803 199212 372827 493950 487358 593328 429372 403970 514219 506789
14996 506789 96638 564877 186489 413875 714434 -244280 297949 74109 348551 448936
14986 448936 161262 276277 177900 415640 360978 -28508 377191 32775 367127 356102
14976 356102 618150 272124 196979 242502 362777 496779 410310 338122 484819 367407
14966 367407 713330 790770 551407 577346 534243 467583 418641 378714 276381 446279 409444
14955 409444 372201 362366 379407 264288 205351 380542 235546 514601 258506 91693 482498
14944 482498 425662 172151 361032 367570 48251 451708 248811 241817 -45595 512413 670080
14933 670080 532477 -23434 513357 282404 372598 470326 621571 237007 302597 267355
$$ packed form
15006E90014k73211j17591J73615J21123o592J05970j63956k5402J10249p430
14996E06789I6638M68239A86489K27386L00559b44280B97949G4109K74442J00385
14986D48936A61262J15015r8377K37740n4662b8508C77191C2775L34352j1025
14976C56102K62048B72124p5145M5523J20275J34002q6469p2188J46697j17412
14966C67407L45923P7440k39363K5939m3103o6660m8942l9927j02333J69898l6835
14955D09444l7243r835J7041j15119n8937J75191j44996K79055k56095I1693L90805
14944D82498n6836A72151J88881O538D8251M03457k02897o994d5595E12413J57667
14933F70080j37603b3434E13357k30953R0194R7728J51245B37007O5590l5242
$$ plain form
14923 267355 487255 302218 674261 638577 587285 242638 361320 535757 728739 914511
14913 914511 1042248 781721 1080420 1305537 1219243 1596237 1320797 1388100 1274069 1398454
14903 1398454 1821730 1667663 1478606 1435638 1650291 1314622 1005997 1085289 1006748 879591
14893 879591 749098 533086 598251 605141 273983 251880 394444 520628 465904 392390 248868
14882 248868 434972 453988 230423 361484 369152 281053 445003 326924 455089 210884
14871 382233 677647 459587 513363 893099 1023302 622905 505614 798312 814809 858800
14861 858800 867946 644903 941446 373611 277405 640490 445859 781939 621186 476280
14851 476280 415909 622679 615929 506700 355124 295340 319301 474312 528365 380474 132745
$$ packed form
14923B67355K19900j85037L72043l5684n1292B42638J18682J74437J92982J85772
14913I14511J27737k60527K98699K25117q6294L76994k75440O7303j14031J24385
14903A398454M23276j54067j89057m2968K14653l35669l08625P9292p8541j27157
14893H79591j30493k16012O5165O890B73983k2103J42564J26184n4724p3514j43522
14882B48868J86104J9016k23565J31061P668q8099J63950j18079J28165B10884
14871C82233K95414k18060N3776L79736J30203m00397j17291K92698J6497M3991
14861H58800R146k23043K96543C73611r6206L63085j94631L36080j60753j44906
14851D76280o0371K06770o750j09229j51576n9784K3961J55011N4053j47891A32745
$$ plain form
14839 215184 273475 429785 443258 433449 295936 197486 253648 550169 327183 576188 445980
14828 445980 398064 745622 590168 1105108 790463 1083911 871614 1011919 912582 506770
14818 506770 846600 748255 341831 774326 656710 486620 542770 441992 302193 793677
14808 793677 560743 492931 636298 465563 742845 516951 517997 425010 707740 585088
14798 585088 553475 625615 587513 487918 651128 506004 725773 722593 754127 385754 1038543
14787 1038543 643656 944922 744990 465704 687652 486788 858938 571039 426470
14778 426470 551654 342770 519858 56214 331500 732839 862009 777276 805943 704362
14768 704362 1053093 549603 462500 687644 349127 535803 554688 532424 636506 671235
$$ packed form
14839B15184N8291J56310J3473r809j37513r8450N6162K96521k22986K49005j30208
14828D45980m7916L47558j55454N14940l14645K93448k12297J40305r9337m05812
14818E06770L39830r8345C41831M32495j17616j70090N6150j00778j39799M91484
14808G93677k32934o7812J43367j70735K77282k25894J046r2987K82730j22652
14798E85088l1613P2140l8102r9595J63210j45124K19769l180L1534l68373O52789
14787A038543l94887L01266j99932k79286K21948k00864L72150k87899j44569
14778D26470J25184k08884J77088E6214K75286M01339J29170q4733K8667j01581
14768G04362L48731n03490q7103K25144l38517J86676J8885k2264J04082L4729
$$ plain form
14758 671235 1222117 969523 939954 771778 841900 339329 501602 480933 699745 705071
14748 705071 514322 397014 545550 725564 313089 275124 595862 606066 290652 827822
14738 827822 600620 802191 854949 586199 648737 569918 479160 721630 540127 440260
14728 440260 648398 657666 724589 903206 478058 258354 448199 739257 803246 679133
14718 679133 514845 615813 705177 752502 810938 833797 1064403 1485336 1427273 1573107
14708 1573107 1595068 998907 1090718 729533 990821 1094833 865134 652714 1082857 873827
14698 873827 796717 935605 744556 969575 645801 793456 1109643 836769 1199096 1128057
14688 1128057 1174795 1292339 1425346 1468374 1617759 1235788 1654010 1581441 1327392 1052723
$$ packed form
14758F71235N50882k52594k9569j68176P0122C39329J62273k0669K18812N326
14748G05071j90749j17308J48536J80014C13089l7965L20738J0204B90652N37170
14738H27822k27202K01571N2758k68750O2538p8819r0758K42470j81503r9867
14728D40260K08138R268O6923J78617m25148k19704J89845K91058O3989j24113
14718F79133j64288J00968Q9364M7325N8436K2859K30606M20933n8063J45834
14708A573107K1961n96161R1811l61185K61288J04012k29699k12420M30143k09030
14698H73827p7110J38888j91049K25019l23774J47655L16187k72874L62327p1039
14688A128057M6738J17544J33007M3028J49385l81971M18222p2569k54049k74669
$$ plain form
14678 1052723 941732 703708 968341 808825 546902 866749 887503 786307 961557 965767
14668 965767 844541 1048847 758444 491050 664580 998033 1164804 838257 645831 829772
14658 829772 700254 801559 974374 951930 572484 777047 696477 809058 844132 981480
14648 981480 735405 1246780 934216 1059371 1046470 717980 829395 725824 1004342 978382
14638 978382 863419 1162059 1341882 1134763 1222342 1151184 1043131 855806 1453568 999313
14628 999313 971000 1124568 1195611 986886 844937 1246448 1110086 1215856 1273961 928235
14618 928235 1209532 1194748 1162647 1160421 1264060 943629 1245909 1018128 1144699 1118914
14608 1118914 1070596 951572 1037494 1252631 1523902 955477 1170916 1239512 1324052 1005272
$$ packed form
14678A052723j10991k38024K64633j59516k61923L19847K0754j01196J75250M210
14668I65767j21226K04306k90403k67394J73530L33453J66771l26547j92426J83941
14658H29772j29518J01305J72815k2444l79446K04563q0570J12581L5074J37348
14648I81480k46075N11375l12564J25155j2901l28490J11415j03571K78518k5960
14638I78382j14963K98640J79823k07119Q7579p1158j08053j87325N97762m54255
14628I99313k8313J53568P1043k08725j41949M01511j36362J05770N8105l45726
14618I28235K81297j4784l2101k226J03639l20431L02280k27781J26571k5785
14608A118914m8318j19024Q5922K15137K71271n68425K15439O8596Q4540l18780
$$ plain form
14598 1005272 1070404 1466728 1263617 1472967 1217646 1297400 1403918 1484265 1179456 1393686
14588 1393686 1592706 1611550 1226910 1202626 1268997 1460900 1448650 1328421 1290647 1289818 1682281
14577 1682281 1407435 1579539 1438214 1401297 1309853 1429305 1800996 1522917 1575504 1422515
14567 1422515 2040764 1606980 1503442 1425394 1872204 1930384 1723284 1783615 1791790 1856815
14557 1856815 1710544 2193321 1694876 1911839 2062256 1743242 2072876 2267971 2193430 2149946
14547 2149946 2305609 2386990 2532232 2491232 3046492 2830107 3266258 3672532 3842512 4054016
14537 4054016 4477755 5303905 6733451 8966891 12747126 20113478 31137197 27888638
14529 27888638 17695681 11689270 7887344 5888083 4231121 4537971 4788412 3538015
$$ packed form
14598A005272O5132L96324k03111K09350k55321P9754J06518Q0347l04809K14230
14588A393686J99020J8844l84640k4284O6371J91903j2250j20229l7774q29L92463
14577A682281k74846J72104j41325l6917r1444J19452L71691k78079N2587j52989
14567A422515O18249m33784j03538p8048M46810N8180k07100O0331Q175O5025
14557A856815j46271M82777m98445K16963J50417l19014L29634J95095p4541m3484
14547B149946J55663Q1381J45242m1000N55260k16385M36151M06274J69980K11504
14537D054016M23739Q26150J429546K233440L780235P366352J1023719l248559
14529B7888638j0192957o006411l801926j999261j656962L06850K50441j250397
$$ plain form
14521 3538015 2664481 2791144 2351118 2062348 1783610 2038333 2173286 2472378 2023607
14512 2023607 1974096 2103179 2240158 1762271 2138592 1982708 2277338 2393792 2224671 2267346
14502 2267346 2328704 2340449 2326151 2444262 2295400 2319417 2502520 2146345 2628669 2637243
14492 2637243 2498918 2478718 2802547 2815743 2705873 2851962 2642535 3037592 2564215 2756418
14482 2756418 2638278 2829855 2928829 2960190 3144763 2805432 3341489 3102640 2905225 3091094
14472 3091094 3109950 3435579 3112854 3388585 3433892 3398050 3826761 3279278 3544052 3653521
14462 3653521 3537528 3594331 3811994 3733685 3982930 4010779 3925473 4142288 3753113 4196590
14452 4196590 3831501 4095785 4172731 4367125 4268096 4323297 4572682 4221719 4745998 4436323
$$ packed form
14521C538015q73534J26663m40026k88770k78738K54723J34953K99092m48771
14512B023607m9511J29083J36979m77887L76321j55884K94630J16454j69121M2675
14502B267346O1358J1745j4298J18111j48862K4017J83103l56175M82324Q574
14492B637243j38325k0200L23829J3196j09870J46089k09427L95057m73377J92203
14482B756418j18140J91577R8974L1361J84573l39331N36057k38849j97415J85869
14472C091094J8856L25629l22725K75731M5307l5842M28711n47483K64774J09469
14462C653521j15993N6803K17663p8309K49245K7849q5306K16815l89175M43477
14452D196590l65089K64284P6946J94394r9029N5201K49385l50963N24279l09675
$$ plain form
14442 4436323 4567944 4747570 4436615 4461696 4831775 4935632 4718380 4903557 4737759 4834521
14432 4834521 4933267 5242720 5243128 5500243 5584763 5506539 5549639 5827184 5427257 5662568 5660445
14421 5660445 5702507 5919098 6167331 6257817 6379875 6059808 6361682 6506267 6746758 6375829
14411 6375829 6697188 6802597 6862355 6944651 7006818 7431020 7602721 7649419 7717763 7829668
14401 7829668 7981285 8424679 8119622 7886205 7998478 8364621 8206976 8613469 8724232
14392 8724232 8702131 9259198 9097253 9364566 9557726 9772353 9775127 9876904 9897980 9756587
14382 9756587 10114656 10057583 10487381 10648261 10750009 11054472 11006912 11339712 11599193 11803434
14372 11803434 12025412 12288949 12563567 12620938 12886823 13062532 13307737 13784034 13710483 14472992
$$ packed form
14442D436323J31621J79626l10955K5081L70079J03857k17252J85177j65798R6762
14432D834521R8746L09453M08K57115Q4520p8224M3100K77545l99927K35311k123
14421E660445M2062K16591K48233R0486J22058l20067L01874J44585K40491l70929
14411F375829L21359J05409N9758Q2296O2167M24202J71701M6698O8344J11905
14401G829668J51617M43394l05057k33417J12273L66143j57645M06493J10763
14392H724232k2101N57067j61945K67313J93160K14627K774J01777K1076j41393
14382I756587L58069n7073M29798J60880J01748L04463m7560L32800K59481K04241
14372A1803434K21978K63537K74618N7371K65885J75709K45205M76297p3551P62509
$$ plain form
14362 14472992 14141121 14773940 14913347 15581754 15730124 15942366 15932108 16307910 16734889
14353 16734889 16837246 17213871 17722179 18148819 18607903 18906753 19672989 19907192 20472244
14344 20472244 20428377 21310373 21641721 21972947 22620687 23256805 23583679 24186368 24782258
14335 24782258 25607588 25942943 26879161 27644791 28251723 29069009 29592158 30447636 31302062
14326 31302062 32353340 33127883 33548756 35245802 35868652 36848645 37856750 39412086 40627975
14317 40627975 42045426 43259733 44494718 45755683 47572822 49090186 50630577 52768391
14309 52768391 54386867 56344029 58258223 60602841 62946832 65090901 67562720 70037991
14301 70037991 73019451 75656559 78973977 82284247 85685673 89193728 93282696 97401900
$$ packed form
14362A4472992l31871O32819J39407O68407J48370K12242j0258L75802M26979
14353A6734889J02357L76625N08308M26640M59084K98850P66236K34203N65052
14344B0472244m3867Q81996L31348L31226O47740O36118L26874O02689N95890
14335B4782258Q25330L35355R36218P65630O06932Q17286N23149Q55478Q54426
14326C1302062J051278P74543M20873J697046O22850R79993J008105J555336J215889
14317D0627975J417451J214307J234985J260965J817139J517364J540391K137814
14309E2768391J618476J957162J914194K344618K343991K144069K471819K475271
14301G0037991K981460K637108L317418L310270L401426L508055M088968M119204
$$ plain form
14293 97401900 101569782 106434568 111337095 116513474 122368781 128280636 134906375 141678458
14285 141678458 149025657 156529059 164493406 172732072 182149190 192146286 202113771 213249212
14277 213249212 224815785 236670300 249783657 263312047 277253257 291739444 306447927
14270 306447927 321163984 336257455 351900337 367032948 381786532 395344837 408056575
14263 408056575 419746881 430686196 440467866 449667107 457813982 462344398 464179416 464565268
14255 464565268 463556659 456474767 450163578 443959574 438102671 431430851 419178533 404998663
14247 404998663 390410184 375538383 360854003 346270218 331427362 316981774 302007418
14240 302007418 288056873 274111111 261375510 248677608 236753622 224366376 212859865
$$ packed form
14293I7401900M167882M864786M902527N176379N855307N911855O625739O772083
14285A41678458P347199P503402P964347Q238666R417118R997096R967485J1135441
14277B13249212J1566573J1854515J3113357J3528390J3941210J4486187J4708483
14270C06447927J4716057J5093471J5642882J5132611J4753584J3558305J2711738
14263D08056575J1690306J0939315R781670R199241Q146875M530416J835018L85852
14255D64565268j008609p081892o311189o204004n856903o671820j2252318j4179870
14247D04998663j4588479j4871801j4684380j4583785j4842856j4445588j4974356
14240C02007418j3950545j3945762j2735601j2697902j1923986j2387246j1506511
$$ plain form
14233 212859865 201283397 190671726 180506127 171473684 162646853 154671560 146902336
14226 146902336 139547560 133165755 126614205 121235179 115616488 110475393 105302931 100925317
14218 100925317 96439006 92643158 88807031 85371502 81680433 78757336 75828580 72421077
14210 72421077 69630768 67366534 64744148 62351220 60287531 58269826 56256596 54549301
14202 54549301 52561855 50731259 49501352 47888639 46439853 44656196 43501022 42505845
14194 42505845 41040211 39673429 39043426 37868406 36886700 35816487 34914662 33821034
14186 33821034 32727983 32184330 31564087 30720154 29704554 28891426 28198525 27871248 26789013
14177 26789013 26294521 25536563 24927952 24323355 23781080 23321115 22666725 22177387 21661757
$$ packed form
14233B12859865j1576468j0611671j0165599r032443q826831p975293p769224
14226A46902336p354776o381805o551550n379026n618691n141095n172462m377614
14218A00925317m486311l795848l836127l435529l691069k923097k928756l407503
14210G2421077k790309k264234k622386k392928k063689k017705k013230j707295
14202E4549301j987446j830596j229907j612713j448786j783657j155174r95177
14194D2505845j465634j366782o30003j175020r81706j070213r01825j093628
14186C3821034j093051n43653o20243q43933j015600q13128o92901l27277j082235
14177B6789013m94492p57958o08611o04597n42275m59965o54390m89338n15630
$$ plain form
14168 21661757 21367004 20836382 20380529 20245208 19449968 19043760 18869619 18704302 17779789
14159 17779789 17845291 17201274 16718311 16323890 16156412 15870182 15468725 15115246 15296892
14150 15296892 14543946 14484685 14122808 13722664 13950949 13494565 13404323 12979665 12773965 12627444
14140 12627444 12194023 12154783 11700651 11775130 11508202 11420948 11392771 10754892 10688726 10686992
14130 10686992 10359004 10301789 10213267 10194126 9873843 9946222 9421807 9397822 9150073 9038584
14120 9038584 9078876 9030630 8571973 8624030 8355631 8164975 8149843 8087644 7810159 7893384
14110 7893384 7469234 7540710 7581590 7465375 7672940 7299407 6991874 7414437 7022699 6739488
14100 6739488 6750424 6531026 6881556 6299187 6342827 6551362 6329089 6486204 6516213 6054307
$$ packed form
14168B1661757k94753n30622m55853j35321p95240m06208j74141j65317r24513
14159A7779789O5502o44017m82963l94421j67478k86230m01457l53479J81646
14150A5296892p52946n9261l61877m00144K28285m56384r0242m24658k05700j46521
14140A2627444m33421l9240m54132P4479k66928q7254k8177o37879o6166j734
14130A0686992l27988n7215q8522j9141l20283P2379n24415k3985k47749j11489
14120I038584M0292m8246m58657N2057k68399j90656j5132o2199k77485Q3225
14110G893384m24150P1476M0880j16215K07565l73533l07533M22563l91738k83211
14100F739488J0936k19398L50530n82369M3640K08535k22273J57115L0009m61906
$$ plain form
14090 6054307 5964909 5649363 6013490 5928004 5885792 5692726 5512738 5507005 5521341 5341423
14080 5341423 5287734 5274471 5168590 5383618 5221817 5086139 5083279 4471703 4909471 4813116
14070 4813116 4718893 5008682 4544698 4397082 4425632 4493988 4537114 4573001 4570320 4243002 4459212
14059 4459212 4221251 3975715 4293491 3761932 3950094 4344504 4150520 4201973 3670517 3698069
14049 3698069 3991317 3673117 4067456 4023205 4037685 3891865 3628365 3722802 3850535 3643367
14039 3643367 3518160 3717941 3587363 3666730 3483425 3173778 3691116 3321601 3276700 3479922
14029 3479922 2874588 3191612 3020634 3067595 3262366 2905396 2847423 3096202 2865303 3054892
14019 3054892 3146225 2894312 2877089 3213159 2856481 2966620 2807171 2760414 2850154 2810066
$$ packed form
14090F054307q9398l15546L64127q5486m2212j93066j79988n733J4336j79918
14080E341423n3689j3263j05881K15028j61801j35678k860o11576M37768r6355
14070D813116r4223K89789m63984j47616K8550O8356M3126L5887k681l27318K16210
14059D459212k37961k45536L17776n31559J88162L94410j93984N1453n31456K7552
14049C698069K93248l18200L94339m4251J4480j45820k63500R4437J27733k07168
14039C643367j25207J99781j30578P9367j83305l09647N17338l69515m4901K03222
14029C479922o05334L17024j70978M6961J94771l56970n7973K48779k30899J89589
14019C054892R1333k51913j7223L36070l56678J10139j59449m6757Q9740m0088
$$ plain form
14009 2810066 2591303 2433091 2257920 2825529 2454872 2311338 2461416 2671851 2312939
14000 2312939 2481075 2394444 2546124 2177810 2316483 2450191 2435429 2185435 2186859 2119054
13990 2119054 2066155 2277192 2407976 2222377 1959695 2107783 2065457 2238909 2114655 2280763
13980 2280763 2416640 2578416 2573804 2821845 3342108 4030282 5510544 8456282 14979328
13971 14979328 27625690 29581657 21421267 14865852 10935019 7581540 5696391 4784796
13963 4784796 4207586 3535479 3311870 3120541 2829884 2899930 2711357 2476777 2214212 2412142
13953 2412142 2380206 2782351 2364641 2012503 2092405 1916252 2172197 1617598 1925571 2025151
13943 2025151 1829608 2052845 2176747 2090718 1964245 1739240 1825268 1737565 1973274 1632773
$$ packed form
14009B810066k18763j58212j75171N67609l70657j43534J50078K10435l58912
14000B312939J68136q6631J51680l68314J38673J33708j4762k49994J424o7805
13990B119054n2899K11037J30784j85599k62682J48088m2326J73452j24254J66108
13980B280763J35877J61776m612K48041N20263O88174J480262K945738O523046
13971A4979328J2646362J955967q160390o555415l930833l353479j885149r11595
13963D784796n77210o72107k23609j91329k90657P0046j88573k34580k62565J97930
13953B412142l1936M02145m17710l52138P9902j76153K55945n54599L07973R9580
13943B025151j95543K23237J23902q6029j26473k25005Q6028q7703K35709l40501
$$ plain form
13933 1632773 1988270 2161834 1715865 2035357 1907179 1609607 1583332 1642296 1770409 2081102
13923 2081102 1884573 1714174 1419951 1706246 1587820 1789648 1460892 1717156 1559746
13914 1559746 1325649 1484892 1554234 1415090 1201135 1524644 1340556 1528326 1583015 1297155
13904 1297155 1570706 1641468 1409513 1522757 1807473 1337994 1307387 1446972 1465814 1493333
13894 1493333 1212033 1273173 1482249 1615771 1453710 1059743 1467517 1102686 1238388 1516062
13884 1516062 1051269 1385709 1250146 1524364 1328643 1216018 1661231 1341288 1299897 1178415
13874 1178415 1363988 1347667 944440 1142096 1072582 1226020 1105491 1221061 982690 1222252
13864 1222252 1182480 1280642 1402542 1073418 971320 909412 1361031 857892 1085360 1074271
$$ packed form
13933A632773L55497J73564m45969L19492j28178k97572k6275N8964J28113L10693
13923B081102j96529j70399k94223K86295j18426K01828l28756K56264j57410
13914A559746k34097J59243O9342j39144k13955L23509j84088J87770N4689k85860
13904A297155K73551P0762k31955J13244K84716m69479l0607J39585J8842K7519
13894A493333k81300O1140K09076J33522j62061l93967M07774l64831J35702K77674
13884A516062m64793L34440j35563K74218j95721j12625M45213l19943m1391j21482
13874A178415J85573j6321m03227J97656o9514J53438j20529J15570k38371K39562
13864A222252l9772R8162J21900l29124j02098o1908M51619n03139K27468j1089
$$ plain form
13854 1074271 1145206 1016793 926846 1153326 1169987 970051 1322108 966118 852120 1062816
13844 1062816 988932 1026194 1102786 1400805 965751 993659 975886 938045 712233 703274 1017672
13833 1017672 1053226 895649 894757 770822 450637 1137740 844208 775005 972839 1036033
13823 1036033 953066 819736 792957 894349 474296 1283720 1046066 672337 889402 1062221
13813 1062221 783582 877511 747360 646877 812768 732331 734663 702675 823185 800612
13803 800612 932897 662294 583086 801521 930181 1088230 966757 644995 687831 743674
13793 743674 686685 835693 1058311 724583 700052 815947 824217 846543 605210 598337 721870
13782 721870 699297 392454 685765 1006526 686703 589632 783252 710493 679655 665299
$$ packed form
13854A074271P0935j28413q9947K26480J6661j99936L52057l55990j13998K10696
13844A062816p3884L7262P6592K98019m35054K7908j7773l7841k25812q959L14398
13833A017672L5554j57577q92j23935l20185O87103k93532o9203J97834O3194
13823A036033q2967j33330k6779J01392m20053Q09424k37654l73729K17065J72819
13813A062221k78639R3929j30151j00483J65891q0437K332l1988J20510k2573
13803H00612J32285k70603p9208K18435J28660J58049j21473l21762M2836N5843
13793G43674n6989J49008K22618l33728k4531J15895Q270K2326k41333o873J23533
13782G21870k2573l06843K93311L20761l19823r7071J93620p2759l0838j4356
$$ plain form
13772 665299 733806 966871 711798 595200 974009 696401 502033 780351 881176 810505
13762 810505 701575 479290 612166 973317 713820 951436 790030 701812 672249 917591
13752 917591 952771 920246 594101 676487 627383 658738 887389 299196 817294 574041
13742 574041 710638 806260 649402 664634 506343 364074 764945 377467 826755 656014
13732 656014 528522 705176 604962 488956 841078 773809 747392 842647 482924 769334
13722 769334 473852 943250 299881 619330 511659 631557 450416 381503 706542 265117
13711 298451 268597 350139 318591 575424 146369 578265 625256 628008 504292 814921 609002
13700 609002 642936 395760 264201 573263 649737 357598 572227 620143 531482 624821
$$ packed form
13772F65299O8507K33065k55073j16598L78809k77608j94368K78318J00825p0671
13762H10505j08930k22285J32876L61151k59497K37616j61406q8218k9563K45342
13752I17591L5180l2525l26145Q2386m9104L1355K28651B99196N18098k43253
13742E74041J36597R5622j56858J5232j58291j42269M00871C77467M49288j70741
13732F56014j27492J76654j00214j16006L52122o7269k6417R5255l59723K86410
13722G69334k95482M69398B99881L19449j07671J19898j81141o8913L25039B65117
13711B98451k9854Q1542l1548K56833A46369M31896M6991K752j23716L10629k05919
13700F09002L3934k47176j31559L09062P6474k92139K14629M7916q8661R3339
$$ plain form
13690 624821 599389 672841 672851 507030 762661 621707 112425 521487 663819 722795 632958
13679 632958 603767 330593 285976 324041 439337 600371 504385 492003 123750 645703
13669 645703 418742 509985 550099 495122 570259 636886 514191 548592 420511 602803 371837
13658 371837 737713 533440 116383 584345 314935 258509 420827 302674 321572 728577
13648 728577 241921 328286 522232 396164 421485 559879 340187 553276 622534 444065
13638 444065 298247 217516 650834 242785 691320 443728 353726 495796 271387 661881
13628 661881 54156 276586 257720 112166 513317 548149 662487 579058 404621 374229
13618 374229 400989 266460 536986 115105 388612 250686 148228 499885 140525 624349
$$ packed form
13690F24821k5432P3452J0j65821K55631j40954A12425M09062J42332N8976q9837
13679F32958k9191k73174m4617L8065J15296J61034r5986j2382A23750N21953
13669F45703k26961R1243M0114n4977P5137O6627j22695L4401j28081J82292k30966
13658C71837L65876k04273A16383M67962k69410n6426J62318j18153J8898M07005
13648G28577B41921Q6365J93946j26068K5321J38394k19692K13089O9258j78469
13638D44065j45818q0731M33318B42785M48535k47592r0002J42070k24409L90494
13628F61881E4156K22430j8866A12166M01151L4832J14338q3429j74437l0392
13618C74229K6760j34529K70526A15105K73507j37926j02458L51657A40525M83824
$$ plain form
13608 624349 810709 264216 212289 527619 552153 279933 504885 541702 532224 263482
13597 468507 271656 261716 307775 270478 -51614 552065 104056 411215 426765 306780 233622
13586 233622 505543 768227 487760 319004 429258 333098 372680 255809 482546 183114
13575 550232 214512 374647 197220 347263 346634 291029 193248 259236 308049 137570 244528
13564 244528 219771 229353 -227810 114633 138460 189067 65998 385930 382180 309059 247807
13553 247807 264767 279437 65040 495326 300717 209281 317223 24787 283294 478079
13543 478079 361881 323558 153500 393434 239751 328619 518299 211914 337465 225062
13533 225062 -152061 486828 446549 228442 379059 386237 538051 471318 255538 116580
$$ packed form
13608F24349J86360B64216n1927L15330K4534k72220K24952L6817r478B63482
13597D68507j96851r940M6059l7297e1614E52065A04056L07159J5550j19985p3158
13586B33622K71921K62684k80467j68756J10254r6160L9582j16871K26737A83114
13575E50232B14512J60135j77427J50043o29n5605r7781O5988M8813A37570J06958
13564B44528k4757R582b27810A14633K3827N0607F5998L19932l750p3121o1252
13553B47807J6960J4670F5040M30286j94609r1436J07942B4787K58507J94785
13543D78079j16198l8323A53500K39934j53683Q8868J89680B11914J25551j12403
13533B25062a52061D86828m0279k18107J50617P178J51814o6733k15780A16580
$$ plain form
13522 271241 256745 64094 88468 451583 210508 47678 -32449 87358 306176 105601 377705
13511 377705 546481 513452 241882 144050 149240 65654 429483 21448 139241 301047 631518
13500 631518 301327 186680 -5833 238397 85887 198878 129004 315288 554837 -73993
13489 250295 603435 325774 77225 174296 486566 140100 331282 -84477 191227 -162623
13478 360327 505649 243202 338957 148292 76792 293308 198061 635588 206562 331986
13468 331986 327358 366794 498251 614619 253964 153903 220034 339121 205545 352429
13458 352429 210433 244300 106793 194324 160395 52034 96623 267013 61818 449309 307975
13447 307975 130806 76174 262590 126336 469397 17205 414606 309358 58626 58603 370171
$$ packed form
13522B71241j4496F4094K4374L63115B10508D7678c2449H7358K18818A05601K72104
13511C77705J68776l3029B41882r7832N190F5654L63829B1448J17793J61806L30471
13500F31518C01327j14647e833B38397H5887J12991o9874J86284K39549g3993
13489B50295L53140k77661G7225R7071L12270A40100J91182h4477A91227a62623
13478C60327J45322B43202R5755A48292p1500K16516r5247M37527B06562J25424
13468C31986m628L9436J31457J16368B53964j00061O6131J19087j33576J46884
13458C52429j41996L3867A06793Q7531l3929E2034M4589J70390F1818L87491j41334
13447C07975A30806n4632J86416A26336L43061A7205L97401j05248E8626k3L11568
$$ plain form
13436 370171 27514 254745 274983 65167 124818 388744 197345 433313 169747 245885
13426 245885 143782 227685 188268 -83414 194889 222230 304799 239971 273301 282969 15441
13414 131597 301327 -41703 273866 185562 123377 243592 395501 -190186 109801 29238
13403 645516 302641 408766 209246 -178123 -99879 356842 166001 200176 219267 129377
13393 129377 47427 234718 99292 379204 -112696 34198 278213 227010 -109282 -77954
13383 -77954 -133598 -47741 585493 181690 144752 417262 -38305 331189 84372 289729 287656
13372 287656 170367 438353 375928 195239 85214 181710 220410 173758 72738 382917 208131
13361 208131 372980 38505 208553 178965 59740 283886 312980 220209 228920 390307 242798
$$ packed form
13436C70171B7514K27231K0238F5167N9651K63926j91399K35968A69747P6138
13426B45885j02103Q3903l9417h3414A94889K7341Q2569o4828L3330R668A5441
13414A31597J69730d1703B73866q8304o2185J20215J51909a90186A09801B9238
13403F45516C02641J06125j99520a78123P8244C56842A66001L4175J9091q9890
13393A29377D7427J87291I9292K79912a12696C4198K44015n1203a09282L1328
13383g7954n5644d7741E85493A81690l6938K72510c8305C31189H4372K05357k073
13372B87656j17289K67986o2425j80689H5214R6496L8700m6652G2738L10179j74786
13361B08131J64849C8505J70048k9588E9740K24146K9094r2771Q711J61387j47509
$$ plain form
13350 242798 303427 161090 286106 515576 182461 21739 146331 -114849 -137724 253515
13339 19834 363138 -125410 49056 262689 522746 79279 199822 461167 -27202 269495
13328 354022 113262 -43300 360399 100428 25047 69026 309851 135314 250176 143546
13318 143546 169385 147455 -103366 177689 407738 310036 636571 336727 221038 395646
13308 395646 155651 127648 445479 244700 352348 -60287 95849 47190 63693 85929 53330
13297 53330 192528 135367 -12894 58487 -76848 275615 -57421 289065 253717 302512 419832
13286 419832 265621 38825 478018 57997 309528 148226 303967 40453 475854 390871
13276 390871 -43856 462017 222839 -5649 15080 166081 -39288 261407 -65160 304139 79542
$$ packed form
13350B42798O0629j42337J25016K29470A82461B1739J24592a14849k2875B53515
13339A9834L43304a25410D9056K13633K60057G9279J20543K61345b7202B69495
13328C54022A13262d3300C60399A00428B5047M3979K40825A35314J14862j06630
13318A43546K5839k1930a03366A77689K30049r7702L26535k99844j15689J74608
13308C95646A55651k8003L17831k00779J07648f0287I5849D7190J6503K2236l2599
13297E3330J39198n7161a2894E8487g6848B75615e7421B89065l5348M8795J17320
13286D19832j54211C8825M39193E7997K51531A48226J55741D0453M35401q4983
13276C90871d3856D62017B22839e649A5080J51001c9288B61407f5160C04139G9542
$$ plain form
13264 490116 210496 -59516 -18908 25723 175395 151820 -51290 108063 253434 50027 40517
13253 40517 375838 212493 -162886 -80665 133957 98537 145035 106912 419561 -146452
13242 70357 267926 86117 110879 149171 126837 3317 245360 -136192 294564 55274 90536
13231 90536 130356 55438 346776 279467 13422 40918 41250 -245225 185473 -111412 98502
13219 -129682 161655 28472 190131 43631 202092 42090 -143539 60732 106116 257187
13209 257187 -88628 -115799 39916 -25220 98507 327617 275439 -180093 102749 4626 303122
13198 303122 119623 96123 471709 180630 152853 180220 118199 -63332 -389639 391819
13187 -3229 -31543 217431 -252211 211165 -189985 19195 -248287 467669 332085 79491
$$ packed form
13264D90116B10496e9516a8908B5723J49672k3575e1290A08063J45371E0027r510
13253D0517L35321j63345a62886h0665A33957l5420M6498l8123L12649a46452
13242G0357J97569H6117K4762L8292k2334C317K42043a36192B94564E5274L5262
13231I0536L9820E5438K91338o7309A3422K7496L32b45225A85473a11412I8502
13219a29682A61655B8472J61659D3631J58461D2090a43539F0732M5384J51071
13209B57187h8628k7171C9916b5220I8507K29110n2178a80093A02749D626K98496
13198C03122A19623k3500L75586A80630k7777K7367o2021f3332l26307C91819
13187c229k8314B17431b52211B11165a89985A9195b48287D67669j35584G9491
$$ plain form
13176 32748 146962 -78150 477882 -11307 138459 -82017 -50666 165109 76238 140274 -112065
13164 35182 210583 281238 56681 116208 412221 -32454 -95106 184988 -71885 125467 30331
13152 316683 -68786 -179834 76851 23840 60094 46240 25118 128701 53145 94197 133369
13141 133369 8812 -85975 282493 -154906 570046 178871 97511 210836 147877 -42918 -62075
13130 -62075 349710 155932 291536 12459 -242104 -332131 -64707 -486362 241385 1198 158570
13119 158570 395769 242433 -208034 109173 158913 63507 229021 -76297 22896 -91599
13108 59499 222016 26311 365655 -102086 -109187 -56422 -139870 25124 -18838 156262 109442
13097 109442 107721 -75644 -105175 219978 139437 -39528 -22476 116993 263994 241534 119681
$$ packed form
13176C2748J14214g8150D77882a1307A38459h2017L1351A65109G6238O4036a12065
13164C5182J75401P0655E6681N9527K96013c2454o2652A84988g1885A25467C0331
13152C16683f8786j11048G6851B3840L6254j3854k1122J03583E3145M1052L9172
13141A33369H812h5975B82493a54906E70046A78871q1360J13325o2959d2918j9157
13130f2075C49710A55932J35604A2459b42104r0027f4707m21655B41385A198J57372
13119A58570K37199j53336b08034A09173M9740F3507J65514g6297B2896i1599
13108E9499J62517B6311L39344a02086p101N2765q3448B5124a8838A56262m6820
13097A09442j721g5644k9531B19978q0541c9528J7052A16993J47001k2460A19681
$$ plain form
13085 34883 -209338 142042 176416 83393 -160797 -138679 20172 162284 -24125 -19201 -128749
13074 -128749 -373898 -48774 -80461 47170 -16799 382947 -246463 -7527 -10834 16692 -226075
13062 246161 -54957 -126380 76151 151166 138498 75391 206511 -78645 76211 355858 125215
13050 32257 298627 2483 215844 349152 61951 272914 189176 116729 -146396 12083 145090
13039 145090 392303 15501 38801 -112638 332613 -24065 84461 288461 76212 2270 -64170
13027 117290 -72487 139460 -203379 104625 325663 19762 99755 106117 -222594 67118 206293
13016 206293 -150649 53476 -244694 237838 60038 -138046 72822 96554 206802 52381
13005 168696 167269 398 15524 10428 -136215 -13091 93530 126783 19542 -82556 13262 77017
$$ packed form
13085C4883b09338A42042L4374H3393a60797K2118B0172J42112b4125M924j09548
13074a28749k45149d8774l1687D7170a6799C82947b46463g527l307A6692b26075
13062B46161e4957p1423G6151P5015j2668o3107J31120g8645G6211K79647A25215
13050C2257K66370B483K13361J33308F1951K10963q3738p2447a46396A2083J33007
13039A45090K47213A5501K3300a12638C32613b4065H4461K04000G6212B270f4170
13027A17290g2487A39460b03379A04625K21038A9762P9993O362b22594F7118J39175
13016B06293a50649E3476b44694B37838F0038a38046G2822K3732J10248E2381
13005A68696j427C98J5126n096a36215a3091I3530L3253A9542h2556A3262O3755
$$ plain form
12993 77017 197585 -151999 141494 -53928 187786 33625 -131470 302217 -27585 84610
12982 125851 224499 -76040 -178816 180829 287086 386687 -231736 157941 46981 54676 118165
12971 118165 335500 30802 252921 -67986 122304 69563 -250571 122329 9260 -109128
12960 127104 4142 142741 -86061 -307277 -137550 150183 439328 186528 103911 -175646
12949 -130833 -420603 23433 135436 86227 -76029 126035 155834 -1799 248289 -105261 365709
12937 31644 -15154 -190686 -78625 253837 -95395 -16607 120641 -89074 -78251 115174 -189383
12925 58684 114957 270361 -129796 -57951 133764 210473 189505 -408658 -96934 18678 92293
12914 92293 247257 99587 146341 91625 158613 237719 10811 -239021 203691 -32926 161072
$$ packed form
12993G7017J20568a51999A41494e3928A87786C3625a31470C02217b7585H4610
12982A25851R8648g6040j02776A80829J06257R9601b31736A57941D6981P695O3489
12971A18165K17335C0802K22119f7986A22304n2741b50571A22329I260a09128
12960A27104D142J38599h6061k21216a37550A50183K89145A86528q2617a75646
12949a30833k89770B3433J12003m9209g6029A26035K9799a799B48289a05261C65709
12937C1644a5154j75532g8625B53837i5395a6607A20641h9074J0823A15174a89383
12925E8684N6273J55404a29796e7951A33764P6709k0968d08658i6934A8678P3615
12914I2293J54964I9587M6754n4716O6988P9106A0811b39021B03691c2926A61072
$$ plain form
12902 -125231 288806 106184 15350 -14127 -22928 -157335 2304 103680 378317 3136 146465
12891 146465 33888 -118067 7233 -246106 210330 -72348 -34658 386305 -136721 -41281 145930
12879 -97992 -88481 214166 232331 -122848 -89933 275539 -251130 406911 -147206 -215497 50186
12867 121495 137982 -29711 214732 -213136 71023 155485 -101433 3656 315998 318145 74705
12855 -14471 110394 27180 -119230 -2309 237065 151477 101035 71458 -121376 229532 162709
12844 162709 -107349 142108 183733 99500 350914 215240 -173646 -306770 -51870 282512
12833 94050 -84655 31208 -42560 -48465 86571 16346 172960 -15865 -96151 -34532 -69027 -140815
12821 -140815 -175091 332815 -112894 163404 58022 -52984 -121576 -195052 122206 -58834 -186647
$$ packed form
12902a25231B88806A06184A5350a4127q801j34407B304J01376K74637C136J43329
12891A46465C3888a18067G233b46106B10330g2348c4658C86305a36721d1281A45930
12879i7992R511B14166J8165a22848L2915B75539b51130D06911a47206o8291E0186
12867A21495J6487b9711B14732b13136G1023Q4462a01433C656L12342K147G4705
12855a4471A10394B7180a19230b309B37065q5588n0442k9577a21376B29532o6823
12844A62709a07349A42108M1625q4233K51414j35674a73646j33124e1870B82512
12833I4050h4655C1208d2560n905H6571A6346J56614a5865q0286c4532l4495p1788
12821a40815l4276C32815a12894A63404E8022e2984o8592p3476A22206e8834j27813
$$ plain form
12810 -186647 195566 -10101 313257 198761 17922 121930 90166 171052 27537 -121777
12799 14860 -121097 71206 -333917 -571054 -288447 -174552 29277 80952 -359405 -291179
12789 -291179 128600 -97815 -108946 -397622 -84696 228015 10072 234699 191138 -140707
12778 38653 -208411 110878 -7737 30002 -315167 -233534 218100 -266068 60982 105952 -290889
12766 75527 -88735 12572 -18020 102763 -29234 -87801 44482 -4862 3360 94308 36365 -115176
12753 169029 -174242 126836 180601 6022 -150556 -188879 -198162 130743 17254 -279696 291627
12741 123575 349597 -255942 316431 -188080 -159782 -32896 73109 -32411 -75246 11988 -343205
12729 113892 -162933 157197 152411 142652 -7037 243711 194180 -3727 86414 202166 107749
$$ packed form
12810a86647A95566a0101C13257j14496A7922J04008l1764Q0886B7537a21777
12799A4860a21097G1206c33917k37137K82607J13895B9277N1675c59405O8226
12789b91179A28600i7815j1131k88676h4696B28015A0072K24627m3561a40707
12778C8653b08411A10878g737C0002c15167Q1633B18100b66068F0982M4970b90889
12766G5527h8735A2572a8020A02763b9234n8567D4482d862C360R0948C6365a15176
12753A69029a74242A26836N3765F022a50556l8323r283A30743A7254b79696B91627
12741A23575K26022b55942C16431a88080K8298c2896G3109c2411m2835A1988c43205
12729A13892a62933A57197m786r759g037B43711m9531c727H6414J15752r4417
$$ plain form
12718 107749 130571 30958 30099 4250 371094 31525 -153374 -79639 260925 -71544 280092
12706 304024 158767 166467 -128487 -184369 56033 19861 -373186 39018 -136 22433 -87148
12694 47847 471310 204716 93513 -155333 183521 151411 -228908 -44153 -195956 -120079
12684 -120079 16895 -270936 -14448 -294 98692 -6913 353451 61959 -4263 167217 17285 -116830
12671 217751 -38565 -5464 -164303 -268585 205862 46336 -190985 139532 156950 172026 123123
12660 123123 202677 -363279 601 213424 -36240 98483 149536 -165944 -43390 -144636 1422
12648 -78316 -7817 -121168 56878 44711 127289 301315 305590 -252953 63358 12881 206706
12637 206706 -178335 219423 -101168 262770 -71980 -160711 162172 -25484 -63726 101054
$$ packed form
12718A07749K2822C0958q59D250L66844C1525a53374P3735B60925g1544B80092
12706C04024j45257P700a28487n5882E6033A9861c73186C9018a36B2433h7148
12694D7847M23463B04716I3513a55333A83521l2110b28908d4153j51803P5877
12684a20079A6895b70936a4448b94I8692f913C53451F1959d263A67217A7285a16830
12671B17751c8565e464j58839j04282B05862D6336a90985A39532J7418J5076m8903
12660A23123P9554c63279F01K12823c6240I8483N1053a65944d3390j01246A422
12648g8316g817j13351E6878j2167Q2578J74026M275b52953F3358A2881J93825
12637B06706a78335B19423a01168B62770g1980q8731A62172b5484l8242A01054
$$ plain form
12626 119269 93796 -10009 221872 -6094 250706 44560 138423 99172 304834 -196167 99100
12614 -110491 -44680 -20204 311051 33815 431190 -220187 -58704 31683 238872 175735 221260
12603 221260 166095 -81269 293530 -51676 158178 301541 -58858 -10395 -32497 -243574 -189689
12592 -189689 32339 226456 -236035 -25052 97306 513348 181293 103242 86933 66856 85331
12581 85331 -51139 424367 182607 113857 160443 152458 88618 211242 -50463 288304 303549
12570 303549 -86428 5858 -144921 41714 350169 127694 182735 340482 220216 117404
12560 117404 -155697 147210 -308273 -142016 187420 229347 181008 -113659 -112897 27903 -204940
12548 452970 46840 161285 203873 -167988 99368 163719 -132440 182448 151116 -126139
$$ packed form
12626A19269k5473a0009B21872f094B50706D4560R3863l9251K05662a96167I9100
12614a10491d4680b0204C11051C3815L97375b20187e8704C1683K07189o3137M5525
12603B21260n5165h1269B93530e1676A58178J43363e8858a0395k2102k11077N3885
12592a89689C2339J94117b36035b5052I7306M16042A81293p8051j6309k0077J8475
12581H5331e1139D24367A82607o8750M6586p985o3840J22624e0463B88304J5245
12570C03549h6428E858a44921D1714L08455A27694N5041J57747j20266j02812
12560A17404a55697A47210c08273a42016A87420M1927m8339a13659P62B7903b04940
12548D52970D6840J14445M2588a67988I9368O4351a32440A82448l1332a26139
$$ plain form
12537 -153874 -90896 147125 -116672 -53027 -103997 -235222 -114988 60486 -318304 -73125
12526 -206608 -177666 -315485 1828 -135311 -7517 70773 36503 -103988 217533 -175711 38360
12514 14208 -85789 460926 83187 -214358 -192685 -81739 -37356 -110808 92737 130388 -196043
12502 132999 71729 109525 58344 -407805 -36417 -263515 -46027 64056 -219780 9788 -2780
12490 48436 20645 60634 -123975 165960 -160982 210516 -356620 130375 220867 86678
12479 71006 -91210 173457 -467966 -388547 -199907 -327641 -227392 73089 -74533 -102391 71412
12467 92111 43021 250219 129203 -62623 -51069 41349 -331829 122839 270219 170644 -182421
12455 -33886 56754 -89306 103087 -61479 44787 217796 -41643 -81371 174069 363013 -224770
$$ packed form
12537a53874O2978A47125a16672e3027n0970j31225a14988F0486c18304g3125
12526b06608K8942j37819A828a35311g517G0773l4270a03988B17533a75711C8360
12514A4208h5789D60926H3187b14358K1673h1739c7356p3452I2737L7651a96043
12502A32999o1270L7796n1181d07805c6417k27098d6027F4056b19780I788b780
12490D8436B0645L9989a23975A65960a60982B10516c56620A30375R0492H6678
12479G1006i1210A73457d67966P9419J88640j27734J00249G3089g4533k7858G1412
12467I2111D3021K07198j21016f2623J1554D1349c31829A22839J47380r9575a82421
12455c3886E6754h9306A03087f1479D4787J73009d1643l9728A74069J88944b24770
$$ plain form
12443 -106588 51072 99465 -26342 63541 49939 -100865 -113464 18307 11817 109253 182135
12432 182135 41667 -69842 -188946 -164506 -86822 131793 -176455 61379 -133585 -78322 -221743
12421 -221743 -63667 -224074 -121428 109291 -93466 -111650 -120274 -45084 -114360 5606 -321664
12409 70725 233593 154987 -41590 139348 -265358 -230973 -82188 44795 160817 84378 -16188
12397 -241650 -170120 -150542 65700 67936 115525 -160671 -8976 -107073 -113312 91512 41815 -9940
12384 -104084 56180 -275455 168869 -254349 39548 -76561 -234896 1310 30856 125907 -170885
12372 305223 -20208 -188492 73036 -58097 144202 -33371 116383 -145961 234050 -58513
12361 -212678 39413 351854 -216558 56155 103428 -21764 -167757 -8291 44256 187248 172385
$$ packed form
12443a06588E1072M8393b6342F3541j3602a00865j2599A8307o490R7436P2882
12432A82135D1667f9842j19104K4440P7684A31793a76455F1379a33585N5263j43421
12421b21743f3667j60407J02646A09291i3466j8184q624d5084o9276E606c21664
12409G0725J62868p8606d1590A39348b65358L4385h2188D4795J16022p6439a6188
12397b41650P1530J9578F5700K236M7589a60671h976r8097o239I1512D1815i940
12384a04084E6180b75455A68869b54349C9548g6561j58335A310K9546R5051a70885
12372C05223b0208j68284G3036e8097A44202c3371A16383a45961B34050e8513
12361b12678C9413L12441b16558E6155M7273b1764j45993h291D4256J42992j4863
$$ plain form
12350 172385 154708 126398 -39104 218747 213275 217358 62008 43683 -22690 -158229 -143675
12339 -143675 -33147 24581 -167825 15993 204966 -14220 -174625 41661 1490 -190489 -11236
12327 221110 21090 219218 253777 -174728 -38447 -293759 329855 162432 68697 146595
12317 146595 63254 -54226 42023 236009 60311 173807 -277113 -106222 114895 -2281 321202
12305 286552 113636 355890 75975 81553 258827 369594 -61865 15706 19143 131308 -131294
12293 170450 364 41111 -173946 -10484 -32699 127123 -117685 201356 -156708 267650 134689
12282 134689 160726 138089 -47036 -38599 313517 -50227 55231 273583 80654 164757 226571
12271 226571 177199 77141 364764 190987 467580 135648 181186 -27162 189195 184812 204455
$$ packed form
12350A72385j7677k8310c9104B18747n472M083F2008j8325b2690j35539J4554
12339a43675c3147B4581a67825A5993J88973a4220j60405D1661A490a90489a1236
12327B21110B1090J98128L4559a74728c8447k55312C29855A62432F8697P7898
12317A46595F3254e4226D2023J93986F0311J13496b77113a06222A14895b281C21202
12305B86552A13636K42254G5975N578J77274J10767f1865A5706L437J12165a31294
12293A70450C64M0747a73946a0484k2215A27123a17685B01356a56708B67650j32961
12282A34689K6037k2637d7036Q437C13517e0227E5231K18352H0654Q4103O1814
12271B26571m9372G7141K87623j73777K76593A35648M5538b7162A89195m383J9643
$$ plain form
12260 204455 88989 345440 129119 -173149 95821 128261 27931 -31322 473919 -15460 325661
12248 -289843 -21904 138438 99000 -143002 243892 601088 138906 353244 -23502 417392
12237 140749 137064 26618 185898 37882 -125621 -11360 316449 159212 150520 224432 -151437
12225 79566 -37162 46515 340591 139724 57869 -112429 271601 125278 76205 222192
12215 222192 272830 154228 213513 -2715 83461 -124805 103137 163330 -109628 197300 81364
12203 177751 -179555 175189 426062 -73828 30861 254921 -95149 180219 177921 254936 388962
12192 388962 -90548 17171 -28799 309801 368407 294340 96023 -54985 -3541 274643 66231
12180 168291 228673 31412 174200 328073 139721 330071 90981 22352 184614 136401
$$ packed form
12260B04455H8989K56451A29119a73149I5821L2440B7931c1322D73919a5460C25661
12248b89843b1904A38438l9438a43002B43892L57196A38906K14338b3502D17392
12237A40749l685B6618J59280C7882a25621a1360C16449j57237q692P3912a51437
12225G9566c7162D6515K94076A39724E7869a12429B71601A25278m9073J45987
12215B22192N0638j18602N9285b715H3461a24805A03137O0193a09628A97300H1364
12203A77751a79555A75189K50873g3828C0861K24060i5149A80219k298P7015J34026
12192C88962i0548A7171b8799C09801N8606p4067I6023e4985c541B74643F6231
12180A68291O0382C1412J42788J53873A39721J90350I0981B2352J62262m8213
$$ plain form
12170 136401 150446 215171 31255 17493 17893 -13018 227990 196421 -153820 230180 150464
12159 150464 256319 323694 -106932 -201872 156516 -4949 227501 -23804 110409 39278 347108
12148 347108 96497 320168 205552 34556 119227 188909 60687 159275 172349 251865 117077
12136 -69846 -4876 48203 -105434 44249 228061 387438 377708 105409 -179621 144035 101568
12125 101568 31887 10712 -142591 39706 -74633 -34159 236951 -192450 -167462 122013 102767
12114 102767 291218 -368 180728 -148340 210180 -71024 -19374 216839 158138 148068 -29524
12102 284329 120402 210677 274313 240692 -116402 -71860 113871 54120 261093 135075
12092 135075 -67685 20198 -162696 80240 -40623 -69135 15968 209236 297778 -70100 -44815
$$ packed form
12170A36401J4045O4725C1255j3762M00a3018B27990l1569a53820B30180p9716
12159A50464J05855O7375a06932r4940A56516d949B27501b3804A10409C9278L07830
12148C47108I6497K23671j14616C4556Q4671O9682F0687R8588J3074P9516A17077
12136f9846d876D8203a05434D4249J83812J59377r730A05409a79621A44035m2467
12125A01568C1887A0712a42591C9706g4633c4159B36951a92450K4988A22013j9246
12114A02767J88451c68A80728a48340B10180g1024a9374B16839n8701j0070b9524
12102B84329A20402R0275O3636l3621a16402M4542A13871E4120K06973j26018
12092A35075f7685B0198a62696H0240d0623k8512A5968J93268Q8542g0100K5285
$$ plain form
12081 -44815 215297 208640 158903 221581 -59291 -153798 186069 307090 59046 6394 -103783
12069 272561 -155705 38982 373079 -118639 174982 43007 -21534 285231 33266 403995
12059 403995 -74502 426670 -32104 138673 65873 -123652 246249 -17815 21382 222224
12049 222224 100865 88173 76919 52899 127508 148735 -133113 -45462 110106 -33129 -63191
12038 -63191 -27767 -72404 -193667 -227229 80516 -215871 6647 34612 -159707 305387 -31467
12026 -31942 167032 -406441 -296107 -360929 -265459 89621 -38273 18895 88176 -312523 376238
12014 -60015 -316842 -242085 164171 4586 -241336 44576 192772 -190251 142409 444696
12004 444696 -108579 -216282 166406 38537 -185533 90362 1569 161514 204592 94434 355650
$$ packed form
12081d4815B15297o657m9737O2678e9291r4507A86069J21021E9046F394a03783
12069B72561a55705C8982L34097a18639A74982D3007b1534B85231C3266L70729
12059D03995g4502D26670c2104A38673F5873a23652B46249a7815B1382K00842
12049B22224A00865j2692j1254k4020P4609K1227a33113d5462A10106c3129l0062
12038f3191b7767m4637j21263l3562H0516b15871F647K7965a59707C05387c1467
12026c1942A67032d06441J10334o4822R5470H9621c8273A8895O9281c12523C76238
12014f0015k56827P4757A64171D586b41336D4576J48196a90251A42409L02287
12004D44696a08579j07703A66406C8537a85533I0362A569J59945M3078I4434K61216
$$ plain form
11993 355650 77864 26645 -48435 -107267 83599 67114 134268 -26458 -185333 -27394 72939
11981 -97484 -44569 -131349 -26622 32867 158975 -165947 19376 21055 108877 10610 242574
11970 242574 12626 13336 203290 -215411 43717 -18442 137996 -21411 479161 43186 -161139
11958 189341 -25890 -176940 121277 229528 -424439 -168039 62038 -74407 -80025 -153509 -65868
11946 146350 224012 312947 110410 75099 -60479 -61191 299581 17439 390652 -12033 158614
11934 -79015 -178368 130590 -115497 -71132 -21291 -159445 476030 -127683 252831 -9080 -256923
11923 -256923 227838 -134136 201542 -195795 162902 279695 -211583 -7946 -145448 -156939
11913 -156939 239692 -79495 -241252 53111 192581 91722 -164147 82276 21109 -52516 248377
$$ packed form
11993C55650G7864B6645d8435n8832H3599j6485O7154b6458j58875b7394G2939
11981i7484d4569q6780b6622C2867J26108a65947A9376J679Q7822A0610K31964
11970B42574A2626P10J89954b15411D3717a8442A37996b1411D79161D3186a61139
11958A89341b5890j51050A21277J08251d24439a68039F2038g4407n618p3484f5868
11946A46350P7662Q8935A10410l5311f0479p12B99581A7439L73213a2033A58614
11934g9015r9353A30590a15497M4365b1291j38154D76030a27683B52831i080k47843
11923b56923B27838a34136B01542a95795A62902J16793b11583g946j37502j1491
11913a56939B39692g9495j61757E3111J39470I1722a64147H2276B1109e2516B48377
$$ plain form
11901 736 281900 -30248 -63451 -124649 -33847 -110140 -273468 83138 62171 -107361 -214239
11890 -214239 452187 -87012 -130872 66747 -140442 -23343 -296679 321438 121943 -294329
11879 87485 -142024 19637 20303 -201487 126858 -218209 -134129 -277346 188259 234356 94092
11867 13184 186046 -390296 -153727 -122248 185679 -41144 -134980 -60057 462940 -176098
11856 -134990 173022 -41790 -60624 18893 -16128 -36019 -145852 -17469 270208 -350800 -139482
11844 -23992 -168278 107843 -410892 168800 -178996 -163467 -101861 182894 -164721 -187375
11834 -187375 -314577 105185 96097 -162739 16877 -117174 -378524 227017 -198252 149304
11823 42381 -1852 -127220 58060 174248 37007 -53274 -172035 30504 -76956 -264100 35914
$$ packed form
11901G36K81164c0248l3203o1198c3847p6293j63328H3138k0967a07361j06878
11890b14239D52187h7012m3860F6747a40442b3343k73336C21438A21943b94329
11879H7485a42024A9637O66b01487A26858b18209Q4080j43217A88259M6097I4092
11867A3184J72862c90296a53727L1479A85679d1144r3836f0057D62940a76098
11856a34990A73022d1790j8834A8893a6128j9891j09833a7469B70208c50800a39482
11844b3992j44286A07843d10892A68800a78996J5529O1606A82894a64721k2654
11834a87375j27202A05185r088a62739A6877a17174k61350B27017a98252A49304
11823D2381a852j25368E8060J16188C7007e3274j18761C0504g6956j87144C5914
$$ plain form
11811 189415 79702 -269879 -102975 -111064 146841 -151049 -231380 -148031 -187410 -351340 -506987
11800 -506987 230000 183115 195261 -11364 108353 -218667 15970 187553 -205094 -207964 -119253
11789 -119253 78941 -130591 -159806 -88830 -254897 -358079 8587 -188425 9178 173318 21984
11777 -162381 -100657 -56245 -79338 72970 693 148765 227174 -251964 -157395 39618 -4393 106802
11764 -302517 108152 -151898 -167465 -152293 16430 -145951 -233753 140733 26368 -66987 -41470
11753 -41470 -50285 -3149 303298 -168761 -21155 261009 -115696 158004 -330400 369508 -49852
11741 92018 -93108 243955 -194676 284410 24281 183080 -31261 180689 -196792 144742
11730 5102 -237192 32050 64778 10882 -192262 315681 -14806 53159 206779 -57931 -71559
$$ packed form
11811A89415G9702b69879a02975q089A46841a51049q0331Q3349l9379j63930j55647
11800e06987B30000m6885J2146a1364A08353b18667A5970J71583b05094k870Q8711
11789a19253G8941a30591k9215P0976j66067j03182H587a88425I178J64140B1984
11777a62381O1724M4412k3093G2970F93J48072P8409b51964R4569C9618d393A06802
11764c02517A08152a51898j5567J5172A6430a45951q7802A40733B6368f6987K5517
11753d1470q815c149C03298a68761b1155B61009a15696A58004c30400C69508d9852
11741I2018i3108B43955a94676B84410B4281J58799c1261A80689a96792A44742
11730E102b37192C2050L2728A0882a92262C15681a4806E3159J53620e7931j3628
$$ plain form
11719 -71559 69910 82523 -39513 40405 169306 -191526 -74138 187903 -313519 -151960 -83659
11708 -83659 241736 265405 -309536 195256 308696 -48339 31293 217023 346884 78174
11697 77030 -84758 353576 -295473 -124185 70854 280799 -28372 352499 148579 -14059
11686 -59430 70488 230174 -183571 292569 108297 -251277 -171229 83418 328384 -140908
11675 38956 -258853 -119145 69562 122253 -27503 671 331019 119874 113237 82519 230477
11664 230477 241880 79845 242148 -119792 315878 110063 89095 146787 88756 22436 -167708
11652 15209 -55965 -101331 194886 11151 206481 71607 -50059 -219401 229156 -243612 -94104
11640 -234984 -78760 -243910 -190348 298867 -125457 -57469 295704 26300 234019 -44329
$$ packed form
11719g1559F9910J2613c9513D0405J28901a91526g4138A87903c13519a51960O8301
11708h3659B41736K3669c09536A95256J13440d8339C1293J85730J29861G8174
11697G7030h4758C53576b95473a24185G0854K09945b8372C52499A48579a4059
11686e9430G0488J59686a83571B92569A08297b51277Q0048H3418K44966a40908
11675C8956b58853a19145F9562N2691b7503F71L30348A19874o637l0718J47958
11664B30477J1403G9845J62303a19792C15878A10063k0968N7692n8031B2436a67708
11652A5209e5965m5366A94886A1151J95330G1607e0059j69342B29156b43612i4104
11640b34984g8760j65150N3562B98867a25457e7469B95704B6300K07719d4329
$$ plain form
11629 34332 258211 -11551 45635 155663 -91398 145994 182259 -995 148659 -245921 32270
11617 -55974 238893 63102 -293041 132523 -216322 -131090 206252 328908 -40281 64932
11606 74095 -115928 106462 73016 21169 -84262 -36522 -206028 -7422 121288 115320 -3681
11594 -185514 -116514 -95472 -182842 -148240 -72710 5852 -112861 150531 22948 3276 -151729
11582 -249961 77547 35113 107567 -125397 84455 55910 -66523 -147435 24337 -68962 140482
11570 379172 105138 14081 -42389 -29310 -132395 478663 495438 166131 -47800 69129 -48012
11558 -396728 88 131721 202880 45280 -9341 45428 -106836 16653 -212919 46421 261586
11547 261586 -70218 -283020 206928 -56225 87468 28307 101844 -128479 175646 -83196 -84062
$$ packed form
11629C4332K23879a1551D5635J10028i1398A45994L6265i95A48659b45921C2270
11617e5974B38893F3102b93041A32523b16322Q5232B06252J22656d0281F4932
11606G4095a15928A06462l3446B1169h4262c6522j69506g422A21288n968c681
11594a85514O9000K1042q7370L4602g2710E852a12861A50531B2948C276a51729
11582b49961G7547C5113P2454a25397H4455k8545f6523q0912B4337f8962A40482
11570C79172A05138A4081d2389J3079j03085D78663J6775A66131d7800F9129d8012
11558c96728H8J31633P1159D5280i341D5428a06836A6653b12919D6421K15165
11547B61586g0218k12802B06928e6225H7468B8307P3537a28479A75646h3196q66
$$ plain form
11536 -84062 -54146 352199 139940 -34558 163858 -188721 122192 201692 152474 38526 -253768
11524 -144472 172056 27168 -99026 -154445 -54408 349046 -120291 190394 145107 138072 103102
11513 103102 -108605 207776 118455 -61385 -100588 297925 -10319 67263 68851 103592 -252154
11501 69605 104825 -132997 -383112 -63755 -92139 -75105 -57307 25418 -57365 675423 123280
11489 -64132 154168 233141 259443 212403 45828 217435 152040 256043 26166 -14189 20811
11477 -8441 179408 167455 -59951 367071 204751 136429 -185302 213600 37850 101079 291981
11466 291981 270182 -61594 21445 -24920 138433 -118756 -102290 2830 268066 60587 251823
11455 251823 224484 289890 -123996 13997 23173 240968 253013 -20085 188742 195736 199577
$$ packed form
11536h4062K9916C52199A39940c4558A63858a88721A22192P9500m9218C8526b53768
11524a44472A72056B7168i9026n5419e4408C49046a20291A90394m5287p035l4970
11513A03102a08605B07776q9321f1385l9203B97925a0319F7263J588L4741b52154
11501F9605L5220a32997k50115f3755k8384J7034J7798B5418e7365F75423A23280
11489f4132A54168P8973K6302m7040D5828J71607o5395J04003B6166a4189B0811
11477h441A79408j1953e9951C67071j62320o8322a85302B13600C7850O3229J90902
11466B91981k1799f1594B1445b4920A38433a18756J6466B830K65236F0587J91236
11455B51823k7339O5406a23996A3997R176K17795J2045b0085A88742O994L841
$$ plain form
11444 199577 109056 143820 -121468 -11652 127286 4690 73915 85410 291300 -198121 -242029
11433 -242029 266707 -155130 -20244 -18556 189218 -93990 179566 -209436 73489 -25358 236251
11421 229276 101128 -71700 -210019 17013 149259 196416 -31004 159128 -17178 -196283
11411 -196283 -248227 -29418 -91838 191408 22309 167237 -200924 23402 -250222 307222
11400 1991 -182800 121320 244137 265444 -84430 -97709 53944 103114 -162738 118021 -81059
11388 46508 19986 134123 50030 -31226 -167615 -181958 92141 111935 303148 -1650 -37453
11377 -37453 138487 -2800 263951 300779 84473 130560 -228799 137807 -169978 -131281 -189983
11366 -189983 110087 140516 -249225 102709 -115153 123261 -95584 -117003 -374494 -323082
$$ packed form
11444A99577r0521L4764a21468a1652A27286D690O9225J1495K05890a98121m3908
11433b42029B66707a55130b0244J688A89218i3990A79566b09436G3489b5358B36251
11421B29276A01128g1700j38319A7013J32246M7157c1004A59128a7178j79105
11411a96283n1944b9418o2420A91408B2309J44928b00924B3402b50222C07222
11400A991a82800A21320J22817K1307h4430j3279E3944M9170a62738A18021h1059
11388D6508A9986J14137E0030c1226j36389j4343I2141J9794J91213a650l5803
11377c7453A38487b800B63951L6828H4473M6087b28799A37807a69978L8697n8702
11366a89983A10087L0429b49225A02709a15153A23261i5584k1419k57491N1412
$$ plain form
11356 -323082 30536 -105786 307208 218622 230146 38488 -155442 54359 -166302 331422
11345 -220368 -7133 -34234 78480 84780 -101324 60905 -231132 81692 -313493 -13789 -55832
11334 -55832 -191806 -169571 287348 -165212 -6082 -21699 53156 163064 -22009 138859 47639
11322 55974 -342699 -108860 39925 25582 -195501 250836 85113 162123 -302960 -309986 244722
11310 -132237 -84160 59424 -161376 9168 -5108 -61016 -152034 -349501 95805 -60149 9356 18970
11298 18970 -92724 32501 -269722 222669 -142562 248277 237028 58002 -68100 -113582 -70991
11287 -70991 246772 -220606 -1021 257708 -416495 4679 138249 -51997 115779 -320349 -62031
11275 69110 -60972 -59387 -205600 -396862 35652 -274873 -141528 -10525 -80324 -98754 -473942
$$ packed form
11356c23082C0536a05786C07208q8586J1524C8488a55442E4359a66302C31422
11345b20368g133k7101G8480O300a01324F0905b31132H1692c13493a3789m2043
11334e5832j35974K2235B87348a65212f082j5617E3156J09908b2009A38859D7639
11322E5974c42699a08860C9925j4343a95501B50836H5113P7010c02960p026B44722
11310a32237M8077E9424a61376I168e108n5908r1018j97467I5805f0149I356R614
11298A8970i2724C2501b69722B22669a42562B48277j1249E8002f8100m5482M2591
11287g0991B46772b20606a021B57708d16495D679J33570e1997A15779c20349f2031
11275F9110f0972J585j46213j91262C5652b74873J33345a0525o9799j8430l75188
$$ plain form
11264 -473942 -147461 -35445 40332 -19032 -42796 290968 8154 -249812 -257268 -258169 35133 -262977
11251 -224595 118095 112795 -194127 9841 -30690 -341014 171748 -200948 39907 -159928 -159518
11240 -159518 -78596 384223 205389 46344 -223279 189528 -351021 290399 196087 -162111
11229 -195614 -9536 51385 -235023 86806 -81310 -94303 -21186 -151924 -178955 -137181 -367850
11218 -367850 115525 -319084 -192849 147024 -157316 -187427 -130092 128423 238954 -91996
11207 -148195 433543 -38521 -73992 236867 -213220 -80801 164216 -60814 50474 -136623
11196 51929 -38501 -46720 -309625 -28331 -84540 -14032 -307356 -59451 46537 164727 -165725
11184 120965 374 138988 -40516 15752 382908 78433 302940 365191 -16125 6551 -338984
$$ packed form
11264d73942a47461c5445D0332a9032k3764B90968H154b49812p456r01C5133b62977
11251b24595A18095n300a94127I841c0690l10324A71748b00948C9907a59928M10
11240a59518g8596C84223j78834D6344b23279A89528c51021B90399r4312a62111
11229a95614i536E1385b35023H6806h1310j2993b1186j30738k7031M1774k30669
11218c67850A15525c19084J26235A47024a57316l0111N7335A28423J10531i1996
11207a48195D33543c8521l5471B36867b13220h0801A64216f0814E0474a36623
11196E1929c8501q219k62905b8331n6209a4032k93324e9451D6537J18190a65725
11184A20965C74J38614d0516A5752L67156G8433K24507O2251a6125F551c38984
$$ plain form
11172 -183051 -62686 -164820 91101 369588 245655 -50868 -83072 -63126 -181679 167192
11161 -149027 -26076 53835 117075 59404 -52102 -408643 152796 -152719 -31232 145111 -152070
11149 213033 -28648 51358 11787 47465 234696 161592 -14262 158074 -139380 -122242 275570
11137 157946 -71892 -17969 -164475 -78289 -85423 79277 10235 -134690 130613 402499 -101981
11125 27931 -120243 -80267 -100917 -310109 9650 367707 -58553 122729 -30094 -34054 -86704
11114 -86704 -76258 -17962 31622 94000 145301 -136277 14832 -23054 88194 -43572 171164
11102 245450 -94461 -71332 33121 -88515 -30961 -94419 -144198 9286 205839 -379 17439 65192
11090 65192 4038 -141110 -27829 317999 178657 96970 -167957 95469 196664 349581 292023
$$ packed form
11172a83051f2686j02134I1101K78487j23933e0868l2204J9946j18553A67192
11161a49027b6076E3835O3240n7671e2102l56541A52796a52719c1232A45111a52070
11149B13033b8648E1358A1787L5678J87231p3104a4262A58074a39380J7138B75570
11137A57946g1892a7969j46506g8289p134G9277A0235a34690A30613K71886a01981
11125B7931a20243L9976k0650k09192I650L58057e8553A22729c0094l960n2650
11114h6704J0446a7962C1622O2378N1301a36277A4832b3054H8194d3572A71164
11102B45450i4461K3129C3121h8515c0961o3458m9779I286J96553c79A7439M7753
11090F5192D038a41110b7829C17999j39342q1687a67957I5469J01195J52917n7558
$$ plain form
11079 292023 72294 -83874 -69562 129436 417781 422163 40412 72100 -112397 263861 100983
11067 186301 -200951 -2241 -75820 87395 505164 356013 44312 -24638 478825 422949 294023
11056 294023 291151 332265 129566 221382 -50991 300595 575190 -46094 -168923 237776 395361
11045 395361 438497 293718 343261 272518 132726 603416 336982 520874 650166 466807
11035 466807 411126 609226 297506 389327 558345 974536 637275 628131 468857 483990
11025 483990 507634 986556 732785 404009 682919 671332 634869 488458 653123 557844
11015 557844 532208 351707 614885 448163 443995 503184 808359 197186 577578 636744
11005 636744 571185 678574 472414 346991 397608 213990 505500 510011 449298 505119 513618
$$ packed form
11079B92023G2294h3874J4312A29436K88345M382D0412L1688a12397B63861A00983
11067A86301b00951b241p3579H7395M17769j49151D4312b4638D78825n5876j28926
11056B94023k872M1114A29566R1816e0991C00595K74595d6094j22829B37776J57585
11045C95361M3136j44779M9543p0743A32726M70690k66434J83892J29292j83359
11035D66807n5681J98100B97506R1821J69018M16191l37261r144j59274J5133
11025D83990K3644M78922k53771l28776K78910j1587l6463j46411J64665r5279
11015E57844k5636j80501K63178j66722m168N9189L05175A97186L80392N9166
11005F36744o5559J07389k06160j25423N0617j83618K91510M511o0713N5821Q499
$$ plain form
10994 513618 279776 379150 290526 553106 423441 365958 520514 245447 979309 712240
10984 712240 571528 403903 900728 613001 677357 408047 615141 720348 541712 435688
10974 435688 563674 504848 249569 705480 464506 879573 509881 416561 524893 722613
10964 722613 980419 917691 982662 1045141 1289672 1160786 1566989 1555766 1676778 1649089
10954 1649089 2170332 1743077 2098166 1949953 2146893 1798836 1538650 1784231 1564797
10945 1564797 1418822 1187898 1450062 1337574 1061345 1549527 1192148 1152392 1399361 1470443
10935 1470443 1145694 1512107 1121251 1353546 1172181 819814 588066 454481 293920
10926 293920 179687 675733 197822 309496 490719 46654 105056 459245 182225 481787
$$ packed form
10994E13618k33842R9374q8624K62580j29665n7483J54556B45447P33862k67069
10984G12240j40712j67625M96825k87727O4356k69310K07094J05207j78636j06024
10974D35688J27986n8826B49569M55911k40974M15067l69692r3320J08332J97720
10964G22613K57806o2728O4971O2479K44531j28886M06203j1223J21012k7689
10954A649089N21243m27255L55089j48213J96940l48057k60186K45581k19434
10945A564797j45975k30924K62164j12488k76229M88182l57379l9756K46969P1082
10935A470443l24749L66413l90856K32295j81365l52367k31748j33585j60561
10926B93920j14233M96046A97822J11674J81223D6654N8402L54189A82225K99562
$$ plain form
10916 481787 -2846 158417 -29873 15269 -221530 307377 8423 -77741 47543 -104183 200376
10904 199087 -46158 -49919 -88772 219519 -94893 7281 78391 149335 -187709 112325 -233647
10892 -3235 -161609 -85053 -89408 -72038 -155626 111596 -47542 69973 -244114 161857 37025
10880 111945 -190380 -2328 -331359 244501 67188 24202 -32822 -272668 -433215 180387
10869 -85141 -245327 -49779 -9059 98 -126114 -192155 4215 -151251 -328921 -119586 -388891
10858 -388891 -195065 -102322 -22468 126063 80005 -55808 -155155 -97096 107128 66689 -413141
10846 -105708 80107 -361020 -104332 30476 -8092 63107 139726 190392 -136981 -255148 238797
10834 295564 -105639 -80297 -49300 -357018 -76150 110055 -32610 221015 -342354 245428
$$ packed form
10916D81787b846A58417b9873A5269b21530C07377H423g7741D7543a04183B00376
10904A99087d6158l761l8853B19519i4893G281P1110P0944a87709A12325b33647
10892c235j58374P6556m355J7370q3588A11596d7542F9973b44114A61857C7025
10880A11945a90380b328l29031B44501F7188B4202c2822k39846j60547A80387
10869h5141j60186d9779i059I8a26114o6041D215a51251j77670a19586k69305
10858c88891J93826R2743b2468A26063m6058e5808r9347N8059A07128m0439d13141
10846a05708H0107c61020a04332C0476h092F3107P6619N0666a36981j18167B38797
10834B95564a05639K5342L0997l07718g6150A10055c2610B21015c42354B45428
$$ plain form
10823 -53857 19559 54569 70488 -71889 -191802 111729 81316 163555 -16627 -205219 -282814
10812 -282814 250521 40844 -313158 124007 46113 -225896 -108016 202431 119695 -130756
10801 -11321 161519 21978 31942 80151 -312793 -63551 146579 -135956 -38297 33087 193696
10790 193696 -246108 152239 169563 -121385 -90435 248348 59456 82671 84461 -30264 -35622
10779 -35622 -145498 6109 197289 -279997 -403 -24946 207322 87859 -181308 -111344 6025
10767 -90737 -32991 -66334 80361 152306 -251068 -71620 82910 -68669 -142308 23995 -252648
10755 -308647 26759 -222790 -494815 -228577 -55622 250390 15328 78873 -70866 -53506 295608
10743 -64518 -134281 -209080 231863 323379 167447 -200851 171844 -286080 88217 210565
$$ packed form
10823e3857A9559L5010J5919g1889j19913A11729l0413Q2239a6627j88592p7595
10812b82814B50521D0844c13158A24007D6113b25896a08016B02431q2736a30756
10801a1321A61519B1978R964M8209c12793f3551A46579a35956c8297C3087J60609
10790A93696b46108A52239J7324a21385L0950B48348E9456K3215J790c0264n358
10779c5622j09876F109J91180b79997d03k4543B07322H7859a81308O9964F025
10767i0737c2991l3343H0361P1945b51068g1620H2910f8669p3639B3995b52648
10755c08647B6759b22790k72025b28577e5622B50390A5328O3545g0866J7360B95608
10743f4518o9763p4799B31863R1516j55932b00851A71844b86080H8217J22348
$$ plain form
10733 210565 -69016 -51150 -97159 -44776 -91619 -62911 -30647 -203288 -35274 -57345 110932
10721 -240943 171132 -33611 73947 -135152 -36652 145800 -284490 108435 58627 -205116
10710 -42249 36727 37805 -153054 -18610 85577 279148 95070 -10885 -258979 41926 45455
10699 45455 -150433 -84467 86542 58406 -157908 1321 114589 18719 -267147 -37543 59380
10687 -304229 -173083 95143 -39099 -379117 -136510 217197 88058 130137 -108743 -31319
10676 -249197 -55004 -93646 -82194 -437602 -15542 139290 134423 -42932 26974 -160263 55121
10664 54472 -1343 -51187 106094 19469 -10450 32323 156717 70406 233237 111596 67614
10653 67614 3532 -23828 125898 -172931 173542 155598 47135 64276 -30298 -141464 -257104
$$ packed form
10733B10565f9016J7866m6009d4776m6843K8708c0647j72641c5274k2071A10932
10721b40943A71132c3611G3947a35152c6652A45800b84490A08435m9808b05116
10710d2249C6727J078a53054a8610H5577J93571I5070a0885k48094D1926L529
10699D5455a50433O5966H6542k8136a57908A321J13268A8719b67147c7543E9380
10687c04229J31146I5143c9099l40018a36510B17197H8058M2079a08743c1319
10676b49197e5004l8642J1452l55408a5542A39290m867d2932B6974a60263E5121
10664E4472a343m9844A06094A9469a0450C2323J24394G0406J62831A11596m3982
10653F7614C532b3828A25898a72931A73542j7944D7135J7141c0298j11166j15640
$$ plain form
10642 -257104 -224965 78218 -182148 -3359 -82271 -49078 -128469 -555683 255426 21112 -74378
10630 -143785 -353407 13932 -213962 -186280 52107 189508 47082 57919 -282880 99290 80372
10619 80372 -117250 10453 -9318 -158588 -506014 -101438 -83329 128402 17100 71366 158611
10608 158611 247969 -117685 -54857 58843 -344942 -59362 -124468 -43959 165849 -202338 -216523
10597 -216523 -165885 206136 268463 -17179 -17381 -97089 -320817 67353 -112817 -109337 174565
10585 -152894 269112 128757 -275766 -923 153868 -57559 -453801 -181321 -153514 -29456 -248435
10574 -248435 182661 12445 -378479 -53871 -120476 246048 170126 103828 30067 -205777 24914
10562 50911 -36519 10969 167776 -155323 -138946 -336559 -204219 -377997 -841 73770 117959
$$ packed form
10642b57104L2139G8218a82148c359p8912L3193p9391m27214B55426B1112g4378
10630a43785k09622A3932b13962K7682E2107J37401D7082J0837b82880I9290j8918
10619H0372a17250A0453i318j49270l47426a01438J8109A28402A7100N4266Q7245
10608A58611Q9358a17685e4857E8843c44942e9362o5106d3959A65849b02338j4185
10597b16523N0638B06136O2327a7179k02p9708k23728F7353a12817L480A74565
10585a52894B69112A28757b75766i23A53868e7559l96242a81321K7807b9456k18979
10574b48435A82661A2445c78479e3871o6605B46048p5922o6298C0067b05777B4914
10562E0911c6519A0969J56807a55323J6377j97613J32340j73778h41G3770M4189
$$ plain form
10551 117959 -155744 103010 -161104 -337321 -535083 -177725 150811 -129203 304416 31964
10540 55300 88466 -120222 216637 297979 -104276 -116706 459628 -252049 59868 104903 -192884
10528 81374 31745 -223976 -199843 -292113 19433 2957 253186 -131856 -327523 -68089 8855
10516 -148519 -42019 -379478 -729 -19043 -132947 -144975 -16339 -231912 15186 -214784 73439
10504 61838 -340089 -231353 -300993 -124607 -78239 124078 -83395 -19730 -219839 -124118 -106074
10493 -106074 281849 -189937 -46049 -36387 -230538 -99697 153428 -93891 -49972 140996 -426084
10481 218759 195412 144924 -78620 -113204 247549 -26208 50997 -76793 -26924 -145295 -181613
10470 -181613 6376 70681 81738 -138645 -149318 139334 81477 -18630 171199 232488 454734
$$ packed form
10551A17959a55744A03010a61104j76217j97762a77725A50811a29203C04416C1964
10540E5300L3166a20222B16637Q1342a04276j2430D59628b52049E9868M5035a92884
10528H1374C1745b23976K4133r2270A9433B957K50229a31856j95667f8089H855
10516a48519d2019l37459g29j8314j13904j2028a6339k15573A5186b14784G3439
10504F1838c40089J08736o9640a24607M6368A24078h3395a9730k00109R5721J8044
10493a06074B81849a89937d6049R662j94151i9697A53428i3891M3919A40996d26084
10481B18759k3347n0488g8620l4584B47549b6208E0997g6793b6924j18371l6318
10470a81613F376O4305J1057a38645j0673A39334n7857a8630A71199O1289K22246
$$ plain form
10459 454734 321843 437561 383903 343870 110890 -45607 -322097 283564 232500 -53449
10448 -118219 -321986 285294 -1728 -232095 214378 -387274 -159082 -110190 -7098 108136
10437 -77397 -75104 -112602 287110 106988 -49051 -68554 -176317 -133587 67713 -46016 45185
10425 218335 -195471 241243 -347093 48065 -60351 -124494 -12354 237236 91877 29648 -270715
10413 215718 -135586 57847 -89367 -158035 114015 -216671 -87145 67183 4422 18148 73055
10402 73055 -139828 -304766 177120 -48398 -83716 29721 -7915 148457 245228 -268577 -40718
10390 -150089 96666 -42720 -120765 -24407 161673 -120660 73900 113296 255661 -145656 -147100
10379 -147100 -94290 -306945 -99222 -151083 328654 216896 -96920 203268 17153 138188
$$ packed form
10459D54734j32891J15718n3658m0033A10890d5607k76490B83564n1064e3449
10448a18219k03767B85294a728k30367B14378c87274a59082M8892g098A08136
10437g7397K293l7498B87110A06988d9051j9503j07763M2730F7713d6016D5185
10425B18335a95471B41243c47093D8065f0351o4143a2354B37236I1877B9648b70715
10413B15718a35586E7847h9367o8668A14015b16671h7145F7183D422J3726N4907
10402G3055a39828j64938A77120d8398l5318B9721g915A48457R6771b68577d0718
10390a50089I6666d2720p8045b4407A61673a20660G3900L9396J42365a45656j444
10379a47100N2810k12655i9222n1861C28654j11758i6920B03268A7153J21035
$$ plain form
10369 138188 -86146 52214 107341 263550 -32523 134606 -24829 -112694 -191134 -33387 290351
10357 151109 23505 320751 -33591 11651 75665 220511 233158 88554 302031 461199 251341
10346 251341 402414 347434 557889 51050 306931 439475 254262 244741 94228 48651 -7486
10334 -25339 177300 314065 548758 242173 -11338 499397 484836 -55876 350794 409466
10324 409466 -1963 526475 171431 -50018 182880 287703 212860 39296 17521 204131 250263
10313 250263 104389 -301749 238635 158233 -21680 -130322 175165 -253138 65662 56664
10303 56664 276804 -188949 91052 50555 106873 -93830 178266 153487 -176402 270517 266898
10292 266898 -182143 162679 -110481 -96433 145639 204294 -280233 120777 -109276 237058
$$ packed form
10369A38188h6146E2214N5127J56209c2523A34606b4829q7865p8440c3387B90351
10357A51109B3505K97246c3591A1651O4014J44846J2647H8554K13477J59168k09858
10346B51341J51073n4980K10455E1050K55881J32544j85213r521I4228m5577g486
10334b5339A77300J36765K34693B42173a1338D99397j4561e5876C50794N8672
10324D09466a963E26475A71431e0018A82880J04823p4843C9296A7521J86610M6132
10313B50263A04389c01749B38635q0402b1680j08642A75165b53138F5662q998
10303E6664K20140a88949I1052m0497N6318i3830A78266k4779a76402B70517l619
10292B66898a82143A62679a10481J4048A45639N8655b80233A20777a09276B37058
$$ plain form
10281 21414 193164 160854 -203345 -207480 9363 -197101 175234 -170849 -283309 -168280 -169240
10270 -169240 -50443 229538 -46414 151236 -11649 -11970 -131627 -115954 -35216 72365 208837
10259 208837 -124136 -216491 -205719 -34393 -209644 217345 147449 2569 -66070 -190010 26963
10247 200537 -187361 -182634 54054 39299 300908 -101483 172209 326877 96970 62596 233247
10236 233247 123077 85650 147920 -262629 -257551 163297 15929 -74067 111812 160890 -213250
10224 -79429 -356477 -26949 -301893 -267678 22954 -188975 -258316 -216909 -158665 15763 134474
10213 134474 46412 9559 -71039 -256963 142517 -235246 89003 -265144 324631 9778 6525
10202 6525 -78525 -158915 -45369 -61902 245771 -391856 -169357 254530 -61195 -257671 -28967
$$ packed form
10281B1414J71750l2310b03345m135I363a97101A75234a70849j12460J15029r60
10270a69240e0443B29538d6414A51236a1649l21j19657J5673c5216G2365J36472
10259B08837a24136r2355J0772c4393j75251B17345o9896B569f6070j23940B6963
10247B00537a87361M727E4054j4755K61609a01483A72209J54668I6970l4374J70651
10236B33247j10170l7427O2270b62629N078A63297A5929g4067A11812M9078b13250
10224g9429k77048b6949k74944L4215B2954a88975o9341M1407N8244A5763J18711
10213A34474D6412I559g1039j85924A42517b35246H9003b65144C24631I778l253
10202F525g8525q0390d5369j6533B45771c91856a69357B54530f1195j96476b8967
$$ plain form
10190 103906 -260652 -38130 -21782 -291876 -70808 -147925 -126133 124666 -325759 153258
10179 -132759 102976 -84625 130557 80732 424692 -122788 -15601 -29735 -503294 -167893
10168 -214181 -176688 -146747 87743 -364041 -70789 -91968 -225137 -62233 -114179 148394 -18018
10156 -179088 83917 1930 -174925 5692 -241081 -375705 325070 92679 -422148 -11229 8961
10144 -48182 220624 4877 -76741 -102429 116746 -164967 -17724 370626 -2841 -245537 141377
10132 2690 127858 -67050 -56508 43797 -16102 -161072 282964 -59362 -52302 462708 -232080
10120 -158941 91927 -68839 245090 -199836 88766 -121176 -110126 -124260 -160702 -71843 -196121
10109 -196121 -12323 -92438 97675 -49473 -184522 -78417 -473911 -70338 199722 -131381 146077
$$ packed form
10190A03906b60652c8130J6348k70094g0808p7117K1792A24666c25759A53258
10179a32759A02976h4625A30557m9825L43960a22788a5601j4134m73559a67893
10168b14181L7493K9941H7743c64041g0789k1179j33169f2233n1946A48394a8018
10156a79088H3917A930a74925E692b41081j34624C25070I2679d22148a1229H961
10144d8182B20624D877g6741k5688A16746a64967a7724C70626b841k42696A41377
10132B690J25168f7050J0542D3797a6102j44970B82964e9362P060D62708b32080
10120a58941I1927f8839B45090a99836H8766a21176J1050j4134l6442g1843j24278
10109a96121a2323q0115I7675d9473j35049g8417l95494g0338A99722a31381A46077
$$ plain form
10097 -190193 -319918 -361907 2858 -259813 117676 -230888 193758 206977 59842 -194125
10086 90091 -324213 -277240 328530 92271 -72668 -77829 -66353 -147789 -251202 -51545 -75256
10075 -75256 -298577 20057 226321 -33221 -175118 -277110 -258775 183178 168895 43331 -200902
10063 -64078 -272200 -19117 -6540 -94830 322527 -4279 211038 100133 -132210 161518 -94480
10051 458202 -178400 -322379 36501 -78939 -169394 -345369 207085 66321 -57248 102140
10040 106815 -57174 -50059 72219 -150212 34403 246907 -191606 -303381 -127206 156870
10029 196747 -289179 73026 9867 -178713 -15262 240363 -143822 261226 -57306 5097 -6216
10017 256121 -114236 97238 -299697 -217749 -46684 -143335 -27803 -204101 -38177 -140232 39074
$$ packed form
10097a90193j29725m1989B858b59813A17676b30888A93758J3219E9842a94125
10086I0091c24213M6973C28530I2271g2668n161J1476q1436j03413e1545k3711
10075g5256k23321B0057K06264c3221j41897j01992J8335A83178j4283D3331b00902
10063f4078k08122a9117f540q8290C22527d279B11038A00133a32210A61518i4480
10051D58202a78400j43979C6501g8939r0455j75975B07085F6321e7248A02140
10040A06815e7174P115G2219a50212C4403K12504a91606j11775a27206A56870
10029A96747b89179G3026I867a78713a5262B40363a43822B61226e7306E097f216
10017B56121a14236I7238b99697Q1948d6684r6651b7803j76298c8177j02055C9074
$$ plain form
10005 -338628 -145548 12114 -133306 -78953 -71203 -214867 -396032 -15957 -213300 -287613 142146
9993 234924 887 -105282 -351983 43555 -156087 -111018 61404 -162362 14900 35342 276260
9982 276260 -231136 -205741 -121960 -158881 14621 -37094 9866 -174156 -57140 -22792 -360368
9971 -360368 -211491 20201 -15991 -162060 -225952 34520 -11696 -256143 -485343 -160679 -89387
9960 -89387 -247107 -107405 76176 -148237 -198479 85377 -358813 -184558 -70048 -102008 -165766
9949 -165766 -256429 -204474 111544 61043 33015 -24006 88697 -364310 -200087 -368664 39695
9937 132463 64359 -200854 -71993 200317 -258809 97850 -57988 -206207 -129028 -371194 97805
9925 -246550 -10341 71542 -56780 -238421 59999 155938 36717 63091 -51880 121590 100127
$$ packed form
10005c38628a45548A2114a33306N4353P750j43664j81165a5957j97343p4313A42146
9993B34924H87a05282k46701D3555a56087M5069F1404a62362A4900K0442K40918
9982B76260b31136K5395Q3781l6921A4621c7094I866a74156e7140b2792l37576
9971c60368J48877B0201a5991j46069o3892C4520a1696k44447k29200a60679P1292
9960h9387j57720a07405G6176a48237n0242H5377c58813J74255g0048l1960o3758
9949a65766r0663N1955A11544n0501k8028b4006H8697c64310J64223j68577C9695
9937A32463F4359b00854g1993B00317b58809I7850e7988j48219P7179k42166I7805
9925b46550a0341G1542e6780j81641E9999R5939C6717K6374e1880A21590k1463
$$ plain form
9914 100127 35119 -40158 -444483 -259221 45936 -195745 -178954 -283654 141870 -103623
9903 73677 -333588 -212967 -83508 28156 -315016 -186761 81043 -183815 -88079 24732 -13269
9891 -85999 -152817 75163 100462 -352356 -211543 -44558 -261267 143472 -443431 60771 -226051
9879 15904 2681 -86323 -182868 135226 81516 158904 -74285 -224290 -290820 46960 85693 -155331
9866 31520 -559753 24659 -14215 106607 -189299 -178251 41870 28182 -36414 -73740 -30519
9854 -82438 -137073 -344626 52331 -102568 -269413 83616 47132 -71416 -55415 -124642 47125
9842 -358786 -23001 -152471 -27026 116524 -10748 -95979 -366012 -52405 54958 123271 -125089
9830 9616 278665 96574 10035 -137569 -356510 -53716 171597 -82782 -785881 260971 -30339
$$ packed form
9914A00127C5119d0158m04325J85262D5936a95745J6791j04700A41870a03623
9903G3677c33588J20621h3508B8156c15016J28255H1043a83815h8079B4732a3269
9891h5999o6818G5163K5299c52356J40813d4558k16709A43472d43431F0771b26051
9879A5904B681h6323r6545A35226n3710P7388g4285j50005o6530D6960L8733a55331
9866C1520e59753B4659a4215A06607a89299J1048D1870j3688c6414l7326c0519
9854h2438n4635k07553E2331a02568j66845H3616l6484g1416J6001o9227D7125
9842c58786b3001j29470b7026A16524a0748q5231k70033e2405E4958O8313a25089
9830I616K69049I6574A0035a37569k18941e3716A71597h2782p03099B60971c0339
$$ plain form
9818 -124116 -316423 -156288 -230314 -210089 -2140 -139564 -17172 -392931 -162249 4523 -218638
9806 -99364 -347793 26365 58060 -108144 -412073 -145565 31525 -125300 -80142 272875 -341781
9794 264267 -30944 -149665 -56107 425363 78541 -7918 -229015 212377 -35049 -370998 115893
9782 -142917 -582324 350743 -15201 -48666 -163604 38421 -311722 -83833 -84797 -229957 202184
9770 -86816 -477355 -83889 69065 -19355 -104921 -28009 -160752 -185246 -270361 -23197 -192282
9759 -192282 396725 4267 -177447 345911 -30073 -377122 138103 -51368 -347874 103813
9748 -180070 230811 -192280 -329930 121779 182830 -162562 -87871 -375107 -34349 -235683
9738 -235683 17989 -141983 -134139 56681 101016 16933 -151788 119734 -54477 994 -47668 -123881
$$ packed form
9818a24116j92307a56288p4026K0225b140j37424a7172l75759a62249D523b18638
9806i9364k48429B6365L1695a08144l03929a45565C1525a25300M5158B72875c41781
9794B64267c0944j18721e6107D25363G8541g918k21097B12377c5049l35949A15893
9782a42917m39407C50743a5201l3465j14938C8421c11722h3833r64j45160B02184
9770h6816l90539h3889F9065a9355q5566b8009j32743k4494q5115b3197j69085
9759a92282C96725D267a77447C45911c0073l47049A38103e1368k96506A03813
9748a80070B30811a92280j37650A21779O1051a62562P4691k87236c4349k01334
9738b35683A7989a41983P844E6681M4335A6933a51788A19734e4477I94d7668p6213
$$ plain form
9726 -123881 -4134 142668 46419 -94534 -449746 -100770 -169667 115353 -12811 -199238 -14834
9714 46493 -120930 10354 -38406 154755 -17629 -310984 -72371 -36665 -23165 -70698 -44486
9703 -44486 -214302 -161309 -122115 109390 23089 -17218 249382 -26396 -154897 -173938 14324
9691 41198 -238832 -68307 -29180 113686 -113923 -217012 21525 -197232 58656 89952 -171045
9679 -44860 -105224 -92328 -128729 -263211 131973 -44774 126388 -570394 41408 -363933 4470
9667 -79904 -307489 4457 -88655 -118890 -19810 49077 -154607 -72123 34925 -133848 31667
9655 -368933 131801 -297953 -118245 229511 209720 -124961 -245010 67412 143952 -269854
9644 -10429 40508 16376 -34438 -207280 -2699 -65957 113421 -220288 -143059 84060 -7433 -289647
$$ packed form
9726a23881d134A42668D6419i4534l55212a00770o8897A15353a2811j86427a4834
9714D6493a20930A0354c8406A54755a7629k93355g2371L5706J3500m7533K6212
9703d4486j69816N2993L9194A09390B3089a7218B49382b6396j28501j9041A4324
9691D1198b38832f8307b9180A13686a13923j03089B1525a97232E8656L1296a71045
9679d4860o0364J2896l6401j34482A31973d4774A26388e70394D1408c63933D470
9667g9904k27585D457h8655l0235a9810D9077a54607g2123C4925a33848C1667
9655c68933A31801b97953a18245B29511j9791a24961j20049F7412P6540b69854
9644a0429D0508A6376c4438j72842b699o3258A13421b20288P7229H4060g433k82214
$$ plain form
9632 -289647 142096 -51314 -1123 90487 -301153 5548 14491 150880 247387 -211447 155583
9620 -229237 227267 -228154 -108962 -120379 -107995 271878 -392200 -79834 121808 57032
9609 118122 -108522 84180 118258 115203 -157682 -39607 -219661 -10137 134990 -198016 19915
9597 -56751 16122 -155561 106157 -181266 -270891 -306058 -26684 -298820 -234817 -207351 192483
9585 -264 -140532 -109843 6381 -149416 32598 104674 -146507 -225369 -298636 -122825 -72877 178063
9572 -125691 344087 26334 91146 -347864 88123 141227 -48604 -46172 48418 71570 263932
9561 263932 136537 102985 152234 -165721 42829 -170599 -186377 152004 -341119 -25639 -238697
9550 -238697 210036 39878 -204097 -235519 -118564 -162342 40176 -196003 -43259 -143938 26779
$$ packed form
9632b89647A42096e1314a123I0487c01153E548Q943J36389R6507b11447A55583
9620b29237B27267b28154a08962j1417J2384B71878c92200g9834A21808E7032
9609A18122a08522H4180L4078l055a57682c9607j80054a0137A34990a98016A9915
9597e6751A6122a55561A06157a81266q9625l5167b6684k72136O4003K7466A92483
9585b64j40268L0689F381a49416C2598P2076a46507p8862p3267a22825M9948A78063
9572a25691C44087B6334O4812c47864H8123N3104d8604K432D8418K3152J92362
9561B63932j27395l3552M9249a65721D2829a70599j5778A52004c41119b5639k13058
9550b38697B10036C9878b04097l1422J16955m3778D0176a96003d3259j00679B6779
$$ plain form
9538 -194937 -260362 -17249 48423 373092 -96205 -262317 29755 136353 48450 -190912 -31916
9526 229022 108703 -79205 -81976 -157997 -249815 -473986 -82753 -11204 -376728 10311 66594
9515 66594 55502 66214 69025 -72605 -570771 -242139 93959 -159093 -95379 -301057 -17265
9503 -224740 -203582 207312 -271429 25094 57747 -178227 -96523 230644 -21836 -138301 -105352
9492 -105352 303388 -24591 -138284 -11064 -72982 -273498 -235570 -191558 252852 -63762 -479422
9481 -479422 -141978 -41205 -280409 -137041 -323366 93707 10092 -40479 -118573 269729 -331247
9469 -127852 89119 189445 138045 259299 -165277 -27695 31830 -347812 18021 -239523 -313590
9458 -313590 -314275 27065 -107479 -52850 44523 47239 3942 -358057 -406413 -103958 14367 -359300
$$ packed form
9538a94937o5425a7249D8423L24669i6205j66112B9755J06598D8450a90912c1916
9526B29022A08703g9205k771p6021r1818k24171h2753a1204l65524A0311N6283
9515F6594j1092J0712K811g2605m98166b42139I3959a59093O3714k05678a7265
9503b24740K1158B07312b71429B5094L2653a78227Q1704B30644b1836j16465L2949
9492a05352C03388b4591j13693a1064o1918k00516L7928M4012B52852f3762m15660
9481d79422a41978d1205k39204a37041j86325I3707A0092d0479p8094B69729c31247
9469a27852H9119J00326n1400J21254a65277b7695C1830c47812A8021b39523p4067
9458c13590o85B7065a07479e2850D4523K716C942c58057m8356a03958A4367c59300
$$ plain form
9445 111140 26110 410311 -72392 123850 260517 150262 93466 5095 41110 234960 -220064
9433 116901 17101 143761 69669 -99175 -103970 -352216 -262800 -225344 112661 -102780 -75022
9422 -75022 -124493 -108862 -129564 232316 45484 -147694 -113108 20052 167661 -68984 -308200
9411 -308200 -240115 -136455 -82762 -156141 -132266 -219940 106232 22155 -82088 -329557 -90305
9399 -262053 -48705 -93403 -45578 -72540 70657 279485 -92823 -339270 -136954 -306123 -398606
9388 -398606 331505 -173750 441 -81019 -100891 171447 -102066 -316282 68380 66302 322869
9377 322869 156167 -236920 -189834 -28543 -12662 -152092 -120829 -58767 300438 -12664 -98014
9366 -98014 -221825 12557 -156564 53999 -51375 -211668 -157212 144699 -148307 188382 -167471
$$ packed form
9445A11140B6110L84201g2392A23850J36667j10255n6796E095L6015J93850b20064
9433A16901A7101J26660F9669i9175m795k48246Q9416L7456A12661a02780K7758
9422g5022m9471J5631k0702B32316D5484a47694L4586B0052J47609f8984k39216
9411c08200O8085J03660N3693p3379K3875q7674A06232B2155h2088k47469i0305
9399b62053d8705m4698d5578k6962G0657K08828i2823k46447a36954j69169r2483
9388c98606C31505a73750D41h1019j9872A71447a02066k14216F8380k078K56567
9377C22869A56167b36920M7086b8543a2662j39430L1263e8767C00438a2664q5350
9366i8014j23811A2557a56564E3999e1375j60293N4456A44699a48307A88382a67471
$$ plain form
9354 -90276 -80130 -134562 -72337 54806 62343 40353 -356003 -89592 -35061 120941 -46831 393403
9341 117295 -397476 -14897 -125649 123174 -104973 -165412 72171 -21937 18841 45371 187159
9330 187159 88424 -436697 -50425 38743 -117178 -278194 57945 -22503 -104203 -199218 57600
9318 78127 -92184 -228881 -332258 -30761 -120968 -22513 92396 -327121 201598 -269945 -21479
9306 79173 -46594 139535 -482750 37887 -167825 -107971 -127556 -42566 32937 -373998 164933
9294 -229993 -207530 -253884 -206092 -373841 -37522 -49898 84802 -377409 -79082 -181255 62181
9282 -168 -49724 112443 51909 -54606 240771 322 -171495 46360 -184688 -103764 -206946 -138905
9270 -138905 -121044 145522 -173135 -295232 -181051 -141147 -87724 -209459 -167090 -164218 221728
$$ packed form
9354i0276J0146n4432O2225E4806P537k1990c56003h9592c5061A20941d6831C93403
9341A17295c97476a4897j10752A23174a04973o0439G2171b1937A8841K6530J41788
9330A87159H8424d36697e0425C8743a17178j61016E7945b2503q1700r5015E7600
9318G8127i2184j36697j03377c0761r0207b2513I2396c27121B01598b69945b1479
9306G9173d6594A39535d82750C7887a67825N9854j9585d2566C2937c73998A64933
9294b29993K2463m6354M7792j67749c7522j2376H4802c77409g9082j02173F2181
9282a68m9556A12443E1909e4606B40771C22a71495D6360a84688Q0924j03182O8041
9270a38905J7861A45522a73135j22097J14181L9904N3423j21735M2369K872B21728
$$ plain form
9258 -154152 157765 -123421 -150217 -217359 -278159 -80086 -305947 18080 -117626 -180204 -227991
9247 -227991 100502 -86930 8198 -240252 -79733 -112081 -168457 259912 99917 -169509 -230898
9236 -230898 -322831 -118516 340706 162993 -6548 -89131 308246 -154499 132536 -62264 -22060
9224 -129258 112647 47723 128038 -215175 42480 6183 -272446 -202070 -110450 260464 -305008
9212 -217389 -217022 173168 -39008 -159703 -162831 -369401 236534 -257041 -196288 25092 -49881
9200 -331944 -27708 689 65823 -415827 -270876 -33181 -264832 119933 61854 173952 61444
9188 -241099 24440 -54902 -91083 124779 -52835 60097 -146697 -237403 142081 -54515 -145964
9177 -145964 -109856 -370731 2911 -163769 -88830 14666 -64306 -225423 -193514 92161 23384
$$ packed form
9258a54152A57765a23421k6796o7142o0800h0086k25861A8080a17626o2578m7787
9247b27991A00502h6930H198b40252g9733l2348n6376B59912I9917a69509o1389
9236b30898r1933a18516C40706A62993f548q2583C08246a54499A32536f2264b2060
9224a29258A12647D7723Q0315b15175D2480F183b72446P0376R1620B60464c05008
9212b17389L67A73168c9008j20695l128k06570B36534b57041O0753B5092d9881
9200c31944b7708F89O5134d15827J44951c3181k31651A19933n8079J12098F1444
9188b41099B4440e4902l6181A24779e2835F0097a46697r0706A42081e4515r1449
9177a45964L6108k60875B911a63769P4939A4666f4306j61117L1909I2161B3384
$$ plain form
9165 -172433 -69732 -96029 34859 -5400 101789 73677 73740 -167989 122886 -7174 67309 196545
9153 196545 -84363 -124543 -77268 -69132 99310 28103 4845 -76162 -238981 -122361 -198358 -96434
9140 -256320 -496646 -245354 -85541 453211 46852 7053 -51625 -59403 13199 73319 243979
9129 243979 -288471 -308008 111954 5887 -24906 78120 -191006 -139425 -187619 81819 -139427
9117 -120514 96958 239736 -184107 15656 -255515 33532 23278 170324 327911 -276159
9106 21113 -143775 -145908 89405 467823 -19352 213963 47050 -286951 -419448 -124639 -342499
9095 -342499 398 164584 -44300 173741 -44364 -135518 57273 -304292 -147711 -13874 -124976
9084 -124976 141048 79380 -69755 10084 40627 -267678 42183 -30177 -297534 320984 102383
$$ packed form
9165a72433f9732k6297C4859e400A01789k8112O3a67989A22886g174F7309J29236
9153A96545h4363m0180M7275Q136I9310B8103D845g6162j62819J16620p5997i6434
9140b56320k40326b45354h5541D53211D6852G053e1625p778A3199O0120J70660
9129B43979b88471j9537A11954E887b4906G8120a91006N1581m8194H1819a39427
9117a20514I6958J42778a84107A5656b55515C3532j0254J47046J57587b76159
9106B1113a43775k133H9405L78418a9352B13963D7050b86951j32497a24639k17860
9095c42499C98J64186d4300A73741d4364r1154E7273c04292a47711a3874j11102
9084a24976A41048o1668f9755A0084L0543b67678D2183c0177k67357C20984A02383
$$ plain form
9072 -63863 103629 -469238 -108401 171670 -21166 52123 -375930 251862 -73241 -55651 -230007
9061 -230007 50204 128979 -12612 -113166 79063 -121928 -9250 129342 202607 3808 -36929
9049 -226337 93020 71861 -67655 -339726 115383 8855 286488 -343181 38496 -178787 17540
9037 97188 -215138 -16857 16847 -162732 48121 -246982 -228661 -322792 -213892 242790 -68165
9025 -21943 -137420 176863 143291 -143144 -182855 45376 -67651 31033 -260223 -316109 -12717
9013 -172140 201612 73179 -172317 -105417 -309140 64520 -64349 -15592 48920 -150156 -114551
9002 -114551 -108957 -201082 -102958 -209354 -24081 -71771 185697 -160074 -139812 -251651 17265
8990 81900 -110185 -132163 -29013 -182072 -81064 6880 186548 -219038 -282143 -40683 -324370
$$ packed form
9072f3863A03629d69238a08401A71670b1166E2123c75930B51862g3241J7590j74356
9061b30007E0204P8775a2612j00554G9063a21928i250A29342P3265C808c6929
9049b26337I3020k1159f7655k72071A15383H855K77633c43181C8496a78787A7540
9037I7188b15138a6857A6847a62732D8121b46982J8321r4131J08900B42790f8165
9025b1943j15477A76863l3572a43144l9711D5376f7651C1033b60223n5886a2717
9013a72140B01612G3179a72317O6900k03723F4520f4349a5592D8920a50156L5605
9002a14551N594r2125R8124j06396b4081m7690A85697a60074K0262j11839A7265
8990H1900a10185k1978b9013j53059h1064F880J79668b19038o3105d0683k83687
$$ plain form
8979 -324370 -105596 258268 198474 172632 3051 161711 16121 -94540 215237 -122037 -257152
8968 -257152 -42784 53786 -403668 82268 100728 -71545 -21758 -174127 6515 -91144 78749
8956 -17110 97975 -37096 212297 -348047 69522 66846 276468 -65930 72463 -146677 -336431
8945 -336431 -50230 165426 -387040 115417 183752 -64050 -108177 229293 -226813 -190226 18203
8933 -248859 3095 -100908 -117742 -247049 -421496 -143386 30650 -233032 192904 132779 293823
8922 293823 -15988 -93722 -194364 -275237 -321510 40790 229627 -108553 -31451 -112222 195119
8910 -239450 26681 361219 67718 295621 478029 1075778 2109196 4370427 3100346 1347823
8899 1130906 603240 305654 447851 51122 342173 -155011 24171 -305417 -77991 258271
$$ packed form
8979c24370a05596B58268n9794k5842C051J58660A6121i4540B15237a22037j35115
8968b57152d2784E3786d03668H2268J8460g1545b1758j52369F515i1144G8749
8956a7110I7975c7096B12297c48047F9522k676K09622f5930G2463a46677j89754
8945c36431e0230A65426c87040A15417O8335f4050m4127B29293b26813L6587A8203
8933b48859C095a00908j6834j29307j74447a43386C0650b33032A92904o0125J61044
8922B93823a5988p7734j00642q0873m6273D0790J88837a08553c1451q0771A95119
8910b39450B6681L34538F7718K27903J82408N97749J033418K261231j270081A347823
8899A130906n27666k97586J42197E1122K91051a55011B4171c05417g7991B58271
$$ plain form
8888 136114 123471 -123369 -46452 -36893 67926 219435 124803 -327616 430315 -216468 59586
8876 -98245 -54361 243438 262960 -99520 235984 -373947 -55305 -192373 -8848 -53998 -83087
8865 -83087 159430 -209443 -112415 -150506 58163 107617 -176414 -96131 -329841 -233702 23280
8853 -166649 173251 24588 -11784 33746 31049 -96485 -94941 -228031 -216897 -106175 69679
$$ packed form
8888A36114j2643a23369d6452R559F7926J51509r4632c27616D30315b16468E9586
8876i8245M3884B43438J9522i9520B35984c73947e5305j37068h848m5150k9089
8865h3087A59430b09443R7028l8091E8163M9454a76414Q0283k33710R6139B3280
8853a66649A73251B4588a1784C3746k697i6485J544j33090J1134a06175F9679
$$ [...]
##END NTUPLES=NMR SPECTRUM
##END=
