
##TITLE=AC1110_Colombia_5835382_ZlHcrL0rVu
##JCAMPDX= 6.0         $$ Bruker NMR JCAMP-DX V2.0
##DATA TYPE= NMR SPECTRUM
##DATA CLASS= NTUPLES
##ORIGIN= BRUKER
##OWNER= Administrator
$$ 1.72 TOPSPIN		Version 2.1
$$ 2012-03-26 23:39:42.187 -0500  Administrator@TOPSPIN
$$ Compression mode = diff/dup
##.OBSERVE FREQUENCY= 400.13188235
##.OBSERVE NUCLEUS= ^1H
##.ACQUISITION MODE= SIMULTANEOUS (DQD)
##.ACQUISITION SCHEME= undefined
##.AVERAGES= 8
##.DIGITISER RES= 22
##SPECTROMETER/DATA SYSTEM= spect
##.PULSE SEQUENCE= zg30
##.SOLVENT NAME= COFFEE_meoh
##.SHIFT REFERENCE= INTERNAL, COFFEE_meoh, 1, 14.98061
##AUDIT TRAIL= $$ (NUMBER, WHEN, WHO, WHERE, PROCESS, VERSION, WHAT)
$$ ##TITLE= Audit trail, TOPSPIN		Version 2.1
$$ ##JCAMPDX= 5.01
$$ ##ORIGIN= Bruker BioSpin GmbH
$$ ##OWNER= Administrator
$$ $$ C:\Bruker\TOPSPIN/data/COFFEE/nmr/AC1110_Colombia_5835382_ZlHcrL0rVu/10/pdata/1/auditp.txt
$$ ##AUDIT TRAIL=  $$ (NUMBER, WHEN, WHO, WHERE, PROCESS, VERSION, WHAT)
(   1,<2012-03-26 23:39:35.125 -0500>,<Administrator>,<TOPSPIN>,<go>,<TOPSPIN 2.1>,
      <created by zg
	started at 2012-03-26 23:38:28.578 -0500,
	POWCHK enabled, PULCHK disabled,
       configuration hash MD5:
       1A 1E CE 29 27 FD 77 03 67 4E F0 E3 C4 B2 CB 90
       data hash MD5: 64K
       3A 89 24 A1 D6 A3 CC 13 16 A1 23 C8 31 CD 68 45>)
(   2,<2012-03-26 23:39:37.765 -0500>,<Administrator>,<TOPSPIN>,<proc1d>,<TOPSPIN 2.1>,
      <Start of raw data processing
       efp LB = 0 FT_mod = 6 PKNL = 1 PHC0 = 0 PHC1 = 0 SI = 32K 
       data hash MD5: 32K
       56 7A AC 44 56 5B D8 9E 45 50 5F 13 59 46 45 C6>)
(   3,<2012-03-26 23:39:38.125 -0500>,<Administrator>,<TOPSPIN>,<proc1d>,<TOPSPIN 2.1>,
      <pk PHC0 = 211.5143 PHC1 = 0 
       data hash MD5: 32K
       81 D6 83 F1 8F 07 EB BD 9C 6E 7E 26 C0 E9 A3 E8>)
(   4,<2012-03-26 23:39:38.203 -0500>,<Administrator>,<TOPSPIN>,<proc1d>,<TOPSPIN 2.1>,
      <abs ABSG = 1 
       data hash MD5: 32K
       3A 80 23 17 1A EE B8 3D 93 05 DA 21 88 FE 02 46>)
(   5,<2012-03-26 23:39:38.234 -0500>,<Administrator>,<TOPSPIN>,<proc1d>,<TOPSPIN 2.1>,
      <abs ABSG = 2 
       data hash MD5: 32K
       D7 EA D2 0F 34 6F F4 2C CC 98 31 B8 70 A0 90 D4>)
(   6,<2012-03-26 23:39:38.265 -0500>,<Administrator>,<TOPSPIN>,<proc1d>,<TOPSPIN 2.1>,
      <abs ABSG = 3 
       data hash MD5: 32K
       5D 01 A2 F5 9D 0D 01 24 FA D8 E1 D3 E0 51 B8 D6>)
(   7,<2012-03-26 23:39:38.296 -0500>,<Administrator>,<TOPSPIN>,<proc1d>,<TOPSPIN 2.1>,
      <abs ABSG = 4 
       data hash MD5: 32K
       D8 51 34 DA 1C EF 70 67 0D 31 34 F3 CB 45 1B 36>)
(   8,<2012-03-26 23:39:38.312 -0500>,<Administrator>,<TOPSPIN>,<proc1d>,<TOPSPIN 2.1>,
      <abs ABSG = 5 
       data hash MD5: 32K
       2C 16 DE B3 97 E5 52 6D C8 0A C3 2E A2 EF 88 8E>)
$$ ##END=
$$ 
$$ $$ hash MD5
$$ $$ E8 84 B8 E2 EA B4 0C BE D4 93 9D 00 00 A1 11 19
##$RELAX= 
##$RELAX= 
##$RELAX= 
##$RELAX= 
##$RELAX= 
##$RELAX= 
##$RELAX= 
$$ Bruker specific parameters
$$ --------------------------
$$ [...]
##$TP= (0..7)
150 150 150 150 150 150 150 150
##$TP07= 0
##$TPNAME0= <>
##$TPNAME1= <>
##$TPNAME2= <>
##$TPNAME3= <>
##$TPNAME4= <>
##$TPNAME5= <>
##$TPNAME6= <>
##$TPNAME7= <>
##$TPOAL= (0..7)
0.5 0.5 0.5 0.5 0.5 0.5 0.5 0.5
##$TPOFFS= (0..7)
0 0 0 0 0 0 0 0
##$TUNHIN= 0
##$TUNHOUT= 0
##$TUNXOUT= 0
##$USERA1= <user>
##$USERA2= <user>
##$USERA3= <user>
##$USERA4= <user>
##$USERA5= <user>
##$V9= 5
##$VALIST= <valist>
##$VCLIST= <CCCCCCCCCCCCCCC>
##$VD= 0
##$VDLIST= <DDDDDDDDDDDDDDD>
##$VPLIST= <PPPPPPPPPPPPPPP>
##$VTLIST= <TTTTTTTTTTTTTTT>
##$WBST= 1024
##$WBSW= 4
##$XGAIN= (0..3)
0 0 0 0
##$XL= 0
##$YL= 0
##$YMAX_a= 532084
##$YMIN_a= -652178
##$ZGOPTNS= <>
##$ZL1= 120
##$ZL2= 120
##$ZL3= 120
##$ZL4= 120
##$ABSF1= 14.98061
##$ABSF2= -5.57192
##$ABSG= 5
##$ABSL= 3
##$ALPHA= 0
##$AQORDER= 0
##$ASSFAC= 0
##$ASSFACI= 0
##$ASSFACX= 0
##$ASSWID= 0
##$AUNMP= <proc_prof1d_extract_pilot.lims>
##$AXLEFT= 0
##$AXNAME= <>
##$AXNUC= <1H>
##$AXRIGHT= 0
##$AXTYPE= 0
##$AXUNIT= <>
##$AZFE= 0.1
##$AZFW= 0.1
##$BCFW= 0
##$BC_mod= 0
##$BYTORDP= 0
##$COROFFS= 0
##$CY= 15
##$DATMOD= 1
##$DC= 0
##$DFILT= <>
##$DTYPP= 0
##$F1P= 0
##$F2P= 0
##$FCOR= 0.5
##$FTSIZE= 32768
##$FT_mod= 6
##$GAMMA= 0
##$GB= 0
##$INTBC= 1
##$INTSCL= 1
##$ISEN= 128
##$LB= 0
##$LEV0= 0
##$LPBIN= 0
##$MAXI= 10000
##$MC2= 0
##$MEAN= 0
##$ME_mod= 0
##$MI= 0
##$NCOEF= 0
##$NC_proc= -8
##$NLEV= 6
##$NOISF1= 0
##$NOISF2= 0
##$NSP= 0
##$NTH_PI= 0
##$NZP= 0
##$OFFSET= 14.98061
##$PC= 1
##$PHC0= 211.5143
##$PHC1= 0
##$PH_mod= 1
##$PKNL= yes
##$PPARMOD= 0
##$PPDIAG= 0
##$PPIPTYP= 0
##$PPMPNUM= 2147483647
##$PPRESOL= 1
##$PSCAL= 4
##$PSIGN= 0
##$PYNMP= <proc.py>
##$REVERSE= no
##$SF= 400.13
##$SI= 32768
##$SIGF1= 0
##$SIGF2= 0
##$SINO= 400
##$SIOLD= 32768
##$SPECTYP= <>
##$SREGLST= <1H.CDCl3>
##$SSB= 0
##$STSI= 32768
##$STSR= 0
##$SW_p= 8223.68421052632
##$SYMM= 0
##$S_DEV= 0
##$TDeff= 65536
##$TDoff= 0
##$TI= <>
##$TILT= no
##$TM1= 0
##$TM2= 0
##$TOPLEV= 0
##$USERP1= <user>
##$USERP2= <user>
##$USERP3= <user>
##$USERP4= <user>
##$USERP5= <user>
##$WDW= 1
##$XDIM= 32768
##$YMAX_p= 465521024
##$YMIN_p= -744919
##$CURPLOT= <Network HP LaserJet P1505>
##$CURPRIN= <$Network HP LaserJet P1505>
##$DFORMAT= <normdp>
##$LAYOUT= <+/1D_H.xwp>
##$LFORMAT= <normlp>
##$PFORMAT= <normpl>
##$SURQMSG= 1
$$ End of Bruker specific parameters
$$ ---------------------------------
##NTUPLES= NMR SPECTRUM
##VAR_NAME=  FREQUENCY,     SPECTRUM/REAL,   SPECTRUM/IMAG
##SYMBOL=    X,             R,               I
##VAR_TYPE=  INDEPENDENT,   DEPENDENT,       DEPENDENT
##VAR_FORM=  AFFN,          ASDF,            ASDF
##VAR_DIM=   32768,         32768,           32768
##UNITS=     HZ,            ARBITRARY UNITS, ARBITRARY UNITS
##FACTOR=    0.250966925370066, 1,           1
##FIRST=     8223.43324360095, 8307,         -75371
##LAST=      0,             -81594,          -37399
##MIN=       0,             -744919,         0
##MAX=       8223.43324360095, 465521024,    0
$$ Real data points
##PAGE= N=1
##DATA TABLE= (X++(R..R)), XYDATA
$$ [...]
$$ plain form
19475 -197546 -23598 -83342 67851 -76582 -107496 -181255 -24267 -47012 165264 -77134 -75878
19464 -75878 269985 -261128 -36131 -499900 343842 -121149 -82010 -378096 -105477 311808
19453 -209158 -88263 -162715 -96439 175893 -205318 193667 -318382 -183086 -369735 -137455
19442 9515 -116117 166682 111600 165700 -243346 -110541 81586 -230181 -428111 -45664 172414
19430 -159382 -107852 131533 -26582 41528 -28650 -221645 -199301 77329 -69226 -298564 -245376
19419 -245376 270634 73574 210000 261579 59588 -166164 -120650 -235979 171923 -135148
19408 -41170 -126701 -5366 -286356 105887 9075 -270688 -151189 407358 -5461 47901 128586
19397 128586 48989 -325255 -154292 -103401 340002 -393554 38676 -23480 -97376 54641 -105590
$$ packed form
19475a97546b3598n9744F7851g6582l0914p3759b4267k2745A65264g7134J256
19464g5878B69985b61128c6131m63769C43842a21149L9139k96086a05477C11808
19453b09158h8263p4452O6276A75893b05318A93667c18382J35296j86649a37455
19442I515a16117A66682n5082N4100b43346a10541H1586b30181j97930d5664A72414
19430a59382N1530A31533b6582D1528b8650j92995K2344G7329f9226k29338N3188
19419b45376B70634G3574J36426N1579E9588a66164M5514j15329A71923a35148
19408d1170q5531e366k80990A05887I075b70688J19499D07358e461D7901Q0685
19397A28586D8989c25255a54292N0891C40002c93554C8676b3480p3896E4641a05590
$$ plain form
19385 95346 -138678 -2920 20999 -129795 -221862 -187804 -18216 41803 -296212 -220134 31666
19373 -96492 -118737 145107 -218791 -402247 -46844 -374898 163808 -131862 -237848 -38321
19362 -186803 -207904 16495 -12468 -140171 -214124 -239022 -178406 -239778 230970 -131852 136099
19350 156193 -2230 -223102 -109305 -141978 -83596 -104792 101399 146855 -76293 273051 231947
19339 231947 44424 357890 -470635 -110721 -21036 23005 60917 -106717 -55987 -182182
19329 -182182 141199 -37617 48344 -228525 -324552 -20821 -148355 -260750 -196195 -383416
19319 -383416 -219295 -287009 277044 -122109 45950 214693 -366124 235274 -80870 -177037
19309 -177037 58243 -145140 -109219 -27044 -311694 218781 -152380 150718 -27658 -125700
$$ packed form
19385I5346a38678b920B0999a29795r2067L4058a8216D1803b96212P6078C1666
19373i6492k2245A45107b18791j83456d6844l28054A63808a31862j05986c8321
19362a86803k1101A6495a2468j27703p3953k4898O0616o1372B30970a31852A36099
19350A56193b230k20872a09305l2673N8382k1196A01399M5456g6293B73051m1104
19339B31947D4424L13466d70635a10721b1036B3005L7912a06717N0730j26195
19329a82182A41199c7617D8344b28525r6027b0821j27534j12395O4555j87221
19319c83416J64121o7714B77044a22109D5950J68743c66124B35274h0870r6167
19309a77037E8243a45140L5921b7044k84650B18781a52380A50718b7658r8042
$$ plain form
19299 -125700 -84491 192114 -101108 108749 22126 176751 -254214 -262979 1728 103290 -97267
19287 6023 90369 149632 -190098 -158316 14882 -12689 -151710 144496 -168975 -28502 58890
19275 122695 -84809 -54055 77210 17941 -15162 -8478 -54991 205368 -352488 -26338 -366548
19264 -366548 -99523 23216 21061 -195854 78737 -209983 244759 151435 17341 -258288 -399594
19253 -399594 -326149 -133720 -113503 -78497 5196 -103236 -170525 -221478 12723 68416 -37141
19241 91985 62491 -117315 -264059 -216129 291488 -323086 -78755 145613 142572 114494 -56747
19229 -281764 -43587 97428 -393684 -104311 -307073 71360 -392314 111601 -134615 23296
19218 51056 -255347 4104 -46341 -210480 -175146 -290648 14782 -44077 -231373 -144955 -61851
$$ packed form
19299a25700M1209A92114a01108A08749B2126J54625b54214q765A728J01562i7267
19287F023Q4346N9263a90098L1782A4882a2689j39021A44496a68975b8502E8890
19275A22695h4809L0754G7210A7941a5162O684m6513B05368c52488b6338l40210
19264c66548i9523B3216k155a95854G8737b09983B44759r3324A7341b58288j41306
19253c99594P3445a33720K0217L5006E196a03236o7289n0953A2723N5693c7141
19241I1985k9494a17315j46744M7930B91488c23086g8755A45613l041k8078e6747
19229b81764d3587I7428c93684a04311k02762G1360c92314A11601a34615B3296
19218E1056b55347D104d6341j64139L5334j15502A4782d4077j87296Q6418f1851
$$ plain form
19206 -34706 -24082 91110 -7069 -232999 -17129 28933 -41686 -205769 76881 118532 -140296
19194 72897 -150034 -61462 32251 151 -113304 252529 -213757 -145424 -61378 -243160 -292161
19183 -292161 33379 82805 -923 -93322 -318822 117382 -205917 -190941 -95132 -403077 -290463
19172 -290463 -90336 -380474 -181525 116743 203998 24982 192516 -249636 -45817 189480
19161 -289336 88874 -39564 205157 -86238 -127377 6944 -301567 27610 -319070 75778 -223016
19149 82747 161420 -59500 35359 -274015 -251839 -61085 190144 -97702 -213480 -233330 -132892
19138 -132892 51452 -223904 -301585 -48250 31253 306208 35270 -38204 221917 24310 117427
19127 117427 -214191 -196002 63366 10931 -127356 -114092 -264977 156066 109839 -194815
$$ packed form
19206c4706J0624I1110g069k25930a7129B8933d1686j64083G6881M1651a40296
19194G2897a50034f1462C2251A51a13304B52529b13757O8333f1378j81782m9001
19183b92161C3379M9426i23r2399k25500A17382b05917J4976i5132l07945J12614
19172b90463i0336k90138a81525A16743Q7255B4982J67534b49636d5817A89480
19161b89336H8874c9564B05157h6238m1139F944c01567B7610c19070G5778b23016
19149H2747P8673e9500C5359b74015K2176f1085A90144i7702j15778j9850J00438
19138a32892E1452b23904p7681d8250C1253K74955C5270c8204B21917B4310R3117
19127A17427b14191J8189F3366A0931a27356J3264j50885A56066m6227a94815
$$ plain form
19116 20478 -108229 -195996 89608 -29530 -216828 -18264 59399 -302525 -270502 136794 78487
19105 78487 -84243 -89431 83838 -100663 -112927 -119557 -207497 43341 -172077 -258662 -256653 270429
19092 -77607 -144150 257366 -98808 -163715 28778 -117606 22227 122536 58938 -77699 19934
19080 -121729 157806 -64986 239934 -174907 79918 -185611 -138462 -65802 -198670 12707
19069 -207966 -99033 -162453 -413914 -251758 36153 -286890 -111868 -28402 125317 -41520
19058 -117013 -69846 -32318 -134754 -84153 109349 127134 53506 -68438 163254 -125396 -218463
19047 -218463 -185741 254312 64359 -282822 -65626 35699 -22623 -85271 175596 -1450 -195465
19036 -195465 -101800 266528 -160201 275109 -178454 -247693 -108502 -293029 62134 -335730
$$ packed form
19116B0478a08229q7767H9608b9530j87298a8264E9399c02525L2023A36794n8307
19105G8487h4243n188H3838a00663j2264o630q7940D3341a72077q6585K009B70429
19092g7607o6543B57366i8808o4907B8778a17606B2227J00309E8938g7699A9934
19080a21729A57806f4986B39934a74907G9918a85611M7149f5802j32868A2707
19069b07966i9033o3420k51461J62156C6153b86890a11868b8402A25317d1520
19058a17013M7167c2318j02436N0601A09349J7785E3506f8438A63254a25396r3067
19047b18463L2722B54312F4359b82822f5626C5699b2623o2648A75596a450j94015
19036a95465R3665B66528a60201B75109a78454o9239a08502j84527F2134c35730
$$ plain form
19025 -15698 177335 -67997 323497 41315 -124508 141595 48702 142077 -214458 -72945 -76261
19014 -76261 357988 27665 262917 -126313 89266 -131539 137133 -4621 261624 28923 80734
19003 80734 80087 139272 327582 -16524 -214570 102717 -357729 19133 -124898 220179 15875
18991 -140225 -50955 39140 -22389 161630 -315765 97874 16426 -53157 157538 190812 375175
18980 375175 149719 -98012 -76448 435 -91337 86021 37064 -40750 -115372 99476 226175
18969 226175 -88121 -360472 -132235 171537 -202925 172392 131717 -86751 -264762 125519
18958 4419 -130674 364593 997682 56441 323933 305954 -105941 605139 157798 122730
18948 122730 -113583 -153615 -221384 47220 98577 70435 -352282 -292539 220766 48573 -53156
$$ packed form
19025a5698A77335f7997C23497D1315a24508A41595D8702R3375b14458g2945l316
19014g6261C57988B7665K35252a26313H9266a31539A37133d621B61624B8923N1811
19003H0734o47N9185J88310a6524j98046A02717c57729A9133a24898B20179A5875
18991a40225e0955C9140b2389A61630c15765I7874A6426e3157A57538L3274J84363
18980C75175A49719i8012K1564D35i1337H6021C7064d0750p4622I9476J26699
18969B26175h8121k72351a32235A71537b02925A72392m0675h6751j78011A25519
18958D419a30674C64593O33089E6441K67492j7979a05941F05139A57798l5068
18948A22730a13583m0032o7769D7220N1357k8142c52282N9743B20766D8573e3156
$$ plain form
18936 144271 -114204 -57821 -3007 373991 262770 -105247 203786 -37937 30260 108707 130792
18925 130792 -262404 -86290 226151 -233404 9929 -172983 -148195 -364898 -192074 -61470
18914 -40829 48261 -311391 25545 215918 -108911 38443 75431 -120319 86011 -42841 -82009
18903 -82009 -298259 40399 -280508 51024 -41705 186566 243791 299672 60442 140324 301502
18892 301502 294592 -189706 244539 104291 -70684 7616 -59860 -162811 -73612 146622 80576
18881 80576 -162010 -16493 37745 46243 157499 -334122 78141 -429409 136219 -232995 304201
18869 -139952 -191973 -141445 -320933 -230105 -18520 -31644 208948 -143598 -184147 -196670 -161989
18858 -161989 152078 -91968 -81207 -23089 238117 165197 331601 -370965 -426129 -64809 187618
$$ packed form
18936A44271a14204N6383c007C73991j11221a05247B03786c7937C0260P8447K2085
18925A30792b62404h6290B26151b33404I929a72983K4788k16703J72824f1470
18914d0829D8261c11391B5545J90373a08911C8443L6988a20319H6011d2841l9168
18903h2009k16250D0399b80508E1024d1705A86566N7225N5881F0442P9882J61178
18892C01502o910a89706B44539A04291g0684G616e9860j02951g3612A46622o6046
18881H0576a62010a6493C7745Q498J11256c34122G8141d29409A36219b32995C04201
18869a39952n2021N0528j79488R0828a8520j3124B08948a43598m0549j2523L4681
18858a61989A52078i1968J0761b3089B38117p2920J66404c70965n5164f4809A87618
$$ plain form
18846 -284470 175234 -96612 -62742 25775 222553 3584 17232 -581822 146869 45847 -385495
18834 -154641 -199428 -137583 -162392 26633 -243889 -174770 -106282 -286748 -73712 -2292 -274227
18823 -274227 -189666 -36043 -14057 -17192 -11157 62187 -330578 132799 96885 191865 -110665
18811 -139508 132812 71155 14618 83795 -46692 67479 245430 -168524 -57130 -195862 210329
18799 163387 -157364 18812 170275 205063 312675 95573 58474 -18720 51805 -170525 -278978
18788 -278978 -17354 -20770 -397914 -65725 -568 150411 -519133 -105237 399660 -209659 -54670
18776 77660 -41464 142183 -198069 -133963 -111800 -38699 -347816 -388220 -44684 3280 -59905
18764 248893 -23432 111259 217752 -11186 34892 -2500 -100511 209473 9659 -31592 -77383
$$ packed form
18846b84470A75234i6612L3870B5775J96778C584J3648e81822A46869D5847c85495
18834a54641m4787O1845k4809B6633b43889O9119O8488j80466g3712b292k71935
18823b74227Q4561c6043a4057l135O035F2187c30578A32799l5914R4980a10665
18811a39508A32812o1657A4618O9177d6692F7479J77951a68524e7130j38732B10329
18799A63387a57364A8812J51463L4788J07612I5573l7099a8720E1805a70525j08453
18788b78978a7354l416l77144f5725e68A50411e19133a05237C99660b09659e4670
18776G7660d1464A42183a98069O4106K2163c8699l09117m0404d4684C280e9905
18764B48893b3432A11259J06493a1186C4892b500r8011B09473I659c1592m5791
$$ plain form
18753 -77383 188443 169294 -200904 -126077 76562 -123437 -8443 -94013 -78055 331252 -90261
18741 -121916 -133841 185333 -68875 103981 29607 -171808 116120 79756 72052 -180616 -182576
18730 -182576 2702 -115804 -51433 -148355 -35000 -81229 -192319 -223619 136894 48348 -118237
18718 -140008 225070 -172935 13798 -15151 -160537 -247960 -168721 -30078 -68796 -140629 -225137
18707 -225137 -156334 -164621 -183068 -55960 -4787 156690 -307872 -14851 214711 -206469 -196553
18696 -196553 27427 -113001 -129587 -161964 2243 -330965 192817 -143540 -84950 23515 -144272
18684 -45915 -350561 -120020 63806 -205441 -201630 -1605 -17421 -224909 86877 -120105 -63950
18673 -63950 400762 46328 99685 -136210 -308269 179297 -172990 -37697 -53056 -28083 -342567
$$ packed form
18753g7383A88443j9149b00904P4827G6562a23437h443q5570J5958C31252i0261
18741a21916j1925A85333f8875A03981B9607a71808A16120l6364p704a80616j960
18730a82576B702a15804e1433r6922c5000m6229j11090l1300A36894D8348a18237
18718a40008B25070a72935A3798a5151j45386q7423P9239c0078l8718p1833q4508
18707b25137O8803q287j8447e5960d787A56690c07872a4851B14711b06469R916
18696a96553B7427a13001j6586l2377B243c30965A92817a43540N8590B3515a44272
18684d5915l04646a20020F3806b05441L811a605j5816k07488H6877a20105N6155
18673f3950D00762D6328N3357a36210j72059A79297a72990c7697j5359K4973l14484
$$ plain form
18662 -342567 52589 -250739 -301865 59191 93187 78646 -269385 -1737 45458 119718 -46889
18650 148112 44265 -148172 91906 -155230 111221 -153922 -177207 -352872 -322810 151233
18639 -344124 -225221 82808 -289706 -90659 15925 -158627 -76000 21549 -58606 -5308 -116908
18628 -116908 -195446 56684 271533 13127 -31261 41521 -49189 45422 188836 -280690 316464
18616 287699 -147725 148522 133433 288671 166802 -196444 -171403 -354988 -140473 -116213
18606 -116213 -42758 96142 177006 157320 335972 80626 -200512 -277303 -200011 282678 -57588
18594 -93712 38140 626 -170735 -379906 -166915 214329 -150164 142267 -2392 -113649 182875
18582 -16541 63089 -150079 193736 29663 -214188 127378 -138638 85177 24552 -292292
$$ packed form
18662c42567E2589b50739n1126E9191L3996j4541b69385a737D5458P4260d6889
18650A48112D4265a48172I1906a55230A11221a53922k3285j75665L0062A51233
18639c44124J18903H2808b89706i0659A5925a58627g6000B1549e8606e308j11600
18628a16908p8538E6684K14849A3127c1261D1521d9189D5422J43414b80690C16464
18616B87699a47725A48522j5089J55238j21869a96444K5041j83585a40473K4260
18606a16213d2758I6142Q0864j9686J78652H0626b00512p6791P7292B82678e7588
18594i3712C8140F26a70735k09171a66915B14329a50164A42267b392j11257A82875
18582a6541F3089a50079A93736B9663b14188A27378a38638H5177B4552b92292
$$ plain form
18571 187313 100664 249125 -111935 -99243 -238331 -241407 -296106 45971 -319478 4425 -241948
18559 7149 152819 -321514 -62472 -173040 -235860 -145196 -283736 270227 -314051 -12538 79197
18547 14111 -103345 152404 44041 252554 257922 -96249 -126156 -126141 13957 112526 -127427 193901
18534 831 -95637 -65020 195478 -12389 -255274 -16775 -63106 256307 6705 -56617 333419
18522 -198084 -13536 -59032 -107031 -206590 -236934 -255678 143833 61493 178564 -166441 -210787
18511 -210787 301518 -167542 -68634 83565 -123887 -34799 -186963 -99824 214719 -381074
18500 192670 26867 -24480 -176106 -143449 -54195 -255067 90560 -342394 -356103 -14846 47751
18488 136494 -22030 -186701 -44409 -203099 102347 -56353 82499 -159424 -220086 51293 -68322
$$ packed form
18571A87313q6649J48461a11935J2692j39088l076n4699D5971c19478D425b41948
18559G149J45670c21514f2472j10568o2820R0664j38540B70227c14051a2538G9197
18547A4111a03345A52404D4041K08513N368i6249k9907J5A3957R8569a27427A93901
18534H31i5637L0617A95478a2389k42885a6775m6331B56307F705e6617C33419
18522a98084a3536m5496m7999r9559l0344j8744A43833F1493J17071a66441m4346
18511b10787C01518a67542f8634H3565a23887c4799j52164Q7139B14719c81074
18500A92670B6867b4480j51626L2657e4195k00872I0560c42394j3709a4846D7751
18488A36494b2030j64671d4409j58690A02347e6353H2499a59424o0662E1293f8322
$$ plain form
18476 -70416 -20126 194342 236465 199470 -180390 -198336 -287021 -283922 229115 223630 2542 280004
18464 280004 87795 -194295 112938 -171060 44456 49297 -258755 -117299 -211804 67917 72187
18453 72187 65673 -302896 -66989 1097 -16749 -41375 -341900 83479 231997 -193502 -115757
18442 -115757 246370 -173576 -164134 -76364 -343163 313097 -2820 155904 22808 137937 -296235
18430 -63352 -135344 -482516 147539 80310 316286 -26067 -203621 -263395 -320714 -124158 -5329
18418 -78224 -164590 199608 71943 -159084 -202296 -220947 -188164 -119414 -181680 -27776 -304210
18407 -304210 -181898 -1691 -300126 276370 -77209 88742 -29275 -17422 72788 109714 65196
18396 65196 168969 -22315 300975 147004 2161 -36538 250815 -153868 -288719 178407
$$ packed form
18476g0416b0126A94342M2123l6995a80390j7946q8685L099B29115n485B542K77462
18464B80004H7795a94295A12938a71060D4456M841b58755a17299r4505F7917M270
18453G2187o514c02896f6989A097a6749k4626l00525H3479J48518a93502P7745
18442a15757B46370a73576R442g6364k66799C13097b820A55904B2808J15129b96235
18430f3352p1992l47172A47539o7229K35976b6067j77554n9774n7319a24158e329
18418g8224q6366A99608G1943a59084m3212j8651L2783O8750o2266b7776k76434
18407c04210J22312a691k98435B76370g7209H8742b9275J1853G2788L6926m4518
18396F5196J03773b2315C00975A47004B161c6538B50815a53868j34851A78407
$$ plain form
18385 -102306 278328 415526 105706 135275 -349779 68253 92605 -31589 -283389 47238
18374 162840 145332 -6967 -75225 -171054 141067 -2903 175309 15724 226230 280408 -299886
18362 -64896 78533 187337 -9498 57077 69763 -231714 81283 -805 97335 -178220 88116 212116
18350 212116 -36931 -71081 -86819 -100536 133371 -84640 98669 -60408 -184613 160552 17818
18338 109632 -55420 -146034 82966 -173754 122841 240907 293475 176459 -308975 -53447
18327 -133802 -111669 -188998 495378 149262 -209277 -109832 -136685 -103005 -232672 -132207
18317 -132207 -114490 6644 34483 -500904 -334274 -23007 -35614 82054 267081 50427 167830
18306 167830 -77260 -118248 93810 -62972 -2246 -338074 -151877 82272 -13444 -79545 -231765
$$ packed form
18385a02306B78328J37198A05706K9569c49779F8253K4352c1589k51800D7238
18374A62840j7508f967o8258r5829A41067b903A75309A5724K10506N4178b99886
18362f4896G8533J08804i498E7077J2686b31714H1283h05I7335a78220H8116J24000
18350B12116c6931l4150j5738j3717A33371h4640I8669f0408j24205A60552A7818
18338A09632e5420r0614H2966a73754A22841J18066N2568j17016c08975e3447
18327a33802K2133p7329D95378A49262b09277R9445k6853L3680j29667J00465
18317a32207J7717F644K7839e00904J66630b3007j2607H2054J85027E0427J17403
18306A67830g7260m0988I3810f2972b246l35828a51877H2272a3444o6101j52220
$$ plain form
18295 -231765 -14328 -52312 123525 52141 -63778 238684 178662 986 -148815 -111478 -179304
18284 -179304 217368 92484 -154162 -208820 47322 -71311 -85028 -101841 26900 -317796 92296
18272 -105038 101231 124839 43806 -313723 -149565 139099 -179644 214892 -84878 423294
18261 -277507 -79350 -21357 15504 -147145 -47438 276315 -89479 50537 -363640 -38135 47562
18249 152694 -298345 222706 20755 234473 -56650 -229035 -64934 185717 195914 -146158
18238 -123079 -31362 -148110 -194629 -5503 -396368 -76856 22753 -1161 47350 -252659 -141348
18227 -141348 -359060 -238896 50012 -200974 103933 178116 -150116 378137 38721 45213
18217 45213 -15963 96641 78297 70566 -174224 -158653 228772 78252 -24890 -2781 148466
$$ packed form
18295b31765a4328l7984A23525E2141f3778B38684o0022I86a48815L7337o7826
18284a79304B17368I2484a54162n4658D7322g1311j3717j6813B6900c17796I2296
18272a05038A01231K3608D3806c13723a49565A39099a79644B14892h4878D23294
18261b77507g9350b1357A5504a47145d7438B76315h9479E0537c63640c8135D7562
18249A52694b98345B22706B0755K13718e6650j72385f4934A85717J0197a46158
18238a23079c1362j16748m6519e503l90865g6856B2753a161D7350b52659J11311
18227a41348k17712J20164E0012b00974A03933P4183a50116C78137C8721O492
18217D5213a5963I6641j8344p731a74224J5571B28772G8252b4890b781A48466
$$ plain form
18205 -46442 -120691 -99729 285546 12464 28573 36423 -376652 -168683 -5992 60709 89720
18194 89720 9772 -137935 -140953 -134738 54478 -44970 -115592 -49434 -250886 -323167 209859 42374
18181 306900 -78154 -288080 161888 244877 -58410 28628 -478518 -103454 -39260 194631
18170 287816 22812 -239246 76616 296502 -340400 -116165 40489 35909 20397 -190599 -297366
18159 -297366 66583 -67674 95626 131313 56007 -88361 -113824 -73975 3111 275824 -135510
18147 -208942 200410 113715 456974 -161392 46738 -125552 -340511 126447 -33896 -329385
18137 -329385 -191238 31670 -24270 -101708 -244833 489012 121395 76535 -213205 -185823
18127 -185823 57644 -242326 19485 -106580 144115 -270218 -143140 121061 402054 -170041
$$ packed form
18205d6442p4249K0962B85546A2464J6109P850c76652a68683e992F0709K9011
18194H9720I772a37935l018O215E4478d4970p0622d9434k01452p2281B09859D2374
18181C06900g8154k09926A61888Q2989e8410B8628d78518a03454c9260A94631
18170B87816B2812b39246G6616K19886c40400a16165D0489m580j5512a90599j06767
18159b97366F6583f7674I5626L5687E6007h8361k5463L9849C111K72713a35510
18147b08942B00410q6695L43259a61392D6738a25552k14959A26447c3896k95489
18137c29385J38147C1670b4270p7438j43125D89012A21395m4860b13205K7382
18127a85823E7644b42326A9485a06580A44115b70218J27078A21061K80993a70041
$$ plain form
18116 186837 87441 82529 250061 -112663 -41179 30942 216722 -28897 -56463 74089 -14261
18104 -97508 -160609 -115130 -11100 -74480 15613 -160394 -490576 101546 198393 199362 -269506
18092 -229224 -320333 205214 -216688 -18042 -49118 153981 166007 914 64755 -84423 -129162
18081 -129162 25820 61788 32174 -81933 230472 90199 135698 -62562 165777 31950 -187653
18069 -133893 219166 -74191 355772 41562 -19845 205660 -97530 216390 -331239 8589 -84405
18057 -140371 54199 168182 -215156 66478 -114878 314453 -287242 235404 -156828 -13301
18046 -26691 276150 -45427 -64933 -185455 4716 -326775 -76363 162828 74424 227912 -114757
18034 -101007 41723 110231 -270206 -162901 118645 -110682 -17135 -18845 -103223 -134520 181613
$$ packed form
18116A86837H7441m912J67532a12663d1179C0942J85780b8897k7566G4089a4261
18104i7508o3101M5479a1100o3380A5613a60394l30182A01546R6847R69b69506
18092b29224r1109B05214b16688a8042l1076A53981J2026I14O3841h4423m4739
18081a29162B5820L5968k9614h1933B30472I0199M5499f2562A65777C1950a87653
18069a33893B19166g4191C55772D1562a9845B05660i7530B16390c31239H589h4405
18057a40371E4199J13983b15156F6478a14878C14453b87242B35404a56828a3301
18046b6691B76150d5427j9506j20522D716c26775g6363A62828G4424J53488a14757
18034a01007D1723O8508b70206J07305A18645a10682a7135j710q4378l1297A81613
$$ plain form
18022 104354 89422 114347 287188 -42622 45501 -205460 143024 36879 48240 127447 -6403
18010 63944 -279211 83042 359631 95040 105424 -28684 106040 223357 199691 -310615 45647
17998 197692 48250 -249260 -85757 35190 184621 -100994 92981 -31864 -361035 75485 35531
17986 -381594 143680 -159805 -370524 97539 -66747 119514 -220104 65015 40980 -223114
17975 -103578 -274086 -137956 230841 137803 -14933 -177967 291667 -135616 -138876 19695
17964 209295 -33628 74326 131809 -16685 66349 3697 106350 53436 -115322 -125002 -136322
17953 -136322 125472 -349026 126636 35248 311086 455062 -308527 13336 19929 86667
17943 86667 -242290 -16981 -120987 178359 -1870 303422 117426 18220 -36959 -309028 15289
$$ packed form
18022A04354j4932K4925J72841d2622D5501b05460A43024C6879J1361P9207f403
18010F3944b79211H3042K76589I5040J0384b8684A06040J17317k3666c10615D5647
17998A97692D8250b49260h5757C5190J49431a00994I2981c1864l29171G5485C5531
17986c81594A43680a59805k10719I7539f6747A19514b20104F5015k4035b23114
17975a03578j70508J36130B30841r3038a4933j63034B91667a35616l260A9695
17964B09295c3628G4326N7483a6685F6349C697J02653n2914a15322r680j1320
17953a36322A25472c49026A26636C5248K75838J43976c08527A3336O593O6738
17943H6667b42290a6981j04006A78359a870C03422A17426A8220c6959k72069A5289
$$ plain form
17931 118487 -149308 295350 287700 120619 -48229 -238876 299563 -114461 119111 -21513
17920 50301 317830 28594 148234 -119824 396357 66290 99374 -115335 190323 -127467
17909 9986 -250227 -51942 7075 -146439 389228 -165250 -179626 -250878 -228112 -82801 -142578
17898 -142578 41684 112351 -165586 371219 -115366 166191 -264688 58881 28495 11414
17887 76491 95990 43312 -279558 35603 -98883 28591 104267 356292 -456541 59066 52162
17876 52162 32317 -55627 97115 -31348 120638 -104460 -365154 -23084 -141844 -122008 249333
17864 167129 -7204 141005 -75863 76548 352305 203078 -127938 -154879 47496 6319 103825
17853 103825 20016 243190 20139 -19354 419432 -128217 146490 -111842 -171709 49844
$$ packed form
17931A18487a49308B95350p650A20619d8229j90647B99563a14461A19111b1513
17920E0301K67529B8594J19640a19824C96357F6290L3084a15335A90323a27467
17909I986b50227e1942G075a46439C89228a65250j4376p1252K2766h2801n9777
17898a42578D1684P0667a65586C71219a15366A66191b64688E8881B8495A1414
17887G6491J9499D3312b79558C5603i8883B8591P5676K52025d56541E9066o904
17876E2162j9845e5627I7115c1348A20638a04460k60694b3084j18760J9836B49333
17864A67129g204A41005g5863G6548K75757j49227a27938k6941D7496F319R7506
17853A03825B0016K23174B0139a9354D19432a28217A46490a11842n9867D9844
$$ plain form
17842 -253937 -332108 194038 256356 155477 74466 7261 110955 175780 118419 318093 657005
17831 657005 121763 -44111 -32736 193627 -145803 61404 -84420 78727 207827 -448979
17820 22507 167004 262822 46714 324990 -91377 8589 -227420 457282 14308 79909 3184
17808 171223 189590 23801 -150232 66592 -374963 122474 20432 120765 167817 393920
17798 393920 -151558 -82271 -111773 -321075 -76491 -68056 -197432 224531 79263 188584 215850
17787 215850 298974 -8887 197309 97425 192873 37555 61862 30246 -241817 170241 125757
17776 125757 -241289 -30456 -378505 33779 97625 104597 -152164 -15674 33901 -78047 284260
17764 -49082 370459 222847 75761 213296 123518 142277 408989 139401 -351548 -232173
$$ packed form
17842b53937p8171A94038O2318j00879G4466G261J03694O4825n7361J99674L38912
17831F57005A21763d4111J1375A93627a45803F1404h4420G8727J29100d48979
17820B2507J44497R5818D6714K78276i1377H589b27420D57282A4308O5601C184
17808A71223J8367B3801a50232F6592c74963A22474B0432J00333M7052K26103
17798C93920a51558O9287k9502k09302g6491Q435j29376B24531G9263J09321K7266
17787B15850Q3124h887A97309I7425R5448C7555K4307C0246b41817A70241m4484
17776A25757b41289c0456l48049C3779O3846O972a52164a5674C3901g8047B84260
17764d9082C70459j47612G5761J37535q9778J8759K66712A39401c51548J19375
$$ plain form
17754 -232173 35482 329388 52192 46179 -263170 54468 -210101 -15340 369013 334913 227136
17743 227136 198969 193117 -84437 108268 -116251 75653 13883 -91013 144472 131179 414083
17732 414083 -115092 -140622 20603 131583 -229143 22351 -19908 -66732 210165 -187852
17721 101299 -129378 -159466 113456 118797 17839 126802 -31001 269692 -25001 255815 235143
17710 235143 137250 141410 262994 252277 -10477 148900 -129516 4182 423234 81671 264408
17699 264408 -18004 43555 91715 169309 -141882 268619 245344 133113 117704 46817 -156973
17687 -107752 -181122 369769 152272 235800 -23167 -74123 346048 11490 275994 313139 147648
17675 -131322 221981 31801 104947 142849 217290 97856 -27762 114268 132100 182247 -45011
$$ packed form
17754b32173C5482K93906E2192o013b63170E4468b10101a5340C69013l4100j07777
17743B27136k8167n852h4437A08268a16251G5653A3883i1013A44472j3293K82904
17732D14083a15092k5530B0603J10980b29143B2351a9908m6824B10165a87852
17721A01299a29378l0088A13456N341A7839J08963c1001B69692b5001B55815k0672
17710B35143r7893M160J21584j0717a0477A48900a29516D182M19052H1671J82737
17699B64408a8004D3555M8160P7594a41882B68619k3275j12231j5409D6817a56973
17687a07752p3370C69769A52272Q3528b3167n0956C46048A1490K64504L7145A47648
17675a31322B21981C1801P3146L7902P4441I7856b7762A14268J7832N0147d5011
$$ plain form
17663 107607 307249 28371 10237 107758 -54589 168744 -144061 154084 331296 17779
17652 186529 -229320 -60531 120259 232839 252 180970 -138374 61750 -12636 175969 -7618
17640 355956 -135049 329536 73313 317104 -112348 -98641 -89298 152604 -60712 -67145 155611
17628 151999 191081 421507 34859 -56874 202817 39435 182622 49594 490162 157458
17617 -117457 327242 63751 165581 -181265 142381 -19771 171982 206197 281459 151137
17607 151137 -123419 335666 232077 -43974 150264 212394 528564 23716 336467 -86779
17596 63973 161154 -54492 -301523 -56666 -14380 82560 -96596 230186 -101442 28690 306902
17585 306902 157181 122554 154477 199937 312322 -18012 105888 -117689 7854 -136458 107672
$$ packed form
17663A07607J99642B8371A0237R7521e4589A68744a44061A54084J77212A7779
17652A86529b29320f0531A20259J12580B52J80718a38374F1750a2636A75969g618
17640C55956a35049C29536G3313K43791a12348J3707R343A52604f0712o433A55611
17628A51999L9082K30426C4859e6874B02817C9435J43187D9594M40568A57458
17617a17457C27242F3751J01830a81265A42381a9771A71982L4215P5262j30322
17607A51137a23419C35666j03589d3974A50264O2130L16170B3716L12751h6779
17596F3973R7181e4492k47031e6666a4380H2560i6596B30186a01442B8690K78212
17585C06902j49721l4627L1923M5460J12385a8012A05888a17689G854a36458A07672
$$ plain form
17573 54510 116941 150516 -15432 95468 -18664 163488 -271647 295204 220482 -63506 28287
17561 69477 115621 -155198 52179 86701 225346 407596 372696 155073 268437 97618 11279
17549 247776 -88573 51343 -248034 79668 260973 166689 143259 93856 431435 23168 143765
17538 143765 15300 81172 93013 174484 142050 351164 113550 289978 -146634 6874 487666
17527 487666 290694 388025 -89676 393371 101153 306181 -59715 176687 35734 218734
17517 218734 114594 283539 183856 295568 591233 476719 402514 800339 664269 943579
17507 943579 1088331 539546 778132 567249 203857 302622 46284 578196 298942 350432
17497 350432 130302 458755 477942 730984 855914 1037984 633987 893257 104962 586121
$$ packed form
17573E4510O2431L3575a5432I5468a8664A63488b71647B95204p4722f3506B8287
17561F9477M6144a55198E2179L4522J38645J82250l4900A55073J13364I7618A1279
17549B47776h8573E1343b48034G9668J81305r4284k3430m9403L37579B3168J20597
17538A43765A5300O5872J1841Q1471l2434K09114A13550J76428a46634F874M80792
17527D87666j96972R7331h9676C93371A01153K05028e9715A76687C5734J83000
17517B18734j04140J68945r9683J11712K95665j14514p4205L97825j36070K79310
17507I43579J44752E39546K38586k10883B03857R8765D6284N31912k79254N1490
17497C50432A30302L28453J9187K53042J24930J82070m03997K59270A04962M81159
$$ plain form
17487 586121 470247 349361 648802 252350 340264 506440 429446 249421 -33337 3474
17476 172833 416624 122783 55589 276891 276958 191389 303902 420670 399723 391894 499631
17465 499631 272922 205158 127856 420559 458762 -74353 176222 293250 257759 -75112 -3926
17453 263380 146601 435426 -27134 -132929 166587 188111 333846 358980 -12529 400434
17442 242905 314437 77967 -115571 123978 262411 99868 115464 378700 319978 696041
17432 696041 356836 398160 455215 457046 146399 216996 243433 320676 57101 170789 137342
17421 137342 464943 600823 467470 242496 178063 103992 647511 196596 456400 176678
17410 472778 578765 714921 112978 234630 413315 191994 258461 65455 151590 377200
$$ packed form
17487E86121j15874j20886K99441B52350Q7914J66176p6994j80025c3337C474
17476A72833K43791A22783E5589K21302O7q5569J12513J16768k0947p829J07737
17465D99631k26709o7764p7302K92703L8203g4353A76222J17028l5491g5112c926
17453B63380j16779K88825b7134j05795A66587K1524J45735K5134a2529D00434
17442B42905P1532G7967a15571A23978J38433I9868J5596K63236n8722L76063
17432F96041l39205M1324N7055J831A46399P0597K6437P7243E7101J13688l3447
17421A37342L27601J35880j33353k24974o4433p4071N43519A96596K59804A76678
17410D72778J05987J36156A12978J21652J78685A91994O6467F5455Q6135K25610
$$ plain form
17400 377200 276447 315180 305037 440735 429058 329735 19554 294904 -59886 366948 463915
17389 463915 151420 232085 477478 90719 122639 469285 281283 321721 42814 116634 124513
17378 124513 96301 232818 349068 245549 385395 -54282 412740 333343 536946 250868
17367 480932 227368 -65265 300537 168902 358324 5884 249744 433465 304338 226740
17357 226740 -24063 222980 145467 307723 -77211 91438 215225 388887 371745 -217103
17346 310992 394154 362387 292383 191459 419282 83764 112690 285200 500713 335143
17336 335143 -59495 182114 50064 408575 211360 398994 135503 384520 433854 94021
17325 656048 152861 84509 26054 167410 -50346 269592 264238 459944 157906 386363
$$ packed form
17400C77200j00753L8733j0143J35698j1677r9323A9554K75350e9886C66948R6967
17389D63915A51420Q0665K45393I0719L1920L46646j88002M0438D2814P3820P879
17378A24513k8212J36517J16250j03519J39846e4282D12740p9397K03603B50868
17367D80932B27368f5265C00537j31635J89422E884K43860J83721j29127p7598
17357B26740b4063B22980p7513J62256g7211I1438J23787J73662j7142b17103
17346C10992Q3162l1767p0004j00924K27823H3764K8926J72510K15513j65570
17336C35143e9495A82114E0064L58511j97215J87634A35503K49017M9334I4021
17325F56048A52861o8352B6054J41356e0346B69592n354J95706A57906K28457
$$ plain form
17315 386363 182207 282897 579247 218298 288544 558942 321313 345168 224705 145034
17305 145034 282562 252117 406274 286843 255786 97647 203882 385901 262873 372170
17295 372170 353743 -78867 443993 165128 107998 399626 440495 246131 545119 308276
17285 308276 144944 412334 335154 742897 152439 295844 587239 152924 387534 73650
17274 212546 39498 365755 195275 74591 278961 410991 -62931 29346 -176542 255378
17263 -120527 254756 -6141 95474 212781 -31239 560627 144728 353143 566410 172531
17252 368661 439731 178378 548797 429719 585171 326157 110720 -14550 316871 352440
17242 352440 43921 65322 659284 438791 345096 187599 330416 351828 179649 288347
$$ packed form
17315C86363A82207J00690K96350B18298P0246K70398k37629K3855j20463p9671
17305A45034J37528l0445J54157j19431l1057I7647J06235J82019j23028J09297
17295C72170j8427g8867D43993A65128n7130K91628M0869j94364K98988k36843
17285C08276A44944K67390p7180M07743A52439J43405K91395A52924K34610G3650
17274B12546C9498L26257j70480G4591K04370J32030f2931B9346a76542B55378
17263a20527B54756f141I5474J17307c1239E60627A44728K08415K13267A72531
17252C68661P1070A78378L70419j19078J55452k59014A10720a4550C16871L5569
17242C52440D3921K1401N93962k20493r3695j57497J42817K1412j72179J08698
$$ plain form
17232 288347 437813 296689 542229 743582 299272 419944 486120 432797 87976 362908
17222 362908 578712 -46229 258524 174126 216978 495215 331902 297375 204599 464914
17212 464914 231361 396261 169138 440216 229286 549794 207501 203935 340286 -44259
17201 324081 573534 349134 158630 353358 288682 251227 464137 577140 -34791 305733
17190 206830 800369 309609 585924 376765 311404 199832 154618 686912 130328 371478
17180 371478 335838 179042 479449 645230 391911 356277 594294 410576 376029 319301
17170 319301 276235 388252 346489 314226 481277 647308 97022 361266 39011 424476
17160 424476 418567 367812 412665 445137 585440 622220 444049 570883 553731 294180 434152
$$ packed form
17232B88347J49466j41124K45540K01353B99272J20672O6176n3323H7976K74932
17222C62908K15804d6229B58524q4398M2852K78237j63313l4527r2776K60315
17212D64914B31361J64900A69138K71078k10930L20508B07501l566J36351d4259
17201C24081K49453k24400A58630J94728o4676l7455K12910J13003c4791C05733
17190B06830N93539C09609K76315k09159o5361j11572m5214N32294A30328K41150
17180C71478l5640j56796L00407J65781k53319l5634K38017j83718l4547n6728
17170C19301m3066J12017m1763l2263J67051J66031I7022K64244C9011L85465
17160D24476n909n0755M4853L2472J40303L6780j78171J26834j7152k59551J39972
$$ plain form
17149 434152 274424 586038 475454 309973 419648 151880 374888 704333 230924 290683
17139 290683 199264 417287 365083 607365 163760 571213 708503 608925 489733 605488
17129 605488 519989 355374 494753 773873 553165 512537 362983 277724 456436 568606
17119 568606 331585 480086 654047 652619 41646 539464 633998 600910 325156 412591 621076
17108 621076 487968 546035 113962 447904 371484 635433 337052 653120 453439 485288
17098 485288 577951 649029 606963 698727 613822 705089 454443 411114 720574 442189 155390
17086 816008 327695 945877 354673 654320 555234 530071 163349 458474 712771 584241
17076 584241 808640 435693 604807 460941 684921 616029 196125 609985 435262 357359
$$ packed form
17149D34152j59728L11614j10584j65481J09675A51880K23008L29445B30924N9759
17139B90683r1419K18023n2204K42282A63760M07453J37290r9578j19192J15755
17129F05488q5499j64615J39379K79120k20708m0628j49554q5259J78712J12170
17119E68606k37021J48501J73961j428D1646M97818R4534l3088k75754Q7435K08485
17108F21076j33108N8067A13962L33942p6420K63949k98381L16068j99681L1849
17098D85288R2663P1078m2066R1764q4905R1267k50646m3329L09460k78385A55390
17086H16008C27695O18182C54673K99647r9086k5163A63349K95125K54297j28530
17076E84241K24399l72947J69114j43866K23980o8892A96125M13860j74723p7903
$$ plain form
17066 357359 610047 625500 947813 590634 836932 589489 792484 544303 736495 743582
17056 743582 535682 967489 752691 734682 745446 765607 841103 869128 683062 1027951
17046 1027951 758977 731919 645198 757447 633985 558687 676234 777140 919215 610872
17036 610872 815492 817170 613099 1121628 887351 668156 997808 545790 653211 942192
17026 942192 885638 1046423 687466 631154 863745 703902 985696 840275 644357 699810
17016 699810 778730 968570 844460 801081 801824 842292 807686 885442 796602 693289 720771
17005 720771 774382 743982 1142810 1003273 689330 993854 1196283 884641 853044 1082909
16995 1082909 603639 908112 1039637 840181 875653 959435 855542 1342441 976279 922698
$$ packed form
17066C57359K52688J5453L22313l57179K46298k47443K02995k48181J92192P087
17056G43582k07900M31807k14798j8009J0764K0161P5496K8025j86066L44889
17046A027951k68974k7058q6721J12249j23462p5298J17547J00906J42075l08343
17036F10872K04620J678k04071N08529k34277k19195L29652m52018J07421K88981
17026I42192n6554J60785l58957n6312K32591j59843K81794j45421j95918N5453
17016F99810P8920J89840j24110m3379P43M0468l4606P7756q8840j03313K7482
17005G20771N3611l0400L98828j39537l13943L04524K02429l11642l1597K29865
16995A082909m79270L04473J31525j99456L5472Q3782j03893M86899l66162n3581
$$ plain form
16985 922698 1152905 992354 991719 1160889 1083282 1547433 1250221 1200744 1119968 1282851 1304330
16974 1304330 1021316 1173861 1465211 1496588 1158947 1000919 1309199 1320019 1151956 1223848
16964 1223848 849145 1191948 1367025 1092181 1265650 1280942 1599053 1501604 1479533 1449228
16954 1449228 1094847 1336936 1391822 1331805 1294398 1382034 1318473 1498904 1441581 1258612
16944 1258612 1893649 1503810 1470199 1348245 1252326 1482308 1555124 1242366 1544143 1749446
16934 1749446 1680682 1697186 1631942 1959096 1907325 1620160 1551364 1568722 1622171 1742037 1548451
16923 1548451 1590098 1415801 1924501 1678594 1532906 1891903 1779069 1958392 1887466 1989559
16913 1989559 1744375 2036303 1940879 2039536 2010409 1823229 1980387 1490861 1883539 2074046
$$ packed form
16985I22698K30207j60551o35J69170p7607M64151k97212m9477q0776J62883K1479
16974A304330k83014J52545K91350L1377l37641j58028L08280J0820j68063P1892
16964A223848l74703L42803J75077k74844J73469J5292L18111r7449k2071l0305
16954A449228l54381K42089N4886o0017l7407Q7636o3561J80431n7323j82969
16944A258612O35037l89839l3611j21954r5919K29982P2816l12758L01777K05303
16934A749446o8764J6504o5244L27154n1771k87165o8796J7358N3449J19866j93586
16923A548451M1647j74297N08700k45907j45688L58997j12834J79323p0926J02093
16913A989559k45184K91928r5424R8657k9127j87180J57158m89526L92678J90507
$$ plain form
16903 2074046 2170880 2157071 2110891 2164095 2119502 2272661 2155551 2513289 2183596 2128865
16893 2128865 2356304 2435742 2311422 2270691 2204862 2440787 2590374 2522877 2660472 2679219
16883 2679219 2761403 2649750 2837121 2769511 2801453 2773476 2524123 3074900 2716622 2693432
16873 2693432 2895591 2751355 2896015 2997369 3262298 3226722 3151932 3319507 3269052 3055473
16863 3055473 3132839 3590271 3237358 3310186 3486789 3196371 3091490 3916420 3413313 3546625
16853 3546625 3779201 3855392 3680427 4010742 3743400 4089540 3703544 4064127 4296455 4163995
16843 4163995 3968156 4108042 4410310 4519251 4295006 4459976 4500742 4666992 4547970 4696913
16833 4696913 4652390 4827717 5184671 5043901 5182008 5266831 5026409 5087471 5839740 5734252
$$ packed form
16903B074046R6834j3809m6180N3204m4593J53159j17110L57738l29693n4731
16893B128865K27439P9438j24320m0731o5829K35925J49587o7497J37595J8747
16883B679219Q2184j11653J87371o7610L1942k7977k49353N50777l58278k3190
16873B693432K02159j44236J44660J01354K64929l5576p4790J67575n0455k13579
16863C055473P7366M57432l52913P2828J76603k90418j04881Q24930n03107J33312
16853C546625K32576P6191j74965L30315k67342L46140l85996L60583K32328j32460
16843D163995j95839J39886L02268J08941k24245J64970M0766J66250j19022J48943
16833D696913m4523J75327L56954j40770J38107Q4823k40422O1062P52269j05488
$$ plain form
16823 5734252 5690762 5487191 5677582 5926614 6219297 6130929 6382103 6304900 6448213 6523931
16813 6523931 6594244 7154143 6430957 7249606 7103261 7159774 7434392 7971679 7708059 7914549
16803 7914549 7988001 8241628 8200463 8848238 9016449 8892465 8961712 9362904 9835420 9750060
16793 9750060 10044988 10128726 10498513 10444690 10682460 11028183 11469734 11555169 11723982 12067582
16783 12067582 12437767 12872101 13014374 13270523 13888483 14135871 14601851 14621996 15208254
16774 15208254 15337457 16155994 16397676 16587513 17183418 17749613 18232087 18887907 19562398
16765 19562398 20101840 20456998 21025126 21618812 22252988 23197365 23945007 24522379 25628112
16756 25628112 26153802 27022339 28303555 28923922 30397525 31225969 32029350 33317385 34570463
$$ packed form
16823E734252m3490k03571J90391K49032K92683q8368K51174p7203J43313P5718
16813F523931P0313N59899p23186Q18649j46345N6513K74618N37287k63620K06490
16803G914549P3452K53627m1165O47775J68211j23984O9247M01192M72516q5360
16793I750060K94928Q3738L69787n3823K37770L45723M41551Q5435J68813L43600
16783A2067582L70185M34334J42273K56149O17960K47388M65980K0145N86258
16774A5208254J29203Q18537K41682J89837N95905N66195M82474O55820O74491
16765A9562398N39442L55158N68128N93686O34176R44377P47642N77372J105733
16756B5628112N25690Q68537J281216O20367J473603Q28444Q03381J288035J253078
$$ plain form
16747 34570463 35863605 37521255 38865910 40360688 42137452 43495385 45382050 47287701
16739 47287701 48944293 50728273 53078487 55332449 57719532 60002459 63040046 65750362
16731 65750362 68561386 71294659 74715681 77486244 81306288 84782954 88163105 91873932
16723 91873932 95711251 99396144 103409396 107321351 111514458 115681469 119879607 123390001
16715 123390001 126761037 130401207 133579276 136259824 139014062 141327779 142963415 144408976
16707 144408976 145249409 145728455 145325791 144874611 143618478 142069400 140203016 137878193
16699 137878193 134883540 131821386 128057990 124564973 120716012 117009893 112607365 108825416
16691 108825416 105106240 100934161 96747783 92969460 89561128 85616142 81565639 78601513
$$ packed form
16747C4570463J293142J657650J344655J494778J776764J357933J886665J905651
16739D7287701J656592J783980K350214K253962K387083K282927L037587K710316
16731F5750362K811024K733273L421022K770563L820044L476666L380151L710827
16723I1873932L837319L684893M013252L911955M193107M167011M198138L510394
16715A23390001L371036L640170L178069K680548K754238K313717J635636J445561
16707A44408976Q40433M79046m02664m51180j256133j549078j866384k324823
16699A37878193k994653l062154l763396l493017l848961l706119m402528l781949
16691A08825416l719176m172079m186378l778323l408332l944986m050503k964126
$$ plain form
16683 78601513 75185174 72031471 68926529 65990027 63123972 60509762 57774265 55641637
16675 55641637 53131578 50883127 48836086 46815744 44709585 42967447 41158286 39592470
16667 39592470 37945236 36735146 35290699 34207841 32704478 31526500 30170885 29309442
16659 29309442 28224483 27083475 26453480 25597803 24702196 24106883 23216241 22050556 21351122
16650 21351122 20852934 20431467 19707201 18576797 18754569 17886201 17369632 17146228 16286848
16641 16286848 15959119 15581675 15435729 14458508 14452366 14033707 13799436 13106625 12792887 12681268
16631 12681268 12350444 12141497 11600435 11284565 11003182 11025376 10516281 10327844 10350463 9827302
16621 9827302 9708107 9543958 9285507 9036900 8613033 8711303 8410507 8119006 7874955 7986016
$$ packed form
16683G8601513l416339l153703l104942k936502k866055k614210k735497k132628
16675E5641637k510059k248451k047041k020342k106159j742138j809161j565816
16667C9592470j647234j210090j444447j082858j503363j177978j355615q61443
16659B9309442j084959j141008o29995q55677q95607n95313q90642j165685o99434
16650B1351122m98188m21467p24266j130404J77772q68368n16569k23404q59380
16641A6286848l27729l77444j45946r77221o142m18659k34271o92811l13738j11619
16631A2681268l30824k08947n41062l15870k81383K2194n09095j88437K2619n23161
16621I827302j19195j64149k58451k48607m23867R8270l00796k91501k44051J11061
$$ plain form
16611 7986016 7629457 7668439 7373362 7161332 7112818 6955862 6946880 6921195 6927939 6610798 6490022
16600 6490022 6274637 5994002 6209350 6029126 5605792 5763122 5561669 5564352 5484522 5351528
16590 5351528 5237485 5163335 5306424 5132330 5191580 4542204 4537219 4596789 4495269 4540423
16580 4540423 4633987 4238814 4158632 3948117 4185861 4124871 4117648 4323110 3796588 4038002
16570 4038002 3862593 3828183 3708113 3860088 3685561 3416727 3598716 3653209 3288451 3306649
16560 3306649 3515651 3022786 3247844 3228488 3275354 3116928 3120030 2767915 2785836 2872548
16550 2872548 2839570 2808750 2597504 2585536 2902562 2814402 2924629 2759646 2759164 2673495 2545349
16539 2545349 2488829 2768576 2404877 2557536 2171097 2428147 2208337 2407464 2315752 1974213
$$ packed form
16611G986016l56559L8982k95077k12030m8514j56956q982k5685O744l17141j20776
16600F490022k15385k80635K15348j80224m23334J57330k01453K683p9830j32994
16590E351528j14043p4150J43089j74094N9250o49376m985N9570j01520M5154
16580D540423R3564l95173q0182k10515K37744o0990p223K05462n26522K41414
16570D038002j75409l4410j20070J51975j74527k68834J81989N4493l64758J8198
16560C306649K09002m92865K25058j9356M6866j58426L102l52115J7921Q6712
16550B872548l2978l0820k11246j1968L17026q8160J10227j64983m82q5669j28146
16539B545349n6520K79747l63699J52659l86439K57050k19810J99127r1712l41539
$$ plain form
16529 1974213 2386824 2216538 1978133 2239823 1838647 2409592 2056351 1766832 1912150
16520 1912150 1925449 1419514 2064247 2231078 1803703 2077207 1968844 1754104 1670284 1654749
16510 1654749 2246782 1631305 1796064 1331826 1468478 1666971 1684193 1854850 1846521 1679606
16500 1679606 1653181 1745189 1871916 1819410 1303558 1559793 1499440 1632736 1277767 1618308
16490 1618308 1507621 1444718 1766353 1531355 1437601 1581504 1659213 1522873 1261708 1172807
16480 1172807 1266225 1254376 1554426 1311063 1110196 1248550 916711 1077979 1011409 1311705
16470 1311705 1393743 1512079 1419291 903115 1262491 1456008 1182152 1020818 1314099 970600
16460 970600 1105988 1220066 1336224 1258918 1107689 1270034 1108353 1214512 955034 816501
$$ packed form
16529A974213M12611j70286k38405K61690m01176N70945l53241k89519J45318
16520A912150J3299n05935O44733J66831m27375K73504j08363k14740q3820j5535
16510A654749N92033o15477J64759m64238J36652J98493J7222J70657q329j66915
16500A679606k6425R2008J26727n2506n15852K56235o0353J33296l54969L40541
16490A618308j10687o2903L21635k34998r3754J43903P7709j36340k61165q8901
16480A172807R3418j1849L00050k43363k00867J38354l31839J61268o6570L00296
16470A311705Q2038J18336r2788n16176L59376J93517k73856j61334K93281l43499
16460I70600J35388J14078J16158p7306j51229J62345j61681J06159k59478j38533
$$ plain form
16450 816501 1162305 1287294 884341 1185026 1437822 947183 987158 1286433 1006773 1072540
16440 1072540 873540 829414 1121307 934040 1038223 670816 944038 999365 820510 799947
16430 799947 717172 594077 817224 1052124 1051838 973219 1026441 761305 938104 767570 885090
16419 885090 902487 790999 1036955 682796 738857 1151386 931794 712408 980166 821267
16409 821267 823836 897268 839130 896949 938920 634291 1019960 1038297 583482 743268 499818
16398 499818 796638 769114 599404 615920 885435 472255 796111 640261 803094 827689
16388 827689 423792 640884 748443 552995 612114 765743 656619 617988 675318 728308
16378 728308 752511 580700 475473 620488 913768 870817 976409 525257 470324 709890
$$ packed form
16450H16501L45804J24989m02953L00685K52796m90639L9975K99275k79660O5767
16440A072540j99000m4126K91893j87267J04183l67407K73222N5327j78855k0563
16430G99947q2775j23095K23147K34900k86p8619N3222k65136J76799j70534J17520
16419H85090J7397j11488K45956l54159N6061M12529k19592k19386K67758j58899
16409H21267K569P3432n8138N7819M1971l04629L85669J8337m54815J59786k43450
16398D99818K96820k7524j69710J6516K69515m13180L23856j55850J62833K4595
16388H27689m03897K17092J07559j95448N9119J53629j09124l8631N7330N2990
16378G28308K4203j71811j05227J45015K93280m2951J05592m51152n4933K39566
$$ plain form
16368 709890 540784 471734 738932 733683 313782 697025 800776 792940 538315 582601 546286
16357 546286 502496 292678 389526 600066 369240 589192 464788 629300 367074 676716
16347 676716 660989 792196 460665 479514 925633 465491 828093 301151 410733 379005
16337 379005 763415 645217 450509 563140 697294 580561 619761 320198 461756 266355
16327 266355 511262 560960 773926 561705 1116296 445287 455926 777007 464306 327110
16317 327110 673200 405858 353202 356283 553828 360519 214321 481478 499846 532904
16307 532904 517041 533875 724946 424657 535104 516751 643106 339389 -174190 237408
16296 451998 198117 568740 265135 160662 565063 487586 431515 338123 488666 234838
$$ packed form
16368G09890j69106o9050K67198n249C13782L83243J03751p836k54625M4286l6315
16357E46286m3790k09818R6848K10540k30826K19952j24404J64512k62226L09642
16347F76716j5727J31207l31531J8849M46119m60142L62602C01151J09582l1728
16337C79005L84410j18198j94708J12631J34154j16733L9200k99563J41558j95401
16327B66355K44907M9698K12966k12221N54591D45287J0639L21081l12701j37196
16317C27110L46090k67342n2656L081J97545j93309j46198K67157J8368L3058
16307E32904j5863J6834J91071l00289J10447j8353J26355l03717a74190B37408
16296D51998A98117L70623B65135j04473M04401p7477n6071r3392J50543B34838
$$ plain form
16285 610535 513704 222995 423389 531700 196331 227995 481349 361838 507279 162023
16274 378140 268418 689916 172113 209571 86506 264852 269554 48238 322246 239604 154575
16263 154575 392734 145500 436132 481719 257354 529957 657747 269930 458476 397151
16253 397151 277639 433533 593983 378350 288618 155238 328009 322212 368240 276030
16243 276030 55700 251115 336346 178388 356380 262392 494095 205756 219320 81920
16232 181262 280060 302459 -156 380189 89550 343352 339814 433832 406719 328390 179760
16221 179760 273431 520686 175195 590591 399980 153893 322203 542988 299048 193256
16211 193256 -89564 79756 96016 -176267 467309 258676 79744 455984 95942 289625
$$ packed form
16285F10535r6831B22995K00394J08311A96331L1664K53354j19511J45441A62023
16274C78140j09722M21498A72113L7458H6506J78346M702D8238K74008q2642q5029
16263A54575K38159A45500K90632M5587k24365K72603J27790B69930J88546o1325
16253C97151j19512J55894J60450k15633q9732j33380J72771n797M6028r2210
16243B76030E5700J95415Q5231j57958J77992r3988K31703B05756J3564H1920
16232A81262R8798K2399a56C80189H9550K53802l538R4018k7113p8329j48630
16221A79760R3671K47255A75195M15396j90611A53893J68310K20785k43940j05792
16211A93256h9564G9756J6260a76267D67309k08633G9744L76240I5942J93683
$$ plain form
16201 289625 289747 58851 354336 581542 499972 95715 242738 150964 110713 300101 90068
16189 205879 52965 290182 -165577 351954 175576 174410 305886 335308 430722 380385 124294
16177 -78960 59991 270873 -357703 485451 180030 259593 387614 154018 245601 402241
16167 402241 352040 244241 -79296 323007 -367486 -35824 173287 248260 83205 -199553
16156 68050 93273 164784 194613 194919 24850 82873 463488 182268 291924 -150061 171602
16144 56389 357388 -35893 -55634 -75847 123690 266520 132288 96449 -230423 257243
16133 141555 390227 141809 11012 188571 91257 -22321 10350 102228 -7025 172438 192361
16122 192361 304130 188720 228788 -125222 -71452 116009 -2000 -35666 192106 107749 184345
$$ packed form
16201B89625J22E8851K95485K27206q1570I5715J47023r1774m0251J89388I0068
16189B05879E2965K37217a65577C51954A75576j166J31476K9422R5414n0337A24294
16177g8960E9991K10882c57703D85451A80030P9563J28021A54018R1583J56640
16167D02241n0201j07799g9296C23007c67486c5824A73287P4973H3205a99553
16156F8050K5223P1511K9829L06B4850N8023L80615A82268J09656a50061A71602
16144E6389L00999c5893j9741k0213A23690J42830A32288l5839b30423B57243
16133A41555K48672A41809A1012J77559I1257b2321A0350R1878g025A72438J9923
16122A92361J11769j15410M0068a25222N3770A16009b000l3666A92106q4357P6596
$$ plain form
16111 184345 169101 2398 95152 98303 -15932 114449 140312 473888 -74687 313271 204976
16100 204976 165944 374058 -122192 350011 235218 -28006 4360 141187 -12224 734343
16089 237600 -13909 -67107 -41678 -207052 243369 67945 -198897 146145 -43544 342880
16078 69537 -127670 -58989 101013 -130301 35761 -99540 -380366 39649 -13482 -310366 230383
16066 104807 -113829 131109 167652 -55179 9303 33912 91867 -5073 215349 9733 150979
16055 150979 280174 80457 191125 74651 208533 33621 217113 237866 255192 -3813 24826
16043 414688 17337 91747 96278 18898 209554 125219 -128058 310677 -287638 179269 -7086
16031 32131 285201 256246 1458 -310416 -27317 55170 279258 -46563 -75613 174221 3262
$$ packed form
16111A84345j5244B398R2754L151a5932A14449K5863L33576g4687C13271j08295
16100B04976l9032K08114a22192C50011j14793b8006D360J36827a2224G34343
16089B37600a3909n3198K5429j65374B43369F7945a98897A46145d3544C42880
16078F9537a27670e8989A01013a30301C5761i9540k80826C9649a3482k96884B30383
16066A04807a13829A31109L6543e5179I303K4609N7955e073B15349I733J41246
16055A50979J29195H0457J10668G4651J33882C3621J83492K0753J7326c813B4826
16043D14688A7337P4410M531A8898J90656q4335a28058C10677b87638A79269g086
16031C2131K53070k8955A458c10416b7317E5170K24088d6563k9050A74221C262
$$ plain form
16019 -21437 -42584 10112 39119 -519797 462489 -62567 -97837 254875 33582 -381662 457922
16007 66944 -78348 276282 195252 10594 -52486 176598 296351 33300 -183066 127033 -125433
15995 -132054 14309 -106141 5446 -27874 -135989 306999 142360 254147 167079 -482440
15984 34760 142495 -92630 -58411 -149556 39369 -251430 160832 37865 339078 295804 7589
15972 238847 304500 821483 744189 688117 814754 887190 600169 525282 -264092 254998
15961 -185638 -17057 -50842 283528 -160635 84601 21616 -22425 -105579 -157574 157657 -179993
15949 -113288 67443 346491 -255374 37730 165068 38009 -16865 -210962 -52478 -98894 -41728
15937 -92415 178823 -71441 83601 294640 250377 89968 188 -184923 196502 -253894 -112741
$$ packed form
16019b1437k1147A0112K9007e19797D62489f2567l5270B54875C3582c81662D57922
16007F6944g8348B76282q1030A0594e2486A76598J19753C3300a83066A27033a25433
15995a32054A4309a06141E446b7874j08115C06999A42360J11787q7068d82440
15984C4760J07735i2630L4219r1145C9369b51430A60832C7865L01213m3274G589
15972B38847O5653N16983p7294n6072J26637P2436k87021p4887b64092B54998
15961a85638a7057l3785B83528a60635H4601B1616b2425q3154n1995A57657a79993
15949a13288F7443K79048b55374C7730J27338C8009a6865j94097e2478m6416d1728
15937i2415A78823g1441H3601K11039m4263H9968A88a84923A96502b53894a12741
$$ plain form
15925 6413 73673 -199842 2756 -333903 -23944 -207202 -200924 19844 -266679 -234411 -136294
15914 -136294 181041 16608 -10080 268079 -189036 -195452 -45345 83248 13456 240150 -242976
15902 158316 111079 33726 -340243 7652 8051 273692 6899 -64149 -50163 -396297 -200747
15891 -200747 75535 249850 324676 222311 -42246 -86593 -189772 182783 -38643 -143100
15881 -143100 180094 104040 60323 187414 -102512 -142309 -110335 -5612 -274584 -84157 335358
15869 -94081 -99302 -16577 210171 -87342 78045 90404 -166014 -148289 103872 97061 -16864
15857 -206738 -114075 -221578 392885 -157248 -116337 -183917 -360352 -88599 196333 -175633
15846 38377 118774 -29911 -85083 -82472 6189 318950 327348 -164072 409172 -157389 -90593
$$ packed form
15925F413O7260a99842B756c33903b3944j83258O278A9844b66679L2268R8117
15914a36294A81041A6608a0080B68079a89036o416d5345H3248A3456K26694b42976
15902A58316m7237C3726c40243G652L99K65641F899f4149J3986l46134J95550
15891b00747G5535J74315P4826j02365d2246m4347j03179A82783c8643j04457
15881a43100A80094p6054m3717J27091a02512l9797L1974e612k68972h4157C35358
15869i4081n221a6577B10171h7342G8045J2359a66014J7725A03872o811a6864
15857b06738R2663j07503C92885a57248M0911o7580j76435h8599A96333a75633
15846C8377Q0397b9911n5172K611F189L12761Q398a64072D09172a57389O6796
$$ plain form
15835 -90593 -225292 113012 -193626 -216802 -226884 38451 34482 -239480 -19058 -155448 -120537
15824 -120537 -121656 138575 80622 -313053 -73508 39488 -76424 75477 253454 -78533 171370
15812 -102094 42157 46506 -30179 334833 -55689 -275269 -104474 -189379 -355648 -161470 -109756
15801 -109756 17531 -122192 -325928 102405 -89288 -67130 -67651 85864 -31022 7475 -150453
15789 -129722 -138922 -189569 -17327 -238158 -75732 9786 516 47671 -43064 218170 -329649 170916
15776 -271217 139331 -84120 -332806 302542 136814 122141 -123157 -117712 -53277 56692 -218455
15764 -210832 45735 96010 -78295 77091 -271084 -109942 -107088 109739 -98271 -186585 105730
15752 177255 169689 33687 61995 80573 -123599 -196077 -235586 -24029 -77823 185869 46208
$$ packed form
15835i0593j34699A13012a93626k3176j0082C8451l969b39480a9058j36390L4911
15824a20537j119A38575n7953c13053g3508C9488g6424G5477J77977g8533A71370
15812a02094D2157M349c0179C34833e5689k19580a04474q4905j66269a61470N1714
15801a09756A7531a22192k03736A02405h9288K2158n21H5864c1022G475a50453
15789a29722r200n0647a7327k20831g5732I786E16M7155d3064B18170c29649A70916
15776b71217A39331h4120k48686C02542A36814j4673a23157N445e3277E6692b18455
15764b10832D5735N0275g8295G7091b71084a09942K854A09739i8271q8314A05730
15752A77255p566C3687K8308J8578a23599p2478l9509b4029n3794A85869D6208
$$ plain form
15740 -225394 -44910 220030 270090 97432 -59959 5180 -81188 152844 -318069 -4160 -114079
15729 -114079 -213566 81479 336913 -260558 46079 -23368 269477 336850 177338 -69064 -13834
15717 203611 292600 1905 98302 273836 344535 -80167 -315280 -11845 -67311 -127238 -107540
15706 -107540 54368 -138466 -121511 152433 -351732 274332 -86311 146073 507797 201086
15695 107290 136826 -262421 199311 17104 245518 4371 -209258 163481 123681 89451 -87854
15683 116689 -6829 -111643 -57847 373611 26693 124040 -53373 -120499 223603 187276 117816
15672 117816 -54337 -191821 -345406 -161030 139188 -48262 -132728 -164964 -324454 -116576
15661 -2373 145094 -103666 -20667 -265173 -1293 -158135 -169947 88171 14848 -383463 244572
$$ packed form
15740b25394d4910B20030N0060I7432e9959E180h1188A52844c18069d160j09919
15729a14079r9487H1479K55434b60558D6079b3368B69477O7373j59512f9064a3834
15717B03611Q8989A905R6397J75534P0699h0167k35113a1845n5466n9927J9698
15706a07540E4368a38466J6955A52433c51732B74332h6311A46073L61724B01086
15695A07290K9536b62421A99311A7104K28414D371b09258A63481l9800l4230h7854
15683A16689f829j04814N3796C73611B6693R7347e3373o7126B23603l6327o9460
15672A17816e4337j37484j53585a61030A39188d8262q4466l2236j59490a16576
15661b373A45094a03666b0667k44506a293j56842j1812H8171A4848c83463B44572
$$ plain form
15649 -185211 -374133 -138687 -80681 -311115 108208 -4792 -110744 139743 23085 -413579
15638 -78815 -307257 99863 -84570 -493925 -161035 -106639 -132873 110923 -336892 299057
15627 51410 -88377 51797 -209924 46928 -59783 -4483 -230688 -106928 32794 -83645 -256791
15616 -256791 101673 -234412 -112093 79465 -258861 8857 -22785 9503 149278 69716 -7601
15604 -119540 -168783 -245850 152954 -94256 -136895 386576 -212921 149726 -35025 255226
15593 -103989 105491 -71729 -57794 26454 48473 -302599 232772 215906 -80506 -96990 -81658
15582 -81658 161131 188119 -384849 -299642 -182308 129994 -87095 439572 -1556 -281941 118478
15570 261422 -173832 -185322 -30868 60363 43260 -227622 -87075 163848 -203966 27195 108267
$$ packed form
15649a85211j88922a38687N8006k30434A08208d792j05952A39743B3085d13579
15638g8815k28442I9863h4570m09355a61035N4396k6234A10923c36892B99057
15627E1410h8377E1797b09924D6928e9783d483k26205a06928C2794h3645j73146
15616b56791A01673b34412a12093G9465b58861H857b2785I503J39775F9716g601
15604a19540m9243p7067A52954i4256m2639C86576b12921A49726c5025B55226
15593a03989A05491g1729J3935B6454K2019c02599B32772j6866h0506j6484J5332
15582h1658A61131K6988c84849Q5207J17334A29994h7095D39572a556k80385A18478
15570B61422a73832j1490c0868F0363j7103b27622h7075A63848b03966B7195Q1072
$$ plain form
15559 108267 305826 164742 277375 -146092 -264520 164092 254253 -22024 -128646 -61916
15548 -62293 502167 119175 123434 -105139 -263829 -41436 -258529 318110 -130992 -446294
15538 -446294 -421059 -10295 313439 -22768 228615 -87397 -227716 -50590 89440 -99865 -72444
15527 -72444 266603 138095 -120015 67556 142702 214014 -205320 63977 221460 -36463 13347
15515 -194165 -3440 179315 37236 34161 -42641 239223 -135491 -30344 60345 -125434 -243972
15504 -243972 -229410 -40678 79209 121355 -63658 149989 110378 89227 222012 -196493 136862
15492 240765 172446 309761 -70607 341096 -40951 33385 442540 337039 300733 267327 -61827
15480 358879 43921 172619 124631 95333 185999 268344 201955 38685 264282 85626 116110
$$ packed form
15559A08267J97559j41084J12633a46092j18428A64092R0161b2024j06622f1916
15548f2293E02167A19175M259a05139j58690d1436k17093C18110a30992l15302
15538d46294K5235a0295C13439b2768B28615h7397j40319e0590H9440i9865K7421
15527g2444B66603j28508a20015F7556P5146P1312b05320F3977J57483c6463A3347
15515a94165c440A79315C7236l075d2641B39223a35491c0344F0345a25434j18538
15504b43972J4562d0678G9209M2146f3658A49989l9611k1151J32785a96493A36862
15492B40765o8319J37315g0607C41096d0951C3385M09155j05501l6306l3406f1827
15480C58879D3921J28698m7988k9298R0666Q2345o6389C8685K25597H5626L0484
$$ plain form
15469 116110 -106892 159932 -151437 192632 267248 283695 -100920 -148970 393496 49997
15458 702867 670928 305205 768589 121263 88649 136182 136847 43087 -210198 -108660 -256700
15447 -256700 330151 30812 142104 53852 -41608 49558 -89952 -150707 31122 247187 198020
15436 198020 395006 -11548 -117502 -2081 172704 158244 56454 113042 227845 299804 615553
15425 615553 681139 633135 919711 710894 326592 229846 229455 109436 -36896 47170 7251
15413 13222 -62330 44996 138838 99345 394542 -289157 -145853 274784 -216618 -10500 147816
15401 48955 132315 95422 165083 -287382 -189030 -279085 -23815 78217 265858 -137901 73262
15389 147273 229645 200571 -113212 -46288 -7957 -45635 -66785 -15131 -103892 23976 8571 142835
$$ packed form
15469A16110a06892A59932a51437A92632P4616J6447a00920m8050C93496D9997
15458G02867l1939C05205M63384A21263l2614M7533O65D3087b10198J01538j48040
15447b56700C30151C0812J11292E3852d1608D9558h9952o0755C1122K16065m9167
15436A98020J96986a1548j05954b081A72704j4460E6454N6588J14803P1959L15749
15425F15553O5586m8004K86576k08817C26592r6746l91A09436c6896D7170G251
15413A3222f2330D4996R3842l9493K95197b89157J43304B74784b16618a0500A47816
15401D8955Q3360l6893O9661b87382R8352r0055b3815G8217J87641a37901G3262
15389A47273Q2372k9074a13212d6288g957l7678k1150a5131q8761B3976H571J34264
$$ plain form
15377 142835 93787 20097 128596 184953 -113734 -83956 -17366 -336616 -54999 47639 -372772
15365 -145564 -169360 68352 -28868 24232 -166107 267833 382505 68319 246799 -199786
15354 64495 317379 -36163 109145 129456 28615 161689 -66842 117408 262473 38931 73889
15343 73889 -49745 180312 119958 200194 177237 314655 410316 -108648 174078 229586 128310
15332 128310 71190 164526 -60701 382465 77354 446370 373606 203893 328562 461827
15322 461827 214250 -24281 171252 383614 210062 -56537 240051 -32081 230341 -179247
15311 96891 133172 -104389 146986 57328 211278 341295 387622 343093 -48399 5225 2006
15299 31880 -47605 26060 67624 -81412 332215 294231 149580 -136281 -20151 33945 -31574
$$ packed form
15377A42835m9048B0097J08499N6357a13734K9778a7366l19250e4999D7639c72772
15365a45564k3796F8352b8868B4232a66107B67833J14672F8319J78480a99786
15354F4495K52884c6163A09145K0311B8615J33074f6842A17408J45065C8931L4958
15343G3889d9745A80312o0354Q0236k2957J37418R5661a08648A74078N5508j01276
15332A28310n7120R3336f0701C82465G7354L69016p2764j69713J24669J33265
15322D61827B14250b4281A71252K12362j73552e6537B40051c2081B30341a79247
15311I6891L6281a04389A46986E7328J53950J30017M6327m4529d8399E225B006
15299C1880d7605B6060M1564h1412C32215l7984j44651a36281b0151C3945c1574
$$ plain form
15287 -7120 -33378 -15059 347255 99241 -117414 -178817 89551 450033 150760 105439 255147
15276 255147 -54769 253720 360826 -216812 -85969 -42777 -46981 -254375 78512 207368 -136441
15264 -34386 23077 -77940 -16539 144329 -140247 84025 88831 173462 -35585 34471 -248490
15252 -90813 -4432 -90881 56641 495822 -242799 14134 -56117 -73693 141773 125479 271 246479
15240 246479 153929 14984 82083 -128654 246056 166964 4919 430497 342852 281004 773791
15229 773791 851523 1602418 1121515 1587202 1008366 800809 478266 387670 157706 236799
15219 236799 -115657 155213 76439 162736 75486 -223884 84605 -191184 -10456 -98165 189281
15207 54465 111795 -98094 -277954 291443 12625 52377 -139872 -299607 373631 311217 99439
$$ packed form
15287g120k6258a5059C47255I9241a17414o1403H9551L60482A50760m5321J49708
15276B55147e4769B53720J07106b16812h5969d2777m204k07394G8512J28856a36441
15264c4386B3077g7940a6539A44329a40247H4025M806Q4631c5585C4471b48490
15252i0813d432q6449E6641M39181b42799A4134e6117j7576A41773j6294B71K46208
15240B46479r2550A4984O7099a28654B46056p9092D919M25578q7645o1848M92787
15229G73791P7732P50895m80903M65687n78836k07557l22543r0596A57706P9093
15219B36799a15657A55213G6439Q6297G5486b23884H4605a91184a0456q7709A89281
15207E4465N7330i8094j79860B91443A2625L9752a39872j59735C73631o2414I9439
$$ plain form
15195 135904 -113646 537527 133137 76549 -44615 23619 -63069 34299 208348 15833 263282
15184 263282 38521 417466 -71229 119311 199887 -19207 -218971 305702 246922 -238852
15173 -95813 213376 -291421 98830 171010 96280 352668 6668 360258 129713 225620 -108967
15161 -156604 -52548 14099 369507 48108 -108604 -90842 -15222 163811 72243 45019 419780
15150 419780 173957 -205311 334926 39150 485596 114306 368387 154955 241787 -107329
15139 287784 253953 -82340 108471 5169 528446 56534 32718 -175607 153625 152416 -86858
15127 -325649 -140098 15820 19171 155917 230998 117062 -89361 203811 581524 107200
15116 221434 475360 -174630 38519 214277 444808 154777 266062 320821 -126814 -5044
$$ packed form
15195A35904a13646E37527A33137n6588d4615B3619f3069C4299J74049A5833K47449
15184B63282C8521L78945g1229A19311Q0576a9207j99764C05702n8780b38852
15173i5813B13376b91421I8830P2180p4730K56388F668L53590A29713R5907a08967
15161a56604e2548A4099L55408D8108a08604J7762a5222A63811G2243k7224L74761
15150D19780A73957b05311C34926C9150M46446A14306K54081A54955Q6832a07329
15139B87784l3831h2340A08471E169N23277E6534k3816a75607A53625j209h6858
15127c25649a40098A5820L351J36746P5081j13936h9361B03811L77713A07200
15116B21434K53926a74630C8519J75758K30531A54777J11285N4759a26814e044
$$ plain form
15105 525242 751902 327862 716180 40882 210746 172305 -192216 273670 216736 148768
15095 148768 -206440 47768 433087 211992 35008 311546 -24279 219730 205682 359911
15085 359911 343485 157823 312387 110598 409274 132884 171477 -8898 124616 16546
15074 -38653 105295 169486 -53028 65412 151339 283226 231049 210693 -52701 234768 137219
15063 137219 -23993 297726 26734 122690 173604 -102895 256843 21141 199643 -121826
15052 244061 313870 56780 98854 389186 -37382 204500 359260 401053 459308 292869 -645
15040 204763 522105 40509 501306 585425 112380 574996 179340 447351 311043 263768
15030 263768 334368 293722 509758 275044 110927 214821 630000 250392 366660 257916
$$ packed form
15105E25242K26660C27862L88318D0882J69864l8441a92216B73670n6934o7968
15095A48768b06440D7768L85319B11992C5008K76538b4279B19730j4048J54229
15085C59911j6426A57823J54564A10598K98676A32884L8593h898A24616A6546
15074c8653A05295O4191e3028F5412Q5927J31887n2177k0356e2701B34768r7549
15063A37219b3993B97726B6734R5956N0914a02895B56843B1141J78502a21826
15052B44061O9809E6780M2074K90332c7382B04500J54760M1793N8255j66439f45
15040B04763L17342D0509M60797Q4119A12380M62616A79340K68011j36308m7275
15030B63768P0600m0646K16036k34714A10927J03894M15179B50392J16268j08744
$$ plain form
15020 257916 466460 425062 579725 500785 545841 533532 252035 778223 530629 554708
15010 554708 151253 807853 607132 172194 506223 412663 444500 253743 236286 503674
15000 503674 289133 395237 244339 546301 444479 340396 463616 383095 253697 323398
14990 323398 604414 272875 105867 233639 376396 245443 438180 246072 555179 428562
14980 428562 488082 669517 449546 593235 85413 508172 382403 557310 320367 352678
14970 352678 468022 579241 688371 543617 351782 715029 838317 725025 827884 687069
14960 687069 626343 781345 596238 798337 606128 927048 830635 552124 475536 281171
14950 281171 341935 412127 337863 417110 547864 339236 410378 600095 440757 82992 642413
$$ packed form
15020B57916K08544m1398J54663p8940M5056j2309B52035N26188k47594K4079
15010E54708A51253O56600k00721A72194L34029r3560L1837j90757j7457K67388
15000E03674k14541J06104j50898L01962j01822j04083J23220q0521j29398O9701
14990C23398K81016B72875A05867J27772J42757j30953J92737j92108L09107j26617
14980D28562N9520J81435k19971J43689H5413M22759j25769J74907k36943L2311
14970C52678J15344J11219J09130j44754j91835L63247J23288j13292J02859j40815
14960F87069o0726J55002j85107K02099j92209L20920r6413k78511p6588j94365
14950B81171O0764P0192p4264P9247J30754k08628P1142J89717j59338H2992N59421
$$ plain form
14939 642413 494922 269262 536787 225887 617244 331658 190060 680599 228728 507007
14929 507007 481947 560817 492480 573750 516250 600956 413910 214402 582694 231058 455357
14918 455357 745879 499800 608467 862126 668100 1019056 893911 1273565 1197072 1177410
14908 1177410 1569595 1391774 1446635 1713494 1342825 1465507 1199221 1566859 1815562 1568934
14898 1568934 1362333 1429953 1229251 1146380 782646 912476 1077866 830547 482225 225201
14887 294972 356945 295772 753891 667544 475474 477824 250465 357736 681878 416948
14877 416948 485311 486850 658435 634924 166694 262990 511473 550092 570752 449963 678471
14866 678471 461533 909056 486718 743398 517252 783913 1048065 593288 474219 745498
$$ packed form
14939F42413j47491k25660K67525B25887L91357k85586j41598M90539B28728K78279
14929E07007k5060P8870o8337Q1270n7500Q4706j87046j99508L68292B31058K24299
14918D55357K90522k46079J08667K53659j94026L50956j25145L79654p6493j9662
14908A177410L92185j77821N4861K66859l70669J22682k66286L67638K48703k46628
14898A568934k06601O7620k00702q2871l63734J29830J65390k47319l48322B25201
14887B94972O1973o1173M58119q6347j92070K350k27359J07271L24142k64930
14877D16948O8363J539J71585k3511A66694R6296K48483L8619K0660j20789K28508
14866F78471k16938M47523m22338K56680k26146K66661K64152m54777j19069K71279
$$ plain form
14856 745498 445250 397320 136240 532843 441556 367348 812390 779161 768770 471202
14846 471202 123894 642071 600623 341498 312398 695143 676855 571117 406933 479320
14836 479320 411820 509322 565740 619908 543788 827325 267898 839389 554165 1020398
14826 1020398 1030842 1144296 1094353 1179421 846389 1082003 1072794 850188 890532 501437
14816 501437 677749 374838 531193 591366 483704 657861 519941 460741 375754 716463
14806 716463 332242 638596 948139 404191 977039 709896 664422 851974 617464 568355
14796 568355 724082 945012 637067 864670 607118 880420 675194 882952 378941 852734
14786 852734 730858 887167 801713 934085 711052 340814 537235 729824 766773 717301
$$ packed form
14856G45498l00248m7930A36240L96603r1287p4208M45042l3229j0391k97568
14846D71202A23894N18177m1448k59125k9100L82745j8288j05738j64184P2387
14836D79320o7500R7502N6418N4168p6120K83537B67898N71491k85224M66233
14826A020398J0444J13454m9943Q5068l33032K35614r209k22606M0344l89095
14816E01437J76312l02911J56355O0173j07662J74157j37920n9200q4987L40709
14806G16463C32242L06354L09543D04191N72848k67143m5474J87552k34510m9109
14796E68355J55727K20930l07945K27603k57552K73302k05226K07758C78941M73793
14786H52734j21876J56309q5454J32372k23033C40814J96421J92589L6949m9472
$$ plain form
14776 717301 767630 676316 619679 655545 697085 916605 480677 761062 830371 606775 939125
14765 939125 862691 637057 854954 640616 563552 1127375 467287 834377 787199 872079
14755 872079 739446 1131259 1049662 1058012 836139 517005 469281 488883 653391 607728 509231
14744 509231 872248 612231 531227 748701 690200 929846 673112 892546 659230 817758
14734 817758 851283 423011 810691 599683 789308 839662 956576 698886 618326 1059325
14724 1059325 483954 705858 611876 782374 700258 907111 997461 567984 1208917 976907
14714 976907 1052419 854501 1284178 1322690 1170405 1845320 1601557 1458706 1394350 1367928
14704 1367928 975534 1292472 1287740 655941 1169284 795031 990490 830564 1263028 466812
$$ packed form
14776G17301N0329r1314n6637L5866M1540K19520m35928K80385O9309k23596L32350
14765I39125p6434k25634K17897k14338p7064N63823D67287L67090m7178Q4880
14755H72079j32633L91813q1597Q350k21873l19134m7724J9602J64508m5663r8497
14744E09231L63017k60017q1004K17474n8501K39646k56734K19434k33316J58528
14734H17758L3525D23011L87680k11008J89625N0354J16914k57690q0560M40999
14724A059325D83954K21904r3982J70498q2116K06853R0350m29477O40933k32010
14714I76907P5512j97918M29677L8512j52285O74915k43763j42851o4356k6422
14704A367928l92394L16938m732o31799N13343l74253J95459j59926M32464D66812
$$ plain form
14693 672709 924762 1100139 995203 1241270 1028409 1253980 1176211 1440199 1353918 1644660
14683 1644660 1733816 1525835 1563086 1566737 1025863 1326349 946326 1213455 1243407 936411
14673 936411 832167 1055171 1179960 1146341 1054883 1203538 725821 1056802 973040 1215564
14663 1215564 1062645 689696 1049869 1113346 1208247 509049 908251 804519 824811 1101001
14653 1101001 1148417 1338234 1071321 1111098 1400038 1084531 1154892 884251 1029862 1155934
14643 1155934 1061961 1355182 1268260 1508856 1453605 1052368 1506611 1481583 1355743 1387454
14633 1387454 1415672 1355108 1118712 1112663 1119753 1188961 1366694 1323210 1186868 1242457 1282914
14622 1282914 1534601 1283687 1466169 1508652 1187831 1032272 1416104 1466178 1323171 1693301
$$ packed form
14693F72709K52053J75377j04936K46067k12861K25571p7769K63988q6281K90742
14683A644660Q9156k07981L7251L651n40874L00486l80023K67129K9952l06996
14673I36411j04244K23004J24789l3619r1458J48655m77717L30981q3762K42524
14663A215564j52919l72949L60173O3477R4901E09049L99202j03732K0292K76190
14653A101001M7416J89817k66913L9777K88940l15507P0361k70641J45611J26072
14643A155934r3973K93221q6922K40596n5251m01237M54243k5028j25840L1711
14633A387454K8218o0564k36396o049P090O9208J77733m3484j36342N5589M0457
14622A282914K51687k50914J82482M2483l20821j55559L83832N0074j43007L70130
$$ plain form
14612 1693301 1723487 1528029 1239676 1568441 1384796 1181860 1368573 1298496 1629941 1547267
14602 1547267 1441696 1724611 1274743 1539060 1206810 1507828 1426947 1639802 1529592 1290123
14592 1290123 1646741 1463560 1482748 1654620 1998653 1898121 1614592 1652453 1512444 1562384
14582 1562384 1569743 1837342 1449545 1877003 1644849 1880015 1735791 1684153 1783119 1419041
14572 1419041 1770205 2020852 1665652 1730943 1819631 1770576 1677679 2151302 2172057 1836172
14562 1836172 2052632 1881683 2156272 1989737 2120966 2330596 2022869 2286290 2252672 2336319
14552 2336319 2302892 2337505 2617326 2871186 2344622 2547859 2712610 3081263 3188895 3404271
14542 3404271 3500980 3679228 3771331 4195160 4744207 5318054 5935682 7268747 9538533
$$ packed form
14612A693301L0186j95458k88353L28765j83645k02936J86713p0077L31445q2674
14602A547267j05571K82915m49868K64317l32250L01018q0881K12855j10210k39469
14592A290123L56618j83181J9188J71872L44033j00532k83529L7861j40009M9940
14582A562384P359K67599l87797M27458k32154K35166j44224n1638R8966l64078
14572A419041L51164K50647l55200O5291Q8688m9055r2897M73623K0755l35885
14562A836172K16460j70949K74589j66535J31229K09630l07727K63421l3618Q3647
14552B336319l3427L4613K79821K53860n26564K03237J64751L68653J07632K15376
14542C404271R6709J78248R2103M23829N49047N73847O17628J333065K269786
$$ plain form
14533 9538533 13265338 19775812 29503533 33043351 20920132 12630511 7665159 5666406
14525 5666406 4882699 5288285 5050543 3720440 2996728 2753594 2635822 2384380 2157866
14516 2157866 2473031 2403140 2297952 2361294 2305363 2518009 2439535 2354868 2182352 2746584
14506 2746584 2603967 2276176 2703968 2351561 2920228 2655160 2684162 2880891 2385153 3027426
14496 3027426 2706913 2934647 3038452 2731889 3138758 3184177 3005131 2874438 3370442 3366998
14486 3366998 3108264 3157803 3166611 3337466 3409925 3449474 3408780 3703607 3109887 3472068
14476 3472068 3652676 3637747 3693151 3635923 3638064 3878043 3942861 3823016 4090874 4142625 4210354
14465 4210354 4205012 3949467 4370216 4359238 3924491 4069584 4267116 4282540 4523865 4216641
$$ packed form
14533I538533L726805O510474R727721L539818j2123219q289621m965352j998753
14525E666406p83707M05586k37742j330103p23712k43134j17772k51442k26514
14516B157866L15165o9891j05188O3342n5931K12646p8474q4667j72516N64232
14506B746584j42617l27791M27792l52407N68667k65068K9002J96729m95738O42273
14496C027426l20513K27734J03805l06563M06869M5419j79046j30693M96004l444
14486C366998k58734M9539Q808J70855P2459L9549m0694K94827n93720L62181
14476C472068J80608j4929N5404n7228K141K39979O4818j19845K67858N1751O7729
14465D210354n342k55545M20749j0978m34747J45093J97532J5424K41325l07224
$$ plain form
14455 4216641 4451648 4625391 4519028 4519866 4670720 4614971 4917649 4983502 4856325 4953115
14445 4953115 4753754 5145275 5037636 5192210 5353503 5290326 5061147 5147662 5810985 5395122
14435 5395122 5485812 5601108 5935215 5815407 6109530 6051515 5780273 5875161 6200069 6215066
14425 6215066 6265842 6334931 6493391 6495043 6651547 6496952 6762089 6993698 7357656 7131432
14415 7131432 6969862 7455756 7642060 7657152 7625207 7558872 8112256 7848851 8036175 8011443
14405 8011443 8280970 8665800 8691576 8995071 9101312 8996224 9333379 9674949 9420688 9290408
14395 9290408 9764022 9647926 9948170 9786150 10076960 10572616 10465880 10874380 11058828
14386 11058828 11019787 11508610 11241196 11484248 11685560 11873990 12033492 11983273 12372227 12551388
$$ packed form
14455D216641K35007J73743j06363Q38J50854n5749L02678O5853j27177R6790
14445D953115j99361L91521j07639J54574J61293o3177k29179Q6515O63323m15863
14435E395122R0690J15296L34107j19808K94123n8015k71242R4888L24908J4997
14425F215066N0776O9089J58460J652J56504j54595K65137K31609L63958k26224
14415G131432j61570M85894J86304J5092l1945o6335N53384k63405J87324k4732
14405H011443K69527L84830K5776L03495J06241j05088L37155L41570k54261j30280
14395I290408M73614j16096L00244j62020K90810M95656j06736M08500J84448
14386A1058828l9041M88823k67414K43052K01312J88430J59502n0219L88954J79161
$$ plain form
14376 12551388 12798629 12851643 13038498 13560701 13624896 13626551 14544173 14604692 14670000 14965877
14366 14965877 15289882 15364694 16086471 16050140 16501817 16991497 17309308 17020671 17814839 17913486
14356 17913486 18419733 18547620 18926681 19404878 20094487 20262612 20946731 21133055 21531692
14347 21531692 22185484 22617882 23077858 23623174 23905565 24622827 25041613 25698619 26373137
14338 26373137 27314457 27563541 28228541 28928134 29635264 30688863 31511790 32030886 32818431
14329 32818431 33636986 34443637 35335717 36675658 37874539 38519338 39646994 40822686 42046487
14320 42046487 43284250 44697076 45936392 47290914 48542430 50278301 51690637 54082961
14312 54082961 55623352 57272919 59164548 61322857 63395009 65617299 67949613 70906537
$$ packed form
14376A2551388K47241N3014J86855N22203O4195J655R17622O0519O5308K95877
14366A4965877L24005P4812P21777l6331M51677M89680L17811k88637P94168R8647
14356A7913486N06247J27887L79061M78197O89609J68125O84119J86324L98637
14347B1531692O53792M32398M59976N45316K82391P17262M18786O57006O74518
14338B6373137R41320K49084O65000O99593P07130J053599Q22927N19096P87545
14329C2818431Q18555Q06651Q92080J339941J198881O44799J127656J175692J223801
14320D2046487J237763J412826J239316J354522J251516J735871J412336K392324
14312E4082961J540391J649567J891629K158309K072152K222290K332314K956924
$$ plain form
14304 70906537 73371805 76176363 79130028 81540767 85341349 88216721 91675172 95697836
14296 95697836 99588415 103505179 107967613 112770247 117786000 122975253 128691043 134874968
14288 134874968 141009442 147830527 155255943 162824978 170693069 179629680 188222709 197796823
14280 197796823 207756721 218180940 229598126 241462227 254207509 267074803 280775440
14273 280775440 295058465 309234532 323438089 337821916 352300855 366614615 380486336
14266 380486336 393385706 404898680 416550520 426539214 435985012 443983622 452097370
14259 452097370 458687949 462762003 463964472 464777241 465521024 463191117 455783099 449957660
14251 449957660 443352567 432493653 420330716 407396508 394146919 380747064 366703442
$$ packed form
14304G0906537K465268K804558K953665K410739L800582K875372L458451M022664
14296I5697836L890579L916764M462434M802634N015753N189253N715790O183925
14288A34874968O134474O821085P425416P569035P868091Q936611Q593029R574114
14280A97796823R959898J0424219J1417186J1864101J2745282J2867294J3700637
14273B80775440J4283025J4176067J4203557J4383827J4478939J4313760J3871721
14266C80486336J2899370J1512974J1651840R988694R445798P998610Q113748
14259D52097370O590579M074054J202469Q12769P43783k329907p408018n825439
14251D49957660o605093j0858914j2162937j2934208j3249589j3399855j4043622
$$ plain form
14244 366703442 352180575 338600157 323901677 309719817 296102868 282721874 270414854
14237 270414854 257900744 245863261 234695809 224378714 213743769 203078353 192384072
14230 192384072 183035297 174174211 165452759 157696495 150156680 143009779 136482699 130470160
14222 130470160 124985907 119403690 113763732 109014585 104217300 99669519 96305936 92201375
14214 92201375 88836410 85128170 81786397 78850885 75910280 72901774 70225166 68021016
14206 68021016 65730301 63024566 61244900 58997708 57356100 55422935 53514011 52142568
14198 52142568 50347524 49005897 47788876 46081043 44508905 43564651 42350862 41563907
14190 41563907 40390560 38767339 37767719 36824978 35755526 35014257 34203676 33254882 32522832
$$ packed form
14244C66703442j4522867j3580418j4698480j4181860j3616949j3380994j2307020
14237B70414854j2514110j2037483j1167452j0317095j0634945j0665416j0694281
14230A92384072r348775q861086q721452p756264p539815p146901o527080o012539
14222A30470160n484253n582217n639958m749147m797285m547781l363583m104561
14214I2201375l364965l708240l341773k935512k940605l008506k676608k204150
14206F8021016k290715k705735j779666k247192j641608j933165j908924j371443
14198E2142568j795044j341627j217021j707833j572138r44254j213789p86955
14190D1563907j173347j623221r99620r42741j069452p41269q10581r48794p32050
$$ plain form
14181 32522832 31364792 30758303 29948476 29098350 28669820 27672524 26956644 26670824 25633580
14172 25633580 25380948 24735553 23847026 23650830 23173341 22386534 22059792 21621365 21474818
14163 21474818 20893726 20747205 19532423 19543652 19095610 18535876 18642438 17948046 17440664
14154 17440664 17639425 16781815 16882703 16359696 16161229 15645127 15625538 15505988 15004424
14145 15004424 14734450 14202074 14430009 14271697 13676637 13361388 13042774 12852877 13026726
14136 13026726 12889756 12531162 12238247 11953846 11631172 11459514 11328969 11372642 11039565
14127 11039565 11274868 10531597 10400687 10372272 10035632 10292436 10338117 9874967 9523602 9533807
14117 9533807 9802160 9117351 9373589 9207205 8671288 8933996 8602772 8530839 8523399 8510841
$$ packed form
14181C2522832j158040o06489q09827q50126m28530r97296p15880k85820j037244
14172B5633580k52632o45395q88527j96196m77489p86807l26742m38427j46547
14163B1474818n81092j46521j214782J1229m48042n59734J06562o94392n07382
14154A7440664J98761q57610J00888n23007j98467n16102j9589j19550n01564
14145A5004424k69974n32376K27935j58312n95060l15249l18614j89897J73849
14136A3026726j36970l58594k92915k84401l22674j71658j30545M3673l33077
14127A1039565K35303p43271j30910k8415l36640K56804M5681m63150l51365J0205
14117I533807K68353o84809K56238j66384n35917K62708l31224p1933p440j2558
$$ plain form
14107 8510841 8256007 8265002 8024480 8194839 7845470 7868026 7340897 7710938 7247382 7344679
14097 7344679 7437162 7293059 7074885 7011567 6688417 6909432 6872648 7015448 6579788 6414425
14087 6414425 6332002 6125568 5853710 6268658 6210110 5674874 5666106 6128634 5605342 6001974
14077 6001974 5665040 5444067 5424147 5380293 5318737 5367231 5337967 5047270 5137251 4927882
14067 4927882 4938685 5164452 5182894 4835642 5228384 4822311 5049837 4718492 4626760 4704850
14057 4704850 4570870 4595990 4447684 4565941 4689876 4476900 4559805 4378230 4492211 4125499
14047 4125499 4173452 4163693 4489276 4266277 4376102 4350080 4241441 4063682 3994402 3659468
14037 3659468 3592089 3860183 3444335 3655637 3976721 3511080 3789980 3610134 3121341 3450541
$$ packed form
14107H510841k54834Q995k40522J70359l49369K2556n27129L70041m63556R7297
14097G344679R2483j44103k18174o3318l23150K21015l6784J42800m35660j65363
14087F414425q2423k06434k71858M14948n8548n35236q768M62528n23292L96632
14077F001974l36934k20973j9920m3854o1556M8494k9264k90697Q9981k09369
14067D927882J0803K25767J8442l47252L92742m06073K27526l31345r1732P8090
14057D704850j33980K5120j48306J18257J23935k12976Q2905j81575J13981l66712
14047D125499M7953r759L25583k22999J09825k6022j08639j77759o9280l34934
14037C659468o7379K68094m15848K11302L21084m65641K78900j79846m88793L29200
$$ plain form
14027 3450541 3225823 3234558 3340934 3348532 3471941 3111168 3034192 3126175 3284649 3284648 3096274
14016 3096274 2940967 3189619 3408693 3017908 3457045 2885733 3027808 3195575 2736989
14007 2736989 3083956 3099995 2892084 2495294 2515023 2829141 2669805 2778272 2972325 2396769
13997 2396769 2047133 2174891 2363043 2713805 1946210 2448242 2523978 2469945 2182035 2303117
13987 2303117 2251151 2211910 2413872 2427424 2430311 2538320 2171702 2894558 2743630 3038655
13977 3038655 3304891 3611813 4613051 5826412 9026303 14190674 24442100 33865543
13969 33865543 24612143 16095885 11327945 7851369 6409911 5198522 4714906 4091120
13961 4091120 3739704 3596984 3491837 2818968 3053379 2924917 3032451 2635276 2667716 2638095
$$ packed form
14027C450541k24718Q735J06376P598J23409l60773p6976R1983J58474jj88374
14016C096274j55307K48652K19074l90785M39137n71312J42075J67767m58586
14007B736989L46967J6039k07911l96790J9729L14118j59336J08467J94053n75556
13997B396769l49636J27758J88152L50762p67595N02032P5736n4033k87910J21082
13987B303117n1966l9241K01962J3552K887J08009l66618P22856j50928K95025
13977C038655K66236L06922J001238J213361L199891N164371J0251426R423443
13969C3865543r253400q516258m767940l476576j441458j211389m83616o23786
13961D091120l51416j42720j05147o72869K34411j28462J07534l97175L2440k9621
$$ plain form
13951 2638095 2572887 2730024 2092528 2088100 2450061 2451359 2049693 2153265 2262602 2026524
13941 2026524 2016655 2291740 2164493 2599448 2004321 2169320 2059271 1683753 1834939 1946735
13931 1946735 2108888 1770836 1925092 1825664 1624519 2153042 1925593 1859103 1970872 2018540
13921 2018540 1742131 1917858 1551046 1878756 2083420 1332030 1606356 1433501 1650405
13912 1650405 2236719 1292738 1872437 1811446 1713231 1764876 1495980 1413451 1611093 1613861
13902 1613861 1801809 1249593 1348887 1373276 1117829 1591991 1815108 1549409 1343823 1234447
13892 1234447 1559348 1553072 1069678 1330664 1200917 1334815 1467365 1286132 1241918 1174657
13882 1174657 1430686 1309042 1484025 1316071 1005530 1243178 1159184 1547497 1310716 1593100
$$ packed form
13951B638095o5208J57137o37496m428L61961J298m01666J03572J09337k36078
13941B026524r869K75085j27247M34955n95127J64999j10049l75518J51186J11796
13931A946735J62153l38052J54256r9428k01145N28523k27449o6490J11769M7668
13921B018540k76409J75727l66812L27710K04664p51390K74326j72855K16904
13912A650405N86314r43981N79699o0991r8215N1645k68896q2529J97642K768
13902A613861J87948n52216R9294K4389k55447M74162K23117k65699k05586j09376
13892A234447L24901o276m83394K60986j29747J33898J32550j81233m4214o7261
13882A174657K56029j21644J74983j67954l10541K37648q3994L88313k36781K82384
$$ plain form
13872 1593100 1437695 1427908 1426339 1495837 1266447 1524975 1326545 1301940 1280798 1359135 1365201
13861 1365201 1115233 1275510 1194193 1013113 1068789 1027143 1246384 943388 1223737 1199003
13851 1199003 1210434 1021931 796972 927607 1098391 1110617 1473793 888746 1182336 1265091
13841 1265091 1253647 1033986 1023670 997019 1034286 1032320 967341 1022310 1225055 1332594 1049946
13830 1049946 1072793 1127023 1002715 891533 1286882 1083941 1134910 1044101 1278931 562629
13819 987138 1052777 1082817 1115051 748834 683399 957417 973008 652750 1097052 768392
13809 768392 664163 807718 676880 1134287 1074470 732759 1019569 1070489 760273 983700
13799 983700 769078 986973 1102745 540388 1104283 1027118 1083812 1102850 701716 1101455
$$ packed form
13872A593100j55405r787j569O9498k29390K58528j98430k4605k1142P8337O066
13861A365201k49968J60277q1317j81080N5676m1646K19241l02996K80349k4734
13851A199003J1431j88503k24959J30635J70784J2226L63176n85047K93590Q2755
13841A265091j1444k19661j0316k6651L7267j966o4979N4969K02745J07539k82648
13830A049946K2847N4230j24308j11182L95349k02941N0969r0809K34830E62629
13819I87138O5639L0040L2234l66217o5435K74018J5591l20258M44302l28660
13809G68392j04229J43555j30838M57407n9817l41711K86810N0920l10216K23427
13799I83700k14622K17895J15772E40388N63895p7165N6694J9038m01134L99739
$$ plain form
13789 1101455 636637 896097 895933 766240 880338 491280 1182904 609699 640409 839989
13779 839989 840850 499191 780992 734729 615377 561160 970068 592481 759394 702604 950053
13768 950053 548400 1079091 632398 669927 417189 733845 488433 923866 626169 626319
13758 626319 544458 638777 550761 735711 662434 654840 836451 845537 746208 796187 531743
13747 531743 397608 910976 842423 518082 456516 1035320 763262 747508 796596 657092
13737 657092 687438 753622 742662 562870 751503 849566 420306 730533 524338 514933 1131790
13726 1131790 650438 586041 337775 902114 500229 493669 601737 252825 256582 726635
13716 726635 555493 440292 658028 776473 694394 647781 627520 862035 552581 562171
$$ packed form
13789A101455m64818K59460j64j29693J14098l89058O91624n73205L0710J99580
13779H39989Q61l41659K81801m6263j19352n4217M08908l77587J66913n6790K47449
13768I50053m01653N30691m46693L7529k52738L16656k45412M35433k97697J50
13758F26319q1861R4319q8016J84950p3277p594J81611R086r9329M9979k64444
13747E31743j34135N13368o8553l24341o1566N78804k72058j5754M9088j39504
13737F57092L0346O6184j0960j79792J88633R8063D20306L10227k06195r405O16857
13726A131790m81352o4397k48266N64339m01885o560J08068B52825L757M70053
13716G26635j71142j15201K17736J18445q2079m6613k0261K34515l09454R590
$$ plain form
13706 562171 602076 910527 571310 555049 318322 239856 443222 515476 606067 592530 555985
13695 555985 421438 685225 450407 493425 338607 288511 482329 498849 441176 657825
13685 657825 310710 691128 316621 311943 192466 394931 600684 440863 524303 270265
13675 270265 869506 409311 268031 95530 443776 536618 274328 104452 520029 849961
13665 849961 708034 662415 11021 568298 481808 420516 352243 150566 289927 144885
13654 624449 733101 512322 14061 329778 665021 291310 438364 271519 457884 446745
13644 446745 576813 276827 223890 545389 513899 719242 186218 297863 368392 529786
13634 529786 425283 309406 550926 522520 478319 285898 212024 496081 158772 101507
$$ packed form
13706E62171L9905L08451l39217j6261k36727p8466K03366P2254R0591j3537l6545
13695E55985j34547K63787k34818M3018j54818n0096J93818J6520n7673K16649
13685F57825C10710L80418C16621m678j19477K02465K05753j59821Q3440k54038
13675B70265N99241D09311j41280I5530L48246R2842k62290A04452M15577L29932
13665H49961j41927m5619A1021N57277q6490o1292o8273A50566J39361A44885
13654F24449J08652k20779A4061L15717L35243B91310J47054j66845J86365j1139
13644D46745J30068B76827n2937L21499l1490K05343A86218J11645P0529J61394
13634E29786j04503j15877K41520k8406m4201j92421p3874K84057A58772n7265
$$ plain form
13624 101507 432986 194750 383919 245646 232810 413692 662757 295475 608148 410470
13614 410470 262045 340751 579913 241922 358372 467130 97823 782269 293872 306516
13604 306516 194800 405531 376922 559281 316432 345964 346038 138975 189920 404752 116674
13592 625648 269747 372165 382413 338098 436487 545176 660901 641540 452021 361167
13582 361167 321878 73467 191557 -91402 554199 447426 765580 509758 456286 306298
13572 306298 414803 150024 188672 684440 543390 361179 445247 259323 388985 309838
13562 309838 392171 457733 118934 -31226 439115 529078 450013 216374 392305 -63506 455264
13550 287821 289563 272559 109501 460587 220935 478874 179212 244336 375389 363889
$$ packed form
13624A01507L31479A94750J89169j38273j2836J80882K49065B95475L12673j97678
13614D10470j48425P8706K39162B41922J16450J08758I7823O84446B93872J2644
13604C06516j11716K10731k8609J82359k42849K9532P4A38975N0945K14832A16674
13592F25648B69747J02418J0248m4315R8389J08689J15725j9361j89519r0854
13582C61167l9289G3467J18090i1402E54199j06773L18154k55822n3472j49988
13572C06298J08505A50024L8648M95768j41050j82211Q4068j85924J29662p9147
13562C09838Q2333O5562A18934c1226D39115Q9963p9065B16374J75931f3506D55264
13550B87821J742j7004A09501L51086B20935K57939A79212O5124J31053j1500
$$ plain form
13540 363889 785963 244205 276916 401588 413112 218748 -23779 81953 368451 177240
13529 262663 105247 67699 204987 128486 341730 535326 557467 154242 209830 536221
13519 536221 383302 362534 590607 419945 382384 461977 166723 234376 136909 583444
13509 583444 90965 536805 425794 287289 174803 481384 455689 366651 269044 156817
13499 156817 469245 213846 488920 45209 212547 113270 186048 121808 159279 286778
13489 286778 673213 166015 157163 149145 244468 359180 154394 144993 276957 135457 381375
13478 381375 473718 -82911 267206 464741 348663 -3418 477732 100692 374461 275382
13468 275382 19994 -83687 246981 160879 370863 172891 295341 -90141 146759 15267
$$ packed form
13540C63889M22074B44205L2711J24672J1524j94364b3779H1953K86498A77240
13529B62663A05247l7548J37288p6501K13244J93596K2141A54242N5588L26391
13519E36221j52919k0768K28073j70662l7561P9593A66723O7653r7467M46535
13509E83444I0965M45840j11011j38505j12486L06581k5695q9038r7607j12227
13499A56817L12428B13846K75074D5209J67338r9277P2778o4240L7471J27499
13489B86778L86435A66015q852q018R5323J14712A54394r401J31964A35457K45918
13478C81375R2343h2911B67206J97535j16078c418D77732A00692K73769r9079
13468B75382A9994h3687B46981q6102K09984A72891J22450i0141A46759A5267
$$ plain form
13457 100665 128951 154183 282818 265802 340627 321112 255655 177774 132763 422050 -80562
13445 237684 122882 111996 128022 492437 376942 423425 442990 237942 207536 99707 316250
13434 316250 367612 -40203 -116706 299533 148281 287819 366357 134887 325185 210794
13424 210794 271388 311563 462443 120985 434040 356058 110768 146588 148739 114592 228809
13413 228809 341651 100463 -29445 136829 -26102 217554 -135656 145121 206915 -259764
13402 -22795 -120692 118068 227947 43832 125589 150264 483435 345739 428625 31093 399149
13391 399149 392837 230651 75586 -176425 84594 299911 154141 121341 277224 90509 -202747
13379 -86495 238080 -124433 197423 -34411 161057 155256 205217 -107367 258168 389909
$$ packed form
13457A00665K8286K5232J28635j7016P4825j9515o5457p7881m5011K89287h0562
13445B37684j14802j0886J6026L64415j15495M6483J9565k05048l0406I9707K16543
13434C16250N1362d0203p6503B99533A48281J39538P8538A34887J90298j14391
13424B10794O0594M0175J50880A20985L13055p7982A10768L5820K151l4147J14217
13413B28809J12842A00463b9445A36829b6102B17554a35656A45121O1794b59764
13402b2795r7897A18068J09879D3832Q1757K4675L33171j37696Q2886C1093L68056
13391C99149o312j62186G5586a76425H4594K15317j45770l2800J55883I0509b02747
13379h6495B38080a24433A97423c4411A61057n801M9961a07367B58168J31741
$$ plain form
13369 389909 384123 -110328 109480 288864 498748 13217 398314 340582 334492 43042 -64122
13357 -9441 393361 236266 93304 216675 302749 629 191351 423123 83355 385693 190751
13345 287857 117118 340248 123023 363089 290678 199708 146420 183452 53587 -19486 400840
13333 -18105 175128 -16514 57770 338739 490972 510433 297014 96301 534277 166751
13322 472859 102587 200862 538832 153367 304709 87528 229494 -22562 367464 430776
13312 430776 546561 -52952 421509 -93732 199800 116470 238523 114272 -125336 103728
13301 327761 309655 18348 269330 202997 223066 332381 67403 277074 18468 201158 293236
13290 293236 141766 -144887 421171 230479 316282 -94866 -121856 249603 352495 306600
$$ packed form
13369C89909n786a10328A09480J79384K09884A3217L85097n7732o090D3042f4122
13357i441C93361j57095I3304J23371Q6074F29J90722K31772H3355L02338A90751
13345B87857A17118K23130A23023K40066p2411r0970n3288L7032E3587a9486D00840
13333a8105A75128a6514E7770K80969J52233J9461k13419I6301M37976A66751
13322D72859A02587R8275L37970A53367J51342H7528J41966b2562C67464O3312
13312D30776J15785e2952D21509i3732A99800q3330J22053A14272a25336A03728
13301C27761j8106A8348K50982o6333K0069J09315F7403K09671A8468J82690R2078
13290B93236A41766a44887D21171j90692Q5803i4866k6990B49603J02892m5895
$$ plain form
13280 306600 87711 19372 391851 289229 -135210 320148 20724 359463 -22643 86546
13269 -80496 -234221 291740 403518 258923 19123 106887 -19235 470131 142959 -241504
13258 -93415 -290383 200665 53662 163927 -53487 175255 -31118 -311876 239952 136474
13248 136474 -260959 103368 167553 -203752 87738 66432 -11103 126236 181012 396264
13238 396264 125314 -99755 214711 268517 101092 437634 20700 314001 190613 -355156
13227 -65141 -77395 199554 49272 219619 -113593 -62865 128476 300755 -82774 -29107 -338271
13216 -338271 79684 376061 -4073 370627 -31746 65734 34732 185014 172167 245181 452180
13205 452180 168506 128882 84330 -60274 -62119 218513 342187 108149 31131 -60325 9603
$$ packed form
13280C06600H7711A9372L72479j02622a35210C20148B0724L38739b2643H6546
13269h0496j53725B91740J11778j44595A9123Q7764a9235D70131A42959b41504
13258i3415j96968B00665E3662J10265e3487A75255c1118k80758B39952j03478
13248A36474b60959A03368O4185b03752H7738k1306a1103A26236N4776K15252
13238C96264A25314i9755B14711N3806A01092L36542B0700K93301j23388c55156
13227f5141j2254A99554D9272J70347a13593N0728A28476J72279h2774b9107l09164
13216c38271G9684K96377d073C70627c1746F5734l1002J50282j2847P3014K06999
13205D52180A68506l9624m4552f0274j845B18513J23674A08149C1131f0325I603
$$ plain form
13193 -134632 2782 -96200 -206901 130281 15137 81016 -20541 319256 -137484 237340 -66297
13181 355639 385069 109280 488728 271533 193224 118857 237311 99352 317049 -24374
13170 211471 197285 -126997 115752 587294 22014 182596 -78201 54323 -78753 106402
13159 293268 -59776 -83034 69674 64449 -199616 200797 145863 139169 27782 -132241 -40157
13147 263206 123655 -5010 -103798 57764 -189170 309704 108402 170611 305702 -471616
13136 -76752 271101 61084 38232 25838 -63545 294964 82092 28960 67424 30139 -60269
13124 174103 270976 236820 217841 180676 289013 -202590 290887 -39984 -133694 23927 285691
13113 285691 146195 54885 149770 5601 -169576 5823 -82711 -169455 209036 26717 -246365
$$ packed form
13193a34632B782i6200j10701A30281A5137O5879b0541C19256a37484B37340f6297
13181C55639K9430A09280L79448k17195p8309p4367J18454I9352K17697b4374
13170B11471j4186a26997A15752M71542B2014J60582g8201E4323g8753A06402
13159B93268e9776k3258F9674n225a99616B00797n4934o694B7782a32241d0157
13147B63206A23655e010r8788E7764a89170C09704A08402O2209J35091d71616
13136g6752B71101F1084k2852j2394f3545B94964H2092B8960L8464C0139f0269
13124A74103R6873l4156j8979l7165J08337b02590B90887c9984r3710B3927K61764
13113B85691j39496E4885R4885E601a69576E823h2711q6744B09036B6717b46365
$$ plain form
13101 340154 86888 72955 140736 -2765 -35781 330887 -158534 -16554 -242255 -311570 151886
13089 6339 88802 277183 -83015 68058 -129070 210139 51043 6098 178130 -224556 150669
13077 23348 93351 67029 212386 91134 -45627 -34151 207475 199174 195104 112366 -23051 97410
13064 403813 215523 91352 -41631 2776 18721 -197742 56847 201974 264671 -143470 175138
13052 53383 -263676 306869 -109609 340115 -94729 221487 -98511 -137800 38489 -106396
13041 145225 2302 83435 -43814 128042 232720 15527 -30878 225850 152893 18945 -136440
13029 62450 -102491 -88647 446575 -266306 203254 -59414 80149 129698 230826 -77619 139383
13017 27018 62387 -107775 215133 -37752 -226664 23265 164370 289101 -5614 -95711 47513
$$ packed form
13101C40154H6888j3933O7781b765l3016C30887a58534a6554k25701o9315A51886
13089F339Q2463J88381h3015F8058a29070B10139E1043F098J72032b24556A50669
13077B3348P0003k6322J45357I1134d5627J1476B07475q301m070q2738b3051I7410
13064D03813j88290I1352d1631B776J5945a97742E6847J45127O2697a43470A75138
13052E3383b63676C06869a09609C40115i4729B21487i8511l9289C8489a06396
13041A45225B302Q1133d3814A28042J04678A5527c0878B25850p2957A8945a36440
13029F2450a02491J3844D46575b66306B03254e9414H0149M9549J01128g7619A39383
13017B7018L5369a07775B15133c7752j88912B3265J41105J24731e614r0097D7513
$$ plain form
13005 282341 259571 404295 87366 -139116 -42381 250986 15864 168385 -152227 242297
12994 65211 -30679 -137693 255059 16865 -74679 -197270 297811 363874 161405 -146201
12983 49640 -129062 -186798 98643 128846 32787 371324 166912 206177 -16691 -223074 122175
12971 -239212 230973 -239116 -221339 -121861 271255 -61520 140677 346074 -87074 -7989 -163749
12960 -163749 -110693 63956 72730 187050 328532 -64712 -174718 115838 89193 40092 -11226
12948 174420 -91934 299756 205133 -305552 -140244 171813 -236341 265904 -255207 5939
12937 92223 -67826 87382 -55714 381 74153 -283250 186191 -27623 294108 -3236 -86750 -94600
12925 -94600 -170222 168847 112720 88787 -1293 133629 23456 -43687 139278 189481 74365
$$ packed form
13005B82341k2770J44724H7366a39116d2381B50986A5864J52521a52227B42297
12994F5211c0679j07014B55059A6865g4679j22591B97811O6063A61405a46201
12983D9640a29062n7736I8643L0203C2787L38537A66912L9265a6691k06383A22175
12971b39212B30973b39116J7777R9478B71255f1520A40677K05397h7074g989j55760
12960a63749N3056F3956Q774J14320J41482f4712j10006A15838k6645D0092a1226
12948A74420i1934B99756r4623c05552a40244A71813b36341B65904b55207E939
12937I2223f7826H7382e5714C81P3772b83250A86191b7623B94108c236q3514p850
12925i4600p5622A68847n6127k3933a293A33629B3456d3687A39278N0203G4365
$$ plain form
12913 -59016 -54767 -13136 117081 -475910 127465 -64168 211032 196740 151740 163765 -263
12901 150580 155838 127484 225978 -103031 -377118 -86015 97170 -12813 -214552 -75559 800
12889 74661 210511 -28453 80036 -34911 114437 -60893 181008 49430 261576 -13521 41142
12877 -18290 -90428 347833 -232616 138122 204799 -121827 -87509 47303 -103181 65683 30866
12865 122309 -138433 -127094 -161592 22237 82060 27042 23285 185317 -392855 433486 50013
12853 -176799 18440 -283641 72397 -33415 -159107 -274585 128999 -333907 -87234 291421
12842 243560 184409 161308 -227599 2132 -223279 110123 36672 75146 -24027 -104122 -254791
12831 -254791 -112721 29021 64455 59482 209605 -5011 167638 99659 -72959 73051 12505
$$ packed form
12913e9016M249a3136A17081d75910A27465f4168B11032j4292m5000J2025b63
12901A50580N258k8354R8494a03031k74087h6015I7170a2813k01739g5559H00
12889G4661J35850b8453H0036c4911A14437f0893A81008D9430K12146a3521D1142
12877a8290p2138C47833b32616A38122O6677a21827L4318D7303a03181F5683C0866
12865A22309a38433J1339l4498B2237N9823B7042l757J62032c92855D33486E0013
12853a76799A8440b83641G2397c3415j25692j15478A28999c33907h7234B91421
12842B43560n9151k3101b27599B132b23279A10123C6672L8474b4027q0095j50669
12831b54791a12721B9021L5434m973J50123e011A67638o7979g2959G3051A2505
$$ plain form
12819 -22067 188902 240390 -42541 -14043 27385 -427153 -33308 199293 -42833 200723 67572
12807 154655 -107471 91546 222453 -169662 -85779 -112005 111936 -125632 -224088 976 223854
12796 223854 -233529 -301733 -422495 168311 365382 -90326 32818 141682 -65561 348258
12785 -149503 445085 -352507 216509 111935 102751 -108494 130636 -12581 -182388 270592
12774 -187045 -157375 -401995 6109 224255 -355429 15921 -66101 115076 147356 -141819 168065
12762 292588 45919 -108256 64898 42230 -252960 3147 -119538 177693 -224434 162040
12751 -41724 -21983 234179 15698 50235 177481 -32888 -198384 -71769 -189621 93128 -294396
12739 -144636 134252 7564 -60224 58518 15024 -46299 -295051 104457 3336 3579 -22471 62202
$$ packed form
12819b2067A88902N1488d2541a4043B7385d27153c3308A99293d2833B00723F7572
12807A54655a07471I1546J30907a69662Q3883k6226A11936a25632r8456I76K22878
12796B23854b33529o8204j20762A68311J97071i0326C2818J08864f5561C48258
12785a49503D45085c52507B16509j04574r184a08494A30636a2581j69807B70592
12774a87045K9670k44620F109K18146c55429A5921f6101A15076L2280a41819A68065
12762B92588D5919a08256F4898k2668b52960C147a19538A77693b24434A62040
12751d1724J9741B34179A5698L4537J27246c2888j65496g1769j17852I3128b94396
12739a44636A34252G564f0224E8518A5024d6299k48752A04457C336K43b2471F2202
$$ plain form
12726 -129868 137268 -42134 -33285 -85923 234571 30394 434411 324419 59566 -52207 143836
12714 19020 -46653 -26586 -9802 265459 186532 -180551 -239876 28966 -128996 -114324 -151040
12703 -151040 -141918 -76248 136462 95678 -106203 -181668 106980 76411 31212 108980 69548
12692 69548 11291 -155951 11578 335618 74510 134055 113745 -47646 130505 -142019 140056
12680 213290 -85714 -327307 15630 -198482 -161115 91723 -256934 94491 -77881 89266 75596
12669 75596 42311 255839 223974 149113 -165912 332094 58049 -105466 131541 202234 208710
12658 208710 176558 -206045 -14566 180229 61758 31757 -188720 -156569 -22218 -111435 -100617
12647 -100617 -185433 -108927 -62524 279328 2855 47943 199641 -103637 20998 69852 101572
$$ packed form
12726a29868A37268d2134Q849n2638B34571C0394M04017j09992E9566e2207A43836
12714A9020d6653K0067i802B65459p8927a80551n9325B8966a28996J4672l6716
12703a51040R122O5670A36462m0784a06203p5465A06980l0569C1212P7768l9432
12692F9548A1291a55951A1578L24040G4510N9545k0310d7646A30505a42019A40056
12680B13290h5714k41593A5630a98482L7367I1723b56934I4491g7881H9266j3670
12669G5596l3285K13528l1865p4861a65912C32094E8049a05466A31541P0693O476
12658B08710l2152b06045a4566A80229F1758l0001a88720L2151b2218q9217J0818
12647a00617q4816P6506M6403B79328B855M5088J51698a03637B0998M8854L1720
$$ plain form
12636 101572 145616 -49729 -17549 -398770 137520 521500 489126 174525 -201228 -2744 96483
12624 79240 -194675 42221 419690 -104216 -189114 -30980 258965 -26671 243817 158870 -35055
12612 -35644 105528 276826 124673 -5955 411346 -161147 139651 96891 151849 221748 8957
12600 38852 -303779 -103001 54678 46234 -159250 66088 90622 -36679 -31233 -164422 260589
12588 -144069 17493 -12147 140654 -175014 -96858 19289 458844 -177043 -93651 1692 -114061
12576 79442 91496 23175 -134496 21109 -49019 -55926 88992 -88341 -359365 -26680 -157595
12565 -157595 -122283 -70977 -11712 387205 -22198 -135015 -233328 234204 -87436 -102871 147040
12553 -43412 67083 203380 366547 -10757 164790 4814 94800 -84385 204009 -156500 -209499
$$ packed form
12636A01572M4044d9729a7549l81221A37520L83980l2374A74525b01228b744I6483
12624G9240a94675D2221L77469a04216q4898c0980B58965b6671B43817q4947c5055
12612c5644A05528J71298A24673e955D11346a61147A39651m2760N4958O9899H957
12600C8852c03779a03001E4678q444a59250F6088K4534c6679N446j33189B60589
12588a44069A7493a2147A40654a75014P8156A9289M39555a77043Q3392A692a14061
12576G9442J2054B3175a34496B1109d9019o907H8992h8341k71024b6680j30915
12565a57595L5312N1306a1712C87205b2198j12817r8313B34204h7436j5435A47040
12553d3412F7083J36297J63167a0757A64790D814Q9986h4385B04009a56500n2999
$$ plain form
12542 -209499 -19295 -146931 -107241 312117 342508 -47901 -15695 -24746 -91024 -118257 116076
12530 6482 112183 -305142 -369081 -254069 92 199220 -433299 -100161 49702 -138780 -83873
12519 -83873 252738 -240549 -117262 -129793 -145687 287239 -30651 82091 566181 48327 -131752
12507 28799 -37902 100512 -145228 -248467 -244230 -164838 -42985 220172 -66427 -43752 338328
12495 231711 348044 160599 -77888 127776 75509 171028 -108649 -68228 -126740 -153792 349716
12483 108276 -90879 2222 -349939 -105060 -177261 -105574 55064 107880 -213634 215085 -148929
12471 -146878 55728 -2891 195567 185119 -224411 -82558 38298 47954 -368880 193937 126623
12460 126623 275108 -52554 -31292 66203 -96459 233740 163810 -190037 359653 -53428 -271294
$$ packed form
12542b09499a9295j27636L9690C12117L0391d7901a5695r051o6278k7233A16076
12530F482J05701c05142o3939J15012I2J99128d33299a00161D9702a38780N4907
12519h3873B52738b40549a17262j2531j5894B87239c0651H2091M84090D8327a31752
12507B8799c7902A00512a45228j03239M237P9392d2985B20172f6427K2675C38328
12495B31711J16333A60599g7888A27776n2267R5519a08649M0421n8512k7052C49716
12483A08276i0879B222c49939a05060p2201P1687E5064N2816b13634B15085a48929
12471a46878E5728b891A95567j0448b24411h2558C8298R656c68880A93937o7314
12460A26623J48485e2554K1262F6203i6459B33740o9930a90037C59653e3428k17866
$$ plain form
12449 -271294 -67420 8802 79610 3848 70600 -90719 8858 -95788 89505 17605 -94490 -94339
12437 -94339 -186898 -244855 -326982 -206573 -235826 16022 -342281 -125635 -223226 208308 279236
12426 279236 137416 -104075 -39214 10333 -44874 -105101 -214207 -84384 200850 87613 34955
12414 -349784 -178718 21657 56171 -155473 -96845 203900 103387 -180839 -219002 -248141
12404 -248141 47502 -21222 -407796 -157588 -240432 25130 -177768 203912 39058 147298
12394 147298 310874 -105191 -141223 246911 82721 131608 -226196 -18746 -105575 -64410 91573
12382 -70221 -148918 150279 7982 -124060 -184389 -130546 193377 10300 63994 86530 286072
12371 286072 -1651 -33992 98165 30927 147147 484940 113287 -156280 109364 123783 119266
$$ packed form
12449b71294f7420H802P0808C848O6752i0719H858i5788H9505A7605i4490J51
12437i4339r2559n7957q2127J20409k9253A6022c42281a25635r7591B08308P0928
12426B79236A37416a04075c9214A0333d4874o0227j09106h4384B00850H7613C4955
12414c49784J71066B1657L4514a55473N8628B03900j00513a80839l8163k9139
12404b48141D7502b1222l86574a57588q2844B5130a77768B03912C9058J08240
12394A47298J63576a05191l6032B46911H2721M8887b26196a8746q6829M1165I1573
12382g0221p8697A50279G982a24060o0329N3843A93377A0300N3694K2536J99542
12371B86072a651l2341I8165C0927J16220L37793A13287a56280A09364J4419m517
$$ plain form
12360 119266 183410 139022 133410 56792 58380 -228724 220680 -156183 60980 113283 254463
12349 254463 105296 264986 234414 -235349 30737 -33192 -72191 -157128 -237167 41695 -16679
12337 47716 -158241 -196807 36960 -49138 204631 118569 324248 -108401 -368848 98656 69485
12326 69485 57982 -264012 338923 -381557 15739 -63035 318659 26922 66100 -24316 144233
12314 -122205 281368 6877 13223 409339 283944 -82026 -15100 10767 92912 237461 41618
12302 283027 -128870 263398 237840 -144883 -124482 299585 63813 253135 -50000 -122369
12292 -122369 -265132 -115500 -7713 231102 216619 234164 108807 181241 10369 -82411 263697
12280 159757 7112 235045 40718 152183 70549 9816 -204683 225795 -269777 -61116 -24257
$$ packed form
12360A19266O4144m4388n612E6792J588b28724B20680a56183F0980N2303J41180
12349B54463A05296J59690l0572b35349C0737c3192l8999q4937q0039D1695a6679
12337D7716a58241l8566C6960d9138B04631q6062K05679a08401k60447I8656k9171
12326F9485j1503b64012C38923c81557A5739f3035C18659B6922L9178b4316A44233
12314a22205B81368F877O346L96116j25395h2026a5100A0767Q2145J44549D1618
12302B83027a28870B63398k5558a44883K0401B99585F3813J89322e0000p2369
12292a22369j42763a15500g713B31102j4483J7545A08807P2434A0369h2411B63697
12280A59757G112K27933D0718J11465G0549I816b04683B25795b69777f1116b4257
$$ plain form
12268 304589 338521 109758 -43822 -110830 57016 -28605 129422 604615 157251 -53536 88539
12256 53284 61644 204106 28756 274363 1084 -97389 105521 208578 435537 217138 272047
12245 272047 277854 155946 89307 185978 -119179 23612 257654 232781 107585 77547 27685
12233 304358 88604 -311056 461600 54112 -62415 99180 -203167 85114 173878 -65804 125126
12221 56339 53945 -80077 208210 159526 -300244 484219 -169334 1223 4683 374245 245657
12210 245657 322713 -38928 390606 211646 77616 29927 329541 466089 150702 15474
12199 84830 37956 71984 110548 -27045 345580 -29654 -120915 46928 -92469 -74126 -86860
12188 -86860 178230 -219315 -17593 419450 -122623 63827 185636 -119275 340515 441795
$$ packed form
12268C04589L3932A09758d3822o7008E7016b8605A29422M75193A57251e3536H8539
12256E3284Q360J42462B8756K45607A084i7389A05521J03057K26959B17138N4909
12245B72047N807j21908o6639R6671a19179B3612K34042k4873A07585l0038B7685
12233C04358H8604c11056D61600E4112f2415I9180b03167H5114Q8764f5804A25126
12221E6339k394h0077B08210m8684c00244D84219a69334A223L460L69562j28588
12210B45657P7056c8928C90606j78960G7616B9927K99614J36548A50702A5474
12199H4830C7956L4028L8564b7045C45580b9654r1261D6928i2469J8343j2734
12188h6860A78230b19315a7593D19450a22623F3827J21809a19275C40515J01280
$$ plain form
12178 441795 240882 100406 242599 -65738 512395 -197378 197583 46868 -28290 -68556
12168 -68556 -258945 277943 230898 40877 24634 108096 334265 31299 -136616 -39716 130114
12156 25039 115450 70454 36186 -6192 117984 304512 6495 574182 164484 -154834 196466
12144 228230 398842 169234 279713 -56493 88472 402707 125617 175007 148124 171986
12134 171986 139990 29081 -27540 -105120 185044 -72733 -222297 78292 499506 139227 278121
12123 278121 118719 76532 362116 178459 62942 67323 442501 155063 54286 306143
12113 306143 189462 121050 -67588 31440 92140 -28220 -83098 20381 10796 -154967 -135155
12102 -135155 28169 111588 97682 -347678 435054 77231 -167253 249578 203789 156350 -31179
$$ packed form
12178D41795k00913A00406J42193f5738E12395a97378A97583D6868b8290m0266
12168f8556j90389B77943m7045D0877j6243Q3462K26169C1299a36616c9716A30114
12156B5039R0411m4996l4268f192A17984J86528F495N67687A64484a54834A96466
12144B28230J70612A69234J10479e6493H8472L14235A25617M9390k6883K3862
12134A71986l1996B9081b7540p7580A85044g2733j49564G8292M21214A39227J38894
12123B78121A18719m2187K85584A78459F2942M381L75178A55063E4286K51857
12113C06143j16681o8412f7588C1440O0700b8220n4878B0381r585a54967J9812
12102a35155B8169Q3419j3906c47678D35054G7231a67253B49578m5789m7439c1179
$$ plain form
12090 -93791 126344 195229 133582 -42779 -80813 404409 219662 378932 -113505 17803 23694
12079 23694 145198 30771 -261183 242416 27333 -357402 -168025 25765 14300 -24751 183929
12067 -103420 -280470 -69566 45081 -103005 -275661 224054 253624 266007 226408 -136563
12056 -24516 35909 -31066 281070 261849 307486 -372812 257222 -189132 435261 -20690 203716
12044 254927 167711 -150001 216476 -121350 -157281 -21047 23053 -183385 166168 -112033
12033 44915 155407 475759 189512 24665 353567 79104 38651 -227934 -43237 80449 101461
12022 101461 -152411 145301 -189090 207812 47695 114163 -41471 58269 -39071 242396
12011 -183180 -14920 -178709 162301 -120244 -12992 -20084 53641 -18979 9938 216590 -147241
$$ packed form
12090i3791A26344O8885o1647d2779l8034D04409j84747J59270a13505A7803N891
12079B3694J21504C0771b61183B42416B7333c57402a68025B5765j1465b4751A83929
12067a03420j77050f9566D5081a03005j72656B24054K9570J2383l9599a36563
12056b4516C5909c1066B81070j9221M5637c72812B57222a89132D35261b0690B03716
12044B54927q7216a50001B16476a21350l5931b1047B3053a83385A66168a12033
12033D4915J10492L20352A89512B4665L28902G9104C8651b27934d3237H0449K1012
12022A01461a52411A45301a89090B07812D7695O6468d1471E8269c9071B42396
12011a83180a4920j63789A62301a20244a2992p092E3641a8979I938K06652a47241
$$ plain form
11999 260326 141578 -76705 -76365 322350 -132756 -194424 -123925 333684 58187 191571 -69496
11987 43901 -265213 290240 -265531 112664 -296244 -176123 88927 -42311 -184889 64932
11976 -8648 123725 147151 -91016 -32823 -143993 249407 9996 84820 -133705 -194460 -196614
11965 -196614 -133808 -182808 -227767 129973 190631 58771 -53685 69019 -61827 -483294 1567
11953 84521 21598 337403 191489 -65309 -27963 13585 -78696 67597 -81585 -231919 -191375
11942 -191375 -29164 59523 61040 -25755 118050 -160501 83684 81423 983 -313500 578083
11930 -44696 98901 292754 138899 -150163 -157668 -33149 39647 439638 -100238 -43131 -9807
11918 -12788 42889 -200223 82024 -13908 -157175 79809 51972 113312 -62266 311162 -331642
$$ packed form
11999B60326j18748g6705L40C22350a32756o1668P0499C33684E8187J33384f9496
11987D3901b65213B90240b65531A12664b96244J20121H8927d2311j42578F4932
11976h648A23725K3426i1016c2823j11170B49407I996P4824a33705o0755k154
11965a96614O2806m9000m4959A29973O0658E8771e3685F9019f1827m21467A567
11953H4521B1598L15805j45914f5309b7963A3585g8696F7597h1585j50334M0544
11942a91375b9164E9523J517b5755A18050a60501H3684k261I83c13500E78083
11930d4696I8901J93853A38899a50163p505c3149C9647L99991a00238d3131i807
11918a2788D2889b00223H2024a3908j43267G9809k7837O1340f2266C11162c31642
$$ plain form
11906 -115723 -318905 -40246 -310484 -93514 -187259 -369790 27104 83397 91420 -324697 -1184
11894 -26640 137503 203295 306750 241908 -29501 -126690 162598 -48128 95222 204585 22420
11882 -101966 305553 276280 54250 -50148 180407 -203154 -136126 250373 -1405 69725 -173710
11870 -124331 339585 -271559 -206602 -18792 -47539 -127257 -215969 -309006 9053 20576 52360
11859 52360 -270170 175915 72607 -146182 69800 48264 19737 192253 -239310 -83902 -63376
11848 -63376 -303571 -285573 223677 -117191 -79650 149319 28801 -75899 122921 231242
11838 231242 11615 -279661 -109221 142836 -81825 -303880 -136758 -61429 -53630 469619
11827 81417 -203602 -60868 3261 -37286 -20633 -25774 103217 214573 -77716 -218079 -322155
$$ packed form
11906a15723k03182d0246k70238i3514r3745j82531B7104N6293Q023c24697a184
11894b6640A37503O5792J03455o4842b9501r7189A62598d8128I5222J09363B2420
11882a01966C05553k9273E4250e0148A80407b03154O7028B50373a405F9725a73710
11870a24331C39585b71559O4957a8792k8747p9718q8712r3037I053J1523L1784
11859E2360b70170A75915G2607a46182F9800k1536A9737J72516b39310h3902K0526
11848f3376k40195J7998B23677a17191L7541A49319B8801g5899A22921J08321
11838B31242A1615b79661a09221A42836h1825k22055a36758f1429P799D69619
11827H1417b03602f0868C261c7286J6653n141A03217J11356g7716j40363j04076
$$ plain form
11816 -322155 -90968 -224347 -210544 -186864 113158 -87315 -271601 32319 -87736 -75685 -383958
11805 -383958 -20259 -139660 136305 144852 104882 37042 -83363 -72360 -232152 162735 -35686
11793 132753 20783 -73331 -289690 98053 -247428 -107728 -291930 253377 105255 164671
11783 164671 88582 33530 -3261 -124755 -146363 -56892 102216 12407 -349782 188975 -94144
11771 29399 -177650 -253456 -235391 100372 -261229 -183232 74170 9874 166601 91876 251074
11760 251074 293771 162127 141273 364769 177682 -129058 -231623 -331680 15818 -122097
11749 -197125 108015 83738 -128127 -348069 121752 130805 304485 -14514 135714 -377001
11738 99304 -11339 -249753 19413 220056 -210535 -22218 -18953 -35646 288509 -28119 -167665
$$ packed form
11816c22155i0968j33379J3803K3680A13158h7315j84286C2319h7736J2051l08273
11805c83958b0259j19401A36305Q547l9970C7042h3363J1003j59792A62735c5686
11793A32753B0783g3331k16359I8053b47428a07728j84202B53377A05255N9416
11783A64671p6089C3530c261j21494k1608e6892A02216A2407c49782A88975i4144
11771B9399a77650p5806J8065A00372b61229P7997G4170I874J56727p4725J59198
11760B51074M2697j31644k0854K23496A77682a29058j02565j00057A5818a22097
11749a97125A08015k4277a28127k19942A21752R053J73680a4514A35714c77001
11738I9304a1339k38414A9413K00643b10535b2218L265j6693B88509b8119j39546
$$ plain form
11727 -167665 -97854 -37468 -235947 -124158 -40818 406291 -270365 -18331 -124452 -62926
11717 -62926 -397600 -51859 -131650 -62488 174141 27279 -126761 -459616 -47181 -147470 551688
11705 -102716 -89448 122092 -63968 38315 -4294 162577 33358 123339 -140697 -57473 -89269
11694 -89269 122832 59328 68701 224881 333045 -15062 207411 -76555 -64859 -139794 -8035
11682 -118202 233039 55392 -172522 125578 41040 103656 -164704 -136400 -20229 -5587 63194
11670 -89655 -21861 11431 165438 220405 -57257 -107821 -142809 -322055 106091 73825 -67108
11658 -140254 39414 -124616 322927 -127921 -351098 -39908 -212781 -78978 -8577 120875
11647 120087 107690 150695 -220278 -12931 61031 -272477 -83627 203595 -3200 7437 222047
$$ packed form
11727a67665O9811c7468j98479J11789d0818D06291b70365a8331j06121O1526
11717f2926l34674e1859p9791f2488A74141B7279a26761l32855d7181j00289E51688
11705a02716J3268A22092f3968C8315d294A62577C3358Q9981a40697e7473l1796
11694h9269A22832E9328R373J56180J08164a5062B07411g6555J1696p4935h035
11682a18202B33039E5392a72522A25578D1040O2616a64704K8304b0229e587F3194
11670h9655b1861A1431J54007N4967e7257n0564l4988j79246A06091l2266f7108
11658a40254C9414a24616C22927a27921k23177c9908j72873g8978h577A20875
11647A20087j2397M3005b20278a2931F1031b72477h3627B03595c200G437K14610
$$ plain form
11636 222047 -447726 295278 160967 67261 -184557 74580 -48963 -22766 -183348 132543
11625 88456 -1530 45939 -235456 79012 -115346 184265 -251584 153167 124615 145514 -220646
11613 -92481 -208052 -104082 350884 188472 110961 -184066 -24486 156636 24993 -105356
11602 50999 -18629 -66021 256148 -303401 243072 -199239 160870 84810 -24972 50312 150187
11591 150187 -42874 -283623 239795 -36672 -208402 -198635 357409 56964 -270718 -64483 148221
11579 257192 -49925 113518 23037 -119345 -217435 -88406 55057 120483 370406 97972 -58750
11567 220985 105624 177557 57568 346906 21682 -107055 381737 -68372 -316204 -2809 67525
11555 -193064 266453 -193187 130156 162093 -270222 -65341 187174 145324 69035 345804
$$ packed form
11636B22047d47726B95278j34311F7261a84557G4580d8963b2766j60582A32543
11625H8456a530D5939b35456G9012a15346A84265b51584A53167k8552K0899b20646
11613i2481j15571J03970C50884j62412p7511a84066b4486A56636B4993a05356
11602E0999a8629m7392B56148c03401B43072a99239A60870p6060b4972E0312R9875
11591A50187d2874k40749B39795c6672j71730R767C57409E6964b70718f4483A48221
11579B57192d9925A13518B3037a19345r8090h8406E5057O5426K49923I7972e8750
11567B20985A05624P1933E7568K89338B1682a07055C81737f8372k47832b809F7525
11555a93064B66453a93187A30156L1937b70222f5341A87174m1850F9035K76769
$$ plain form
11545 345804 -31509 117536 311641 -121104 160656 -55459 -244091 -152057 84284 274618
11535 274618 18439 -145768 62564 95363 101838 84541 321399 172639 466136 -107588 -145
11523 110573 -36896 78037 105148 112516 279319 22849 184214 -101536 263846 185680 -49048
11511 18097 246435 -95355 294237 44332 238575 125110 -7099 -16837 14586 89581 -320191
11499 200348 -130787 330412 113020 -9628 450796 -160473 -84862 191849 264484 206989
11489 206989 -33789 51088 96073 187571 -14438 257317 55263 194240 430710 169190 64378
11477 139 3336 138934 446914 44077 189578 -3684 89136 38970 349253 171536 72496
11465 425568 -178780 -293805 92346 223257 77715 582 152310 237997 51118 84664 152542
$$ packed form
11545C45804c1509A17536J94105a21104A60656e5459j88632R2034H4284J90334
11535B74618A8439a45768F2564L2799O475j7297K36858j48760K93497a07588a45
11523A10573c6896G8037K7111P368J66803B2849J61365a01536B63846p8166d9048
11511A8097K28338i5355B94237D4332J94243j13465g099r738A4586P4995c20191
11499B00348a30787C30412A13020i628D50796a60473P5611A91849P2635n7495
11489B06989c3789E1088M4985R1498a4438B57317E5263J38977K36470A69190F4378
11477A39L197J35598L07980D4077J45501c684H9136C8970L10283A71536G2496
11465D25568a78780j15025I2346J30911G7715E82J51728Q5687E1118L3546O7878
$$ plain form
11454 152542 260943 201647 -406835 188655 277202 -42595 32006 -104986 386924 611901
11444 611901 1083 -48556 123939 133208 165505 223143 -314308 -106471 -157876 321901 293150
11433 293150 333871 32489 422722 79404 67804 7641 166491 65993 111033 55337 68012
11422 68012 -161294 147322 143868 91837 310565 -222928 335136 79701 -70241 54970 134583
11411 134583 42861 -93128 40302 14126 209848 -85159 56658 19842 -329158 -280229 213937
11399 81313 -152135 -31064 -179842 34418 50988 70923 206384 179008 -34293 129592 126592
11388 126592 -177646 134025 -20892 39642 165176 368655 350247 -290292 94576 31034
11377 76031 -88934 -44210 61671 -129260 -89047 -73793 109205 120072 -263135 26562 -129863
$$ packed form
11454A52542J08401n9296d06835A88655Q8547d2595C2006a04986C86924K24977
11444F11901A083d8556A23939R269L2297N7638c14308a06471n1405C21901k8751
11433B93150M0721C2489L90233G9404j1600G641J58850F5993M5040E5337J2675
11422F8012a61294A47322l454n2031K18728b22928C35136G9701g0241E4970P9613
11411A34583D2861i3128D0302A4126J95722h5159E6658A9842c29158M8929B13937
11399H1313a52135c1064j48778C4418J6570J9935J35461k7376c4293A29592l000
11388A26592a77646A34025b0892C9642J25534K03479j8408b90292I4576C1034
11377G6031h8934d4210F1671a29260M0213J5254A09205J0867b63135B6562a29863
$$ plain form
11365 -154683 -193619 -229661 156204 -234440 94299 -153509 208564 -166283 -99472 -31439
11354 77315 -52683 -51830 -137922 73692 289870 93827 123771 -129652 -41152 13572 -341882
11342 -1245 -12393 -222663 51319 70884 -260090 -54257 -94044 -96609 153489 33273 -52676
11330 -85961 -53900 -118860 138014 -168107 97808 -245905 925 -214532 77275 -227004 -73342
11318 -23079 -49020 58144 -219201 -3575 16158 -100325 89430 198857 74039 183758 -237926
11306 -14015 124452 -160710 -379175 -382172 244704 -5228 -163119 -157296 7793 70075 -322872
11294 -7164 -183727 127606 -96535 7119 13173 -284739 -45511 -110832 -28075 -122184 -381531
11283 -381531 184976 16120 260856 -238035 -11725 29312 232982 -79114 -520816 251795
$$ packed form
11365a54683l8936l6042A56204b34440I4299a53509B08564a66283O6811c1439
11354G7315e2683Q53q6092G3692K16178I3827K9944a29652d1152A3572c41882
11342a245j1148k10270E1319J9565b60090e4257l9787k565A53489C3273e2676
11330h5961L2061o4960A38014a68107I7808b45905I25b14532G7275b27004g3342
11318b3079k5941E8144b19201c575A6158a00325H9430J09427G4039J09719b37926
11306a4015A24452a60710k18465k997B44704e228j57891N823G793O2282c22872
11294g164j76563A27606i6535G119O054b84739d5511o5321b8075r4109k59347
11283c81531A84976A6120K44736b38035a1725B9312K03670g9114m41702B51795
$$ plain form
11272 169755 -120180 -100498 -2956 -159813 413648 23624 -1707 129806 66787 -206870 198542
11260 35021 115873 -54950 8371 -56011 -582654 61302 215636 -204839 -402434 -58705 65574
11248 -217513 3369 -3830 -237165 77066 -274688 -377224 -79493 -44639 -196556 70965 -295024
11236 -304669 -145918 215661 213588 -70402 -49067 81810 -105044 -150827 -189469 253250 -160339
11224 2813 -30633 -34069 -57501 -21693 -351474 110244 -82594 -85015 8333 25903 37514 -105036
11211 347371 330069 -402472 -135717 -194851 -139452 514503 -126852 -119632 -121899 -120768 -347459
11200 -347459 69497 218431 -149541 -138772 132671 45608 66956 -238213 -216303 37132 -35225
11188 -182745 -136529 -372968 119662 176711 -311767 1293 -217867 67620 -47394 -139301 -329238
$$ packed form
11272A69755a20180J9682b956j56857D13648B3624a707A29806o3019b06870A98542
11260C5021Q0852e4950H371e6011n26643F1302J54334b04839j97595e8705F5574
11248b17513C369c830k33335G7066b74688j02536g9493L4854j51917G0965b95024
11236c04669a45918B15661k073g0402K1335H1810a05044m5783l8642B53250a60339
11224B813c0633l436k3432b1693l29781A10244h2594k421H333J7570J1611a05036
11211C47371j7302d02472a35717n9134N5399E14503a26852P220k267J131k26691
11200c47459F9497J48934a49541J0769A32671D5608K1348b38213K1910C7132c5225
11188a82745M6216k36439A19662N7049c11767A293b17867F7620d7394r1907j89937
$$ plain form
11177 -329238 71999 182001 383906 -149558 241278 139530 -146978 -69497 31401 -184458
11166 222782 -492762 -238779 -20776 -175563 119506 -189115 -166731 132722 -361113 -16999
11155 22121 69753 -137125 288481 -122981 -147287 67487 174784 245039 21397 7615 206011
11144 206011 -206994 545 203867 153243 68144 115961 -63440 -182089 23589 57393 -148161
11132 -8784 -202816 -11951 21852 131970 36377 -229624 -254923 -202818 201399 -109095 -207612
11121 -207612 98109 -37449 -60662 214245 -98570 18583 42875 -304661 154366 -64544 61379
11109 59465 2934 151855 -368653 193171 -48683 61153 -29620 -171184 -191684 358153 -219313
11097 -171031 324624 104158 197935 417119 148331 154832 89102 209709 13016 42388 -289422
$$ packed form
11177c29238G1999J10002K01905a49558B41278j01748a46978f9497C1401a84458
11166B22782d92762b38779b0776j54787A19506a89115K2384A32722c61113a6999
11155B2121M7632a37125B88481a22981k4306F7487J07297P0255B1397G615J98396
11144B06011b06994E45K03322n0624F8144M7817f3440j18649B3589L3804a48161
11132h784j94032a1951B1852J10118C6377b29624k5299N2105B01399a09095r8517
11121b07612I8109c7449k3213B14245i8570A8583K4292c04661A54366f4544F1379
11109E9465B934J48921c68653A93171d8683F1153b9620j41564k0500C58153b19313
11097a71031C24624A04158R3777K19184A48331O501o5730J20607A3016K9372b89422
$$ plain form
11085 -76291 235132 240681 62616 273374 47931 22081 245247 202714 4466 136597 -18162
11073 -2599 250525 326544 161918 234362 218997 382583 382104 335810 146268 126834 -188692
11061 296488 146178 292738 562088 368284 295444 149527 442413 184816 433795 -38202
11050 195695 206030 300138 155304 177295 354954 453131 460274 307430 185667 425031 517946
11039 517946 626534 465236 594448 567208 678059 555172 479910 465455 566315 309529
11029 309529 446500 222375 567376 689705 603524 770651 217663 1088402 358131 420709
11019 420709 680142 821620 674178 607622 694216 379279 446067 591521 647733 639840 787128
11008 787128 639863 763249 867325 676991 354897 354109 738475 375583 368410 482174
$$ packed form
11085g6291B35132N549F2616K10758D7931B2081K23166m2533D466J32131a8162
11073b599B50525P6019A61918P2444j5365J63586m79m6294A46268j9434a88692
11061B96488A46178J46560K69350j93804p2840j45917K92886A84816K48979c8202
11050A95695J0335R4108j44834K1991J77659R8177P143j52844j21763K39364R2915
11039E17946J08588j61298J29212k7240J10851j22887p5262j4455J00860k56786
11029C09529J36971B22375L45001J22329q6181J67127B17663Q70739C58131O2578
11019D20709K59433J41478j47442o6556Q6594l14937O6788J45454N6212p893J47288
11008G87128j47265J23386J04076j90334l22094p88L84366l62892p173J13764
$$ plain form
10998 482174 425987 627181 302664 292072 480942 530997 503596 527090 582413 453042 248161
10987 248161 705880 267609 151208 416291 504179 376671 585330 224841 550864 436196
10977 436196 721189 675962 860022 725676 436882 516845 664313 655046 1003720 864251
10967 864251 671325 587786 812608 749164 830364 1078706 1252565 1269072 1487338 1597594
10957 1597594 1748696 1735744 1855769 2037916 2369225 2034758 1854320 2297141 1821813 1548932
10947 1548932 1648770 1390581 1187856 1395023 1525274 1297077 1553641 1820346 1398988 1581598
10937 1581598 1450494 1632720 1626099 1375951 1205471 1163586 1075436 648987 960999 443987
10926 567760 396637 181778 385942 -153392 194423 -15919 146998 242253 244017 406516
$$ packed form
10998D82174n6187K01194C02664j0592J88870N0055k7401K3494N5323j29371k04881
10987B48161M57719B67609j16401K65083Q7888j27508K08659B24841L26023j14668
10977D36196K84993m5227J84060j34346k88794P9963J47468r267L48674j39469
10967H64251j92926q3539K24822o3444Q1200K48342J73859J6507K18266J10256
10957A597594J51102j2952J20025J82147L31309l34467j80438M42821m75328k72881
10947A548932R9838k58189k02725K07167J30251k28197K56564K66705m21358J82610
10937A581598j31104J82226o621k50148j70480m1885q8150m26449L12012D43987
10926E67760j71123A81778K04164a53392A94423a5919A46998R5255J764J62499
$$ plain form
10916 406516 157216 47586 -14862 163456 -116595 28905 208980 167350 -41344 578094
10905 98248 -144389 175760 214197 -233404 72582 -17440 -55277 79539 66618 132866 -13053
10893 -398125 -75643 31834 -135098 70915 -90441 -94859 -145705 145428 -20169 -123927 44502
10881 -269582 24262 -233118 156382 46413 -151211 277969 -189556 155590 196458 -124431
10870 214675 143406 21235 32326 -134117 -77661 -386496 -355669 66790 -110520 158295 11820
10858 -96159 -66614 -199550 -12335 232730 102233 261753 -200045 76377 -132871 -137172 -24524
10846 390787 -272503 -139048 44684 -12999 -61223 -331732 -198860 -59558 222280 -127560
10835 64382 235914 -251861 -39710 -95315 -65605 -70390 -133040 28092 64613 41461 -63153
$$ packed form
10916D06516A57216D7586a4862A63456a16595B8905J80075m1630d1344E78094
10905I8248a44389A75760L8437b33404G2582a7440l7837G9539j2921O6248a3053
10893c98125g5643C1834a35098G0915i0441m418n0846A45428b0169j03758D4502
10881b69582B4262b33118A56382D6413a51211B77969a89556A55590M0868a24431
10870B14675p1269B1235J1091a34117N6456l08835L0827F6790a10520A58295A1820
10858i6159K9545j32936a2335B32730A02233J59520b00045G6377a32871m301b4524
10846C90787b72503J33455D4684a2999m8224k70509J32872e9558B22280a27560
10835F4382J71532b51861c9710n5605K9710m785o2650B8092L6521k3152f3153
$$ plain form
10823 258818 -7401 -16551 -100246 -304921 127519 -205531 -57506 2547 -90776 -177484 84657
10811 60987 -307104 -96927 -21362 -119262 -96924 50847 4547 -331451 -89109 -71832 93808
10799 -34220 152854 -40789 19527 -64310 -116677 -90853 144887 -196450 138671 -369988 100321
10787 -220306 -47524 -169172 -65075 28642 -280783 -17454 -30320 27649 15871 -44983 -84675
10776 -84675 -170163 -176032 1785 -79482 -136622 167933 -169795 215781 -183687 -456496 -138470
10764 -176877 -198003 89671 28128 50497 -145249 -181765 53804 60022 7759 -110698 66974
10752 47884 -118884 59145 79254 -151106 -3546 120235 68587 -192199 -154388 227292 173295
10741 173295 -113738 90971 -211290 -247694 -363060 9940 -177557 -90606 149231 -85266 -99188
$$ packed form
10823B58818g401r150q3695k04675A27519b05531e7506B547i0776q6708H4657
10811F0987c07104i6927b1362r7900K2338E0847D547c31451h9109J7277I3808
10799c4220A52854d0789A9527f4310n2367K5824A44887a96450A38671c69988A00321
10787b20306d7524j21648f5075B8642b80783a7454j2866B7649j1778d4983l9692
10776h4675q5488n869A785g9482n7140A67933a69795B15781a83687k72809a38470
10764a76877k1126H9671B8128K2369a45249l6516E3804O218G759a10698F6974
10752D7884a18884E9145K0109a51106c546A20235n1648a92199L7811B27292n3997
10741A73295a13738I0971b11290l6404j15366I940a77557Q6951A49231h5266j3922
$$ plain form
10730 -99188 -180570 5996 82082 -255149 81226 -83083 117893 77464 108741 -94774 -191918
10719 -191918 118956 -231510 -464214 -59906 216080 -355398 166312 91176 -390959 8448
10708 89632 -291859 -58309 -488825 47880 -109440 -242366 134133 72541 130188 -200957
10697 -205108 -104866 -51426 -92018 95890 54902 -42516 223965 -10947 7542 188702 -321001
10685 -205348 -205830 -240378 -132013 130120 60617 -244652 -299936 -122825 -216064 127086 -124262
10673 146432 87531 253578 -362446 -192341 102719 28904 -201912 -114080 3497 -117570
10662 -107219 41748 214290 -85304 351530 -203873 -458385 20522 214514 62872 121950
10652 121950 -406473 -89801 290104 374050 33943 1876 -312861 37645 149039 199671 -205829
$$ packed form
10730i9188q1382E996P6086b55149H1226h3083A17893m0429L1277i4774r7144
10719a91918A18956b31510k32704e9906B16080c55398A66312p5136c90959H448
10708H9632b91859e8309m30516D7880a09440j32926A34133o1592N7647b00957
10697b05108J00242e1426m0592I5890m0988d2516B23965a0947G542J81160c21001
10685b05348m82l4548J08365A30120F0617b44652n5284a22825r3239A27086a24262
10673A46432n8901J66047c62446J70105A02719B8904b01912Q7832C497a17570
10662a07219D1748J72542h5304C51530b03873k54512B0522J93992F2872N9078
10652A21950d06473h9801B90104Q3946C3943A876c12861C7645J11394N0632b05829
$$ plain form
10640 -112239 -183718 -344266 57523 -79153 -88779 -186645 98682 -466795 -131504 107007 95919
10629 95919 -449262 -203410 -67806 -128062 -10817 -432292 120412 -194974 205932 -243836
10618 115079 -57880 50498 -123938 137616 -126991 -124335 203166 -9323 -218274 -62863 248483
10606 -542898 -460230 -153131 -63133 -32515 -186617 -207471 35063 -290735 -62716 -123629 -324295
10595 -324295 -59411 -718 -184563 -51960 -112813 172491 160999 172280 -158355 77555 196519
10584 196519 64786 84832 -94729 -153836 -145017 284674 117027 195944 256378 -259799 -314511
10573 -314511 -43251 -172068 72401 331948 -337449 -12058 -76089 -126589 -55600 -121084 -245518
10562 -245518 -124441 19502 -178821 -99632 -5009 -56672 -220047 114742 -64859 148969 -165895
$$ packed form
10640a12239p1479j60548E7523g9153r626r7866I8682d66795a31504A07007j1088
10629I5919d49262b03410f7806o0256a0817m21475A20412a94974B05932b43836
10618A15079e7880E0498a23938A37616a26991K656B03166i323k08951f2863B48483
10606e42898Q2668a53131f3133L0618j54102k0854C5063b90735f2716o0913k00666
10595c24295e9411g18j83845e1960o0853A72491j1492J1281a58355G7555J18964
10584A96519F4786K0046i4729n9107Q819B84674A17027P8917O0434b59799n4712
10573c14511d3251j28817G2401K59547c37449a2058o4031n0500e5600o5484j24434
10562b45518J21077A9502a78821P9189e009n1663j63375A14742f4859A48969a65895
$$ plain form
10550 -254488 220004 138639 58872 117492 -1257 -75588 -150641 124938 299890 -106415 -173620
10539 -173620 -67707 -234930 -47735 -302386 -166164 -18831 286975 7381 -52424 238532 -276778
10527 86046 -35122 94831 175108 -474792 84832 -25013 174835 -271177 -139852 1258 -246674
10515 113421 -386837 -205956 -85980 244226 -10689 115158 -52509 -107963 -302019 -120480
10504 -69801 97283 -184065 -53841 -46725 56818 128459 -173647 295795 62844 -112761 166578
10492 -42808 -49924 -243276 191644 -203558 -247459 -132875 -101916 -36614 -137470 63638 200192
10481 200192 -161487 133954 291088 -109294 -333768 211327 -214032 -271364 -249887 176331
10470 123522 155735 292498 -90630 78434 175473 122496 162281 172973 187217 195196 408538
$$ packed form
10550b54488B20004q1365E8872N8620a257p4331p5053A24938J74952a06415o7205
10539a73620f7707j67223d7735k54651J36222a8831B86975G381e2424B38532b76778
10527H6046c5122I4831Q0277d74792H4832b5013A74835b71177J31325A258b46674
10515A13421c86837J80881h5980B44226a0689A15158e2509n5454j94056a20480
10504f9801I7283a84065e3841P116E6818P1641a73647B95795F2844a12761A66578
10492d2808p116j93352A91644b03558m3901J14584L0959c6614j00856F3638J36554
10481B00192a61487A33954J57134a09294k24474B11327b14032n7332K1477A76331
10470A23522L2213J36763i0630G8434R7039n2977L9785J0692J4244P979K13342
$$ plain form
10459 408538 481827 184326 152134 109702 30102 57942 -142208 71404 -5968 247355 56519
10447 55323 191267 202154 86819 187534 2960 100443 -65461 274114 80208 -80155 111735
10435 -97813 -46854 -73676 69304 81526 -203872 -91020 -98730 -279146 24846 -25250 29613
10423 -24548 -27922 -50735 38422 43523 9748 -3585 -278676 -61220 -98011 57104 23681 -138672
10410 -4034 -23077 49080 -172176 35281 -47737 39272 -281127 -147509 263898 -127232 -162903
10399 -162903 -148286 -154438 -1578 -4148 -136533 149175 -19520 -213352 100633 169361 -18955
10387 34855 -336490 -29828 96326 8809 -285699 114867 -136092 -49412 182943 -112117 34424
10375 -264505 32711 -181683 104909 243192 90455 257731 188260 213694 142451 -32595 73193
$$ packed form
10459D08538P3289A84326l2192m2432C0102K7840a42208G1404e968B47355E6519
10447E5323J35944J0887H6819J00715B960R7483f5461B74114H0208h0155A11735
10435i7813d6854k6822F9304J2222b03872i1020p710j80416B4846b5250B9613
10423b4548l374k2813C8422N101I748c585k75091f1220l6791E7104B3681a38672
10410d034j9043D9080a72176C5281d7737C9272b81127J33618B63898a27232l5671
10399a62903J4617o152a578k570j32385A49175a9520j93832A00633O8728a8955
10387C4855c36490b9828I6326H809b85699A14867a36092d9412A82943a12117C4424
10375b64505C2711a81683A04909J38283I0455J67276o9471K5434p1243c2595G3193
$$ plain form
10363 -24027 97955 -97620 186421 194281 291625 180676 364767 434191 60143 83697 119833
10352 119833 232570 240931 406853 235370 173604 314245 173567 443526 112909 249378
10342 249378 180815 100055 65675 -5558 130298 222760 342361 -282318 226575 407990 435455
10331 435455 455294 227535 221330 517687 199231 284963 503553 291643 220870 197999 176689
10320 176689 178352 487627 74630 150106 203405 -45736 224443 209336 70566 -177278 102994
10308 108121 -88642 -168027 358282 143974 14690 16905 199867 62205 100270 311025 -108914
10296 60980 319268 167879 -43911 8802 -189021 325233 -68055 -32811 -16161 -159969 -162722
10285 -162722 227058 -109031 -83796 -147636 300131 -55965 122463 -201655 -133663 126615
$$ packed form
10363b4027I7955i7620A86421P860R7344j10949J84091O9424F0143K3554L6136
10352A19833J12737Q361J65922j71483o1766J40641j40678K69959A12909J36469
10342B49378o8563q0760l4380e558A30298R2462J19601b82318B26575J81415K7465
10331D35455J9839B27535o205K96357A99231Q5732K18590k11910p0773k2871k1310
10320A76689J663L09275G4630P5476N3299d5736B24443j5107G0566a77278A02994
10308A08121h8642p9385C58282A43974A4690K215J82962F2205L8065K10755a08914
10296F0980K58288j51389d3911H802a89021C25233f8055c2811a6161j43808k753
10285a62722B27058a09031K5235o3840C00131e5965A22463b01655O7992A26615
$$ plain form
10274 -556 64399 65368 -16710 78448 -218406 -287184 144412 126743 -140500 -57769 -260152 -60499
10261 -133299 -155792 19154 -312908 85444 -104471 148906 216548 85774 30973 173483 -15609
10249 194434 110318 -109186 28034 -396254 -11329 -26416 -167469 -363241 201455 104800
10239 104800 -169888 -268735 -6339 161462 274556 196086 85246 -15009 246015 -22474 -300134
10228 -300134 307052 95103 103284 -239656 -86628 -80228 117588 -234652 -37199 46494 -396015
10216 -38478 102574 70432 -307944 -272427 -194890 -107526 -347512 -467793 113421 165066 -310632
10204 -133693 145484 -188504 -5333 -228859 -311371 91300 -62991 -479679 -24182 102656 -108392
10192 -94865 188643 -235079 -298364 42607 14678 -275143 190426 -249596 -97530 -194216 -300843
$$ packed form
10274e56F4399R69a6710G8448b18406o8778A44412j7669a40500e7769k02383f0499
10261a33299k2493A9154c12908H5444a04471A48906O7642H5774C0973J42510a5609
10249A94434q4116a09186B8034c96254a1329j5087j41053j95772B01455r6655
10239A04800a69888r8847f339A61462J13094p8470H5246a5009B46015b2474k77660
10228c00134C07052I5103Q181b39656h6628O400A17588b34652c7199D6494c96015
10216c8478A02574l2142c07944L5517P7537Q7364k39986j20281A13421N1645c10632
10204a33693A45484a88504e333k23526q2512I1300f2991m16688b4182A02656a08392
10192i4865A88643b35079o3285D2607A4678b75143A90426b49596i7530r6686j06627
$$ plain form
10181 -300843 99764 44522 73717 -143808 -170290 -316284 -314849 -80942 -415806 -68868 268788
10169 -75478 -52990 -60346 83607 22589 198371 -142995 -9907 -101889 -126579 -198528 -59930 287141
10156 -287702 -61427 13995 77831 275933 -83371 247848 -256906 111659 129631 -234079
10145 -321138 62283 217601 -95123 -181908 164147 12235 -361305 -96219 125341 -252051
10134 -82245 97031 -1324 -12905 -238302 -158650 876 155982 -176184 -107768 138687 -129200
10122 -241068 -374589 31955 78217 -240501 -91116 -26551 -116408 35904 -369068 -136170 -185350
10111 -185350 -77834 -2126 19271 315642 -98649 -305760 27433 387765 -103807 -33295 218077
10099 346303 -43215 124739 -324330 -106559 -18290 110115 10375 -228029 -190042 -6349 253787
$$ packed form
10181c00843I9764D4522K9195a43808k6482j45994J435h0942l34864f8868B68788
10169g5478K2488p356H3607B2589J75782a42995i907r1982k4690p1949e9930B87141
10156b87702f1427A3995O3836J98102h3371B47848b56906A11659J7972b34079
10145c21138F2283J55318i5123q6785A64147A2235c61305i6219A25341b52051
10134h2245I7031a324j1581k25397P9652H76J55106a76184O8416A38687a29200
10122b41068j33521C1955M6262b40501i1116b6551q9857C5904c69068a36170m9180
10111a85350g7834b126A9271K96371i8649k07111B7433L60332a03807c3295B18077
10099C46303d3215A24739c24330a06559a8290A10115A0375b28029L7987f349B53787
$$ plain form
10087 -61678 -35164 -185707 259016 -108854 -262957 -163640 -375332 -116800 -246872 -364504
10077 -364504 149192 -266021 -360235 70757 -98661 92600 -394621 -186322 -14730 -411477
10067 -411477 -189790 3118 63497 53691 -191280 -29741 66092 -322947 -181905 -112907 34175
10055 -170871 -33639 -280191 175101 -230874 -192250 227875 -206269 -144003 -161380 -348001
10045 -348001 2884 -20521 143380 272479 -178931 344958 -45239 332375 -135560 -262520
10035 -262520 79263 -173397 -149211 113571 -72721 56753 72096 103053 -147308 -32030 -34894
10024 -34894 -58826 99201 -129222 17696 292740 -199529 -282127 42046 22430 -11934 -276079
10013 -276079 -574220 -38329 -108767 -317475 46679 -121479 -274606 122385 -368162 -402849
$$ packed form
10087f1678K6514j50543B59016a08854j54103R9317k11692a16800j30072j17632
10077c64504A49192b66021r4214G0757i8661I2600c94621a86322a4730l96747
10067d11477a89790C118O0379r806a91280b9741F6092c22947J41042O8998C4175
10055a70871c3639k46552A75101b30874L8624B27875b06269O2266j7377j86621
10045c48001B884b0521A43380J29099a78931C44958d5239C32375a35560j26960
10035b62520G9263a73397K4186A13571g2721E6753J5343L0957a47308c2030k864
10024c4894k3932I9201a29222A7696K75044a99529q2598D2046j9616a1934k64145
10013b76079k98141c8329p0438k08708D6679a21479j53127A22385c68162l4687
$$ plain form
10003 -402849 -14556 317584 -22134 -18291 -33725 -230733 -16159 -122049 -170168 -157783 -383248
9992 -383248 45110 -59966 -296683 -208089 -156601 20375 -27717 -56829 244687 -277219 -111157
9980 12845 209185 243417 -126046 -113066 89242 85172 142037 -44042 -135510 -240360 80454
9968 -104474 170436 -209817 -20921 -273163 -165164 41484 37366 -226177 -12292 203974 -77450
9956 -308429 -131845 59369 44960 207167 -150835 -15476 -171978 113905 -30290 -123341 56291
9944 -259917 -226006 246949 -366021 -28115 -290917 39725 -27668 -252290 134527 78568 -463453
9932 -211521 -117264 52934 -439444 32823 -256298 124018 -14590 178576 -140875 108191
9921 -53068 -62935 -90412 -46639 -231997 -28230 148534 -155176 181882 46803 44375 -326393
$$ packed form
10003d02849a4556C17584b2134L843j5434j97008a6159j05890m8119J2385k25465
9992c83248D5110e9966k36717Q8594N1488B0375b7717k9112B44687b77219a11157
9980A2845J96340L4232a26046J2980H9242m070N6865d4042r1468j04850H0454
9968a04474A70436b09817b0921k52242J07999D1484m118b26177a2292B03974g7450
9956c08429a31845E9369j4409J62207a50835a5476j56502A13905c0290r3051E6291
9944b59917L3911B46949c66021b8115k62802C9725b7668k24622A34527n5959d63453
9932b11521R4257E2934d39444C2823b56298A24018a4590A78576a40875A08191
9921e3068r867k7477M3773j85358b8230A48534a55176A81882D6803k428c26393
$$ plain form
9909 -112369 86646 -395203 67115 -148732 -186893 145033 -287775 -241265 72963 -633038 32694
9897 -118150 -7493 34280 -109708 -216400 -7891 -98418 -129099 3885 10250 79375 325910 -122440
9884 -45338 17268 -41358 -71722 -237430 -122627 156861 306395 -44463 -605618 80164 -188209
9872 81035 -17052 56561 -44059 -264543 -256216 -398346 -7153 -487684 -70486 -222540 -418142
9861 -418142 -138065 -58867 -368594 -174618 62852 -96117 214857 -175295 -264544 -169710 18042
9849 -54956 137732 156052 -84606 -86420 32649 -236455 -49522 239602 17350 70547 114233
9838 114233 -178077 52457 80608 -301054 79088 -255834 -431085 -37478 41454 -61289 -259911
9827 -259911 -413102 -219217 -21224 -368096 -166292 -326428 -181620 -202972 -171985 -274226
$$ packed form
9909a12369H6646c95203F7115a48732l8161A45033b87775M6510G2963f33038C2694
9897a18150g493C4280a09708j06692g891r0527l0681C885O365O9125K46535a22440
9884d5338A7268d1358l0364j65708J14803A56861J49534d4463n61155H0164a88209
9872H1035a7052E6561d4059k20484Q327j42130g153m80531g0486j52054j95602
9861d18142a38065e8867l09727a74618F2852i6117B14857a75295q9249R4834A8042
9849e4956A37732J8320h4606j814C2649b36455d9522B39602A7350N3197M3686
9838A14233a78077E2457K8151c01054G9088b55834j75251c7478D1454f1289j98622
9827b59911j53191J93885b1224l46872a66292j60136J44808k1352L0987j02241
$$ plain form
9817 -274226 31321 -74372 71661 66426 -35952 -300989 105090 86546 -168250 -338649 235331
9805 -43294 -112043 -359247 90824 -146724 -172687 -193732 48418 -158986 89158 4184 43488
9794 43488 354568 -170975 390451 10620 -211840 -202377 -327301 5185 -430079 -53712 65141
9782 -194952 79909 7820 -19703 -192355 -230731 60735 -91893 -201433 -89236 149751 157176
9771 157176 -159596 204108 -32217 229035 -213634 -287144 -116381 32444 -174197 -151675
9761 -151675 -56400 124963 -186871 37427 164872 -56269 -115293 -2146 -341982 107187 -105472
9749 -158121 -151181 -85674 -152763 -253429 -221719 250744 -70135 -162749 -14986 -88212 8294 -206556
9736 -241294 -83930 -182586 -273378 95252 74925 -70086 -145790 -46326 -141286 -312541 45176
$$ packed form
9817b74226C1321g4372G1661n235c5952k65037A05090j8544a68250j70399B35331
9805d3294o8749k47204I0824a46724k5963k1045D8418a58986H9158D184L9304
9794D3488L11080a70975C90451A0620b11840R463j24924E185d30079e3712F5141
9782a94952G9909G820a9703j72652l8376F0735i1893j09540h9236A49751P425
9771A57176a59596B04108c2217B29035b13634p3510a16381C2444a74197K2522
9761a51675e6400A24963a86871C7427J27445e6269n9024b146l39836A07187a05472
9749a58121O940O5507o7089j00666L1710B50744g0135r2614a4986p3226H294b06556
9736b41294h3930r8656r0792I5252k0327g0086p5704d6326r4960j71255D5176
$$ plain form
9724 146602 -291167 303574 -9652 128005 189356 -93263 61014 -26136 -139402 -233776 40247
9712 -62314 -96656 -87290 115164 58991 -5172 20768 223204 41767 -121527 247865 63222
9700 -10410 107460 -4177 -363154 180374 -262680 80231 24337 182313 -3490 -49374 -246362
9689 -246362 -107978 447279 -209313 150009 -228917 -134899 -79190 333613 -24152 -101657
9679 -101657 -57354 -250774 -229625 248693 190733 -277305 -230096 -172634 160247 112217 604
9667 -197580 91633 92982 37623 -309894 -418799 13128 77242 303533 -136352 313534 -249384
9655 -80392 353039 108806 -418485 -81935 -173234 -41341 -348348 -59018 45062 202492 -196281
9643 54254 54531 -226928 122860 295394 206309 -102246 -123508 -20002 -487032 -27586 -97213
$$ packed form
9724A46602b91167C03574i652A28005O1351i3263F1014b6136j13266r4374D0247
9712f2314l4342R366A15164n6173e172B0768K02436D1767a21527B47865F3222
9700a0410A07460d177l58977A80374b62680H0231B4337J57976c490m5884j96988
9689b46362a07978D47279b09313A50009b28917R4018N5709C33613b4152p7505
9679a01657M4303j93420K1149B48693n7960b77305M7209N7462A60247m8030F04
9667a97580I1633J349C7623c09894j08905A3128O4114K26291a36352C13534b49384
9655h0392C53039A08806d18485h1935r1299d1341l07007e9018D5062J57430a96281
9643E4254K77b26928A22860J72534q9085a02246k1262b0002m67030b7586o9627
$$ plain form
9632 -97213 -556140 -167518 -91156 -250589 -78197 146439 -232433 -259863 1502 17765 -194782
9620 -27802 14204 -39475 -35135 23896 -155393 -86008 -176791 330545 62100 301216 179997
9609 179997 -94320 41907 -66222 31530 41872 -233155 -381595 71922 57642 192210 -97426
9597 -271783 -51965 140356 -148511 -68207 -117314 -60645 -189624 67158 -317924 -489589 -15006
9585 -6316 280361 146160 38666 -141408 -98677 -232002 -161487 -16199 -280 67083 -5517 -106387
9573 -106387 178243 75812 301603 -143295 -97738 76290 5900 -91024 346396 -168081 -173713
9562 -173713 -204592 81201 77275 -179908 -34075 -105920 125625 -249768 -331500 144074 3622
9550 91129 -12912 -304214 -195239 132048 -187318 147839 69781 -45779 -63710 -250232 133696
$$ packed form
9632i7213m58927a67518P6362j59433g8197A46439b32433k7430A502J6263a94782
9620b7802A4204c9475M340B3896a55393O9385r0783C30545F2100K39116j21219
9609A79997i4320D1907f6222C1530J0342b33155j48440G1922j4280J34568i7426
9597b71783e1965A40356a48511f8207m9107N6669j28979F7158c17924j71665a5006
9585f316B80361j34201C8666a41408M2731j33325P0515a6199b80F7083e517j00870
9573a06387A78243G5812K25791a43295M5557G6290E900i1024C46396a68081n632
9562a73713l0879H1201l926a79908c4075p1845A25625b49768q1732A44074C622
9550I1129a2912k91302J08975A32048a87318A47839F9781d5779j7931j86522A33696
$$ plain form
9538 -399055 -7719 425 135171 -110718 186453 -245292 -221761 -99949 76199 -322780 25420
9526 -171524 218667 360090 -92325 21237 60227 -155236 -376588 -218743 153836 -122818
9515 177521 -160395 180759 -121126 170146 32488 -139705 -226474 -45136 120483 30602
9504 -11398 188872 -217942 -221472 -56604 94509 -51413 -287399 -37744 -299970 208900 31658
9492 19106 -281843 -254293 -13051 67324 -138084 -88188 -170756 -262635 82705 -98563 -64971
9481 -64971 -71752 -171448 107333 -21307 55310 -170648 168424 -243198 -225253 56029 -89720
9469 -26565 -146309 -76170 314484 -239671 -427249 -33766 -5327 -151115 121412 322204 -46583
9457 -256562 -147201 -7042 99030 -46067 -265273 -66570 -65555 201220 126726 99872 125033
$$ packed form
9538c99055g719D25J34746a10718A86453b45292K3531i9949G6199c22780B5420
9526a71524B18667J41423i2325B1237L8990a55236k21352J57845A53836a22818
9515A77521a60395A80759a21126A70146C2488a39705q6769d5136A20483C0602
9504a1398A88872b17942l530e6604I4509e1413k35986c7744k62226B08900C1658
9492A9106b81843K7550a3051F7324a38084M9896q2568r1879H2705i8563L3592
9481f4971o781r9696A07333b1307E5310a70648A68424b43198J7945E6029h9720
9469b6565j19744P0139C14484b39671j87578c3766e327j45788A21412K00792d6583
9457b56562J09361g042I9030d6067k19206f6570J015B01220p4494k6854K5161
$$ plain form
9446 125033 -26223 -384658 105113 -342433 190885 -217090 -167280 112655 -47759 -188565
9436 -188565 -105276 -133389 -95031 -352955 154384 -116918 -210952 -396116 -173600 -123285 -42839
9424 -221403 118810 -385771 3193 -42639 -79543 177129 -437697 155407 -21194 -16060 -136335
9413 -136335 -126270 -7468 -84165 8371 -128154 24531 107666 -240953 242094 169356 -4908 88951
9400 -149836 -303510 37545 -99381 106709 111684 60594 19788 17171 -444858 -178495 171926
9388 -48756 -55346 -240360 -49318 67191 -304295 -235870 249045 -124252 -277821 -78126 37199
9376 -17039 242735 -113371 59325 -91003 -31304 -173508 -201796 -21605 -110892 283288 86911
9364 158086 77512 274396 204644 173280 -302539 -235550 -17955 -108595 -160563 57738 91015
$$ packed form
9446A25033b6223l58435A05113c42433A90885b17090M9810A12655d7759j40806
9436a88565Q3289k8113L8358k57924A54384a16918r4034j85164a73600N0315d2839
9424b21403A18810c85771C193d2639l6904A77129d37697A55407b1194N134j20275
9413a36335J0065g468p6697H371a28154B4531Q3135b40953B42094p2738d908H8951
9400a49836j53674C7545i9381A06709M975n1090A9788k617d44858a78495A71926
9388d8756o590j85014d9318F7191c04295O8425B49045a24252j53569g8126C7199
9376a7039B42735a13371E9325i1003c1304j42204k8288b1605q9287B83288H6911
9364A58086G7512J96884o9752l1364c02539O6989a7955r0640n1968E7738L3277
$$ plain form
9353 91015 -651417 124096 164618 -170889 -25775 -406935 -128181 -47243 200293 96594 -131565
9341 -28576 -276684 -10281 -138344 -200516 -181013 77041 -252973 4974 -251939 -106688 -172204
9330 -172204 -2403 -122904 -116420 -182998 139249 -83377 31839 -181043 289155 157517 73546
9318 -538 -412212 -179844 -229028 154417 10970 -85955 -140554 -155577 172535 -111674 34233
9306 -142991 -305878 -45806 -66473 -91567 -440683 281560 146715 -177036 64220 102625 -211965
9294 -295623 -131494 -488907 -78018 -135219 -200347 -7388 4351 -112933 4138 124710 160653
9283 160653 -186136 -114284 -155231 -257862 -254530 64923 112588 -151366 -8189 -247666 105344
9271 242942 -93368 27287 135735 -119541 -305234 -278793 -70660 -220103 427349 -136365
$$ packed form
9353I1015f51417A24096M0522a70889b5775l81160a28181d7243B00293I6594a31565
9341b8576k48108a0281j28063o2172J9503G7041b52973D974b51939a06688o5516
9330a72204b403j20501O484o6578A39249h3377C1839a81043B89155j31638G3546
9318e38m11674a79844m9184A54417A0970h5955n4599j5023A72535a11674C4233
9306a42991j62887d5806k0667k5094l49116B81560j34845a77036F4220L8405b11965
9294b95623a31494l57413g8018n7201o5128g388D351a12933D138J20572L5943
9283A60653a86136P1852m0947j02631L332F4923M7665a51366h189k39477A05344
9271B42942i3368B7287J08448a19541j85693K6441g0660j49443D27349a36365
$$ plain form
9260 -544782 -406117 54474 -105480 -116892 219409 -55594 -281942 4559 -58081 -167659 65528
9248 132238 46563 -169227 -133701 -207729 224120 173992 -297949 -80942 -166125 130644 -123417
9236 42030 -122355 117189 96415 -182925 -257517 147457 -135836 51307 62085 14008 -26251
9224 -231203 -43359 -44420 29898 -120124 62159 -327896 -12123 27565 254749 -148874 52785
9212 -168279 38604 41380 59683 -83859 145797 301634 -7834 -83310 99807 -241883 158662
9200 -133278 -149517 -123048 -142470 21637 -307513 -220453 -196608 8687 -118455 58277 -42946
9188 -142680 -131719 -507366 -466253 30020 -57389 -203185 -367783 -109495 -168008 -228193 -335468
9177 -335468 -135340 33287 -214892 -186059 183736 56053 -264174 -136123 299924 -328920
$$ packed form
9260e44782J38665E4474a05480j1412B19409e5594k26348D559e8081j09578F5528
9248A32238D6563a69227L5526p4028B24120n0128b97949h0942q5183A30644a23417
9236D2030a22355A17189k0774a82925p4592A47457a35836E1307J0778A4008b6251
9224b31203d3359j061B9898a20124F2159c27896a2123B7565K27184a48874E2785
9212a68279C8604K776J8303h3859A45797J55837g834p5476I9807b41883A58662
9200a33278j6239K6469j9422B1637c07513Q7060K3845H687a18455E8277d2946
9188a42680J0961l75647M1113C0020e7389j45796j64598a09495n8513o0185j07275
9177c35468a35340C3287b14892K8833A83736E6053b64174J28051B99924c28920
$$ plain form
9166 -39937 -139912 -35638 -52926 -148685 -340321 -571188 150320 -55600 106805 -4435 218100
9154 179250 -399317 -81924 -8996 -6464 -119263 -157220 -201170 139352 -256727 -291790 -96346
9142 -318089 183581 -13698 158620 -7127 -149968 -69910 -153707 76943 -166503 -369564 257310
9130 -158067 -166091 -324325 71490 -46598 51639 -250886 -188816 82510 47206 -132954 -23420
9118 124703 -545520 -233342 -268253 -106353 79529 -183169 -85248 -33435 107910 34849 26910
9107 26910 -46937 43876 -154270 -43609 -424780 -207816 -225869 7984 47039 54409 -158242
9095 -68167 -169945 -184995 -168879 4571 188521 -195250 -522477 -164283 -206819 28538 87848
9084 87848 -361270 -301008 -26974 -33574 -186760 -126387 43581 153271 59733 192465 -120136
$$ packed form
9166c9937r9975c5638j7288r5759j91636k30867A50320e5600A06805d435B18100
9154A79250c99317h1924h996K532j12799l7957m3950A39352b56727l5063i6346
9142c18089A83581a3698A58620g127j42841f9910q3797G6943a66503k03061B57310
9130a58067q024j58234G1490d6598E1639b50886O2070H2510l5304a32954b3420
9118A24703e45520b33342l4911a06353G9529a83169h5248c3435A07910C4849p939
9107B6910d6937D3876a54270d3609l81171b07816j8053G984L9055P370a58242
9095f8167j01778j5050J6116D571J83950a95250l27227a64283m2536B8538N9310
9084H7848c61270O0262b6974o600j53186O0373D3581J09690E9733J32732a20136
$$ plain form
9072 255869 2219 -143570 184899 93572 271209 -451429 -94840 -27633 27356 99707 122011
9061 122011 -199028 -387599 75947 -106391 -24569 -30226 -204971 -111624 -56436 -145944 -15027
9049 79853 -118158 -151965 20355 -32177 -345241 199684 5352 1397 -124116 -16161 -153633
9038 -153633 -99970 179173 -72091 129444 118284 -242827 166418 -198898 -335844 -72717
9027 23204 60422 -126612 -19727 -28025 -208663 -8232 29008 -116588 255392 77078 150849
9016 150849 16617 254019 -166311 153244 -172988 81042 -174018 -247099 -52892 -199255
9006 -199255 -133360 -83706 -109721 -354493 -244405 -98338 -70616 -124902 -188637 -296275 -361092
8995 -361092 86514 -277121 18094 -227799 -63010 40412 172734 153544 149784 91675 171291
$$ packed form
9072B55869B219a43570A84899r1327J77637d51429i4840b7633B7356P2351K2304
9061A22011a99028j88571G5947a06391b4569n657j74745R3347N5188q9508a5027
9049G9853a18158l3807B0355c2177l13064A99684E352A397a24116a6161j37472
9038a53633N3663A79173g2091A29444j1160b42827A66418a98898j36946g2717
9027B3204L7218a26612a9727q298j80638h232B9008a16588B55392G7078P3771
9016A50849A6617K37402a66311A53244a72988H1042a74018p3081e2892j46363
9006a99255O5895M9654k6015k44772J10088i8338K7722n4286o3735j07638o4817
8995c61092H6514b77121A8094b27799f3010D0412J32322j9190l760n8109P9616
$$ plain form
8984 171291 -450615 -108681 -45968 -284172 -167608 -488197 129114 12903 110642 -278618
8973 -282464 202389 44269 2539 -106610 -200378 -129687 -47819 -146321 36111 -247650 61442
8961 12344 -144712 -649860 158360 -79430 -158101 -67990 318717 -5284 -411661 -35873 242324
8949 215965 -110908 5847 321416 258205 -45157 -137649 252172 -52182 -183450 157979 -321746
8937 -105357 -106799 -62354 -22775 -33681 59748 -16951 -73448 -162472 -149300 -20371 -292699 -40211
8924 -186165 191686 -260509 -168654 -171668 92743 58320 246642 262024 4942 -208713 172757
8912 160758 223717 97624 53560 446398 509727 773325 1286687 2181255 4407530 8007906
8902 8007906 4047059 2102669 1316095 332742 409995 134188 73098 209021 382023 355675
$$ packed form
8984A71291d50615a08681d5968k38204J16564l20589A29114A2903R7739b78618
8973b82464B02389D4269B539a06610r3768P0691d7819r8502C6111b47650F1442
8961A2344a44712n05148A58360g9430p8671f7990C18717e284m06377c5873B42324
8949B15965a10908E847L15569o3211d5157r2492B52172e2182j31268A57979c21746
8937a05357j442M4445b2775j0906E9748a6951n6497q9024J3172b0371k72328d0211
8924a86165A91686b60509R1855l014I2743l4423J88322J5382D942b08713A72757
8912A60758O2959I7624m4064L92838O3329K63598N13362Q94568K226275L600376
8902H007906l960847j944390p86574C32742P7253A34188o1090J35923J73002k6348
$$ plain form
8892 355675 -275649 339361 439591 12912 -214855 -39863 35937 -53707 209359 -78392 -50935
8881 -50935 -346253 -281851 -2182 93535 -247576 48657 35666 -122389 -197091 151635 -257036
8869 209467 125779 -147896 -17422 64574 -76880 -24620 20409 -25859 168828 191614 -250028
8857 168433 -64244 70632 -22218 -33918 -60130 -421208 -515186 -125211 -150543 165323 17260
8845 -262594 -65256 31844 37634 -81080 137033 111720 190595 -28081 -43701 264919 125925
$$ packed form
8892C55675b75649C39361J00230A2912b14855c9863C5937e3707B09359g8392K7457
8881e0935k95318O4402b182I3535b47576D8657j2991a22389p4702A51635b57036
8869B09467q3688a47896a7422F4574g6880b4620B0409b5859A68828K2786b50028
8857A68433f4244G0632b2218j1700k6212l61078r3978a25211k5332A65323A7260
8845b62594f5256C1844N790h1080A37033k5313P8875b8081j5620B64919A25925
$$ [...]
##END NTUPLES=NMR SPECTRUM
##END=
