
##TITLE=AC1110_Colombia_5835382_ZlHcrL0rVu
##JCAMPDX= 6.0         $$ Bruker NMR JCAMP-DX V2.0
##DATA TYPE= NMR SPECTRUM
##DATA CLASS= NTUPLES
##ORIGIN= BRUKER
##OWNER= Administrator
$$ 1.72 TOPSPIN		Version 2.1
$$ 2012-03-26 23:53:18.187 -0500  Administrator@TOPSPIN
$$ Compression mode = diff/dup
##.OBSERVE FREQUENCY= 400.13188235
##.OBSERVE NUCLEUS= ^1H
##.ACQUISITION MODE= SIMULTANEOUS (DQD)
##.ACQUISITION SCHEME= undefined
##.AVERAGES= 64
##.DIGITISER RES= 22
##SPECTROMETER/DATA SYSTEM= spect
##.PULSE SEQUENCE= noesygpps1d.comp
##.SOLVENT NAME= COFFEE_meoh
##.SHIFT REFERENCE= INTERNAL, COFFEE_meoh, 1, 14.96826
##AUDIT TRAIL= $$ (NUMBER, WHEN, WHO, WHERE, PROCESS, VERSION, WHAT)
$$ ##TITLE= Audit trail, TOPSPIN		Version 2.1
$$ ##JCAMPDX= 5.01
$$ ##ORIGIN= Bruker BioSpin GmbH
$$ ##OWNER= Administrator
$$ $$ C:\Bruker\TOPSPIN/data/COFFEE/nmr/AC1110_Colombia_5835382_ZlHcrL0rVu/12/pdata/1/auditp.txt
$$ ##AUDIT TRAIL=  $$ (NUMBER, WHEN, WHO, WHERE, PROCESS, VERSION, WHAT)
(   1,<2012-03-26 23:53:12.609 -0500>,<Administrator>,<TOPSPIN>,<go>,<TOPSPIN 2.1>,
      <created by zg
	started at 2012-03-26 23:41:41.046 -0500,
	POWCHK enabled, PULCHK disabled,
       configuration hash MD5:
       1A 1E CE 29 27 FD 77 03 67 4E F0 E3 C4 B2 CB 90
       data hash MD5: 64K
       19 19 70 CD BE 59 0D 38 8B 64 1C 1D 54 4E CC 96>)
(   2,<2012-03-26 23:53:15.437 -0500>,<Administrator>,<TOPSPIN>,<proc1d>,<TOPSPIN 2.1>,
      <Start of raw data processing
       efp LB = 0.3 FT_mod = 6 PKNL = 1 PHC0 = 0 PHC1 = 0 SI = 128K 
       data hash MD5: 128K
       C1 C5 52 78 B6 81 0B 96 E7 BE A4 2D E4 40 74 84>)
(   3,<2012-03-26 23:53:17.390 -0500>,<Administrator>,<TOPSPIN>,<proc1d>,<TOPSPIN 2.1>,
      <pk PHC0 = 33.34351 PHC1 = 0 
       data hash MD5: 128K
       C3 A1 A2 5B BB 33 55 95 FD 0F FD EB F3 5D C5 70>)
(   4,<2012-03-26 23:53:17.718 -0500>,<Administrator>,<TOPSPIN>,<proc1d>,<TOPSPIN 2.1>,
      <abs ABSG = 1 
       data hash MD5: 128K
       73 1A 5C 14 83 25 FB 2F 39 38 2F 2B 6A 36 30 0D>)
(   5,<2012-03-26 23:53:17.859 -0500>,<Administrator>,<TOPSPIN>,<proc1d>,<TOPSPIN 2.1>,
      <abs ABSG = 2 
       data hash MD5: 128K
       5E 53 9F AA AD E4 A5 7A ED 41 B4 85 92 83 47 60>)
(   6,<2012-03-26 23:53:17.921 -0500>,<Administrator>,<TOPSPIN>,<proc1d>,<TOPSPIN 2.1>,
      <abs ABSG = 3 
       data hash MD5: 128K
       83 8D 0C 90 29 10 36 D8 2E 8C 38 C4 36 43 BD 89>)
(   7,<2012-03-26 23:53:18.062 -0500>,<Administrator>,<TOPSPIN>,<proc1d>,<TOPSPIN 2.1>,
      <abs ABSG = 4 
       data hash MD5: 128K
       58 80 6C EF 10 BF ED FA 31 DE E0 5D 15 00 C1 66>)
(   8,<2012-03-26 23:53:18.109 -0500>,<Administrator>,<TOPSPIN>,<proc1d>,<TOPSPIN 2.1>,
      <abs ABSG = 5 
       data hash MD5: 128K
       CA 13 B1 5D 75 AB B2 35 4B 73 E3 49 9D 11 23 E8>)
$$ ##END=
$$ 
$$ $$ hash MD5
$$ $$ 20 CC 83 7A A7 86 FC 5A 0B BA 25 BD 4B 85 C4 64
##$RELAX= 
##$RELAX= 
##$RELAX= 
##$RELAX= 
##$RELAX= 
##$RELAX= 
##$RELAX= 
##$RELAX= 
$$ Bruker specific parameters
$$ [...]
##$TP07= 0
##$TPNAME0= <>
##$TPNAME1= <>
##$TPNAME2= <>
##$TPNAME3= <>
##$TPNAME4= <>
##$TPNAME5= <>
##$TPNAME6= <>
##$TPNAME7= <>
##$TPOAL= (0..7)
0.5 0.5 0.5 0.5 0.5 0.5 0.5 0.5
##$TPOFFS= (0..7)
0 0 0 0 0 0 0 0
##$TUNHIN= 0
##$TUNHOUT= 0
##$TUNXOUT= 0
##$USERA1= <user>
##$USERA2= <user>
##$USERA3= <user>
##$USERA4= <user>
##$USERA5= <user>
##$V9= 5
##$VALIST= <valist>
##$VCLIST= <CCCCCCCCCCCCCCC>
##$VD= 0
##$VDLIST= <DDDDDDDDDDDDDDD>
##$VPLIST= <PPPPPPPPPPPPPPP>
##$VTLIST= <TTTTTTTTTTTTTTT>
##$WBST= 1024
##$WBSW= 4
##$XGAIN= (0..3)
0 0 0 0
##$XL= 0
##$YL= 0
##$YMAX_a= 13415679
##$YMIN_a= -5841905
##$ZGOPTNS= <>
##$ZL1= 120
##$ZL2= 120
##$ZL3= 120
##$ZL4= 120
##$ABSF1= 14.96826
##$ABSF2= -5.58427
##$ABSG= 5
##$ABSL= 3
##$ALPHA= 0
##$AQORDER= 0
##$ASSFAC= 0
##$ASSFACI= 0
##$ASSFACX= 0
##$ASSWID= 0
##$AUNMP= <proc_prof1d_extract.lims>
##$AXLEFT= 0
##$AXNAME= <>
##$AXNUC= <1H>
##$AXRIGHT= 0
##$AXTYPE= 0
##$AXUNIT= <>
##$AZFE= 0.1
##$AZFW= 0.1
##$BCFW= 0
##$BC_mod= 0
##$BYTORDP= 0
##$COROFFS= 0
##$CY= 15
##$DATMOD= 1
##$DC= 0
##$DFILT= <>
##$DTYPP= 0
##$F1P= 0
##$F2P= 0
##$FCOR= 0.5
##$FTSIZE= 131072
##$FT_mod= 6
##$GAMMA= 0
##$GB= 0
##$INTBC= 1
##$INTSCL= 1
##$ISEN= 128
##$LB= 0.3
##$LEV0= 0
##$LPBIN= 0
##$MAXI= 10000
##$MC2= 0
##$MEAN= 0
##$ME_mod= 0
##$MI= 0
##$NCOEF= 0
##$NC_proc= -3
##$NLEV= 6
##$NOISF1= 0
##$NOISF2= 0
##$NSP= 0
##$NTH_PI= 0
##$NZP= 0
##$OFFSET= 14.96826
##$PC= 1
##$PHC0= 33.34351
##$PHC1= 0
##$PH_mod= 1
##$PKNL= yes
##$PPARMOD= 0
##$PPDIAG= 0
##$PPIPTYP= 0
##$PPMPNUM= 2147483647
##$PPRESOL= 1
##$PSCAL= 4
##$PSIGN= 0
##$PYNMP= <proc.py>
##$REVERSE= no
##$SF= 400.130004943973
##$SI= 131072
##$SIGF1= 0
##$SIGF2= 0
##$SINO= 400
##$SIOLD= 131072
##$SPECTYP= <>
##$SREGLST= <1H.CDCl3>
##$SSB= 0
##$STSI= 131072
##$STSR= 0
##$SW_p= 8223.68421052632
##$SYMM= 0
##$S_DEV= 0
##$TDeff= 65536
##$TDoff= 0
##$TI= <>
##$TILT= no
##$TM1= 0
##$TM2= 0
##$TOPLEV= 0
##$USERP1= <user>
##$USERP2= <user>
##$USERP3= <user>
##$USERP4= <user>
##$USERP5= <user>
##$WDW= 1
##$XDIM= 131072
##$YMAX_p= 498560349
##$YMIN_p= -367470709
##$CURPLOT= <Network HP LaserJet P1505>
##$CURPRIN= <$Network HP LaserJet P1505>
##$DFORMAT= <normdp>
##$LAYOUT= <+/1D_H.xwp>
##$LFORMAT= <normlp>
##$PFORMAT= <normpl>
##$SURQMSG= 1
$$ End of Bruker specific parameters
$$ ---------------------------------
##NTUPLES= NMR SPECTRUM
##VAR_NAME=  FREQUENCY,     SPECTRUM/REAL,   SPECTRUM/IMAG
##SYMBOL=    X,             R,               I
##VAR_TYPE=  INDEPENDENT,   DEPENDENT,       DEPENDENT
##VAR_FORM=  AFFN,          ASDF,            ASDF
##VAR_DIM=   131072,        131072,          131072
##UNITS=     HZ,            ARBITRARY UNITS, ARBITRARY UNITS
##FACTOR=    0.0627417313425165, 1,          1
##FIRST=     8223.62146879498, 4145,         -95334
##LAST=      0,             4110,            -95609
##MIN=       0,             -367470709,      0
##MAX=       8223.62146879498, 498560349,    0
$$ Real data points
##PAGE= N=1
##DATA TABLE= (X++(R..R)), XYDATA
$$ [...]
$$ plain form
62938 2748002 2748681 2756744 2770792 2789275 2810633 2832928 2854511 2875610 2898157 2923173 2949190 2974055
62926 2974055 2997292 3019578 3040708 3059225 3073368 3081218 3080519 3069827 3049582 3020816 2983041 2934743
62914 2934743 2875923 2808909 2736461 2660097 2580472 2498375 2414851 2331014 2248074 2167082 2088451
62903 2088451 2012257 1939223 1870942 1808760 1752556 1700750 1651547 1604399 1560369 1520868 1486001
62892 1486001 1454548 1425480 1398735 1374350 1351869 1331158 1312764 1296648 1281524 1266475 1252355
62881 1252355 1240332 1229807 1219258 1208574 1198859 1190156 1181082 1170827 1159963 1149003 1137684 1126085
62869 1126085 1115064 1104945 1094968 1084645 1074547 1065063 1055548 1045582 1036199 1028795 1023371 1018641 1013443
62856 1013443 1007422 1000878 994736 990221 987752 986350 984745 982765 981070 979925 979071 978685 979550 981958 984972
$$ packed form
62938B748002O79Q063J4048J8483K1358K2295K1583K1099K2547K5016K6017K4865
62926B974055K3237K2286K1130J8517J4143P850o99j0692k0245k8766l7775m8298
62914B934743n8820o7014p2448p6364p9625q2097q3524q3837q2940q0992p8631
62903B088451p6194p3034o8281o2182n6204n1806m9203m7148m4030l9501l4867
62892A486001l1453k9068k6745k4385k2481k0711j8394j6116j5124j5049j4120
62881A252355j2023j0525j0549j0684r715q703r074j0255j0864j0960j1319j1599
62869A126085j1021j0119r977j0323j0098r484r515r966r383p404n424m730n198
62856A013443o021o544o142m515k469j402j605j980j695j145q54l86Q65K408L014
$$ plain form
62841 984972 987187 988055 988237 988715 989842 991316 992949 995060 997898 1000968 1003318 1004382 1004209 1002964 1000762
62826 1000762 998070 995822 994791 994871 994980 993652 990080 984945 979967 976230 973220 969919 966394 963497 961302
62811 961302 958913 955829 952452 948946 944548 938507 931058 923012 915002 907488 900866 895000 889052 882183
62797 882183 874202 865548 857148 850340 845969 843147 839710 834460 828347 823014 818978 815902 813755 812624
62783 812624 811855 810561 808891 807922 808229 809334 810680 812512 815526 819931 825038 829781 833862 838462 845306
62768 845306 854665 864751 873571 880942 888102 895748 903308 910095 916421 923388 931877 941673 951378 959602
62754 959602 966700 974865 985849 998913 1011810 1023434 1034603 1046484 1059500 1073840 1089870 1107499
62742 1107499 1125977 1144851 1164599 1186085 1209992 1236855 1266685 1298212 1329585 1360649 1393799
$$ packed form
62841I84972K215Q68J82M78J127J474J633K111K838L070K350J064j73j245k202
62826A000762k692k248j031Q0J09j328l572n135m978l737l010l301l525k897k195
62811I61302k389l084l377l506m398o041p449q046q010p514o622n866n948o869
62797H82183p981q654q400o808m371k822l437n250o113n333m036l076k147j131
62783H12624p69j294j670r69L07J105J346J832L014M405N107M743M081M600O844
62768H45306R359J0086Q820P371P160P646P560O787O326O967Q489R796R705Q224
62754I59602P098Q165J0984J3064J2897J1624J1169J1881J3016J4340J6030J7629
62742A107499J8478J8874J9748K1486K3907K6863K9830L1527L1373L1064L3150
$$ plain form
62731 1393799 1431681 1474536 1520496 1568005 1617143 1669088 1725350 1787390 1856062 1931280 2012684
62720 2012684 2100435 2194803 2295497 2402327 2516232 2638512 2769025 2906207 3048839 3196526
62710 3196526 3348027 3500248 3649439 3792349 3925687 4045698 4149307 4234878 4300866 4344585
62700 4344585 4363553 4357458 4327476 4274157 4197588 4099557 3983922 3854470 3713802 3564779 3411610
62689 3411610 3258324 3106799 2957107 2809439 2665196 2526816 2397048 2277587 2167551
62680 2167551 2063738 1963377 1866684 1776312 1694598 1621887 1557101 1499041 1446980 1400544 1359193
62669 1359193 1321724 1286598 1253146 1222121 1194646 1170974 1150813 1134386 1122153 1113532 1106934 1101417
62657 1101417 1097602 1096443 1097578 1099466 1100988 1102554 1105637 1111466 1120170 1131125 1144043 1159565 1178633
$$ packed form
62731A393799L7882M2855M5960M7509M9138N1945N6262O2040O8672P5218Q1404
62720B012684Q7751R4368J00694J06830J13905J22280J30513J37182J42632J47687
62710C196526J51501J52221J49191J42910J33338J20011J03609Q5571O5988M3719
62700D344585J8968o095k9982n3319p6569r8031j15635j29452j40668j49023j53169
62689C411610j53286j51525j49692j47668j44243j38380j29768j19461j10036
62680B167551j03813j00361r6693r0372q1714p2711o4786n8060n2061m6436m1351
62669A359193l7469l5126l3452l1025k7475k3672k0161j6427j2233q621o598n517
62657A101417l815j159J135J888J522J566L083N829Q704J0955J2918J5522J9068
$$ plain form
62644 1178633 1201475 1227596 1256782 1289746 1327525 1370401 1417636 1468216 1521667 1578121 1637814
62633 1637814 1700793 1767112 1836877 1909776 1984718 2060250 2135100 2207887 2276523 2338486 2391586
62622 2391586 2433937 2463629 2479608 2482950 2475803 2458440 2428598 2384627 2328222 2262914 2190863 2112656
62610 2112656 2029681 1944853 1860836 1778816 1699131 1621918 1546939 1473971 1403843 1338246 1278149
62599 1278149 1223093 1172189 1124923 1080854 1039611 1001558 967422 936690 907357 878083 849888
62588 849888 824889 803836 785542 768320 751248 734379 718447 704330 692207 681250 670415
62577 670415 659444 648866 639246 630768 623390 617061 611710 607148 602980 598762 594465 590617 587698 585632
62563 585632 584360 584546 586856 590602 594116 596681 599244 602967 608046 614368 622300 631989 642618 653162
$$ packed form
62644A178633K2842K6121K9186L2964L7779M2876M7235N0580N3451N6454N9693
62633A637814O2979O6319O9765P2899P4942P5532P4850P2787O8636O1963N3100
62622B391586M2351K9692J5979L342p147j7363k9842m3971n6405o5308p2051p8207
62610B112656q2975q4828q4017q2020p9685p7213p4979p2968p0128o5597o0097
62599A278149n5056n0904m7266m4069m1243l8053l4136l0732k9333k9274k8195
62588H49888k4999k1053j8294j7222j7072j6869j5932j4117j2123j0957j0835
62577F70415j0971j0578r620q478p378o329n351m562m168m218m297l848k919k066
62563E85632j272J86K310L746L514K565K563L723N079O322P932R689J0629J0544
$$ plain form
62549 653162 663527 674408 686625 701066 718453 738372 759272 780466 803505 830498 861590
62538 861590 895307 931079 969953 1012872 1059670 1110180 1165103 1225181 1290305 1359854 1433081
62527 1433081 1508737 1585222 1661618 1737762 1812589 1883266 1946774 2001673 2047317 2082057 2103634
62516 2103634 2111163 2105403 2087096 2056534 2015205 1966355 1912753 1854750 1791629 1724156 1654612 1584776
62504 1584776 1515393 1447547 1382963 1322433 1265193 1210668 1159858 1114064 1072988 1035194 1000049
62493 1000049 968106 939582 913441 888299 863799 840838 820545 802913 786367 769166 751529
62482 751529 735662 723084 712607 701912 690572 680322 672616 667361 664049 662604 662455 662056 660372
62469 660372 658201 657242 658321 661184 665595 671756 679716 689024 699159 710067 722129 735706 750799
$$ packed form
62549F53162J0365J0881J2217J4441J7387J9919K0900K1194K3039K6993L1092
62538H61590L3717L5772L8874M2919M6798N0510N4923O0078O5124O9549P3227
62527A433081P5656P6485P6396P6144P4827P0677O3508N4899M5644L4740K1577
62516B103634P529n760j8307l0562m1329m8850n3602n8003o3121o7473o9544o9836
62504A584776o9383o7846o4584o0530n7240n4525n0810m5794m1076l7794l5145
62493A000049l1943k8524k6141k5142k4500k2961k0293j7632j6546j7201j7637
62482G51529j5867j2578j0477j0695j1340j0250p706n255l312j445j49l99j684
62469F60372k171r59J079K863M411O161P960R308J0135J0908J2062J3577J5093
$$ plain form
62456 750799 767361 785942 807616 832921 861249 891733 924260 958963 995196 1032133 1070140
62445 1070140 1110353 1152650 1195076 1235422 1272470 1305571 1334150 1357949 1376648 1388862 1392742
62434 1392742 1388134 1377013 1361128 1340371 1314206 1283494 1249765 1213776 1176062 1138148 1101776
62423 1101776 1067337 1034224 1002359 972303 944240 918074 894292 873646 856091 840976 828182
62412 828182 818075 810410 804131 798306 792576 786902 781702 778087 777088 778542 781343 784553 787653 790234
62398 790234 792497 795872 801828 809914 817929 824315 829667 835757 843868 854212 866178 878907 892205
62385 892205 906921 923785 941958 959467 974905 987751 997205 1002094 1002317 999091 993083 983303 968689
62372 968689 950058 929653 909269 889511 870258 850927 830626 809084 787501 767807 750908
$$ packed form
62456G50799J6562J8581K1674K5305K8328L0484L2527L4703L6233L6937L8007
62445A070140M0213M2297M2426M0346L7048L3101K8579K3799J8699J2214L880
62434A392742m608j1121j5885k0757k6165l0712l3729l5989l7714l7914l6372
62423A101776l4439l3113l1865l0056k8063k6166k3782k0646j7555j5115j2794
62412H28182j0107p665o279n825n730n674n200l615r99J454K801L210L100K581
62398G90234K263L375N956Q086Q015O386N352O090Q111J0344J1966J2729J3298
62385H92205J4716J6864J8173J7509J5438J2846R454M889K23l226o008r780j4614
62372I68689j8631k0405k0384j9758j9253j9331k0301k1542k1583j9694j6899
$$ plain form
62361 750908 736171 722646 710218 699340 690107 682154 675369 670256 667315 666316 666519 667602 669898 673592
62347 673592 678132 682937 688514 696314 707301 720809 734899 747843 759385 770630 782551 794768
62335 794768 806295 817347 829397 842931 856166 867014 875587 883516 891173 897110 900333 901620 902026
62322 902026 901455 899753 898232 898773 901614 905151 908147 911339 916612 925221 937403 953371 973801 998927
62308 998927 1027704 1058679 1091759 1128539 1170671 1218593 1272163 1331771 1397974 1470310 1547280
62297 1547280 1627404 1709733 1793562 1878301 1963411 2047583 2127843 2200160 2261162 2309092 2343572
62286 2343572 2365317 2375858 2376375 2366551 2345429 2313588 2273438 2226968 2174128 2114179 2047900 1977729
62274 1977729 1906294 1835660 1767602 1703474 1643518 1586907 1532901 1481747 1434109 1389591 1346245
$$ packed form
62361G50908j4737j3525j2428j0878r233p953o785n113k941r99K03J083K296L694
62347F73592M540M805N577P800J0987J3508J4090J2944J1542J1245J1921J2217
62335G94768J1527J1052J2050J3534J3235J0848Q573P929P657N937L223J287M06
62322I02026n71j702j521N41K841L537K996L192N273Q609J2182J5968K0430K5126
62308I98927K8777L0975L3080L6780M2132M7922N3570N9608O6203P2336P6970
62297A547280Q0124Q2329Q3829Q4739Q5110Q4172Q0260P2317O1002M7930L4480
62286B343572K1745J0541N17r824k1122l1841m0150m6470n2840n9949o6279p0171
62274A977729p1435p0634o8058o4128n9956n6611n4006n1154m7638m4518m3346
$$ plain form
62263 1346245 1302079 1257224 1214149 1175367 1141308 1110792 1082897 1057326 1033367 1010064 987955
62252 987955 969508 956924 949951 946354 944002 941921 939916 938086 936688 935844 935179 933983 931766 928607
62238 928607 925078 921795 918682 914657 908612 901062 894356 890679 889990 890273 889782 888717 888751 891097 895262
62223 895262 899798 904248 909939 918492 929961 943103 957296 973274 991763 1012264 1033618 1055224
62211 1055224 1077269 1100358 1125421 1153428 1184517 1217672 1251949 1287914 1327378 1371783 1421218
62200 1421218 1474981 1532734 1595020 1662732 1735967 1813317 1892452 1971426 2049042 2123776 2192881
62189 2192881 2253175 2302661 2341015 2368507 2384755 2388653 2379360 2357237 2323682 2280023 2226887 2165098
62177 2165098 2096924 2025645 1953553 1881008 1807979 1736040 1668089 1606027 1549307 1496092 1445590
$$ packed form
62263A346245m4166m4855m3075l8782l4059l0516k7895k5571k3959k3303k2109
62252I87955j8447j2584o973l597k352k081k005j830j398q44o65j196k217l159
62238I28607l529l283l113m025o045p550o706l677o89K83m91j065L4K346M165
62223H95262M536M450N691Q553J1469J3142J4193J5978J8489K0501K1354K1606
62211A055224K2045K3089K5063K8007L1089L3155L4277L5965L9464M4405M9435
62200A421218N3763N7753O2286O7712P3235P7350P9135P8974P7616P4734O9105
62189B192881O0294M9486L8354K7492J6248L898r293k2123l3555m3659n3136o1789
62177B165098o8174p1279p2092p2545p3029p1939o7951o2062n6720n3215n0502
$$ plain form
62166 1445590 1398879 1357429 1321261 1289087 1260183 1235352 1215588 1200310 1187669 1176303 1166065
62155 1166065 1157281 1150280 1145633 1143827 1144333 1145825 1147668 1150387 1154263 1158361 1161583 1163966 1166190 1168417
62141 1168417 1170553 1173247 1177613 1183949 1191532 1199813 1209310 1221122 1235740 1252306 1268895 1283850 1297201
62128 1297201 1310694 1326207 1344382 1364937 1387604 1412112 1437680 1463359 1488896 1514649 1540716
62117 1540716 1566805 1593020 1620139 1648936 1679692 1712581 1748021 1786333 1827371 1870935 1917402
62106 1917402 1967629 2022151 2080550 2141539 2203515 2264950 2324197 2379114 2427270 2466915 2497716
62095 2497716 2520268 2534851 2541098 2539136 2530628 2517950 2502138 2482105 2456264 2424700 2389433 2352881
62083 2352881 2316622 2281425 2247654 2215452 2185232 2158220 2135726 2117458 2101360 2085774 2071037
$$ packed form
62166A445590m6711m1450l6168l2174k8904k4831j9764j5278j2641j1366j0238
62155A166065q784p001m647j806N06J492J843K719L876M098L222K383K224K227
62141A168417K136K694M366O336P583Q281R497J1812J4618J6566J6589J4955J3351
62128A297201J3493J5513J8175K0555K2667K4508K5568K5679K5537K5753K6067
62117A540716K6089K6215K7119K8797L0756L2889L5440L8312M1038M3564M6467
62106A917402N0227N4522N8399O0989O1976O1435N9247N4917M8156L9645L0801
62095B497716K2552J4583O247j962q508j2678j5812k0033k5841l1564l5267l6552
62083B352881l6259l5197l3771l2202l0220k7012k2494j8268j6098j5586j4737
$$ plain form
62072 2071037 2058091 2046245 2033679 2020059 2007408 1998044 1992408 1989168 1986922 1985699 1987103 1992791 2002332
62059 2002332 2013075 2022976 2033087 2046172 2063355 2083592 2106158 2131663 2160115 2189745 2218835
62048 2218835 2247531 2277028 2308062 2341088 2376870 2415793 2457401 2501513 2549007 2600581 2655567
62037 2655567 2712893 2772254 2833008 2892762 2948724 3000429 3049979 3099778 3151160 3204993 3262071
62026 3262071 3322216 3383653 3443823 3500839 3554526 3606508 3658990 3712937 3767736 3822945 3879707
62015 3879707 3939656 4002984 4068552 4135455 4203460 4272273 4341726 4412746 4486961 4564946 4645571
62004 4645571 4727298 4809409 4891680 4973530 5053935 5131869 5206499 5276989 5342167 5400565 5451250
61993 5451250 5494698 5532254 5564519 5591079 5612224 5629876 5645866 5660111 5671553 5680195 5687054 5692898
$$ packed form
62072B071037j2946j1846j2566j3620j2651r364n636l240k246j223J404N688R541
62059B002332J0743R901J0111J3085J7183K0237K2566K5505K8452K9630K9090
62048B218835K8696K9497L1034L3026L5782L8923M1608M4112M7494N1574N4986
62037B655567N7326N9361O0754N9754N5962N1705M9550M9799N1382N3833N7078
62026C262071O0145O1437O0170N7016N3687N1982N2482N3947N4799N5209N6762
62015C879707N9949O3328O5568O6903O8005O8813O9453P1020P4215P7985Q0625
62004D645571Q1727Q2111Q2271Q1850Q0405P7934P4630P0490O5178N8398N0685
61993E451250M3448L7556L2265K6560K1145J7652J5990J4245J1442Q642O859N844
$$ plain form
61981 5692898 5698471 5705347 5714700 5725410 5735244 5744114 5754427 5767831 5783345 5799330 5815695 5833087
61969 5833087 5851165 5868785 5885068 5899409 5911229 5920495 5927771 5933046 5935487 5935164 5934008 5933861 5934241
61956 5934241 5933276 5930314 5926256 5921619 5915754 5908187 5899618 5891167 5883389 5876407 5870330 5865139 5860614 5856709
61942 5856709 5853672 5851560 5850031 5848935 5848848 5850633 5854501 5859754 5865501 5871435 5877679 5883847 5888515 5890010
61928 5890010 5887704 5882180 5874082 5863410 5850291 5835826 5821316 5806770 5791047 5773652 5755582 5737935
61916 5737935 5720340 5701459 5680575 5657758 5632709 5604616 5573633 5541549 5510156 5479316 5447324
61905 5447324 5412884 5376058 5337670 5298696 5260190 5222753 5185813 5148181 5109666 5071466 5034610
61894 5034610 4998785 4963223 4928122 4894508 4863055 4833585 4805542 4778652 4753487 4731506 4713886
$$ packed form
61981E692898N573O876R353J0710R834Q870J0313J3404J5514J5985J6365J7392
61969E833087J8078J7620J6283J4341J1820R266P276N275K441l23j156j47L80
61956E934241r65k962m058m637n865p567q569q451p778o982o077n191m525l905
61942E856709l037k112j529j096q7J785L868N253N747N934O244O168M668J495
61928E890010k306n524q098j0672j3119j4465j4510j4546j5723j7395j8070j7647
61916E737935j7595j8881k0884k2817k5049k8093l0983l2084l1393l0840l1992
61905E447324l4440l6826l8388l8974l8506l7437l6940l7632l8515l8200l6856
61894E034610l5825l5562l5101l3614l1453k9470k8043k6890k5165k1981j7620
$$ plain form
61883 4713886 4699881 4687091 4673970 4661432 4651386 4644543 4640700 4640447 4645092 4654889 4668556 4684846
61871 4684846 4703811 4726388 4753376 4784939 4820501 4859195 4901003 4947279 4999552 5058107 5122625
61860 5122625 5193887 5273664 5362933 5461412 5569114 5687257 5817365 5960713 6119344 6296667
61850 6296667 6496151 6719938 6969321 7246060 7552631 7891734 8266217 8679184 9133504
61841 9133504 9631387 10174727 10765461 11404909 12092527 12825024 13595558 14392369 15197224
61832 15197224 15984705 16722925 17375736 17906362 18281823 18477221 18479292 18288759 17920200 17398719
61822 17398719 16754894 16020734 15227278 14402512 13569358 12745135 11942826 11172445 10441506
61813 10441506 9755315 9117407 8529307 7989871 7495918 7044202 6632373 6257928 5917300
$$ packed form
61883D713886j4005j2790j3121j2538j0046o843l843k53M645R797J3667J6290
61871D684846J8965K2577K6988L1563L5562L8694M1808M6276N2273N8555O4518
61860E122625P1262P9777Q9269R8479J07702J18143J30108J43348J58631J77323
61850F296667J99484K23787K49383K76739L06571L39103L74483M12967M54320
61841I133504M97883N43340N90734O39448O87618P32497P70534P96811Q04855
61832A5197224P87481P38220O52811N30626L75461J95398K071j90533l68559n21481
61822A7398719o43825p34160p93456q24766q33154q24223q02309p70381p30939
61813A0441506o86191o37908n88100n39436m93953m51716m11829l74445l40628
$$ plain form
61804 5917300 5606796 5323859 5066688 4833097 4620494 4426668 4249934 4088711 3941539
61795 3941539 3807430 3685665 3575210 3474520 3381978 3296611 3218706 3149516 3089628 3037502
61785 3037502 2990412 2946918 2907435 2872060 2839179 2807115 2776055 2747147 2720647 2696429 2675615
61774 2675615 2659755 2648354 2638969 2630260 2623544 2620654 2621425 2624138 2627551 2631585 2636676 2643446 2652615 2664319
61760 2664319 2677634 2691540 2706277 2723169 2743184 2766310 2792226 2820775 2851546 2883947 2918347
61749 2918347 2956800 3001867 3054643 3114227 3179044 3248360 3322653 3403084 3490838 3586632 3690446
61738 3690446 3801760 3920295 4046665 4182351 4329084 4488001 4659189 4842015 5036202
61729 5036202 5242777 5463928 5701971 5958561 6234688 6531173 6849329 7191651 7561926
$$ packed form
61804E917300l10504k82937k57171k33591k12603j93826j76734j61223j47172
61795C941539j34109j21765j10455j00690r2542q5367p7905o9190n9888n2126
61785C037502m7090m3494l9483l5375l2881l2064l1060k8908k6500k4218k0814
61774B675615j5860j1401r385q709o716k890P71K713L413M034N091O770R169J1704
61760B664319J3315J3906J4737J6892K0015K3126K5916K8549L0771L2401L4400
61749B918347L8453M5067N2776N9584O4817O9316P4293Q0431Q7754R5794J03814
61738C690446J11314J18535J26370J35686J46733J58917J71188J82826J94187
61729E036202K06575K21151K38043K56590K76127K96485L18156L42322L70275
$$ plain form
61720 7561926 7964266 8402145 8879001 9399797 9971017 10598604 11286603 12038350 12858294
61711 12858294 13751870 14724061 15778756 16918777 18144901 19453928 20837303 22280230
61703 22280230 23759976 25243491 26686054 28031866 29216893 30174776 30845965 31187373
61695 31187373 31178819 30825097 30154464 29213442 28058137 26745425 25328209 23854431 22365988
61686 22365988 20896499 19470780 18107024 16818571 15613419 14493937 13459045 12506931
61678 12506931 11635526 10841439 10119699 9464394 8869027 8326814 7831762 7379697 6967886
61669 6967886 6593666 6253570 5943422 5659019 5397093 5156012 4935223 4733775 4549632
61660 4549632 4380523 4224777 4081000 3947636 3823479 3708158 3601409 3502121 3408659 3319986
$$ packed form
61720G561926M02340M37879M76856N20796N71220O27587O87999P51747Q19944
61711A2858294Q93576R72191J054695J140021J226124J309027J383375J442927
61703B2280230J479746J483515J442563J345812J185027R57883O71189L41408
61695C1187373q554l53722o70633r41022j155305j312712j417216j473778j488443
61686B2365988j469489j425719j363756j288453j205152j119482j034892r52114
61678A2506931q71405p94087p21740o55305n95367n42213m95052m52065m11811
61669F967886l74220l40096l10148k84403k61926k41081k20789k01448j84143
61660D549632j69109j55746j43777j33364j24157j15321j06749r9288r3462q8673
$$ plain form
61650 3319986 3236091 3157509 3084699 3017548 2955066 2895808 2838913 2784491 2732782 2683412 2635843
61639 2635843 2590083 2546315 2504041 2462161 2419972 2377810 2336647 2297051 2258398 2219293 2179198
61628 2179198 2139503 2102325 2068205 2035761 2003703 1972346 1942806 1915693 1891169 1869304 1849500
61617 1849500 1830247 1810513 1791097 1773810 1759535 1747678 1737090 1726792 1716114 1705015 1694244
61606 1694244 1684560 1675833 1667381 1658900 1650513 1642050 1632959 1622968 1612559 1602855 1595048 1589373 1584279 1577377
61592 1577377 1567889 1557593 1548627 1541060 1533720 1526819 1522202 1520883 1521667 1522627 1522883 1522425 1521151 1518993 1516589
61577 1516589 1515024 1514908 1516085 1518201 1521244 1525457 1530858 1536980 1543221 1549423 1555896 1562752 1569469 1575350
61563 1575350 1580209 1584347 1588058 1591443 1594518 1597199 1599349 1601093 1602807 1604489 1605347 1604423 1601414 1596529
$$ packed form
61650C319986q3895p8582p2810o7151o2482n9258n6895n4422n1709m9370m7569
61639B635843m5760m3768m2274m1880m2189m2162m1163l9596l8653l9105m0095
61628B179198l9695l7178l4120l2444l2058l1357k9540k7113k4524k1865j9804
61617A849500j9253j9734j9416j7287j4275j1857j0588j0298j0678j1099j0771
61606A694244r684q727q452q481q387q463r091r991j0409r704p807n675n094o902
61592A577377r488j0296q966p567p340o901m617j319P84R60K56m58j274k158k404
61577A516589j565j16J177K116L043M213N401O122O241O202O473O856O717N881
61563A575350M859M138L711L385L075K681K150J744J714J682Q58r24l009m885
$$ plain form
61549 1596529 1589846 1581439 1572009 1562706 1554031 1545311 1535415 1523774 1510597 1496470 1482170 1468811 1457660
61536 1457660 1449266 1442720 1436294 1429162 1422140 1416431 1412270 1409544 1409083 1411932 1417445 1423620 1429785 1437586
61522 1437586 1448658 1462579 1478008 1494670 1513053 1533210 1555164 1579737 1607515 1637585 1668779
61511 1668779 1701719 1738017 1777782 1819651 1863317 1910043 1960086 2011316 2061400 2110093 2158214
61500 2158214 2205436 2250541 2293423 2335434 2377564 2419161 2458672 2495018 2527969 2557650 2584191
61489 2584191 2607750 2628476 2646242 2660579 2671158 2678259 2682380 2683295 2680026 2672234 2661369 2649778
61477 2649778 2638599 2626957 2613357 2597509 2580665 2564685 2551258 2541797 2537248 2537425 2540716 2545321
61465 2545321 2551134 2560131 2574599 2595490 2622792 2656706 2697466 2744642 2798012 2858993 2929709 3010503
$$ packed form
61549A596529o683q407r430r303q675q720r896j1641j3177j4127j4300j3359j1151
61536A457660q394o546o426p132p022n709m161k726m61K849N513O175O165P801
61522A437586J1072J3921J5429J6662J8383K0157K1954K4573K7778L0070L1194
61511A668779L2940L6298L9765M1869M3666M6726N0043N1230N0084M8693M8121
61500B158214M7222M5105M2882M2011M2130M1597L9511L6346L2951K9681K6541
61489B584191K3559K0726J7766J4337J0579P101M121R15l269p792j0865j1591
61477B649778j1179j1642j3600j5848j6844j5980j3427r461m549J77L291M605
61465B545321N813Q997J4468K0891K7302L3914M0760M7176N3370O0981P0716Q0794
$$ plain form
61453 3010503 3099918 3197669 3306093 3427907 3564006 3714617 3881004 4064303 4263598 4477158
61443 4477158 4705273 4950291 5213909 5495702 5793877 6105503 6425362 6745652 7057272
61434 7057272 7350756 7616145 7843444 8024120 8152145 8224112 8239644 8202045 8117499 7992983
61424 7992983 7835111 7650656 7447007 7231440 7010317 6789191 6573117 6366445 6172336
61415 6172336 5992457 5827138 5676351 5540987 5422818 5322877 5240675 5175616 5128245 5098843
61405 5098843 5085492 5085011 5095506 5116573 5147463 5187054 5235769 5295308 5365392 5442295 5521884 5603150
61393 5603150 5687623 5775975 5866343 5955665 6041739 6124095 6203579 6281280 6357583 6432093 6504082
61382 6504082 6572515 6636020 6693817 6746916 6797374 6845949 6891134 6931016 6965291 6994866 7020172
$$ packed form
61453C010503Q9415R7751J08424J21814J36099J50611J66387J83299J99295K13560
61443D477158K28115K45018K63618K81793K98175L11626L19859L20290L11620
61434G057272K93484K65389K27299J80676J28025P1967J5532l7599q4546j24516
61424G992983j57872j84455k03649k15567k21123k21126k16074k06672j94109
61415F172336j79879j65319j50787j35364j18169r9941q2202o5059m7371k9402
61405E098843j3351m81J0495K1067L0890L9591M8715N9539P0084P6903P9589Q1266
61393E603150Q4473Q8352R0368Q9322Q6074Q2356P9484P7701P6303P4510P1989
61382F504082O8433O3505N7797N3099N0458M8575M5185L9882L4275K9575K5306
$$ plain form
61371 7020172 7040749 7056133 7066196 7070536 7068347 7059460 7045297 7028272 7009943 6989803 6966166 6938220
61359 6938220 6907000 6874425 6841937 6810204 6779441 6749593 6720723 6693677 6669846 6649735 6632333
61348 6632333 6616357 6601311 6586661 6570822 6552058 6529839 6504384 6475696 6444333 6412470 6382642
61337 6382642 6355717 6331629 6311825 6299347 6296601 6304723 6325295 6360872 6413325 6483233 6571587 6680724
61325 6680724 6812768 6968232 7146808 7348582 7573792 7822149 8092867 8384557 8694678
61316 8694678 9019694 9355658 9697393 10036749 10362760 10664037 10930346 11152240 11321214
61307 11321214 11431660 11482288 11475225 11414285 11303920 11148464 10951769 10718172 10453644 10164761
61297 10164761 9856577 9532969 9199036 8861426 8525907 8196240 7875701 7567581 7273399
$$ packed form
61371G020172K0577J5384J0063M340k189q887j4163j7025j8329k0140k3637k7946
61359F938220l1220l2575l2488l1733l0763k9848k8870k7046k3831k0111j7402
61348F632333j5976j5046j4650j5839j8764k2219k5455k8688l1363l1863k9828
61337F382642k6925k4088j9804j2478k746Q122K0572L5577N2453O9908Q8354J09137
61325F680724J32044J55464J78576K01774K25210K48357K70718K91690L10121
61316H694678L25016L35964L41735L39356L26011L01277K66309K21894J68974
61307A1321214J10446N0628p063o0940j10365j55456j96695k33597k64528k88883
61297A0164761l08184l23608l33933l37610l35519l29667l20539l08120k94182
$$ plain form
61288 7273399 6992640 6725501 6474417 6241977 6029013 5835697 5662579 5509063 5372606
61279 5372606 5251198 5145412 5056611 4984515 4928008 4886827 4860642 4847701 4846219 4855976 4876799
61268 4876799 4906791 4944119 4989358 5043684 5105577 5171737 5240591 5312329 5385775 5457896 5526586
61257 5526586 5591665 5652803 5708584 5758139 5801839 5839898 5871957 5898414 5920438 5938148 5950354
61246 5950354 5956506 5957235 5952425 5940486 5920338 5892692 5858626 5818349 5772129 5720940 5665099 5603573
61234 5603573 5535800 5463385 5388981 5314310 5240052 5166718 5094613 5023804 4955191 4890815 4832010
61223 4832010 4777887 4726791 4678656 4634718 4595442 4560134 4528348 4500047 4474131 4448175 4420225
61212 4420225 4390014 4358052 4324622 4290371 4256922 4225822 4197411 4171692 4149911 4134111 4125253
$$ packed form
61288G273399k80759k67139k51084k32440k12964j93316j73118j53516j36457
61279E372606j21408j05786q8801p2096n6507m1181k6185j2941j482R757K0823
61268D876799K9992L7328M5239N4326O1893O6160O8854P1738P3446P2121O8690
61257E526586O5079O1138N5781M9555M3700L8059L2059K6457K2024J7710J2206
61246E950354O152P29m810j1939k0148k7646l4066m0277m6220n1189n5841o1526
61234E603573o7773p2415p4404p4671p4258p3334p2105p0809o8613o4376n8805
61223D832010n4123n1096m8135m3938l9276l5308l1786k8301k5916k5956k7950
61212D420225l0211l1962l3430l4251l3449l1100k8411k5719k1781j5800q858
$$ plain form
61201 4125253 4122913 4126912 4137957 4156384 4181730 4214388 4256318 4308850 4371051 4442161 4524760 4622956
61189 4622956 4737103 4862577 4994570 5132043 5275584 5423029 5568977 5707481 5833078
61180 5833078 5939487 6019325 6065983 6075329 6045912 5978666 5876684 5744558 5587617 5411826
61170 5411826 5223701 5029308 4833343 4639632 4451980 4273578 4105784 3948473 3801572
61161 3801572 3665451 3539982 3424410 3318536 3223132 3138564 3063450 2995240 2932073 2873866
61151 2873866 2821677 2776211 2736988 2703001 2673961 2650489 2633076 2621410 2614913 2613383 2616685 2624221
61139 2624221 2635147 2648876 2665076 2683371 2703088 2722868 2740648 2754727 2764894 2771565 2773870 2769999
61127 2769999 2759922 2746180 2731033 2714106 2694002 2670886 2645894 2619067 2589769 2558632 2527253
$$ packed form
61201D125253k340L999J1045J8427K5346L2658M1930N2532O2201P1110Q2599R8196
61189D622956J14147J25474J31993J37473J43541J47445J45948J38504J25597
61180E833078J06409P9838M6658R346k9417o7246j01982j32126j56941j75791
61170E411826j88125j94393j95965j93711j87652j78402j67794j57311j46901
61161C801572j36121j25469j15572j05874r5404q4568p5114o8210o3167n8207
61151B873866n2189m5466l9223l3987k9040k3472j7413j1666o497j530L302P536
61139B624221J0926J3729J6200J8295J9717J9780J7780J4079J0167O671K305l871
61127B769999j0077j3742j5147j6927k0104k3116k4992k6827k9298l1137l1379
$$ plain form
61116 2527253 2496215 2465027 2433732 2402817 2371603 2338663 2304194 2270216 2237748 2205293 2170991
61105 2170991 2135027 2098786 2062498 2024933 1985209 1944004 1902951 1863389 1825820 1790241 1756535
61094 1756535 1724267 1692454 1660278 1628279 1597977 1569844 1542401 1513991 1484556 1454704 1423929
61083 1423929 1391308 1357739 1325972 1298164 1274332 1253227 1233797 1215699 1199343 1185603 1174886
61072 1174886 1166559 1159924 1155331 1153354 1153277 1153703 1154592 1157384 1162945 1170613 1179496 1189574 1201078 1213711
61058 1213711 1226975 1240655 1254636 1268770 1282940 1296727 1309225 1320091 1330634 1342886 1357452
61047 1357452 1373052 1388046 1401430 1412522 1420883 1426763 1430678 1432412 1431320 1427522 1421752 1414316 1405534
61034 1405534 1397041 1390874 1386887 1382783 1377338 1372009 1368404 1365576 1361131 1354174 1346025 1338572 1332873 1328900
$$ packed form
61116B527253l1038l1188l1295l0915l1214l2940l4469l3978l2468l2455l4302
61105B170991l5964l6241l6288l7565l9724m1205m1053l9562l7569l5579l3706
61094A756535l2268l1813l2176l1999l0302k8133k7443k8410k9435k9852l0775
61083A423929l2621l3569l1767k7808k3832k1105j9430j8098j6356j3740j0717
61072A174886q327o635m593j977p7M26Q89K792N561P668Q883J0078J1504J2633
61058A213711J3264J3680J3981J4134J4170J3787J2498J0866J0543J2252J4566
61047A357452J5600J4994J3384J1092Q361N880L915J734j092l798n770p436q782
61034A405534q493o167l987m104n445n329l605k828m445o957q149p453n699l973
$$ plain form
61020 1328900 1325754 1322329 1318363 1314674 1312133 1310770 1310049 1309420 1308368 1306568 1304294 1302078 1299706 1296239
61006 1296239 1291293 1285565 1279836 1274262 1269082 1265172 1263270 1263188 1264259 1265956 1267698 1268699 1268706 1268506 1269268 1271666
60990 1271666 1275831 1281637 1288735 1296777 1305917 1316671 1329113 1342781 1357634 1374564 1394589 1418011
60978 1418011 1444602 1474087 1505937 1538991 1571782 1603437 1634435 1666558 1701808 1741058 1783949
60967 1783949 1830167 1880196 1934499 1992820 2055081 2122143 2194660 2271915 2352970 2438380 2529432
60956 2529432 2626267 2728353 2836503 2952639 3077531 3210403 3350954 3500286 3659465 3828468
60946 3828468 4006818 4194128 4390015 4594831 4810786 5041430 5290191 5560555 5857138
60937 5857138 6184807 6546676 6944402 7380422 7859113 8387248 8975552 9638660 10390618
$$ packed form
61020A328900l146l425l966l689k541j363p21o29j052j800k274k216k372l467
61006A296239m946n728n729n574n180l910j902q2J071J697J742J001Pk00P62K398
60990A271666M165N806P098Q042R140J0754J2442J3668J4853J6930K0025K3422
60978A418011K6591K9485L1850L3054L2791L1655L0998L2123L5250L9250M2891
60967A783949M6218N0029N4303N8321O2261O7062P2517P7255Q1055Q5410R1052
60956B529432R6835J02086J08150J16136J24892J32872J40551J49332J59179J69003
60946C828468J78350J87310J95887K04816K15955K30644K48761K70364K96583
60937E857138L27669L61869L97726M36020M78691N28135N88304O63108P51958
$$ plain form
60928 10390618 11241187 12199507 13280574 14505177 15896155 17480799 19295220 21377898
60920 21377898 23758770 26463062 29516913 32907794 36495350 39961546 42899070 45008737
60912 45008737 46246902 46801949 46951346 46948423 46999633 47252873 47720637 48197953 48304949 47674394
60902 47674394 46144961 43809667 40914592 37726159 34462004 31280827 28284700 25520683
60894 25520683 22995735 20702028 18632487 16780730 15137893 13693420 12434801 11344597
60886 11344597 10400733 9581163 8866704 8240098 7685975 7192798 6752451 6357233 5999206
60877 5999206 5672727 5375150 5104116 4855920 4627027 4415293 4218834 4035004 3860996
60868 3860996 3694371 3533004 3375941 3224482 3080999 2946486 2820328 2702076 2591764
$$ packed form
60928A0390618Q50569R58320J081067J224603J390978J584644J814421K082678
60920B1377898K380872K704292L053851L390881L587556L466196K937524K109667
60912D5008737J238165N55047J49397k923N1210K53240M67764M77316J06996o30555
60902D7674394j529433k335294k895075l188433l264155l181177k996127k764017
60894B5520683k524948k293707k069541j851757j642837j444473j258619j090204
60886A1344597r43864q19570p14459o26606n54123m93177m40347l95218l58027
60877E999206l26479k97577k71034k48196k28893k11734j96459j83830j74008
60868C860996j66625j61367j57063j51459j43483j34513j26158j18252j10312
$$ plain form
60859 2591764 2488546 2390763 2297648 2209572 2126540 2047857 1973264 1902958 1836546 1773457 1714208
60848 1714208 1659604 1608867 1560388 1514223 1471843 1433400 1397444 1363588 1333090 1306148 1280870
60837 1280870 1256007 1232683 1212142 1193487 1175056 1156723 1139523 1124024 1110242 1098263 1087894
60826 1087894 1078542 1070243 1063984 1060267 1058323 1057460 1058120 1060697 1064319 1067920 1071812 1077152 1084310 1092597
60812 1092597 1101144 1109314 1116726 1123566 1130524 1137893 1145065 1151201 1155813 1158407 1158385 1155909 1152218 1148378
60798 1148378 1144213 1139103 1133510 1129011 1126814 1126515 1126413 1125147 1123156 1122256 1123570 1126561 1130718 1137135 1146989
60783 1146989 1159009 1170436 1180596 1191539 1204487 1217453 1227604 1234754 1241255 1249239 1259014 1269548
60771 1269548 1279442 1287795 1294908 1301960 1309608 1317478 1325438 1334565 1345937 1358879 1371211 1381202 1388925
$$ packed form
60859B591764j03218r7783r3115q8076q3032p8683p4593p0306o6412o3089n9249
60848A714208n4604n0737m8479m6165m2380l8443l5956l3856l0498k6942k5278
60837A280870k4863k3324k0541j8655j8431j8333j7200j5499j3782j1979j0369
60826A087894r352q299o259l717j944q63O60K577L622L601L892N340P158Q287
60812A092597Q547Q170P412O840O958P369P172O136M612K594k2k476l691l840
60798A148378m165n110n593m499k197k99j02j266j991r00J314K991M157O417R854
60783A146989J2020J1427J0160J0943J2948J2966J0151P150O501P984R775J0534
60771A269548R894Q353P113P052P648P870P960R127J1372J2942J2332R991P723
$$ plain form
60758 1388925 1395979 1404200 1414318 1425452 1436008 1445087 1452816 1459659 1466113 1472894 1480359 1487452 1492031
60745 1492031 1492588 1489150 1482542 1473728 1463909 1454099 1443986 1432044 1417276 1400227 1382034 1363299 1344333
60732 1344333 1325763 1308379 1292787 1279271 1267376 1255833 1243876 1232580 1223800 1217898 1213829 1211314
60720 1211314 1211043 1212499 1213782 1214576 1217293 1223861 1233079 1242783 1253206 1266288 1282585 1300821 1319961
60707 1319961 1340033 1361188 1383419 1406953 1431663 1456431 1480289 1503698 1527286 1549777 1568861
60696 1568861 1584071 1597262 1610126 1622709 1634593 1645984 1656922 1666628 1674507 1681137 1687606 1694305
60684 1694305 1700843 1706717 1711686 1715742 1718932 1721030 1721454 1719972 1717405 1714988 1712815 1709446 1703440 1695017
60670 1695017 1685986 1678132 1671738 1665495 1657777 1648104 1637409 1626889 1616740 1606044 1593673 1579340
$$ packed form
60758A388925P054Q221J0118J1134J0556R079P729O843O454O781P465P093M579
60745A492031N57l438o608q814r819r810j0113j1942j4768j7049j8193j8735j8966
60732A344333j8570j7384j5592j3516j1895j1543j1957j1296q780n902m069k515
60720A211314k71J456J283P94K717O568R218R704J0423J3082J6297J8236J9140
60707A319961K0072K1155K2231K3534K4710K4768K3858K3409K3588K2491J9084
60696A568861J5210J3191J2864J2583J1884J1391J0938R706P879O630O469O699
60684A694305O538N874M969M056L190K098M24j482k567k417k173l369o006q423
60670A695017r031p854o394o243p718r673j0695j0520j0149j0696j2371j4333
$$ plain form
60658 1579340 1564109 1549980 1538521 1529691 1522409 1516312 1512220 1510532 1510043 1509230 1508199 1508461 1511018 1515406
60644 1515406 1520375 1524583 1526688 1525797 1522303 1517686 1513079 1508372 1503028 1497421 1492836 1490175 1489010 1488138
60630 1488138 1486896 1485536 1484284 1482625 1479969 1476779 1474293 1473161 1472845 1472229 1470141 1465445 1457624 1447457
60616 1447457 1436194 1423752 1408744 1390706 1371188 1351966 1333192 1314195 1295097 1276448 1258066
60605 1258066 1239689 1222398 1208055 1197453 1190108 1185614 1183820 1183760 1183972 1184351 1186326 1190524 1195384 1199059
60591 1199059 1201861 1205723 1211604 1218465 1224754 1230002 1234715 1239357 1243802 1247465 1249717 1250430 1250387 1250882 1252487
60576 1252487 1254458 1255839 1257119 1260025 1265358 1271706 1276931 1280535 1283939 1288870 1296308 1306726 1320119
60563 1320119 1335468 1351125 1366249 1381424 1397754 1416081 1437237 1462011 1490207 1520410 1551399
$$ packed form
60658A579340j5231j4129j1459q830p282o097m092j688m89q13j031K62K557M388
60644A515406M969M208K105q91l494m617m607m707n344n607m585k661j165q72
60630A488138j242j360j252j659k656l190k486j132l16o16k088m696p821j0167
60616A447457j1263j2442j5008j8038j9518j9222j8774j8997j9098j8649j8382
60605A258066j8377j7291j4343j0602p345m494j794o0K12L79J975M198M860L675
60591A199059K802L862N881O861O289N248M713M642M445L663K252P13m3M95J605
60576A252487J971J381J280K906N333O348N225L604L404M931P438J0418J3393
60563A320119J5349J5657J5124J5175J6330J8327K1156K4774K8196L0203L0989
$$ plain form
60552 1551399 1583272 1616645 1651275 1686131 1720396 1753772 1786034 1816685 1844687 1868087 1884469
60541 1884469 1892431 1892430 1885838 1873605 1856263 1834607 1809642 1782121 1752692 1722201 1691412 1660835
60529 1660835 1631258 1603990 1580049 1559497 1541930 1527010 1514143 1502613 1492828 1486425 1483941 1483105
60517 1483105 1480907 1476975 1473436 1471554 1470147 1467580 1463871 1460139 1457145 1455236 1454961 1456721 1460070 1464125
60503 1464125 1468627 1474123 1481034 1488996 1497520 1507208 1519757 1536170 1555214 1574481 1593089 1612351
60491 1612351 1633407 1655364 1676700 1697582 1719469 1743014 1767821 1793978 1822270 1852752 1884572
60480 1884572 1917720 1953802 1994461 2039744 2088286 2138028 2186168 2229378 2265050 2292082 2310021
60469 2310021 2318070 2315572 2303186 2283115 2258346 2231741 2205260 2179667 2155501 2134514 2119362 2111227
$$ packed form
60552A551399L1873L3373L4630L4856L4265L3376L2262L0651K8002K3400J6382
60541A884469P962jo592j2233j7342k1656k4965k7521k9429l0491l0789l0577
60529A660835k9577k7268k3941k0552j7567j4920j2867j1530r785o403k484q36
60517A483105k198l932l539j882j407k567l709l732k994j909k75J760L349M055
60503A464125M502N496O911P962Q524R688J2549J6413J9044J9267J8608J9262
60491A612351K1056K1957K1336K0882K1887K3545K4807K6157K8292L0482L1820
60480A884572L3148L6082M0659M5283M8542M9742M8140M3210L5672K7032J7939
60469B310021Q049k498j2386k0071k4769k6605k6481k5593k4166k0987j5152q135
$$ plain form
60457 2111227 2108452 2108446 2110661 2116890 2128815 2146186 2167450 2191314 2217337 2245645 2276642 2310886 2349047
60444 2349047 2392098 2441543 2498978 2565290 2640752 2726319 2824356 2937466 3066864 3212705 3375937
60433 3375937 3558810 3763081 3988555 4234113 4499632 4786211 5095209 5428189 5787439
60424 5787439 6174791 6588895 7023511 7467308 7903193 8307204 8650364 8904666 9049232
60415 9049232 9072669 8972892 8757430 8443447 8054638 7615773 7148878 6672568 6202210 5749177
60405 5749177 5320397 4919518 4548748 4209792 3903636 3629824 3385964 3168205 2972782
60396 2972782 2797295 2640262 2499806 2373513 2259652 2157609 2066617 1984699 1909626 1840648
60386 1840648 1778475 1723320 1673569 1626807 1581868 1539354 1500337 1465210 1433872 1406115 1381214
$$ packed form
60457B111227k775oK215O229J1925J7371K1264K3864K6023K8308L0997L4244L8161
60444B349047M3051M9445N7435O6312P5462Q5567R8037J13110J29398J45841J63232
60433C375937J82873K04271K25474K45558K65519K86579L08998L32980L59250
60424E787439L87352M14104M34616M43797M35885M04011L43160K54302J44566
60415I049232K3437r9777k15462l13983l88809m38865m66895m76310m70358m53033
60405E749177m28780m00879l70770l38956l06156k73812k43860k17759j95423
60396B972782j75487j57033j40456j26293j13861j02043r0992q1918p5073o8978
60386A840648o2173n5155m9751m6762m4939m2514l9017l5127l1338k7757k4901
$$ plain form
60375 1381214 1357875 1335520 1315172 1297917 1282758 1267349 1251011 1235580 1222796 1212123 1201897
60364 1201897 1191419 1180942 1170678 1161051 1153180 1147820 1144178 1140795 1137205 1133893 1131243 1129626 1129903
60351 1129903 1132480 1136194 1139420 1142127 1145588 1150338 1155776 1161679 1168545 1176294 1184006 1191276 1198483 1205476
60337 1205476 1211477 1216910 1223849 1233643 1245049 1255639 1264301 1271608 1278598 1286127 1294739 1304116 1313018
60324 1313018 1320599 1327382 1334072 1339846 1342858 1342409 1339762 1336767 1334471 1333137 1332704 1332736 1332569 1332091 1332042 1332958
60308 1332958 1334051 1333938 1332570 1331639 1332583 1334812 1336734 1338137 1340531 1345133 1351665 1359466 1368571 1378944
60294 1378944 1389683 1400138 1411107 1423681 1437321 1450377 1462392 1474558 1487852 1501904 1515947
60283 1515947 1529648 1542567 1553928 1563681 1572989 1582738 1591962 1598401 1600505 1598582 1594342 1589804 1586441
$$ packed form
60375A381214k3339k2355k0348j7255j5159j5409j6338j5431j2784j0673j0226
60364A201897j0478j0477j0264r627p871n360l642l383l590l312k650j617K77
60351A129903K577L714L226K707L461M750N438N903O866P749P712P270P207O993
60337A205476O001N433O939R794J1406J0590Q662P307O990P529Q612R377Q902
60324A313018P581O783O690N774L012m49k647k995k296j334m33L2j67m78m9R16
60308A332958J093j13j368r31R44K229J922J403K394M602O532P801R105J0373
60294A378944J0739J0455J0969J2574J3640J3056J2015J2166J3294J4052J4043
60283A515947J3701J2919J1361R753R308R749R224O439K104j923m240m538l363
$$ plain form
60270 1586441 1584872 1585015 1586361 1588130 1589682 1591287 1594052 1598313 1602283 1603277 1600482 1595654 1590809 1586055
60256 1586055 1580113 1572227 1562845 1552846 1542791 1532906 1523389 1514618 1506940 1500175 1493608 1486940 1480849 1475943
60242 1475943 1471460 1466276 1461239 1459124 1461477 1466507 1470986 1473475 1474745 1475718 1476369 1476510 1476388 1476112 1475367
60227 1475367 1474121 1473050 1472778 1473058 1473234 1473307 1474053 1476098 1479393 1483931 1490584 1500588 1513947 1528761 1542612
60212 1542612 1554672 1566270 1579375 1594715 1611363 1627962 1644146 1660634 1678072 1696162 1714267
60201 1714267 1732562 1751988 1773122 1795820 1820139 1846862 1876677 1909474 1945045 1983999 2027380
60190 2027380 2075707 2128891 2186901 2250115 2319276 2395374 2479158 2570616 2669580 2776983 2894514
60179 2894514 3022486 3159153 3302895 3453871 3612377 3776756 3944562 4115045 4288496
$$ packed form
60270A586441j569J43J346J769J552J605K765M261L970R94k795m828m845m754
60256A586055n942p886r382r999j0055r885r517q771p678o765o567o668o091m906
60242A475943m483n184n037k115K353N030M479K489J270R73O51J41j22k76p45
60227A475367j246j071k72K80J76P3P46K045L295M538O653J0004J3359J4814J3851
60212A542612J2060J1598J3105J5340J6648J6599J6184J6488J7438J8090J8105
60201A714267J8295J9426K1134K2698K4319K6723K9815L2797L5571L8954M3381
60190B027380M8327N3184N8010O3214O9161P6098Q3784R1458R8964J07403J17531
60179B894514J27972J36667J43742J50976J58506J64379J67806J70483J73451
$$ plain form
60170 4288496 4463293 4635191 4799621 4953461 5094815 5222565 5336163 5434425 5514560 5573938
60160 5573938 5612923 5634496 5641078 5633356 5612319 5580576 5541146 5496728 5450814 5407629 5369952 5338418
60148 5338418 5313969 5299563 5298381 5311727 5339960 5384214 5445621 5523625 5616555 5723397 5843818
60137 5843818 5976946 6121275 6275412 6437692 6605030 6772820 6935904 7089259 7228333
60128 7228333 7349529 7450398 7529218 7584854 7617166 7626703 7613574 7577379 7518677 7439739 7343457
60117 7343457 7232723 7111648 6986254 6862737 6745511 6637693 6542529 6463011 6400520 6355036
60107 6355036 6326693 6316559 6326245 6357282 6410191 6483282 6572635 6673841 6783354 6897825 7013212
60096 7013212 7125563 7231963 7329716 7415377 7485925 7540672 7580983 7608393 7624004 7629493 7627640
$$ packed form
60170D288496J74797J71898J64430J53840J41354J27750J13598R8262Q0135N9378
60160E573938L8985K1573O582p722k1037l1743l9430m4418m5914m3185l7677l1534
60148E338418k4449j4406j182J3346K8233M4254O1407P8004R2930J06842J20421
60137E843818J33128J44329J54137J62280J67338J67790J63084J53355J39074
60128G228333J21196J00869P8820N5636L2312R537j3129l6195n8702p8938r6282
60117G343457j10734j21075j25394j23517j17226j07818r5164p9518o2491m5484
60107F355036k8343j0134R686L1037N2909P3091Q9353J01206J09513J14471J15387
60096G013212J12351J06400R7753Q5661P0548N4747M0311K7410J5611N489j853
$$ plain form
60085 7627640 7621808 7615556 7612637 7616724 7631132 7659106 7703855 7767857 7852657 7959872 8091667 8249579
60073 8249579 8433699 8644027 8882034 9149939 9449017 9779558 10141678 10534856 10957065
60064 10957065 11405650 11878747 12374478 12888732 13414761 13944710 14470431 14982982 15472825
60055 15472825 15930962 16349260 16719804 17034947 17288116 17474016 17588456 17629065 17596019 17491018
60045 17491018 17315680 17072192 16765793 16405774 16003881 15572382 15123312 14668166 14217600
60036 14217600 13781529 13368971 12986834 12639167 12328657 12058584 11832211 11650667 11513080
60027 11513080 11418664 11366751 11354274 11374991 11422207 11490920 11576260 11671114 11766807 11855689 11932041
60016 11932041 11991083 12028560 12041590 12029101 11991107 11927864 11839765 11727709 11593180 11437764
$$ packed form
60085G627640n832o252k919M087J4408K7974M4749O4002Q4800J07215J31795J57912
60073H249579J84120K10328K38007K67905K99078L30541L62120L93178M22209
60064A0957065M48585M73097M95731N14254N26029N29949N25721N12551M89843
60055A5472825M58137M18298L70544L15143K53169J85900J14440M0609l3046j05001
60045A7491018j75338k43488l06399l60019m01893m31499m49070m55146m50566
60036A4217600m36071m12558l82137l47667l10510k70073k26373j81544j37587
60027A1513080r4416n1913j2477K0717M7216O8713Q5340R4854R5693Q8882P6352
60016A1932041N9042L7477J3030j2489l7994o3243q8099j12056j34529j55416
$$ plain form
60006 11437764 11262497 11067957 10855401 10627710 10389000 10143595 9895728 9649620 9408825
59997 9408825 9175558 8951669 8740389 8546249 8373062 8222824 8096616 7995427 7919557 7868330
59987 7868330 7841356 7839474 7863562 7912771 7984765 8077594 8190684 8323771 8475072 8640289 8813078
59976 8813078 8986470 9154082 9310292 9449900 9568312 9661934 9727724 9762424 9763298 9730008 9664831
59965 9664831 9570441 9448304 9300172 9130391 8945314 8750556 8550080 8348137 8150563 7963137
59955 7963137 7789410 7631228 7490921 7371666 7275695 7203439 7154952 7131162 7133055 7160611 7213613
59944 7213613 7292935 7399777 7533955 7694079 7879061 8087775 8317077 8561719 8816606 9077516
59934 9077516 9338825 9592306 9829695 10045402 10235404 10394748 10518210 10602957 10648713 10655353
$$ packed form
60006A1437764j75267j94540k12556k27691k38710k45405k47867k46108k40795
59997I408825k33267k23889k11280j94140j73187j50238j26208j01189p5870n1227
59987G868330k6974j882K4088M9209P1994R2829J13090J33087J51301J65217J72789
59976H813078J73392J67612J56210J39608J18412R3622O5790L4700Q74l3290o5177
59965I664831r4390j22137j48132j69781j85077j94758k00476k01943j97574j87426
59955G963137j73727j58182j40307j19255r5971p2256m8487k3790J893K7556N3002
59944G213613P9322J06842J34178J60124J84982K08714K29302K44642K54887K60910
59934I077516K61309K53481K37389K15707J90002J59344J23462Q4747M5756O640
$$ plain form
59924 10655353 10622069 10549172 10439321 10296599 10125700 9932598 9725067 9511823 9301272 9100721
59914 9100721 8915591 8749080 8603239 8480539 8383776 8314761 8274119 8262298 8279445 8324058
59904 8324058 8393049 8483720 8594721 8724582 8870297 9028022 9194270 9365651 9538141 9707514
59894 9707514 9870355 10024308 10167852 10300267 10421363 10530816 10628114 10713455 10788260 10854683
59884 10854683 10915298 10973635 11034396 11102704 11183652 11282728 11405666 11557039 11739546 11955290
59874 11955290 12207118 12497862 12828819 13199937 13610995 14061136 14546831 15061073 15594616
59865 15594616 16136742 16674004 17189081 17662391 18075367 18412082 18658515 18802433 18835929
59856 18835929 18758281 18575723 18298542 17939146 17512380 17035511 16526043 15999419 15468984
$$ packed form
59924A0655353l3284p2897j09851j42722j70899j93102k07531k13244k10551k00551
59914I100721j85130j66511j45841j22700r6763o9015m0642j1821J7147M4613
59904H324058O8991R0671J11001J29861J45715J57725J66248J71381J72490J69373
59894I707514J62841J53953J43544J32415J21096J09453R7298Q5341P4805O6423
59884A0854683O0615N8337O0761O8308Q0948R9076J22938J51373J82507K15744
59874A1955290K51828K90744L30957L71118M11058M50141M85695N14242N33543
59865A5594616N42126N37262N15077M73310M12976L36715K46433J43918L3496
59856A8835929p7648j82558k77181l59396m26766m76869n09468n26624n30435
$$ plain form
59847 15468984 14947010 14444338 13969237 13527669 13124670 12764572 12449946 12181475 11959261
59838 11959261 11783821 11655713 11574800 11539967 11548965 11598412 11684406 11803138 11950509 12121314
59828 12121314 12309223 12507112 12706414 12896356 13064878 13200639 13293707 13334978 13316705 13234495
59818 13234495 13088250 12881029 12617831 12305656 11953506 11571225 11168191 10752926 10333095
59809 10333095 9915376 9505678 9109426 8731019 8373007 8036625 7723240 7434466 7170904
59800 7170904 6931939 6717150 6526905 6361057 6217946 6095168 5990542 5901933 5827096 5764308
59790 5764308 5712205 5668327 5628683 5589695 5550086 5510321 5471063 5432966 5397153 5364586 5335090
59779 5335090 5307751 5281912 5256906 5231064 5201966 5167888 5128391 5083477 5032889 4976690 4916432
$$ packed form
59847A5468984n21974n02672m75101m41568m02999l60098l14626k68471k22214
59838A1959261j75440j28108q0913l4833Q998M9447Q5994J18732J47371J70805
59828A2121314J87909J97889J99302J89942J68522J35761R3068M1271j8273q2210
59818A3234495j46245k07221k63198l12175l52150l82281m03034m15265m19831
59809A0333095m17719m09698l96252l78407l58012l36382l13385k88774k63562
59800G170904k38965k14789j90245j65848j43111j22778j04626q8609p4837o2788
59790E764308n2103m3878l9644l8988l9609l9765l9258l8097l5813l2567k9496
59779E335090k7339k5839k5006k5842k9098l4078l9497m4914n0588n6199o0258
$$ plain form
59768 4916432 4855397 4797210 4743701 4693971 4645846 4598266 4552187 4509661 4472916 4444071 4424482
59757 4424482 4413843 4410596 4413447 4421801 4434784 4451205 4471141 4496502 4529326 4570389 4619955 4678571
59745 4678571 4746006 4820421 4899801 4983482 5070986 5160122 5247746 5332045 5412591 5488274 5556788
59734 5556788 5616568 5668190 5713557 5754700 5793695 5832714 5873360 5916433 5962924 6015106 6076436
59723 6076436 6150606 6240784 6349344 6477901 6627489 6798786 6992490 7210058 7454327 7728910
59713 7728910 8036549 8378267 8754322 9165321 9611524 10090832 10597075 11118602 11636723
59704 11636723 12125347 12553861 12892750 13119342 13221921 13201867 13072949 12857176 12578977
59695 12578977 12261010 11922788 11580590 11247324 10932672 10643801 10385982 10162744 9976108
$$ packed form
59768D916432o1035n8187n3509m9730m8125m7580m6079m2526l6745k8845j9589
59757D424482j0639l247K851Q354J2983J6421J9936K5361L2824M1063M9566N8616
59745D678571O7435P4415P9380Q3681Q7504Q9136Q7624Q4299Q0546P5683O8514
59734E556788N9780N1622M5367M1143L8995L9019M0646M3073M6491N2182O1330
59723F076436P4170R0178J08560J28557J49588J71297J93704K17568K44269K74583
59713G728910L07639L41718L76055M10999M46203M79308N06243N21527N18121
59704A1636723M88624M28514L38889K26592J02579k0054j28918k15773k78199
59695A2578977l17967l38222l42198l33266l14652k88871k57819k23238j86636
$$ plain form
59686 9976108 9827037 9715557 9640621 9600458 9593445 9618573 9675299 9763327 9882507 10032341 10211455
59675 10211455 10418129 10651833 10914078 11207604 11534984 11898145 12298789 12738667 13219460
59666 13219460 13742786 14310430 14924317 15586143 16297240 17058996 17873143 18741120 19662794
59657 19662794 20635676 21655035 22714120 23803835 24912459 26026311 27131250 28214290
59649 28214290 29265092 30277278 31248892 32181655 33079926 33950274 34800912 35639889 36472859
59640 36472859 37302147 38126763 38941672 39736542 40496149 41202930 41839515 42389867 42840232
59631 42840232 43180835 43407208 43520255 43526073 43436255 43267448 43039275 42772137 42486456 42202629
59621 42202629 41940323 41717598 41550945 41455661 41445258 41530346 41718376 42014547 42422855 42946432
$$ packed form
59686I976108j49071j11480p4936m0163p013K5128N6726Q8028J19180J49834J79114
59675A0211455K06674K33704K62245K93526L27380L63161M00644M39878M80793
59666A3219460N23326N67644O13887O61826P11097P61756Q14147Q67977R21674
59657A9662794R72882J019359J059085J089715J108624J113852J104939J083040
59649B8214290J050802J012186R71614R32763Q98271Q70348Q50638Q38977Q32970
59640C6472859Q29288Q24616Q14909P94870P59607P06781O36585N50352M50365
59631D2840232L40603K26373J13047N818q9818j68807k28173k67138k85681k83827
59621D2202629k62306k22725j66653r5284j0403Q5088J88030K96171M08308N23577
$$ plain form
59611 42946432 43586919 44343032 45209192 46175076 47225565 48339778 49489461 50638644 51745122
59602 51745122 52762181 53639907 54327692 54778812 54955528 54833234 54403865 53678005 52683468
59593 52683468 51460085 50054116 48514839 46891726 45230361 43569230 41939853 40368169
59585 40368169 38873557 37466340 36147527 34910787 33743107 32623606 31524594 30417421
59577 30417421 29280179 28102686 26887163 25645662 24395855 23156767 21945988 20778533
59569 20778533 19666160 18616597 17633516 16717804 15869259 15087423 14371153 13717592 13121881
59560 13121881 12578575 12083697 11634991 11229836 10863734 10531834 10231412 9961521 9720126
59551 9720126 9502914 9305368 9124966 8960394 8809219 8667278 8530298 8395421 8261116
$$ packed form
59611D2946432O40487P56113Q66160R65884J050489J114213J149683J149183J106478
59602E1745122J017059Q77726O87785M51120J76716j22294m29369p25860r94537
59593E2683468j223383j405969j539277j623113j661365j661131j629377j571684
59585D0368169j494612j407217j318813j236740j167680j119501j099012j107173
59577C0417421j137242j177493j215523j241501j249807j239088j210779j167455
59569B0778533j112373j049563r83081r15712q48545p81836p16270o53561n95711
59560A3121881n43306m94878m48706m05155l66102l31900l00422k69891k41395
59551I720126k17212j97546j80402j64572j51175j41941j36980j34877j34305
$$ plain form
59542 8261116 8126142 7988932 7847945 7702535 7553459 7402408 7251008 7100368 6951580
59533 6951580 6806281 6666382 6533269 6407605 6290085 6182216 6086026 6002768 5931980 5871939
59523 5871939 5821142 5779332 5747176 5725186 5713070 5710022 5715397 5728870 5749914 5777477 5810615 5849332
59511 5849332 5894182 5944865 5999867 6057923 6119258 6184764 6254550 6328264 6406530 6490957 6582834
59500 6582834 6682871 6792303 6912975 7045860 7190556 7347054 7517248 7703947 7908860
59491 7908860 8132300 8374470 8636179 8918296 9221019 9543854 9886050 10246831 10625004
59482 10625004 11018143 11422301 11832671 12244228 12651547 13048843 13431081 13794511 14134899
59473 14134899 14445729 14719968 14953935 15148272 15305072 15425789 15512427 15568791 15599206 15607164
$$ packed form
59542H261116j34974j37210j40987j45410j49076j51051j51400j50640j48788
59533F951580j45299j39899j33113j25664j17520j07869r6190q3258p0788o0041
59523E871939n0797m1810l2156k1990j2116l048N375J3473K1044K7563L3138L8717
59511E849332M4850N0683N5002N8056O1335O5506O9786P3714P8266Q4427R1877
59500F582834J00037J09432J20672J32885J44696J56498J70194J86699K04913
59491G908860K23440K42170K61709K82117L02723L22835L42196L60781L78173
59482A0625004L93139M04158M10370M11557M07319L97296L82238L63430L40388
59473A4134899L10830K74239K33967J94337J56800J20717Q6638N6364L0415P958
$$ plain form
59463 15607164 15596427 15572425 15541461 15509458 15482631 15468480 15474685 15507285 15570597 15667829 15800297
59452 15800297 15966319 16161689 16380353 16613331 16847556 17067271 17256688 17400939 17485889
59443 17485889 17499412 17433530 17284697 17052472 16739208 16351026 15897948 15392766 14850076 14285499
59433 14285499 13714039 13148315 12598354 12072357 11576629 11115011 10689368 10300829 9950359
59424 9950359 9638825 9367167 9135729 8942490 8782921 8653107 8552706 8483602 8446254 8438891
59414 8438891 8459923 8509200 8586593 8690929 8820980 8976460 9157546 9364003 9594784 9847536
59404 9847536 10118345 10402643 10696144 10993900 11288542 11570646 11830877 12060941 12252692
59395 12252692 12397840 12489004 12520342 12487571 12389154 12228022 12010874 11745067 11437021 11093788
$$ packed form
59463A5607164j0737k4002l0964l2003k6827j4151O205L2600O3312R7232J32468
59452A5800297J66022J95370K18664K32978K34225K19715J89417J44251Q4950
59443A7485889J3523o5882j48833k32225l13264l88182m53078n05182n42690n64577
59433A4285499n71460n65724n49961n25997m95728m61618m25643l88539l50470
59424I950359l11534k71658k31438j93239j59569j29814j00401o9104l7348p363
59414H438891K1032M9277P7393J04336J30051J55480J81086K06457K30781K52752
59404I847536K70809K84298K93501K97756K94642K82104K60231K30064J91751
59395A2252692J45148R1164L1338l2771r8417j61132k17148k65807l08046l43233
$$ plain form
59385 11093788 10724562 10339276 9946058 9550714 9158107 8773203 8400801 8044629 7706783
59376 7706783 7388125 7089458 6812061 6556630 6322076 6106284 5908118 5727904 5565873
59367 5565873 5420888 5290982 5174660 5071376 4981113 4903637 4838110 4783530 4739575 4706492
59357 4706492 4684035 4671257 4667650 4673391 4687794 4708888 4735799 4770236 4813519 4862546 4910689 4952776
59345 4952776 4987897 5017991 5045935 5075265 5109461 5150384 5198614 5255861 5325393 5408958 5504152
59334 5504152 5605740 5709258 5813328 5919817 6032674 6156088 6293059 6445658 6616184
59325 6616184 6807201 7020595 7257714 7520486 7811432 8132542 8485196 8871277 9293406
59316 9293406 9754101 10255733 10801137 11392919 12031946 12717506 13448645 14223655 15037892
$$ packed form
59385A1093788l69226l85286l93218l95344l92607l84904l72402l56172l37846
59376G706783l18658k98667k77397k55431k34554k15792j98166j80214j62031
59367E565873j44985j29906j16322j03284r0263p7476o5527n4580m3955l3083
59357D706492k2457j2778l607N741J4403K1094K6911L4437M3283M9027M8143M2087
59345D952776L5121L0094K7944K9330L4196M0923M8230N7247O9532Q3565R5194
59334E504152J01588J03518J04070J06489J12857J23414J36971J52599J70526
59325F616184J91017K13394K37119K62772K90946L21110L52654L86081M22129
59316I293406M60695N01632N45404N91782O39027O85560P31139P75010Q14237
$$ plain form
59307 15037892 15883166 16749091 17623536 18492054 19339265 20151972 20920177 21635627 22291830
59298 22291830 22886186 23419902 23894618 24310641 24668979 24972484 25222961 25418439 25554644
59289 25554644 25627602 25633019 25564510 25414857 25179114 24855619 24445163 23951077 23379875 22740315
59279 22740315 22041902 21294993 20511466 19703410 18880926 18052215 17225701 16410866 15616706
59270 15616706 14850051 14115579 13416859 12757021 12138568 11562755 11029344 10537272 10085387
59261 10085387 9672310 9296123 8955052 8648199 8374521 8131306 7915030 7723770 7557261
59252 7557261 7414220 7291147 7184436 7092300 7014043 6949041 6897502 6860765 6839419 6831958 6836437
59241 6836437 6852686 6881903 6924838 6981299 7050616 7131492 7222109 7321441 7430059 7548861 7677546
$$ packed form
59307A5037892Q45274Q65925Q74445Q68518Q47211Q12707P68205P15450O56203
59298B2291830N94356N33716M74716M16023L58338L03505K50477J95478J36205
59289B5554644P2958N417o8509j49653k35743l23495m10456m94086n71202o39560
59279B2740315o98413p46909p83527q08056q22484q28711q26514q14835p94160
59270A5616706p66655p34472o98720o59838o18453n75813n33411m92072m51885
59261A0085387m13077l76187l41071l06853k73678k43215k16276j91260j66509
59252G557261j43041j23073j06711r2136p8257o5002n1539l6737k1346p461M479
59241F836437J6249K9217M2935N6461O9317Q0876R0617R9332J08618J18802J28685
$$ plain form
59230 7677546 7814843 7959380 8109565 8263490 8419719 8577391 8734910 8889558 9039322
59221 9039322 9184221 9325148 9462587 9597419 9731631 9866706 10001967 10135493 10265724
59212 10265724 10390999 10508645 10616218 10713060 10799318 10873954 10934848 10979919 11006568 11010665 10987972
59201 10987972 10936790 10858340 10755093 10629931 10486440 10328494 10159600 9983588 9805487 9630624
59191 9630624 9463227 9306862 9165339 9041562 8935954 8847672 8777210 8726220 8694905 8681302
59181 8681302 8683420 8700632 8732571 8777919 8834871 8901800 8976885 9057725 9141836 9227438 9313940
59170 9313940 9402069 9493283 9588585 9688373 9794029 9908968 10037227 10181720 10345024 10531239
59160 10531239 10745477 10991457 11270696 11583797 11931070 12311621 12722709 13159772 13615521
$$ packed form
59230G677546J37297J44537J50185J53925J56229J57672J57519J54648J49764
59221I039322J44899J40927J37439J34832J34212J35075J35261J33526J30231
59212A0265724J25275J17646J07573R6842Q6258P4636O0894M5071K6649M097k2693
59201A0987972n1182p8450j03247j25162j43491j57946j68894j76012j78101j74863
59191I630624j67397j56365j41523j23777j05608q8282p0462n0990l1315j3603
59181H681302K118J7212L1939M5348N6952O6929P5085Q0840Q4111Q5602Q6502
59170I313940Q8129R1214R5302R9788J05656J14939J28259J44493J63304J86215
59160A0531239K14238K45980K79239L13101L47273L80551M11088M37063M55749
$$ plain form
59151 13615521 14078518 14533531 14963695 15351856 15680424 15932071 16092230 16151179 16104135 15950536
59141 15950536 15693745 15340817 14901954 14390287 13821834 13214401 12585287 11949414 11319006
59132 11319006 10704183 10113349 9552984 9027025 8536607 8080999 7659378 7271540 6916911
59123 6916911 6593618 6299081 6030946 5786900 5564332 5361138 5176485 5009901 4859839
59114 4859839 4723868 4599940 4486699 4382963 4287930 4201831 4125535 4059356 4002694 3954655
59104 3954655 3914490 3881657 3855919 3837150 3824703 3817489 3815298 3819547 3832036 3853223 3882148 3917502
59092 3917502 3958296 4004071 4055159 4112251 4175340 4243753 4317565 4397852 4484934 4577634 4675304
59081 4675304 4779222 4890540 5007898 5128754 5252402 5379996 5512043 5647455 5784713
$$ packed form
59151A3615521M62997M55013M30164L88161L28568K51647J60159N8949m7044j53599
59141A5950536k56791l52928m38863n11667n68453o07433o29114o35873o30408
59132A1319006o14823n90834n60365n25959m90418m55608m21621l87838l54629
59123F916911l23293k94537k68135k44046k22568k03194j84653j66584j50062
59114D859839j35971j23928j13241j03736r5033q6099p6296o6179n6662m8039
59104C954655m0165l2833k5738j8769j2447p214k191M249J2489K1187K8925L5354
59092C917502M0794M5775N1088N7092O3089O8413P3812Q0287Q7082R2700R7670
59081D675304J03918J11318J17358J20856J23648J27594J32047J35412J37258
$$ plain form
59072 5784713 5922445 6059013 6192789 6322578 6446672 6562144 6666632 6760393 6845215 6921762
59062 6921762 6989565 7048961 7101083 7146283 7184718 7218580 7251722 7286794 7324539 7366138 7414187
59051 7414187 7470852 7536950 7613602 7702979 7806490 7923861 8055085 8201806 8365490 8545372
59041 8545372 8739549 8947246 9168586 9402382 9645104 9891601 10135735 10370274 10587009
59032 10587009 10777584 10934484 11051475 11123509 11146856 11120328 11046809 10932593 10784212 10606380
59022 10606380 10403717 10183292 9953360 9719595 9484273 9249172 9017085 8789486 8564393
59013 8564393 8338263 8109578 7879676 7650557 7422888 7196055 6969397 6743147 6518411
59004 6518411 6296521 6078606 5865810 5659380 5460075 5267780 5082248 4904024 4734243
$$ packed form
59072E784713J37732J36568J33776J29789J24094J15472J04488R3761Q4822P6547
59062F921762O7803N9396N2122M5200L8435L3862L3142L5072L7745M1599M8049
59051G414187N6665O6098P6652Q9377J03511J17371J31224J46721J63684J79882
59041H545372J94177K07697K21340K33796K42722K46497K44134K34539K16735
59032A0587009J90575J56900J16991P2034K3347k6528p3519j14216j48381j77832
59022A0606380k02663k20425k29932k33765k35322k35101k32087k27599k25093
59013H564393k26130k28685k29902k29119k27669k26833k26658k26250k24736
59004F518411k21890k17915k12796k06430j99305j92295j85532j78224j69781
$$ plain form
58995 4734243 4573821 4423229 4282509 4150922 4027160 3910623 3801966 3701684 3608873 3522233
58985 3522233 3441456 3366419 3295702 3227435 3161192 3097656 3036736 2977513 2919820 2864269 2810710
58974 2810710 2758265 2707057 2658526 2613706 2572417 2534395 2500007 2469515 2442687 2419422 2399892
58963 2399892 2383880 2370799 2360363 2352386 2346153 2340952 2336940 2334276 2331704 2327442 2321584 2316398 2314063
58950 2314063 2314984 2318111 2321707 2323999 2324396 2324180 2325090 2327512 2330989 2335686 2341835 2348315 2353591 2357637 2361325
58935 2361325 2364509 2366811 2369677 2375220 2383117 2391169 2398953 2408205 2419299 2430278 2440313 2451476 2465703
58922 2465703 2482190 2499166 2516301 2533992 2552083 2570750 2591157 2613916 2638234 2663541 2690443
58911 2690443 2718993 2747761 2776041 2805565 2838553 2875170 2914046 2954125 2994784 3035415 3076234
$$ packed form
58995D734243j60422j50592j40720j31587j23762j16537j08657j00282r2811q6640
58985C522233q0777p5037p0717o8267o6243o3536o0920n9223n7693n5551n3559
58974B810710n2445n1208m8531m4820m1289l8022l4388l0492k6828k3265j9530
58963B399892j6012j3081j0436p977o233n201m012k664k572m262n858n186k335
58950B314063R21L127L596K292L97k16R10K422L477M697O149O480N276M046L688
58935B361325L184K302K866N543P897Q052P784R252J1094J0979J0035J1163J4227
58922B465703J6487J6976J7135J7691J8091J8667K0407K2759K4318K5307K6902
58911B690443K8550K8768K8280K9524L2988L6617L8876M0079M0659M0631M0819
$$ plain form
58900 3076234 3118573 3163250 3209552 3256674 3305012 3355125 3406769 3460167 3517004 3578769 3645056
58889 3645056 3714739 3787983 3865880 3948814 4036213 4127286 4221310 4318118 4419102 4526787 4642572
58878 4642572 4765834 4895929 5033853 5181030 5337658 5503509 5679596 5868029 6070791
58869 6070791 6289208 6523718 6773690 7038577 7319762 7620072 7941192 8283249 8647571
58860 8647571 9037852 9457463 9907419 10388269 10902260 11452217 12040017 12667832 13339120
58851 13339120 14056148 14817621 15620794 16464938 17350551 18275589 19234198 20218457 21219022
58842 21219022 22223539 23215315 24173554 25074391 25892738 26604685 27188546 27624274 27894368
58833 27894368 27987649 27902038 27643287 27222421 26655455 25963464 25170071 24298429 23370888 22409534
$$ packed form
58900C076234M2339M4677M6302M7122M8338N0113N1644N3398N6837O1765O6287
58889C645056O9683P3244P7897Q2934Q7399R1073R4024R6808J00984J07685J15785
58878D642572J23262J30095J37924J47177J56628J65851J76087J88433K02762
58869F070791K18417K34510K49972K64887K81185L00310L21120L42057L64322
58860H647571L90281M19611M49956M80850N13991N49957N87800O27815O71288
58851A3339120P17028P61473Q03173Q44144Q85613R25038R58609R84259J000565
58842B1219022J004517R91776R58239R00837Q18347P11947N83861M35728K70094
58833B7894368R3281q5611k58751m20866n66966o91991p93393q71642r27541r61354
$$ plain form
58823 22409534 21434532 20462148 19505545 18576413 17684002 16833485 16027355 15268043 14557478
58814 14557478 13894780 13276657 12700162 12163452 11663988 11197817 10761061 10350919 9965090
58805 9965090 9601336 9257863 8933436 8627330 8339813 8072066 7824522 7595594 7382976
58796 7382976 7185839 7005002 6841482 6695497 6565990 6450166 6344550 6247813 6161907 6089315
58786 6089315 6030085 5982665 5946402 5921481 5907441 5903905 5912307 5934763 5971069 6018417 6074302 6138575
58774 6138575 6212830 6299015 6398595 6511871 6638033 6776537 6928067 7093503 7272797 7465931
58764 7465931 7674194 7899235 8141608 8401588 8680780 8981573 9305653 9654380 10029794
58755 10029794 10433724 10866790 11330160 11827689 12364358 12942818 13563092 14225234 14930264
$$ packed form
58823B2409534r75002r72384r56603r29132q92411q50517q06130p59312p10565
58814A4557478o62698o18123n76495n36710m99464m66171m36756m10142l85829
58805I965090l63754l43473l24427l06106k87517k67747k47544k28928k12618
58796G382976j97137j80837j63520j45985j29507j15824j05616r6737q5906p2592
58786F089315n9230m7420l6263k4921j4040l536Q402K2456L6306M7348N5885O4273
58774F138575P4255Q6185R9580J13276J26162J38504J51530J65436J79294J93134
58764G465931K08263K25041K42373K59980K79192L00793L24080L48727L75414
58755A0029794M03930M33066M63370M97529N36669N78460O20274O62142P05030
$$ plain form
58746 14930264 15678677 16469882 17303017 18176100 19083664 20016410 20963122 21911133 22844348
58737 22844348 23742095 24580576 25335008 25981047 26496297 26861980 27063817 27092775 26946772
58728 26946772 26631805 26160528 25549839 24820065 23994475 23096720 22148090 21168037 20176119
58719 20176119 19190682 18225070 17286824 16381000 15512779 14686515 13904009 13164859 12467880
58710 12467880 11811839 11195671 10618414 10078605 9573876 9101823 8661020 8250493 7868486
58701 7868486 7512493 7180132 6869307 6578182 6305870 6052350 5816777 5596777 5390657
58692 5390657 5199171 5023418 4861918 4711683 4571519 4442159 4323450 4213629 4111404
58683 4111404 4016713 3929074 3846924 3769068 3695460 3626317 3561622 3501445 3445467 3392277 3340524
$$ packed form
58746A4930264P48413P91205Q33135Q73083R07564R32746R46712R48011R33215
58737B2844348Q97747Q38481P54432O46039N15250L65683K01837K8958j46003
58728B6946772l14967m71277o10689p29774q25590q97755r48630r80053r91918
58719B0176119r85437r65612r38246r05824q68221q26264p82506p39150o96979
58710A2467880o56041o16168n77257n39809n04729m72053m40803m10527l82007
58701G868486l55993l32361l10825k91125k72312k53520k35573k20000k06120
58692E390657j91486j75753j61500j50235j40164j29360j18709j09821j02225
58683D111404r4691q7639q2150p7856p3608o9143o4695o0177n5978n3190n1753
$$ plain form
58672 3340524 3290669 3244191 3201221 3160390 3120826 3082712 3045936 3009728 2973618 2937254 2899407
58661 2899407 2858784 2815837 2772119 2727839 2681721 2633380 2584065 2534703 2484866 2434152 2383149
58650 2383149 2332427 2281705 2230519 2178972 2127762 2078213 2031953 1989564 1950009 1912476 1878079
58639 1878079 1848242 1822132 1797521 1773573 1750718 1728164 1703889 1677210 1649270 1620884 1591905
58628 1591905 1562928 1535472 1510078 1486090 1463583 1443473 1425402 1407695 1390144 1374874 1363646
58617 1363646 1355974 1350594 1347143 1345605 1345608 1347114 1350671 1356509 1364534 1375277 1389178 1404708 1418925 1430382
58603 1430382 1439891 1448067 1454012 1457054 1457973 1457585 1455511 1451104 1444357 1435441 1424683 1413411 1403409 1395224
58589 1395224 1388530 1384281 1384495 1389368 1396635 1404674 1414469 1427523 1443591 1461710 1482043 1505384 1531841
$$ packed form
58672C340524m9855m6478m2970m0831l9564l8114l6776l6208l6110l6364l7847
58661B899407m0623m2947m3718m4280m6118m8341m9315m9362m9837n0714n1003
58650B383149n0722n0722n1186n1547n1210m9549m6260m2389l9555l7533l4397
58639A878079k9837k6110k4611k3948k2855k2554k4275k6679k7940k8386k8979
58628A591905k8977k7456k5394k3988k2507k0110j8071j7707j7551j5270j1228
58617A363646p672n380l451j538LJ506L557N838Q025J0743J3901J5530J4217J1457
58603A430382R509Q176N945L042R19l88k074m407o747q916j0758j1272j0002q185
58589A395224o694m249K14M873P267Q039R795J3054J6068J8119K0333K3341K6457
$$ plain form
58576 1531841 1561065 1592999 1627653 1664899 1704940 1748085 1793802 1841306 1891473 1946826 2008881
58565 2008881 2076519 2147629 2221449 2298984 2382098 2472639 2571720 2679632 2796931 2925012 3064657
58554 3064657 3214986 3375527 3548486 3736778 3940413 4157379 4387729 4633550 4894225
58545 4894225 5164683 5439570 5716631 5994246 6267338 6526985 6762609 6963488 7119946
58536 7119946 7225045 7275101 7268742 7206865 7093694 6936151 6741580 6517246 6271656 6013917
58526 6013917 5751080 5487894 5229331 4980888 4745672 4523596 4314535 4120249 3942243
58517 3942243 3779939 3632299 3499353 3380911 3275519 3181996 3100340 3029809 2967589 2910577
58507 2910577 2857311 2807278 2759684 2713779 2669166 2625177 2581211 2537974 2496784 2457371 2418132
$$ packed form
58576A531841K9224L1934L4654L7246M0041M3145M5717M7504N0167N5353O2055
58565B008881O7638P1110P3820P7535Q3114R0541R9081J07912J17299J28081J39645
58554C064657J50329J60541J72959J88292K03635K16966K30350K45821K60675
58545D894225K70458K74887K77061K77615K73092K59647K35624K00879J56458
58536G119946J05099N0056o359o1877j13171j57543j94571k24334k45590k57739
58526F013917k62837k63186k58563k48443k35216k22076k09061j94286j78006
58517C942243j62304j47640j32946j18442j05392r3523q1656p0531o2220n7012
58507B910577n3266n0033m7594m5905m4613m3989m3966m3237m1190l9413l9239
$$ plain form
58496 2418132 2378735 2340349 2303092 2265637 2227860 2191334 2156402 2121242 2084685 2047485 2009886
58485 2009886 1970620 1929468 1888201 1847712 1806793 1765131 1724859 1687514 1651998 1617373 1585229
58474 1585229 1557368 1533197 1511190 1490797 1471276 1451006 1429928 1410554 1394541 1380208 1365287
58463 1365287 1350066 1335917 1322797 1310265 1298939 1288859 1278324 1266497 1255288 1246598 1239622 1233070
58451 1233070 1228064 1226352 1227276 1228927 1230833 1233237 1235179 1235726 1235864 1237017 1238761 1239835 1239929 1238641 1234489
58436 1234489 1227202 1219412 1213575 1208556 1201659 1192809 1184212 1176800 1169543 1161697 1153575 1145393 1137043 1128669
58422 1128669 1120250 1111366 1102337 1094531 1088597 1083656 1079123 1075621 1073147 1070300 1066564 1063301 1061185 1058739
58408 1058739 1054774 1050017 1044952 1038600 1031055 1024519 1019916 1015204 1009113 1003646 1000499 997924 994004 990244
$$ packed form
58496B418132l9397l8386l7257l7455l7777l6526l4932l5160l6557l7200l7599
58485B009886l9266m1152m1267m0489m0919m1662m0272l7345l5516l4625l2144
58474A585229k7861k4171k2007k0393j9521k0270k1078j9374j6013j4333j4921
58463A365287j5221j4149j3120j2532j1326j0080j0535j1827j1209q690o976o552
58451A233070n006j712R24J651J906K404J942N47J38J153J744J074R4j288m152
58436A234489p287p790n837n019o897q850q597p412p257p846q122q182q350q374
58422A128669q419q884r029p806n934m941m533l502k474k847l736l263k116k446
58408A058739l965m757n065o352p545o536m603m712o091n467l147k575l920l760
$$ plain form
58394 990244 988780 988600 987841 987522 989539 993061 996356 1000210 1006089 1012899 1019265 1027235 1039722 1055605
58380 1055605 1071195 1085404 1099685 1113906 1126315 1137087 1148181 1159616 1168912 1174111 1174887 1171271
58368 1171271 1163828 1154456 1144571 1133373 1120080 1106549 1095208 1085808 1076928 1069157 1063888 1060436 1057196
58355 1057196 1054178 1051523 1047507 1041438 1036718 1037116 1041420 1045592 1048952 1054141 1061945 1070378 1078406 1086727
58341 1086727 1095198 1103107 1111639 1122569 1134816 1145632 1154753 1164110 1174085 1183536 1192953 1203945 1215881
58328 1215881 1226524 1235846 1245961 1257446 1268870 1279731 1290888 1302328 1313336 1324429 1336468
58317 1336468 1348549 1359360 1369458 1379499 1387784 1392881 1397089 1403420 1410336 1413445 1411668 1408003 1405017
58304 1405017 1403308 1403565 1406322 1410296 1414465 1420823 1431545 1444592 1456001 1465410 1475403 1486640 1497762
$$ packed form
58394I90244j464j80p59l19K017L522L295L854N879O810O366P970J2487J5883
58380A055605J5590J4209J4281J4221J2409J0772J1094J1435R296N199P76l616
58368A171271p443r372r885j1198j3293j3531j1341r400q880p771n269l452l240
58355A057196l018k655m016o069m720L98M304M172L360N189P804Q433Q028Q321
58341A086727Q471P909Q532J0930J2247J0816R121R357R975R451R417J0992J1936
58328A215881J0643R322J0115J1485J1424J0861J1157J1440J1008J1093J2039
58317A336468J2081J0811J0098J0041Q285N097M208O331O916L109j777l665k986
58304A405017j709K57K757L974M169O358J0722J3047J1409R409R993J1237J1122
$$ plain form
58291 1497762 1508876 1520737 1531490 1538657 1543483 1549025 1555139 1559837 1564284 1571389 1580532 1588830 1596707
58278 1596707 1606835 1618293 1627367 1633917 1641450 1650949 1660053 1668390 1678276 1689728 1700043 1708906 1719069
58265 1719069 1731513 1744648 1758510 1775065 1794189 1813989 1835052 1859665 1886926 1913450 1938650
58254 1938650 1964469 1990429 2014130 2036219 2059607 2084232 2107921 2131580 2157687 2184392 2207453
58243 2207453 2227618 2249873 2275758 2302867 2331392 2364071 2399743 2434185 2467587 2504073 2543589
58232 2543589 2581830 2618702 2659045 2703897 2748928 2793090 2841109 2895418 2952785 3010958 3071672
58221 3071672 3135146 3198405 3261130 3326853 3396862 3469199 3544565 3626319 3713683 3802046 3890820
58210 3890820 3983696 4080668 4177842 4275890 4380283 4492078 4607055 4725077 4851376 4987176
$$ packed form
58291A497762J1114J1861J0753P167M826N542O114M698M447P105R143Q298P877
58278A596707J0128J1458R074O550P533R499R104Q337R886J1452J0315Q863J0163
58265A719069J2444J3135J3862J6555J9124J9800K1063K4613K7261K6524K5200
58254A938650K5819K5960K3701K2089K3388K4625K3689K3659K6107K6705K3061
58243B207453K0165K2255K5885K7109K8525L2679L5672L4442L3402L6486L9516
58232B543589L8241L6872M0343M4852M5031M4162M8019N4309N7367N8173O0714
58221C071672O3474O3259O2725O5723P0009P2337P5366Q1754Q7364Q8363Q8774
58210C890820R2876R6972R7174R8048J04393J11795J14977J18022J26299J35800
$$ plain form
58200 4987176 5128164 5273837 5429214 5595701 5769720 5952021 6148467 6359749 6580332
58191 6580332 6809525 7053384 7313861 7586837 7872782 8177817 8501866 8837625 9184086
58182 9184086 9549118 9935999 10340292 10763394 11215865 11703235 12221828 12772828 13366793
58173 13366793 14009490 14696848 15428357 16210891 17044286 17918225 18829320 19787008 20798148
58164 20798148 21862136 22986144 24187031 25471502 26832640 28273470 29815697 31478097
58156 31478097 33265602 35186067 37254733 39472712 41825179 44313966 46971491 49833548
58148 49833548 52923739 56276298 59947363 63990857 68452266 73401612 78944082 85184951
58140 85184951 92217160 100156848 109151902 119341280 130855686 143882044 158675660
$$ packed form
58200D987176J40988J45673J55377J66487J74019J82301J96446K11282K20583
58191F580332K29193K43859K60477K72976K85945L05035L24049L35759L46461
58182I184086L65032L86881M04293M23102M52471M87370N18593N51000N93965
58173A3366793O42697O87358P31509P82534Q33395Q73939R11095R57688J011140
58164B0798148J063988J124008J200887J284471J361138J440830J542227J662400
58156C1478097J787505J920465K068666K217979K352467K488787K657525K862057
58148D9833548L090191L352559L671065M043494M461409M949346N542470O240869
58140H5184951P032209P939688Q995054J0189378J1514406J3026358J4793616
$$ plain form
58133 158675660 175482300 194501895 215945486 240055692 267081500 297383401 331515608
58126 331515608 369656595 410241470 448963164 479649743 496910154 498560349 486020587
58119 486020587 462865181 433083641 400112605 366533446 334004802 303357302 274891789
58112 274891789 248704300 224841933 203322596 184138883 167257287 152591116 139997740
58105 139997740 129330175 120475883 113328996 107744778 103537645 100503431 98417397 97002937
58097 97002937 95896399 94643617 92775048 89959679 86132047 81473905 76276940 70826869
58089 70826869 65373030 60119556 55193097 50634340 46443332 42622481 39171236 36068885
58081 36068885 33286276 30801584 28591044 26619737 24856003 23282145 21879180 20614847
$$ packed form
58133A58675660J6806640J9019595K1443591K4110206K7025808L0301901L4132207
58126C31515608L8140987M0584875L8721694L0686579J7260411J650195j2539762
58119D86020587k3155406k9781540l2971036l3579159l2528644l0647500k8465513
58112B74891789k6187489k3862367k1519337j9183713j6881596j4666171j2593376
58105A39997740j0667565q854292p146887n584218m207133l034214k086034j414460
58097I7002937j106538j252782j868569k815369l827632m658142n196965n450071
58089G0826869n453839n253474m926459m558757m191008l820851l451245l102351
58081C6068885k782609k484692k210540j971307j763734j573858j402965j264333
$$ plain form
58073 20614847 19459049 18398732 17425905 16523394 15674527 14875851 14128320 13425360 12760118
58064 12760118 12134880 11552684 11007978 10494935 10016376 9575118 9164655 8777253 8413114
58055 8413114 8072659 7747750 7429868 7120316 6823989 6539609 6264012 5999537 5749256
58046 5749256 5510683 5281167 5063461 4859292 4663802 4472965 4290242 4119358 3957002
58037 3957002 3799331 3649264 3510436 3380020 3254401 3136047 3028012 2927324 2830459 2739659
58027 2739659 2657186 2579098 2501553 2427792 2361848 2300588 2238968 2178174 2121578 2067435 2012733
58016 2012733 1959714 1911417 1864963 1816357 1768136 1725341 1687456 1650941 1616173 1585226 1556164
58005 1556164 1526250 1497757 1474164 1453556 1432021 1410606 1392603 1376779 1359677 1342043 1326795
$$ packed form
58073B0614847j155798j060317r72827r02511q48867p98676p47531p02960o65242
58064A2760118o25238n82196n44706n13043m78559m41258m10463l87402l64139
58055H413114l40455l24909l17882l09552k96327k84380k75597k64475k50281
58046E749256k38573k29516k17706k04169j95490j90837j82723j70884j62356
58037C957002j57671j50067j38828j30416j25619j18354j08035j00688r6865r0800
58027B739659q2473p8088p7545p3761o5944o1260o1620o0794n6596n4143n4702
58016B012733n3019m8297m6454m8606m8221m2795l7885l6515l4768l0947k9062
58005A556164k9914k8493k3593k0608k1535k1415j8003j5824j7102j7634j5248
$$ plain form
57994 1326795 1312952 1297597 1281515 1267020 1252585 1235596 1218150 1204148 1192700 1180345 1167726
57983 1167726 1157955 1150070 1140284 1128504 1117821 1108630 1098827 1088826 1080921 1074500 1067128 1059652 1055246
57970 1055246 1054048 1053387 1052392 1051761 1049980 1044677 1037008 1030174 1024357 1017568 1010422 1005289 1001417 995754 988133
57955 988133 981022 974570 966492 956706 947624 939769 931203 921330 911466 901736 891166 880642 872029 864508
57941 864508 855415 844620 834664 826815 820414 815690 813584 812976 811586 809559 808976 810192 811857 814005
57927 814005 817644 821673 823776 824115 824746 825637 824710 821671 818438 815949 813854 812985 814646 817574 819087
57912 819087 819214 820226 822143 822347 819865 816423 812711 807089 798847 789761 781497 774084 767603 762910 759998
57897 759998 757722 755410 752822 748830 742492 735212 729343 724939 720344 715535 712105 710295 708907 707950
$$ packed form
57994A326795j3843j5355j6082j4495j4435j6989j7446j4002j1448j2355j2619
57983A167726r771p885r786j1780j0683r191r803j0001p905o421p372p476m406
57970A055246j198o61r95o31j781n303p669o834n817o789p146n133l872n663p621
57955I88133p111o452q078r786r082p855q566r873r864r730j0570j0524q613p521
57941H64508r093j0795r956p849o401m724k106o08j390k027n83J216J665K148
57927H14005L639M029K103L39O31Q91r27l039l233k489k095q69J661K928J513
57912H19087J27J012J917K04k482l442l712n622q242r086q264p413o481m693k912
57897G59998k276k312k588l992o338p280n869m404m595m809l430j810j388r57
$$ plain form
57883 707950 708468 710008 711195 712598 715864 720180 722864 723575 724609 726792 728430 728751 728943 729065 727230
57868 727230 722862 717659 712229 704819 694778 684541 676538 670302 664178 657939 652312 647447 643153 639511
57854 639511 636589 634613 634541 637082 641142 644873 648121 652110 657048 662245 668259 676292 685332 692598 697199
57839 697199 700818 704272 706073 705332 703615 702700 702389 701599 699922 697107 692507 685904 677832 668727 658940
57824 658940 649554 641678 634894 627955 620852 614536 608884 602969 597195 593060 590836 589447 588516 588421 588672
57809 588672 588657 589787 594309 601862 609829 617223 625443 634851 643482 649971 655288 660753 666403 671788 676213
57794 676213 677975 675859 671681 668711 667211 664285 658485 651446 644317 635952 625906 616024 607393 598498
57780 598498 588122 577546 568111 559014 549430 540676 534300 529702 525292 520375 514551 507091 498299 489803
$$ packed form
57883G07950N18J540J187J403L266M316K684P11J034K183J638L21J92J22j835
57868G27230m368n203n430p410j0041j0237q003o236o124o239n627m865m294l642
57854F39511k922j976p2K541M060L731L248L989M938N197O014Q033R040P266M601
57839F97199L619L454J801p41j717r15l11p90j677k815m600o603q072r105r787
57824F58940r386p876o784o939p103o316n652n915n774m135k224j389r31r5K51
57809E88672j5J130M522P553P967P394Q220R408Q631O489N317N465N650N385M425
57794F76213J762k116m178k970j500k926n800p039p129q365j0046r882q631q895
57780E98498j0376j0576r435r097r584q754o376m598m410m917n824p460q792q496
$$ plain form
57766 489803 482248 474476 465984 457975 450696 442197 431529 420973 412958 406544 399092 389964 380599 372212
57752 372212 365258 360021 356046 352019 347587 344151 342578 341556 339696 337892 338035 340559 344719 350090
57738 350090 356278 362302 367737 373595 380687 388012 393822 397484 399514 400945 403273 407511 412491 415814
57724 415814 417338 419729 424496 429618 432613 433852 435046 436342 436936 436828 435881 432677 426461 418906 411881
57709 411881 404751 396014 386372 377941 371357 365752 360787 356706 353241 350413 349554 351478 354416 355744
57695 355744 355140 354224 353991 354596 356745 360884 365533 368749 371075 375019 381768 390244 399093 407634 415103
57680 415103 421031 426436 432778 439742 445744 450611 455855 462188 468657 474576 480523 486883 492960 498317
57666 498317 503809 510525 518489 526940 535265 543293 551209 559463 568441 578260 589055 601069 614116
$$ packed form
57766D89803p555p772q492q009p279q499j0668j0556q015o414p452r128r365q387
57752C72212o954n237l975m027m432l436j573j022j860j804J43K524M160N371
57738C50090O188O024N435N858P092P325N810L662K030J431K328M238M980L323
57724D15814J524K391M767N122K995J239J194J296N94j08r47l204o216p555p025
57709D11881p130q737r642q431o584n605m965m081l465k828q59J924K938J328
57695C55744o04r16k33O05K149M139M649L216K326L944O749Q476Q849Q541P469
57680D15103N928N405O342O964O002M867N244O333O469N919N947O360O077N357
57666D98317N492O716P964Q451Q325Q028P916Q254Q978R819J0795J2014J3047
$$ plain form
57653 614116 627638 641907 658394 678052 699773 721508 742509 763639 785999 810132 836026
57642 836026 863037 890331 918311 948983 983948 1022512 1062778 1104102 1147558 1194485 1245521
57631 1245521 1300686 1359585 1421903 1488245 1559999 1638118 1723076 1816454 1921016 2038150 2166587
57620 2166587 2304976 2454596 2618303 2798053 2994923 3210347 3445536 3700467 3974842
57611 3974842 4268972 4582015 4910145 5247576 5587332 5918022 6220484 6470667 6647313
57602 6647313 6737460 6737580 6653269 6497923 6288593 6041226 5769380 5485193 5198468 4914896
57592 4914896 4637666 4371009 4120165 3888024 3674326 3478584 3301596 3143469 3002334
57583 3002334 2876051 2763738 2664854 2578046 2501692 2434696 2376484 2327154 2287674 2258724 2239204
$$ packed form
57653F14116J3522J4269J6487J9658K1721K1735K1001K1130K2360K4133K5894
57642H36026K7011K7294K7980L0672L4965L8564M0266M1324M3456M6927N1036
57631A245521N5165N8899O2318O6342P1754P8119Q4958R3378J04562J17134J28437
57620B166587J38389J49620J63707J79750J96870K15424K35189K54931K74375
57611C974842K94130L13043L28130L37431L39756L30690L02462K50183J76646
57602F647313R0147J20q4311j55346k09330k47367k71846k84187k86725k83572
57592D914896k77230k66657k50844k32141k13698j95742j76988j58127j41135
57583C002334j26283j12313r8884q6808p6354o6996n8212m9330l9480k8950j9520
$$ plain form
57572 2239204 2226861 2220327 2219601 2224965 2236707 2255410 2281080 2312455 2348767 2391712 2443902 2505891
57560 2505891 2576770 2657184 2749241 2853421 2968146 3092929 3229619 3379739 3542482 3715837
57550 3715837 3897675 4084895 4273169 4458112 4635043 4797060 4935148 5040888 5107914 5131288
57540 5131288 5108463 5041849 4938058 4803334 4641560 4457403 4258556 4052818 3844738 3636944
57530 3636944 3433068 3237130 3051077 2874864 2708476 2552479 2407331 2273500 2151651
57521 2151651 2041497 1941056 1848082 1761719 1682010 1608652 1541201 1479618 1423523 1371565 1322534
57510 1322534 1276590 1234553 1196614 1162487 1132079 1105132 1080843 1058630 1038729 1021261 1005419
57499 1005419 990395 976605 965126 956240 949156 942931 937300 932873 930655 930977 933106 936565 942414
$$ packed form
57572B239204j2343o534p26N364J1742J8703K5670L1375L6312M2945N2190O1989
57560B505891P0879Q0414R2057J04180J14725J24783J36690J50120J62743J73355
57550C715837J81838J87220J88274J84943J76931J62017J38088J05740O7026K3374
57540E131288k2825o6614j03791j34724j61774j84157j98847k05738k08080k07794
57530C636944k03876j95938j86053j76213j66388j55997j45148j33831j21849
57521B151651j10154j00441r2974q6363p9709p3358o7451o1583n6095n1958m9031
57510A322534m5944m2037l7939l4127l0408k6947k4289k2213j9901j7468j5842
57499A005419j5024j3790j1479q886p084o225n631m427k218L22K129L459N849
$$ plain form
57486 942414 951985 964585 978177 992509 1009770 1031538 1056730 1083318 1110590 1138950 1169152 1202721
57474 1202721 1241477 1285281 1331617 1378722 1427990 1482055 1541722 1606266 1675700 1751181 1833831
57463 1833831 1924356 2023058 2129115 2240867 2358121 2483273 2618622 2763256 2913779 3067128
57453 3067128 3220904 3371396 3512948 3639075 3743196 3819035 3862130 3871159 3846971 3790888
57443 3790888 3705216 3594842 3466641 3327104 3181230 3032967 2885157 2739209 2596323 2459031
57433 2459031 2330317 2211297 2101146 1999296 1906284 1822270 1746354 1678156 1618874 1569661
57423 1569661 1529468 1495374 1464955 1437884 1415375 1398658 1388139 1383660 1384964 1391563 1402495 1416824
57411 1416824 1434474 1456262 1483231 1516370 1556627 1604376 1658973 1719685 1786933 1861702 1944038
$$ packed form
57486I42414R571J2600J3592J4332J7261K1768K5192K6588K7272K8360L0202L3569
57474A202721L8756M3804M6336M7105M9268N4065N9667O4544O9434P5481Q2650
57463A833831R0525R8702J06057J11752J17254J25152J35349J44634J50523J53349
57453C067128J53776J50492J41552J26127J04121P5839M3095R029k4188n6083
57443C790888q5672j10374j28201j39537j45874j48263j47810j45948j42886j37292
57433B459031j28714j19020j10151j01850r3012q4014p5916o8198n9282m9213
57423A569661m0193l4094l0419k7071k2509j6717j0519m479J304O599J0932J4329
57411A416824J7650K1788K6969L3139M0257M7749N4597O0712O7248P4769Q2336
$$ plain form
57400 1944038 2033499 2130871 2237537 2352832 2473938 2599081 2728747 2862469 2996148 3123906
57390 3123906 3240796 3341934 3420736 3470621 3488096 3472644 3424703 3345865 3240338 3113871
57380 3113871 2971240 2816393 2654393 2490789 2328977 2170206 2016344 1870597 1735050
57371 1735050 1609412 1492911 1385698 1287564 1196881 1112077 1033138 960659 894220 832732 775748
57360 775748 723502 675981 632679 592975 556123 521097 487103 454304 423592 395501 369529
57349 369529 344696 320647 298053 277819 260024 243754 227763 211084 193402 175398 158522
57338 158522 143759 130699 118499 107387 98146 90289 82250 73667 65948 60039 55031 49725 44203
57325 44203 38864 33208 26786 20359 14881 10130 5417 779 -3591 -8228 -13532 -18777 -22929 -25741 -27209
$$ packed form
57400A944038Q9461R7372J06666J15295J21106J25143J29666J33722J33679J27758
57390C123906J16890J01138P8802M9885J7475j5452m7941p8838j05527j26467
57380C113871j42631j54847j62000j63604j61812j58771j53862j45747j35547
57371A735050j25638j16501j07213r8134r0683q4804p8939p2479o6439o1488n6984
57360G75748n2246m7521m3302l9704l6852l5026l3994l2799l0712k8091k5972
57349C69529k4833k4049k2594k0234j7795j6270j5991j6679j7682j8004j6876
57338A58522j4763j3060j2200j1112r241p857q039q583p719n909n008n306n522
57325D4203n339n656o422o427n478m751m713G79c591m637n304n245m152k812j468
$$ plain form
57310 -27209 -27158 -26401 -26985 -29769 -32870 -34139 -34244 -35544 -38736 -42506 -45987 -49649 -53918 -58582 -63498 -68538
57294 -68538 -72995 -76250 -78817 -81650 -84854 -88091 -91567 -95398 -98719 -100742 -101997 -103260 -104174 -104353 -104802
57279 -104802 -106516 -108699 -110187 -111661 -114339 -117457 -119442 -120879 -123715 -127901 -131351 -133065 -133886 -134298 -133941
57264 -133941 -133253 -133102 -132674 -130262 -126339 -123277 -121683 -119711 -116580 -113991 -112969 -111808 -108601 -103806 -98890
57249 -98890 -94046 -88567 -82193 -74966 -66810 -58152 -49921 -42322 -34459 -25539 -15471 -4279 7873 20238
57235 20238 32446 45741 61682 79866 98720 118125 139074 161074 182493 203561 226304 251155
57223 251155 276404 301575 328496 358076 388715 419108 450101 482504 515540 548929 584098
57212 584098 621610 659324 694682 727021 756235 781105 800608 815230 825443 830379 829393 823463
$$ packed form
57310b7209N1P57n84k784l101j269j05j300l192l770l481l662m269m664m916n040
57294f8538m457l255k567k833l204l237l476l831l321k023j255j263r14j79m49
57279a04802j714k183j488j474k678l118j985j437k836m186l450j714q21m12L57
57264a33941O88J51M28K412L923L062J594J972L131K589J022J161L207M795M916
57249i8890M844N479O374P227Q156Q658Q231P599P863Q920J0068d279G873J2365
57235B0238J2208J3295J5941J8184J8854J9405K0949K2000K1419K1068K2743K4851
57223B51155K5249K5171K6921K9580L0639L0393L0993L2403L3036L3389L5169
57212E84098L7512L7714L5358L2339K9214K4870J9503J4622J0213M936r86n930
$$ plain form
57200 823463 813825 800726 784632 766978 748582 729005 708542 688990 671203 653736 635238 616377
57188 616377 598190 580532 563602 549016 537793 528975 521793 517357 516647 518524 521260 524271 526976
57175 526976 527922 526724 525058 524158 523219 521780 521576 524211 529108 535646 545123 558373 573507 588423
57161 588423 603747 620865 638692 654910 669098 682422 695688 709772 726287 745432 764803
57150 764803 782731 801317 823736 850128 878777 909843 945043 984754 1028160 1075215 1125759
57139 1125759 1177535 1227720 1275847 1323231 1370554 1418186 1467548 1519506 1572336 1623669 1673563
57128 1673563 1723369 1772600 1819372 1863068 1904304 1943152 1979543 2014345 2048073 2079677 2108638
57117 2108638 2136697 2165359 2193357 2218941 2242779 2265928 2286782 2303129 2315586 2325858 2333070
$$ packed form
57200H23463r638j3099j6094j7654j8396j9577k0463j9552j7787j7467j8498j8861
57188F16377j8187j7658j6930j4586j1223q818p182m436p10J877K736L011K705
57175E26976R46j198j666r00r39j439k04K635M897O538R477J3250J5134J4916
57161E88423J5324J7118J7827J6218J4188J3324J3266J4084J6515J9145J9371
57150G64803J7928J8586K2419K6392K8649L1066L5200L9711M3406M7055N0544
57139A125759N1776N0185M8127M7384M7323M7632M9362N1958N2830N1333M9894
57128A673563M9806M9231M6772M3696M1236L8848L6391L4802L3728L1604K8961
57117B108638K8059K8662K7998K5584K3838K3149K0854J6347J2457J0272P212
$$ plain form
57106 2333070 2335086 2332208 2326482 2318639 2308805 2298884 2291214 2286219 2284349 2288462 2300820 2319447 2341044
57093 2341044 2365681 2394607 2425016 2451453 2471387 2485326 2492517 2490792 2479930 2461022 2432934 2392921
57081 2392921 2339907 2273853 2193250 2096847 1986419 1864284 1730083 1583728 1428978 1269539
57071 1269539 1104176 930588 751261 569555 382196 181511 -37382 -278046 -548638 -858838
57061 -858838 -1212093 -1607720 -2048844 -2540996 -3084959 -3679516 -4330250 -5047656 -5838087 -6705405
57051 -6705405 -7660665 -8721272 -9901408 -11212252 -12670590 -14297952 -16112985 -18135376
57043 -18135376 -20396762 -22938558 -25802739 -29037815 -32712249 -36910053 -41718585 -47239070
57035 -47239070 -53608967 -60997737 -69580109 -79522061 -90973435 -104039491 -118758821 -135123173
$$ packed form
57106B333070K016k878n726p843r834r921p670m995j870M113J2358J8627K1597
57093B341044K4637K8926L0409K6437J9934J3939P191j725j0862j8908k8088m0013
57081B392921n3014o6054q0603r6403j10428j22135j34201j46355j54750j59439
57071A269539j65363j73588j79327j81706j87359A81511c7382k40664k70592l10200
57061h58838l53255l95627m41124m92152n43963n94557o50734p17406p90431q67318
57051f705405r55260j060607j180136j310844j458338j627362j815033k022391
57043a8135376k261386k541796k864181l235076l674434m197804m808532n520485
57035d7239070o369897p388770q582372r941952j1451374j3066056j4719330j6364352
$$ plain form
57027 -135123173 -153077827 -172437846 -192850056 -214005583 -235975041 -259172364 -283701699
57020 -283701699 -308581478 -331643899 -350300469 -362544536 -367470709 -365186876 -356474166
57013 -356474166 -342498663 -324617262 -304222407 -282602858 -260811609 -239552460 -219150457
57006 -219150457 -199655484 -181016162 -163202795 -146238466 -130189977 -115156915 -101247043
56999 -101247043 -88538596 -77061415 -66805718 -57731106 -49764548 -42806602 -36750980
56992 -36750980 -31496327 -26943481 -22996098 -19570057 -16595598 -14009072 -11750934 -9773066
56984 -9773066 -8039253 -6516045 -5170372 -3976857 -2918607 -1978202 -1135475 -376205 305005
56974 913911 1462061 1960549 2415116 2830780 3215047 3572607 3902132 4202268 4476768 4730690
$$ packed form
57027a35123173j7954654j9360019k0412210k1155527k1969458k3197323k4529335
57020b83701699k4879779k3062421j8656570j2244067m926173K283833Q712710
57013c56474166J3975503J7881401K0394855K1619549K1791249K1259149K0402003
57006b19150457J9494973J8639322J7813367J6964329J6048489J5033062J3909872
56999a01247043J2708447J1477181J0255697R074612P966558O957946O055622
56992c6750980N254653M552846L947383L426041K974459K586526K258138J977868
56984i773066J733813J523208J345673J193515J058250R40405Q42727c76205C05005
56974I13911N48150M98488M54567M15664L84267L57560L29525L00136K74500K53922
$$ plain form
56964 4730690 4965585 5181486 5379978 5562569 5729242 5880991 6020646 6149248 6264832
56955 6264832 6366614 6457059 6537990 6608023 6665976 6714071 6755985 6794174 6830322 6866133 6903564
56944 6903564 6947371 7006134 7083775 7166951 7225704 7230960 7170341 7047438 6872269 6656538 6412971
56933 6412971 6152044 5878897 5595943 5307163 5017635 4731006 4450485 4180909 3927252
56924 3927252 3692238 3477270 3283739 3110876 2953878 2806747 2666154 2530968 2399941
56915 2399941 2272342 2149411 2032674 1921706 1815389 1714076 1618605 1528739 1444768 1369156
56905 1369156 1303961 1247671 1196955 1150705 1110148 1076012 1048099 1026790 1012243 1002328 993673 984646
56893 984646 975284 964628 950403 931474 908799 883790 857327 830336 803705 777494 751520 726714
$$ packed form
56964D730690K34895K15901J98492J82591J66673J51749J39655J28602J15584
56955F264832J01782R0445Q0931P0033N7953M8095M1914L8189L6148L5811L7431
56944F903564M3807N8763P7641Q3176N8753N256o0619j22903j75169k15731k43567
56933F412971k60927k73147k82954k88780k89528k86629k80521k69576k53657
56924C927252k35014k14968j93531j72863j56998j47131j40593j35186j31027
56915B399941j27599j22931j16737j10968j06317j01313r5471q9866q3971p5612
56905A369156o5195n6290n0716m6250m0557l4136k7913k1309j4547r915q655r027
56893I84646r362j0656j4225j8929k2675k5009k6463k6991k6631k6211k5974k4806
$$ plain form
56881 726714 704722 686320 671275 659339 650280 643545 639211 638692 643136 651901 663952 679616 698764
56868 698764 717920 731567 736338 732087 719432 698754 671663 640901 608082 573486 538314 504920
56856 504920 474173 444833 416428 390669 368859 349814 331685 314269 298177 283260 269372
56845 269372 257396 247961 240169 233077 227452 224450 223263 221734 218782 214825 210375 205953 203163 204032
56831 204032 208854 215864 223393 231344 240446 251213 264135 279866 298382 318345 337748 355044
56819 355044 369627 381826 392734 403626 415085 426758 438046 448851 459631 471061 483825
56808 483825 498500 515419 534562 555566 577950 601742 628082 658760 694511 733752 773277
56797 773277 809944 841236 864572 877294 878113 868412 851802 832335 812949 795045 779115 765629
$$ packed form
56881G26714k1992j8402j5045j1936r059o735m334n19M444Q765J2051J5664J9148
56868F98764J9156J3647M771m251j2655k0678k7091l0762l2819l4596l5172l3394
56856E04920l0747k9340k8405k5759k1810j9045j8129j7416j6092j4917j3888
56845B69372j1976r435p792p092n625l002j187j529k952l957m450m422k790Q69
56831B04032M822P010P529P951R102J0767J2922J5731J8516J9963J9403J7296
56819C55044J4583J2199J0908J0892J1459J1673J1288J0805J0780J1430J2764
56808D83825J4675J6919J9143K1004K2384K3792K6340L0678L5751L9241L9525
56797G73277L6667L1292K3336J2722Q19r701j6610j9467j9386j7904j5930j3486
$$ plain form
56785 765629 755272 748355 744641 744336 749033 760837 780357 806332 837538 874371 918026 968557
56773 968557 1024133 1081555 1136629 1184260 1219215 1237599 1238031 1221991 1193391 1157246 1117799 1077494
56761 1077494 1037622 999352 963620 930614 900588 875177 856861 846717 843554 845711 852938 865911
56749 865911 884630 908205 935767 966479 998436 1028185 1051589 1065030 1066304 1055377 1034609 1007652
56737 1007652 977563 945936 913560 881203 849616 819454 791647 767460 747698 732084 719834
56726 719834 710704 705124 703497 705707 711233 719447 729780 741611 753629 763179 766840 762537 751058
56713 751058 735023 716469 695940 673737 650934 628690 607216 586079 565256 545346 526899
56702 526899 509976 494353 479900 466818 455646 446850 440228 434900 430049 425392 420808 416056 411385
$$ packed form
56785G65629j0357o917l714l05M697J1804J9520K5975L1206L6833M3655N0531
56773I68557N5576N7422N5074M7631L4955J8384M32j6040k8600l6145l9447m0305
56761A077494l9872l8270l5732l3006l0026k5411j8316j0144l163K157P227J2973
56749H65911J8719K3575K7562L0712L1957K9749K3404J3441J274j0927k0768k6957
56737A007652l0089l1627l2376l2357l1587l0162k7807k4187j9762j5614j2250
56726G19834r130n580j627K210N526Q214J0333J1831J2018R550L661m303j1479
56713G51058j6035j8554k0529k2203k2803k2244k1474k1137k0823j9910j8447
56702E26899j6923j5623j4453j3082j1172q796o622n328m851m657m584m752m671
$$ plain form
56689 411385 408039 407358 409286 412174 414059 413834 411473 407873 404536 402738 402611 403383 404507 406179 408726
56674 408726 412104 416113 420461 424369 426785 427501 427456 427387 426681 424331 420655 417160 414712 412763 410640 408815
56658 408815 408180 408403 407871 405481 401961 398905 396777 394504 391177 387423 384549 382836 381460 379805 377902
56643 377902 375582 372374 368638 365861 365078 365587 365873 365224 363857 362153 360662 360351 361681 363598 364341 363249
56627 363249 360917 357796 353761 349229 345557 343756 343476 343701 343804 343504 342542 341109 340250 341161 344123 348337
56611 348337 352555 355626 356950 356981 357106 358500 361143 364264 367504 371125 375126 378854 381744 384057 386507
56596 386507 389347 392181 394621 396664 398277 398950 398046 395504 391826 387418 382350 376858 371554 366762 361983
56581 361983 356471 350206 343933 338350 333617 329614 326336 323963 322674 322369 322583 322941 323848 326257 330369
$$ packed form
56689D11385l346o81J928K888J885k25k361l600l337j798j27P72J124J672K547
56674D08726L378M009M348L908K416P16m5o9p06k350l676l495k448j949k123j825
56658D08815o35K23n32k390l520l056k128k273l327l754k874j713j376j655j903
56643C77902k320l208l736k777p83N09K86o49j367j704j491l11J330J917P43j092
56627C63249k332l121m035m532l672j801k80K25J03l00r62j433q59R11K962M214
56611C48337M218L071J324L1J25J394K643L121L240L621M001L728K890K313K450
56596C86507K840K834K440K043J613O73r04k542l678m408n068n492n304m792m779
56581C61983n512o265o273n583m733m003l278k373j289l05K14L58R07K409M112
$$ plain form
56566 330369 334945 338394 340244 341050 341296 341276 341870 344305 348666 353308 356244 356896 356347 356240 357566 359974
56550 359974 361938 361962 359985 357436 355711 354902 354208 353265 352670 353205 354797 356346 356600 355214 352898 350597
56534 350597 348861 348107 348992 351939 356425 361240 365431 368744 371294 373369 375425 377792 380327 382651 384602
56519 384602 386158 387249 388095 389400 391572 394166 396787 400039 404550 409426 413124 415880 419800 426171
56505 426171 434072 442200 450588 459654 468882 477823 487476 499168 512476 525632 537832 549905 562645
56492 562645 575571 587650 598412 608037 616829 624805 631458 635977 638122 638750 638885 638381 636155 631690
56478 631690 625568 618475 610605 602325 594489 587376 579928 570834 560006 548256 535898 522714 509291
56465 509291 497257 487622 479648 471986 464421 457705 452147 447223 442439 437703 432940 428178 424037 421116
$$ packed form
56566C30369M576L449J850Q06K46k0N94K435M361M642K936O52n49j07J326K408
56550C59974J964K4j977k549j725q09o94r43n95N35J592J549K54j386k316k301
56534C50597j736p54Q85K947M486M815M191L313K550K075K056K367K535K324J951
56519C84602J556J091Q46J305K172K594K621L252M511M876L698K756L920O371
56505D26171P901Q128Q388R066R228Q941R653J1692J3308J3156J2200J2073J2740
56492E62645J2926J2079J0762R625Q792P976O653M519K145O28J35n04k226m465
56478F31690o122p093p870q280p836p113p448r094j0828j1750j2358j3184j3423
56465E09291j2034r635p974p662p565o716n558m924m784m736m763m762m141k921
$$ plain form
56451 421116 418710 415244 410482 406262 404243 403737 402707 400247 397070 394116 391800 390406 390119 390634 391451
56436 391451 392367 392994 392261 389508 385896 383676 384009 386445 390354 395599 401589 406923 410544 412553 413586
56421 413586 414095 414459 415038 415768 416325 416806 417652 418883 420131 421317 422431 422918 422435 422206 424191 428623 433732
56404 433732 438299 443104 449186 456066 462653 468819 475032 481292 487390 493559 499902 505727 510224 513298
56390 513298 515171 515941 516216 517334 519893 522628 523656 522433 519739 516353 512707 509389 506841 504728 502479
56375 502479 500289 498680 497117 494069 488744 482186 476236 471651 467522 462502 456410 450371 445429 441530
56361 441530 438197 435587 433988 432671 430429 427308 424745 423759 423920 424252 424238 423748 423021 422878 423904 425179
56345 425179 424971 422957 420524 418646 417000 415575 415409 416792 418300 418751 418845 419697 421041 422136 423249 424869
$$ packed form
56451D21116k406l466m762m220k019n06j030k460l177k954k316j394k87N15Q17
56436C91451R16O27p33k753l612k220L33K436L909N245N990N334L621K009J033
56421D13586N09L64N79P30N57M81Q46J231J248J186J114M87m83k29J985M432N109
56404D33732M567M805O082O880O587O166O213O260O098O169O343N825M497L074
56390E13298J873P70K75J118K559K735J028j223k694l386l646l318k548k113k249
56375E02479k190j609j563l048n325o558n950m585m129n020o092o039m942l899
56361D41530l333k610j599j317k242l121k563r86J61L32j4m90p27j43J026J275
56345D25179k08k014k433j878j646j425j66J383J508M51R4Q52J344J095J113J620
$$ plain form
56329 424869 426475 427587 429155 432369 436694 440419 442644 443590 443641 443348 443812 445764 448723 451987 455660
56314 455660 459582 462272 462627 462096 463390 467268 471994 475812 478529 480746 482922 485416 488424 491654 494668
56299 494668 497478 500339 503378 506936 511565 517038 522215 526584 530909 535469 539015 540836 542531 545928
56285 545928 550267 553470 555421 557721 560668 562873 564054 565925 569738 574641 579193 583168 587289 592234
56271 592234 598324 605277 612059 617798 622873 628265 634120 639954 646026 653284 662092 672197 683664 696510
56257 696510 709565 721152 730993 740204 749556 759154 769752 782620 797672 813090 827466 841346
56245 841346 856229 872917 891112 909732 927345 943050 957253 971070 985075 999168 1013314
56234 1013314 1027526 1041403 1054543 1067177 1079652 1091744 1103279 1114806 1126700 1138461 1150187
$$ packed form
56329D24869J606J112J568L214M325L725K225R46N1k93M64J952K959L264L673
56314D55660L922K690L55n31J294L878M726L818K717K217K176K494L008L230L014
56299D94668K810K861L039L558M629N473N177M369M325M560L546J821J695L397
56285E45928M339L203J951K300K947K205J181J871L813M903M552L975M121M945
56271E92234O090O953O782N739N075N392N855N834O072P258Q808J0105J1467J2846
56257F96510J3055J1587R841R211R352R598J0598J2868J5052J5418J4376J3880
56245H41346J4883J6688J8195J8620J7613J5705J4203J3817J4005J4093J4146
56234A013314J4212J3877J3140J2634J2475J2092J1535J1527J1894J1761J1726
$$ plain form
56223 1150187 1163843 1181509 1203062 1227327 1254705 1286545 1322331 1359905 1398651 1440299 1486238
56212 1486238 1536063 1589286 1646669 1709175 1777231 1851649 1933786 2024125 2121964 2227039 2340336
56201 2340336 2462980 2595641 2739416 2895879 3065634 3247926 3442124 3648476 3867012
56192 3867012 4096725 4336074 4583208 4835386 5089094 5340640 5585522 5817581 6030545
56183 6030545 6220677 6386359 6524930 6631864 6703769 6740712 6744966 6718975 6665369 6587606 6489418
56172 6489418 6374176 6245343 6106707 5961574 5812099 5659481 5504166 5345979 5184984
56163 5184984 5022099 4858048 4692089 4523068 4351534 4179564 4008700 3839376 3672176
56154 3672176 3508161 3348056 3192492 3042844 2900410 2765087 2636442 2515551 2403764
$$ packed form
56223A150187J3656J7666K1553K4265K7378L1840L5786L7574L8746M1648M5939
56212A486238M9825N3223N7383O2506O8056P4418Q2137R0339R7839J05075J13297
56201B340336J22644J32661J43775J56463J69755J82292J94198K06352K18536
56192C867012K29713K39349K47134K52178K53708K51546K44882K32059K12964
56183F030545J90132J65682J38571J06934P1905L6943M254k5991n3606p7763r8188
56172F489418j15242j28833j38636j45133j49475j52618j55315j58187j60995
56163E184984j62885j64051j65959j69021j71534j71970j70864j69324j67200
56154C672176j64015j60105j55564j49648j42434j35323j28645j20891j11787
$$ plain form
56145 2403764 2300037 2201904 2109132 2023852 1946707 1875504 1808590 1747075 1692375 1643579 1598873
56134 1598873 1558039 1521805 1489745 1460317 1432494 1406310 1382112 1359929 1339394 1320127 1302475
56123 1302475 1287648 1276426 1267963 1260551 1253269 1246396 1240992 1238924 1242019 1249770 1258909 1266724 1273666
56110 1273666 1281172 1288733 1295643 1303976 1316512 1332636 1349617 1367289 1387894 1411672 1436535 1462201
56098 1462201 1490643 1521759 1552587 1582022 1612661 1646381 1681408 1715517 1749106 1783163 1816935
56087 1816935 1849826 1883514 1920229 1960621 2004883 2054318 2110442 2174000 2245885 2327509 2419681
56076 2419681 2522797 2638366 2767943 2909708 3058091 3207253 3352973 3491239 3618228
56067 3618228 3732628 3835511 3927398 4007946 4078350 4140226 4191145 4224938 4237970 4232275 4211759
$$ packed form
56145B403764j03727r8133r2772q5280p7145p1203o6914o1515n4700m8796m4706
56134A598873m0834l6234l2060k9428k7823k6184k4198k2183k0535j9267j7652
56123A302475j4827j1222q463p412p282o873n404k068L095P751R139P815O942
56110A273666P506P561O910Q333J2536J6124J6981J7672K0605K3778K4863K5666
56098A462201K8442L1116L0828K9435L0639L3720L5027L4109L3589L4057L3772
56087A816935L2891L3688L6715M0392M4262M9435N6124O3558P1885Q1624R2172
56076B419681J03116J15569J29577J41765J48383J49162J45720J38266J26989
56067C618228J14400J02883R1887Q0548P0404O1876N0919L3793J3032n695k0516
$$ plain form
56056 4211759 4179062 4137288 4090405 4039086 3979041 3905638 3817703 3715554 3599160 3470785 3336297
56045 3336297 3201048 3066785 2934715 2808803 2693376 2589592 2496501 2413598 2340576 2276768
56035 2276768 2222518 2178855 2144468 2115671 2090715 2071171 2057578 2047085 2037342 2029462 2024935 2022675
56023 2022675 2021296 2021263 2022513 2022846 2020871 2017814 2014678 2010846 2007194 2006811 2010258 2013791 2014902 2016089 2020461
56008 2020461 2027263 2034685 2043652 2055658 2069969 2085928 2104981 2127554 2151000 2173485 2196897 2223405
55996 2223405 2252347 2282849 2315775 2350512 2383902 2415270 2448511 2486117 2525321 2563428 2602707
55985 2602707 2646323 2693532 2742612 2794550 2850074 2907008 2964328 3024785 3089863 3156415 3222103
55974 3222103 3289786 3362577 3439200 3518282 3602204 3692029 3783498 3873149 3963964 4060247 4161651
$$ packed form
56056D211759l2697m1774m6883n1319o0045p3403q7935j02149j16394j28375j34488
56045C336297j35249j34263j32070j25912j15427j03784r3091q2903p3022o3808
56035B276768n4250m3663l4387k8797k4956j9544j3593j0493r743p880m527k260
56023B022675j379l3J250L33j975l057l136l832l652l83L447L533J111J187M372
56008B020461O802P422Q967J2006J4311J5959J9053K2573K3446K2485K3412K6508
55996B223405K8942L0502L2926L4737L3390L1368L3241L7606L9204L8107L9279
55985B602707M3616M7209M9080N1938N5524N6934N7320O0457O5078O6552O5688
55974C222103O7683P2791P6623P9082Q3922Q9825R1469Q9651R0815R6283J01404
$$ plain form
55963 4161651 4267206 4380154 4503231 4633809 4769206 4912283 5066537 5230509 5402437
55954 5402437 5585251 5781341 5987764 6202499 6429929 6673998 6931723 7199842 7481680
55945 7481680 7780392 8091579 8410303 8739680 9084976 9445364 9819731 10214662 10638163
55936 10638163 11091047 11572699 12089249 12647467 13246598 13884531 14565044 15290029 16052071
55927 16052071 16844672 17673024 18545609 19463833 20430217 21457342 22556584 23726906 24967219
55918 24967219 26290833 27715167 29247144 30891648 32662124 34566925 36597498 38748923
55910 38748923 41042748 43513514 46186090 49085972 52258524 55756785 59624891 63917951
55902 63917951 68725226 74150444 80286164 87232500 95118278 104072135 114200539 125640258
$$ packed form
55963D161651J05555J12948J23077J30578J35397J43077J54254J63972J71928
55954E402437J82814J96090K06423K14735K27430K44069K57725K68119K81838
55945G481680K98712L11187L18724L29377L45296L60388L74367L94931M23501
55936A0638163M52884M81652N16550N58218N99131O37933O80513P24985P62042
55927A6052071P92601Q28352Q72585R18224R66384J027125J099242J170322J240313
55918B4967219J323614J424334J531977J644504J770476J904801K030573K151425
55910C8748923K293825K470766K672576K899882L172552L498261L868106M293060
55902F3917951M807275N425218O135720O946336P885778Q953857J0128404J1439719
$$ plain form
55894 125640258 138618528 153433316 170418746 189981197 212606506 238728359 268598855
55887 268598855 302285211 339472480 378696852 416490504 447651768 467105643 472146576
55880 472146576 463315279 443484700 416274208 384979522 352201452 319768872 288767980
55873 288767980 259732030 232911340 208435346 186343356 166597539 149110175 133741205
55866 133741205 120289116 108528944 98262231 89312840 81496242 74629768 68566708
55859 68566708 63193935 58405261 54103249 50219177 46705220 43510678 40585645 37900692
55851 37900692 35441228 33186739 31113269 29209490 27470536 25879934 24414423 23061598
55843 23061598 21815982 20662651 19581838 18566203 17617683 16730773 15894402 15107048 14374226
$$ packed form
55894A25640258J2978270J4814788J6985430J9562451K2625309K6121853K9870496
55887B68598855L3686356L7187269L9224372L7793652L1161264J9453875N040933
55880D72146576q831297j9830579k7210492l1294686l2778070l2432580l1000892
55873B88767980k9035950k6820690k4475994k2091990j9745817j7487364j5368970
55866A33741205j3452089j1760172j0266713q949391p816598o866474o063060
55859F8566708n372773m788674m302012l884072l513957l194542k925033k684953
55851C7900692k459464k254489k073470j903779j738954j590602j465511j352825
55843B3061598j245616j153331j080813j015635r48520q86910q36371p87354p32822
$$ plain form
55834 14374226 13692550 13050550 12443708 11875163 11342832 10838942 10361550 9914229 9494831
55825 9494831 9095907 8715647 8357538 8019890 7696256 7385646 7092134 6814800 6547827
55816 6547827 6290232 6046222 5816321 5597006 5388503 5194001 5011587 4835582 4665466
55807 4665466 4505187 4354229 4207756 4065270 3930897 3805314 3685328 3571042 3465192
55798 3465192 3365281 3264327 3159845 3054678 2948949 2839167 2726152 2616235 2513230 2415834
55788 2415834 2323846 2240019 2164338 2092856 2023950 1960255 1903210 1851022 1803036 1760854 1724115
55777 1724115 1690084 1658254 1630564 1606526 1583029 1559623 1539232 1523020 1509091 1496719 1487241
55766 1487241 1480335 1473870 1467739 1463275 1458498 1448618 1431859 1410638 1386703 1359600 1330200 1301050
$$ packed form
55834A4374226o81676o42000o06842n68545n32331n03890m77392m47321m19398
55825I494831l98924l80260l58109l37648l23634l10610k93512k77334k66973
55816F547827k57595k44010k29901k19315k08503j94502j82414j76005j70116
55807D665466j60279j50958j46473j42486j34373j25583j19986j14286j05850
55798C465192r9911j00954j04482j05167j05729j09782j13015j09917j03005r7396
55788B415834r1988q3827p5681p1482o8906o3695n7045n2188m7986m2182l6739
55777A724115l4031l1830k7690k4038k3497k3406k0391j6212j3929j2372r478
55766A487241o906o465o131m464m777r880j6759k1221k3935k7103k9400k9150
$$ plain form
55754 1301050 1272398 1242054 1209896 1178626 1149651 1122103 1096128 1072948 1051402 1028697 1005150
55743 1005150 984133 966753 950719 935121 922209 913360 906965 901283 896137 891114 885372 879726 875701
55730 875701 872330 867283 861285 857604 856771 855615 852166 847749 843417 838067 831401 825512 822101 820552
55716 820552 819510 817819 813433 804119 790004 773235 755034 735481 715869 698198 682189 665705
55704 665705 648373 632133 618249 606441 596707 589008 581370 571478 560156 550295 542475 534720 526376
55691 526376 518875 512719 507104 502520 500261 499145 496116 490364 483580 476056 466144 454003 442314 432585
55677 432585 423861 415531 408184 401271 393182 384298 376910 371802 367949 365581 365895 367414 366519 362391 357851
55662 357851 354493 350670 345274 339786 335220 330487 325238 321073 318404 315200 310425 305894 303135 301097
$$ packed form
55754A301050k8652l0344l2158l1270k8975k7548k5975k3180k1546k2705k3547
55743A005150k1017j7380j6034j5598j2912q849o395n682n146n023n742n646m025
55730H75701l371n047n998l681q33j156l449m417m332n350o666n889l411j549
55716H20552j042j691m386r314j4115j6769j8201j9553j9612j7671j6009j6484
55704F65705j7332j6240j3884j1808r734p699p638r892j1322r861p820p755q344
55691E26376p501o156n615m584k259j116l029n752o784p524r912j2141j1689r729
55677D32585q724q330p347o913q089q884p388n108l853k368L14J519q95m128m540
55662C57851l358l823n396n488m566m733n249m165k669l204m775m531k759k038
$$ plain form
55648 301097 298508 296062 294883 295028 296578 299872 303735 305844 305770 305306 305186 304206 302249 301205 301807 302385
55632 302385 301829 301048 300450 298923 296582 295804 298074 302238 307027 312762 319456 325881 331838 338909 347790
55617 347790 357246 366601 376540 386390 393464 396411 396523 394661 389886 382382 374572 367646 360060 351363
55603 351363 344420 341498 340923 340153 339698 341272 344090 345737 345406 343957 342017 340075 339387 340928 344191
55588 344191 348151 352243 355516 356462 354919 352695 351268 350290 349114 347926 346448 343461 338668 333231 327692
55573 327692 321528 315482 311658 310037 307416 301445 293415 285547 277980 270210 263023 256798 249939 241295
55559 241295 232576 226298 222613 219896 217013 213417 208497 202555 197269 193803 191561 189575 187523 184730
55545 184730 180434 176035 174652 177050 180287 181730 181865 181689 180254 176964 173599 171564 169469 165956 162609
$$ packed form
55648C01097k589k446j179J45J550L294L863K109p4m64j20r80j957j044O02N78
55632C02385n56p81n98j527k341p78K270M164M789N735O694O425N957P071Q881
55617C47790R456R355R939R850P074K947J12j862m775p504p810o926p586q697
55603C51363o943k922n75p70m55J574K818J647l31j449j940j942o88J541L263
55588C44191L960M092L273R46j543k224j427r78j176j188j478k987m793n437n539
55573C27692o164o046l824j621k621n971q030p868p567p770p187o225o859q644
55559B41295q719o278l685k717k883l596m920n942n286l466k242j986k052k793
55545A84730m296m399j383K398L237J443J35j76j435l290l365k035k095l513l347
$$ plain form
55530 162609 161300 160727 158605 155507 153504 152488 150987 149529 150035 152372 154213 153934 151509 147194 141512
55515 141512 135976 131840 128650 125548 122995 121474 119851 117063 114256 113023 112739 111975 111456 112968 116019
55500 116019 118160 118257 117266 116093 114834 113770 113103 112024 109901 107887 107450 107845 107089 105068 103591 103603
55484 103603 104370 105408 107285 110308 113909 117400 120146 121251 120444 119003 118502 118849 118725 117545 115810
55469 115810 114037 112646 112439 113938 116578 119538 122779 126314 129261 130815 131377 131692 131796 131959 133441
55454 133441 136903 141031 144123 145997 146986 146422 143904 140964 139519 139487 139573 139382 139005 137640 134715 131487
55438 131487 129395 127662 124645 120779 117851 115917 113373 109881 106957 105588 105155 104720 103740 101700 98631
55423 98631 95735 93936 92329 89645 86560 84667 83822 82613 80934 79756 78617 75799 71263 67304 65902
$$ packed form
55530A62609j309n73k122l098k003j016j501j458N06K337J841k79k425m315n682
55515A41512n536m136l190l102k553j521j623k788k807j233k84p64n19J512L051
55500A16019K141R7r91j173j259j064o67j079k123k014m37L95p56k021j477J2
55484A03603P67J038J877L023L601L491K746J105q07j441n01L47j24j180j735
55469A15810j773j391k07J499K640K960L241L535K947J554N62L15J04J63J482
55454A33441L462M128L092J874R89n64k518k940j445l2Q6j91l77j365k925l228
55438A31487k092j733l017l866k928j934k544l492k924j369m33m35r80k040l069
55423I8631k896j799j607k684l085j893q45j209j679j178j139k818m536l959j402
$$ plain form
55408 65902 67004 69486 72070 73300 72381 70282 68588 67429 66037 64895 65344 67138 68447 68469 68198 68396
55392 68396 68577 68347 68167 68480 69294 70604 71900 71618 68861 65424 64178 65332 66139 64473 60938 57316
55376 57316 54749 53717 54107 54875 55139 55690 57901 61145 63129 62860 61505 60189 59003 58430 59535 61940
55360 61940 63573 63323 62329 61867 61602 60841 59923 59375 58955 58504 58547 59150 59271 58188 56678 56014 56576 58080
55342 58080 60260 62696 64707 66086 67242 68187 68025 65976 62406 58573 55738 54452 54215 53974 53412 53253
55326 53253 53605 52923 50045 46514 45123 46433 48602 50541 53084 56651 59823 61121 60702 59399 57421
55311 57421 54876 52535 51185 50879 51182 51405 50491 47840 44574 42881 43613 45412 46509 46440 45793 45298 45483
55294 45483 46360 47270 47749 48381 49816 51338 51739 51349 51558 52413 52470 51182 49676 48767 47944 46830 45965 45483
$$ packed form
55408F5902J102K482K584J230r19k099j694j159j392j142M49J794J309K2k71J98
55392F8396J81k30j80L13Q14J310J296k82k757l437j246J154Q07j666l535l622
55376E7316k567j032L90P68K64N51K211L244J984k69j355j316j186n73J105K405
55360F1940J633k50r94m62k65p61r18n48m20m51M3O03J21j083j510o64N62J504
55342E8080K180K436K011J379J156R45j62k049l570l833k835j286k37k41n62j59
55326E3253L52o82k878l531j391J310K169J939K543L567L172J298m19j303j978
55311E7421k545k341j350l06L03K23r14k651l266j693P32J799J097o9o47m95J85
55294D5483Q77R10M79O32J435J522M01l90K09Q55N7j288j506r09q23j114q65m82
$$ plain form
55276 45483 44589 43092 41964 41678 41428 40746 40437 41034 41650 41414 40949 41501 43413 46073 48449 49188 47411
55259 47411 44051 41404 40781 41602 43000 44753 46188 46055 44556 43884 45411 47616 48142 46711 44621 42468
55243 42468 40142 38394 38597 40874 43694 45513 46054 45971 45897 45972 46042 46279 47347 49422 51343 51745 51035 51066
55225 51066 52565 54115 54241 53319 52761 53294 54710 56371 57292 56689 55194 54649 56011 58315 60302 62039
55209 62039 64074 66046 67153 67331 67000 66304 65441 65045 65345 65576 65110 64627 65214 66689 67675 67107 65093
55192 65093 62601 60871 60675 61568 62199 61760 60708 59723 58600 56736 54232 51987 51101 52337 55487 58858
55176 58858 60199 58793 56098 53852 52198 50214 47577 44970 43302 43207 44984 48399 52649 56802 60107
55161 60107 61953 62124 61281 60589 60703 61554 63144 65761 69265 72851 75639 76962 76331 74042 71571 70152
$$ packed form
55276D5483q94j497j128k86k50o82l09N97O16k36m65N52J912K660K376P39j777
55259D7411l360k647o23Q21J398J753J435j33j499o72J527K205N26j431k090k153
55243D2468k326j748K03K277K820J819N41q3p4P5P0K37J068K075J921M02p10L1
55225E1066J499J550J26r22n58N33J416J661R21o03j495n45J362K304J987J737
55209F2039K035J972J107J78l31o96q63l96L00K31m66m83N87J475R86n68k014
55192F5093k492j730j96Q93O31m39j052r85j123j864k504k245q86J236L150L371
55176E8858J341j406k695k246j654j984k637k607j668r5J777L415M250M153L305
55161F0107J846J71q43o92J14Q51J590K617L504L586K788J323o31k289k471j419
$$ plain form
55145 70152 69096 66954 64291 63413 64859 66158 65180 63167 63065 65917 70183 73785 75581 75478 74381
55130 74381 73755 74352 75496 76038 75637 74805 74345 75020 76922 78767 78708 76332 73006 69946 67067 64186 62047
55113 62047 61321 61637 62374 63354 64093 63600 61906 60594 60684 61034 60008 57820 55952 55024 54467 53795 53064 52493
55095 52493 52506 53633 55616 57228 57693 57505 57173 56170 54194 52500 52715 54898 57847 60700 63081 64283
55079 64283 63562 61140 58195 56024 55600 57118 59451 60879 60963 60674 60256 58589 55606 53528 53940 55156
55063 55156 54591 52681 52151 54029 56693 58649 60015 61134 61936 63191 66391 71430 75840 77412 76748
55048 76748 76383 77926 80733 83099 84201 84869 86538 89566 92901 95387 96828 97674 98536 100292 103539
55033 103539 107230 109015 107879 105493 103940 103281 102643 102456 103701 105732 106992 107618 109298 112509 115736
$$ packed form
55145G0152j056k142k663q78J446J299r78k013j02K852M266L602J796j03j097
55130G4381o26N97J144N42m01q32m60O75J902J845n9k376l326l060k879k881k139
55113F2047p26L16P37R80P39m93j694j312R0L50j026k188j868r28n57o72p31n71
55095E2493J3J127J983J612M65j88l32j003j976j694K15K183K949K853K381J202
55079F4283p21k422k945k171m24J518K333J428Q4k89m18j667k983k078M12J216
55063E5156n65j910n30J878K664J956J366J119Q02J255L200N039M410J572o64
55048G6748l65J543K807K366J102O68J669L028L335K486J441Q46Q62J756L247
55033A03539L691J785j136k386j553o59o38j87J245K031J260O26J680L211L227
$$ plain form
55018 115736 117694 118604 118895 118249 116639 114982 114010 113439 112866 112625 113219 114632 116623 119055 121482 123025
55002 123025 123123 122012 120332 118719 117864 118312 119879 121593 122368 121567 119103 115456 111576 108328 105997 104389
54986 104389 103119 101590 99314 96722 95117 95192 96043 96243 95457 94365 93529 93065 93037 93374 93743 94097 94948
54969 94948 96536 98286 99639 100786 102017 103266 104936 107978 112058 114940 115284 115000 116848 120318 122016
54954 122016 120068 116188 113198 112233 112848 114318 116048 117660 119288 121305 123646 125906 127922 129622 130727
54939 130727 131380 132518 134724 137356 139772 142427 145367 146828 145409 142859 142185 143310 143202 140458 137120
54924 137120 135338 134786 134468 134687 135665 136101 134804 132505 130570 129039 127329 125898 125733 126807 128261 129579
54908 129579 130672 131441 132163 133674 136249 138907 140586 141363 141834 142193 142863 144986 148913 152854 154553 154096
$$ packed form
55018A15736J958R10K91o46j610j657r72n71n73k41N94J413J991K432K427J543
55002A23025R8j111j680j613q55M48J567J714P75q01k464l647l880l248k331j608
54986A04389j270j529k276k592j605P5Q51K00p86j092q36m64k8L37L69L54Q51
54969I4948J588J750J353J147J231J249J670L042M080K882L44k84J848L470J698
54954A22016j948l880k990r65O15J470J730J612J628K017K341K260K016J700J105
54939A30727O53J138K206K632K416K655K940J461j419k550o74J125j08k744l338
54924A37120j782n52l18K19R78M36j297k299j935j531j710j431j65J074J454J318
54908A29579J093P69P22J511K575K658J679P77M71L59O70K123L927L941J699m57
$$ plain form
54892 154096 153720 154945 157334 160222 164194 170018 177109 184128 190749 197970 206679 216645 227169 238243
54878 238243 250639 265036 281352 298657 315345 329616 340432 347984 352640 353644 349744 341089
54866 341089 329313 315537 299759 282847 267369 254952 244066 232238 219679 208852 201072 195557
54854 195557 191561 189151 187632 185423 182277 179887 179321 179379 178544 177315 177383 179365 182471 185928 189764 194478
54838 194478 200660 208864 219439 232353 246979 261861 275250 286685 297615 309377 320747 328728
54826 328728 331656 330232 325573 317836 307142 294359 280297 265315 250212 236172 223232 210106
54814 210106 196352 183530 173317 165542 159011 153287 148630 144917 141660 138607 135654 132719 130242
54801 130242 128994 128755 128037 125926 123493 122466 123172 124615 125965 127007 127512 127095 125599 123096 119751
$$ packed form
54892A54096l76J225K389K888L972N824P091P019O621P221Q709R966J0524J1074
54878B38243J2396J4397J6316J7305J6688J4271J0816P552M656J004l900q655
54866C41089j1776j3776j5778j6912j5478j2417j0886j1828j2559j0827p780n515
54854A95557l996k410j519k209l146k390n66N8q35j229O8J982L106L457L836M714
54838A94478O182Q204J0575J2914J4626J4882J3389J1435J0930J1762J1370P981
54826C28728K928j424m659p737j0694j2783j4062j4982j5103j4040j2940j3126
54814B10106j3754j2822j0213p775o531n724m657l713l257l053k953k935k477
54801A30242j248k39p18k111k433j027P06J443J350J042N05m17j496k503l345
$$ plain form
54786 119751 116108 113079 111135 109824 108442 106823 105236 103923 102978 102204 101011 99136 97457 97076 97503
54771 97503 96962 94954 93284 93834 96362 99258 101485 102876 103518 103880 104868 106772 108716 109925 110918 112607
54755 112607 114866 116877 118333 119422 120104 120272 120301 120820 122343 125458 130459 136162 140169 141404 141631 143350
54739 143350 146954 151124 155262 159896 165097 170167 175096 180878 188037 195953 204098 212932 222975 233714
54725 233714 244224 254620 266277 280481 297118 314789 331993 347803 361389 371508 377126 378345
54713 378345 376093 371110 363867 355174 345899 336253 326371 317477 311068 306792 302490 296816 290586 285264
54699 285264 281463 279361 278982 279401 279232 278747 279902 283356 287221 289990 293007 298488 306734 317002 329430
54684 329430 343948 358806 372835 388220 408226 432645 458169 483048 508465 534862 559503
$$ packed form
54786A19751l643l029j944j311j382j619j587j313r45p74j193j875j679l81M27
54771I7503n41k008j670N50K528K896K227J391O42L62R88J904J944J209R93J689
54755A12607K259K011J456J089O82J68K9N19J523L115N001N703M007J235K27J719
54739A43350L604M170M138M634N201N070M929N782P159P916Q145Q834J0043J0739
54725B33714J0510J0396J1657J4204J6637J7671J7204J5810J3586J0119N618J219
54713C78345k252m983p243q693r275r646r882q894o409m276m302n674o230n322
54699B85264l801k102l79M19j69m85J155L454L865K769L017N481Q246J0268J2428
54684C29430J4518J4858J4029J5385K0006K4419K5524K4879K5417K6397K4641
$$ plain form
54673 559503 578683 590380 593961 589212 576915 559073 537466 512893 486294 459423 433691 409372
54661 409372 386582 366049 348258 332564 317696 302593 286864 271403 258478 249746 243921 237881
54649 237881 230483 223701 219355 216475 213081 209103 205920 203905 202117 199991 197856 195828 193457 190670
54635 190670 188228 186955 186975 187792 188792 189689 190724 192259 194028 195109 194955 194147 193875 194900 197149 199906
54619 199906 202107 202921 202442 201588 201121 201136 201632 202937 205161 207841 210649 213988 218293 223132 227718 232049
54603 232049 236905 242798 249476 256362 262992 268969 274026 278237 281905 285271 288587 292325 296833 301798
54589 301798 306451 310393 313857 317164 320366 323602 327393 332290 338431 345679 353910 362894 372197 381719
54575 381719 392331 405598 422766 444136 469170 496745 525436 554261 583368 613346 643401
$$ packed form
54673E59503J9180J1697L581m749j2297j7842k1607k4573k6599k6871k5732k4319
54661D09372k2790k0533j7791j5694j4868j5103j5729j5461j2925q732n825o040
54649B37881p398o782m346k880l394l978l183k015j788k126k135k028k371k787
54635A90670k442j273K0Q17J000Q97J035J535J769J081j54q08k72J025K249K757
54619A99906K201Q14m79q54m67J5M96J305K224K680K808L339M305M839M586M331
54603B32049M856N893O678O886O630N977N057M211L668L366L316L738M508M965
54589C01798M653L942L464L307L202L236L791M897O141P248Q231Q984R303R522
54575C81719J0612J3267J7168K1370K5034K7575K8691K8825K9107K9978L0055
$$ plain form
54564 643401 670646 691694 704667 709351 706047 695088 677274 654003 626976 598162 569599 542398
54552 542398 516148 490226 465544 443945 425836 409473 392948 376037 359907 345912 334911
54541 334911 326804 320255 313668 306739 300208 294006 286984 278911 271297 265379 260546 255739 251134 247213
54527 247213 243239 238193 232427 226942 221662 215960 210360 206006 202608 198553 193102 187075 181233 175451
54513 175451 169899 165714 163781 163532 163493 162600 160808 158913 157819 157592 157388 156780 156684 158138 160490 161811
54497 161811 161004 158661 156098 154534 154950 157453 160707 163087 164562 166391 168971 171201 172251 172722 173582
54482 173582 174964 176505 178015 179313 180191 181007 182581 185107 187839 190237 192740 196057 200387 205651 211824
54467 211824 218617 225491 232396 240030 249044 259484 271122 283634 296284 308263 319635 331199
$$ packed form
54564F43401K7245K1048J2973M684l304j0959j7814k3271k7027k8814k8563k7201
54552E42398k6250k5922k4682k1599j8109j6363j6525j6911j6130j3995j1001
54541C34911q107o549o587o929o531o202p022q073p614n918m833m807m605l921
54527B47213l974n046n766n485n280n702n600m354l398m055n451o027n842n782
54513A75451n552m185j933k49l9q93j792j895j094k27k04o08r6J454K352J321
54497A61811q07k343k563j564M16K503L254K380J475J829K580K230J050M71Q60
54482A73582J382J541J510J298Q78Q16J574K526K732K398K503L317M330N264O173
54467B11824O793O874O905P634R014J0440J1638J2512J2650J1979J1372J1564
$$ plain form
54455 331199 342957 353404 360708 363986 363137 358293 350073 339786 328723 317446 306130 295121 284754
54442 284754 274952 265346 255567 245380 234949 225067 216562 209398 202925 197105 192736 190193 188679 187106
54428 187106 185080 182647 179685 176068 172152 168715 166601 166333 167621 169337 170662 172162 174916 178592
54414 178592 181495 182772 183465 184891 187006 189074 191101 193754 197396 201807 206387 210165 212295 213153 214356
54399 214356 217017 220469 223348 225397 227447 229849 231620 231221 227968 222915 218363 216033 215596 215493 215071
54384 215071 214907 214931 213632 209920 204702 199645 195178 190810 186707 183668 181725 179855 177211 173994 171182
54369 171182 169796 170198 171563 172296 171448 169531 167639 166299 165513 165296 165491 165554 165197 164828 164917 165512 166920
54352 166920 169949 174564 179041 181639 182617 183536 185091 186854 188759 191309 194452 197687 201399 206665 213435
$$ packed form
54455C31199J1758J0447P304L278q49m844q220j0287j1063j1277j1316j1009j0367
54442B84754r802r606r779j0187j0431r882q505p164o473n820m369k543j514j573
54428A87106k026k433k962l617l916l437k114k68J288J716J325J500K754L676
54414A78592K903J277O93J426K115K068K027K653L642M411M580L778K130Q58J203
54399B14356K661L452K879K049K050K402J771l99l253n053m552k330m37j03m22
54384B15071j64K4j299l712n218n057m467m368m103l039j943j870k644l217k812
54369A71182j386M02J365P33q48j917j892j340p86k17J95O3l57l69Q9N95J408
54352A66920L029M615M477K598R78R19J555J763J905K550L143L235L712N266O770
$$ plain form
54337 213435 220203 225947 231217 236726 241989 246161 249292 251980 254503 257145 260649 265256 269632 271753
54323 271753 270948 268378 265529 262796 259535 254907 248604 241177 233761 227144 221056 214754 208244 202456
54309 202456 198114 194976 192491 190693 189886 189742 189235 187522 184539 180851 177336 174871 173718 173186 172498
54294 172498 172077 173203 176069 179059 180639 181330 182860 185817 189212 192180 194915 197623 199647 200267 199888
54279 199888 199797 200980 203422 206378 209015 210877 211853 211805 210643 208985 208108 208578 209324 208868 207090 204780
54263 204780 201782 197070 190783 184717 180260 177024 174111 171491 169261 166595 162543 157198 151279 145280
54249 145280 139874 136213 134591 133410 130851 127353 125173 125480 126961 127418 125779 122426 118426 114938 112763
54234 112763 111962 112017 112394 112817 113079 112862 111751 109457 106411 104214 104781 108473 113445 117388 119563 120678
$$ packed form
54337B13435O768N744N270N509N263M172L131K688K523K642L504M607M376K121
54323B71753q05k570k849k733l261m628o303p427p416o617o088o302o510n788
54309B02456m342l138k485j798q07j44n07j713k983l688l515k465j153n32o88
54294A72498m21J126K866K990J580O91J530K957L395K968K735K708K024O20l79
54279A99888r1J183K442K956K637J862R76m8j162j658q77M70P46m56j778k310
54263B04780k998m712o287o066m457l236k913k620k230k666m052n345n919n999
54249A45280n406l661j622j181k559l498k180L07J481M57j639l353m000l488k175
54234A12763q01N5L77M23K62k17j111k294l046k197N67L692M972L943K175J115
$$ plain form
54218 120678 121334 121445 120962 120386 120502 122006 125058 128731 131305 131842 131299 131485 133164 135797 138783 142069
54202 142069 145581 148880 151448 152857 152749 151257 149393 148415 148833 150346 152371 154050 154227 152510 150250
54187 150250 149473 150671 152337 152789 151669 149598 147186 144774 142539 140505 138743 137591 137314 137590 137830
54172 137830 137861 137777 137379 136609 136443 138290 142218 146518 149350 150272 150059 149860 150771 153324 156827 159773 161378
54155 161378 162270 163368 164662 165512 165683 165541 165579 166067 166933 167741 168100 168217 168607 169188 169313 168862 168464 168246
54137 168246 167198 164486 160756 157357 154745 152440 150165 148106 146318 144780 143935 144083 144162 142249 137899
54122 137899 133255 131103 132131 134620 136484 137046 137029 137504 138970 140944 142243 142072 141028 140687 141876 143620
54106 143620 144182 142958 140885 139116 137902 136970 136455 136798 137869 138633 137934 135502 132134 128968 126665 125246
$$ packed form
54218A20678O56J11m83n76J16J504L052L673K574N37n43J86J679K633K986L286
54202A42069L512L299K568J409j08j492j864r78M18J513K025J679J77j717k260
54187A50250p77J198J666M52j120k071k412k412k235k034j762j152k77K76K40
54172A37830L1q4l98p70j66J847L928M300K832R22k13j99R11K553L503K946J605
54155A61378Q92J098J294Q50J71j42L8M88Q66Q08L59J17L90N81J25m51l98k18
54137A68246j048k712l730l399k612k305k275k059j788j538q45J48P9j913m350
54122A37899m644k152J028K489J864N62j7M75J466J974J299j71j044l41J189J744
54106A43620N62j224k073j769j214r32n15L43J071P64o99k432l368l166k303j419
$$ plain form
54090 125246 124596 124849 126049 127591 128336 127349 124329 119404 113072 106481 101189 98086 96731 96238 96614 98590
54074 98590 102096 105547 107131 106585 105290 104711 105097 105723 105854 105124 103376 100849 98536 97655 98357 99426
54058 99426 99592 98737 97504 96337 95551 95762 97172 98628 98454 96400 93966 92639 92488 92604 92208 91184
54042 91184 90190 90374 92341 95439 98714 102231 106325 109830 110758 109057 107113 106950 108446 110870 114283
54027 114283 118189 120602 120354 119154 119527 121480 123010 123165 122695 122132 121275 120480 120596 121421 121718 121005 119956
54010 119956 119013 118064 117619 118738 121454 124599 127477 130262 132462 132660 130584 128111 127339 128590 130945
53995 130945 133684 136455 139007 141499 144393 147452 149704 150890 151892 153121 153689 153213 153430 156607 162795
53980 162795 169804 175587 179705 182763 185626 189307 194571 201258 208478 215752 223529 232350 241828 250883
$$ packed form
54090A25246o50K53J200J542P45r87l020m925o332o591n292l103j355m93L76J976
54074I8590L506L451J584n46j295n79L86O26J31p30j748k527k313q81P02J069
54058I9426J66q55j233j167p86K11J410J456j74k054k434j327j51J16l96j024
54042I1184r94J84J967L098L275L517M094L505R28j701j944j63J496K424L413
54027A14283L906K413k48j200L73J953J530J55m70n63q57p95J16Q25K97p13j049
54010A19956r43r49m45J119K716L145K878K785K200J98k076k473p72J251K355
53995A30945K739K771K552K492K894L059K252J186J002J229N68m76K17L177O188
53980A62795P009N783M118L058K863L681N264O687P220P274P777Q821R478R055
$$ plain form
53966 250883 258957 266590 274506 282338 288924 294100 299443 306645 315652 325067 333800 341296 346725 349510
53952 349510 350611 351767 353078 352793 350052 346484 344179 343240 342386 340997 339289 337059 333602 328733 322966
53937 322966 316701 310016 303240 297011 291549 286267 280296 273472 266781 261584 258035 254616 249952 244804
53923 244804 241110 239182 237367 234886 233298 234058 236005 236807 236034 235215 235346 235896 236186 236346 236766 237633 239145
53906 239145 241273 243267 244217 244159 243828 243361 242315 241085 241177 243417 246630 248756 248826 247316 244927 241811
53890 241811 238039 234263 231469 230147 230109 231273 234258 239642 246700 253515 258586 261947 264613 267627 271858
53875 271858 277834 285057 292102 298228 304541 312700 322775 333211 342643 350741 357248 361412 362944 362939
53861 362939 363087 364115 365423 366291 367080 369023 372845 377927 383156 388375 394317 401131 407961 414433 421651
$$ packed form
53966B50883Q074P633P916P832O586N176N343P202R007R415Q733P496N429K785
53952C49510J101J156J311k85k741l568k305r39q54j389j708k230l457m869n767
53937C22966o265o685o776o229n462n282n971o824o691n197l549l419m664n148
53923B44804l694j928j815k481j588P60J947Q02p73q19J31N50K90J60M20Q67J512
53906B39145K128J994R50n8l31m67j046j230R2K240L213K126P0j510k389l116
53890B41811l772l776k794j322l8J164K985N384P058O815N071L361K666L014M231
53875B71858N976P223P045O126O313Q159J0075J0436R432Q098O507M164J532n
53861C62939J48J028J308Q68P89J943L822N082N229N219N942O814O830O472P218
$$ plain form
53846 421651 430635 440274 447945 452251 454279 456049 458547 461501 464329 466741 468715 470294 471336 471369 469890
53831 469890 466822 462526 457394 451673 445598 439326 432627 424917 415779 405463 394950 385558 378186 372555
53817 372555 367281 360993 353409 345174 336825 328299 319471 310799 303154 296988 291807 286629 281064 275728
53803 275728 271357 267723 263860 259277 254280 249059 243264 236857 230763 226098 223011 220655 218068 214903
53789 214903 211666 209340 208212 206968 203764 198552 193513 190675 189902 189762 189332 188201 185709 181685 177532
53774 177532 175226 175247 176442 177623 178294 178162 177229 176348 176402 176849 176269 174572 173494 174529 177327 180411 182491
53757 182491 182869 181753 180673 181538 184573 188062 190645 192947 196163 200042 203292 205349 206725 208058 209863
53742 209863 212881 217513 222905 227584 231252 235250 240959 248276 255958 263027 269505 276032 283103 290545
$$ packed form
53846D21651Q984R639P671M306K028J770K498K954K828K412J974J579J042L3j479
53831D69890l068m296n132n721o075o272o699p710r138j0316j0513r392p372n631
53817C72555n274o288p584q235q349q526q828q672p645o166n181n178n565n336
53803B75728m371l634l863m583m997n221n795o407o094m665l087k356k587l165
53789B14903l237k326j128j244l204n212n039k838p73j40m30j131k492m024m153
53774A77532k306K1J195J181O71j32r33q81N4M47n80j697j078J035K798L084K080
53757A82491L78j116j080Q65L035L489K583K302L216L879L250K057J376J333J805
53742B09863L018M632N392M679L668L998N709P317P682P069O478O527P071P442
$$ plain form
53728 290545 297553 303271 307586 311391 315932 321678 327768 332616 335174 335593 334771 333500 332142 330792 329366
53713 329366 327599 325245 322249 318592 314201 309276 304421 300039 295860 291618 287933 285669 284407 282466
53699 282466 278783 274063 269593 265566 261305 256852 253561 252965 255355 259496 263601 266607 268698 270555
53685 270555 272237 273112 272980 272776 273750 276063 278503 279539 278468 275602 271601 266799 261269 255494 250569
53670 250569 247325 245346 243359 240638 237554 234721 232229 230047 228555 228111 228448 229041 229773 230688 231394 231490
53654 231490 231492 232454 234443 236193 236762 236927 238202 240860 243744 245996 248113 250961 254489 257985 261190 264474
53638 264474 268100 271991 276240 281174 286677 292001 296649 301128 306422 312854 319717 325827 330290 332996
53624 332996 334647 336162 337805 339035 339358 339008 338471 337657 336046 333687 331631 331125 332406 334338 335321 334637
$$ packed form
53728B90545P008N718M315L805M541N746O090M848K558M19q22j271j358j350j426
53713C29366j767k354k996l657m391m925m855m382m179m242l685k264j262j941
53699B82466l683m720m470m027m261m453l291n96K390M141M105L006K091J857
53685B70555J682Q75j32k04R74K313K440J036j071k866m001m802n530n775m925
53670B50569l244j979j987k721l084k833k492k182j492m44L37N93P32R15P06R6
53654B31490KR62J989J750N69J65J275K658K884K252K117K848L528L496L205L284
53638B64474L626L891M249M934N503N324M648M479N294O432O863O110M463K706
53624C32996J651J515J643J230L23l50n37q14j611k359k056n06J281J932R83o84
$$ plain form
53608 334637 332815 330626 328170 325393 323030 321978 321762 320758 318358 315850 314607 314484 314739 315358 316242
53593 316242 316043 313389 308832 304254 300731 298378 297730 299368 302184 304064 304741 306182 309401 312681 314036
53578 314036 313912 314002 314593 314737 314333 314308 314895 315240 314885 314598 315463 317891 321642 326225 331152 336250 341658
53561 341658 347204 352130 356006 359575 363841 368442 371854 373359 374043 375619 378884 383657 389589 396416
53547 396416 403677 410699 417056 422966 429176 436308 444062 451082 455927 458388 459840 462287 467013 473854
53533 473854 481481 488426 494131 499095 503917 508452 512196 515312 518676 522773 526980 530322 532681 534872
53519 534872 537545 540379 542458 543198 542776 541934 541605 542462 544264 545679 545355 543427 541465 540555 540034 538759
53503 538759 537104 536655 538059 540280 542341 544806 548816 554333 560126 565198 569488 573301 576734 579838
$$ packed form
53608C34637j822k189k456k777k363j052k16j004k400k508j243j23K55O19Q84
53593C16242j99k654m557m578l523k353o48J638K816J880O77J441L219L280J355
53578C14036j24R0N91J44m04k5N87L45l55k87Q65K428L751M583M927N098N408
53561C41658N546M926L876L569M266M601L412J505O84J576L265M773N932O827
53547C96416P261P022O357N910O210P132P754P020M845K461J452K447M726O841
53533D73854P627O945N705M964M822M535L744L116L364M097M207L342K359K191
53519E34872K673K834K079P40m22q42l29Q57J802J415l24j928j962r10n21j275
53503E38759j655m49J404K221K061K465M010N517N793N072M290L813L433L104
$$ plain form
53489 579838 582996 586867 591967 598185 604685 610499 615387 619953 624860 630245 635996 642150 648713 655451
53475 655451 662268 669557 677853 687306 697785 709178 721210 733252 744820 756118 767703 779747
53463 779747 792013 804424 817198 830460 844146 858311 873290 889542 907529 927465 948865
53452 948865 970613 992042 1013917 1037833 1064559 1093315 1122700 1151940 1181311 1211755 1244159
53441 1244159 1278611 1314347 1350817 1388682 1429097 1471923 1515379 1557902 1599749 1642257 1685894
53430 1685894 1729633 1771994 1812209 1850526 1888027 1926048 1965189 2004724 2043422 2081015 2118377
53419 2118377 2156258 2194572 2233248 2272908 2313729 2354027 2391218 2424515 2455869 2487687 2520278
53408 2520278 2552130 2582152 2610591 2637773 2662906 2684725 2702868 2718069 2731051 2741581 2748663
$$ packed form
53489E79838L158L871N100O218O500N814M888M566M907N385N751O154O563O738
53475F55451O817P289Q296R453J0479J1393J2032J2042J1568J1298J1585J2044
53463G79747J2266J2411J2774J3262J3686J4165J4979J6252J7987J9936K1400
53452I48865K1748K1429K1875K3916K6726K8756K9385K9240K9371L0444L2404
53441A244159L4452L5736L6470L7865M0415M2826M3456M2523M1847M2508M3637
53430A685894M3739M2361M0215L8317L7501L8021L9141L9535L8698L7593L7362
53419B118377L7881L8314L8676L9660M0821M0298L7191L3297L1354L1818L2591
53408B520278L1852L0022K8439K7182K5133K1819J8143J5201J2982J0530P082
$$ plain form
53397 2748663 2751460 2749901 2744549 2736097 2725086 2711920 2696835 2679801 2660795 2640284 2619085 2597489
53385 2597489 2574815 2550119 2523076 2493848 2462557 2429504 2395690 2362341 2329945 2298295 2267240
53374 2267240 2236502 2204974 2171619 2137703 2106962 2082410 2063457 2047088 2031419 2017074 2005250
53363 2005250 1995692 1987079 1978715 1971238 1965904 1963533 1964076 1966954 1971726 1978317 1986669 1996533 2007930 2021491
53349 2021491 2037788 2056503 2076828 2098790 2123498 2151751 2182894 2215631 2249674 2285943 2325123
53338 2325123 2366674 2409621 2453876 2500273 2549507 2601710 2657124 2716465 2780128 2847373 2916866
53327 2916866 2987831 3060253 3134142 3209265 3285533 3363005 3441415 3520265 3599417 3678904 3757904
53316 3757904 3834820 3908937 3981308 4053154 4123765 4190897 4253062 4310533 4363951 4412734 4455307
$$ packed form
53397B748663K797j559n352q452j1011j3166j5085j7034j9006k0511k1199k1596
53385B597489k2674k4696k7043k9228l1291l3053l3814l3349l2396l1650l1055
53374B267240l0738l1528l3355l3916l0741k4552j8953j6369j5669j4345j1824
53363B005250r558q613q364p477n334k371N43K878M772O591Q352R864J1397J3561
53349B021491J6297J8715K0325K1962K4708K8253L1143L2737L4043L6269L9180
53338B325123M1551M2947M4255M6397M9234N2203N5414N9341O3663O7245O9493
53327B916866P0965P2422P3889P5123P6268P7472P8410P8850P9152P9487P9000
53316C757904P6916P4117P2371P1846P0611O7132O2165N7471N3418M8783M2573
$$ plain form
53305 4455307 4490409 4517782 4537908 4551497 4559093 4560756 4555957 4543898 4524042 4496420 4461560 4420322
53293 4420322 4373770 4323035 4269050 4212332 4153045 4091343 4027513 3961767 3894033 3824170 3752402
53282 3752402 3679510 3606679 3535119 3465545 3397808 3331339 3266184 3203168 3142607 3083308 3023720
53271 3023720 2963954 2905888 2851179 2800013 2751929 2706884 2664990 2625992 2589681 2556205 2525229
53260 2525229 2495401 2465621 2436643 2410411 2387670 2366946 2346135 2324480 2302604 2281109 2259848
53249 2259848 2238695 2218482 2200591 2185612 2172805 2161152 2150556 2141653 2134818 2130023 2127369 2126895
53237 2126895 2127861 2129195 2131002 2134805 2141873 2152028 2164562 2179503 2197353 2218118 2241327 2266522
53225 2266522 2293153 2320588 2348972 2379615 2413598 2450259 2487781 2525009 2561920 2598602 2634663
$$ packed form
53305D455307L5102K7373K0126J3589P596J663m799j2059j9856k7622l4860m1238
53293D420322m6552n0735n3985n6718n9287o1702o3830o5746o7734o9863p1768
53282C752402p2892p2831p1560o9574o7737o6469o5155o3016o0561n9299n9588
53271C023720n9766n8066n4709n1166m8084m5045m1894l8998l6311l3476l0976
53260B525229k9828k9780k8978k6232k2741k0724k0811k1655k1876k1495k1261
53249B259848k1153k0213j7891j4979j2807j1653j0596q903o835m795k654m74
53237B126895R66J334J807L803P068J0155J2534J4941J7850K0765K3209K5195
53225B266522K6631K7435K8384L0643L3983L6661L7522L7228L6911L6682L6061
$$ plain form
53214 2634663 2669583 2702727 2732873 2758492 2778920 2794943 2808060 2819197 2827949 2832891 2832929 2828560
53202 2828560 2821414 2812298 2800376 2784765 2766124 2745804 2723982 2699639 2671995 2641059 2607146 2570917
53190 2570917 2533608 2496131 2458092 2418659 2378072 2337014 2294884 2250397 2204170 2159020 2116964
53179 2116964 2077163 2037689 1998309 1960588 1925900 1894163 1864130 1834385 1804497 1775569 1749286
53168 1749286 1726132 1705049 1684872 1665339 1646533 1628345 1610940 1594866 1580175 1566244 1552901
53157 1552901 1540792 1530037 1519548 1508546 1497846 1488609 1480418 1471660 1461310 1449435 1436397 1422602
53145 1422602 1408662 1394801 1380339 1364717 1348858 1334555 1322577 1312211 1302425 1292561 1281983 1270160
53133 1270160 1257308 1244108 1230589 1216023 1200091 1183415 1166685 1149915 1132684 1114539 1095045
$$ packed form
53214B634663L4920L3144L0146K5619K0428J6023J3117J1137Q752M942L8m369
53202B828560p146r116j1922j5611j8641k0320k1822k4343k7644l0936l3913l6229
53190B570917l7309l7477l8039l9433m0587m1058m2130m4487m6227m5150m2056
53179B116964l9801l9474l9380l7721l4688l1737l0033k9745k9888k8928k6283
53168A749286k3154k1083k0177j9533j8806j8188j7405j6074j4691j3931j3343
53157A552901j2109j0755j0489j1002j0700r237q191q758j0350j1875j3038j3795
53145A422602j3940j3861j4462j5622j5859j4303j1978j0366r786r864j0578j1823
53133A270160j2852j3200j3519j4566j5932j6676j6730j6770j7231j8145j9494
$$ plain form
53122 1095045 1074169 1052860 1032559 1013826 996037 978678 962174 946925 932125 916241 898506
53111 898506 879510 860517 842524 825807 810020 794731 779876 765498 751189 736395 721386
53100 721386 707235 694465 682223 669300 655479 641299 627035 612728 598961 586628 575862
53089 575862 565911 556256 547044 538244 529178 519499 509971 501529 493909 486005 477487 469242 462066 455649
53075 455649 449313 443219 438238 434725 431918 428660 424437 419670 415212 411695 409159 407050 404542 401010
53061 401010 396445 391468 386803 382608 378409 373871 369478 366102 363811 361407 357366 351183 343786 336838
53047 336838 331604 328089 325089 321298 316556 311776 307745 304522 302121 300984 301165 301651 301337 300348 299656
53032 299656 299645 299932 300394 301308 302393 302791 302305 301723 301539 301374 301245 302335 305466 309482 312339 313556 314599
$$ packed form
53122A095045k0876k1309k0301j8733j7789j7359j6504j5249j4800j5884j7735
53111H98506j8996j8993j7993j6717j5787j5289j4855j4378j4309j4794j5009
53100G21386j4151j2770j2242j2923j3821j4180j4264j4307j3767j2333j0766
53089E75862r951r655r212q800r066r679r528q442p620p904q518q245p176o417
53075D55649o336o094m981l513k807l258m223m767m458l517k536k109k508l532
53061D01010m565m977m665m195m199m538m393l376k291k404m041o183p397o948
53047C36838n234l515l000l791m742m780m031l223k401j137J81M86l14r89o92
53032B99656j1K87M62R14J085L98m86n82j84j65j29J090L131M016K857J217J043
$$ plain form
53015 314599 316919 320585 324824 328893 332047 333531 333301 332486 332620 334395 337206 339716 340829 340382 339003
53000 339003 337122 334257 329590 323211 316273 309835 304072 298819 294228 290300 286246 281205 275583 270912
52986 270912 268028 265897 262700 257859 252628 248794 247170 247197 247517 246819 244607 241487 238532 236145 233858
52971 233858 231421 229542 228877 228643 227211 224221 221181 219502 218751 217619 215988 214967 215064 215401 214897 213356
52955 213356 211074 208267 205412 203442 202837 202962 202995 203205 204446 206661 208764 209992 210468 210359 209574 208671
52939 208671 208902 210458 211602 210774 209046 209058 211532 214254 214914 213698 212393 211958 212034 212151 212183 211796 210592
52922 210592 209006 208249 208985 210639 212301 213796 215465 217242 218509 218859 218623 218471 218679 219072 219656 220895
52906 220895 222992 225146 226162 225803 224995 224578 224600 225077 226461 228634 230285 230464 230243 231447 233901 235419
$$ packed form
53015C14599K320L666M239M069L154J484k30q15J34J775K811K510J113m47j379
53000C39003j881k865m667o379o938o438n763n253m591l928m054n041n622m671
52986B70912k884k131l197m841n231l834j624K7L20o98k212l120k955k387k287
52971B33858k437j879o65k34j432k990l040j679p51j132j631j021R7L37n04j541
52955B13356k282k807k855j970o05J25L3K10J241K215K103J228M76j09p85r03
52939B08671K31J556J144q28j728J2K474K722O60j216j305m35P6J17L2l87j204
52922B10592j586p57P36J654J662J495J669J777J267L50k36j52K08L93N84J239
52906B20895K097K154J016l59q08m17K2M77J384K173J651J79k21J204K454J518
$$ plain form
52890 235419 234853 233793 234558 237551 241459 245250 248913 252672 256486 260249 263680 266083 266968 267031 267946 270970
52874 270970 275956 281739 287111 291514 295293 299531 305285 312661 320690 328209 334827 340837 346269 350327
52860 350327 352126 352014 351758 352960 355363 357182 357169 355914 354884 354563 353990 352037 348736 345159 342131 339318
52844 339318 335820 331616 327877 325536 323969 321822 318936 316578 315581 315195 314322 313158 312832 313852 315674
52829 315674 317669 319662 321448 322485 322494 322038 322111 323149 324613 325468 325039 323487 321640 320379 320007 319971 319255
52812 319255 317422 315419 314891 316317 318224 318788 317932 317125 317406 318556 320162 322342 324966 327150 328157
52797 328157 328132 327432 326000 323983 322165 321035 320202 319575 320245 322971 326458 328576 329019 329240 329866 329937 329099
52780 329099 328892 330882 334684 338903 343116 347605 351713 353938 353793 352563 351842 351962 352171 351844 351056 350175
$$ packed form
52890B35419n66j060P65K993L908L791L663L759L814L763L431K403Q85O3R15L024
52874B70970M986N783N372M403L779M238N754P376Q029P519O618O010N432M058
52860C50327J799j12k56J202K403J819j3j255j030l21n73j953l301l577l028k813
52844C39318l498m204l739k341j567k147k886k358r97l86q73j164l26J020J822
52829C15674J995J993J786J037Rm56P3J038J464Q55m29j552j847j261l72l6p16
52812C19255j833k003n28J426J907N64q56q07K81J150J606K180K624K184J007
52797C28157k5p00j432k017j818j130q33o27O70K726L487K118M43K21O26P1q38
52780C29099k07J990L802M219M213M489M108K225j45j230p21J20K09l27p88q81
$$ plain form
52764 350175 349305 348341 347504 347522 348855 350702 351318 349790 347247 345769 346164 347371 348059 348115 348240 348659 348981
52747 348981 349205 350146 352517 355888 358927 360650 361324 362039 363410 364688 364330 361525 357022 352234 347806
52732 347806 343482 339213 335569 332733 329737 325404 319778 314083 309322 305345 301201 296040 289884 283846
52718 283846 279308 276395 273617 269696 265355 262349 260857 259039 255451 250792 246772 244113 242341 240771
52704 240771 238937 236487 233402 230044 226621 223042 219583 217069 215816 215065 214028 212877 212005 211043 209502
52689 209502 207686 205895 203313 199045 193983 190237 188617 187897 186634 184461 181416 177463 173320 170592
52675 170592 170140 170998 171639 171650 171492 171278 170637 169411 167759 165828 163932 162645 162050 161176 158955 155621 152529
52658 152529 150698 150120 150379 151129 151846 151917 151335 150812 150801 150710 149505 146943 143944 141863 141519 142722 144468
$$ packed form
52764C50175q70r64q37J8J333J847O16j528k543j478L95J207O88N6J25M19L22
52747C48981K24R41K371L371L039J723O74P15J371J278l58k805m503m788m428
52732C47806m324m269l644k836k996m333n626n695m761l977m144n161o156o038
52718B83846m538k913k778l921m341l006j492j818l588m659m020k659j772j570
52704B40771j834k450l085l358l423l579l459k514j253p51j037j151q72r62j541
52689B09502j816j791k582m268n062l746j620p20j263k173l045l953m143k728
52675A70592m52Q58O41J1j58k14o41j226j652j931j896j287n95q74k221l334l092
52658A52529j831n78K59P50P17P1n82n23j1r1j205k562k999k081l44J203J746
$$ plain form
52641 144468 145690 145972 145475 144222 141967 139090 137107 137419 139558 141432 141644 140944 140924 141858 142602 142376 141696
52624 141696 141377 141349 141042 140557 140793 142290 144280 145277 144786 144213 145613 149440 153995 157364 159333 160893
52608 160893 162531 164029 165556 167658 170123 172072 173487 175516 178794 182592 186232 190090 194317 197714
52594 197714 199137 199231 199501 200323 201170 202221 204031 205843 205902 203703 200543 197589 194729 191762 189368 188080
52578 188080 187238 185758 183339 180378 177356 174782 173029 171740 170042 167834 166070 165229 164422 162869 161417
52563 161417 161298 161830 160769 157137 152608 149627 148854 148983 148585 147516 146584 146258 146031 145137 143720 142879 143350
52546 143350 144469 144898 144249 143541 143957 145512 147097 147664 147144 146242 145494 144757 143749 142942 143423 145604 148291
52529 148291 149539 148489 146133 144276 144128 145985 149692 154790 160356 165399 169600 173188 175915 176898 176025
$$ packed form
52641A44468J222K82m97j253k255k877j983L12K139J874K12p00k0R34P44k26o80
52624A41696l19k8l07m85K36J497J990R97m91n73J400L827M555L369J969J560
52608A60893J638J498J527K102K465J949J415K029L278L798L640L858M227L397
52594A97714J423R4K70Q22Q47J051J810J812N9k199l160k954k860k967k394j288
52578A88080q42j480k419k961l022k574j753j289j698k208j764q41q07j553j452
52563A61417j19N32j061l632m529k981p73J29l98j069r32l26k27q94j417q41M71
52546A43350J119M29o49p08M16J555J585N67n20r02p48p37j008q07M81K181K687
52529A48291J248j050k356j857j48J857L707N098N566N043M201L588K727R83q73
$$ plain form
52514 176025 174812 174875 175859 176083 175228 175085 177142 180639 183807 186045 187918 189782 191611 193627 195811 197093
52498 197093 196300 193945 191993 191731 192779 194171 195325 195862 195549 194841 194577 194918 195421 196278 198347 201573
52482 201573 204582 206482 207970 209882 211686 212512 212905 214312 217181 220538 223236 224750 225051 224646 224670 226082
52466 226082 228646 231319 233540 235551 237591 239529 241259 242760 243756 244093 244476 245912 248117 249358 248485
52451 248485 246472 245181 244943 244348 242420 240145 239372 240734 243197 245468 247153 248440 249152 248560 246022
52436 246022 241639 236449 232084 229912 230119 231721 233630 235504 237381 238974 239910 240371 240704 240596 239558
52421 239558 238370 238970 242241 246542 249226 249240 247588 245606 243753 242195 241614 242709 245156 247763 249776
52406 249776 251650 254236 257493 260410 262047 262180 261000 258979 257306 257644 260568 264620 267678 269076 269742
$$ packed form
52514A76025j213O3R84K24q55j43K057L497L168K238J873J864J829K016K184J282
52498A97093p93k355j952k62J048J392J154N37l13p08k64L41N03Q57K069L226
52482B01573L009J900J488J912J804Q26L93J407K869L357K698J514L01m05K4J412
52466B26082K564K673K221K011K040J938J730J501R96L37L83J436K205J241q73
52451B48485k013j291k38n95j928k275p73J362K463K271J685J287P12n92k538
52436B46022m383n190m365k172K07J602J909J874J877J593R36M61L33j08j038
52421B39558j188O00L271M301K684J4j652j982j853j558n81J095K447K607K013
52406B49776J874K586L257K917J637J33j180k021j673L38K924M052L058J398O66
$$ plain form
52391 269742 270537 271396 271998 272317 272377 272326 272962 275232 278790 281816 282814 282109 281167 281056 282013 283945 286583 289262
52373 289262 291012 291042 289374 287302 286872 289017 292152 293566 292491 290856 290671 291771 292873 293736 295010
52358 295010 296575 297493 297556 297656 298279 298532 297208 294285 290965 288453 287160 286975 287844 289711 291982 293599
52342 293599 294022 293895 294294 295514 297036 298472 299876 301209 302279 303306 304850 306987 309166 311010 312583
52327 312583 313785 314274 314248 314598 316093 318968 323310 328931 334895 340316 345760 352486 359949 365643 368157
52312 368157 368882 369639 370091 368959 366607 364743 364173 364440 365230 366687 368590 370441 372152 373687 374478 374332
$$ packed form
52391B69742P95Q59O02L19O0n1O36K270L558L026R98p05r42j11R57J932K638K679
52373B89262J750L0j668k072m30K145L135J414j075j635j85J100J102Q63J274
52358B95010J565R18O3J00O23K53j324k923l320k512j293j85Q69J867K271J617
52342B93599M23j27L99J220J522J436J404J333J070J027J544K137K179J844J573
52327C12583J202M89k6L50J495K875M342N621N964N421N444O726P463N694K514
52312C68157P25P57M52j132k352j864n70K67P90J457J903J851J711J535P91j46
$$ [...]
##END NTUPLES=NMR SPECTRUM
##END=
