
##TITLE=AC1110_Colombia_5835382_ZlHcrL0rVu
##JCAMPDX= 6.0         $$ Bruker NMR JCAMP-DX V2.0
##DATA TYPE= NMR SPECTRUM
##DATA CLASS= NTUPLES
##ORIGIN= BRUKER
##OWNER= Administrator
$$ 1.72 TOPSPIN		Version 2.1
$$ 2012-03-28 11:08:20.406 -0500  Administrator@TOPSPIN
$$ Compression mode = diff/dup
##.OBSERVE FREQUENCY= 400.13188235
##.OBSERVE NUCLEUS= ^1H
##.ACQUISITION MODE= SIMULTANEOUS (DQD)
##.ACQUISITION SCHEME= undefined
##.AVERAGES= 64
##.DIGITISER RES= 22
##SPECTROMETER/DATA SYSTEM= spect
##.PULSE SEQUENCE= noesygpps1d.comp
##.SOLVENT NAME= COFFEE_meoh
##.SHIFT REFERENCE= INTERNAL, COFFEE_meoh, 1, 14.96823
##AUDIT TRAIL= $$ (NUMBER, WHEN, WHO, WHERE, PROCESS, VERSION, WHAT)
$$ ##TITLE= Audit trail, TOPSPIN		Version 2.1
$$ ##JCAMPDX= 5.01
$$ ##ORIGIN= Bruker BioSpin GmbH
$$ ##OWNER= Administrator
$$ $$ C:\Bruker\TOPSPIN/data/COFFEE/nmr/AC1110_Colombia_5835382_ZlHcrL0rVu/22/pdata/1/auditp.txt
$$ ##AUDIT TRAIL=  $$ (NUMBER, WHEN, WHO, WHERE, PROCESS, VERSION, WHAT)
(   1,<2012-03-28 04:54:01.156 -0500>,<Administrator>,<TOPSPIN>,<go>,<TOPSPIN 2.1>,
      <created by zg
	started at 2012-03-28 04:42:29.421 -0500,
	POWCHK enabled, PULCHK disabled,
       configuration hash MD5:
       1A 1E CE 29 27 FD 77 03 67 4E F0 E3 C4 B2 CB 90
       data hash MD5: 64K
       5C B6 A8 60 FC EE C9 FA E3 73 C5 52 A9 7E 07 0B>)
(   2,<2012-03-28 04:54:05.718 -0500>,<Administrator>,<TOPSPIN>,<proc1d>,<TOPSPIN 2.1>,
      <Start of raw data processing
       efp LB = 0.3 FT_mod = 6 PKNL = 1 PHC0 = 0 PHC1 = 0 SI = 128K 
       data hash MD5: 128K
       C8 B9 BA 2C 85 96 CB 73 70 E5 E9 79 85 86 F7 C3>)
(   3,<2012-03-28 04:54:07.093 -0500>,<Administrator>,<TOPSPIN>,<proc1d>,<TOPSPIN 2.1>,
      <pk PHC0 = 37.54028 PHC1 = 0 
       data hash MD5: 128K
       AF 74 16 7F 64 AD 85 A7 20 D8 7E 5B 17 6C 9F BB>)
(   4,<2012-03-28 04:54:07.703 -0500>,<Administrator>,<TOPSPIN>,<proc1d>,<TOPSPIN 2.1>,
      <abs ABSG = 1 
       data hash MD5: 128K
       0A C7 22 CE 50 4D 20 41 E9 7B D9 3E 19 3F F4 C8>)
(   5,<2012-03-28 04:54:07.828 -0500>,<Administrator>,<TOPSPIN>,<proc1d>,<TOPSPIN 2.1>,
      <abs ABSG = 2 
       data hash MD5: 128K
       19 CF 5D 95 1A 0C 0D F5 B0 CE 5D B4 54 C7 4D 34>)
(   6,<2012-03-28 04:54:07.890 -0500>,<Administrator>,<TOPSPIN>,<proc1d>,<TOPSPIN 2.1>,
      <abs ABSG = 3 
       data hash MD5: 128K
       10 FA 01 95 CA 35 B0 D5 FD 01 9C 9D FD 22 B5 BA>)
(   7,<2012-03-28 04:54:07.968 -0500>,<Administrator>,<TOPSPIN>,<proc1d>,<TOPSPIN 2.1>,
      <abs ABSG = 4 
       data hash MD5: 128K
       B5 72 8B 3F DB 69 3D B2 36 8C CE E7 FA 02 2E BB>)
(   8,<2012-03-28 04:54:08.031 -0500>,<Administrator>,<TOPSPIN>,<proc1d>,<TOPSPIN 2.1>,
      <abs ABSG = 5 
       data hash MD5: 128K
       7F D8 E8 E4 5A DE 5F A2 E1 80 34 8F 25 E7 96 1D>)
(   9,<2012-03-28 04:54:09.234 -0500>,<Administrator>,<TOPSPIN>,<audit>,<TOPSPIN 2.1>,
      <user comment:
       ICON-NMR User ID: COFFEE
       data hash MD5: 128K
$$ [...]
##$TP07= 0
##$TPNAME0= <>
##$TPNAME1= <>
##$TPNAME2= <>
##$TPNAME3= <>
##$TPNAME4= <>
##$TPNAME5= <>
##$TPNAME6= <>
##$TPNAME7= <>
##$TPOAL= (0..7)
0.5 0.5 0.5 0.5 0.5 0.5 0.5 0.5
##$TPOFFS= (0..7)
0 0 0 0 0 0 0 0
##$TUNHIN= 0
##$TUNHOUT= 0
##$TUNXOUT= 0
##$USERA1= <user>
##$USERA2= <user>
##$USERA3= <user>
##$USERA4= <user>
##$USERA5= <user>
##$V9= 5
##$VALIST= <valist>
##$VCLIST= <CCCCCCCCCCCCCCC>
##$VD= 0
##$VDLIST= <DDDDDDDDDDDDDDD>
##$VPLIST= <PPPPPPPPPPPPPPP>
##$VTLIST= <TTTTTTTTTTTTTTT>
##$WBST= 2048
##$WBSW= 25
##$XGAIN= (0..3)
0 0 0 0
##$XL= 0
##$YL= 0
##$YMAX_a= 13104908
##$YMIN_a= -6055092
##$ZGOPTNS= <>
##$ZL1= 120
##$ZL2= 120
##$ZL3= 120
##$ZL4= 120
##$ABSF1= 14.96823
##$ABSF2= -5.5843
##$ABSG= 5
##$ABSL= 3
##$ALPHA= 0
##$AQORDER= 0
##$ASSFAC= 0
##$ASSFACI= 0
##$ASSFACX= 0
##$ASSWID= 0
##$AUNMP= <proc_prof1d_extract.lims>
##$AXLEFT= 0
##$AXNAME= <>
##$AXNUC= <1H>
##$AXRIGHT= 0
##$AXTYPE= 0
##$AXUNIT= <>
##$AZFE= 0.1
##$AZFW= 0.1
##$BCFW= 0
##$BC_mod= 0
##$BYTORDP= 0
##$COROFFS= 0
##$CY= 15
##$DATMOD= 1
##$DC= 0
##$DFILT= <>
##$DTYPP= 0
##$F1P= 0
##$F2P= 0
##$FCOR= 0.5
##$FTSIZE= 131072
##$FT_mod= 6
##$GAMMA= 0
##$GB= 0
##$INTBC= 1
##$INTSCL= 1
##$ISEN= 128
##$LB= 0.3
##$LEV0= 0
##$LPBIN= 0
##$MAXI= 10000
##$MC2= 0
##$MEAN= 0
##$ME_mod= 0
##$MI= 0
##$NCOEF= 0
##$NC_proc= -3
##$NLEV= 6
##$NOISF1= 0
##$NOISF2= 0
##$NSP= 0
##$NTH_PI= 0
##$NZP= 0
##$OFFSET= 14.96823
##$PC= 1
##$PHC0= 37.54028
##$PHC1= 0
##$PH_mod= 1
##$PKNL= yes
##$PPARMOD= 0
##$PPDIAG= 0
##$PPIPTYP= 0
##$PPMPNUM= 2147483647
##$PPRESOL= 1
##$PSCAL= 4
##$PSIGN= 0
##$PYNMP= <proc.py>
##$REVERSE= no
##$SF= 400.130004955247
##$SI= 131072
##$SIGF1= 0
##$SIGF2= 0
##$SINO= 400
##$SIOLD= 131072
##$SPECTYP= <>
##$SREGLST= <1H.CDCl3>
##$SSB= 0
##$STSI= 131072
##$STSR= 0
##$SW_p= 8223.68421052632
##$SYMM= 0
##$S_DEV= 0
##$TDeff= 65536
##$TDoff= 0
##$TI= <>
##$TILT= no
##$TM1= 0
##$TM2= 0
##$TOPLEV= 0
##$USERP1= <user>
##$USERP2= <user>
##$USERP3= <user>
##$USERP4= <user>
##$USERP5= <user>
##$WDW= 1
##$XDIM= 131072
##$YMAX_p= 499630364
##$YMIN_p= -406801672
##$CURPLOT= <Network HP LaserJet P1505>
##$CURPRIN= <$Network HP LaserJet P1505>
##$DFORMAT= <normdp>
##$LAYOUT= <+/1D_H.xwp>
##$LFORMAT= <normlp>
##$PFORMAT= <normpl>
##$SURQMSG= 1
$$ End of Bruker specific parameters
$$ ---------------------------------
##NTUPLES= NMR SPECTRUM
##VAR_NAME=  FREQUENCY,     SPECTRUM/REAL,   SPECTRUM/IMAG
##SYMBOL=    X,             R,               I
##VAR_TYPE=  INDEPENDENT,   DEPENDENT,       DEPENDENT
##VAR_FORM=  AFFN,          ASDF,            ASDF
##VAR_DIM=   131072,        131072,          131072
##UNITS=     HZ,            ARBITRARY UNITS, ARBITRARY UNITS
##FACTOR=    0.0627417313425165, 1,          1
##FIRST=     8223.62146879498, -7645,        -94468
##LAST=      0,             -3502,           -96532
##MIN=       0,             -406801672,      0
##MAX=       8223.62146879498, 499630364,    0
$$ Real data points
##PAGE= N=1
##DATA TABLE= (X++(R..R)), XYDATA
$$ [...]
60713A253176J0609J3172J6688K0037K2386K3355K2890K1683K1159K2267K4497
60702A471919K6358K6491K4401K0769J7224J5021J3813J2380J0484Q995Q368Q229
60690A664452Q514R505J0503J0071Q124O232N218M150K495J451J877K519J852
60677A736963L28q38j893l699n623o281n887o006p190q538r496j0485j1656j2457
60663A647242j2710j3010j3731j4434j4394j3144j0707p841n715m677l813k377
60651A530689j025p12j095j247j190j393j338k21J211J300p4j337j763k534m629
60636A514642p007p768o307l663j421o38j217j842j137P40K089J565m15k405l612
60621A481604m423n537p011q362r612j1858j6078k1279k4678k4456k1812j9614
$$ plain form
60713 1253176 1263785 1276957 1293645 1313682 1336068 1359423 1382313 1403996 1425155 1447422 1471919
60702 1471919 1498277 1524768 1549169 1569938 1587162 1602183 1615996 1628376 1638860 1647855 1656223 1664452
60690 1664452 1672966 1682471 1692974 1703045 1711169 1717401 1722619 1726769 1729264 1730715 1732592 1735111 1736963
60677 1736963 1737291 1736453 1734560 1730861 1725238 1718957 1713070 1707064 1699874 1691336 1681840 1671355 1659699 1647242
60663 1647242 1634532 1621522 1607791 1593357 1578963 1565819 1555112 1547271 1541556 1536879 1533066 1530689
60651 1530689 1529664 1528952 1527857 1526610 1525420 1524027 1522689 1522468 1523679 1524979 1524905 1523568 1521805 1519271 1514642
60636 1514642 1507635 1499867 1493560 1489897 1488476 1487838 1486621 1484779 1483642 1484382 1486471 1488036 1487621 1485216 1481604
60621 1481604 1477181 1471644 1464633 1456271 1446659 1434801 1418723 1397444 1372766 1348310 1326498 1306884
60609A306884j9423k0359k0464j8538j4926j1172q475o294l158P21K935J999j96
60596A189534m92J682M135N005M405L366K760L245M794O283O682O448O492O326
60582A250665M980L266K890L418K541j16j984j269O06J764K919N644R072J0808
60568A295204J0405R768J0215J1112J1679J2447J4098J6153J7825J9399K1779
60557A450084K4853K7401K8806K9978L1939L4123L5149L5033L5254L6193L5899
60546A804712L2472K6680K0889J5937J0571L688m293j2334j9676k5540k9171l0676
60534A793259l1119l1403l1578l1167k9526k6198k1816j8311j7019j6783j5300
60523A523039j2188r147p153n419l545k651l392m423m189k951j868j124l00K69
$$ plain form
60609 1306884 1287461 1267102 1246638 1228100 1213174 1202002 1193527 1187233 1184075 1184796 1187731 1189730 1189534
60596 1189534 1189042 1190724 1194859 1199864 1204269 1207635 1210395 1213640 1218434 1224717 1231399 1237847 1244339 1250665
60582 1250665 1255645 1258911 1261801 1265219 1267760 1267644 1265660 1264391 1264997 1266761 1269680 1275324 1284396 1295204
60568 1295204 1305609 1315377 1325592 1336704 1348383 1360830 1374928 1391081 1408906 1428305 1450084
60557 1450084 1474937 1502338 1531144 1561122 1593061 1627184 1662333 1697366 1732620 1768813 1804712
60546 1804712 1837184 1863864 1884753 1900690 1911261 1914949 1910656 1898322 1878646 1853106 1823935 1793259
60534 1793259 1762140 1730737 1699159 1667992 1638466 1612268 1590452 1572141 1555122 1538339 1523039
60523 1523039 1510851 1501704 1494551 1489132 1485587 1482936 1479544 1475121 1470932 1467981 1466113 1464989 1464689 1464958
60509A464958k6o25j14K064M984P247Q169Q151Q275R305J1003J2717J4371J6093
60495A566572J7214J6970J6181J6682J8766K0888K2331K4297K7341K9688K9659
60484A806589K8346K8147K9774L2360L5426L8898M1987M3959M5483M7315M8059
60473B226343M5059L7345K6230J3416L88j0864j8726k3903k8477l2669l4329l2082
60461B167731k7147k1394j5346q960k737L022Q806J4587J9209K2119K4574K7787
60449B212251L1025L3023L4555L7873M3812N1082N8455O6364P5933Q7485J00571
60438B832429J14899J30680J48226J67330J86965K05857K23571K40881K58704
60429D509542K77141K96004L15965L38324L63634L90747M16573M35791M41036
$$ plain form
60509 1464958 1464932 1464307 1464193 1466257 1471241 1478488 1486657 1494808 1503083 1512388 1523391 1536108 1550479 1566572
60495 1566572 1583786 1600756 1616937 1633619 1652385 1673273 1695604 1719901 1747242 1776930 1806589
60484 1806589 1834935 1863082 1892856 1925216 1960642 1999540 2041527 2085486 2130969 2178284 2226343
60473 2226343 2271402 2308747 2334977 2348393 2348781 2337917 2319191 2295288 2266811 2234142 2199813 2167731
60461 2167731 2140584 2119190 2103844 2094884 2092147 2095169 2103975 2118562 2137771 2159890 2184464 2212251
60449 2212251 2243276 2276299 2310854 2348727 2392539 2443621 2502076 2568440 2644373 2731858 2832429
60438 2832429 2947328 3078008 3226234 3393564 3580529 3786386 4009957 4250838 4509542
60429 4509542 4786683 5082687 5398652 5736976 6100610 6491357 6907930 7343721 7784757
60420G784757M24748L81824L10938K14334R7714k9784j57173k74254l72947m47014
60410G933143m92862n11702n09538m93446m68058m36092m00567l64461l28750
60401C927667k93002k58124k26834k00864j79210j59984j42681j27719j14815
60392B224434j03061r2160q2560p4560o7923o2116n6518n0744m5191m0762l7563
60381A511276l4555l1117k8165k6780k6292k4932k2178j9374j7759j6895j5417
60370A247812j2878j0395r508j0454j1695j1515r950q490p776o772m683k576j957
60357A139163k672l368l308k402j80L506P046Q115O392L956K799L313N075P501
60343A174936R338R191P292N532N081N204M985M912N826P403Q646R069Q682P675
$$ plain form
60420 7784757 8209505 8591329 8902267 9116601 9214315 9184531 9027358 8753104 8380157 7933143
60410 7933143 7440281 6928579 6419041 5925595 5457537 5021445 4620878 4256417 3927667
60401 3927667 3634665 3376541 3149707 2948843 2769633 2609649 2466968 2339249 2224434
60392 2224434 2121373 2029213 1946653 1872093 1804170 1742054 1685536 1634792 1589601 1548839 1511276
60381 1511276 1476721 1445604 1417439 1390659 1364367 1339435 1317257 1297883 1280124 1263229 1247812
60370 1247812 1234934 1224539 1215031 1204577 1192882 1181367 1171417 1162927 1155151 1148379 1143696 1141120 1139163
60357 1139163 1136491 1133123 1129815 1127413 1127233 1130739 1137785 1145900 1152292 1156248 1159047 1162360 1167435 1174936
60343 1174936 1184274 1193465 1200757 1206289 1211370 1216574 1221559 1226471 1232297 1239700 1248346 1257415 1266097 1273772
60329A273772O812P153Q558R314Q231O236N003M772M589L964L086J938M56p09
60315A343175p39K6L07n42j846k590k420j667p75J41J380L137M866N692N600N595
60299A359340O347P345P875Q088Q574R467J0602J1819J2640J2466J1801J2278
60287A478642J4506J6829J7350J6327J5227J4271J2599J0319Q495P173N278K646
60275A619662M54q19k160m094n523n428m331l040j094K066N247O458N458L913
60261A616769K951J874l95l696p134j0292j3037j4626j4078j1560q661o867o263
60248A524985o036n725n530n579n621n422m993m343l459k551j940j651j438j124
60234A469573n08P57K516L578K907J349Q51J713K023O48p66j99J596K257J584
$$ plain form
60329 1273772 1280584 1287737 1296295 1305609 1313840 1320076 1325079 1329851 1334440 1338404 1341490 1343428 1343884 1343175
60315 1343175 1342436 1342462 1342769 1342227 1340381 1337791 1335371 1333704 1332929 1333070 1334450 1337587 1342453 1348145 1353745 1359340
60299 1359340 1365687 1373032 1380907 1388995 1397569 1407036 1417638 1429457 1442097 1454563 1466364 1478642
60287 1478642 1493148 1509977 1527327 1543654 1558881 1573152 1585751 1596070 1604565 1611738 1617016 1619662
60275 1619662 1620116 1619297 1617137 1613043 1607520 1602092 1597761 1594721 1593627 1595693 1600940 1607398 1612856 1616769
60261 1616769 1619720 1621594 1621199 1617503 1610369 1600077 1587040 1572414 1558336 1546776 1538115 1531248 1524985
60248 1524985 1518949 1513224 1507694 1502115 1496494 1491072 1486079 1481736 1478277 1475726 1473786 1472135 1470697 1469573
60234 1469573 1469065 1469822 1472338 1475916 1478823 1480172 1481023 1482736 1484759 1485407 1484641 1484442 1486038 1488295 1489879
60219A489879K017N145R599J3091J5078J6379J7285J7275J6242J4851J3711J2856
60207A643408J2144J1676J1677J2316J3770J6156J9202K2064K3827K4450K5056
60196A835746K7003L0597L5015L9513M4222M9534N5187O0539O5472P0468P5896
60185B389192Q1718Q8019R5316J04074J14024J24125J33244J40959J47737J54313
60175C572721J60881J66949J71759J74492J74342J70898J64671J56635J47203
60166E060551J35957J22418J06556Q8671O9519N0507L2715J5695j543j8048l1002
60155E631996l9003m3750m7243m8727m6162l9583l0929k1043r035N406K1090L7009
60143E370026N3236O9759Q5954J01703J17371J32152J44094J52597J59292J65245
$$ plain form
60219 1489879 1491896 1497041 1506640 1519731 1534809 1551188 1568473 1585748 1601990 1616841 1630552 1643408
60207 1643408 1655552 1667228 1678905 1691221 1704991 1721147 1740349 1762413 1786240 1810690 1835746
60196 1835746 1862749 1893346 1928361 1967874 2012096 2061630 2116817 2177356 2242828 2313296 2389192
60185 2389192 2470910 2558929 2654245 2758319 2872343 2996468 3129712 3270671 3418408 3572721
60175 3572721 3733602 3900551 4072310 4246802 4421144 4592042 4756713 4913348 5060551
60166 5060551 5196508 5318926 5425482 5514153 5583672 5634179 5666894 5682589 5681046 5662998 5631996
60155 5631996 5592993 5549243 5502000 5453273 5407111 5367528 5336599 5315556 5306521 5311927 5333017 5370026
60143 5370026 5423262 5493021 5578975 5680678 5798049 5930201 6074295 6226892 6386184 6551429
60133F551429J68598J66469J58291J45883J30908J13611R3663P0951M5805J9474
60123G665082n953k9225n1083p2420r1738j06249j15442j21563j25798j25949
60113F819662j19416j07098r2413p7162o0398m1280k0850l49K0444M1930O2924
60102F425994Q1487R6755J08695J16679J19786J18235J13124J04749R2720P7769
60092G455993O2041M7109L3012J9824Q719O77m582p275o293n40R319K1845L6940
60079G676789N5576P7767J02182J27585J53502J79676K06180K34021K64287K96443
60069I374008L28553L59298L88896M17897M46069M72499M95838N14324N26522
60060A3323904N32163N31338N22976N05388M78291M42853L99466L47151K85995
$$ plain form
60133 6551429 6720027 6886496 7044787 7190670 7321578 7435189 7528852 7599803 7645608 7665082
60123 7665082 7659129 7629904 7578821 7506401 7414663 7308414 7192972 7071409 6945611 6819662
60113 6819662 6700246 6593148 6500735 6423573 6363175 6321895 6301045 6300696 6321140 6363070 6425994
60102 6425994 6507481 6604236 6712931 6829610 6949396 7067631 7180755 7285504 7378224 7455993
60092 7455993 7518034 7565143 7598155 7617979 7626698 7627375 7622793 7615518 7609225 7608685 7618004 7639849 7676789
60079 7676789 7732365 7810132 7912314 8039899 8193401 8373077 8579257 8813278 9077565 9374008
60069 9374008 9702561 10061859 10450755 10868652 11314721 11787220 12283058 12797382 13323904
60060 13323904 13856067 14387405 14910381 15415769 15894060 16336913 16736379 17083530 17369525
60051A7369525K18530J47694P4562p89p7215j52520k24686k91721l50941l99753
60041A6312686m36929m62169m75004m75352m64635m44879m16881l80809l38553
60032A2417475k93787k49048k04095j57970j11559o7201k6652R439M0475O5660
60022A1422737Q4615R7327J03232J01305R1381P4824N3607K9168K563k4976n2333
60011A1983450p9152j05517j30952j54422j75291j93766k10141k24142k35344
60002A0474723k43733k49259k51194k48571k41292k30255k16355j99750j80295
59993H414019j58335j34824j10738q6505o2035l7291j2725J1203L4916N9532Q5282
59982H002499J10395J32210J49428J62574J72165J77057J75302J66351J51692
$$ plain form
60051 17369525 17588055 17735749 17810311 17809522 17732307 17579787 17355101 17063380 16712439 16312686
60041 16312686 15875757 15413588 14938584 14463232 13998597 13553718 13136837 12756028 12417475
60032 12417475 12123688 11874640 11670545 11512575 11401016 11333815 11307163 11316602 11357077 11422737
60022 11422737 11507352 11604679 11707911 11809216 11900597 11975421 12029028 12058196 12060759 12035783 11983450
60011 11983450 11904298 11798781 11667829 11513407 11338116 11144350 10934209 10710067 10474723
60002 10474723 10230990 9981731 9730537 9481966 9240674 9010419 8794064 8594314 8414019
59993 8414019 8255684 8120860 8010122 7923617 7861582 7824291 7811566 7822769 7857685 7917217 8002499
59982 8002499 8112894 8245104 8394532 8557106 8729271 8906328 9081630 9247981 9399673
59973I399673J33086J10687Q3596N2080J8375j5242m8318q1285j13075j41127
59963I398450j63915j82146j96773k06945k10981k08469k00285j87189j69749
59954G671998j49358j27823j05695q2090n6453k9705l303K2168M7224P2803R9493
59943G359259J26859J53521J78251K00824K21282K38806K52108K60591K63898
59934I255399K60680K49249K29797K04588J75585J43126J07408O9690L1032q986
59924A0717568n0820r2842j31761j64868j90972k09648k20609k23741k18986k06436
59914I006885j87188j63684j38274j11539q2874n2578k2459N811L2032N6941Q0953
59903H424026J03750J24486J42063J55535J64746J70363J73153J73271J70359
$$ plain form
59973 9399673 9532759 9643446 9727042 9779122 9797497 9782255 9733937 9652652 9539577 9398450
59963 9398450 9234535 9052389 8855616 8648671 8437690 8229221 8028936 7841747 7671998
59954 7671998 7522640 7394817 7289122 7207032 7150579 7120874 7117571 7139739 7186963 7259766 7359259
59943 7359259 7486118 7639639 7817890 8018714 8239996 8478802 8730910 8991501 9255399
59934 9255399 9516079 9765328 9995125 10199713 10375298 10518424 10625832 10695522 10726554 10717568
59924 10717568 10666748 10573906 10442145 10277277 10086305 9876657 9656048 9432307 9213321 9006885
59914 9006885 8819697 8656013 8517739 8406200 8323326 8270748 8248289 8254100 8286132 8343073 8424026
59903 8424026 8527776 8652262 8794325 8949860 9114606 9284969 9458122 9631393 9801752
59894I801752J64185J55009J43564J30754J17359J03982R1262Q0037P1204O5471
59884A0924579O3353O5269P1564Q2546R8520J19497J44753J73098K03972K37950
59874A2185101K75677L16462L58427L99839M39440M75413N05033N26063N37705
59865A6019160N39225N27975M99933M52403L85431L00727K00698Q9440k6418j39439
59855A8849135k44003l36693m14795m75928n19219n45540n56061n51593n33791
59846A4671512n05866m71112m31276l86912l38853k88649k38101j88867j41870
59837A1680006r6563n1528o608L6137P4454J08139J38301J64886J86100J99924
59827A2433248K05065K00528J85444J59439J22582P5172J8479m4596j10475j76308
$$ plain form
59894 9801752 9965937 10120946 10264510 10395264 10512623 10616605 10707867 10787904 10859108 10924579
59884 10924579 10987932 11053201 11124765 11207311 11305831 11425328 11570081 11743179 11947151 12185101
59874 12185101 12460778 12777240 13135667 13535506 13974946 14450359 14955392 15481455 16019160
59865 16019160 16558385 17086360 17586293 18038696 18424127 18724854 18925552 19014992 18988574 18849135
59855 18849135 18605132 18268439 17853644 17377716 16858497 16312957 15756896 15205303 14671512
59846 14671512 14165646 13694534 13263258 12876346 12537493 12248844 12010743 11821876 11680006
59837 11680006 11583443 11531915 11525307 11561444 11635898 11744037 11882338 12047224 12233324 12433248
59827 12433248 12638313 12838841 13024285 13183724 13306306 13381478 13399957 13355361 13244886 13068578
59817A3068578k39579k96941l44973l82187m09076m26335m34286m34038m27513
59808I673650m15845l99044l77668l53529l28139l01745k74469k47324k21335
59799F754552j96639j73125j51054j30391j10554r1591p4797o1435n1507m4380
59789E669079l9663l6837l4998l3871l4127l5784l7140l6434l3903l1130k8931
59778E286261k7094k5834k6204k9010l4094m0586m7168n2366n5358n6412n6119
59767D836016n4597n2081m9640m8223m7191m4747l9851l2920k4871j6363q029
59756D417503n48N851J1433J6367K0588K4349K8486L4004M1587N1346O2505P3404
59744D786875Q2258Q8150R1257R2261R1864R0446Q7707Q2681P4741O4708N4654
$$ plain form
59817 13068578 12828999 12532058 12187085 11804898 11395822 10969487 10535201 10101163 9673650
59808 9673650 9257805 8858761 8481093 8127564 7799425 7497680 7223211 6975887 6754552
59799 6754552 6557913 6384788 6233734 6103343 5992789 5901198 5826401 5764966 5713459 5669079
59789 5669079 5629416 5592579 5557581 5523710 5489583 5453799 5416659 5380225 5346322 5315192 5286261
59778 5286261 5259167 5233333 5207129 5178119 5144025 5103439 5056271 5003905 4948547 4892135 4836016
59767 4836016 4781419 4729338 4679698 4631475 4584284 4539537 4499686 4466766 4441895 4425532 4417503
59756 4417503 4416955 4422806 4434239 4450606 4471194 4495543 4524029 4558033 4599620 4650966 4713471 4786875
59744 4786875 4869133 4957283 5048540 5140801 5232665 5323111 5410818 5493499 5568240 5632948 5687602
59733E687602M6519M1113L8316L7714L8833M1311M5358N2040O2512P6712R3096
59722F261126J10207J28252J48549J71336J95295K19556K45004K72561L01275
59713H053161L29734L58715L90351M24521M57763M85967N06029N13835N02358
59704A2022434M63627L92819K90969J65852L1368r6055k03361k84495l38847l68073
59694A2076238l75475l66471l46725l19410k85572k46820k06163j66103j27203
59685I636296q8839n0688j3367K1808N3931Q3882J14004J45632J77553K07845
59675A0288057K36644K65958K97332L30983L66756M04420M43224M82628N23395
59666A3639397N66656O12060O58412P06097P57007Q11458Q66820R20016R70224
$$ plain form
59733 5687602 5734121 5775234 5813550 5851264 5890097 5931408 5976766 6028806 6091318 6168030 6261126
59722 6261126 6371333 6499585 6648134 6819470 7014765 7234321 7479325 7751886 8053161
59713 8053161 8382895 8741610 9131961 9556482 10014245 10500212 11006241 11520076 12022434
59704 12022434 12486061 12878880 13169849 13335701 13367069 13271014 13067653 12783158 12444311 12076238
59694 12076238 11700763 11334292 10987567 10668157 10382585 10135765 9929602 9763499 9636296
59685 9636296 9547457 9496769 9483402 9505210 9559141 9643023 9757027 9902659 10080212 10288057
59675 10288057 10524701 10790659 11087991 11418974 11785730 12190150 12633374 13116002 13639397
59666 13639397 14206053 14818113 15476525 16182622 16939629 17751087 18617907 19537923 20508147
59657B0508147J017928J062177J099740J126690J140151J138904J123199J094336
59649B9311272J054682J008083R59700R14466Q75610Q44902Q23594Q11797Q07030
59640C7411136Q04503P99095P86179P60971P18988O58115N79389M85421L79220
59631D3383017K64950J48436L5802o7684j56981k27014k74480k99255l02697k85254
59621D2218840k46932j89652j17406l3900N8891J59769K67068L78779M92941O07423
59611D3595821P19844Q27861R28695J017798J088609J134150J148481J126129
59603E1587388J061010R47270P81797N65900L05390J0427l04222o20048r17867
59594E3417045j181471j399569j565771j678092j738639j752966j728658j673753
$$ plain form
59657 20508147 21526075 22588252 23687992 24814682 25954833 27093737 28216936 29311272
59649 29311272 30365954 31374037 32333737 33248203 34123813 34968715 35792309 36604106 37411136
59640 37411136 38215639 39014734 39800913 40561884 41280872 41938987 42518376 43003797 43383017
59631 43383017 43647967 43796403 43832205 43764521 43607540 43380526 43106046 42806791 42504094 42218840
59621 42218840 41971908 41782256 41664850 41630950 41689841 41849610 42116678 42495457 42988398 43595821
59611 43595821 44315665 45143526 46072221 47090019 48178628 49312778 50461259 51587388
59603 51587388 52648398 53595668 54377465 54943365 55248755 55259182 54954960 54334912 53417045
59594 53417045 52235574 50836005 49270234 47592142 45853503 44100537 42371879 40698126
59586D0698126j595734j501653j399200j297717j207635j138360j096381j084623
59578C0376823j101833j141028j189273j231397j255856j257849j237892j198909
59570B0762786j144855j080397j010128r37670q65413p94625p25751o59327n96825
59561A2947795n39908m88740m41994l98869l59987l25757k95096k66609k40067
59552I590768k15784j93592j73671j57449j46011j38079j31251j25145j21764
59543H188022j22525j26294j30902j35378j40041j45039j49536j52075j51481
59534F934751j47791j42283j36147j29086j19850j08299r6221q5523p6088o6054
59524E827409n4214m1611l0315k0986j2258k739P154J6056K3685L0830L7616M3236
$$ plain form
59586 40698126 39102392 37600739 36201539 34903822 33696187 32557827 31461446 30376823
59578 30376823 29274990 28133962 26944689 25713292 24457436 23199587 21961695 20762786
59570 20762786 19617931 18537534 17527406 16589736 15724323 14929698 14203947 13544620 12947795
59561 12947795 12407887 11919147 11477153 11078284 10718297 10392540 10097444 9830835 9590768
59552 9590768 9374984 9181392 9007721 8850272 8704261 8566182 8434931 8309786 8188022
59543 8188022 8065497 7939203 7808301 7672923 7532882 7387843 7238307 7086232 6934751
59534 6934751 6786960 6644677 6508530 6379444 6259594 6151295 6055074 5969551 5893463 5827409
59524 5827409 5773195 5731584 5701269 5680283 5668025 5665286 5672440 5688496 5712181 5743011 5780627 5823863
59512E823863M7633N2003N6982O1712O5535O9292P3852P8569Q2581Q6717R2596
59501F591335J00555J09934J20733J33249J46548J59260J71966J86928K05047
59492G925555K24606K43571K61907K80872L00964L21395L41033L59218L75827
59483A0634948L90735M03131M11556M14825M12532M04463L90348L70830L47599
59474A4180967L21298K90148K52410K09943J67639J29191R4909O3727L5597J1264
59464A5757093q819k4274l4273l7979l5013k5141q136J5626M4844P7724J12354
59453A5834006J46631J78328K05136K24143K31787K25035K02439J63598J08694
59444A7519797L9828l8125j20095k03969k89248l72644m47411n07706n51724n79964
$$ plain form
59512 5823863 5871496 5923499 5980481 6042193 6107728 6177020 6250872 6329441 6412022 6498739 6591335
59501 6591335 6691890 6801824 6922557 7055806 7202354 7361614 7533580 7720508 7925555
59492 7925555 8150161 8393732 8655639 8936511 9237475 9558870 9899903 10259121 10634948
59483 10634948 11025683 11428814 11840370 12255195 12667727 13072190 13462538 13833368 14180967
59474 14180967 14502265 14792413 15044823 15254766 15422405 15551596 15646505 15710232 15745829 15757093
59464 15757093 15748274 15724000 15689727 15651748 15616735 15591594 15583458 15599084 15643928 15721652 15834006
59453 15834006 15980637 16158965 16364101 16588244 16820031 17045066 17247505 17411103 17519797
59444 17519797 17559625 17521500 17401405 17197436 16908188 16535544 16088133 15580427 15028703 14448739
59434A4448739n92702n90680n76442n52991n21972m84693m43906m02715l62023
59425I920615l20765k78734k37709j99445j63708j29130r5239o2758l2124k660
59415H398343K6321N4324Q0439J05179J30426J57169J84221K09661K32615K52921
59405I831619K70028K83444K93408K99749L00550K93187K76285K49521K12342
59396A2310133J64729J08883M8235j5299q1297j47976k11152k66625l12370l48283
59386A1248978l75187l94356m06495m10948m07265l97452l84869l70762l53852
59377G747792l33607l11654k89274k65984k41901k19385k00388j83660j66441
59368E535498j48065j30306j14767j01286q8619p5690o2458m9997l9342l0189
$$ plain form
59434 14448739 13856037 13265357 12688915 12135924 11613952 11129259 10685353 10282638 9920615
59425 9920615 9599850 9321116 9083407 8883962 8720254 8591124 8495885 8433127 8401003 8398343
59415 8398343 8424664 8478988 8559427 8664606 8795032 8952201 9136422 9346083 9578698 9831619
59405 9831619 10101647 10385091 10678499 10978248 11278798 11571985 11848270 12097791 12310133
59396 12310133 12474862 12583745 12631980 12616681 12535384 12387408 12176256 11909631 11597261 11248978
59386 11248978 10873791 10479435 10072940 9661992 9254727 8857275 8472406 8101644 7747792
59377 7747792 7414185 7102531 6813257 6547273 6305372 6085987 5885599 5701939 5535498
59368 5535498 5387433 5257127 5142360 5041074 4952455 4876765 4814307 4764310 4724968 4694779
59358D694779k1478j3053n353K257J0908J9833K6966L2592L9629M8650N5081N3894
59346D944705M5684L5943K9484K7677L0057L5964M4592N5308O8114Q2537R6266
59335E496331J06206J11035J12156J12639J15766J23601J35771J50246J66127
59326F629878J84782K07474K33252K60422K88870L19306L51474L84937M20705
59317I281100M60030N02074N44698N87285O30984O76428P22807P68668Q11722
59308A4985796Q48044Q73414Q85776Q84969Q70359Q40723P96722P41788O79880
59299B2407471O13795N46019M79582M16933L58539L03088K48513J92720J34246
59290B5700906P2652P779o1411j36458k17786l03959l92468m80397n64302o40461
$$ plain form
59358 4694779 4673301 4660248 4654895 4657152 4668060 4687893 4714859 4747451 4787080 4835730 4890811 4944705
59346 4944705 4990389 5026332 5055816 5083493 5113550 5149514 5194106 5249414 5317528 5400065 5496331
59335 5496331 5602537 5713572 5825728 5938367 6054133 6177734 6313505 6463751 6629878
59326 6629878 6814660 7022134 7255386 7515808 7804678 8123984 8475458 8860395 9281100
59317 9281100 9741130 10243204 10787902 11375187 12006171 12682599 13405406 14174074 14985796
59308 14985796 15833840 16707254 17593030 18477999 19348358 20189081 20985803 21727591 22407471
59299 22407471 23021266 23567285 24046867 24463800 24822339 25125427 25373940 25566660 25700906
59290 25700906 25773558 25781337 25719926 25583468 25365682 25061723 24669255 24188858 23624556 22984095
59280B2984095p05834p58800p99126q27497q44778q51373q47642q35036q15748
59271A5698261p90634p58719p19912o77148o34187n91967n48955n04728m61209
59262A0010802m20195l81537l44394l08838k75402k44190k15154j88509j64312
59253G468271j42198j21990j03950q7980p3151n8471m3713k9184j5065j353J1745
59242F802961K3694L4136M3579N3458O5108P8472R2218J05096J16656J26668J34764
59231G676810J41086J46413J51054J54381J55885J55870J54602J51836J47959
59222I035896J44436J42077J39943J37009J33956J32055J31278J30764J30047
59213A0257461J28244J23230J13692J01426Q9507P8414O5891N0265L1786J0676
$$ plain form
59280 22984095 22278261 21519461 20720335 19892838 19048060 18196687 17349045 16514009 15698261
59271 15698261 14907627 14148908 13428996 12751848 12117661 11525694 10976739 10472011 10010802
59262 10010802 9590607 9209070 8864676 8555838 8280436 8036246 7821092 7632583 7468271
59253 7468271 7326073 7204083 7100133 7012153 6939002 6880531 6836818 6807634 6792569 6791216 6802961
59242 6802961 6826655 6860791 6904370 6957828 7022936 7101408 7193626 7298722 7415378 7542046 7676810
59231 7676810 7817896 7964309 8115363 8269744 8425629 8581499 8736101 8887937 9035896
59222 9035896 9180332 9322409 9462352 9599361 9733317 9865372 9996650 10127414 10257461
59213 10257461 10385705 10508935 10622627 10724053 10813560 10891974 10957865 11008130 11039916 11050592
59203A1050592j3700m1041o9185r5847j20058j41403j59055j72164j80204j82700
59193I875235j79622j72195j62152j49886j34597j16347r6719p7005n7195l7334
59183H692183j8573k001J2680K6525L9965N2643O3910P3028P9391Q3229Q5792
59172I188772Q8490R1954R5987J00226J04979J11523J21161J33785J48179J64313
59162A0349369J84191K09380K38717K69905L02422L36817L71658M03386M29270
59153A3095115M48221M58344M55886M37671M02882L51565K83219J98410J00525
59144A6231838n536j15701k26497l33318m30476n13173n78695o25982o54880o66073
59134A2081507o61248o43252o15903n83075n47379n09895m71303m32954l96468
$$ plain form
59203 11050592 11036892 10995851 10926666 10830819 10710761 10569358 10410303 10238139 10057935 9875235
59193 9875235 9695613 9523418 9361266 9211380 9076783 8960436 8863717 8786712 8729517 8692183
59183 8692183 8673610 8671609 8684289 8710814 8750779 8803422 8867332 8940360 9019751 9102980 9188772
59172 9188772 9277262 9369216 9465203 9565429 9670408 9781931 9903092 10036877 10185056 10349369
59162 10349369 10533560 10742940 10981657 11251562 11553984 11890801 12262459 12665845 13095115
59153 13095115 13543336 14001680 14457566 14895237 15298119 15649684 15932903 16131313 16231838
59144 16231838 16226302 16110601 15884104 15550786 15120310 14607137 14028442 13402460 12747580 12081507
59134 12081507 11420259 10777007 10161104 9578029 9030650 8520755 8049452 7616498 7220030
59125G220030l62574l30843l00641k72191k46358k23453k02630j82954j64708
59116D933678j48799j35033j22144j09658r8344q8304p8321o8011n9032n2555
59106C973477m6892l9591l0834k2651j5561q389j036N144R996J5289K2035K8991
59094C889978L4754L9785M5438N2168N9454O6580P2877P8033Q2631Q7667R3351
59083D602716R9066J04440J09539J14195J18268J22447J27495J32713J36453J38088
59073E805420J38101J36355J32016J25432J18408J11975J05272R7054Q7084P5766
59063F932883O3794N2659M4086L8371L4335L1356L0249L1843L5897M1848M9378
59052G386699N7858O6540P5766Q6882J00468J15584J31030J46209J60756J74597
$$ plain form
59125 7220030 6857456 6526613 6225972 5953781 5707423 5483970 5281340 5098386 4933678
59116 4933678 4784879 4649846 4527702 4418044 4319700 4231396 4153075 4085064 4026032 3973477
59106 3973477 3926585 3886994 3856160 3833509 3817948 3809559 3808523 3813667 3823663 3838952 3860987 3889978
59094 3889978 3924732 3964517 4009955 4062123 4121577 4188157 4261034 4339067 4421698 4509365 4602716
59083 4602716 4701782 4806222 4915761 5029956 5148224 5270671 5398166 5530879 5667332 5805420
59073 5805420 5943521 6079876 6211892 6337324 6455732 6567707 6672979 6770033 6857117 6932883
59063 6932883 6996677 7049336 7093422 7131793 7166128 7197484 7227733 7259576 7295473 7337321 7386699
59052 7386699 7444557 7511097 7586863 7673745 7774213 7889797 8020827 8167036 8327792 8502389
59042H502389J88461K03020K17333K29468K38511K44409K45991K41161K29170
59033A0539913K10631J84942J50079J05767N5043J993n0071r7944j38754j72140
59023A0789459k00045k23105k39340k47719k50599k50850k48836k44396k39754
59014H644815k37693k37962k38123k37266k36594k36683k36413k34670k31455
59005F517956k27183k22065k16286k09932k02884j95325j87786j80091j71138
58996D705266j60597j49934j40776j33023j25625j18267j11204j04060r6194q7979
58986C477607q0599p4734p0060o5820o1493n7385n4689n4184n4805n4666n3588
58975B795584n3009n2968n1298m6754m1056l6461l2982k9574k6366k3772k0832
$$ plain form
59042 8502389 8690850 8893870 9111203 9340671 9579182 9823591 10069582 10310743 10539913
59033 10539913 10750544 10935486 11085565 11191332 11246375 11248368 11198297 11100353 10961599 10789459
59023 10789459 10589414 10366309 10126969 9879250 9628651 9377801 9128965 8884569 8644815
59014 8644815 8407122 8169160 7931037 7693771 7457177 7220494 6984081 6749411 6517956
59005 6517956 6290773 6068708 5852422 5642490 5439606 5244281 5056495 4876404 4705266
58996 4705266 4544669 4394735 4253959 4120936 3995311 3877044 3765840 3661780 3565586 3477607
58986 3477607 3397008 3322274 3252214 3186394 3124901 3067516 3012827 2958643 2903838 2849172 2795584
58975 2795584 2742575 2689607 2638309 2591555 2550499 2514038 2481056 2451482 2425116 2401344 2380512
58964B380512j6643j2525j0455r949q663n906l525l058l724l645j971N77K542
58951B303567K977K337J970K388K712K237J699K137L387M620N620O525P047O965
58937B356188O746O771O623N937N299N377N960O641P622Q958J0039J0774J2101
58924B455036J4271J5805J5605J4940J5721J7762J9485K0614K2281K4718K6745
58913B662983K7591K7858K8500K9835L1584L3161L4069L4549L5492L7263L9285
58902C022170M1245M3592M6208M7834M7866M7611M8534N0359N2148N4155N7177
58891C558899O1025O5112O9723P5258Q0978Q5919R0327R4884R9354J03356J07601
58880D492436J12987J19365J26570J35431J46135J56783J65603J73783J84052
$$ plain form
58964 2380512 2363869 2351344 2340889 2330940 2322277 2316371 2312846 2309788 2306064 2302419 2300448 2301025 2303567
58951 2303567 2306544 2308881 2310851 2313239 2315951 2318188 2319887 2322024 2325411 2330031 2335651 2342176 2349223 2356188
58937 2356188 2362934 2369705 2376328 2382265 2387564 2392941 2398901 2405542 2413164 2422122 2432161 2442935 2455036
58924 2455036 2469307 2485112 2500717 2515657 2531378 2549140 2568625 2589239 2611520 2636238 2662983
58913 2662983 2690574 2718432 2746932 2776767 2808351 2841512 2875581 2910130 2945622 2982885 3022170
58902 3022170 3063415 3107007 3153215 3201049 3248915 3296526 3345060 3395419 3447567 3501722 3558899
58891 3558899 3619924 3685036 3754759 3830017 3910995 3996914 4087241 4182125 4281479 4384835 4492436
58880 4492436 4605423 4724788 4851358 4986789 5132924 5289707 5455310 5629093 5813145
58871E813145J97137K11613K26593K42444K59325K77161K96727L18797L42462
58862H185404L66282L90839M18203M49005M81980N16288N52277N89960O28589
58853A2578827O67994P08672P50517P92816Q35205Q76938R15544R48149R73830
58844B0048492R92508J001633R96206R72291R28331Q62778P72973O57567N18425
58835B7751204L59481J85388K119j82638l60830n25140o69053p87815q80156r47670
58825B3944890r91981j013909j015720j002039r77166r42806q99707q50288p98117
58816A5453157p45679o94046o44313n97925n55481n16374m80024m46852m17583
58807A0354880l91940l68566l46352l25309l05823k87556k69729k52117k34826
$$ plain form
58871 5813145 6010282 6221895 6448488 6690932 6950257 7227418 7524145 7842942 8185404
58862 8185404 8551686 8942525 9360728 9809733 10291713 10808001 11360278 11950238 12578827
58853 12578827 13246821 13955493 14706010 15498826 16334031 17210969 18126513 19074662 20048492
58844 20048492 21041000 22042633 23038839 24011130 24939461 25802239 26575212 27232779 27751204
58835 27751204 28110685 28296073 28298192 28115554 27754724 27229584 26560531 25772716 24892560 23944890
58825 23944890 22952909 21939000 20923280 19921241 18944075 18001269 17101562 16251274 15453157
58816 15453157 14707478 14013432 13369119 12771194 12215713 11699339 11219315 10772463 10354880
58807 10354880 9962940 9594374 9248022 8922713 8616890 8329334 8059605 7807488 7572662
58798G572662k17353j99224j81480j65844j52015j37663j21837j06540r3763q2870
58788F114073p2277o1837n1640m0264k6659j2530k88J0465K1878L3998M4809N3915
58776F013643O3472P5132Q8199J01240J13637J25280J36430J48160J61439J75739
58766G202371J90053K05018K22264K41827K62071K82318L03624L26749L51210
58757I587505L76809M04484M35051M68348N03910N41381N80125O19557O59891
58748A4177061P01439P43361P84160Q23158Q60131Q93794R21647R40910R48378
58739B1794039R40243R13403Q66398P97783P04903N86273M44222K83491J08707
58730B7439462p4280k56120m26664n79910p13774q25786r12575r73508j011372
$$ plain form
58798 7572662 7355309 7156085 6974605 6808761 6656746 6519083 6397246 6290706 6196943 6114073
58788 6114073 6041796 5979959 5928319 5888055 5861396 5848866 5848578 5859043 5880921 5914919 5959728 6013643
58776 6013643 6077115 6152247 6240446 6341686 6455323 6580603 6717033 6865193 7026632 7202371
58766 7202371 7392424 7597442 7819706 8061533 8323604 8605922 8909546 9236295 9587505
58757 9587505 9964314 10368798 10803849 11272197 11776107 12317488 12897613 13517170 14177061
58748 14177061 14878500 15621861 16406021 17229179 18089310 18983104 19904751 20845661 21794039
58739 21794039 22734282 23647685 24514083 25311866 26016769 26603042 27047264 27330755 27439462
58730 27439462 27365182 27109062 26682398 26102488 25388714 24562928 23650353 22676845 21665473
58721B1665473j028890j027662j011000r84276r51016r11321q65418q16347p67783
58712A3301760p21297o77038o35147n95269n56374n18228m81905m48290m17330
58703H250882l88900l62787l37879l13238k89948k69744k51993k34440k16886
58694E585067k01267j87916j74815j61174j48705j38371j28831j19279j10914
58685D213795j04174r7259q9135q1572p6348p2581o8463o3872n9586n5620n1851
58674C393334m8789m6450m3926m1124l9382l9308l9640l9096l7873l6642l5755
58663B945349l5927l7710l9889m0544m0165m1296m4548m7676m9332n0699n2468
58652B465095n3307n2767n2575n3317n2745m9448m5390m2703m0535l7419l4295
$$ plain form
58721 21665473 20636583 19608921 18597921 17613645 16662629 15751308 14885890 14069543 13301760
58712 13301760 12580463 11903425 11268278 10673009 10116635 9598407 9116502 8668212 8250882
58703 8250882 7861982 7499195 7161316 6848078 6558130 6288386 6036393 5801953 5585067
58694 5585067 5383800 5195884 5021069 4859895 4711190 4572819 4443988 4324709 4213795
58685 4213795 4109621 4012362 3923227 3841655 3765307 3692726 3624263 3560391 3500805 3445185 3393334
58674 3393334 3344545 3298095 3254169 3213045 3173663 3134355 3094715 3055619 3017746 2981104 2945349
58663 2945349 2909422 2871712 2831823 2791279 2751114 2709818 2665270 2617594 2568262 2517563 2465095
58652 2465095 2411788 2359021 2306446 2253129 2200384 2150936 2105546 2062843 2022308 1984889 1950594
58641A950594l2618l1596k9791k7729k6516k5506k3693k1959k1786k2909k4112
58630A662379k5088k5909k6099k5653k5373k4977k2883j9199j6571j6356j6362
58619A417909j4266j0849p805m824j299J475K447L071M873O853P908R476J2700
58606A427669J5232J4337J1399R647Q881O219J245l365n906p099p726p884q345
58593A454304r819j0883r355n619k170m0J849M087O091Q088J1256J5490J9099
58580A482378K1037K1979K2966K4507K6855K9789L2348L4030L5896L9248M3849
58569A814882M8626N3229N7639O1329O4421O8623P5266Q3319R1002R8366J06694
58558B623396J16399J27243J39378J52360J64429J74847J85664J99025K13981
$$ plain form
58641 1950594 1917976 1886380 1856589 1828860 1802344 1776838 1753145 1731186 1709400 1686491 1662379
58630 1662379 1637291 1611382 1585283 1559630 1534257 1509280 1486397 1467198 1450627 1434271 1417909
58619 1417909 1403643 1392794 1384989 1380165 1378866 1380341 1382788 1385859 1390732 1397585 1405493 1414969 1427669
58606 1427669 1442901 1457238 1468637 1478284 1487165 1493384 1494629 1491264 1485358 1478259 1470533 1462649 1454304
58593 1454304 1444485 1433602 1424247 1418628 1416458 1416418 1418267 1422354 1428445 1436533 1447789 1463279 1482378
58580 1482378 1503415 1525394 1548360 1572867 1599722 1629511 1661859 1695889 1731785 1771033 1814882
58569 1814882 1863508 1916737 1974376 2035705 2100126 2168749 2244015 2327334 2418336 2516702 2623396
58558 2623396 2739795 2867038 3006416 3158776 3323205 3498052 3683716 3882741 4096722
58549D096722K28185K41394K54610K66845K75638K80230K81485K78878K69870
58540F473857K52111K24346J85878J37486Q2505K4949l3082r0268j43318j87912
58530F926552k22148k47008k63724k72714k74642k70575k61361k48382k34151
58521D631847k20234k05507j88346j69647j51702j35220j19782j06127r5264q6162
58511C153856p6953o7858o0483n4986n0493m7412m6483m6176m4137m0902l9144
58500B578829l9456l9853l9462l9507m0275m0112l8274l6345l5923l6782l7894
58489B154946l8597l8446l7573l7256l8597m0697m1664m1044l9634l7581l4745
58478A729112l2193l1167l0845k9469k7202k5708k5277k4656k3371k1915k0048
$$ plain form
58549 4096722 4324907 4566301 4820911 5087756 5363394 5643624 5925109 6203987 6473857
58540 6473857 6725968 6950314 7136192 7273678 7356183 7381132 7348050 7257782 7114464 6926552
58530 6926552 6704404 6457396 6193672 5920958 5646316 5375741 5114380 4865998 4631847
58521 4631847 4411613 4206106 4017760 3848113 3696411 3561191 3441409 3335282 3240018 3153856
58511 3153856 3076903 3009045 2948562 2893576 2843083 2795671 2749188 2703012 2658875 2617973 2578829
58500 2578829 2539373 2499520 2460058 2420551 2380276 2340164 2301890 2265545 2229622 2192840 2154946
58489 2154946 2116349 2077903 2040330 2003074 1964477 1923780 1882116 1841072 1801438 1763857 1729112
58478 1729112 1696919 1665752 1634907 1605438 1578236 1552528 1527251 1502595 1479224 1457309 1437261
58467A437261j7237j4490j3291j3060j2002j0178r204r248q918p996p679q119
58455A305839q102p185n951m363k158m31l94r17M8K056K903K314J888J654m4l032
58439A284125m907m705m119m497n371o412q128r939j0176q841q018q822j0053
58426A190137j0409r988r191q206p744q271q408o403l187j514k028k858l258m591
58412A104081p028q131o170k674m50o00k378m488n746n633m710l861l237k806
58398A046169l083m059m454l490k270j809j186M26J668J439J521L886P147Q947
58384A050852J0187J3093J6526J7328J5499J3919J3485J2534J0536Q381N590J339
58372A189269k354k844j908l903r023j3075j4049j4092j4482j3635j1137r100
$$ plain form
58467 1437261 1420024 1405534 1392243 1379183 1367181 1357003 1347799 1338551 1329633 1321637 1313958 1305839
58455 1305839 1297737 1290552 1284601 1280238 1278080 1277649 1277255 1276338 1276386 1278442 1281345 1283659 1285547 1287201 1287157 1284125
58439 1284125 1279218 1274513 1270394 1265897 1260526 1254114 1245986 1236047 1225871 1217030 1209012 1200190 1190137
58426 1190137 1179728 1169740 1160549 1152343 1144599 1136328 1127920 1121517 1118330 1116816 1114788 1111930 1108672 1104081
58412 1104081 1097053 1088922 1082752 1080078 1079628 1079028 1076650 1072162 1066416 1060783 1056073 1052212 1048975 1046169
58398 1046169 1043086 1039027 1034573 1031083 1028813 1027004 1025818 1026244 1027912 1029351 1030872 1034758 1041905 1050852
58384 1050852 1061039 1074132 1090658 1107986 1123485 1137404 1150889 1163423 1173959 1182340 1187930 1189269
58372 1189269 1186915 1184071 1182163 1178260 1169237 1156162 1142113 1128021 1113539 1099904 1088767 1079667
58360A079667q212o598l859k195k334k263j088l09k99O24K582L524L156L647N529
58345A071572O922P567R429J2322J3394J2065J1135J1714J1656J0306J0154J1964
58333A200200J2852J1301R929J1067J3500J5510J7352J8880J8621J6959J6418
58322A362589J7137J6173J2808J0242R994R175N688J888M67M72O7k75K12N48J50
58307A447335M7L77j38j059k44J969K678J635K075N044P637Q434R706J2357J3631
58292A511484J2081R964Q595O178K576J026K618L935K890J934K940L884L345L264
58278A576714M522M883M052N347R471J2273J1851J2015J5056J7156J5224J2584
58266A701148J3182J5405J6419J7703K1209K4534K4868K3804K3860K4150K3480
$$ plain form
58360 1079667 1071455 1064857 1060998 1058803 1056469 1054206 1053118 1052809 1052510 1053134 1055716 1059240 1062396 1066043 1071572
58345 1071572 1078494 1086061 1095490 1107812 1121206 1133271 1144406 1156120 1167776 1178082 1188236 1200200
58333 1200200 1213052 1224353 1234282 1245349 1258849 1274359 1291711 1310591 1329212 1346171 1362589
58322 1362589 1379726 1395899 1408707 1418949 1428943 1438118 1443806 1445694 1446161 1446633 1446700 1446425 1446637 1447185 1447335
58307 1447335 1447382 1447759 1447621 1446562 1446318 1448287 1450965 1452600 1454675 1459719 1467356 1475790 1485496 1497853 1511484
58292 1511484 1523565 1533529 1542124 1548302 1550878 1551904 1554522 1558457 1561347 1563281 1566221 1570105 1573450 1576714
58278 1576714 1581236 1586119 1590171 1595518 1604989 1617262 1629113 1641128 1656184 1673340 1688564 1701148
58266 1701148 1714330 1729735 1746154 1763857 1785066 1809600 1834468 1858272 1882132 1906282 1929762
58255A929762K3606K5542K6957K6683K7172K9019K8515K4478K1722K3351K5452
58244B212259K4234K2484K3677K5464K4895K4569K7470L0699L0658K9801L1891
58233B508101L4911L4988L3455L3931L5986L7257L8321M0399M1964M2321M4319
58222B925953M9035N2560N2622N3132N7442O2742O6188P0421P7543Q3883Q6646
58211C638167Q9504R5503J00994J03009J05782J13067J20745J24446J27742J35077
58201D754036J43315J48380J53608J63068J73182J79634J86217J97899K11358
58192F310697K21425K30769K44157K59177K71706K84444L01137L18722L33990
58183H776224L51115L73688L96769M16010M36613M63554M91683N15896N41994
$$ plain form
58255 1929762 1953368 1978910 2005867 2032550 2059722 2088741 2117256 2141734 2163456 2186807 2212259
58244 2212259 2236493 2258977 2282654 2308118 2333013 2357582 2385052 2415751 2446409 2476210 2508101
58233 2508101 2543012 2578000 2611455 2645386 2681372 2718629 2756950 2797349 2839313 2881634 2925953
58222 2925953 2974988 3027548 3080170 3133302 3190744 3253486 3319674 3390095 3467638 3551521 3638167
58211 3638167 3727671 3823174 3924168 4027177 4132959 4246026 4366771 4491217 4618959 4754036
58201 4754036 4897351 5045731 5199339 5362407 5535589 5715223 5901440 6099339 6310697
58192 6310697 6532122 6762891 7007048 7266225 7537931 7822375 8123512 8442234 8776224
58183 8776224 9127339 9501027 9897796 10313806 10750419 11213973 11705656 12221552 12763546
58174A2763546N76314O13880O48535O85267P30139P78127Q24017Q74937R38014
58165A9432776J006091J070399J136627J213357J296064J378622J468321J572106
58157B9574363J680777J785718J898383K033892K189409K359632K557856K798025
58149D6878055L072107L371392L714489M126954M609806N155780N775201O472528
58141H3176312P221339Q004543Q860469R848589J0993056J2302655J3810168J5529252
58133A69746383J7405120J9385383K1522590K3950727K6817156L0285597L4360635
58126C43473591L8282721M0033034L6973234K7647683J3220101k956855j7294858
58119D79378651k7670009l3712545l6109139l5900269l4120833l1593453k8803067
$$ plain form
58174 12763546 13339860 13953740 14602275 15287542 16017681 16795808 17619825 18494762 19432776
58165 19432776 20438867 21509266 22645893 23859250 25155314 26533936 28002257 29574363
58157 29574363 31255140 33040858 34939241 36973133 39162542 41522174 44080030 46878055
58149 46878055 49950162 53321554 57036043 61162997 65772803 70928583 76703784 83176312
58141 83176312 90397651 98402194 107262663 117111252 128104308 140406963 154217131 169746383
58133 169746383 187151503 206536886 228059476 252010203 278827359 309112956 343473591
58126 343473591 381756312 421789346 458762580 486410263 499630364 496673509 479378651
58119 479378651 451708642 417996097 381886958 345986689 311865856 280272403 251469336
58112B51469336k5951373k3124990k0388275j7777299j5309485j3021997j0958428
58105A24937489r116939p452522n935147m574026l381527k347085j470882q21228
58097H9838133n43505p80675j542048k633793l742327m611572n147297n375784
58089F5461132n354942n144724m815434m430797m023597l608831l209131k846241
58081C2027435k520622k222942j957025j731803j540784j370402j220927j099854
58073A8363076j001942r14871q38479p80331p37271o98305o60998o29173n99197
58064A1502509n64054n26584m93920m63346m27988l91756l63817l42551l19902
58055G608591k97982k86095k83663k80600k73138k65685k58388k46273k30446
$$ plain form
58112 251469336 225517963 202392973 182004698 164227399 148917914 135895917 124937489
58105 124937489 115820550 108368028 102432881 97858855 94477328 92130243 90659361 89838133
58097 89838133 89294628 88513953 86971905 84338112 80595785 75984213 70836916 65461132
58089 65461132 60106190 54961466 50146032 45715235 41691638 38082807 34873676 32027435
58081 32027435 29506813 27283871 25326846 23595043 22054259 20683857 19462930 18363076
58073 18363076 17361134 16446263 15607784 14827453 14090182 13391877 12730879 12101706 11502509
58064 11502509 10938455 10411871 9917951 9454605 9026617 8634861 8271044 7928493 7608591
58055 7608591 7310609 7024514 6740851 6460251 6187113 5921428 5663040 5416767 5186321
58046E186321k17687k08769j98154j85001j73901j65194j54762j42996j34231
58037C605626j27766j18874j08044j00118r5067q8586q0948p6479p4998p2394
58027B662352o8854o8094o9290o8124o4842o3236o2727n9710n5591n5036n7118
58016A969730n6442n2334m8876m6701m2867l8126l6022l5390l1959k6910k5532
58005A528571k7492k6899k2299j8490j7653j6654j4097j2624j2869j2085r898
57994A337511r141j0169j0503j0484j2858j6497j7076j4386j2435j1995r908o292
57982A195767n284p434q275o030m299n220o144n104l939l980l707k568k353l310
57968A128120l431k751l710o271p384o233n317n592n311m399n019o963p502o697
$$ plain form
58046 5186321 4968634 4759865 4561711 4376710 4202809 4037615 3882853 3739857 3605626
58037 3605626 3477860 3358986 3250942 3150824 3055757 2967171 2886223 2809744 2734746 2662352
58027 2662352 2593498 2525404 2456114 2387990 2323148 2259912 2197185 2137475 2081884 2026848 1969730
58016 1969730 1913288 1860954 1812078 1765377 1722510 1684384 1648362 1612972 1581013 1554103 1528571
58005 1528571 1501079 1474180 1451881 1433391 1415738 1399084 1384987 1372363 1359494 1347409 1337511
57994 1337511 1328370 1318201 1307698 1297214 1284356 1267859 1250783 1236397 1223962 1211967 1202059 1195767
57982 1195767 1190483 1183049 1174774 1168744 1164445 1159225 1153081 1147977 1144038 1140058 1136351 1133783 1131430 1128120
57968 1128120 1124689 1121938 1118228 1111957 1104573 1098340 1093023 1087431 1082120 1077721 1072702 1065739 1058237 1051540
57954A051540p818j1346j3578j2555j0760j0439j0716j0629j0941j1702j1915
57943I29141j2290j4293j6119j4208r195n652n255n103l619k884l872m311k940
57930H29400j450o48J012L717N307N216N285N708M527K173J891M437O678O596
57916H79849N325L426P0l070k448J230K716o6l212l738l896n831p184n471k536
57901H55164j173j042j062k158m534n654m066k175k346l297l153k967m202n597
57887H11738n380m162k980j036K064M369M396L557L464L240J772J27n91j302k579
57872H16697k716p08J156K08l032o484r623j2663j4557j4247j2460j0423q259
57859G22889o054m739m379l596j945p41k69J230M224O282N719M334M455N666O541
$$ plain form
57954 1051540 1043722 1032376 1018798 1006243 995483 985044 974328 963699 952758 941056 929141
57943 929141 916851 902558 886439 872231 863036 857384 852129 847026 843407 840523 836651 832340 829400
57930 829400 827950 827302 828314 832031 837338 842554 847839 853547 858074 860247 862138 866575 873253 879849
57916 879849 885174 888600 888670 885600 883152 884382 887098 887032 883820 880082 876186 870355 863171 857700 855164
57901 855164 853991 852949 851887 849729 845195 839541 835475 833300 830954 827657 824504 821537 817335 811738
57887 811738 806358 802196 799216 798180 800244 804613 809009 812566 816030 819270 821042 821169 820578 819276 816697
57872 816697 813981 813273 814429 814637 811605 805121 795498 782835 768278 754031 741571 731148 722889
57859 722889 716835 712096 707717 704121 702176 701435 701166 702396 706620 712902 718621 722955 727410 733076 739617
57844G39617P393Q818R553Q137N351L042J881J660K137K324Q13j853l238k595
57830G83040k130l421n164n974o741q281r280q688p859q096q245o921n162m727
57816F92351n394n837n531m303j895O81J541J020J846M788O948O319N120O289
57802G03943R208J1338J1773J0809Q374N232L541L797L550J262j236k442m191
57789G64958p919j0976j0406q072p875r785j0597r383q225q292q780r204r642
57776F45802r201p150m915m307m599m032l238m150o328p428o926o474o885p401
57762E62768p709q236q774q958r542j1012j1786j0259p812p038p637o934m233
57749D52838j749j149j698k091j891r34O77J912J874J528K595N067P462R068J0035
$$ plain form
57844 739617 747010 755828 765381 773518 778869 781911 783792 785452 787589 789913 790726 788873 785635 783040
57830 783040 780910 777489 772325 766351 759610 751329 742049 733361 725502 717406 709161 702240 697078 692351
57816 692351 686957 681120 675589 671286 669391 670072 671613 672633 674479 679267 686215 692534 697654 703943
57802 703943 713151 724489 736262 747071 755445 760677 764218 768015 771565 772827 771591 769149 764958
57789 764958 757039 746063 735657 727585 719710 709925 699328 689945 681720 673428 664648 655444 645802
57776 645802 636601 629451 624536 620229 615630 611598 608360 604210 597882 590454 583528 577054 570169 562768
57762 562768 555059 546823 538049 529091 519549 508537 496751 486492 478680 471642 464005 457071 452838
57749 452838 451089 449940 448242 446151 444260 443326 444003 445915 447789 449317 451912 456979 464441 473509 483544
57734D83544R825P675M445J967P62R1j32O32K018L147M261O012P488O952M416
57719E43103J626l90k071l829n499p066q484r123q725q375q915r229p843n476
57705D59704m029l783l594l144k870k144R2L103M965N311N455O006O319O241O398
57690D84030O768O763O586O788O730N342L272K380L219M638N762O598O829N858
57676E61563M151L012L038L890N233O637P236O771O190N978N147L512L294O131
57662F31783J0026J1901J1922J2370J3373J3292J2600J3562J6091J7509J6849
57651G81278J6138J6779J7895J8860K0484K2737K4229K4887K6349K8814L0396
57640A028846L0752L2366L6647M1443M4317M5981M8477N1986N5500N9107O3493
$$ plain form
57734 483544 493369 501044 505489 507456 508218 508309 508177 508809 510827 513974 518235 524247 531735 538687 543103
57719 543103 544729 544339 542268 538439 532940 525874 517390 508267 499542 491167 482252 473023 465180 459704
57705 459704 455675 451892 448298 445154 442284 440140 440232 443335 448300 453611 459066 465072 471391 477632 484030
57690 484030 490798 497561 504147 510935 517665 523007 526279 528659 531878 536516 542278 548876 555705 561563
57676 561563 565714 568726 571764 575654 580887 587524 594760 601531 607721 613699 618846 622358 625652 631783
57662 631783 641809 653710 665632 678002 691375 704667 717267 730829 746920 764429 781278
57651 781278 797416 814195 832090 850950 871434 894171 918400 943287 969636 998450 1028846
57640 1028846 1059598 1091964 1128611 1170054 1214371 1260352 1308829 1360815 1416315 1475422 1538915
57629A538915O8286P2787P7614Q4153R2782J02618J12588J22297J32564J45252
57619B549856J61431J79481J96364K11129K25666K41695K58740K75646K92124
57610D592132L07690L20398L27483L25819L10839K76763K19981J42634N2778l8509
57600F838008j20901j88086k38795k74507k96383l05252l03595k95085k81946
57591D533458k64673k44622k24485k05546j86688j67111j48147j31261j16159
57582B844766j02007q8901p6882o5146n3513m3300l5455k8962k2234j4911p372
57571B306083K75P766J4573K1083K8545L6946M4481N0354N6526O5293P6401Q7922
57559B796248R8777J08932J18259J26846J35731J45857J56772J67333J76859J84451
$$ plain form
57629 1538915 1607201 1679988 1757602 1841755 1934537 2037155 2149743 2272040 2404604 2549856
57619 2549856 2711287 2890768 3087132 3298261 3523927 3765622 4024362 4300008 4592132
57610 4592132 4899822 5220220 5547703 5873522 6184361 6461124 6681105 6823739 6876517 6838008
57600 6838008 6717107 6529021 6290226 6015719 5719336 5414084 5110489 4815404 4533458
57591 4533458 4268785 4024163 3799678 3594132 3407444 3240333 3092186 2960925 2844766
57582 2844766 2742759 2653858 2576976 2511830 2458317 2415017 2379562 2350600 2328366 2313455 2306083
57571 2306083 2306358 2314124 2328697 2349780 2378325 2415271 2459752 2510106 2566632 2631925 2708326 2796248
57559 2796248 2895025 3003957 3122216 3249062 3384793 3530650 3687422 3854755 4031614 4216065
57549D216065J88202J86375J78783J65700J46074J18254Q2297M0554l739m7706
57539E270859q9128j26616j59358j86273k05780k16991k20752k19074k13920k06664
57529C426303j97977j87822j76163j63891j52198j41135j29922j18872j09395
57520B048928j01575r3424q3614p3639o6025o1291n7823n4060m9697m5215m1179
57509A321386l7674l4103k9916k5763k2956k1613k0466j8892j7723j7435j6792
57498A058053j4358j0308n932k206L63J583K120L283N440P509Q722R832J1807
57485A075908J4202J5892J6713J7573J9365K2232K5451K8004K9995L3107L8375
57474A336817M3970M7185M8471N1093N6404O2169O6390P0070P4796Q0206Q5739
$$ plain form
57549 4216065 4404267 4590642 4769425 4935125 5081199 5199453 5281750 5322304 5318565 5270859
57539 5270859 5181731 5055115 4895757 4709484 4503704 4286713 4065961 3846887 3632967 3426303
57529 3426303 3228326 3040504 2864341 2700450 2548252 2407117 2277195 2158323 2048928
57520 2048928 1947353 1853929 1770315 1696676 1630651 1569360 1511537 1457477 1407780 1362565 1321386
57509 1321386 1283712 1249609 1219693 1193930 1170974 1149361 1128895 1110003 1092280 1074845 1058053
57498 1058053 1043695 1033387 1027455 1025249 1025612 1027195 1029315 1032598 1038038 1045547 1054269 1064101 1075908
57485 1075908 1090110 1106002 1122715 1140288 1159653 1181885 1207336 1235340 1265335 1298442 1336817
57474 1336817 1380787 1427972 1476443 1527536 1583940 1646109 1712499 1782569 1857365 1937571 2023310
57463B023310R2418J00677J08556J14486J19919J26750J33798J38607J41100J42399
57453C242020J41251J34922J22892J06505Q5372N7656K4127j1149m4716p5588
57443C783292j02687j23549j37109j45433j50932j53498j51932j46689j39495
57434B531968j31093j21110j09872r8879q9256q0533p1443o1635n2202m4359l7887
57423A633699l1571k5103j9550j5504j1852p371k541J499N113R706J5437K1029
57411A572991K5879L0856L6546M2171M6975N1773N8161O6496P5406Q3324R0145
57400B180723R7009J04519J11725J17438J22090J26951J31445J32657J28203J18340
57390C371100J04271Q5604O1015L0735k959l7355p0201r9411j23306j41425j54341
$$ plain form
57463 2023310 2115728 2216405 2324961 2439447 2559366 2686116 2819914 2958521 3099621 3242020
57453 3242020 3383271 3518193 3641085 3747590 3832962 3890618 3914745 3903596 3858880 3783292
57443 3783292 3680605 3557056 3419947 3274514 3123582 2970084 2818152 2671463 2531968
57434 2531968 2400875 2279765 2169893 2071014 1981758 1901225 1829782 1768147 1715945 1671586 1633699
57423 1633699 1602128 1577025 1557475 1541971 1530119 1522748 1520207 1521706 1526819 1536525 1551962 1572991
57411 1572991 1598870 1629726 1666272 1708443 1755418 1807191 1865352 1931848 2007254 2090578 2180723
57400 2180723 2277732 2382251 2493976 2611414 2733504 2860455 2991900 3124557 3252760 3371100
57390 3371100 3475371 3560975 3621990 3652725 3649766 3612411 3542210 3442799 3319493 3178068 3023727
57379C023727j62767j67259j68394j66438j61318j53552j44619j35700j26566
57370A637114j16551j06006r5943q6853p8804p1989o6203o0406n3980m7946m3838
57359H08595m1699m0108l7791l4462l0611k7217k5102k3848k2134j9763j8163
57348D87697j8014j7815j6147j3981j3066j3318j3703j4492j6314j7824j6865
57337C16158j3621j0416q580p655p304p624p675o312m681n319q195j0201r490
57324B09085p816p332p331n980l615k287k856m340n598o244o094n011l431k369
57310A38781k575l917n402n738m226j460J004J757M41k137m492n501n350n174
57296I6011n556n889n521m651l638k430j409j536k684l065j701k29n96k083k625
$$ plain form
57379 3023727 2860960 2693701 2525307 2358869 2197551 2043999 1899380 1763680 1637114
57370 1637114 1520563 1414557 1318614 1231761 1152957 1080968 1014765 954359 900379 852433 808595
57359 808595 766896 726788 688997 654535 623924 596707 571605 547757 525623 505860 487697
57348 487697 469683 451868 435721 421740 408674 395356 381653 367161 350847 333023 316158
57337 316158 302537 292121 283541 275886 268582 260958 253283 246971 242290 236971 228776 218575 209085
57324 209085 201269 193937 186606 180626 177011 174724 171868 167528 161930 155686 149592 144581 141150 138781
57310 138781 136206 132289 126887 121149 116923 115463 116467 118224 118665 116528 112036 106535 101185 96011
57296 96011 90455 84566 79045 74394 70756 68326 66917 65381 62697 59632 57931 57702 57106 55023 52398
57281E2398k063j749j609k19K270L885L779L116K688J942Q71O50J547K232K059
57266G1797K110K988L411K251M57l34j3K18n04k031l309k792J00L574M873L577
57250H6373K074K171K932K852K438L153M903O176O119N299M662M637N071N540
57236A44400N822O140O607O810O658P201R282J1686J2237J0801R525R926J1497
57223B58592J3431J5708J7886J8930J9241K0939K4877K9155L1929L3971L6856
57212E21515M0022M1527M0700L8313L4849L0288K5013J9460J3148N445l016j0710
57200G96554j6765k1296k4541k6548k7365k6886k5013k2498k0799k0354j9805
57189E44684j7875j5168j3094j1767j0271q489p230o696o033m582k656q62P15
$$ plain form
57281 52398 50335 48586 46977 46758 49028 52913 56692 59808 62496 64438 65309 65959 67506 69738 71797
57266 71797 73907 76895 80306 82557 83014 82680 82667 82885 82381 80350 77041 74249 74349 77923 82796 86373
57250 86373 88447 90618 93550 96402 98840 101993 106896 113072 119191 124490 129152 133789 138860 144400
57236 144400 150222 156362 162969 169779 176437 183638 192920 204606 216843 227644 237169 247095 258592
57223 258592 272023 287731 305617 324547 343788 364727 389604 418759 450688 484659 521515
57212 521515 561537 603064 643764 682077 716926 747214 772227 791687 804835 810280 807264 796554
57200 796554 779789 758493 733952 707404 680039 653153 628140 605642 584843 564489 544684
57189 544684 526809 511641 498547 486780 476509 468020 460790 454094 448061 443479 440823 439961 440676
57176D40676K426M458O473P801Q121P922P876P931P684P545Q473J0369J1895J2565
57162E52215J3823J7034K1222K4054K4820K5309K7519L1327L4859L6758L7492
57151H46432L8272L9232L9491L8951L8866L9999M1197M0850L9075L7324L6476
57140A276165L6568L7861M0576M3910M6757M9212N1996N4807N6763N8191O0037
57129A812843O1724O1466N8837N5244N1756M8259M4849M2007L9195L5260L0618
57118B342058K7119K5435K4398K3157K2051K1120J9806J8335J7269J5576J1744
57107B568068O911M100L745L068O83j323j147j34k24j260k520m423o863q235p875
57092B552571p321p556p248n353l151k016j437j008k003n243r609j4431k0947
$$ plain form
57176 440676 443102 447560 454033 461834 469955 477877 485753 493684 501368 508913 517386 527755 539650 552215
57162 552215 566038 583072 604294 628348 653168 678477 705996 737323 772182 808940 846432
57151 846432 884704 923936 963427 1002378 1041244 1081243 1122440 1163290 1202365 1239689 1276165
57140 1276165 1312733 1350594 1391170 1435080 1481837 1531049 1583045 1637852 1694615 1752806 1812843
57129 1812843 1874567 1936033 1994870 2050114 2101870 2150129 2194978 2236985 2276180 2311440 2342058
57118 2342058 2369177 2394612 2419010 2442167 2464218 2485338 2505144 2523479 2540748 2556324 2568068
57107 2568068 2574979 2579079 2582824 2585892 2586575 2585252 2584105 2583971 2583747 2582487 2579967 2575544 2568681 2560446 2552571
57092 2552571 2545250 2537694 2530446 2525093 2521942 2519926 2518489 2517481 2515478 2510235 2500626 2486195 2465248
57079B465248k9731l9365m9448o2211p9003r7930j17097j37349j59425j81265
57069A512424k00933k19630k39208k59222k78994A4605c07885l45330l67800l93210
57059a414225m25055m63476n07953n59899o19377o83011p49334q23006r09717
57050g155053j009956j121779j246248j385631j539810j709627j901212k122773
57042a9192089k380855k685079l053489l508047m067505m748208n566172o531405
57034e1732849p642558q890325j0261116j1735817j3293505j4914671j6561126
57027a35031967j8155504j9633675k1063117k2664158k4595266k6637677k8113931
57020b95895295k8191964k6340615k2572145j7350848j1330535n120270Q44749
$$ plain form
57079 2465248 2435517 2396152 2346704 2284493 2205490 2107560 1990463 1853114 1693689 1512424
57069 1512424 1311491 1091861 852653 593431 314437 14605 -307885 -653215 -1021015 -1414225
57059 -1414225 -1839280 -2302756 -2810709 -3370608 -3989985 -4672996 -5422330 -6245336 -7155053
57050 -7155053 -8165009 -9286788 -10533036 -11918667 -13458477 -15168104 -17069316 -19192089
57042 -19192089 -21572944 -24258023 -27311512 -30819559 -34887064 -39635272 -45201444 -51732849
57034 -51732849 -59375407 -68265732 -78526848 -90262665 -103556170 -118470841 -135031967
57027 -135031967 -153187471 -172821146 -193884263 -216548421 -241143687 -267781364 -295895295
57020 -295895295 -324087259 -350427874 -373000019 -390350867 -401681402 -406801672 -405956923
57013d05956923O326291J1216547J5439841J8908876K1559636K3398228K4494914
57006b84612590K4939572K4811081K4177194K3105986K1676042J9983355J8137764
56999a27781596J6245130J4389153J2627806J1000059R529962Q226980P088920
56992d8673586O106581N266055M550313L942616L428315K993179K623033K306929
56984a7456565K038106J810059J614118J442759J292530J161496J046047R42538
56976f108912Q49928P68447O97052O34015N78550N30125M87629M50544M19272
56967f93350c00449F8006L43775L19258K95595K71818K47419K24328K04675J88157
56957B163031J73505J60942J51008J42371J33076J22986J13006J02652R0421P6013
$$ plain form
57013 -405956923 -399630632 -388414085 -372974244 -354065368 -332505732 -309107504 -284612590
57006 -284612590 -259673018 -234861937 -210684743 -187578757 -165902715 -145919360 -127781596
56999 -127781596 -111536466 -97147313 -84519507 -73519448 -63989486 -55762506 -48673586
56992 -48673586 -42567005 -37300950 -32750637 -28808021 -25379706 -22386527 -19763494 -17456565
56984 -17456565 -15418459 -13608400 -11994282 -10551523 -9258993 -8097497 -7051450 -6108912
56976 -6108912 -5258984 -4490537 -3793485 -3159470 -2580920 -2050795 -1563166 -1112622 -693350
56967 -693350 -300449 68006 411781 731039 1026634 1298452 1545871 1770199 1974874 2163031
56957 2163031 2336536 2497478 2648486 2790857 2923933 3046919 3159925 3262577 3352998 3429011
56947C429011O0899M7756M0604M3088N2751N6887L8024j3127q9063j69293k32817
56936C264720k69083k80259k75153k61431k42917k22242k02754j86446j72038
56927A152397j57267j42236j28655j16661j04719r2558q2111p5053p1118o9124
56917A12895D4699b2532o4767o0257n4829m9828m5307m0533l5314k9992k4549
56906d27908j8397j1016k523O258J4116K0203K4725K8560L2053L4654L5746L5173
56894b28356L2555K7079J8774R513J741l569o824q109p053m531k875l258m037
56881a78950k984n08R11L32j94J715N915J0307J3467J5836J8543K1675K3644K2030
56867d8261J5401M771o777j6025k1316k2779k1794k0269j9535j9280j7914j4432
$$ plain form
56947 3429011 3489910 3537666 3578270 3621358 3674109 3730996 3769020 3755893 3666830 3497537 3264720
56936 3264720 2995637 2715378 2440225 2178794 1935877 1713635 1510881 1324435 1152397
56927 1152397 995130 852894 724239 607578 502859 410301 328190 253137 182019 112895
56917 112895 44699 -22532 -87299 -147556 -202385 -252213 -297520 -338053 -373367 -403359 -427908
56906 -427908 -446305 -457321 -459844 -453586 -439470 -419267 -394542 -365982 -333929 -299275 -263529 -228356
56894 -228356 -195801 -168722 -149948 -140435 -138694 -142263 -149087 -157196 -164249 -168780 -171655 -174913 -178950
56881 -178950 -181934 -182442 -181531 -181199 -181393 -179678 -173763 -163456 -149989 -134153 -115610 -93935 -70291 -48261
56867 -48261 -32860 -28089 -34866 -50891 -72207 -94986 -116780 -137049 -156584 -175864 -193778 -208210
56855b08210r601n121k110o57k61p8P44K289L621L863L378L368M335N449N558
56840a93433M513L276K777L055L663M555N731O193M525J270o09R09M049N547N160
56825a38819N438P194P938N766K319L09K3J68O50K389N223P976J0268J2683J5474
56810e5001J8389a5178I367K7021K8404K9567L1606L4244L6583L8877M1941M5033
56798C22643M5925M3077L6523K6725J4170M76j1460j9200k2296k2010k0109j7822
56786C76642j5247j1714o991j809L182Q315J4115K0353K6695L3453M0617M6911
56774E34522N1195N3991N6094N6046N0733L8498K0580nj9522l3988m0942m1455
56762G25747l9125l6587l4001l0718k6791k2453j7500j1844n754P15P610J4333
$$ plain form
56855 -208210 -217811 -222932 -225042 -225699 -225960 -226038 -225294 -223005 -219384 -215521 -212143 -208775 -204440 -198991 -193433
56840 -193433 -188920 -185644 -182867 -179812 -176149 -171594 -165863 -159670 -155145 -153875 -154484 -153575 -149526 -143979 -138819
56825 -138819 -133381 -126187 -118249 -112483 -110164 -109855 -109832 -109664 -109014 -106625 -101402 -93426 -83158 -70475 -55001
56810 -55001 -36612 -15178 9367 36388 64792 94359 125965 160209 196792 235669 277610 322643
56798 322643 368568 411645 448168 474893 489063 489539 478079 458879 436583 414573 394464 376642
56786 376642 361395 349681 342690 340881 344063 352378 366493 386846 413541 446994 487611 534522
56774 534522 585717 639708 695802 751848 802581 841079 861659 861654 842132 808144 767202 725747
56762 725747 686622 650035 616034 585316 558525 536072 518572 506728 500974 501689 509299 523632
56750E23632K0041K4869K9586L3917L6431L6125L2792K5811J4418j16j4101k4320
56738G39085l0516l4389l7106l8500l7949l5210l0838k6163k2334j9112j5382
56727D11586j0910o659l074P69N659J0840J4890J7396J8786J8889J6500J0552
56715E05224J597p982j5434j9675k1721k2945k3436k2610k0732j8733j6908j4910
56703C01735j2881j1485j0808j0305r687q882p358m790k291j539k613l964m547
56690B10585m559m038k520m49P40O84P00J637K443J864K96r92j524j637j604j540
56674B00086j511j306q10p04j659k785k402p28L8r60j823j028k9r17l008l946
56658A76508l323k799l125l215k339j316r53r03o74o37j242j971j892q33L67N83
$$ plain form
56750 523632 543673 568542 598128 632045 668476 704601 737393 763204 777622 777506 763405 739085
56738 739085 708569 674180 637074 598574 560625 525415 494577 468414 446080 426968 411586
56727 411586 400676 394017 390943 391712 397371 408211 423101 440497 459283 478172 494672 505224
56715 505224 506821 498839 483405 463730 442009 419064 395628 373018 352286 333553 316645 301735
56703 301735 288854 277369 266561 256256 246569 237687 230329 225539 223248 221709 219096 215132 210585
56690 210585 206026 201988 199468 199019 199759 200443 201143 202780 205223 207087 207383 206391 204867 203230 201626 200086
56674 200086 198575 197269 196459 195755 194096 191311 188909 188181 188219 187259 185436 184408 184379 183462 180454 176508
56658 176508 173185 170386 167261 164046 161707 160391 159438 158535 157861 157224 155982 154011 152119 151286 151653 152236
56642A52236o55k634l803l127j193M36J013J198J703K029J220m36j304k69J880
56627A48294L491M074M532N445O182O051N478N275N363N107M491M045L843L460
56613B15131K804K144J520Q69N77R85J479J101M7m35K21J206J507J001J44o95
56597B29606j371k041l190m992o777p700p820p761p678p345p039p247p735p886
56583A43024p731p555o810m767k092l23J13O2j20q59j782j606l3J690K620L175
56567A17006L921M614M937M994M716L866K932K740L041K837K215K211K708K307
56553A65045Q54Q8J042K455K686J655J64j084j108Q13L328L660J344n69N16L236
56537A84125M415L178J134k66o49J24J921L835N041N693O047N627M209K648J712
$$ plain form
56642 152236 151581 148947 145144 142017 140824 141260 142273 143471 145174 147203 148423 147987 146683 146414 148294
56627 148294 151785 155859 160391 165836 172018 178069 183547 188822 194185 199292 203783 207828 211671 215131
56613 215131 217935 220079 221599 222468 223045 224030 225509 226610 226657 226222 226443 227649 229156 230157 230301 229606
56597 229606 228235 226194 223004 218012 211235 203535 195715 187954 180276 172931 165892 158645 150910 143024
56583 143024 135293 127738 120928 116161 114069 113746 113859 113921 113801 112942 111160 109554 109521 111211 113831 117006
56567 117006 120927 125541 130478 135472 140188 144054 146986 149726 152767 155604 157819 160030 162738 165045
56553 165045 165899 165987 167029 169484 172170 173825 173989 172905 171797 172610 175938 179598 180942 180373 180889 184125
56537 184125 188540 191718 192852 192586 191937 192061 193982 197817 202858 208551 214598 220225 224434 227082 228794
56522B28794J136Q54J727L747M967L918J973J446K404L290L803M949O719P838
56508B77565P821P460P254P009P038Q186J0397J2506J3737J4356J4682J4556J3977
56495D16544J3322J2685J1767J0674J0044J0166J0471J0202R182P704N852L257
56483E31870k07l596n511n943o753r302j2285j3329j2207j0796j0166r794r595
56470D22386j0289j1318j0859q879p758q630r426q162n942m822m578l836k825
56457C25062k709l367l853m080m251l793k642k253l378m162k761o29o67k970m939
56442B78608n026l913k413p63J69n56k045k317j059K07P24J186J753J422j19j668
56426B64190k130j631p57J25N96L70l7K34J198K089K389K149J657J527K460M063
$$ plain form
56522 228794 229930 230784 232511 236258 241225 245143 247116 248562 250966 254256 258059 263008 269727 277565
56508 277565 285386 292846 300100 307109 314147 322333 332730 345236 358973 373329 388011 402567 416544
56495 416544 429866 442551 454318 464992 475036 485202 495673 505875 515057 522761 528613 531870
56483 531870 531663 528067 522556 516613 509860 500558 488273 474944 462737 451941 441775 431981 422386
56470 422386 412097 400779 389920 381041 373283 364653 355227 347065 341123 336301 331723 327887 325062
56457 325062 322353 318986 315133 311053 306802 303009 300367 298114 294736 290574 287813 287184 286517 283547 278608
56442 278608 273582 269669 267256 266493 266662 266106 264061 261744 260685 260892 261616 262802 264555 265977 265858 264190
56426 264190 262060 260429 259672 259797 260393 260763 260726 260960 262158 264247 266636 268785 270442 271969 274429 278492
56410B78492M855M354M011M884N720M992L592L521M857O103O751P360P708P054
56396C54254N896N401N395M732L407K433K103K005K209K677K271M26j085m62Q92
56381C92554J81k288l403j987k31o3q35j315j563j986k520l309m504n219m520
56366C58992l403l697n066n465m484l605l072j458J063K020L50j782k227j528
56352C26638j076p57J01J195J992K536K529J231r03k170k085k078k883l199k068
56337C19003n99jL03J125J764J342N36L89N68K95k9M42J435J939J541M64q92j683
56319C27942q28J573L945N076N417N819O092N748N251N402O051O284N506L926
56305C93204K451K289L851N811O150M475K422J608K132L247M252M436L354J700
$$ plain form
56410 278492 283347 287701 291712 296596 302316 307308 310900 314421 319278 325381 332132 339492 347200 354254
56396 354254 360150 365551 370946 375678 379085 381518 383621 385626 387835 390512 392783 393209 392124 391662 392554
56381 392554 392735 390447 387044 385057 384826 384763 383928 382613 381050 379064 376544 373235 368731 363512 358992
56366 358992 355589 351892 346826 341361 336877 333272 330200 328742 329805 331825 332175 330393 328166 326638
56352 326638 325562 324805 324906 326101 328093 330629 333158 334389 333486 331316 329231 327153 324270 321071 319003
56337 319003 318404 318403 318706 319831 321595 322937 323473 323862 324430 324725 324696 325138 326573 328512 330053 330517 329625 327942
56319 327942 327114 328687 332632 337708 343125 348944 355036 360784 366035 371437 377488 383772 389278 393204
56305 393204 395655 397944 401795 407606 413756 418231 420653 422261 424393 427640 431892 436328 439682 441382
56291D41382Q98J411K335K871L124L229K878K114J604J734K359L425M877N924
56277D80165N626M239K887K034J516J807L594O123P618P591P196P239P350P346
56263E52331P696Q388Q797Q903R304J0000J0582J1353J2572J3101J1913J0618
56251F75558J1920J5551J8284J8369J7288J6637J6049J5285J5647J7851K0308
56240H58747K1013J9561J6600J3058J0603J0792J2765J3698J2429J0778J0482
56229A010526J1102J1878J3355J5688J7448J7754J7965J9661K2475K5289K8159
56218A211300L1560L5021L7974M1006M5114N0369N6102O1611O6405P0769P6130
56207A783361Q3541R1819R8971J05405J13593J24356J35838J46613J57459J69322
$$ plain form
56291 441382 442280 443691 446026 448897 452021 455250 458128 460242 461846 463580 465939 469364 474241 480165
56277 480165 485791 490030 492917 494951 496467 498274 501868 507991 515609 523200 530396 537635 544985 552331
56263 552331 560027 568415 577212 586115 595419 605419 616001 627354 639926 653027 664940 675558
56251 675558 687478 703029 721313 739682 756970 773607 789656 804941 820588 838439 858747
56240 858747 879760 899321 915921 928979 939582 950374 963139 976837 989266 1000044 1010526
56229 1010526 1021628 1033506 1046861 1062549 1079997 1097751 1115716 1135377 1157852 1183141 1211300
56218 1211300 1242860 1277881 1315855 1356861 1401975 1452344 1508446 1570057 1636462 1707231 1783361
56207 1783361 1866902 1958721 2057692 2163097 2276690 2401046 2536884 2683497 2840956 3010278
56197C010278J81807J94519K07729K20848K32390K42086K50824K57924K60849
56188E059254K58403K51687K41174K25657K05015J81050J54215J22542Q5688M7356
56178F832041J1709k0442n0024p6618r9174j18012j33964j46764j55748j61070
56168E881934j63297j63324j63167j64859j67917j70129j71214j73070j75893
56159D369064j77283j76167j74312j72590j69275j63719j58248j54242j49613
56150B873615j42589j34933j28765j22929j15249j06110r7211q8904q0979p4016
56140A781930o7937o1435n4551m9236m5710m1383l5430l1040l0481l1131k9397
56129A304199k5565k1735j7928j3690j0894j1161j2601j2400j0787r270p236l638
$$ plain form
56197 3010278 3192085 3386604 3594333 3815181 4047571 4289657 4540481 4798405 5059254
56188 5059254 5317657 5569344 5810518 6036175 6241190 6422240 6576455 6698997 6784685 6832041
56178 6832041 6843750 6823308 6773284 6696666 6597492 6479480 6345516 6198752 6043004 5881934
56168 5881934 5718637 5555313 5392146 5227287 5059370 4889241 4718027 4544957 4369064
56159 4369064 4191781 4015614 3841302 3668712 3499437 3335718 3177470 3023228 2873615
56150 2873615 2731026 2596093 2467328 2344399 2229150 2123040 2025829 1936925 1855946 1781930
56140 1781930 1713993 1652558 1598007 1548771 1503061 1461678 1426248 1395208 1364727 1333596 1304199
56129 1304199 1278634 1256899 1238971 1225281 1214387 1203226 1190625 1178225 1167438 1158168 1150932 1147294
56117A147294m1J480J850L204N260O507P400R348J1928J3853J5351J7201J9139
56104A259774K1183K4375K8077K9370K7602K6447K8630L1749L2680L2741L4526
56093A577154L6752L6728L5534L6036L7813L8595L9054M1757M6579N1464N6442
56082B033908O3011P0669P7839Q5148R4342J05210J16709J29277J42705J53526
56072C072344J58185J56919J51341J40781J25017J08040R4482Q4202P4464O4954
56062D230729N6001M4413K6805N542j3878k9871m4106n5698o2215o5910p2988
56051D018824q6313j03362j21018j37577j50354j56405j56094j52004j44575j32760
56041B678362j18429j05528r4934q4181p2156o0358m9927m0932l3925k8690k2595
$$ plain form
56117 1147294 1147253 1148733 1150583 1153787 1159047 1165554 1172954 1182302 1194230 1208083 1223434 1240635 1259774
56104 1259774 1280957 1305332 1333409 1362779 1390381 1416828 1445458 1477207 1509887 1542628 1577154
56093 1577154 1613906 1650634 1686168 1722204 1760017 1798612 1837666 1879423 1926002 1977466 2033908
56082 2033908 2096919 2167588 2245427 2330575 2424917 2530127 2646836 2776113 2918818 3072344
56072 3072344 3230529 3387448 3538789 3679570 3804587 3912627 4007109 4091311 4165775 4230729
56062 4230729 4286730 4331143 4357948 4363490 4349612 4319741 4275635 4219937 4157722 4091812 4018824
56051 4018824 3932511 3829149 3708131 3570554 3420200 3263795 3107701 2955697 2811122 2678362
56041 2678362 2559933 2454405 2359471 2275290 2203134 2142776 2092849 2051917 2017992 1989302 1966707
56030A966707j3888n310o86N29J473K586K471J995K733L105J049j255m04K154
56016A963259K426N98O4J263K203L627P560J1858J2431J0263J0355J4016J7857
56003B057780J9921K1367K2512K2581K2844K4984K7258K7149K6286K7546K9321
55992B329549K8605K7505L0147L4967L7106L6829L8309M1374M2093M0705M1385
55981B728574M4657M7329M9526N4392O1117O5574O7657P1018P5990P9769Q2890
55970C428493Q8423R5430J00331J03696J08645J14053J16897J19553J26581J36192
55960D538294J43284J48905J57767J68592J76624J83672J95360K10115K21439
55951F144052K29572K40125K52737K62487K71008K84419L01461L15822L28866
$$ plain form
56030 1966707 1952819 1947509 1946823 1947352 1948825 1951411 1953882 1955877 1958610 1961715 1962764 1961509 1961105 1963259
56016 1963259 1965685 1966283 1966347 1967610 1969813 1973440 1981000 1992858 2005289 2015552 2025907 2039923 2057780
56003 2057780 2077701 2099068 2121580 2144161 2167005 2191989 2219247 2246396 2272682 2300228 2329549
55992 2329549 2358154 2385659 2415806 2450773 2487879 2524708 2563017 2604391 2646484 2687189 2728574
55981 2728574 2773231 2820560 2870086 2924478 2985595 3051169 3118826 3189844 3265834 3345603 3428493
55970 3428493 3516916 3612346 3712677 3816373 3925018 4039071 4155968 4275521 4402102 4538294
55960 4538294 4681578 4830483 4988250 5156842 5333466 5517138 5712498 5922613 6144052
55951 6144052 6373624 6613749 6866486 7128973 7399981 7684400 7985861 8301683 8630549
55942H630549L47336L69591L87595M01752M20241M44448M68989M94982N28293
55933A2493776N65588N98029O28242O67039P13886P58331Q00734Q52494R14754
55924A8992873R76428J035352J101445J176735J252809J330625J421427J524790
55916B8812484J628002J731328J851524J996484K159694K343227K561079K815708
55908D5899530L098079L415890L794250M244108M758367N340419O002168O732633
55900H3285444P510378Q353943R317995J0434895J1708489J3169351J4875875
55893A58656370J6852302J9093935K1640714K4556606K7818026L1310026L4870117
55886C34798096L8015700L9431582L7052807K9284643J6496491J237939j3180491
$$ plain form
55942 8630549 8977885 9347476 9735071 10136823 10557064 11001512 11470501 11965483 12493776
55933 12493776 13059364 13657393 14285635 14952674 15666560 16424891 17225625 18078119 18992873
55924 18992873 19969301 21004653 22106098 23282833 24535642 25866267 27287694 28812484
55916 28812484 30440486 32171814 34023338 36019822 38179516 40522743 43083822 45899530
55908 45899530 48997609 52413499 56207749 60451857 65210224 70550643 76552811 83285444
55900 83285444 90795822 99149765 108467760 118902655 130611144 143780495 158656370
55893 158656370 175508672 194602607 216243321 240799927 268617953 299927979 334798096
55886 334798096 372813796 412245378 449298185 478582828 495079319 496317258 483136767
55879D83136767k4418719l1742358l5534709l6598113l5790095l3864263l1346796
55872B53841714k8528488k5588065k2679709j9913255j7340271j5001561j2947313
55865A11843052j1194464r708698q447195p385920o496598n736627n078437m519542
55857E3275571m051705l647241l285433k966122k687499k434823k200447j992529
55849C0009772j814813j657744j516742j399014j304700j220230j137796j063810
55841A8894923j001227r40830q77107q16697p63919p12742o59839o11546n71571
55832A1939445n34824m99015m69714m48587m28891m07523l89579l76474l61639
55823H023199l42567l25289l12199k97072k77047k58380k45234k33391k19917
$$ plain form
55879 483136767 458718048 426975690 391440981 354842868 319052773 285188510 253841714
55872 253841714 225313226 199725161 177045452 157132197 139791926 124790365 111843052
55865 111843052 100648588 90939890 82492695 75106775 68610177 62873550 57795113 53275571
55857 53275571 49223866 45576625 42291192 39325070 36637571 34202748 32002301 30009772
55849 30009772 28194959 26537215 25020473 23621459 22316759 21096529 19958733 18894923
55841 18894923 17893696 16952866 16075759 15259062 14495143 13782401 13122562 12511016 11939445
55832 11939445 11404621 10905606 10435892 9987305 9558414 9150891 8761312 8384838 8023199
55823 8023199 7680632 7355343 7043144 6746072 6469025 6210645 5965411 5732020 5512103
55814E512103k08738k01769j94391j84519j76571j71933j64952j53087j41830
55805C914313j34858j28171j18661j09784j04002r7952q9887q3967q2534q1814
55795B882683p9623p9626q3396q5835q3311p9381p7784p6416p2813o9089o6962
55784B028447o3857n8324n3485n1256m8834m4504m1065l9967l7992l3415k9457
55773A526291k7948k5464j9680j3844j1012r305o715n282o582q202q496r893j3790
55760A360078j7168j7998j9123k2992k7265k9299l0441l2179l2578l0298k7873
55749A072864k7319k6592k3823k0927j9670j8241j5174j2511j1701j0380o811
55738H79715l529l037l545k529r85p26q32j60q3j562k736k415k717n235p881q509
$$ plain form
55814 5512103 5303365 5101596 4907205 4722686 4546115 4374182 4209230 4056143 3914313
55805 3914313 3779455 3651284 3532623 3422839 3318837 3220885 3130998 3047031 2964497 2882683
55795 2882683 2803060 2723434 2640038 2554203 2470892 2391511 2313727 2237311 2164498 2095409 2028447
55784 2028447 1964590 1906266 1852781 1801525 1752691 1708187 1667122 1627155 1589163 1555748 1526291
55773 1526291 1498343 1472879 1453199 1439355 1428343 1419038 1412323 1407041 1400459 1392257 1383761 1373868 1360078
55760 1360078 1342910 1324912 1305789 1282797 1255532 1226233 1195792 1163613 1131035 1100737 1072864
55749 1072864 1045545 1018953 995130 974203 954533 936292 921118 908607 896906 886526 879715
55738 879715 876186 873149 869604 867075 866090 865364 864532 864372 864289 862727 859991 857576 854859 849624 841743 833234
55722H33234q342q949r167q064p505q709r512q308p430r305j2193j3218j2865
55709G09667j3170j3791j3183j1642j0258q707o523m686m098m462o110j0272j6012
55696E86753j9943k0615k0156k0001j8676j5621j3295j3030j2584j0366q377q178
55684D05911p789n666m059n030o447n608l778l486m121l858l430m286n201m293
55670C38859k458j543j049J28O89j119m188o204o957p333o742m538k350k088k940
55655B90167k847j697p80m68m14o81q73K02K402L794L687L838N082N546M005K076
55639C13039R82p69l980o146n125k682j498j325r45j170k650l288j303J386K150
55624B86676J870K852M656N520N955P416Q993Q799P258N906M525K450Q20M69n39
$$ plain form
55722 833234 824892 815943 806776 798712 791207 782498 772986 764678 757248 747943 735750 722532 709667
55709 709667 696497 682706 669523 657881 647623 638916 632393 627707 623609 619147 613037 602765 586753
55696 586753 566810 546195 526039 506038 487362 471741 458446 445416 432832 422466 414089 405911
55684 405911 398122 392456 388397 383367 376920 371312 367534 364048 359927 356069 352639 348353 343152 338859
55670 338859 336401 334858 333809 333937 334626 333507 329319 323115 316158 308825 302083 297545 295195 293107 290167
55655 290167 287320 285623 284843 284375 283961 283280 282407 282609 285011 288805 292492 296330 301412 306958 310963 313039
55639 313039 314021 313252 309272 303126 298001 295319 293821 292496 291551 290381 287731 284443 283140 284526 286676
55624 286676 288546 291398 296054 301574 307529 314945 323938 332737 339995 345901 350426 352876 353696 354165 353626
55609C53626l772o852o639m304l349m065m093l327l887n560n468k599P09K182
55595C02602J699q3k385l537k135P54K673K945K820K817K064K46j634k461j854
55580C04531k94N64j156m994p923p956o464n576n381n449o752r595j1687j1102
55566B20766r335q800r044q308p075o875p045n985m458m408n420n479m376l427
55552A30731k687j408l56p33j584j250n19j303k968l121j454K22J123J767J750
55537A18210L96q73m4J929K163K36j419j449r60j022j467k330l819m927m323k599
55521I7702j365p24N5K03j408l424l392j630p12j271j393j91R90J155P75J92n87
55504H4975o38P35J881N98k176l398k472j706k136k262j320o60j081j526j296
$$ plain form
55609 353626 349854 343002 336363 332059 328710 324645 320552 317225 313338 307778 302310 299711 300420 302602
55595 302602 304301 304218 301833 298296 296161 296915 299588 302533 305353 308170 310234 310480 308846 306385 304531
55580 304531 304237 304801 303645 298651 290728 282772 276308 270732 265351 259902 253150 243555 231868 220766
55566 220766 211431 202631 193587 185279 178204 171329 164284 158299 153841 149433 144013 138534 134158 130731
55552 130731 128044 126636 126280 125547 123963 122713 122194 120891 117923 114802 113348 113570 114693 116460 118210
55537 118210 118606 117733 117689 119618 121781 122017 120598 119149 118189 117167 115700 113370 109551 104624 100301 97702
55521 97702 96337 95613 95668 95871 94463 91039 87647 86017 85305 84034 82641 82450 83440 84595 85370 85562 84975
55504 84975 84337 85072 86953 87551 85375 81977 79505 77799 75663 73401 72081 71421 70340 68814 67518
55489F7518j085j188r29k61J65N21J126O56k032m604l315J369M793M443K696K194
55473G2067K126R72k88p4J039J631J826K461L288L577L428L270L142L205L778
55458A05448M430M364L935M294N264N474M733M235M093K977P13j139k007l275
55444A43539n550p245p043n794m800m062l379l388m346n290n455n127m528l486
55430G4046k778l724n600n714l150m65k32j814l036l303l272k859j567j17J7j492
55414C4940l341l838k206P64L109L400K042K47j836m455o225n054j433J441J606
55399A9161N76O90K006K986K803J780M93o53j592k733m128m636l161n74J220J917
55383A6155K636L317K724J181O99J716K311J495O82Q22P38k62o84M02J262K87
$$ plain form
55489 67518 66433 65245 64316 64055 64220 64741 65867 66523 64491 59887 56572 57941 62734 67177 69873 72067
55473 72067 74193 75165 74877 74803 75842 77473 79299 81760 85048 88625 92053 95323 98465 101670 105448
55458 105448 109878 114242 118177 122471 127735 133209 137942 142177 146270 149247 149960 148821 146814 143539
55444 143539 137989 130744 123701 117907 113107 109045 105666 102278 97932 92642 87187 82060 77532 74046
55430 74046 71268 67544 61944 56230 53080 52615 52383 50569 47533 44230 40958 38099 36532 36415 36432 34940
55414 34940 31599 27761 25555 26319 29428 32828 34870 35117 33281 28826 22601 17547 16114 17555 19161
55399 19161 19737 20427 22433 25419 28222 30002 30495 29842 28250 25517 21389 16753 13592 13018 14238 16155
55383 16155 18791 22108 24832 26013 26712 28428 30739 32234 32916 33738 34476 34214 33530 33932 35194 35481
55367C5481j138p60J046K112J594K68j189k329k406j453r49j729k343j278L68
55352B5295M57q24j451q69n32j211j804j272p6Q80J541K257K889K890K081R87
55336C1238M26N79O65p4j147j434r78j068k128k841k104o84M5J51P54K182L551
55319B7133M010L482K326Q47p07j979k422j733n92m42j821l353l384k100q36J72
55303A8601J629L053K864R16r55j509j405j274l86J638L381L196J268q71k013
55288B8133j775o08J55o52k356l025k121j041n49L49K035K855J574m14j116q43
55272B0601j251k395k658j260P12J653R04q11j788p92J259J874k7k629l476k152
55256G764N3J920K651J603p82k531k041k3J549J782J101j53j889l260k954q83
$$ plain form
55367 35481 34343 33583 34629 36741 38335 38603 37414 35085 32679 31226 30277 28548 26205 24927 25295
55352 25295 25752 24928 23477 22608 22076 20865 19061 17789 17713 18593 20134 22391 25280 28170 30251 31238
55336 31238 31664 32243 32908 32834 31687 30253 29275 28207 26079 23238 21134 20450 20495 20646 21400 23582 27133
55319 27133 31143 34625 36951 37798 37091 35112 32690 30957 30365 29923 28102 24749 21365 19265 18429 18601
55303 18601 20230 23283 26147 27063 26108 24599 23194 21920 21534 23172 26553 29749 31017 30146 28133
55288 28133 26358 25750 25905 25253 22897 19872 17751 16710 16161 16510 18545 21400 22974 22560 21444 20601
55272 20601 19350 16955 14297 13037 13749 15402 16306 15495 13707 12915 14174 16048 16021 13392 9916 7764
55256 7764 7817 9737 12388 13991 13209 10678 8637 8614 10163 11945 13046 12893 11004 7744 4790 3907
55240C907J276J629Mj828j870o2J581J375N4l99M63J352J532J589J798J551R03
55223A4855R27J686J566k82k242k215k16K041L291L426K906K232J532L72j275
55208B8604k130j066O87O63j290k665j957l61P59J670K478K025J12j353j107l90
55192B4679m86n55K26O10m44j432p13N25L30n84k80Q19P36m96r63j45O20O61O00
55173B3708N66Q5m23j26M62J50o71o57n0l73j578j771j27K022L341L872L742K386
55155C4558n4k065k379j394l45J40K79N29J027J294O99m40q01J86J293J192M18
55138C4137L86J005Q29o81k320k723j792n39l0l61m08Q26K488K700J391O68J606
55121C7182K585K073J028P23J87j781l699l369j659j350k749l396j938L96K226
$$ plain form
55240 3907 5183 6812 6816 4988 3118 3056 4637 6012 6066 5667 6130 7482 9014 10603 12401 13952 14855
55223 14855 15782 17468 19034 18752 16510 14295 14079 16120 19411 22837 25743 27975 29507 29879 28604
55208 28604 26474 25408 26095 26758 25468 22803 20846 20485 21244 22914 25392 27417 27529 26176 25069 24679
55192 24679 24193 23638 23864 24474 24030 22598 21885 22410 22740 22156 21876 22695 23431 22935 21972 21827 22447 23108 23708
55173 23708 24274 24359 23936 23810 24272 24422 23751 23094 23044 22671 21093 19322 19195 21217 24558 28430 32172 34558
55155 34558 34504 32439 30060 28666 28321 28461 28740 29269 30296 31590 32289 31849 31048 31234 32527 33719 34137
55138 34137 34523 35528 36357 35676 33356 30633 28841 28302 28272 27911 27503 28329 30817 33517 34908 35576 37182
55121 37182 39767 41840 42868 43591 43778 41997 38298 34929 33270 31920 29171 25775 23837 24233 26459
55106B6459L327L422K122M31N2Q22Q60m54j676j802j462j157m20O50Q66k41j604
55089C0195k190j956j056L81J406R74j61m9J516K578K064J415K164L502L538J789
55073D6110o23k473l244l052k267j006Q40K603K617K73k422l022j886j323j829
55058B9296j577J56J603J396O34Q78J888K591K905L330L778L842L464K651J373
55043E8208J59j37N08J334K103L083L740L069J584J139K218L042K145J95j450
55028H0940k327k207o36J663K552J117p82r55K60J062R67R07J198J182O25J51
55012H5717K13N40P45P96Q73J053J046J81j856m138n094m194k526j339q23n30
54996G0664k96k53m65p97r25m67L93P59K07l99j84K24k06q77m39O53N16j072k138
$$ plain form
55106 26459 29786 33208 35330 35761 35813 36635 37495 37041 35365 33563 32101 30944 30524 31174 32040 31799 30195
55089 30195 28005 26049 24993 25374 26780 27754 27593 27544 29060 31638 33702 35117 37281 40783 44321 46110
55073 46110 45487 43014 39770 36718 34451 33445 34285 36888 39505 39778 37356 34334 32448 31125 29296
55058 29296 27719 27875 29478 30874 31508 32386 34274 36865 39770 43100 46878 50720 54184 56835 58208
55043 58208 58367 58230 58738 60072 62175 65258 68998 72067 73651 74790 77008 80050 82195 82390 80940
55028 80940 78613 76406 75770 77433 79985 81102 80320 79365 79625 80687 81654 82561 83759 84941 85566 85717
55012 85717 85930 86470 87215 88011 88884 89937 90983 91164 89308 85170 80076 75882 73356 72017 71194 70664
54996 70664 70368 70115 69650 68853 67928 67461 67854 68613 68820 68421 68237 68461 68255 67378 66939 67592 68108 67036 64898
54977F4898j598o97o07o14O0N23k24j428j725j053r3J113K588L403K642Q98k92
54960F7794j08J186K813L712K974R69o10n47N81J435J457Q71N6m91l36K28N25
54943H2509O96J454K439K346J249R95K326L386K416M01n74l74l74j000j382j045
54927I5468l77J66K10p07k342l345k794j503q99j168j560j753j654p51J021K410
54911H0422K290J455J606K892L890L655K533J180L5m37j00L74M17M74J083J590
54895A03359J129M21J060L149N183O253O896P590P816P190O359O180O837Q166
54881A77588J0142J2535J4705J6145J6869J7048J6586J5251J2909R649N919K336
54869C27682j014m784r333j3717j6413j7033j6704j6542j6361j5163j2715j0136
$$ plain form
54977 64898 63300 62603 61996 61382 61442 61965 61741 60313 58588 57535 57442 58555 61143 64546 67188 68086 67794
54960 67794 67686 68872 71685 75397 78371 79340 78730 78183 78764 80199 81656 82527 82583 82092 81756 81984 82509
54943 82509 83205 84659 87098 89444 90693 91688 94014 97400 99816 100217 99643 99269 98895 97895 96513 95468
54927 95468 95091 95257 95467 94760 92418 89073 86279 84776 83877 82709 81149 79396 77742 76991 78012 80422
54911 80422 82712 84167 85773 88665 92555 96210 98743 99923 99958 99521 99421 99795 100212 100686 101769 103359
54895 103359 104488 104909 105969 109118 114301 120554 127450 135040 142856 150046 156405 162585 169422 177588
54881 177588 187730 200265 214970 231115 247984 265032 281618 296869 309778 319427 325346 327682
54869 327682 326668 321884 312551 298834 282421 265388 248684 232142 215781 200618 187903 177767
54857A77767q785q679q578p644o437n627m582k478k49K85o56o80J361L677M360
54842A33055M255N447Q207J1026J2808J3379J2658J1140J0621J2513J5490J6512
54830B67111J4270J0193O034K098j818n301p980j0279j2710j4943j6145j5868
54818B14662j4397j2579j1374j1127j1205j0694r468q209p507p258o745n119k264
54805I6716N17J338j34k070k640j996j267o47J31K55j286l407l535j044J585J830
54789H4346J48j091p20K48K89r60k654l621l225j820n11k79j110k012k080j560
54773F3388j457j818j154J483M214L852J51l168k852k19Q83o94k295j528P47K132
54757F1665J829J013R56J830K985L630L374K509J763J651K087K603K759K420J945
$$ plain form
54857 177767 168982 160303 151725 144081 137644 132017 127435 124957 124708 124993 124337 123657 125018 128695 133055
54842 133055 137310 142757 150964 161990 174798 188177 200835 211975 222596 235109 250599 267111
54830 267111 281381 291574 297608 299706 297888 292587 284607 274328 261618 246675 230530 214662
54818 214662 200265 187686 176312 165185 153980 143286 133818 125609 118102 110844 104099 98980 96716
54805 96716 97233 98571 98437 96367 93727 91731 90464 89817 89948 90203 88917 85510 81975 80931 82516 84346
54789 84346 84494 83403 82683 82931 83220 82260 79606 75985 72760 70940 70429 70150 69040 67028 64948 63388
54773 63388 61931 60113 58959 60442 64656 68508 68659 65491 62639 62420 63303 62609 60314 58786 59533 61665
54757 61665 63494 64507 65463 67293 70278 73908 77282 79791 81554 83205 85292 87895 90654 93074 95019
54742I5019J908K474L208L697M070M551M942N023N183O029P529R056J0136J0716
54728A73541J0982J1305J2156J3581J4966J5667J5591J4954J3915J2799J1971
54717C21428J0988Q644M493k86m266p205r274r846q535o766o663q343r803r454
54703B65112p619n381l393k051j632j697j321l37M73P34J079K055L356M628O163
54688B60169Q125R894J0981J2034J4100J7161K0135K2196K3440K4256K4647K4407
54676D71545K3428K1513J8193J3183O938L02o344j2977j8893k2729k4182k4822
54664D45155k6064k7022k5882k3011k0813k0256j9567j7157j4033j2014j1130
54653B28206j0358r649r477r230p896n867m433l746k861j531m91OM27O67j65k236
$$ plain form
54742 95019 96927 99401 102609 106306 110376 114927 119869 124892 130075 136104 143633 152689 162825 173541
54728 173541 184523 195828 207984 221565 236531 252198 267789 282743 296658 309457 321428
54717 321428 332416 341060 345553 345267 341001 333796 324522 314676 306141 299375 292712 284369 274566 265112
54703 265112 257493 252112 248719 246668 245036 243339 242018 241681 242154 242888 243967 246022 249378 254006 260169
54688 260169 268294 278188 289169 301203 315303 332464 352599 374795 398235 422491 447138 471545
54676 471545 494973 516486 534679 547862 554800 555102 548758 535781 516888 494159 469977 445155
54664 445155 419091 392069 366187 343176 322363 302107 282540 265383 251350 239336 228206
54653 228206 217848 208199 198722 189492 181596 175729 171296 167550 164689 163158 162667 162673 163100 163767 163602 161366
54637A61366m277m724l124m58J483J389k16j381j052k27j27l00K35R76P47j67
54621A50143m26K52J071J811K741L239K417R64N32J287J991K437L679N576O382
54606A84096N462M496N069O620P647P565O645N378M640N045N633M586J964K16
54592B55062J150L691N470N459M240K952K710L889N212M850L169K907N707R876
54578C16344J2770J4013J5065J6730J8644K0478K2231K3810K5347K7387K9866
54567E42685L1534L1208K8900K4882J8625R785l87r738j7031k2367k6379k9629
54555E82088l2107l2739l0328k5667k1578j9986j9992j9693j8568j6886j4310
54544C30234j0900q369q192r157q862p213o327p067p879p459o545o318o599o529
$$ plain form
54637 161366 157089 152365 149241 148783 150266 151655 151439 150058 149006 148779 148652 148352 148587 149563 150310 150143
54621 150143 149717 149969 151040 152851 155592 158831 161248 162212 162744 164031 166022 168459 172138 177714 184096
54606 184096 189558 194054 199123 205743 213390 220955 227600 232978 237618 242663 248296 252882 254846 255062
54592 255062 256212 259903 265373 270832 275072 278024 280734 284623 289835 294685 297854 300761 306468 316344
54578 316344 329114 343127 358192 374922 393566 414044 436275 460085 485432 512819 542685
54567 542685 574219 605427 634327 659209 677834 687619 687232 677494 660463 638096 611717 582088
54555 582088 549981 517242 486914 461247 439669 419683 399691 379998 361430 344544 330234
54544 330234 319334 310965 302773 293616 284754 277541 271214 264147 256268 248809 242264 235946 229347 222818
54530B22818n905m962l882l146l544n021o267o254n507n240n602n656m790l444
54516A53598k352j688j230j044j522k700l834m079l513k980k831k441j285O7O43
54501A22809L84O0K3k16j093k194k667k144j087k79nJ72P35J433J625J337J367
54484A20260K063K643K270J385J201K100L161L442L193L512M901O498O975O154
54470A69758N259N341O007O354O629P811R748J1076J1293J1558J2813J4196J4287
54457B92130J2974J1130R114O695L994J447r43l438n940q200j0380j2623j4400
54444B81560j5095j4971j4761j4495j3523j1582r116o648m600l434l270l479l515
54431A63071l875n142o301n351k134O98N47k006l867l064p34P02N45K96J346L071
$$ plain form
54530 222818 216913 211951 208069 204923 201379 196358 190091 183837 178330 173090 167488 161832 157042 153598
54516 153598 151246 149558 148328 147284 145762 143062 139228 135149 131636 128656 125825 123384 122099 122166 122809
54501 122809 123193 123253 123276 123060 121967 119773 117106 114962 113875 113596 113591 113763 114498 115931 117556 118893 120260
54484 120260 122323 124966 127236 128621 129822 131922 135083 138525 141718 145230 150131 156629 163604 169758
54470 169758 175017 180358 186365 192719 199348 207159 216907 227983 239276 250834 263647 277843 292130
54457 292130 305104 316234 325348 332043 336037 337484 336541 333103 327163 318963 308583 295960 281560
54444 281560 266465 251494 236733 222238 208715 197133 188017 181369 176769 173335 170065 166586 163071
54431 163071 159196 154054 147753 142402 140268 140966 141513 139507 135640 132576 131842 132544 133089 133385 134731 137802
54415A37802L834L275K647K786K883J962O82N42J581K171J313J48M66K289L780
54400A68161L492K010J050J384K189K367J843J283R98O91O9q10j780k566k669
54385A77712j842q02q05k279m223n194m565k840j179o58j532k978l885l873l254
54370A37803k338j299n49m14o26p20p05n68L59K232L444K241m38j740q02J94l93
54353A35681j266o93O66J286J523K618M103M549M106M042M072K633M0j007J109
54338A63462M638O688O514N618N484O246P175P572P166O085M564K754Q65p24j799
54323B32308k523l061l363l654m567o139p155o348m092k167j921l300n361o945
54309A71712p020n216k471n25m87j919l258l133j545J04N36J19J84Q71P81p36
$$ plain form
54415 137802 141636 144911 147558 150344 153227 155189 155871 156413 157994 160165 161478 161626 162092 164381 168161
54400 168161 171653 173663 174713 176097 178286 180653 182496 183779 184777 185468 185537 184727 182947 180381 177712
54385 177712 175870 175068 174263 171984 167761 162567 158002 155162 153983 153325 151793 148815 144930 141057 137803
54370 137803 135465 134166 133617 133203 132577 131857 131152 130584 130943 133175 136619 138860 138422 136682 135880 136074 135681
54353 135681 134415 133722 134388 135674 137197 139815 143918 148467 152573 156615 160687 163320 163360 162353 163462
54338 163462 168100 174788 181302 186920 192404 198650 205825 213397 220563 226648 231212 233966 234831 234107 232308
54323 232308 229785 226724 223361 219707 215140 209001 201846 195498 191406 189239 187318 184018 178657 171712
54309 171712 164692 159476 157005 156480 155993 154074 150816 147683 146138 146242 146778 146897 147081 147952 148733 147997
54293A47997k267k215r24J36M55N24O35J012K353M756O576N980L439J261P98J590
54277A72106K876M319N151M316K054k3q68r57j066j261j468j913k596l181l794
54262A73695m930o359p105o820o148n490m511l249k530k587k388j228m5j38j141
54247A19026j438m11O56J69j833l640l678k140o71n28j416k167k123j494r01r21
54231I6490j701k507k264r67Q3O2k31J48O71L69l04k00N43R17R50J499K270J997
54213I7825P43K12J273K756L182K445J180j81j182j297o37J80J040K304L741M616
54197A18200M795M538L353P67j885k430r00K87l43j757k685l175l119j632P80
54182A14794J766M41r10l67N66l01j834j260J250K800K205J266J472J954J496
$$ plain form
54293 147997 145730 143515 142591 142727 143182 143706 144341 145353 147706 152462 159038 165018 168457 169718 170516 172106
54277 172106 174982 179301 184452 188768 190822 190799 189931 188974 187908 186647 185179 183266 180670 177489 173695
54262 173695 168765 162406 155301 148481 142333 136843 132332 129083 126553 123966 121578 120350 120305 120167 119026
54247 119026 117588 117177 117833 118002 116169 112529 108851 106711 106040 105512 104096 101929 99806 98312 97411 96490
54231 96490 94789 92282 90018 89051 89134 89196 88965 89113 89784 90153 89849 89649 90192 91109 92059 93558 95828 97825
54213 97825 98568 98780 100053 102809 105991 108436 109616 109435 108253 106956 106319 106499 107539 109843 113584 118200
54197 118200 122995 127533 130886 131653 129768 127338 126438 126725 126382 124625 121940 118765 115646 114014 114794
54182 114794 116560 117001 116091 115724 116290 115989 114155 112895 114145 116945 119150 120416 121888 123842 125338
54167A25338M65k33n59p98o21L91J908L068L146K004L40o02k85L08j00j290j874
54150A30606j250j47P66J550K120J866Q11J12P03J953K342J095j292l749n204
54135A32282m850k778m34L01r79k582k648j399o39j057j283l04N39n80k901l731
54119A06957k066K78J436J579J584J351N98n3n5P3j88k91J36J01j300l043l389
54102A03708k272r68PR59J383K42k014l511l461l037l169k932j229J032J688K6
54086H6452k365l463k818j380Q3J564K773K583M18k238l141k060q82p09m97O33
54070G4953J535R23l03n02Ok50r02J8K648M287K576j629n340o323m413j055J768
54053F7997K730J950M40j003j909j716k51J566K620L070L743M294L427J118q36
$$ plain form
54167 125338 125803 125570 125011 124213 123592 123983 125891 128959 132105 134109 134449 133847 133562 133870 133770 132480 130606
54150 130606 129356 129209 129975 131525 133645 135511 136322 136434 137137 139090 141432 142527 141235 137486 132282
54135 132282 127432 124654 124220 124521 123542 120960 118312 116913 116274 115217 113934 113630 114169 113589 110688 106957
54119 106957 104891 105169 106605 108184 109768 111119 111717 111664 111609 111682 111494 111203 111339 111440 110140 107097 103708
54102 103708 101436 100468 100475 101434 102817 103059 101045 97534 94073 91036 87867 84935 83706 84738 86426 86452
54086 86452 84087 80624 77806 76426 76509 78073 80846 83429 83847 81609 78468 76408 75526 74817 74320 74953
54070 74953 76488 77411 77108 76606 76612 76362 75460 75478 78126 82413 84989 83360 78020 71697 67284 66229 67997
54053 67997 70727 72677 73117 72114 70205 68489 68238 69804 72424 75494 79237 83531 86958 88076 87240
54038H7240j053j37N14L58l15j012j018K23K021K609J202q61j679q94M32J384
54022H9014J804J720J032j92j434j806o64J517L041K539N43j161j569j065j63
54007I3156R89J796J447M50N02J961K953J999L13NJ003J414N20l10K48J775K928
53990A13149L044K491J990J916K009J827J549J915L048L959L894L602M289N727
53976A54409O573O525O905Q590J0408J0425Q439O355O073P506Q983R388R357J0078
53962B70014J1269J1240R068N961L938L751M704N870O593O140M093J232q99j663
53948C41311j981k956m451n499n603n132m675m515m737n407o434p415p850p612
53934B67044p129o812o413n362l902l237l966m898m361k487j125j279j843j387
$$ plain form
54038 87240 86187 86050 86564 86922 86607 85595 84577 84800 86821 89430 90632 89771 88092 87198 87630 89014
54022 89014 90818 92538 93570 93378 91944 90138 89474 90991 94032 96571 97114 95953 94384 93319 93156
54007 93156 94145 95941 97388 97838 98340 100301 103254 105253 105566 105571 106574 107988 108508 108198 108446 110221 113149
53990 113149 116193 118684 120674 122590 124599 126426 127975 129890 132938 136897 140791 144393 148682 154409
53976 154409 160982 167507 174412 183002 193410 203835 212274 218629 224702 232208 241191 250579 259936 270014
53962 270014 281283 292523 301591 307552 311490 315241 319945 325815 332408 338548 342641 343873 342974 341311
53948 341311 339330 336374 331923 326424 320821 315689 311014 306499 301762 296355 289921 282506 274656 267044
53934 267044 259915 253103 246690 241328 237426 234189 230223 225325 220964 218477 217352 216073 214230 212843
53920B12843j65N70N57M94N45J10q34j368r05Q8J008J789K261J788L84o99m05
53903B18061O57J199J158J518K516L260L078K170P98q94k188k116r48r7p4J80
53887B28278J257J949J145j24l2J390K582K980L543M799O014O662P344Q643J0037
53872B86467J0594J0100Q978P615O178M675K993J242L9p7M61N97j00j156k018
53857C36588k339j520R20M235O686P387P160P176P619Q029Q140P857P163O536
53843D11637O621P088O670M959L148K299J826O52j002k160k739l388m160m611
53829D26840m936n746o796p197o931p067q180r569j0295j0170r445q317p129o432
53815C18630o458o937p522p967p873o974n732m973m804m529l883l558m116n066
$$ plain form
53920 212843 212678 213248 213805 214299 214844 214954 214120 212752 211847 211935 212943 214732 216993 218781 219165 218466 218061
53903 218061 218718 219917 221075 222593 225109 228369 231447 233617 234415 233521 231333 229217 228269 228172 228098 228278
53887 228278 229535 231484 232629 232505 232473 233863 236445 239425 242968 247767 253781 260443 267787 276430 286467
53872 286467 297061 307161 316139 323754 329932 334607 337600 338842 338881 338804 339265 339862 339762 338606 336588
53857 336588 334249 332729 333649 337884 344570 351957 359117 366293 373912 381941 390081 397938 405101 411637
53843 411637 418258 425346 432016 436975 440123 442422 444248 444900 443898 441738 438999 435611 431451 426840
53829 426840 421904 416158 409362 402165 395234 388167 379987 370418 360123 349953 340508 332191 325062 318630
53815 318630 312172 305235 297713 289746 281873 274899 269167 264194 259390 254861 250978 247420 243304 238238
53801B38238n428m835l797l270m017n710o620n201k289o85j850m029m610l445
53787A82452k493k796l421l316k703k204j825j406j088p41J85J454J581l92l113
53772A60174m008k089J072L169L240J991P92N47J067J336P22j88l96O0J77m42
53756A67224r80o06M61J517K286K756K654J854R48P96J668L124M507N238N133
53741A98580M813N200O107O107M552K905K948M304N214N397O249Q118R265Q312
53727B78071O178M524L475K217R04N31J244K054K139J530O27j82n60o11j064k344
53711B98733l699m090l733l730m304m525l964l420l524l693l280k851l274m039
53697B46607l750k231r32q37j021j07J514K147J232J53J67P24O51J57L31J106
$$ plain form
53801 238238 232810 227975 224178 220908 216891 211181 204561 199360 197071 196386 194536 190507 185897 182452
53787 182452 179959 177163 173742 170426 167723 165519 163694 162288 161200 160459 160644 162098 163679 163287 160174
53772 160174 156166 154077 155149 158318 161558 163549 164341 164888 165955 167291 168013 167825 167429 167489 167666 167224
53756 167224 166244 165638 166099 167616 169902 172658 175312 177166 178114 178910 180578 183702 188209 193447 198580
53741 198580 203393 208593 214700 220807 225359 228264 231212 235516 240730 246127 252376 260494 269759 278071
53727 278071 284249 288773 292248 294465 295369 295900 297144 299198 301337 302867 303494 303312 302752 302141 301077 298733
53711 298733 295034 290944 287211 283481 279177 274652 270688 267268 263744 260051 256771 253920 250646 246607
53697 246607 242857 240626 239694 238857 237836 237729 239243 241390 242622 242775 242942 243666 244317 244474 244805 245911
53681B45911J261M75o5K99M23r34l171m758n274n321m968l782k181j405j945k989
53665B11576l618l656l196k251j148m42j90k6J9l24o00l3R46J013K70O68L017
53648B02025N146M709K746K380M373O231N942M515L852L939L538K672K537L367
53634B57972L991L795L728M683N836N701M388L662M572N993O086M476K320N73
53620C17776p16j448j063L51J404Q76o73j720j903k179k908l029j769j77O4j208
53604C01678k553k810k237j744j748k013k032j316K35J914K543J636lj149j385
53589B89016j165r61p73m23O6N17P12N08R7l2K72M01j46o25L38K653M251L424
53571B98130J093k91L26J782K629K737K679K651K595K628K759K731K625L050M070
$$ plain form
53681 245911 247172 247647 247582 247881 248304 247370 244199 239441 234167 228846 223878 220096 217915 216510 214565 211576
53665 211576 207958 204302 201106 198855 197707 197265 197075 197049 197068 196744 196144 196111 197057 198070 198340 199008 202025
53648 202025 207171 211880 214626 217006 221379 227610 233552 238067 241919 245858 249396 252068 254605 257972
53634 257972 261963 265758 269486 274169 280005 285706 290094 293756 298328 304321 310407 314883 317203 317776
53620 317776 317060 315612 314549 314900 316304 317180 316507 314787 312884 310705 307797 304768 302999 302822 302886 301678
53604 301678 299125 296315 294078 292334 290586 288573 286541 285225 285460 287374 289917 291553 291550 290401 289016
53589 289016 287851 286890 286117 285694 285760 286277 286989 287497 287594 287562 287834 288235 288089 287464 287802 290455 294706 298130
53571 298130 299223 298932 299258 301040 303669 306406 309085 311736 314331 316959 319718 322449 325074 328124 332194
53556C32194M670M129L388M032O053P690P553O023M454L772M153N261O379O824
53542D06575O633O477O681O792O294N290M270L711M031N276O564O559N064L456
53528D83673K985L260L157K645K732L781M883M958L779J838j17j265j083J51J549
53513E16926K438K795K947L111L164K559P06k064m228m313k380K30K419L883M420
53498E32613L781K478J732K129K940L349L730M958O754P544O258L869K719M137
53484E88991O916Q553Q000O592O066O494O890P066P568Q185Q076P520P989R928
53470F94834J1769J1933J0768R708R437R769J0545J1584J2431J3037J4230J6551
53458H36596J9105K0501K0623K0505K0789K1239K1638K2198K3040K4068K5401
$$ plain form
53556 332194 336864 340993 344381 348413 354466 362156 369709 375732 380186 383958 388111 393372 399751 406575
53542 406575 413208 419685 426366 433158 439452 444742 449012 452723 456754 462030 468594 475153 480217 483673
53528 483673 486658 489918 493075 495720 498452 502233 507116 512074 515853 517691 517574 516309 515226 515377 516926
53513 516926 519364 522159 525106 528217 531381 533940 534646 532582 528354 524041 521661 521891 524310 528193 532613
53498 532613 536394 538872 540604 542733 545673 549022 552752 557710 564464 572008 578266 582135 584854 588991
53484 588991 595907 604460 612460 619052 625118 631612 638502 645568 653136 661321 669397 676917 684906 694834
53470 694834 706603 718536 729304 739012 748449 758218 768763 780347 792778 805815 820045 836596
53458 836596 855701 876202 896825 917330 938119 959358 980996 1003194 1026234 1050302 1075703
53447A075703K7293K9530L1432L2552L3041L3463L4438L6229L8264L9484L9559
53436A450988L9375L9799M0596M1115M1521M2443M3731M4406M3740M1871L9614
53425A909199L8147L8369L9831M0823M0282L9013L8324L8159L7659L6821L6250
53414B332877L5836L5082L4411L4662L5409L5278L3814L1615K8852K5286K1675
53403B684797J9279J7636J4706R925N401L154K458R01k913q431j3973j7876j9692
53390B695372k0669k2190k3828k4251k4024k5415k8831l1689l2114l1667l2689
53379B398005l4716l5580l4863l3898l3095l1547k9170k7225k6427k5992k4871
53368B060621k2761j9775j6208j2771j0232q646p511o523n523m028j625J371M326
$$ plain form
53447 1075703 1102996 1132526 1163958 1196510 1229551 1263014 1297452 1333681 1371945 1411429 1450988
53436 1450988 1490363 1530162 1570758 1611873 1653394 1695837 1739568 1783974 1827714 1869585 1909199
53425 1909199 1947346 1985715 2025546 2066369 2106651 2145664 2183988 2222147 2259806 2296627 2332877
53414 2332877 2368713 2403795 2438206 2472868 2508277 2543555 2577369 2608984 2637836 2663122 2684797
53403 2684797 2704076 2721712 2736418 2746343 2751744 2754898 2757356 2758257 2755344 2746913 2732940 2715064 2695372
53390 2695372 2674703 2652513 2628685 2604434 2580410 2554995 2526164 2494475 2462361 2430694 2398005
53379 2398005 2363289 2327709 2292846 2258948 2225853 2194306 2165136 2137911 2111484 2085492 2060621
53368 2060621 2037860 2018085 2001877 1989106 1978874 1970228 1962717 1956194 1950671 1946643 1945018 1946389 1950715
53355A950715O953R016J0027J0192J0981J3584J7281K0498K2995K5664K8614L1073
53343B157593L3057L5470L8357M0562M1570M2445M4343M7325N1099N5682O0549
53332B648052O4199O5692O6050O7149O9487P1910P3417P4380P5711P7320P8144
53321C431511P7779P7491P8893Q1675Q3397Q1932P7583P2396O8017O4776O2321
53310D257771O0089N7283N3092M7112L9493L0905K2579J5664R979L965l519j1837
53298D582576j9559k6106l1785l6905m1772m6993n2758n8242o2505o5524o7740
53287D072687o9335p0781p3062p6231p8629p8789p7191p4859p1581o7226o3626
53276C271377o2606o3009o2214o0040n8392n7408n5167n1468m8613m7436m5686
$$ plain form
53355 1950715 1957668 1966684 1976711 1986903 1997884 2011468 2028749 2049247 2072242 2097906 2126520 2157593
53343 2157593 2190650 2226120 2264477 2305039 2346609 2389054 2433397 2480722 2531821 2587503 2648052
53332 2648052 2712251 2777943 2843993 2911142 2980629 3052539 3125956 3200336 3276047 3353367 3431511
53321 3431511 3509290 3586781 3665674 3747349 3830746 3912678 3990261 4062657 4130674 4195450 4257771
53310 4257771 4317860 4375143 4428235 4475347 4514840 4545745 4568324 4583988 4593967 4597932 4594413 4582576
53298 4582576 4563017 4536911 4505126 4468221 4426449 4379456 4326698 4268456 4205951 4140427 4072687
53287 4072687 4003352 3932571 3859509 3783278 3704649 3625860 3548669 3473810 3402229 3335003 3271377
53276 3271377 3208771 3145762 3083548 3023508 2965116 2907708 2852541 2801073 2752460 2705024 2659338
53265B659338m1780l7450l4876l3476l1511k8905k6549k4426k2320k1021k1087
53254B335937k1625k1879k2533k3821k4024k1863j8792j6689j4714j1123p097
53243B131777n643o951p740n534j235K960N964P510P508O730O773Q607J1948J6219
53229B178893K0873K4781K6829K7585K8985L1826L4746L6154L6024L5299L4702
53218B516697L4660L5364L6178L5862L3928L1079K7994K4598K0850J7277J4035
53207B828522J0475O271K154j232m444q357j2783j6745j9758k2065k3942k5531
53195B712565k7258k9764l3232l7126m0537m2733m3564m3532m3355m3326m3324
53184B284814m3333m3497m3524m2584m0283l7511l5848l5923l6598l6020l3660
$$ plain form
53265 2659338 2617558 2580108 2545232 2511756 2480245 2451340 2424791 2400365 2378045 2357024 2335937
53254 2335937 2314312 2292433 2269900 2246079 2222055 2200192 2181400 2164711 2149997 2138874 2131777
53243 2131777 2126134 2119183 2111443 2105909 2104674 2107634 2113598 2121108 2128616 2135346 2142119 2150726 2162674 2178893
53229 2178893 2199766 2224547 2251376 2278961 2307946 2339772 2374518 2410672 2446696 2481995 2516697
53218 2516697 2551357 2586721 2622899 2658761 2692689 2723768 2751762 2776360 2797210 2814487 2828522
53207 2828522 2838997 2845268 2847422 2846190 2841746 2833389 2820606 2803861 2784103 2762038 2738096 2712565
53195 2712565 2685307 2655543 2622311 2585185 2544648 2501915 2458351 2414819 2371464 2328138 2284814
53184 2284814 2241481 2197984 2154460 2111876 2071593 2034082 1998234 1962311 1925713 1889693 1856033
53173A856033l0998k9810k9807k8908k6083k2915k1509k1631k1155j9012j6346
53162A587859j4692j4219j4028j3341j2035j0689j0210j0802j1410j1019j0280
53151A455134j0671j2094j2833j2075j0997j0772j1037j1143j1521j2651j3816
53140A325524j4209j4355j5018j5516j4623j2746j1720j2440j4012j5202j5611
53129A170072j5318j4526j3871j4109j5214j6417j7359j8387j9555k0085j9315
53118I85916j7733j6669j7055j8536j9590j8834j6646j5195j6043j8061j8743
53107G92811j7552j6596j7468j8735j7760j4365j1273j0946j2997j5115j5701
53096F24303j4953j3810j2719j1623j0631j0107j0163j0448j0543j0320r746q721
$$ plain form
53173 1856033 1825035 1795225 1765418 1736510 1710427 1687512 1666003 1644372 1623217 1604205 1587859
53162 1587859 1573167 1558948 1544920 1531579 1519544 1508855 1498645 1487843 1476433 1465414 1455134
53151 1455134 1444463 1432369 1419536 1407461 1396464 1385692 1374655 1363512 1351991 1339340 1325524
53140 1325524 1311315 1296960 1281942 1266426 1251803 1239057 1227337 1214897 1200885 1185683 1170072
53129 1170072 1154754 1140228 1126357 1112248 1097034 1080617 1063258 1044871 1025316 1005231 985916
53118 985916 968183 951514 934459 915923 896333 877499 860853 845658 829615 811554 792811
53107 792811 775259 758663 741195 722460 704700 690335 679062 668116 655119 640004 624303
53096 624303 609350 595540 582821 571198 560567 550460 540297 529849 519306 508986 499240 490519
53084D90519p401o466o622p794r101r579q862p254n441m065l371l241l515l945
53070D03862l910k787j019j70j252l372m846n228n294n378n020m275m066m673
53056C52572n123m660l780l127k430j556j584l402n816o583n243l547k958l070
53042B99693k844k205j821k038k720l499l775l027j631p77r68j282o63N06J050
53027B73999Q42J069K468M139M483L048J112M54J631L503M541M421M094M378N051
53012C19233N440N199M141K040p33k921l615l459l781m727n256m911m517m860
52998B97273n664o277o512o291n235l363j661j157j704k303k391k252k359k866
52984B47238l642m273m215l368k437k176k411k315j615r51r32j342j508j091l51
$$ plain form
53084 490519 483118 476652 470030 462236 453135 443556 434694 427440 421999 417934 414563 411322 407807 403862
53070 403862 399952 397165 396146 395976 394724 391352 386506 381278 375984 370606 365586 361311 357245 352572
53056 352572 347449 342789 339009 335882 333452 331896 330312 326910 321094 314511 309268 305721 302763 299693
53042 299693 296849 294644 292823 290785 288065 284566 280791 277764 276133 275356 274388 273106 272443 272949 273999
53027 273999 274841 275910 278378 282517 287000 290048 291160 291614 293245 296748 301289 305710 309804 314182 319233
53012 319233 324673 329872 334013 336053 335320 332399 328784 325325 321544 316817 311561 306650 302133 297273
52998 297273 291609 285332 278820 272529 267294 263931 262270 261113 259409 257106 254715 252463 250104 247238
52984 247238 243596 239323 235108 231740 229303 227127 224716 222401 220786 219835 218903 217561 216053 214962 214611
52969B14611J70K5q25j965k848l168k810j706j02J210J330J45j534k686k781j903
52953A95163o64L5l35j358k055j986j668j689j866j575o71K58M82q9p06m42P52
52936A81586J753J478K78m37k9O77Q36Q11J332K064K024J184O07R02J440J395
52920A97901P97J26n29j289j854j676p03N32J462J835J596R15L95P30J856K691
52904B04785K164N13p70n28P48J562J217N09L98O31L71j83J75J762L135K785J122
52887B20396j47j88L04N68P81J374K190K960L983N646P551Q755Q808Q132P470
52872B78583P228P210O690N019K559Q35J216L435N780O630N541L130N21j103j141
52857C32133r4R09J218R60L70o28j935k974l188k629j865j529j921k595k499j130
$$ plain form
52969 214611 214781 214806 213981 212016 209168 206000 203190 201484 201382 202592 203922 204067 202533 199847 197066 195163
52953 195163 194499 194534 194199 192841 190786 188800 187132 185443 183577 182002 181331 181589 182071 181982 181276 180834 181586
52936 181586 183339 184817 185095 184658 184629 185306 186142 186953 188285 190349 192373 193557 194164 195066 196506 197901
52920 197901 198698 198824 198295 197006 195152 193476 192773 193305 194767 196602 198198 199113 199508 200238 202094 204785
52904 204785 206949 207462 206692 206164 206912 208474 209691 210200 210598 211229 211600 211417 211592 213354 216489 219274 220396
52887 220396 220249 220061 220365 220933 221714 223088 225278 228238 232221 237867 245418 254173 262981 271113 278583
52872 278583 285811 293021 299711 304730 307289 308124 309340 312775 318555 325185 330726 333856 334377 333274 332133
52857 332133 332039 332948 334166 335126 335496 334868 332933 329959 326771 324142 322277 320748 318827 316232 313733 312603
52841C12603L99L58j346k804k554j446j289k432l671l992l265j682K44J202J15
52826B90440k066k828r77J806K997K106P22L09P82J214J093O98M98M48k3j182
52810B96037k274k177q92K23P9p83j108p05m91q60j041m10M04M77J52O82K305
52793B89618L577L118J432K04K13P74J223J810K691L047K218J147J497L416N180
52778C21165N346M351L553L483L566L088J842Q1j612k581k554j783p23K31N85
52763C38038rj108j643j148l79r1J08R18J784J253q92k881k883j139M02M00m58
52746C30272l92J320L488M314L307J475j23j279j978j798p45j8q93l116n335o936
52730C21563q324r478r472p903n692l857k433j271j023k270m172n022m076k213
$$ plain form
52841 312603 313002 313360 312014 309210 306656 305210 303921 301489 297818 293826 290561 288879 289123 290325 290440
52826 290440 288374 285546 284569 286375 289372 291478 292200 292509 293291 294505 295598 296296 296794 297242 297219 296037
52810 296037 293763 291586 290694 290917 290996 290213 289105 288400 287909 287049 286008 285598 286002 286479 286631 287313 289618
52793 289618 293195 296313 297745 297949 298162 298936 300159 301969 304660 307707 309925 311072 312569 315985 321165
52778 321165 326511 330862 334415 337898 341464 344552 346394 346475 344863 342282 339728 337945 337222 337453 338038
52763 338038 338029 336921 335278 334130 333751 333660 333768 334686 336470 337723 336831 333950 331067 329928 330330 330730 330272
52746 330272 329880 331200 334688 339002 342309 343784 343661 342382 340404 338606 337861 337843 336950 333834 328499 321563
52730 321563 313239 303761 294289 286386 280694 276837 274404 273133 272110 269840 265668 260646 256570 254357
52716B54357r40j217k782m116l539j233L61q09l704n422m880l777l667l871l156
52701B11605k038j936k877l576l440l054k788k195j186o38j220k411l221l414
52687A77611l359l218k924k717k984l531l612k900k066k069k977l722l123j148
52673A37261Q90J477M20r23j072j37L42o39k155k500j479o60j083j649p60J082
52657A28415J602k03k588l260k046n91q5l69r01j469j848j689j066n78o15r00
52641A11809q92l52N22J183J016m3j202j551r81K1J102K055K396J923J465J964
52625A20435K839K521Q74l91k08L36r4r67r20J14J200K067K996L599L313K760
52609A40474L054L822L501J818L42K02O96P55N24O32J091J770L013M714N654M856
$$ plain form
52716 254357 253417 252200 249418 245302 241763 240530 240891 240082 236378 230956 226076 222299 218632 214761 211605
52701 211605 209567 207631 204754 201178 197738 194684 191896 189701 188515 187877 186657 184246 181025 177611
52687 177611 174252 171034 168110 165393 162409 158878 155266 152366 150300 148231 145254 141532 138409 137261
52673 137261 138151 139628 140048 139125 138053 137916 138258 137619 135464 132964 131485 130825 129742 128093 127333 128415
52657 128415 130017 129814 127226 123966 121920 121329 121244 120875 119974 118505 116657 114968 113902 113324 112709 111809
52641 111809 110917 110565 111087 112270 113286 113243 112041 110490 109509 109530 110632 112687 115083 117006 118471 120435
52625 120435 123274 125795 126669 126278 126070 126406 126312 125345 124425 124539 125739 127806 130802 134401 137714 140474
52609 140474 143528 147350 150851 152669 153011 153213 153909 154664 155188 155820 156911 158681 161694 166408 172062 176918
52593A76918L028J639R70K25q30j554j758k108k921l412k695j054K27J38j194
52578A65619k653l167k723k322k751l658m171m057l723l256k382j297p34q35q40
52563A27050l04R5m37j495j960j515q78p23j025j436j621j170J14J638K341J860
52547A20534R16L37K81N57J117J714J779J163N34M00K58m65j212r90K8P34R13
52530A28598J498K716L208J814n60j825j003J018K736L366L071K452J925J551
52516A50565J392J785K724L277K501R21O0K79L94j10jJ517K938K356L94n99K57
52499A70650J631K305K425K367J896J032M21K84K7o38j084o76L91J472J927J200
52483A85630n97k055j574O09K396K263P98l11Q4K028M333N004L214R60R86K872
$$ plain form
52593 176918 179946 181585 182555 182780 181950 180396 178638 176530 173609 170197 167502 166448 166675 166813 165619
52578 165619 162966 159799 157076 154754 152003 148345 144174 140117 136394 133138 130756 129459 128725 127890 127050
52563 127050 126746 126841 126404 124909 122949 121434 120556 119833 118808 117372 115751 114581 114695 116333 118674 120534
52547 120534 121450 121787 122068 122625 123742 125456 127235 128398 128932 129332 129590 129125 127913 126923 126951 127685 128598
52530 128598 130096 132812 136020 137834 137274 135449 134446 135464 138200 141566 144637 147089 149014 150565
52516 150565 151957 153742 156466 159743 162244 163165 163225 163504 163898 163788 163787 165304 168242 170598 170992 170393 170650
52499 170650 172281 174586 177011 179378 181274 182306 182727 183011 183038 182400 181316 180640 181031 182503 184430 185630
52483 185630 185033 182978 181404 182013 184409 186672 187470 187159 187243 189271 193604 198608 201822 202782 203768 206640
52467B06640L476J884J156L444O003M854P18j998j277O49J447J436J493J057l52
52452B30630j647j692r42l14L39J364K032J519L70l66q25j728k550j909J19J546
52436B25946R63n84j020Q9J193R95o8p63p53n92n42l28no0l71n8J038J728J201
52417B28009N57J252K562K208l42k750k683p02O84J39j242j640n74Q84J580J611
52401B29553K026L259M328L935K087J23p04j05J448L067L632K629R36J03O08J498
52385B58423J842J746J709J812J948K051J762O37r02j644j188o72j173k125k140
52370B62086q98O53J551J500O66l41m76Q18K688L582K894J447L85J46M30P06O63
52353B78500M31K88L5q81k285l000k232o79N14J301K227K944K675J898J950K789
$$ plain form
52467 206640 210116 212000 213156 216600 222603 227457 228175 226177 224900 225549 226996 228432 229925 230982 230630
52452 230630 228983 227291 226349 226035 226374 227738 229770 231289 231659 231293 230468 228740 226190 224281 224400 225946
52436 225946 226909 226325 225305 225394 226587 227582 227514 226751 225998 225406 224864 224536 224531 224471 224100 224042 225080 226808 228009
52417 228009 228566 229818 232380 234588 234246 231496 228813 228111 228795 228934 227692 226052 225478 226362 227942 229553
52401 229553 231579 234838 239166 243101 245188 245311 244607 244502 245950 249017 252649 255278 256214 256317 256925 258423
52385 258423 260265 262011 263720 265532 267480 269531 271293 271930 271028 269384 268196 267524 266351 264226 262086
52370 262086 261188 261841 263392 264892 265558 265217 264741 265559 268247 271829 274723 276170 276555 276701 277131 277837 278500
52353 278500 278931 279219 279254 278373 276088 273088 270856 270177 270691 271992 274219 277163 279838 281736 283686 286475
52337B86475K765J244n8N51K247K788J442m51j416j102J27J656K711K983L270
52322C05232M500O104O411M915L108K542L055L542L501K964J603o92k783l185
52308C40817k005q80p78r72m96N38J669K939M011L586J094j576j729P69L324L989
52292C54300L514L469L937M156M245M778N230M479K746J632K120L613N187O658
52278D10064P963Q572Q156P165O077M783L271K220K158K643L197M428P018R916
52264D87631J1049J0035Q819R024R877R738Q727Q529R967J2106J3771J4781J5352
52251F29406J5441J5364J6213J8612K1486K3089K3226K3469K4919K6727K7502
52240H65454K7439K8016K9725L1289L1517L1006L1131L2047L2710L2797L3223
$$ plain form
52337 286475 289240 290484 290426 290977 293224 296012 297454 297003 295587 294485 294612 296268 298979 301962 305232
52322 305232 309732 315836 322247 327162 330270 332812 335867 339409 342910 345874 347477 346785 344002 340817
52308 340817 338812 337932 337154 336182 335686 336224 337893 340832 344843 348429 349523 347947 346218 346987 350311 354300
52292 354300 357814 361283 365220 369376 373621 378399 383629 388108 390854 392486 394606 398219 403406 410064
52278 410064 418027 426599 434755 441920 447997 452780 456051 458271 460429 463072 466269 470697 477715 487631
52264 487631 498680 508715 517534 526558 536435 546173 554900 563429 573396 585502 599273 614054 629406
52251 629406 644847 660211 676424 695036 716522 739611 762837 786306 811225 837952 865454
52240 865454 892893 920909 950634 981923 1013440 1044446 1075577 1107624 1140334 1173131 1206354
52229A206354L4386L5099L4187L2356L1177L0692K9564K7612K6482K6937K7009
52218A541855K4329J9505J5457J3601J2462J0443Q262P497P862P444N225K002
52206A675944j125l855o018p016o706o009n743n378l871j473M06J140J680L037
52192A635013M873O219O924P553Q243Q684R214J0982J4540J8802K1911K2969K2629
52179A798556K2138K2142K2429K2496K2100K1243J9875J7958J5862J4213J3047
52168B012059J1509Q901N749L195J458l39k782n430p756j0077j3014j6484j9803
52155A967186k2394k4080k4978k5542k6334k7326k7781k7241k6222k5505k5079
52144A684704k4470k3728k3364k3426k3335k2603k1208j9235j6736j4059j1821
$$ plain form
52229 1206354 1240740 1275839 1310026 1342382 1373559 1404251 1433815 1461427 1487909 1514846 1541855
52218 1541855 1566184 1585689 1601146 1614747 1627209 1637652 1645914 1653411 1661273 1668717 1673942 1675944
52206 1675944 1674819 1670964 1664946 1657930 1651224 1645215 1639472 1634094 1630223 1628750 1629156 1630296 1631976 1635013
52192 1635013 1639886 1646105 1653029 1660582 1668825 1677509 1686723 1697705 1712245 1731047 1752958 1775927 1798556
52179 1798556 1820694 1842836 1865265 1887761 1909861 1931104 1950979 1968937 1984799 1999012 2012059
52168 2012059 2023568 2032469 2038218 2041413 2042871 2042532 2039750 2034320 2026564 2016487 2003473 1986989 1967186
52155 1967186 1944792 1920712 1895734 1870192 1843858 1816532 1788751 1761510 1735288 1709783 1684704
52144 1684704 1660234 1636506 1613142 1589716 1566381 1543778 1522570 1503335 1486599 1472540 1460719
52133A460719j0461j0005j0090j0002q971p005n178m586n136n892o271o207n505
52120A365410m073k768k944m841p089q151p609n924l830k308k323l890n826o876
52106A296958o785o086n266m546m107m126m717n810o844o859n509l809l051l111
52092A226332k945k616l299m989n808m532k369j081o62k57j65r79j653o88J033
52077A195322R20j413l083j843P32J372o12k826l120j944j216j817k746k475p38
52062A174513J265K421L113M519O693Q198Q012P086P379R647J2824J5395J6887
52049A277952J7954J9395K1287K3076K4425K5815K8013L0987L3824L5829L7159
52038A575716L8148L8558L8184L7657L7913L8898L9582L9360L8652L7825L6343
$$ plain form
52133 1460719 1450258 1440253 1430163 1420161 1411190 1404185 1399007 1394421 1389285 1383393 1377122 1370915 1365410
52120 1365410 1361337 1358569 1355625 1350784 1343695 1335544 1327935 1322011 1318181 1315873 1313550 1309660 1303834 1296958
52106 1296958 1290173 1284087 1278821 1274275 1270168 1266042 1261325 1255515 1248671 1241812 1236303 1232494 1229443 1226332
52092 1226332 1223387 1220771 1217472 1212483 1206675 1202143 1199774 1198693 1198031 1197774 1197609 1196630 1194977 1194289 1195322
52077 1195322 1196242 1194829 1191746 1189903 1190635 1192007 1191395 1188569 1185449 1183505 1182289 1180472 1177726 1175251 1174513
52062 1174513 1175778 1178199 1181312 1185831 1192524 1200722 1208734 1215820 1223199 1232846 1245670 1261065 1277952
52049 1277952 1295906 1315301 1336588 1359664 1384089 1409904 1437917 1468904 1502728 1538557 1575716
52038 1575716 1613864 1652422 1690606 1728263 1766176 1805074 1844656 1884016 1922668 1960493 1996836
52027A996836L3717L0690K8437K6652K3627J8672J3576J0662R859Q697N232J26
52015B206783m346o586o744o261o871r506j3498j7110j9190k0013k0332k0289
52003B056037j9732j8923j8138j7082j5488j3794j2352j0514p709m996l926l933
51991A909450k533J388O051R278J1053J2525J3810J4234J3972J3857J3924J3478
51979B030487J2539J1975J2229J2869J3391J3473J2555J0232P184M613K661L76
51967B144584k635n722q469j1193j3771j5435j6404j8274k1738k5198k6972k7745
51955A951028k9203l1190l2248l2428l3272l4980l5831l5133l4670l6022l8121
51944A577930l8925l8213l7191l6288l5135l4139l4236l5138l5485l4847l4181
$$ plain form
52027 1996836 2030553 2061243 2089680 2116332 2139959 2158631 2172207 2182869 2192728 2201425 2206657 2206783
52015 2206783 2202437 2195851 2189107 2182846 2175975 2166469 2152971 2135861 2116671 2096658 2076326 2056037
52003 2056037 2036305 2017382 1999244 1982162 1966674 1952880 1940528 1930014 1922305 1917309 1913383 1909450
51991 1909450 1906917 1908305 1914356 1923634 1934687 1947212 1961022 1975256 1989228 2003085 2017009 2030487
51979 2030487 2043026 2055001 2067230 2080099 2093490 2106963 2119518 2129750 2136934 2141547 2144208 2144584
51967 2144584 2141949 2136227 2127758 2116565 2102794 2087359 2070955 2052681 2030943 2005745 1978773 1951028
51955 1951028 1921825 1890635 1858387 1825959 1792687 1757707 1721876 1686743 1652073 1616051 1577930
51944 1577930 1539005 1500792 1463601 1427313 1392178 1358039 1323803 1288665 1253180 1218333 1184152
51933A184152l3979l3449l2116l0944l0920l1478l1259k9906k8233k6878k5632
51922H49358k3999k2037k0569k0604k2116k3455k2758k0216j8083j7851j8379
51911F19291j7626j5447j3414j2367j1624j0523r391q635q181q159r035j0397
51899D84492j0701r135o994o143o606o746n516l595k291k244l155m081l922k500
51885D10863j169j434k818l188j707k32q77l113m591m283l251k522j789p93n04
51870C78592j893m241n681n182l430j964j875l052m324m646m328m510n193m878
51856C23395k900r86j142k771l478k507j506j819k812l459l894m387m192k743
51842B84799j071o51j468k455l320m471n426m914k801o16L65N36Q16J012L38r04
$$ plain form
51933 1184152 1150173 1116724 1084608 1053664 1022744 991266 960007 930101 901868 874990 849358
51922 849358 825359 803322 782753 762149 740033 716578 693820 673604 655521 637670 619291
51911 619291 601665 586218 572804 560437 548813 538290 528899 520264 512083 503924 494889 484492
51899 484492 473791 464656 457662 451519 444913 438167 432651 429056 426765 424521 421366 417285 413363 410863
51885 410863 409694 408260 405442 402254 400547 400315 399438 396325 391734 387451 384200 381678 379889 379096 378592
51870 378592 376699 372458 366777 361595 358165 356201 354326 351274 346950 342304 337976 333466 328273 323395
51856 323395 320495 319509 318367 315596 312118 309611 308105 306286 303474 300015 296121 291734 287542 284799
51842 284799 283728 283077 281609 279154 275834 271363 265937 261023 258222 257606 257971 258507 259323 260335 260673 259769
51826B59769j330k86J188J632R29J49O8N22J171J949K315J209j366l361k698N
51810B61865K046K019J169J115J712J973J739J351O78l70j068p16L61J564L019
51795B78457M823O068N907M861L790K335J04j423k73K792M675L822J815N47n0
51780C18250n53l64R91K239J784Qj384j781k078k902l698l695k915j943j181n07
51764C00271M97J704K071O65j761l149k463p97M47J320K405L129K414O17n99l07
51748C06464Q22J686J758R39n41j788j837r55o04j595k933l097k028j095j240
51733B93956j748j249M52J940J746M4j591k002j508r82n17M84K126L524L621K269
51717C00565M66m23J37J281J635Q12k44m94J44J056J719J839J345O96P14J554
$$ plain form
51826 259769 258439 258153 259341 260973 261902 262051 262119 262641 263812 265761 268076 269285 267919 264558 261860 261865
51810 261865 263911 265930 267099 268214 269926 271899 273638 274989 275667 275297 274229 273513 273874 275438 278457
51795 278457 283280 289348 295255 300116 303906 306241 306345 304922 304649 307441 312116 315938 317753 318300 318250
51780 318250 317697 317333 318324 320563 322347 322355 320971 319190 317112 314210 310512 306817 303902 301959 300778 300271
51764 300271 300768 302472 304543 305208 303447 300298 297835 297038 297485 298805 301210 304339 306753 307370 306771 306464
51748 306464 307286 308972 310730 311669 311128 309340 307503 306548 305944 304349 301416 298319 296291 295196 293956
51733 293956 292208 290959 291411 293351 295097 295141 293550 291548 290040 289058 288541 289025 291151 294675 298296 300565
51717 300565 301031 300608 300745 302026 303661 304473 304229 303735 303879 304935 306654 308493 309838 310534 311248 312802
51701C12802K282K080J432J441K366L462L958L500K058L36j8K128N655P942P644
51686C59068N902M578M272M627N574P267R063R665Q631P245P371R429J1925J3247
51672D67864J3463J3693J3831J2216Q093L301L15p90j924l875n283n067m261m449
51658E07127n443n739m782l629l279l359k794j362q2m5j152k283k648k544k604
51643D65382k789k680k209j499k67J607L138K953J181l69k21J340L132M408M960
51628D78067M756M164L849L999M228M618N984Q395J0409J0606R260P551N836L732
51614E65454J384n06j687k220j654M48L133M491L756K082R13M61J59k33n88q56
51598E74537j092j388k137l925o716r454j0868j0542r085p485o441o052n977n983
$$ plain form
51701 312802 315084 317164 318596 320037 322403 325865 329823 333323 335381 335717 335699 337827 343482 351424 359068
51686 359068 364970 369548 373820 378447 384021 391288 400351 410016 418647 425892 433263 442692 454617 467864
51672 467864 481327 495020 508851 521067 529160 532461 532776 531986 530062 526187 520904 515837 511576 507127
51658 507127 501684 495945 491163 487534 484255 480896 478102 476740 476658 476613 475461 473178 470530 467986 465382
51643 465382 462593 459913 457704 456205 455938 457545 460683 463636 464817 464448 464227 465567 468699 473107 478067
51628 478067 482823 486987 490836 494835 499063 503681 509665 518060 528469 539075 548335 555886 561722 565454
51614 565454 566838 566332 564645 562425 560771 561219 564352 568843 572599 574681 575594 576055 576214 575981 575393 574537
51598 574537 573445 572057 569920 565995 559279 549825 538957 528415 519330 511845 505404 499352 493375 487392
51584D87392o282p005p585p231o002m781m123l760l466l570m183m606m213l451
51570D17134l164l267k898j835q93p28r54r37r17j693l324m748m935l988k785
51555C80068j874j230r62j458k524l125k606j732j749k669l308k926j901p26O31
51540C51909K014K681K316J711J686J932J721J396K116M141O209O861N831M029
51526C96553K627K357L290M924O629P972Q742Q788Q194P338O555N759M708L401
51512D77837J919M7k462n261p404q101p360n933m786m327m078l367k430k190k660
51497D19444k490q30J210K054J981K551M069N273N553N672N872N175L435K380
51483D61349L175M307L680J835J095J921K261P62j272j937j396j397k855m814
$$ plain form
51584 487392 481110 474105 466520 459289 453287 448506 444383 440623 437157 433587 429404 424798 420585 417134
51570 417134 413970 410703 407805 405970 405077 404349 403395 402458 401541 399848 396524 391776 386841 382853 380068
51555 380068 378194 376964 376002 374544 372020 368895 366289 364557 362808 360139 356831 353905 352004 351278 351909
51540 351909 353923 356604 358920 360631 362317 364249 365970 367366 369482 373623 379832 386693 392524 396553
51526 396553 399180 401537 404827 409751 416380 424352 433094 441882 450076 457414 463969 469728 474436 477837
51512 477837 479756 479803 477341 472080 464676 456575 449215 443282 438496 434169 430091 426724 424294 422104 419444
51497 419444 416954 416124 417334 419388 421369 423920 427989 433262 438815 444487 450359 455534 458969 461349
51483 461349 464524 468831 472511 474346 475441 477362 479623 480385 479113 477176 475780 474383 471528 466714
51469D66714n550m193j480Q05J445R42P78J533K468K943L295L930M558M938N550
51454D88676O560O844N196K259op71j106k057l171l518l323l593m591n592o016
51439D75791n983n704n072m176l600l805m459m803m457l607k559j626j269j853
51425D22818k974l471k465l65J464K101J983K244L267M163L902K782K307L469
51411D41225N499O747O562N927O178P567R196J0175J0563J1117J2124J2728J1815
51398E57423R604P701P137P074O203M767L956L637K293m02k552k423p27N47O15
51383F04853K6q60k059k974k659j134N65J704K267K280J775J425K071L473M483
51368F15236M599M311L738K268q2k112k966l310m285o066q059r698j0485j0032
$$ plain form
51469 466714 461164 456971 455491 456296 457741 458683 459461 460994 463462 466405 469700 473630 478188 483126 488676
51454 488676 495236 502080 507276 509535 509529 508758 507652 505595 502424 498906 495583 491990 487399 481807 475791
51439 475791 469808 464104 459032 454856 451256 447451 442992 438189 433732 430125 427566 425940 424671 422818
51425 422818 419844 416373 413908 413543 415007 417108 419091 421335 424602 428765 432667 435449 437756 441225
51411 441225 446724 453471 460033 465960 472138 479705 488901 499076 509639 520756 532880 545608 557423
51398 557423 567027 574728 581865 588939 595142 599909 603865 607502 609795 609393 606841 604418 603691 604238 604853
51383 604853 604879 604019 601960 598986 596327 595193 595758 597462 599729 602009 603784 605209 607280 610753 615236
51368 615236 619835 624146 627884 630152 630070 627958 624992 621682 617397 611331 603272 593574 583089 573057
51354E73057q833q065p997p546o244n388n927o328m510j343lj710m118m552l066
51339D97427j284K22J922L607M336L859K907K123J657J762K737M097M689M044
51325E34105K923K050R65j146l858n647n852n739p144j0276j3356j4480j3442
51312D59103j1599j0287r737r422r060q931r342j0130j0701j0523r433p708n987
51299C36243m972m848m977m456l207k233k528l871m985m928m000l212l065l020
51285B81941k147k77J556J934M33j935l665l971l076j733p56o55j247j695j413
51270B63294o67N7R44K368L733L822K498J155J019J704J945J232J34m96K6K060
51254B84828N151P851Q848Q246P274O750O554O498O853P616P919O905M931L267
$$ plain form
51354 573057 564224 556159 548162 540616 534372 528984 523057 516729 512219 510876 510873 509163 505045 500493 497427
51339 497427 496143 496365 498287 501894 506230 510089 512996 515119 516776 518538 521275 525372 530061 534105
51325 534105 537028 539078 540043 538897 535039 529392 523540 517801 510657 500381 487025 472545 459103
51312 459103 447504 437217 427480 418058 408998 400067 390725 380595 369894 359371 349938 342230 336243
51299 336243 331271 326423 321446 316990 313783 311550 309022 305151 300166 295238 291238 288026 284961 281941
51285 281941 279794 279517 281073 283007 283440 281505 277840 273869 270793 269060 268304 267649 266402 264707 263294
51270 263294 262627 262684 263628 265996 269729 273551 276049 277204 278223 279927 281872 283104 283238 282742 282768 284828
51254 284828 289979 297830 306678 314924 322198 328948 335502 342000 348853 356469 364388 371293 376224 379491
51240C79491K528J950M34k095m724o757q304r566j0087r223p145n025m118m843
51226C12516o601q193q548p510n933m814m366m143l822l309k335o98R69J378r
51211B54582k175l534l508k883k736l261l646l105j957j213j026l50J266K377
51197B28831J384r54k305j939j392j728j968j043L75J178J548K099K460K260K364
51182B31170L466M232K884J70j239m48N84R5j077j144j00M14m60j671j631k39
51166B35006Q07j1j983k782j380O24J293Q69P54R16K13r99p98J286L182L160K223
51149B42380K323L361L556K224O84L12Q27R23L4j021j064L4J233J639J489J464
51133B60398J484R30j88j145j608j872j962j397j63R24J162O22k86j177j515j002
$$ plain form
51240 379491 382019 383969 384403 382308 377584 370827 362523 352957 342870 333647 326502 321477 317359 312516
51226 312516 305915 297722 289174 281664 275731 270917 266551 262408 258586 255277 252942 252244 253213 254591 254582
51211 254582 252407 248873 245365 242482 239746 236485 232839 229734 227777 226564 225538 225188 226454 228831
51197 228831 230215 229261 226956 225017 223625 221897 219929 218886 219261 220439 221987 224086 226546 228806 231170
51182 231170 234636 238868 241752 241922 240683 240235 240819 240914 239837 238693 238593 239007 238547 236876 235245 235006
51166 235006 235813 235802 233819 231037 229657 230281 231574 232443 233197 234113 234326 233327 232529 233815 236997 240157 242380
51149 242380 244703 248064 251620 253844 254528 254840 255667 256590 256624 255603 254539 254573 255806 257445 258934 260398
51133 260398 261882 262812 262624 261479 259871 257999 256037 254640 254477 255401 256563 257185 256899 255722 254207 253205
51117B53205m50j138k864l741k681j036p55j742k224j328j0L86m33j819k902l004
51101B27464k035o42L24O46P96J165J492J130k19j983l075k909j975j165p22l75
51085B17917k74q74j827j980r24K13J35j072k213k204o48K058M484M762K361j014
51069B18900k999k726r83J228L345M828N054L877J851n8p61L74K674M383M418
51054B43405L521L000K781J780p4j480j603j217j494k467l280l457l265l037k656
51039B30457j888r63m19l24J29J682L683M363K941Q24J47J365L049L836L757L553
51023B56192L383K786J563K51l58q9M05L84j76o89q03p07n50j12P90J948L003
51006B67221L593L187J514n48j324j56J701K544J944N56j015k243k396j330j45
$$ plain form
51117 253205 252755 251617 248753 245012 242331 241295 240540 238798 236574 235246 235236 235622 235189 233370 230468 227464
51101 227464 225429 224787 225111 225757 226553 227718 229210 230340 230121 228138 225063 222154 220179 219014 218292 217917
51085 217917 217643 216769 214942 212962 212038 212251 212386 211314 209101 206897 206249 208307 212791 217553 219914 218900
51069 218900 215901 213175 212192 213420 216765 221593 226647 230524 232375 232317 231556 231930 234604 238987 243405
51054 243405 246926 249926 252707 254487 254413 252933 251330 250113 248619 246152 242872 239415 236150 233113 230457
51039 230457 228569 227606 227187 226863 226992 228674 232357 236720 239661 240485 240632 241997 245046 248882 252639 256192
51023 256192 259575 262361 263924 264175 263817 263728 264133 264517 264341 263652 262849 262142 261592 261480 262270 264218 267221
51006 267221 270814 274001 275515 274967 273643 273487 275188 277732 279676 280232 279217 276974 274578 273248 273103
50991B73103J9m88m99J60P31J122J971L064L141J794M01N21K112L941N033N174
50975C01300M593L740L067K714K487K218J724O26j100k399j952L5J775J964R81
50960C21773j60r64r61O06L428N425M852K633J304J870L131L929M470N116N415
50945C61867N198N377O514P491O852N044M021M792O565Q385J0258J2266J3755
50932D58385J4219J4195J4517J5210J5928J6862J8377K0209K1906K3591K5317
50921F58716K6191K5603K5017K6885L1520L6580M0074M2448M5018M7958N0986
50910A056996N4769O0130O6538P2647P7856Q2310Q6117Q9765R4577J01215J08028
50899A950948J12441J13953J14342J14870J14713J12458J07856J01412R3175Q2802
$$ plain form
50991 273103 273122 272634 272135 272295 273026 274148 276119 279183 282324 284118 284519 285040 287152 291093 296126 301300
50975 301300 305893 309633 312700 315414 317901 320119 321843 322469 321369 318970 317018 317053 318828 320792 321773
50960 321773 321613 320649 319688 320294 323722 329147 333999 336632 337936 339806 342937 346866 351336 356452 361867
50945 361867 367065 372442 378956 386447 393299 398343 402364 407156 413721 422106 432364 444630 458385
50932 458385 472604 486799 501316 516526 532454 549316 567693 587902 609808 633399 658716
50921 658716 684907 710510 735527 762412 793932 830512 870586 913034 958052 1006010 1056996
50910 1056996 1111765 1171895 1238433 1311080 1388936 1471246 1557363 1647128 1741705 1842920 1950948
50899 1950948 2063389 2177342 2291684 2406554 2521267 2633725 2741581 2842993 2936168 3018970
50889C018970P0389N6817M3355L0917J9345P632m682j6668k7130l6059m3997n0471
50877C068418n4351n5740n6053n6054n5118n2884n0432m9113m9105m9786n0839
50866B488943n2371n4554n7625o1828o6792p1405p4484p5533p4990p4143p4221
50855A750997p4797p3613o9272o3625n9856n8354n6539n2935m9111m6482m3603
50844A102810l8422l1666k5967k2475k0209j8078j5834j3360j0607q109o303m604
50832H87176k362l06L94K47J077L513O216P841Q532R110R935J0955J2069J3034
50818I67431J3684J4475J6167J8741K1366K3488K5347K7259K9160L0961L2755
50807A220834L4551L6330L8461M1447M5303M9801N5116O1385O7871P3636P9088
$$ plain form
50889 3018970 3089359 3146176 3189531 3220448 3239793 3247425 3242743 3226075 3198945 3162886 3118889 3068418
50877 3068418 3014067 2958327 2902274 2846220 2791102 2738218 2687786 2638673 2589568 2539782 2488943
50866 2488943 2436572 2382018 2324393 2262565 2195773 2124368 2049884 1974351 1899361 1825218 1750997
50855 1750997 1676200 1602587 1533315 1469690 1409834 1351480 1294941 1242006 1192895 1146413 1102810
50844 1102810 1064388 1032722 1006755 984280 964071 945993 930159 916799 906192 898083 891780 887176
50832 887176 884814 884508 884902 885149 886226 889739 895955 903796 912328 921438 931373 942328 954397 967431
50818 967431 981115 995590 1011757 1030498 1051864 1075352 1100699 1127958 1157118 1188079 1220834
50807 1220834 1255385 1291715 1330176 1371623 1416926 1466727 1521843 1583228 1651099 1724735 1803823
50796A803823Q5675R3894J02797J11767J21509J32663J44625J56568J68650J81325
50786C103296J94294K06982K19285K30862K40411K46802K50449K52484K52868
50777E197733K50296K43522K31721K13911J89483J59496J26262R1441N5589J9678
50767F779132j4281m4797p1930r5909j15546j29120j36320j38397j36664j31868
50757E764300j24835j16764j08732j01704r7055r6161r9040j04160j10125j16969
50747D688755j25252j34455j43254j50996j57998j64308j69118j71640j71789
50738C299945j69544j64555j57058j48520j40252j31724j21412j09358r7584q7619
50728A972319p8793o9896o1440n4825m9764m4173l6993k9772k4738k2232k0760
$$ plain form
50796 1803823 1889498 1983392 2086189 2197956 2319465 2452128 2596753 2753321 2921971 3103296
50786 3103296 3297590 3504572 3723857 3954719 4195130 4441932 4692381 4944865 5197733
50777 5197733 5448029 5691551 5923272 6137183 6326666 6486162 6612424 6703865 6759454 6779132
50767 6779132 6764851 6720054 6648124 6552215 6436669 6307549 6171229 6032832 5896168 5764300
50757 5764300 5639465 5522701 5413969 5312265 5215210 5119049 5020009 4915849 4805724 4688755
50747 4688755 4563503 4429048 4285794 4134798 3976800 3812492 3643374 3471734 3299945
50738 3299945 3130401 2965846 2808788 2660268 2520016 2388292 2266880 2157522 2059938 1972319
50728 1972319 1893526 1823630 1762190 1707365 1657601 1613428 1576435 1546663 1521925 1499693 1478933
50717A478933j8938j6547j4102j2254j1431j1362j1075j0035r030r165j0124j0389
50705A334481r234p596o578o001n008l443j918p26N89K591N213P741R527J0923
50691A330561J3315J7686K3199K7940L1106L3615L6289L8770M1009M4568N0827
50680A688885N8588O5190O9936P4844Q1689Q9901R7967J05584J13422J21592J29510
50669B697108J36850J43780J50313J55907J59588J60177J56922J50329J41977
50660D052951J32975J22801J10146R4506P6381N6308L4412J0977j3195l6998n9193
50649D582071p8483r3893j05155j12371j15422j14274j09714j03109r5345q6662
50639C567643p7716o9973o4549o1170n8977n7967n9000o2579o8341p5575q3468
$$ plain form
50717 1478933 1459995 1443448 1429346 1417092 1405661 1394299 1383224 1373189 1364159 1354994 1344870 1334481
50705 1334481 1325247 1317651 1311073 1305072 1300064 1296621 1294703 1293977 1294566 1297157 1302370 1310111 1319638 1330561
50691 1330561 1343876 1361562 1384761 1412701 1443807 1477422 1513711 1552481 1593490 1638058 1688885
50680 1688885 1747473 1812663 1882599 1957443 2039132 2129033 2227000 2332584 2446006 2567598 2697108
50669 2697108 2833958 2977738 3128051 3283958 3443546 3603723 3760645 3910974 4052951
50660 4052951 4185926 4308727 4418873 4513379 4589760 4646068 4680480 4691457 4678262 4641264 4582071
50649 4582071 4503588 4409695 4304540 4192169 4076747 3962473 3852759 3749650 3654305 3567643
50639 3567643 3489927 3419954 3355405 3294235 3235258 3177291 3118291 3055712 2987371 2911796 2828328
50628B828328r0737r5943r8602r9574r9869r9424r7344r3003q6580p8941p1225
50617A817086o4136n7247m9566m1296l4185k9320k5259j9751j2798o514j963K052
50605A477103O668J1188J4542J7041J9362K1088K1706K2249K4312K7780L0898
50594A693937L2454L2675L2361L2368L3798L7211M1512M4881M7054M9573N3548
50583B131372N8350O2932O7314P2068P7141Q1921Q6053Q9669R3092R6554R9821
50572C016287J01931J01839R9554R6197R2691Q8769Q3336P5478O5187N3496M1894
50561C916659L1245K1349J1925L456l480r174j4013j7225j7619j5405j2109q762
50549C886847n370k190q9O17M18o15l094p094j1935j7572k4864l3969m3743n3439
$$ plain form
50628 2828328 2737591 2641648 2543046 2443472 2343603 2244179 2146835 2053832 1967252 1888311 1817086
50617 1817086 1752950 1695703 1646137 1604841 1570656 1541336 1516077 1496326 1483528 1477014 1475051 1477103
50605 1477103 1483771 1494959 1509501 1526542 1545904 1566992 1588698 1610947 1635259 1663039 1693937
50594 1693937 1726391 1759066 1791427 1823795 1857593 1894804 1936316 1981197 2028251 2077824 2131372
50583 2131372 2189722 2252654 2319968 2392036 2469177 2551098 2637151 2726820 2819912 2916466 3016287
50572 3016287 3118218 3220057 3319611 3415808 3508499 3597268 3680604 3756082 3821269 3874765 3916659
50561 3916659 3947904 3969253 3981178 3984634 3981154 3971980 3957967 3940742 3923123 3907718 3895609 3886847
50549 3886847 3881477 3879287 3879198 3879815 3880233 3879618 3876524 3869430 3857495 3839923 3815059 3781090 3737347 3683908
50535C683908o3793p5522q7744r8587j06645j11382j13101j13045j12515j11375
50525B690199j08439j03639r8409r3414q7553q0196p2777o6934o2268n7284n1508
50514A807778m5392l9141l2990k7789k3913k0281j5736j0590n777j340K991O654
50502A594474R196J1532J4892J9108K3266K7297L1398L4779L6570L7545L9265
50491A879322M1923M4506M6628M8671N0516N1755N2806N4372N6064N7044N7475
50480B441082N7971N8178N7656N7528N9297O2522O5735O9318P5051Q2940R0927
50469C178205R8100J05734J14584J23520J31796J40541J50737J61343J70600J77858
50459D553018J83093J86003J86540J85143J81534J74426J63092J48180J30334
$$ plain form
50535 3683908 3620115 3544593 3456849 3358262 3251617 3140235 3027134 2914089 2801574 2690199
50525 2690199 2581760 2478121 2379712 2286298 2198745 2118549 2045772 1978838 1916570 1859286 1807778
50514 1807778 1762386 1723245 1690255 1662466 1638553 1618272 1602536 1591946 1586169 1584829 1587820 1594474
50502 1594474 1603670 1615202 1630094 1649202 1672468 1699765 1731163 1765942 1802512 1840057 1879322
50491 1879322 1921245 1965751 2012379 2061050 2111566 2163321 2216127 2270499 2326563 2383607 2441082
50480 2441082 2499053 2557231 2614887 2672415 2731712 2794234 2859969 2929287 3004338 3087278 3178205
50469 3178205 3276305 3382039 3496623 3620143 3751939 3892480 4043217 4204560 4375160 4553018
50459 4553018 4736111 4922114 5108654 5293797 5475331 5649757 5812849 5961029 6091363
50450F091363J09359Q5434N9741L3061N197k3307n0272p3808r3959j11388j25625
50439E905796j35792j41804j43637j40506j32179j20158j06126r0002p1045n0296
50429D774251l0390j3224R00J2029J9646K3043K1659J5102L285j3581l5284o1044
50417D716392q8115j12303j31018j45140j56722j65783j70847j71789j70123j66575
50407C237977j60363j51295j40986j31096j21573j11431j00488q9489p9067o9317
50397B082872o0185n1702m3903l6748l0037k3480j7098j1532p357m009p9M929
50385A801671R818J3377J6282K0210K5217K9352L1371L2583L4909L8076M0276
50374B093142M1099M1945M3426M4242M3390M1793M0659L9666L8036L6267L5197
$$ plain form
50450 6091363 6200722 6286156 6345897 6378958 6384155 6360848 6310576 6236768 6142809 6031421 5905796
50439 5905796 5770004 5628200 5484563 5344057 5211878 5091720 4985594 4895592 4824547 4774251
50429 4774251 4743861 4730637 4731537 4743566 4763212 4786255 4807914 4823016 4826301 4812720 4777436 4716392
50417 4716392 4628277 4515974 4384956 4239816 4083094 3917311 3746464 3574675 3404552 3237977
50407 3237977 3077614 2926319 2785333 2654237 2532664 2421233 2320745 2231256 2152189 2082872
50397 2082872 2022687 1970985 1927082 1890334 1860297 1836817 1819719 1808187 1800830 1796821 1796742 1801671
50385 1801671 1811489 1824866 1841148 1861358 1886575 1915927 1947298 1979881 2014790 2052866 2093142
50374 2093142 2134241 2176186 2219612 2263854 2307244 2349037 2389696 2429362 2467398 2503665 2538862
50363B538862L4321L2588L0096K7552K4865K1922J9904J9883K0957K1872K3740
50352B816562K8493L5075M0201M3089M6344N1519N6781O0194O2449O4717O6260
50341C371684O6085O4820O3096N9848N4180M7144L9797L1169K0209Q047l983j7007
50329C805089l2638m9503o4517p6916q8318r9067j07112j10716j10097j06248
50319B959957r9943r2115q3443p3471o1534m8492l6014k4479j3343l285M075Q556
50307B436469J1496J3184J2150P489J49q635j8520k9072l9066m7512n4315n9539
50295B224278o3141o5511o7073o7283o5482o2638o0375n8262n4214m8076m2431
50284A569792l8861l5750l1292k6557k3504k1663j9154j5952j3708j2741j1480
$$ plain form
50363 2538862 2573183 2605771 2635867 2663419 2688284 2710206 2730110 2749993 2770950 2792822 2816562
50352 2816562 2845055 2880130 2920331 2963420 3009764 3061283 3118064 3178258 3240707 3305424 3371684
50341 3371684 3437769 3502589 3565685 3625533 3679713 3726857 3766654 3797823 3818032 3826079 3822096 3805089
50329 3805089 3772451 3722948 3658431 3581515 3493197 3394130 3287018 3176302 3066205 2959957
50319 2959957 2860014 2767899 2684456 2610985 2549451 2500959 2464945 2440466 2427123 2423838 2427913 2436469
50307 2436469 2447965 2461149 2473299 2480788 2480937 2472302 2453782 2424710 2385644 2338132 2283817 2224278
50295 2224278 2161137 2095626 2028553 1961270 1895788 1833150 1772775 1714513 1660299 1612223 1569792
50284 1569792 1530931 1495181 1463889 1437332 1413828 1392165 1373011 1357059 1343351 1330610 1319130
50273A319130q981o032l439r37J689L907N638P952J1624J5682J8438J9583K0379
50260A404633K1814K3451K4371K4656K5282K6623K7666K7069K4753K2093K0559
50249A672970K0486K1103K1465K1082J9955J8219J5930J3157J0141P275M945L523
50237A850251L142L146K030j256n846r599j1453j2314j3362j4557j5540j6859
50225A757783j9096k1517k2893k3302k3815k4733k5419k5705k6033k6275k5752
50214A493243k4604k3810k3448k2257j9524j6319j4183j3504j3833j4845j6112
50203A290804j6542j5142j2281r519q078p742p278n831l846k533k418k832l055
50190A193707l313l987m549m356l956m366n269n401m708m575n636o841p301p460
$$ plain form
50273 1319130 1310149 1304117 1300678 1299741 1301430 1305337 1310975 1318927 1330551 1346233 1364671 1384254 1404633
50260 1404633 1426447 1449898 1474269 1498925 1524207 1550830 1578496 1605565 1630318 1652411 1672970
50249 1672970 1693456 1714559 1736024 1757106 1777061 1795280 1811210 1824367 1834508 1841783 1846728 1850251
50237 1850251 1853393 1856539 1858569 1857313 1851467 1841868 1830415 1818101 1804739 1790182 1774642 1757783
50225 1757783 1738687 1717170 1694277 1670975 1647160 1622427 1597008 1571303 1545270 1518995 1493243
50214 1493243 1468639 1444829 1421381 1399124 1379600 1363281 1349098 1335594 1321761 1306916 1290804
50203 1290804 1274262 1259120 1246839 1237320 1229242 1221500 1214222 1208391 1204545 1202012 1199594 1196762 1193707
50190 1193707 1190394 1186407 1181858 1177502 1173546 1169180 1163911 1158510 1153802 1149227 1143591 1136750 1129449 1121989
50176A121989p668p019m960k897k762m577o670p820p891o765m210j030J074J391
50162A060185J128J779L100L529K426J034Q18J566J855J236Q86J764L107L634
50148A088047L451L465L340J580k032n542p094p251q052j0329j2737j3335j1585
50135A021926q830p081p141p922p689n998m038l253m036n624o655o015l870j872
50121I41902j586k742l711l577k825k073j365r51j497k938m120m230l811l733
50107I02743l943l861l367k852k824l846o057q460r582r380r428j0634j1899j1995
50093H04615j1561j1936j2743j2264r997p393n960n733n837n643n039m193l347
50080G02969k538j397K70J855K383J697P22L71O71J087J409J923K831L907M778
$$ plain form
50176 1121989 1114321 1107302 1102342 1099445 1096683 1092106 1085436 1077616 1069725 1062960 1058750 1057720 1058794 1060185
50162 1060185 1061313 1063092 1066192 1069721 1072147 1073181 1073999 1075565 1077420 1078656 1079542 1081306 1084413 1088047
50148 1088047 1091498 1094963 1098303 1099883 1097851 1092309 1085215 1077964 1069912 1059583 1046846 1033511 1021926
50135 1021926 1013096 1006015 998874 990952 983263 977265 973227 969974 965938 960314 953659 947644 943774 941902
50121 941902 940316 937574 933863 930286 927461 925388 924023 923072 921575 918637 914517 910287 906476 902743
50107 902743 898800 894939 891572 888720 885896 882050 875993 867533 857951 848571 839143 828509 816610 804615
50093 804615 793054 781118 768375 756111 746114 738721 732761 727028 721191 715548 710509 706316 702969
50080 702969 700431 699034 699304 701159 703542 705239 705961 706332 707003 708090 709499 711422 714253 718160 722938
50065G22938N415O060O795P477Q106Q852R681J0413J1358J3115J5395J6709J6097
50052H58411J4558J3920J4725J6007J6716J6438J5307J4157J4136J5065J4987
50041A024427J2795J0327R819J0218Q619N198L537N473Q525R559Q428O584M580
50028A128089K789K335L254L478J797K92J618N140Q038R150R462R695R703R799
50014A204639J0588J1846J3154J5105J8192K1353K3403K5052K7451K9527K9232
50003A429542K6955K5205K5043K5147K4443K3293K1901J9818J7492J6197J5872
49992A670908J4822J2142Q716N473K400l84k467m322o848r378j0308j0116j1469
49979A659169j5388j9508k1298k1071k0511k0157j9886k0165k1051k1127j9158
$$ plain form
50065 722938 728353 734413 741208 748685 756791 765643 775324 785737 797095 810210 825605 842314 858411
50052 858411 872969 886889 901614 917621 934337 950775 966082 980239 994375 1009440 1024427
50041 1024427 1037222 1047549 1057368 1067586 1076205 1081403 1084940 1090413 1098938 1108497 1116925 1123509 1128089
50028 1128089 1130878 1133213 1136467 1139945 1141742 1142034 1143652 1148792 1156830 1165980 1175442 1185137 1194840 1204639
50014 1204639 1215227 1227073 1240227 1255332 1273524 1294877 1318280 1343332 1370783 1400310 1429542
50003 1429542 1456497 1481702 1506745 1531892 1556335 1579628 1601529 1621347 1638839 1655036 1670908
49992 1670908 1685730 1697872 1706588 1712061 1714461 1714077 1711610 1707288 1700440 1691062 1680754 1670638 1659169
49979 1659169 1643781 1624273 1602975 1581904 1561393 1541236 1521350 1501185 1480134 1459007 1439849
49968A439849j5960j3314j1859j1204j1082j1094j0340q619p059o368n538l669
49956A323743j932j860k617k010J75J886J819R67Q02J556K615L428L539K825K128
49941A337064K759M804O747P158O328N806O768R075J1485J2651J2166J0743R167
49928A442721P292M581J320j499l581n594p682q611p234m431k470k364k858k641
49914A406949k766n571j1413j7800k2336k5336k8506l2034l4511l5242l4939l4082
49902A122413l2342l0006k8400k7977k7386k5519k3365k2482k2461k1389j8544
49891H42542j5232j2972j1973j1666j1809j2523j3617j4216j3150j0096o516m808
49879G03964n951q357r591q737o519l759q70J394K067J218J93K26J275K536L514
$$ plain form
49968 1439849 1423889 1410575 1398716 1387512 1376430 1365336 1354996 1346377 1339318 1332950 1327412 1323743
49956 1323743 1321811 1319951 1317334 1315324 1315499 1317385 1319204 1320171 1320973 1322529 1325144 1328572 1332111 1334936 1337064
49941 1337064 1339823 1344627 1351374 1358532 1364860 1370666 1377434 1386509 1397994 1410645 1422811 1433554 1442721
49928 1442721 1450013 1454594 1455914 1454415 1450834 1445240 1437558 1428947 1421713 1417282 1414812 1412448 1409590 1406949
49914 1406949 1404183 1398612 1387199 1369399 1347063 1321727 1293221 1261187 1226676 1191434 1156495 1122413
49902 1122413 1090071 1060065 1031665 1003688 976302 950783 927418 904936 882475 861086 842542
49891 842542 827310 814338 802365 790699 778890 766367 752750 738534 725384 715288 708772 703964
49879 703964 698013 689656 680065 671328 664809 661050 660180 661574 663641 664859 665052 665278 666553 669089 672603
49864F72603M285N051N817O358O423N994N375M757L925K739J721J628K434L279
49850G32389L498L258L067L099L272L534L794L856L743L800M196M572M522M261
$$ plain form
49864 672603 676888 681939 687756 694114 700537 706531 711906 716663 720588 723327 725048 726676 729110 732389
49850 732389 735887 739145 742212 745311 748583 752117 755911 759767 763510 767310 771506 776078 780600 784861
$$ [...]
##END NTUPLES=NMR SPECTRUM
##END=
