
##TITLE=AC1110_Colombia_5835382_ZlHcrL0rVu
##JCAMPDX= 6.0         $$ Bruker NMR JCAMP-DX V2.0
##DATA TYPE= NMR SPECTRUM
##DATA CLASS= NTUPLES
##ORIGIN= BRUKER
##OWNER= Administrator
$$ 1.72 TOPSPIN		Version 2.1
$$ 2012-03-28 11:08:13.453 -0500  Administrator@TOPSPIN
$$ Compression mode = diff/dup
##.OBSERVE FREQUENCY= 400.13188235
##.OBSERVE NUCLEUS= ^1H
##.ACQUISITION MODE= SIMULTANEOUS (DQD)
##.ACQUISITION SCHEME= undefined
##.AVERAGES= 8
##.DIGITISER RES= 22
##SPECTROMETER/DATA SYSTEM= spect
##.PULSE SEQUENCE= zg30
##.SOLVENT NAME= COFFEE_meoh
##.SHIFT REFERENCE= INTERNAL, COFFEE_meoh, 1, 14.98061
##AUDIT TRAIL= $$ (NUMBER, WHEN, WHO, WHERE, PROCESS, VERSION, WHAT)
$$ ##TITLE= Audit trail, TOPSPIN		Version 2.1
$$ ##JCAMPDX= 5.01
$$ ##ORIGIN= Bruker BioSpin GmbH
$$ ##OWNER= Administrator
$$ $$ C:\Bruker\TOPSPIN/data/COFFEE/nmr/AC1110_Colombia_5835382_ZlHcrL0rVu/20/pdata/1/auditp.txt
$$ ##AUDIT TRAIL=  $$ (NUMBER, WHEN, WHO, WHERE, PROCESS, VERSION, WHAT)
(   1,<2012-03-28 04:40:23.343 -0500>,<Administrator>,<TOPSPIN>,<go>,<TOPSPIN 2.1>,
      <created by zg
	started at 2012-03-28 04:39:16.750 -0500,
	POWCHK enabled, PULCHK disabled,
       configuration hash MD5:
       1A 1E CE 29 27 FD 77 03 67 4E F0 E3 C4 B2 CB 90
       data hash MD5: 64K
       53 92 9C 45 35 79 1B 03 86 FC 9D 99 F6 2D 97 84>)
(   2,<2012-03-28 04:40:27.531 -0500>,<Administrator>,<TOPSPIN>,<proc1d>,<TOPSPIN 2.1>,
      <Start of raw data processing
       efp LB = 0 FT_mod = 6 PKNL = 1 PHC0 = 0 PHC1 = 0 SI = 32K 
       data hash MD5: 32K
       1A 49 AA EB 62 EB 4B 71 E1 64 00 77 6D 44 D6 AF>)
(   3,<2012-03-28 04:40:27.859 -0500>,<Administrator>,<TOPSPIN>,<proc1d>,<TOPSPIN 2.1>,
      <pk PHC0 = 215.7935 PHC1 = 0 
       data hash MD5: 32K
       29 E7 2F 20 6E D1 E2 40 23 22 C7 7F 46 D0 AC 4A>)
(   4,<2012-03-28 04:40:27.953 -0500>,<Administrator>,<TOPSPIN>,<proc1d>,<TOPSPIN 2.1>,
      <abs ABSG = 1 
       data hash MD5: 32K
       88 6D A2 A3 57 50 B0 DE 12 24 F6 8C 3E 09 78 7F>)
(   5,<2012-03-28 04:40:27.984 -0500>,<Administrator>,<TOPSPIN>,<proc1d>,<TOPSPIN 2.1>,
      <abs ABSG = 2 
       data hash MD5: 32K
       B7 6F A6 1F 9C 43 20 22 3F CB D1 A5 17 4A 67 BD>)
(   6,<2012-03-28 04:40:28.015 -0500>,<Administrator>,<TOPSPIN>,<proc1d>,<TOPSPIN 2.1>,
      <abs ABSG = 3 
       data hash MD5: 32K
       5E CF 19 61 6E ED BD A9 34 85 D4 3E 02 EF 79 D6>)
(   7,<2012-03-28 04:40:28.046 -0500>,<Administrator>,<TOPSPIN>,<proc1d>,<TOPSPIN 2.1>,
      <abs ABSG = 4 
       data hash MD5: 32K
       AC B9 26 B6 70 12 5B 4A 7B F0 DF 41 5E 0C 0E 74>)
(   8,<2012-03-28 04:40:28.078 -0500>,<Administrator>,<TOPSPIN>,<proc1d>,<TOPSPIN 2.1>,
      <abs ABSG = 5 
       data hash MD5: 32K
       B6 1A 20 37 A0 FD 32 65 7C A0 63 6E 64 B4 6A CD>)
(   9,<2012-03-28 04:40:32.968 -0500>,<Administrator>,<TOPSPIN>,<audit>,<TOPSPIN 2.1>,
      <user comment:
       ICON-NMR User ID: COFFEE
       data hash MD5: 32K
       B6 1A 20 37 A0 FD 32 65 7C A0 63 6E 64 B4 6A CD>)
$$ [...]
150 150 150 150 150 150 150 150
##$TP07= 0
##$TPNAME0= <>
##$TPNAME1= <>
##$TPNAME2= <>
##$TPNAME3= <>
##$TPNAME4= <>
##$TPNAME5= <>
##$TPNAME6= <>
##$TPNAME7= <>
##$TPOAL= (0..7)
0.5 0.5 0.5 0.5 0.5 0.5 0.5 0.5
##$TPOFFS= (0..7)
0 0 0 0 0 0 0 0
##$TUNHIN= 0
##$TUNHOUT= 0
##$TUNXOUT= 0
##$USERA1= <user>
##$USERA2= <user>
##$USERA3= <user>
##$USERA4= <user>
##$USERA5= <user>
##$V9= 5
##$VALIST= <valist>
##$VCLIST= <CCCCCCCCCCCCCCC>
##$VD= 0
##$VDLIST= <DDDDDDDDDDDDDDD>
##$VPLIST= <PPPPPPPPPPPPPPP>
##$VTLIST= <TTTTTTTTTTTTTTT>
##$WBST= 2048
##$WBSW= 25
##$XGAIN= (0..3)
0 0 0 0
##$XL= 0
##$YL= 0
##$YMAX_a= 537460
##$YMIN_a= -641105
##$ZGOPTNS= <>
##$ZL1= 120
##$ZL2= 120
##$ZL3= 120
##$ZL4= 120
##$ABSF1= 14.98061
##$ABSF2= -5.57192
##$ABSG= 5
##$ABSL= 3
##$ALPHA= 0
##$AQORDER= 0
##$ASSFAC= 0
##$ASSFACI= 0
##$ASSFACX= 0
##$ASSWID= 0
##$AUNMP= <proc_prof1d_extract_pilot.lims>
##$AXLEFT= 0
##$AXNAME= <>
##$AXNUC= <1H>
##$AXRIGHT= 0
##$AXTYPE= 0
##$AXUNIT= <>
##$AZFE= 0.1
##$AZFW= 0.1
##$BCFW= 0
##$BC_mod= 0
##$BYTORDP= 0
##$COROFFS= 0
##$CY= 15
##$DATMOD= 1
##$DC= 0
##$DFILT= <>
##$DTYPP= 0
##$F1P= 0
##$F2P= 0
##$FCOR= 0.5
##$FTSIZE= 32768
##$FT_mod= 6
##$GAMMA= 0
##$GB= 0
##$INTBC= 1
##$INTSCL= 1
##$ISEN= 128
##$LB= 0
##$LEV0= 0
##$LPBIN= 0
##$MAXI= 10000
##$MC2= 0
##$MEAN= 0
##$ME_mod= 0
##$MI= 0
##$NCOEF= 0
##$NC_proc= -8
##$NLEV= 6
##$NOISF1= 0
##$NOISF2= 0
##$NSP= 0
##$NTH_PI= 0
##$NZP= 0
##$OFFSET= 14.98061
##$PC= 1
##$PHC0= 215.7935
##$PHC1= 0
##$PH_mod= 1
##$PKNL= yes
##$PPARMOD= 0
##$PPDIAG= 0
##$PPIPTYP= 0
##$PPMPNUM= 2147483647
##$PPRESOL= 1
##$PSCAL= 4
##$PSIGN= 0
##$PYNMP= <proc.py>
##$REVERSE= no
##$SF= 400.13
##$SI= 32768
##$SIGF1= 0
##$SIGF2= 0
##$SINO= 400
##$SIOLD= 32768
##$SPECTYP= <>
##$SREGLST= <1H.CDCl3>
##$SSB= 0
##$STSI= 32768
##$STSR= 0
##$SW_p= 8223.68421052632
##$SYMM= 0
##$S_DEV= 0
##$TDeff= 65536
##$TDoff= 0
##$TI= <>
##$TILT= no
##$TM1= 0
##$TM2= 0
##$TOPLEV= 0
##$USERP1= <user>
##$USERP2= <user>
##$USERP3= <user>
##$USERP4= <user>
##$USERP5= <user>
##$WDW= 1
##$XDIM= 32768
##$YMAX_p= 467856470
##$YMIN_p= -703118
##$CURPLOT= <Network HP LaserJet P1505>
##$CURPRIN= <$Network HP LaserJet P1505>
##$DFORMAT= <normdp>
##$LAYOUT= <+/1D_H.xwp>
##$LFORMAT= <normlp>
##$PFORMAT= <normpl>
##$SURQMSG= 1
$$ End of Bruker specific parameters
$$ ---------------------------------
##NTUPLES= NMR SPECTRUM
##VAR_NAME=  FREQUENCY,     SPECTRUM/REAL,   SPECTRUM/IMAG
##SYMBOL=    X,             R,               I
##VAR_TYPE=  INDEPENDENT,   DEPENDENT,       DEPENDENT
##VAR_FORM=  AFFN,          ASDF,            ASDF
##VAR_DIM=   32768,         32768,           32768
##UNITS=     HZ,            ARBITRARY UNITS, ARBITRARY UNITS
##FACTOR=    0.250966925370066, 1,           1
##FIRST=     8223.43324360095, 5790,         -35122
##LAST=      0,             17421,           -238599
##MIN=       0,             -703118,         0
##MAX=       8223.43324360095, 467856470,    0
$$ Real data points
##PAGE= N=1
##DATA TABLE= (X++(R..R)), XYDATA
$$ [...]
$$ plain form
19476 -222883 68001 -10776 170334 -99306 -138844 -107282 -307340 -173195 -211116 -225251 98179
19464 -26240 316835 -180853 38658 -154372 -216024 -6829 14176 170610 -199821 -306006 -575305
19453 -575305 -176211 42507 -283923 -151155 -230296 50614 257048 179684 -237181 -46975
19442 -158638 -227528 -172555 -116766 -63754 -130793 -141996 145863 -142007 -98691 36518 -12634
19430 -365900 -124271 -45793 123624 9852 -316442 178320 -46843 -201164 -138175 141870
19419 56958 22074 -25032 21758 -35089 89702 27110 21415 -443450 -176655 -4070 -396953
19408 -396953 -10500 4541 -28954 -135767 -145982 55471 -279147 300273 -234232 73823 -357036
19396 -241821 32734 -334184 -77590 15531 40371 -260244 -40192 -11564 130982 -131292 129968
$$ packed form
19476b22883F8001a0776A70334i9306l9538L1562k00058J34145l7921j4135I8179
19464b6240C16835a80853C8658a54372o1652f829A4176J56434a99821j06185k69299
19453e75305a76211D2507b83923J32768p9141E0614K06434p7364b37181d6975
19442a58638o8890N4973N5789N3012o7039j1203A45863a42007M3316C6518a2634
19430c65900a24271d5793A23624I852c16442A78320d6843j54321O2989A41870
19419E6958B2074b5032B1758c5089H9702B7110n695d43450a76655d070l92883
19408c96953a0500D541b8954j06813j0215E5471b79147C00273b34232G3823c57036
19396b41821C2734c34184g7590A5531K4840b60244d0192a1564A30982a31292A29968
$$ plain form
19384 99325 103724 78257 -385253 -170276 194822 -142988 -217872 -129992 65705 -81942 -36955
19372 -141999 -178051 -213098 200816 -153279 -205071 -8974 -263433 246547 -273767 -383297
19362 -383297 -141327 -91658 90682 -60396 -129141 -144122 -134421 -81172 -127979 -32998 -198996
19351 -198996 -276728 -266972 -184571 -85433 -36038 -119654 -293206 33410 -11909 41571 -137784
19339 -437391 53848 -88153 48330 -130584 139004 -293862 -173422 -327619 49113 84243
19329 84243 -629229 93852 -72916 -68713 29267 -493353 28392 9895 -189621 343376 -75090
19317 -134261 -353380 -399235 -145063 -130873 108116 -336769 11342 -180939 -57199 -217349
19307 -217349 -199786 -202809 -17478 -27679 -70024 -201029 57232 38498 -87735 -13884 60314
$$ packed form
19384I9325M399k5467c85253a70276A94822a42988p4884Q7880F5705h1942c6955
19372a41999l6052l5047B00816a53279n1792h974k54459B46547b73767j09530
19362c83297a41327M9669I0682f0396o8745j4981R701N3249m6807c2998j65998
19351a98996p7732R756Q2401h5433c6038q3616j73552C3410a1909D1571a37784
19339d37391E3848h8153D8330a30584A39004b93862J20440j54197D9113L5130
19329H4243f29229I3852g2916M203B9267d93353B8392I895a89621C43376g5090
19317a34261k19119m5855a45063J4190A08116c36769A1342a80939e7199j60150
19307b17349J7563l023a7478j0201m2345j31005E7232j8734h7735a3884F0314
$$ plain form
19295 237548 -377624 86619 -44621 -16042 -136256 -48215 194956 38233 -178926 200914
19284 78811 -123903 -282821 144697 -5157 -207360 -274427 -245821 -301487 105038 -10609 -175076
19273 -175076 -197086 -198326 215425 -108262 -308725 -114500 -10952 -86430 18692 -119538 61677
19261 -178488 -211212 90741 -53352 -207678 367193 -120823 -47543 217761 129115 -130307
19250 -165462 25861 -89073 -68666 -52843 66723 -453171 -58129 27595 -329889 -258579 -326822
19239 -326822 113268 -74459 -118489 78091 -479798 57230 -37384 -3065 46379 -40455 -340829
19228 -340829 -6311 99259 129371 -87148 -45036 -26548 123099 22419 -42062 -201008 -205501
19217 -205501 23824 -408492 132250 340006 -299286 -354287 -249453 -123629 269161 -170051
$$ packed form
19295B37548c77624H6619d4621a6042j20214d8215A94956C8233a78926B00914
19284G8811a23903j58918A44697e157k02203o7067K8606n5666A05038a0609j64467
19273a75076k2010j240B15425a08262k00463a14500a0952p5478A8692a19538F1677
19261a78488l2724I0741e3352j54326C67193a20823d7543B17761q8646a30307
19250a65462B5861h9073K0407J5823F6723d53171e8129B7595c29889P1310o8243
19239c26822A13268g4459m4030G8091d79798E7230c7384c065D6379d0455l00374
19228c40829f311I9259L0112h7148M2112J8488A23099B2419d2062j58946m493
19217b05501B3824d08492A32250K07756b99286n5001J04834a23629B69161a70051
$$ plain form
19206 -225234 -173111 -261756 171906 -11613 -201169 270211 -17627 124375 7281 -12819 117930
19194 30222 65274 -226365 62486 460779 142917 -169675 176027 -123898 -166896 -290547
19184 -290547 -289985 18836 25275 -66491 -294651 -198619 11687 65399 -258706 231621 274083
19173 274083 44550 41123 -88123 179535 -14580 -124314 -184425 -483450 209670 -141376 -207393
19162 -207393 -160527 -220073 -140455 -418607 -73903 -155086 -213470 -34622 -189345 24242 260694
19151 260694 64895 -38771 -246483 263160 50823 173545 315733 -75547 27392 -64839 -24873
19139 -3790 -25213 196140 26799 109185 -327936 -71582 -352261 -146116 -32448 -189420 -54416
19127 -11765 56719 -27432 254516 -264808 -146078 -1835 -75310 51146 -5729 -100312 -254100
$$ packed form
19206b25234N2123q8645A71906a1613j89556B70211a7627A24375G281a2819A17930
19194C0222L5052b26365F2486L98293A42917a69675A76027a23898m2998j23651
19184b90547N62A8836O439f6491k28160R6032A1687N3712b58706B31621M2462
19173B74083D4550l427h8123A79535a4580j09734o0111k99025B09670a41376o6017
19162b07393M6866n9546P9618k78152g3903q1183n8384c4622j54723B4242K36452
19151B60694F4895c8771k07712B63160E0823J22722J42188g5547B7392f4839b4873
19139c790k1423A96140B6799Q2386c27936g1582k80679a46116c2448j56972e4416
19127a1765E6719b7432B54516b64808J18730a835p3475E1146e729r4583j53788
$$ plain form
19116 -254100 -127573 -37870 -421948 62454 145648 -68107 -601197 -171618 97529 -144406
19105 -311626 -63258 215086 -185610 -133002 166507 32574 475000 -168083 16560 -317968
19094 -147220 -254586 -56571 19226 -156516 82704 -168687 -67128 -137104 -76846 -94051 -47530
19083 -47530 14238 -106857 207063 88610 11309 45108 -51740 148999 -285971 -473751 -189071
19071 -55122 -121553 -202311 26151 -182122 -5420 -178360 -149567 38373 29147 144288 -5751 -108872
19059 -108872 25065 -213094 112483 75792 -546676 143836 82268 -210519 53365 -346806
19048 89496 14870 -102254 68757 -105613 9636 32784 17262 -270576 -132662 -111349 -86143
19037 -86143 -376342 -15916 -53109 -101743 -73853 145701 -281764 -147981 22308 -551890 57768
$$ packed form
19116b54100J26527c7870l84078F2454Q3194f8107n33090a71618I7529a44406
19105c11626f3258B15086a85610N2608A66507C2574M42426a68083A6560c17968
19094a47220j07366e6571A9226a56516H2704a68687f7128o9976O0258j7205M6521
19083d7530A4238a06857B07063H8610A1309L3799e1740A48999b85971j87780a89071
19071e5122o6431q0758B6151a82122e420j72940K8793C8373r226J15141e751j03121
19059a08872B5065b13094A12483l6691e46676A43836o1568b10519E3365c46806
19048H9496A4870a02254F8757a05613I636K3148j5522b70576a32662K1313K5206
19037h6143k90199a5916l7193m8634K7890A45701b81764J33783B2308e51890E7768
$$ plain form
19025 -144202 408829 -84673 70601 4580 -173667 -112389 -111460 -111724 27507 -213941 -230244 82439
19012 186374 -215942 23968 161767 163751 168071 -115332 49461 -141247 -237419 117784 -178411
19000 107331 -117121 106951 -21444 -176057 -150587 -176113 7209 172547 -105197 104496
18989 -241964 129263 -101695 -47629 67737 162127 -28538 46447 -68420 268393 44777 -1208
18977 -45126 -188360 55011 -217318 -206010 -344843 -291801 -119368 -169826 -354164 137190
18966 42141 19478 -122631 -239785 197597 156400 229093 271598 98703 220269 362056 168318
18954 243613 350841 -46209 215767 -151820 -186649 -210808 -2263 -204535 38959 -384986 -223569
18943 -223569 -226045 -143554 -110245 -156240 282103 -178792 109793 -238488 188054 -185481
$$ packed form
19025a44202D08829h4673G0601D580a73667O1278R29k64B7507b13941j6303H2439
19012A86374b15942B3968J37799J984M320a15332D9461a41247r6172A17784a78411
19000A07331a17121A06951b1444j54613K5470k5526G209J65338a05197A04496
18989b41964A29263a01695d7629F7737R4390b8538D6447f8420B68393D4777a208
18977d5126j43234E5011b17318J1308j38833N3042a19368n0458j84338A37190
18966D2141A9478a22631j17154A97597m1197P2693M2505I8703J21566J41787A68318
18954B43613J07228d6209B15767a51820l4829k4159b263k02272C8959c84986J61417
18943b23569k476Q2491L3309m5995B82103a78792A09793b38488A88054a85481
$$ plain form
18932 120449 -37832 86015 -27825 324178 147638 -58805 -61848 -413798 -288847 -114974 -38307
18920 -111362 -18229 129160 239908 158623 -89601 -43731 -40243 -101105 -387733 -215273 167148
18908 -262423 104143 201730 -169883 163183 -72407 223032 -111547 59841 -353852 138851
18897 95477 115740 253500 200889 350376 163672 173906 -200356 16227 98150 -48141 77888
18885 6076 59467 -159766 -46477 -177746 18433 -170047 -112284 -68424 -138440 51176 -216758
18873 177610 -210216 28980 283306 84478 242835 88794 -187965 -53697 -53549 77445 -87811
18861 -92839 -40688 -238679 -277790 422770 -51811 -196179 109127 -125566 -23818 241173
18850 -73363 121788 -6388 -346264 -146267 34370 -313250 -69200 -262719 -95692 31706 -61621
$$ packed form
18932A20449c7832H6015b7825C24178A47638e8805l043l51950J24951a14974c8307
18920a11362a8229A29160J10748q1285h9601d3731L488o0862k86628J72460A67148
18908b62423A04143R7587a69883A63183g2407B23032a11547E9841c53852A38851
18897I5477K0263J37760n2611J49487A63672J0234b00356A6227Q1923d8141G7888
18885F076N3391a59766d6477j31269A8433a70047N7763M3860p0016E1176b16758
18873A77610b10216B8980K54326H4478J58357H8794a87965e3697J48G7445h7811
18861i2839d0688j97991l9111D22770e1811j44368A09127a25566b3818B41173
18850g3363A21788f388l39876a46267C4370c13250f9200j93519i5692C1706f1621
$$ plain form
18838 -405163 -35306 -272427 28221 -254844 40745 -196249 -70121 -14160 53543 -307616 -28863
18826 30994 -258065 -211459 -271647 -424334 -61381 184081 196070 -212263 15811 -44462 -77641
18815 -77641 -31624 -352004 83509 -125842 -247582 55345 -165794 -89942 -89714 78909 468828
18804 468828 -165662 249842 49071 194260 -82165 9570 -138575 406057 276112 -132682
18793 131009 -8973 -28659 73226 256267 -134209 49029 -481846 -170807 -43273 13052 377018
18782 377018 122131 -289726 -109717 145294 -105151 -24151 -355573 -132105 77132 -499798
18771 -87068 -89535 -16243 -228129 -181819 -19085 125427 228121 -11400 -256016 -12475 -396834
18760 -396834 238687 -236449 -58199 -41319 -178046 -115402 -228154 -116947 -6045 -121949
$$ packed form
18838d05163c5306k37121B8221b54844D0745a96249g0121a4160E3543c07616b8863
18826C0994b58065M6606o0188j52687f1381A84081J1989b12263A5811d4462l3179
18815g7641c1624l20380H3509a25842j21740E5345a65794P5852K28G8909L89919
18804D68828a65662B49842D9071J45189h2165I570a38575D06057j29945a32682
18793A31009h973j9686G3226J83041a34209D9029d81846a70807d3273A3052L63966
18782C77018A22131b89726a09717A45294a05151b4151l31422a32105G7132d99798
18771h7068k467a6243k11886M6310a9085A25427J02694a1400k44616a2475l84359
18760c96834B38687b36449e8199J6880j36727O2644j12752J11207f045j15904
$$ plain form
18750 -121949 148954 -113743 131885 -95421 70006 -164647 -132288 13318 -28286 31399 -339508
18738 -472470 -6 14255 -349737 -7983 -51427 411664 109862 -91825 -29622 -214852 -40232 -199695
18726 -199695 38631 25543 185874 147508 293284 100856 -180318 -17611 150932 183753
18716 183753 -74233 138884 -11706 -889 -87074 -67025 -31321 -255385 -294801 2445 -123775
18704 129374 42664 -19804 401634 25768 -399963 91519 13219 258422 7713 -266871 -182046
18693 -182046 -78063 242415 71538 79640 -220689 272995 -6633 -358779 -40279 -86153 260471
18681 -144701 65469 -222102 133385 -128672 13787 148238 -404726 -161263 238576 173362
18671 173362 -152905 192510 -108007 -141175 -68444 -186838 169272 -157525 -90241 -104548
$$ packed form
18750a21949A48954a13743A31885i5421G0006a64647L2359A3318b8286C1399c39508
18738d72470fA4255c49737g983m3444D11664A09862i1825b9622j85230d0232j59463
18726a99695C8631j3088J60331l8366J45776A00856a80318a7611A50932L2821
18716A83753g4233A38884a1706h89q6185K0049c1321k24064l9416B445a23775
18704A29374D2664a9804D01634B5768c99963I1519A3219K45203G713b66871Q4825
18693a82046g8063B42415G1538Q102b20689B72995f633l52146d0279m5874B60471
18681a44701F5469b22102A33385a28672A3787J34451d04726a61263B38576o5214
18671A73362a52905A92510a08007l3168f8444j18394A69272a57525O7284j4307
$$ plain form
18661 -104548 262247 -177756 114254 106585 -252934 -66787 -160268 35184 133873 162542 -263010
18649 46136 -193605 -360501 -23761 137670 193307 -84222 -53327 191991 19065 155147 282482
18638 282482 -443129 -37248 58309 -304403 -55532 118836 -350725 137216 -41820 106092
18627 -66762 -296862 -70127 290547 208245 -336389 -16543 101022 -132605 -170926 -407274
18617 -407274 39583 -136691 -63216 -275901 -32273 -33015 -75548 70360 262348 -126963 -79793
18606 -79793 -5156 101904 -195297 -181668 -231681 85104 -69037 -30356 15442 332339 -190157
18594 159198 -314666 -21043 -141772 -239127 -56308 -228902 -200799 168529 -15195 -336774
18584 -336774 -206745 10599 -129030 -9811 -190440 291752 31015 -208968 -683 -75816 -6906
$$ packed form
18661a04548B62247a77756A14254p669b52934f6787r3481C5184R8689K8669b63010
18649D6136a93605j66896b3761A37670N5637h4222L0895A91991A9065J36082J27335
18638B82482d43129c7248E8309c04403e5532A18836c50725A37216d1820A06092
18627f6762k30100g0127B90547q2302c36389a6543A01022a32605l8321k36348
18617d07274C9583a36691f3216k12685c2273p42m2533G0360J91988a26963M7170
18606g9793e156A01904a95297J3629n0013H5104f9037c0356A5442L16897a90157
18594A59198c14666b1043j20729r7355e6308j72594K8103A68529a5195l21579
18584c36774J30029A0599a29030i811j80629B91752C1015b08968f83p5133f906
$$ plain form
18572 -437230 -46136 -44318 -147960 35364 70462 -41191 -279570 -6494 -41774 150991 -6195
18560 -231466 -418930 -147997 -23448 354793 -3180 -45854 122827 -174451 312029 -93957
18549 -118760 134468 -113068 -212595 -139093 -14574 179019 27478 16264 -308109 -39348 -112816
18538 -112816 -384279 171992 115413 -101055 134164 173966 -160277 144972 -92429 121323
18527 -410789 210191 194338 26547 -214817 180769 151243 -21414 -233526 132529 233076
18517 233076 -32300 14757 71019 272121 -296627 -217596 -74099 142465 -134188 -329480
18507 -329480 57985 -13666 -75668 -303749 -166399 -301708 -300088 94118 -84232 -120994 -52213
18495 -718 -94265 -175006 6938 -10561 178526 -186794 16217 100303 7534 86870 -120119 133521
$$ packed form
18572d37230d6136J818j03642C5364L5098d1191k38379f494l5280A50991f195
18560b31466j87464a47997b3448C54793c180m2674A22827a74451C12029i3957
18549a18760A34468a13068r9527P3502a4574A79019B7478j1214c08109c9348p3468
18538a12816k71463A71992n6579a01055A34164L9802a60277A44972i2429A21323
18527d10789B10191j5853B6547b14817A80769k9526b1414k12112A32529J00547
18517B33076c2300A4757N6262K01102b96627P9031g4099A42465a34188j95292
18507c29480E7985a3666o2002k28081J37350j35309J620I4118h4232l6762e2213
18495g18r3547q0741F938a0561A78526a86794A6217Q4086G534P9336a20119A33521
$$ plain form
18482 66081 -316029 -340662 -65155 -289763 -41576 -109606 139191 -114420 -135065 -12206 5972
18470 -173207 -301757 231352 18100 177465 -116336 -298749 26140 -355696 -84351 137147
18459 -113198 26689 -7559 -63825 121737 82033 -71846 -260404 110609 -148283 285862 -285423
18447 281351 77288 24354 -27377 -156551 -56842 -7997 -99359 -172855 -47000 53985 -221232
18435 13217 130999 -95241 -293067 -213009 206766 -78366 -210198 -122235 -67779 245985 86817
18423 265270 -196264 -13258 -26115 -268423 -24366 -146923 -124904 -70868 -59918 -51182 14792
18411 -189324 -152903 -149310 -187952 63933 -23025 3013 84577 -111607 -20446 44429 -208290
18399 29376 750 216896 164661 -80048 -2366 -68852 52311 289479 93501 -3448 6003 -221629
$$ packed form
18482F6081c16029k4633f5155k24608d1576o8030A39191a14420k0645a2206E972
18470a73207j28550B31352A8100J59365a16336j82413B6140c55696h4351A37147
18459a13198B6689g559n6266A21737l9704g1846j88558A10609a48283B85862b85423
18447B81351G7288B4354b7377j29174e6842g997r1362p3496d7000E3985b21232
18435A3217J17782i5241j97826Q0058B06766g8366j31832Q7963N4456B45985H6817
18423B65270a96264a3258j2857k42308b4366j22557K2019N4036J0950Q736A4792
18411a89324L6421L593l8642F3933b3025C013Q1564a11607b0446D4429b08290
18399B9376G50K16146n2235h0048b366o6486E2311K37168I3501c448F003b21629
$$ plain form
18386 -190675 336011 -12492 31211 -130849 273658 -51423 77602 -182398 -274007 -5950 -189524
18375 -189524 8241 35858 40207 86204 -114235 83977 -218788 131083 -114495 54879 -266254
18363 145081 -67806 -113889 113686 -396566 90920 132700 336487 17339 -77644 -2896 -29573
18352 -29573 43065 10654 -6464 56717 136942 30421 166213 -135899 165712 64896 113327
18341 113327 102486 61599 106924 196682 77425 -348906 -325399 -308222 -411105 315111 -228721
18329 -110334 -68608 -100050 -75896 -248810 -76011 -212540 56235 42916 7315 -125771 -66688
18318 -66688 -128444 33325 33864 302815 11579 -424363 257226 32671 170178 -84102 -142972
18307 -142972 21705 -137581 169555 -225203 43094 426194 -3836 -30024 93525 -25363 44352
$$ packed form
18386a90675C36011a2492C1211a30849B73658e1423G7602a82398r1609e950j83574
18375a89524H241K7617M349M5997a14235H3977b18788A31083a14495E4879b66254
18363A45081f7806m6083A13686c96566I0920M1780K03787A7339g7644b896k6677
18352b9573D3065A0654f464E6717Q0225C0421J35792a35899A65712F4896M8431
18341A13327j0841m0887M5325Q9758G7425c48906K3507J7177j02883C15111b28721
18329a10334M1726l1442K4154j72914g6011j36529E6235j3319G315a25771N9083
18318f6688o1756C3325N39K68951A1579d24363B57226C2671J37507h4102n8870
18307a42972B1705a37581A69555b25203D3094L83100c836k6188I3525b5363D4352
$$ plain form
18295 -207663 235797 105525 -48876 115241 31049 -198570 -305674 -566532 -26953 -37413
18285 -37413 245069 -87595 225453 25731 -21368 50545 246491 129482 -291437 -266057 20847
18273 61393 -57419 -247077 -239261 -44796 85908 -3680 110216 -408905 -244303 -241342 288602
18261 9480 83824 -217697 156385 -171457 160906 121625 199955 -307385 139561 -88921 67812
18249 73857 -62967 -193460 -58084 -194256 -868 -37638 79215 225789 34416 -3029 50695 -192715
18236 -172906 150167 -283342 -268382 -215488 500094 -145728 -48714 -29938 -320375 79295
18225 287591 -68164 -73185 313287 -424927 231812 -70921 -248779 321236 -81375 -87114 71111
18213 -155593 122379 43124 -109785 -194773 159363 -17674 130082 246233 82567 -134219
$$ packed form
18295b07663B35797A05525d8876A15241C1049a98570j07104k60858b6953j0460
18285c7413B45069h7595B25453B5731b1368E0545J95946j17009b91437K5380B0847
18273F1393e7419j89658P816d4796H5908c680A10216d08905J64602K961B88602
18261I480P4344b17697A56385a71457A60906l9281P8330c07385A39561h8921F7812
18249G3857f2967j30493e8084j36172h68l6770G9215J46574C4416c029E0695a92715
18236a72906A50167b83342J4960N2894E00094a45728d8714J8776k90437G9295
18225B87591f8164n021C13287d24927B31812g0921j77858C21236h1375n739G1111
18213a55593A22379D3124a09785q4988A59363a7674A30082J16151H2567a34219
$$ plain form
18202 209020 156924 -14058 137532 108194 -26539 -82246 -279698 35891 -78649 -189813 37807
18190 -151222 62071 -157172 -282793 -195695 -313011 -250967 77253 -40342 36042 139480 -8866
18178 -248510 139681 -257525 53402 113162 -170158 106338 114326 51461 -232164 -37127 140877
18166 23330 -134618 6722 283315 259862 -104903 -476478 -110396 -65080 -132411 -206335 -103070
18154 93398 21846 139483 -135337 -44302 91751 262213 327483 72385 -320663 -278315 -59336
18142 134136 37919 -12353 240607 116366 -153600 -162206 168197 -81707 32361 122639 -58896
18130 -51395 -81328 81175 -406848 753 -114817 72018 -37954 -158379 1887 54603 -84626 -37795
18117 -158923 -157238 185893 246741 129743 -31525 8642 -151624 163795 231734 -407473 97325
$$ packed form
18202B09020n2096a4058A37532k9338b6539n5707j97452C5891g8649j11164C7807
18190a51222F2071a57172j25621Q7098j17316O2044G7253d0342C6042J03438h866
18178b48510A39681b57525E3402N9760a70158A06338P988E1461b32164c7127A40877
18166B3330a34618F722K76593k3453a04903l71575a10396M5316o7331p3924a03070
18154I3398B1846J17637a35337d4302I1751J70462O5270G2385c20663M2348e9336
18142A34136C7919a2353B40607A16366a53600q606A68197h1707C2361R0278e8896
18130e1395k9933H1175d06848G53a14817G2018c7954j20425A887N2716h4626c7795
18117a58923J685A85893O0848j16998c1525H642a51624A63795O7939d07473I7325
$$ plain form
18105 -9637 -411106 32108 -255652 -59149 -160578 324499 -211609 240397 178910 -165876
18094 193777 -78404 -288287 -71050 112212 46816 -121423 199021 -181991 93059 -73181
18083 161318 180434 64086 127861 -155581 52629 -94570 -10554 17167 -240626 -230502 56204
18071 -231606 89928 -393860 -164484 132487 44606 -45061 348479 -43433 115847 -90464
18060 178891 -71300 -18674 -172292 291522 -197255 21959 -132508 -38435 -54567 197686
18049 -123289 -247778 57220 -18796 237199 1809 4285 -186757 -1126 155237 94649 -32565
18037 -193037 -44897 21788 87787 -245985 35203 -209507 -193709 192608 166467 -36350 98697
18025 -277426 39715 271420 -428645 -40283 279731 190522 -375850 31075 55534 35388 224322
$$ packed form
18105i637m01469C2108b55652e9149j01429C24499b11609B40397o1487a65876
18094A93777g8404k09883g1050A12212D6816a21423A99021a81991I3059g3181
18083A61318J9116F4086O3775a55581E2629i4570a0554A7167b40626J0124E6204
18071b31606H9928c93860a64484A32487D4606d5061C48479d3433A15847i0464
18060A78891g1300a8674j53618B91522a97255B1959a32508c8435j6132A97686
18049a23289j24489E7220a8796B37199A809K476a86757a126A55237o0588c2565
18037a93037d4897B1788O5999b45985C5203b09507J5798A92608k6141c6350I8697
18025b77426C9715K31705d28645d0283B79731q9209c75850C1075K4459k0146J88934
$$ plain form
18014 224322 37446 256553 -205360 -37081 238143 -76896 10223 69436 -353444 -1087 -347726
18003 -347726 -234397 -24794 -183943 16531 -35848 -211396 305801 242122 326805 165901
17993 165901 3953 -85982 -36497 64528 39961 409569 -47703 377904 -52846 -5233 -106085
17982 -106085 162507 63486 236544 -291622 -271231 121602 -124033 135770 298813 79257
17971 -452549 21114 50893 -198512 -63235 194004 100442 -332133 -475727 63002 56107 -108290
17959 326588 -29603 111831 -112097 -69747 -49173 -140718 202434 -58300 -296201 -142035
17948 -69469 -374727 67540 17862 57603 -133808 34967 -273217 -107438 -35027 -212968 -73920
17936 -72206 -246479 33639 -188188 122002 91198 112080 128042 -278522 -34828 16840 159279
$$ packed form
18014B24322C7446K19107b05360c7081B38143g6896A0223N9213c53444a087l46639
18003c47726J13329b4794j59149A6531c5848j75548C05801o3679Q4683j60904
17993A65901C953h5982c6497F4528k4567L69608d7703C77904e2846e233j00852
17982a06085A62507F3486J73058b91622K0391A21602a24033A35770J63043G9257
17971d52549B1114K9779a98512f3235A94004r3562c32133j43594F3002o895a08290
17959C26588b9603A11831a12097M2350K0574r1545B02434e8300k37901a42035
17948f9469l05258F7540A7862L9741a33808C4967b73217a07438c5027j77941g3920
17936g2206j74273C3639a88188A22002l0804K0882J5962b78522c4828A6840J42439
$$ plain form
17925 159279 -326018 106507 -295002 -232196 136500 -15169 107729 -49464 -95215 -2630 -12752
17914 -12752 -61178 -81472 358270 18541 -55551 181819 2357 -202722 96483 26910 43326
17903 43326 -17253 75698 -171677 -5915 108801 311907 70360 60606 69548 -140619 122394
17891 -372052 40978 228692 -92025 234586 19694 -284338 61968 -219505 -2034 331247 -201788
17879 183094 -19899 -6009 145426 -144272 18337 -78384 211770 84926 -108199 85577 172273
17868 172273 -231154 136620 144794 -144103 -202608 192735 -305354 -93838 -82311 -64112 -50440
17857 -50440 371401 42721 -124555 -100744 -86753 41422 -33688 -4657 7918 22448 51289 -36070
17844 -195281 59476 214532 93268 151840 31951 -273109 35320 443914 152608 -128093
$$ packed form
17925A59279c26018A06507b95002O2806A36500a5169A07729d9464m5751b630j0122
17914a2752m8426k0294C58270A8541e5551A81819B357b02722I6483B6910J6416
17903D3326a7253G5698a71677e915A08801K03106G0360r754Q942a40619A22394
17891c72052D0978J87714i2025B34586A9694b84338F1968b19505b034C31247b01788
17879A83094a9899f009A45426a44272A8337g8384B11770H4926a08199H5577Q6696
17868A72273b31154A36620Q174a44103n8505A92735c05354i3838J1527J8199J3672
17857e0440C71401D2721a24555K3811J3991D1422c3688d657G918J4530K8841c6070
17844a95281E9476J55056I3268N8572C1951b73109C5320M08594A52608a28093
$$ plain form
17833 -50853 149010 -86487 -18147 -11386 328841 137682 41421 112177 249583 94481 89886
17822 89886 102160 70218 -132317 -187419 82505 91484 -68963 -238520 -14231 -52037 255307
17810 -44003 -15039 -205059 252727 -12923 17388 -102564 -214401 -9175 -28479 96053 312818
17799 312818 -139695 117633 -164610 71751 267484 -288202 124747 344867 -136130 45486
17788 30393 149210 -50764 83442 -72147 65853 338772 72786 -37238 128207 -222064 -205776
17777 -205776 210635 17558 104980 -185456 213398 -51999 457993 -118121 -238023 -175110
17767 -175110 192371 -169222 -139935 161514 -235562 43111 -22694 -338826 -46990 58901
17756 -160533 93781 18896 -37429 190040 96314 -227237 172066 172010 3259 234596 290956
$$ packed form
17833e0853A49010h6487a8147O761C28841A37682D1421P0756J37406I4481m595
17822H9886J2274l1942a32317n5102H2505Q979f8963j69557a4231l7806B55307
17810d4003a5039j90020B52727a2923A7388a02564j11837i175j9304I6053K16765
17799C12818a39695A17633a64610G1751J95733b88202A24747K20120a36130D5486
17788C0393J18817e0764H3442g2147F5853K72919G2786c7238A28207b22064J6288
17777b05776B10635A7558Q7422a85456B13398e1999D57993a18121j19902O2913
17767a75110A92371a69222K9287A61514b35562D3111b2694l16132d6990E8901
17756a60533I3781A8896c7429A90040r3726b27237A72066n6C259K31337N6360
$$ plain form
17745 290956 37620 138900 35974 356585 142488 -210216 335513 -70274 24909 -31026
17734 84224 -131733 -237375 -444 -198839 163045 -4986 144432 30035 -92189 -195272 -37002
17722 150571 -21844 188002 -186638 -78119 107118 308644 328219 -119782 113031 265677
17712 265677 -29764 43731 289248 246396 33894 465284 -68355 -104658 130164 15819 -79152
17700 -96193 -387541 -48486 170778 331271 21120 102605 78010 43362 -9678 29729 341988
17689 341988 21190 -236609 -48801 75736 144046 283099 68515 186666 182675 73031 -180061
17677 127538 8157 159911 -13024 480910 -35036 38692 37756 -14918 290526 103123 -103482
17665 160653 262643 231610 74924 -7625 -124024 172207 49320 80558 223151 289356 83832
$$ packed form
17745B90956C7620J01280C5974L20611A42488b10216C35513g0274B4909c1026
17734H4224a31733j05642d44j98395A63045d986A44432C0035i2189j03083c7002
17722A50571b1844A88002a86638g8119A07118K01526J9575a19782A13031J52646
17712B65677b9764D3731K45517m2852C3894M31390f8355l6303A30164A5819g9152
17700i6193k91348d8486A70778J60493B1120Q1485k4595l4648i678B9729L12259
17689C41988B1190b36609d8801G5736O8310J39053F8515J18151l991G3031a80061
17677A27538H157J51754a3024D80910c5036C8692r36a4918B90526A03123a03482
17665A60653J01990l1033G4924g625j16399A72207D9320L1238J42593O6205H3832
$$ plain form
17653 85965 46554 -7131 427729 235762 22966 -112529 317353 358162 63140 150656 -24105
17641 370180 30488 -75679 -278097 18499 7527 -107448 -35530 138607 -74724 -250192 364721
17629 348745 101514 209926 200102 -33238 137415 -351858 11386 -112994 434530 225147
17619 225147 502121 -120221 148806 298866 -126425 -33893 -51997 342455 619563 161181
17608 14785 -130456 -129131 123079 68732 36271 -23778 354486 243405 193909 -2602 -18743
17597 -18743 485115 186850 226927 -43258 62193 152321 365586 235775 117636 167261 124858
17586 124858 251105 227353 375715 -80940 -148697 2384 131126 186847 -361625 127586 309464
17575 309464 -23861 184963 -67402 129971 155930 298745 20502 150557 92727 182346 63352
$$ packed form
17653H5965l9411g131D27729j91967B2966a12529C17353M0809F3140Q7516b4105
17641C70180C0488g5679k02418A8499G527a07448c5530A38607g4724j75468C64721
17629C48745A01514J08412r824c3238A37415c51858A1386a12994D34530k09383
17619B25147K76974a20221A48806J50060a26425c3893j8104C42455K77108A61181
17608A4785a30456J325A23079n4347l2461b3778C54486j11081m9496b602j6141
17597a8743D85115A86850M0077d3258F2193R0128K13265j29811A17636M9625m2403
17586A24858J26247k3752J48362h0940o7757B384J28742N5721c61625A27586J81878
17575C09464b3861A84963f7402A29971K5959J42815B0502J30055n7830Q9619F3352
$$ plain form
17563 -175243 111552 -212963 -133954 -15776 29943 209764 341798 -224650 352790 167058
17552 161472 363360 177615 -160164 -116701 -31637 318163 86537 320625 -62380 -281069
17542 -281069 -79573 -103181 212698 320596 155803 -410640 163093 133669 10994 75188
17532 75188 267558 288545 -111173 207245 261452 399927 268944 50155 115745 195737 560776
17521 560776 198893 442963 -5992 63846 305621 124786 182189 78189 566802 740445
17511 740445 414176 720482 587885 744353 897337 707952 675881 735395 556495 347630
17501 347630 766411 754070 335134 245525 550815 858105 432718 681299 1127259 770890
17491 770890 721171 817095 517302 839936 273401 461082 303013 479675 379537 173648
$$ packed form
17563a75243A11552b12963P9009a5776B9943J79821J32034b24650C52790A67058
17552A61472K01888A77615a60164M3463c1637C18163H6537K34088f2380k18689
17542b81069g9573k3608B12698J07898A55803d10640A63093k9424A0994O4194
17532G5188J92370K0987a11173B07245N4207J38475j30983E0155O5590P9992L65039
17521E60776A98893K44070e992F3846K41775A24786N7403G8189M88613J73643
17511G40445l26269L06306j32597J56468J52984j89385l2071N9514j78900k08865
17501C47630M18781j2341C35134q9609L05290L07290m25387K48581M45960l56369
17491G70890m9719R5924k99793L22634B73401J87681j58069J76662j00138A73648
$$ plain form
17480 445290 298728 549978 229885 198733 379448 284418 390887 348079 530963 131103
17469 47910 299940 252958 151668 156479 394061 355969 324609 240650 3291 175160 434679
17458 434679 -55400 241020 548531 146814 576518 169587 413950 325157 238024 145122
17448 145122 110233 356265 309675 327153 -94096 198683 258937 27907 268462 245368 397472
17437 397472 241704 290267 97386 395519 246661 497464 318711 408343 214501 244176
17427 244176 532774 824693 446569 518598 226203 286628 252439 454022 419497 206421
17416 301241 232693 486218 473813 436892 463274 393571 151374 -15774 -202588 193308 75035
17404 50629 261335 465710 41814 449823 418855 227805 52017 475496 631475 325879
$$ packed form
17480D45290j46562K51250B29885l1152J80715r5030J06469m2808J82884A31103
17469D7910K52030m6982j01290M811K37582l8092l1360q3959C291J71869K59519
17458D34679e5400B41020L07511A46814M29704A69587K44363q8793q7133r2902
17448A45122l4889K46032m6590J7478i4096A98683O0254B7907K40555k3094J52104
17437C97472j55768M8563I7386K98133j48858K50803j78753Q9632j93842K9675
17427B44176K88598K91919l78124P2029B26203O0425l4189K01583l4525B06421
17416C01241o8548K53525j2405l6921K6382o9703A51374a5774j86814A93308G5035
17404E0629K10706K04375D1814M08009l0968j91050E2017M23479J55979l05596
$$ plain form
17394 325879 118788 344005 80977 194416 -28737 86934 93195 259945 145716 77301 179674
17383 179674 33697 269247 325353 157956 103498 206600 117277 434678 357184 -55798 192204
17371 205296 14437 -103487 177018 399370 353710 263808 331906 429360 274605 9150 11552
17360 11552 301195 209793 344526 28876 372233 295856 270553 387919 283041 60439 239176
17349 239176 161080 207968 336902 62421 208586 170319 222896 203028 147930 275462 162148
17338 162148 242648 90279 390164 336393 372129 312890 247645 214799 125235 -62142 -145558
17327 -145558 158041 400738 230026 419362 166729 -876 228183 181655 130572 291126
17317 291126 82387 644278 201581 208746 277656 201654 160132 232723 441001 149794 504550
$$ packed form
17394C25879A18788K25217H0977J13439b8737H6934O261J66750j14229o8415J02373
17383A79674C3697K35550N6106A57956n4458J03102q9323L17401p7494e5798A92204
17371B05296A4437a03487A77018K22352m5660q9902O8098R7454j54755I150K402
17360A1552K89643r1402J34733B8876L43357p6377k5303J17366j04878F0439J78737
17349B39176p8096M6888J28934F2421J46165l8267N2577j9868n5098J27532j13314
17338A62148Q0500I0279K99885n3771L5736n9239o5245l2846q9564f2142q3416
17327a45558A58041K42697j70712J89336A66729h76B28183m6528n1083J60554
17317B91126H2387N61891B01581P165O8910p6002m1522P2591K08278A49794L54756
$$ plain form
17306 504550 196544 196761 440077 180340 294266 372657 -22091 623889 -5670 251124 39013
17294 158678 66809 140147 484526 344549 96606 278025 129133 -3294 455453 45593 109609
17283 109609 290868 306483 104839 174270 134273 483110 -147911 279412 249211 338519
17273 338519 179459 72381 204320 358609 510494 -106763 334527 285819 85298 252245
17263 252245 243613 261133 425588 423220 234219 327440 150171 348752 383911 544066 107478
17251 316056 361219 328505 349470 -12779 82600 214638 259428 163595 410613 38734 599193
17240 599193 416608 329227 -26450 247877 317103 441080 591653 375709 31914 422196
17230 422196 374115 374118 35142 236876 513876 616405 467386 -80057 125200 424301 298718
$$ packed form
17306E04550A96544K17K43316A80340J13926P8391b2091F23889e670B51124C9013
17294A58678F6809P3338L44379j39977I6606J81419A29133c294D55453D5593O4016
17283A09609J81259J5615A04839O9431l9997L48837a47911B79412l0201Q9308
17273C38519j59060G2381J31939J54289J51885a06763C34527m8708H5298J66947
17263B52245q632J7520J64455k368j89001R3221A50171J98581L5159J60155A07478
17251C16056M5163l2714K0965a2779H2600J32038M4790r5833K47018C8734N60459
17240E99193j82585q7381b6450B47877O9226J23977J50573k15944C1914L90282
17230D22196m8081LC5142K01734K77000J02529j49019h0057A25200K99101j25583
$$ plain form
17219 298718 323913 364168 803218 59723 208828 149928 -158066 406650 104579 203568
17209 203568 461467 548413 378154 22507 268669 271580 238452 491230 135338 530114
17199 530114 113523 405628 572131 461962 549500 268881 515659 409095 571353 449060
17189 449060 325930 368398 135184 553161 111207 231014 347009 284251 524190 442582
17179 442582 349305 416549 494257 472377 217664 318411 416193 218682 498734 642572
17169 642572 451986 304819 305783 252570 329866 470999 505623 159986 592325 619189 304217
17157 356079 375472 238234 841507 529319 678410 358423 -92836 445733 436378 534542
17147 534542 581835 343868 486199 472488 231287 278978 185402 423275 382797 477208 285376
$$ packed form
17219B98718K5195M0255M39050E9723J49105n8900a58066D06650A04579R8989
17209B03568K57899Q6946j70259B2507K46162K911l3128K52778A35338L94776
17199E30114A13523K92105J66503j10169Q7538B68881K46778j06564J62258j22293
17189D49060j23130M2468A35184M17977A11207J19807J15995o2758K39939q1608
17179D42582r3277O7244P7708k1880B17664J00747R7782j97511K80052J43838
17169F42572j90586j47167R64n3213P7296J41133L4624A59986M32339K6864C04217
17157C56079J9393j37238O03273l12188J49091l19987i2836D45733r355R8164
17147E34542M7293k37967J42331j3711B31287M7691r3576K37873m0478R4411j91832
$$ plain form
17136 285376 495111 478043 461482 489823 556895 791289 418780 586365 486962 417579 638512
17125 638512 673215 30092 345588 655276 582009 633459 704124 578419 507786 595856 488216
17114 488216 297424 420911 487823 529162 545000 512146 584247 721621 461186 520109 642108
17103 642108 467368 413339 589120 675469 443580 360291 758908 341453 657120 471965
17093 471965 587009 597951 556342 427562 444046 536063 612627 535793 837489 420774 486819
17082 486819 505337 691359 763141 645736 341573 503949 500960 381717 781780 284312
17071 526474 640889 611156 448474 386027 544757 494016 820216 569345 615806 478268
17061 478268 802071 496534 913702 580337 535911 635841 551197 858541 1003226 822122
$$ packed form
17136B85376K09735j7068j6561K8341O7072K34394l72509J67585r9403o9383K20933
17125F38512L4703C0092L15496L09688p3267N1450P0665j25705p0633Q8070j07640
17114D88216j90792J23487O6912M1339J5838l2854P2101J37374k60435N8923J21999
17103F42108j74740n4029J75781Q6349k31889q3289L98617C41453L15667j85155
17093D71965J15044J0942m1609j28780J6484R2017P6564p6834L01696m16715O6045
17082D86819J8518J86022P1782j17405l04163J62376k989j19243M00063B84312
17071E26474J14415k9733j62682o2447J58730n0741L26200k50871M6461j37538
17061D78268L23803l05537M17168l33365m4426R9930q4644L07344J44685j81104
$$ plain form
17051 822122 556785 442616 561347 660399 703218 538949 883940 671128 750912 1028530
17041 1028530 837460 556100 589800 796020 807767 621080 635880 1060772 636920 810098
17031 810098 1004995 547996 526186 650699 647300 1290424 702431 972706 628132 930993
17021 930993 680348 995069 721919 1069980 975471 877874 655805 936357 831910 452917
17011 452917 831074 710963 795590 702892 770656 820200 1004537 1023340 617023 1333617
17001 1333617 638451 1042815 768708 864908 1109262 1053330 801421 1029331 1058973 1097579
16991 1097579 1143421 993964 1032181 823564 957688 1232728 1164060 1163077 1158275 1106934 852921
16980 852921 1069537 635704 1266171 898326 1100562 1227559 1390554 1112643 1109563 1391113
$$ packed form
17051H22122k65337j14169J18731R9052M2819j64269L44991k12812P9784K77618
17041A028530j91070k81360L3700K06220J1747j86687J4800M24892m23852J73178
17031H10098J94897m56999k1810J24513l399O43124n87993K70275l44574L02861
17021I30993k50645L14721k73150L48061r4509r7597k22069K80552j04447l78993
17011D52917L78157j20111Q4627r2698O7764M9544J84337J8803m06317P16594
17001A333617F38451M04364k74107R6200K44354n5932k51909K27910K9642L8606
16991A097579M5842j49457L8217k08617J34124K75040o8668r83m802n1341k54013
16980H52921K16616m33833O30467l67845K02236J26997J62995k77911l080K81550
$$ plain form
16970 1391113 1422679 1349613 1057959 1079896 1420867 1063865 1143919 943971 1352313 1086094
16960 1086094 1145465 1635542 1373553 1457205 1155025 1132704 1070529 1123425 1442327 1722679
16950 1722679 1408146 1239249 1029608 1352384 1717829 1328842 1182432 1360558 1421102 1266344
16940 1266344 1448383 1567027 1498647 1612359 1644110 1612212 1404572 1637142 1493604 1750322
16930 1750322 1630420 1941304 2020348 1844014 1820492 1851997 1648057 1658918 1568735 1902896
16920 1902896 1834091 1575781 1808978 1799297 1666010 1493998 1704542 1723065 2112009 1640704
16910 1640704 2031704 2098185 1903996 2176384 1807453 2102218 2434950 2173171 2199400 1926662
16900 1926662 2248754 2300961 2335778 2495821 2563172 2103625 2249564 2029819 2155636 2429715
$$ packed form
16970A391113L1566p3066k91654K1937L40971l57002Q0054j99948M08342k66219
16960A086094N9371M90077k61989Q3652l02180k2321o2175N2896L18902K80352
16950A722679l14533j68897k09641L22776L65445l88987j46410J78126O0544j54758
16940A266344J82039J18644o8380J13712L1751l1898k07640K32570j43538K56718
16930A750322j19902L10884P9044j76334k3522L1505k03940J0861r0183L34161
16920A902896o8805k58310K33197r681j33287j72012K10544J8523L88944m71305
16910A640704L91000O6481j94189K72388l68931K94765L32732k61779K6229k72738
16900A926662L22092N2207L4817J60043O7351m59547J45939k19745J25817K74079
$$ plain form
16890 2429715 2239217 2310766 2455728 2598561 2386841 2536626 2654855 2462881 2620879 2863029
16880 2863029 2865385 2514974 3007746 2916237 2784697 2867848 2842265 3110685 2842974 2959299
16870 2959299 3050193 3113728 2998854 2697262 2844548 2977996 2895615 3201343 3418556 3382069
16860 3382069 3356919 3215969 3435446 3564867 3886726 3616940 3742620 3717904 3826732 3905123
16850 3905123 3949370 4186382 3846698 3950332 4126381 3790785 3943031 4388762 3995194 4306639
16840 4306639 4351094 4679869 4741161 4287014 4957133 4429311 4895537 4957529 4737245 4858251
16830 4858251 5429699 5083104 5062665 5360152 5406643 5285421 5774230 5533474 6026290 5877945
16820 5877945 5886665 6258343 6062170 6263789 6276661 6536586 6535987 6784872 6779581 6797388 7419239
$$ packed form
16890B429715j90498P1549J44962J42833k11720J49785J18229j91974J57998K42150
16880B863029K356l50411M92772r1509j31540Q3151k5583K68420k67711J16325
16870B959299R0894O3535j14874l01592J47286J33448q2381L05728K17213l6487
16860C382069k5150j40950K19477J29421L21859k69786J25680k4716J08828P8391
16850C905123M4247K37012l39684J03634J76049l35596J52246M45731l93568L11445
16840D306639M4455L28775O1292m54147O70119n27822M66226O1992k20284J21006
16830D858251N71448l46595k0439K97487M6491j21222M88809k40756M92816j48345
16820E877945Q720L71678j96173K01619J2872K59925n99K48885n291J7807O21851
$$ plain form
16809 7419239 7665033 7492204 7557132 7499979 7945117 7874336 8432300 8325697 8432584 8720375
16799 8720375 8661865 8646617 9157238 9208548 9714397 9817994 10032445 10062683 10231996 10609152
16789 10609152 10718551 11078285 11293969 11233575 11906455 12050507 12190645 12790322 13184951
16780 13184951 13299323 13703220 13908492 14092645 14875835 14946983 15646524 15458355 16221130
16771 16221130 16619429 16866946 17798723 18032870 18673402 19251629 19615321 20090505 20753253
16762 20753253 21080999 22409712 22795354 23397036 24159369 25100295 25752490 26835243 27665043
16753 27665043 28587097 29606163 30728213 31688067 32622183 34009626 34903143 36479831 37886882
16744 37886882 39578454 41019486 42503272 44550301 46212000 48167873 50365135 51949432
$$ packed form
16809G419239K45794j72829O4928n7153M45138p0781N57964j06603J06887K87791
16799H720375n8510j5248N10621N1310N05849J03597K14451L0238J69313L77156
16789A0609152J09399L59734K15684o0394O72880J44052J40138N99677L94629
16780A3184951J14372M03897K05272J84153P83190P1148O99541j88169P62775
16771A6221130L98299K47517R31777K34147O40532N78227L63692M75184O62748
16762B0753253L27746J328713L85642O01682P62333R40926O52195J082753Q29800
16753B7665043R22054J019066J122050R59854R34116J387443Q93517J576688J407051
16744C7886882J691572J441032J483786K047029J661699J955873K197262J584297
$$ plain form
16736 51949432 54230791 56960298 58994294 61488384 64195780 67198360 70240628 73085233
16728 73085233 76320101 79308403 82637361 86603579 89701150 93730309 97574998 101513480
16720 101513480 105530652 109454215 113418076 117538988 121282704 125146390 128649639 131743472
16712 131743472 134958305 137652648 140204225 142491467 144233510 145135361 146302753 146059778
16704 146059778 145602272 144805260 143142243 141670558 139900791 137146314 134232895 130952856
16696 130952856 127312489 123864541 120076547 116028682 112106504 107737413 104185933 99883684
16688 99883684 95946100 92160048 88420472 84716101 81097015 77833698 74481151 71245609
16680 71245609 68226788 65390510 62398866 59726432 57414514 55196257 52600483 50457366
$$ packed form
16736E1949432K281359K729507K033996K494090K707396L002580L042268K844605
16728G3085233L234868K988302L328958L966218L097571M029159L844689L938482
16720A01513480M017172L923563L963861M120912L743716L863686L503249L093833
16712A31743472L214833K694343K551577K287242J742043R01851J167392k42975
16704A46059778m57506p97012j663017j471685j769767k754477k913419l280039
16696A30952856l640367l447948l787994m047865l922178m369091l551480m302249
16688I9883684l937584l786052l739576l704371l619086l263317l352547l235542
16680G1245609l018821k836278k991644k672434k311918k218257k595774k143117
$$ plain form
16672 50457366 48740281 46181678 44548913 43152624 41246082 39321690 38108760 36634226
16664 36634226 35150326 33990097 32930152 31668958 30502738 29286023 28515373 27424874
16656 27424874 26611582 25436789 25021284 23876521 22806343 22037713 21830379 20959644 20116766
16647 20116766 19978227 19011059 18544284 17879904 17272623 17020535 16735310 16189026 15638355
16638 15638355 15737661 15047353 14199760 14239620 13534559 13226967 13103641 12506415 12009472 12005385
16628 12005385 11925401 11433869 11120587 10873909 10224708 10272402 10064529 10078896 9503364 9523807
16618 9523807 9151559 9028808 8892411 8527536 8633358 8204014 7980650 7810440 7811874 7714741
16608 7714741 7304796 7246726 7025282 6800897 6878584 6724492 6541591 6598679 6202590 6175374
$$ packed form
16672E0457366j717085k558603j632765j396289j906542j924392j212930j474534
16664C6634226j483900j160229j059945j261194j166220j216715p70650j090499
16656B7424874q13292j174793m15505j144763j070178p68630k07334q70735q42878
16647B0116766j38539r67168m66775o64380o07281k52088k85225n46284n50671
16638A5638355R9306o90308q47593L9860p05061l07592j23326n97226m96943m087
16628A2005385p9984m91532l13282k46678o49201M7694k07873J4367n75532K0443
16618I523807l72248j22751j36397l64875J05822m29344k23364j70210J434r7133
16608G714741m09945n8070k21444k24385P7687j54092j82901N7088l96089k7216
$$ plain form
16598 6175374 6121842 6092342 5857737 5671753 5566234 5237031 5579634 5251730 5166315 5240567
16588 5240567 5112183 4979271 4763105 4703541 4578769 4806751 4824277 4525654 4849928 4434670
16578 4434670 4403050 4335881 4219417 4197168 4037525 4267229 3887962 3937026 3766953 3918208
16568 3918208 3783146 3653286 3656106 3601546 3682108 3361385 3604602 3700652 3376486 3584081
16558 3584081 3502472 2834763 3357602 3153654 3006547 2970069 3342117 2996492 2737012 2888681
16548 2888681 3102785 3060374 3211402 2614379 2891851 2923849 2747672 2646725 2700326 2639076
16538 2639076 2549055 2203393 2662398 2482266 2308680 2610890 2484542 2279683 2445613 2394946
16528 2394946 2277911 2130440 2277467 2278272 1947188 2013401 2386267 2113333 1819745 2084092
$$ packed form
16598F175374n3532k9500k34605j85984j05519l29203L42603l27904q5415P4252
16588E240567j28384j32912k16166n9564j24772K27982J7526k98623L24274m15258
16578D434670l1620o7169j16464k2249j59643K29704l79267M9064j70073J51255
16568C918208j35062j29860K820n4560Q0562l20723K43217R6050l24166K07595
16558C584081q1609o67709N22839k03948j47107l6478L72048l45625k59480J51669
16548B888681K14104m2411J51028n97023K77472L1998j76177j00947N3601o1250
16538B639076r0021l45662M59005j80132j73586L02210j26348k04859J65930n0667
16528B394946j17035j47471J47027Q05l31084O6213L72866k72934k93588K64347
$$ plain form
16518 2084092 2072596 2094334 2197332 2390091 1649358 2206929 2005296 1914336 1718034 1833844
16508 1833844 1690123 1759432 1941554 2065016 1920293 1369668 1414263 1654546 1823155 1799888
16498 1799888 2075868 1652145 1850203 1486733 1413008 1496024 1365410 1645430 1705599 1769806
16488 1769806 1883350 1348298 1757465 1657652 1415910 1438226 1495927 1307908 1290296 1589457
16478 1589457 1231793 1456495 1146478 1147080 1353899 1160969 1531649 1019235 1234028 1267244
16468 1267244 1364352 1139720 1424671 935146 1068708 1330728 1256966 1150751 1259015 1248548
16458 1248548 1223279 1216955 931678 1253701 1312258 1160120 893814 1201504 1089507 1143429
16448 1143429 1069136 1137139 866010 835179 897094 723198 1090202 905192 1255176 1164814
$$ packed form
16518B084092j1496K1738J02998J92759p40733N57571k01633r0960j96302J15810
16508A833844j43721O9309J82122J23462j44723n50625M4595K40283J68609k3267
16498A799888K75980m23723J98058l63470p3725Q3016j30614K80020O0169O4207
16488A769806J13544n35052M09167r9813k41742K2316N7701j88019j7612K99161
16478A589457l57664K24702l10017O02K06819j92930L70680n12414K14793L3216
16468A267244R7108k24632K84951m89525J33562K62020p3762j06215J08264j0467
16458A248548k5269o324k85277L22023N8557j52138k66306L07690j11997N3922
16448A143429p4293O8003k71129l0831O1915j73896L67004j85010L49984r0362
$$ plain form
16438 1164814 1071597 869821 974781 946437 833983 784576 937043 972606 1176686 915817
16428 915817 1185908 584111 890675 985767 938380 688954 911616 691575 1161420 875872
16418 875872 788101 955958 977558 851517 774830 1021776 683305 543472 758021 912025
16408 912025 732245 952074 896294 487022 761660 1126112 530765 1035354 883651 853732
16398 853732 670169 794254 454080 667256 594232 570770 362648 512790 702053 418378
16388 418378 818189 760994 628740 863559 907630 635267 708169 592747 778326 652978
16378 652978 541172 452090 455342 610680 565299 742309 884659 730455 733463 253266 989109
16367 989109 627790 468632 887099 605144 393719 467445 350170 502863 804031 618144
$$ packed form
16438A164814r3217k01776J04960k8344j12454m9407J52467L5563K04080k60869
16428I15817K70091E84111L06564R5092m7387k49426K22662k20041M69845k85548
16418H75872q7771J67857K1600j26041p6687K46946l38471j39833K14549J54004
16408I12025j79780K19829n5780m09272K74638L64452E30765N04589j51703k9919
16398H53732j83563J24085l40174K13176p3024k3462k08122J50142J89263k83675
16388D18378L99811n7195j32254K34819M4071k72363P2902j15422J85579j25348
16378F52978j11806q9082L252J55338m5381J77010J42350j54204L008B53266P35843
16367I89109l61319j59158M18467k81955k11425P3726j17275J52693L01168j85887
$$ plain form
16357 618144 444890 465564 522633 591557 525922 747287 462991 507578 520809 564467 689433
16346 689433 792558 467169 618925 652270 298725 495158 124447 502607 775140 741932
16336 741932 433497 616082 425227 449813 342530 408965 647203 649656 741086 580705
16326 580705 475652 501445 563179 300990 539542 437619 440333 385850 748660 647991
16316 647991 140447 432779 512263 595203 447877 535761 751924 244767 594825 250584
16305 299646 351602 555787 414936 358076 312756 684958 564681 571585 584999 404336 636684
16294 636684 702755 309534 421090 578697 498939 650254 317812 336463 428059 531622
16284 531622 472293 290312 163366 514523 438605 253955 583384 526668 496948 504587 635209
$$ packed form
16357F18144j73254K0674N7069O8924o5635K21365k84296M4587J3231M3658J24966
16346F89433J03125l25389J51756L3345B98725J96433A24447L78160K72533l3208
16336G41932l08435J82585j90855K4586j07283O6435K38238K453R1430j60381
16326E80705j05053K5793O1734k62189K38552j01923K714n4483L62810j00669
16316F47991A40447K92332P9484Q2940j47326Q7884K16163B44767L50058B50584
16305B99646N1956K04185j40851n6860m5320L72202j20277O904J3414j80663K32348
16294F36684O6071C09534J11556J57607p9758J51315C17812J8651R1596J03563
16284E31622n9329j81981j26946L51157p5918j84650L29429n6716k9720P639J30622
$$ plain form
16273 635209 606548 502367 509998 277140 -4860 286573 707564 468742 524297 256653 473597
16262 473597 220692 -127404 474641 593648 448541 258145 269206 160175 133408 168960
16252 168960 501238 218116 305642 161805 233660 515391 508847 -45820 353468 4788 106266
16241 106266 198880 760380 187837 367057 89531 170286 128346 121475 270124 468826 604338
16230 604338 277903 386108 302165 454486 117533 108688 -85172 56200 -11483 213720 374327
16219 374327 333220 291987 268914 355028 100552 547426 13004 188880 313800 223460 35150
16207 168277 214946 215456 391379 197049 270807 410203 402305 284705 174151 -10155 182468
16195 496704 394071 121843 211577 206244 112227 433144 -3064 223059 286522 394764 193270
$$ packed form
16273F35209k8661j04181P631k32858d860B86573M20991k38822N5555B56653K16944
16262D73597B20692a27404D74641J19007j45107j90396J1061j09031k6767L5552
16252A68960L32278B18116Q7526j43837P1855K81731o544d5820C53468D788J01478
16241A06266R2614N61500A87837J79220H9531Q0755m1940o871J48649J98702J35512
16230F04338B77903J08205q3943J52321A17533q845h5172E6200a1483B13720J60607
16219C74327m1107m1233k3073Q6114A00552M46874A3004J75876J24920r0340C5150
16207A68277M6669N10J75923j94330P3758J39396p898j17600j10554a0155A82468
16195D96704j02633A21843Q9734n333r4017L20917c064B23059O3463J08242A93270
$$ plain form
16183 243610 -167585 267843 141108 141254 193728 326903 415007 250093 260547 81813 302064
16172 302064 236495 12556 -175834 189585 172078 104012 46361 268699 -89431 361270 200788
16161 200788 93184 176307 103746 97457 25270 310980 304390 178424 -109081 109783 245265
16150 245265 53975 253380 410747 246017 214910 84311 80050 204382 198051 152957 102162
16139 102162 145315 -81478 210852 53688 319406 287572 125490 101902 -28529 -209731 26465
16127 145444 181844 -162222 88731 168942 189436 128389 529456 -148303 103593 372006
16117 372006 36404 15390 15375 312501 217438 422875 -223582 20996 -300165 -17655 20766
16105 219020 297952 44010 57039 542209 125406 -260249 91928 -60208 97122 -66067 112784
$$ packed form
16183B43610a67585B67843j26735J46N2474J33175Q8104j64914J0454H1813K20251
16172C02064o5569A2556a75834A89585j7507o8066D6361K22338h9431C61270j60482
16161B00788I3184Q3123p2561o289B5270K85710o590j25966a09081A09783J35482
16150B45265E3975J99405J57367j64730l1107H4311m261J24332o331m5094n0795
16139A02162M3153h1478B10852E3688K65718l1834A25490k3588b8529j81202B6465
16127A45444L6400a62222H8731Q0211K0494o1047M01067a48303A03593K68413
16117C72006C6404A5390j5K97126r5063K05437b23582B0996c00165a7655B0766
16105B19020P8932D4010J3029M85170A25406b60249I1928f0208I7122f6067A12784
$$ plain form
16093 35297 48850 -10806 40594 320459 184296 43874 -256038 117476 -173079 281597
16082 133717 120780 -41851 121042 10878 2377 162669 -74682 258264 -22074 -178147 -101690
16071 -101690 -75177 180652 134273 78525 33088 -62891 147731 33447 -86315 42317 162514
16060 162514 207888 214574 139579 70403 -18295 -10583 230871 87384 -89628 -68143 80206 63305
16048 63305 17974 -51304 226334 273276 -22692 -395984 280251 318039 37411 -58598 -55663
16037 -55663 127022 156081 86828 -9052 51521 87872 -78796 438396 250627 -10157 -128044
16026 -128044 388077 -9091 -26441 138366 -65877 -265854 -102644 -134787 -207784 72030 -19603
16014 31948 30084 181332 -148418 12331 -161616 -19523 -103866 11719 173128 -9490 204806
$$ packed form
16093C5297J3553a0806D0594K79865j36163D3874b56038A17476a73079B81597
16082A33717j2937d1851A21042A0878B377J60292g4682B58264b2074j56073P6457
16071a01690K6513A80652m6379n5748C3088f2891A47731C3447h6315D2317J20197
16060A62514M5374O686p4995o9176a8295P712B30871H7384h9628K1485H0206j6901
16048F3305A7974e1304B26334M6942b2692l73292B80251L7788C7411e8598K935
16037e5663A27022K9059o9253i052E1521L6351g8796D38396j87769a0157j17887
16026a28044C88077i091j7350A38366f5877j99977a02644l2143p2997G2030a9603
16014C1948j864J51248a48418A2331a61616a9523q4343A1719J61409i490B04806
$$ plain form
16002 36880 -17607 -9126 5046 196012 -17609 153248 145214 -189796 -96705 -40479 -221705
15991 -221705 -20738 294621 27177 192604 158940 236029 136525 -215081 -306409 -252800 72498
15979 -64060 -47850 -80200 451219 37219 -135936 218165 516776 472739 681322 683435 751214
15968 751214 696709 560835 292292 70192 189702 323927 285665 302252 66480 -224654
15957 -274341 -52503 -73711 -264673 143394 73919 6361 -28931 -147032 -82983 48993 -97903
15945 117676 128179 -252906 -118724 -8383 -173545 186626 88305 188633 81119 5637 -205489
15933 -80710 24302 119773 -228757 -93574 -129928 111972 -38935 81594 18166 -230397 -210165
15922 -210165 -382672 -171089 -226528 41595 -177047 -82477 -179527 -9653 17240 -206161 146867
$$ packed form
16002C6880a7607Q481E046J90966a7609A53248q034a89796R3091d0479j81226
15991b21705b0738B94621B7177J65427l3664P7089r9504b15081r1328N3609G2498
15979f4060J6210l2350D51219C7219a35936B18165K98611m4037K08583K113O7779
15968G51214n4505j35874k68543G0192J19510J34225l8262J6587F6480b24654
15957b74341e2503k1208j90962A43394o9475F361b8931j18101O4049D8993i7903
15945A17676J0503b52906a18724h383j65162A86626H8305J00328H1119E637b05489
15933h0710B4302R5471b28757i3574l6354A11972c8935H1594A8166b30397K0232
15922b10165j72507a71089n5439D1595a77047h2477r7050i653A7240b06161A46867
$$ plain form
15910 -261060 87278 91564 45808 16194 5706 -154869 82487 -109383 66022 -194944 -114681
15899 -114681 -119898 -108409 198949 26434 -30266 213757 -178159 4479 153113 107502 -38812
15887 -41263 18115 222602 38661 -188607 -317426 256594 141680 -64740 21323 -186942
15876 -80037 -109290 -93974 155101 92161 -134353 73576 288629 -124268 8987 -149046 253275
15864 -51415 -202083 -272401 8123 194304 -325417 -114998 183926 -32103 129658 179452 258518
15853 258518 -205443 -329626 128780 -100242 297352 -112194 20263 -111696 20790 -532034
15842 -216707 -244894 -9241 -96893 15195 -96594 96533 25373 346465 -269173 59695 -16341
15830 59028 -90435 -288572 -17358 -140760 -147385 -54583 30103 -148638 -323763 21048 6707
$$ packed form
15910b61060H7278M286m5756A6194E706a54869H2487a09383F6022a94944Q0263
15899a14681n217J1489A98949B6434c0266B13757a78159D479J48634m5611c8812
15887d1263A8115K04487C8661a88607j28819B56594j14914f4740B1323a86942
15876h0037k9253J5316A55101o2940a34353G3576K15053a24268H987a49046B53275
15864e1415j50668p0318H123J86181c25417a14998A83926c2103A29658M9794P9066
15853B58518b05443j24183A28780a00242B97352a12194B0263a11696B0790e32034
15842b16707k8187i241q7652A5195i6594I6533B5373L21092b69173E9695a6341
15830E9028i0435j98137a7358j23402o625e4583C0103a48638j75125B1048F707
$$ plain form
15818 -296 -147315 -40976 -99880 -180574 -82447 -34473 108624 -85530 -98362 -239351 154608
15806 -161305 -54987 87645 -223024 -125626 114880 -33794 -207408 98380 127069 30684 -239179
15794 -8394 25004 -172889 -169722 181404 149189 -134671 -238932 195819 360524 -88420 -337816
15783 -337816 -35202 -278632 -83576 -166155 -42953 61765 -1114 25179 34942 29179 -360780 -427711
15771 -427711 -23878 -104009 -233271 -90694 -157470 -108031 -334897 274771 -16056 135786 53452
15759 203148 70418 -76388 208270 73550 -197817 441149 -5829 81923 147911 -227621 99630
15747 -218976 -189756 -50211 -27394 326026 334485 -112906 -145781 -105236 47464 -44975 104143
15735 94320 75131 86403 -221572 -299663 58438 61395 24757 94100 202088 155701 61588
$$ packed form
15818b96j47019d0976n8904q0694h2447c4473A08624h5530j2832j40989A54608
15806a61305e4987H7645b23024R7398A14880c3794j73614I8380K8689C0684b39179
15794h394B5004a72889L167A81404l2215a34671j04261A95819J64705h8420k49396
15783c37816c5202k43430h3576q2579d2953F1765a114B5179R763n763c60780o6931
15771d27711b3878q0131j29262i0694o6776M9439k26866B74771a6056A35786E3452
15759B03148G0418g6388B08270G3550a97817D41149e829H1923O5988b27621I9630
15747b18976K9220e0211K2817C26026Q459a12906l2875M0545D7464d4975A04143
15735I4320j9189J1272b21572p8091E8438K957B4757O9343J07988m6387F1588
$$ plain form
15723 120604 124241 189045 -31097 -139080 -350411 -150052 176171 -154038 -153435 98779 -20913
15711 -38517 -406439 -381737 16115 -24823 -45391 -81159 236662 146920 -121354 -50741 214868
15699 46625 -243268 -112483 56949 -15874 -245681 -76908 -60674 -52410 28322 155065 48457
15687 -203763 -114028 -85232 -215500 -253963 -120408 251135 -130382 -94293 82230 61420 88387
15676 88387 196022 -178107 157224 129471 89849 -396429 -59264 -423020 -6991 -33162 135242
15664 -68293 -80563 133820 96898 -171910 -184288 41100 -223517 -95265 -257165 -55098 -122206
15653 -122206 -42987 122737 76688 -139942 -1930 -27751 -324325 -109451 -143722 -443227 73995
15641 -51497 41631 -236619 -1782 184262 75956 153316 -93569 -186093 -203283 -60825 178728
$$ packed form
15723A20604L637O4804c1097j07983k11331a50052A76171a54038O03I8779b0913
15711c8517l67922K4702A6115b4823k0568l5768B36662q9742a21354e0741B14868
15699D6625b43268a12483E6949a5874k29807g6908J6234Q264B8322J26743D8457
15687b03763Q9735K8796j30268l8463a20408B51135a30382L6089H2230k0810K6967
15676H8387J07635a78107A57224k7753l9622c96429e9264l63756f991k6171A35242
15664f8293j2270A33820l6922a71910j2378D1100b23517i5265j61900e5098o7108
15653a22206d2987A22737m6049a39942a930k5821k96574a09451l4271k99505G3995
15641e1497D1631b36619a782A84262G5956P7360i3569r2524j7190f0825A78728
$$ plain form
15629 -150429 247748 53850 53252 -46493 -252437 70439 198742 -64402 41919 -46158 203145
15617 -53330 13677 -276360 -75524 189608 75261 -66516 -197219 173096 326953 -69695 -96662
15606 -96662 -413193 -259744 -283098 258617 -107233 36994 159896 119436 44415 49963 284999
15595 284999 112547 -27563 -74666 -3737 -137308 -229491 136888 90512 57910 -183649 -206442
15584 -206442 111657 -214056 -299811 77807 443107 123625 -213985 -326297 -16168 -152360
15574 -152360 141710 43175 -111549 -77780 -68037 -12322 -256220 -264380 226442 -55790 -198631
15563 -198631 105708 -336104 -106478 56080 -414345 -50332 173448 107343 -144292 -281443
15553 -281443 214533 -56335 13052 -145663 -158228 -131093 -61631 -6096 -41641 14287 -95653
$$ packed form
15629a50429B47748E3850n98d6493k05944G0439J28303f4402D1919d6158B03145
15617e3330A3677b76360g5524A89608G5261f6516j30703A73096J53857f9695k6967
15606i6662l16531J53449k3354B58617a07233C6994J22902m0460D4415N548K35036
15595B84999A12547b7563m7103c737j33571r2183A36888m6376l2602a83649k2793
15584b06442A11657b14056q5755G7807L65300A23625b13985j12312a6168j36192
15574a52360A41710D3175a11549L3769R743a2322k43898q160B26442e5790j42841
15563a98631A05708c36104a06478E6080d14345e0332A73448o6105a44292j37151
15553b81443B14533e6335A3052a45663j2565K7135f1631f096l5545A4287i5653
$$ plain form
15541 327071 -258976 187299 40473 64288 159434 8122 -62099 6773 -86404 382138 455612
15530 455612 -15857 154828 -26678 196015 14483 -233273 -121193 -77319 -113964 32484 26759
15519 26759 295586 -164314 -108804 122640 -189762 -64051 43437 91682 -172071 76954 -38355
15507 -63919 64802 16261 171636 -26098 -138853 224069 110423 -192540 -120479 232425
15496 13022 530746 179519 -112608 194470 -140818 232227 270948 272678 -117606 169372
15485 -13877 172300 -75245 -186666 106017 449210 -46422 13543 287234 98099 49257 489741
15474 489741 218550 -135761 106656 -156970 -215907 -270766 384894 -174254 -11214 109072
15463 -100954 -70604 195020 408846 410254 434761 508101 592176 613626 204412 345925 88131
$$ packed form
15541C27071b58976A87299D0473K3815R5146H122f2099F773h6404C82138P3474
15530D55612a5857A54828b6678A96015A4483b33273J12080M3874l6645C2484n725
15519B6759K68827a64314N5510A22640a89762f4051D3437M8245a72071G6954c8355
15507f3919F4802A6261J55375b6098j12755B24069A10423a92540P2061B32425
15496A3022N17724A79519a12608A94470a40818B32227L8721J730a17606A69372
15485a3877A72300g5245j11421A06017L43193d6422A3543K73691I8099m8842M40484
15474D89741B18550a35761A06656a56970n8937n4859C84894a74254a1214A09072
15463a00954L0350A95020K13826J408K4507P3340Q4075K1450B04412J41513H8131
$$ plain form
15451 176950 -249065 244765 -117577 35481 -103209 192493 83511 -31297 41851 180201
15441 180201 -234705 135525 -6265 -286718 77761 -173413 -74077 46756 134597 -123326 -55250
15429 -60559 149186 489606 353479 772746 377105 755530 780075 616338 416881 -76228
15418 -317535 -115013 -49920 74480 5090 -169915 -316353 -217215 172429 -82873 444400 -84492
15406 -225054 225992 -22229 193341 -267108 370138 64658 -398649 -176603 7460 34636
15396 34636 -133476 38141 82680 135231 47740 -60225 313568 40676 -16968 106226 -204147
15384 98878 -49595 -126446 -131237 -298281 -15155 -189525 218383 196079 -113463 -107577 -193968
15373 -193968 -9699 118140 6583 -86048 201923 118578 97490 53187 135828 -2443 -335207
$$ packed form
15451A76950b49065B44765a17577C5481a03209A92493H3511c1297D1851J38350
15441A80201b34705A35525f265k80453G7761a73413g4077D6756Q7841a23326e5250
15429f0559A49186L40420j36127M19267C77105L78425K4545j63737j99457g6228
15418c17535a15013d9920G4480E090a69915j46438R9138A72429h2873D44400h4492
15406b25054B25992b2229A93341b67108C70138F4658c98649a76603G460K7176
15396C4636a33476C8141M4539N2551D7740f0225C13568D0676a6968A06226b04147
15384I8878d9595p6851m791j67044a5155j74370B18383k2304a13463N886q6391
15373a93968i699A18140F583h6048B01923q3345k1088m4303Q2641b443l32764
$$ plain form
15362 -335207 52911 532897 354155 310381 168717 56530 235331 306705 229833 -158686
15351 159657 23340 -140193 77400 -187100 332955 228975 -142733 260195 255266 86622
15340 114307 -68943 -243715 568 296194 -63026 308484 180595 263217 38683 306420 -43224
15328 108531 117442 488391 196544 266015 458714 5084 -245870 31143 483073 -82006 23109
15316 108158 282632 224176 171791 125699 33938 49913 26446 -399795 160663 -104374 309878
15304 130357 178858 324709 238568 308844 -79162 191907 221618 78723 192145 336556 84365
15292 645 70681 417061 -155992 92541 224944 311884 60259 -97902 96002 172391 -418224
15280 -35646 -39702 -134527 379730 297661 282093 379598 357776 192370 -51179 -171889 36046
$$ packed form
15362c35207E2911M79986j78742m3774j41664E6530J78801P1374p6872a58686
15351A59657B3340a40193G7400a87100C32955j03980a42733B60195m929H6622
15340A14307f8943j74772E68K95626f3026C08484j27889Q2622C8683K67737d3224
15328A08531Q911L70949A96544O9471J92699E084b45870C1143M51930h2006B3109
15316A08158J74474n8456n2385m6092C3938J5975k3467c99795A60663a04374C09878
15304A30357M8501J45851q6141P0276g9162A91907K9711G8723J13422J44411H4365
15292F45P0036L46380a55992I2541J32403Q6940F0259i7902I6002P6389d18224
15280c5646m056r4825C79730q2069j5568R7505k1822j65406e1179j20710C6046
$$ plain form
15268 31960 -25231 -295125 -129339 -38681 172148 227596 -298811 158526 106356 298929
15258 298929 154747 77976 286148 -324595 -193865 108356 390270 269487 82899 7804
15247 -2542 9821 253902 188006 481280 5651 56277 191452 -240675 56424 96578 16293
15235 231273 382158 398699 52577 179772 423838 674061 784012 1416965 1359873 1371965
15225 1371965 1379823 806111 466385 484312 -213053 -103948 -188024 394145 33406 -47792
15214 214130 -154652 170754 -55672 -82308 152791 429573 -55128 49444 -171239 286493
15203 17203 25707 -119066 96091 323345 -76163 -257929 -56350 170585 -40529 43158 -175841
15191 67496 -88861 153303 229615 52902 -120976 56735 -114834 -39341 141275 220304 119257
$$ packed form
15268C1960b5231k69894a29339c8681A72148N5448b98811A58526n2170J92573
15258B98929j44182p6771K08172c24595J30730A08356K81914j20783H2899G804
15247b542I821K44081o5896K93274E651N0626J35175b40675E6424M0154A6293
15235B31273J50885J6541E2577J27195K44066K50223J09951O32953n7092J2092
15225A371965P858n73712l39726J7927b13053a03948q4076C94145C3406d7792
15214B14130a54652A70754e5672k6636A52791K76782e5128D9444a71239B86493
15203A7203Q504a19066I6091K27254g6163j81766e6350A70585d0529D3158a75841
15191F7496h8861A53303P6312E2902a20976E6735a14834c9341A41275P9029j01047
$$ plain form
15180 119257 67048 -13027 -9097 361942 421943 -18797 217235 329940 287886 -157179 241390
15168 -18239 90132 -236379 262368 -34342 256667 -53356 74986 174207 421919 -35474 -68134
15157 -68134 -77085 6391 -18688 -41212 17948 96906 111995 -180438 202794 116399 -134195
15145 163391 163229 74651 280052 128606 21951 187371 286063 165520 -85664 114530 80253
15134 80253 -24174 178919 215381 333916 38386 80851 193957 269823 148616 -172471 283027
15122 72411 -28715 32183 266489 -12837 369678 106570 12823 353639 150470 -169185
15111 196555 606602 346347 49015 324075 300106 182394 257234 456446 467496 414930
15101 414930 291761 149336 196481 -54134 148672 295804 306990 90754 -68280 363035
$$ packed form
15180A19257n2209a3027L930C61942O0001a8797B17235J12705m2054a57179B41390
15168a8239I0132b36379B62368c4342B56667e3356G4986R9221K47712c5474l2660
15157f8134q951F391a8688k2524A7948P8958J5089a80438B02794q6395a34195
15145A63391j62G4651K05401A28606B1951J65420R8692j20543h5664A14530l4277
15134H0253b4174A78919L6462J18535C8386M2465J13106P5866j21207a72471B83027
15122G2411b8715C2183K34306a2837C69678A06570A2823L40816A50470a69185
15111A96555M10047k60255D9015K75060k3969j17712P4840J99212J1050n2566
15101D14930j23169j42425M7145e4134A48672J47132J1186I0754f8280C63035
$$ plain form
15090 173142 60972 -34944 304020 -27724 200777 -63880 392391 89491 577834 121318
15079 -181151 285458 -11084 111400 -70356 129093 150245 112226 242550 309757 123936
15068 398834 78281 313160 86997 301287 183416 100860 -7444 301902 113463 7899 233104
15057 233104 -6589 -155226 390058 -9424 -33223 154368 329300 152001 363541 -1766 64600
15045 89123 278967 -11794 233366 167250 200850 53921 249893 236350 328351 163638 400881
15034 400881 219555 576200 353553 315044 535256 302634 3074 553339 172238 342351
15024 342351 321380 307594 249607 611843 362073 294603 500080 180890 670807 496932
15014 496932 781186 508807 707015 418284 120621 726294 131703 22756 582312 442570
$$ packed form
15090A73142F0972c4944C04020b7724B00777f3880C92391H9491M88343A21318
15079a81151B85458a1084A11400g0356A29093K1152l8019J30324O7207A23936
15068C98834G8281K34879H6997K14290j17871q2556g444C01902A13463G899K25205
15057B33104f589j48637C90058i424k3799A54368J74932A52001K11540a766F4600
15045H9123J89844a1794B33366o6116L3600E3921J95972j3543R2001A63638K37243
15034D00881j81326L56645k22647l8509K20212k32622C074N50265A72238J70113
15024C42351k0971j3786n7987L62236k49770o7470K05477A80890M89917j73875
15014D96932K84254k72379J98208k88731A20621O05673A31703B2756N59556j39742
$$ plain form
15004 442570 430487 507595 538912 266104 319661 486248 393083 507911 97696 290470 248721
14993 248721 523247 500595 485448 555516 381691 310518 372041 -11825 144316 478240 589909
14982 589909 476170 750872 353178 370144 314981 173081 369017 357610 305661 549933
14972 549933 588430 455604 364310 593872 618587 660427 498113 752448 746581 810171 760490
14961 760490 654694 444920 381515 577667 549162 723792 506083 272063 507109 407380
14951 407380 370709 134203 188265 734446 292479 555462 291750 279368 480390 10829
14940 256782 403921 348032 292229 349267 316819 320263 49538 200677 252634 402479 423668
14929 423668 361737 705629 384189 368947 622970 702205 556471 698311 583248 468587
$$ packed form
15004D42570j2083P7108L1317B66104N3557J66587r3165J14828I7696J92774m1749
14993B48721K74526k2652j5147P0068j73825p1173O1523a1825A44316L33924J11669
14982E89909j13739K74702C53178J6966n5163j41900J95936j1407n1949K44272
14972E49933L8497j32826r1294K29562K4715M1840j62314K54335n867O3590m9681
14961G60490j05796k09774o3405J96152k8505J74630k17709k34020K35046r9729
14951D07380l6671A34203N4062N46181B92479K62983k63712j2382K01022A0829
14940B56782J47139n5889n5803N7038l2448L444D9538J51139N1957J49845K1189
14929D23668o1931L43892l21440j5242K54023P9235j45734J41840j15063j14661
$$ plain form
14919 468587 436416 371939 629156 703406 763611 983041 1014322 968742 1269405 1094005 1429614
14908 1429614 1731458 1450977 1361445 1312673 1285414 1442762 1666648 1496640 1903521 1859174
14898 1859174 1606411 1361906 1329674 1153984 964688 746638 740614 447253 522026 581306
14888 581306 491191 502125 455051 378121 240321 546385 318947 283979 97522 367153 332396
14877 332396 425136 458160 328460 466676 573253 767038 674841 389129 712270 757227
14867 757227 662790 600948 1140638 577557 424570 543914 1082506 768699 661052 557989
14857 557989 628153 508304 589185 703423 563124 452308 654043 527333 676209 934675
14847 934675 648083 488196 541344 603559 299590 519849 426112 553439 561358 540037 218100
$$ packed form
14919D68587l2171o4477K57217P4250O0205K19430L1281m5580L00663j75400L35609
14908A429614L01844k80481q9532m8772k7259J57348K23886j70008M06881m4347
14898A859174k52763k44505l2232j75690j89296k18050o024k93361P4773N9280
14888E81306r0115J0934m7074p6930j37800L06064k27438l4968I7522K69631l4757
14877C32396R2740L3024j29700J38216J06577J93785r2197k85712L23141M4957
14867G57227r4437o1842N39690n63081j52987J19344N38592l13807j07647j03063
14857E57989P0164j19849Q0881J14238j40299j10816K01735j26710J48876K58466
14847I34675k86592j59887N3148O2215B99590K20259r3737J27327P919k1321B18100
$$ plain form
14835 272338 843075 330160 350606 593731 529174 366448 511157 1225571 951490 823805
14825 823805 672029 742187 950644 810392 923411 1065893 794044 760178 649107 439994
14815 439994 470769 557324 296416 277468 360563 638390 598454 298763 528719 869495
14805 869495 721842 689763 627077 554963 899081 704133 653203 610138 381289 781992
14795 781992 614225 645496 702433 673447 752834 793598 817407 838773 815661 994410 597107
14784 597107 491591 838991 747929 698684 678206 617069 766788 670898 427638 342782 616503
14773 616503 902204 656825 745984 706277 718258 483338 725264 812156 641950 478025
14763 478025 1091105 643418 822108 707615 828266 961567 878675 670500 724685 812864
$$ packed form
14835B72338N70737C30160K0446K43125o4557j62726J44709P14414k74081j27685
14825H23805j51776P0158K08457j40252J13019J42482k71849l3866j11071k09113
14815D39994L0775Q6555k60908j8948Q3095K77827l9936B98763K29956L40776
14805H69495j47653l2079o2686p2114L44118j94948n0930m3065k28849M00703
14795G81992j67767L1271N6937k8986P9387M0764K3809K1366k3112J78749l97303
14784E97107j05516L47400r1062m9245k0478o1137J49719r5890k43260q4856K73721
14773F16503K85701k45379Q9159l9707J1981k34920K41926Q6892j70206j63925
14763D78025O13080m47687J78690j14493J20651J33301q2892k08175N4185Q8179
$$ plain form
14753 812864 387023 619018 706913 855942 490987 765673 722256 610052 496840 492735
14743 492735 649058 992569 741872 687740 511888 592603 611353 680550 608265 356188
14733 356188 534556 809274 695451 858002 642744 818665 652339 974123 408884 629833
14723 629833 663597 657552 870058 1065568 344611 773506 907447 1072258 876811 878884
14713 878884 982198 1193648 1474547 1547145 1586677 1628158 1522969 1491908 920150 1159116
14703 1159116 1055867 860473 955887 745898 893671 1302921 771675 918909 1097401 927510
14693 927510 1169241 1082549 772641 830780 1363270 1116518 1174890 1399324 1492174 1637108
14683 1637108 1562517 1827318 1511335 1633455 1442996 1567446 1203177 1064719 1163296 844859
$$ packed form
14753H12864C87023K31995Q7895J49029l64955K74686m3417j12204j13212m105
14743D92735J56323L43511k50697n4132j75852Q0715J8750O9197p2285k52077
14733C56188J78368K74718j13823J62551k15258J75921j66326L21784D08884K20949
14723F29833L3764o045K12506J95510C44611M28895J33941J64811j95447K073
14713H78884J03314K11450K80899P2598L9532M1481j05189l1061n71758K38966
14703A159116j03249j95394R5414k09989J47773M09250n31246J47234J78492j69891
14693I27510K41731q6692l09908N8139N32490k46752N8372K24434R2850J44934
14683A637108p4591K64801l15983J22120j90459J24450l64269j38458R8577l18437
$$ plain form
14673 844859 884372 987701 705528 903495 951490 1242220 1162005 982957 1128546 1034022
14663 1034022 954892 822773 1013631 857501 1246843 1157968 1045860 1059535 917369 1112623
14653 1112623 1041738 1069173 993692 1216910 1089779 1106324 1006761 905392 931823 1167297
14643 1167297 1112131 1072416 1385046 919595 990642 1139266 1386187 1097045 1180301 986471
14633 986471 1052408 1549956 1424006 1386715 1285560 1092108 1220333 1301073 1255836 1197828
14623 1197828 1188603 1057017 1208214 1213111 1315069 1091134 1319585 1435909 1257670 1061176
14613 1061176 1520735 1301916 1307020 1650575 1379685 1345442 1721737 1647462 1694783 1445645
14603 1445645 1520997 1425668 1156197 1135917 1375427 1670554 1530192 1530824 1525284 1933603 2006214
$$ packed form
14673H44859L9513J03329k82173J97967M7995K90730q0215j79048J45589r4524
14663A034022p9130j32119J90858j56130L89342q8875j12108J3675j42166J95254
14653A112623p0885K7435p5481K23218j27131J6545r9563j01369K6431K35474
14643A167297n5166l9715L12630m65451P1047J48624K46921k89142Q3256j93830
14633I86471O5937M97548j25950l7291j01155j93452J28225Q0740m5237n8008
14623A197828r225j31586J51197M897J01958k23935K28451J16324j78239j96494
14613A061176M59559k18819N104L43555k70890l4243L76295p4275M7321k49138
14603A445645P5352r5329k69471k0280K39510K95127j40362O32n540M08319P2611
$$ plain form
14592 2006214 1196988 1800216 1881962 1446558 1255027 1562016 1768733 1552794 1616414 1803437
14582 1803437 1877361 1756868 1693219 1634584 1511109 1386223 1937979 2063814 1951487 1992697
14572 1992697 1634477 1671035 2117285 1735232 1889576 1853178 1674658 2121507 1790226 1800226
14562 1800226 1829911 2297353 1948589 2002353 2145339 2403606 2120465 2217245 2274978 2158058
14552 2158058 2461859 2124733 2597612 2251174 2692092 2552064 2595870 2868647 3258847 3099544
14542 3099544 3395430 3818155 3942754 4287901 4819008 5486663 6366942 7758977 10666678
14533 10666678 14090798 20178278 30592466 33208644 19828676 11004178 7035719 4985000
14525 4985000 4576753 5263209 4824804 3628724 2621165 2572946 2523022 2334252 2230103
$$ packed form
14592B006214q09226O03228Q1746m35404j91531L06989K06717k15939O3620J87023
14582A803437P3924j20493o3649n8635j23475j24886N51756J25835j12327M1210
14572A992697l58220L6558M46250l82053J54344l6398j78520M46849l31281J0000
14562A800226K9685M67442l48764N3764J42986K58267k83141R6780N7733j16920
14552B158058L03801l37126M72879l46438M40918j40028M3806K72777L90200j59303
14542C099544K95886M22725J24599L45147N31107O67655Q80279J392035K907701
14533A0666678L424120O087480J0414188K616178j3379968q824498l968459k050719
14525D985000m08247O86456m38405j196080j007559m8219m9924j88770j04149
$$ plain form
14516 2230103 2564700 2427319 2352069 2226948 2448278 2278882 2644723 2552912 2236761 2386129
14506 2386129 2726141 2486213 2727745 2748351 2715357 2875419 2554768 2640875 2373549 2544206
14496 2544206 2747432 2802491 3119599 3012789 2880873 3145961 2900677 2866053 3252050 3158263
14486 3158263 3082090 2945987 3463415 3170236 3489241 3278859 3541296 3410107 3734921 3510250
14476 3510250 3419551 3378607 3460410 3604844 3682950 3690001 3479078 3567270 3821494 4101646 3873307
14465 3873307 3649573 3889543 3880395 4203919 4389137 4464847 4314365 4355856 4279435 4582346
14455 4582346 4277701 4689644 4257236 4439900 4721645 4698524 4550051 4802759 4923972 4678976
14445 4678976 4850502 4956866 4996679 5622271 5258844 5172576 5183418 5234787 5686323 5389838
$$ packed form
14516B230103L34597j37381p5250j25121K21330j69396L65841r1811l16151J49368
14506B386129L40012k39928K41532K0606l2994J60062l20651Q6107k67326J70657
14496B544206K03226N5059L17108j06810j31916K65088k45284l4624L85997r3787
14486C158263p6173j36103N17428k93179L19005k10382K62437j31189L24814k24671
14476C510250r0699m0944Q1803J44434P8106P051k10923Q8192K54224K80152k28339
14465C873307k23734K39970r148L23524J85218P5710j50482M1491p6421L02911
14455D582346l04645M11943m32408J82664K81745k3121j48473K52708J21213k44996
14445D678976J71526J06364L9813O25592l63427q6268J0842N1369M51536k96485
$$ plain form
14435 5389838 5602355 5570028 5691521 5816447 5883383 5906963 5956012 5962280 5858881 6326314
14425 6326314 6150391 6495057 6508750 6411428 6680056 6748634 6642899 6875039 7061352 7170607
14415 7170607 7369426 7228218 7349051 7353172 7588323 7854764 7396819 8030051 8096469 8209039
14405 8209039 8308923 8603893 8816015 8525887 8923592 9136807 9125629 9131802 9467600 9644702
14395 9644702 9835219 9597178 9988046 10236417 10607786 10279618 10339367 10934563 10836428 11227631
14385 11227631 11326859 11656349 11470560 11708251 11777019 12303676 12178932 12462434 12561826 12583963
14375 12583963 12926081 13407257 13777096 13949497 14184534 14263663 14729413 14739342 15317163 15547771
14365 15547771 16147481 16314161 16368835 16600997 17046340 17277412 17835576 17954230 18767827
$$ packed form
14435E389838K12517l2327J21493J24926O6936K3580M9049O268j03399M67433
14425F326314j75923L44666J3693r7322K68628O8578j05735K32140J86313J09255
14415G170607J98819j41208J20833M121K35151K66441m57945O33232O6418J12570
14405H209039R9884K94970K12122k90128L97705K13215j1178O173L35798J77102
14395I644702J90517k38041L90868K48371L71369l28168N9749N95196r8135L91203
14385A1227631R9228L29490j85789K37691O8768N26657j24744K83502R9392K2137
14375A2583963L42118M81176L69839J72401K35037P9129M65750R929N77821K30608
14365A5547771N99710J66680N4674K32162M45343K31072N58164J18654Q13597
$$ plain form
14356 18767827 18430201 18838455 19079482 19651730 20240099 20171944 20590118 21447286 21686710
14347 21686710 22515513 22925796 23492734 23611990 24056274 24562202 25237928 25552748 26080630
14338 26080630 26739696 27643278 28193434 28867832 29662954 30408743 31190352 32031503 32796278
14329 32796278 33327524 34274822 35255299 36221289 37107399 38244448 39129427 40259531 41514990
14320 41514990 42637342 44075136 45188156 46804227 48380045 49649404 50940758 52921643
14312 52921643 54704856 56545863 58201703 60375962 62174457 64648451 66829990 69127257
14304 69127257 71608306 74238671 77297538 79875698 83210071 86162452 89935916 93750078
14296 93750078 97579790 101680660 106166553 110348421 115429583 120560461 125973355 132111358
$$ packed form
14356A8767827l37626M08254K41027N72248N88369o8155M18174Q57168K39424
14347B1686710Q28803M10283N66938J19256M44284N05928O75726L14820N27882
14338B6080630O59066R03582N50156O74398P95122P45789P81609Q41151P64775
14329C2796278N31246R47298R80477R65990Q86110J137049Q84979J130104J255459
14320D1514990J122352J437794J113020J616071J575818J269359J291354J980885
14312E2921643J783213J841007J655840K174259J798495K473994K181539K297267
14304F9127257K481049K630365L058867K578160L334373K952381L773464L814162
14296I3750078L829712M100870M485893M181868N081162N130878N412894O138003
$$ plain form
14288 132111358 138204414 144687196 151311080 158902043 166904238 175118406 183756584 193219644
14280 193219644 203016351 213296471 224266102 235799301 247494522 260640194 273792907
14273 273792907 287816114 301817539 316404156 330968965 345494179 359836983 373364661
14266 373364661 386866632 400048234 412009959 423158284 433518701 443341730 451895542
14259 451895542 457454220 460058187 462709330 465286812 467856470 467593808 463001680 458986223
14251 458986223 451948432 441485963 429560692 417530378 404397516 390537843 376148542
14244 376148542 362729286 348479516 334306352 319802947 306490994 293294962 279860578
14237 279860578 267136608 255773657 243939470 232737269 221266773 210114205 199463849
$$ packed form
14288A32111358O093056O482782O623884P590963Q002195Q214168Q638178R463060
14280A93219644R796707J0280120J0969631J1533199J1695221J3145672J3152713
14273B73792907J4023207J4001425J4586617J4564809J4525214J4342804J3527678
14266C73364661J3501971J3181602J1961725J1148325J0360417R823029Q553812
14259D51895542N558678K603967K651143K577482K569658k62662m592128m015457
14251D58986223p037791j0462469j1925271j2030314j3132862j3859673j4389301
14244C76148542j3419256j4249770j4173164j4503405j3311953j3196032j3434384
14237B79860578j2723970j1362951j1834187j1202201j1470496j1152568j0650356
$$ plain form
14230 199463849 189462362 180186105 171398801 163055896 155184978 148095926 141414470 134968648
14222 134968648 129156392 123203963 117998179 112643995 108189515 103613112 99788762 95595518
14214 95595518 91826622 88005860 84808587 81405491 78746309 75608945 73075274 70428631
14206 70428631 67943506 65782594 63394982 61327874 58841799 56998386 55365178 53784271
14198 53784271 52471363 50627700 48935841 47755170 46406438 45038065 44111624 42976137
14190 42976137 41429156 40511829 38847131 37936241 37184167 36353309 35626684 34210655 33335049
14181 33335049 32437885 31711095 30891095 30303161 29543497 28459302 27924884 26849961 26679328
14172 26679328 25760646 25130235 24380727 24034602 23562950 23457493 22678363 22295314 21594071
$$ packed form
14230A99463849j0001487r276257q787304q342905p870918p089052o681456o445822
14222A34968648n812256n952429n205784n354184m454480m576403l824350m193244
14214I5595518l768896l820762l197273l403096k659182l137364k533671k646643
14206G0428631k485125k160912k387612k067108k486075j843413j633208j580907
14198E3784271j312908j843663j691859j180671j348732j368373r26441j135487
14190D2976137j546981r17327j664698r10890p52074q30858p26625j416029q75606
14181C3335049q97164p26790q20000n87934p59664j084195n34418j074923j70633
14172B6679328r18682o30411p49508l46125m71652j05457p79130l83049p01243
$$ plain form
14163 21594071 20936891 20660092 20083134 19943638 19500221 19063068 18712175 18198286 17883494
14154 17883494 17423910 17311626 16809881 16787753 15912171 16000453 15442310 15523889 15325116 14777436
14144 14777436 14918664 14197994 14168998 13703623 13740485 13107656 12935629 13005965 13004505 12560912
14134 12560912 12547662 11941195 12311251 11720391 11763341 11365355 11614158 11129334 11397525 10417440
14124 10417440 10660631 10664376 10374411 10309369 10530915 9802297 9624039 9539535 9503947 9474442
14114 9474442 9321442 9155083 9020051 9274734 8799635 8609893 8496110 8628639 8350097
14105 8350097 7961365 8052241 8284412 7884772 7809248 7879546 7307240 7338926 7270006 7467147
14095 7467147 7251581 7194435 7133026 7208658 6932724 6891537 6878727 6410701 6591888 6595215 6401211
$$ packed form
14163B1594071o57180k76799n76958j39496m43417m37153l50893n13889l14792
14154A7883494m59584j12284n01745k2128q75582Q8282n58143Q1579j98773n47680
14144A4777436J41228p20670k8996m65375L6862o32829j72027P0336j460m43593
14134A2560912j3250o06467L70056n90860M2950l97986K48803m84824K68191r80085
14124A0417440K43191L745k89965o5042K21546p28618j78258q4504l5588k9505
14114I474442j53000j66359j35032K54683m75099j89742j13783J32529k78542
14105H350097l88732R0876K32171l99640p5524P0298n72306L1686o8920J97141
14095G467147k15566n7146o1409P5632k75934m1187j2810m68026J81187L327j94004
$$ plain form
14084 6401211 6372273 6428559 6129507 5962802 6281434 6246799 6089692 5858691 5718479 5805798
14074 5805798 5835714 5532156 5470626 5616645 5481385 5498921 5639027 4979724 5554047 4860773
14064 4860773 5243299 5044719 4793720 5196258 5027653 4451361 4931189 4826076 4579397
14055 4579397 4508727 4295142 4829264 4312151 4260619 4430984 4430953 4055526 4563178 4600114 4495376
14044 4495376 4684974 4155433 4514068 4411584 4216430 3817365 4027068 3873405 4016569
14035 4016569 3878599 3977149 3899656 3453526 3683216 3586463 3461569 3405768 3325685 3737020
14025 3737020 3713624 3741652 3040977 3309482 3546372 3313162 3115578 3421836 3355025 3249349
14015 3249349 3156220 3178322 3107189 2860518 3124902 3020915 2807408 2958679 2738287 2861535
$$ packed form
14084F401211k8938N6286k99052j66705L18632l4635j57107k31001j40212Q7319
14074E805798K9916l03558o1530J46019j35260J7536J40106o59303N74323o93274
14064D860773L82526j98580k50999M02538j68605n76292M79828j05113k46679
14055D579397p0670k13585N34122n17113n1532J70365l1l75427N07652L6936j04738
14044D495376J89598n29541L58635j02484j95154l99065K09703j53663J43164
14035D016569j37970R8550p7493m46130K29690r6753j24894n5801q0083M11335
14025C737020k3396K8028p00675K68505K36890k33210j97584L06258o6811j05676
14015C249349r3129K2102p1133k46671K64384j03987k13507J51271k20392J23248
$$ plain form
14005 2861535 2835934 2920038 2441662 2894637 2995912 3033520 2698787 2697185 2819716 2687612
13995 2687612 2341750 2786521 2460733 2589665 2655841 2455697 2591124 2484475 2203798 2457366
13985 2457366 2306195 2772284 2287207 2766368 2647831 2813016 2867916 2915516 3549593 4298031
13975 4298031 5064832 7036002 10024961 15203421 26142964 34756325 23962363 15489282
13967 15489282 10162885 7142411 6055114 5198819 4281264 4209956 3519293 3649387 3402076
13958 3402076 3117349 3129374 2881760 2635344 2563436 2664153 2692464 2189575 2413593 2839824
13948 2839824 2364644 2457430 2285021 2675437 2329157 2363888 2084120 2124662 2332726 2161213
13938 2161213 2070485 2288997 1927655 2235902 2056684 1901651 2159108 2062321 1928011 2026262
$$ packed form
14005B861535k5601Q4104m78376M52975J01275L7608l34733j602J22531j32104
13995B687612l45862M44771l25788J28932O6176k00144J35427j06649k80677K53568
13985B457366j51171M66089m85077M79161j18537J65185N4900M7600O34077P48438
13975D298031P66801J971170K988959N178460J0939543Q613361j0793962q473081
13967A5489282n326397l020474j087297q56295r17555p1308o90663J30094k47311
13958C402076k84727J2025k47614k46416p1908J00717K8311n02889K24018M26231
13948B839824m75180R2786j72409L90416l46280L4731k79768M0542K08064j71513
13938B161213r0728K18512l61342L08247j79218j55033K57457r6787j34310R8251
$$ plain form
13928 2026262 1905527 1727392 1543833 1968674 1902820 2168400 1663555 1823222 1815393 1875829
13918 1875829 1726941 1606932 1621227 1175624 1845423 2032824 1525692 1600504 1781998 1394901
13908 1394901 1792148 1577520 1509871 1725473 1721428 1640381 1561337 1419089 1379187 1500315
13898 1500315 1653626 1724464 1735248 1408614 1579752 1598316 1577464 1462554 1468062 1389089 1403808
13887 1403808 1428420 1436376 1155327 1113737 1744824 1383389 1267279 1918267 1491106 1572044
13877 1572044 1267337 1371025 1391049 1783294 1391500 1377404 1182995 1236718 1422367 1182828
13867 1182828 1357200 1367003 1347077 1433645 1090260 1111667 831031 995172 971022 1511090
13857 1511090 1301613 1022701 1199894 895124 1008044 1204790 743844 1265939 994227
$$ packed form
13928B026262j20735j78135j83559M24841o5854K65580n04845J59667p829O0436
13918A875829j48888j20009J4295m45603O69799J87401n07132P4812J81494l87097
13908A394901L97247k14628o7649K15602m045q1047p9044j42248l9902J21128
13898A500315J53311P0838J0784l26634J71138J8564k0852j14910N508p8973J4719
13887A403808K4612P956k81049m1590O31087l61435j16110O50988m27161Q0938
13877A572044l04707J03688K0024L92245l91794j4096j94409N3723J85649k39539
13867A182828J74372R803j9926Q6568l43385K1407k80636J64141k4150N40068
13857A511090k09477k78912J77193l04770J12920J96746m60946N22095k71712
$$ plain form
13848 994227 1273651 835956 1386323 1322737 1223239 1303301 1457479 843151 992204 1284002
13838 1284002 1340217 853649 1092339 1197945 1205869 1003728 756334 1371178 977586 964105
13828 964105 904720 710739 1153811 1025289 955578 834562 962613 973693 1173923 955207
13818 955207 800990 1265922 1240521 1234128 1063050 816052 827270 913674 870674 1157088 896329
13807 896329 1200203 1004951 999355 807865 973473 1133601 1255452 761517 947498 907664
13797 907664 1143184 1017887 816214 767298 854628 666097 1157365 869919 723819 693924
13787 693924 778834 1196859 859214 1153840 588179 1004028 846520 1153704 1185252 811061
13777 811061 603088 738275 612111 1087137 962308 980266 651458 691248 712884 831769
$$ packed form
13848I94227K79424m37695N50367o3586r9498Q0062J54178o14328J49053K91798
13838A284002N6215m86568K38690J05606P924k02141k47394O14844l93592j3481
13828I64105n9385j93981M43072j28522o9711j21016J28051J1080K00230k18716
13818I55207j54217M64932k5401o393j71078k46998J1218Q6404m3000K86414k60759
13807H96329L03874j95252n596j91490J65608J60128J21851m93935J85981l9834
13797I07664K35520j25297k01673m8916Q7330j88531M91268k87446j46100k9895
13787F93924Q4910M18025l37645K94626n65661M15849j57508L07184L1548l74191
13777H11061k07973J35187j26164M75026j24829J7958l28808L9790K1636J18885
$$ plain form
13767 831769 806882 685508 774317 762537 743776 682377 823487 800642 700457 642213 1050835
13756 1050835 814994 669487 822882 955775 664171 966964 793052 832659 233284 547760
13746 547760 642310 718591 1081891 616805 864115 664125 542154 512048 377546 568305
13736 568305 497258 590333 416116 832562 626867 875266 391243 631320 672108 725752
13726 725752 914230 683951 708215 652580 465443 588875 675977 687189 825493 560418
13716 560418 628314 828275 471908 363089 533086 833328 747308 597019 651679 883515
13706 883515 544696 738265 569282 720025 615402 536968 882597 530452 441908 572069
13696 572069 431113 479674 675635 582070 580224 457844 660873 563251 646766 514687 522913
$$ packed form
13767H31769k4887j21374Q8809j1780j8761o1399J41110k2845j00185n8244M08622
13756A050835k35841j45507J53395J32893k91604L02793j73912L9607B33284L14476
13746E47760R4550P6281L63300m65086K47310j99990j21971l0106j34502J90759
13736E68305p1047R3075j74217M16446k05695K48399C91243K40077M0788N3644
13726G25752J88478k30279K4264n5635j87137J23432Q7102J1212J38304k65075
13716E60418O7896J99961l56367j08819J69997L00242q6020j50289N4660K31836
13706H83515l38819J93569j68983J50743j04623p8434L45629l52145q8544J30161
13696E72069j40956M8561J95961r3565j846j22380K03029r7622Q3515j32079Q226
$$ plain form
13685 522913 616745 786256 322378 454768 606305 546072 411090 863089 733928 545018
13675 545018 680756 407743 621812 482781 585058 509290 334044 590906 534842 729051
13665 729051 322213 697633 563866 520704 636893 439018 705152 413871 683704 402161
13655 402161 548759 233878 321250 241565 435757 425741 430170 720107 157023 389744
13645 389744 403335 837202 510914 464717 188042 739390 394542 170307 787686 366020
13634 747413 364691 861669 220812 145140 599217 556915 677263 669384 307683 358685
13624 358685 565921 246543 434271 398031 579128 105088 267283 331106 281027 464459
13614 464459 534338 710292 579125 146972 92763 564599 431872 190157 503062 584948
$$ packed form
13685E22913R3832J69511C22378J32390J51537o0233j34982M51999j29161j88910
13675E45018J35738k73013K14069j39031J02277p5768j75246K56862n6064J94209
13665G29051C22213L75420j33767m3162J16189j97875K66134k91281K69833k81543
13655D02161J46598B33878Q7372p9685J94192j0016M429K89937A57023K32721
13645C89744J3591M33867l26288m6197A88042N51348l44848A70307O17379C66020
13634G47413C64691M96978B20812p5672M54077m2302J20348p879C07683N1002
13624C58685K07236B46543J87728l6240J81097A05088J62195O3823n0079J83432
13614D64459O9879J75954j31167A46972n4209M71836j32727A90157L12905Q1886
$$ plain form
13604 584948 613787 481207 401098 244188 503175 505104 501336 148497 636836 277359 649510
13593 649510 612119 524706 674005 267310 600043 332193 363867 516022 456708 642013
13583 642013 659839 331729 579418 256765 454924 476500 492810 317933 289165 218175
13573 218175 184246 400267 288279 539239 458837 531138 60245 518541 257648 299561
13563 299561 316264 311569 280659 227719 414205 442103 244285 107692 353053 390509 478775
13552 478775 116881 268268 430510 379856 478372 317789 124803 392589 192234 494133
13542 494133 573708 61809 461912 310998 337138 205570 428742 5573 301710 551933
13532 551933 426755 656582 508411 210859 197708 309158 404187 -29275 193170 451248
$$ packed form
13604E84948K8839j32580q0109j56910K58987J929l768A48497M88339B77359L72151
13593F49510l7391q7413J49299B67310L32733k67850L1674J52155n9314J85305
13583F42013J7826l28110K47689B56765J98159K1576J6310j74877k8768p0990
13573B18175l3929K16021j11988K50960q0402P2301F0245M58296B57648M1913
13563B99561J6703m695l0910n2940J86486K7898j97818A07692K45361L7456Q8266
13552D78775A16881J51387J62242n0654R8516j60583A24803K67786A92234L01899
13542D94133P9575F1809M00103j50914K6140j31568K23172E573K96137K50223
13532E51933j25178K29827j48171B10859j3151J11450R5029b9275A93170K58078
$$ plain form
13522 451248 140829 286151 224327 523807 403945 253574 333854 369627 337556 728384
13512 728384 351364 424971 203446 286412 335110 59542 212207 -114715 532848 621315
13502 621315 320331 364278 320957 312393 190579 204443 87643 195921 238563 242568 408163
13491 408163 284694 131285 126050 -21387 401234 213498 -126525 227852 415217 441153
13481 441153 458177 246981 251242 253272 104438 -71618 227656 69109 172017 214132 209835
13470 209835 286720 197227 316162 101226 28456 555645 56918 137384 -25745 340003 143778
13458 284976 357251 257866 469031 314171 258783 638395 94140 479367 164728 133339
13448 133339 332528 202507 225739 105001 273147 120283 469928 138582 170864 220006
$$ packed form
13522D51248A40829J45322o1824K99480j19862j50371Q0280L5773l2071L90828
13512G28384C51364P3607B03446Q2966M8698E9542J52665a14715E32848Q8467
13502F21315l00984M3947m3321q564j21814J3864H7643J08278M2642M005J65595
13491D08163j23469A31285n235b1387D01234j87736a26525B27852J87365K5936
13481D41153J7024k11196M261K030A04438g1618B27656F9109J02908M2115m297
13470B09835P6885q9493J18935A01226B8456N27189E6918Q0466b5745C40003A43778
13458B84976P2275r9385K11165j54860n5388L79612I4140L85227A64728l1389
13448A33339J99189j30021K3232A05001J68146A20283L49645A38582L2282M9142
$$ plain form
13438 220006 63389 408080 225620 314101 223825 305710 40376 178619 275190 96839 642216
13427 642216 140857 250346 197567 411891 291954 92499 461884 344781 238776 332665
13417 332665 399038 -78416 349573 -69610 -137999 361463 146081 270740 141680 -21879
13406 358014 86810 282906 -18348 382274 465767 258762 109719 56469 112190 112754 69069
13395 69069 315010 244224 197255 -14033 159453 78624 169560 193339 189388 171404 265496
13384 265496 82943 401291 65277 373787 118737 -23850 132083 262908 188902 300998
13374 300998 145394 -29004 67167 114972 232560 422792 454220 -64879 -13899 97009 334298
13363 334298 114302 -39515 7284 334400 241056 364516 297580 304968 185249 352341 225349
$$ packed form
13438B20006F3389L44691j82460Q8481r0276Q1885D0376J38243R6571I6839N45377
13427F42216A40857J09489n2779K14324j19937I2499L69385j17103j06005R3889
13417C32665O6373g8416C49573f9610o8389C61463A46081J24659j29060b1879
13406C58014H6810J96096a8348C82274Q3493k07005A09719n3250N5721N64m3685
13395F9069K45941p0786m6969a4033A59453G8624R0936K3779l951j7984R4092
13384B65496H2943L18348F5277L08510A18737b3850A32083J30825p4006J12096
13374C00998A45394b9004F7167M7805J17588J90232L1428f4879a3899I7009K37289
13363C34298A14302c9515G284L27116r3344J23460o6936P388j19719J67092j26992
$$ plain form
13352 225349 458976 238933 361083 357927 71200 58153 178350 174890 341848 273881 193281
13341 193281 232990 11268 103732 86598 208485 324886 188836 -56066 296957 618 467721
13330 467721 347243 302863 184867 518288 80047 231739 315829 250038 536915 512756
13320 512756 99086 271749 100525 485042 34102 279334 179352 249610 605579 128309
13309 -80470 173736 105200 52252 140050 334449 827 174565 542560 230189 195403 423088
13298 423088 281019 23708 279696 436632 85275 103387 205934 189267 357403 1705 422686
13287 422686 190190 245767 290495 266878 -127436 243155 -123894 54238 -45184 486922
13276 -272803 -172843 280598 -113322 -195055 350563 193420 46858 -68926 459311 -1190 96829
$$ packed form
13352B25349K33627k20043J22150l156G1200j3047J20197l460J66958o7967q0600
13341A93281L9709A1268R2464j7134J21887J16401j36050e6066B96957F18M67103
13330D67721j20478m4380j17996L33421H0047J51692Q4090o5791K86877k4159
13320E12756I9086J72663A00525L84517C4102K45232r9982P0258L55969A28309
13309h0470A73736o8536E2252Q7798J94399H27J73738L67995B30189l4786K27685
13298D23088j42069B3708K55988J56936H5275J8112J02547j6667J68136A705M20981
13287D22686A90190N5577M4728k3617a27436B43155a23894E4238d5184D86922
13276b72803R9960B80598a13322q1733C50563j57143D6858f8926D59311a190I6829
$$ plain form
13264 -107087 149041 -56142 179167 104767 198099 -222151 77455 200101 50451 91762 29376
13252 186335 298427 73114 -76617 189018 194096 336688 32889 -361179 2147 172331 337155
13241 337155 77696 30862 176679 221845 127521 -125848 260064 247614 16563 149921 53236
13229 12832 -373967 324302 108398 195240 -42833 -4253 30969 36654 142010 -208849 -64643
13217 88600 -2628 -82149 120057 339477 77008 182203 -110828 137406 26322 56288 236096
13206 236096 -6291 -94740 107063 67939 -123335 96724 74132 173874 422773 -32205 225692
13194 -83127 -67170 168131 221413 348660 171424 389037 241323 278402 -207971 285505
13183 279873 -212899 246892 163962 101834 162037 3488 43795 355803 210953 -48694 62081
$$ packed form
13264a07087A49041e6142A79167p4400R3332b22151G7455J22646E0451M1311B9376
13252A86335J12092G3114g6617A89018N078J42592C2889c61179B147J70184J64824
13241C37155G7696C0862J45817M5166r4324a25848B60064j2450A6563J33358E3236
13229A2832c73967C24302A08398Q6842d2833d253C0969N685J05356b08849f4643
13217H8600b628p9521A20057K19420G7008J05195a10828A37406B6322K9966J79808
13206B36096f291q8449A07063l9124a23335I6724k2592R9742K48899c2205B25692
13194h3127J5957A68131N3282J27247A71424K17613j47714L7079b07971B85505
13183B79873b12899B46892q2930o2128O0203C488M0307L12008j44850d8694F2081
$$ plain form
13171 203407 -25068 -47973 516754 327863 218578 284553 85467 156244 181068 340130 360670
13160 360670 157472 -326793 31639 382681 53436 162259 -171014 15187 27025 351317
13150 351317 -87377 -47244 204791 -3089 6291 303168 112016 -60465 80590 164016 171989
13139 171989 -154882 50179 344105 135935 199687 -20501 54204 -271301 57045 12826 164298
13128 164298 52320 -80816 -367280 -104153 106772 -3503 246119 -18237 47358 93573 -195380
13116 197218 -11609 2973 79492 11930 -225051 -31948 132894 -68001 149482 213022 13541
13104 -9853 244472 -68020 93506 -47543 340971 56332 -9158 205357 -159017 234440 116046
13092 16275 322255 379543 -2816 -5786 120467 14154 -37169 19466 -8017 383061 -124420
$$ packed form
13171B03407b5068k2905E16754j88891j09285O5975H5467P0777K4824J59062K0540
13160C60670A57472c26793C1639L51042E3436J08823a71014A5187J1838L24292
13150C51317h7377M0133B04791c089F291K96877A12016f0465H0590Q3426P973
13139A71989a54882E0179K93926A35935O3752b0501E4204b71301E7045A2826J51472
13128A64298E2320h0816k86464a04153A06772c503B46119a8237D7358M6215a95380
13116A97218a1609B973P6519A1930b25051c1948A32894f8001A49482O3540A3541
13104i853B44472f8020I3506d7543C40971E6332i158B05357a59017B34440A16046
13092A6275L05980N7288b816k970A20467A4154c7169A9466h017C83061a24420
$$ plain form
13080 220 -8291 154733 -47224 289408 -44365 280076 -120413 -168203 136730 197031 -166765
13068 223470 230654 216701 -113268 -32929 -160910 111706 289513 94609 259325 229148 170271
13057 170271 333357 237102 179703 -9157 201601 -224701 263336 309247 191692 78253 196108
13046 196108 -7645 -46796 22682 -72875 -191861 -42797 404793 144329 148602 152384 321290
13035 321290 366350 145653 -6567 -333729 -32560 -235818 4721 114920 -257399 158953 -40175
13023 155331 -220075 318475 330687 115096 109891 -96234 175051 121620 283768 13741 -236987
13011 220260 23857 442033 97939 14420 -10849 -410076 330199 31428 -46518 46964 -2494
12999 203149 -49721 -9252 211277 1969 299255 7044 201447 189365 -325921 228107 80534
$$ packed form
13080B20h291A54733d7224B89408d4365B80076a20413m7790A36730O0301a66765
13068B23470P184j3953a13268c2929j27981A11706J77807I4609J64716l0177n8877
13057A70271J63086r6255n7399i157B01601b24701B63336M5911j17555G8253J17855
13046A96108g645l9151B2682g2875j18986d2797D04793A44329M273L782J68906
13035C21290M5060A45653f567l27162c2560k03258D721J10199b57399A58953d0175
13023A55331b20075C18475J2212A15096n205i6234A75051n3431J62148A3741b36987
13011B20260B3857M18176I7939A4420a0849l99227C30199C1428d6518D6964b494
12999B03149d9721i252B11277A969K97286G044J94403j2082c25921B28107H0534
$$ plain form
12987 116806 116217 6202 -221741 108471 110857 107829 21303 -165393 199481 132590 -349383
12975 -17150 -13355 -52010 6878 -182676 -160419 349078 -160450 139345 -70012 49881 -132452
12963 133973 127818 101036 82283 -98765 281601 -242994 160664 30444 -19425 443149 61652
12951 192280 -194531 -71929 155318 -85827 -101622 64214 -23345 78095 40 -326663 150456
12939 220226 28935 258007 181398 248059 311221 167311 -251273 -190133 -76585 -263347 -5567
12927 -207840 -119900 133583 -474 155254 -46340 254754 -191363 56745 -171266 49185 -175480
12915 -78134 -366529 13055 22522 22724 5972 -153932 -120629 -25362 -238852 -101158 -15315 -4979
12902 -156850 326191 104144 207193 -188634 -129610 2809 232072 252335 123913 331904
$$ packed form
12987A16806n89F202b21741A08471K386l028B1303a65393A99481o6891c49383
12975a7150L795l8655F878a82676K2257C49078a60450A39345g0012D9881a32452
12963A33973o155k6782j8753i8765B81601b42994A60664C0444a9425D43149F1652
12951A92280a94531g1929A55318h5827j5795F4214b3345G8095D0c26663A50456
12939B20226B8935K29072p6609O6661O3162j43910b51273O1140g6585j86762e567
12927b07840Q7940A33583d74A55254d6340B54754a91363E6745a71266D9185a75480
12915g8134k88395A3055R467K02E972a53932L3303b5362k13490a01158a5315d979
12902a56850C26191A04144J03049a88634N9024B809K29263K0263A23913K07991
$$ plain form
12892 331904 114636 243299 97729 -96617 200923 26308 114773 -108635 -181762 9380 130903
12881 130903 55112 214209 134549 36025 60276 -231514 -130495 156752 151208 -133083 -369816
12870 -369816 -65813 94333 137545 -62731 33075 -238857 41806 484496 185830 -327617 57948
12858 -3775 233581 319945 89224 -24741 -189829 -135896 -70793 -86447 95472 308603 380185
12847 380185 72738 132902 -195584 -194665 85534 81954 -208204 225165 -7025 94171 32626 132960
12835 132960 -87586 -54758 -173086 -97403 -90692 171528 23 180018 -161658 -185355 -87121
12823 113994 -210344 -74183 521 -154681 -259758 -155545 219351 91560 181890 -79514 -37642
12811 -243581 -58330 320496 -208650 216210 45550 379853 40605 -24681 220185 84893
$$ packed form
12892C31904A14636J28663I7729i6617B00923B6308Q8465a08635p3127I380J21523
12881A30903E5112J59097p9660C6025K4251b31514J01019A56752n544a33083k36733
12870c69816f5813I4333M3212f2731C3075b38857D1806M42690A85830c27617E7948
12858c775B33581Q6364H9224b4741j65088N3933O5103j5654I5472K13131P1582
12847C80185G2738O0164a95584R19H5534l580b08204B25165g025I4171C2626J00334
12835A32960h7586L2828j18328P5683O711A71528B3J79995a61658k3697h7121
12823A13994b10344g4183E21a54681j05077J04213B19351I1560R0330g9514c7642
12811b43581e8330C20496b08650B16210D5550L34303D0605b4681B20185H4893
$$ plain form
12800 -193081 185003 191786 -21827 91566 -227560 208987 -29943 -40870 -178364 -143047 -298161
12789 -298161 157813 -181137 57268 -70587 -186650 129589 -100342 -286630 -49584 880 229688
12778 229688 -47739 409488 83767 -210716 297786 -195445 -26688 -84608 -424633 -422270 10923
12766 -73178 405941 -50032 -100622 167838 -357338 170386 124924 14789 120312 113665 129603
12755 129603 -52799 6252 -341159 -191491 176569 -142536 -14313 58312 7412 -85325 -23151
12743 91232 35751 -306207 -62440 228589 -34495 106674 139621 178474 -236147 -244479 135531
12731 63621 326218 317481 -179263 -7727 208468 48702 -102943 -108430 -40372 46522 -193999
12719 99460 220531 121962 79914 71476 -194800 495158 216442 -179549 113641 220262
$$ packed form
12800a93081A85003O783b1827I1566b27560B08987b9943j0927j37494L5317j55114
12789b98161A57813a81137E7268g0587j16063A29589a00342j86288d9584H80K28808
12778B29688d7739D09488H3767b10716B97786a95445b6688n7920l40025K363A0923
12766g3178D05941e0032n0590A67838c57338A70386m5462A4789J05523o647J5938
12755A29603e2799F252c41159J49668A76569a42536a4313E8312G412h5325b3151
12743I1232C5751c06207f2440B28589c4495A06674L2947L8853b36147q332A35531
12731F3621K62597q737a79263g727B08468D8702a02943n487d0372D6522a93999
12719I9460J21071r8569m2048q438a94800D95158B16442a79549A13641J06621
$$ plain form
12709 220262 -14349 145676 25014 253840 13615 522970 -303033 -16486 -9876 -172567 225576
12697 99302 -5440 244745 256053 197258 228932 595186 199141 92745 74732 -43660 96277
12685 99238 -214969 105935 14319 302594 -38773 53927 -201183 -215833 90173 283365 -146592
12673 175075 -161315 251466 -68451 -129574 66423 35420 -230231 100716 365332 138325
12662 -166371 1559 25662 -18395 -45039 185670 232392 217915 157116 -108462 59739 340540
12651 340540 7287 -52888 -103044 -83040 -260034 83877 -7064 335208 155410 124420 -166364
12639 49039 -66311 -113497 107248 -191277 -177758 297453 -167440 -24810 -5819 120860 286976
12628 286976 -114424 -458268 60903 197743 219993 41668 316967 237621 76951 116457 69446
$$ packed form
12709B20262a4349A45676B5014K28826A3615N09355c03033a6486O610j62691B25576
12697I9302e440B44745J1308n8795L1674L66254A99141I2745j8013d3660I6277
12685I9238b14969A05935A4319K88275c8773E3927b01183j4650I0173J93192a46592
12673A75075a61315B51466f8451o1123F6423l1003b30231A00716K64616A38325
12662a66371A559K4103a8395k6644A85670M6722j4477o0799a08462E9739K80801
12651C40540G287e2888n0156K0004j76994H3877g064C35208A55410l0990a66364
12639D9039f6311m7186A07248a91277J3519B97453a67440b4810e819A20860J66116
12628B86976a14424l43844F0903J36840K2250D1668K75299p9346G6951L9506m7011
$$ plain form
12617 69446 -84668 168421 8133 220452 435659 124938 263664 258155 -34113 -35033 232878
12605 111699 -26082 -5944 144842 165109 2942 266648 -92585 125132 25443 -328237 -207889
12594 -207889 72159 133480 216623 73117 -61895 -192199 51014 -25828 209924 -82800 -65649
12583 -65649 -109170 92952 399700 -21034 -37134 33331 -141157 171592 290156 30785 45882
12572 45882 -340855 67576 -31669 21045 -201401 -75498 15951 -28892 2395 129076 99263
12561 99263 -94563 -35040 133489 -36563 153243 12036 208892 99362 -99879 61813 -139668
12549 -285552 -232742 -322052 129096 186474 319123 -33918 69631 -50564 116852 -53179 126616
12537 68030 -20263 66367 95918 202179 -88395 -26433 -72020 9863 -237375 275746 -141228
$$ packed form
12617F9446h4668A68421H133K12319K15207A24938J38726n509c4113r20B32878
12605A11699b6082e944A44842K0267B942K63706i2585A25132B5443c28237J20348
12594b07889G2159O1321Q3143G3117f1895j30304E1014b5828B09924h2800J7151
12583f5649m3521I2952L06748b1034j6100C3331a41157A71592J18564C0785J5097
12572D5882c40855F7576c1669B1045b01401g5498A5951b8892B395J26681k9813
12561I9263i4563c5040A33489c6563A53243A2036J96856I9362i9879F1813a39668
12549b85552N2810q9310A29096N7378J32649c3918F9631e0564A16852e3179A26616
12537F8030b0263F6367K9551J06261h8395b6433m5587I863b37375B75746a41228
$$ plain form
12525 -7058 67966 -85933 242789 -273928 -120411 26916 -428467 187565 257588 74719 169815
12514 169815 -163980 213332 -35879 -139004 54861 -295620 -12736 9750 135274 19458 -164589
12502 118157 62241 205424 125368 -156982 -233770 -106984 74497 141916 -40253 -57870 87743
12490 -54214 112363 25519 297076 -342260 312162 130422 99731 104727 46379 208329 136663
12479 136663 235068 -145087 259 11639 -291476 115841 300203 252824 157634 -91315 39001
12467 147125 44755 519879 -152388 -258573 -78119 -13051 -249510 134818 -386952 167225
12456 53455 13497 166414 -14804 -200826 -94323 178270 -23854 -385687 -12112 -56560 -166391
12445 -166391 199247 -89435 207107 -57959 442983 36937 -338485 -163529 63300 -233791
$$ packed form
12525g058F7966h5933B42789b73928a20411B6916d28467A87565P0023G4719R5096
12514A69815a63980B13332c5879j03125E4861b95620a2736I750J25524A9458a64589
12502A18157n5916J43183q0056a56982p6788a06984G4497O7419d0253j7617H7743
12490e4214A12363B5519K71557c42260C12162A30422l0691M996D6379J61950p1666
12479A36663R8405a45087B59J1380b91476A15841J84362m7379r5190i1315C9001
12467A47125D4755M75124a52388j06185g8119a3051k36459A34818c86952A67225
12456E3455A3497J52917a4804j86022i4323A78270b3854l61833a2112m4448j09831
12445a66391A99247h9435B07107e7959D42983C6937c38485a63529F3300b33791
$$ plain form
12434 -18939 245239 -142749 348368 222361 75435 -455103 -209960 -22886 243781 5384
12423 312359 -128865 -295440 -127649 31387 29241 -73355 -66410 101986 42678 87706 -55767
12411 242499 -119528 -101423 110742 102128 509626 74721 -73598 -129225 -209237 -197493 -368561
12400 -368561 164623 -33685 -54196 -262534 -332326 108378 -91830 158495 -50156 130373
12389 53945 -38679 -217283 -174205 334720 58528 -36590 -271598 -133418 79304 -36933 -74774
12378 -74774 109733 -148398 80369 52259 4130 118061 281569 75214 3921 -443428 127121
12366 220153 -20646 393896 -13663 -42234 -47500 -108577 117332 -60237 243546 76709 -30179
12354 271090 -169036 -61069 -374417 362508 -125005 -49477 79154 -241263 149822 138304
$$ packed form
12434a8939B45239a42749C48368j26007G5435d55103b09960b2886B43781E384
12423C12359a28865j66575a27649C1387k146g3355O945A01986D2678M5028e5767
12411B42499a19528J8105A10742q614M07498G4721g3598n5627q0012J1744j71068
12400c68561A64623c3685k0511k08338o9792A08378i1830A58495e0156A30373
12389E3945c8679j78604M3078C34720E8528c6590k35008a33418G9304c6933l7841
12378g4774A09733a48398H0369k8110D130J13931J63508G5214C921d43428A27121
12366B20153b0646C93896a3663k8571n266o1077A17332f0237B43546G6709c0179
12354B71090a69036f1069l13348C62508a25005d9477G9154b41263A49822j1518
$$ plain form
12344 138304 180700 -275982 363697 35687 -2764 -55010 66690 -91445 -13829 -45619 41320
12332 -77247 -160815 -246805 59484 -54239 -224001 199665 47928 247389 95153 143767 -360771
12320 17439 114980 240141 126967 4522 -208779 28347 338852 195349 255466 88264 62187
12309 62187 -69095 -58024 71146 215260 74799 -114419 315751 153438 -31152 287960 -273575
12297 334806 238474 -63703 -40176 -17288 40723 189936 171777 9537 -252910 13648 57236
12286 57236 106488 137806 170003 -163250 14271 162749 -43129 243396 58889 10520 81139
12275 81139 200693 201012 -60893 184261 153314 34330 299348 252189 -103795 371968 203120
12264 203120 216692 291004 -98052 -146018 -70226 298766 -204157 43543 302826 51363 142029
$$ packed form
12344A38304M2396b75982C63697C5687b764n2246F6690i1445a3829l1790D1320
12332g7247q3568q5990E9484e4239j69762A99665D7928J99461I5153M8614c60771
12320A7439R7541J25161j13174D522b08779B8347L10505j43503O0117H8264k6077
12309F2187f9095J1071G1146J44114G4799a14419C15751A53438c1152B87960b73575
12297C34806r6332f3703K3527a7288D0723J49213j8159I537b52910A3648M3588
12286E7236M9252L1318L2197a63250A4271J48478d3129B43396E8889A0520P0619
12275H1139J19554L19f0893A84261l0947C4330K65018m7159a03795C71968j68848
12264B03120J3572P4312i8052m7966g0226B98766b04157D3543K59283E1363R0666
$$ plain form
12253 142029 -85414 -254826 274666 -2649 116988 44901 431493 212290 175053 -84277 -41467
12241 65181 190061 -315454 70157 76034 285176 463342 71442 -22082 302881 121189 363106
12230 363106 394512 38280 83805 138375 366005 203499 143347 129708 109341 -29072 61565
12218 134269 142369 275722 25850 607581 156161 478734 349777 -289255 310647 333981
12208 333981 95660 -84094 21825 40301 22853 279983 200110 61866 36090 244484 182483
12197 182483 -87941 -188750 92831 297117 54393 94485 295784 126352 5357 8729 94601
12186 94601 -16887 426860 155041 -6355 257010 -9194 184019 126710 437458 307983 316185
12175 316185 397499 248483 417103 129506 -29744 -66948 323266 -68178 337657 -150099
$$ packed form
12253A42029h5414j69412B74666b649A16988D4901L86592B12290l7237h4277d1467
12241F5181J24880c15454G0157N877K09142J78166G1442b2082C02881A21189K41917
12230C63106L1406C8280M5525N4570K27630j62506o0152j3639k0367b9072F1565
12218A34269Q100J33353B5850N81731A56161L22573j28957b89255C10647K3334
12208C33981I5660h4094B1825J8476j7448K57130p9873F1866k5776K08394o2001
12197A82483h7941j00809I2831K04286E4393M0092K01299A26352E357L372Q5872
12186I4601a6887D26860A55041f355B57010i194A84019n7309L10748j29475Q202
12175C16185Q1314j49016J68620A29506b9744l7204C23266f8178C37657a50099
$$ plain form
12164 264638 358297 33370 -9047 137301 -114319 172478 116727 36880 139534 254372 390838
12153 390838 318744 214703 140454 344762 154941 107817 319072 249311 405298 342244
12143 342244 503066 207048 128040 110470 191829 199645 153507 40778 -8907 -284476 72632
12131 -16231 -202280 257257 402634 216011 20660 -305855 135952 -187544 187955 -15490
12120 95551 -62708 100089 126211 178879 302783 139635 -71076 -151285 109828 -83609 10854
12108 144530 101212 442653 -106565 -104222 -90669 201402 45620 -226774 275101 70429 121478
12097 121478 -105663 -69078 231372 207595 -10910 -10925 126332 88838 96447 77725 175458 -62273
12084 532725 178710 217645 -99666 -216313 118184 300947 -220616 220853 281126 -229103
$$ packed form
12164B64638R3659C3370i047A37301a14319A72478n5751C6880J02654J14838J36466
12153C90838p2094j04041p4249K04308A54941m7124K11255o9761J55987o3054
12143C42244J60822B07048p9008j7570Q1359P816m6138D0778h907k75569G2632
12131a6231j86049B57257J45377j86623B0660c05855A35952a87544A87955a5490
12120I5551f2708A00089K6122N2668J23904A39635g1076q0209A09828h3609A0854
12108A44530m3318L41441a06565K343J3553B01402D5620b26774B75101G0429N1049
12097A21478a05663L6585B31372k3777a0910j5A26332l7494P609j8722R7733f2273
12084E32725A78710L8935i9666j16647A18184J82763b20616B20853O0273b29103
$$ plain form
12073 43028 190508 398699 185474 -99457 274667 39579 72444 423850 139411 247405
12063 247405 -25918 34763 222608 221487 112721 175194 82353 -190326 176726 209228 153068
12052 153068 106257 168145 102607 -135576 96970 95759 -147912 170193 118090 -45646 44923
12040 -24322 127896 6687 -201598 98519 259471 249897 121410 107410 -71145 -110612 -113424
12029 -113424 -101231 295610 298527 387440 256991 43605 -105466 -60830 -183064 257171 175482
12018 175482 -87791 16455 15249 -216999 -41260 -304739 142336 -258389 -97752 -85111 -97315
12007 -97315 -57669 290644 -171910 -224883 72319 23455 -144288 56444 47494 -2260 259148
11995 229942 480 -119658 106157 59424 -144841 -52129 101891 395588 64116 -320180 488974
$$ packed form
12073D3028J47480K08191A85474i9457B74667C9579L2865L51406A39411J07994
12063B47405b5918C4763J87845j121j08766O2473H2353a90326A76726L2502n6160
12052A53068m6811O1888o5538a35576I6970j211a47912A70193n2103d5646D4923
12040b4322A27896F687b01598I8519J60952r574A21410j4000g1145l9467k812
12029a13424J2193B95610K917Q8913j30449D3605a05466M4636j22234B57171q1689
12018A75482h7791A6455j206b16999d1260k63479A42336b58389i7752J2641j2204
12007i7315L9646B90644a71910n2973G2319B3455a44288E6444q950b260B59148
11995B29942D80a19658A06157m6733a44841e2129A01891K93697F4116c20180D88974
$$ plain form
11983 33646 -152727 -52095 -122381 292229 23968 53448 289212 280715 -84593 70503 242635
11972 242635 53484 -70170 82122 75263 9190 -108193 238442 -122746 -93587 221218 7165
11960 117355 -41873 -23708 329372 -361965 40868 -43906 212921 115556 -47648 -59777 57504
11948 -66190 63663 -185903 260138 -75735 52048 13222 264555 -17734 -137986 -259779 -61507
11936 75040 -154931 73538 34931 358857 418963 -233326 -92836 90789 -3509 214273 7245
11924 54247 -49036 68386 -186640 82196 -87494 -87209 204560 -16316 82800 -104283 297464
11912 -325952 -230817 8313 1575 295112 26915 -194357 -95632 49837 166593 52649 -102145
11900 119472 -92252 -358863 155702 127134 76134 -321915 -108118 -74978 171222 -265568
$$ packed form
11983C3646a52727e2095p0286B92229B3968K9480K35764q497h4593G0503J72132
11972B42635E3484g0170H2122o859I190a08193B38442a22746K9159B21218G165
11960A17355d1873J8165C29372c61965D0868d3906B12921r7365d7648j2129E7504
11948f6190F3663a85903B60138g5735E2048A3222K51333a7734j20252j21793f1507
11936G5040a54931G3538C4931L23926O0106b33326i2836I0789c509B14273G245
11924E4247d9036F8386a86640H2196h7494K85B04560a6316H2800a04283B97464
11912c25952R5135H313A575K93537B6915a94357i5632D9837J16756E2649a02145
11900A19472i2252k66611A55702k8568n1000c21915a08118L3140A71222b65568
$$ plain form
11889 -134425 85779 58963 -211313 20968 48150 253838 -263038 164328 -210875 -106894
11879 -106894 -275105 -268923 -196358 202486 114848 149973 -175090 -102967 -114789 -67981 -275879
11868 -275879 4342 108033 152069 242774 -321470 32006 135436 72185 129030 -147086 147154
11856 -27340 200391 -112073 -134074 -146309 -211906 -11365 -111665 -105686 79500 -322360 -115584
11844 179544 -262016 146534 294575 -270028 -71747 -12811 343335 142268 2985 178607
11834 178607 168161 -149975 213098 -165879 -295463 -16986 -109534 -219264 5070 -15405 -4629
11822 -37959 -26926 -150575 -235423 -264336 -59922 -124254 177326 -35898 -248664 -58222 283894
11810 -76964 -413568 -1542 99604 -112903 -385770 189953 57649 -194868 -36392 -42734 -40562
$$ packed form
11889a34425H5779k6816b11313B0968K7182K05688b63038A64328b10875J03981
11879a06894j68211O182P2565B02486q7638L5125a75090P2123j1822M6808k07898
11868b75879D342J03691M4036R0705c21470C2006J03430o3251N6845a47086A47154
11856b7340B00391a12073k2001j2235o5597a1365j00300N979G9500c22360a15584
11844A79544b62016A46534J48041b70028g1747a2811C43335A42268B985J75622
11834A78607j0446a49975B13098a65879j29584a6986r2548j09730E070a5405d629
11822c7959J1033j23649q4848k8913e9922o4332A77326c5898k12766e8222B83894
11810g6964l36604a542I9604a12903k72867A89953E7649a94868c6392o342K172
$$ plain form
11799 -40562 -52604 344808 -56978 -59808 70857 167804 -124624 -104921 40987 113742 147599
11788 147599 -9019 -186203 86764 328161 -54918 -358894 -114228 188050 -129620 86275
11777 41943 -304399 192509 -71092 404221 -90042 157937 -155351 82551 41159 1408 -218503
11765 32712 21460 114428 -173922 182225 -267782 67490 -131708 -172475 5563 -8880 136554
11753 -17531 -308371 -84647 252594 34988 -128163 -21865 49535 137063 84333 -182048 -128344
11742 -128344 -168350 28872 -213547 -49271 -150427 99820 98088 149662 -127493 -12600 148254
11730 76910 -338950 -245805 -127924 35798 363816 79274 -37738 -53131 -5550 538 -98923 125777
11717 17258 -86541 37654 22141 -29255 -34071 -19680 28878 343954 -27443 -196 134078 -138349
$$ packed form
11799d0562j2042C44808e6978k830G0857R6947a24624J9703D0987P2755L3857
11788A47599i019j77184H6764K41397e4918l03976a14228A88050a29620H6275
11777D1943c04399A92509g1092D04221i0042A57937a55351H2551D1159A408b18503
11765C2712j1252R2968a73922A82225b67782F7490a31708m0767E563h880A36554
11753a7531k90840h4647B52594C4988a28163b1865D9535Q7528n2730a82048N3704
11742a28344m0006B8872b13547d9271j01156I9820j732N1574a27493a2600A48254
11730G6910c38950R3145J17881C5798L28018G9274c7738j5393e550E38i8923A25777
11717A7258h6541C7654j5513b9255m816J4391B8878L15076b7443a96A34078a38349
$$ plain form
11704 -71104 104417 -51302 -37207 99409 -135971 -70559 286 -228449 -172172 70429 -88957
11692 -4500 30778 -186070 43769 197343 53724 -108792 -55853 -166256 525305 -116327 369526
11680 249999 -23457 -49905 189990 -38253 -12615 165843 -30553 -311122 80006 -206947 -153784
11669 -153784 -215096 133764 -205213 -196320 -87526 -133721 104601 -143517 -114776 258533 67519
11657 43820 -241410 -144376 -168698 -52606 116324 402072 -166807 -6147 369235 -98491 -189009
11646 -189009 414639 -309669 84894 126128 63265 -116715 -30745 -58338 37162 132330 -125887
11634 232776 76386 203856 -27437 90307 -81184 -244784 77238 -37023 13011 400355 41250
11622 -43304 -157226 -293155 63860 87334 -61161 -9022 -182315 91866 -48369 -113269 130534
$$ packed form
11704g1104A04417e1302J4095I9409a35971O5412B86b28449N6277G0429h8957
11692d500C0778a86070D3769J53574E3724a08792N2939j10403E25305a16327C69526
11680B49999b3457k6448A89990c8253a2615A65843c0553k80569H0006b06947N3163
11669a53784o1312A33764b05213Q893h7526m6195A04601a43517K8741B58533F7519
11657D3820b41410R7034k4322e2606A16324K85748a66807f147C69235i8491r0518
11646a89009D14639c09669H4894M1234o2863a16715c0745k7593C7162R5168a25887
11634B32776G6386J27470b7437I0307h1184j63600G7238c7023A3011L87344D1250
11622d3304j13922j35929F3860K3474f1161i022j73293I1866d8369o4900A30534
$$ plain form
11610 -81573 206840 130660 -56860 -289575 -31836 114471 -409658 166602 273604 216338
11600 216338 -255829 -31195 -233865 251159 28713 114403 118241 53474 180869 49243 -33275
11588 215930 1997 107569 136634 127619 66082 -200603 105495 27292 85045 -96529 321022
11576 31060 -160438 -171799 73233 97272 88146 6461 90753 83221 68921 246206 11918 104781
11564 104781 256316 36152 143852 -5349 548825 -190578 140533 -320605 -44931 368843
11553 43192 216577 310952 -203648 362810 -414722 -76205 -156 95014 396536 239733 151503
11542 151503 52864 -144518 -50795 -59389 -114627 42179 19531 -194287 -42620 328156 117454
11530 11513 -281499 200458 -91321 91609 45145 136503 310849 -249193 -35375 35269 243912
$$ packed form
11610h1573B06840p6180e6860k32715c1836A14471d09658A66602J07002n7266
11600B16338b55829c1195k02670B51159B8713Q5690L838E3474J27395D9243c3275
11588B15930A997J05572K9065r015o1537b00603A05495B7292N7753i6529C21022
11576C1060a60438j1361G3233K4039r126F461Q4292p532j4300J77285A1918R2863
11564A04781J51535C6152J07700e349E48825a90578A40533c20605d4931C68843
11553D3192J73385R4375b03648C62810d14722g6205a56I5014L01522j56803q8230
11542A51503E2864a44518e0795q594n5238D2179A9531a94287d2620C28156A17454
11530A1513b81499B00458i1321I1609D5145R1358J74346b49193c5375C5269K08643
$$ plain form
11519 243912 211935 117805 -57308 23327 193210 79829 198993 -145114 -123362 -114400 143281
11507 -45965 59534 116265 165507 413622 79967 -445012 194983 103542 264872 -147470 305287
11495 155009 24649 86798 -66524 -183171 -60252 -333153 -52040 42997 371724 41555 48945
11484 48945 -222647 3530 112563 91148 42828 290207 -51379 38797 -87020 290464 162616
11473 162616 33726 -203059 -191996 -16841 225576 99751 -39585 181132 42706 165263 268346
11462 268346 -72794 62263 -106702 -211638 241631 245127 -41086 65435 76377 -9556 45426
11450 240597 -44930 476914 475597 116192 167424 319384 124297 -7285 -24088 363038 -13717
11438 -1911 25360 36816 223120 -39040 384224 372307 178730 21849 158484 -64267 154475
$$ packed form
11519B43912l1977r4130e7308B3327J69883G9829J19164a45114K1752Q962A43281
11507d5965E9534N6731M9242K48115G9967d45012A94983r1441J61330a47470C05287
11495A55009B4649O2149f6524j16647f0252k72901e2040D2997L28727D1555P390
11484D8945b22647C530J09033k1415D2828K47379e1379C8797h7020B90464j27848
11473A62616C3726b03059J1063a6841B25576I9751c9585A81132D2706J22557J03083
11462B68346g2794F2263a06702j04936B41631L496d1086F5435J0942i556D5426
11450B40597d4930D76914j317A16192N1232J51960A24297g285j6803C63038a3717
11438a911B5360J1456J86304c9040C84224j1917A78730B1849J36635f4267A54475
$$ plain form
11426 -61608 -35829 -31861 263675 -63675 -70379 -18026 146678 107559 211296 150000 90283
11415 90283 -436068 116880 107167 -291175 3852 -395355 -403411 -249230 152485 391096 1048
11403 -54496 -181602 29039 8157 -314617 347834 -31386 -138660 -230797 74991 -174071 -293932
11392 -293932 242664 217181 129 -139035 -261838 275614 -55238 402664 55163 349916 70283
11380 -63855 141576 61141 66303 -10057 109159 -3541 -367522 56748 -284611 121461 -154989
11368 -170213 297316 -418106 13231 -99270 7661 152784 384530 -2933 120437 168202 64185
11356 153314 16771 -335935 159274 -11815 -399970 -51058 -151709 -404815 -512285 -203663
11345 -76 224851 104297 319009 -113211 167562 -91575 -352849 18619 132306 -65706 -318200
$$ packed form
11426f1608K5779L968B63675f3675o704a8026A46678l9119J03737o1296n9717
11415I0283d36068A16880r713b91175C852c95355q056J54181A52485K38611A048
11403e4496j27106B9039H157c14617C47834c1386j07274r2137G4991a74071j19861
11392b93932B42664k5483A29a39035j22803B75614e5238D02664E5163K94753G0283
11380f3855A41576F1141N162a0057A09159c541l63981E6748b84611A21461a54989
11368a70213B97316d18106A3231i9270G661J45123K31746b933A20437M7765F4185
11356A53314A6771c35935A59274a1815l88155e1058j00651k53106j07470b03663
11345g6B24851A04297K14712a13211A67562i1575k61274A8619J13687f5706k52494
$$ plain form
11334 -318200 136301 -72228 392955 -102156 -99038 149116 73361 123473 -7019 -327546 24332
11322 -59351 -73000 -82552 147054 188842 -266873 13707 -268921 -263621 15903 2299 -595 -295342
11310 -295342 64345 -103020 189729 -2885 131925 57258 125613 -137193 -177005 340632 -261324
11298 126608 -68048 86800 158511 29289 221195 -164210 38812 46996 127992 -370994 -316728
11287 -316728 77085 -129845 38946 38070 -189111 -184402 253607 -3199 -242503 10270 49040
11276 49040 -78277 -203570 -50549 -7423 -128342 -126003 -49448 -205789 -353635 -74114 171220
11264 -26927 -52877 -92632 122499 102671 -208759 58351 42016 224543 -58321 -35502 -130870
11253 -130870 -10711 -409290 363015 76518 -136835 83016 -272384 -140213 -64928 -122445
$$ packed form
11334c18200A36301g2228C92955a02156L118A49116G3361N0112g019l20527B4332
11322e9351j3649r552A47054M1788b66873A3707b68921N300A5903B299e95k94747
11310b95342F4345a03020A89729b885A31925E7258O8355a37193l9812C40632b61324
11298A26608f8048H6800P1711B9289J91906a64210C8812Q184Q0996c70994N4266
11287c16728G7085a29845C8946q76a89111M709B53607c199k39304A0270L8770
11276D9040g8277j25293e0549g423j20919K339d9448j56341j47846g4114A71220
11264b6927k5950l9755A22499j9828b08759E8351j6335J82527e8321K2819r5368
11253a30870a0711l98579C63015G6518a36835H3016b72384J32171f4928n7517
$$ plain form
11243 -122445 229240 -163019 -58020 -101300 26313 -244491 -276607 -41790 52853 -140193 -86692
11232 -86692 -162075 -284374 30822 -36814 -242814 174740 -6925 -231557 85974 -474895 -223891
11220 -46603 43611 -55051 10700 207524 3412 -5154 -19408 -520 221772 -141397 -75610 -489632
11208 -489632 -441638 -147421 -112765 -174995 47867 98850 -54104 -83207 123930 -158241 -88220
11197 -88220 -141014 -85951 -275542 19184 -160580 222340 238778 201681 -123474 -93400 -257445
11186 -257445 -112484 -179225 -258458 -327475 -201429 28235 -88708 -219482 -165920 14292 -120906
11174 -143642 75518 -56423 -372506 -104575 3638 -60520 -11200 -19191 -222742 45130 -444284
11162 102000 -111971 -241382 166867 -3348 17864 113812 16181 -47716 186142 -13772 -222202
$$ packed form
11243a22445B29240a63019e8020m3280B6313b44491l2116d1790E2853a40193N3501
11232h6692p5383j22299C0822c6814k06000A74740f925k24632H5974d74895b23891
11220d6603D3611e5051A0700J96824C412e154j4254e20B21772a41397O5787m14022
11208d89632M7994a47421L4656o2230D7867N0983e4104k9103A23930a58241P0021
11197h8220n2794N5063j89591A9184a60580B22340J6438l7097a23474L0074j64045
11186b57445a12484o6741p9233o9017J26046B8235h8708j30774N3562A4292a20906
11174a43642G5518e6423l16083a04575C638f0520a1200p991k03551D5130d44284
11162A02000a11971j29411A66867c348A7864R5948A6181d7716A86142a3772k08430
$$ plain form
11151 -222202 -144082 -53322 -58137 16493 -357365 82730 -54667 -378886 -368203 -275214 142382
11139 -2798 175230 106297 -48526 -187824 322008 -190366 -256629 142237 -24149 254117 -25806
11127 390398 -41697 -170110 84966 10905 79318 -182313 -243944 197730 34638 139486 257616
11116 257616 -82491 -415148 -80128 197671 13148 -623829 -230063 -25880 -260006 -66981
11105 175182 -160971 8059 325919 -137464 226388 -147318 -151646 -140071 125885 432298
11095 432298 254426 -43862 5356 211315 -155137 -337227 310699 102341 243705 68205
11084 56578 -393247 239342 169361 -126881 207900 93534 460327 128383 -195123 79898
11073 -12638 422021 366774 280162 -143729 310888 205862 143768 266534 101677 -45205
$$ packed form
11151b22202P8120e3322m815A6493c57365H2730e4667l24219J0683R2989A42382
11139b798A75230o8933d8526j39298C22008a90366o6263A42237b4149B54117b5806
11127C90398d1697j28413H4966A0905O8413a82313o1631A97730C4638J04848J18130
11116B57616h2491l32657h0128A97671A3148f23829b30063b5880k34126f6981
11105A75182a60971H059L17860a37464B26388a47318m328J1575A25885L06413
11095D32298j77872d3862E356K05959a55137j82090C10699A02341J41364F8205
11084E6578c93247B39342o9981a26881B07900I3534L66793A28383a95123G9898
11073a2638D22021n5247q6612a43729C10888j05026o2094J22766A01677d5205
$$ plain form
11062 310577 134079 317959 435809 323289 218267 164870 155501 480199 430932 45943
11051 109316 254324 218656 147984 441792 159208 312634 441391 403358 489933 631427
11041 631427 336064 335319 467372 539318 458896 568122 451731 621875 663945 493493 467345
11030 467345 615542 287247 887070 1061849 596958 599103 788904 719797 812498 442164
11020 442164 681606 528399 599070 792049 579373 204919 695206 475213 408207 293584
11010 293584 294695 377583 428457 778968 732128 215732 373216 585059 639770 342464 663827
10999 663827 354220 538887 787083 500080 471127 699433 485733 519749 623326 816368
10989 816368 376976 309960 723940 641294 781158 401162 732801 722170 612493 747746
$$ packed form
11062C10577A34079J83880J17850j12520j05022n3397r369L24698m9267D5943
11051A09316J45008l5668p0672K93808A59208J53426J28757l8033Q6575J41494
11041F31427k95363p45J32053P1946q0422J09226j16391J70144M2070j70452k6148
11030D67345J48197B87247N99823J74779m64891K145J89801o9107R2701l70334
11020D42164K39442j53207P0671J92979k12676B04919M90287k19993o7006j14623
11010B93584J111Q2888N0874L50511m6840B15732J57484K11843N4711k97306L21363
10999F63827l09607J84667K48196k87003k8953K28306k13700L4016J03577J93042
10989H16368C76976o7016M13980q2646J39864l79996L31639j0631j09677J35253
$$ plain form
10979 747746 277201 205776 688099 733199 474064 787723 382726 642026 602728 606308
10969 606308 553769 901818 775481 899829 706764 921511 999487 1359364 1297034 1399830
10959 1399830 1175717 1267713 1478314 1909028 1867339 2193612 1876189 2233026 1901789 1901399
10949 1901399 1900620 1623754 1178897 1735364 1354367 1570472 1657276 1387618 2012622 1547169
10939 1547169 1568406 1565181 1165855 1538347 1318602 1248046 1221205 698362 798955 680190
10929 680190 699850 325997 537650 282378 438823 33824 20596 295662 203675 36313
10918 320405 32141 282926 -256208 144428 115560 222623 -130125 87786 21540 179159
10908 179159 26558 32934 95179 -288965 -109583 -168870 -91761 -104207 -76432 58599 146824
$$ packed form
10979G47746B77201p1425M82323M5100k59135L13659C82726K59300l9298L580
10969F06308n2539L48049j26337J24348j93065K14747P7976L59877o2330J02796
10959A399830k24113R1996K10601M30714m1689L26273l17423L56837l31237l90
10949A901399p79k76866m44857N56467l80997K16105Q6804k69658O25004m65453
10939A547169K1237l225l99326L72492k19745p0556k6841n22843J00593j18765
10929F80190J9660C25997K11653k55272J56445C3824j3228K75066r1987C6313
10918C20405C2141K50785b56208A44428k8868J07063a30125H7786B1540J57619
10908A79159B6558O376O2245b88965a09583n9287P7109j2446K7775E8599Q8225
$$ plain form
10897 146824 -287744 -69842 157987 -35846 67078 -250145 185187 10652 96084 97832 -72544
10885 -164192 -91565 -41080 204871 -78587 -30568 -316532 -10551 95592 -270710 -212820 71085
10873 -62769 22321 5650 64350 107409 -469975 -18583 96641 281410 -298203 265736 -101811
10861 28769 181581 -92973 -183131 144513 -87195 85760 -58962 128387 98415 -90859 -372800
10850 -372800 184963 -9932 2667 -69793 -136157 -249037 121375 -182386 -289961 75931 -38256
10838 -261248 114302 94239 -203085 -80054 166597 -106003 123980 -134209 -48796 -191131
10828 -191131 130090 152420 134199 98115 25190 -231362 -52408 -245626 -102470 160822
10817 -37239 -69554 104246 -91986 357210 -114796 -198224 -101948 -66129 -196242 8686 -166369
$$ packed form
10897A46824b87744f9842A57987c5846F7078b50145A85187A0652Q5432J748g2544
10885a64192P2627d1080B04871g8587c0568k85964a0551I5592b70710N7890G1085
10873f2769B2321E650N8700M3059d69975a8583I6641J84769b98203B65736a01811
10861B8769J52812i2973r0158A44513h7195H5760e8962A28387k9972i0859k81941
10850c72800A84963i932B667f9793o6364j12880A21375a82386j07575G5931c8256
10838b61248A14302k0063b03085h0054A66597a06003A23980a34209d8796j42335
10828a91131A30090K2330j8221l6084B5190b31362e2408j93218a02470A60822
10817c7239l2315A04246i1986C57210a14796q3428R6276L5819j30113H686a66369
$$ plain form
10805 329430 -243762 28056 -137946 219691 11300 -123318 214555 70700 194989 -410023
10794 194080 149816 -181053 72486 34823 116109 74980 32603 -81773 44227 -51776 -107423
10783 -107423 167481 37513 -37433 -199855 -181044 -52095 -214116 -104040 -221922 -198303
10773 -198303 -86877 286518 93700 17322 -81082 -163791 103196 -205669 57376 177425 92236
10762 92236 66380 -250192 -216715 -31565 -244234 -243581 144392 -91286 -54957 -183396 -98375
10751 -98375 70101 -214624 -24337 -226444 -183487 -102219 352119 115673 -361135 -2072 122964
10739 -47863 -311478 107796 258269 -296052 -115531 -184544 289905 -3604 -286698 249486
10728 -212575 14542 -107484 -3037 668 47195 -312055 -149303 -27009 -131021 -194105 -210506
$$ packed form
10805C29430b43762B8056a37946B19691A1300a23318B14555G0700J24289d10023
10794A94080m4264a81053G2486C4823Q1286m1129C2603h1773D4227e1776n5647
10783a07423A67481C7513c7433j62422J8811e2095j62021a04040j17882K3619
10773a98303h6877B86518I3700A7322h1082q2709A03196b05669E7376J20049q5189
10762I2236k5856b50192L3477c1565k12669O53A44392i1286L6329j28439Q5021
10751i8375G0101b14624b4337k02107M2957Q1268C52119A15673c61135b072A22964
10739d7863k63615A07796J50473b96052a15531o9013B89905c604k83094B49486
10728b12575A4542a07484c037F68M6527c12055a49303b7009j04012o3084j6401
$$ plain form
10717 -210506 -251824 -240128 -119324 -6525 260494 -76990 -129661 -51787 -163777 -308175 184985
10705 -256508 -88555 -244670 -337380 -167301 238184 11886 13015 -30927 -162201 -131239 -227457
10694 -227457 -217325 12146 -167836 -135157 -222897 -164505 -155957 -109339 172064 133700 -27108
10682 5369 233972 21015 -48851 115542 229795 138481 -212720 -52052 -34307 -172056 139565
10670 -370951 224118 -145188 -172551 -134616 -219620 -251485 194302 -186511 -109417 -16483 18846
10658 59261 -191233 -53837 -70026 -24568 -101570 89961 175496 97999 -104569 -97340 35226
10646 -222234 -33145 -442418 -190879 -217135 -134455 -71418 -223543 -119913 2837 71370 174913
10635 174913 55673 -132596 -20287 -53736 144042 68881 -128875 -21555 -14345 -208173 -124229
$$ packed form
10717b10506m1318J1696a19324f525B60494g6990n2671e1787j11990j44398A84985
10705b56508h8555j56115r2710a67301B38184A1886J129c0927j31274L0962r6218
10694b27457J0132A2146a67836L2679q7740N8392Q548M6618A72064l8364b7108
10682E369K28603B1015d8851A15542J14253r1314b12720e2052J7745j37749A39565
10670c70951B24118a45188k7363L7935q5004l1865A94302a86511P7094a6483A8846
10658E9261a91233e3837j6189b4568p7002H9961Q5535p7497a04569P229C5226
10646b22234c3145m09273a90879k6256Q2680O3037j52125J03630B837O8533J03543
10635A74913E5673a32596b0287l3449A44042F8881a28875b1555P210j93828Q3944
$$ plain form
10624 -124229 81602 286306 -241364 259581 -249204 -3244 270050 133837 94196 289416
10614 289416 84731 40755 -388344 97138 79795 -121586 -111419 67332 -3381 -298867 -128686
10602 -235330 -100272 -89596 -23558 -23809 17329 -88038 64853 -253095 -157227 94891 -175215
10590 -261020 179893 -34904 -92603 11183 59617 13185 -152609 -61534 -14264 -333775 -54199
10578 71307 39535 -397793 -478635 -106623 198500 -72933 -435938 -140246 -8778 -137319 -105451
10567 -105451 -15737 143789 -471754 71444 -151933 -249331 114080 -23854 -59497 278451
10556 336647 164792 -75832 244835 129108 -77781 8468 -279102 -301051 -155019 -190811 139782
10544 -44968 305492 -191866 207842 203 76007 91911 301420 -36751 -120156 173058 -236544
$$ packed form
10624a24229H1602K04704b41364B59581b49204c244B70050A33837l9641J95220
10614B89416H4731D0755c88344I7138j7343a21586J0167F7332c381k95486a28686
10602b35330a00272J0676b3558k51A7329h8038F4853b53095R5868I4891a75215
10590b61020A79893c4904n7699A1183M8434A3185a52609f1534a4264l19511e4199
10578G1307l1772c97793q0842a06623A98500g2933l63005a40246h778j28541L1868
10567a05451a5737A43789d71754G1444a51933r7398A14080b3854l5643B78451
10556C36647A64792g5832B44835j15727g7781H468b79102k1949J46032l5792A39782
10544d4968C05492a91866B07842B03P5804J5904K09509c6751q3405A73058b36544
$$ plain form
10532 75952 -119755 -130222 442 -281834 389415 139463 -210633 148150 5855 -282513 -233842
10521 -233842 -108164 -370494 122005 177877 -87750 -40989 -48301 94323 -776 -173087 -223498
10510 -223498 18017 17421 282103 151006 -9466 -269625 -287567 148629 124776 -285859 -153236
10499 -153236 64863 -124171 -205905 -84364 -484125 84899 -287590 66187 -86577 130145 107340
10488 107340 -235913 -239483 3865 153623 176387 -56975 -397844 -298259 -123301 90898 29321
10476 -249419 -234309 217316 42335 -99721 -289736 -55320 7102 -99405 -210718 -119752 91986
10464 172537 224615 491605 195413 336464 456269 279547 225071 519387 187151 189082
10454 189082 367978 170553 47406 -167983 95399 93943 -121903 -192331 39842 -287533 -67687
$$ packed form
10532G5952a19755j0467D42b81834C89415A39463b10633A48150E855b82513M8671
10521b33842a08164k62330A22005N5872h7750d0989p312I4323g76j72311n0411
10510b23498A8017n96K64682j31097i466k60159j7942A48629k3853b85859J32623
10499a53236F4863a24171q1734h4364l99761H4899b87590F6187h6577A30145k2805
10488A07340b35913l570C865J49758K2764e6975l40869R9585a23301I0898B9321
10476b49419J5110B17316D2335i9721j90015e5320G102i9405j11313R0966I1986
10464A72537N2078K66990A95413J41051J19805j76722n4476K94316A87151J931
10454A89082J78896A70553D7406a67983I5399j456a21903p0428C9842b87533f7687
$$ plain form
10442 -3397 -138631 72258 37619 -19128 -138608 -154182 188031 82659 -24366 249674 183992
10431 183992 50027 -23940 17906 -82531 -186491 248141 -68419 -95901 -19533 88688 -63436
10419 10275 -10852 -134866 301165 -257795 -2317 32277 -212363 24806 127108 22642 -241536
10407 -47065 25179 186234 118982 -429857 -198739 48882 -315374 91239 -157373 -35506 -128440
10396 -128440 106208 -178812 -168441 -244156 -129774 -230274 -117652 156216 -97165 -73373
10386 -73373 -139 -174310 63895 45771 -112393 25989 -111722 -250417 414380 -115744 77489
10374 73019 181549 272387 285975 133038 84598 -141010 239981 195409 -125991 159578
10363 348017 71850 279346 70346 62596 380858 52818 224352 225636 -18382 290264 287762
$$ packed form
10442c397j35234G2258l4639a9128j19480j5574A88031H2659b4366B49674o5682
10431A83992E0027b3940A7906h2531j03960B48141f8419k7482a9533H8688f3436
10419A0275a0852j24014C01165b57795b317C2277b12363B4806J02302B2642b41536
10407d7065B5179J61055o7252d29857a98739D8882c15374I1239a57373c5506r2934
10396a28440A06208a78812J0371p5715J14382j00500J12622A56216i7165K3792
10386g3373a39j74171F3895j8124a12393B5989a11722j38695D14380a15744G7489
10374G3019J08530R0838J3588A33038m8440a41010B39981m4572a25991A59578
10363C48017G1850K07496G0346p750L18262E2818J71534J284a8382B90264k502
$$ plain form
10352 287762 202806 150075 359333 -23926 290883 538241 120579 307992 198489 306550
10342 306550 120599 264860 65865 14765 378238 63228 209491 369445 74026 356998
10332 356998 158643 377160 205229 376175 142417 27632 -50117 212777 381133 335247
10322 335247 179136 430017 262601 230059 -6510 202692 237243 26529 43001 45624 -115945
10310 101217 85172 -34283 20177 271214 169273 -82405 119580 297809 -25607 -102672 238537
10298 -106375 -80730 218113 -182433 246217 -100410 -1756 -53057 -33534 10245 -75110 -34054
10286 -242260 88423 81298 -158455 -100557 -55364 208981 -204402 -101640 -153264 -245090 -257666
10275 -257666 -277937 142529 -120447 -99928 163001 -156864 183980 -407203 -60178 -48315
$$ packed form
10352B87762q4956n2731K09258b3926B90883K47358A20579J87413j09503J08061
10342C06550A20599J44261F5865A4765L63473F3228J46263J59954G4026K82972
10332C56998A58643K18517j71931J70946A42417B7632e0117B12777J68356m5886
10322C35247j56111K50881j67416l2542f510B02692L4551B6529J6472K623a15945
10310A01217j6045c4283B0177K51037j01941h2405A19580J78229b5607p7065B38537
10298a06375K5645B18113a82433B46217a00410a756n1301J9523A0245g5110c4054
10286b42260H8423p125a58455N7898M5193B08981b04402a01640n1624r1826j2576
10275b57666k0271A42529a20447K0519A63001a56864A83980d07203f0178J1863
$$ plain form
10265 -48315 -13691 -167436 -109262 -96669 -31182 78732 -1750 174262 -7683 343382 59920
10253 -254382 -242005 58823 -81911 -287512 11664 240576 -231023 -124451 71149 -131190
10242 -156781 117535 380635 21687 253151 307824 295950 246504 526570 314590 51082
10231 63434 51131 -249936 -71067 -15418 282399 227524 16542 -129131 -426088 -12514 -12942
10220 -12942 323587 124761 269191 328563 46416 -160556 9082 -89491 -148547 59512 -89570
10208 -243709 -34051 50606 -24586 83006 -115767 -85101 -191881 -36784 -203429 -163499 -42873
10196 111651 -96862 -252696 123165 58770 484315 -133953 152923 167375 -104989 -28659
10185 -117362 441275 7587 -460416 -76388 5559 -29 -31704 -91965 119464 92971 -169004 -3418
$$ packed form
10265d8315a3691j53745N8174J2593c1182G8732a750A74262g683C43382E9920
10253b54382J2377E8823h1911k05601A1664K28912b31023J06572G1149a31190
10242a56781A17535K63100B1687K31464N4673j1874m9446K80066k11980E1082
10231F3434j2303b49936g1067a5418B82399n4875A6542a29131k96957a2514m28
10220a2942C23587A24761J44430N9372D6416a60556I082h9491n9056E9512h9570
10208b43709c4051E0606b4586H3006a15767L0666j06780c6784j66645L9930d2873
10196A11651i6862j55834A23165E8770M25545a33953A52923J4452a04989b8659
10185a17362D41275G587d60416g6388E559b9l1675o0261A19464k6493a69004c418
$$ plain form
10172 176135 -461573 -407332 -219200 -162067 -148919 -62420 189802 -310984 -217142 -360012
10162 -360012 -30617 -50304 -54039 -195000 9307 -84281 -25491 58319 -253591 -46398 -159732
10151 -159732 108442 313044 -467364 52761 -104501 -158072 -217490 155531 -81897 -70675
10141 -70675 -175036 179160 -139121 68576 78732 66340 307240 356104 41766 -99590 -178977
10130 -178977 135963 90427 -60119 -22261 249047 101504 -52348 -347131 -357266 448292
10119 70621 -31226 -30810 -389727 -5435 -103100 -62698 -7296 10764 -162045 -43166 -282877 107922
10106 -361613 49075 -198094 108047 -96662 -269147 179587 15620 181280 -33473 -225172
10096 -225172 139622 -44587 -72247 -85601 -150476 -119343 55125 -423175 1427 158378 -235890
$$ packed form
10172A76135d61573N4241J88132N7133J3148f2420A89802c10984R3842j42870
10162c60012c0617j9687l735j40961I307h4281b5491E8319b53591d6398j13334
10151a59732A08442K04602d67364E2761a04501n3571n9418A55531h1897J1222
10141g0675j04361A79160a39121F8576J0156j2392K40900M8864D1766i9590p9387
10130a78977A35963m5536f0119b2261B49047A01504e2348k94783j0135D48292
10119G0621c1226M16l58917e435r7665M0402g296A0764a62045d3166k39711A07922
10106c61613D9075a98094A08047i6662j72485A79587A5620J65660c3473j91699
10096b25172A39622d4587k7660j3354o4875L1133E5125d23175A427J56951b35890
$$ plain form
10084 64848 63605 -19089 -223353 226696 67296 -92863 -160943 -365661 5158 -82329 -129244
10073 -129244 86420 -27055 -48438 224004 -162384 -167305 -202195 -318295 4932 -168147 110012
10061 37651 -36782 -49369 9602 -393026 -119935 -88847 236565 -49856 -66069 -228197 -339647
10050 -339647 24780 78632 19609 -185581 -148935 235972 -246093 93686 -24105 -133942 151362
10038 -97006 210022 -172592 -306990 -92927 -73368 -123594 90012 21041 -31799 86242 103654
10027 103654 66108 244294 148820 -23305 -143200 60639 -275370 -3108 -319590 -158184 -183343
10016 -183343 -59002 109902 -59897 -83291 -308375 -296205 -157871 212055 -136070 -34397
10005 190457 152223 -33532 303197 -70327 12754 259646 -145602 208657 -234283 254139
$$ packed form
10084F4848j243a9089k04264B26696F7296i2863o8080k04718E158h2329m6915
10073a29244H6420b7055k1383B24004a62384m921l4890j16100D932a68147A10012
10061C7651c6782j2587I602c93026a19935L1088B36565d9856j6213j62128j11450
10050c39647B4780N3852A9609a85581L6646B35972b46093I3686b4105j09837A51362
10038i7006B10022a72592j34398i2927J9559n0226I0012B1041c1799H6242J7412
10027A03654l7546J78186r5474b3305j19895F0639b75370c108l16482a58184k5159
10016a83343e9002A09902e9897k3394k25084J2170J38334B12055a36070c4397
10005A90457l8234c3532C03197g0327A2754K46892a45602B08657b34283B54139
$$ plain form
9994 112529 -379970 -121960 157620 -97796 187975 -108845 168204 -69924 -173307 -42913
9983 -25944 41773 -34443 -209478 -95256 61145 113116 -161388 -338078 22782 80958 -324412
9971 -221024 75009 -126549 13403 -315124 -255576 -2555 -136128 110261 284769 -102638 47354
9959 86517 -206939 -59136 96816 65799 -877 -182095 -232405 18903 82380 72537 -154403 -576203
9947 -576203 16114 44569 -171385 -42151 -241074 -125225 -13837 -122168 -196548 41563 -78999
9935 -515479 -36376 -141848 -205694 -112548 101711 -256555 -102983 -29211 -112084 -261066 196503
9923 224070 -278028 -21048 -110153 -4868 -66532 -45220 -91463 -255148 -62035 -217386 153789
9911 -270233 -213368 -139240 -109250 240856 86179 194116 -400254 -158906 -160211 -928 99765
$$ packed form
9994A12529c79970a21960A57620i7796A87975a08845A68204f9924j03383d2913
9983b5944D1773c4443j75035i5256F1145N1971a61388j76690B2782N8176c24412
9971b21024G5009a26549A3403c15124N9548b555j33573A10261J74508a02638D7354
9959H6517b06939e9136I6816l1017h77j81218n0310A8903O3477r843a54403m21800
9947e76203A6114K8455a71385d2151j98923J15849a3837j08331p4380D1563g8999
9935e15479c6376j05472o3846R3146A01711b56555a02983b9211q2873j48982A96503
9923B24070b78028b1048q9105d868o1664K1312m6243j63685f2035j55351A53789
9911b70233N6865P4128K9990B40856H6179J07937d00254a58906j305i28I9765
$$ plain form
9899 293553 144715 -18504 -325053 -260680 -151631 -260383 -125388 -54914 -72314 183456
9888 -129693 135870 2262 -101552 118255 -7913 82472 -281994 -73045 -197821 105169 203403
9877 203403 6660 -32585 -175094 -175655 19148 -180089 47247 -491447 -198504 -112476 144192
9865 -144512 -178609 -162398 159100 -302850 -125604 -276488 -100746 -163593 -28470 44933 -99453
9853 -187553 -18862 -198422 -30485 -77164 -239192 33674 98350 -215736 -188737 86845 24757
9841 77924 -27672 -136913 -255817 181077 20969 91020 -90906 -294978 -82863 285496 -89426
9829 106047 -108477 -436499 -144760 -172658 -75570 -427397 -159929 166917 162209 -226519
9818 -271984 -342981 195326 -228029 192696 -131556 217449 -216674 203360 44371 -28115
$$ packed form
9899B93553A44715a8504l06549O4373J09049j08752a25388e4914j7400A83456
9888a29693A35870B262a01552A18255g913H2472b81994g3045j24776A05169R8234
9877B03403F660c2585j42509n61A9148a80089D7247d91447a98504Q6028A44192
9865a44512l4097J6211A59100c02850a25604j50884a00746o2847b8470D4933i9453
9853a87553a8862j79560c0485m6679j62028C3674O4676b15736K6999H6845B4757
9841G7924b7672j09241j18904A81077B0969P0051i0906k04072h2863B85496h9426
9829A06047a08477l28022a44760k7898g5570l51827a59929A66917m708b26519
9818b71984p0997A95326b28029A92696a31556B17449b16674B03360D4371b8115
$$ plain form
9807 -32879 6398 450534 -252060 -202467 288717 -100034 -75379 -400837 -88824 -50710 -40551
9796 -40551 -234304 -367294 209679 -76547 -210473 -252954 200853 -125209 -32773 -51082 -7465
9784 -171316 231729 -88041 -202027 -205956 -312874 -10827 -40351 -149232 -152524 -16841 -75967
9773 -75967 -113499 -306083 96029 111708 -93248 -102434 8520 -4189 54802 -124044 74229 -170199
9760 -91410 253923 -229951 79623 -406658 -42882 -13578 -217375 -215597 -271095 -266173 -342210
9749 -342210 9457 -267631 -177166 -63009 -188638 -356604 195298 -207052 301963 59314 -152025
9737 -343807 -165600 75185 315441 -177684 -198238 236624 -108480 -44612 2189 -86601 -363288
9726 -363288 36062 -71071 -60256 349950 243121 112678 -182218 286400 309396 -264356
$$ packed form
9807c2879F398M44136b52060M9593B88717a00034K4655l25458h8824L8114J0159
9796d0551j93753j32990B09679g6547j33926m2481B00853a25209c2773j8309g465
9784a71316B31729h8041j13986l929j06918a0827k9524j08881l292a6841n9126
9773g5967l7532j92584I6029J5679i3248r186H520d189E4802a24044G4229a70199
9760i1410B53923b29951G9623d06658d2882a3578k03797J778n5498M922p6037
9749c42210I457b67631R0465f3009j25629j67966A95298b07052C01963E9314a52025
9737c43807a65600G5185K40256a77684k0554B36624a08480d4612B189h6601k76687
9726c63288C6062g1071J0815C49950j06829A12678a82218B86400K2996b64356
$$ plain form
9715 -167227 111082 56347 -16392 -322434 -244410 -104638 -2029 -67255 -7659 28563 -227484
9703 -49110 15461 -69288 -117644 -85265 -88098 90380 20433 11062 -182371 -174812 -72213 -273968
9691 -273968 4553 -225944 61893 45449 -321563 -243351 -29460 -173471 -110383 -63565 -344269
9680 -344269 95644 -131308 -190216 -138290 -92329 151439 -296809 -86310 9567 -266037 -159516
9669 -159516 85150 346805 -976 -98263 118542 72424 -31401 -303962 41669 -290540 88460
9657 -43902 39607 77215 93162 68666 -462436 -25664 -71735 -270209 -40753 155753 40906
9645 -127907 -259736 109042 -66799 -228507 102958 36643 73771 -290172 -174272 199040
9634 -233645 49447 247905 -238325 -310410 -215700 -402872 132664 2027 -138795 144172 -372346
$$ packed form
9715a67227A11082n4735a6392l06042P8024a04638b029o5226g659B8563b27484
9703d9110A5461f9288m8356L2379k833I0380B0433r371a82371P559g2213k01755
9691b73968D553b25944F1893j6444c21563P8212b9460j44011O3088M6818k80704
9680c44269I5644a31308n8908N1926M5961A51439b96809h6310I567b66037J06521
9669a59516H5150K61655i76r7287A18542m6118c1401k72561D1669b90540H8460
9657d3902C9607L7608J5947k4496d62436b5664m6071j98474d0753A55753D0906
9645a27907j31829A09042f6799j61708A02958C6643L7128b90172J15900A99040
9634b33645D9447J98458b38325p2085R4710j87172A32664B027a38795A44172c72346
$$ plain form
9622 -78289 -204236 143499 85338 364290 -191150 -33337 184794 -178798 -164495 -96885 -210102
9611 -210102 75095 -182919 -365684 -210508 112244 162178 -70504 -360301 -30005 -199678
9601 -199678 -304470 -232342 144201 -317973 -280049 130344 71327 -19331 -49186 -12975 -187786
9590 -187786 164217 -187646 -5665 -324224 74403 -69979 39727 39057 -246134 -53952 34215
9578 -273159 30781 -114709 -121945 -36035 -172547 -124907 -290144 21288 -340543 200450 -169987
9566 -69952 38530 125691 228858 1934 24548 70542 12772 189977 12419 -137157 -38747
9554 -124290 135686 -115613 185069 66269 -300181 -123048 -98884 -194002 -121787 -81594 -153384
9543 -153384 -29307 -194426 142571 -34833 -212211 -285103 -61996 66174 101736 225930 -168336
$$ packed form
9622g8289j25947A43499n8161K78952a91150c3337A84794a78798J4303O7610j13217
9611b10102G5095a82919j82765J55176A12244M9934g0504k89797c0005j69673
9601a99678j04792P2128A44201c17973L7924A30344n9017a9331k9855a2975j74811
9590a87786A64217a87646e665l18559G4403f9979C9727o70b46134e3952C4215
9578b73159C0781a14709p236c6035j36512M7640j65237B1288c40543B00450a69987
9566f9952C8530Q7161J03167A934K2614M5994A2772J77205A2419a37157c8747
9554a24290A35686a15613A85069F6269c00181a23048K4164r5118P2215M0193p1790
9543a53384b9307j65119A42571c4833j77378p2892f1996F6174L5562J24194a68336
$$ plain form
9531 -150605 -9806 154511 -222727 -177855 12404 306138 -106905 -268694 75623 33347 -261471
9519 -56596 183466 -33677 -17144 -113481 70195 -223647 -274345 -206310 -71679 -206460 -107432
9508 -107432 -232434 -137432 -103308 -216478 156063 -491888 -135939 -189679 -35734 -70864 72148
9496 -272369 -226398 10532 -38690 -55904 -276777 -82974 -41186 -366508 116842 -327101 -267409
9485 -267409 -16068 -157022 259313 -210663 -186926 31540 -48599 -137956 -130121 398249 23926
9473 -131072 -164754 69295 -301416 -437062 156550 -150549 -152056 -175573 127937 10498 -119093
9461 -387063 -15870 -241853 -33515 -27257 -121514 153766 -329500 -212407 -70867 -69090 105883
9449 -116038 -118083 5034 131629 -255134 -162269 -55933 -125601 221893 36571 -27896 99479
$$ packed form
9531a50605i806A54511b22727M4872A2404K93734a06905j61789G5623C3347b61471
9519e6596A83466c3677J6533r6337G0195b23647n0698O8035g1679j34781R9028
9508a07432j25002R5002L4124j13170A56063d91888a35939n3740c5734l5130G2148
9496b72369M5971A0532c8690j7214k20873h2974d1186l25322A16842c27101N9692
9485b67409a6068j40954B59313b10663K3737C1540d8599q9357P835C98249B3926
9473a31072l3682F9295c01416j35646A56550a50549j507k3517A27937A0498a19093
9461c87063a5870k25983c3515O258r4257A53766c29500J17093g0867J777A05883
9449a16038k045E034J26595b55134R2865e5933o9668B21893C6571b7896I9479
$$ plain form
9437 -309707 145117 200948 -62665 -230171 -21419 -41399 -186704 -75062 -23808 131144 -196282
9425 72445 161470 -98013 -102603 213204 -105340 -179417 -184364 290452 201823 5597 73733 -462396
9412 -96773 -351429 371016 -280917 -1739 -237683 -163048 -190335 -156850 -130839 -37524 39927
9400 -36355 -52075 7647 -405970 -343469 -107944 92311 205109 -220608 -234925 159505 -267607
9388 -150271 232784 -193650 -122126 -175302 191467 -99055 86103 -380635 302246 -429797
9377 182149 -41750 125685 -171473 62134 96461 -198648 -8843 -116399 204002 -36000 6602
9365 12246 29460 -57805 -28810 86293 135248 -27590 37628 -257762 -19039 -98808 -86553 132521
9352 -113829 -72068 -131602 -65393 37495 -79549 -249296 -89941 185253 -42854 -132560 -167755
$$ packed form
9437c09707A45117N5831f2665j67506b1419j9980j45305g5062b3808A31144a96282
9425G2445Q9025i8013m590B13204a05340p4077m947B90452q8629E597O8136d62396
9412i6773k54656C71016b80917a739k35944P4635k7287L3485K6011c7524C9927
9400c6355j5720G647d05970O2501a07944I2311J12798b20608j4317A59505b67607
9388a50271B32784a93650P1524n3176A91467i9055H6103c80635C02246d29797
9377A82149d1750A25685a71473F2134L4327a98648h843j07556B04002c6000F602
9365A2246J7214e7805b8810H6293M8955b7590C7628b57762a9039p9769J2255A32521
9352a13829M1761n9534f5393C7495g9549j69747h9941A85253d2854q9706l5195
$$ plain form
9341 -167755 -35483 71980 -102229 42074 -51035 -351 -44631 -198515 -267130 -198527 52031 30487
9329 30487 -214179 -303373 150888 63071 73505 269029 -205356 -107738 -173883 -73546 -147117
9318 -147117 -195703 -326318 -211955 22906 -333421 -279380 479733 -296149 -41879 205059
9307 -274713 105730 -87410 -39418 84656 -65330 289869 -58633 -61919 -92175 102390 -80785
9295 -177858 -154960 96012 -334074 -111505 -174213 -63031 -251683 122694 -42601 -180352 36657
9283 76685 -83950 -127114 51656 -117339 -57120 144499 -11430 -263364 -166851 13235 -204860
9271 -27148 -139033 104035 -281336 -277363 121920 -371341 44837 -209057 -99599 -309705 153118
9259 -448789 -237184 -396655 170914 50668 16492 -146785 -86757 194951 -194213 46830
$$ packed form
9341a67755c5483G1980a02229D2074e1035c51m4280j53884o8615O8603E2031k1544
9329C0487b14179q9194A50888F3071J0434J95524b05356R7618o6145g3546p3571
9318a47117m8586j30615J14363B2906c33421N4041D79733b96149d1879B05059
9307b74713A05730h7410c9418H4656f5330B89869e8633l286l0256A02390h0785
9295a77858K2898I6012c34074a11505o2708f3031j88652A22694d2601j37751C6657
9283G6685h3950m3164E1656a17339e7120A44499a1430k51934R6513A3235b04860
9271b7148j11885A04035b81336L973A21920c71341D4837b09057i9599k10106A53118
9259d48789K11605j59471A70914E0668A6492a46785O0028A94951a94213D6830
$$ plain form
9248 -133513 -227363 -171770 78647 -521031 -89949 136374 132523 -372815 -110474 165543 -91803
9236 -133058 90007 -26493 -35138 -214666 2114 -315071 -22248 276271 179669 -102689 -255396
9225 -255396 151640 -29479 -50165 -47683 -220772 -35740 -28829 179769 -99184 -226675 129043
9213 88666 -52822 7512 -60799 233185 -214962 31812 -50993 -208502 -193632 -247642 -232393
9202 -232393 73565 73406 -83262 -260577 -306456 -188756 -111317 -159905 -201930 -79187 32199 -54933
9189 -45211 -45744 167904 236344 -201495 -32959 37671 -325582 -290327 272141 -23784 -207084
9178 -207084 120587 -291494 121920 -36406 -54898 42258 62764 -34643 2664 -350514 -121347
9166 47346 -180250 23140 -368853 152331 102027 282305 176948 -270995 -145643 46386
$$ packed form
9248a33513r3850N5593G8647e21031h9949A36374l851c72815a10474A65543i1803
9236a33058I0007b6493q645j79528B114c15071b2248B76271r6602a02689j52707
9225b55396A51640b9479k0686K482j73089c5740O911A79769i9184j27491A29043
9213H8666e2822G512f0799B33185b14962C1812e0993j57509J4870n4010J5249
9202b32393G3565j59h3262j77315m5879J17700P7439m8588m2025g9187C2199e4933
9189d5211n33A67904O8440b01495c2959C7671c25582L5255B72141b3784j83300
9178b07084A20587b91494A21920c6406j8492D2258K0506c4643B664c50514a21347
9166D7346a80250B3140c68853A52331n0304J80278j05357b70995J25352D6386
$$ plain form
9155 -39844 -162914 -134885 262719 6545 16300 -30428 -150480 175763 -61836 -343908 68245
9143 27236 94056 -61212 -177767 13276 -52702 -206627 369506 -438426 -24966 71658 -509630
9131 82429 46105 -176681 -187820 124567 -86004 152921 171370 -46798 147470 -252440 -65464
9119 -37936 -168109 -181864 213768 -80550 -298730 -64901 100460 -32989 -111288 168353 -181426
9107 -279800 -238131 -148058 -6486 -224772 -150511 -74014 -197640 -105396 24580 -273195 68686
9095 -328937 92030 107978 138270 43756 39895 -23695 155175 177711 -111157 -45824 103415
9083 -129424 156372 -57919 -208287 -163723 -6038 4954 -52482 -147869 255250 -101782 -36262
9071 144911 37309 128310 -37910 -208070 -25281 221040 -243656 -2167 -167435 -101577 -10951
$$ packed form
9155c9844j23070K8029B62719F545R755c0428j20052A75763f1836k82072F8245
9143B7236O6820f1212j16555A3276e2702j53925C69506d38426b4966G1658e09630
9131H2429l6324a76681j1139A24567h6004A52921J8449d6798A47470b52440f5464
9119c7936j30173j3755B13768h0550k18180f4901A00460c2989p8299A68353a81426
9107b79800M1669R0073f486k18286P4261g4014j23626R2244B4580b73195F8686
9095c28937I2030J5948L0292D3756l861b3695A55175K2536a11157d5824A03415
9083a29424A56372e7919j50368M4564f038D954e2482r5387B55250a01782c6262
9071A44911C7309R1001c7910j70160b5281B21040b43656b167j65268O5858a0951
$$ plain form
9059 -22874 48093 120730 -8377 -113521 -355256 -111258 -27118 18678 -120698 -67682 12515
9047 -81102 -254485 -33783 -35011 -336646 -112746 -276011 152689 -148121 230851 -421554
9036 -74715 -442572 -37056 -31707 31811 46916 32423 -49196 302625 86233 11118 -121347
9024 46002 -56549 -178262 -152503 -407637 -170891 157674 174463 -119781 -349677 141316
9013 1420 -225513 -101707 -83750 -148824 -547240 -322035 35418 16218 74035 -215591 -38892
9001 -94865 -8105 -11069 -166283 -103069 58019 -33254 89379 -304521 -58692 82759 231861 33913
8988 5786 -162515 -326623 74880 138248 -40972 -71076 -249537 42883 -77115 -10095 24042
8976 -462264 -33241 43655 124222 12815 409765 123389 -60229 -137878 165005 -451605 132251
$$ packed form
9059b2874D8093P2637h377j05144k41735a11258b7118A8678a20698N3016A2515
9047h1102j73383c3783j228l01635a12746j63265A52689a48121B30851d21554
9036g4715l67857c7056N349C1811J5105j4493d9196C02625H6233A1118a21347
9024D6002e6549j21713K5759k55134a70891A57674J6789a19781k29896A41316
9013A420b25513a01707J7957o5074l98416K25205C5418A6218N7817b15591c8892
9001i4865h105k964j55214O3214E8019c3254H9379c04521e8692H2759J49102C3913
8988E786a62515j64108G4880O3368d0972l0104j78461D2883g7115a0095B4042
8976d62264c3241D3655Q0567A2815L96950A23389f0229p7649A65005d51605A32251
$$ plain form
8964 80606 -57011 -179554 175682 -117986 -220110 -42317 -334367 -410250 14798 75254 85251
8953 85251 -65515 -457463 -147526 -12228 -251769 73032 -76845 75063 -88669 -33049 -436411
8942 -436411 177886 166110 235968 71433 105157 -19089 190708 -87495 -215889 -202406 -454936
8931 -454936 -147225 -68155 153096 173991 309862 -138739 316398 -271817 5495 -166249
8920 -177408 -295198 -84919 18059 139485 253820 20351 299029 210227 -43566 -139535 283953
8908 391522 367701 652369 1548595 2430877 4761962 8052764 3778546 1827795 877599
8898 398223 504376 243054 -20205 211789 155861 437972 -212640 191285 266998 -35394
8887 -392764 -195099 -22315 -1928 -126425 -138670 -110860 67054 -25291 140702 -47888 -308906
$$ packed form
8964H0606e7011j22543A75682a17986j02124d2317k92050p5883A4798O0456R997
8953H5251f5515l91948a47526a2228k39541G3032g6845G5063h8669c3049m03362
8942d36411A77886j1776O9858G1433L3724a9089A90708h7495j28394J3483k52530
8931d54936a47225f8155A53096K0895J35871a38739C16398b71817E495a66249
8920a77408j17790h4919A8059J21426J14335B0351K78678q8802d3566r5969B83953
8908C91522k3821K84668Q96226Q82282K331085L290802C778546A827795H77599
8898C98223J06153B43054b0205B11789n5928K82111b12640A91285P5713c5394
8887c92764a95099b2315a928j24497j2245K7810F7054b5291A40702d7888k61018
$$ plain form
8876 -308906 101713 -146555 -65302 -213420 -114139 -209628 185197 -41443 -6220 212346 -248943
8864 413016 206525 183082 125005 169134 -245616 -152569 -140220 134864 -145727 210497 -53601
8852 41448 -340087 -240541 116707 73040 167757 -361889 -132777 14034 -527484 -41327 -117075
8841 -117075 -68429 -208829 -63249 -111730 47566 -238846 299645 -58707 149732 -224896 -140990
$$ packed form
8876c08906A01713a46555f5302j48118R9281r5489A85197d1443f220B12346b48943
8864D13016k06491k3443n8077M4129b45616R3047J2349A34864a45727B10497e3601
8852D1448c40087R9546A16707m3667R4717c61889a32777A4034e27484d1327p5748
8841a17075M8646j40400f3249m8481D7566b38846B99645e8707A49732b24896Q3906
$$ [...]
##END NTUPLES=NMR SPECTRUM
##END=
