
##TITLE=AC1111_Colombia_5835338_vh2UkRcLu9
##JCAMPDX= 6.0         $$ Bruker NMR JCAMP-DX V2.0
##DATA TYPE= NMR SPECTRUM
##DATA CLASS= NTUPLES
##ORIGIN= BRUKER
##OWNER= Administrator
$$ 1.72 TOPSPIN		Version 2.1
$$ 2012-04-10 11:08:10.093 -0500  Administrator@TOPSPIN
$$ Compression mode = diff/dup
##.OBSERVE FREQUENCY= 400.13188235
##.OBSERVE NUCLEUS= ^1H
##.ACQUISITION MODE= SIMULTANEOUS (DQD)
##.ACQUISITION SCHEME= undefined
##.AVERAGES= 8
##.DIGITISER RES= 22
##SPECTROMETER/DATA SYSTEM= spect
##.PULSE SEQUENCE= zg30
##.SOLVENT NAME= COFFEE_meoh
##.SHIFT REFERENCE= INTERNAL, COFFEE_meoh, 1, 14.98061
##AUDIT TRAIL= $$ (NUMBER, WHEN, WHO, WHERE, PROCESS, VERSION, WHAT)
$$ ##TITLE= Audit trail, TOPSPIN		Version 2.1
$$ ##JCAMPDX= 5.01
$$ ##ORIGIN= Bruker BioSpin GmbH
$$ ##OWNER= Administrator
$$ $$ C:\Bruker\TOPSPIN/data/COFFEE/nmr/AC1111_Colombia_5835338_vh2UkRcLu9/20/pdata/1/auditp.txt
$$ ##AUDIT TRAIL=  $$ (NUMBER, WHEN, WHO, WHERE, PROCESS, VERSION, WHAT)
(   1,<2012-03-28 02:03:07.500 -0500>,<Administrator>,<TOPSPIN>,<go>,<TOPSPIN 2.1>,
      <created by zg
	started at 2012-03-28 02:02:00.218 -0500,
	POWCHK enabled, PULCHK disabled,
       configuration hash MD5:
       1A 1E CE 29 27 FD 77 03 67 4E F0 E3 C4 B2 CB 90
       data hash MD5: 64K
       5C AF 7A BF C0 9A 12 32 0A 21 97 25 6C C9 12 58>)
(   2,<2012-03-28 02:03:10.953 -0500>,<Administrator>,<TOPSPIN>,<proc1d>,<TOPSPIN 2.1>,
      <Start of raw data processing
       efp LB = 0 FT_mod = 6 PKNL = 1 PHC0 = 0 PHC1 = 0 SI = 32K 
       data hash MD5: 32K
       CB 3B 32 C4 F7 15 99 B4 9D 12 BC BC 77 68 18 B1>)
(   3,<2012-03-28 02:03:11.296 -0500>,<Administrator>,<TOPSPIN>,<proc1d>,<TOPSPIN 2.1>,
      <pk PHC0 = 211.3824 PHC1 = 0 
       data hash MD5: 32K
       5F 51 4F FC B9 41 4E 76 6C 60 C6 7C 72 CC 8D 9C>)
(   4,<2012-03-28 02:03:11.359 -0500>,<Administrator>,<TOPSPIN>,<proc1d>,<TOPSPIN 2.1>,
      <abs ABSG = 1 
       data hash MD5: 32K
       A1 10 CB 80 BE 7C 47 87 38 80 94 FF C6 5B 71 FF>)
(   5,<2012-03-28 02:03:11.390 -0500>,<Administrator>,<TOPSPIN>,<proc1d>,<TOPSPIN 2.1>,
      <abs ABSG = 2 
       data hash MD5: 32K
       EE 4E 5B D1 D0 8D C9 1A 01 D4 06 A9 2F 8F A5 B7>)
(   6,<2012-03-28 02:03:11.421 -0500>,<Administrator>,<TOPSPIN>,<proc1d>,<TOPSPIN 2.1>,
      <abs ABSG = 3 
       data hash MD5: 32K
       DF 1D 53 32 00 48 59 27 F7 A2 04 5D 75 12 7D 3A>)
(   7,<2012-03-28 02:03:11.453 -0500>,<Administrator>,<TOPSPIN>,<proc1d>,<TOPSPIN 2.1>,
      <abs ABSG = 4 
       data hash MD5: 32K
       94 20 D7 49 5E A4 22 98 14 88 DA E4 78 67 9F A2>)
(   8,<2012-03-28 02:03:11.484 -0500>,<Administrator>,<TOPSPIN>,<proc1d>,<TOPSPIN 2.1>,
      <abs ABSG = 5 
       data hash MD5: 32K
       EE 72 E5 F8 A2 1B 73 29 A6 C6 A1 93 6D C6 58 FB>)
(   9,<2012-03-28 02:03:16.718 -0500>,<Administrator>,<TOPSPIN>,<audit>,<TOPSPIN 2.1>,
      <user comment:
       ICON-NMR User ID: COFFEE
       data hash MD5: 32K
       EE 72 E5 F8 A2 1B 73 29 A6 C6 A1 93 6D C6 58 FB>)
$$ [...]
150 150 150 150 150 150 150 150
##$TP07= 0
##$TPNAME0= <>
##$TPNAME1= <>
##$TPNAME2= <>
##$TPNAME3= <>
##$TPNAME4= <>
##$TPNAME5= <>
##$TPNAME6= <>
##$TPNAME7= <>
##$TPOAL= (0..7)
0.5 0.5 0.5 0.5 0.5 0.5 0.5 0.5
##$TPOFFS= (0..7)
0 0 0 0 0 0 0 0
##$TUNHIN= 0
##$TUNHOUT= 0
##$TUNXOUT= 0
##$USERA1= <user>
##$USERA2= <user>
##$USERA3= <user>
##$USERA4= <user>
##$USERA5= <user>
##$V9= 5
##$VALIST= <valist>
##$VCLIST= <CCCCCCCCCCCCCCC>
##$VD= 0
##$VDLIST= <DDDDDDDDDDDDDDD>
##$VPLIST= <PPPPPPPPPPPPPPP>
##$VTLIST= <TTTTTTTTTTTTTTT>
##$WBST= 2048
##$WBSW= 25
##$XGAIN= (0..3)
0 0 0 0
##$XL= 0
##$YL= 0
##$YMAX_a= 539058
##$YMIN_a= -661502
##$ZGOPTNS= <>
##$ZL1= 120
##$ZL2= 120
##$ZL3= 120
##$ZL4= 120
##$ABSF1= 14.98061
##$ABSF2= -5.57192
##$ABSG= 5
##$ABSL= 3
##$ALPHA= 0
##$AQORDER= 0
##$ASSFAC= 0
##$ASSFACI= 0
##$ASSFACX= 0
##$ASSWID= 0
##$AUNMP= <proc_prof1d_extract_pilot.lims>
##$AXLEFT= 0
##$AXNAME= <>
##$AXNUC= <1H>
##$AXRIGHT= 0
##$AXTYPE= 0
##$AXUNIT= <>
##$AZFE= 0.1
##$AZFW= 0.1
##$BCFW= 0
##$BC_mod= 0
##$BYTORDP= 0
##$COROFFS= 0
##$CY= 15
##$DATMOD= 1
##$DC= 0
##$DFILT= <>
##$DTYPP= 0
##$F1P= 0
##$F2P= 0
##$FCOR= 0.5
##$FTSIZE= 32768
##$FT_mod= 6
##$GAMMA= 0
##$GB= 0
##$INTBC= 1
##$INTSCL= 1
##$ISEN= 128
##$LB= 0
##$LEV0= 0
##$LPBIN= 0
##$MAXI= 10000
##$MC2= 0
##$MEAN= 0
##$ME_mod= 0
##$MI= 0
##$NCOEF= 0
##$NC_proc= -8
##$NLEV= 6
##$NOISF1= 0
##$NOISF2= 0
##$NSP= 0
##$NTH_PI= 0
##$NZP= 0
##$OFFSET= 14.98061
##$PC= 1
##$PHC0= 211.3824
##$PHC1= 0
##$PH_mod= 1
##$PKNL= yes
##$PPARMOD= 0
##$PPDIAG= 0
##$PPIPTYP= 0
##$PPMPNUM= 2147483647
##$PPRESOL= 1
##$PSCAL= 4
##$PSIGN= 0
##$PYNMP= <proc.py>
##$REVERSE= no
##$SF= 400.13
##$SI= 32768
##$SIGF1= 0
##$SIGF2= 0
##$SINO= 400
##$SIOLD= 32768
##$SPECTYP= <>
##$SREGLST= <1H.CDCl3>
##$SSB= 0
##$STSI= 32768
##$STSR= 0
##$SW_p= 8223.68421052632
##$SYMM= 0
##$S_DEV= 0
##$TDeff= 65536
##$TDoff= 0
##$TI= <>
##$TILT= no
##$TM1= 0
##$TM2= 0
##$TOPLEV= 0
##$USERP1= <user>
##$USERP2= <user>
##$USERP3= <user>
##$USERP4= <user>
##$USERP5= <user>
##$WDW= 1
##$XDIM= 32768
##$YMAX_p= 466004360
##$YMIN_p= -716544
##$CURPLOT= <Network HP LaserJet P1505>
##$CURPRIN= <$Network HP LaserJet P1505>
##$DFORMAT= <normdp>
##$LAYOUT= <+/1D_H.xwp>
##$LFORMAT= <normlp>
##$PFORMAT= <normpl>
##$SURQMSG= 1
$$ End of Bruker specific parameters
$$ ---------------------------------
##NTUPLES= NMR SPECTRUM
##VAR_NAME=  FREQUENCY,     SPECTRUM/REAL,   SPECTRUM/IMAG
##SYMBOL=    X,             R,               I
##VAR_TYPE=  INDEPENDENT,   DEPENDENT,       DEPENDENT
##VAR_FORM=  AFFN,          ASDF,            ASDF
##VAR_DIM=   32768,         32768,           32768
##UNITS=     HZ,            ARBITRARY UNITS, ARBITRARY UNITS
##FACTOR=    0.250966925370066, 1,           1
##FIRST=     8223.43324360095, 103327,       -203696
##LAST=      0,             -34628,          115869
##MIN=       0,             -716544,         0
##MAX=       8223.43324360095, 466004360,    0
$$ Real data points
##PAGE= N=1
##DATA TABLE= (X++(R..R)), XYDATA
$$ [...]
23763 -18795 182247 106164 167361 263592 -153154 -54751 -167519 91578 302763 40768 -20904
23751 -199481 74793 -35924 -51995 -139780 -27739 -71147 141002 -41742 263268 -132989 63195
23739 180670 297127 -95003 -277741 153278 -17929 -31141 -143387 -51634 37347 -412595
23728 149932 80957 -62234 -344730 59064 204960 -407 37248 -142653 167555 -456636 155856
23716 101124 -191682 -38513 106629 16038 -174895 15731 -110167 337058 44514 -315768
23705 89559 -109895 63340 82994 7439 -69375 -53203 91991 -148265 -93251 156287 -36067
23693 118453 -23162 -298329 -385414 -64328 135973 -76123 -75310 -165376 -31109 -90368 250597
23681 160657 -170207 -58779 -209670 60382 -276359 30364 251570 -69010 -55649 72445 6638
23669 -244038 75786 -178404 229015 281489 -89699 -130161 -137903 126993 -20739 32311 -40310
23657 43617 -85332 -215065 113028 -75289 -272019 -197226 -119134 -15023 -70567 55053 -7905
23645 171925 -210687 98199 -177165 319799 277412 292316 -10157 -141165 126881 198886
23635 198886 -210884 -63201 274162 25895 -38498 44757 -53302 -59690 -164573 -308154 107100
23623 299226 -192940 -238075 56009 -165165 -107615 206294 -299506 11853 -176221 -271587
23613 -271587 72868 -214156 -298966 -219819 -67146 -82665 32116 -215358 -423101 367800 91312
23601 -267631 128357 31048 -250909 389571 73661 -273843 72722 -79966 99788 -144884
23590 -76456 -174769 -61 -247069 53539 -125176 -157450 295730 57168 -436389 444564 185236
23578 7787 367896 290762 250966 297980 52715 -135977 124869 372760 -1100 -163762 292156
23566 33547 311227 50440 82418 -373759 242189 -3421 -76639 24250 78464 135685 150019
23555 150019 264784 -221713 -97127 76912 -101270 325897 -101302 64896 -313229 86974
23544 146793 132307 274455 -155871 -313163 -94599 -177862 170664 -19863 8430 -243076 -56618
23532 227244 -219662 -66756 -347015 351170 -271749 -38475 -123820 -155109 -45214 207057
23521 -41517 33371 -86674 9931 235082 83647 23957 -84623 131153 -8757 189930 -288782
23509 129863 -275229 26768 -127651 14080 -240145 48902 -123303 -473761 57689 -191740
23498 -120503 114833 -88129 -150538 146511 102800 126311 -227638 -393805 -146626 17468
23487 51111 -92344 -60965 90366 213631 95887 -62596 -260241 -5070 -374112 -399952 -97624
23475 141670 239972 -45095 -71793 -82272 -86409 -113613 42251 86547 -130389 163151 -265140
23463 -113544 -3132 -91864 -104615 122039 -16393 -20274 -86305 -40343 131851 -30017 93420
23451 -315969 -71312 287844 -3312 -329851 -130739 49529 -39128 -203912 -51433 -166809 -159840
23440 -159840 -84137 -88954 -173603 -23130 51220 -29576 295575 -170776 15302 -89625 110387
23428 -22643 -382515 109888 -166606 -48159 -134246 -179983 -159207 251106 -35745 -189597 -183652
23417 -183652 8535 45841 -354581 183604 6773 -73714 3997 37161 -61690 28534 -221831
23405 42050 -24822 642883 12594 -183971 -212971 -222850 202593 483864 -263326 143581 -252372
23393 3759 -956 -74103 -240542 50144 -394195 -52580 -5620 -26357 17875 -389349 28646 -144134
23380 347765 47036 251242 73303 25087 134126 12519 34650 -39970 144423 -33997 -106
23368 -5373 -6498 -183247 189776 174186 304142 -139477 86342 66220 276313 -88753 -210327
23357 -210327 -87051 237338 -36602 -12494 -86593 -29938 112985 -297787 -125153 -229143
23347 -229143 129990 -37983 -234726 -310951 -176014 -63675 163737 218739 408464 -185530
23336 -111652 202939 44454 115450 -306283 -164939 -194467 -393365 12108 304233 -231449
23325 423394 211816 110592 -91390 -157325 -114636 -384039 -115033 -368254 -52108 -187096
23315 -187096 108598 -71376 -166557 -120348 93241 -272784 -172080 -24672 -46320 175061 -59674
23303 -131186 150259 -202349 -212193 -77172 -113985 15703 -80030 118077 294 -212650 -183417
23292 -183417 229459 -139348 -18571 -183738 45343 79347 -233518 -50668 39915 59562 18268
23280 200675 -32031 -121605 -175137 235451 105659 15913 -92395 -266829 435349 54718 31181
23269 31181 -267857 157749 -70053 -137454 -409340 98926 -115424 31998 -198366 86628 32211
23257 -46432 -112365 -152696 -236409 164717 178234 146447 149899 248470 10905 9254 405980 61822
23244 79158 -161585 8670 -126172 105373 -86859 200426 39742 479533 -60253 -220481 68313
23232 -90684 -146294 55021 283598 -109738 -200848 -63603 -36864 -443724 -117184 51469 112620
23221 112620 293021 -135187 296224 109573 -66368 -314700 71396 -134254 -35387 -86406
23211 -86406 -78716 242535 -468156 879 -351783 -33700 -216713 172270 -86408 133596 -151905
23199 -120714 101560 84290 9513 -151158 -84338 76059 -250317 -68047 153804 -166779 -53516
23187 -129264 -9170 258905 84763 -152702 65276 57054 85326 -71171 287326 239085 84183
23175 -240044 -380445 -157155 -26238 46476 -64733 -110535 -17491 -196098 -57253 -77775 -132483
23164 -132483 -57870 -250251 -129767 -33866 -117787 69603 -73566 -92916 -117073 63744 -20814
23152 -55900 -263947 139464 -140816 109460 -412316 -48711 165003 65409 236669 -336900
23141 -50249 52439 95251 -186484 -115086 -110094 -97298 -49871 145386 -147352 -284956 -252988
23130 -252988 192359 89642 -58488 198153 -147677 -158870 -68305 -120937 147793 -230823
23119 -304393 37298 -96454 233473 101743 266430 -112030 402509 -189291 -132026 152697
23108 145556 18504 -86069 -46598 169668 83070 268984 117892 -304326 -132797 -109056
23098 -109056 -268261 18380 -39028 -39615 -50978 -20052 52796 -97651 -113799 246728 12759
23086 29042 -131984 144609 139472 29978 101399 -100751 61324 -172068 296133 63197 329798
23075 329798 74075 324799 195479 -108506 -12650 -281417 -65728 -398437 -7210 -219398
23065 -219398 -281115 -148230 546507 465722 -110865 -6951 215390 -158778 112678 44754
23054 16817 11371 277218 -83082 146658 207137 659 176162 -162766 -28419 -42140 115217
23042 89531 372452 172926 -4 117209 295063 -141387 64314 -60763 -150521 -38746 -122817
23031 -122817 214972 -71631 33551 81347 -37774 -166971 -86432 327097 579507 -213660
23020 175733 121801 359670 -117238 113735 321353 259367 -63448 -6734 95193 -1684 -65033
23009 -65033 14548 -111871 -28482 -126599 159689 -59881 33243 256891 -252742 -107184 87233
22997 -91418 -311957 11499 202039 -112342 338588 252601 -165385 -133110 -147892 -172611 69635
22985 -449330 129162 -193571 -9951 -384325 7175 -50061 -219566 114192 -281667 -22782 119729
22973 23556 -193768 -42060 -83571 -188975 212026 246897 1982 -101614 29682 -68750 -46862
22962 -46862 -29297 -246879 11881 -64164 -510618 -70285 109637 76637 -479323 -111436 -258512
22951 -258512 138269 -27503 -101330 -61946 441281 -287339 267875 -80145 87319 -144182
22940 72583 71889 -325593 -252447 -256674 49087 -69163 -136802 -472754 178573 93118 264032
22929 264032 300717 63741 -30558 132032 3832 14090 -33152 74809 -86541 79730 147518
22918 147518 -203359 71727 -147527 59925 -51822 -54402 -153698 -58760 -124122 -33302 -109500
22907 -109500 -314477 40914 -93767 -111238 152939 127215 -65146 -154604 -89832 -133194 283868
22895 20382 144369 -240703 -321886 -155077 98083 249741 -121406 -228368 -227588 188591 161650
22884 161650 276146 -31802 67294 132563 290577 -110946 5900 251042 27057 -1894 219795
22872 -227172 -319373 -118968 -158597 -167982 -46386 244069 -216808 109522 240674 -119684
22861 -125564 -285153 -19317 185370 -243703 -27915 102362 32139 -36380 -153162 -333919
22851 -333919 -98562 -304999 200827 -192765 -432897 -53201 254023 -215657 88404 -143471
22840 -75757 -460165 -117319 -430710 4585 -234203 15722 -66127 -419426 -88800 313971 152099
22828 -228317 -201717 -229091 -294311 -120572 435453 22334 182880 -154163 109456 -62582
22817 -62505 -140701 157676 -223726 91617 -124556 -256956 158267 -56480 164000 356836
22807 356836 -74374 227514 -69634 -55690 23226 -189298 15112 -100822 17274 -9280 -152445
22796 -152445 -42164 153591 235097 -162772 -29030 176012 -193370 -266742 -102410 -118799
22786 -118799 63929 -365020 243142 -231624 214816 -205441 -265789 -71407 18962 -15252
22775 -58558 -189242 16392 187935 221109 -97399 2151 -48960 -88766 -253 193810 -6143 -192868
22763 -192868 64967 5873 42046 -142135 -348531 -24486 182562 -140899 150609 -16999 -248616
22752 -248616 -64762 -50138 -355348 -408569 233803 132759 308786 40158 49160 -232486 22358
22740 -114645 86382 240001 -243449 -224279 -88239 -70259 -134490 20586 68858 -1515 -406870
22729 -406870 -270443 -90898 -70427 -308206 35662 106954 -10048 -388377 78603 -419 -21880
22718 -21880 111666 -345263 -49857 -79386 -49557 81264 -67557 116279 -66081 106531 319693
22707 319693 -143594 105769 -189413 191420 269208 18524 104005 -249882 142756 181551
22697 181551 320043 -313058 -99458 -431515 269363 -98722 -64385 -218015 34451 -29989
22686 -69778 -69135 -127960 7145 92872 123432 -75149 -68717 286788 -36283 -330788 97379 145208
22674 145208 24110 -174366 -40435 -97670 -21795 6979 394066 105869 176282 106162 -31648
22662 272700 -305980 404141 228471 -148538 -16507 -129077 -285744 -286311 215694 -1860 -451864
22651 -451864 -30244 -264087 -72519 245089 -128282 -199330 46791 -13344 50869 298946 72042
22639 -215343 98063 -39917 -209115 -93529 69260 85152 -14361 -36082 -98993 122415 -28482
22627 -226454 78569 -197748 138484 202993 202465 107493 120308 129512 -15604 -253291 -121944
22615 43423 -125954 -36659 294248 34481 -108409 -31330 71671 -45052 19518 -127728 186391
22603 229446 -292427 416755 -86054 -41231 142919 188192 233752 -23634 -121608 -172548 -128842
22592 -128842 -164926 -291430 -411846 -279541 -189451 -369771 -128037 177651 357956 -71520
22581 -215429 106267 115334 159883 -119124 -218966 -161874 83443 -56940 -280768 -60795 -424484
22570 -424484 -331736 230742 86115 32319 43858 -18365 200575 -216404 313781 -128055
22559 78012 17965 96039 -36338 35452 -279700 -172879 -80028 -154869 -107109 93551 -195597
22547 -19709 -182811 1584 -132426 -166136 -25938 -19873 -307079 52205 -46422 183475 192426
22536 192426 -323582 -322599 -104953 -142818 -103824 -153748 231399 21227 -180479 370437 -20398
22524 221442 -161855 218786 -79328 -259834 115387 77031 11667 211657 -158355 128115
22513 -38602 -169640 -51523 88789 295675 -91116 78075 -149452 -18116 -216875 130657 103886
22502 103886 -218498 -29702 45870 -7029 -144186 -27646 -62566 -86205 -188144 -67009 67779
22490 -192416 35985 324423 -36818 201586 -262293 -55594 -205640 -243243 -93630 131540
22479 -36535 -484967 -3237 100429 -87342 -366503 43944 159922 -65708 19001 -11918 101297
22467 207587 -57675 68807 71825 229385 -266552 118615 -93440 70208 -100125 -21853 -158128
22456 -158128 -25947 -289402 48102 -229445 -59287 -445106 -23865 -216727 188355 67303
22445 153571 -43261 75002 331187 106033 -147795 -106251 -264246 299241 126223 -5550
22434 -198917 -25289 38198 -85196 75769 -30913 128881 -164243 264009 -209023 138860
22423 -77647 -57590 -61602 15642 -86225 -261997 -348976 -31464 91350 -98327 -100475 202419 -77589
22410 -215951 157647 120105 117549 -134058 -378063 -26759 121047 -45354 -134800 125412 -78188
22398 188032 61648 -266422 117349 -279803 83724 38022 -96943 -81062 95869 353661 145265
22386 -1443 152397 -69698 -41567 -162110 -214328 6604 137261 -182765 119489 -42095 -127671
22375 -127671 -2819 -12610 127804 161472 -164296 -317835 -170628 113198 -384955 138435
22364 -9403 -223017 -230402 -314722 153337 -118836 168013 -161894 10781 68329 107024 405928
22353 405928 90835 97391 -10031 84647 -182664 -20218 -362922 -370090 -93537 -56216 -58481 -3688
22340 -172932 60163 -293875 108606 -129972 -148213 -203849 -335035 -183346 272811 189686
22330 189686 -120787 -6579 149209 -127221 -40642 -123516 -168021 -899 183847 -466885 -22477
22318 -160699 220010 -255964 -66474 7649 63008 -192570 59405 127850 -152251 -84541 179688
22306 59884 -610 -229019 3204 -85288 -140614 -397221 195771 -279522 144750 -116631 -4992
22294 -94454 -33004 10842 -111253 -151631 -255710 136942 10079 -113265 -240657 -159714 8823
22282 -91417 184282 -64456 -139169 -150439 -147260 -401697 -227643 -11569 -111731 34632 -38740
22270 -14066 148812 -39460 -215002 -231941 88965 -220603 -286494 228281 17933 -161352 -125091
22259 -125091 -162109 -145587 -356630 -167757 -10055 -229977 -461313 174048 -261721 -276803
22249 -276803 -19196 -263688 -67828 758 -42091 2884 -138637 -287213 70042 248783 74817
22237 20883 224380 -196075 -77301 111661 312956 -96994 92550 -163480 -124887 -106588 -50475
22225 -271884 -149863 -515797 201894 184778 -108427 -194574 16408 -234412 -225666 -135875 -37499
22213 -4395 -365181 -266799 -44485 30655 -156983 -189238 -32537 59675 -295724 -35430 -176249
22202 -176249 -141878 305470 -29195 -135685 29692 -105977 175187 -152491 -48287 116694
22191 -55863 53185 57609 -157816 -112450 84405 -166497 195905 6994 -127863 -30317 -251541
22180 -251541 170444 257883 -38863 -290768 -36978 -381491 -121831 -240397 -38115 41718
22169 314908 -25511 14225 -164877 -372697 -209599 326730 -247807 -62914 -238996 -203349
22159 -203349 -168379 -163865 73803 -391706 162690 101703 -282304 233114 -209725 -144944 -4412
22147 -172570 -248950 -186510 54596 -15864 -119446 -262643 -55558 -117337 -258665 -109231 192732
22135 -65919 -285566 -128268 -53623 44038 -158407 -329189 -111116 -85561 -273182 -326639
22125 -326639 -87148 -77658 -277639 121247 -214173 -81272 106313 -156274 34015 -391510
22114 142448 -272708 -17043 217248 -59049 -716544 97071 -121302 -67477 -224285 34755
22103 4622 -110262 106646 -260299 -207776 200473 -165216 -135164 -55874 420488 363964 48636
22091 54296 13980 -3221 -31227 89786 -26169 43787 -170801 -92411 -35741 147096 -14600
22079 -181961 -13026 68283 61346 197665 -102951 237437 -215093 -119724 -287095 3496 -133761
22067 -118045 -104119 31683 -111978 156305 -29781 68486 191499 -241979 -49903 -154301
22057 -154301 149656 -73104 19569 -203868 -353554 29950 -64065 -356559 318885 188307
22047 188307 -227645 -193764 138574 39909 -154188 -66482 366385 -174245 232768 -232846
22036 188714 16151 -137473 -21363 105013 137764 153776 55017 211089 3607 -59631 -194640
22025 -194640 -128651 -245276 -137435 -32005 22320 -204949 -73270 -271019 46203 315044
22015 315044 -113030 161772 -69520 26912 -154338 202203 299494 -1095 -37619 -177105 74378
22003 -65558 -169269 -424711 11001 87995 -508081 -136195 90741 -179758 -47980 56071 220844
21992 220844 -5084 -13715 -38805 -138633 117685 -258920 -73208 -10085 -126305 -236883 76494
21980 -71287 -289996 -158488 -358218 -106850 -8236 -309019 -175451 -64926 89752 94813 -117486
21968 79279 190187 33707 144453 136374 -367215 -2720 -201239 137751 -88303 251899 -24337
21956 -191788 133886 23283 151839 51934 -93923 -185247 -41621 267648 -174053 -4409 190144
21944 -13602 3046 39422 -101595 69712 -289771 34776 -640212 91981 26099 -179620 -205750
21933 -205750 48230 -54430 -21874 -251722 -179326 -94716 123650 -410765 395 -115507 -146770
21922 -146770 -178367 254842 167654 183166 14073 61210 -268303 -13067 -208134 -385506 92885
21910 -162246 126383 -98432 -180916 -126244 169687 -173806 312445 -6695 219599 -222197
21899 -6489 -126745 93549 -219980 -9867 46568 118203 -218626 80866 -154912 -145459 26755
21887 -299116 -87376 -77034 -139789 -389768 78925 -42948 271061 -113424 116528 -50087 74755
21875 -159563 4984 36625 79798 -159030 -191195 111454 -370284 178744 31892 124837 8952
21863 80918 -215384 -135552 -33255 228606 -67871 -252955 -161949 219840 -112125 -31281 44111
21851 -97742 232378 -253703 6146 -57909 217806 117748 -97663 -164629 151053 -10909 8455
21839 -105405 17977 264235 -20236 -277537 -329851 -23886 -38109 2325 -5676 -14714 7068 151238
21827 151238 -52770 -94287 -57009 -315655 -94770 -344800 -300203 -144410 107109 111708 4514
21815 -267031 158686 137131 -216801 -80722 -56981 -465376 -271897 -40687 -202090 -116028
21805 -116028 -162488 325092 20696 -372896 78465 55719 -134051 -9060 -141773 58941 378478
21794 378478 -50866 -83833 124138 165213 -110391 -34550 -375645 -254870 -27673 118264
21783 -226437 -2113 -266127 64907 -411640 -65682 -160463 -95578 -144626 -183681 -116544 -71769
21772 -71769 200396 -86485 219748 -36788 -80720 -136536 -61873 -69453 86958 -173047 -20506
21760 -369413 -91556 -136134 87369 -8671 -27432 489218 -142287 -78586 54388 203766 -22769
21748 -163580 -16290 221727 -35981 259539 120377 -209888 182229 -154127 -106110 -259834
21738 -259834 20733 104074 -31387 -87659 134649 -140404 57086 -41089 40882 204373 -210374
21726 56369 175847 17743 71546 65873 149262 155658 -114256 111301 -194910 -42513 -26673
21715 -26673 -139624 222435 -32396 -103625 -6646 -124360 -96378 -263745 82125 147838 -203846
21703 -78743 -39782 -254912 171204 -70396 -530102 -66851 -208040 140564 -119366 -4322 -203378
21692 -203378 -106625 -167705 -7821 -225167 97397 -63908 165682 155983 -181900 -58894 -1475
21680 -22258 14745 86743 -77759 -118260 55719 -134268 -199704 253208 -31568 -131270 -100056
21669 -100056 -291752 -77332 -153614 -88640 115952 99043 295963 -137940 -153609 -123310 -49280
21657 -351754 -138119 -127898 -288490 83426 -21593 -257268 123124 -38774 -158855 -186111
21647 -186111 172519 -177100 -71105 -98159 128804 -398291 -40039 -470869 -13272 -119051
21637 -119051 247741 79230 -86387 -146298 -232780 -38669 -166537 -105456 -228236 -26527 -147276
21626 -147276 137262 30212 -96811 -301559 131449 64744 189198 15523 48877 -102659
21615 -67145 35756 -124793 25211 531 70045 -49091 63931 -291764 -146984 -67 -186219 -152676
21603 -152676 -139103 -100743 -281892 -193620 287608 -278687 -55517 -190676 -331745 -36845
21592 -164129 166665 -210332 -132695 124826 -787 46925 -259001 -29731 -244136 385928 22903
21580 133544 -197377 -90802 110990 -24016 294109 -192944 77588 -234873 -39386 13907
21569 222247 74552 35228 -5922 -18586 169763 -46655 -297935 150550 226697 -28624 108422
21557 -33627 40761 -61794 151110 -171624 212520 -110226 38313 -59146 -206566 143406
21546 -103340 -174353 -227671 -206080 169774 36699 -155065 174213 -186461 -140786 12481 31993
21535 31993 248860 -426407 -251025 -287100 -44537 5112 201536 -96333 -355204 -9151 -114789
21524 -114789 -6263 168675 -282649 341051 182211 -182505 154436 -443438 227993 -120061
21513 -149082 -232166 -42754 -202216 104747 -54613 -149313 -137141 -140887 21763 -27813 -114531
21502 -114531 -55301 -185022 -88373 -261146 -89339 10352 178226 -29232 -264564 161330
21491 -25571 139382 -365942 -32442 313720 -70904 4203 -273527 -58704 -7163 -216493 -34606
21479 -284505 -133679 -212361 98832 -321843 -314191 -77551 -192150 258569 -104496 31459 -120216
21467 1171 216938 56701 38146 7606 187398 113838 -148802 -336568 -166267 -155370 122950
21455 45504 17990 59370 -233254 -335613 175547 -102292 -379611 -138073 138191 -332314
21444 92983 4783 57422 32921 -85043 9318 191371 13782 -367873 -28927 32153 176960
21433 176960 -67630 -178594 -111488 177648 273517 -271733 -32415 193492 186213 22001 127146
21422 127146 416294 70317 385841 -15413 45705 -141605 317502 -66320 38213 194426
21412 194426 -156453 -54272 -41690 -388916 108125 -41700 -161283 -81067 -433963 -12064
21401 -232692 268353 -236530 -11921 56155 94813 250924 173011 323215 -50970 -184188
21391 -184188 -57997 -7023 -176457 -44109 -66632 -85223 -94891 147396 -24310 -37025 -130688
21380 -130688 -148401 -101645 -203332 -70663 -240430 -43168 -110281 -193618 -86743 -284425 340924
21368 -379668 -500 242761 183159 58474 -310419 184002 -235163 265897 81495 -269469 -89027
21356 5514 20179 -160555 6807 -187632 -71400 -142626 137717 -218658 -80610 145890 116984
21345 116984 -406846 154212 -3331 12206 -225283 282737 -23437 253188 -140111 -313588
21335 -313588 -24936 -83776 116460 -190490 -176632 198169 -250434 -471077 44884 19482
21324 -53956 -119026 -24976 -577 -169727 310874 -26320 -212162 -336061 102988 -245934 -138224
21313 -138224 -16529 13299 -165971 -144922 -110580 -157082 194828 -172708 102403 -129205
21302 63861 15402 -178373 -198408 -39126 -140054 7229 -456869 -149955 52416 136216 53145
21290 -29845 -246526 -317774 -96839 107198 -248886 204874 88714 94157 -175476 -126290 -164483
21279 -164483 34902 71102 -100787 -17899 -12140 -18159 -75048 73953 -347275 -185253 -85388
21267 168531 -197357 -240523 -3323 -149886 -42838 27977 -76089 -154187 329049 192759 21316
21255 185676 -212632 -207616 160558 -147478 -153148 290772 -189843 -98693 -114820 -198715 50500
21243 -65770 -58707 -13963 62032 -87146 -198695 -18440 -210143 -332712 -86640 -34115 255074
21231 -132283 -261802 204144 23188 -195876 -321530 -74163 -149464 -50012 -20237 -66984 -315232
21220 -315232 56828 -27491 -51216 150487 105593 -130565 -216783 7431 -255290 291259 -178431
21208 -36561 226447 -75570 184565 -124630 82740 -262352 6627 -149611 -38484 -176053 74766
21196 22845 -266678 5999 -8723 -123833 -6651 169026 -414041 -139083 10616 -46864 193452
21184 -154418 121057 28772 -174 -220143 -243819 -250322 -302680 -329812 -94380 4760 52568 -25877
21171 -391247 -14204 78497 -36748 37352 -114614 -168082 -77564 92998 -34108 -256835 -37392
21159 88095 -128909 -184340 -14822 293958 -56229 -206438 165695 110083 -239642 86272 28924
21147 -196107 -42503 296284 -118830 -186854 37292 -144284 -258610 -60367 -79842 21231 111364
21136 111364 -265857 -89428 -275252 -143423 23662 -188801 -37495 -99598 239415 99358
21125 -173213 -25750 -299300 8723 94653 158360 163398 75871 -197330 -10786 -89448 -84814 116626
21112 -455261 -89775 -229461 -104239 -119023 -49628 65025 -77471 42516 -228244 -128121 -95299
21101 -95299 144341 237753 13189 -273285 138667 -154157 17269 -114996 -6857 -397928 183640
21089 278871 -378053 -183743 10455 119707 41218 90056 -6580 -136694 -61871 -250816 -472711
21078 -472711 36165 -84032 157505 2397 -193569 -332612 -120419 9973 -299129 -33162 61929
21066 -94461 -155113 6992 -19974 161169 77001 -93877 -134486 135931 211068 -231549 105018
21054 110 51095 171795 136826 -178328 -228876 -77851 -213263 -139495 26479 -103200 -46893
21042 -94762 -439212 -6800 22956 -10969 104030 237396 -147054 122844 -360106 -181431
21032 -181431 239197 112566 44684 -43252 -186349 117668 -100494 -107585 56183 -182224
21021 11403 193768 31388 24309 -137455 232170 -377972 -131735 95813 -67650 -281300 -429556
21010 -429556 20081 -101939 39376 -353296 -42241 39848 90591 28051 92426 -145499 -15252
20998 204429 67573 12877 -27936 -10675 264086 11555 204521 156938 127208 410193 180618
20986 -68368 199958 376997 167516 5591 -236737 78116 -24762 -83149 -75837 -120479 104759
20974 -28833 149365 -44966 31895 -274252 -1913 -183095 76563 -59155 -73938 -152097 -193263
20963 -193263 166 57455 -88993 -46625 -266986 374 10676 -196202 -78594 328396 5549 165085
20951 165085 -28677 -15782 -71006 -53981 83566 -68093 -115524 58489 49928 -296234 -40132
20939 -160234 -106340 -337422 -88864 -21489 423600 213310 -7682 224475 137958 450452 254685
20928 254685 524414 109286 -97836 124047 65167 153988 -213885 2889 -315319 -218121 103366
20916 -44 -152635 -309647 -118771 17146 -56479 -95141 -12698 3771 146262 47274 69615 187437
20904 187437 -37111 191108 -178221 -57752 27068 -158379 -110151 239692 176937 -266668
20893 116390 146221 -54521 -281993 -150054 38998 -139365 -136759 -24879 -41053 -229117 -359148
20882 -359148 -188350 -238351 -6105 121498 57517 -37933 36823 11345 159783 -205353 171239
20870 -133214 -105322 165733 7892 17328 -53384 -258653 -4869 -3924 156698 200955 -105755 -147221
20858 -147221 -379174 187256 -2067 6423 -374374 -157899 -245883 198849 297357 54881 140143
20847 140143 -233735 -10798 59999 -139444 111943 17176 133029 -215096 -228948 -161796
20837 -161796 -11690 -143676 -18305 105489 77109 -252633 -124362 -32706 -130230 -350665
20827 -350665 25738 -158329 339384 1985 -36116 -332543 112232 -127625 199563 183663
20817 183663 -63080 -187663 -228614 11343 -106243 -108423 -235080 34269 -36784 210804 -100465
20805 172516 4286 -65947 -87669 -123224 213287 138293 -20786 365255 96255 33292 -127038
20793 -92840 -402132 -24283 101563 -66288 -406489 -139960 -265720 -199724 -216890 -11618 -90025
20782 -90025 -174475 21613 -187231 -380974 177127 -162211 -224506 -78099 -263511 -226453 61929
20770 -4208 -294869 140996 -50201 186490 -308411 7589 45768 139 298310 -333998 -30653
20758 -31767 -130302 -85648 54224 -143641 -109992 -163777 14486 -141563 -135736 57596 -112141
20746 75599 126690 533217 -368550 25626 -441039 -43902 -314526 -186658 -221465 -63704 -104678
20735 -104678 -195102 -11122 -39565 -3069 -226706 135083 91569 147040 -90363 -308625 128423
20723 -99264 36034 65234 -446188 -262815 -45011 336430 281515 28730 -10664 -161455 -227843
20712 -227843 -155947 129659 -139746 -403238 -7683 -23476 -143453 -8099 -113705 135994 -359784
20700 -314895 -107077 -367164 109551 24413 -158599 -344489 284755 -119821 -75776 42697
20689 58136 47410 -153414 -122751 421837 150903 37860 -170484 -419544 137117 -105170
20678 -376156 179197 -108361 -82579 -40322 90345 -305133 -99822 31256 86775 14458 23668
20667 23668 76442 46629 -143970 67044 178613 -166709 135106 -24380 139531 -94143 68364
20655 188182 -311390 345366 46124 -422717 -137607 14975 -307718 -210072 -88787 61461
20644 -180613 -156468 235396 -63421 -382797 -121408 108466 358654 -384336 -41151 -208973
20634 -208973 -9636 149275 -456650 5651 191277 51746 -255293 -285225 -283118 -431879 -594375
20623 -594375 165431 -347930 -166910 22127 20174 -380313 -452257 -69256 -279878 914 104323
20612 104323 -63983 -11887 -66609 103564 18679 -212805 -252038 51178 18546 132867 -128510
20600 -120049 82343 10339 232481 195021 1467 -130738 24237 -109505 -389063 -135844 224766
20588 -84662 -358878 -179213 -336508 -172647 -125948 278422 109831 -160334 -213917 -23108
20577 -74017 -138563 322283 -102189 -95080 272582 -227088 79905 104692 23162 147230 311073
20566 311073 83481 118471 -8364 -124477 305951 -6443 139790 306066 -281162 231131 -4309
20554 -28470 68533 -224129 -258971 -122410 -167194 162549 145006 104536 -163910 -374558 -479472
20543 -479472 -132002 -11605 -46989 -240062 -239857 -189329 -392139 14868 103828 -51463 -237302
20532 -237302 -182590 -230145 50163 42215 -219591 62688 -26839 -197855 -593204 -325585 69431
20520 302727 -114338 267397 -221912 45154 -157791 98428 6844 -205723 -284425 -77180 -76414
20509 -76414 164333 188238 -75960 119299 -332916 23848 80511 203981 -175381 -19446 38722
20497 -299917 31598 32145 -16849 185104 -253799 67117 -109306 -30513 221278 110175 -111789
20485 -147794 -16769 57710 -10201 202952 44340 -126161 -185501 -52083 58451 -36960 -253472
20474 -253472 104657 -88925 -504883 -230290 -19630 92603 -36225 -115278 -126760 -81857 -60479
20463 -60479 -88112 -203744 -97605 -104449 -48280 -223419 399222 -72760 -248056 -194478 -59742
20451 -91859 182989 217972 116004 249131 -209037 -224059 -219888 36359 -195288 34863 150531
20440 150531 139160 247145 -99953 -139278 -82914 1899 -296135 2440 -117942 -343893 -23684
20428 394 -57563 -7170 -322864 -20690 -73720 -100155 -175287 -198694 189672 3143 -52279 9533
20415 -309477 -372788 90236 -51877 -91602 -230698 35870 -95380 -252249 -163228 88922 116143
20404 116143 -237532 -151131 -99248 115768 -79602 -34058 -114157 -238502 37762 -6639 69710
20392 -10453 -315533 -305160 169629 -191328 -268095 316925 -52989 -107085 151116 -113680
20381 98418 -255657 -303879 -125013 -202917 178757 -400540 -397933 98723 73566 -81693 254949
20369 -257870 -117204 -392686 -78987 -337419 -166896 127573 -89913 -48082 149367 -234930
20358 -284438 -238307 -99183 -72857 94401 337467 35303 -569092 92883 -16865 106916 -50042
20346 -333636 -99721 -211724 -284370 65488 -56141 -73799 -145762 170383 -90899 184066 -106367
20334 5920 -217755 371244 80931 -70624 -327057 -238637 10166 171129 116420 333563 -190200
20322 203124 94091 301551 -41126 23915 -112655 -166610 -82812 65019 -166505 -75482 -72525
20311 -72525 101785 244133 58207 -93703 10417 -195248 221732 14431 -193676 -256808 -227675
20300 -227675 -277603 -146733 -69630 -89926 358065 -71995 197051 274914 -210765 -58159 68911
20288 -116972 -273222 -22200 -237612 -225011 -36458 168876 16491 268709 -107724 -145728
20278 -145728 184191 -192413 134751 -98556 -147383 211726 -286483 -272588 57407 -188643
20267 -221885 39630 -115718 -14161 118406 43107 -48873 -16779 -171222 72838 113747 -93344
20255 -29044 15676 -137116 -246227 -99121 -149650 195984 36923 -50858 -398758 64262 -41002
20243 349983 66563 -100224 -270739 -215722 -167244 -96001 -56702 -169087 274274 1248 218877
20232 218877 76139 126 146344 106611 -100665 23643 123151 236836 -156579 -209176 -88745
20220 58783 2251 59895 -247902 -288231 -134871 209230 -283844 53350 225407 -308275 201994
20208 -67917 -376470 -326454 -214111 218694 71804 -212992 53222 26353 -19283 131196 -184956
20196 -226402 -228481 -231460 95582 -213436 -169204 -16318 68010 -98481 111710 293484 -259986
20184 -125590 -163761 23730 -115956 -89196 121579 -77837 -429094 186097 188406 -101588 371681
20172 55419 64265 -189500 -171785 -184042 112955 -25509 165518 -158400 -40500 -258383 -36687
20160 -98831 -21119 152386 -16650 216732 242176 -133856 2082 -241163 -64948 -41510 -38218
20149 -38218 77798 219413 182832 24065 11008 -52377 458987 -437315 82932 225547 -134037
20137 43632 175297 198553 238855 -238715 250549 161754 180563 141438 189711 98732 43277
20125 96655 156346 270147 475264 287045 185498 118115 -24802 156357 82492 -26146 241923
20113 173412 272810 7847 -61753 62584 134137 -367504 -12991 -168657 -236393 122114 -94590
20101 32806 16126 188791 56614 -192319 42443 113329 112649 -14642 -72423 224564 -410607
20089 -240516 -130687 116870 -53162 119988 185205 -204278 -173764 205061 36106 90319
20079 90319 -149470 35155 191623 -196730 -108920 49125 69833 146645 15257 -149805 -270986
20068 -270986 -58944 -73724 17488 -309951 68344 220914 -102287 20147 58773 121791 -100371
20056 71382 -236453 -264706 -252265 44008 -182638 181360 -145262 229653 -446348 42889
20045 -193774 -172879 -240477 -103474 -276691 -207238 -59368 -80751 -189270 7927 -298890 -91312
20033 -40042 94192 55046 23046 -96165 -102267 108956 38817 -47366 -151908 251385 171891
20022 171891 162912 5361 -120759 -181499 -4231 79539 -138200 -161296 -144656 -151827 -67054 38334
20009 -267487 -193697 23761 55941 -205592 143343 -240452 -281361 -119835 -224270 -179749
19999 -179749 77846 -179210 325990 -149606 -251309 52071 -129182 362324 128336 20440
19988 -37489 310410 -162586 -130992 -224785 24500 -53301 355789 97961 -53892 194658 102182
19977 102182 -100656 10256 171996 9969 210737 -47109 -42872 66948 -32733 15933 -227456
19965 -461883 50013 50701 378508 282192 -46975 -43328 -236787 251423 317884 29083 353702
19954 353702 -331816 -117159 -39950 442144 231894 -159424 -43326 147367 215813 253182
19944 253182 28141 155626 305449 324139 -286510 259080 146445 66537 -146019 -98594
19934 -98594 251156 95247 35129 -305939 77651 -261974 -62113 -37097 -21775 -150700 226215
19922 179096 -54434 -69002 162960 283955 519380 -107366 -53158 -57507 124238 -328144
19911 140751 -68582 64364 -43543 114575 127075 194906 -48065 37868 -39939 -313609 82952
19899 98482 -265860 -250999 -235221 7109 -19871 -166951 -281651 -159968 -156331 -75818 -2909
19887 205249 -189387 -74559 151802 93278 -130526 -274764 64798 210509 65669 191063
19877 191063 107840 -73691 -1913 -62132 257207 -227306 -355713 -257096 -32569 115418 -132476
19865 -92681 -342317 59767 -179491 156495 106830 -187981 -168930 -113500 -343381 -111460
19854 138738 -15018 124365 -215338 -90689 -75548 21538 -21408 104657 -82712 -222110 -87533
19842 -270337 -182420 26125 -109367 -94555 148242 276938 316289 -21988 -46750 73167 119838
19831 119838 46278 -29760 -236359 54840 91876 -129232 -115472 1780 209961 -380444 -188165
19819 -18638 117191 200004 -48205 -46603 187429 -316619 -117844 -100381 41761 -210830 12769
19807 -181224 -100361 89169 -108047 3515 -286247 -236831 -213984 -287966 -39386 -551782 -337159
19796 -337159 -398940 34211 -138292 90836 -158038 -284340 -245182 73711 -178346 -96828 -160547
19785 -160547 -310601 33102 74466 179474 -203778 23755 -7827 -206317 -342346 -118355
19774 -96501 -251740 -167215 35787 104783 22794 -77686 113405 -106137 -127886 -172215 19579
19762 -5390 -51603 -133452 -72474 -21858 -107322 -286739 -112132 50186 89091 13257 182907
19751 182907 36218 -252559 -141161 422344 192016 -218517 -183307 -25308 -198293 -15626
19740 160837 229611 78106 -273762 -214906 -133079 549767 19522 169098 -17123 -23129 -177050
19729 -177050 70185 -203571 -223200 20403 -216193 421942 139051 -328310 205218 51451
19718 -60989 301225 233122 47192 53567 446969 296524 55306 394750 117417 31109 138662
19707 138662 -15268 -200824 39665 -387801 371430 -19268 -249542 -25469 -183916 100423
19696 -300524 -132311 297091 -3952 139193 -114488 4215 -24298 -82566 70931 43314 -47340
19684 294689 184703 240236 128914 225463 440009 48018 61831 -301 135920 131705 -130848
19672 198385 -238756 243370 87081 46068 -124510 -190583 119038 371907 -10665 -253747
19662 -253747 -48898 -26360 -317176 -161535 92232 -33307 -23716 435507 1264 -8302 -130712
19651 -130712 -373545 -86606 191649 -318155 229926 -165668 -82412 -359833 -107991 31502
19640 -125137 93190 136663 -55356 -202596 -143869 -6296 -332589 1086 -153859 120088 -4947
19628 -187560 -45121 62821 36780 6833 45063 -41377 -103870 -88841 87307 14672 37390 -15735
19615 18769 114687 -114282 99049 -116716 -325855 9167 -70801 -75364 -19644 63974 45945
19604 45945 -248343 353786 3613 -16277 -345987 -218411 -6047 -375435 -163548 -379173 78094
19592 -28125 58036 95955 -153180 -74928 -104188 76869 123038 -56038 -337899 101668 -134099
19580 -144832 118870 -138438 20898 29060 -220561 -273243 475183 -101693 -292300 -79856
19569 -146539 -531639 94240 -322802 -22041 -143293 6521 -127156 88133 -275731 -278137 -290950
19558 -290950 -230204 -340941 -158314 -149542 321698 25713 -121906 -466363 62536 -196151
19547 42082 69764 -9036 324276 32546 155780 -363696 17115 36638 -180737 -229678 159585
19535 -244482 -121044 -203360 -143723 -251790 44203 -187774 -32120 -221918 -166751 -100354 -166077
19524 -166077 -285861 -190928 70678 -13837 -89821 148355 9608 14292 -27713 -181799 -73701
19512 176685 -32109 -89808 -223515 -119873 -267924 -50630 -42261 -363653 85540 -220076 -97024
19500 -133156 -197219 -237106 -216394 -134040 -240081 -75379 -193112 -107812 13527 69773 -313340
19488 -315703 -16648 98245 145818 -10667 273053 -172631 26324 -138745 25136 4971 -54886
19476 -280964 -336250 11864 -109757 25776 -50314 -176292 46841 -142975 -148277 -114315 -161965
19465 -161965 -212375 -5435 -197183 -494634 243011 -217467 -197826 -25406 -44992 -99902 22576
19453 -143743 -139542 -140067 23837 -308208 133328 -26078 -365516 1086 -276538 -355057 151682
19441 -191932 -303799 1966 -332758 241175 6866 -351702 54910 2364 -226902 -219490 39255
19429 -24675 -54564 -114963 24688 15152 -435775 -165793 228190 -428841 -9159 67328 -203003
19417 41618 -473644 278974 -200605 163231 175627 -105384 92667 -69239 -17318 -502896
19407 -502896 -44741 2961 121247 -257178 -111188 -535547 -9253 -201797 196726 56173 142267
19396 142267 -31093 43597 -17945 147279 -15619 -130579 -299612 -177785 -179407 -171465 -113735
19385 -113735 112116 -7188 66436 -226983 -228091 -99883 -6663 -277906 -33648 -272822 2138
19373 -189472 9019 211828 -421 -149385 71754 73162 148395 -250265 -2161 -142028 172390
19361 -76089 -108186 145553 -137319 -341427 28095 77444 130705 -401427 99707 -113539 -12678
19349 -220611 -280101 -59442 44870 -166018 19484 -117523 84741 -358454 -266278 319838 357203
19338 357203 4469 -41145 -269185 -60786 231149 -301523 -321485 -18080 -225942 61828 -66664
19326 -198104 -313785 3666 -62462 -19695 152888 -328501 -158997 30344 -203947 304419
19315 -57624 -125110 52964 -252549 185212 -83346 -270470 194701 7647 -69448 -209371 -161834
19304 -161834 29227 -196297 -3929 -178075 -262433 -111428 111667 -228321 73200 -59245 -254746
19293 -254746 60240 256989 -284887 -35908 -24159 -144963 -130730 -88930 -371251 -11677 -137251
19282 -137251 -472243 -99305 -206201 -282049 22730 -304397 -228326 -74636 -139928 -140119 -344533
19271 -344533 -191812 -59933 1598 56267 -137643 -30125 187247 -266369 -46140 -21067 -271210
19260 -271210 -77882 -182586 131476 133109 126836 -125295 -197954 -152069 -130693 -56188 -330654
19249 -330654 234846 -200387 -62935 -169504 88952 154346 -426434 -160606 125663 138919
19239 138919 -278089 49106 251031 -139769 -236302 222300 280391 -286829 -60682 212953
19228 21273 87663 59334 187446 -199683 -250319 149729 84234 85124 -288884 112348 18728
19216 94977 171283 154234 -139803 -225488 476143 -19476 10787 54348 -47954 -115182 -184547
19205 -184547 -76735 -197001 -125179 -228542 -184109 -363081 302088 -11201 -199756 -132732
19195 -132732 62734 -47144 -71564 -205237 175280 -338175 -271781 191440 -38785 -96554 -39638
19183 -43348 -77383 -118060 179468 -349668 -314335 -273501 -235537 -19012 -101437 69176 -100512
19171 -227065 -264303 -99855 -44032 -349662 50765 199496 -163517 -67379 42918 2372 -197346
19159 113394 -53531 -114182 58061 124995 -9983 -361515 110446 80484 103591 -229035 134618
19147 139745 -111879 966 -60798 143138 15506 53011 -27933 72818 -111746 -377819 -263652
19136 -263652 -157813 99117 -317611 97419 -71634 -23075 183593 -191789 -88666 228022
19125 -84512 186404 -39572 78575 169890 134986 -133355 -306898 -127206 -23654 -339313 -411764
19114 -411764 -222473 7415 -132611 -119332 -421750 -215226 -5841 -28602 46917 -200716 109020
19102 279643 -245250 -247136 -204519 -114945 -573731 80715 -145517 -178807 -413442 39948 -1553
19090 -170058 54809 -67044 -4461 15487 -552116 14622 292050 -408981 114232 -349680 -50155
19078 184464 -178226 39089 194167 -93574 -266795 -127992 -98659 171243 -128039 -166152
19068 -166152 -112892 -48921 97862 -69383 -263521 -500373 70947 -285471 -119540 -181696 -479167
19057 -479167 -149880 -171193 -315331 57088 30937 -56145 215115 -224451 -158558 59590 325956
19046 325956 282694 -189118 -8616 53901 -189363 -46209 -89310 -4304 -199082 138506 -236670
19034 55759 144428 46334 -139538 -67061 -165299 -91611 393736 -246326 24864 191336 -2864
19022 -51108 95050 -400230 182476 6858 -106944 -99459 154941 29665 124418 -161422 -86524
19011 -86524 189638 166160 -65741 12600 2067 21406 62827 -30590 -180268 -140772 39483
18999 -353983 -90809 87709 -144889 -60768 -47995 -149074 153694 100136 -265350 300130
18988 -58972 -78465 -25222 365116 74828 -175586 -191278 -198107 -121014 -151290 31313 222983
18977 222983 -152247 138796 -359360 62894 16170 92826 -224223 80977 -168916 179140
18966 73264 -166485 -113786 -58953 -120906 -54662 -163658 279041 133500 65567 288693 507999
18955 507999 328400 -257076 124344 -196874 -190596 277367 38423 26948 -187464 -205555
18945 -205555 -122037 -49844 384966 21268 370027 163181 -269489 -213330 374466 186184
18934 180588 379268 270722 -200431 -104405 -236828 -369292 -87295 -323426 73934 543874
18924 543874 243532 -358697 -140252 110550 -142584 333818 -50072 47296 -32398 256348
18913 -564301 194329 29558 -98209 -118873 -48811 54778 -172668 -258082 -79954 -54594 -54480
18902 -54480 -76582 74397 -103485 -67721 -115835 224759 76177 2956 -5386 716601 531292
18891 531292 332936 414745 -255392 -35516 -54492 -148950 -92628 -254367 68908 -30039 123948
18879 177373 40579 64649 -326904 -83733 -405218 34247 -111928 -39864 -7680 -25147 81514
18867 180119 -94214 -259987 -274171 -70949 -190895 287267 -27191 -401006 106867 -106581
18856 -388508 -149826 2711 -110668 -201730 -234685 129534 -141623 -181764 34304 -51001 -122544
18845 -122544 -81694 -208396 -183634 -144625 -14767 -251301 347556 -132969 -1996 47122 55530
18834 55530 258646 86709 -236117 -66751 -183852 81303 37596 -12592 63138 -144839 -159176
18823 -159176 360743 171971 -347357 -362566 4159 216438 -213888 168679 117213 -28684
18812 11601 -64405 53791 -186864 155655 123689 86788 -77364 86556 171924 -235976 -11496
18800 -326559 -98553 108415 211223 3939 -182988 202203 57176 408138 -109727 -61702
18790 -61702 2057 -5710 -124704 -25536 -4633 -124638 -21097 28458 337365 194501 -152361
18778 175096 -210012 -75523 56967 46127 -76741 111058 -212826 -173643 21347 41534 -33577
18766 -21319 -271997 -65109 84521 169773 -235022 34054 -15088 136014 -64364 104267 -189439
18754 -282416 94183 62253 -101708 -197665 219324 53277 -171881 -254412 -242480 -222831 -107343
18742 -119663 215250 -328294 -103426 -306309 -36495 -167888 162839 -474434 -142110 -179564
18732 -179564 99686 92644 -64201 294814 -117627 -116597 268379 -173178 -108830 -128877 -37798
18720 -27291 -192838 335892 66990 79200 -220077 -39408 -135454 -322343 496506 -179647
18709 -249179 12450 -136894 107263 -4318 -55598 -54628 -135043 -286022 157456 -135043 -57612
18697 -321134 -153681 -198369 -135063 -18951 -153353 817 -198434 -16976 -203982 -140105 100721
18685 -298705 -158173 58306 75761 -181072 -47397 -109127 -458932 -392056 -280662 57546 164113
18674 164113 24172 37199 -205462 -4360 43437 61792 -226618 -20850 -305164 -86162 228526
18662 65277 -151818 9300 -149667 11571 -403701 3749 -469139 -273401 -168296 -140141 -57422
18650 79080 -122259 -301690 68922 163067 -94673 -226400 -112132 -83711 115161 -176078
18639 -151996 -218036 -44151 143964 -41271 -19028 -105737 224596 -211823 -309508 -10282 134166
18627 -212923 -226257 -197273 71506 -292166 38067 -188936 -320168 31513 -5288 -207752 103605
18615 -140917 -57073 -2203 -2892 193294 47555 212305 -118099 -517581 34816 8178 -47800
18603 29073 -11254 84010 -151421 197636 -29871 224044 174462 -26428 40168 131518 209866
18592 209866 -168777 -205590 -183453 -136684 -78403 -319067 77651 97636 10393 357181 -88440
18580 -295043 37363 -205732 -313710 -110704 -127694 -139679 346322 -43613 -37008 -30968 -187734
18569 -187734 -331047 -88538 -234456 89697 -152680 -349111 28923 -206093 73923 -62799
18558 22236 59106 -304370 -9762 57303 -21458 -36358 -183291 -176022 43289 -2716 43535 -69452
18545 221455 -537439 -60695 -126254 55737 -229051 -240796 -83663 -36456 90570 -139035 -11599
18533 -284257 -86328 -86023 -72637 -347995 186956 -255521 154687 -154542 -256617 -12823 93854
18521 -108223 -73773 162913 80573 -180508 -61024 -356136 -125853 -41482 -124872 77312 -55851
18509 227792 -26573 -31631 -77080 99705 -93592 -140542 -198446 119767 -125282 -280762 -310086
18498 -310086 56853 -84872 115749 123609 -40888 30693 115574 5365 49668 -200033 -147278
18487 -147278 -166335 21525 53185 -129003 -227562 21263 160340 137185 63325 5058 3478
18476 3478 317667 83371 55809 -7173 -75299 -195538 539851 276648 -184794 -72290 -117683
18465 -117683 109596 17123 8928 118337 -147016 -233112 -279133 32311 22060 -38088 -145741
18454 -145741 -306429 218720 -173301 -104551 -92669 -379156 -117580 -130666 -211908 -201266
18444 -201266 109268 -300016 238579 75062 -162993 -144676 -65360 -184820 -124706 14025
18433 -29828 -153962 -108914 -28419 117486 12710 -205203 -191031 112836 149057 56527 -52626
18421 -270349 5471 -117155 79179 -36582 209991 122782 46593 -224337 188173 380839 -41063
18409 -197536 31960 -222756 -167425 141620 -92 -222157 -137511 -330622 319676 85254 -164667
18397 -193773 40625 180604 -63964 103071 -61274 -396522 249391 -15845 -225241 -95652
18386 36056 62791 -318921 -322333 -189001 -11629 105620 249649 -207694 -222629 -50619 132585
18374 -4890 -43967 -129887 -310338 -123836 -66446 -125371 87778 -262440 127637 -170211 66220
18362 46683 -126887 -256283 8955 -196323 243197 -246519 223570 9169 22028 213870 253286
18351 253286 -24132 84682 88604 55234 153919 60802 80257 75740 -70700 1638 -53406 -239361
18339 -239361 -32992 -219806 248704 -17127 -66170 126484 87412 -84472 69140 -24770 1506
18327 45872 -39258 -64467 216681 384360 -146977 205131 -551051 -99519 118118 61523
18317 61523 97365 7485 -138433 12676 -68 113693 59871 -188622 248683 -235551 -162103
18306 -162103 -75980 -17850 -13879 -144710 -16012 -204595 83433 369019 -216792 -478641 182198
18294 127824 95840 38083 -154 -75519 92763 -410216 62393 -156934 -118530 -543263 -255256
18282 -180735 -443980 183816 15057 -42339 -147829 -246621 -161572 18821 128518 -95466 77945
18270 -213829 -112124 -66912 160128 162084 -15957 -22894 -108718 -227859 -16304 229649 -172805
18258 5926 -194625 259929 -385446 -30100 -17468 -18548 16977 -31726 247424 -14282 -106734
18247 -106734 -159143 -225042 283229 -28923 278520 -382950 -151357 -81814 -23036 230494
18236 447280 83380 24900 31918 133773 -356068 159136 -141540 43297 -262962 -61337 -62929
18225 -62929 95305 -326022 81400 364797 25552 -29788 -384509 -328293 -88590 255564 42095
18213 48661 -114010 -8365 -39839 -70346 -334276 -8815 -37451 -185640 -306059 209493 -12158
18201 -178425 271209 79456 74438 -134536 -95325 -48034 92955 211966 131296 -75052 223705
18189 27895 257558 -162694 -145747 -14990 -336272 -47076 -83624 60815 71359 -141492 -11271
18177 263183 -119071 -293741 103845 -228782 10513 66358 80518 -403242 176455 77205
18166 156147 -339065 88227 118571 -24694 -187320 -288250 90048 -9349 342286 16021 144948
18155 144948 141216 103938 -6255 -109998 -180482 -56378 107721 -22724 -40534 2529 139726
18144 139726 -209423 -15378 -158710 -8581 66918 -1447 27913 -337307 -93063 -76243 -73687
18133 -73687 -38578 -140574 -250139 -111753 -48669 -82412 70757 28876 -138898 -2047 169669
18121 137953 294084 152966 147693 494969 67051 -120680 -215457 47946 158102 264604
18111 264604 -98912 273060 185877 102248 171704 -49680 86074 415568 -134750 -100109 -207977
18100 -207977 -122757 -520 -158593 -161266 -68970 316416 -66589 130696 -28424 128250 23844
18088 151645 -17531 -130709 -53316 157993 -819 -75117 185920 -62740 87085 -253718 -179590
18077 -179590 86517 6713 2961 275752 1311 226665 216849 5218 243004 -339280 23640 121394
18065 121394 -10900 105129 36798 279449 -150535 -52285 -56103 31274 144701 -251688 -400332
18054 -400332 55126 28575 -138348 24523 -128168 -201018 230293 -243687 -211597 109462
18043 10443 -54546 201660 -119670 -87766 -71099 -169783 -118441 263065 91692 194955 -221679
18031 172270 85267 -29187 -8519 -37684 257940 27619 -301357 -40992 -260504 -132961 -120125
18020 -120125 -217427 162143 19780 -174855 -89813 -82156 -210462 80394 -257864 -67257 -139458
18009 -139458 5264 -197765 -80985 -131576 -67193 141866 -153520 40930 -190672 -171208 319380
17997 7307 -140569 -128313 56460 -179767 -297303 294852 115154 -177001 -143191 184328
17986 300450 -201091 55682 -119377 101417 -183195 -36133 -137296 145116 -31790 -34682
17976 -34682 109257 228055 -110326 177150 -116972 82088 -357235 105628 183290 -369027
17965 55483 46603 200143 -161879 -246155 -129715 131318 52779 -210634 7908 26685 -62159
17953 -19068 168294 -46481 -158855 54352 58780 10711 111497 -4548 191397 -89815 -244697
17942 -244697 195952 -81441 58161 -89265 -126637 -101189 -212947 -186275 -382189 225157 -52223
17930 73954 -143365 203907 203349 79702 108587 -16136 126220 -135841 57903 -419868 50966
17918 -20109 -276019 51437 48630 -42324 67022 -8196 168788 234868 -111995 170455 -181368
17906 29632 -27884 188271 -107129 -76351 -126472 24584 -164641 -73121 359685 -24380 69859
17894 103589 18247 83492 -216907 -134951 -67696 188350 319271 331873 79040 -5082 -237173
17883 -237173 161942 -121943 5511 250053 -133672 121355 -89927 120115 11564 -93833
17872 59605 59857 195908 -294200 160681 258150 -53175 92500 -170583 309126 -168548 -5158
17860 -185719 -86840 70812 327653 233356 -88435 -293043 64785 125177 21921 -164763 -40560
17848 152637 -161367 59095 -198490 -110503 527 104771 2350 128272 237532 243756 -132505
17836 -182057 -184708 -155691 -84748 239843 -187889 95025 245525 -147153 193122 -2184 220878
17824 -39560 -318210 116095 7092 31586 -45142 -262924 -285912 -115626 -255805 -5254 24970
17812 126505 99334 -261678 -58349 99231 79584 224707 9132 31613 157556 -3449 26578
17800 266968 -149064 -89894 274756 193876 -120876 222700 -73222 23983 108480 90268 -105237
17788 -78290 -78218 -118431 -11726 -120610 103103 30336 -22305 497314 166354 257241 205815
17777 205815 143620 28393 163776 -29870 -44111 -32504 -11018 -29088 57811 -325224 212755
17765 -176712 69535 97055 -15411 -64537 -10997 34595 -341056 -17519 -364090 -328305 146134
17753 236906 102686 93014 -7796 96388 449579 205926 186572 -210750 55672 -83959 -1126
17741 133017 53578 287166 -44313 4753 449029 231827 365 -423662 325995 -14723 -91747
17730 -91747 95811 -64909 -50371 70669 72657 29275 78224 373416 45909 115878 161798 62264
17717 -973 -24080 -124063 170474 139867 48082 72189 28695 180796 74300 -295248 83564
17705 21216 -86183 15644 18801 -49120 54808 58370 -90456 -149607 -55067 91929 168301 245587
17693 245587 291937 329147 201976 -63928 -162025 216940 -20864 36350 224804 -68432 108982
17681 -87791 37772 269837 -342100 95063 56843 -45268 63366 163223 -115145 112914 136398
17670 136398 -91475 68155 -46288 -135252 -370105 83044 153549 36945 108165 45841 122829
17659 122829 -68896 41880 4503 55035 -156435 178916 205649 -31247 336341 184660 8645
17647 72118 269782 389195 129327 201957 246059 185445 291057 -152205 316671 -17666
17636 160652 -128612 -48187 -65964 170935 409474 18587 86386 -233687 64531 256958
17626 256958 -24081 -6253 -41814 453708 222174 161058 243463 -56311 102500 215315 41407
17614 62079 357086 153205 352344 440966 -197738 357108 -42123 -29339 -222763 119966
17603 150845 429237 343231 87359 37454 138530 -190132 116787 40143 201734 -31791
17592 140995 126889 -45895 52333 -101653 27709 -82143 28923 -152155 -176744 97303 -76390
17580 -172944 304062 -61213 237861 -342242 159553 -136813 231762 149897 104001 254701
17570 254701 11724 -18198 67249 175309 150962 220861 206379 398267 128315 -163475 149646
17558 93659 15106 -111426 186336 54665 340117 95491 -514 89269 241010 58394 93197
17547 93197 91154 58302 235401 78981 307084 -108158 -30884 -196827 515372 -82451 -214646
17536 -214646 -154424 52036 227465 50105 451298 141270 367282 268956 402860 -386 60504
17524 88596 186949 138291 216407 170972 118567 98943 217903 3739 -94632 293454 693160
17513 693160 270742 462944 512205 379181 698353 886333 815619 779828 490492 696130
17503 696130 209813 389064 52183 568746 360578 513214 406006 687487 468667 1120251
17493 1120251 1047248 917628 737115 264820 583938 852631 386480 3648 359887 432775
17483 432775 201705 375530 391354 -43910 136995 191476 335737 330717 616302 163208
17472 252380 88634 396105 285265 54523 263993 327917 337021 433347 16468 -34701 188414
17460 405611 382051 168430 398449 247705 153468 407953 506906 620150 625684 -23449 240501
17448 51313 108898 306033 277956 104368 -126844 410826 153140 645285 215886 159223
17438 159223 302096 58081 104043 175887 429748 414738 469363 435306 858937 292721 311792
17427 311792 334334 530271 602188 563829 332626 101969 153792 245596 488953 276859
17417 276859 158746 257803 176561 304448 354101 368524 96177 572259 275430 561835
17407 561835 292163 263436 305277 162815 206731 498494 317621 247804 387456 393005 29022
17395 319150 3650 264372 200839 454181 323880 -145355 121856 82166 194892 173565
17385 173565 -30969 17724 -213610 457921 146858 245562 84962 347635 409079 77114 280781
17374 280781 237212 248395 509285 379672 324048 192122 275746 269996 -21268 -59291 315096
17362 168204 208718 274403 417376 326776 375875 453266 112376 211084 88470 32190 295916
17351 295916 505235 213729 17282 114402 80040 183055 478127 312312 79022 231948
17341 231948 187721 180739 114217 492452 657527 -81321 473620 405916 510751 346191 170526
17329 243623 466102 523835 269566 216067 340764 117731 159050 -59913 488494 341636
17319 341636 185479 360596 221934 236508 -95844 173950 401495 90867 208705 76762
17308 213881 154782 96635 168696 484202 390498 166659 333522 134542 521630 307352
17298 307352 380656 143588 294679 302187 17524 390402 22418 174384 386375 158429
17287 254876 336630 108803 197957 209314 303269 494851 285682 44419 299408 327207 440473
17276 440473 270465 -48997 387147 559804 87423 296801 112878 181859 634091 320643
17266 320643 97049 409325 -134371 406271 96928 164912 176633 500048 234502 294508
17256 294508 311571 377357 414871 314793 348827 76331 289203 417210 8265 235578 298039
17245 298039 -35898 -165308 444318 378806 281881 489695 189481 170467 214216 9688 388862
17234 388862 53801 462073 244673 75587 -21533 17429 42501 309886 161255 354473
17224 354473 -145580 410316 284081 768232 350926 442004 70493 260594 176394 327392
17214 327392 342319 205850 340296 261981 126624 228087 54402 530705 650563 298072
17203 277573 388849 -13617 425849 331980 210754 409836 448990 258760 302951 347112
17193 347112 219413 334050 144677 598268 359225 252789 408087 343992 651802 417365
17183 417365 473632 377467 134378 476801 341390 162112 416073 250794 600434 423574
17173 423574 380819 162707 663564 490285 81458 551933 596158 218472 298973 284840
17163 284840 230557 223412 346992 316587 678792 629805 504231 389701 429443 446238 377788
17152 377788 350754 166270 580577 753186 658217 602868 126140 220648 762046 455123
17142 455123 278312 389764 361670 275552 172152 499688 448901 275575 349755 224035
17132 224035 200593 640294 413680 400519 394003 523381 398699 472594 461479 613587 100144
17120 914548 415955 295708 255013 448597 329412 533465 373863 399151 627073 553742
17110 553742 693869 480299 696141 638153 565172 542590 545308 405879 204773 834240
17100 834240 580960 186087 409225 223402 443865 666300 282906 537330 542481 592830
17090 592830 810819 482747 830251 553369 649515 466391 702190 543636 820700 401906
17079 604635 474090 652494 775465 873880 528464 820308 396210 603993 572965 675375
17069 675375 845926 681559 419218 753839 992610 553095 765269 530436 714907 909311
17059 909311 747125 737294 715283 676700 608472 612257 445491 663740 742681 584946 769531
17048 769531 649376 456982 523168 876471 670592 310315 504956 478381 685155 860515
17038 860515 883055 790200 992191 749596 808830 871203 776027 692075 921713 916574 1006717
17027 1006717 778246 814691 598438 660762 1063904 660925 967278 788117 690201 958838
17017 958838 959769 943177 788431 1047709 770903 1105661 536801 436608 913661 694372
17007 694372 1283279 1066593 1052116 1137469 850470 989889 822047 875056 808626 705411
16997 705411 956913 1159695 812573 942685 911299 772550 872306 988592 867075 1026862
16987 1026862 1232699 1060266 1033087 1313199 1190448 1125813 1106494 1110861 1209514 1026710
16977 1026710 836234 1497917 784560 1502014 1072530 1190949 1013201 1031194 1283396 1103288
16967 1103288 1372516 1202252 1091590 1382974 1487751 1418659 1552294 1326714 1367764 1347045
16957 1347045 1248410 1214700 1331677 1624723 1362954 1552818 1248103 1572256 1422717 1565700
16947 1565700 1212988 1422183 1389945 1416195 1609144 1732871 1464103 1241466 1308500 1501526
16937 1501526 1572104 1594193 1773141 1617578 1465116 1693761 1633838 1773520 1869530 1888598
16927 1888598 1700894 1616782 1874518 1617502 1948077 1773428 1651917 1782171 1943840 1774516
16917 1774516 1480373 1549287 2077599 1921956 1513504 1908374 1740698 1792182 2284961 2202120
16907 2202120 2019362 1944985 2185915 1999429 2303548 2007739 2143436 2212409 1802177 2127378
16897 2127378 2087490 2099967 2053981 2823468 2006371 2304026 2415799 2604340 2691450 2524213
16887 2524213 2493517 2341231 2795357 2160593 2555678 2812059 2845029 2699965 2563940 2649417
16877 2649417 2657081 2909893 3081899 3033545 2681374 2883813 3001729 3284291 3228694 3214377
16867 3214377 2794810 3137780 3297767 3344123 3287224 3331463 3327933 3493249 3500481 3425348 3563255
16856 3563255 3650435 3454025 3834339 3897515 3579547 3777118 3630900 3819697 3991492 3900902
16846 3900902 4117212 4080423 4243240 4521535 4241697 4298965 4471509 5018701 4431597 4794971
16836 4794971 4646842 4645950 4678810 4940017 5225598 4967522 5187978 5289853 5345804 5342604 5504666
16825 5504666 5651952 5481586 5958077 5957409 5755277 5918908 6108602 6299214 6176783 6225093
16815 6225093 6269607 6587632 7094407 7010920 7114029 7377576 7254745 7371041 7601473 7659985
16805 7659985 7656282 8087695 8292930 8429912 8659190 9069140 8989158 8861205 9130316 9283191
16795 9283191 9773146 9739186 10043724 10509909 10551759 10742304 11097928 11242704 11192936 11862743
16785 11862743 12162793 12527811 12557531 13215180 13382399 13709348 14123302 14268136 14610907
16776 14610907 15208540 15704667 16046517 16519612 16799060 17576435 17762815 18251087 18647646
16767 18647646 19613977 20098680 20513044 21266962 22156447 22722156 22998329 23882963 24846054
16758 24846054 25429343 26670897 27233943 28512977 29271009 30557526 31333208 32477998 33595944
16749 33595944 34873280 36322807 37803851 39400999 40584663 42118388 43426130 45367769
16741 45367769 47020361 49213490 51026368 53495310 55469615 58170296 60425577 62717470
16733 62717470 65492769 68550443 71789325 74487110 78217045 81593704 84714469 88522720
16725 88522720 92507498 96082154 100250343 103867489 108166913 112311574 116555308 120294124
16717 120294124 124578777 128031365 131842664 135096001 138073824 140756015 143145576 145049995
16709 145049995 146787711 147455766 148190869 148301988 147577794 146446309 144860569 142806653
16701 142806653 140302507 137366313 134301748 130846633 127317643 123240683 119718095 114944418
16693 114944418 111588379 107211393 103095901 98630264 94905861 91117349 87226310 83812540
16685 83812540 80157378 76767013 73145198 70277625 66836125 64151941 61564477 58820017
16677 58820017 56577466 53867204 51661056 49771885 47767531 45776967 43691051 42177478
16669 42177478 40278001 39027019 37522500 36049724 34378500 33091550 32085660 30429766
16661 30429766 29734146 28501284 27639196 26404071 25945099 24993322 24086506 23407404 22712322
16652 22712322 22010824 21540744 20617754 19768145 19254676 18794780 18212016 17528665 17053978
16643 17053978 16861424 16358589 15642840 15510089 15232528 14298286 14225298 14146777 13481130 13091046
16633 13091046 13055175 12397831 12457935 11571772 11462523 11410602 10880739 10682303 10318775 10519846
16623 10519846 9925425 9669824 9571497 9229833 9017976 8900825 8781548 8560404 8487486 8443017
16613 8443017 7861191 7950521 7967678 7864260 7415282 7447381 6976435 7059316 6965060 6519293
16603 6519293 6714012 6470844 6312147 6511340 6132863 6101627 5947079 5623921 5695453 5566170
16593 5566170 5782850 5271812 5613654 5078305 5168466 5149098 4929418 5080010 5217444 4812999
16583 4812999 4655604 4633417 4397124 4532317 4521493 4516905 4248515 4399353 3914534 4292904
16573 4292904 4248968 4098732 3716479 3750448 3694605 3639401 3776794 3662796 3475014 3460285
16563 3460285 3520194 3371301 3275635 3182639 3049789 2999262 3058897 3261346 3126913 2677953
16553 2677953 3134262 2976141 3384790 2922079 3068399 2680375 2851607 2664209 2587814 2653675
16543 2653675 2727548 2655446 2441721 2864394 2505813 2751922 2311784 2533225 2359173 2581666
16533 2581666 2161170 2187674 2536431 2061862 2165939 2157577 2286527 2114955 2265513 2183315
16523 2183315 2095660 1806958 1865247 2075439 1975876 2019779 2253689 1957786 2114754 1853081
16513 1853081 2072294 1771733 1607961 1679895 1518416 1671013 1489501 1525174 1645719 1574422
16503 1574422 1695990 1748228 1982085 1700365 1625978 1556779 1531415 1791107 1480712 1731135
16493 1731135 1641710 1615311 1596394 1340353 1696259 1521176 1780502 1375789 1257675 1613360
16483 1613360 1583393 1532531 1324853 1012398 1426472 940734 1441001 1327160 1329635 1293200
16473 1293200 1618943 1435483 1358998 1177770 1475602 1378797 1078923 1218107 1547286 887531
16463 887531 1461953 1480641 1324253 1135714 1019824 1084070 1023040 1410714 1113722 1016455
16453 1016455 911617 919194 917024 1340578 1147489 1321641 997707 904875 790402 1157281
16443 1157281 1252457 864088 998475 1278240 902917 1023444 1041620 992609 1102826 981926
16433 981926 923562 573908 672909 1271616 872858 739620 1190400 828220 1001033 1019465
16423 1019465 738836 930965 885318 937628 804656 900534 610452 764618 1009126 678057
16413 678057 986216 879963 598373 843061 832664 704743 880653 918986 592374 601278
16403 601278 714346 593084 807709 728687 549014 520293 872147 747128 590188 788566
16393 788566 448056 608516 597265 821396 572549 639279 912041 770989 548537 717860
16383 717860 598526 756810 452920 935735 459256 578889 722014 472949 943285 683765
16373 683765 599482 717727 666754 121242 514337 561151 725767 511476 699108 507704
16363 507704 529034 358855 818203 612747 707572 697468 487878 779694 353303 483309
16353 483309 600941 157938 332709 592056 327997 472640 524566 293627 830355 461416
16343 461416 561297 361389 402582 584741 527106 393815 542699 510615 535114 415022
16333 415022 670379 714767 642294 864003 354055 207147 606020 679952 332006 564945
16323 564945 646368 636414 360480 678301 468676 521065 339682 362197 354108 390577 323146
16312 323146 509781 608103 614724 255093 591113 553387 513299 248284 427764 441899 494072
16301 494072 111249 445172 551515 325641 337433 370533 360408 359371 300702 227204 544193
16290 544193 605707 454565 277297 593020 100371 454573 654522 272702 435184 562479
16280 562479 495515 104122 136161 528385 128299 679053 586098 714394 367418 99516
16269 278464 227464 407472 385502 549973 350539 -5551 152189 553224 480624 399414 377371
16258 377371 443942 177116 468828 -95935 488042 261280 375370 96746 693300 23458
16247 11655 315168 331643 333755 12327 597187 92368 189777 316766 219331 294981 178660
16236 178660 122468 202044 -10698 200332 205709 366263 359185 328895 151980 204676 -35571
16224 313486 337854 337262 -50954 3781 310620 161029 -195987 281076 185177 270051 319496
16213 319496 73097 287432 571568 383721 -25224 52371 289336 264354 637182 309226
16202 343067 -25080 -124339 -80159 278431 265368 60725 114593 162028 256814 395674 308369
16191 308369 50404 243550 291431 485398 338875 -91274 181565 432148 499416 188052
16180 127841 185389 -50264 241130 458935 -95206 319569 226714 280378 -30502 19518 -76187
16168 159162 181840 388928 -66912 115723 58392 44005 -77666 209450 234913 526942 110995
16156 545618 122446 63806 173632 198537 26507 -174585 109426 517690 292699 51622
16145 168593 242712 145807 -91306 114962 235912 177548 336082 446913 -2564 194964 273343
16134 273343 310401 272845 340059 362040 97373 -92477 74904 -137969 289236 108098 -87670
16122 422189 -82474 276790 -139945 -171790 -43376 188342 190623 61366 298865 147799 43712
16110 51591 138172 -274555 161797 174603 144420 383023 -247400 50748 261280 200677 279303
16099 279303 -14237 212359 -54602 157554 -159525 177979 -107895 246299 101685 -119147
16088 416082 155835 217351 89771 177928 -285934 224634 -24723 318038 72219 55552 -263
16076 249384 242966 333320 298567 264445 155615 -116435 220217 180390 311278 -94768 125308
16064 164947 40723 -46166 -112276 408257 -2509 119442 223122 124488 87771 2296 -99855
16052 190566 309240 -107031 394222 -58506 173633 86050 -78714 117322 14899 -26387
16041 104020 130672 -12937 -194396 -11125 -22915 35906 -27172 107422 193476 -12721 111440
16029 109152 -118551 -139160 44311 288394 -27098 -139788 -379518 64467 -30892 -30677 -3016
16017 -32703 -128998 48165 51711 23325 136886 126263 -141393 -40256 -93968 421073 -147875
16005 -49507 162372 148936 60375 37374 44901 -215490 -113968 30640 -126936 21890 46438
15994 46438 144726 -132603 333574 73560 157083 -79887 -76778 128887 136126 114966 148248
15983 148248 37345 67289 135584 171315 116854 259596 37207 499678 -24084 564868 300333
15972 300333 485688 803080 700565 389490 893545 926917 778920 471962 460825 281350
15962 281350 -145617 -63390 -69266 26886 47657 96785 -187437 -25591 105184 74313 -188341
15950 -10232 57593 157857 -52569 25740 -134712 216763 -417095 80623 -37825 -98965 -348674
15939 -348674 -206576 -45969 -53858 -172648 -34751 -139958 -145870 184378 -69944 -42119 378656
15927 -420627 117987 372452 -117437 -180846 -59941 -112040 107574 48883 -25652 -122881 -176071
15916 -176071 -118918 54125 -300744 74669 111608 -225657 23819 -199546 22590 -73347 149231
15904 -78368 265564 -93405 -114580 -29824 -46487 241736 -34962 -321164 94823 65435 -109009
15892 -312264 -281376 137020 159527 50639 -251072 29768 -160684 -221882 105816 -193466
15881 -261751 -201179 168022 194592 43997 -7642 -97349 116480 89212 -84965 -159654 64507
15869 -350355 245831 107706 152284 180793 136192 102141 1684 -75037 -82152 -124165 14795
15857 117675 126421 -139582 -370530 -219688 123122 -72464 166527 133935 120173 -192724
15846 -272520 163403 -134704 -195834 34180 -102569 -49920 70619 288566 -20123 14053 195699
15835 195699 -43881 -284593 -68025 -371481 345189 -5064 -166159 -158041 106998 -41214 118137
15823 -237951 188281 260288 -298914 -175331 265730 -253101 201590 -126903 -368298 45035
15812 -258917 28404 -118319 12209 -105290 29055 -132086 -187287 -16674 -287280 77870 144477
15801 144477 68479 -23364 -135573 -8567 24739 -247078 -10849 -359758 -231406 -69233 245555
15789 -27387 -250934 -127872 225714 213475 239150 -33827 -125232 -135681 199222 -174850 -155370
15778 -155370 -3001 142924 170011 -533364 -51037 158191 125796 310056 -88793 -80045 31653
15766 -51322 -179855 -97080 -68624 -158634 93392 202624 -183696 153946 62234 63780 121223
15755 121223 -115469 6257 195616 75170 189656 -36292 -209015 -4123 -279448 253635 -341
15743 228267 230225 184804 131446 97524 -112907 -111346 177648 118934 303287 48906 -181278
15731 -52146 -138891 359031 104889 74908 -153221 11664 -187194 -38016 -182830 -419244
15721 -419244 -55629 -94004 21359 -130489 -82285 99961 57139 -86443 -249067 -140641 -108309
15710 -108309 -172980 -47216 136988 115585 -47994 -82196 -117908 129983 -12586 -124767 54261
15698 -249067 -167422 -142946 -99060 241562 5909 -218246 -413409 -4614 329460 122008 -254441
15686 65347 228892 79547 69921 -186787 -127727 117778 74571 -86118 -246231 248598 -168146
15674 110360 -215711 -9527 -87663 64877 -89022 29799 -126466 86040 -454288 -301297 10383
15662 52104 280983 319398 21671 -399685 206350 -170668 124138 256493 -7789 245455
15651 369869 -166394 -178353 -173154 363084 -81143 150775 177688 75135 -279636 -291213 -229643
15640 -229643 282907 -143226 -78328 -224998 84934 81080 -299022 57223 -348650 103774
15629 117828 50267 146121 159271 -89353 73839 -160203 -40951 64442 14398 351434 17738
15617 -387013 111096 72924 148102 -59571 -67345 39052 -146251 40045 15949 9645 -173977
15605 86954 -89630 -39320 150415 -516207 110437 -78352 50175 -112942 -48328 92901 -229375
15593 92928 163146 7734 -208468 -165988 -228047 -363540 -337660 74002 -27625 179804 68504
15581 266754 229641 52492 128814 86345 115775 -58299 -96543 -186193 -259615 83677 -288434
15569 -81066 164841 -14109 2744 5294 18241 -92755 -238726 -76148 64560 -344641 5601 198842
15557 198842 -200440 -142645 -148233 -15586 71302 169245 -309509 -38829 -236692 -103674 316357
15545 453310 66040 130405 -277360 96866 -159788 -222094 -286134 -116620 -208206 -57104 -46436
15534 -46436 74394 -71141 184337 -190321 -21408 -66958 -112529 84491 78585 58576 -280550
15522 103208 524 156703 65459 -165157 32362 136376 -140551 -191548 -247639 305313 -19490
15510 -376707 33334 -94431 144614 249571 -80879 -50903 263899 -74566 -47107 284104 56232
15498 96662 67226 -15658 -134341 197846 -16553 131984 -136562 -14478 215352 177802 -12353
15486 41170 71804 339480 183188 159001 -195667 274864 -29478 148737 -343094 -223835
15476 -223835 132230 197613 263015 -55478 124776 204986 74962 164037 217113 230766 177563
15465 177563 100737 -38226 252585 339 165146 67563 453861 270502 614544 515295 554295
15454 554295 128874 298563 -34546 87695 151485 137528 221395 341149 -67073 112090 35765
15442 -129170 192982 116867 68956 -107783 197083 -2913 283312 -60940 -126597 35033 265445
15431 265445 -136232 225643 302428 158328 555686 251655 736609 433603 590000 685581
15421 685581 11314 52478 555419 384141 209490 -211193 -79697 -35780 90938 -12864 -226405
15410 -226405 36515 4945 -164071 63142 165412 -288145 40989 -78389 -42044 69923 -203527
15398 -109189 -107461 39601 -107717 227335 107960 -100176 147740 -312784 25620 314379
15388 314379 34816 432975 -183483 324927 232321 48460 -98725 -92648 46601 320001 60565
15376 22837 -28542 -454 -86998 131606 201773 -20618 4712 135874 101986 211813 -432594
15364 280563 -33347 -112927 -37442 -308947 82964 224243 163708 -107099 140795 350350
15354 350350 30603 -66146 70533 227708 189640 172892 465992 502125 318194 222842 208147
15343 208147 288389 510567 242147 10163 -102561 409609 7568 -55587 -29643 188943 157413
15332 157413 312167 -245526 183992 244153 275502 294162 627336 527580 77786 312892
15322 312892 414463 319971 -236045 321658 159973 -198228 193584 97217 -211513 185024
15311 -2879 147727 185233 -53283 192471 -64946 66367 49958 158502 149163 2908 129107
15300 129107 100515 -113536 61970 -156535 306631 -92760 288350 214661 -1952 122296 240931
15289 240931 -96190 10548 92672 -167199 -135453 376 -481989 294764 24209 157026 69491
15277 -124296 -108857 107276 -33986 68621 -56172 47407 218827 43876 -115581 -198635 -245392
15266 -245392 123882 -26113 111308 244017 -50084 -53434 -51740 -186344 -23406 -28180 -1685
15254 -71868 -439858 260628 138237 102291 347823 26682 -30796 16472 -10327 -56374 179912
15242 99501 383134 118182 94433 59956 221405 -197702 -63200 285501 270002 46041 444500
15231 444500 268099 494009 855510 1583906 1167808 1163180 1258136 1097337 741564 172888
15220 91795 456880 88324 126943 61151 -91966 64898 -237191 -221926 -238338 -234865 118909
15208 -166751 -259206 38017 -84981 62220 245980 -141825 66007 168627 78031 14123 -74194
15196 -112491 -6363 -72274 -178221 2692 266883 -13632 -54311 -296756 -42383 -82692 253489
15184 -317878 -279125 26368 415256 169972 -8435 29727 84915 -77272 -17419 18740 48638
15173 48638 -141069 10177 243534 -2262 254480 -68336 147764 123548 235591 220875 57726
15161 197195 -60964 70688 97191 101061 217294 -121487 16000 79798 -175824 28064 560711
15150 560711 104531 98739 15822 194522 198530 26087 -7269 141008 373112 82010 62912
15139 62912 -107150 -25154 270657 140251 194250 292442 86100 54867 89028 35077 -120688
15127 -182548 -104100 434851 98607 82232 547899 -4688 -98791 -36089 138199 188467 207878
15116 207878 42890 262692 176238 121866 88636 -26366 -243160 107117 316714 252264 200377
15105 200377 335741 78828 240688 506248 14681 274455 143876 265843 252623 284053
15095 284053 -93103 233414 57015 221970 -225696 46914 278898 -123750 176081 -67333
15084 314762 206558 185217 -70316 64449 31899 253405 351966 19520 158571 85772 230868
15073 230868 -206310 250784 304256 11892 188799 -26895 181374 377295 -29438 307519
15062 122763 348403 290633 207711 109727 104179 70387 121199 171134 149796 98353 346957
15051 346957 249469 211856 313992 -33733 325363 126042 247757 22103 199309 207366 51573
15039 204728 55482 64176 79795 109386 98981 251314 687773 372183 392007 412451 344677
15028 344677 434622 237907 204854 288994 88285 248159 572040 505940 171266 367568
15018 367568 239655 325840 590064 459376 768627 863183 493735 484593 801954 281774
15007 636993 147442 615182 583222 279237 629143 111855 608537 162284 317838 422912
14997 422912 65169 433129 333619 610664 337122 372205 529699 80735 436201 294624
14987 294624 401763 550995 228256 -6967 509260 453577 404828 614986 559411 220872
14976 441790 619187 504608 618320 214182 503161 573372 416902 598535 367571 528744
14966 528744 747209 689245 481406 730218 800091 539285 108692 477198 724996 407758
14956 407758 635659 616093 500825 805311 614862 490370 413347 479294 152366 -242202
14945 532408 373553 266699 106463 351375 190373 449280 257641 90718 375703 443737
14935 443737 637939 353574 371800 540146 430958 500132 586991 23951 356833 399036
14925 399036 323400 651253 553643 675035 228841 381672 338585 426658 615316 487931
14915 487931 461054 767532 938676 1295830 1478545 1392716 1311130 1280063 1231073 1608163
14905 1608163 1275115 1218396 1466968 1204778 1412848 1976600 1682584 1562498 1426667 1328672
14895 1328672 1007677 910762 674807 583587 899397 641299 554009 404951 446448 536031
14885 536031 371500 600904 369499 446312 465173 335485 549424 300258 222943 355513
14875 355513 442296 457976 151722 458165 549539 545357 570186 793096 674550 642202 404948
14864 404948 654084 904615 578498 1126179 816855 876911 431995 360639 642946 516052
14854 516052 459071 482647 319325 917833 633814 594293 548951 502274 720593 630466 332058
14843 332058 698661 244705 802233 590703 554260 481455 870873 469351 390359 352015
14833 352015 335700 414964 489026 231308 447614 572540 498556 1262299 1044388 1139704
14823 1139704 918719 1114057 1061885 797345 940942 586637 821059 566166 363130 558841
14813 558841 493652 554518 494291 560962 695591 309677 500368 510594 519975 613978 742401
14802 742401 568265 865584 622627 712638 649065 711251 758690 712163 536847 824461
14792 824461 647482 634050 438907 854353 919029 826747 893995 982772 716073 712981 545246
14781 545246 319536 18576 681811 814476 889331 215310 510143 435000 676510 721281
14771 721281 473751 719174 905717 376040 895077 523107 614850 686496 740906 976721
14761 976721 537271 889921 859970 921337 668816 1128411 841674 907054 655078 605581
14751 605581 760543 822659 649418 610028 699300 601320 534556 652695 548268 912846
14741 912846 492632 676825 970230 502569 529588 719543 543165 697299 1175039 546137
14730 637979 490965 830759 672384 816601 791539 557395 701705 957588 875448 748658
14720 748658 627500 821836 750725 614232 1282811 964181 1103050 908396 1148830 1404566
14710 1404566 1194064 1557093 1416918 1510394 1012148 1336046 1464594 1054766 803139 1038780
14700 1038780 947606 1093406 834526 944906 765002 1076933 985950 913279 765547 957424
14690 957424 684939 1253660 820413 1092831 1523410 1086705 1254597 1569475 1491178 1391893
14680 1391893 964797 1144095 1343728 985541 1240321 1059085 724320 1033448 955609 608117
14670 608117 757898 915747 763841 1310746 1206156 841258 882633 1112946 871632 1215276
14660 1215276 808430 786606 839319 1082717 809404 780349 1253288 1113342 949431 1245764
14650 1245764 1060732 1216600 993696 1050100 1072919 1119975 1391189 983304 724916 999684
14640 999684 1232325 1152361 1422242 842551 1180336 949212 1288103 1423532 1082973 1293986
14630 1293986 1191654 1323964 1273462 1295374 1374712 1275204 1100907 1256237 1190856 1228905
14620 1228905 1266902 1152045 1376688 1153346 1244724 1632669 1815809 1365362 1051272 1273757
14610 1273757 1273237 1391677 1226331 1300238 1337515 1040658 1313529 1492575 1291348 1660751
14600 1660751 1530612 1250018 1704865 1639839 1476696 1447115 1518526 1585104 1504405 1127747
14590 1127747 1630404 1582645 1770629 1505957 1651555 1626343 2058501 1652984 1688461 1598010
14580 1598010 1838901 1697126 1754771 1761903 1705781 1591976 1581361 1592903 2057342 1746243
14570 1746243 1828696 1941884 1943552 1953364 1961630 1649003 2073710 1685023 2227597 1918342 2346076
14559 2346076 2155796 2130281 2288141 2335170 2382602 2255510 2051614 2363087 2372150 2500918
14549 2500918 2776937 2671946 2716514 2682868 2961236 2985186 3054655 3162434 3841856 3935132
14539 3935132 4190489 4481843 5302880 5689204 7369776 9930999 14116834 20248803 30362337
14530 30362337 30745614 19332429 12782094 8494871 6027552 5395096 5268352 5052874
14522 5052874 3702431 3171597 2578812 2591647 2430266 2567640 2382855 2723310 2098934
14513 2098934 2331180 2537215 2392305 2540944 2511327 2666509 2447434 2504960 2579912 2609988
14503 2609988 2470136 2648311 2531972 2580221 3135885 2801681 2989333 2920776 2663817 2694418
14493 2694418 3192898 2762054 2897138 3201614 3101598 3342066 3238513 3243225 3412764 3357891
14483 3357891 3315302 3381478 3404567 3315207 3384882 3294294 3347341 3525554 3492384 3403965 3424472
14472 3424472 3744070 3983759 3584557 3790169 3736404 3820221 3817224 3924241 4216948 4224505
14462 4224505 4282391 3814415 4275646 4326262 4238725 4359386 4570548 4549743 4494767 4711964
14452 4711964 4591790 4975688 4543834 4823531 4797080 4733080 4893892 4978286 5076574 5289059
14442 5289059 5079180 5150898 5372794 5728407 5098479 5344570 5521443 5634416 5256206 5506654
14432 5506654 5788767 5683118 5909709 6178098 6343803 6423985 5923056 6411968 6596045 6614443
14422 6614443 6572941 6944720 6713971 6976477 7171802 6785829 6937965 7444117 7414102 7365711
14412 7365711 7595372 7698706 7866983 7704890 7909832 7975809 8461557 8733554 8609577 8700059
14402 8700059 8882043 9435481 9116841 9529147 9490862 9196982 9469752 9704723 9724911 9727626
14392 9727626 9806265 10329468 10606242 10583998 10829042 10780398 11414616 11642640 11480934 11391706
14382 11391706 11836007 12098390 12016572 12235801 12363920 12415834 12800977 12987025 13172805 13277647
14372 13277647 13352936 13972670 14059893 14301804 14721553 14946497 15494416 15463507 15995715 16171797
14362 16171797 16546775 16824299 16731845 17647229 17875255 18467082 18498577 19112087 19479306 19678887
14352 19678887 19893842 20603122 21101558 21555327 22251902 22718283 22755013 23489558 23883199
14343 23883199 24460931 25214346 25689753 26091756 26713180 27572410 28114689 28420453 29543181
14334 29543181 30170454 31255922 31995679 32765094 33443441 34726791 35633737 36440351 37736576
14325 37736576 38485505 39590381 40664487 42002952 42944168 44537241 45946688 47250866
14317 47250866 48539630 50031863 51644782 53656831 54858857 57236412 58991867 60849451
14309 60849451 63343304 65226872 67847680 70198838 72712098 75128034 77992383 80726689
14301 80726689 84188471 87064618 90780164 94168946 98325052 101975251 106557514 111032767
14293 111032767 115759582 120739971 126503331 131872822 138150478 144254265 151020786 158289867
14285 158289867 165652019 173909640 182756011 191409557 200792596 211155706 221731149 232729052
14277 232729052 244392559 256433022 269415584 282781812 296702240 311256493 325955238
14270 325955238 340983308 355961386 370206097 383883611 396750718 408626560 420001450
14263 420001450 430300077 440003279 448808698 456565896 462702893 465815309 466004360 465841085
14255 465841085 464795576 460051698 453476800 448541960 441844213 433664973 423449839 410661239
14247 410661239 396985423 382548529 368743292 354898108 341106258 326269399 312538502
14240 312538502 298903887 286115036 273253135 260931452 248601198 236903477 226491251
14233 226491251 215782844 205220366 194754706 185059572 175821665 166862223 158976767
14226 158976767 151394527 144721426 137942331 132169407 126159075 120614024 115433428 110621683
14218 110621683 105761614 101849286 97894579 93807786 90247731 86630370 83357433 80250034
14210 80250034 77375837 74543209 72007826 69306385 66829462 64467579 62695838 60506401
14202 60506401 58546906 56681093 54959549 53589701 51807123 50117939 48581712 47008476
14194 47008476 45708915 44911356 43772296 42381511 41305880 40003717 38835207 37876006
14186 37876006 37041496 36043351 35016124 33961055 33439019 32413702 31674531 30878259 30343342
14177 30343342 29384270 28731663 28017046 27132566 26884434 26259837 25633971 24899642 24669600
14168 24669600 23918521 23486284 22962944 22190088 22122401 21465600 21207890 20699206 20228704
14159 20228704 19991210 19795107 19221401 18916163 18549385 18088670 17642328 17578932 16927937
14150 16927937 16705558 16863059 16320058 16468004 15511731 15739609 15235369 14870867 14384053
14141 14384053 14294172 13898329 13757605 13318079 13640926 13663255 13014991 12987352 12713685 12631774
14131 12631774 12309275 12145357 11661320 11756060 11312267 11486757 11187835 10982331 10479737
14122 10479737 10392607 10595040 10348211 9922143 9957067 10064676 9869096 9826828 9412535 9071607
14112 9071607 9215155 9178562 8879868 8989290 8662808 8845071 8527703 8461624 8206374 8308397
14102 8308397 8152839 7942515 7739676 7955901 7710578 7322485 7236637 7281861 7135483 7486757
14092 7486757 7037763 6976287 6943090 7010757 6454827 6587811 6440895 6479836 6509956 6295319
14082 6295319 6920401 6330981 6092403 6078257 6064145 5863310 5836716 6092329 6071912 5472058
14072 5472058 5344025 5775059 5456139 5453035 5643667 5408100 5440033 5536307 5178940 5341585
14062 5341585 5065090 4731125 4963234 4919886 4894444 4609080 4933317 4612282 4588356 4589596
14052 4589596 4618043 4641449 4681233 4494834 4541147 4537413 4508610 4262962 4255259 4501702 4521255
14041 4521255 4331736 4049004 3956600 4018350 4086611 3767566 4061898 3758997 3744841 4048532
14031 4048532 3819940 3791922 3529832 3496054 3730698 3144159 3638861 3922942 3729510 3502851
14021 3502851 3528188 3573641 3381693 3488639 3343666 3395313 3127893 3431033 3174129 3235912
14011 3235912 3381218 3228006 2793531 3046914 3258478 3001959 2930096 2991254 2741819 2787736
14001 2787736 2847492 2814470 2611351 2967705 2569037 2521352 2457753 2831140 2398400 2702860
13991 2702860 2719574 2401629 2855397 2409404 2528412 2238584 2381962 2571577 2486141 2393078
13981 2393078 2513411 2626180 3228971 2908687 3293159 3812896 4936692 6587141 9981722
13972 9981722 15532708 25646238 32137131 23175899 16146657 11695114 8650403 6809038
13964 6809038 5352656 5059694 4612050 3608720 3849285 3648477 3508896 3140140 2810250
13955 2810250 2608151 2796393 2613944 2866318 2515043 2594862 2753369 2067995 2417810 2636618
13945 2636618 2275913 2334173 2157837 2149605 2171278 2309199 1973929 2005919 2272816 2178859
13935 2178859 2169683 2197488 2288346 2135660 2203487 2362287 2056081 2044714 1990716 1778375 2088067
13924 2088067 1913014 1928057 1935194 2119264 1605064 1646873 1730573 1481123 1876009 1641147
13914 1641147 1916184 1742127 1846329 1772416 1662719 2066102 1525034 1644909 1504155 1751556
13904 1751556 1829722 1723909 1623978 1675396 1719523 1534122 1838217 1777754 1581495 1386693
13894 1386693 1636384 1496203 1427927 1743477 1355269 1422626 1424841 1202067 1851010 1663761
13884 1663761 1806752 1597248 1526848 1661428 1607689 1501459 1554295 1282795 1394104 1774931
13874 1774931 1345408 1156894 1349864 1659796 1263055 1142897 1237296 1310353 1116297 1304170
13864 1304170 1471882 1062494 1243045 1439681 1421202 1508643 1319717 1476686 1481003 1305581
13854 1305581 1002929 1381970 1204807 1131083 1111421 965642 1406262 1043086 1032182 1455918
13844 1455918 1092042 1264124 1036017 887311 1229784 1307595 1374649 1112190 988104 1441744
13834 1441744 990813 1154717 1365311 1003618 1022873 1201102 991072 1099732 1131267 1322419
13824 1322419 980540 1102866 945844 1089174 869678 1329829 755102 1349735 1433683 826846
13814 826846 1011265 1204518 934546 738527 869344 946251 817344 748813 1089780 1014225
13804 1014225 924080 904899 1042603 1187784 1071977 937021 849550 861150 1031459 1132398
13794 1132398 1220914 1054211 754874 1007001 947881 908228 1174503 1116052 593228 878601
13784 878601 1008650 745433 764408 863604 1014367 1144964 812563 917240 897071 636457
13774 636457 719122 876155 1090603 1071461 869714 939901 1122138 747246 955558 832832
13764 832832 869483 1011193 918984 757850 523255 886782 779658 864607 1015605 783917
13754 783917 930348 759497 978048 862969 612514 744269 886827 939423 957927 751381
13744 751381 655586 931004 726014 1032762 655168 701858 588778 720775 758891 752056
13734 752056 680719 945512 792302 872438 827624 480301 679706 644883 879307 634972
13724 634972 614560 586372 756506 743543 788630 728626 641055 841272 456884 381325 886685
13713 886685 532957 599483 835163 637943 573907 601658 438474 748630 540579 -67359
13702 603110 751844 708214 813739 665981 821165 766857 455811 512873 529730 855191
13692 855191 542257 496018 613483 294632 530333 218516 325581 525637 499416 736531
13682 736531 606048 800278 609319 716883 328548 903330 588668 850771 396816 499943
13672 499943 752418 426986 393488 618525 549163 674427 649759 366010 534473 535492
13662 535492 620035 696058 465101 388585 675496 447209 587732 729714 657828 373616
13652 373616 601358 365438 654678 708862 910935 494477 580573 578433 439727 369599
13642 369599 324581 655369 276020 488756 670638 602214 496375 364141 568948 451307
13632 451307 671673 634099 660705 408886 569679 372632 308336 314400 743309 337488
13621 622069 528665 338476 136062 246760 667159 436648 178698 647187 445339 539015
13611 539015 353034 318227 594262 63451 47369 313293 450598 757952 550859 554383
13601 554383 575634 470926 500533 479779 451569 425376 484376 396331 284331 536406 287444
13590 287444 362213 451335 351504 285143 459965 572199 507461 105139 461367 579559
13580 579559 295011 400323 474476 293407 362383 557037 446634 241471 365068 636562
13570 636562 248538 332108 139017 497758 285624 421601 283731 250739 395104 243607
13560 243607 327867 367577 730438 616625 358169 590398 552199 346962 255131 477160
13550 477160 484769 565478 463807 361484 434761 422680 268847 547285 335624 437856
13540 437856 114627 358186 140744 516825 356996 303277 108386 512830 713742 386759
13530 386759 192391 525145 464391 231610 323726 393056 129527 114214 171058 338181
13520 338181 217866 408222 529962 480964 412115 523491 410114 345445 192707 195054
13510 195054 204159 77865 135773 140616 451144 770768 502541 -26957 625121 332443 584039
13499 584039 181001 228719 574721 72513 503245 78707 292874 382971 566195 324200
13489 324200 134126 372512 723572 65934 339433 75605 324241 172709 338341 189479
13479 189479 207491 391856 139495 630853 446958 144707 379005 300331 402917 225054
13469 225054 -52648 297453 322757 339155 158222 198720 193825 449257 347128 413032 19832
13457 236651 496294 114201 491123 224826 111853 53987 587887 151189 478392 282117
13447 282117 303373 42460 213494 241624 422100 -85905 224220 698936 595960 98720
13436 3014 -28633 366689 255423 315417 193773 266791 178830 533810 173592 -10093 328523
13424 365126 -52200 462945 338191 244101 -175002 418711 255032 218624 330108 294987
13414 294987 261182 202592 318237 229122 434720 71879 339089 31589 423102 98897 110409
13403 110409 86140 285155 290612 168729 293898 223539 423998 456515 420031 -126836 450927
13391 532063 201880 329554 282847 321133 100867 333414 578495 273061 226340 456328
13381 456328 299365 114763 390289 631954 119268 64647 254804 338532 340907 346546 613941
13370 613941 94320 173963 47840 -16893 283870 -23573 -273512 113170 154914 249960 -96185
13358 216236 166395 301501 278429 386682 355025 -109687 394090 418382 434374 270163
13348 270163 463244 -2230 302742 532430 -279861 116031 -51222 216133 121118 365214
13338 365214 406782 83282 153325 28110 374187 490262 210000 507642 124266 20882
13327 366202 53550 198732 313979 221572 394396 461159 265513 358450 215802 -7860 241932
13315 280949 277451 208381 363299 -17244 117351 -131937 152893 215772 -8732 474676 -30145
13303 226646 277399 357043 617383 283699 75788 120962 240669 155014 89637 232505 484869
13292 484869 140995 558696 251079 114755 142080 218755 -46674 467265 337481 207257
13282 207257 332099 375625 209045 213987 169970 -175454 324973 -129963 -106951 113882
13271 213125 119243 77929 -81657 -175319 353665 494222 110847 -54700 163071 69912 259892
13260 259892 130313 66195 202090 505303 318600 253222 209195 259957 344680 113562
13249 431228 257163 107154 279885 -11604 -26567 -55591 192764 -61191 123445 123092 43889
13237 -182597 285460 34472 286991 -92990 147725 283982 379026 322578 180055 252677
13227 252677 298708 38781 -107052 -219036 133689 52028 137125 78110 100643 141621 268192
13216 268192 91868 -115726 193691 86863 206395 83097 314449 -73992 300030 289614
13206 289614 142575 59791 107216 -38530 241156 286635 -96345 399400 182146 -34393 104239
13194 269816 110434 202379 185563 333830 307114 162292 447441 -80351 -10842 225383
13183 172681 96910 235538 168156 271394 -57382 150934 187202 16238 -155241 -71341 -186867
13172 -186867 167322 112077 -55908 138581 75847 81351 308891 -73855 -68767 24174 156685
13161 156685 117975 -110270 212609 307716 290723 82772 136542 302728 60034 105052 -53926
13149 -178913 81720 106242 -31584 105151 67947 -76908 -196761 39182 89733 83384 167026
13138 167026 129906 -65109 -112302 97298 62389 -67058 -317206 293090 104227 -1971 182657
13126 309919 267347 243895 364527 32969 16718 208260 236393 -125489 133255 -103542
13115 15935 282294 335261 26153 203245 -124386 -20155 138175 57939 59449 484630 52292
13103 -97761 -199422 -19398 196375 7414 167796 -24423 408005 42296 373106 -90219 362916
13091 188360 385815 27205 271734 56743 5396 95871 325249 252688 -14034 83945 -57489
13079 -53811 -403696 307910 83219 226454 257044 -159411 390845 299482 18338 30865 198916
13068 198916 15374 359402 103767 -96233 166719 58711 -74859 273617 96084 190599 -175107
13056 83535 -8485 87665 203985 246332 67496 138832 222033 25230 421513 228125 205792
13045 205792 296371 278264 113831 380430 118417 -181588 -17983 73557 135334 252246
13035 252246 243271 194209 63152 -140439 184653 427598 271170 112019 -59744 177323
13024 -53015 -81602 -6501 50814 108232 141994 49834 87414 -270227 -28811 121534 300013
13013 300013 521426 -225168 -70604 435678 338685 28321 231776 -3820 -76983 91906 -19497
13001 91170 -50606 193404 -33168 141388 29381 56319 -30402 229983 97280 255071 219874
12990 219874 -27968 291045 195987 35821 367014 -103702 353745 152056 -133524 -344639
12980 -344639 52545 32401 -174733 291417 -10627 167192 -23702 19581 62088 234078 156744
12969 156744 114856 197226 286569 -82995 7537 32314 -165026 -195506 -183776 122038 -5139
12957 -145547 110339 166722 -271443 106460 17138 -83955 102021 -121885 149486 -304913
12946 75286 72992 -61035 110822 3881 231201 8369 66408 -143177 -99334 8647 45925 155451
12934 155451 -82228 -251425 233122 -105036 6115 -27133 -148710 -80671 25560 150518 335293
12923 335293 -7842 -72525 267798 298767 -45628 264083 301220 257908 85852 35045 151494
12912 151494 -226901 -30353 9949 -6192 220473 -57179 -47642 172457 215364 -182250 427363
12900 119582 71169 -43780 -90417 40642 -700973 -53973 -77420 119617 -32243 -198690 -155732
12889 -155732 64963 -129050 79227 114035 -130169 -28501 467600 -334113 29171 55940 -15170
12877 27915 136700 349026 -106529 189718 1993 -190135 -250669 284573 -776 116574 -44963
12865 71680 96165 57800 -24972 -165806 -163194 -21685 -88750 -19966 133658 -178482 -15127
12853 241209 116321 19571 -12421 -27030 -113552 40136 184266 -134058 -80394 42882 137262
12842 137262 253390 -114702 14733 348131 6813 -21354 164655 177380 208593 -181110 263814
12830 162962 -161451 215034 -183963 334758 -132238 117511 -37725 -22845 222033 28261
12819 -48811 167604 -41630 -261791 -84803 -31992 231747 5706 -16692 -139815 37964 138204
12808 138204 147568 20848 -135855 100827 105322 175649 -80898 -112826 -319461 -221264 47148
12796 62232 -5380 -212845 332491 -67758 45531 272176 21018 -251940 113978 53199 -58008
12784 -328810 56515 833 194253 -51753 350209 306633 43653 287238 36766 -46684 377657
12772 -132940 -94857 -138024 340827 21953 21422 146384 -452928 -227798 -175077 -184117 -124085
12761 -124085 15252 -197239 85830 211825 96125 104463 -146347 321936 374107 -114754 -98329
12750 -98329 -177253 -68869 55086 -147184 -184685 -81750 218744 50089 156151 253359 -172683
12738 -59164 113482 442107 -107461 -50432 -166748 280448 39707 -71464 96047 -285221
12727 -167310 206637 225120 340033 100173 118566 -183170 -91459 27469 45042 185301
12717 185301 -104782 -26655 -80179 24800 -14449 -144211 -125391 620 4252 -98239 -183972 -251855
12705 -251855 52249 138982 -79836 154409 216014 -115297 294846 -163359 -123203 53788 41609
12694 41609 138599 22193 263959 385707 405213 267120 154381 156106 -41592 455409 414386
12683 414386 70314 233783 51295 100657 -135030 284144 15820 89917 -229746 -41899 -136591
12672 -136591 109315 181063 433350 -69801 28290 87626 -41652 175057 84361 380028 -46829
12660 108540 243340 146021 194739 138060 95723 -104900 -55517 -231111 334996 28248 121636
12649 121636 -129659 49482 -169402 -133953 -9235 301639 -141542 12588 104235 248501 77424
12637 -222246 -46882 96973 173968 -7775 332258 134900 106771 58247 153965 24950 90285
12626 90285 188376 -175077 -210770 178615 324556 12718 70644 -437381 193982 215839 99505
12614 -78825 439673 527167 -502808 76512 107129 70252 358913 180055 371936 534213
12604 534213 265025 -261548 241182 249185 -34131 127679 -76612 84738 57901 26505 31124
12593 31124 91153 345498 -67573 44075 143096 14090 -299448 418360 -60072 41642 -161440
12581 361973 339079 221660 132480 -67106 32366 -132523 71881 132735 -62423 43286 216742
12570 216742 134582 -202730 67612 -243772 226368 -60409 -47007 178473 -185621 -165535
12560 -165535 -72700 98652 -13123 172795 61745 21112 -98415 -41867 -114350 119099 -75781
12548 -33238 55430 56439 25418 -100056 153792 -161845 188469 53887 144344 47558 -183070
12536 105127 851 29216 -250861 142054 -244062 -180199 199449 298747 -185787 -325762 -150391
12524 -167493 -412438 271801 69106 -123280 -247990 -90997 -32351 72809 227501 -118532
12513 55878 -250969 -163858 -8210 144318 3363 278952 -201718 -192813 -5481 206573 -48113
12501 83257 -76880 28438 -54524 -35669 101677 396987 -84555 -41689 -99066 -16438 -189248
12490 -189248 104267 -16582 344218 98266 199900 -3360 -212076 -25310 -125732 300754
12479 -334773 -2551 -283031 -41304 180103 80204 40143 26489 -126633 -98389 -396588 157483
12467 -1291 -59393 356507 -66820 -59672 177981 -409221 -15365 -153918 272066 59630 -280275
12455 -143453 -121994 -207806 79716 26313 335008 34048 124214 184212 169646 -75633 -171386
12444 -171386 -310134 40223 191809 24102 -239863 -151807 142307 -11801 358840 -108076
12433 -63344 -98380 39854 -32555 -23106 -88214 73413 4314 -302411 101560 -95640 -11606 -198852
12421 -198852 176268 -98124 157269 131516 428286 -215380 -59319 -76322 -158958 201380
12410 35750 -31472 439649 -79546 132639 136067 -246391 348500 11262 9241 -97117 64917
12398 34762 154208 -110153 229024 -126105 -220283 55855 -159435 -106162 -170703 63603 -147314
12386 35967 -61484 302319 20198 223478 398979 -178705 2078 -190717 -71536 30827 43446
12375 43446 -144429 86327 -51994 236530 -43163 -15809 117412 -175904 78883 190961 -411271
12363 123188 25910 495874 143207 -80780 44397 353694 -113318 284016 89636 594883
12353 594883 -182607 -115202 92447 -319511 -52281 121774 -141822 -55198 189865 -14711
12342 -193505 107460 136572 -60752 -94192 103877 -18967 -150769 -124300 311344 267520 119661
12330 199792 317925 112026 98085 84260 -66531 386908 224722 275452 63991 -93035 426740
12318 161152 -77767 -92718 78848 55126 -66072 317833 231083 -190071 316814 197065 161618
12307 161618 187724 214226 89365 293765 -13717 84005 -111824 47297 -149724 -63850 420934
12295 222145 -282727 48298 77241 251991 15577 494 -41946 238126 56580 312021 266553
12284 266553 103264 -25827 34714 138986 -111664 449843 -114966 183240 -312977 -224123
12274 -224123 -26091 181395 16430 -55230 -219861 139334 376982 108427 -190172 -99674
12264 -99674 151862 -40219 -35492 36528 -3952 377272 229706 248555 146686 100051 282625
12253 282625 294045 170840 124611 34987 278003 232150 54685 301686 -20731 -66214 2826
12241 257034 65941 62096 11083 -100269 28953 60937 235931 268079 252412 -184981 108715
12229 -31714 121329 135414 -52377 114461 -61904 77553 336929 158458 363908 -143519
12218 -226078 36760 -2643 214997 42046 17567 61037 162769 107330 -325729 281513 3254
12206 -121908 70055 272532 393671 443261 240829 68685 428222 116207 317922 54917
12195 144380 285175 -188121 333520 -110353 512058 159509 -32828 -29392 186546 -55082
12184 -57235 57785 511296 174140 59241 212474 -57944 -81651 2440 132972 172946 229573
12173 229573 370015 114326 66863 169289 88397 124549 43102 154006 274046 235124
12163 235124 272175 25674 -79685 268057 -201057 -14351 50320 -20241 362343 344522 -28145
12151 334799 232728 366812 311610 305140 368094 353648 -90856 -13652 267961 139420 135469
12140 135469 308740 139198 144022 -130166 15567 295494 122632 -67273 -70402 129147 109920
12129 109920 -146998 62911 223531 259236 -77310 274216 249921 135389 88099 100171 154102
12118 154102 -73002 510022 67753 140175 256052 49970 -133499 -20389 293854 68219 -30040
12106 -90128 140665 20539 -22328 205292 180178 230494 -41977 -223985 -74535 -25394 173656
12094 373995 -121192 -80968 -310850 357544 115286 -199891 72342 -151623 88079 66387
12084 66387 -8015 51398 -137479 282537 102667 -37682 -9303 143615 -71389 172820 412454
12073 412454 144609 -37390 -78980 398249 101294 29888 264336 -247884 12973 -97596
12062 390254 -47018 -73526 84370 -99649 285601 136828 104736 213075 -32576 394994 53741
12050 123910 105229 212417 537412 24495 393895 -20572 228541 -142327 187525 202374
12040 202374 -179408 138646 295212 86168 295958 -23297 433670 45434 -29431 -226362
12030 -226362 -58236 117197 102087 -3409 -127783 4014 -268861 -129684 159736 326097 93318
12018 -174443 -50770 117235 -72201 3039 95532 -99853 200509 505208 199081 173888 -220081
12006 272533 19106 -236332 314866 176305 86749 29658 -14370 63800 156016 36015 176842
11995 176842 191640 -158148 -156662 -125252 308775 -193486 74298 286998 260361 -157998 -20438
11983 19918 -136717 71401 280168 -28489 -114014 -197809 -289187 -137356 37309 -60576 330274
11971 -17691 55653 252175 92131 76040 -65670 57631 100245 -165049 57871 289996 -94558
11959 -150953 -23786 -69090 -115706 -145930 -43229 -22831 166798 -112864 49851 -53018 51692
11947 99751 -207828 -198532 172 -206828 -278008 152030 262859 -57053 -90357 -283700 290833
11935 5804 -172973 65248 101568 -98273 62792 11781 22835 -259929 -198459 120982 230795
11924 230795 -12176 -305432 -37704 50335 -106470 245768 117540 33671 -28153 -28780 -266754
11913 -266754 -261949 48614 281643 16867 -407771 -217233 113194 321179 101774 -6331 -184477
11902 -184477 121375 -233070 73057 -122606 -226930 31361 -2472 -211444 409988 22493
11891 -96539 173307 194743 141522 148678 -87793 102946 34506 -81343 164979 146885 207000
11880 207000 -53819 49916 107072 92993 -34951 445393 54085 -345579 11922 -347704 -95997
11868 -192896 23487 117949 215531 -344580 -1531 -122507 105630 -62854 -197693 -286260 135638
11856 -27486 249199 33043 -162022 25463 -303383 -157340 159495 103010 -178217 63711
11845 -261948 129304 -28776 -60613 147130 -90656 59095 -43672 -306961 -46434 250213 17016
11833 -231942 72793 128673 -109875 -294527 -151724 -73123 74362 -123862 66196 -149533
11822 -141859 -19337 116116 -189718 334558 -21183 -18827 -347547 -220280 -26948 178386
11811 102029 71443 216975 -125149 1938 -211608 -122738 89333 -64265 -253921 116556 -269270
11799 61974 -11700 141897 -213979 -73453 -7668 -379353 -99119 -105823 -20647 24190 87238
11788 87238 39056 -66743 -197283 25788 -246570 -98353 2574 -229379 -30646 286877 233472
11777 233472 76618 155808 129587 82766 -52437 99902 -196708 135197 -114399 -122363 171913
11765 28756 -189758 -255244 46013 179002 33774 36432 -12101 -356558 -268746 -130330 -12715
11753 -260445 -58847 -156640 -107485 -160488 171301 45521 -160 45781 163527 -259782 -358493
11742 -358493 174454 -107141 99551 44862 -31219 -41281 49783 13766 162404 236041 -2836
11730 -63594 158437 -20650 -44754 -109850 -123830 -26631 -76656 -97916 -268097 -166155 -28581
11718 203139 164748 -84166 -428191 -156960 -136373 37275 145928 -31599 -132024 -51213 293520
11706 60162 91475 -118134 -269698 11441 -25021 -153802 -137013 -213719 201987 43615 -242841
11694 96763 75354 -14663 -308832 58596 90398 -117023 -79472 -16239 321101 257742 78500
11682 247128 -64743 71306 -169530 -140618 296803 56476 -102759 38382 -207235 154312
11671 115834 -221590 92676 111105 322396 59161 -165721 154393 -30315 -210596 97849
11660 -334785 -30790 100078 389420 6055 24529 129562 -80579 182276 125639 -125014 116186
11648 360593 308454 280578 111898 -11208 122215 213151 234619 97499 17218 -92790 202920
11636 -119938 -78650 -323516 -13151 -23562 191608 201093 87386 -272695 -22721 178539 72395
11624 164899 -62159 187235 -19463 -65298 54785 -4447 -51556 213507 173299 277096 276968
11613 276968 -54694 302015 44604 -53585 105983 -273639 90721 98316 -2239 85425 -102922
11601 -137176 -92934 86812 -302951 -45943 -90610 -255621 -139363 -69472 90151 -175641 91050
11589 2094 -33480 -277618 33858 -217226 183090 -76913 -285255 288275 84852 305573 158323
11578 158323 62757 212149 273124 -375875 -37225 75700 43658 114768 361983 -185478 44829
11566 -50256 194092 135053 -228455 194312 97843 -150468 213450 -157952 31839 209402
11556 209402 63821 265496 2081 287098 -220851 19600 152840 148834 -406469 299376 163533
11545 163533 69295 -113581 215162 -132808 -257740 175505 179170 140499 174034 21765 -130975
11533 185188 -156418 103801 -6434 133792 -156193 -290894 220472 81223 -145817 136468
11522 48713 -26216 -89058 7033 -223 8926 245335 -150791 45510 8245 -462237 -56235 177792
11509 115770 323250 9821 -9345 101376 -4003 129200 -189215 73145 343246 -200071 174327
11497 -114038 190843 41965 170003 351148 -50052 294015 75936 -2811 98573 8355 338442
11486 338442 85084 -185782 87146 -15791 149756 323745 334520 14913 50618 226254 -158127
11474 64083 314991 333737 48907 880 -106162 75681 -303319 -129 180497 267726 200277 -61843
11461 -33941 34224 238518 292487 182995 -161339 1574 -228586 -126566 -165058 6843 227356
11450 227356 242424 195366 194098 -111111 117885 117702 340580 441144 14236 225221 129754
11439 129754 238130 227442 389711 43441 113116 -54260 283364 -185218 -74601 19565 -20940
11427 180898 -72128 -176818 -67606 -138257 158797 412089 -260470 -246144 -69936 341573
11416 -175846 235090 165500 -18258 122166 -180241 -226065 268993 253495 61272 87017 -254027
11404 -14433 222036 -10454 -26736 -392051 96280 27636 -30350 121714 -318711 -164975 -120716
11393 -120716 -106902 -193201 382143 122767 -104748 274569 -161225 19790 -280663 36608
11382 63291 230648 -183960 125966 -148356 -211228 140266 62346 -78314 -76734 -28080 162105
11370 -216373 143812 -234983 -68281 -297083 184103 -557215 -152429 -89765 32187 166211
11360 166211 -87804 311789 15416 53911 51711 -145936 24654 30794 113739 -67063 147196
11348 138122 -21754 -153689 -158896 -355960 -376468 298742 38522 256877 -87999 -198626 58741
11336 208353 202533 -19213 -49406 -374543 -66820 -87462 -45906 -136703 -261326 -165120 210111
11324 11182 150824 155497 -25410 -210837 133750 -8535 -74879 -10076 -167618 -240818 -21222
11312 43870 150990 65573 2684 105767 -174289 -141934 -96647 95612 10097 -220064 -34528
11300 180627 -23156 -30597 182950 -22640 -26664 195857 -254597 134113 -86675 -53689 -49557
11289 -49557 -136266 153848 -931 64419 33640 -53190 -87073 -78680 99699 -375682 -246052 204680
11276 73495 -160387 -2279 178946 -133070 160398 -198631 190634 94381 -33288 -206360
11266 -206360 79776 -220370 -140925 464793 -779 -221550 70763 -206028 -181700 19094 -30292
11254 17314 -144503 -77774 19335 -164963 -232415 -225318 7159 48331 -419955 165786 -77992
11242 -68064 162490 -264238 -189462 202708 -393081 -15835 77588 125187 -75390 108035 -254107
11230 -241643 277598 -17006 69331 2839 -15301 -23044 -93387 -187481 -204057 -17830 38873 -24899
11217 26479 -231040 -143077 -59085 313953 31148 -216811 78372 -177702 142007 -216610
11206 -84742 232440 -19517 265415 111392 -223098 92196 -300863 -104485 -108719 -130224 50229
11194 428261 -60422 94680 -100447 -152039 23180 377496 12618 -74947 17960 108468 -51883
11182 329043 -138121 -49712 -263395 161290 -94698 -145914 -76167 76282 -116103 -193211 -82232
11170 221463 -205686 130912 -127262 152808 34665 -253106 103948 -103643 101755 -158554
11159 -211127 -596504 -224518 -153595 -47651 -92625 -414543 48285 -223058 -128135 -240511
11149 -240511 -30006 109202 117542 -210348 296242 36899 -88504 -220606 -179610 27204 -194423
11137 -191698 -272470 35790 -107805 -209603 282692 -78430 -191225 -291732 -319448 -93560
11126 106168 1285 -16293 -260480 -86497 223280 -145197 131391 23835 294280 78034 -218560
11114 9188 -1044 309826 -21655 91906 -68586 -41270 -95940 -57951 222407 -68914 36786 281462
11102 281462 178200 -62206 76882 25358 104313 4457 -244483 31734 318465 23616 -54619
11090 -253535 127378 35329 -304481 268226 -217248 206461 64211 -21312 -52256 140978
11079 148206 132480 31025 288245 260927 169957 263423 16369 306303 352030 340254 236327
11068 236327 169349 -137854 278692 268872 219666 437123 17810 -62250 413295 369604 295120
11057 295120 366107 60299 -118223 14901 136755 84708 448179 159496 420475 576752
11047 576752 474701 137783 637802 171513 283897 729317 31838 568170 436674 140792
11036 829302 724071 792039 740805 594488 918289 895072 435231 870876 753490 408981
11026 408981 540803 766657 561371 376417 693708 425207 362616 753153 562040 657046
11016 657046 550282 238054 582785 447999 613388 592563 657451 459814 868890 891549
11006 891549 727010 757039 603903 572622 646431 393971 520379 508839 817349 668146
10996 668146 772749 587305 533492 518834 529814 581351 316200 1017887 384448 578183
10986 578183 503122 698312 366463 391035 605594 926922 268618 779369 482835 911596
10976 911596 611015 677465 525894 721378 742230 477916 595109 792995 890237 875447
10966 875447 676824 835905 1024029 1113503 1078022 1444641 1061175 1187734 1268113 1602646
10956 1602646 2113063 2179700 2291138 1971581 2428053 2288524 2353416 1887853 1833873 1648567
10946 1648567 1627598 985728 1460651 1552437 1429979 1400769 1572882 1630341 1281331 1473340
10936 1473340 1141674 1441079 1498034 1071026 873202 909211 683240 758830 334861 444284
10926 444284 387158 335533 -20764 285289 116883 31925 396638 115618 115839 463456 58830
10914 -77792 32307 -42686 211155 96828 -14675 -138367 -66997 -21165 -50433 381252 82820
10902 -25389 131636 229410 76122 -47988 -38562 -65166 30577 80148 69668 21920 59717 -134218
10889 -30872 -126727 -109657 -292831 -80550 -56994 146333 -267367 259529 -101041 44153 -67812
10877 -210288 4456 -62368 -153570 -88139 -149276 -221001 -332468 836 3650 -124417 133482 -76605
10864 52590 -104318 -58499 163733 -81651 5169 -142464 -28843 -101016 200586 78728 356157
10853 356157 -145399 -198228 -31238 -155080 36363 -80097 -380472 -195470 -223184 -55357 -50933
10842 -50933 18867 -125743 -115492 136123 137760 -77046 -54431 201940 -24113 -103495 431020
10830 -157344 279491 14626 -279440 -40597 -233042 -139975 -53100 -22467 -192381 -198304 721
10818 -172420 -111898 66113 -40041 -33623 -198931 -11349 145565 121851 49548 -57604 91678
10806 -176948 351662 -165834 415211 190844 -47792 -167266 -8006 47801 82950 113158 -280617
10794 -216346 96269 31195 140033 -292023 -277864 33992 216057 110802 141949 -385282
10783 -38045 104602 14188 -246290 63822 -161481 242701 -70876 28375 -83626 134828 -126109
10771 157641 -6347 95907 -120411 -232965 144630 -90914 -462866 -63493 -253593 6498 -39451
10759 332247 321575 -154605 -227421 158357 109912 75268 -99732 -85729 434012 -643105 121754
10747 -33212 -557355 -113878 237835 -196917 -131311 -16450 233221 -18666 -91131 -88556 119379
10735 69636 -178180 -70934 -11684 349859 -166180 -33596 110599 130099 -136915 108100
10724 -384328 400470 41845 -76804 -96818 -33736 55078 97110 93460 -166704 141324 37406
10712 -402374 -52033 -63822 -188310 109817 15920 -208566 122386 -271742 144846 -313294
10701 -181698 -271748 -482032 -254307 -71183 49052 -110208 -89667 -202485 -72472 28392 -104810
10689 -239538 -155417 286436 135089 47756 -73967 -39796 140392 -98745 -125583 -298668 -307720
10678 -307720 -4974 147216 125355 -414028 -118441 192189 -145337 120718 208618 -232116
10667 -74371 -158240 5630 35775 52370 9934 -128394 84264 140627 89414 -198131 -261006 -190189
10655 -190189 -147105 -66707 -60832 157277 70133 -274728 355909 -188978 -338932 -98721 -33284
10643 197979 -284164 5234 -2227 272904 25400 -215312 81837 108514 -203611 -41710 -142284
10632 -142284 -76876 249869 -209280 -195914 -94758 -29118 -242743 -237212 -79027 -179255 24147
10620 139141 -32447 33576 -288133 67337 -339678 -145546 -45578 -176180 -98318 -266379
10610 -266379 -138766 -213180 -160254 70856 60859 329912 -313571 -169036 194095 129754 -119266
10598 124622 35795 -225315 136086 -106025 47717 148273 -304151 330086 -61719 -20264
10587 -291309 -88748 -83676 -338857 -16404 -18110 -81532 -182726 88465 118501 -342025 -4949
10575 -421323 36968 -142724 -77883 139840 109838 31911 28672 -154298 -212151 -183752 -207099
10564 -207099 -306395 -8968 274227 203108 7140 -227054 159322 -560669 -215882 -133771 118125
10552 -167369 -281690 150506 -114832 265385 -64731 -65051 26317 -210721 -134211 -7442 173579
10540 262256 107272 87932 -71232 62282 152509 -69602 -162380 155344 -125237 81177 99350
10529 99350 216911 179272 -285698 -65995 -303325 40338 220750 -9406 -26478 262615 -68943
10517 -108824 -351268 -255496 -240357 98124 -24518 -48406 -19329 -161128 -344541 -146130 -184716
10506 -184716 160225 -230132 -113675 97796 -271750 -308141 -210788 93028 -204947 160127
10495 -238734 508572 40893 73586 -245679 493278 143754 176923 32373 -37467 78986 -94159
10483 -66720 117970 -204749 -245649 18615 -59898 -22573 288594 17907 -136557 8025 -10133
10471 17981 -136706 -484697 -168258 24121 478126 -93481 80406 334731 316467 401669 468316
10460 468316 530322 636744 461873 391821 266542 -266210 435299 94989 356813 -67269
10449 156126 -122601 -93257 -181909 -128855 63668 -226146 94811 77114 -219304 -489715 -24481
10437 28339 -234709 -195092 111872 -85405 28094 124345 -457465 -131038 -74213 -304907 -24661
10425 62 -144862 -72916 -74702 203186 -102931 -405523 395607 -229638 134872 153700 -97348
10413 90217 -162308 -160019 -125371 1596 -38629 260871 238820 -143517 -188772 -172620 155559
10401 -82541 -221134 27349 64890 188744 -618 -54951 78110 -163804 -273322 256808 313639
10390 313639 -34258 33418 -47378 10064 -120069 10401 -9008 -190328 -142332 -162152 204549
10378 247469 324136 -98297 -217613 -237336 -65545 324946 176087 -17382 306631 -46710 189918
10366 -102745 23859 -171690 169292 295409 83979 -21952 89390 193028 118698 -15759 392588
10354 -51967 342090 -37412 236768 256433 58020 464247 503719 558349 15299 217896 -24641
10342 437294 498509 482062 183574 -52579 106886 360647 -268426 189855 790043 355767
10331 506507 126877 193642 134537 53027 512375 50830 164843 284588 200091 -248047
10320 260066 47585 283939 93766 -118449 433387 147783 -25587 305880 259581 122371
10309 46049 202232 -197583 248891 190919 228552 264238 221160 -83624 108434 96806 304947
10298 304947 -87139 -17216 348125 172369 -134292 380997 -73829 208250 76621 271687
10288 271687 -10057 245384 147571 -121767 421668 -94182 -285581 6074 34583 83057 171894
10277 171894 -57502 -170570 -35023 -41305 190509 29171 5950 216530 48007 -218434 26087
10265 -106992 54267 -95376 -72736 -59695 -300426 15879 -223593 203850 -18465 -230154 -193193
10254 -193193 88862 -2971 40036 -222460 -13016 129188 -87951 364373 71812 -229418 202889
10242 -321312 174193 218926 72449 262763 411451 -2654 143848 109251 472423 38024 -27631
10230 83314 136815 -388147 -131013 92280 255183 137191 -197607 -31803 -6863 -144688 -373166
10219 -373166 -6393 61787 -52971 -83368 -57769 178151 153482 60240 29876 -106352 -269303
10208 -269303 -272446 -416511 -87839 -39872 -180761 -121331 164075 -13118 -359664 -248095 98001
10196 -218824 -88578 -174421 11432 152569 47655 -52290 -200303 -182447 -194716 142792 15525
10184 62537 -48288 -97728 -140350 83223 -380325 -123070 -165176 69292 -46087 -108380 -243959
10173 -243959 -314758 -188237 206598 -225790 -24033 -135952 -152868 -11883 1420 20444 -98458
10161 -38776 -21641 58853 143782 -44124 -163856 -100936 -321973 -192519 -222287 128681 -183778
10149 -167643 -100719 -274042 -224751 -214071 32265 -64186 -139505 2232 72004 -150135 -121421
10138 -121421 -3076 270509 20271 -143856 -338985 -17707 -62119 -57273 102437 -174077 73245
10126 157765 -88607 -107939 3819 -247675 -229146 224575 27225 82804 -548095 335453 214826
10115 214826 -218620 -253829 -179793 -231871 -330205 -345476 27832 351918 -49915 -159436 194385
10103 -276926 -53012 -255073 -90259 78025 16377 -64208 -54406 154067 -26791 -57342 -332139
10092 -332139 -285345 246563 342 67464 137215 -59778 -172905 -255235 150977 113767 327002
10081 327002 142015 -426594 147681 -40456 1001 -318577 -315942 -139892 -151619 -241581 173760
10069 -46932 55846 -156010 120990 -50855 -230577 23025 -141773 -54744 -181425 -223199 -177142
10058 -177142 -211975 -9616 -181788 242493 256384 -211912 -270859 -106516 -132820 -159210 -89099
10047 -89099 -85250 -46961 -158091 59853 805 -135849 -42314 -184052 -195489 -115920 130453
10035 239650 -295311 -296771 -288834 -241596 -221580 -113546 135130 -280586 -4966 173756 5148
10023 -11044 61285 144802 -47604 3578 -12152 -197354 -34730 -44459 -307462 214593 -59280
10011 -191347 -131501 60629 100654 -137977 -18772 130261 207939 -113280 -50024 95305 -178574
9999 -107728 4214 36344 18499 -245517 -264274 248124 -180318 -419461 121990 -14836 -1910
9987 100811 -278039 166399 -35170 15122 -267181 -218511 -200176 -183667 -90317 -53022 -235780
9976 -235780 174784 -180263 -205072 88966 205067 -216436 -24770 -55233 -172997 12264 -78131
9964 -39389 -11584 -94456 -218502 -391960 -200572 86792 256627 -179241 113488 -12220 -16640
9953 -16640 15322 -140763 216333 -162971 -192455 -259689 -133454 -212818 73048 -154929 -142799
9942 -142799 -37827 55678 -66738 -199162 184511 -98614 -99779 -306449 -10537 23149 -76919
9930 123942 -252228 217772 90632 99109 62961 94054 -196442 -522890 215451 -136571 294498
9918 -432874 331334 26718 -419785 -9191 -13085 7529 -54654 36791 -208407 -96182 -183574 -214577
9906 -214577 78055 441758 -144116 -82689 157705 -213360 -92490 -11969 -224562 192710
9895 -300662 -162757 -46524 -265180 -163069 72937 -170623 -279727 75132 236378 469326
9885 469326 -295580 218040 -151825 -181640 28176 182712 -50030 -73955 -22039 298713 -75594
9873 -118645 -33647 212570 -196615 -194130 -208192 17852 -175501 59580 -325496 1637 -32716
9861 162028 -228860 -105347 194869 -347745 -309684 -341036 59600 214431 -258755 19026
9850 -162330 -213298 -198998 82561 -60788 262551 -97165 60187 -267262 -73195 -135910 294982
9838 83835 -338950 -141188 102607 -117940 -97643 -159690 -94293 -35375 214364 221433 -16735
9826 51203 -90073 -125249 -239966 -453058 -91088 -68474 -246016 35661 86239 190320 68145
9814 -205527 215505 -148181 -102032 -241527 293936 -234588 -140508 147739 146587 -268261
9803 -232693 -166016 -120003 11981 5578 -141297 -436646 -133742 -65842 -234369 -28613 -356594
9792 -356594 -2560 -106701 -199965 -71634 38593 -80761 -24118 -271522 -37317 -48650 -101929
9781 -101929 -74473 -219060 -161056 -127493 -318891 93961 -138151 -289730 367182 -191886
9770 -255374 57123 -178496 -92133 41316 132391 -56531 168796 -114989 -104294 92881 43322
9758 -21350 30792 -212196 -409054 -234828 52951 37192 6681 -98901 -265847 63535 379656
9747 379656 70307 44681 -72989 -76091 -23985 -284358 -200900 -126376 -48167 -155765 -50140
9735 -142852 -145546 -284042 -377613 -122028 -68275 -192452 -127192 -293688 204856 -246881 -189094
9724 -189094 200136 -267295 96724 -99160 -163221 -119840 -444108 -384961 -249461 75588 -92087
9712 153572 25283 74396 -409189 4841 -37695 308339 -107311 -282401 -80206 -419111 287654
9700 -13982 33977 -114932 -98780 276054 -47519 174780 215613 64131 123610 116825 -232690
9688 -107786 -158624 116156 196939 40855 44765 16346 -238110 -38313 183949 -87870 -55552
9677 -55552 142911 -82030 -43343 137349 16891 147503 -163183 -395074 -55295 -6867 39512
9665 -237564 147530 153173 -178893 175286 21873 -75665 -17668 -125055 2703 -38005 -131587
9654 -131587 -75781 -41914 -316500 -63844 85275 -68588 -443907 -12508 -197000 -131625 172954
9642 -288163 -356898 -57223 146071 68397 -145637 -165594 6608 -169337 -281244 26974 -21323
9630 -62839 28630 138125 215069 76618 169901 6425 415398 -90280 -32877 -254396 80874
9618 -97335 -387818 201855 -139506 -123286 -341214 91870 143992 49082 -342859 -380769 80920
9606 -207955 -244422 -188359 -161008 228550 -247652 -327018 -203583 -73982 186758 53450 -162234
9594 -194281 -39987 -59929 194406 11245 -3706 4496 -14338 41314 -8719 -20022 67530 -181163
9581 28334 173828 -69486 174579 168664 -230894 -23777 10592 -145802 78442 140305 -356441
9569 -250782 100060 -137327 -50479 -103685 96024 -49519 -37254 -288229 -25096 -24993 261257
9557 -4182 217445 93523 -122538 -178473 -49225 294065 -174593 -62117 -158338 -194933 -176036
9546 -176036 75322 5023 -51962 -317667 104251 -147058 161077 -11368 -208169 208848 28392
9534 -34634 -438277 -107070 -109550 -320531 -392198 -51000 22500 36611 244673 45051 -273066
9522 22500 -142770 -76314 184819 -470149 -341447 -74569 -82389 -234889 299419 136475 40269
9510 61699 -164094 -61018 87991 53119 118399 106996 -255783 166980 49313 -224302 67134
9498 -108006 -150267 -202302 -139758 -467226 408491 -180031 59298 29984 42742 -30919 298258
9486 43054 -145331 257930 -93988 -46848 17571 -110259 130974 -110894 -37097 89443 282844
9475 282844 -115202 -152107 -264654 -390445 50153 -165434 40570 14672 -153701 227262
9464 105905 -55081 -76910 48985 108209 -227559 -194694 -342287 -37792 -248274 31290 83109
9453 83109 -87797 -171496 -13908 143515 110568 -7186 68368 -112833 214082 337922 -213556
9441 -195466 -311397 -233692 77874 -49725 103062 -353049 -134761 63859 -353591 -63041 265546
9429 -137498 -15227 -95052 -87306 -249158 -5043 -133539 -231940 14647 -132096 -390741 -89908
9417 125257 37060 89393 -165120 144339 -181214 -6211 -482382 -55172 84871 85464 130571
9406 130571 -114099 -133982 -257967 -91103 23065 -196405 98172 -252099 -2308 -127102 116953
9394 -175567 26678 221280 -243385 -515 -91268 -68144 -76782 -256190 202152 -77825 912 81
9381 54801 -70760 -244894 -79813 -23825 116110 3311 -53854 6675 -203766 -339445 -30173
9369 -297181 -44210 7453 -295856 -169883 11799 -78837 111638 155309 -46411 42989 -85554
9357 -396280 135481 -350667 159710 -63194 -410758 -290723 -28936 31786 -1509 -15684 284715
9345 118268 -111371 -390451 -246948 6960 72995 -331288 125405 -85535 158129 -450214
9334 -32968 -270727 -178404 -171510 -45559 -251096 123055 -153198 20929 56118 -107673 126109
9322 -178708 192237 -169692 -175631 92797 311296 -181128 -231169 59049 88522 122972 69605
9311 69605 -219258 169487 88333 4316 354554 -47141 -266362 -234234 -226174 -158349 -303954
9300 -303954 -122020 -459386 102613 -120724 -184263 -291021 -92210 -426587 29809 33350 168054
9289 168054 236993 -90833 142355 83739 -124020 -243662 -143351 107865 215899 -194739
9278 -140640 130153 62830 -243731 168345 -159000 -574053 -331053 60917 -61348 151344
9267 18798 41104 -202172 -7865 151092 14364 -91776 -130705 153304 -193358 196734 -62414
9255 146691 -284239 136460 -189523 -374343 -54803 -188533 107047 -159146 -225474 292373
9244 -142382 -254947 43410 62837 160660 348936 -258220 19163 123021 54303 -357157 -44572
9232 -110059 -160709 -226018 18305 -21119 68412 94495 161251 57048 56065 -226537 208765 -25224
9219 134764 -295990 -313265 27974 68447 -23617 -15227 -7720 35089 -181113 107584 -178906
9207 184643 5965 -305285 -60974 -64346 -137050 -161061 -196623 -214568 -64049 87213 -127906 50356
9194 -169984 180163 -99407 -109534 16783 -151959 -229441 -326490 130901 20611 -194106 -208058
9183 -208058 -379593 -45305 -29164 -244613 304391 -191305 48135 -25922 126618 -263838
9172 -181895 -131396 -85926 99663 -146965 180490 4139 -114093 -46324 -426719 151029 -58591
9160 -209117 -2013 -41726 -199208 132685 34544 -24009 -285829 -60298 -167556 365438 -313414
9148 178470 -109026 -8782 -355133 -679696 -113590 -194843 -304140 176194 160382 191074 -115056
9136 -913 -135264 -302027 215737 60294 220810 162671 129321 -149083 125083 -146784 -195226
9125 -195226 -178807 -367713 10706 -279966 -97970 149788 101760 165757 -298225 286585 -354597
9113 -243230 406539 -19095 -163560 -180958 -170698 -197140 -17903 -106116 -36614 53505 206434
9102 206434 -33272 80160 -52312 59605 -183137 203734 225502 121394 54718 137534 -301174
9090 116268 -86959 -154222 -318298 126054 210497 -385491 34937 -358900 -123594 170786
9079 -326944 178347 19820 -344511 190883 -160507 -148934 -202927 -303486 -74911 46446 -72038
9067 100306 84899 -309616 -41938 139581 -160056 82203 264921 -316321 -271926 129916
9056 -187473 -376231 -157996 -256395 -129152 -244963 110130 -5399 286358 55310 144029 -149511
9044 -250182 -154283 -80897 -14484 -29499 -79482 -90997 81176 -233764 -324478 25850 -107303
9032 123886 -227669 -10688 67821 228631 162068 47254 -145028 -158793 -40646 153440 -240050
9020 -156612 107239 -14964 214618 206273 21118 -171226 17410 -204720 258274 41186 -86329
9008 -190602 -118770 48850 55390 19598 -329461 360206 -52583 -234868 -35436 129888 -303422
8996 -46918 -71399 -13484 -76896 -110767 205526 -139364 1404 184886 55507 -313578 83797
8984 -170587 -143494 56192 32357 -185993 -190630 -349248 -202061 -140175 -21617 30067 -319350
8972 -125466 261698 -49079 109258 -231303 -286419 -463875 -49087 -145374 40212 17713 -80051
8960 -4506 -70127 -103782 1248 21376 -216670 -163550 -127585 -262122 -354784 -13699 -332011 36937
8947 -85769 124126 26129 -86864 -25518 95972 -105394 -159015 -74814 93814 185068 -147124
8935 -120152 104479 -187970 -25117 -197055 63639 -32972 199228 -354412 -163608 -305078
8925 -305078 -215143 -107856 -74078 224632 -8901 307073 48242 -50153 -31065 283763 247568
8914 247568 64434 -47672 233168 254517 322016 357345 450450 898783 1194921 1997469 3621305
8903 3621305 6530283 3405065 2014360 942506 589830 329160 205558 225759 256357
8894 256357 63191 7383 255634 120707 -21463 289682 136667 -53730 -58039 -6232 -41615
8883 -41615 43826 -234783 -148973 -242723 43552 -217182 -365500 -157444 29715 35176 -426163
8871 -191969 102104 257112 65473 32952 172653 -169287 -194150 -368794 -213393 105330
8860 41983 -273272 -194014 127188 -151465 -182180 33305 -96203 -263213 50788 -227759 -192438
8849 -192438 -557573 -28507 -116355 -44067 311981 -155219 -89832 -271742 17947 18810 85763
8838 85763 171558 -54868 -29557 -141923 11556 310556 328125 -45628 29121 216823 150720
8827 150720 264496 -294187 -283830 -121184 115763 -34893 6074 78946 253855 262857 14872
8815 -19708 -276917 -198395 70973 -378531 21938 124981 -104903 -111551 -332658 198738 -334671
8803 135885 -341537 -251751 -198177 109707 190548 -231318 -210966 138761 24382 65665 -187648
8791 120474 -413335 -327257 -33483 -109308 13128 -154852 -198934 -93680 -323812 76749 -448572
8779 -52167 -123053 108353 -8613 76885 -33589 146783 -144691 -98620 119950 -144056 -17240
8767 -20328 -398078 -164147 -194362 -164126 42474 -45424 165998 140267 -189920 -143453 -245838
8756 -245838 -60380 60593 -367194 183319 18662 125584 -160651 -22681 -72812 -51412 12064
8744 -90461 -246129 36377 106265 -265014 19816 11335 29879 -248326 -217433 99663 -185044
8732 -129160 -180748 -355454 155948 -87291 -145248 44820 197522 11798 -151571 -208668 -87058
8720 -101228 -215970 34625 116255 -43096 36558 -200195 -194478 -288410 -42316 45074 -103114
8708 208982 264532 -77046 316174 1017 -95143 116203 155308 -111096 -54702 196235 -38418
8696 -350373 89630 -98957 -158247 -124898 -238217 -22480 249175 334963 242714 -95578 25448
8684 -56820 -114715 -271418 -101613 -108186 -19742 -179188 -247669 115393 -76356 217213 -252658
8672 -39483 -104887 232340 -259435 -133599 -381006 231664 -261426 289952 -210316 212222
8661 156933 281353 1332 230456 141032 -8640 -160362 -70389 77136 -110272 -214437 -104082
8649 -147825 -156869 229900 -156704 -225000 28853 -324641 -19636 502549 -51705 -46634 55450
8637 -37000 -242279 -135189 51284 12662 -412927 -193020 93906 -204932 -83688 35996 -183783
8625 -110850 -69138 134278 -72644 145071 87403 -116124 -103285 35200 -102870 -51297 153516
8613 146707 43276 -52371 50038 -147198 -6547 5777 -72182 -143305 -159459 -289455 199214
8601 -173460 -162717 -38020 -39699 49993 186504 -6194 -70765 -131268 75790 80937 -91131 -65604
8589 -65604 -123889 -323141 78237 113972 -123802 59385 -245536 231659 24009 -105894 -104005
8578 -104005 -237966 -6937 102758 -89959 356355 -48776 138203 -331669 221873 29084 -90293
8566 133617 9536 323179 -43262 -100505 175545 -215767 -123762 58778 50640 -623 -175063 -460041
8554 -460041 36613 -33755 -55610 -234484 -343592 45247 -100828 -110086 174689 -119441 32364
8542 388314 261817 -215597 -361104 -2070 -121479 31061 -30699 191348 -102625 414172
8531 -165710 -94784 -205586 -92371 -94681 195278 -136310 -12665 -108079 -116484 -347698 -128121
8519 -94085 35906 -172342 34247 -240634 13493 -25115 -95006 -437549 -130901 8471 -188995
8507 -112480 52751 161571 46902 155406 -52685 39200 165342 97326 110237 198237 -200971
8495 118569 -92055 24367 -271970 -115241 -298846 72431 -4327 112667 -233991 -141182 -237213
8484 -237213 77437 -51305 -78091 228456 -279648 -222977 228386 -225971 -257108 -93603 -174493
8473 -174493 -79828 -53179 118562 -173732 -25741 426100 -268776 14469 -122176 -236402
8463 -236402 70529 181722 62415 -226068 -7988 633 69553 -107648 12943 54448 106058 123629
8451 123629 -24942 -92584 -20664 -355521 -135308 -296211 227018 -224819 76090 -288074
8440 -100167 153695 34228 33911 97881 59281 21734 80671 189408 -267790 85805 43227
8429 43227 -163364 39717 196459 232258 -57882 -33489 -125407 -72911 42808 -201405 -85449
8417 -397731 -183032 -68309 -279023 -151356 171684 -139925 -283777 136830 31584 210206
8407 210206 -64684 -267066 -358346 81948 -269377 102631 115410 -238484 21238 62547 -24827
8395 -34598 -12834 -87489 122855 35327 -147145 -120407 274897 157099 -193368 202261 -60282
8383 -147712 258902 107739 -20712 -251416 -29423 79300 54436 -150888 130317 133051 127526
8372 127526 -166220 -117878 -24692 -214700 -163469 14330 -260358 222 -30943 -103204 -99305 -107308
8360 -107308 -311330 23933 -49187 -61654 25493 41834 112407 118530 -252957 9236 -220538
8348 50630 217489 -147507 59715 -91459 44531 -90183 70771 -91450 -26720 -169807 -101264
8337 -101264 143879 -44329 -184577 -182669 -267697 -64219 294017 97779 -27917 217291 -304687
8325 143203 -67464 -35131 290124 -173067 122223 -232219 186872 202954 -134953 121848
8314 -44005 -199235 -1145 -167660 71626 -292183 -202956 141330 -128771 17897 87451 235294
8303 235294 -147310 -59440 146717 -8735 -211376 -147856 29243 198760 -7710 -147418 -129501
8292 -129501 -118022 166962 -229057 295433 76822 144508 -54610 -172511 -115923 -274785 211151
8280 -55551 -66674 3974 90919 58281 87651 -104407 -94098 28243 -73719 -105608 -51999 55456
8267 -241041 -419129 121583 -346625 -42908 -13380 20146 -86946 31716 -231469 71192 -62775
8255 29028 -59317 -203946 176715 -263699 16858 -68993 -125407 -184293 -175125 -4678 -135218
8244 -135218 52587 40690 8538 61067 96411 -55627 186647 25398 170074 -24454 171830
8232 326285 -396642 -113212 132471 299532 -288644 161136 -70533 98532 -182419 -114461
8222 -114461 -117432 -86178 -13290 -299651 57355 -212734 -112562 -172414 -213968 176000 -60409
8210 -14976 -327041 -106331 -297217 191658 -35861 -242230 -292994 -263387 199207 174222 -159930
8198 -71375 121151 -151189 -125720 -215772 203763 50362 -57340 -131298 -121379 -106715 266809
8186 145496 -113384 430312 -214315 -354903 -62744 36542 164889 79523 382002 -172816
8175 134676 259403 -333937 -133091 -112503 194480 108331 114654 213784 -83413 -130488 -137249
8164 -137249 -3434 129949 10889 93833 -206914 215634 133981 -1233 -33902 112835 308445
8153 308445 141407 90514 -143159 -91600 1174 -19606 -25640 -99159 47386 -200097 49265
8141 -52054 152865 42048 14870 285147 -56026 167337 -18688 -223788 41851 124583 48892
8129 99866 31008 27957 19343 -62946 154732 -20749 -98681 -400691 -26833 -75540 116778 -273865
8116 3874 64598 -527896 27799 -223997 122650 -463408 -30636 -11078 -185326 -108880 75195
8104 -3887 -66552 -146679 156182 -54646 34088 8217 -6039 15764 25241 93909 -60501 -143846
8092 -143846 -193608 -196457 256770 10390 49104 -69717 -249082 -217579 -174117 -139502 66698
8080 -201929 139051 -155675 -35205 53920 -394899 -3808 64348 67676 -171904 133406 -385392
8068 -208284 -289642 73864 -352982 143299 -87557 -171550 18128 198787 22712 -224385 167660
8056 114960 -144545 -155027 291 94531 -31335 135445 -69269 71852 16056 3813 142077 233880
8044 233880 -13894 224766 -206382 2346 -205866 23919 28129 101158 -306430 119552 213191
8033 213191 -54441 168900 -192088 17920 -139904 -175222 -37209 -64988 160336 4772 -56562
8021 -127092 91410 -34123 -265522 144396 102861 -121519 -119061 30188 271444 -152179 14317
8009 -210155 49133 -88559 -57894 -174907 -194913 126514 53721 50652 31801 -107839 98650
7997 -162446 71754 6675 51252 23000 117439 120785 77534 260206 113403 160941 -342216
7985 -141454 -45600 -10309 216104 -122431 -129221 302603 34139 237465 -84443 -144955 18372
7973 -190207 77676 -168197 -209467 -128975 41921 73945 -153745 230270 143082 13036 279543
7962 279543 -20614 -376033 -209228 -269694 53106 -161315 -54292 121560 -53449 -246900 -24730
7950 74911 -265491 -50955 -199689 -307634 -149472 -69616 -125826 -148030 40671 -96448 -61403
7939 -61403 -107274 -97384 201516 -175943 -243360 -162153 -215516 -57533 -22957 205094 -203150
7927 -358259 38703 -619819 -143746 -91323 -65720 267696 -68805 30672 -57336 -133442 -213584
7916 -213584 -376793 122441 160138 220957 87561 -89903 -191377 -64692 193311 151070 49877
7904 -95568 -190086 -122868 146932 -134852 -120954 12399 159476 81564 -113309 -379503 175099
7892 -380245 215843 141868 178233 -120091 78406 -119527 -115555 -63992 473662 -63069 -310760
7881 -310760 361298 -88865 239973 114658 18234 229964 97633 316480 115899 356143
7871 356143 76616 -167682 292008 148434 14988 -194683 -191306 158784 -181619 8167 148005
7860 148005 -71724 -99161 -342772 77433 57509 38295 365234 -168303 -76009 -134904 -79239
7849 -79239 -167577 -39152 -33051 -83555 -331712 -173046 -40657 -72852 -135320 -144778 134405 -181679
7836 -56828 -214946 113439 3267 -51728 -155810 -75666 -139632 153555 -173486 -643654 -134540
7824 -180788 69640 -15275 103449 287061 327627 -55287 -169175 -280829 -13615 -217295 23176
7812 275520 -2962 50488 -302216 -53801 -347637 -26758 -233496 -236406 178857 317652 28408
7800 -124222 -75603 -153897 -12565 61344 -222202 -78051 -22437 -22328 208764 148347 369933
7789 369933 -225151 -159242 -363596 202448 -90205 25641 -282396 -119589 23269 -7621 -126614
7778 -126614 -82263 -228859 169021 -39514 -116201 -74244 124495 -140030 349894 133769
7767 -42370 -205629 -29241 -10044 -49818 -80186 -342690 140866 -255918 -127256 -137795 118238
7755 -75699 -28507 30021 -193578 122656 72853 189350 152258 -64293 338050 -78994 236695
7743 -31291 -100042 -124981 3813 -56862 48576 -107073 -364836 313704 198049 -366913 -201911
7732 -201911 136696 -140843 2044 -308685 -85953 -237089 -230801 -196020 86487 -168549 -524191
7721 -524191 51188 87740 -86951 -21053 -65043 -170711 -175410 -39777 -280845 -9904 6652 128295
7709 128295 127277 205227 48173 -159517 274686 -140238 -187754 47852 1923 -197937 57567
7697 -245159 332124 -195112 26682 -83820 148894 283200 -48236 -160283 84630 41820 -287934
7685 -183851 119350 84222 -40220 -24405 66513 -71323 -150022 98185 -4516 -19466 -113525 -16467
7672 -107638 -100487 -12306 108564 -36433 187599 156986 -219759 -39013 -115033 35819 129977
7661 129977 153754 45178 -11105 -21776 9587 -98629 199553 87317 -268958 -148592 75765
7649 152401 -171523 -208669 330579 -109374 -65696 131801 141017 -284971 16443 -422684 -359030
7638 -359030 -138635 -113545 352261 -173815 -468971 -53702 26760 57233 -78438 207350 -380670
7626 -21460 -25580 294006 525287 -325820 -153802 -82822 -88717 -205488 1055 75178 168468
7615 168468 -220344 293322 -120851 235870 -175475 83905 35194 213704 87158 96069 -71148
7603 -42203 183336 32605 -37635 -151979 176328 133759 -19883 58870 -213311 -53283 104750
7591 -286134 -64456 -121604 -191970 193943 -218319 -244977 -79003 -1953 -168979 63983 9010
7579 26453 -144835 95636 48557 197950 257569 -221519 121942 178946 62180 320986 -159329
7567 -48889 -309603 -34352 221364 362595 10911 28731 33192 -220139 375581 -77800 -245687
7556 -245687 -110462 -272103 -400028 -101995 -20728 74633 -378315 141772 16592 -142990
7545 -62610 -103548 370769 -116168 169699 -11955 -25699 -39109 -22736 13691 -37090 207115
7533 7503 -107798 -79744 -135352 5936 -368488 196652 209195 37058 26019 -224634 -142443
7522 -142443 -96194 106962 -91694 -398138 18772 -29200 -95844 -86644 133591 -73451 -163614
7511 -163614 -108310 -1808 -179821 -80855 5217 -63491 -59279 -271704 132382 55349 20235 -30023
7498 -270985 -25540 -271604 -124957 -185558 -88312 -136533 -151331 -9696 -100932 -79778 -150746
7487 -150746 265314 -27621 -77378 46338 -109539 -47843 -453623 -93548 87431 -291277 -100979
7475 -68918 -37892 -100309 -37477 182418 303996 -260402 108463 -100920 66083 -164230 85171
7463 -382111 -305929 31557 -124443 -25513 -133281 -230365 -191666 38877 -41755 10763 -280535
7451 75948 8324 98753 44231 -283665 299396 -290208 -173305 3640 114895 -87479 -251530
7440 -251530 -45155 -99139 -398442 -214085 36910 -93262 -257007 -5018 75019 -38281 48419
7428 -185768 -116931 157265 -5305 -117673 258428 -164686 19832 293038 -311168 -358906 -59036
7416 44363 -79994 77987 -72571 -107310 815 -14439 199204 95606 55551 -135969 25237 244820
7404 244820 144544 -194117 43745 263740 -378354 -257991 207160 -177879 46622 69959
7394 69959 -262562 19193 -276144 30463 45474 -7732 139803 -162137 94993 236231 75513
7382 -219505 -49828 67419 147005 310985 -12301 50622 -224894 225509 -189392 3728 -40966
7370 -20966 391740 170253 -140263 -103717 -2303 -72017 -222703 99198 -222020 -74571 -295206
7359 -295206 -258371 -355656 -243407 91556 -34236 -426232 59852 -331242 225988 74266 -85744
7347 -196606 94255 -122715 118404 90201 121059 -284405 -15654 -80686 -54719 -210698 171631
7335 65030 -84658 -355125 125565 79144 -52312 -113460 -78978 61528 -164257 -243706 -125627
7324 -125627 -186943 134833 -16414 107549 -164600 9763 -231134 27192 -246554 116873 -117651
7312 -132787 2479 -119542 -36478 280771 -422206 184634 25903 -403122 14266 -65673 -31687
7300 -112346 65069 215021 -200205 17707 111978 83000 192887 -154681 24895 -102212 -68543
7289 -68543 -351942 -145829 -313286 31419 8912 62890 -164927 -62668 26002 183776 55536
7277 -68508 -174719 -24567 -151385 -10052 125210 -221813 389828 113377 291256 -88927
7266 -39634 18645 413583 -295852 28207 84604 -57199 35859 -153776 138300 157532 -22460
7254 -192604 -23262 -662965 -155664 -131922 -93323 -16077 66446 40274 10654 45345 3724
7242 -1795 142267 100186 -120219 -104692 -142337 29008 -146140 -104983 -8205 1062 62053 -137185
7229 -213958 201522 -163786 -5064 -77245 -27176 343073 72156 -41837 -86949 -131804 -274808
7218 -274808 -215627 -20539 -29978 -141683 71822 63698 159822 111543 97690 -192759 34069 -413695
7205 -212351 29589 68252 -53831 330004 148043 -236722 -331608 -222419 -177856 97196 -490513
7193 -230765 -205910 192172 -7864 -116333 25094 16824 -249954 -299548 -115199 -104977 74093
7181 34036 -142228 -96091 13949 -48518 -87835 35290 -230337 -27227 -81489 -244570 -104768
7169 -236951 -120475 -25556 252038 -104164 60004 298020 78827 45709 7804 -116086 -207240
7158 -207240 -35405 87933 -288476 -175777 -9794 -43147 -67630 114891 235781 32544 227407
7147 227407 12502 143153 -165600 28950 -182254 2777 -115970 14254 173274 46894 -6670
7135 129134 -12013 -8269 173864 -212291 -97608 86762 48064 -110879 167234 -126053 70420
7123 -245441 398558 -168830 -221586 -339100 182991 -133628 145795 45405 -31318 -162421
7113 -162421 -53345 -252666 -33107 -80699 73807 -78591 -294055 63710 -450127 92595 -37249
7101 -54292 -134527 96260 -44931 -42757 140524 96389 36066 -142364 142074 -98829 165480
7089 103330 20765 -48958 -11271 -280394 -170357 91537 12594 58070 -101023 248308 -117171
7077 -15775 -249670 -173831 47841 -130054 140253 205029 -42423 107525 196063 -48873 173881
7065 -128060 -133448 59174 -159974 103109 57608 188084 25056 112408 69869 -288762 77495
7053 -22457 -164511 -394510 202739 87113 -274994 -246413 89636 90906 157989 85287 -177065
7041 147309 145059 199211 -158135 -43285 68074 14100 -239824 -355852 215043 -9264 169464
7029 44752 -212670 87316 53066 -244934 -175455 62408 -111625 14717 -135397 -105134 -197593
7018 -197593 -30320 45048 -310114 -46905 91055 -113691 -15868 -155115 29298 76116 -192276
7006 -54759 6631 125613 -218566 -287713 21548 -128575 109147 133750 254261 277379 -138634
6994 30886 89669 -67163 77031 -43883 -194212 -100111 72480 111419 231764 -97127 -407439
6983 -407439 12165 -130182 97532 301019 -266187 -47584 -4508 -287803 171393 -225119 101327
6971 239375 36247 -138672 -104135 79255 -115689 -112060 -75175 74182 -135235 -215667 -246526
6960 -246526 211125 118262 -88797 -280466 7039 -227239 -143445 16789 -84097 -39106 85604
6948 -80412 40973 90048 -323792 69738 75693 103593 -104602 -168201 -144675 34558 48389 -45557
6935 211919 -79589 393168 -248131 33705 -69089 -382323 38013 12471 -48869 130211 101259
6924 101259 -291545 -104455 50975 -535006 109433 -62499 -134873 -287053 -243902 -5151 -8509
6913 -8509 82238 104383 313074 -75001 56585 24580 -24547 -126438 116142 11050 103270
6902 103270 7630 24493 212299 -169729 78377 178367 22698 110075 -303446 -282918 23574
6890 -27126 28005 -415914 -172901 -171180 -156019 152103 -292859 -42813 -161080 -11938 -152468
6879 -152468 68069 440745 -150773 3757 -31577 -45567 -114329 -177544 82032 -284232 -74208
6867 -1687 75940 9059 -11038 329759 91862 -218601 191830 -98799 96484 169834 -201186
6855 -181647 -169076 -177753 247911 57515 33094 -129641 -121028 211447 -16573 -164931 188718
6843 262167 107204 -106288 -367216 -70108 246029 73967 -251266 -278138 63199 -87181 -24495
6831 32749 113467 -45394 -87951 -55984 -162686 107860 -200857 17646 154979 5328 172829
6820 172829 -134500 -282193 8231 -92159 86810 -39840 -50871 178210 -89251 -11307 154312
6808 -31652 120274 16570 -168514 -123574 173335 -287440 -146359 120014 213406 -102662
6797 404691 22204 -290386 -72077 -139678 -43443 -328388 -89890 -67583 -127904 25469 60906
6786 60906 150301 251239 218810 -93838 -222781 -86358 68847 -86053 352646 -179348 51604
6774 -53643 -358077 -114943 145477 -128047 60869 142380 -255732 214966 -1134 -5587 50831
6762 -44795 80640 -46759 -2134 143182 -206588 2776 -60152 -97847 -327601 -138830 185746
6750 -122044 328366 9712 -330729 22888 216834 -87431 -346083 -86311 111785 -208260 182789
6738 61952 -119497 221067 -149452 -65037 135266 -90120 -65753 275021 177041 143197 -47949
6726 -186818 -208105 -52224 -47217 30640 -269657 -135998 1031 -184791 -286758 187610 -184453
6714 -281265 -28869 -74610 26141 206573 -38136 154517 -153401 -83647 -292428 1294 17100
6703 17100 84251 -264184 347448 -95005 -155247 147309 105343 -105622 -257933 67967 -239219
6691 -98291 -184333 -82379 135142 -86002 271312 62501 71154 -16514 -13385 -8149 246089 -63144
6678 -205860 -109455 174760 98468 -24651 35981 158411 311878 -210664 83169 288157 -105409
6666 -290184 -208778 96588 -229291 -123285 81161 -207523 134845 47806 -163479 104764
6655 -69783 220075 -41055 -293714 135289 42664 49639 242098 -237069 76415 -58657 -333589
6644 -333589 104529 91215 163647 5379 -9009 94560 198465 129771 -79472 23830 51208 -419653
6631 48006 209407 -94704 149792 148577 -210961 108680 121859 301024 -268617 -83543 -56370
6620 -56370 -15708 -287801 -281673 128979 -76477 387436 -18622 -49308 -68075 -228599 57945
6608 -72268 -69175 -34536 189045 182514 8192 67527 -300753 145080 -227940 -257869 63219 161371
6596 161371 127561 551909 -157698 341935 223799 44011 53222 -109575 289796 -199239
6585 56216 72094 -52845 -106761 37035 -55502 -120373 257212 -127347 -42738 105359 -287567
6573 112374 392957 157125 81151 281608 49536 92635 -123564 43174 -328681 -260331 -520895
6562 -520895 -503183 -315338 -148483 -321932 -192339 -314142 -55545 134698 91315 167089
6552 167089 118152 -186196 -162877 -206522 -144013 -29097 288302 -363014 -5299 50072 148228
6541 148228 -35774 145273 -116004 -16126 186611 18693 -25408 -245544 -118575 93207 -31538
6529 -328277 10690 -391538 -109358 85079 -239099 -6427 -383536 47485 -188802 59406 308001
6518 308001 -233430 -110718 249176 261139 -72271 55885 78853 252921 -83661 -193728 300305
6506 -32502 473462 107477 140586 -56644 -3238 -113302 47968 48460 56868 -251052 15888 23680
6494 23680 57082 -311698 -251095 -95877 -204611 111924 128972 -160185 -13556 -20689 -149512
6483 -149512 160732 -184725 57417 -9578 211366 211416 16156 7400 424547 39636 -304227 -74887
6470 -209021 36872 -86142 -89899 -306905 -42916 -179321 45939 205754 -180465 -4726 -117636
6459 -117636 177827 207458 -25736 198811 -78358 199071 91070 43128 -95650 130894 77342
6448 77342 222134 84054 -181204 -62772 -229665 -105496 61388 -176890 72794 34716 -140625
6436 -45971 -109134 -64871 -105843 -219201 -50875 3446 -78348 94620 211085 81697 -97798 -173665
6424 -173665 -197121 101828 122474 140188 256889 -73604 -84094 -99650 -46851 153472 2946
6412 -145270 -98568 341131 -230142 123119 -112348 -109372 -214697 -167664 48934 -146509 -50867
6400 111923 28387 177888 -151171 -70996 -244000 -49869 -229185 -29466 42972 -281388 55554
6388 -95516 58462 210742 68919 119683 -337420 108636 -421264 -107099 45185 -294822 -39207
6376 183906 -498550 150060 7292 -110634 -6850 -365650 153210 27294 -83325 -257501 365783
6364 146248 -42713 63449 -334808 -29787 75840 43674 10017 -206092 80121 128636 -19025
6352 -269615 -64298 -30127 -165783 72692 109628 -294456 -3340 239142 -80382 -56074 19909
6340 -392249 -93546 189040 -15094 -63419 317833 -223033 171222 -85392 -209876 100843
6329 60890 -33339 -156718 -66117 28217 -178050 215326 34923 -390912 50965 -154286 -373150
6318 -373150 -17073 -208184 83743 -175533 78597 -115667 -267775 -147794 -50080 471323
6307 -70947 -169471 68164 -78971 -309497 -23465 253855 -121656 196508 255543 118308 -79062
6295 -127286 230953 -382233 10463 -10060 194635 163027 -279837 158986 -164764 -267242
6285 -267242 -544547 -50349 -68553 -53857 -187318 47412 -194890 -251416 82897 -1026 113216
6273 225821 209650 227550 -196465 -139201 211815 -216736 62607 23506 -45466 -363937 -170322
6261 80853 327704 -135560 9971 40798 152398 -233155 -314827 100032 179208 -108374 210555
6249 -17769 -178213 311277 137722 -218969 -384248 -27959 73619 -102744 100620 -251710
6238 63066 -61833 125457 199323 154944 -32639 39051 -214265 74800 -151304 -96452 -13917
6226 -325575 16849 -59266 -148262 55945 -141049 -69945 194421 305520 -127077 -185846 3529
6214 -46587 -205740 -140621 99673 101347 -127823 82598 35945 -239632 -78003 18224 -128861
6202 91943 36857 331679 195521 186348 -128831 -22503 372842 121254 -176006 16726 -57721
6190 -53148 41936 351636 -193479 -226551 180817 -105307 82042 18175 -29392 76423 98588
6179 98588 150615 -64885 -16076 -177171 -54567 -58806 -94210 -23120 -90774 205970 -18564 -33123
6167 -33123 113746 -110438 -236585 -51546 74208 162366 -297191 -132515 82750 -103319 -36535
6155 305081 175722 119246 142109 -178661 -104929 -81431 -160856 230983 -141214 323235 -78819
6143 -207782 -104959 188958 13961 -298129 45937 49888 212169 120579 -267232 -99854 -23141
6131 -56379 135986 86286 -132162 213751 22849 -221638 -89693 20268 128297 -207602 133062
6119 -37736 183077 -236179 -269686 -180447 -139205 -2512 -294058 274835 -107441 -137181 298764
6107 -188939 -22660 -141342 -177702 33218 -35649 -168281 -118509 -373887 -235823 106020 248043
6096 248043 41858 -21439 41256 -248352 -224290 -153261 -228622 -213621 17628 976 -85503 -131288
6084 -131288 -55973 -68403 -114154 44100 -68791 28674 84337 112825 170522 -211106 -9121 -9339
6072 -9339 -70363 -230732 113264 -16268 67229 -90680 33321 -196607 130127 87979 55642
6061 55642 171126 -218744 -133034 150995 -56472 149681 146871 19747 -52735 -138579 -42576
6049 224197 327159 -11912 -43717 98791 7245 -89440 23633 -53732 -134660 82696 -204660
6037 -41171 74627 241836 13290 154070 207590 -26230 112107 -307700 -258878 25234 -162663
6025 198562 -294259 169408 -130015 62996 122895 -223736 -27215 494309 202200 10062
6014 -89173 -12978 -72722 53161 29610 -9895 -10903 -31848 62407 -154370 214764 -273253 -428984
6002 -428984 -254089 423534 425355 388197 157999 9570 -247286 -158271 -75086 28771 -81928
5990 -234609 -44310 6097 155647 169851 -370179 43388 216305 -121599 105037 32112 4240
5978 -165211 390261 75914 143135 241438 94923 304198 -138296 231612 -37133 35886 126504
5967 126504 303662 -186450 184279 37131 -123708 30168 -26056 -303583 45046 -309987
5956 -75857 -68938 -139293 -63575 -196110 77785 190192 -232819 -144124 10021 -137162 7610
5944 -323413 -15706 -89496 86503 173639 -174960 -175895 159774 115406 -257339 -40537 -226365
5933 -226365 67706 -97852 -56228 -89928 76596 -14918 -189200 201873 -138239 214911 217667
5922 217667 198065 -137496 24235 3755 128814 47428 16187 142673 42494 180770 -102949
5910 -203678 24957 -149525 -71763 100941 40355 203882 92764 -52118 -8746 -173618 26230
5898 201692 417786 -119601 -90382 233485 43582 -286381 -197023 -324083 -20474 346632
5887 129911 -64260 -132970 137442 160013 -35070 -117979 174947 -99185 -146467 -80217 196205
5875 186078 21128 215475 159478 -12582 105254 -93188 5887 165101 50763 198003 111161
5864 111161 -45988 -119972 43405 -247809 -89665 -173432 -151617 108511 73587 -121280 112797
5852 104071 292404 -112016 -153960 -118716 -16432 124714 131100 -106172 63996 36311 -115432
5840 -76405 -281114 -265496 179666 -109349 -36368 34643 -143656 -139600 11962 364195 -293139
5828 -148410 133541 -51414 -99430 -111155 -20431 49636 208193 -261589 -21658 -523706 -171448
5816 159178 242151 -302472 -9225 -192513 82783 227483 134907 28498 -242878 -104613 68033
5804 150751 65699 384160 101452 -189651 -123337 -261333 139858 -27498 -66172 -83908 339445
5792 25308 69946 -50106 186795 -219460 -144556 76826 -278106 190809 -91592 -239118 16405
5780 139528 -282146 -376393 -55978 -194415 -33754 32172 -98304 279931 -303480 -315555 25825
5768 8422 -24611 77760 166656 211926 41196 180898 -37041 116562 -114511 146239 -157864
5756 -51259 123312 278453 127718 -117148 -64710 10712 -149756 93488 164943 -140494 152210
5744 6670 184575 -59886 -372824 -198589 14799 -51662 104937 -452032 68224 -24618 121027
5732 -346585 -30745 56748 -86018 -28240 -131857 -82392 177992 232276 -424883 111953 -45500
5720 -20360 434681 379851 -97352 169167 -28178 145557 183937 -27042 -36521 1781 198406
5709 198406 -119481 -127666 162662 59276 4955 -45799 47257 164215 -213370 -336953 -53896
5697 -131267 9780 -196405 -12397 60707 -76137 17569 154582 -166649 -18453 172142 40041
5685 91056 314217 187399 -99197 135315 -308989 -461562 137169 34629 24 -134960 143876
5673 144471 58613 58664 11831 -13366 -147640 -185523 -235418 340391 88198 -242810 -28375 86489
5660 -207409 -60467 -33921 -179191 -52488 -107749 -155799 45276 -28748 -56360 104193 13055
5648 282807 107242 -39642 402533 -40747 -98042 -290444 -185744 299031 88316 144526 -3446
5636 -59418 -43602 70549 128656 -204901 53215 262828 144059 108904 110510 -44808 -62944
5625 -62944 -51111 113762 85328 -14353 -38399 38435 -317732 -168533 183007 77893 -129330
5613 31308 39587 240442 265082 -187460 -45182 -4341 10549 -80077 278815 282710 336091 -170471
5600 42402 174480 -458880 76360 155216 -153939 -268660 -113672 -40763 223994 -254516
5589 -25187 84004 -416671 -82075 23113 -87294 -88238 -185046 166638 -42873 -12844 -43577 -84294
5577 -84294 -79759 -203653 427364 40583 -358426 64457 -97733 -231389 13674 21919 165272
5566 165272 18048 -521499 136392 17325 -29883 -17901 55297 238735 -291521 -137660 102897
5554 244289 219341 50499 12109 118420 61548 131793 27997 -33426 -97907 173946 -115235
5542 -55362 -26928 125309 47619 212193 125653 161678 157063 9999 -12076 153005 149683 -69699
5529 -139458 69558 104067 195621 -203871 343094 -101919 311809 19565 79766 206070 -282595
5517 78570 55456 328409 -286525 -141489 -65719 -20332 -58865 158315 168609 -1941 -123574
5506 -123574 -20843 87441 40634 -83114 -173954 187890 -87234 197069 53407 -88341 138267
5494 -44955 329771 148390 52019 -195500 95281 -2225 268320 -106578 -179735 -226374 -90158
5482 -85011 -107477 188051 -45584 -219081 92099 57001 -6350 -76430 104034 94700 -35308 179303
5469 -49124 -399457 -107082 116261 -121092 -19851 213945 -143993 201257 106589 159226
5459 159226 109609 -74347 -146322 48502 -58609 110963 -91985 -38588 18333 137648 9564
5447 -80189 -171926 253933 -163218 -170300 -270721 -31886 244170 45535 -164341 -172130 -115790
5436 -115790 -195656 47027 -97565 12229 -7489 187294 -59997 22816 65142 96847 170280 143515
5424 143515 32511 -527081 100390 160859 -327944 198374 27007 106686 -67990 176541 -65340
5412 116821 105688 62197 -54663 167027 -448108 222992 58389 -166760 -162548 121736 91904
5401 91904 -98310 58346 -27479 -175486 114590 -134589 -72115 149009 -119532 50458 -77906
5389 -38714 -93772 97766 44600 -244369 154854 -61852 132970 -46538 -175020 -186903 141382
5377 -308842 178508 -100078 -208053 125955 -134182 78931 258654 301252 53716 92926
5367 92926 56924 -18830 85410 -296380 225602 -79419 -40990 -38719 -83214 -245163 -386693
5356 -386693 -206662 43499 -18114 -83296 142876 10449 125083 159489 -317827 56341 61215
5345 61215 109727 313679 -276700 -110181 215651 -18524 -577223 37885 235555 31237 -122366
5333 163590 -109399 52235 110620 -45854 115398 279418 -204475 -106423 -18621 -146180 104511
5321 -68816 164281 -255831 167714 -1839 -231929 210069 -98675 -185376 65506 -206215 37704
5309 185967 -113415 -201267 171694 -187223 127296 226135 75982 16119 -201613 286784
5298 -20999 159122 18981 11499 -33899 -192275 59626 -138442 207489 -192501 -167464 216971
5286 20589 -3027 197708 -165768 -224338 -181088 74660 35646 360859 121888 -153352 85441
5274 11817 -135664 -106290 -157749 -59219 37103 117195 84638 142021 186788 -107686 -140123
5263 -140123 -206001 42843 99388 8313 154033 -17869 184624 151430 -279198 -128019 80284
5251 -90795 63895 -229529 -176737 -392743 8677 99696 159468 277028 258562 -417667 -48873
5239 -181833 -119004 -69534 -25231 -16845 -43252 375826 -36117 43330 23083 328317 -64802
5227 -144032 82542 51580 196632 187140 -110898 -80331 156776 -244544 121325 368924 38192
5215 10766 12967 330416 -24878 -185251 136273 251566 21314 264956 95801 123327 260378
5204 260378 42162 23242 -223563 8787 199483 114151 -57422 154362 -111063 -30481 -94656
5193 -94656 -46259 146473 257206 88375 190781 -130286 104776 -72977 175879 129853 -157180
5181 -311205 -20785 37784 210148 177556 83512 142499 -134680 -60911 -44025 -179256 45088
5169 259101 -174338 -87612 -249799 256242 -105693 9894 -112040 -202918 -49410 77771 -115498
5157 50417 189858 -68218 -110670 2407 -299043 -188756 -351834 72593 196742 -22193 204128
5145 -342716 90317 -297386 -457485 24566 -327157 -159462 -172612 -83951 21300 75343 232855
5134 232855 209802 -86650 -476767 -204316 -22673 -327637 -219232 -45056 44832 161540 -366046
5122 -308003 -1734 -159576 113861 40180 199902 27218 -21891 363596 -27580 208925 134094
5111 134094 -153118 -47342 4809 -122016 338426 42513 -115643 298165 231420 -102067 -112705
5100 -112705 181186 153062 -166649 -138612 -10497 170606 -78064 -81276 -56578 87187 179332
5089 179332 -241898 225287 94169 -52090 209611 79763 -121174 204701 6571 -3831 -208149
5078 -208149 -144012 -100163 60574 -125948 17640 -385510 27129 119730 -3837 -47237 351618
5066 -69337 -178933 -50232 -30956 16755 108105 129760 116366 -272893 -34503 -4870 -80608 -412925
5054 -412925 -91585 198554 72687 -161527 -170313 -31498 260639 80726 -15647 178669 -24257
5042 104814 63291 120413 95662 434904 -101226 -35264 -117668 -110277 1548 38785 -215335
5030 -71787 138807 -133222 -191213 -66753 -124412 111013 7162 161412 -66431 47941 245438
5019 245438 130384 36055 128184 -53715 -17480 -16385 -73946 -15784 121672 31631 146888
5008 146888 159420 119437 -97618 -84173 63938 -304156 -84760 -90365 107341 -137057 -25412
4996 -54771 -272513 -173985 39476 -299739 39652 71511 -91155 85387 -66721 -109301 43937
4984 -351067 -83999 -222265 283219 41810 -24547 363300 -514229 13237 -75541 163650 -150142
4972 1927 56664 406429 152285 -153180 85506 -278070 -183729 -8429 74820 243776 -176008
4960 -203873 78257 135544 257989 -125265 7872 -149296 -243888 -3114 202374 200993 -194790
4948 -8504 130131 126851 514550 -281922 217811 304353 -463478 -135055 164725 212497 22904
4936 143761 42842 -166682 25092 -128092 -60162 134424 3283 88789 281669 98618 18733
4924 115331 -141121 365850 -4219 -205438 -217413 268154 94923 188763 89717 -402552 154139
4912 -106641 -109542 -16194 -152706 18633 183917 10976 -118964 -213858 158888 64288 65202
4901 65202 43738 221466 -81960 -143040 159752 6477 221240 -103447 -49994 125319 69762
4890 69762 75280 320950 -232704 64216 292027 -209415 243430 278715 184088 -60188 15903
4878 205289 -125265 -56805 204351 -85863 -363842 28639 26335 -53828 68046 233384 88297
4866 -46931 41455 -36238 -78773 53098 36346 -64318 -91384 385658 188106 -325926 -135946
4854 214007 50626 142457 148624 -190667 -145398 99897 92315 -249088 -190770 -207337 -261720 -222532
4842 -222532 -67394 -6553 266789 -309961 -454977 50024 -29869 63140 -179991 -23149 -207911
4831 -207911 139726 -262916 177958 -12439 45407 85626 183159 111267 -13371 180088 81854
4819 393647 -270312 228629 -105846 161252 351974 -43776 139719 -103254 -168398 -8696
4808 -131212 41059 -114907 -5056 81466 -11211 -116438 -68634 -283178 -112992 35907 -132019
4796 -157570 127450 265813 -2176 -62859 33216 60232 12705 -101040 -231100 81499 227008
4785 227008 -127424 -73964 -119983 204081 -75786 181852 108150 208587 -336744 147868
4774 -17307 142892 280910 -112225 257860 118440 -171251 67438 -39802 162227 460572
4764 460572 170233 2075 -165643 -27547 159351 -153290 -266637 57674 111247 397527 46994
4752 4498 -122480 -218100 -182945 51287 176872 -22183 9633 97454 -48660 -231504 64989 5231
4739 21303 -22891 -235158 -154774 -18810 -242809 -383580 -236678 -202998 -78548 -52411 160359
4727 55946 6419 107962 -136410 215197 157544 87164 59090 278693 -27499 9132 346612
4716 346612 -356790 -67804 -245699 -33999 161680 34662 103918 -8510 13918 -122691 357533
4704 186749 -48606 222481 23083 -165212 60653 -100980 -64602 13441 285108 41484 293098
4693 293098 153295 237663 -151300 -14296 -80289 -213224 76517 -164202 -35547 -82840 -15439
4681 -161007 -147153 77916 134012 98335 -48811 110341 -98936 187388 44510 -34321 19396
4669 -173766 -80988 45093 35083 373118 80459 217323 83977 -33643 -77061 59815 -6475
4657 -34767 -41326 45913 117819 115608 56711 64871 339999 -94753 -381550 -576097 93590 49221
4645 49221 -191158 44186 156180 8905 170747 325065 -9598 -18525 334456 -31113 299961
4633 -291809 85325 236730 171774 150677 -127579 -110118 -164287 -282510 -27595 99495 49823
4622 49823 -70629 274082 165970 -263763 -222247 -142716 -32943 -21802 94486 -128932 -51597
4610 38309 -94984 90344 45493 -37510 293728 182704 -58283 9402 -167337 -234537 -341420
4599 -341420 -91691 259408 47076 -177634 26566 142673 172933 102408 24868 -35123 267831
4587 -248560 -106184 -222801 134120 -151994 21908 -168380 232356 -3339 -138486 137486
4576 81853 -37854 109759 201957 -362300 -62752 -302964 91386 211226 189811 -305297 -61793
4564 -60174 -186803 -7801 -151054 150627 44629 170737 -228777 -85101 105102 149995 8454
4552 226169 -78752 -135537 -216171 -123424 8060 143652 -237515 -44091 -295874 -165528 -189020
4541 -189020 -108019 30995 136295 149583 107317 -438476 -14018 -120864 -69185 86386 -13480
4529 -151062 121713 -34656 -274796 -110274 -416863 -118 26385 344253 -38248 -179649 8895
4517 61913 26652 -180474 -119358 280747 160308 222776 -53193 -169714 -82929 141078 -73731
4505 107807 20660 248313 -379788 -85019 75936 -39024 214987 -1734 210971 299535 -41505
4493 -95081 -81342 97404 193921 10154 228688 224963 12830 59330 -143312 106472 -400275
4481 1055 -196360 18558 112035 -93583 119578 -9384 257851 93384 137596 -136479 67309
4469 158038 -17601 -148358 -62663 43741 -63996 77869 415995 -113274 -203701 -377129 307581
4457 159500 96237 122334 -104993 -144887 -58938 177824 -5948 -111618 -113510 104362 37475
$$ [...]
##END NTUPLES=NMR SPECTRUM
##END=
