
##TITLE=AC1112_Colombia_5835514_o0V20XEKOe
##JCAMPDX= 6.0         $$ Bruker NMR JCAMP-DX V2.0
##DATA TYPE= NMR SPECTRUM
##DATA CLASS= NTUPLES
##ORIGIN= BRUKER
##OWNER= Administrator
$$ 1.72 TOPSPIN		Version 2.1
$$ 2012-04-03 01:25:15.812 -0500  Administrator@TOPSPIN
$$ Compression mode = diff/dup
##.OBSERVE FREQUENCY= 400.13188235
##.OBSERVE NUCLEUS= ^1H
##.ACQUISITION MODE= SIMULTANEOUS (DQD)
##.ACQUISITION SCHEME= undefined
##.AVERAGES= 8
##.DIGITISER RES= 22
##SPECTROMETER/DATA SYSTEM= spect
##.PULSE SEQUENCE= zg30
##.SOLVENT NAME= COFFEE_meoh
##.SHIFT REFERENCE= INTERNAL, COFFEE_meoh, 1, 14.98061
##AUDIT TRAIL= $$ (NUMBER, WHEN, WHO, WHERE, PROCESS, VERSION, WHAT)
$$ ##TITLE= Audit trail, TOPSPIN		Version 2.1
$$ ##JCAMPDX= 5.01
$$ ##ORIGIN= Bruker BioSpin GmbH
$$ ##OWNER= Administrator
$$ $$ C:\Bruker\TOPSPIN/data/COFFEE/nmr/AC1112_Colombia_5835514_o0V20XEKOe/10/pdata/1/auditp.txt
$$ ##AUDIT TRAIL=  $$ (NUMBER, WHEN, WHO, WHERE, PROCESS, VERSION, WHAT)
(   1,<2012-04-03 01:25:07.578 -0500>,<Administrator>,<TOPSPIN>,<go>,<TOPSPIN 2.1>,
      <created by zg
	started at 2012-04-03 01:24:00.234 -0500,
	POWCHK enabled, PULCHK disabled,
       configuration hash MD5:
       1A 1E CE 29 27 FD 77 03 67 4E F0 E3 C4 B2 CB 90
       data hash MD5: 64K
       44 25 9A 89 F4 71 66 46 77 D5 8B 52 B9 25 C9 7D>)
(   2,<2012-04-03 01:25:10.421 -0500>,<Administrator>,<TOPSPIN>,<proc1d>,<TOPSPIN 2.1>,
      <Start of raw data processing
       efp LB = 0 FT_mod = 6 PKNL = 1 PHC0 = 0 PHC1 = 0 SI = 32K 
       data hash MD5: 32K
       FD 74 4C F4 64 19 C8 A2 E7 7F 36 1F CE A8 8F B6>)
(   3,<2012-04-03 01:25:10.906 -0500>,<Administrator>,<TOPSPIN>,<proc1d>,<TOPSPIN 2.1>,
      <pk PHC0 = 213.0084 PHC1 = 0 
       data hash MD5: 32K
       BC 6A 26 06 4D 01 82 EA 26 32 41 43 9F EF 84 D4>)
(   4,<2012-04-03 01:25:10.968 -0500>,<Administrator>,<TOPSPIN>,<proc1d>,<TOPSPIN 2.1>,
      <abs ABSG = 1 
       data hash MD5: 32K
       0F 6D F3 56 D1 9C 84 68 83 02 39 8B AB 57 80 73>)
(   5,<2012-04-03 01:25:11.015 -0500>,<Administrator>,<TOPSPIN>,<proc1d>,<TOPSPIN 2.1>,
      <abs ABSG = 2 
       data hash MD5: 32K
       3F 82 11 9C 61 A2 31 8F 9F 61 C0 FF B6 35 15 BE>)
(   6,<2012-04-03 01:25:11.046 -0500>,<Administrator>,<TOPSPIN>,<proc1d>,<TOPSPIN 2.1>,
      <abs ABSG = 3 
       data hash MD5: 32K
       1D ED 97 9F 6E EB 8A CE 05 66 CD 2D F2 E4 8A C3>)
(   7,<2012-04-03 01:25:11.093 -0500>,<Administrator>,<TOPSPIN>,<proc1d>,<TOPSPIN 2.1>,
      <abs ABSG = 4 
       data hash MD5: 32K
       6D E7 83 60 25 59 ED 20 72 46 18 98 46 37 75 C6>)
(   8,<2012-04-03 01:25:11.171 -0500>,<Administrator>,<TOPSPIN>,<proc1d>,<TOPSPIN 2.1>,
      <abs ABSG = 5 
       data hash MD5: 32K
       4F F5 92 4B 92 F1 72 5E E5 77 F5 62 0E EB 5F 49>)
$$ ##END=
$$ 
$$ $$ hash MD5
$$ $$ 3C 34 E4 1D 86 67 24 22 02 BB 64 E0 91 E7 01 12
##$RELAX= 
##$RELAX= 
##$RELAX= 
##$RELAX= 
##$RELAX= 
##$RELAX= 
##$RELAX= 
$$ Bruker specific parameters
$$ --------------------------
$$ [...]
##$TP= (0..7)
150 150 150 150 150 150 150 150
##$TP07= 0
##$TPNAME0= <>
##$TPNAME1= <>
##$TPNAME2= <>
##$TPNAME3= <>
##$TPNAME4= <>
##$TPNAME5= <>
##$TPNAME6= <>
##$TPNAME7= <>
##$TPOAL= (0..7)
0.5 0.5 0.5 0.5 0.5 0.5 0.5 0.5
##$TPOFFS= (0..7)
0 0 0 0 0 0 0 0
##$TUNHIN= 0
##$TUNHOUT= 0
##$TUNXOUT= 0
##$USERA1= <user>
##$USERA2= <user>
##$USERA3= <user>
##$USERA4= <user>
##$USERA5= <user>
##$V9= 5
##$VALIST= <valist>
##$VCLIST= <CCCCCCCCCCCCCCC>
##$VD= 0
##$VDLIST= <DDDDDDDDDDDDDDD>
##$VPLIST= <PPPPPPPPPPPPPPP>
##$VTLIST= <TTTTTTTTTTTTTTT>
##$WBST= 2048
##$WBSW= 25
##$XGAIN= (0..3)
0 0 0 0
##$XL= 0
##$YL= 0
##$YMAX_a= 536205
##$YMIN_a= -654782
##$ZGOPTNS= <>
##$ZL1= 120
##$ZL2= 120
##$ZL3= 120
##$ZL4= 120
##$ABSF1= 14.98061
##$ABSF2= -5.57192
##$ABSG= 5
##$ABSL= 3
##$ALPHA= 0
##$AQORDER= 0
##$ASSFAC= 0
##$ASSFACI= 0
##$ASSFACX= 0
##$ASSWID= 0
##$AUNMP= <proc_prof1d_extract_pilot.lims>
##$AXLEFT= 0
##$AXNAME= <>
##$AXNUC= <1H>
##$AXRIGHT= 0
##$AXTYPE= 0
##$AXUNIT= <>
##$AZFE= 0.1
##$AZFW= 0.1
##$BCFW= 0
##$BC_mod= 0
##$BYTORDP= 0
##$COROFFS= 0
##$CY= 15
##$DATMOD= 1
##$DC= 0
##$DFILT= <>
##$DTYPP= 0
##$F1P= 0
##$F2P= 0
##$FCOR= 0.5
##$FTSIZE= 32768
##$FT_mod= 6
##$GAMMA= 0
##$GB= 0
##$INTBC= 1
##$INTSCL= 1
##$ISEN= 128
##$LB= 0
##$LEV0= 0
##$LPBIN= 0
##$MAXI= 10000
##$MC2= 0
##$MEAN= 0
##$ME_mod= 0
##$MI= 0
##$NCOEF= 0
##$NC_proc= -8
##$NLEV= 6
##$NOISF1= 0
##$NOISF2= 0
##$NSP= 0
##$NTH_PI= 0
##$NZP= 0
##$OFFSET= 14.98061
##$PC= 1
##$PHC0= 213.0084
##$PHC1= 0
##$PH_mod= 1
##$PKNL= yes
##$PPARMOD= 0
##$PPDIAG= 0
##$PPIPTYP= 0
##$PPMPNUM= 2147483647
##$PPRESOL= 1
##$PSCAL= 4
##$PSIGN= 0
##$PYNMP= <proc.py>
##$REVERSE= no
##$SF= 400.13
##$SI= 32768
##$SIGF1= 0
##$SIGF2= 0
##$SINO= 400
##$SIOLD= 32768
##$SPECTYP= <>
##$SREGLST= <1H.CDCl3>
##$SSB= 0
##$STSI= 32768
##$STSR= 0
##$SW_p= 8223.68421052632
##$SYMM= 0
##$S_DEV= 0
##$TDeff= 65536
##$TDoff= 0
##$TI= <>
##$TILT= no
##$TM1= 0
##$TM2= 0
##$TOPLEV= 0
##$USERP1= <user>
##$USERP2= <user>
##$USERP3= <user>
##$USERP4= <user>
##$USERP5= <user>
##$WDW= 1
##$XDIM= 32768
##$YMAX_p= 465509380
##$YMIN_p= -722124
##$CURPLOT= <Network HP LaserJet P1505>
##$CURPRIN= <$Network HP LaserJet P1505>
##$DFORMAT= <normdp>
##$LAYOUT= <+/1D_H.xwp>
##$LFORMAT= <normlp>
##$PFORMAT= <normpl>
##$SURQMSG= 1
$$ End of Bruker specific parameters
$$ ---------------------------------
##NTUPLES= NMR SPECTRUM
##VAR_NAME=  FREQUENCY,     SPECTRUM/REAL,   SPECTRUM/IMAG
##SYMBOL=    X,             R,               I
##VAR_TYPE=  INDEPENDENT,   DEPENDENT,       DEPENDENT
##VAR_FORM=  AFFN,          ASDF,            ASDF
##VAR_DIM=   32768,         32768,           32768
##UNITS=     HZ,            ARBITRARY UNITS, ARBITRARY UNITS
##FACTOR=    0.250966925370066, 1,           1
##FIRST=     8223.43324360095, -90243,       67279
##LAST=      0,             158559,          -191484
##MIN=       0,             -722124,         0
##MAX=       8223.43324360095, 465509380,    0
$$ Real data points
##PAGE= N=1
##DATA TABLE= (X++(R..R)), XYDATA
$$ [...]
19469a84526M8488k9981M514E6963J37247c17385h1337p8503q8098E4931a498
$$ -184526 -136038 -166019 -161505 56963 194210 -317385 -81337 -159840 -247938 54931 -1498
19457b76293k01613F2097b09578A48195o1629d13397F453c9232j3885a1466B3446
$$ -276293 -477906 62097 -209578 148195 86566 -413397 6453 -39232 -53117 -11466 23446
19445A13155a02210A96378a50451I518b70056a33473B11099b1497B5139f6867
$$ 113155 -102210 196378 -150451 9518 -270056 -133473 211099 -21497 25139 -66867
19434A70609a75961n7844A68408A2612b70723f9347k0933L7343A77Q1954B4677
$$ 170609 -175961 -233805 168408 12612 -270723 -69347 -90280 -52937 177 82131 24677
19422i6027H6082b19770J03959m423C06077a97428k76351a43584E764a71653a5512
$$ -96027 86082 -219770 -115811 -120234 306077 -197428 -473779 -143584 5764 -171653 -15512
19410f5629B74787c05645g0770e948C649b93676k8038A50749k390h1013A73734
$$ -65629 274787 -305645 -70770 -5948 3649 -293676 -321714 150749 148359 -81013 173734
19398C6018J09144a84811e5035k8856A86898a05086L7792k09136a01866M2069
$$ 36018 145162 -184811 -55035 -83891 186898 -105086 -67294 -276430 -101866 -59797
19388e9797A21884c36586R9438R0147M070k7385C30896b35313j6061c4793E0448
$$ -59797 121884 -336586 -237148 -147001 -142931 -170316 330896 -235313 -251374 -34793 50448
19376b18354i8570k09485a26108l53328C9036a21030j5773E771b10865j35363
$$ -218354 -98570 -308055 -126108 -479436 39036 -121030 -136803 5771 -210865 -346228
19366c46228n6363e7155k13317o5638E6568a90982O0187j09388h4539I697J88735
$$ -346228 -402591 -57155 -270472 -336110 56568 -190982 -130795 -240183 -84539 9697 198432
19355A98432a48258f9004F9920f9484A22906Q4353b76684j07668a42491k2989
$$ 198432 -148258 -69004 69920 -69484 122906 207259 -276684 -384352 -142491 -165480
19345a65480A60802p586b70303J33517j06569h9653K8192a7099A9980d36431G6668
$$ -165480 160802 153216 -270303 -136786 -243355 -89653 -61461 -17099 19980 -436431 76668
19333A45123p1987a38750A57932d8592M146k44743M0260a8879j25132j56897C5652
$$ 145123 73136 -138750 157932 -48592 -44446 -289189 -248929 -18879 -144011 -300908 35652
19321C53331A14448b21382M7295A55976a44869A1071N0461b9845k17081f1782
$$ 353331 114448 -221382 -174087 155976 -144869 11071 61532 -29845 -246926 -61782
19310A87766a27099o5682I9196i9678A18465a87995A70893a15684G8466b87815
$$ 187766 -127099 -192781 99196 -99678 118465 -187995 170893 -115684 78466 -287815
19299a66085o5987A21430l4913J81034d29833E8624F410J64214c49490f9474q6134
$$ -166085 -232072 121430 86517 267551 -429833 58624 6410 170624 -349490 -69474 -155608
19288a55608j3979o4551B80739A13167b27817P624c2199A11564b76511b2791C34771
$$ -155608 -169587 -234138 280739 113167 -227817 -220193 -32199 111564 -276511 -22791 334771
19276c52894C4891J41077G9097d2039C1778d7809k11172M4275R6137L9049b4011
$$ -352894 34891 175968 79097 -42039 31778 -47809 -258981 -214706 -118569 -79520 -24011
19264g3103P261l0036f355j2052m42401a6763e115j14128A85375a08986K4538
$$ -73103 -65842 -95878 -6355 -18407 -460808 -16763 -5115 -119243 185375 -108986 -84448
19253h4448A03407f3695k86304O9975A0987J76703b3298A94616O870a67429e0090
$$ -84448 103407 -63695 -349999 -280024 10987 187690 -23298 194616 201486 -167429 -50090
19241A59393b11291N2603e9311k47319M2941G899c7093k83467A02429a45471L68
$$ 159393 -211291 -158688 -59311 -306630 -263689 7899 -37093 -320560 102429 -145471 -145103
19230a45103g1336j08242G0199O8497c9541A94326e5579l5894H7357O784i3990
$$ -145103 -71336 -179578 70199 138696 -39541 194326 -55579 -91473 87357 94141 -93990
19218a64286A72030a42022a5073j9762k8824K6206D9988a47385j856E8812b3173
$$ -164286 172030 -142022 -15073 -34835 -63659 -37453 49988 -147385 -149241 58812 -23173
19206c86416J21651J13061j81987G3773G465b98933C9706A3856f624n3655E3182
$$ -386416 -264765 -151704 -333691 73773 7465 -298933 39706 13856 -6624 -60279 53182
19194b4721n0543L2700q3894d3982A20055a10756A38873g1824j15378D3258K11333
$$ -24721 -75264 -42564 -126458 -43982 120055 -110756 138873 -71824 -187202 43258 254591
19183B54591D6049Q6991a51976n541A75682e44442f8502p5879j71521J55923E7144
$$ 254591 46049 133040 -151976 -157517 175682 -544442 -68502 -144381 -315902 -159979 57144
19171a56224j9202l0747B34363E6583K08308a98756H4526a61422B43442A729O435
$$ -156224 -175426 -206173 234363 56583 264891 -198756 84526 -161422 243442 1729 8164
19160H164b17421l6352A42076a0604j53752k29195b0447D5658J1705a16245n6903
$$ 8164 -217421 -253773 142076 -10604 -164356 -393551 -20447 45658 57363 -116245 -173148
19149a73148K9296k02865A09149P4279b31020D5367Q682a4836H163M1392b36079
$$ -173148 -143852 -346717 109149 183428 -231020 45367 54049 -14836 8163 49555 -236079
19137a28074e2444M948j05267M7713A89254h4053A85331a83180R567e7876j19972
$$ -128074 -52444 -47496 -152763 -105050 189254 -84053 185331 -183180 -173613 -57876 -177848
19126a77848K2327K9254a4086C0956M2432J08634E7305a90220B32182F1717b15707
$$ -177848 -155521 -126267 -14086 30956 73388 182022 57305 -190220 232182 61717 -215707
19114I3507b02725q4286k2151C41880g3087p3059A6719L6048M5971k9721K15607
$$ 93507 -202725 -287011 -309162 341880 -73087 -146146 16719 52767 98738 69017 284624
19103B84624e6964J0094B07036h0368j78982B4627j111J57670D4902b16894B32564
$$ 284624 -56964 -46870 207036 -80368 -259350 24627 23516 181186 44902 -216894 232564
19091A96148B6932a48069a457C9638c8578l23740a77597A7369b34492G8738a42694
$$ 196148 26932 -148069 -1457 39638 -38578 -362318 -177597 17369 -234492 78738 -142694
19079e5423k7530b1245A36380o6176i4615a1965j79447J7919d187o6047b3491
$$ -55423 -82953 -21245 136380 70204 -94615 -11965 -191412 -173493 -4187 -70234 -23491
19067b70939Q9687J4502P8719A07276i3854J1807k45497d7405l61918J54871D06219
$$ -270939 -181252 -166750 -88031 107276 -93854 -82047 -327544 -47405 -409323 -254452 406219
19055a45700J3178m2018H3288M0520a71866j55221Q9285l4947g6314C55483c07415
$$ -145700 -132522 -174540 83288 123808 -171866 -327087 -237802 -272749 -76314 355483 -307415
19043b99915A61118q227J31332a37001B18421D8397c66389g2604q066q6777e3686
$$ -299915 161118 152891 284223 -137001 218421 48397 -366389 -72604 -80670 -167447 -53686
19031a86292B17246a34181M2650A09734c49632a44125k62187C3284J16635B8973
$$ -186292 217246 -134181 -91531 109734 -349632 -144125 -406312 33284 149919 28973
19020A65696C0121J04431K38986a53502j03471f5754b6606j75317B04773e9334
$$ 165696 30121 134552 373538 -153502 -256973 -65754 -26606 -201923 204773 -59334
19009a81601A4333a03945A56178G6785c6430c073B9180c10761I9409D1587a73003
$$ -181601 14333 -103945 156178 76785 -36430 -3073 29180 -310761 99409 41587 -173003
18997b13250q0353a41712B17917J1855A2110d02987G8169j1123R1433a12598b3887
$$ -213250 -293603 -141712 217917 229772 12110 -402987 78169 67046 158479 -112598 -23887
18985A15304a93801A33332i457F0082J166a23300A0971c00979A71702G6523f2341
$$ 115304 -193801 133332 -9457 60082 61248 -123300 10971 -300979 171702 76523 -62341
18973b33094A33597a75146P7786j77651N1224D3797L7323P8756J13275h8980k44967
$$ -233094 133597 -175146 -97360 -275011 -223787 43797 81120 159876 273151 -88980 -333947
18962c33947L0242i3687B5432a00217C61761A6104M77269B4601n515f7923m9246
$$ -333947 -303705 -93687 25432 -100217 361761 16104 493373 24601 19086 -67923 -117169
18951a17169j48864a01834m3682H1112J65769h7006b4882j17142A07222K11824
$$ -117169 -266033 -101834 -145516 81112 246881 -87006 -24882 -142024 107222 319046
18941C19046a2152A32748a25561N7262A91824l378i8872i11k97102A89246e2474
$$ 319046 -12152 132748 -125561 -68299 191824 188446 -98872 -911 -298013 189246 -52474
18929a43891f3616m4735A28568R3198p4838l6361a58624C3835f310k18636L9374
$$ -143891 -63616 -108351 128568 221766 146928 110567 -158624 33835 -6310 -224946 -185572
18918a85572C11343G8487b73494a13967A41650a81490g4395I2529a78497E7586
$$ -185572 311343 78487 -273494 -113967 141650 -181490 -74395 92529 -178497 57586
18907A83680o9646a83953H4296h3990j51504I3179a66613N9349A70863E9794c12876
$$ 183680 114034 -183953 84296 -83990 -235494 93179 -166613 -107264 170863 59794 -312876
18895B94467H6407K66993D4142K11855k9548a31374I5839J55559b2109l6353k06159
$$ 294467 86407 353400 44142 255997 226449 -131374 95839 251398 -22109 -58462 -264621
18884b64621J22840E708d68701a55045B26855E0177A1282c45021E1950E974g1926
$$ -264621 -141781 5708 -468701 -155045 226855 50177 11282 -345021 51950 5974 -71926
18872e8608k6035L5030k31073j18011C5352h3316j54708d1523k24767a08420j48319
$$ -58608 -84643 -49613 -280686 -398697 35352 -83316 -238024 -41523 -266290 -108420 -256739
18861b56739E7622b15928c3470G9180K2981a63623d3802A10116C9170a09257g99
$$ -256739 57622 -215928 -33470 79180 102161 -163623 -43802 110116 39170 -109257 -799
18849A17287b14878B53885C7914K55648m3415a47589A50289N7440E8587a08376
$$ 117287 -214878 253885 37914 293562 250147 -147589 150289 207729 58587 -108376
18838B24781H5919b36599a5490A77003C018b48893d8344H5238K67329A33998a68810
$$ 224781 85919 -236599 -15490 177003 3018 -248893 -48344 85238 352567 133998 -168810
18826c6309J0453k74775i4815j03604A44091a09738A2577a90162C41898f2699
$$ -36309 -25856 -300631 -94815 -198419 144091 -109738 12577 -190162 341898 -62699
18815g9139B3568b1000F5174a95830j49330O9715H8111D468b86212F5825b14020
$$ -79139 23568 -21000 65174 -195830 -345160 -275445 88111 4468 -286212 65825 -214020
18803A68103a52104B46189d2833B34127b35601A61654D2422L91739K4650C1029
$$ 168103 -152104 246189 -42833 234127 -235601 161654 42422 434161 458811 31029
18792D4814a63511B21068K3929q5518C8874a019C54987c54227A0007J0640J41535
$$ 44814 -163511 221068 244997 159479 38874 -1019 354987 -354227 10007 20647 162182
18781A62182a33284D4856i3594p3213f5466I0596c74433a78160D4730J68443b71486
$$ 162182 -133284 44856 -93594 -166807 -65466 90596 -374433 -178160 44730 213173 -271486
18769a3410j45108j16154j63693a54066A2340a3459C6514H944a54618j4223j32903
$$ -13410 -158518 -274672 -438365 -154066 12340 -13459 36514 8944 -154618 -168841 -301744
18758c01744C51727a05457n0876N903A03523A8312j157L10949B0755J63902a61721
$$ -301744 351727 -105457 -156333 -150430 103523 18312 17155 328104 20755 184657 -161721
18746D2844a24044j49562J10782g4782j42899l8623D6444f7554k13881f5651n0321
$$ 42844 -124044 -273606 -162824 -74782 -217681 -256304 46444 -67554 -281435 -65651 -115972
18735a15972M8814l964j52407A59820c8134j09347k91863H9561j1886b03271j5816
$$ -115972 -67158 -71122 -223529 159820 -38134 -147481 -439344 89561 77675 -203271 -219087
18724b19087L7688A7040J1933f4871l4966G4581a87647g6362F8443a51334C30135
$$ -219087 -181399 17040 28973 -64871 -99837 74581 -187647 -76362 68443 -151334 330135
18712b2985n0848B66479F1992a9911k46281A40112a84825f6455E6269J40325h6728
$$ -22985 -73833 266479 61992 -19911 -266192 140112 -184825 -66455 56269 196594 -86728
18700b57245C5864d14374O3827B58377I9218E363J06125b83746J10071J4009d7517
$$ -257245 35864 -414374 -350547 258377 99218 5363 111488 -283746 -173675 -159666 -47517
18688b27165c650H1669f3641k59979a10837n0572A93545b90957C4175c0595o8171
$$ -227165 -3650 81669 -63641 -323620 -110837 -161409 193545 -290957 34175 -30595 -98766
18677i8766F0713q63a13640C3735O9180g68j52200K9645k59045F3972Q4701J01136
$$ -98766 60713 59850 -113640 33735 102915 -768 -152968 -123323 -382368 63972 148673 249809
18665B49809D9936d18487J71332L200H0533a71986j20108d1350j43862f7173o9815
$$ 249809 49936 -418487 -247155 -243955 80533 -171986 -292094 -41350 -185212 -67173 -136988
18654a36988N7533A93358a07998H4590J3407d9548j08686B9059i8981m8841j22083
$$ -136988 -79455 193358 -107998 84590 97997 -49548 -158234 29059 -98981 -147822 -269905
18643b69905F3864b36309L7085A41860K71607B02718c15294l6229A7449a98105
$$ -269905 63864 -236309 -199224 141860 413467 202718 -315294 -351523 17449 -198105
18632b129j98659j14362c4199l35713a21366j96206J07377m5620J22087n6784
$$ -2129 -200788 -315150 -34199 -369912 -121366 -317572 -210195 -255815 -133728 -190512
18622a90512B79385a99199q3924a34389F0730J61552c6964R160o975A88106k7192
$$ -190512 279385 -199199 -283123 -134389 60730 222282 -36964 -27804 -34779 188106 160914
18611A60914b00594n8668e8123a0869j3644A7814P2050m2799a6215j7281m712
$$ 160914 -200594 -259262 -58123 -10869 -24513 17814 89864 47065 -16215 -33496 -38208
18600c8208j23152B339i0704q6760p9082E541a68565D1682a75729b2598A2008
$$ -38208 -161360 2339 -90704 -177464 -256546 5541 -168565 41682 -175729 -22598 12008
18588c34960J36699F3012k2199J49009a3732B29960b43861j56030E6276a15819
$$ -334960 -198261 63012 40813 189822 -13732 229960 -243861 -399891 56276 -115819
18577c34963a56584A7479i4326j98950E1172c5017d639j13363M4603B501d7845
$$ -334963 -156584 17479 -94326 -293276 51172 -35017 -4639 -118002 -73399 2501 -47845
18565a48994A26494i4405b1729j1654j11758k7334A38098J1531J42336a46630
$$ -148994 126494 -94405 -21729 -33383 -145141 -172475 138098 149629 291965 -146630
18554a52347H14O4501b20365i4527j92179R3749h8534D9793i1688B25830c35705
$$ -152347 814 65315 -220365 -94527 -286706 -192957 -88534 49793 -91688 225830 -335705
18542b06147q287F1378a11934d9065J9398r0571A0908e1346j22407A1485g5533
$$ -206147 -214434 61378 -111934 -49065 -29667 -120238 10908 -51346 -173753 11485 -75533
18530A55734j1380b48230h1203H2144N30e4038k31872a24213l6010B54040a15715
$$ 155734 144354 -248230 -81203 82144 82674 -54038 -285910 -124213 -160223 254040 -115715
18518B20730a61948D5269e3591A55754J50555a33825j37347J9019a02855C91245
$$ 220730 -161948 45269 -53591 155754 306309 -133825 -271172 -252153 -102855 391245
18507A44262J17441a02376a7918q052k93685J55191c0235B07632b01602F6786
$$ 144262 261703 -102376 -17918 -25970 -319655 -164464 -30235 207632 -201602 66786
18496f6534q7053j08059e2887l47216D1211i7408B21613a06871B6179J30764m0185
$$ -66534 -153587 -261646 -52887 -400103 41211 -97408 221613 -106871 26179 156943 116758
18485A16758n981a55406l75732g3004B14537c30014I687a34694j50864h6334n6075
$$ 116758 110777 -155406 -531138 -73004 214537 -330014 9687 -134694 -285558 -86334 -142409
18474a42409j49217G3707d0056j3595G7851c18593J57279A18379j74a11379b3116
$$ -142409 -291626 73707 -40056 -53651 77851 -318593 -161314 118379 118205 -111379 -23116
18462A49380c9193k86121c9027J4001q9829f904j48980B89140n0818c96890G7924
$$ 149380 -39193 -325314 -39027 -25026 -114855 -6904 -155884 289140 238322 -396890 77924
18450B07951A3911K4822e3979j51075C7459a29897B431a83026M6897B31652f1555
$$ 207951 13911 38733 -53979 -205054 37459 -129897 2431 -183026 -136129 231652 -61555
18438A77557a83251A62585H0184J73628c55491B51711f00765h2802j73780E1139
$$ 177557 -183251 162585 80184 253812 -355491 251711 -600765 -82802 -256582 51139
18427a78986E1605L2267e8553a0484l85660A39349N9067a33076c5933E1044A5189
$$ -178986 51605 83872 -58553 -10484 -396144 139349 198416 -133076 -35933 51044 15189
18415b95831d3227k32937a11613B60264a05064k5413C18b25889l2963B88553G7771
$$ -295831 -43227 -276164 -111613 260264 -105064 -130477 318 -225889 -258852 288553 77771
18403a21020F8379d30148J44909B71929a1004k24666J16603E4163K58069J2541
$$ -121020 68379 -430148 -285239 271929 -11004 -235670 -119067 54163 312232 324773
18393C24773E8023b240p912k19621d1093r6690k6564D9154a6996j07422F3740
$$ 324773 58023 -2240 -10152 -229773 -41093 -137783 -164347 49154 -16996 -124418 63740
18381G2683l0549d2977B66314F2260c80434a5777l2089m8185A71622a42933A80481
$$ 72683 42134 -42977 266314 62260 -380434 -15777 -47866 -96051 171622 -142933 180481
18369b04918B53824b13324E0924e1872J2697A75467a8127A87371h4431l77346
$$ -204918 253824 -213324 50924 -51872 -39175 175467 -18127 187371 -84431 -461777
18359d61777g348A86011a0429F2895a9864B45921c4508I6853J04419I9969D5645
$$ -461777 -7348 186011 -10429 62895 -19864 245921 -34508 96853 201272 99969 45645
18347a47963L5133A73913a19815m4029l8588B63971j22945a53291j7882h0364
$$ -147963 -112830 173913 -119815 -163844 -202432 263971 141026 -153291 -171173 -80364
18336A11440C9005b22135A58246b04465b4130G8124L1899h2728L954C7445a80024
$$ 111440 39005 -222135 158246 -204465 -24130 78124 110023 -82728 -78774 37445 -180024
18324A01757g81k6561j30274j3510F2468M5346c39378c1110r3673K7433Q391a6634
$$ 101757 -781 -27342 -157616 -171126 62468 107814 -339378 -31110 -124783 -97350 -88959 -16634
18311F5948a05726j18373J2542a6700k02066N6313A8050f8690i450j13715B9798
$$ 65948 -105726 -224099 -211557 -16700 -218766 -162453 18050 -68690 -9450 -123165 29798
18299F183L4007J97441c757A03475m4809c84I5016d9389A36191c8540j69375b0325
$$ 6183 40190 237631 -3757 103475 58666 -384 95016 -49389 136191 -38540 -207915 -20325
18286a73337B61002a39811f9797k00015A12549C6207K3219J31239O8717b278j36357
$$ -173337 261002 -139811 -69797 -269812 112549 36207 59426 190665 259382 -2278 -138635
18275a38635B65993d1690A46640a67945A5838b18561K5799N9050j42102a16891
$$ -138635 265993 -41690 146640 -167945 15838 -218561 -192762 -133712 -275814 -116891
18264F0230e2540I7377d0399k30862C36714g5040D37848b52832a4345D1823b86458
$$ 60230 -52540 97377 -40399 -271261 336714 -75040 437848 -252832 -14345 41823 -286458
18252h0659A6633g0289A2597b467G2216i8286p7459P3679j74912c8594A2474e8728
$$ -80659 16633 -70289 12597 -2467 72216 -98286 -175745 -102066 -276978 -38594 12474 -58728
18239A64077a397k3584j64110D117N4875b63262a07925b8144j0448E3719d19982
$$ 164077 -1397 -24981 -189091 4117 58992 -263262 -107925 -28144 -38592 53719 -419982
18227a05401k92020D1365J17146a97756g399G5627J69165A6671a07776A63424
$$ -105401 -397421 41365 158511 -197756 -7399 75627 244792 16671 -107776 163424
18216D4879L4834B1979J4653g8651A25148m7146M1341b26854B15808a58060B7773
$$ 44879 79713 21979 36632 -78651 125148 78002 119343 -226854 215808 -158060 27773
18204A23472A3595b44265n7045G799J08430b18270B14433P7231j10140a20353
$$ 123472 13595 -244265 -301310 7799 116229 -218270 214433 291664 181524 -120353
18193B1936d00104a6143n6702j44852H6077N492J80251A35611a98471i4958A43867
$$ 21936 -400104 -16143 -72845 -217697 86077 91569 271820 135611 -198471 -94958 143867
18181a68858I9443a00250f60k39255a19946A34931M8079D9660j8542J80524e1022
$$ -168858 99443 -100250 -660 -239915 -119946 134931 183010 49660 31118 211642 -51022
18169A89588M7303b85694F5058c5589o5788B1935P2076h2385C6217K2359c2422
$$ 189588 236891 -285694 65058 -35589 -101377 21935 94011 -82385 36217 58576 -32422
18157e949o3701C46495B426R6326b26688g9181o1471I2520K4986b60164n2252
$$ -5949 -69650 346495 2426 98752 -226688 -79181 -140652 92520 117506 -260164 -312416
18146c12416J05744C9376a29946K0679j83091Q9538O6968A29354a04101B7152
$$ -312416 -206672 39376 -129946 -109267 -292358 -202820 -135852 129354 -104101 27152
18135B92398A28435g4054i087p4945A40232b38106C74607b55850f3041D0905J11747
$$ 292398 128435 -74054 -9087 -84032 140232 -238106 374607 -255850 -63041 40905 152652
18124A52652m2444n4274a03096a5039q7971C7114B621a91790O2144A4195b42562
$$ 152652 110208 55934 -103096 -15039 -103010 37114 2621 -191790 -129646 14195 -242562
18112a37429O1607C94J6420c29675C0988c88157A74068a8795j00423k1305B16096
$$ -137429 -75822 394 16814 -329675 30988 -388157 174068 -18795 -119218 -140523 216096
18100B56312H0001c57474e9337B34082b16268a02452b5837j05085B49403j02573
$$ 256312 80001 -357474 -59337 234082 -216268 -102452 -25837 -130922 249403 146830
18090A46830n598c37798m151A87502a9832M47j90098A98766h213q1298F5738a3317
$$ 146830 141232 -337798 -341949 187502 -19832 -19385 -209483 198766 -8213 -89511 65738 -13317
18077A22136C0375L84434i5387a5951k69903j18135a33253a2898k68728g6955
$$ 122136 30375 414809 -95387 -15951 -285854 -403989 -133253 -12898 -281626 -76955
18066A75689d3356B58928e30n7172m00250a24883L060F9252R2971i5390A5253
$$ 175689 -43356 258928 -530 -57702 -457952 -124883 -121823 69252 162223 -95390 15253
18054b12232a8064m6198A23692i4215j23767A00614c72731e7309A01152f0610
$$ -212232 -18064 -64262 123692 -94215 -217982 100614 -372731 -57309 101152 -60610
18043E17496B46980A13503B6226b94783A22447k9342J15410d0779H7922a58207
$$ 517496 246980 113503 26226 -294783 122447 93105 208515 -40779 87922 -158207
18032A10382h4613A17350g0347B56917M9552r3838a83678q6537A9945O1248c4487
$$ 110382 -84613 117350 -70347 256917 306469 212631 -183678 -270215 19945 81193 -34487
18020f7724E4721P5503a89635h6606r8001j25429J25448g4081r9753A06221a40946
$$ -67724 54721 130224 -189635 -86606 -184607 -310036 -184588 -74081 -173834 106221 -140946
18008A10601N2616n6202B586K41275d320p8561j55149e5994B39268i6269d884
$$ 110601 163217 107015 2586 243861 -4320 -82881 -238030 -55994 239268 -96269 -4884
17996C06369a97467Q3085H0317a75171A27008E9980b1065o9893r7934C8384a14416
$$ 306369 -197467 -114382 80317 -175171 127008 59980 -21065 -90958 -188892 38384 -114416
17984C10439g4705A91058a48881A76857a01335H6782a413A32648a66878A8339
$$ 310439 -74705 191058 -148881 176857 -101335 86782 -1413 132648 -166878 18339
17973B14358F3814o549a70442C22302F397K56047a35834B75923C8099a25915A16998
$$ 214358 63814 57265 -170442 322302 6397 262444 -135834 275923 38099 -125915 116998
17961B03767b66687c6821A27138N8772m9135A1623c61656A89415f2502k38307
$$ 203767 -266687 -36821 127138 185910 136775 11623 -361656 189415 -62502 -300809
17951c00809d813A60735e3215A23080j5931e72537b28946H7322h5488A35850L850
$$ -300809 -4813 160735 -53215 123080 107149 -572537 -228946 87322 -85488 135850 139700
17940A39700d1372n5698J9350q5882A64834a02128K9511j90387A61524F0562M09290
$$ 139700 -41372 -97070 -77720 -163602 164834 -102128 -72617 -263004 161524 60562 469852
17929D69852b46081C59659a30224I8957b08923m1931A76397c9118B49524r8917
$$ 469852 -246081 359659 -130224 98957 -208923 -250854 176397 -39118 249524 150607
17919A50607Q7635G8679k1667p937b22171N906B8641c92563a85518h3695B2831
$$ 150607 238242 78679 57012 49075 -222171 -216265 28641 -392563 -185518 -83695 22831
17907a51090A99513r1075P8846r0089c399j25229A78304I541b22279A88486i6726
$$ -151090 199513 108438 187284 97195 -3399 -128628 178304 9541 -222279 188486 -96726
17895A57049N7987a612j79608B31352f070A55255a43241G6120j3190J57795N1461
$$ 157049 215036 -1612 -181220 231352 -6070 155255 -143241 76120 62930 220725 272186
17884B72186c8377B89361D370J3174c5649p2938j12066c2661B2752c2968j27562
$$ 272186 -38377 289361 4370 17544 -35649 -108587 -220653 -32661 22752 -32968 -160530
17873a60530H6515K66112A02604i5921B4823J55628d9196k44132B0509K29931
$$ -160530 86515 352627 102604 -95921 24823 180451 -49196 -293328 20509 250440
17863B50440a5676B73646J87790A32801M9883O5825b81556j14707H635M19761
$$ 250440 -15676 273646 461436 132801 182684 248509 -281556 -396263 8635 428396
17853D28396A66516F7131J79382E2659a39927m198A35877b78612c5455A90237
$$ 428396 166516 67131 246513 52659 -139927 -144125 135877 -278612 -35455 190237
17842c2653A49561o7734K49110b13605j9758A9312c15335h0656l1086m5056A28159
$$ -32653 149561 81827 330937 -213605 -233363 19312 -315335 -80656 -111742 -156798 128159
17830C27520d6091p1737F7837a75894m4990E125J08563g6303n647j5762F2425
$$ 327520 -46091 -117828 67837 -175894 -220884 5125 113688 -76303 -81950 -97712 62425
17818a1188k51322f7393E9574g3212A69786a25463q444C3388c18574A06203M3338
$$ -11188 -262510 -67393 59574 -73212 169786 -125463 -133907 33388 -318574 106203 149541
17807A49541j3486j5909K23780B8201P1356b14341C45357c73906a67268J2222
$$ 149541 136055 120146 343926 28201 99557 -214341 345357 -373906 -167268 -155046
17797a55046A18411R4635j00230b657B5914J60976a81392d9636A5579c746O48
$$ -155046 118411 213046 112816 -2657 25914 186890 -181392 -49636 15579 -3746 -3098
17786c098k61174C71224G5516J96441c44m7800C29795c2079J5507A52079L3518
$$ -3098 -264272 371224 75516 271957 -344 -48144 329795 -32079 -16572 152079 185597
17775A85597m1394a6041E8249J1728A3788h3955o8724a3038l95844g9198A74791
$$ 185597 144203 -16041 58249 69977 13788 -83955 -152679 -13038 -408882 -79198 174791
17763B75570R447F6465J31466H3459b8991A01J50675c3275C00956N4864d16090
$$ 275570 285017 66465 197931 83459 -28991 101 150776 -33275 300956 355820 -416090
17751A74158f9043A88287h8514A1416J84512a03832e0851B04009B5140M1924A1572
$$ 174158 -69043 188287 -88514 11416 195928 -103832 -50851 204009 25140 67064 11572
17739c4279j23046f5609m4981e3473A58933b11632B8067J76563I0580O5290M4559
$$ -34279 -157325 -65609 -110590 -53473 158933 -211632 28067 204630 90580 155870 200429
17728B00429g8994J248k44418a28788A20121a61543A56332E1778M0268J30350
$$ 200429 -78994 -77746 -322164 -128788 120121 -161543 156332 51778 92046 222396
17718B22396j10450J1930a4545F9976a03998J5379A74579J7690p4912b13737C77944
$$ 222396 111946 123876 -14545 69976 -103998 -88619 174579 192269 117357 -213737 377944
17706B52601k0259D0241e6185j45098B0923C030J68552p430f2679C59452g8009
$$ 252601 232342 40241 -56185 -201283 20923 3030 171582 164152 -62679 359452 -78009
17694B61789q5317J54505h5897B33397B2416a24293j42510D52255A48949a52640
$$ 261789 176472 330977 -85897 233397 22416 -124293 -266803 452255 148949 -152640
17683E0004O0368L08916J65007b3359p8120l6895c9489A65024K41402k3644b0595
$$ 50004 110372 419288 584295 -23359 -101479 -138374 -39489 165024 406426 382782 -20595
17671D75392f2970A50772p0507O227i6579B48698p2544n6236k9151C2994J46466
$$ 475392 -62970 150772 80265 86492 -96579 248698 176154 119918 90767 32994 179460
17660A79460f1367n0146r4616A52123k3164d0743A02896B3129L89486A49165J55165
$$ 179460 -61367 -111513 -206129 152123 128959 -40743 102896 23129 412615 149165 304330
17649C04330A34158a8554m7199J4364D25212A07696a11797B95427C6914K56108
$$ 304330 134158 -18554 -65753 -51389 425212 107696 -111797 295427 36914 293022
17639B93022A06929K79730A27536F3531J383J88659H0884a440H2713b0052j8035
$$ 293022 106929 386659 127536 63531 64914 253573 80884 -1440 82713 -20052 -38087
17628c8087k25346b6456D5880L49561j45621a41370h000A13532f3255A68844d6422
$$ -38087 -263433 -26456 45880 395441 249820 -141370 -8000 113532 -63255 168844 -46422
17616B30300D2532J80528K4816a81761A86873A2142N0046k0562K66820A8740Q2592
$$ 230300 42532 223060 247876 -181761 186873 12142 62188 41626 308446 18740 101332
17605A01332g8731B05894J87599e277C43058N6999a23227C30981g3213A44082
$$ 101332 -78731 205894 393493 -5277 343058 400057 -123227 330981 -73213 144082
17594A49639Q5628A14692L02997B2585J74070k2717J32007E4426A9912b6410B19638
$$ 149639 235267 114692 417689 22585 196655 173938 305945 54426 19912 -26410 219638
17582C23892F6927a70900g0114n0760B9326j0271O8645J62696e2839D03931p8700
$$ 323892 66927 -170900 -70114 -120874 29326 19055 87700 250396 -52839 403931 325231
17571C25231E9343M3514J20085B273M10973A92771a9708F6881J40143f7142B53258
$$ 325231 59343 102857 222942 2273 413246 192771 -19708 66881 207024 -67142 253258
17559C33247O3908j98508c13690A67681B6104K28190q2023f2980n3685b6392A78395
$$ 333247 397155 198647 -313690 167681 26104 254294 172271 -62980 -116665 -26392 178395
17547B28945A8333J57985E0374J85078a21527B39467j8931a80948B96381b4678
$$ 228945 18333 176318 50374 235452 -121527 239467 220536 -180948 296381 -24678
17536D00024R3282A46673P0036m5640O3037K85459H1490J11271n146e3803B95629
$$ 400024 493306 146673 216709 171069 234106 519565 81490 192761 187615 -53803 295629
17524D74668D047f8383D38299A88826N3518J17546j43750l4346R5347K9038j00411
$$ 474668 4047 -68383 438299 188826 242344 359890 216140 181794 277141 306179 205768
17513B05768J62079j58033Q8376N16030j5856K4408j53637P8533M8836k82256
$$ 205768 367847 209814 298190 814220 798364 822772 669135 747668 796504 514248
17503E14248Q9176B46668J62253A12533M75819r5299J72242j0678M5241j63905
$$ 514248 603424 246668 408921 112533 588352 493053 665295 654617 699858 535953
17493E35953O11454P1143l38163J33908m28399B90548J77518j38948j32969O592
$$ 535953 1147407 1218550 880387 1014295 585896 290548 468066 329118 196149 202741
17483B02741m4249M12158A57264J5316J73952A62735K97160j86096A3979L81868
$$ 202741 158492 570650 157264 172580 346532 162735 459895 273799 13979 395847
17473C95847A13272K8725K69967j11847m9563D8583J86100P4777j37432J08400
$$ 395847 113272 141997 411964 300117 250554 48583 234683 309460 172028 280428
17463B80428M1771R7994p7012A51338R1129J92699A80123J09674A19968J29208
$$ 280428 322199 420193 343181 151338 242467 435166 180123 289797 119968 249176
17453B49176J22702A39831J22384a68883d0216G2900L31170K3684Q5703J9640
$$ 249176 371878 139831 262215 -168883 -40216 72900 404070 427754 513457 533097
17443E33097B40156k4504m756m0691L3899a20767A62999N5620K16001D1102Q18816
$$ 533097 240156 215652 210896 170205 204104 -120767 162999 218619 434620 41102 859918
17432H59918C42622j12463j07157K00968A10085J07655J25880j13460m086P752
$$ 859918 342622 230159 123002 323970 110085 217740 343620 230160 226074 233826
17422B33826O3401J42932l4325K42426A74624K28798p1470r2993p3304K42107
$$ 233826 297227 440159 405834 648260 174624 403422 331952 238959 165655 407762
17412D07762E2790K54088J63897k29692j8862p9591L32543j49192n2843p8994
$$ 407762 52790 306878 470775 241083 222221 142630 475173 325981 273138 194144
17402A94144L63380B76553H6765M39406k31624M18423o7674k93592r9388j17679
$$ 194144 557524 276553 86765 526171 294547 712970 645296 351704 252316 134637
17392A34637J5890L2787J16429j11882k7641f047I8644q398K28357r0190k2101
$$ 134637 150527 183314 299743 187861 160220 -6047 98644 90246 318603 228413 206312
17381B06312J9145J94641j97075B3696L8324a22505B13360K4440C2590J35825
$$ 206312 225457 420098 223023 23696 62020 -122505 213360 237800 32590 168415
17371A68415J76051a31223H3690L81844j37741O4269A15536J88127I4829K09171
$$ 168415 344466 -131223 83690 465534 327793 392062 115536 303663 94829 304000
17361C04000G2032K63338E9290a5673D8054c431E45430e4543B04840H8393L35636
$$ 304000 72032 335370 59290 -15673 48054 -3431 545430 -54543 204840 88393 424029
17350D24029j11918A45853L30568k14821a95639B47922J8611j9481g585A33950
$$ 424029 312111 145853 476421 261600 -195639 247922 266533 247052 -7585 133950
17339A09199K78794R7366j8971l8171K3232j76304M7186m2299M134A29616j1283
$$ 109199 387993 485359 466388 428217 451449 275145 322331 280032 284166 129616 118333
17328A18333J20048J92985j63621J84440r4516a45695p1076C58943o7098b63165
$$ 118333 238381 431366 267745 452185 357669 -145695 -216771 358943 291845 -263165
17317B14404D4073L65641H1503J25020D9234J70314F9069K24630H8122K02631
$$ 214404 44073 409714 81503 206523 49234 219548 69069 293699 88122 290753
17307B90753n7204K20500A97944H9679J95095K90123j58266p3678A52139p2453
$$ 290753 233549 454049 197944 89679 284774 574897 416631 342953 152139 79686
17297G9686K72331r5468H7762K05242C887K48604a06966A94981p2773c1250D34239
$$ 79686 352017 256549 87762 293004 3887 252491 -106966 194981 122208 -31250 434239
17285C44363J81913p3490d6467B53504I913J54301L75896j40070P3088j7648F5219
$$ 344363 526276 452786 -46467 253504 9913 164214 540110 400040 473128 455480 65219
17273E33098j54346J18326N7181B65434F8149K24967m8748A3360L46653P3576
$$ 533098 378752 497078 554259 265434 68149 293116 244368 13360 360013 433589
17263D33589A99799M17800k41556A84001M25721C8188L29272J44448A10090J13273
$$ 433589 199799 617599 376043 184001 609722 38188 367460 511908 110090 223363
17253B23363K02323j89839l4024L25200Q7003k65128A01576M74303B808J43375
$$ 223363 425686 235847 201823 527023 614026 348898 101576 575879 2808 146183
17243A46183J83609q671M9037j84894J23513j9396J07379o0373j31688O2687J84786
$$ 146183 329792 321121 370158 185264 308777 289381 396760 336387 204699 267386 452172
17232D52172A05012K65520m0317K8773A30768N01278B43897E1658M19591D5626
$$ 452172 105012 370532 330215 358988 130768 632046 243897 51658 471249 45626
17221G99N97163k50023L44948j96932L4376N9668j46826n7269j68418Q5056K10422
$$ 799 597962 347939 692887 495955 530331 589999 443173 385904 217486 302542 512964
17210E12964j61495q685M3179A43970J03481J58973A96759J28142K27257n3241
$$ 512964 351469 342784 385963 143970 247451 406424 196759 324901 552158 498917
17200D98917B19823K81023q1951j55710M1584R7701N51825l40304n3698j74619
$$ 498917 219823 500846 418895 263185 304769 402470 954295 613991 560293 385674
17190C85674J94043A80351L72229j49496O6373k25561A9437M81146j99036K38921
$$ 385674 579717 180351 552580 403084 469457 243896 19437 500583 301547 540468
17180E40468J60R4363r2379H440K50546J84755m4961n831A4262K41016K90131
$$ 540468 540628 634991 542612 8440 258986 443741 398780 392949 14262 255278 545409
17169E45409k46714l7122J42629P1981J48126j75134K40493B62417O81J43618
$$ 545409 298695 261573 404202 476183 624309 449175 689668 262417 263098 406716
17159D06716J0252J68386j22746n5488L16034l30332A91142L14645M8971n6671
$$ 406716 416968 585354 462608 407120 723154 392822 191142 505787 554758 498087
17149D98087J64520j76081K16802r099j41735J96495j15303O6447l37761J88069
$$ 498087 662607 486526 703328 694229 552494 748989 633686 700133 362372 550441
17139E50441r8474J13877j80415N6736o7044N0789j61315L1029M67556C67556
$$ 550441 451967 565844 385429 442165 375121 425910 264595 295624 763180 367556
17128I12560C85177K89997J62129B73493M57611k83785O604M5153j95374L26880
$$ 912560 385177 675174 837303 273493 731104 447319 453923 499076 303702 630582
17118F30582O4629C21104j6255L13345N769K98555m48147J30787J66553l48212
$$ 630582 695211 321104 304849 618194 623963 922518 474371 605158 771711 423499
17108D23499L64888m8302j76069j18466j42154K55311j0391k55712Q5294Q7446
$$ 423499 788387 740085 564016 445550 303396 558707 548316 292604 377898 465344
17098D65344L9342J27779r2516L41186C21836O83798D55776j47179J83283K91887
$$ 465344 504686 632465 539949 881135 321836 1005634 455776 308597 491880 783767
17088G83767j28983k95638L14767n6972k16530J03046j52594K15791m826r9614
$$ 783767 654784 359146 673913 616941 400411 503457 350863 566654 561828 462214
17078D62214K72953o727Q5094j58540k35618L81507k30308k23624K65700K09423
$$ 462214 735167 728440 813534 654994 419376 800883 570575 346951 612651 822074
17068H22074J48437C37810L91869j17002K17541k49408M9116Q1267j16525K86511
$$ 822074 970511 337810 729679 612677 830218 580810 629926 711193 594668 881179
17058H81179j40032o8131m4294K42061k80951J69864L07430D52950K88072J01166
$$ 881179 741147 673016 628722 870783 589832 759696 1067126 452950 741022 842188
17048H42188r5633j17356L62633l52040J73011J53818M4097k70488O9670J56646
$$ 842188 746555 629199 991832 639792 812803 966621 1010718 740230 809900 966546
17038I66546j80878J40843j05152k70297J08945P02388n91838O0184p5635l5360
$$ 966546 785668 926511 821359 551062 660007 1362395 770557 830741 755106 719746
17028G19746J54861M7320J60716k63407j58902N47764m08743k03382K42573J06379
$$ 719746 874607 921927 1082643 819236 660334 1208098 799355 595973 838546 944925
17018I44925j47801k339J46426k422J90582j58051K52645l68712j15491K66389
$$ 944925 797124 794785 941211 938789 1129371 971320 1223965 855253 739762 1006151
17008A006151p4194Q4309k33182K09943Q7353j63209J13533J01095l1632j65628
$$ 1006151 931957 1016266 783084 993027 1080380 917171 1030704 1131799 1100167 934539
16998I34539J19650N8679L5903K12574q9055n19433K8381K02836n6900J01033
$$ 934539 1054189 1112868 1148771 1361345 1272290 752857 781238 984074 927174 1028207
16988A028207K7977K73231j31487o818j44680K8346q0652M44375k96604L06942
$$ 1028207 1056184 1329415 1197928 1191110 1046430 1074776 994124 1438499 1141895 1448837
16978A448837k91564N8229J809K88505k87304J67270n13017J76022p7803K28816
$$ 1448837 1157273 1215502 1217311 1505816 1218512 1385782 872765 1048787 970984 1199800
16968A199800J64503j52943O9369j7635K06632J05754k4538j12145O6593L6765
$$ 1199800 1364303 1211360 1280729 1263094 1469726 1575480 1550942 1438797 1505390 1542155
16958A542155j5107j13532n5847K99157k8180k36269J90389J05790k5013k07297
$$ 1542155 1527048 1413516 1357669 1656826 1628646 1392377 1582766 1688556 1663543 1456246
16948A456246m1269J15821n4893j09078L15455M1859k07603J30994n2769K07824
$$ 1456246 1414977 1530798 1475905 1366827 1682282 1724141 1516538 1647532 1594763 1802587
16938A802587Q1188k96318N92276m34865J22870k29594K32302Q2942k62026O856
$$ 1802587 1883775 1587457 2179733 1744868 1867738 1638144 1870446 1953388 1691362 1698218
16928A698218L5973L40347m53340M17085m9098p4092J05530k20838K57071l8878
$$ 1698218 1734191 2074538 1621198 2038283 1989185 1915093 2020623 1799785 2056856 2017978
16918B017978j87662j1200K61305j72899O67410n50390L6215J11774J23982j12890
$$ 2017978 1830316 1819116 2080421 1907522 2574932 2024542 2060757 2172531 2296513 2183623
16908B183623j86204K25352k8688J02033J00421j85243N5147r9023M97400k85162
$$ 2183623 1997419 2222771 2194083 2296116 2396537 2211294 2266441 2167418 2664818 2379656
16898B379656k14909J86293p6755J29007N7137R8161j82286K54869o3578j49400
$$ 2379656 2164747 2351040 2274285 2403292 2460429 2558590 2376304 2631173 2567595 2418195
16888B418195N31384j65233k77259k2105M44693O1243j32751K88085k21119j12283
$$ 2418195 2949579 2784346 2507087 2484982 2929675 2990918 2858167 3146252 2925133 2812850
16878B812850P4777J27750j51029j43180N25085R1954o73667M40783k1652L66734
$$ 2812850 2887627 3015377 2864348 2721168 3246253 3338207 2664540 3105323 3083671 3450405
16868C450405l58127N12279l82329J34929L25847j42508o6676K49682O1858k73090
$$ 3450405 3092278 3604557 3222228 3357157 3683004 3540496 3473820 3723502 3785360 3512270
16858C512270K30355K26749k15183k3788J68796m4691L31343j30574K98428L04947
$$ 3512270 3742625 3969374 3754191 3730403 3899199 3854508 4185851 4055277 4353705 4658652
16848D658652n55904K15584j1100K03964J47962j25941J51286j08492L83914k7062
$$ 4658652 4102748 4318332 4307232 4511196 4659158 4533217 4684503 4576011 4959925 4932863
16838D932863J05974j27656J06342L33311P3763N5990k33381M49573L4264j73177
$$ 4932863 5038837 4911181 5017523 5350834 5424597 5480587 5247206 5696779 5731043 5557866
16828E557866M28426l4300K46238q9220N0801K00699J11900K70032j86503L02693
$$ 5557866 5986292 5951992 6198230 6109010 6159811 6360510 6472410 6742442 6555939 6858632
16818F858632j9842R5270J25975L33262k39995R6361N79176l45470M43841m4801
$$ 6858632 6838790 6934060 7060035 7393297 7153302 7249663 7828839 7483369 7927210 7882409
16808G882409M47789J74201J8083K69091P7259J47022N1251K96117K09430K73406
$$ 7882409 8330198 8504399 8522482 8791573 8868832 9015854 9067105 9363222 9572652 9846058
16798I846058K61029J29272J54126J51526N24392j88742L06187K23171M99142
$$ 9846058 10107087 10236359 10390485 10542011 11066403 10877661 11183848 11407019 11906161
16789A1906161M25235K02824L36806J37824L20789J52515K94952O68884O6333
$$ 11906161 12331396 12534220 12871026 13008850 13329639 13482154 13777106 14445990 14512323
16780A4512323M65331L43958L09504M32149K92106Q55383Q0255N96507M50380
$$ 14512323 14977654 15321612 15631116 16063265 16355371 17210754 17291009 17887516 18337896
16771A8337896N21112P42761M56576O53343N54202O37182P30627O99486M76352
$$ 18337896 18859008 19601769 20058345 20711688 21265890 21903072 22633699 23333185 23809537
16762B3809537R01743P51879P55172Q23957P53131R34444J147503J089721J170392
$$ 23809537 24711280 25463159 26218331 27042288 27795419 28729863 29877366 30967087 32137479
16753C2137479Q15864R74788J141860J441619J378824J388392J287242J672295
$$ 32137479 32953343 33928131 35069991 36511610 37890434 39278826 40566068 42238363
16745D2238363J735509J502509J599269J776648K055397J978330J859761K246295
$$ 42238363 43973872 45476381 47075650 48852298 50907695 52886025 54745786 56992081
16737E6992081K423779K125309K612690K542443K639262K761156K808941L313439
$$ 56992081 59415860 61541169 64153859 66696302 69335564 72096720 74905661 78219100
16729G8219100K833962L280880L161329L264326L507672L187616L437914L487338
$$ 78219100 81053062 84333942 87495271 90759597 94267269 97454885 100892799 104380137
16721A04380137L438499L558355K851362L319698K974388L069619K808526K070233
$$ 104380137 107818636 111376991 114228353 117548051 120522439 123592058 126400584 128470817
16713A28470817K451603J717168J539371O88694J100267J3018K32303n34593q59706
$$ 128470817 130922420 132639588 134178959 134867653 135967920 135980938 136213241 135678648 134818942
16704A34818942j576959j480403j777473k556186k243716k819168k987215l048958
$$ 134818942 133241983 131761580 129984107 127427921 125184205 122365037 119377822 116328864
16696A16328864l451149l196101l584038l280674l366774l555174l379000l280523
$$ 116328864 112877715 109681614 106097576 102816902 99450128 95894954 92515954 89235431
16688H9235431l466703l321549l019344l405861k617866k961046l042021k739243
$$ 89235431 85768728 82447179 79427835 76021974 73404108 70443062 67401041 64661798
16680F4661798k038759k689519k371541k214848k260848j946515k028819j789247
$$ 64661798 62623039 59933520 57561979 55347131 53086283 51139768 49110949 47321702
16672D7321702j982484j495548j932119j377951q89469j698779j133566j586728
$$ 47321702 45339218 43843670 41911551 40533600 39644131 37945352 36811786 35225058
16664C5225058j406734r41546j233813j135190n98269j308645n24914j314117
$$ 35225058 33818324 32876778 31642965 30507775 29909506 28600861 28075947 26761830
16656B6761830m85973j306758n46434r21781o63249k87876p65355q27295n72011
$$ 26761830 26275857 24969099 24422665 23500884 22837635 22549759 21784404 20957109 20385098
16647B0385098n60641o04084m34129n28877n15948k25926r31155k03961n5257
$$ 20385098 19824457 19220373 18786244 18257367 17741419 17515493 16584338 16380377 16325120
16638A6325120p13485l91684m77655k99376m28168j90084l04697q30342P3436
$$ 16325120 15611635 15219951 14742296 14442920 14014752 13824668 13519971 12689629 12763065
16629A2763065n24377k36688k50857j06169k89386l38931L46853o68661k73670
$$ 12763065 12238688 12002000 11751143 11644974 11355588 11016657 11363510 10694849 10421179
16620A0421179l79770l47058K30235j88828l48983j29264j09219k87275m82176
$$ 10421179 10041409 9694351 9924586 9735758 9386775 9257511 9148292 8861017 8378841
16611H378841k945K165k359m58638j41177j14382k79319j24705J39803l91198
$$ 8378841 8375896 8378061 8375702 7917064 7775887 7661505 7382186 7257481 7397284 7006086
16601G006086N6711k44254k40060K10084k79062r9768p9878j62695K04628j60844
$$ 7006086 7062797 6818543 6578483 6788567 6509505 6409737 6329859 6167164 6371792 6210948
16591F210948k07750n36186L38915j62249m5983l92856J39592p8679K63861n85306
$$ 6210948 6003198 5467012 5805927 5643678 5597695 5204839 5344431 5265752 5529613 4944307
16581D944307K68298j04746j6467k60002j95626j93737k1836r5011K68034l54198
$$ 4944307 5212605 5107859 5091392 4831390 4635764 4442027 4420191 4325180 4593214 4239016
16571D239016K28291l37479l044l05026K34349q6184J80812o5912j67910k21817
$$ 4239016 4467307 4129828 4126784 3821758 4056107 3969923 4150735 4084823 3916913 3695096
16561C695096l43826J92759r5247K41468k28283k8058j78328L3263L04650l94324
$$ 3695096 3351270 3544029 3448782 3690250 3461967 3433909 3255581 3288844 3593494 3199170
16551C199170K58846R9127l72328J87129j98017K04588j08219j7611j74004K83815
$$ 3199170 3458016 3557143 3184815 3371944 3173927 3378515 3270296 3252685 3078681 3362496
16541C362496r36429O13151k80963p9650L93118l26343K4373K00170l39210O8290
$$ 3362496 2426067 3039218 2758255 2678605 3071723 2745380 2769753 2969923 2630713 2699003
16531B699003k05739K02514j75510j29160Q4631p7982Q255j67437L75843j48962
$$ 2699003 2493264 2695778 2520268 2391108 2475739 2397757 2406012 2238575 2614418 2465456
16521B465456M5267j98925J27871p4323o1134L1791j38855J58363l25257j74929
$$ 2465456 2510723 2311798 2439669 2365346 2304212 2336003 2197148 2355511 2030254 1855325
16511A855325M08769K0176l0232r6622Q4297k05786l46515K12600N5740J23218
$$ 1855325 2264094 2284270 2254038 2157416 2241713 2035927 1689412 1902012 1957752 2080970
16501B080970p4002L1920j13153r9332J84192j33430r9243J1636l818J27708k77019
$$ 2080970 2006968 2038888 1925735 1826403 2010595 1877165 1777922 1789558 1785740 1913448 1636429
16490A636429J31558l9603J34586k36695K16271q9590m08959M83561l03598k22271
$$ 1636429 1767987 1728384 1862970 1626275 1842546 1752956 1343997 1827558 1523960 1301689
16480A301689O36861l65619o8756J61825j87913K48922j25089j21010k27952L01642
$$ 1301689 1938550 1572931 1504175 1666000 1478087 1727009 1601920 1480910 1252958 1554600
16470A554600m95863M94744k34096J86491j84765L62703j98051l28550M28953
$$ 1554600 1058737 1553481 1319385 1505876 1321111 1683814 1485763 1157213 1586166
16461A586166P838m3056k21095R3909j18462r3270Q8166n258O781J69475j9628
$$ 1586166 1594004 1550948 1329853 1423762 1305300 1212030 1300196 1294938 1301719 1471194 1451566
16450A451566m11074L4616L63002k33335K92133k00542n2078K42259m77251J67398
$$ 1451566 1040492 1075108 1438110 1204775 1496908 1296366 1244288 1486547 1009296 1176694
16440A176694L60077o75559l5336K79332L8333M0233Q0949k10205k55086L76602
$$ 1176694 1536771 861212 825876 1105208 1143541 1183774 1264723 1054518 799432 1176034
16430A176034K3518Q0764k82815L19452J198m18079J67959j11282J71636K63090
$$ 1176034 1199552 1280316 997501 1316953 1318151 900072 1068031 956749 1128385 1391475
16420A391475j11472l40939r5353J05594Q9154j60008l09229L08591k5611j3034
$$ 1391475 1280003 939064 843711 949305 1038459 878451 569222 877813 852202 839168
16410H39168M40613m63614K26284p2800P9074k88183O1335p7266L84130j53558
$$ 839168 1279781 816167 1042451 969651 1048725 760542 821877 744611 1128741 975183
16400I75183K29106k31548p7813J02918j51536j21182k66351P27499k83576j36449
$$ 975183 1204289 972741 894928 997846 846310 725128 458777 1186276 902700 766251
16390G66251K68434j96014j87733O67820l71385k19956L25307r6509p489m11925
$$ 766251 1034685 838671 650938 1318758 947373 727417 1052724 956215 948726 536801
16380E36801K55823j69108K15010p2494r1393M03126l06919r2352K87516L6463
$$ 536801 792624 623516 838526 766032 674639 1077765 770846 678494 966010 1002473
16370A002473k19654j41714K00214j84050K07312j89633K7272J03560q2690j7138
$$ 1002473 782819 641105 841319 657269 864581 674948 702220 805780 723090 705952
16360G05952J62742k03047L6977J97331j45819J86361k80983R130J82160P7911
$$ 705952 868694 665647 702624 899955 754136 940497 659514 668644 850804 928715
16350I28715j96665j37776B42517J77071k6927J4742P36914n08776J60863n0592
$$ 928715 732050 594274 242517 419588 392661 407403 1144317 635541 796404 745812
16340G45812j43899J36956j20146p8779J08400k99002L53508l2779j19322k23353
$$ 745812 601913 738869 618723 539944 648344 349342 702850 670071 550749 327396
16330C27396K10755J51557k15980J65884P9138j36487q2425L1554O3643q8489
$$ 327396 538151 689708 473728 639612 718750 582263 499838 531392 595035 506546
16320E06546Q2946J38187k96612N0468K23456j26516o0279j23558l8376L71466
$$ 506546 589492 727679 431067 481535 704991 578475 518196 394638 356262 727728
16310G27728B11828N73856k35417k31754L5885K99324p8102j46126n5976K54901
$$ 727728 211828 785684 550267 318513 354398 653722 575620 429494 373518 628419
16300F28419k06513J19472j13962K69748j72190B37707l8758J71506L85163A82737
$$ 628419 421906 541378 427416 697164 524974 237707 198949 370455 755618 182737
16289D17415M824A08099J27065L39326k55570J90572k06167L68398l0202k38350
$$ 417415 422239 108099 235164 574490 318920 509492 303325 671723 641521 403171
16279D03171A62063K55460n142J63436J16751l12574j5381D1427L73136L00193
$$ 403171 162063 417523 412381 575817 692568 379994 364613 41427 414563 714756
16269G14756k26213l6936r2638j00114J94485J65931k31202j24039L71944H7328
$$ 714756 488543 451607 358969 258855 453340 619271 388069 264030 635974 87328
16258B75627K69757j63794p018j0672J20387j22434J58080l6360Q5001j68870
$$ 275627 545384 381590 374572 363900 484287 361853 519933 483573 568574 399704
16248C99704q7682L18859C4121M17179o1222n9405O4835o7252K4049A75949K34551
$$ 399704 312022 630881 34121 451300 390078 330673 395508 328256 352305 175949 410500
16237D10500K28445B45966Q4080K1198j67205J39526A00966M01042j24646O7316
$$ 410500 638945 245966 330046 351244 184039 323565 100966 502008 377362 444678
16227D44678j76154J17513L1841j84989J74072j64227I0557K82927A64307J10813
$$ 444678 268524 386037 417878 232889 406961 242734 90557 373484 164307 275120
16217B75120p8771c4306E9721K11756O8562A69492Q6915L5332A43685J51347J15837
$$ 275120 196349 -34306 59721 271477 340039 169492 256407 291739 143685 295032 410869
16206D10869r9667H3700O12787B49003P4193A12003J53945J7705K1838A46962
$$ 410869 311202 83700 696487 249003 323196 112003 265948 283653 305491 146962
16195D39518j60918K74309k72946K6611j05401P707K19211j05511H4506R5571
$$ 439518 278600 552909 279963 306574 201173 208880 428091 322580 84506 180077
16185A80077k9468l3946i6294D87849j28229l0327c8523C95618j58380j3915M7370
$$ 180077 150609 116663 -96294 487849 359620 329293 -38523 395618 237238 223323 270693
16174B70693j02426m3707J14995J59225J05526k37531n5289O9312O4809j22330
$$ 270693 168267 124560 239555 398780 504306 266775 211486 280798 345607 223277
16164B23277K30638B06502J23407A46598b1260B60844n3540F5093J47601L7701
$$ 223277 453915 206502 329909 146598 -21260 260844 207304 65093 212694 250395
16154B50395q3689J96890A01433K34317L0678j11453n6627h3309B7267P1694J31571
$$ 250395 166706 363596 101433 335750 366428 254975 198348 -83309 27267 98961 230532
16143B30532E5611M73262B5093K01551J70431D8377a5902A02496m3294J87793
$$ 230532 55611 528873 25093 226644 397075 48377 -15902 102496 59202 246995
16133B46995r4991K08696A66429b2657q225C8969K7447b9596g806B32717F6159
$$ 246995 152004 360700 166429 -22657 -30882 38969 66416 -29596 -7806 232717 66159
16121D20074a94772G9531a7649m9194A41417J43855j03467R0528j08324F8243
$$ 420074 -194772 79531 -17649 -66843 141417 285272 181805 272333 164009 68243
16110B35731E9550i4040C67416h491B85571K201k7461b4181C9038K78947G2863
$$ 235731 59550 -94040 367416 -8491 285571 287772 260311 -24181 39038 317985 72863
16098E9386R5597J3944m7967n3558J47348d3298B56953H592K64806K7503r8361
$$ 59386 154983 168927 120960 67402 214750 -43298 256953 8592 273398 300901 202540
16087B02540J7343A05964D6532R9155d1222l9884E0470h9937C5882Q3323b00492
$$ 202540 219883 105964 46532 145687 -41222 -81106 50470 -89937 35882 119205 -200492
16075a8724A47357C5881j7146f7887A60416M0353B9663J92135a62291D22112a01353
$$ -18724 147357 35881 18735 -67887 160416 200769 29663 221798 -162291 422112 -101353
16063E4986K00968b33254R4201p816m1200D9199E481O1065K64838A19018b4001
$$ 54986 255954 -233254 -139053 -146869 -188069 49199 5481 66546 331384 119018 -24001
16051D0992i0276B47091C3385g5665A03888L8810b10148C19291p9724A08876O2937
$$ 40992 -90276 247091 33385 -75665 103888 142698 -210148 319291 239567 108876 171813
16040A71813h007C21591p0145a25285K2987A61430h2906A25807a4304B64060d4446
$$ 171813 -8007 321591 251446 -125285 -102298 161430 -82906 125807 -14304 264060 -44446
16028B63289a37944D7404M8802J1531i9818C13286A02113K31767A00634J30000
$$ 263289 -137944 47404 96206 107737 -99818 313286 102113 333880 100634 230634
16018B30634e917D36691A5658K12066o9374h259F2338J72995l2014a5957C6645
$$ 230634 -5917 436691 15658 227724 158350 -8259 62338 235333 203319 -15957 36645
16006I3672c51726A15561O2505J09686A02745J28815a62346C14425G8161L7515
$$ 93672 -351726 115561 178066 287752 102745 231560 -162346 314425 78161 115676
15996A15676c4025D59704F2499a09387k4539b271A82378i0304D0374K14829E2658
$$ 115676 -34025 459704 62499 -109387 -133926 -2271 182378 -90304 40374 255203 52658
15984e4586l20879a28764E0414b6711E7002j3764O2576a26472A53952B4773K51465
$$ -54586 -375465 -128764 50414 -26711 57002 43238 105814 -126472 153952 24773 276238
15973B76238j10657K96371M49753k40654M63623l77884K62878D29029A47344D2519
$$ 276238 165581 461952 911705 671051 1134674 756790 1019668 429029 147344 42519
15962H3329K64592g3381k62914B44429G1193J11205a54026A14899L123L4931b90263
$$ 83329 347921 -73381 -336295 244429 71193 182398 -154026 114899 118022 152953 -290263
15950A30178a22941A42198e1418p8234F756g927o1835c874k11681c2692j95280
$$ 130178 -122941 142198 -51418 -129652 6756 -7927 -69762 -3874 -215555 -32692 -227972
15939b27972A48308P0842A1205a11685K6476D3614b878A96188l5112J96847I3200
$$ -227972 148308 219150 11205 -111685 -85209 43614 -2878 196188 161076 357923 93200
15927i5904p7200K7360C1393Q1068n5772i5792j29544j2267L7584j06708R8583
$$ -95904 -173104 -145744 31393 112461 56689 -95792 -225336 -237603 -200019 -306727 -208144
15916b08144G6757J8100B547f2303A94641a18822k03775J10014A16884B3275K85584
$$ -208144 76757 94857 2547 -62303 194641 -118822 -322597 -212583 116884 23275 308859
15905C08859A2176J51487o6286a01107l59804b08472d9160C0900O0399P5431b11540
$$ 308859 12176 163663 97377 -101107 -460911 -208472 -49160 30900 91299 166730 -211540
15893I4000N8732d68383B93060a48096C5578b54274b9962n2237l1801R22B664
$$ 94000 152732 -468383 293060 -148096 35578 -254274 -29962 -82199 -114000 -113078 2664
15881h6790j20995O9412H5443k0687b85573h9387r1126C61333a96050K957I0042
$$ -86790 -207785 -138373 85443 64756 -285573 -89387 -180513 361333 -196050 -193093 90042
15869B6334a32548D18643a35960K1073C50967E0412L9076b33581a7246A78755
$$ 26334 -132548 418643 -135960 -114887 350967 50412 89488 -233581 -17246 178755
15858B6926J74774c43933J71238d2120E0007f3376A52940B5832b72785a21630
$$ 26926 201700 -343933 -172695 -42120 50007 -63376 152940 25832 -272785 -121630
15847a13718o3666B14588b35753q7946n3726a59427D4303p083a1649k14429A57608
$$ -113718 -177384 214588 -235753 -323699 -377425 -159427 44303 37220 -11649 -226078 157608
15835f2130k12174p3576H0403b09120a7109j08919H8027c38275J44922A11979
$$ -62130 -274304 -347880 80403 -209120 -17109 -126028 88027 -338275 -193353 111979
15824C97g5729J9750n5216p5202B73076j31163K30659A46343c8492A33043a00386
$$ 397 -75729 -55979 -111195 -186397 273076 141913 372572 146343 -38492 133043 -100386
15812b57158B28332c6651b05A63081a5100m9684j03477D8033e4490A75390c83240
$$ -257158 228332 -36651 -205 163081 -15100 -64784 -168261 48033 -54490 175390 -383240
15800B84900r0901J18325r1448A01851h2687A18424a12909m0325C7467L7256h2561
$$ 284900 193999 312324 220876 101851 -82687 118424 -112909 -153234 37467 74723 -82561
15788d3852j01278h194A0444L2663a26101j72147b9075E6774Q6028c83638J05282
$$ -43852 -145130 -8194 10444 43107 -126101 -298248 -29075 56774 142802 -383638 -278356
15777b78356C06788A45004n1519C4672n385N4941b56689b4015C0632a42174H1294
$$ -278356 306788 145004 93485 34672 29287 84228 -256689 -24015 30632 -142174 81294
15765h529m8598j12901A06665a76301A80495p273a94536P7736A62462a25953L8980
$$ -8529 -57127 -170028 106665 -176301 180495 173222 -194536 -116800 162462 -125953 -86973
15754h6973l08618A41749J43041a62344N7641G2065K11363a24464E3575b02677
$$ -86973 -395591 141749 284790 -162344 -104703 72065 283428 -124464 53575 -202677
15743a17696B24314p9562J00280J3095J83372I5517A6559a03394r6101c2750A44655
$$ -117696 224314 144752 245032 258127 441499 95517 16559 -103394 -199495 -32750 144655
15731A1951L55077c24489E712N5349a4046A4931J47701o7455d3575o0633k50377
$$ 11951 367028 -324489 5712 61061 -14046 14931 162632 95177 -43575 -104208 -354585
15720c54585c8687N720A36449B2165c6351r4477j34221D7850e5772j90252B46075
$$ -354585 -38687 -32967 136449 22165 -36351 -130828 -265049 47850 -55772 -246024 246075
15708a45942A37888D9995c2856A12354J94778b49676B101a41162j93885a30967
$$ -145942 137888 49995 -32856 112354 307132 -249676 2101 -141162 -335047 -130967
15697b41384H1285A7459c43354i0456C620c29468N7570J01340M0397m0653p9352
$$ -241384 81285 17459 -343354 -90456 3620 -329468 -271898 -170558 -130161 -170814 -250166
15686b50166H4347a02149j06147e9166g404r7069r2742B17176H908f8263L0599
$$ -250166 84347 -102149 -208296 -59166 -7404 -104473 -197215 217176 8908 -68263 -37664
15675c7664j08145B18171B0278Q6159b84651B7034b27008E2773b94536B16369
$$ -37664 -145809 218171 20278 106437 -284651 27034 -227008 52773 -294536 216369
15664f2086j50683A04413l01m0497J01175e0810g737B10950m4332a67843b227
$$ -62086 -212769 104413 104112 63615 164790 -50810 -7737 210950 166618 -167843 -2227
15652A73663C8559i9544c2894j75421A81399R1673A09025a69322d6501o1189B63030
$$ 173663 38559 -99544 -32894 -208315 181399 273072 109025 -169322 -46501 -107690 263030
15640c45171d8720G1861d4007o861j57787K7768h3528C60383K03250B6703N8543
$$ -345171 -48720 71861 -44007 -50868 -208655 -180887 -83528 360383 563633 26703 85246
15629H5246C0007b093E1283b88600M4205A57016D4812a4176j18127b9469C4415
$$ 85246 30007 -2093 51283 -288600 -244395 157016 44812 -14176 -132303 -29469 34415
15617B66478j02291g5504H4060b63868B43627b351p4147G0312c48241A89780H4873
$$ 266478 164187 -75504 84060 -263868 243627 -2351 -76498 70312 -348241 189780 84873
15605b42841I7603b34656B5644j0505b37768R1035f852n2199K1487j83904I9351
$$ -242841 97603 -234656 25644 15139 -237768 -146733 -6852 -59051 -37564 -221468 99351
15593e7301A49102F1055b44287B82693E9680a75183n4631j18048i4824r7478e489
$$ -57301 149102 61055 -244287 282693 59680 -175183 -229814 -347862 -94824 -192302 -5489
15581a13647A30888f2893k11656C5569J04452a38900B42742d1752j50662e310
$$ -113647 130888 -62893 -274549 35569 140021 -138900 242742 -41752 -192414 -5310
15570B06705b83744f3861K7700k59023a21258K0394a3642l3703j93764R7125A27476
$$ 206705 -283744 -63861 -36161 -295184 -121258 -100864 -13642 -47345 -241109 -143984 127476
15558A72885k4658B9357J95153J6196c36455a05197j12907I8432b39015A55569
$$ 172885 148227 29357 224510 240706 -336455 -105197 -218104 98432 -239015 155569
15547c6942D85595b15008p8708a41587H0898g7330B00339L75615d29366G6015
$$ -36942 485595 -215008 -293716 -141587 80898 -77330 200339 575954 -429366 76015
15536a69769I6334r353d9091B57002r7441b19092B72501A09099L5348K9524C9698
$$ -169769 96334 86981 -49091 257002 159561 -219092 272501 109099 144447 173971 39698
15524E6914b4688B81131L161A04422k1586C9593i4380d2377J7184F588L8845e1158
$$ 56914 -24688 281131 284292 104422 82836 39593 -94380 -42377 -25193 6588 45433 -51158
15511a94264B2891Q5047a48096c4716o2823L5470m5658o2624A23388E0967L73648
$$ -194264 22891 107938 -148096 -34716 -97539 -62069 -107727 -170351 123388 50967 424615
15500D24615j15285H9939J41638p9095O7937q3957b07432m4445B90466K4045D2824
$$ 424615 309330 89939 231577 152482 220419 136462 -207432 -251877 290466 314511 42824
15488E9403J53285m2916J99420b4713A09230K9912K7881k3239J80528e826D35342
$$ 59403 212688 169772 369192 -24713 109230 139142 167023 143784 324312 -5826 435342
15476b27809f505o4400B07787D0923A3429Q5717J19442q4531J69102B9709L17580
$$ -227809 -6505 -70905 207787 40923 13429 99146 218588 134057 303159 29709 347289
15465C47289b29897C86106b156A40228D0689J40464L92654B08851M44419l12580
$$ 347289 -229897 386106 -2156 140228 40689 181153 573807 208851 653270 340690
15455C40690K2300j78287K7508E263J43997b85309A13830K6646Q1509a57492A20276
$$ 340690 362990 184703 212211 5263 149260 -285309 113830 140476 221985 -157492 120276
15443a50275b6884j02380A09619J43153n1002D4968a40959C7913J1441J11471
$$ -150275 -26884 -129264 109619 252772 201770 44968 -140959 37913 49354 160825
15433A60825l6292M02132A09205P6242J84114F0585O03532j4594J94268j00103
$$ 160825 124533 526665 109205 185447 369561 60585 664117 649523 843791 743688
15423G43688j26363j14292l5733j53148L3579b35398A30401a09310K5819E0908
$$ 743688 617325 503033 467300 314152 347731 -235398 130401 -109310 -83491 50908
15412a40437r5304A58036J43273E6285B7083d6939K2554n4389K5642g302A17857
$$ -140437 -235741 158036 301309 56285 27083 -46939 -24385 -78774 -53132 -7302 117857
15400C22166H6518L4549a51067d2113D0078J4029A5520b51000j31570a60133b6353
$$ 322166 86518 121067 -151067 -42113 40078 54107 15520 -251000 -382570 -160133 -26353
15388c50366A3176K70901N9579D6247a02995A7952a83830A66662d2764j54305
$$ -350366 13176 284077 343656 46247 -102995 17952 -183830 166662 -42764 -197069
15378a97069g6758j43900J2037Q1346I847a96022H0281k135K21145g4611B0878
$$ -197069 -76758 -220658 -208621 -127275 9847 -196022 80281 78146 299291 -74611 20878
15366a72700N1619B12662B3548J9611J39926l5295K45254A12464J23259E0139
$$ -172700 -121081 212662 23548 43159 183085 147790 393044 112464 235723 50139
15355a00730C10204a36434A04077J89289a24271L8248B84198a42668A53473K33361
$$ -100730 310204 -136434 104077 293366 -124271 -86023 284198 -142668 153473 386834
15345C86834C0552c0975A79735l7118J20160h4235C5790a70419d5949C85959j31873
$$ 386834 30552 -30975 179735 142617 262777 -84235 35790 -170419 -45949 385959 254086
15334B54086a84253B21098A3503J4289K1061L44667j1448r1127n1031B2301K21760
$$ 254086 -184253 221098 13503 27792 48853 393520 382072 290945 239914 22301 244061
15323B44061A8157L7186c260B14999Q448c3852G3831J20293H5502b33326A29102
$$ 244061 18157 55343 -3260 214999 223447 -33852 73831 194124 85502 -233326 129102
15311B27666L1873o6514O8925H8215J56296j3872p2483K56879D3647M4437K11057
$$ 227666 259539 193025 261950 88215 244511 230639 158156 415035 43647 88084 299141
15300B99141d9269A16550P7516C189b17830E9331J23798N07368B25543a20857
$$ 299141 -49269 116550 194066 3189 -217830 59331 183129 690497 225543 -120857
15289A35443D3751a16521Q582B64635P125L8408j12627K78323A20889b09640L6806
$$ 135443 43751 -116521 -107939 264635 271760 310168 197541 475864 120889 -209640 -172834
15278a72834C15580j49039D5961J57731J75448c7572A56069m7916i4152j59625
$$ -172834 315580 166541 45961 203692 379140 -37572 156069 108153 -94152 -253777
15268b53777N6449e5674a7350I0920a7188j46411e5425A65070a91362B7541a5262
$$ -253777 -197328 -55674 -17350 90920 -17188 -163599 -55425 165070 -191362 27541 -15262
15256c37354c7887A34861J84813J7115q8753h6726A89276a36557K6826A67508
$$ -337354 -37887 134861 319674 336789 248036 -86726 189276 -136557 -109731 167508
15245b11506K6003A96175a39280F8622N009C6617b1273B15879G7060K16038j04148
$$ -211506 -185503 196175 -139280 68622 73631 36617 -21273 215879 77060 293098 188950
15234A88950C8449O1074L66962A17738K88771J72987Q92952l50102K13441J0690
$$ 188950 38449 99523 466485 117738 406509 579496 1472448 1122346 1335787 1346477
15224A346477m59600B77175J44934p3356J59814e7454B97276R114f1362A21338
$$ 1346477 886877 277175 422109 348753 508567 -57454 297276 306390 -61362 121338
15213B97587a26363K2802A43394a02768A32576R3694J68969a4876A69244a77774
$$ 297587 -126363 -103561 143394 -102768 132576 226270 395239 -14876 169244 -177774
15202D46419j42494a52820A16342J04689K4251o9074F5342J17840i1856q5966
$$ 446419 303925 -152820 116342 221031 245282 176208 65342 183182 -91856 -177822
15192a77822e9943B50295j03266l3483b62305a22887M9036A12156a31002F0465
$$ -177822 -59943 250295 147029 113546 -262305 -122887 -73851 112156 -131002 60465
15181h0747B263K14567K22391a66682A00024J64707b304A63807k5984C5297J4460
$$ -80747 2263 216830 439221 -166682 100024 264731 -2304 163807 137823 35297 49757
15170D9757R4845e9474k3992B0581J14407B4801N5276g886q4500j59064I6100
$$ 49757 144602 -59474 -83466 20581 134988 24801 80077 -7886 -92386 -251450 96100
15158h3322A90666L53113A8617g0857N665F4848o920i2963I2033A8128J71389
$$ -83322 190666 543779 18617 -70857 -65192 64848 57928 -92963 92033 18128 189517
15147A89517E2995A0449L13189G7842J13421A7427b05632b9850k47063C27427
$$ 189517 52995 10449 323638 77842 191263 17427 -205632 -29850 -276913 327427
15136a34264H8767B4284G877a21579d0467A44339c37865O8342D08220A51195A0276
$$ -134264 88767 24284 7877 -121579 -40467 144339 -337865 -269523 408220 151195 10276
15124A97028n6264n3494J6567C5363J76811J4149L7959B1801A35R430M80120i8228
$$ 197028 140764 87270 103837 35363 212174 226323 264282 21801 135 9565 489685 -98228
15111a38469A34805N0295r978R494L6843E4428M84724B05840L9261K39822A11903
$$ -138469 134805 185100 175122 184616 221459 54428 539152 205840 245101 484923 111903
15099D09781A53954J69206I8104R1674a0499A03402d4983A04306A5027O2460j3239
$$ 409781 153954 323160 98104 189778 -10499 103402 -44983 104306 15027 77487 64248
15088F4248b17073C35559j37084J91791A01414a6076C08232E0336J55327F1871
$$ 64248 -217073 335559 198475 390266 101414 -16076 308232 50336 205663 61871
15077A84021G4647c9654B18895b17622A98018F9612K54393I5750K51716D0666
$$ 184021 74647 -39654 218895 -217622 198018 69612 324005 95750 347466 40666
15066B6533L46803i6307B3389N847M92721B02776q3398P6932C692M30675j47247
$$ 26533 373336 -96307 23389 29236 521957 202776 119378 196310 3692 434367 287120
15055B87120a35223L6933B30965C9827q159J81824Q9782b8325A43337J39764P2853
$$ 287120 -135223 -98290 230965 39827 31668 213492 303274 -28325 143337 283101 355954
15044C55954D2886J97707o1966J7482P4481K41656J71762A91616O0726J17831
$$ 355954 42886 240593 178627 196109 270590 512246 684008 191616 252342 370173
15034C70173J79130o1563A14556L08655j5950A4706M51451J2207j36978j31798
$$ 370173 549303 487740 114556 423211 407261 14706 466157 478364 341386 209588
15024B09588L1150J14762D0082L60583Q1889C7791N75267j70105L63397k16766
$$ 209588 240738 355500 40082 400665 482554 37791 613058 442953 806350 589584
15014E89584k22441K33479j70659K95075B36195J31962K4453J19875p5424A35943
$$ 589584 367143 600622 429963 725038 236195 368157 392610 512485 437061 135943
15003D31618J65818j14140l4233j90477J45805m7622q0981n2552J56137o4215
$$ 431618 597436 483296 449063 258586 404391 356769 275788 223236 379373 315158
14993C15158K59368j54556A70080O5224J66384L1464J92136C05784L10232K0242
$$ 315158 574526 419970 170080 235304 401688 433152 625288 305784 616016 636258
14983F36258k22777A25889M67909j92513m5350p7264K71292K2983l1463J64576
$$ 636258 413481 125889 593798 401285 355935 278671 549963 572946 541483 706059
14973G06059B02227J80444J77862n9746p3576B03441N86702k19747L02864J30196
$$ 706059 202227 382671 560533 500787 427211 203441 790143 570396 873260 1003456
14963A003456D80150P9017j87634J71337q4507l4104K0420O4566k04060P9822
$$ 1003456 480150 559167 371533 542870 458363 424259 444679 509245 305185 385007
14953C85007K16788J01235J21399C17308K20914k4382r4437j38360l2124Q6417
$$ 385007 601795 703030 824429 317308 538222 513840 419403 281043 248919 335336
14943C35336L6110j81065J76652j21584F5006J04744J21596j1014l2668K64768
$$ 335336 371446 190381 367033 245449 65006 169750 291346 280332 247664 512432
14933E12432k54171J6268O0205J78737L5555F5460P11311j89069j37982k2385
$$ 512432 258261 274529 334734 513471 549026 65460 776771 587702 449720 427335
14923D27335M46890J18802m46679J66727j21522j91618K43288K11097L7140J38234
$$ 427335 874225 993027 546348 713075 591553 399935 643223 854320 891460 1029694
14913A029694l6904L39257j21150K99005M0804q0243r6215L10381o6199l5888
$$ 1029694 992790 1332047 1210897 1509902 1550706 1470463 1374248 1684629 1618430 1582542
14903A582542J17460J56759N14401m79967l5267l70285j96591j42259k87668J92173
$$ 1582542 1700002 1856761 2371162 1891195 1855928 1485643 1289052 1146793 859125 1051298
14893A051298N5004l09935j59821L00429m48687J9170j02871L15948A84027K03881
$$ 1051298 1106302 796367 636546 936975 488288 507458 404587 720535 184027 387908
14883C87908P2866j0841n2201r5331J84637j21321L68441k56406j68083J89093
$$ 387908 460774 449933 397732 302401 487038 365717 734158 477752 309669 498762
14873D98762r8181L8230L15033L5934K7733l84812R5547R4697J56599j7051n1362
$$ 498762 400581 438811 753844 789778 817511 432699 528246 622943 779542 762491 711129
14862G11129K8553o2016P2621L3937l89995L99475j11476k90854J55529J49806
$$ 711129 739682 677666 750287 784224 394229 793704 682228 391374 546903 696709
14852F96709m6995L82363m26511J40759j27566M9473Q6869k43147j22902m8739
$$ 696709 649714 1032077 605566 746325 618759 668232 755101 511954 389052 340313
14842C40313M02256k52444n1674O9613j98846R1493A73581J42039J12564L88117
$$ 340313 742569 490125 438451 508064 309218 400711 173581 315620 428184 816301
14832H16301m05514J53571j03428K65625Q4880M8525j23794K65916J64323J84119
$$ 816301 410787 564358 460930 726555 811435 859960 736166 1002082 1166405 1350524
14822A350524l11595p8378K36390l05601o7914Q4326D32496Q9695J96673l9539
$$ 1350524 1038929 960551 1196941 891340 823426 907752 432496 522191 718864 679325
14812F79325J9703K43131m17872k48429L06240K83651m10802J80156n3746Q3709
$$ 679325 699028 942159 524287 275858 582098 865749 454947 635103 581357 665066
14802F65066L02129m38662j31474M20485j8808j27056O9282L90616j98734p0676
$$ 665066 967195 528533 397059 817544 798736 671680 740962 1131578 932844 862168
14792H62168J66438D18364O80312m05896K02627l0426J08412r043j31712k14994
$$ 862168 1028606 418364 1098676 692780 895407 864981 973393 964350 832638 617644
14782F17644n7697J53162j46217J21464k02899m9901J22565J1400k02061K79525
$$ 617644 559947 713109 566892 688356 485457 435556 558121 569521 367460 646985
14772F46985m2176P9065J04056Q5189Q687l98807L05868k88038J09600L00007
$$ 646985 604809 683874 787930 873119 881806 482999 788867 500829 610429 910436
14762I10436l92158K81191j94134l1881J79090K71347j42447j11016L96877l87281
$$ 910436 518278 799469 605335 573454 752544 1023891 881444 770428 1167305 780024
14752G80024j59071K29337l5085J10040k29098K10420j23294k29572A67516O64149
$$ 780024 620953 850290 815205 925245 696147 906567 783273 553701 167516 831665
14742H31665l22973K06007R9305k76733L9419M80167l75137N2110l00431J61156
$$ 831665 508692 714699 814004 537271 576690 1056857 681720 733830 433399 594555
14732E94555j78010L42156j26374J8239P9303K2439J41109j19753L71884l91325
$$ 594555 416545 758701 632327 650566 729869 752308 893417 773664 1145548 754223
14722G54223J10386N0669j69732L4616J45145k23598N66227r4029k44338N9929
$$ 754223 864609 915278 745546 780162 925307 701709 1267936 1173907 929569 989498
14712I89498M56421j9492k54394M87064L27167j66308j95485k27049k34772j78654
$$ 989498 1445919 1426427 1172033 1659097 1986264 1819956 1624471 1397422 1162650 983996
14702I83996r2951J50283j9640k33670K74398k43070J14558J13567r7354K38823
$$ 983996 891045 1041328 1021688 788018 1062416 819346 933904 1047471 950117 1188940
14692A188940k019r4416J41696l27451R7487K57515P3727L08599j29707P6904
$$ 1188940 1186921 1092505 1234201 906750 1004237 1261752 1335479 1644078 1514371 1591275
14682A591275J46013o96758K21520Q4090N4022k99712J22633E92312J93941K55086
$$ 1591275 1737288 1040530 1262050 1346140 1400162 1100450 1223083 592312 786253 1041339
14672A041339k12108j66555L56873j73771P2662M50602o07669K89946Q5568j97106
$$ 1041339 829231 662676 1019549 845778 918440 1369042 761373 1051319 1136887 939781
14662I39781L41566k34496J33990l93680J83373L73658j72201k28778K81870j12433
$$ 939781 1281347 1046851 1180841 787161 970534 1344192 1171991 943213 1225083 1112650
14652A112650J13584m61292L86192j01355j18373K48117k3335m19159K35564Q3947
$$ 1112650 1226234 764942 1151134 1049779 931406 1179523 1156188 737029 972593 1056540
14642A056540J10588o7135k18823J63495K03573N8679R3605M5424k09155j21392
$$ 1056540 1167128 1099993 881170 1044665 1248238 1306917 1400522 1445946 1236791 1115399
14632A115399K14468j04671P7203j04974J22570J42516N1452o02941L99897k95257
$$ 1115399 1329867 1225196 1302399 1197425 1319995 1462511 1513963 911022 1310919 1015662
14622A015662N46345K12042k70904m03903Q2324J72856M1916N2291Q76M2172J26945
$$ 1015662 1562007 1774049 1503145 1099242 1181566 1354422 1396338 1448629 1449505 1491677 1618622
14611A618622Q2258m14418R1640m01729Q49415l49161k64054O2319J16157K9086
$$ 1618622 1700880 1286462 1378102 976373 1825788 1476627 1212573 1274892 1391049 1420135
14601A420135J71084j97143j37247N55311p8937l1264l28278J60706J26357l11669
$$ 1420135 1591219 1394076 1256829 1812140 1733203 1701939 1373661 1534367 1660724 1349055
14591A349055L48765r809K8227L7557j12266n110K458J74623J41078k4736k53511
$$ 1349055 1697820 1688011 1716238 1753795 1641529 1636419 1638877 1813500 1954578 1929842 1676331
14580A676331N241K04773J31436l2448j93608M90414k88067j68739j39233R1423
$$ 1676331 1681572 1886345 2017781 1985333 1791725 2282139 1994072 1825333 1686100 1777523
14570A777523O5925J63330K02853k2132l07848J06739M23469k43658N942j00558
$$ 1777523 1843448 2006778 2209631 2187499 1879651 1986390 2409859 2166201 2172143 2071585
14560B071585J39222J71866l2574k10799J78339J05094n8919K43721k32271K55566
$$ 2071585 2210807 2382673 2350099 2139300 2317639 2422733 2363814 2607535 2375264 2630830
14550B630830J44618k82458Q9310K46316O1580K0909j04328J12199K12826O98497
$$ 2630830 2775448 2492990 2582300 2828616 2890196 2911105 2806777 2918976 3131802 3830299
14540C830299O0773R3632M57562P62274R26265J770339J972894M206008P016311
$$ 3830299 3891072 3984704 4442266 5204540 6130805 7901144 9874038 14080046 21096357
14531B1096357J0312570n21130j2057437o881756l259790k674814r71713K63842
$$ 21096357 31408927 30887797 18830360 11948604 8688814 6014000 5042287 5306129
14523E306129m69458q94059q25912k74314j72922j79825j7739O3909J28221o13251
$$ 5306129 4836671 3942612 3116700 2842386 2669464 2489639 2471900 2535809 2664030 2050779
14513B050779k2177M12505K24453m70717P14116l30505L2017k49155J83528K12161
$$ 2050779 2028602 2441107 2665560 2194843 2908959 2578454 2610471 2361316 2544844 2757005
14503B757005k00714K26454q0899L6987r7893K21785O1344o7271L53703l50611
$$ 2757005 2556291 2782745 2701846 2738833 2640940 2862725 2924069 2856798 3210501 2859890
14493B859890K35868j59432J30706R7985j05416K31501j06446j53272J96001K22505
$$ 2859890 3095758 2936326 3067032 3165017 3059601 3291102 3184656 3031384 3227385 3449890
14483C449890j34288j53084L16947j20893j06944M57413j07429J36308o87406
$$ 3449890 3315602 3162518 3479465 3358572 3251628 3709041 3601612 3737920 3050514
14474C050514M89408P3233K48720q3761l2592L13203o1967k78059K38125j97074
$$ 3050514 3539922 3613155 3861875 3778114 3745522 4058725 3996758 3718699 3956824 3759750
14464C759750l0998N99475j16329r4535J88890k0603P9919J82497r5332L81959
$$ 3759750 3728752 4328227 4211898 4117363 4306253 4285650 4365569 4548066 4452734 4834693
14454D834693j74024J50639l7717j60013k37303J96044K34719J51522L3562K02264
$$ 4834693 4660669 4811308 4773591 4613578 4376275 4572319 4807038 4958560 4992122 5194386
14444E194386k25289K72437l11802M80908l36492J81495J48271k08090K48279
$$ 5194386 4969097 5241534 4929732 5410640 5074148 5255643 5403914 5195824 5444103
14435E444103M67840j23400M9545O4552j7844K37351k34256N47465l63748J02779
$$ 5444103 5911943 5788543 5838088 5902640 5884796 6122147 5887891 6435356 6071608 6174387
14425F174387j03405J2107O36992k43927L71498j88569J92756K13454j47873K96084
$$ 6174387 6070982 6083089 6720081 6476154 6847652 6659083 6851839 7065293 6917420 7213504
14415G213504k7922K46679L48911n13907M64742O414k79000P10013o1565J25867
$$ 7213504 7185582 7432261 7781172 7267265 7732007 7738421 7459421 8169434 8107869 8233736
14405H233736N45017J38548l160J94314L48235k82724K49321q3632O8085n695
$$ 8233736 8778753 8917301 8914141 9108455 9456690 9173966 9423287 9339655 9407740 9402045
14395I402045J78493J95800K8534K47396N7035J90243M61749J51245J85627J92131
$$ 9402045 9580538 9776338 9804872 10052268 10109303 10299546 10761295 10912540 11098167 11290298
14385A1290298O4288J40069k50986O13895J99322J18198j87321K9625P35119L82814
$$ 11290298 11354586 11494655 11243669 11857564 12056886 12175084 11987763 12017388 12752507 13135321
14375A3135321l30600N23127L31618R7173J94358j13349O10135K18266M29478
$$ 13135321 12804721 13327848 13659466 13756639 13950997 13837648 14447783 14666049 15095527
14366A5095527J14936L53952K18867O04370n306K65435K80201K94346Q11183O1942
$$ 15095527 15210463 15564415 15783282 16387652 16382346 16647781 16927982 17222328 18033511 18095453
14356A8095453L18521N53857K23711L96375M26647L39548R29123K50285L62985
$$ 18095453 18413974 18967831 19191542 19587917 20014564 20354112 21283235 21533520 21896505
14347B1896505M55222M45156M01947L24332O89951M84858L63698P08830P04794
$$ 21896505 22351727 22796883 23198830 23523162 24213113 24697971 25061669 25770499 26475293
14338B6475293O94575N74222O12731P29450N87531P74787J019566L61815R88539
$$ 26475293 27169868 27744090 28356821 29086271 29673802 30448589 31468155 31829970 32818509
14329C2818509P94898J340577R13969O66271J268142R99412J382875J308929O30411
$$ 32818509 33613407 34953984 35867953 36534224 37802366 38801778 40184653 41493582 42123993
14320D2123993J288721J495599J176096J696186J366532J522769J522398K150300
$$ 42123993 43412714 44908313 46084409 47780595 49147127 50669896 52192294 54342594
14312E4342594J202804J928346K251334K131049J784734K402201K327833K744298
$$ 54342594 55545398 57473744 59725078 61856127 63640861 66043062 68370895 71115193
14304G1115193K805658K501066L208926K777897L334108L184777L506815L820746
$$ 71115193 73920851 76421917 79630843 82408740 85742848 88927625 92434440 96255186
14296I6255186M283036L889554M517101M739152N199834N235339N727658N838215
$$ 96255186 100538222 104427776 108944877 113684029 118883863 124119202 129846860 135685075
14288A35685075O053886O774366P243006P099333Q021650Q170912Q899189R229453
$$ 135685075 141738961 148513327 155756333 162855666 170877316 179048228 187947417 197176870
14280A97176870R678510J0450968J0866794J1346402J1926751J2259679J3533302
$$ 197176870 206855380 217306348 228173142 239519544 251446295 263705974 277239276
14273B77239276J3389346J4596240J4535282J4373052J4275459J4545320J4244076
$$ 277239276 290628622 305224862 319760144 334133196 348408655 362953975 377198051
14266C77198051J3145964J2624564J2116014J0985168J0132253Q699663P979083
$$ 377198051 390344015 402968579 415084593 426069761 436202014 444901677 452880760
14259D52880760P076525M616224O55726K80145p34369l928385q045385n935698
$$ 452880760 459957285 464573509 465229235 465509380 464775011 460846626 452801241 446865543
14251D46865543n531388o816103j0114283j1476928j2818607j2698881j3777362
$$ 446865543 441334155 434518052 424403769 412926841 400108234 387409353 373631991
14244C73631991j4689787j3254006j3678220j4117190j3950467j3591008j3047922
$$ 373631991 358942204 345688198 332009978 317892788 303942321 290351313 277303391
14237B77303391j2802123j2610270j1820618j0917387j1048281j1229609j0436621
$$ 277303391 264501268 251890998 240070380 229152993 218104712 206875103 196438482
14230A96438482j0320820q596337q853783q087030p753985p047804o830949n964574
$$ 196438482 186117662 177521325 168667542 160580512 152826527 145778723 138947774 132983200
14222A32983200n589936n682718n362441n106718m413733m412469l471322m499936
$$ 132983200 127393264 121710546 116348105 111241387 106827654 102415185 98943863 94443927
14214I4443927l401432l522301l485996l142457k957358k814545k784502k315513
$$ 94443927 91042495 87520194 84034198 80891741 77934383 75119838 72335336 70019823
14206G0019823k367799j869918k348277k112660k143189j991353j569949j713343
$$ 70019823 67652024 65782106 63433829 61321169 59177980 57186627 55616678 53903335
14198E3903335j194707k026346j648627j610232j280199j052680j009976j203823
$$ 53903335 52708628 50682282 49033655 47423423 46143224 45090544 44080568 42876745
14190D2876745j255359j563745j047343j017933q00238p93180q05019j023463
$$ 42876745 41621386 40057641 39010298 37992365 37192127 36398947 35593928 34570465
14182C4570465r86987q11803o33781p68659q46454p11099q20228q56302n31973
$$ 34570465 33583478 32771675 32137894 31369235 30522781 29811682 28991454 28135152 27603179
14173B7603179p03332m97881n46891r81775l49141o19288m33959o68053k61537
$$ 27603179 26899847 26401966 25855075 24873300 24524159 23904871 23470912 22802859 22541322
14164B2541322o84576m6132r66497j15344l55424k43188n98412m21109n63834
$$ 22541322 21856746 21810614 20844117 20728773 20373349 20130161 19531749 19110640 18546806
14155A8546806k92835m17997j94618j43032n10184l84238j0052p30483Q650M8840
$$ 18546806 18253971 17835974 17641356 17498324 16988140 16603902 16593850 15863367 15872017 15920857
14145A5920857n37725m29546j32089k69963o16029j27638j37108k07909J89053
$$ 15920857 15383132 14953586 14821497 14551534 13935505 13807867 13670759 13462850 13651903
14136A3651903p22853R3482k42324n71015J5831j01246m16436k88644j29350K5920
$$ 13651903 12929050 13022532 12780208 12209193 12225024 12123778 11707342 11418698 11289348 11315268
14126A1315268j29418k50634J18321k79033n26362L73193j88451p5495l26799
$$ 11315268 11185850 10935216 11053537 10774504 10248142 10621335 10432884 10357389 10030590
14117A0030590R0545m04337j65018k98138L13445n40680j55552M18972k70896
$$ 10030590 10121135 9716798 9551780 9253642 9567087 9026407 8870855 9289827 9018931
14108I018931m04374q7404p6860j27308k65203J38154n23473K99064k02156K1680
$$ 9018931 8614557 8527153 8450293 8322985 8057782 8195936 7672463 7971527 7769371 7791051
14098G791051k51659j29839k41117J24124m02210K43028J31484k61112l29882
$$ 7791051 7539392 7409553 7168436 7292560 6890350 7133378 7264862 7003750 6673868
14089F673868L2472r3939m7322J52880n14412L27461j19975p0416m77013J37904
$$ 6673868 6706340 6612401 6565079 6717959 6203547 6531008 6411033 6340617 5863604 6001508
14079F001508l76476L69088J26791k02799j38107k32989K2776j69729O1366k13050
$$ 6001508 5625032 5994120 6120911 5918112 5780005 5547016 5569792 5400063 5461429 5248379
14069E248379J46096j48266M4600k22520L23437l49812n2708k49946L62547j11356
$$ 5248379 5394475 5246209 5290809 5068289 5391726 5041914 4989206 4739260 5101807 4990451
14059D990451k37071n1897J38195R2512l04390k05099J73833l24201K35012l53905
$$ 4990451 4753380 4701483 4839678 4932190 4627800 4422701 4596534 4272333 4507345 4153440
14049D153440M0046L01633m22483P70291l71150J23832j2751m06655j99941m9801
$$ 4153440 4193486 4495119 4072636 4842927 4471777 4595609 4582858 4176203 3976262 3926461
14039C926461L82616l66596Q9917J55919l59332k20193L81523j72853J65637j65306
$$ 3926461 4309077 3942481 4032398 4188317 3828985 3608792 3990315 3817462 3983099 3817793
14029C817793l9114q8552k23434L66799j23664k35812l41474m0241L08254m3042
$$ 3817793 3778679 3690127 3466693 3833492 3709828 3474016 3132542 3092301 3400555 3357513
14019C357513m8430o4847l95140N30452j25433L31302n7248l62061J98183n50924
$$ 3357513 3309083 3244236 2849096 3379548 3254115 3585417 3528169 3166108 3364291 2813367
14009B813367p1367L5058K03863k67212K80619k1566l09040k04628K05095M76480
$$ 2813367 2742000 2777058 2980921 2713709 2994328 2972762 2663722 2459094 2664189 3140669
13999C140669l41578l45811K33522j81476K06326k7863j58405j34814R1940J42396
$$ 3140669 2799091 2453280 2686802 2505326 2711652 2683789 2525384 2390570 2482510 2624906
13989B624906k85065M84451n86016J41398L44771J41825j36888l46752Q3604K90924
$$ 2624906 2339841 2824292 2238276 2379674 2724445 2866270 2729382 2382630 2466234 2757158
13979B757158l91027Q59803J87069J03557R98900J581625L598972N952382J0915515
$$ 2757158 2366131 3225934 3413003 3516560 4515460 6097085 9696057 15648439 26563954
13970B6563954N649344r569922p018875m039295l422882j450659j064501r62003
$$ 26563954 32213298 22643376 15624501 11585206 8162324 6711665 5647164 4685161
13962D685161m59644j99267m72596j9182l38126Q9160l59951n2953m4686o51039
$$ 4685161 4225517 4026250 3553654 3534472 3196346 3285506 2925555 2872602 2827916 2176877
13952B176877L62382n5835j06972j09960J79293K80369j99447p1649k76035j50118
$$ 2176877 2539259 2483424 2376452 2266492 2445785 2726154 2526707 2455058 2179023 2028905
13942B028905K22371J25204m14084L12360k87272K0224J39469j74102J65576l94127
$$ 2028905 2251276 2376480 1962396 2274756 1987484 2007708 2147177 1973075 2138651 1744524
13932A744524R2922K71212j65767k46813M92710k54221K00622m62544J21528n1349
$$ 1744524 1837446 2108658 1942891 1696078 2188788 1934567 2135189 1672645 1794173 1742824
13922A742824L2034P8471m3033J15342j01643r7106K11462m158j49688Q0562m23327
$$ 1742824 1774858 1853329 1810296 1925638 1823995 1726889 1938351 1934193 1784505 1865067 1441740
13911A441740M8747J75088L4650l2766l10665L21948j06666j0760K3800o5153
$$ 1441740 1490487 1665575 1700225 1667459 1356794 1678742 1572076 1561316 1585116 1519963
13901A519963m4811K49156l96074N08808o5746l00094o9005J82809k30758K61329
$$ 1519963 1475152 1724308 1328234 1837042 1771296 1471202 1402197 1585006 1354248 1615577
13891A615577j75216N2470L11269m59671n4131M89056l25956k33799L4768J51565
$$ 1615577 1440361 1492831 1804100 1344429 1290298 1779354 1453398 1219599 1254367 1405932
13881A405932M0914j005j69567L94288K5515j65945r7641J77695m42701M29300
$$ 1405932 1446846 1445841 1276274 1670562 1696077 1530132 1432491 1610186 1167485 1596785
13871A596785l10874K6243O9389k70702j28048j3949M28077k739j45262J14413
$$ 1596785 1285911 1312154 1381543 1110841 982793 968844 1396921 1394182 1248920 1363333
13861A363333l22517j11538K98326P8220K61543j28951m42014L61282r0237n4735
$$ 1363333 1040816 929278 1227604 1305824 1567367 1438416 996402 1357684 1267447 1212712
13851A212712q6839o3097O6354L13872k04870o5602k24958P2835L9125M40672
$$ 1212712 1125873 1062776 1129130 1443002 1238132 1172530 947572 1020407 1059532 1500204
13841A500204j21484n03665K32346n9124R7687k24766K10660L1658k38270J01920
$$ 1500204 1378720 875055 1107401 1048277 1145964 921198 1131858 1163516 925246 1027166
13831A027166k2864J22934K25958k44274j02392K8698R2196J59171k26412k071
$$ 1027166 1004302 1127236 1353194 1108920 1006528 1035226 1127422 1286593 1060181 1058110
13821A058110M4098j21639j38170J00207K7979M36864l81990m6734j54231J94870
$$ 1058110 1102208 980569 842399 942606 970585 1407449 1025459 978725 824494 1019364
13811A019364L4478l08566l7578K41155l7315j35930J01498K55694j15387k50477
$$ 1019364 1053842 745276 707698 948853 911538 775608 877106 1132800 1017413 766936
13801G66936J68781O9084k10008k9536K37775j89170k91237J21600L04435L3048
$$ 766936 935717 1004801 794793 765257 1003032 813862 522625 644225 948660 981708
13791I81708j67177k08728N33688k51525r3749J04961K34O1515k98087K04796
$$ 981708 814531 605803 1139491 887966 794217 899178 899412 960927 662840 867636
13781H67636k29611M18015k51317K59406m67218K00990K46714l05153k255j98317
$$ 867636 638025 1056040 804723 1064129 596911 797901 1044615 739462 737207 538890
13771E38890N10331j50004j34443O6929j39516Q1140q5181L946K70115j18115
$$ 538890 1049221 899217 764774 831703 692187 773327 688146 692092 962207 844092
13761H44092N6170P476q9750l20045M05486p0445P4657p7570J50813m34017J43640
$$ 844092 900262 907738 817988 497943 903429 832984 907641 830071 980884 546867 690507
13750F90507J468G056Q23305k70770J06741j441j47186K69397C48367L91184j65084
$$ 690507 691975 7056 830361 559591 666332 664891 517705 787102 348367 739551 574467
13739E74467J81839q171j95381J34597C41313L05444k54505K23727j92200K34396
$$ 574467 756306 748135 552754 687351 341313 646757 392252 615979 423779 658175
13729F58175M5900j37533o8598K44080M532J66759m36987J56900K0275J19923
$$ 658175 704075 566542 497944 742024 746556 913315 476328 633228 653503 773426
13719G73426j21563J45780K52557k86339k5377R626q2208L39281j24621J6243
$$ 773426 651863 797643 1050200 763861 738484 748110 665902 1005183 880562 896805
13709H96805k15428Q1814N1481B95814M1780L77627N0091J25013l37804K63242
$$ 896805 681377 763191 814672 295814 337594 715221 765312 890325 552521 815763
13699H15763J5225k05454j05398J77922k96040M60246j09161j15471p600j2598
$$ 815763 830988 625534 520136 698058 402018 862264 753103 637632 630032 617434
13689F17434K0482o8464J14900C04849L00389j72060k3455K42846j26840L27384
$$ 617434 637916 569452 684352 304849 605238 433178 409723 652569 525729 853113
13679H53113C75734K61135k43831j7673K30055j52146K0354n4532K3144M1539
$$ 853113 375734 636869 393038 375365 605420 453274 473628 419096 442240 483779
13669D83779J09586M8939J92120l98018J22450M6335m7731j7332k07924L39893
$$ 483779 593365 642304 834424 436406 558856 605191 557460 540128 332204 672097
13659F72097B52712K07611K32748B82586K37967m6174J2121j89153l8056J59683
$$ 672097 252712 460323 693071 282586 520553 474379 486500 297347 259291 418974
13649D18974J50896A78308K01815L7356K39834j06853Q6700k88695K02771j56570
$$ 418974 569870 178308 380123 417479 657313 550460 637160 348465 551236 394666
13639C94666K89213p9418B85321J11679J09743K6080I2348K56749Q3368A11779
$$ 394666 683879 604461 285321 397000 506743 532823 92348 349097 432465 111779
13628G16538C42087K81464P4777k99919j28361J20600A79539L36896H4003J79963
$$ 716538 342087 623551 698328 398409 270048 390648 179539 516435 84003 263966
13618B63966O560N1962J02929M331K44369B10688J91068p1269K71401L6676B62809
$$ 263966 270526 322488 425417 429748 674117 210688 401756 330487 601888 638564 262809
13606D95588j49996J5512J7034A63750J62030J45822p0189A62420J91367R4860
$$ 495588 345592 361104 378138 163750 325780 471602 401413 162420 353787 448647
13596D48647A44772K86273A40827L41226K55138k31481j26406j27023J44950o6952
$$ 448647 144772 431045 140827 482053 737191 505710 379304 252281 397231 330279
13586C30279p2817K47433n2701j62696j0668p0171K39369M3803K95832k62761
$$ 330279 257462 504895 452194 289498 278830 208659 448028 491831 787663 524902
13576E24902p8969O3096M2189k57036E4279N9665f1490A56502L41378M7309k21718
$$ 524902 445933 509029 551218 294182 54279 113944 -61490 156502 497880 545189 323471
13565C23471K15479j89002F0246J94511j19247o0420K23184J98227k48230J45665
$$ 323471 538950 349948 60246 254757 135510 75090 298274 496501 248271 393936
13555C93936j4180j21088l7618n6343K04795A14872J88402H0268N12502j25449
$$ 393936 379756 258668 221050 164707 369502 114872 303274 80268 592770 467321
13545D67321B2203d7142A58056J00415J40090A99124J49218Q1243H6380O0509
$$ 467321 22203 -47142 158056 258471 398561 199124 348342 429585 86380 146889
13535A46889J43063J22896R9280q5752D0638M22559J36361B30383J8486d5225
$$ 146889 289952 412848 512128 426376 40638 463197 599558 230383 248869 -45225
13524D6236M98517I0067i0907B87347L2522n953K4948K60805B58601K20099B10559
$$ 46236 544753 90067 -90907 287347 319869 313916 338864 599669 258601 478700 210559
13512A54303N0143K19877j22325j9693o2532K84277n669A34370M9079L00940B41890
$$ 154303 204446 424323 301998 282305 219773 504050 498381 134370 183449 484389 241890
13500d5830D57117A19914J8887L95526B49169J3785J4422E1429Q722M81146A74661
$$ -45830 457117 119914 138801 534327 249169 262954 277376 51429 60151 541297 174661
13488A43871K28775J03746j0021a0505B22742J23969M75837A52489k7204M20261
$$ 143871 372646 476392 466371 -10505 222742 346711 822548 152489 125285 545546
13478E45546k7851B56422J39040g898A91073H3152P4691l5915M11313A51816K64997
$$ 545546 517695 256422 395462 -7898 191073 83152 157843 121928 533241 151816 416813
13467D16813B4986J75168L7825P2267P270f7079B79082a579A93042J68010g0807
$$ 416813 24986 200154 237979 310246 317516 -67079 279082 -1579 193042 361052 -70807
13455C32645A12857J4473J7734J31295N0424A35261J68041R0866G3604K63757
$$ 332645 112857 127330 145064 276359 326783 135261 303302 394168 73604 337361
13445C37361L8088m4576n0593H0204J27482K58961A96682l2822E0375K92810O9557
$$ 337361 375449 330873 280280 80204 207686 466647 196682 163860 50375 343185 412742
13434D12742A68149L06976A61790J64653c8228D00385J31811B21133A01317e7981
$$ 412742 168149 475125 161790 326443 -38228 400385 532196 221133 101317 -57981
13423A44041N15232A93734P707B9040L9958Q5628b7360A04526J16694l0224n4225
$$ 144041 659273 193734 201441 29040 68998 154626 -27360 104526 221220 190996 136771
13412A36771K13321m5092q8427K33446k05887A15877J58491J08447A6214J32230
$$ 136771 350092 305000 216573 450019 244132 115877 274368 382815 16214 148444
13402A48444N017Q6552A0308M33242k15339A04330N3646K69015A39553J85218
$$ 148444 153461 240013 10308 443550 228211 104330 157976 426991 139553 324771
13392C24771E7356J13024K60687o1078N2957C8584J71161J13169K5672p8967l9194
$$ 324771 57356 170380 431067 369989 422946 38584 209745 322914 348586 269619 230425
13381B30425h8051A67513d546D95477J94919i9314B84178c3296A17785h8733A88634
$$ 230425 -88051 167513 -4546 495477 690396 -99314 284178 -33296 117785 -88733 188634
13369B89250I1918d5672A19982K31190a04293C1403J93784B2388L25908E085J13364
$$ 289250 91918 -45672 119982 351172 -104293 31403 225187 22388 348296 5085 118449
13358A18449K8475J65421e8898B82644q9429a8043F3296L63928B00830K42105
$$ 118449 146924 312345 -58898 282644 193215 -18043 63296 427224 200830 442935
13348D42935B08308J01091c216o4905A83848i9257k18498C58573J40824C451J35650
$$ 442935 208308 309399 -3216 -68121 183848 -99257 -317755 358573 499397 3451 139101
13337A39101Q9260J86276k02399K01931q4773j60999J75315j8115K95277B59476
$$ 139101 228361 414637 212238 414169 329396 168397 343712 325597 620874 259476
13326a20901D09732E0414J94746k429K00424k2004J32079j59954j34549Q230I4955
$$ -120901 409732 50414 245160 242731 443155 421151 553230 393276 258727 266957 94955
13314C25059r3065n3077b0180A30040L64788j03267A53454D9500A5342R9561J25927
$$ 325059 231994 178917 -20180 130040 494828 391561 153454 49500 15342 114903 240830
13303B40830Q6842A22767M7356L24748j29294j56940o7624J24948K1721M3132
$$ 240830 327672 122767 170123 494871 365577 208637 141013 265961 287682 330814
13293C30814p1074i1691A99792J01883p2349J48455A72282G4622M0763m5634L88990
$$ 330814 259740 -91691 199792 301675 229326 377781 172282 74622 115385 69751 458741
13282D58741A62236M8211l2654K33771A57873f0567B72660h7982A89096p6369
$$ 458741 162236 210447 177793 411564 157873 -60567 272660 -87982 189096 112727
13272A12727M01886j52472l5026a29283C80213j80825d170D1706O2286b06817
$$ 112727 514613 362141 327115 -129283 380213 199388 -4170 41706 103992 -206817
13261B11804J34116j6327A22662C8796K24943D4873J43229m2063A7288b7681A18963
$$ 211804 345920 329593 122662 38796 263739 44873 188102 146039 17288 -27681 118963
13249A6391h8239B09412F3005L2063A5066J08327L58029D6825K8056a88160A49277
$$ 16391 -88239 209412 63005 95068 15066 123393 481422 46825 74881 -188160 149277
13237B71936A03369O4044b75106A52519E0686K64618j44874M26882A0029b5261
$$ 271936 103369 167413 -275106 152519 50686 315304 170430 597312 10029 -25261
13226i1587c8125B70964a670A22072L02680b5976A72144h4575j50444C31175j43040
$$ -91587 -38125 270964 -1670 122072 424752 -25976 172144 -84575 -235019 331175 188135
13215A88135d7440l4536p6338G4511b1111D51846b18441G7924p102J07762q7524
$$ 188135 -47440 -81976 -158314 74511 -21111 451846 -218441 77924 70822 178584 91060
13204I1060J94462D4805c8349B51663G9093a63169g8100B18676n804I2105g7603
$$ 91060 285522 44805 -38349 251663 79093 -163169 -78100 218676 212872 92105 -77603
13192D89314a43545j43459A40064e8156K470A08251Q3103a54596G9032L34893
$$ 489314 -143545 -287004 140064 -58156 -55686 108251 191354 -154596 79032 413925
13182D13925F3248h0743E0004K99941j65682I1619N4363l7279G916J89653q7017
$$ 413925 63248 -80743 50004 349945 184263 91619 145982 108703 7916 197569 110552
13171A10552L11850a54516N6434b387j73762N9648A4729J97605C4913r627g3989
$$ 110552 422402 -154516 -98082 -2387 -176149 -116501 14729 212334 34913 25286 -73989
13159G9580C3527J63082b39420R2101B10743J11529e4454C35064A57582A8039
$$ 79580 33527 196609 -239420 -147319 210743 322272 -54454 335064 157582 18039
13148a8095k0818M740E4053n053K15869A07900m7983K8697j6422B8613K50878
$$ -18095 -38913 -34173 54053 49000 264869 107900 59917 88614 72192 28613 279491
13137B79491A7923a34350O1393D66767I1239d0115m2551B73459g1620j09742c5619
$$ 279491 17923 -134350 -72957 466767 91239 -40115 -82666 273459 -71620 -181362 -35619
13125a28628M5063E649P4433M5695b1520F9074b4154I9769f3589I4714K03586
$$ -128628 -83565 5649 80082 125777 -21520 69074 -24154 99769 -63589 94714 298300
13114B98300b05584D67422a8705A59688c55155B61524A12398E3455c9421j04767
$$ 298300 -205584 467422 -18705 159688 -355155 261524 112398 53455 -39421 -144188
13104a44188B71170C215O7958A6689a42522I2873C0707R5281D6138R0790b3228
$$ -144188 271170 3215 71173 16689 -142522 92873 30707 125988 46138 136928 -23228
13092A1784J10962Q343M8252O4098a64564D7456a31005B33515c3352C65481a03244
$$ 11784 122746 131089 179341 243439 -164564 47456 -131005 233515 -33352 365481 -103244
13080d4191k8511A67853c4590C4345b21473A83717B9815R4059d5338o9300A81559
$$ -44191 -72702 167853 -34590 34345 -221473 183717 29815 123874 -45338 -114638 181559
13068c12B87685n6629c8074L602B79444D0554P078N9849K9946R5904L2303K13713
$$ -312 287685 231056 -38074 -34472 279444 40554 47632 107481 137427 233331 265634 479347
13056D79347g2285A25199n322B7156J58115F0296M01929b06578a0671j19215G5952
$$ 479347 -72285 125199 119877 27156 185271 60296 462225 -206578 -10671 -129886 75952
13044a31536f967B33596a92790H9572R4067g9438D5791b12069Q6595E9202J42539
$$ -131536 -6967 233596 -192790 89572 183639 -79438 45791 -212069 -125474 59202 201741
13033B01741a6734q2283C47036h5632E799R1346g6636j30481B03703J87723F43
$$ 201741 -16734 -99017 347036 -85632 5799 97145 -76636 -207117 203703 391426 643
13021F2585J7966L78481k7682c16430J41267H0156O075f2726A79855m4704o4829
$$ 62585 80551 459032 431350 -316430 -175163 80156 86231 -62726 179855 135151 70322
13010G0322c7661j713A46034O6508D3034c9595B40464J8221l4044h4675A58980
$$ 70322 -37661 -39374 146034 212542 43034 -39595 240464 258685 224641 -84675 158980
12998A4723e8175A92990I095L56361j74769c4297B27076a72929d4482A95175J59533
$$ 14723 -58175 192990 9095 365456 190687 -34297 227076 -172929 -44482 195175 354708
12987C54708A77107a309C06613m9066A1825J81934a61808A0110J51090D305J54785
$$ 354708 177107 -1309 306613 257547 11825 193759 -161808 10110 161200 4305 159090
12976A59090p0289J92295c372G1903P3423K01596a72402b1596j25156q7287J4367
$$ 159090 88801 281096 -3372 71903 145326 346922 -172402 -21596 -146752 -234039 -219672
12965b19672M165b1359B08502J30619j61980a38884c5839k9640A57710a10708
$$ -219672 -215507 -21359 208502 339121 177141 -138884 -35839 -65479 157710 -110708
12954a29835C62249A01585l1908B9204J41759d6679a8306l21579B5670c3777B39897
$$ -129835 362249 101585 69677 29204 170963 -46679 -18306 -339885 25670 -33777 239897
12942b45021H9710J38036A2547a2018p5365C78313C472O9386g8679A02671b23037
$$ -245021 89710 227746 12547 -12018 -87383 378313 3472 72858 -78679 102671 -223037
12930a75998A20516N16908b95995R3695R5102A31426c54341a5223j44701M3666
$$ -175998 120516 637424 -295995 -202300 -107198 131426 -354341 -15223 -159924 -116258
12920a16258b0890o4999G0104g7633A8370J32294k8594D8302J2985c3576m7914
$$ -116258 -20890 -85889 70104 -77633 18370 150664 122070 48302 61287 -33576 -81490
12909h1490A88013J51412H4735f5993b4837k7054l28826G0079H209a01218G2374
$$ -81490 188013 339425 84735 -65993 -24837 -51891 -380717 70079 8209 -101218 72374
12897F4653L29304A62314N736F4346K19936a94487l4039A80350C1930e1238B22806
$$ 64653 393957 162314 168050 64346 284282 -194487 -228526 180350 31930 -51238 222806
12885c93973a48368C22550D5980B2006c8104k445q040a3209D02187j08885A13149
$$ -393973 -148368 322550 45980 22006 -38104 -40549 -48589 -13209 402187 293302 113149
12873E6950b80707i0397H336k396J15717K97780A14961c13953a05684G9215b2024
$$ 56950 -280707 -90397 8336 5940 121657 419437 114961 -313953 -105684 79215 -22024
12861A03475a3474r2791F383a68391A47344a42223B44001a77846M0834A20675
$$ 103475 -13474 -106265 6383 -168391 147344 -142223 244001 -177846 -137012 120675
12850c42846A20312L5327e1118j55288E2489a3278E2199K07852E4431e7410E8303
$$ -342846 120312 155639 -51118 -206406 52489 -13278 52199 260051 54431 -57410 58303
12838E2516K66173h4507C0307O8771L6541A0636K64954d9300C3076a61268q8345
$$ 52516 318689 -84507 30307 99078 135619 10636 275590 -49300 33076 -161268 -249613
12827b49613B181e2068A4364b89638d2243A78289h4269n6845e2109G9339k9145
$$ -249613 2181 -52068 14364 -289638 -42243 178289 -84269 -141114 -52109 79339 50194
12816E0194a86803A94048k9637O25J4876B6851a6154C76276g746C59405b00386
$$ 50194 -186803 194048 164411 165036 179912 26851 -16154 376276 -7746 359405 -200386
12804B15209c16771O8830A35834o0523J63082G7851d08018A12836b95065g4626
$$ 215209 -316771 -247941 135834 75311 238393 77851 -408018 112836 -295065 -74626
12793d0556A32104K931c82562a30590B12882b41486F3551d60070F7210L7768a64818
$$ -40556 132104 135035 -382562 -130590 212882 -241486 63551 -460070 67210 104978 -164818
12781a68241h1985B58528K9184a56560q5006f9386D8572J19492g390m3976j12698
$$ -168241 -81985 258528 287712 -156560 -241566 -69386 48572 168064 -7390 -51366 -164064
12770a64064G004M6182j8565P4605j5742J24727I4139k077A4461M4543K399a18825
$$ -164064 7004 53186 34621 109226 93484 218211 94139 92062 14461 59004 61403 -118825
12757f7247e276G705K84579j37505h7644F4226k4975e6002K4404m2122K1897k06509
$$ -67247 -5276 7705 292284 154779 -87644 64226 39251 -56002 -31598 -73720 -51823 -258332
12745b58332k9911M098A78473h6108B10803l4748R1766a3752k50400B41906p4247
$$ -258332 -288243 -284145 178473 -86108 210803 176055 267821 -13752 -264152 241906 167659
12734A67659K11556D0219c33826A74270N5537c240j39157I7037g6640H2344d9561
$$ 167659 379215 40219 -333826 174270 229807 -3240 -142397 97037 -76640 82344 -49561
12722C3049b32540B68085J8302m4227a95227e9927B6992j3262K26771f5715B98086
$$ 33049 -232540 268085 286387 242160 -195227 -59927 26992 13730 240501 -65715 298086
12710C21733a36547B6366L3851J03499C8714K64001c9752n169C28720a71984C24693
$$ 321733 -136547 26366 60217 163716 38714 302715 -39752 -44921 328720 -171984 324693
12698b54309I3478f5827j4763j22374E3009L35931A03939D9916h9672A81169e1870
$$ -254309 93478 -65827 -80590 -202964 53009 388940 103939 49916 -89672 181169 -51870
12686C16536f1835a8450j8304E5050J82292c24446a0096j4518F408b37536a01257
$$ 316536 -61835 -18450 -36754 55050 237342 -324446 -10096 -24614 6408 -237536 -101257
12674a4394C29241A34000K8057F2874a43493k9751C66450A72775K04495g2954
$$ -14394 329241 134000 162057 62874 -143493 -173244 366450 172775 377270 -72954
12663F5422b9867A14914J00397j06915m7157a92894a5368A68411C0265N6684N570
$$ 65422 -29867 114914 215311 108396 61239 -192894 -15368 168411 30265 86949 92519
12652I2519a2595m1583a2373l07083A17334a78805H903J59958q1655G438a32204
$$ 92519 -12595 -54178 -12373 -319456 117334 -178805 8903 168861 87206 7438 -132204
12640A13780j3543a2204H3106P4274E4507i8111B63148A17089m5473a34126e1979
$$ 113780 100237 -12204 83106 157380 54507 -98111 263148 117089 71616 -134126 -51979
12628a03987d9918B39754a5166I2675g5587d07j26443j14226B00526n1544J70445
$$ -103987 -49918 239754 -15166 92675 -75587 -407 -126850 -241076 200526 148982 319427
12617C19427j07438A7185M3713a10701B31394m0724a45622B68216l4180j08507
$$ 319427 211989 17185 60898 -110701 231394 190670 -145622 268216 234036 125529
12607A25529i5744A52987O8739b0282j60844j22129C71091e646G8405J90453B1202
$$ 125529 -95744 152987 221726 -20282 -181126 -303255 371091 -5646 78405 268858 21202
12595H5865K0937C6738a30198B27707b76195A7673J34011j1754d5467A16317J71580
$$ 85865 106802 36738 -130198 227707 -276195 17673 151684 139930 -45467 116317 287897
12584B87897G8725P8528O0448g5956j75068k816C38797a38654I91J22652D4852
$$ 287897 78725 157253 217701 -75956 -251024 -253840 338797 -138654 991 123643 44852
12572A69957g6891c730I231J15009k3621K00027D4035r27J5900Q1062o0661L90123
$$ 169957 -76891 -3730 9231 124240 100619 300646 44035 43108 59008 140070 79409 469532
12560D69532A21749O296i3781A29393a75897b6427I0338a11877b5845o6306K3700
$$ 469532 121749 128045 -93781 129393 -175897 -26427 90338 -111877 -25845 -92151 -68451
12549f8451b3020n0629l2390c9199B20381f3502D43324A10520a85388a0890A60588
$$ -68451 -23020 -73649 -106039 -39199 220381 -63502 443324 110520 -185388 -10890 160588
12537e0218E747J32585b41355A92140b11745E0944J71536c00207G643J88393e4485
$$ -50218 5747 138332 -241355 192140 -211745 50944 222480 -300207 7643 196036 -54485
12525D8417a55385I7110O9531O7742Q3009A5991b86594A6912K17354m7295a12147
$$ 48417 -155385 97110 166641 234383 317392 15991 -286594 16912 234266 186971 -112147
12513A9154o949K14156i8180B94315A14525a40580c968r6251a5274B54b03670
$$ 19154 12205 226361 -98180 294315 114525 -140580 -3968 -100219 -15274 254 -203670
12501B55515a87292A97603G8792L39435j48267A1466c23787J54986A38541M0975
$$ 255515 -187292 197603 78792 418227 269960 11466 -323787 -168801 138541 179516
12491A79516L0925a650r1481A3886B337K07968d810B01860a75459A65117L8468
$$ 179516 210441 -1650 -93131 13886 2337 210305 -4810 201860 -175459 165117 203585
12480B03585d4667B06807a15728n9991O7824A41509a180o6295k00476N5084c8771
$$ 203585 -44667 206807 -115728 -175719 -107895 141509 -1180 -67475 -267951 -212867 -38771
12468A20346b57546e4774b4761r2262a9536k19164C6579e8301C2307j1382J28551
$$ 120346 -257546 -54774 -24761 -117023 -19536 -238700 36579 -58301 32307 20925 149476
12457A49476a58968p196B4723J84692a95007B23538b6485m3579A5974c5885k48814
$$ 149476 -158968 -166164 24723 209415 -195007 223538 -26485 -70064 15974 -35885 -284699
12446b84699D6414b94305C6671J79972d1616l2686k58698A64327a87466l7344
$$ -284699 46414 -294305 36671 216643 -41616 -74302 -333000 164327 -187466 -224810
12436b24810B22853b74859F5227a72417e7938C6424a33402B10250J81298a13091
$$ -224810 222853 -274859 65227 -172417 -57938 36424 -133402 210250 391548 -113091
12425a90080A68397a97905B16838a75747h0504J514A67760a88512B9338b7327
$$ -190080 168397 -197905 216838 -175747 -80504 -78990 167760 -188512 29338 -27327
12414a22023j14559B47167b2063C07367b63119A86650a84757d6015E243N2179
$$ -122023 -236582 247167 -22063 307367 -263119 186650 -184757 -46015 5243 57422
12404E7422B0379M1469b23806n1056a097k40506k6599J10675n884m27814A48557
$$ 57422 20379 61848 -223806 -274862 -1097 -241603 -268202 -157527 -163411 -591225 148557
12392a52062k26996c6929C70640a73401D9943d75977A26755f3143D3949J7756
$$ -152062 -379058 -36929 370640 -173401 49943 -475977 126755 -63143 43949 61705
12382F1705O3508a96872A90468a9708B46837E9219R1020g0601C20074m3414F4617
$$ 61705 125213 -196872 190468 -19708 246837 59219 150239 -70601 320074 276660 64617
12370a02997F9050J10786J79843D394a36740k30076B7602A805f5965G0589K93121
$$ -102997 69050 179836 359679 4394 -136740 -366816 27602 1805 -65965 70589 363710
12359C63710A61089L503d8256B44772d9135B51540a06943E8184r658a05233B01256
$$ 363710 161089 164592 -48256 244772 -49135 251540 -106943 58184 48526 -105233 201256
12347a37004A31022b7401k34382h0371I0612a33181d2521F4406g7663A1441M3131
$$ -137004 131022 -27401 -261783 -80371 90612 -133181 -42521 64406 -77663 11441 54572
12336E4572h6181j80655a23611B55997c8552o4560H8606c10146g3474A15247a17453
$$ 54572 -86181 -266836 -123611 255997 -38552 -103112 88606 -310146 -73474 115247 -117453
12324B4366J42202a68038B8628c23597B58962I0185O1112J49097A27536A8599
$$ 24366 166568 -168038 28628 -323597 258962 90185 151297 300394 127536 18599
12313A44707a34286B34234b84344A78320b6873G9425P4664e0366C5247K08328
$$ 144707 -134286 234234 -284344 178320 -26873 79425 154089 -50366 35247 243575
12303B43575J96872F290J97367M64070B25575a44789B92314O928C7791N9846b2937
$$ 243575 440447 6290 203657 667727 225575 -144789 292314 299242 37791 97637 -22937
12291A25823c7358I082L6029K22094r7005H1901m256l265K5880C1770c4730F1695
$$ 125823 -37358 9082 45111 267205 170200 81901 77645 74380 100260 31770 -34730 61695
12278A9762J46869C4153P5924c0696q416B43843f5580G7190e573B43464p7517
$$ 19762 166631 34153 110077 -30696 -39112 243843 -65580 77190 -5573 243464 165947
12267A65947G3211P9200J35366A2331e1281B37347e4424E31608A65765c0786H9719
$$ 165947 73211 152411 287777 12331 -51281 237347 -54424 531608 165765 -30786 89719
12255B73337j34617J08650j15225P4931m7662o239h8809B81107H0711a8556l4948
$$ 273337 138720 247370 132145 207076 159414 153175 -88809 281107 80711 -18556 -53504
12244e3504A59879M5959J28400a66232n9654A12282J73313a39791C19763N8974
$$ -53504 159879 205838 334238 -166232 -225886 112282 285595 -139791 319763 378737
12234C78737A58189k5784a72651E6961h9720A06327c179A34997d5661A40149o0122
$$ 378737 158189 132405 -172651 56961 -89720 106327 -3179 134997 -45661 140149 80027
12223H0027a9398j47105f8027r0973F5890J80559R5374n6757I9909K06612n7901
$$ 80027 -19398 -166503 -68027 -159000 65890 246449 341823 285066 99909 306521 248620
12212B48620J62794a0005B50958o0210q7654K11121K00506H3089K53762c2422
$$ 248620 411414 -10005 250958 190748 103094 314215 514721 83089 336851 -32422
12201a09938A27156L2788b5269C9691N5478l0541a8819F7115d7745A85023c2835
$$ -109938 127156 159944 -25269 39691 95169 64628 -18819 67115 -47745 185023 -32835
12189A47499K83368B4920J96384i0461B71844E9076a86561B39878k3409j01999
$$ 147499 430867 24920 221304 -90461 271844 59076 -186561 239878 216469 114470
12179A14470J50361n323K4468n892J64205B18428q3536K2901b0271A13447K21274
$$ 114470 264831 259508 283976 278084 442289 218428 134892 157793 -20271 113447 334721
12168C34721K8233F5716K11300A844M88071C543K0549L85711a06444A40185B9824
$$ 334721 362954 65716 277016 1844 489915 3543 24092 409803 -106444 140185 29824
12156B28805l4492I1483K59473R7343E0256L33909j28900q0485P4269a69801A788
$$ 228805 194313 91483 350956 448299 50256 384165 255265 174780 249049 -169801 1788
12144i2565j01375c3064B9731R1644J01585E7182b59380A49639d845A62653K24265
$$ -92565 -193940 -33064 29731 121375 222960 57182 -259380 149639 -4845 162653 386918
12133C86918c14740h0827j64869c9342o9284N2619A7422P8841a29101B20548a4065
$$ 386918 -314740 -80827 -245696 -39342 -108626 -56007 17422 96263 -129101 220548 -14065
12121f1496J5212I2858J93789G3681M6078m7412k4144K43442a24602e2661B19331
$$ -61496 -46284 92858 286647 73681 119759 72347 48203 291645 -124602 -52661 219331
12109b02050C12916j20613Q7206r4890C8347f0967b992B38310H476K26411J07962
$$ -202050 312916 192303 279509 184619 38347 -60967 -2992 238310 8476 234887 342849
12098C42849l5195n9597B4136J0428j0764L3736J53895a09250A51472l9286e8822
$$ 342849 307654 248057 24136 34564 23800 57536 211431 -109250 151472 112186 -58822
12086A09772a81664r2338H4932d43678D82821D7593J0806a03320H6587a05705
$$ 109772 -181664 -274002 84932 -443678 482821 47593 58399 -103320 86587 -105705
12075A02592k2216k868j1959b3667B12580Q6123b90257B22303b78067C25713a32859
$$ 102592 80376 77508 65549 -23667 212580 298703 -290257 222303 -278067 325713 -132859
12063B29509a31816H8682J44259F139a11749c8186r6995A9244g364j1584k87915
$$ 229509 -131816 88682 232941 6139 -111749 -38186 -135181 19244 -7364 -18948 -306863
12052c06863b0634C57960L34794H7215M20412A75896D7525K7754J77143A0291
$$ -306863 -20634 357960 692754 87215 507627 175896 47525 75279 252422 10291
12041c7654k75731B15302f2606p8792C16009a2170j63758b0106B76739A00906
$$ -37654 -313385 215302 -62606 -141398 316009 -12170 -175928 -20106 276739 100906
12030C560a12794k38134h986C1119O3387D3178d3659m2721j29219H9925K66671
$$ 3560 -112794 -350928 -8986 31119 94506 43178 -43659 -86380 -215599 89925 356596
12019C56596I4839A7582c4062k60483A5510L6553a25759A11397E3442a28960E8400
$$ 356596 94839 17582 -34062 -294545 15510 52063 -125759 111397 53442 -128960 58400
12007B27372p6834e7629H7577J17618A9470N9680M2010a58959B637K48545F988
$$ 227372 150538 -57629 87577 205195 19470 79150 121160 -158959 2637 251182 6988
11995c3810A49268D9178e2647A90322C0797f6334K5061Q401C17220d5477A02472
$$ -33810 149268 49178 -52647 190322 30797 -66334 -41273 -32872 317220 -45477 102472
11983i5250o2355M0356A00501a65379A69207a81193C2136e28768B68839A03090
$$ -95250 -157605 -117249 100501 -165379 169207 -181193 32136 -528768 268839 103090
11972a8742C03890b32559M6336I288b68023c455k75808A04692c17361D1247a23267
$$ -18742 303890 -232559 -186223 9288 -268023 -3455 -279263 104692 -317361 41247 -123267
11960A13032d35862A57987o6547J24884a7543j89960A35023a64091A87544M8124
$$ 113032 -435862 157987 91440 216324 -17543 -207503 135023 -164091 187544 235668
11950B35668b19029I9392J7074R0685I0015c4596A13567n6590B631f7874A82465
$$ 235668 -219029 99392 116466 207151 90015 -34596 113567 56977 2631 -67874 182465
11938H9074D3761L6053a99021q9648a25225m5580B91259a04518E8993B8807P4150
$$ 89074 43761 79814 -199021 -288669 -125225 -170805 291259 -104518 58993 28807 102957
11927A02957r608b01364j1936A54606m8829a88524m3686i414p9357j11883A88114
$$ 102957 93349 -201364 -213300 154606 105777 -188524 -232210 -9414 -88771 -200654 188114
11915F1760d4312A28699e9732A37460a08567A8487a29048o1290g335C6781b04295
$$ 61760 -44312 128699 -59732 137460 -108567 18487 -129048 -190338 -7335 36781 -204295
11903D26545J35621a4451A04862a98969R21C0794K1930L7636K2998K06840j38199
$$ 426545 562166 -14451 104862 -198969 -198048 30794 52724 90360 113358 320198 181999
11892A81999h0472A09986b6550I5001J0556J97137h0101c7944o3328M6982A70725
$$ 181999 -80472 109986 -26550 95001 105557 302694 -80101 -37944 -101272 -54290 170725
11880a44379G4328P1259a6356p4331J2699q6934g5446r8952k87104I6823K2430
$$ -144379 74328 145587 -16356 -90687 -77988 -164922 -75446 -174398 -461502 96823 119253
11869A19253A9054b46031P5341r7336e493k36309j2285Q7568q2617R8739A15065
$$ 119253 19054 -246031 -170690 -268026 -5493 -241802 -254087 -166519 -249136 -150397 115065
11857B72357c71510E6786K66439a21737r0250J03742j99224j21895H2869k6573
$$ 272357 -371510 56786 323225 -121737 -211987 -108245 -307469 -429364 82869 56296
11847E6296h5020r7041B2739N9532e766j90889i7238j19169C1277c0123m7151
$$ 56296 -85020 -182061 22739 82271 -5766 -196655 -97238 -216407 31277 -30123 -77274
11836g7274A6847a00776L9857j43999O9895j59407k64253K60736r545e3102B36796
$$ -77274 16847 -100776 -60919 -204918 -135023 -294430 -558683 -297947 -307492 -53102 236796
11824h689H4272b2976j79249C5632d00858A40193b00593R3007N044A07599e8093
$$ -8689 84272 -22976 -202225 35632 -400858 140193 -200593 -107586 -102542 107599 -58093
11812a71680n5399C4474b27646e7969m6317I3988g6051l04322a50014M3382D158
$$ -171680 -227079 34474 -227646 -57969 -104286 93988 -76051 -380373 -150014 -106632 4158
11800a4782C87638e8693E4784K4353c61706a43851A30639e54277a54781A75969
$$ -14782 387638 -58693 54784 79137 -361706 -143851 130639 -554277 -154781 175969
11789a21605j39364B4818c4912j12547j68670A83103i2904q2429A91285N7901
$$ -121605 -260969 24818 -34912 -147459 -316129 183103 -92904 -175333 191285 249186
11779B49186a1712A55191G4005i755k41473A62967M2468G5126J4723a59464d2030
$$ 249186 -11712 155191 74005 -9755 -251228 162967 205435 75126 89849 -159464 -42030
11767e5864B30726a05240d4298A15790B9903J59565a77213O0152l08291B29735
$$ -55864 230726 -105240 -44298 115790 29903 189468 -177213 -117061 -425352 229735
11756b58198A77277d17580i3891j95092J7706C52968H2539J48965a20361j06158
$$ -258198 177277 -417580 -93891 -288983 -271277 352968 82539 231504 -120361 -226519
11746b26519p6195a09458H9270d4316f820I8271P944B0753f2312q9150e0860I5269
$$ -226519 -302714 -109458 89270 -44316 -6820 98271 106215 20753 -62312 -151462 -50860 95269
11733b54967A50751g4301B28223N590b7107B89506G9245b75824c4540A7008a1685
$$ -254967 150751 -74301 228223 233813 -27107 289506 79245 -275824 -34540 17008 -11685
11721A38732f4095n8330A58122d13786C5841J05721f7779r344A99701a00750H7099
$$ 138732 -64095 -122425 158122 -413786 35841 141562 -67779 -77123 199701 -100750 87099
11709B48944a14718F3696d2502E3231b17394B78855l3551F7352b70476h8559K2280
$$ 248944 -114718 63696 -42502 53231 -217394 278855 245304 67352 -270476 -88559 -66279
11698f6279j33189A95848e7930q4730K493a3942A62116a06025L4731E1641N8229
$$ -66279 -199468 195848 -57930 -142660 -140167 -13942 162116 -106025 -71294 51641 109870
11687A09870b08160j52354a12767J3542n7378j72423I9608b65557a18964l4058
$$ 109870 -208160 -360514 -112767 -99225 -156603 -329026 99608 -265557 -118964 -153022
11677a53022N6879A02463L06993j00543a69243b306l9773A62711m0792j3494c7516
$$ -153022 -96143 102463 409456 308913 -169243 -2306 -42079 162711 121919 108425 -37516
11665a59309k32432e6705k8816B13230J62038a3386C54525b00091C1821d2582
$$ -159309 -391741 -56705 -85521 213230 375268 -13386 354525 -200091 31821 -42582
11654a78598Q4417F6001b03407k3254j0671B31513g7471k8528B07529F4316K71461
$$ -178598 -94181 66001 -203407 -226661 -237332 231513 -77471 -105999 207529 64316 335777
11643C35777r7791b48095A26976i0777A25493C9330K25451k6536m5122k0549E497
$$ 335777 237986 -248095 126976 -90777 125493 39330 264781 238245 193123 172574 5497
11631G6851a68347B0981h1724m3741A34816a1667l90689A09249E1539a3993o8274
$$ 76851 -168347 20981 -81724 -125465 134816 -11667 -402356 109249 51539 -13993 -82267
11620h2267A70125E4453K662b35350A17519L7115b96688B96236a09219A88762
$$ -82267 170125 54453 57115 -235350 117519 154634 -296688 296236 -109219 188762
11609b1790A07041b55836e0857A58248L5288c2001C04652G8842P0589a1776n2984
$$ -21790 107041 -255836 -50857 158248 193536 -32001 304652 78842 149431 -11776 -64760
11598f4760B13381J38014c77928J15763B9181N9848b66841I0404Q2021a71024
$$ -64760 213381 351395 -377928 -262165 29181 89029 -266841 90404 172425 -171024
11587D6228j321g4943A22570n147J17817l5841P4588H2468L26129e1805C14362
$$ 46228 44907 -74943 122570 117423 235240 199399 273987 82468 408597 -51805 314362
11575d0506C85069a39606C18138a9914l3128L049C4600a02494L6579B07309K31837
$$ -40506 385069 -139606 318138 -19914 -53042 -49993 34600 -102494 -65915 207309 439146
11564D39146C5162c24998A54027J15576G6381O8940n2628J02530d8581j11560
$$ 439146 35162 -324998 154027 269603 76381 145321 92693 195223 -48581 -160141
11554a60141A53064L3626a48053D0921L26272a53717A59399J8634c8009J280k72134
$$ -160141 153064 186690 -148053 40921 367193 -153717 159399 178033 -38009 -36729 -308863
11543c08863A74705f6913p1080c3996A73924Q1605E1807K37437b73258a02149
$$ -308863 174705 -66913 -137993 -33996 173924 255529 51807 289244 -273258 -102149
11532b52467G2748A7896M22774D6390i0979D6539J44456l5996J4940k6715L55297
$$ -252467 72748 17896 440670 46390 -90979 46539 190995 154999 169939 143224 498521
11521D98521n3658d4182R281j43063P6343A29335h292A03204J5746a17701N1587
$$ 498521 444863 -44182 -34901 -177964 -101621 129335 -8292 103204 118950 -117701 -66114
11510f6114D9134a05010B4823J81830J9782N7459h5170A33365e2217A33699P7999
$$ -66114 49134 -105010 24823 206653 226435 283894 -85170 133365 -52217 133699 211698
11499B11698k8634p2632b08301C82383A13522k6440c29485B2068L01041A7080
$$ 211698 183064 110432 -208301 382383 113522 87082 -329485 22068 323109 17080
11488A78372L6188M1659o069P1647j05876A04672J83972h7309C54099B5141a8913
$$ 178372 214560 256219 250150 321797 215921 104672 288644 -87309 354099 25141 -18913
11476c1628A44785j1935M1542J03301o5274a21251B02041n1748J28040i8453A82158
$$ -31628 144785 132850 174392 277693 212419 -121251 202041 150293 278333 -98453 182158
11464a29851J338B47511m3471f0384C5726N3478k0249J40395j9619r581p261E4476
$$ -129851 -128513 247511 204040 -60384 35726 89204 68955 209350 189731 180150 172889 54476
11451B07944O7257a17113A92577g0592A31728J04455J46167H7853P5107J0548
$$ 207944 275201 -117113 192577 -70592 131728 236183 382350 87853 162960 173508
11441A73508l160a59503B25182b5492k65864i0433F65382b98520B03105b73821
$$ 173508 170348 -159503 225182 -25492 -291356 -90433 665382 -298520 203105 -273821
11430a60163b483k3026K874B46385a82182C18657A50007i2500C7478a16283a2249
$$ -160163 -2483 -25509 -22635 246385 -182182 318657 150007 -92500 37478 -116283 -12249
11418a63222A80682O0796J8652E0538b5632F4986R7404J57579c7902k3671j83338
$$ -163222 180682 241478 260130 50538 -25632 64986 162390 319969 -37902 -61573 -244911
11407b44911f668p0673j22405N1686K6616I3036J40532d3434k55686B5009c4980
$$ -244911 -6668 -77341 -199746 -148060 -121444 93036 233568 -43434 -299120 25009 -34980
11395d6281b1962B03150c8993A05324m1055b14315Q5597b8919B0291K69541a7581
$$ -46281 -21962 203150 -38993 105324 64269 -214315 -128718 -28919 20291 289832 -17581
11383B42200p8610J1913E4763a66869o0557e2908j89151p2884e2525k5349j1400
$$ 242200 163590 175503 54763 -166869 -227426 -52908 -242059 -314943 -52525 -77874 -89274
11372h9274F0010J15752o5462C1928j5238J69860a83037d1611C7062a26885j8987
$$ -89274 60010 175762 110300 31928 16690 186550 -183037 -41611 37062 -126885 -145872
11361a45872D09428g6324B5406N4859l0236J49326a52303D2021J8333J17973p7048
$$ -145872 409428 -76324 25406 80265 50029 199355 -152303 42021 60354 178327 101279
11350A01279a40406D7939e2823D5376a78780k95603K11887J06004O9392m3647
$$ 101279 -140406 47939 -52823 45376 -178780 -474383 -262496 -156492 -87100 -130747
11340a30747b1719E5875j3186R2323P0027B0155J14864b47397P3423j6940n3967
$$ -130747 -21719 55875 42689 135012 205039 20155 135019 -247397 -173974 -190914 -244881
11329b44881M7626A93588b2722q9271K3320L6850G1445f3565j02731A60577j8204
$$ -244881 -197255 193588 -22722 -111993 -88673 -51823 71445 -63565 -166296 160577 142373
11318A42373a69722O4575q9680B2406K32252c34193i1004k21267B6896F439f4434
$$ 142373 -169722 -105147 -194827 22406 254658 -334193 -91004 -312271 26896 6439 -64434
11306A66668F8561a24713J6684a6496A52807C785a96828C1077K65873a79877h3396
$$ 166668 68561 -124713 -108029 -16496 152807 3785 -196828 31077 296950 -179877 -83396
11294b68917a02489j05447J5670A82308a78021A54766G5743e4053E5666a88998
$$ -268917 -102489 -207936 -192266 182308 -178021 154766 75743 -54053 55666 -188998
11283i1645c4364H0358c09089J07163a1287m06291E00293a65125a0554C34489
$$ -91645 -34364 80358 -309089 -201926 -11287 -417578 500293 -165125 -10554 334489
11272d0804j34967I7656a4751k40604H3308J4131c67894J83029j30469Q2166J10521
$$ -40804 -175771 97656 -14751 -255355 83308 97439 -367894 -184865 -315334 -233168 -122647
11261a22647B9234g8101k3128k4281a9410l8976j2848o1815m3259h399H610K34883
$$ -122647 29234 -78101 -101229 -125510 -19410 -58386 -71234 -133049 -176308 -8399 8610 243493
11249B43493E2492a19458j36924d6390m1492j29463A36552a70699f6068A05751
$$ 243493 52492 -119458 -256382 -46390 -87882 -217345 136552 -170699 -66068 105751
11238b3740p2626E5632J5882f6710q3835F8890J13041e2515H288g6372q614C8661
$$ -23740 -96366 55632 71514 -66710 -150545 68890 181931 -52515 8288 -76372 -84986 38661
11225a35546j01728K4509D3238f6309j29661E3273O4138e4488e843B9200J56276
$$ -135546 -237274 -212765 43238 -66309 -195970 53273 117411 -54488 -5843 29200 185476
11214A85476f7569m8011j11730n1123E4958M6220f2218a5889m34253b0580n3888
$$ 185476 -67569 -115580 -227310 -278433 54958 101178 -62218 -15889 -450142 -20580 -74468
11203g4468j68562B05261D9239b15498H9422d80463a95609F1568e6390m9165r4608
$$ -74468 -243030 205261 49239 -215498 89422 -480463 -195609 61568 -56390 -105555 -200163
11192b00163k0336A0062N4363K75931G9161a39074A10296a27970C71668c2541
$$ -200163 -220499 10062 64425 340356 79161 -139074 110296 -127970 371668 -32541
11181d1279j69302A31923a12279N0355n0625A56834O6913H2369m864b96908f7008
$$ -41279 -210581 131923 -112279 -61924 -112549 156834 223747 82369 77505 -296908 -67008
11169f6464n1179L034k77m0876F7642a19368I4834I814c4070C9874B457J23354
$$ -66464 -117643 -114609 -114886 -155762 67642 -119368 94834 9814 -34070 39874 2457 125811
11157A25811b38036i7372c175j80520d2990k53715b8847j12067b2762k13842Q5945
$$ 125811 -238036 -97372 -3175 -183695 -42990 -296705 -28847 -140914 -22762 -236604 -150659
11146a50659M8968J1194j61853c065C30893j37741E7609b70571a6934j15623n0610
$$ -150659 -101691 -90497 -252350 -3065 330893 193152 57609 -270571 -16934 -132557 -183167
11135a83167D7644K44287A25736k4054D6099K33140J44039f2107j39159C3597
$$ -183167 47644 291931 125736 101682 46099 279239 423278 -62107 -201266 33597
11124a36421e6292r5493N0224A25689c9823A13879O3045a40858q4910a02574B73687
$$ -136421 -56292 -151785 -101561 125689 -39823 113879 176924 -140858 -225768 -102574 273687
11112A48249p2176J0193a39421a4097E231K72180c68906A81340Q4654k4086A10308
$$ 148249 76073 86266 -139421 -14097 5231 277411 -368906 181340 265994 241908 110308
11100F0516a24386C6678N0385l349k452O5931a10145d0302k25128B3937J2229
$$ 60516 -124386 36678 87063 83714 81262 147193 -110145 -40302 -265430 23937 36166
11089C6166M33867B03269Q0720A37787l2817J76213D1846R9553F1431N4072Q7408
$$ 36166 470033 203269 283989 137787 104970 281183 41846 141399 61431 115503 202911
11078B02911l4877f6033C52035g383j0066D1776K17983n156M515j19536J64270
$$ 202911 168034 -66033 352035 -7383 -17449 41776 259759 254603 259118 139582 303852
11067C03852G8529J95842K5744i2486A43935A3322N4412L49697a02418A71945
$$ 303852 78529 274371 300115 -92486 143935 13322 67734 417431 -102418 171945
11056D40490h5968B93194j1022I0907M31497f430B64638G7693D42a34764F13951
$$ 440490 -85968 293194 282172 90907 522404 -6430 264638 77693 442 -134764 613951
11044A74982M32228k11223j48562P7978P6377M8204K95390k60815K17606L0933
$$ 174982 607210 395987 247425 325403 401780 449984 745374 484559 702165 733098
11034G33098n183q3514L60445m16652j03802M48034j94445O7727j96579J81319
$$ 733098 727915 644401 1004846 588194 484392 932426 737981 805708 609129 790448
11024G90448l38173P6192M33757D56168L97357j98904q5469J41473k4226j17622
$$ 790448 452275 528467 962224 456168 853525 654621 569152 710625 686399 568777
11014E68777K26495j24793P6096j02960r2079P7041M1153B85051M53960j88238
$$ 568777 795272 670479 746575 643615 551536 628577 669730 285051 739011 550773
11004E50773L91122J6996C33986K99508P9040B89781K3142K95157k11330M40496
$$ 550773 941895 958891 333986 633494 712534 289781 312923 608080 396750 837246
10994H37246l91340j71837L6126K62206j29315M0590J97977j34517J83072l03163
$$ 837246 445906 274069 310195 572401 443086 483676 681653 547136 730208 427045
10984D27045R0224J53144p7590l7162K1921L1721K2925l0263J56710q0443J6391
$$ 427045 517269 670413 592823 555661 577582 609303 632228 601965 758675 678232 694623
10973F94623C12718M03051Q0179L8291r2643K7620l23865L61245l0693Q5074j48090
$$ 694623 312718 715769 795948 834239 741596 769216 445351 806596 775903 860977 712887
10962G12887p4262Q02377k95768O2843K27111R3519L08587L00403K4516l97809
$$ 712887 638625 1441002 1145234 1208077 1435188 1528707 1837294 2137697 2162213 1764404
10952A764404M84017l35547L40171N3775j98682k24319K2338m07347j02172r6331
$$ 1764404 2248421 1912874 2253045 2306820 2108138 1883819 1906157 1498810 1396638 1300307
10942A300307m499K31402Q3519j92543K86236l72071K87620k02343p8671k80722
$$ 1300307 1295808 1527210 1610729 1418186 1704422 1332351 1619971 1417628 1338957 1058235
10932A058235m96152M45416j65111J54383m36842j04858B20581L12404j66699
$$ 1058235 562083 1007499 842388 996771 559929 455071 220581 532985 366286
10923C66286L47084B99003F4968J55116J68825H8395H687a24069D9067J26636
$$ 366286 713370 299003 64968 220084 388909 88395 8687 -124069 49067 175703
10913A75703J35156D3778a55758f4759D103f1053A84925A9768b29262P5690B05664
$$ 175703 310859 43778 -155758 -64759 4103 -61053 184925 19768 -229262 -153572 205664
10901A65543l5148d1071j5326j5650a7977B43847a27166A9305a13973b811C0548
$$ 165543 130395 -41071 -56397 -72047 -17977 243847 -127166 19305 -113973 -2811 30548
10889G1391K2968k5113K9271j9579b01072m787F8147h1347k4366M4848k01449
$$ 71391 94359 69246 98517 78938 -201072 -205859 68147 -81347 -105713 -60865 -262314
10878b62314A32510c87635A47428b39222A47397a23035C4390M3705a34668N1301
$$ -262314 132510 -387635 147428 -239222 147397 -123035 34390 78095 -134668 -83367
10868h3367B39310A4811L7735c17749e3153k22298A33412J38243B5554J7301J5798
$$ -83367 239310 14811 52546 -317749 -53153 -275451 133412 271655 25554 42855 58653
10857E8653a2400D3765A2946e8076j20798O6260P767j52832A28629b0684A10853
$$ 58653 -12400 43765 12946 -58076 -178874 -112614 -104847 -257679 128629 -20684 110853
10845D0319J72753a53526a6399H210M2021i9245F6253a85508G3282J34144I8920
$$ 40319 213072 -153526 -16399 8210 50231 -99245 66253 -185508 73282 207426 98920
10833C55818D7575J98905n6472a86263L0990l1015D3449i4250H6601J40959e5381
$$ 355818 47575 246480 190008 -186263 -155273 -186288 43449 -94250 86601 227560 -55381
10821b23176A00124c81620C0000J51366N5905p8545c09278O8263A45616a63871
$$ -223176 100124 -381620 30000 181366 237271 158726 -309278 -241015 145616 -163871
10810A23522a52165B18123a20788l1973A72775a16290G1367a74257o965k63716
$$ 123522 -152165 218123 -120788 -152761 172775 -116290 71367 -174257 -181222 -444938
10800d44938K01272P7891A53111i8141A71179D6069b01900L133f4955D1726f5928
$$ -444938 -243666 -165775 153111 -98141 171179 46069 -201900 -198767 -64955 41726 -65928
10788b07572B0349a84796m3731n421A98264a937I0899h2656K8393o3772A80313
$$ -207572 20349 -184796 -228527 -233948 198264 -1937 90899 -82656 -54263 -118035 180313
10776E7924J40507J4365I674b97899J08180f1117J6598C17084I7404h1507E0558
$$ 57924 198431 212796 9674 -297899 -189719 -61117 -44519 317084 97404 -81507 50558
10764A71155K0616E5308A8534a72284Q2333A93266L0218h0780c7373A2366Q584
$$ 171155 191771 55308 18534 -172284 -89951 193266 223484 -80780 -37373 12366 20950
10753B0950J38564M1856a98595b436q3119j63715D0773f2167a3641j62378O8474
$$ 20950 159514 201370 -198595 -2436 -85555 -249270 40773 -62167 -13641 -176019 -107545
10742a07545b6875B89297C6073c070j49645d9975r9798A34707a68914A44749b12051
$$ -107545 -26875 289297 36073 -3070 -152715 -49975 -149773 134707 -168914 144749 -212051
10730b76732h9201B83O3836K71822i3968H8879h6932k34070O5497H3558f7351
$$ -276732 -89201 283 64119 335941 -93968 88879 -86932 -321002 -255505 83558 -67351
10718a81283M0534B00451b65070a00734D4762i3978J1062j5559A1456J5873c4897
$$ -181283 -140749 200451 -265070 -100734 44762 -93978 -82916 -98475 11456 27329 -34897
10706I121K05453b18633k676F7981a34959j05794i8643J5066j19611A74509C3160
$$ 9121 214574 -218633 -221309 67981 -134959 -240753 -98643 -83577 -203188 174509 33160
10694A52986b02801f0947m49638A8585M6754r3b28980A3907K47109b069k293B55134
$$ 152986 -202801 -60947 -510585 18585 65339 65246 -228980 13907 261016 -2069 -4362 255134
10681h0462j18081g5595B2897L3608g9919k9610E401L7833f5336K6068o0144L6285
$$ -80462 -198543 -75595 22897 56505 -79919 -109529 5401 43234 -65336 -39268 -99412 -63127
10669f3127m3293n9349m8662g305j60379A5069J49775b56067h2930l16352j424
$$ -63127 -106420 -165769 -214431 -7305 -167684 15069 164844 -256067 -82930 -399282 -400706
10658d00706i5794A68806j868a02941H4909g188F2592K5232O2478b27252h041
$$ -400706 -95794 168806 166938 -102941 84909 -7188 62592 87824 150302 -227252 -8041
10646c48098d1175G7092J11577a90544n31580a32775j79232B06109i9504K6408
$$ -348098 -41175 77092 188669 -190544 -722124 -132775 -312007 206109 -99504 -73096
10636g3096j97407M7995c7258j45430B14651g6876O126o1139B26796B9177d15202
$$ -73096 -270503 -222508 -37258 -182688 214651 -76876 -70750 -131889 226796 29177 -415202
10624A70948d8786k4434j04967Q420f3969B7499j2068K8284g9106r631J6930K2491
$$ 170948 -48786 -73220 -178187 -169767 -63969 27499 15431 43715 -79106 -88737 -71807 -49316
10612d9316J2588l83654A00672b45534A97628F5546L2488a26458e9070b1490j51763
$$ -49316 -36728 -420382 100672 -245534 197628 65546 98034 -126458 -59070 -21490 -173253
10601a73253C4857e8653k1118J8103B38614b91330A21573b08479A65229L6891
$$ -173253 34857 -58653 -79771 -61668 238614 -291330 121573 -208479 165229 202120
10591B02120a22088j88263A16498M1911C9616L67116b77208Q9044l2954a04684
$$ 202120 -122088 -310351 116498 158409 39616 406732 -277208 -188164 -221118 -104684
10580b76618d3731A33047h5810B04603b36654G7619a78900C5706J90605a13578
$$ -276618 -43731 133047 -85810 204603 -236654 77619 -178900 35706 226311 -113578
10569b73705c6488B45379c66850J05183d130C18544c32194A48083b21302C30178
$$ -273705 -36488 245379 -366850 -261667 -4130 318544 -332194 148083 -221302 330178
10558A8982h3236I5618c5219C08782i2646K670A32147e5144b5836k15653B78150
$$ 18982 -83236 95618 -35219 308782 -92646 -89976 132147 -55144 -25836 -241489 278150
10546A55894a77372b4045C02574c09025F6913b8474A9754a3978j41074J6500D1806
$$ 155894 -177372 -24045 302574 -309025 66913 -28474 19754 -13978 -155052 -138552 41806
10534c35862c4456A34712J33929c58727d2642k9240K5173m8853M5398p3890J4442
$$ -335862 -34456 134712 268641 -358727 -42642 -71882 -46709 -95562 -50164 -124054 -109612
10523a09612j46109D8291i4491q5409C18807B3522J71434b94426j48968B3330
$$ -109612 -255721 48291 -94491 -179900 318807 23522 194956 -294426 -443394 23330
10512g3233l10247A26160b83288g9842E047J38499K2234b10501I7172c73873d4737
$$ -73233 -383480 126160 -283288 -79842 5047 143546 165780 -210501 97172 -373873 -44737
10500H9649J5880c9316k4772a9125j32648D1041J78454a35138H781a66172J0013
$$ 89649 105529 -39316 -64088 -19125 -151773 41041 219495 -135138 8781 -166172 -156159
10489a56159F3531n475K784b13659A59626J24493D092c8661n2450k15256d977
$$ -156159 63531 58056 60840 -213659 159626 284119 4092 -38661 -91111 -306367 -4977
10477I3847K7172a97456i1399j24371H8860g0840j51816f0277B8152c854G2100
$$ 93847 121019 -197456 -91399 -215770 88860 -70840 -222656 -60277 28152 -3854 72100
10465A19281N2667L956P0405j3939N3359q6376R6873K33238A48971J32086J74412
$$ 119281 171948 175904 246309 232370 285729 199353 296226 529464 148971 281057 455469
10454D55469a43982j9237D30586q9293A32636I107K049d4931B06518a63471A7154
$$ 455469 -143982 -163219 430586 341293 132636 9107 11156 -44931 206518 -163471 17154
10442a73521o981M1164K7635q7572j13748C48731H9806m2304a3351l6433B7156
$$ -173521 -180502 -139338 -111703 -199275 -313023 348731 89806 47502 -13351 -49784 27156
10430b641A32845b2005H4810e352B9836G58a5627F5537c07664a07946J8313B56217
$$ -2641 132845 -22005 84810 -5352 29836 758 -15627 65537 -307664 -107946 -89633 256217
10417c4660j03622A09441J42656b5428C4166a3454C5703b49901C963d1874A48582
$$ -34660 -138282 109441 252097 -25428 34166 -13454 35703 -249901 3963 -41874 148582
10405f97p0037p3281l8442Q4938D1620a43424A39955c3105C6246e0905D7108b07030
$$ -697 -70734 -144015 -182457 -97519 41620 -143424 139955 -33105 36246 -50905 47108 -207030
10392b4750k50279P8611P3904q2772N1369b7671A74148a04859l9976N6290J0988
$$ -24750 -275029 -196418 -122514 -205286 -153917 -27671 174148 -104859 -144835 -88545 -77557
10381g7557C5221b24395A95796m1304K5827g7101B93621i0259m987B06363J5726
$$ -77557 35221 -224395 195796 154492 180319 -77101 293621 -90259 -95246 206363 222089
10370B22089f7886K5279D0741a11306I4089a6634I6439J07276b0093B10739K7021
$$ 222089 -67886 -42607 40741 -111306 94089 -16634 96439 203715 -20093 210739 237760
10359B37760C9376K01018B5605L22007E9269K62012N0373k6353a1528E116J96739
$$ 237760 39376 240394 25605 347612 59269 321281 371654 345301 -11528 5116 201855
10348B01855O24115C97410j76194q7274K92560o7481J33821A87782g8556B93786
$$ 201855 825970 397410 221216 133942 426502 359021 492842 187782 -78556 293786
10337A36571E7204L58106j78464P759j7692L92313k89619r4067p4564J69275q806
$$ 136571 57204 415310 236846 244605 226913 619226 329607 235540 160976 330251 321445
10326C21445j08371K37186j54859K75351d233A6892a66368D08284D7940M76578
$$ 321445 213074 450260 295401 570752 -4233 16892 -166368 408284 47940 524518
10316E24518a14305K7089B66828l8730R158A05067J81335a75758B3008K17377
$$ 524518 -114305 -87216 266828 228098 237256 105067 286402 -175758 23008 240385
10306B40385E7539J36785p6980h9337B14655b94864B85920j26458j7817a782E55787
$$ 240385 57539 194324 117344 -89337 214655 -294864 285920 159462 141645 -1782 555787
10294A17103f5074A12658b30467J07531H1712C8805d5158j81269R5051A58548
$$ 117103 -65074 112658 -230467 -122936 81712 38805 -45158 -226427 -131376 158548
10283a00202A59011A2411K59570b65400F235b60447B71778N3038B4778c6098p4036
$$ -100202 159011 12411 271981 -265400 6235 -260447 271778 324816 24778 -36098 -110134
10272a10134C55042b36404J09855I8874N9078K452a37913j83814c4474G5992N6387
$$ -110134 355042 -236404 -126549 98874 157952 160404 -137913 -321727 -34474 75992 132379
10261A32379B3265a97646C5309A0318a24887o4191c6443k18257g601j38810a5791
$$ 132379 23265 -197646 35309 10318 -124887 -189078 -36443 -254700 -7601 -146411 -15791
10249B53949e1829m4213A44285j0848O1746d12700g150j34402f9251I7190l1155
$$ 253949 -51829 -96042 144285 133437 195183 -412700 -7150 -141552 -69251 97190 66035
10238F6035J08582G1237K49908e0847C0466J32081J57571A29740f2834A05864
$$ 66035 174617 71237 321145 -50847 30466 162547 320118 129740 -62834 105864
10227d83068a52835j76154a28219m82748a82633B44692a90035c5863A4662J9871
$$ -483068 -152835 -328989 -128219 -610967 -182633 244692 -190035 -35863 14662 34533
10217C4533i5811j30691k88234e70B13392h8761j31474R4202l32204f4907k22134
$$ 34533 -95811 -226502 -514736 -570 213392 -88761 -220235 -126033 -458237 -64907 -287041
10206b87041A31886B4941b25468B36714I5804a53100A24348a21559c6604o2427
$$ -287041 131886 24941 -225468 236714 95804 -153100 124348 -121559 -36604 -99031
10196i9031B70550d00094b4655l4158B09520P4202A26120b14665R5708A58466
$$ -99031 270550 -400094 -24655 -58813 209520 283722 126120 -214665 -118957 158466
10185a49638E5319L9851a83733M7659j71930e5661r7665b3326A11488l8011a1034
$$ -149638 55319 95170 -183733 -136074 -308004 -55661 -153326 -23326 111488 73477 -11034
10173a77061r4217a733A8819a62450b259A03836l9489I951J18497a33431D2026
$$ -177061 -271278 -1733 18819 -162450 -2259 103836 64347 9951 128448 -133431 42026
10161c651k11102D7210h4622j31557e6605m5632C846J35759j2917b58309b2569
$$ -3651 -214753 47210 -84622 -216179 -56605 -102237 3846 139605 126688 -258309 -22569
10149A9585c56179A59697o571a30909E6079p803K8012d2394C47555j56812d7704
$$ 19585 -356179 159697 153126 -130909 56079 48276 76288 -42394 347555 190743 -47704
10137A1606h8471k26326a23418q1485B73866p4601E5155a54137L6060F5531a0494
$$ 11606 -88471 -314797 -123418 -204903 273866 199265 55155 -154137 -118077 65531 -10494
10125i7630L1448J2970G3488h3804H8883f8321G9463B1138e1847k31966R8884
$$ -97630 -66182 -53212 73488 -83804 88883 -68321 79463 21138 -51847 -283813 -184929
10114a84929P2383d3675b6j31652H5256b31161c7267B62071c17731N3954H6639
$$ -184929 -112546 -43675 -26 -131678 85256 -231161 -37267 262071 -317731 -263777 86639
10102e2296A20987f4783A41153Q272p3351d27050g4740B47624c08640b7334l3363
$$ -52296 120987 -64783 141153 149425 76074 -427050 -74740 247624 -308640 -27334 -60697
10091f0697b5183l54431J54404q3875J51216A30982c2724p5269H0353K405g4454
$$ -60697 -25183 -379614 -225210 -309085 -157869 130982 -32724 -107993 80353 82758 -74454
10079h3678F1025J69520N4961o0245J7764E9856a26726b6143D5099M2028b7514
$$ -83678 61025 230545 285506 225261 243025 59856 -126726 -26143 45099 87127 -27514
10067b59024a3040j98083j03706M8970A89639n4381b71036A43713e528j31954
$$ -259024 -13040 -211123 -314829 -265859 189639 135258 -271036 143713 -5528 -137482
10057a37482j29890a8616B01218q0581a56308j64894I8117a95929j00598a879
$$ -137482 -267372 -18616 201218 120637 -156308 -321202 98117 -195929 -296527 -1879
10046f1858G3656e8701j3579l2505c2334A85121p3819Q8683a96528H0140h0997
$$ -61858 73656 -58701 -72280 -104785 -32334 185121 111302 199985 -196528 80140 -80997
10034D7553d04664D1633c00960b1852p7368B99431d9186E2947b93997a00068C292
$$ 47553 -404664 41633 -300960 -21852 -99220 299431 -49186 52947 -293997 -100068 3292
10022B94328a58795j4496E6924a03765j27662I1702b3538G8625a36919N6236K7317
$$ 294328 -158795 -173291 56924 -103765 -231427 91702 -23538 78625 -136919 -80683 -53366
10011e3366G9948J03580o6968a37229L9660m4298c4215M535j60855j51024g2995
$$ -53366 79948 183528 116560 -137229 -97569 -141867 -34215 -29680 -190535 -341559 -72995
9999c91821c0719J1505A0034f0617G1983M5825i9239J6500A68203a43746A05056
$$ -391821 -30719 -19214 10034 -60617 71983 117808 -99239 -82739 168203 -143746 105056
9987f6077l6366j28747A71616a26384k47795i6021o7712L8802c5993A43668b33576
$$ -66077 -102443 -231190 171616 -126384 -374179 -96021 -163733 -124931 -35993 143668 -233576
9975F4374J1218l0348c53842b0870B14983G7706P1951A0373a63747g977m00331
$$ 64374 75592 45244 -353842 -20870 214983 77706 149657 10373 -163747 -7977 -408308
9964d08308A15389a48656F2405b52241f7316E0850J61771a065k30066P2803F4769
$$ -408308 115389 -148656 62405 -252241 -67316 50850 212621 -1065 -231131 -158328 64769
9952D2247b40315E1883J7634a65784D8435J4544i7483J8846A9125h2357k21569
$$ 42247 -240315 51883 69517 -165784 48435 62979 -97483 -78637 19125 -82357 -303926
9941c03926J8878P2460g4024j43100a229l69281A43970a87070d008p09035c0000
$$ -303926 -285048 -212588 -74024 -217124 -1229 -370510 143970 -187070 -4008 -713043 -30000
9929d3537n4246d6452l62177a9068D1006P5960i8341j08583A71426e5859j89901
$$ -43537 -97783 -46452 -408629 -19068 41006 116966 -98341 -206924 171426 -55859 -245760
9918b45760M4417A54217h6107r9471j3600j46046a54518j05810d7967j47605B8568
$$ -245760 -201343 154217 -86107 -185578 -199178 -345224 -154518 -260328 -47967 -195572 28568
9906A62452J81472d7415A47312o4089D725d88806H0241a01685L5666l567k29188
$$ 162452 343924 -47415 147312 83223 4725 -488806 80241 -101685 -66019 -69586 -298774
9895b98774b8814H3374b71448A02279P0710b04243H7935c34471A63664i6224A13396
$$ -298774 -28814 83374 -271448 102279 172989 -204243 87935 -334471 163664 -96224 113396
9883H5577b96695j24293A30690j9154a45276a4070l38727q284D2699J1378b88078
$$ 85577 -296695 -420988 130690 111536 -145276 -14070 -352797 -361081 42699 54077 -288078
9871b38116G9030d56015A4551J11769A1538b46347A0452c07185C18985a58023
$$ -238116 79030 -456015 14551 126320 11538 -246347 10452 -307185 318985 -158023
9860b7407r5369A42231a94474B08018I5722A8635a31874k4689A69758o0236c9582
$$ -27407 -122776 142231 -194474 208018 95722 18635 -131874 -156563 169758 109522 -39582
9848i3283r0197f0814k11964a14939G643a39805I5312b41844a14280M1973A55699
$$ -93283 -183480 -60814 -272778 -114939 7643 -139805 95312 -241844 -114280 -72307 155699
9836G0609g5070N690r0483E4131a73091h5692K4221A10934b49524a10152J5959
$$ 70609 -75070 -69380 -159863 54131 -173091 -85692 -61471 110934 -249524 -110152 -94193
9825i4193k05146m4712B08869E6302b08780C4583b26959A43611d8903D61850A25941
$$ -94193 -299339 -344051 208869 56302 -208780 34583 -226959 143611 -48903 461850 125941
9813a98880b9126j27439A42259C1749R3250b14450A46788c9801a8255l53979h6049
$$ -198880 -29126 -156565 142259 31749 124999 -214450 146788 -39801 -18255 -372234 -86049
9801a57640I2991i7435B0662J1318c9098H5333d29226R8705I4616c43828a19129
$$ -157640 92991 -97435 20662 31980 -39098 85333 -429226 -330521 94616 -343828 -119129
9789b55622J01697B62038c02472R4562e2033E933a28378j65910C1837J28956b3245
$$ -255622 -153925 262038 -302472 -207910 -52033 5933 -128378 -294288 31837 160793 -23245
9777b51283B5672c5900C13014H8894b52511i8935d581k2996A51685a40937A29123
$$ -251283 25672 -35900 313014 88894 -252511 -98935 -4581 -27577 151685 -140937 129123
9765a0829j29766M6137c4438A06875C5930j6483K51398h6987J1023k81476b0220
$$ -10829 -140595 -94458 -34438 106875 35930 19447 270845 -86987 -75964 -357440 -20220
9753i3094k16102A45714a69232A40099J64172a00553j55304j37796a7589j3337
$$ -93094 -309196 145714 -169232 140099 304271 -100553 -255857 -393653 -17589 -30926
9743c0926j28446j32411B00550a78580C26374c2613j67053A8936K37875b67245
$$ -30926 -159372 -291783 200550 -178580 326374 -32613 -199666 18936 256811 -267245
9732D4713a20660A94034d65658A88129R6774i3070l1567B75660B3230a57154B3445
$$ 44713 -120660 194034 -465658 188129 284903 -93070 -124637 275660 23230 -157154 23445
9720e2929A1553J45435a69314r4866J10017A07622h6413j30192d5540j07773d9007
$$ -52929 11553 156988 -169314 -264180 -154163 107622 -86413 -216605 -45540 -153313 -49007
9708b1238j59182A07733i4075d2951j20692l5531k5399m4899k4717a14253m0016
$$ -21238 -180420 107733 -94075 -42951 -163643 -199174 -224573 -269472 -294189 -114253 -154269
9697a54269K6992k2718B11101H4171c8910j06869C9742A5763J50975N2504b9741
$$ -154269 -127277 -149995 211101 84171 -38910 -145779 39742 15763 166738 219242 -29741
9685b2613J912o71G5421a0640H9194D649d3683A61140b05297N8935o7794B78438
$$ -22613 -20701 -21372 75421 -10640 89194 4649 -43683 161140 -205297 -146362 -214156 278438
9672a95277i7586d5804B10647n5426a31111K6388k77375C23853B110K2641a69494
$$ -195277 -97586 -45804 210647 155221 -131111 -104723 -382098 323853 2110 24751 -169494
9660A74412a23732B01626a0015j32160q2683d2448E7855d92072h2185j96875e3386
$$ 174412 -123732 201626 -10015 -142175 -224858 -42448 57855 -492072 -82185 -279060 -53386
9648c90012c8596k88426a49094j23114a27443A19890a7693j9982k34102A83143
$$ -390012 -38596 -327022 -149094 -272208 -127443 119890 -17693 -37675 -271777 183143
9637A05881a78208A12955c6085C5197L51157D399a62900j44392A1825f3860m65915
$$ 105881 -178208 112955 -36085 35197 386354 4399 -162900 -307292 11825 -63860 -529775
9626e29775a39231k04398a54904e6411r6491a5248B7011c05668b9043q3350q699
$$ -529775 -139231 -343629 -154904 -56411 -152902 -15248 27011 -305668 -29043 -112393 -121092
9615a21092o2921O7948a2024k02302D5924h2156p3271A01890j8481J15495c20438
$$ -121092 -184013 -116065 -12024 -214326 45924 -82156 -155427 101890 83409 198904 -320438
9603A970d0120D4633a3255D5802d4526j6114A5362O7023a95502c5179j75019k21087
$$ 1970 -40120 44633 -13255 45802 -44526 -60640 15362 82385 -195502 -35179 -210198 -431285
9591d31285R5016j6363J64347A77613c4848B934h7648E549K53806d08618h2766
$$ -431285 -336269 -352632 -188285 177613 -34848 2934 -87648 5549 259355 -408618 -82766
9579a3627A291M0381f9549B7300i9072A12657c64375A66000D2393J09959J1504
$$ -13627 1291 41672 -69549 27300 -99072 112657 -364375 166000 42393 152352 163856
9568A63856a86666O5617k05833h3824j89802A80725A7785a56461j7625e282A87053
$$ 163856 -186666 -121049 -326882 -83824 -273626 180725 17785 -156461 -174086 -5282 187053
9556A26271R5036b51225m3802c6004C5788b22055F9654c43666l7853b5894k85838
$$ 126271 221307 -251225 -295027 -36004 35788 -222055 69654 -343666 -381519 -25894 -311732
9545c11732D6274c14165B5116K913a86308N1365n1603f2443K7523j3838l31464
$$ -311732 46274 -314165 25116 28029 -186308 -134943 -186546 -62443 -34920 -48758 -380222
9534c80222A93549f1611j86154F3213a28330B35099p6371J38585a36504l24479
$$ -380222 193549 -61611 -247765 63213 -128330 235099 158728 297313 -136504 -460983
9524d60983B5532N8555c4041F5108J89342a54821C6232j7960a56486a671n9928
$$ -460983 25532 84087 -34041 65108 254450 -154821 36232 18272 -156486 -1671 -61599
9513f1599I1487a30006F0458J19955g4321L569E7970J7907j4737L3128a28197
$$ -61599 91487 -130006 60458 180413 -74321 -70752 57970 75877 61140 94268 -128197
9501b9106j4523k3269j80110B30677a61435J0767A99065c82458J75755i9284K6845
$$ -29106 -43629 -66898 -247008 230677 -161435 -150668 199065 -382458 -206703 -99284 -72439
9490g2439G2191a40618g249k58281J08192j7905j71873a30839j29009a1777k11642
$$ -72439 72191 -140618 -7249 -265530 -157338 -175243 -347116 -130839 -259848 -11777 -223419
9479b23419j47181D8787b53928B18655f6850j42906B70098h6994A115K3041b83563
$$ -223419 -370600 48787 -253928 218655 -66850 -209756 270098 -86994 1115 24156 -283563
9467E259b74316j33144a5567j68522g3951B15533o5744B9480J49991h0463j77103
$$ 5259 -274316 -407460 -15567 -184089 -73951 215533 149789 29480 179471 -80463 -257566
9456b57566i1899A97704A4553i5118I8731b64376A5589Q3854l7323f2176m32023
$$ -257566 -91899 197704 14553 -95118 98731 -264376 15589 99443 62120 -62176 -494199
9445d94199a12827o7440a1030m7155E107b67169E227a23442B63343b822k49949
$$ -494199 -112827 -180267 -11030 -58185 5107 -267169 5227 -123442 263343 -2822 -252771
9434b52771A59551Q755o7758a7072j14067A77278o9843L9236F7986J09503H874
$$ -252771 159551 168306 100548 -17072 -131139 177278 107435 146671 67986 177489 8874
9422d95874b42166A19661f7679A89073i3665A02238c62994G3095a52875j08893
$$ -495874 -242166 119661 -67679 189073 -93665 102238 -362994 73095 -152875 -261768
9412b61768e8076j05877R024N5581H7112d3062b0798K342i30E1858b59559a25532
$$ -261768 -58076 -163953 -154929 -99348 87112 -43062 -20798 -18456 -930 51858 -259559 -125532
9399b9123k16748i6109B94713F9428c8732k85275C1165K75725E3159g3526A82005
$$ -29123 -245871 -96109 294713 69428 -38732 -324007 31165 306890 53159 -73526 182005
9387A70049b03505c8420j70924M6145M4355e8114A62491f9986k58934j43413K12420
$$ 170049 -203505 -38420 -209344 -163199 -118844 -58114 162491 -69986 -328920 -472333 -259913
9376b59913C438i3826F5619b63016D2025a85204i0656j38352j49905D5650i5855
$$ -259913 3438 -93826 65619 -263016 42025 -185204 -90656 -229008 -378913 45650 -95855
9364c0858j92188g1637A4696b56929a6107j23254j13185p259A60208a44971b2579
$$ -30858 -223046 -71637 14696 -256929 -16107 -139361 -252546 -259805 160208 -144971 -22579
9352B92004a00935j33652B79665H8643a41407r0797M2012A0616c16696a42352
$$ 292004 -100935 -234587 279665 88643 -141407 -232204 -190192 10616 -316696 -142352
9341A36537a83541e7453C88925a19591j48541N4020A10578D5971J94294b34132
$$ 136537 -183541 -57453 388925 -119591 -268132 -214112 110578 45971 240265 -234132
9330C2746M505c78101J70713A57077J07470C15M339L6004c56628Q8160E2229M85253
$$ 32746 37251 -378101 -207388 157077 264547 315 4654 40658 -356628 -268468 52229 537482
9318E37482a11919A55562d2912A34785J59676b20210J04404j34293B27499a23619
$$ 537482 -111919 155562 -42912 134785 294461 -220210 -115806 -250099 227499 -123619
9307b21212B6470J12006F1856a02176G677P2990d43453b17993p782M3023o8272
$$ -221212 26470 138476 61856 -102176 7677 80667 -443453 -217993 -225775 -182752 -251024
9296b51024A26299b81103J1187J9251K4885A62659a69523j6385P5024M4679C9460
$$ -251024 126299 -281103 -269916 -250665 -225780 162659 -169523 -185908 -110884 -66205 39460
9284b74874b000j25954C75233a5257j70245g6867G9170K12648h8281B52508g6411
$$ -274874 -2000 -127954 375233 -15257 -185502 -76867 79170 291818 -88281 252508 -76411
9272c90355d0062j88425C01347b6356m95660c3195o1304j62069H7392a06777F4873
$$ -390355 -40062 -228487 301347 -26356 -522016 -33195 -94499 -256568 87392 -106777 64873
9260A89855C0901b15011K231O8016A64108A4316a4332l74715f7158A35174b70556
$$ 189855 30901 -215011 -212780 -144764 164108 14316 -14332 -389047 -67158 135174 -270556
9248b7680E1919M64038a6549A07462e2666B36496H1128d3655j82827O5781C30292
$$ -27680 51919 515957 -16549 107462 -52666 236496 81128 -43655 -226482 -160701 330292
9236f0051k17532m9184J28177A30763a67316C1823L6646M7631g8202a9978G1147
$$ -60051 -277583 -326767 -198590 130763 -167316 31823 68469 116100 -78202 -19978 71147
9224G1300d4632j92540o5305b8310l21189J24573N6783Q1078H8626J3149F381
$$ 71300 -44632 -237172 -302477 -28310 -349499 -224926 -168143 -87065 88626 101775 6381
9212C6895b7341m01227I5325a24427l2564O6856C8570b2568j54398E1439b24412
$$ 36895 -27341 -428568 95325 -124427 -156991 -90135 38570 -22568 -176966 51439 -224412
9200A36974a78220O7958b6443B32050g1634l4338A18186a47090j75396E021O7596
$$ 136974 -178220 -110262 -26443 232050 -71634 -105972 118186 -147090 -322486 5021 72617
9189G2617c81276b9893j90852L5901h2796A53995a05451J3018A80064d17228f7845
$$ 72617 -381276 -29893 -220745 -184844 -82796 153995 -105451 -92433 180064 -417228 -67845
9177a60518N6428L7403D7595f46554g9407J8816q1953F8788i0269k09358a4001
$$ -160518 -104090 -66687 47595 -646554 -79407 -60591 -142544 68788 -90269 -299627 -14001
9165a86237h9854A51366J33387B6078b14590i1611E3305N7898g5130L6549p2282
$$ -186237 -89854 151366 284753 26078 -214590 -91611 53305 111203 -75130 -38581 -110863
9154a10863m4014N1237a8581A79137b28479A53407A7667a33416N8369B36193b60356
$$ -110863 -154877 -103640 -18581 179137 -228479 153407 17667 -133416 -75047 236193 -260356
9142H5012l7305J77835i0280j90662K8101A74581C0308N1221c48786O4128A9612
$$ 85012 47707 225542 -90280 -280942 -252841 174581 30308 81529 -348786 -284658 19612
9130E3399d0127B6712a1916j58221Q4421j68460k430E2739b24013f4080C6846
$$ 53399 -40127 26712 -11916 -170137 -85716 -254176 -256606 52739 -224013 -64080 36846
9118B10999m4826f2585n7385e6163k32021m1318c2337p0742a1830j54908k61182
$$ 210999 166173 -62585 -119970 -56163 -288184 -329502 -32337 -103079 -11830 -166738 -427920
9107d27920A22561b85821c6770J6083A85507a72078L7952F4944Q9236o6352C259
$$ -427920 122561 -285821 -36770 -20687 185507 -172078 -134126 64944 154180 87828 3259
9095F8176c37804e9739A00481b94397a15844l53700a07870B40829A16369c08641
$$ 68176 -337804 -59739 100481 -294397 -115844 -469544 -107870 240829 116369 -308641
9084a11772C13221c28875g927m22138H659c62377a64399B65235E8305J52377f292
$$ -111772 313221 -328875 -7927 -430065 8659 -362377 -164399 265235 58305 210682 -6292
9072a92424g2205b5647j56862C27149b36888A81814f8643b2781j66682A36250
$$ -192424 -72205 -25647 -182509 327149 -236888 181814 -68643 -22781 -189463 136250
9061a20993A51317b47087F0136J2860d2601j39842D1243a3708j67131j9379e5602
$$ -120993 151317 -247087 60136 72996 -42601 -182443 41243 -13708 -180839 -200218 -55602
9049c03720J12630A54662G2577l0071P9345J26121b3757j29954j32150B54194
$$ -303720 -191090 154662 72577 42506 121851 247972 -23757 -153711 -285861 254194
9038C9956a10179o1533C78913H735a38866A03741j6149a74556n7959B92626a11585
$$ 39956 -110179 -171712 378913 8735 -138866 103741 87592 -174556 -232515 292626 -111585
9026b13816a00994D9777a58536g5947j97089E6377c93798a51244k63039a31056
$$ -213816 -100994 49777 -158536 -75947 -273036 56377 -393798 -151244 -414283 -131056
9015F4932Q4567f220j24070D940a85498A263b34770A64341o6187a76296O3967
$$ 64932 149499 -6220 -130290 4940 -185498 1263 -234770 164341 98154 -176296 -112329
9004a12329I0817b35025g1588A8737a49349A19304i4463B83497b028k5035l05163
$$ -112329 90817 -235025 -71588 18737 -149349 119304 -94463 283497 -2028 -27063 -332226
8993c32226A09198a32824a7236q6504F178a37422j76736a32698k58659A00768
$$ -332226 109198 -132824 -17236 -103740 6178 -137422 -314158 -132698 -391357 100768
8982c3150a437B1157d2646j03813D69646A15562a53721n1116h41k21684j1446
$$ -33150 -1437 21157 -42646 -146459 469646 115562 -153721 -204837 -841 -222525 -233971
8971b33971B06813b19997M2019j05823E854J37570i6406C77336A34241a64524
$$ -233971 206813 -219997 -177978 -283801 5854 143424 -96406 377336 134241 -164524
8960F5967b57153d5065C5505a13671k84155a00569j33944K4984N6222q8444d4717
$$ 65967 -257153 -45065 35505 -113671 -397826 -100569 -234513 -209529 -153307 -241751 -44717
8948c29657b0555l14688a43523k46389J87155Q8116A67728i4796A18109a06594
$$ -329657 -20555 -335243 -143523 -389912 -202757 -114641 167728 -94796 118109 -106594
8937A65856F3608h6421A09409b12125R6301r466M4655A12923c26154J12801Q3843
$$ 165856 63608 -86421 109409 -212125 -115824 -125290 -80635 112923 -326154 -213353 -129510
8926a29510C42548j36049a85355C24264a54335j26416J32771B3890J66178F9106
$$ -129510 342548 206499 -185355 324264 -154335 -280751 -147980 23890 190068 69106
8915A58233K68035j92312D7755J55399J89123A5965K73185L22847m9368M05444
$$ 158233 426268 233956 47755 203154 392277 15965 289150 611997 562629 968073
8905I68073Q30247J886950L379598k400970k152333p33740q75570P8653C37265
$$ 968073 1798320 3685270 7064868 4663898 2511565 1777825 902255 980908 337265
8895i3813A88898A946K22325Q0534j926a10684A58406k2812J85296a75478A46052
$$ -93813 188898 1946 224271 304805 302879 -110684 158406 135594 320890 -175478 146052
8883b05037E9346a96150B89173A12966a38560o3232l685B88246b77371H6958H143
$$ -205037 59346 -196150 289173 112966 -138560 -201792 -205477 288246 -277371 86958 8143
8871i5896G1645C5503J73844A01048a61764D2351a82928f5607I477J36553D1483
$$ -95896 71645 35503 209347 101048 -161764 42351 -182928 -65607 9477 146030 41483
8859A08265O7702H2717f3930A01583b2607l2079b330A62984b15109A38641a80821
$$ 108265 175967 82717 -63930 101583 -22607 -54686 -2330 162984 -215109 138641 -180821
$$ [...]
##END NTUPLES=NMR SPECTRUM
##END=
