
##TITLE=AC1112_Colombia_5835514_o0V20XEKOe
##JCAMPDX= 6.0         $$ Bruker NMR JCAMP-DX V2.0
##DATA TYPE= NMR SPECTRUM
##DATA CLASS= NTUPLES
##ORIGIN= BRUKER
##OWNER= Administrator
$$ 1.72 TOPSPIN		Version 2.1
$$ 2012-04-03 01:38:54.640 -0500  Administrator@TOPSPIN
$$ Compression mode = diff/dup
##.OBSERVE FREQUENCY= 400.13188235
##.OBSERVE NUCLEUS= ^1H
##.ACQUISITION MODE= SIMULTANEOUS (DQD)
##.ACQUISITION SCHEME= undefined
##.AVERAGES= 64
##.DIGITISER RES= 22
##SPECTROMETER/DATA SYSTEM= spect
##.PULSE SEQUENCE= noesygpps1d.comp
##.SOLVENT NAME= COFFEE_meoh
##.SHIFT REFERENCE= INTERNAL, COFFEE_meoh, 1, 14.96849
##AUDIT TRAIL= $$ (NUMBER, WHEN, WHO, WHERE, PROCESS, VERSION, WHAT)
$$ ##TITLE= Audit trail, TOPSPIN		Version 2.1
$$ ##JCAMPDX= 5.01
$$ ##ORIGIN= Bruker BioSpin GmbH
$$ ##OWNER= Administrator
$$ $$ C:\Bruker\TOPSPIN/data/COFFEE/nmr/AC1112_Colombia_5835514_o0V20XEKOe/12/pdata/1/auditp.txt
$$ ##AUDIT TRAIL=  $$ (NUMBER, WHEN, WHO, WHERE, PROCESS, VERSION, WHAT)
(   1,<2012-04-03 01:38:49.281 -0500>,<Administrator>,<TOPSPIN>,<go>,<TOPSPIN 2.1>,
      <created by zg
	started at 2012-04-03 01:27:17.187 -0500,
	POWCHK enabled, PULCHK disabled,
       configuration hash MD5:
       1A 1E CE 29 27 FD 77 03 67 4E F0 E3 C4 B2 CB 90
       data hash MD5: 64K
       1C D7 EB 7E 13 6E F1 7B E6 93 FB 94 1C B0 29 6B>)
(   2,<2012-04-03 01:38:52.156 -0500>,<Administrator>,<TOPSPIN>,<proc1d>,<TOPSPIN 2.1>,
      <Start of raw data processing
       efp LB = 0.3 FT_mod = 6 PKNL = 1 PHC0 = 0 PHC1 = 0 SI = 128K 
       data hash MD5: 128K
       B6 9D F1 20 CD E0 6C B1 8B 57 90 A6 DB 00 2E 31>)
(   3,<2012-04-03 01:38:53.671 -0500>,<Administrator>,<TOPSPIN>,<proc1d>,<TOPSPIN 2.1>,
      <pk PHC0 = 35.1178 PHC1 = 0 
       data hash MD5: 128K
       78 A3 FB 77 B0 3C F7 4C 9A A6 3D 75 D3 59 C6 F9>)
(   4,<2012-04-03 01:38:53.968 -0500>,<Administrator>,<TOPSPIN>,<proc1d>,<TOPSPIN 2.1>,
      <abs ABSG = 1 
       data hash MD5: 128K
       33 28 E8 E9 83 74 32 68 06 10 E0 69 9E F9 F5 BA>)
(   5,<2012-04-03 01:38:54.078 -0500>,<Administrator>,<TOPSPIN>,<proc1d>,<TOPSPIN 2.1>,
      <abs ABSG = 2 
       data hash MD5: 128K
       DC 2B 8C 91 03 7B FC 41 F6 50 F0 73 AA 97 43 5A>)
(   6,<2012-04-03 01:38:54.187 -0500>,<Administrator>,<TOPSPIN>,<proc1d>,<TOPSPIN 2.1>,
      <abs ABSG = 3 
       data hash MD5: 128K
       A2 85 E9 EC 1E 1B 32 A0 3D 75 31 14 EE 64 CB FF>)
(   7,<2012-04-03 01:38:54.468 -0500>,<Administrator>,<TOPSPIN>,<proc1d>,<TOPSPIN 2.1>,
      <abs ABSG = 4 
       data hash MD5: 128K
       AC 56 74 D7 B9 A0 BC 75 84 3E 9D FA AC A6 A5 48>)
(   8,<2012-04-03 01:38:54.531 -0500>,<Administrator>,<TOPSPIN>,<proc1d>,<TOPSPIN 2.1>,
      <abs ABSG = 5 
       data hash MD5: 128K
       13 C5 91 FB 4D D2 BA B7 C2 98 51 C3 77 B2 69 24>)
$$ ##END=
$$ 
$$ $$ hash MD5
$$ $$ 10 45 4B 93 F8 83 41 8C AF 17 28 65 B5 A8 85 3A
##$RELAX= 
##$RELAX= 
##$RELAX= 
##$RELAX= 
##$RELAX= 
##$RELAX= 
##$RELAX= 
##$RELAX= 
$$ Bruker specific parameters
$$ [...]
##$TP07= 0
##$TPNAME0= <>
##$TPNAME1= <>
##$TPNAME2= <>
##$TPNAME3= <>
##$TPNAME4= <>
##$TPNAME5= <>
##$TPNAME6= <>
##$TPNAME7= <>
##$TPOAL= (0..7)
0.5 0.5 0.5 0.5 0.5 0.5 0.5 0.5
##$TPOFFS= (0..7)
0 0 0 0 0 0 0 0
##$TUNHIN= 0
##$TUNHOUT= 0
##$TUNXOUT= 0
##$USERA1= <user>
##$USERA2= <user>
##$USERA3= <user>
##$USERA4= <user>
##$USERA5= <user>
##$V9= 5
##$VALIST= <valist>
##$VCLIST= <CCCCCCCCCCCCCCC>
##$VD= 0
##$VDLIST= <DDDDDDDDDDDDDDD>
##$VPLIST= <PPPPPPPPPPPPPPP>
##$VTLIST= <TTTTTTTTTTTTTTT>
##$WBST= 2048
##$WBSW= 25
##$XGAIN= (0..3)
0 0 0 0
##$XL= 0
##$YL= 0
##$YMAX_a= 13463960
##$YMIN_a= -6273462
##$ZGOPTNS= <>
##$ZL1= 120
##$ZL2= 120
##$ZL3= 120
##$ZL4= 120
##$ABSF1= 14.96849
##$ABSF2= -5.584041
##$ABSG= 5
##$ABSL= 3
##$ALPHA= 0
##$AQORDER= 0
##$ASSFAC= 0
##$ASSFACI= 0
##$ASSFACX= 0
##$ASSWID= 0
##$AUNMP= <proc_prof1d_extract.lims>
##$AXLEFT= 0
##$AXNAME= <>
##$AXNUC= <1H>
##$AXRIGHT= 0
##$AXTYPE= 0
##$AXUNIT= <>
##$AZFE= 0.1
##$AZFW= 0.1
##$BCFW= 0
##$BC_mod= 0
##$BYTORDP= 0
##$COROFFS= 0
##$CY= 15
##$DATMOD= 1
##$DC= 0
##$DFILT= <>
##$DTYPP= 0
##$F1P= 0
##$F2P= 0
##$FCOR= 0.5
##$FTSIZE= 131072
##$FT_mod= 6
##$GAMMA= 0
##$GB= 0
##$INTBC= 1
##$INTSCL= 1
##$ISEN= 128
##$LB= 0.3
##$LEV0= 0
##$LPBIN= 0
##$MAXI= 10000
##$MC2= 0
##$MEAN= 0
##$ME_mod= 0
##$MI= 0
##$NCOEF= 0
##$NC_proc= -3
##$NLEV= 6
##$NOISF1= 0
##$NOISF2= 0
##$NSP= 0
##$NTH_PI= 0
##$NZP= 0
##$OFFSET= 14.96849
##$PC= 1
##$PHC0= 35.1178
##$PHC1= 0
##$PH_mod= 1
##$PKNL= yes
##$PPARMOD= 0
##$PPDIAG= 0
##$PPIPTYP= 0
##$PPMPNUM= 2147483647
##$PPRESOL= 1
##$PSCAL= 4
##$PSIGN= 0
##$PYNMP= <proc.py>
##$REVERSE= no
##$SF= 400.13000484888
##$SI= 131072
##$SIGF1= 0
##$SIGF2= 0
##$SINO= 400
##$SIOLD= 131072
##$SPECTYP= <>
##$SREGLST= <1H.CDCl3>
##$SSB= 0
##$STSI= 131072
##$STSR= 0
##$SW_p= 8223.68421052632
##$SYMM= 0
##$S_DEV= 0
##$TDeff= 65536
##$TDoff= 0
##$TI= <>
##$TILT= no
##$TM1= 0
##$TM2= 0
##$TOPLEV= 0
##$USERP1= <user>
##$USERP2= <user>
##$USERP3= <user>
##$USERP4= <user>
##$USERP5= <user>
##$WDW= 1
##$XDIM= 131072
##$YMAX_p= 477184136
##$YMIN_p= -428740092
##$CURPLOT= <Network HP LaserJet P1505>
##$CURPRIN= <$Network HP LaserJet P1505>
##$DFORMAT= <normdp>
##$LAYOUT= <+/1D_H.xwp>
##$LFORMAT= <normlp>
##$PFORMAT= <normpl>
##$SURQMSG= 1
$$ End of Bruker specific parameters
$$ ---------------------------------
##NTUPLES= NMR SPECTRUM
##VAR_NAME=  FREQUENCY,     SPECTRUM/REAL,   SPECTRUM/IMAG
##SYMBOL=    X,             R,               I
##VAR_TYPE=  INDEPENDENT,   DEPENDENT,       DEPENDENT
##VAR_FORM=  AFFN,          ASDF,            ASDF
##VAR_DIM=   131072,        131072,          131072
##UNITS=     HZ,            ARBITRARY UNITS, ARBITRARY UNITS
##FACTOR=    0.0627417313425165, 1,          1
##FIRST=     8223.62146879498, 4928,         -98580
##LAST=      0,             7766,            -97530
##MIN=       0,             -428740092,      0
##MAX=       8223.62146879498, 477184136,    0
$$ Real data points
##PAGE= N=1
##DATA TABLE= (X++(R..R)), XYDATA
$$ [...]
60728A287233n437N6L949M284L162L531N234O002N382N430P553J0738J3473J5747
$$ 1287233 1281796 1281852 1285801 1290085 1293247 1296778 1302012 1308014 1313396 1318826 1326379 1337117 1350590 1366337
60714A366337J8024J9691J9993J9845K0942K3151K4355K3355K1589K1034K1336
$$ 1366337 1384361 1404052 1424045 1443890 1464832 1487983 1512338 1535693 1557282 1578316 1599652
60703A599652K0420J7681J4930J3811J3614J2715J1084R862R000P305M939L898
$$ 1599652 1620072 1637753 1652683 1666494 1680108 1692823 1703907 1713769 1722769 1730074 1735013 1738911
60691A738911N039O347N640L675K764L197L282K440J911K015J139j643m734o113
$$ 1738911 1743950 1750297 1755937 1759612 1762376 1765573 1768855 1771295 1773206 1775221 1776360 1774717 1769983 1763870
60677A763870n846n326n308o051q067j1130j3448j3566j2475j2071j2257j1535
$$ 1763870 1758024 1752698 1747390 1741339 1733272 1722142 1708694 1695128 1682653 1670582 1658325 1646790
60665A646790j0042r599j0490j0558q432n703m563m821m637l120p97J577L246
$$ 1646790 1636748 1627149 1616659 1606101 1597669 1591966 1587403 1582582 1577945 1574825 1574028 1575605 1578851
60652A578851L192J183j274k451k609l302m709n254m126k569k080k666l640m856
$$ 1578851 1582043 1583226 1581952 1579501 1576892 1573590 1568881 1563627 1559501 1556932 1554852 1552186 1548546 1543690
60638A543690o082o170m382j925q15j286j698j050k92p23k284m128o002q085j0063
$$ 1543690 1537608 1531438 1527056 1525131 1524316 1523030 1521332 1520282 1519990 1519267 1516983 1512855 1506853 1498768 1488705
60623A488705j1347j2008j2711j3847j5369j7286j9524k1351k1832k0949j9603
$$ 1488705 1477358 1465350 1452639 1438792 1423423 1406137 1386613 1365262 1343430 1322481 1302878
60612A302878j8255j6400j3770j1254r913r531q855p046m338j459R80K606L409
$$ 1302878 1284623 1268223 1254453 1243199 1233286 1223755 1214900 1207854 1203516 1202057 1203037 1205643 1209052
60599A209052L818M230M516M452M517N614P787R753J0163R023P587P025P548Q504
$$ 1209052 1212870 1217100 1221616 1226068 1230585 1236199 1243986 1253739 1263902 1272925 1280512 1287537 1295085 1303589
60585A303589Q953Q167O041L358J462J271K416L455L237K188K038M018P452J0366
$$ 1303589 1312542 1320709 1326750 1330108 1331570 1332841 1335257 1338712 1341949 1344137 1346175 1350193 1357645 1368011
60571A368011J1550J1672J2225J3748J5473J6656J7637J9274K1557K3440K4112
$$ 1368011 1379561 1391233 1403458 1417206 1432679 1449335 1466972 1486246 1507803 1531243 1555355
60560A555355K3973K4010K4616K5452K6210K6771K6663K5182K2383J9391J7183
$$ 1555355 1579328 1603338 1627954 1653406 1679616 1706387 1733050 1758232 1780615 1800006 1817189
60549A817189J5474J3279J0271P008M041J403j166l990p496j1929j6908k1541
$$ 1817189 1832663 1845942 1856213 1863221 1867262 1868665 1867499 1863509 1856013 1844084 1827176 1805635
60537A805635k5036k7050k7602k7101k6302k5673k4856k3138k0507j7676j5066
$$ 1805635 1780599 1753549 1725947 1698846 1672544 1646871 1622015 1598877 1578370 1560694 1545628
60526A545628j2446r670p175n309l683j749K19J241P89m31j056m21P68J347J243
$$ 1545628 1533182 1523512 1516337 1511028 1507345 1505596 1505815 1507056 1507845 1507414 1506358 1505937 1506705 1508052 1509295
60511A509295J615L100M657M961M465M956P062R392J0389R989R072Q329Q256R167
$$ 1509295 1510910 1514010 1518667 1523628 1528093 1533049 1540111 1549503 1559892 1569881 1578953 1587282 1595538 1604705
60497A604705J0466J0783R684Q355P817P411O252N212N788P628Q949R222R665
$$ 1604705 1615171 1625954 1635638 1643993 1651810 1659221 1665473 1670685 1676473 1684101 1693050 1702272 1711937
60484A711937J1049J2872J5113J8900K4461K9964L3742L6552M0243M4831M8318
$$ 1711937 1722986 1735858 1750971 1769871 1794332 1824296 1858038 1894590 1934833 1979664 2027982
60473B027982M8937M6309M0652L2353K2571J3127N097j955q852j5337k0114k2130
$$ 2027982 2076919 2123228 2163880 2196233 2218804 2231931 2237028 2235073 2226221 2210884 2190770 2168640
60461B168640k1482j9149j6050j2449q152l168J992O649J0479J3613J6311J8667
$$ 2168640 2147158 2128009 2111959 2099510 2091358 2088190 2090182 2096831 2107310 2120923 2137234 2155901
60449B155901K0592K2108K3683K6081K9727L4359L9513M5211N1868N9718O8753
$$ 2155901 2176493 2198601 2222284 2248365 2278092 2312451 2351964 2397175 2449043 2508761 2577514
60438B577514P8984R0213J01855J13669J26540J41635J58789J76624J94399K12715
$$ 2577514 2656498 2746711 2848566 2962235 3088775 3230410 3389199 3565823 3760222 3972937
60428C972937K32199K52691K74364K98378L25422L54262L82528M07892M27103
$$ 3972937 4205136 4457827 4732191 5030569 5355991 5710253 6092781 6500673 6927776
60419F927776M34416M22605L86201L23767K38015J34985K2873q9608j94354k83916
$$ 6927776 7362192 7784797 8170998 8494765 8732780 8867765 8890638 8801030 8606676 8322760
60409H322760l52065l96014m17949m23224m17029m03184l84908l64592l42830
$$ 8322760 7970695 7574681 7156732 6733508 6316479 5913295 5528387 5163795 4820965
60400D820965l19338k95090k72252k51810k32827k14259j96103j78388j60767
$$ 4820965 4501627 4206537 3934285 3682475 3449648 3235389 3039286 2860898 2700131
60391B700131j43745j28740j16043j04245r2722q3084p6648p1796o5709n8048
$$ 2700131 2556386 2427646 2311603 2207358 2114636 2031552 1954904 1883108 1817399 1759351
60381A759351n1037m6244m3075m0402l7866l5188l1752k7725k4463k2861k1907
$$ 1759351 1708314 1662070 1618995 1578593 1540727 1505539 1473787 1446062 1421599 1398738 1376831
60370A376831j9991j7322j5971j7132j9100j8876j5641j1719r735r628r392q120
$$ 1376831 1356840 1339518 1323547 1306415 1287315 1268439 1252798 1241079 1231344 1221716 1212324 1204204
60358A204204o801o179n492m070k700k291k116p19J936M483O070P016P651P677
$$ 1204204 1197403 1191224 1185732 1181662 1178962 1176671 1174555 1173836 1175772 1180255 1186325 1193341 1200992 1208669
60344A208669O993O283O201O473O291N450M784N303O931Q413Q737Q344Q264Q465
$$ 1208669 1215662 1221945 1228146 1234619 1240910 1246360 1251144 1256447 1263378 1271791 1280528 1288872 1297136 1305601
60330A305601Q086P279P227Q003P984O381M819M891N486M466K188J102K077L245
$$ 1305601 1313687 1320966 1328193 1336196 1344180 1350561 1355380 1360271 1365757 1370223 1372411 1373513 1375590 1378835
60316A378835K845J322K1p04j201j575j840k159k287j553J15J864L001L620L783
$$ 1378835 1381680 1383002 1383023 1382319 1381118 1379543 1377703 1375544 1373257 1371704 1371819 1373683 1376684 1380304 1384087
60301A384087L084J633O33J153K952N026O877Q592J0207J1593J2608J2971J2438
$$ 1384087 1387171 1388804 1389437 1390590 1393542 1398568 1405445 1414037 1424244 1435837 1448445 1461416 1473854
60288A473854J1564J1675J3481J5962J7291J6775J5451J4698J4563J3566J0355
$$ 1473854 1485418 1497093 1510574 1526536 1543827 1560602 1576053 1590751 1605314 1618880 1629235
60277A629235N602J811P57J533J909J243Q58J613K639K927K795K959L242L300
$$ 1629235 1634837 1636648 1637405 1638938 1640847 1642090 1642948 1644561 1647200 1650127 1652922 1655881 1659123 1662423
60263A662423L684M869N732M374M59m224p708r567j0536j1169j1300j0666r636
$$ 1662423 1666107 1670976 1676708 1681082 1681541 1677317 1669609 1660042 1649506 1638337 1627037 1616371 1606735
60250A606735r088r405r841r382q108p099o861o737o094n157m166k576q5K202
$$ 1606735 1597647 1588242 1578401 1569019 1560911 1553812 1546951 1540214 1534120 1528963 1524797 1522221 1522136 1524338
60236A524338K759J546Q6l29L08J243J819J781J385J287J764K170J772J128J767
$$ 1524338 1527097 1528643 1528729 1528400 1528708 1529951 1531770 1533551 1534936 1536223 1537987 1540157 1541929 1543057 1544824
60221A544824M255P158Q454P756O703P200R465J1920J2922J2373J1542J1443J1822
$$ 1544824 1549079 1556237 1564691 1572447 1579150 1586350 1595815 1607735 1620657 1633030 1644572 1656015 1667837
60208A667837J1732J0779R604R315J0624J3291J6427J9427K2458K5687K8455L0013
$$ 1667837 1679569 1690348 1699952 1709267 1719891 1733182 1749609 1769036 1791494 1817181 1845636 1875649
60196A875649L0798L2100L4442L7366M1011M6424N3668O0908O6522P1146P6549
$$ 1875649 1906447 1938547 1972989 2010355 2051366 2097790 2151458 2212366 2278888 2350034 2426583
60185B426583Q3192R0249R7443J05426J14437J23851J33084J42024J50476J58190
$$ 2426583 2509775 2600024 2697467 2802893 2917330 3041181 3174265 3316289 3466765 3624955
60175C624955J65347J72155J77891J81182J81248J78251J72512J64281J54097
$$ 3624955 3790302 3962457 4140348 4321530 4502778 4681029 4853541 5017822 5171919
60166E171919J42475J29247J14014R7049P8905N9634L9683K1194O472m971j5881
$$ 5171919 5314394 5443641 5557655 5654704 5733609 5793243 5832926 5854120 5860592 5855621 5839740
60155E839740k7072l5682l8922l7769l5172l1747k5627j6169n417M779J5339K8482
$$ 5839740 5812668 5776986 5738064 5700295 5665123 5633376 5607749 5591580 5586163 5590942 5606281 5634763
60143E634763M4629O1933P8475R3945J09031J23956J37970J49989J59168J64848
$$ 5634763 5679392 5741325 5819800 5913745 6022776 6146732 6284702 6434691 6593859 6758707
60133F758707J66415J63665J57202J48005J36366J21575J02782Q0143N5144K9919
$$ 6758707 6925122 7088787 7245989 7393994 7530360 7651935 7754717 7834860 7890004 7919923
60123G919923O075j6212l7884n9318p9088r4930j05810j12176j14179j11130j03358
$$ 7919923 7925998 7909786 7871902 7812584 7733496 7638566 7532756 7420580 7306401 7195271 7091913
60112G091913r3288q3134p2134n7731l9301j9059Q60K0491M0362N9301P5492Q8778
$$ 7091913 6998625 6915491 6843357 6785626 6746325 6727266 6728126 6748617 6788979 6848280 6923772 7012550
60100G012550J00220J09472J14318J13204J06953R7397Q5389P1162N5732M0645
$$ 7012550 7112770 7222242 7336560 7449764 7556717 7654114 7739503 7810665 7866397 7907042
60090G907042K6681J3918L080m368p718p583m606J438J0636K2116L5283N1130
$$ 7907042 7933723 7947641 7950721 7946353 7938635 7931052 7926446 7927884 7938520 7960636 7995919 8047049
60078H047049P0887R3767J17523J41453J67197J95868K25954K55432K85086L17763
$$ 8047049 8117936 8211703 8329226 8470679 8637876 8833744 9059698 9315130 9600216 9917979
60068I917979L54422L92459M28351M60614M89422N14498N34679N49007N56938
$$ 9917979 10272401 10664860 11093211 11553825 12043247 12557745 13092424 13641431 14198369
60059A4198369N57405N48775N30198N02396M66703M23694L72980L14201K48036
$$ 14198369 14755774 15304549 15834747 16337143 16803846 17227540 17600520 17914721 18162757
60050A8162757J76555J02452K7662m7267j21993j94772k62548l22514l72750m11477
$$ 18162757 18339312 18441764 18469426 18422159 18300166 18105394 17842846 17520332 17147582 16736105
60040A6736105m37090m49597m51085m43754m28128m04041l72694l36673k98162
$$ 16736105 16299015 15849418 15398333 14954579 14526451 14122410 13749716 13413043 13114881
60031A3114881k58023k16465j73823j30923q9369n1190j7538J1778L6776N6170
$$ 13114881 12856858 12640393 12466570 12335647 12246278 12195088 12177550 12189328 12226104 12282274
60021A2282274O8747P5002P5766P0060N6499L6660J4684o948k9112n2896p7106
$$ 12282274 12351021 12426023 12501789 12571849 12628348 12665008 12679692 12672744 12643632 12590736 12513630
60010A2513630j00021j21629j42490j62009j79535j95816k11532k25455k35801
$$ 12513630 12413609 12291980 12149490 11987481 11807946 11612130 11400598 11175143 10939342
60001A0939342k42529k46441k46903k42599k34089k23479k11462j96652j78045
$$ 10939342 10696813 10450372 10203469 9960870 9726781 9503302 9291840 9095188 8917143
59992H917143j56460j33068j08077q1505n4146k7112j075K3811M7887P1794R5399
$$ 8917143 8760683 8627615 8519538 8438033 8383887 8356775 8355700 8379511 8427398 8499192 8594591
59981H594591J17017J34708J48177J58177J64182J64189J57175J44240J26831
$$ 8594591 8711608 8846316 8994493 9152670 9316852 9481041 9638216 9782456 9909287
59972I909287J05186P9298N0350K0152j0156m0225o9864r8697j25809j49377j67505
$$ 9909287 10014473 10093771 10144121 10164273 10154117 10113892 10044028 9945331 9819522 9670145 9502640
59961I502640j79878j87790j92026j91662j85740j75172j61946j46923j29519
$$ 9502640 9322762 9134972 8942946 8751284 8565544 8390372 8228426 8081503 7951984
59952G951984j09343q7182o4273m1308j8302N177K9810N6073Q3566J10935J36846
$$ 7951984 7842641 7755459 7691186 7649878 7631576 7636753 7666563 7722636 7806202 7917137 8053983
59941H053983J61039J84150K06248K25958K41376K51562K56320K54744K45303
$$ 8053983 8215022 8399172 8605420 8831378 9072754 9324316 9580636 9835380 10080683
59932A0080683K27898K04686J77982J48362J15695Q0822M4692O855l3206p3541
$$ 10080683 10308581 10513267 10691249 10839611 10955306 11036128 11080820 11087675 11054469 10980928
59922A0980928j10503j41861j67301j85994j96070j97291j92157j83184j70636
$$ 10980928 10870425 10728564 10561263 10375269 10179199 9981908 9789751 9606567 9435931
59913I435931j54054j34414j13239r0573o5467l8078j0209J5997L9285N9827P9161
$$ 9435931 9281877 9147463 9034224 8943651 8878184 8840106 8829897 8845894 8885179 8945006 9024167
59902I024167R8882J18564J35683J48143J56196J61290J63982J63846J60550J54037
$$ 9024167 9123049 9241613 9377296 9525439 9681635 9842925 10006907 10170753 10331303 10485340
59892A0485340J44396J32530J20373J09452R9748R0742Q2894P7254P4345P4539
$$ 10485340 10629736 10762266 10882639 10992091 11091839 11182581 11265475 11342729 11417074 11491613
59882A1491613P8921Q8576J03462J23040J47604J77805K13082K51631K91885L33188
$$ 11491613 11570534 11659110 11762572 11885612 12033216 12211021 12424103 12675734 12967619 13300807
59872A3300807L75164M17177M58125M95948N27568N49995N61105N58815N40341
$$ 13300807 13675971 14093148 14551273 15047221 15574789 16124784 16685889 17244704 17785045
59863A7785045N03579M48792L77812K92147J93469Q5848k4035j29470k25839l10314
$$ 17785045 18288624 18737416 19115228 19407375 19600844 19686692 19662657 19533187 19307348 18997034
59853A8997034l80901m36315m76118n00628n11111n09882m99382m81015m55490
$$ 18997034 18616133 18179818 17703700 17203072 16691961 16182079 15682697 15201682 14746192
59844A4746192m23990l88035l48367l05174k59457k13059j66956j20646p3780
$$ 14746192 14322202 13934167 13585800 13280626 13021169 12808110 12641154 12520508 12446728
59835A2446728k7528J6234N6429R2866J25308J52880J74140J87340J90920J83937
$$ 12446728 12419200 12435434 12491863 12584729 12710037 12862917 13037057 13224397 13415317 13599254
59825A3599254J66058J37394R8774N1875j522o0116j22125j84002k41246k90846
$$ 13599254 13765312 13902706 14001480 14053355 14051833 13991717 13869592 13685590 13444344 13153498
59815A3153498l32153l65326l89975m05719m13141m13485m07942l97631l83664
$$ 13153498 12821345 12456019 12066044 11660325 11247184 10833699 10425757 10028126 9644462
59806I644462l66723l46982l24863l01420k77586k53527k29224k05303j82795
$$ 9644462 9277739 8930757 8605894 8304474 8026888 7773361 7544137 7338834 7156039
59797G156039j62334j43999j27836j14211j03581r5867r0043q4642p9042p3946
$$ 7156039 6993705 6849706 6721870 6607659 6504078 6408211 6318168 6233526 6154484 6080538
59787F080538p0035o6462o1640n5445m9561m5296m2183l9345l7362l7660m0441
$$ 6080538 6010503 5944041 5882401 5826956 5777395 5732099 5689916 5650571 5613209 5575549 5535108
59776E535108m4259m7706n0856n4748n9661o4144o5842o3448n7886n1412m5712
$$ 5535108 5490849 5443143 5392287 5337539 5277878 5213734 5147892 5084444 5026558 4975146 4929434
59765D929434m1149l7537l4790l2469k9449k4611j7688r210n8Q772J6466K2987
$$ 4929434 4888285 4850748 4815958 4783489 4754040 4729429 4711741 4702531 4702473 4711245 4727711 4750698
59753D750698K9103L5396M1596M7206N2451N8137O4736P1983P9100Q4973Q8405
$$ 4750698 4779801 4815197 4856793 4903999 4956450 5014587 5079323 5151306 5230406 5315379 5403784
59742E403784Q8795Q6614Q2804P7686P0878O2414N3462M5765M0439L7575L6778
$$ 5403784 5492579 5579193 5661997 5739683 5810561 5872975 5926437 5972202 6012641 6050216 6086994
59731F086994L7876M1017M6428N4350O5056P8483R3814J09997J27027J46202J68618
$$ 6086994 6124870 6165887 6212315 6266665 6331721 6410204 6504018 6614015 6741042 6887244 7055862
59720G055862J93908K21114K50348K82445L17059L52463L87571M22785M57791
$$ 7055862 7249770 7470884 7721232 8003677 8320736 8673199 9060770 9483555 9941346
59711I941346M89177N11234N18577N06972M72330M11082L23095K14161R5228k0917
$$ 9941346 10430523 10941757 11460334 11967306 12439636 12850718 13173813 13387974 13483202 13462285
59701A3462285j23011k03494k59688k93635l10048l13240l05525k88404k64652
$$ 13462285 13339274 13135780 12876092 12582457 12272409 11959169 11653644 11365240 11100588
59692A1100588k38217k11656j84485j54986j23327r1770o1701l1826k68L2444
$$ 11100588 10862371 10650715 10466230 10311244 10187917 10096147 10034446 10002620 10002352 10034796
59682A0034796O3949R3351J22467J53214J85065K16224K46667K78577L13630L51164
$$ 10034796 10098745 10192096 10314563 10467777 10652842 10869066 11115733 11394310 11707940 12059104
59672A2059104L89678M29170M70939N15490N61901O09381O58459P10123P64367
$$ 12059104 12448782 12877952 13348891 13864381 14426282 15035663 15694122 16404245 17168612
59663A7168612Q19977Q75162R28008R76950J021222J060320J092329J113465J120329
$$ 17168612 17988589 18863751 19791759 20768709 21789931 22850251 23942580 25056045 26176374
59654B6176374J112608J092938J064490J029880R92351R56483R26650R05143Q92210
$$ 26176374 27288982 28381920 29446410 30476290 31468641 32425124 33351774 34256917 35149127
59645C5149127Q87169Q88576Q93336Q96456Q92230Q76068Q45488P99638P37918
$$ 35149127 36036296 36924872 37818208 38714664 39606894 40482962 41328450 42128088 42866006
59636D2866006O59539N65057M58225L45419K32766J24420K3950o3786j33614j82901
$$ 42866006 43525545 44090602 44548827 44894246 45127012 45251432 45275382 45211596 45077982 44895081
59626D4895081k12200k22734k14204j85909j39300p8092n644P7008J70096K72936
$$ 44895081 44682881 44460147 44245943 44060034 43920734 43842642 43836998 43914006 44084102 44357038
59616D4357038L83385M98909O17028P34539Q47215R50668J040911J113359J161503
$$ 44357038 44740423 45239332 45856360 46590899 47438114 48388782 49429693 50543052 51704555
59607E1704555J177101J151914J079575R56719P83592N64118L05871K0268k77381
$$ 51704555 52881656 54033570 55113145 56069864 56853456 57417574 57723445 57743713 57466332
59598E7466332n69523q39690j075380j268638j415535j516202j574550j596408
$$ 57466332 56896809 56057119 54981739 53713101 52297566 50781364 49206814 47610406
59590D7610406j587419j553095j500305j437222j371751j311075j262796j234567
$$ 47610406 46022987 44469892 42969587 41532365 40160614 38849539 37586743 36352176
59582C6352176j230824j249739j283788j322897j357093j377880j379461j359820
$$ 36352176 35121352 33871613 32587825 31264928 29907835 28529955 27150494 25790674
59574B5790674j320683j266305j202164j133734j065009r97546r31157q65809
$$ 25790674 24469991 23203686 22001522 20867788 19802779 18805233 17874076 17008267
59566A7008267q02553p42591o85941o31613n79054n28876m82027m38734l98715
$$ 17008267 16205714 15463123 14777182 14145569 13566515 13037639 12555612 12116878 11718163
59557A1718163l62077l29283l00170k73735k49197k26760k06966j89990j76037
$$ 11718163 11356086 11026803 10726633 10452898 10203701 9976941 9769975 9579985 9403948
59548I403948j65801j59647j56692j55440j55172j55955j57530j59069j60048
$$ 9403948 9238147 9078500 8921808 8766368 8611196 8455241 8297711 8138642 7978594
59539G978594j60520j60452j59475j57301j53592j47554j38620j27669j16584
$$ 7978594 7818074 7657622 7498147 7340846 7187254 7039700 6901080 6773411 6656827
59530F656827j06238r5883q4811p3603o3053n2899m2579l2415k3018j3943m191
$$ 6656827 6550589 6454706 6369895 6296292 6233239 6180340 6137761 6105346 6082328 6068385 6064194
59519F064194O023J5082K1904K7300L2926L9360M5691N0855N4819N8274O1601
$$ 6064194 6070217 6085299 6107203 6134503 6167429 6206789 6252480 6303335 6358154 6416428 6478029
59508F478029O4673O7747P1943P8371Q7042R7002J07456J18343J30101J43380
$$ 6478029 6542702 6610449 6682392 6760763 6847805 6944807 7052263 7170606 7300707 7444087
59498G444087J58700J75685J92770K08623K24048K41686K63373K88085L12715
$$ 7444087 7602787 7778472 7971242 8179865 8403913 8645599 8908972 9197057 9509772
59489I509772L34556L53047L69664L86176M02556M16489M25279M27903M24811
$$ 9509772 9844328 10197375 10567039 10953215 11355771 11772260 12197539 12625442 13050253
59480A3050253M16341M02630L84721L64036L40365L11879K77769K39769K00535
$$ 13050253 13466594 13869224 14253945 14617981 14958346 15270225 15547994 15787763 15988298
59471A5988298J61857J25192R2422O4608M1052K0977N508l297m751M76J2176L0747
$$ 15988298 16150155 16275347 16367769 16432377 16473429 16494406 16499914 16496617 16491866 16492342 16504518 16535265
59459A6535265N5569Q4579J15562J46856J76554K01834K19204K24932K15808J90691
$$ 16535265 16590834 16675413 16790975 16937831 17114385 17316219 17535423 17760355 17976163 18166854
59449A8166854J51355J00705M0154l0236j08895j91284k71697l45845m11415m67068
$$ 18166854 18318209 18418914 18459068 18428832 18319937 18128653 17856956 17511111 17099696 16632628
59439A6632628n11596n43624n61957n66622n59679n44251n22638m95921m65286
$$ 16632628 16121032 15577408 15015451 14448829 13889150 13344899 12822261 12326340 11861054
59430A1861054m32471l98521l63250l26820k90776k56448k23053j88776j53572
$$ 11861054 11428583 11030062 10666812 10339992 10049216 9792768 9569715 9380939 9227367
59421I227367j19492q7991n8078k7772L395L4250O3877R2745J21720J50751J79052
$$ 9227367 9107875 9019884 8961806 8934034 8937429 8971679 9035556 9128301 9250021 9400772 9579824
59410I579824K06199K32365K57235K79198K96043L06373L10035L07132K96973
$$ 9579824 9786023 10018388 10275623 10554821 10850864 11157237 11467272 11774404 12071377
59401A2071377K78196K49673K11150J63274J07581M6592j6574p9187j39517j96306
$$ 12071377 12349573 12599246 12810396 12973670 13081251 13127843 13111269 13032082 12892565 12696259
59391A2696259k47949k92668l29424l58008l78226l89841l93712l92092l86937
$$ 12696259 12448310 12155642 11826218 11468210 11089984 10700143 10306431 9914339 9527402
59382I527402l78494l66371l51465l35472l18713k99998k79182k58463k40100
$$ 9527402 9148908 8782537 8431072 8095600 7776887 7476889 7197707 6939244 6699144
59373F699144k23771k07322j89753j72282j56423j42010j27583j12267r6812q2745
$$ 6699144 6475373 6268051 6078298 5906016 5749593 5607583 5480000 5367733 5270921 5188176
59363E188176p0706n9863m9032l8073k7775j8634j0331k406N299J2989K0976K9107
$$ 5188176 5117470 5057607 5008575 4970502 4942727 4924093 4913762 4911356 4916655 4929644 4950620 4979727
59351D979727L6655M2962M7396M8739M5919M0153L5232L4504L8148M4271N1904
$$ 4979727 5016382 5059344 5106740 5155479 5201398 5241551 5276783 5311287 5349435 5393706 5445610
59340E445610O1709P4218Q8756J03820J17181J26048J29180J29437J32630J42613
$$ 5445610 5507319 5581537 5670293 5774113 5891294 6017342 6146522 6275959 6408589 6551202
59330F551202J58320J76335J95277K16530K41442K69575K99854L32130L66851
$$ 6551202 6709522 6885857 7081134 7297664 7539106 7808681 8108535 8440665 8807516
59321H807516M04027M43231M84373N27862N73955O22297O71942P21461P68926
$$ 8807516 9211543 9654774 10139147 10667009 11240964 11863261 12535203 13256664 14025590
59312A4025590Q12102Q48685Q76247Q92108Q94007Q81254Q55116Q17905P71990
$$ 14025590 14837692 15686377 16562624 17454732 18348739 19229993 20085109 20903014 21675004
59303B1675004P19669O63280O04957N46614M90271M37310L86732L34978K78928
$$ 21675004 22394673 23057953 23662910 24209524 24699795 25137105 25523837 25858815 26137743
59294B6137743K18616J55724Q9883J8368o0290j44184k30102l16061m00658m81305
$$ 26137743 26356359 26512083 26601966 26620334 26560044 26415860 26185758 25869697 25469039 24987734
59284B4987734n54767o18944o73175p17317p51658p77236p95075q05208q07109
$$ 24987734 24432967 23814023 23140848 22423531 21671873 20894637 20099562 19294354 18487245
59275A8487245q00801p86797p65432p37290p04079o68175o31166n93450n55077
$$ 18487245 17686444 16899647 16134215 15396925 14692846 14024671 13393505 12800055 12244978
59266A2244978n16367m77773m39787m02927l67464l33288l00392k69175k39965
$$ 12244978 11728611 11250838 10811051 10408124 10040660 9707372 9406980 9137805 8897840
59257H897840k12634j87035j63201j40810j19211r8598q0107o3919m8216l1421
$$ 8897840 8685206 8498171 8334970 8194160 8074949 7976351 7896244 7832325 7784109 7752688
59247G752688j4606j50J1655K2847L4744M6319N6019O3641O9695P4045P6136P5949
$$ 7752688 7738082 7737932 7749587 7772434 7807178 7853497 7909516 7973157 8042852 8116897 8193033 8268982
59235H268982P4069P1186O7909O4589O1036N6807N2105M7969M5420M4823M6250
$$ 8268982 8343051 8414237 8482146 8546735 8607771 8664578 8716683 8764652 8810072 8854895 8901145
59224H901145M9951N6123O4487P4423Q5399R7269J10260J24528J39416J53213
$$ 8901145 8951096 9007219 9071706 9146129 9231528 9328797 9439057 9563585 9703001 9856214
59214I856214J63727J68995J67623J59274J45377J28571J10509R0436O6683L9317
$$ 9856214 10019941 10188936 10356559 10515833 10661210 10789781 10900290 10990726 11057409 11096726
59204A1096726J0549j7235m2994o6710q8364j07271j22004j31148j34638j34018
$$ 11096726 11107275 11090040 11047046 10980336 10891972 10784701 10662697 10531549 10396911 10262893
59194A0262893j30853j25407j17541j08026r7815q6722p4441o2477n3244m7164
$$ 10262893 10132040 10006633 9889092 9781066 9683251 9596529 9522088 9459611 9406367 9359203
59184I359203m2418l7868l4439l2857l1763k9329k5538k1502j7292j1800m302
$$ 9359203 9316785 9278917 9244478 9211621 9179858 9150529 9124991 9103489 9086197 9074397 9070095
59173I070095N140J6730L1249M8996O9220R1073J14844J41946J73601K09658K48740
$$ 9070095 9075235 9091965 9123214 9172210 9241430 9332503 9447347 9589293 9762894 9972552 10221292
59162A0221292K89391L30731L71792M10751M45336M73771M94660N06053N05296
$$ 10221292 10510683 10841414 11213206 11623957 12069293 12543064 13037724 13543777 14049073
59153A4049073M89883M58052M08758L42090K60008J66203O4794m0556j46307k48435
$$ 14049073 14538956 14997008 15405766 15747856 16007864 16174067 16238861 16198305 16051998 15803563
59143A5803563l42526m24423m90919n40497n73710n92562n99253n95430n82413
$$ 15803563 15461037 15036614 14545695 14005198 13431488 12838926 12239673 11644243 11061830
59134A1061830n61771n35665n06584m76535m46372m16228l86609l58411l31730
$$ 11061830 10500059 9964394 9457810 8981275 8534903 8118675 7732066 7373655 7041925
59125G041925l05644k79784k55222k33046k12833j93510j75066j58238j42987
$$ 7041925 6736281 6456497 6201275 5968229 5755396 5561886 5386820 5228582 5085595
59116E085595j28441j14184j00645q8419p7933o9222o1266n2348m2104l2342k4509
$$ 5085595 4957154 4842970 4742325 4653906 4575973 4506751 4445485 4393137 4351033 4318691 4294182
59105D294182j7387r086l78O355J1106J6540K4011L1776L8049M3617N0134N7536
$$ 4294182 4276795 4267709 4267331 4273686 4284792 4301332 4325343 4357119 4395168 4438785 4488919 4546455
59093D546455O4565P0796P6834Q3127Q9477R5315J00036J03613J06948J10709
$$ 4546455 4611020 4681816 4758650 4841777 4931254 5026569 5126605 5230218 5337166 5447875
59083E447875J13857J14434J11933J07600J02324R5665Q7256P7617O7104N5651
$$ 5447875 5561732 5676166 5788099 5895699 5998023 6093688 6180944 6258561 6325665 6381316
59073F381316M4045L3853K5289J6848P939M43l496l932k291O62M838R938J5930
$$ 6381316 6425361 6459214 6484503 6501351 6509290 6509733 6506237 6502305 6500014 6500676 6505514 6515452 6531382
59060F531382K3707L4109M6745O0432P4202Q7437R9918J12340J25851J40524J55365
$$ 6531382 6555089 6589198 6635943 6696375 6770577 6858014 6957932 7070272 7196123 7336647 7492012
59049G492012J70175J85959K02793K18882K32868K45717K59024K72485K84261
$$ 7492012 7662187 7848146 8050939 8269821 8502689 8748406 9007430 9279915 9564176
59040I564176K92896K97652K97709K92102K79864K59567K29821J91018J45530
$$ 9564176 9857072 10154724 10452433 10744535 11024399 11283966 11513787 11704805 11850335
59031A1850335R5397M1149j6182p3406j26905j74928k17020k52567k81282l04034
$$ 11850335 11945732 11986881 11970699 11897293 11770388 11595460 11378440 11125873 10844591 10540557
59021A0540557l21675l34016l41255l45154l47121l46280l41165l32397l22039
$$ 10540557 10218882 9884866 9543611 9198457 8851336 8505056 8163891 7831494 7509455
59012G509455l11119k99454k87049k74061k60189k45707k32070k19846k07274
$$ 7509455 7198336 6898882 6611833 6337772 6077583 5831876 5599806 5379960 5172686
59003E172686j93000j78939j67874j59135j49540j38299j27932j20135j13523
$$ 5172686 4979686 4800747 4632873 4473738 4324198 4185899 4057967 3937832 3824309
58994C824309j06140r7830q9274q0793p2940o6619o1837n7772n4498n2934n2703
$$ 3824309 3718169 3620339 3531065 3450272 3377332 3310713 3248876 3191104 3136606 3083672 3030969
58983C030969n1974n0098m8482m7912m6993m4508m1610m0016l9170l7016l2902
$$ 3030969 2978995 2928897 2880415 2832503 2785510 2741002 2699392 2659376 2620206 2583190 2550288
58972B550288k8170k4189k1082j8246j4997j0737n564q79J445J049k31j51J594
$$ 2550288 2522118 2497929 2476847 2458601 2443604 2432867 2427303 2426424 2427869 2428918 2428687 2428536 2430130
58959B430130L348L786L517L798M408M089K894K536L757N057N027M610N517P504
$$ 2430130 2433478 2437264 2440781 2444579 2448987 2453076 2455970 2458506 2462263 2467320 2472347 2476957 2482474 2489978
58945B489978Q992R672J0514J1490J1298R540P473O176N391M580L815L175K345
$$ 2489978 2498970 2508642 2519156 2530646 2541944 2551484 2558957 2565133 2570524 2575104 2578919 2582094 2584439
58932B584439J353P84R04J406K238L808O148Q626J0705J2228J3082J3531J4725
$$ 2584439 2585792 2586576 2587480 2588886 2591124 2594932 2601080 2609706 2620411 2632639 2645721 2659252 2673977
58919B673977J7656K1366K3504K3121K1870K1972K3793K5939K7118K7416K8159
$$ 2673977 2691633 2712999 2736503 2759624 2781494 2803466 2827259 2853198 2880316 2907732 2935891
58908B935891L0627L4572L8237M0353M1672M3632M6080M7683M8268M9128N0852
$$ 2935891 2966518 3001090 3039327 3079680 3121352 3164984 3211064 3258747 3307015 3356143 3406995
58897C406995N2580N3857N5722N9013O2818O5651O7495O9781P3698P9086Q4705
$$ 3406995 3459575 3513432 3569154 3628167 3690985 3756636 3824131 3893912 3967610 4046696 4131401
58886D131401Q9341R2951R6795J02077J08631J15617J23162J32216J42739J53298
$$ 4131401 4220742 4313693 4410488 4512565 4621196 4736813 4859975 4992191 5134930 5288228
58876E288228J62854J71913J81487J91920K03329K16328K31404K48042K65251
$$ 5288228 5451082 5622995 5804482 5996402 6199731 6416059 6647463 6895505 7160756
58867G160756K82988L02539L25211L50713L77099M02883M29043M58080M91041
$$ 7160756 7443744 7746283 8071494 8422207 8799306 9202189 9631232 10089312 10580353
58858A0580353N26738N64324O04852O48932O94560P39381P84008Q30428Q77720
$$ 10580353 11107091 11671415 12276267 12925199 13619759 14359140 15143148 15973576 16851296
58849A6851296R22142R61452R96004J024680J042428J043584J025781R88932R31934
$$ 16851296 17773438 18734890 19730894 20755574 21798002 22841586 23867367 24856299 25788233
58840B5788233Q52284P48363O20859M72720L09103J36960l6485k04935l62837
$$ 25788233 26640517 27388880 28009739 28482459 28791562 28928522 28892037 28687102 28324265
58831B8324265n05064o27799p29354q09613q69159r09271r32040r39783r34734
$$ 28324265 27819201 27191402 26462048 25652435 24783276 23874005 22941965 22002182 21067448
58822B1067448r19439q96615q68105q34556p96591p55868p14594o74396o35748
$$ 21067448 20148009 19251394 18383289 17548733 16752142 15996274 15281680 14607284 13971536
58813A3971536n98245n61634n26992m96310m70083m45919m20778l94174l67825
$$ 13971536 13373291 12811657 12284665 11788355 11318272 10872353 10451575 10057401 9689576
58804I689576l42777l18723k95868k75175k56414k38053k19592k02067j85728
$$ 9689576 9346799 9028076 8732208 8457033 8200619 7962566 7742974 7540907 7355179
58795G355179j69398j52891j37838j24934j12486r9166q6084p4423o2845m9435
$$ 7355179 7185781 7032890 6895052 6770118 6657632 6558466 6472382 6397959 6335114 6285679
58785F285679l4825k1154q868L188J5196K6282L6735M8204O1324P4890Q7721J00008
$$ 6285679 6250854 6229700 6220832 6224020 6239216 6265498 6302233 6350437 6411761 6486651 6574372 6674380
58773F674380J12370J24787J37188J50349J65396J82457K00135K16721K32116
$$ 6674380 6786750 6911537 7048725 7199074 7364470 7546927 7747062 7963783 8195899
58764H195899K48319K67444K89580L13329L38152L64750L93098M21910M50899
$$ 8195899 8444218 8711662 9001242 9314571 9652723 10017473 10410571 10832481 11283380
58755A1283380M82054N17524N57331O00116O44986O91451P38524P85247Q31343
$$ 11283380 11765434 12282958 12840289 13440405 14085391 14776842 15515366 16300613 17131956
58746A7131956Q76143R17299R51523R75889R87558R83251R60254R17283Q53122
$$ 17131956 18008099 18925398 19876921 20852810 21840368 22823619 23783873 24701156 25554278
58737B5554278P65417O52571N16684L63312J98652K8198j42149l05559m55677
$$ 25554278 26319695 26972266 27488950 27852262 28050914 28079112 27936963 27631404 27175727
58728B7175727n88075p00351p91530q61602r11325r42441r57903r61071r54153
$$ 27175727 26587652 25887301 25095771 24234169 23322844 22380403 21422500 20461429 19507276
58719A9507276r38045r13844q83562q48972q11037p71211p31932o94607o58244
$$ 19507276 18569231 17655387 16771825 15922853 15111816 14340605 13608673 12914066 12255822
58710A2255822o21388n84469n48902n14961m82206m51247m23184l97699l73271
$$ 12255822 11634434 11049965 10501063 9986102 9503896 9052649 8629465 8231766 7858495
58701G858495l49099l25536l02991k81798k62610k45444k28907k12051j96315
$$ 7858495 7509396 7183860 6880869 6599071 6336461 6091017 5862110 5650059 5453744
58692E453744j83548j72647j60632j47156j35231j26702j19544j10995j01414
$$ 5453744 5270196 5097549 4936917 4789761 4654530 4527828 4408284 4297289 4195875
58683D195875r3263q7612q3329p8947p3798o7854o1760n6808n3868n2471n1510
$$ 4195875 4102612 4015000 3931671 3852724 3778926 3711072 3649312 3592504 3538636 3486165 3434655
58672C434655n0364m8863m6841m4568m2988m2580m2419m1528m0585m1084m3024
$$ 3434655 3384291 3335428 3288587 3244019 3201031 3158451 3116032 3074504 3033919 2992835 2949811
58661B949811m4839m5725m6625m8418n0525n2027n3045n3941n4178n3312n2343
$$ 2949811 2904972 2859247 2812622 2764204 2713679 2661652 2608607 2554666 2500488 2447176 2394833
58650B394833n2458n2738n0911m6506m1588l7935l5255l2931l1642l1877l2331
$$ 2394833 2342375 2289637 2238726 2192220 2150632 2112697 2077442 2044511 2012869 1980992 1948661
58639A948661l1740l1160l2288l4121l3803l0874k8274k8355k9755k9484k6740
$$ 1948661 1916921 1885761 1853473 1819352 1785549 1754675 1726401 1698046 1668291 1638807 1612067
58628A612067k3231k0564j8708j6891j4941j3355j2361j1292r277o545m352l134
$$ 1612067 1588836 1568272 1549564 1532673 1517732 1504377 1492016 1480724 1471447 1464902 1460550 1457416
58616A457416j568J638N735Q935J0730J1768J1846R957O415L089J071l89k145
$$ 1457416 1455848 1457486 1463221 1472156 1482886 1494654 1506500 1516457 1522872 1525961 1527032 1526643 1524498
58603A524498l827m808n195n296n214n333o031o751o586n906n771n630l639K17
$$ 1524498 1520671 1515863 1510668 1505372 1500158 1494825 1488794 1482043 1475457 1469551 1463780 1458150 1454511 1454728
58589A454728L376M114L898N161Q304J2181J6008J9446K1895K3117K3978K5675
$$ 1454728 1458104 1462218 1466116 1471277 1479581 1491762 1507770 1527216 1549111 1572228 1596206 1621881
58577A621881K8741L3020L7646M1010M2364M3557M7233N3014N7778O0384O3425
$$ 1621881 1650622 1683642 1721288 1762298 1804662 1848219 1895452 1948466 2006244 2066628 2130053
58566B130053O9041P5718Q1214Q6249R2982J01654J11128J21325J32722J44626
$$ 2130053 2199094 2274812 2356026 2442275 2535257 2636911 2748039 2869364 3002086 3146712
58556C146712J56278J68582J82767J98223K13672K29366K45904K61767K74450
$$ 3146712 3302990 3471572 3654339 3852562 4066234 4295600 4541504 4803271 5077721
58547E077721K83466K89963K93588K91765K82041K63431K35647J98648J53311
$$ 5077721 5361187 5651150 5944738 6236503 6518544 6781975 7017622 7216270 7369581
58538G369581J01673M6559q615o0561j07510j49056j84187k10860k28458k38971
$$ 7369581 7471254 7517813 7509198 7448637 7341127 7192071 7007884 6797024 6568566 6329595
58528F329595k44554k45510k41980k35633k27880k18096k05502j91320j77167
$$ 6329595 6085041 5839531 5597551 5361918 5134038 4915942 4710440 4519120 4341953
58519D341953j62953j48401j34993j24095j14627j04934r5591q8134q2385p7401
$$ 4341953 4179000 4030599 3895606 3771511 3656884 3551950 3456359 3368225 3285840 3208439
58509C208439p3524p1129o8910o5977o3886o3759o3239n9640n4367n0643m8376
$$ 3208439 3134915 3063786 2994876 2928899 2865013 2801254 2738015 2678375 2624008 2573365 2524989
58498B524989m5395m2436m2249m4358m5450m4992m5817m8530m9917m8151m5529
$$ 2524989 2479594 2437158 2394909 2350551 2305101 2260109 2214292 2165762 2115845 2067694 2022165
58487B022165m4370m3705m1828l9188l6982l5254l3905l3324l2877l0871k7111
$$ 2022165 1977795 1934090 1892262 1853074 1816092 1780838 1746933 1713609 1680732 1649861 1622750
58476A622750k3475k1175j9495j7819j6605j5728j4189j2164j1069j0941j0134
$$ 1622750 1599275 1578100 1558605 1540786 1524181 1508453 1494264 1482100 1471031 1460090 1449956
58465A449956q216o633n935m988l638l415m666n734o030p071r288j0687j0277
$$ 1449956 1441740 1435107 1429172 1424184 1420546 1417131 1412465 1406731 1400701 1393630 1384342 1373655 1363378
58452A363378j0067j1745j3850j4221j3285j2800j3043j3200j3145j3089j2636
$$ 1363378 1353311 1341566 1327716 1313495 1300210 1287410 1274367 1261167 1248022 1234933 1222297
58441A222297j1667j0951j0753j0033q144o038m721l911l100k571k352j688n52
$$ 1222297 1210630 1199679 1188926 1178893 1170749 1164711 1159990 1156079 1152979 1150408 1148056 1146368 1145816
58428A145816k74j629l528m509m277l213j705o39r93k234k574j361J51Q15P46
$$ 1145816 1145542 1143913 1140385 1135876 1131599 1128386 1126681 1126042 1125049 1122815 1120241 1118880 1119031 1119846 1120592
58413A120592K03q46j602r59M11N20q31j536m50R96J218L66q75k153k273L24M764
$$ 1120592 1120795 1119949 1118347 1117388 1117799 1118319 1117488 1115952 1115502 1116498 1117716 1118082 1117207 1115054 1112781 1113105 1117869
58396A117869P806P900P124P761R104R129P467N139L000J559R89L46j609m188
$$ 1117869 1125675 1133575 1140699 1148460 1157564 1166693 1174160 1179299 1182299 1183858 1184847 1185193 1183584 1179396
58382A179396n247m455l887m709n661n705n624n926n629m389l496l589l771l977
$$ 1179396 1174149 1169694 1165807 1161098 1155437 1149732 1144108 1138182 1132553 1128164 1124668 1121079 1117308 1113331
58368A113331n427p578p695n147l065l688m981m205k081q15l52N34J489J632J697
$$ 1113331 1107904 1100326 1092631 1087484 1084419 1080731 1075750 1071545 1069464 1068649 1068297 1068831 1070320 1071952 1073649
58353A073649K688L958M877O614R958J3050J3845J3263J3542J4825J5799J6267
$$ 1073649 1076337 1080295 1085172 1091786 1101744 1114794 1128639 1141902 1155444 1170269 1186068 1202335
58341A202335J6583J5898J3497J0918J0328J1470J2295J1769J0146P407L571j66
$$ 1202335 1218918 1234816 1248313 1259231 1269559 1281029 1293324 1305093 1315239 1322646 1326217 1326051
58329A326051k369k949k597j601m80m01j535k291j666r89j694k965l367l335l973
$$ 1326051 1323682 1320733 1318136 1316535 1316055 1315654 1314119 1311828 1310162 1309173 1307479 1304514 1301147 1297812 1293839
58314A293839m598l736j701j02P36K072M691P867J0279J1173J0948J0928J1939
$$ 1293839 1289241 1285505 1283804 1283702 1284438 1286510 1291201 1299068 1309347 1320520 1331468 1342396 1354335
58301A354335J3191J3589J3630J4260J4463J2627J0059R914J2175J3160J0972
$$ 1354335 1367526 1381115 1394745 1409005 1423468 1436095 1446154 1456068 1468243 1481403 1492375
58290A492375Q010O825O871P067P994R497R414P117N334N991P045O035M048L437
$$ 1492375 1500385 1507210 1514081 1521148 1529142 1538639 1548053 1555170 1560504 1566495 1573540 1579575 1583623 1587060
58276A587060M107M728N573P467R763J1610J3385J5149J5888J5866J7098J9851
$$ 1587060 1591167 1595895 1601468 1608935 1618698 1630308 1643693 1658842 1674730 1690596 1707694 1727545
58264A727545K1629K1355K1234K2486K2991K1677K1326K3942K7022K7845K7878
$$ 1727545 1749174 1770529 1791763 1814249 1837240 1858917 1880243 1904185 1931207 1959052 1986930
58253A986930K9233L0212K8593K6285K6263K7414K6833K5134K5088K6669K7567
$$ 1986930 2016163 2046375 2074968 2101253 2127516 2154930 2181763 2206897 2231985 2258654 2286221
58242B286221K7307K7208K7477K7530K7880K8918K9491K9201L0023L3143L6580
$$ 2286221 2313528 2340736 2368213 2395743 2423623 2452541 2482032 2511233 2541256 2574399 2610979
58231B610979L8491M0084M2618M4497M4383M4180M5772M7842M8982N0727N4286
$$ 2610979 2649470 2689554 2732172 2776669 2821052 2865232 2911004 2958846 3007828 3058555 3112841
58220C112841N7709N9514O1582O5096O7597O7763O8899P3587P9068Q2305Q5251
$$ 3112841 3170550 3230064 3291646 3356742 3424339 3492102 3561001 3634588 3713656 3795961 3881212
58209C881212R0322R5028R6337R6401R8582J01761J03836J06880J13192J20274
$$ 3881212 3971534 4066562 4162899 4259300 4357882 4459643 4563479 4670359 4783551 4903825
58199D903825J25506J31803J42717J55814J67100J77888J90995K04162K14051
$$ 4903825 5029331 5161134 5303851 5459665 5626765 5804653 5995648 6199810 6413861
58190F413861K22950K34810K48228K60009K71802K86567L02478L17134L33462
$$ 6413861 6636811 6871621 7119849 7379858 7651660 7938227 8240705 8557839 8891301
58181H891301L54347L75966L94017M11986M35518M63244M90971N19936N52685
$$ 8891301 9245648 9621614 10015631 10427617 10863135 11326379 11817350 12337286 12889971
58172A2889971N86253O18189O53738O97547P44164P86799Q29727Q81421R41395
$$ 12889971 13476224 14094413 14748151 15445698 16189862 16976661 17806388 18687809 19629204
58163A9629204J004915J074297J153282J236416J317169J400887J496707J603072
$$ 19629204 20634119 21708416 22861698 24098114 25415283 26816170 28312877 29915949
58155B9915949J715340J840923J991025K163133K347193K542888K755014K980348
$$ 29915949 31631289 33472212 35463237 37626370 39973563 42516451 45271465 48251813
58147D8251813L218239L486966L809534M191166M632941N159587N808668O598902
$$ 48251813 51470052 54957018 58766552 62957718 67590659 72750246 78558914 85157816
58139H5157816P535466Q639636R944872J1469907J3222243J5210112J7407585
$$ 85157816 92693282 101332918 111277790 122747697 135969940 151180052 168587637
58132A68587637J9726309K2095292K4586594K7383223L0518971L3561075L5460317
$$ 168587637 188313946 210409238 234995832 262379055 292898026 326459101 361919418
58125C61919418L4713524K9927633K0682674Q169043n074725j6363038k4126944
$$ 361919418 396632942 426560575 447243249 455412292 450337567 433974529 409847585
58118D09847585k8278101k9626194k9116297k7491543k5310502k2987593k0772005
$$ 409847585 381569484 351943290 322826993 295335450 270024948 247037355 226265350
58111B26265350j8765057j6983595j5398152j3947782j2573287j1245576r950242
$$ 226265350 207500293 190516698 175118546 161170764 148597477 137351901 127401659
58104A27401659q661876p358501o054653m802228l660895k676832j888748j354930
$$ 127401659 118739783 111381282 105326629 100524401 96863506 94186674 92297926 90942996
58096I0942996j173115j441299k148543l097551l981729m574227m837519m858063
$$ 90942996 89769881 88328582 86180039 83082488 79100759 74526532 69689013 64830950
58088F4830950m723245m484397m188483l883347l591754l312865l048254k803987
$$ 64830950 60107705 55623308 51434825 47551478 43959724 40646859 37598605 34794618
58080C4794618k573850k345955k124330j924081j747960j586505j438331j311478
$$ 34794618 32220768 29874813 27750483 25826402 24078442 22491937 21053606 19742128
58072A9742128j205749j110907j022484r44357q75971q10976p48709o94284o47151
$$ 19742128 18536379 17425472 16402988 15458631 14582660 13771684 13022975 12328691 11681540
58063A1681540o01063n55163n14340m79010m44759m11414l82821l58506l34959
$$ 11681540 11080477 10525314 10010974 9531964 9087205 8675791 8292970 7934464 7599505
58054G599505l14035l00864k94176k87350k78038k68576k58427k44858k29975
$$ 7599505 7285470 6984606 6690430 6403080 6125042 5856466 5598039 5353181 5123206
58045E123206k18803k11191k03019j93916j86288j78596j67450j54748j45046
$$ 5123206 4904403 4693212 4490193 4296277 4109989 3931393 3763943 3609195 3464149
58036C464149j37508j28050j17551j09907j03860r5092q5045p9184p7326p4074
$$ 3464149 3326641 3198591 3081040 2971133 2867273 2772181 2687136 2607952 2530626 2456552
58026B456552o8319o4186o2710o0492n6895n5055n5286n4348n1679m9813m8588
$$ 2456552 2388233 2324047 2261337 2200845 2143950 2088895 2033609 1979261 1927582 1877769 1829181
58015A829181m5403m1173l9446l9588l7490l3077l0650l1330l1514k9323k6528
$$ 1829181 1783778 1742605 1703159 1663571 1626081 1593004 1562354 1531024 1499510 1470187 1443659
58004A443659k3751j9689j5437j3753j3729j1909q880q703j1650j3508j2716j2117
$$ 1443659 1419908 1400219 1384782 1371029 1357300 1345391 1336511 1327808 1316158 1302650 1289934 1277817
57992A277817j2932j2942j1579j1231j2321j2465j1408j1619j3053j2620r787
$$ 1277817 1264885 1251943 1240364 1229133 1216812 1204347 1192939 1181320 1168267 1155647 1145860
57981A145860p621p303o745n496n769p507p579n171l034k160k48L096M619K718
$$ 1145860 1138239 1130936 1124191 1118695 1112926 1105419 1097840 1092669 1089635 1087475 1087227 1090323 1094942 1097660
57967A097660P1q86j053j780k649l559n325p127o987n502n374o783p264o476o676
$$ 1097660 1097731 1096845 1095792 1094012 1091363 1087804 1082479 1075352 1068365 1062863 1057489 1050706 1043442 1036966 1030290
57952A030290q067q405p818q983j1545j1659q496n977o333p005n963n058n585
$$ 1030290 1022223 1013818 1006000 997017 985472 973813 965317 959340 953007 946002 940039 934981 929396
57939I29396n396l226j488j753j582R11L106J948j193l003k900k216j198K55R26
$$ 929396 924000 920774 919286 917533 915951 916862 919968 921916 920723 917720 914820 912604 911406 911661 912587
57924I12587J1j188j308q83o73j44Q20R69k0o12k45n68k318l563k920j988k662
$$ 912587 912598 911410 910102 909219 908546 908402 909222 910191 910171 909559 909314 908746 906428 902865 899945 897957 895295
57907H95295m210n015n185n636o338p045q075r036q614o775n216m797m641m514
$$ 895295 891085 886070 880885 875249 868911 861866 853791 844755 836141 829366 824150 819353 814712 810198
57893H10198n438p033p099n193l750m233m983m502l941m342m251k378k13L97J36
$$ 810198 804760 797727 790628 785435 781685 777452 772469 767967 764026 759684 755433 753055 752842 753239 753375
57878G53375M47Q48L38l37m3O13M58l62j511l767p408j0646j1651j0918j0043
$$ 753375 753822 754670 755008 754671 754628 755241 755699 755337 753826 750059 742651 732005 720354 709436 699393
57863F99393r376q388p076n560l572j524p58j455j799n08J345K261K562L336M525
$$ 699393 690017 681629 674553 668993 665421 663897 663139 661684 659885 659377 660722 662983 665545 668881 673406
57848F73406N492O218O702O483N766N726O606O965N863M343L740L895M034L979
$$ 673406 678898 685116 691818 698301 704067 709793 716399 723364 729227 733570 737310 741205 745239 749218
57834G49218L566K299M07j141k326m191o697q317q412q153q453q903r221r635
$$ 749218 752784 755083 755490 754349 752023 747832 741135 732818 724406 716253 707800 698897 689676 680041
57820F80041r370p262m401l395m275m212k319j271k588l857k799q76o8R18M118
$$ 680041 670671 663409 659008 655613 651338 647126 644807 643536 640948 637091 634292 633416 633348 634266 638384
57805F38384Q205J0199R690Q598Q040P967Q478R210Q700O442M117K949J698o78
$$ 638384 646589 656788 666478 675076 683116 691083 699561 708771 717471 723913 728030 730979 732677 731999
57791G31999k603k613k252l409m855m778m792p479j1286j2099r444p129p460q585
$$ 731999 729396 726783 724531 721122 716267 711489 706697 699218 687932 675833 666389 659260 651800 643215
57777F43215q298p185o711o740o329n308m031k832k352l198m921o396p348q297
$$ 643215 634917 627732 621021 614281 607952 602644 598613 595781 593429 590231 585310 578914 571566 563269
57763E63269r115r003q055p526q194r443j0222j0194r907j0230j1375j2004j0110
$$ 563269 554154 545151 537096 529570 521376 511933 501711 491517 481610 471380 460005 448001 437891
57750D37891n594j198J86j353l264l627k621j389m92M98K348M940O710O260M562
$$ 437891 432297 431099 431285 429932 426668 423041 420420 419031 418539 419037 421385 426325 433035 439295 443857
57735D43857M101N424O328N296L800L822M777M760L594K697K721L060L188L173
$$ 443857 447958 453382 459710 465006 468806 472628 477405 482165 485759 488456 491177 494237 497425 500598
57721E00598L223L644M526M809K882r80m222n090m731n045o183p393q646r620
$$ 500598 503821 507465 511991 516800 519682 518702 514480 509390 504659 499614 493431 486038 477392 467772
57707D67772q892o099l451l000l722l404k062j230j056n38K82O93J134K294L199
$$ 467772 458880 452781 449330 446330 442608 439204 437142 435912 434856 434318 434600 435293 436427 438721 441920
57692D41920K480R91R20K753N132P072Q395Q711Q027P609Q093P843N489K983L297
$$ 441920 444400 445391 446311 449064 454196 461268 469663 478374 486401 494010 502103 509946 515435 518418 521715
57677E21715N901P572P219O688O929O745N723N296O110O947P095P415Q246Q619
$$ 521715 527616 535188 542407 549095 556024 562769 568492 573788 579898 586845 593940 601355 609601 618220
57663F18220Q404R055J1144J3074J3348J2536J2109J2822J4853J8047K1206K2574
$$ 618220 626624 635679 646823 659897 673245 685781 697890 710712 725565 743612 764818 787392
57651G87392K1817K0540K0398K1680K3802K5895K6964K6879K7258K9849L4128
$$ 787392 809209 829749 850147 871827 895629 921524 948488 975367 1002625 1032474 1066602
57640A066602L8023M0821M3550M6728M9824N3011N7232O2311O7153P1978P8065
$$ 1066602 1104625 1145446 1188996 1235724 1285548 1338559 1395791 1458102 1525255 1597233 1675298
57629A675298Q5070R1251R6904J04714J15697J27609J38878J51328J66973J84369
$$ 1675298 1760368 1851619 1948523 2053237 2168934 2296543 2435421 2586749 2753722 2938091
57619B938091K00591K15228K29998K45521K60580K73785K83916K89189K87969
$$ 2938091 3138682 3353910 3583908 3829429 4090009 4363794 4647710 4936899 5224868
57610E224868K79868K64818K41579K08508J65270J12602N1368j6191q4576j46253
$$ 5224868 5504736 5769554 6011133 6219641 6384911 6497513 6548881 6532690 6448114 6301861
57600F301861j95456k30215k51217k60269k60094k54067k44911k33772k20826
$$ 6301861 6106405 5876190 5624973 5364704 5104610 4850543 4605632 4371860 4151034
57591D151034k06544j92035j78221j64881j50873j35647j20461j07414r7096q7756
$$ 4151034 3944490 3752455 3574234 3409353 3258480 3122833 3002372 2894958 2797862 2710106
57581B710106p7207o5083n2929m2476l4206k7220k0134j2240m008L810J1441J9947
$$ 2710106 2632899 2567816 2514887 2472411 2438205 2410985 2390851 2378611 2374603 2378413 2389854 2409801
57569B409801K9724L9766M8826N6893O5134P4644Q5545R7073J08310J18887J29259
$$ 2409801 2439525 2479291 2528117 2585010 2650144 2724788 2810333 2907406 3015716 3134603 3263862
57558C263862J40124J51553J62675J72195J79028J82474J81895J76342J64661
$$ 3263862 3403986 3555539 3718214 3890409 4069437 4251911 4433806 4610148 4774809
57549D774809J46150J20997Q9854N3441J3331k7282o4939r8169j27167j51271
$$ 4774809 4920959 5041956 5131810 5185251 5198582 5171300 5106361 5008192 4881025 4729754
57539D729754j68576j78868j84860j89002j90599j87923j81853j75168j68914
$$ 4729754 4561178 4382310 4197450 4008448 3817849 3629926 3448073 3272905 3103991
57530C103991j61812j53063j43663j34759j26400j18182j09832j01085r2258q4817
$$ 3103991 2942179 2789116 2645453 2510694 2384294 2266112 2156280 2055195 1962937 1878120
57520A878120p9927p6519p2112o5589n8055n1226m6232m3460m2020l9716l5222
$$ 1878120 1798193 1721674 1649562 1583973 1525918 1474692 1428460 1385000 1342980 1303264 1268042
57509A268042l0005k6497k4841k3269k1124j9272j7821j5875j3600j2049j0823
$$ 1268042 1238037 1211540 1186699 1163430 1142306 1123034 1105213 1089338 1075738 1063689 1052866
57498A052866q356m817k144p72R96L746N849O513P190Q795J0299J1487J4308J9505
$$ 1052866 1044510 1039693 1037549 1036777 1037773 1041519 1047368 1053881 1061071 1069866 1080165 1091652 1105960 1125465
57484A125465K4453K6658K7245K8692L1064L3026L4877L7790M1366M4632M8525
$$ 1125465 1149918 1176576 1203821 1232513 1263577 1296603 1331480 1369270 1410636 1455268 1503793
57473A503793N4674O2180O8377P2572P6791Q2789R0356R8708J07556J16456J24645
$$ 1503793 1558467 1620647 1689024 1761596 1838387 1921176 2011532 2110240 2217796 2334252 2458897
57462B458897J31826J38065J42867J45341J45100J41925J34899J23005J06219
$$ 2458897 2590723 2728788 2871655 3016996 3162096 3304021 3438920 3561925 3668144
57453C668144Q4960N9214K9592j299l0238n5922p8668r8125j13129j23624j30667
$$ 3668144 3753104 3812318 3841910 3840611 3810373 3754451 3675783 3577658 3464529 3340905 3210238
57442C210238j34357j33808j29692j24813j21017j16999j10449j01388r2126q4525
$$ 3210238 3075881 2942073 2812381 2687568 2566551 2449552 2339103 2237715 2145589 2061064
57432B061064p8424p2576o6147n9128n1834m4365l6621k8841k1804j6229j1990
$$ 2061064 1982640 1910064 1843917 1784789 1732955 1688590 1651969 1623128 1601324 1585095 1573105
57421A573105q194l881J421P452J3237J7825K1468K5557L0773L5934L9551M2134
$$ 1573105 1564911 1561030 1562451 1569903 1583140 1600965 1622433 1647990 1678763 1714697 1754248 1796382
57409A796382M5903N2251O0455O8980P7050Q4780R2565J00711J09151J17176J23686
$$ 1796382 1842285 1894536 1954991 2023971 2101021 2185801 2278366 2379077 2488228 2605404 2729090
57398B729090J27727J28360J24397J15060J00945Q3342O2490L7440Q183k2905
$$ 2729090 2856817 2985177 3109574 3224634 3325579 3408921 3471411 3508851 3517034 3494129
57388C494129n2444p8350j00077j17268j29460j37237j42390j46030j47217j44446
$$ 3494129 3441685 3363335 3263258 3145990 3016530 2879293 2736903 2590873 2443656 2299210
57378B299210j38283j31340j25389j19750j13220j06420j00776r5921q9940q2410
$$ 2299210 2160927 2029587 1904198 1784448 1671228 1564808 1464032 1368111 1278171 1195761
57368A195761p5304p0186o6029o1057n5561n1284m8617m6026m2357l8245l4832
$$ 1195761 1120457 1050271 984242 923185 867624 816340 767723 721697 679340 641095 606263
57357F06263l2040k8941k5435k2768k2184k3183k3652k1983j8963j6875j6739
$$ 606263 574223 545282 519847 497079 474895 451712 428060 406077 387114 370239 353500
57346C53500j7224j6604j4870j3220j2183j1419j0863j0853j1038j0368q529o523
$$ 353500 336276 319672 304802 291582 279399 267980 257117 246264 235226 224858 216329 209806
57334B09806n332m660l725k723k634l612m411l933k778k541l701m939m869l873
$$ 209806 204474 199814 196089 193366 190732 187120 182709 178776 175998 173457 169756 164817 159948 156075
57320A56075l447m044m467l609k053j387k207l363l243j591J98N26q16k664l839
$$ 156075 152628 148584 144117 140508 138455 137068 134861 131498 128255 126664 126862 127388 126572 123908 120069
57305A20069m005l345k178j244j418k493l041k254j166j045j357p59N09R67L72
$$ 120069 116064 112719 110541 109297 107879 105386 102345 100091 98925 97880 96523 95764 96273 97240 97612
57290I7612P2P60J635K076K352K168N10k155l328j402K260N379P445Q992R630
$$ 97612 97684 98444 100079 102155 104507 106675 107185 105030 101702 100300 102560 107939 115384 124376 134006
57275A34006Q771P424P299Q537R908J0985J2411J4208J5425J5633J5481J5592
$$ 134006 142777 150201 157500 166037 175945 186930 199341 213549 228974 244607 260088 275680
57263B75680J6019J6880J8341J9803K0150J9183J7949J7464J7803J8617J9653
$$ 275680 291699 308579 326920 346723 366873 386056 404005 421469 439272 457889 477542
57252D77542K0542K0848K0652K0556K0896K1464K2040K2640K3161K3399K3585
$$ 477542 498084 518932 539584 560140 581036 602500 624540 647180 670341 693740 717325
57241G17325K4251K5469K6717K7659K8432K9101K9423K9452K9790L0830L2058
$$ 717325 741576 767045 793762 821421 849853 878954 908377 937829 967619 998449 1030507
57230A030507L2556L2087L1513L2084L4276L7116L8903L8878L8107L8310L9944
$$ 1030507 1063063 1095150 1126663 1158747 1193023 1230139 1269042 1307920 1346027 1384337 1424281
57219A424281M1867M2826M2645M1781M0353L8039L4768L1023K7353K3820J9971
$$ 1424281 1466148 1508974 1551619 1593400 1633753 1671792 1706560 1737583 1764936 1788756 1808727
57208A808727J5311R683L339l087q441j1355j1264r211p124o094n711n137m166
$$ 1808727 1824038 1833721 1837060 1833973 1825532 1814177 1802913 1793702 1786578 1780484 1774773 1769636 1765470
57195A765470k930j213J084L135L600K067m04k305k912k399j144P45L415P144
$$ 1765470 1762540 1761327 1762411 1765546 1769146 1771213 1770809 1768504 1765592 1763193 1762049 1762794 1766209 1773353
57181A773353J2353J9312K7472L5241M1077M4933M8144N1500N4060N4488N2900
$$ 1773353 1785706 1805018 1832490 1867731 1908808 1953741 2001885 2053385 2107445 2161933 2214833
57170B214833N0514M7738M3778L8212L1890K5932K0825J6819J4323J3312J3061
$$ 2214833 2265347 2313085 2356863 2395075 2426965 2452897 2473722 2490541 2504864 2518176 2531237
57159B531237J3229J4426J7051K0138K2414K4178K7103L2085L8186M3901M8780
$$ 2531237 2544466 2558892 2575943 2596081 2618495 2642673 2669776 2701861 2740047 2783948 2832728
57148B832728N3240N7370O0652O2764O4050O4997O5727O6177O6315O5778O3762
$$ 2832728 2885968 2943338 3003990 3066754 3130804 3195801 3261528 3327705 3394020 3459798 3523560
57137C523560N9976N5366N1191M7692M4463M1803M0434M0058L9766L9904M1839
$$ 3523560 3583536 3638902 3690093 3737785 3782248 3824051 3864485 3904543 3944309 3984213 4026052
57126D026052M5297M7950M8517M8336M8555M7783M4473L9851L6097L2882K8292
$$ 4026052 4071349 4119299 4167816 4216152 4264707 4312490 4356963 4396814 4432911 4465793 4494085
57115D494085K2309J6706J2129P975M774L761M083L122J79k572l312k604j832
$$ 4494085 4516394 4533100 4545229 4553204 4557978 4561739 4565822 4568944 4569123 4566551 4563239 4560635 4558803
57102D558803j810l368p166j2355j7371k2229k7897l3432l6555l7401l8597m0731
$$ 4558803 4556993 4553625 4546459 4534104 4516733 4494504 4466607 4433175 4396620 4359219 4320622 4279891
57090D279891m0914l7367l2532k9815k9884l2413l9110n2053p0064q9218j06603
$$ 4279891 4238977 4201610 4169078 4139263 4109379 4076966 4037856 3985803 3915739 3826521 3719918
57079C719918j22169j37395j53292j69273j83628j95918k08789k25704k46701
$$ 3719918 3597749 3460354 3307062 3137789 2954161 2758243 2549454 2323750 2077049
57070B077049k68456k89132l10783l36119l65285A09785c24127m77236n29312
$$ 2077049 1808593 1519461 1208678 872559 507274 109785 -324127 -801363 -1330675
57061a330675n90593o60820p39424q26054r21037j024580j136160j256200j387465
$$ -1330675 -1921268 -2582088 -3321512 -4147566 -5068603 -6093183 -7229343 -8485543 -9873008
57052i873008j532846j692894j868376k064069k286589k539183k822354l138668
$$ -9873008 -11405854 -13098748 -14967124 -17031193 -19317782 -21856965 -24679319 -27817987
57044b7817987l492940l889143m332617m835100n412407o077882o844373p732290
$$ -27817987 -31310927 -35200070 -39532687 -44367787 -49780194 -55858076 -62702449 -70434739
57036g0434739q768049r971362j1345335j2873882j4520927j6236608j7972936
$$ -70434739 -79202788 -89174150 -100519485 -113393367 -127914294 -144150902 -162123838
57029a62123838j9683708k1290811k2661757k3657823k4215175k4345978k4040549
$$ -162123838 -181807546 -203098357 -225760114 -249417937 -273633112 -297979090 -322019639
57022c22019639k3201726k1707956j9512057j6630107j3054955q763029l850623
$$ -322019639 -345221365 -366929321 -386441378 -403071485 -416126440 -424889469 -428740092
57015d28740092J370571O460360J1041991J4918545J8050377K0471615K2229218
$$ -428740092 -427369521 -420909161 -409867170 -394948625 -376898248 -356426633 -334197415
57008c34197415K3361720K3904255K3905819K3437765K2581408K1413259K0010516
$$ -334197415 -310835695 -286931440 -263025621 -239587856 -217006448 -195593189 -175582673
57001a75582673J8464050J6871139J5311726J3835899J2469834J1223933J0096410
$$ -175582673 -157118623 -140247484 -124935758 -111099859 -98630025 -87406092 -77309682
56994g7309682R079482Q165837P346215O603851N919506N282533M692048M148854
$$ -77309682 -68230200 -60064363 -52718148 -46114297 -40194791 -34912258 -30220210 -26071356
56986b6071356L652714L206229K813301K472158K175155J916045J692252J499718
$$ -26071356 -22418642 -19212413 -16399112 -13926954 -11751799 -9835754 -8143502 -6643784
56978f643784J330967J179598J042417R16696P99645f82963h7883D23582M39262
$$ -6643784 -5312817 -4133219 -3090802 -2174106 -1374461 -682963 -87883 423582 862844
56969H62844L77905L27854K87200K52091K21040J95280J74435J55423J36234J17528
$$ 862844 1240749 1568603 1855803 2107894 2328934 2524214 2698649 2854072 2990306 3107834
56959C107834J00073Q3600O8519N5690M4059L1388J7571M629o465j6078k3324
$$ 3107834 3207907 3291507 3360026 3415716 3459775 3491163 3508734 3513363 3506898 3490820 3467496
56948C467496k6482k6094k4321k0896j2854R76J7444L0580L2630J4514k9386r4374
$$ 3467496 3441014 3414920 3390599 3369703 3356849 3357825 3375269 3405849 3438479 3452993 3423607 3329233
56936C329233j65713k27585k71122k94834l01316k95142k81275k63139k42532
$$ 3329233 3163520 2935935 2664813 2369979 2068663 1773521 1492246 1229107 986575
56927I86575k21209k00833j81458j62074G8113d7214j10073r6919q6424p9324
$$ 986575 765366 564533 383075 221001 78113 -47214 -157287 -254206 -340630 -419954
56917d19954p4438o9317o2805n5149m6299l6586k8248k3235j9790j4236o114J580
$$ -419954 -494392 -563709 -626514 -681663 -727962 -764548 -792796 -816031 -835821 -850057 -856171 -854591
56905h54591P198J2192J7755K3087K7781L2818L8192M2294M4517M5764M5690M2334
$$ -854591 -847393 -835201 -817446 -794359 -766578 -733760 -695568 -653274 -608757 -562993 -517303 -474969
56893d74969L5588K8217K2271J7105J2129Q695P697P746P589Q188J0581J3437
$$ -474969 -439381 -411164 -388893 -371788 -359659 -350964 -343267 -335521 -327932 -319744 -309163 -295726
56881b95726J4614J3977J3187J3663J5801J9177K2693K5458K7874L0829L3720
$$ -295726 -281112 -267135 -253948 -240285 -224484 -205307 -182614 -157156 -129282 -98453 -64733
56870f4733b9979C198K9444K3318J4299M057m060q745j1781j4628j6317C060a0719
$$ -64733 -29979 3198 32642 55960 70259 74316 70256 61511 49730 35102 18785 3060 -10719
56856b2823j1105j0549j0326r883q444o471n249m668l393j552q42j315o60K204
$$ -22823 -33928 -44477 -54803 -64686 -73130 -79601 -84850 -89518 -92911 -94463 -95305 -96620 -97280 -95076
56842i5076N253O331N817M968L915K729K436L309L998L835M213O244Q959J1214
$$ -95076 -89823 -83492 -77675 -72707 -68792 -66063 -63627 -60318 -56320 -52485 -48272 -42028 -33069 -21855
56828b1855h455G232J6755J6117J5646J6460J6270J2537O848L262L002L542K728
$$ -21855 -8455 7232 23987 40104 55750 72210 88480 101017 107865 111127 114129 117671 120399
56815A20399J287R10J840L154M336N979R227J4419K0041K3661K4375K3895K4634
$$ 120399 121686 122596 124436 127590 131926 137905 147132 161551 181592 205253 229628 253523 278157
56802B78157K7505L1876L6673M0637M2241M0250L4212K4444J2321N74q027j2713
$$ 278157 305662 337538 374211 414848 457089 497339 531551 555995 568316 568890 560863 548150
56790E48150j4635j4810j3457j1287r515p976m918N09O985J2845J7818K2422K7174
$$ 548150 533515 518705 505248 493961 484446 476470 471552 472061 479046 491891 509709 532131 559305
56777E59305L2910M0303M8379N4957N8805N9620N5799M5015K7943R012p949k2552
$$ 559305 592215 632518 680897 735854 794659 854279 910078 955093 983036 992048 984099 961547
56765I61547l5118m3807m6710m4907m1137l6759l1924k7368k3746k0116j4972
$$ 961547 926429 882622 835912 791005 749868 713109 681185 653817 630071 609955 594983
56754E94983q319j368N108J1010J6482K2258K9161L6077L9697L7448K9648J7987
$$ 594983 586664 585296 590404 601414 617896 640154 669315 705392 745089 782537 812185 830172
56742H30172L706j1430k4262l2265l5487l5342l2883k9397k6746k5427k3828k0905
$$ 830172 833878 822448 798186 765921 730434 695092 662209 632812 606066 580639 556811 535906
56730E35906j7871j5747j3233r020m218l83L164P582J1801J4165J5239J6148J5351
$$ 535906 518035 502288 489055 480035 475817 475434 478598 486180 497981 512146 527385 543533 558884
56717E58884J0181J086q357j5372j9760k2339k3833k4888k5251k3549j9628j6026
$$ 558884 569065 570151 561794 546422 526662 504323 480490 455602 430351 406802 387174 371148
56705C71148j4920j4906j3277j0466r221j0064j0634r475p660o517o225o806q157
$$ 371148 356228 341322 328045 317579 308358 298294 287660 278185 270525 264008 257783 250977 242820
56692B42820q934p525m331j277P35K058K475J472p8p30p25j170j506m05J150P94
$$ 242820 233886 226361 222030 220753 221488 223546 226021 227493 227415 226685 225960 224790 223284 222879 224029 224823
56676B24823j172j765J38K247K563J799J027k78k430m058m106l513l486l684l317
$$ 224823 223651 221886 222024 224271 226834 228633 229660 229382 226952 222894 218788 215275 211789 208105 204788
56661B04788k667k283j925j329r91j282j739j808j418n35O71J162k6k030k824
$$ 204788 202121 199838 197913 196584 195593 194311 192572 190764 189346 188811 189482 190644 190618 188588 185764
56646A85764j803j56J255K513L083J989J5o14M63J086K13j10K011N192O704N997
$$ 185764 183961 183805 185060 187573 190656 192645 192660 192046 192509 193595 193808 193698 195709 200901 207605 213602
56630B13602M596L741L686M233M484L185P45l53J281L480L074J18k386k512j224
$$ 213602 218198 221939 225625 229858 234342 237527 238272 237919 239200 242680 245754 245872 243486 240974 239750
56615B39750k01K56P17J355J911K123J730N64r29j671r74N36J379Q13k39l18N71
$$ 239750 239549 239805 240522 241877 243788 245911 247641 248205 247276 245605 244631 245167 246546 247359 247120 246802 247373
56598B47373P83p44k923l967l748l474l544l197k297j925k711l766l816k594p91
$$ 247373 248156 247412 244489 240522 236774 233300 229756 226559 224262 222337 219626 215860 212044 209450 208659
56583B08659O33P76o19k516l248k261o34K83J65m25p43l26O62J475J743K032K737
$$ 208659 209292 210068 209449 206933 203685 201424 200790 201073 201238 200813 200070 199744 200406 201881 203624 205656 208393
56566B08393K949J579p03k056j871j261j063q02J60J626K923L291K087j80j378
$$ 208393 211342 212921 212218 210162 208291 207030 205967 205165 205325 206951 209874 213165 215252 215072 213694
56551B13694L4K478K903R81m71L00J678J572M58O7O18J039R07P49J039J872L000
$$ 213694 213728 216206 219109 220090 219619 219919 221597 223169 223627 223694 224312 225351 226258 227007 228046 229918 232918
56534B32918L502K345j9j626j284J23J286K172L141L628K962J652O98L07L43J240
$$ 232918 236420 238765 238746 237120 235836 235959 237245 239417 242558 246186 249148 250800 251498 251805 252148 253388
56518B53388L249N304N835M602K949K423L620O019Q358R479R287Q629Q173P947
$$ 253388 256637 261941 267776 272378 275327 277750 281370 287389 295747 305226 314513 323142 331315 339262
56504C39262P977Q556R682J1125J3070J5640J7714J7708J5960J4817J5541J6551
$$ 339262 347239 355795 365477 376602 389672 405312 423026 440734 456694 471511 487052 503603
56492E03603J5740J3282J0923R536Q664P836O989N948M492K720Q06j324l650n867
$$ 503603 519343 532625 543548 553084 561748 569584 576573 582521 587013 589733 590539 589215 585565 579698
56478E79698p825r497j0467j0341r891j0519j2203j3297j2872j1809j0898r577
$$ 579698 571873 562376 551909 541568 531677 521158 508955 495658 482786 470977 460079 450502
56466D50502p663o678p814r795j0547j0019r617r564q797p268o384o924p903p983
$$ 450502 442839 436161 428347 418552 408005 397986 388369 378805 370008 362740 356356 349432 341529 333546
56452C33546p013n793n045m884m837m322l324k533k416k514k025q75K33O32L17
$$ 333546 326533 320740 315695 310811 305974 301652 298328 295795 293379 290865 288840 287965 288198 288830 289147
56437B89147k9M43J764K776K271N93p06q45m47j13N05J690K764K871J901L10j230
$$ 289147 289118 289561 291325 294101 296372 296965 296259 295414 294967 294854 295359 297049 299813 302684 304585 304895 303665
56420C03665j749n85J556L180L913M669N764O287N827N249N058M617L754L583
$$ 303665 301916 301331 302887 306067 309980 314649 320413 326700 332527 337776 342834 347451 351205 354788
56406C54788M630N749N930N791N937N534L951K457K463L240L099K037J384J596
$$ 354788 359418 365167 371097 376888 382825 388359 392310 394767 397230 400470 403569 405606 406990 408586
56392D08586K013K283K490K374J745J164J048P79q9o32j0P88K74j152j766r88
$$ 408586 410599 412882 415372 417746 419491 420655 421703 422482 422393 421761 421751 422539 422813 421661 419895 418907
56376D18907K50J124J333L97j821m235n533n769n771n575m803l880l301k414o70
$$ 418907 419157 420281 421614 422011 420190 415955 410422 404653 398882 393307 388504 384624 381323 378909 378239
56361C78239O28j47k084k593j043N37M62q05k088k783k477j104J30k37j611j779
$$ 378239 378867 378720 376636 374043 373000 373537 373999 373194 371106 368323 365846 364742 364872 364635 363024 361245
56345C61245k03J035L52j113j531j034r40j446j644j260r09q50n55L07J243J460
$$ 361245 361042 362077 362429 361316 359785 358751 357811 356365 354721 353461 352552 351702 351147 351454 352697 354157
56329C54157P47l09q93p12o9P90J993L342L863K862J197O84K077M216N348M742
$$ 354157 354904 354595 353702 352990 352921 353711 355704 359046 362909 365771 366968 367652 369729 373945 379293 384035
56313C84035L005J214J07j63M32K060M507O524O757N513M654N126N706N063L959
$$ 384035 387040 388254 388361 388198 388630 390690 395197 401721 408478 413991 418645 423771 429477 434540 438499
56298D38499L980M818M549K582O71O44K301M099N074N357N344N125M708M377M481
$$ 438499 442479 447297 451846 454428 455099 455743 458044 462143 467217 472574 477918 483043 487751 492128 496609
56283D96609M850M830M211L671L715L693K834J987K794N155P020P216O821P082
$$ 496609 501459 506289 510500 514171 517886 521579 524413 526400 529194 534349 541369 548585 555406 562488
56269E62488P556P374O888O793O780O431O367P315Q804J0065J1343J3165J5134
$$ 562488 570044 577418 584306 591099 597879 604310 610677 617992 626796 636861 648204 661369 676503
56256F76503J6517J7188J7046J5671J3654J2960J4511J6555J6932J5838J4784
$$ 676503 693020 710208 727254 742925 756579 769539 784050 800605 817537 833375 848159
56245H48159J3998J2728J1174J0207R751R201Q789Q999R356R315R463J0209J0383
$$ 848159 862157 874885 886059 896266 906017 915218 924007 933006 942362 951677 961140 971349 981732
56232I81732R085P885R032J2211J5265J7501J9887K2525K4306K4973K5385K5891
$$ 981732 990817 998702 1007734 1019945 1035210 1052711 1072598 1095123 1119429 1144402 1169787 1195678
56220A195678K6513K8356L2591L8162M2735M5927M9427N3971N8499O2627O7618
$$ 1195678 1222191 1250547 1283138 1321300 1364035 1409962 1459389 1513360 1571859 1634486 1702104
56209A702104P4264Q1707Q9099R6925J05970J16140J26740J37108J47039J57324
$$ 1702104 1776368 1858075 1947174 2044099 2150069 2266209 2392949 2530057 2677096 2834420
56199B834420J69473J83928J99295K14252K29087K43920K56914K66359K73126
$$ 2834420 3003893 3187821 3387116 3601368 3830455 4074375 4331289 4597648 4870774
56190D870774K78602K81286K78113K68375K53540K34018K09232J80397J49987
$$ 4870774 5149376 5430662 5708775 5977150 6230690 6464708 6673940 6854337 7004324
56181G004324J18432Q4508M9065J5144j5835m4744p1270r3099j09531j22878j35115
$$ 7004324 7122756 7207264 7256329 7271473 7255638 7210894 7139624 7046525 6936994 6814116 6679001
56170F679001j45791j54279j61400j67663j72366j75629j78944j82635j85033
$$ 6679001 6533210 6378931 6217531 6049868 5877502 5701873 5522929 5340294 5155261
56161E155261j85391j85408j86590j88092j88385j87135j84321j79400j72518
$$ 5155261 4969870 4784462 4597872 4409780 4221395 4034260 3849939 3670539 3498021
56152C498021j65004j57727j50348j42694j35194j27583j19162j10752j04232
$$ 3498021 3333017 3175290 3024942 2882248 2747054 2619471 2500309 2389557 2285325
56143B285325r9459r3856q5858p6883o9192o3622n9842n6846n2882m6942m0707
$$ 2285325 2185866 2092010 2006152 1929269 1860077 1796455 1736613 1679767 1626885 1579943 1539236
56132A539236l6747l4777l2223k8609k6160k5540k4281k0688j6264j2914j0482
$$ 1539236 1502489 1467712 1435489 1406880 1380720 1355180 1330899 1310211 1293947 1281033 1270551
56121A270551q552p903q468q182n635k015Q71K801M387O096Q688J2609J6489J8555
$$ 1270551 1261999 1254096 1245628 1237446 1231811 1229796 1230667 1233468 1237855 1243951 1252639 1265248 1281737 1300292
56107A300292J9669K2163K5594K7072K6184K5736K6805K7222K6320K6594K8592
$$ 1300292 1319961 1342124 1367718 1394790 1420974 1446710 1473515 1500737 1527057 1553651 1582243
56096A582243K8627K4553J9821J8493J9627K0268K0870K3664K7911L0962L2774
$$ 1582243 1610870 1635423 1655244 1673737 1693364 1713632 1734502 1758166 1786077 1817039 1849813
56085A849813L5758M1014M7593N4895O3305P3043Q4113R6714J10368J23805J36736
$$ 1849813 1885571 1926585 1974178 2029073 2092378 2165421 2249534 2346248 2456616 2580421 2717157
56074B717157J49979J62644J71107J72237J66141J55023J41542J28938J19858
$$ 2717157 2867136 3029780 3200887 3373124 3539265 3694288 3835830 3964768 4084626
56065D084626J13560J06614R7378Q7027P5563O0524M1137K0213L86j7986l3977
$$ 4084626 4198186 4304800 4402178 4489205 4564768 4625292 4666429 4686642 4687028 4669042 4635065
56054D635065m5739n4978o7129q4303j02443j18081j32837j47699j58172j60114
$$ 4635065 4589326 4534348 4467219 4382916 4280473 4162392 4029555 3881856 3723684 3563570
56044C563570j56091j50777j43693j32030j17467j04242r2709q0402o7851n8028
$$ 3563570 3407479 3256702 3113009 2980979 2863512 2759270 2666561 2586159 2518308 2460280
56034B460280n1168m4968l8904l4076k9904k5158k1105j9633j9522j8390j6848
$$ 2460280 2409112 2364144 2325240 2291164 2261260 2236102 2214997 2195364 2175842 2157452 2140604
56023B140604j6824j7267j5708j2702j0635r328o811l307n59J617M448P084Q006
$$ 2140604 2123780 2106513 2090805 2078103 2067468 2058140 2051329 2048022 2047463 2049080 2053528 2060612 2068618
56010B068618Q289R998J2677J4820J7052K0507K3847K5410K6280K7763K8186K6102
$$ 2068618 2076907 2086905 2099582 2114402 2131454 2151961 2175808 2201218 2227498 2255261 2283447 2309549
55998B309549K4085K5082K7471K8195K8382L0973L5149L8040L9932M2716M5180
$$ 2309549 2333634 2358716 2386187 2414382 2442764 2473737 2508886 2546926 2586858 2629574 2674754
55987B674754M5031M3826M4771M7206M8379M8873N1210N4738N7093N8987O2547
$$ 2674754 2719785 2763611 2808382 2855588 2903967 2952840 3004050 3058788 3115881 3174868 3237415
55976C237415O6686O9202P1382P5347P9165Q0235Q1029Q5408R1574R5109R6820
$$ 3237415 3304101 3373303 3444685 3520032 3599197 3679432 3760461 3845869 3937443 4032552 4129372
55965D129372J00850J06886J11329J14731J21004J30127J38471J45530J53905
$$ 4129372 4230222 4337108 4448437 4563168 4684172 4814299 4952770 5098300 5252205
55956E252205J63577J72543J82004J94572K08477K19833K29331K40508K53165
$$ 5252205 5415782 5588325 5770329 5964901 6173378 6393211 6622542 6863050 7116215
55947G116215K64716K76019K89402L03423L16191L30897L50837L72338L90391
$$ 7116215 7380931 7656950 7946352 8249775 8565966 8896863 9247700 9620038 10010429
55938A0010429M07820M30518M57350M83802N11645N45148N81497O15457O49841
$$ 10010429 10418249 10848767 11306117 11789919 12301564 12846712 13428209 14043666 14693507
55929A4693507O90438P34455P75869Q18448Q70756R31754R94559J060907J137740
$$ 14693507 15383945 16118400 16894269 17712717 18583473 19515227 20509786 21570693 22708433
55920B2708433J222727J308152J396268J495416J604335J717146J840991J990482
$$ 22708433 23931160 25239312 26635580 28130996 29735331 31452477 33293468 35283950
55912C5283950K166305K357060K559627K779088L012796L257168L528187L852160
$$ 35283950 37450255 39807315 42366942 45146030 48158826 51415994 54944181 58796341
55904E8796341M238268M685098N212496N860300O657324P619229Q772082J0142527
$$ 58796341 63034609 67719707 72932203 78792503 85449827 93069056 101841138 111983665
55896A11983665J1725963J3502947J5488839J7729637K0252998K3065656K6174319
$$ 111983665 123709628 137212575 152701414 170431051 190684049 213749705 239924024
55889B39924024K9510051L2785981L5459126L6798333L5893139L1696079K3475357
$$ 239924024 269434075 302220056 337679182 374477515 410370654 442066733 465542090
55882D65542090J1642046j850195j4242452k3405775k8732976l0863804l0829536
$$ 465542090 477184136 475333941 461091489 437685714 408952738 378088934 347259398
55875C47259398k9499676k7513097k5332556k3227877k1292130j9533168j7932732
$$ 347259398 317759722 290246625 264914069 241686192 220394062 200860894 182928162
55868A82928162j6444886j5017539j3642827j2353837j1169559j0078288r073563
$$ 182928162 166483276 151465737 137822910 125469073 114299514 104221226 95147663
55861I5147663q166551p356566o622234n949588n342943m803425m321079l891964
$$ 95147663 86981112 79624546 73002312 67052724 61709781 56906356 52585277 48693313
55853D8693313l520011l197806k906401k637662k397782k186585j992767j812398
$$ 48693313 45173302 41975496 39069095 36431433 34033651 31847066 29854299 28041901
55845B8041901j653280j517368j396180j287001j196891j126409j064617j004194
$$ 28041901 26388621 24871253 23475073 22188072 20991181 19864772 18800155 17795961
55837A7795961r47487q94540q39419p82164p30779o87353o44625n99769n59074
$$ 17795961 16848474 15953934 15114515 14332351 13601572 12914219 12269594 11669825 11110751
55828A1110751n25298m92544m57932m26846m02258l79423l55527l34505l18162
$$ 11110751 10585453 10092909 9634977 9208131 8805873 8426450 8070923 7736418 7418256
55819G418256l02192k84949k70870k61303k51048k37800k26043k17620k07461
$$ 7418256 7116064 6831115 6560245 6298942 6047894 5810094 5584051 5366431 5158970
55810E158970j93067j79711j71448j64813j56331j48806j45050j41873j35331
$$ 5158970 4965903 4786192 4614744 4449931 4293600 4144794 3999744 3857871 3722540
55801C722540j26485j17839j09338j01522r7218r6737r6431r4740r4103r4409
$$ 3722540 3596055 3478216 3368878 3267356 3170138 3073401 2976970 2882230 2788127 2693718
55791B693718r0987q2424p4143p0339o8111o3627n8600n6180n5161n2778m9326
$$ 2693718 2602731 2520307 2446164 2375825 2307714 2244087 2185487 2129307 2074146 2021368 1972042
55780A972042m6109m2327l7449l3260l0614k7560k3198j9752j8464j7379j5500
$$ 1972042 1925933 1883606 1846157 1812897 1782283 1754723 1731525 1711773 1693309 1675930 1660430
55769A660430j4890j6239j6803j5461j5301j8244k1551k2923k4611k8719l2626
$$ 1660430 1645540 1629301 1612498 1597037 1581736 1563492 1541941 1519018 1494407 1465688 1433062
55758A433062l3216l2054l2155l2736l1466k9326k8912k9713k9080k6476k3563
$$ 1433062 1399846 1367792 1335637 1302901 1271435 1242109 1213197 1183484 1154404 1127928 1104365
55747A104365k1185j9098j7479j6327j4593j1831r356q052o729m291j688j16Q73
$$ 1104365 1083180 1064082 1046603 1030276 1015683 1003852 994496 986444 979715 975424 973736 973620 974493
55734I74493J832J884L75j755l610n522p524q751r381j0823j2887j3386j1735
$$ 974493 976325 978209 978584 976829 973219 967697 960173 951422 942041 931218 918331 904945 893210
55721H93210j0232j0404j0827j0010q680p720o848o841r883j5621j9811j9372
$$ 893210 882978 872574 861747 851737 843057 835337 828489 821648 811765 796144 776333 756961
55709G56961j6222j3890j2945j2058j1007j0055q453n999m271m306n010n595p221
$$ 756961 740739 726849 713904 701846 690839 680784 672331 666332 662061 657755 652745 647150 639929
55696F39929j0255j2434j2089j0790j0509j0585r995j0103j2153j4219j3747j1439
$$ 639929 629674 617240 605151 594361 583852 573267 563272 553169 541016 526797 513050 501611
55684E01611r652q549o931n438n681p072p485o531n644n400n078m404l739l054
$$ 501611 491959 483410 476479 471041 465360 458288 450803 444272 438628 433228 428150 423746 420007 416953
55670D16953k415k731m285n550n247m609n555p643q852q585p824o969n721m637
$$ 416953 414538 411807 407522 401972 396725 392116 386561 378918 370066 361481 353657 346688 340967 336330
55656C36330m729n597n689m525l205k702k717k394j408k80K12J32O81K475M010
$$ 336330 331601 326004 320315 315790 312585 309883 307166 304772 303364 303084 303296 303428 304109 306584 310594
55641C10594L356J135k33l37j191l281m111k038R21K093J792K053L352M573M910
$$ 310594 313950 315085 314852 314515 313324 310043 305932 303894 304815 306908 308700 310753 314105 318678 323588
55626C23588M347L441L580N809Q646R159P143N513N400M123J13l588l775k175
$$ 323588 327935 331376 334956 340765 349411 358570 365713 371226 376626 380749 380862 377274 373499 371324
55612C71324k532m730n635m375k957k500k257j863j650j169m9L04j356l230k373
$$ 371324 368792 364062 358427 354052 351095 348595 346338 344475 342825 341656 341607 341911 340555 337325 334952
55597C34952R01L326L181J799P89M03O69J768K917K950J985R78k4j317k058j502
$$ 334952 335853 339179 342360 344159 344948 345351 346020 347788 350705 353655 355640 356618 356594 355277 353219 351717
55581C51717j058k577n131o153n459n307o430o977n877m650m938o458q202r805
$$ 351717 350659 348082 342951 336798 331339 326032 319602 312625 306748 302098 297160 290702 282500 272695
55567B72695j0852j0587r119p579o630o033n835o398p069o547m968l967m225m539
$$ 272695 261843 251256 242137 234558 227928 221895 216060 209662 202593 196046 191078 187111 182886 178347
55553A78347l879k777j997j319m37R9k20r30j326j442j659j871j593o32N47J043
$$ 178347 174468 171691 169694 168375 167938 168037 167817 166887 165561 164119 162460 160589 158996 158364 158911 159954
55537A59954K70j313k463k429j554m53N83J128O41m27q48o53j485l881n790n296
$$ 159954 160224 158911 156448 154019 152465 152012 152595 153723 154364 153937 153089 152436 150951 147070 141280 135984
55521A35984l421k357k298j998j293q26l77K77j95k770n314m694j359J073Q10
$$ 135984 132563 130206 127908 125910 124617 123791 123414 123691 123496 120726 115412 110718 109359 110432 111242
55506A11242l13l48L00O30O76L16j210l381l955j885Q72J756P33j91K97J579K047
$$ 111242 110929 110581 110881 111511 112187 112503 111293 107912 103957 102072 102944 104700 105433 105242 105539 107118 109165
55489A09165O69k014m212m613l607k297r31P24K121K536K386K388K010M74j104
$$ 109165 109834 107820 103608 98995 95388 93091 92160 92884 95005 97541 99927 102315 104325 104799 103695
55474A03695p91J156K442K016J019M12p2k97N68K058K451J627J616L276M661M070
$$ 103695 102904 104060 106502 108518 109537 109949 109877 109580 110148 112206 114657 116284 117900 121176 125837 129907
55458A29907K701K500K995K255m5k200k675j496J85J083P06k25p40j062k075l324
$$ 129907 132608 135108 138103 140358 140313 138113 135438 133942 134127 135210 135916 135691 134951 133889 131814 128490
55442A28490l173j388k1p92l014m942n887n991n281m117l470l623l591k883k703
$$ 128490 125317 123929 123908 123116 120102 115160 109273 103282 98001 93884 90414 86791 83200 80317 77614
55427G7614m016n537n257l372j988k169k815k665k045k092k987l613k785n95J580
$$ 77614 73598 68061 62804 59432 57444 55275 52460 49795 47750 45658 42671 39058 36273 35678 37258
55412C7258K401J740L94j011k215k802k385j430r64j280j599j311p48n15p13j041
$$ 37258 39659 41399 41793 40782 38567 35765 33380 31950 30986 29706 28107 26796 26048 25533 24820 23779
55396B3779j102l92J292L248M273L876K633J311K79k86j88N98J875L276M123L780
$$ 23779 22677 22285 23577 26825 31098 34974 37607 38918 39197 38911 38723 39321 41196 44472 48595 52375
55380E2375K608J744J413M47j584l103k821j950k155k503r49J877L234K405J448
$$ 52375 54983 56727 58140 58587 57003 53900 51079 49129 46974 44471 43522 45399 48633 51038 52486
55365E2486J651K035J842J733J760P80j166k376k359k669l820m072k651j450j795
$$ 52486 54137 56172 58014 59747 61507 62287 61121 58745 56386 53717 49897 45825 43174 41724 39929
55350C9929k112q60O37O52J81R28K013J566K40J75J308J565K85j084j543j567
$$ 39929 37817 36957 37594 38246 38427 39355 41368 42934 43174 43349 44657 46222 46507 45423 43880 42313
55334D2313j580j350q99n05J12J211K054J950J644K097K486J358p33j809j498
$$ 42313 40733 39383 38484 37979 38091 39302 41356 43306 44950 47047 49533 50891 50158 48349 46851
55319D6851j389k256k896k250r55j26J33K96M89N51L47k29j092j767j875j638
$$ 46851 45462 43206 40310 38060 37105 36979 37112 37408 37897 38448 38795 38566 37474 35707 33832 32194
55303C2194j361q43J27J109J604J743J691R82n84k126k771k892l136l110k211
$$ 32194 30833 29990 30117 31226 32830 34573 36264 37246 36662 34536 31765 28873 25737 22627 20416
55288B0416j067o45n45K46J472K088K222K830L657L329J500o07j861k053j241
$$ 20416 19349 18704 18159 18405 19877 21965 24187 27017 30674 34003 35503 34896 33035 30982 29741
55273B9741J63Q96P6j175j088q3k22j757k500j195O77J307R05M86J06l99l59N63
$$ 29741 29904 30800 30876 29701 28613 28530 28308 26551 24051 22856 23533 24840 25745 26231 26337 25938 25579 26142
55255B6142J244N34r65j824j837j894k277k312j575m74M23R81J366J657J643J028
$$ 26142 27386 27920 26955 25131 23294 21400 19123 16811 15236 14762 15185 16166 17532 19189 20832 21860
55239B1860l3q37r86j028j442j483j88J594J862L93o24L71K142K606J685Q70Q74
$$ 21860 21827 20990 20004 18976 17534 16051 15863 17457 19319 19712 19088 19459 21601 24207 25892 26762 27636
55222B7636J134J083O67m6q00j036p11o59j183j044Q84L493M537L622K510K383
$$ 27636 28770 29853 30520 30474 29674 28638 27927 27268 26085 25041 25925 29418 33955 37577 40087 42470
55206D2470K463J756O24k16q92j660j989j530j159j743k406j485Q23K185R44j816
$$ 42470 44933 46689 47313 47097 46205 44545 42556 41026 39867 38124 35718 34233 35056 37241 38185 36369
55190C6369l629l269j426O40K178K879K618J653O87M14Q28J057J50j685k773j648
$$ 36369 32740 29471 28045 28685 30863 33742 36360 38013 38700 39114 39942 40999 41149 39464 36691 35043
55174C5043R43K440J393q52k018j679j052o37K93J792K446J309m67r71R4J307
$$ 35043 35986 38426 39819 38967 36949 35270 34218 33581 33874 35666 38112 39421 38954 37983 38077 39384
55158C9384J498R32N22N46L85n53j954k785k417j268j00Q43J539J553O01n46q28
$$ 39384 40882 41814 42336 42882 43267 42714 40760 37975 35558 34290 34190 35033 36572 38125 38726 38180 37352
55141C7352m14l18n58p6J303K342K356K172K448K431J387K8n56l33L48J617L103
$$ 37352 36938 36620 36062 35986 37289 39631 41987 44159 46607 49038 50425 50453 49897 49564 49912 51529 54632
55124E4632L310J467r61k113k115k112k020j200m74j167k568k610j094L6k04p01
$$ 54632 57942 59409 58448 56335 54220 52108 50088 48888 48414 47247 44679 42069 40975 41011 40807 40106
55108D0106n49l81o56o28L4L74L3K81J811L030K132j04j289p31j21r95k728l461
$$ 40106 39557 39176 38520 37892 37926 38300 38333 38614 40425 43455 45587 45483 44194 43463 43342 42347 39619 36158
55090C6158k260n3J417J386P11N48P86N10k82n93k11k83j459k589k185n27P43
$$ 36158 33898 33845 35262 36648 37359 37907 38693 39203 38921 38328 38117 37834 36375 33786 31601 31074 31817
55073C1817P23K2l67j37L92Q56J067R01J87r57j677q58J418L399L538K431J865
$$ 31817 32540 32562 32195 32058 32450 33306 34373 35274 35461 34504 32827 31969 33387 36786 40324 42755 44620
55056D4620K243K427K059K223L337M150L803L355L946M719M104K264O59k26j038
$$ 44620 46863 49290 51349 53572 56909 61059 64862 68217 72163 76882 80986 83250 83909 83683 82645
55041H2645j787j463L23K552L794L323J280j345k962k557o99J142K073J941O84
$$ 82645 80858 79395 79718 82270 86064 89387 90667 89322 86360 83803 83104 84246 86319 88260 88944
55026H8944j237k151o67K098L329K085M92N81J568J513M55N7P39J029q2j753k712
$$ 88944 87707 85556 84889 86987 90316 92401 92893 93474 95042 96555 97010 97067 97806 98835 98753 97000 94288
55009I4288k859k708k245j226l4O90J021J498K009J774N87o70j055o69l63p04
$$ 94288 91429 88721 86476 85250 85216 85906 86927 88425 90434 92208 92795 92125 91070 90401 90038 89334
54993H9334j584k531l020k645j392J81J339J692J284M01n77j212j268r13n46m77
$$ 89334 87750 85219 82199 79554 78162 78343 79682 81374 82658 83059 82482 81270 80002 79089 78543 78066
54977G8066q38j464j808j352m47k58j282k261j371J436M061M534L059J396O89
$$ 78066 77228 75764 73956 72604 72157 71899 70617 68356 66985 68421 72482 77016 80075 81471 82160
54962H2160O02L66o7k49l5M11J121K155K902K348O00o45L0J783K412J142n83j085
$$ 82160 82762 83128 83061 82812 82777 83188 84309 86464 89366 91714 92314 91669 91699 93482 95894 97036 96453 95368
54944I5368j86J347K773L275K160O2j098m06P41O53k93o70m76p55j325q48P18
$$ 95368 95182 96529 99302 102577 104737 104799 103701 103295 104036 104689 104396 103726 103250 102495 101170 100322 101040
54927A01040J620P07j086k260k425j916r19L25J267J616J564J121R8j004j142
$$ 101040 102660 103367 102281 100021 97596 95680 94761 95086 96353 97969 99533 100654 100752 99748 98606
54912I8606j00J222K268L400M498M346K365n4j046l58J002K417L696M187L277
$$ 98606 98506 99728 101996 105396 109894 114240 116605 116551 115505 115147 116149 118566 122262 126449 129726
54897A29726J660Q03J067J468J510K158M422P710J0343J1383J1339J1118J1041
$$ 129726 131386 132189 133256 134724 136234 138392 142814 150524 160867 172250 183589 194707 205748
54884B05748J1181J2012J3854J5808J6296J5079J3728J3266J2273Q749L268j431
$$ 205748 216929 228941 242795 258603 274899 289978 303706 316972 329245 337994 341262 339831
54872C39831m037o030q949j1983j3363j3034j2538j2818j3357j3136j1648r183
$$ 339831 335794 329764 320815 308832 295469 282435 269897 257079 243722 230586 218938 209755
54860B09755o728n426n452n777n425m590m068m056m055l523k143Q2K470L993M549
$$ 209755 203027 197601 192149 186372 180947 176357 172289 168233 164178 160655 158512 158594 161064 165057 169606
54845A69606N325P237R524J0792J0942J1084J1843J2802J3587J4353J4961J4492
$$ 169606 174931 182168 191692 202484 213426 224510 236353 249155 262742 277095 292056 306548
54833C06548J2172Q411M426R92k157n630r280j2146j3528j3837j3927j3997j3771
$$ 306548 318720 327131 331557 332549 330392 324762 315482 303336 289808 275971 262044 248047 234276
54820B34276j3450j3532j3684j2964j1283r648q487p089n233m063m339m970m580
$$ 234276 220826 207294 193610 180646 169363 159715 151228 144139 138906 134843 130504 125534 120954
54807A20954l491k809k308r77P89J384L87p38p18J34R02J221R57j96j993l398
$$ 120954 117463 114654 112346 111369 112158 113542 113929 113191 112473 112607 113509 114730 115687 115491 113498 110100
54791A10100l677l326l192l160k413q85K39k49k059l465l066j311P2J68k68j71
$$ 110100 106423 103097 99905 96745 94332 93447 93686 93437 91378 87913 84847 83536 83608 83776 83508 83337
54775H3337M40J078J965L474M694L934R23k441m021l510k133r09J30J189J844
$$ 83337 83777 84855 86820 90294 94988 98922 99845 97404 93383 89873 87740 86831 86961 88150 89994
54760H9994J433J72n65L64K285L203K191O08L09J293K062J922J768K402L213L168
$$ 89994 91427 91599 91034 91398 93683 96886 99077 99685 99994 101287 103349 105271 107039 109441 112654 115822
54744A15822K434K196L027M176M645M488M605N469O652P698Q852J0420J1946J2785
$$ 115822 118256 120452 123479 127655 132300 136788 141393 146862 153514 161212 170064 180484 192430 205215
54730B05215J3135J3608J4049J3917J3756J4779J6592J6942J4568J1059Q626P184
$$ 205215 218350 231958 246007 259924 273680 288459 305051 321993 336561 347620 356246 363430
54718C63430N007J394k811o728r856j1296j0330p976o518p062q489q992p837n448
$$ 363430 368437 369831 367020 360292 350436 339140 328810 320834 314316 307254 298765 289773 281936 276488
54704B76488k848j261j357k462l079k382q40O37J539J989K837N208R062J2477
$$ 276488 273640 272379 271022 268560 265481 263099 262259 262896 264435 266424 269261 274469 283531 296008
54690B96008J3538J2864J2962J4993J7568J9183K0358K2394K5061K6777K6613
$$ 296008 309546 322410 335372 350365 367933 387116 407474 429868 454929 481706 508319
54679E08319K4948K2160J7739J1183L372l675q671j2362j6295k0471k3122k3192
$$ 508319 533267 555427 573166 584349 587721 584046 575375 563013 546718 526247 503125 479933
54667D79933k1968k1342k1394k0955j9820j8860j8226j7189j5805j5053j5046
$$ 479933 457965 436623 415229 394274 374454 355594 337368 320179 304374 289321 274275
54656B74275j4562j2980j1200j0083r253q251p535p371o884n361l644k941k930
$$ 274275 259713 246733 235533 225450 216197 207946 200411 193040 186156 180795 177151 174210 171280
54643A71280k230m20J433K108J362k0o65L32K137K553O33j635j597N09J726L61
$$ 171280 169050 168630 170063 172171 173533 173513 172848 173180 175317 177870 178503 176868 175271 175780 177506 177867
54627A77867j787k012l07R29L53o32n1J813K784J623m53j425p97L07Q53R61J356
$$ 177867 176080 174068 173761 174690 175043 174411 174360 176173 178957 180580 180127 178702 177905 178212 179065 180026 181382
54610A81382K500M286O056O825O079M514L560L981N349O797P721P690O474M633
$$ 181382 183882 188168 194224 201049 207128 211642 215202 219183 224532 231329 239050 246740 253214 257847
54596B57847L526M047N603O763O802O286O157O618P020O781O114N653N538N434
$$ 257847 261373 265420 271023 277786 284588 290874 297031 303649 310669 317450 323564 329217 334755 340189
54582C40189N500O585Q969J1665J3704J5525J8156K1491K4490K6845K9108L1192
$$ 340189 345689 352274 361243 372908 386612 402137 420293 441784 466274 493119 522227 553419
54570E53419L1986L0692K7396K2234J5183P177K8n466j0359j5732k0966k4630
$$ 553419 585405 616097 643493 665727 680910 688087 688115 682649 672290 656558 635592 610962
54558F10962k6346k6792k6473k5394k3739k2019k0628j9510j8190j5982j2752
$$ 610962 584616 557824 531351 505957 482218 460199 439571 420061 401871 385889 373137
54547C73137r556p784p496p346o517n738n846o257n780m295k894k701m052o215
$$ 373137 363581 355797 348301 340955 334438 328700 322854 316597 310817 306522 303628 300927 296875 290660
54533B90660p638p167n556m853n759o830o932p042q241r319q468o450n813p005
$$ 290660 283022 275855 270299 265446 259687 252857 245925 238883 230642 221323 212855 206405 200592 193587
54519A93587p588n808l043j804k711m410n472n361m338l275l056l492l383k205
$$ 193587 185999 180191 177148 175344 172633 168223 162751 157390 153052 149777 146721 143229 139846 137641
54505A37641j030r65j368p28J025K203J530l70j889k114j156M88K175L127K855
$$ 137641 136611 135646 134278 133550 134575 136778 138308 137938 136049 133935 132779 133267 135442 138569 141424
54490A41424J756P99O38J214K084K635K260J037J97J008K901L809K911J944K712
$$ 141424 143180 143979 144617 145831 147915 150550 152810 153847 154044 155052 157953 161762 164673 166617 169329
54475A69329M311M504L330L364O134J0067J2645J3177J2538J1569J0898J1371
$$ 169329 173640 178144 181474 184838 190972 201039 213684 226861 239399 250968 261866 273237
54463B73237J3116J4691J4413J2339R916P885N677K837j31k591m633o640q515
$$ 273237 286353 301044 315457 327796 337712 345597 351274 354111 353980 351389 346756 340116 331601
54450C31601r810j0450j0936j1793j2893j3449j2849j1398r968r006q229p316
$$ 331601 321791 311341 300405 288612 275719 262270 249421 238023 228055 219049 210820 203504
54438B03504o353n513m781m191l773l171k045r92j137k399l149k350j099j068
$$ 203504 197151 191638 186857 182666 178893 175722 173677 172685 171548 169149 166000 163650 162551 161483
54424A61483k036k267r95O61J361J147J027J636K735L646L971L913L930M087L978
$$ 161483 159447 157180 156185 156846 158207 159354 160381 162017 164752 168398 172369 176282 180212 184299 188277
54409A88277L389K711K488K849L566M261M397L588K111P24k22q77j155p75k30
$$ 188277 191666 194377 196865 199714 203280 207541 211938 215526 217637 218361 218139 217262 216107 215332 215102
54394B15102o58k134l214k886j993j730j772j144j09K22k74o84o87r93k153l938
$$ 215102 214444 212310 209096 206210 204217 202487 200715 199571 199462 199684 199410 198726 198039 197046 194893 190955
54378A90955n736o717n908l321q26o19k657m553m240j878Q95K593K651J407j70
$$ 190955 185219 178502 172594 169273 168447 167828 165171 160618 156378 154500 155395 157988 160639 162046 161876
54363A61876j176j346p68N05K109L163L231L084L575M216L919K796K036K138K555
$$ 161876 160700 159354 158586 159091 161200 164363 167594 170678 174253 178469 182388 185184 187220 189358 191913
54348A91913K893L159K918J645J26kJ582L425M445N187O349P342P264O360N571
$$ 191913 194806 197965 200883 202528 202654 202652 204234 207659 212104 217291 223640 230982 238246 244606 250177
54333B50177N243N060M726M049K730P10j447k906l179k381j311j244k940n654
$$ 250177 255420 260480 265206 269255 271985 272695 271248 268342 265163 262782 261471 260227 257287 251633
54319B51633p624p818o779n716n338n568n836n582m916m648n100n282m222k744
$$ 251633 244009 236191 229412 223696 218358 212790 206954 201372 196456 191808 186708 181426 177204 174460
54305A74460k564l642l885j949R50K597K138L55j507k448k008n68Q89J562J103
$$ 174460 171896 168254 164369 162420 163370 165967 168105 168460 166953 164505 162497 161929 162818 164380 165483
54290A65483n16k469k865n36K982M793M159L038K975L474L965N119O745O624L477
$$ 165483 164967 162498 159633 159097 162079 166872 171031 174069 177044 180518 184483 189602 196347 202971 206448
54275B06448l16j280P43K798K831J384l41j968l275l826l860m199m872m954m042
$$ 206448 206132 204852 205595 208393 211224 212608 212267 210299 207024 203198 199338 195139 190267 185313 181271
54260A81271k911k332k217k274k589l137l488l478l507l799l991l767l460l493
$$ 181271 178360 176028 173811 171537 168948 165811 162323 158845 155338 151539 147548 143781 140321 136828
54246A36828l637l318k497j843k001k818l498l455k889k333j803r31J89Q43O18
$$ 136828 133191 129873 127376 125533 123532 120714 117216 113761 110872 108539 106736 105805 105994 106837 107455
54231A07455r4p35j137j185p24j35k77j186j700j056r3R2m8P10K296L435L587
$$ 107455 107361 106626 105489 104304 103580 103445 103168 101982 100282 99226 99133 99225 99177 99887 102183 105618 109205
54214A09205L375L048J956R6j161o65R39K059K050J596J466J681J893K017K225
$$ 109205 112580 115628 117584 117680 116519 115854 116793 118852 120902 122498 123964 125645 127538 129555 131780
54199A31780K514K621K348J866J501J354J361J548J820J549J23j906k929k140
$$ 131780 134294 136915 139263 141129 142630 143984 145345 146893 148713 150262 150385 148479 145550 143410
54185A43410p22m89j688k790k350m74J516K457K322K011K039J643j75k664l535
$$ 143410 142688 142199 140511 137721 135371 134897 136413 138870 141192 143203 145242 146885 146710 144046 140511
54170A40511j770Q66K083J954K174L075L110J355j002k221j937j005j83M74J374
$$ 140511 138741 139607 141690 143644 145818 148893 152003 153358 152356 150135 148198 147193 147010 147484 148858
54155A48858K817M384M889L568J231l89n36K8L43L22K90K69O9l70j075j947k501
$$ 148858 151675 156059 160948 164516 165747 165358 164822 164850 165193 165515 165805 166074 166143 165773 164698 162751 160250
54138A60250k203j188k25L3o75k416m637n746m350j212J022N94j611l461l777
$$ 160250 158047 156859 156634 156667 155992 153576 148939 143193 138843 137631 138653 139247 137636 134175 130398
54123A30398k697q67Q10J279K14j446k473k486j658J9K204L468K349n96k826k407
$$ 130398 127701 126834 127644 128923 129137 127691 125218 122732 121074 121093 123297 126765 129114 128518 125692 123285
54107A23285n4J757J419m16j880j893j028n26p89j139r60n62o75j400k115k263
$$ 123285 123231 124988 126407 125991 124111 122218 121190 120664 119875 118736 117776 117214 116539 115139 113024 110761
54091A10761j815r93q1M57J01j074k107k064j252j019k094l535l811k597q48O25
$$ 110761 108946 107953 107872 108329 108430 107356 105249 103185 101933 100914 98820 95285 91474 88877 88029 88654
54075H8654J694K064J189n00j373o40K74l67k047k775k040j369j788k420k138
$$ 88654 90348 92412 93601 93101 91728 91088 91362 90995 88948 86173 84133 82764 80976 78556 76418
54060G6418j204m25J96J001J730J928J712J305M26r58j891j556p32q87j875j843
$$ 76418 75214 74789 74985 75986 77716 79644 81356 82661 83087 82129 80238 78682 77950 77063 75188 73345
54044G3345J92K721L445K075M88K98J003J043K3r20q99m59l82k26Q23K187K355
$$ 73345 73537 76258 79703 81778 82266 82564 83567 84610 84633 83713 82814 82355 81973 81747 82570 84757 87112
54027H7112J210M43J106K099J929Q95L32M74M77J61L59J406K420K450J646Q44
$$ 87112 88322 88765 89871 91970 93899 94794 95126 95600 96077 96238 96597 98003 100423 102873 104519 105363
54011A05363N57N87M38j12o80o61J9P43J059J215J403J087j01j215q00J112K803
$$ 105363 105920 106507 106945 106833 106153 105492 105511 106254 107313 108528 109931 111018 110917 109702 108902 110014 112817
53994A12817K912J976J514K076K779K572J566R19J418K488K986K894L353M746
$$ 112817 115729 117705 119219 121295 124074 126646 128212 129131 130549 133037 136023 138917 142270 147016
53980A47016N803N426M501M621N630N939N075M310M652N683O863Q438J0335J1416
$$ 147016 152819 158245 162746 167367 172997 178936 184011 188321 192973 198656 205519 213957 224292 235708
53966B35708J0788Q994P189N963N603O481Q145Q997Q019O184N144N117N180M951
$$ 235708 246496 255490 262679 268642 274245 280726 288871 297868 305887 312071 317215 322332 327512 332463
53952C32463M640L934K408Q44N05Q70k54l804p832r597q371n490k548m71J84q02
$$ 332463 337103 341037 343445 344289 344794 345664 345410 341606 333774 324177 315806 310316 307768 307297 307481 306679
53936C06679k932n154o685p497q019q413q139o448l501p48K70n69k150l498m335
$$ 306679 303747 298593 291908 284411 276392 267979 259840 253392 249891 249143 249413 248844 246694 243196 238861
53921B38861m431l511k071j240j348j458q16J4J39k36k20L92R86J085P37J68l07
$$ 238861 234430 230919 228848 227608 226260 224802 223986 224000 224139 223903 223683 224075 225061 226146 226883 227051 226744
53904B26744l30j1r9q90j375m21J448K405J571p7j187j415j059k36Q91J682J596
$$ 226744 226414 226403 226304 225414 224039 223618 225066 227471 229042 228965 227778 226363 225304 225068 225959 227641 229237
53887B29237R04L37K64O32J391K467L470M100M711N953P709Q940Q842P790O791
$$ 229237 230141 230478 230742 231374 232765 235232 238702 242802 247513 253466 261175 270115 278957 286747 293538
53872B93538O333O170O122O402O963P041N792L302O84p76m93J068K605K901K054
$$ 293538 299871 306041 312163 318565 325528 332569 338361 341663 342347 341571 341078 342146 344751 347652 349706
53857C49706J569K624M496N417M873M106M314N343O492P514Q253Q199P197N928
$$ 349706 351275 353899 358395 363812 368685 372791 377105 382448 388940 396454 404707 412906 420103 426031
53843D26031M985M191L427L287L970M398L574K141J300P68o73k906m292l763j965
$$ 426031 431016 435207 438634 441921 445891 450289 453863 456004 457304 458072 457399 454493 450201 446438 444473
53828D44473l25j59k421o711j0486j1032q600o186n869o881p692q129q496q350
$$ 444473 444148 443989 441568 434857 424371 413339 404739 398553 392684 385803 378111 369982 361486 353136
53814C53136p481o922p502q381q328p593p276p443p208o277n190m439m278n048
$$ 353136 345655 338733 331231 322850 314522 306929 299653 292210 285002 278725 273535 269096 264818 259770
53800B59770o581p713p430o190n229m903m691m419m318m244l933l824m516n448
$$ 259770 253189 245476 238046 231856 226627 221724 217033 212614 208296 204052 200119 196295 191779 186331
53786A86331n313l827k166j493j857k579k878k210p45N48J003J193J840K305J404
$$ 186331 181018 177191 175025 173532 171675 169096 166218 164008 163263 163811 164814 166007 167847 170152 171556
53771A71556l86j166l07O10J29j190j989k052j821j031P30K461K375M06j096O
$$ 171556 171170 170004 169697 170307 170436 169246 167257 165205 163384 162353 163083 165544 167919 168325 167229 167235
53755A67235K935M830M095K055R37J135J334Q21L04L72N87P52J781M125O275O328
$$ 167235 170170 175000 179095 181150 182087 183222 184556 185377 185681 186053 186640 187392 189173 193298 199573 205901
53739B05901M648L542M360O217P689Q393Q571Q194P242O314O254P300Q671Q931
$$ 205901 210549 214091 218451 224668 232357 240750 249321 257515 264757 271071 277325 284625 293296 302227
53725C02227P075L751J037M09J261K059K398K838L230K663J036o98k036l294m331
$$ 302227 309302 313053 314090 314499 315760 317819 320217 323055 326285 328948 329984 329286 327250 323956 319625
53710C19625m273l125k284k696l514l476k679k174k416l015l498l579l003j767
$$ 319625 315352 312227 309943 307247 303733 300257 297578 295404 292988 289973 286475 282896 279893 278126
53696B78126l80M55K36j169l176m438l899k076n86k50o14j244k242l161k846j181
$$ 278126 277746 278201 278437 277268 274092 269654 265755 263679 263093 262843 262229 260985 258743 255582 252736 251555
53680B51555J34m44k414m124m661m037k403l52P02k77k507m159m412l943l572
$$ 251555 251689 251245 248831 244707 240046 236009 233606 233254 233956 233679 231172 227013 222601 218658 215086
53665B15086l296k717j815j097j140j815k043r04R62J891J410Q63J355K187K244
$$ 215086 211790 209073 207258 206161 205021 203206 201163 200259 201221 203112 204522 205385 206740 208927 211171
53650B11171J846K047K851L445L657L900M012L478K687K666L592M566N023N272
$$ 211171 213017 215064 217915 221360 225017 228917 232929 236407 239094 241760 245352 249918 254941 260213
53636B60213N511N305M485L762L934M869N651N488M383L187K910L794N047N595
$$ 260213 265724 271029 275514 279276 283210 288079 293730 299218 303601 306788 309698 313492 318539 324134
53622C24134M958L388J585L95J44P8p94k055k031j88J769K097J339J129J533J125
$$ 324134 329092 332480 334065 334460 334604 334682 333888 331833 329802 329614 331383 333480 334819 335948 337481 338606
53606C38606n60k337l149l194l002k560j824j246j252j683j941j510m24M84K28
$$ 338606 338046 335709 332560 329366 326364 323804 321980 320734 319482 317799 315858 314348 313924 314408 314636
53591C14636q95j223K17K192K831K011R68K06o20j286j206r73j759l077l044j331
$$ 314636 313741 312518 312735 314927 317758 319769 320737 320943 320323 319037 317831 316858 315099 312022 308978 307647
53575C07647K05N16J019K989N104N298L895L050L596M186L441J681L29L81J539
$$ 307647 307852 308368 309387 312376 317480 322778 326673 329723 333319 337505 340946 342627 342956 343337 344876
53560C44876K404J693k60j610j055P02K155L058M327O274P953Q308P224N452M117
$$ 344876 347280 348973 348713 347103 346048 346750 348905 351963 356290 362564 370517 378825 386049 391501 395618
53545C95618M160N604P253P752P062O328O260O358O023N788O691Q661J0191R957
$$ 395618 399778 405382 412635 420387 427449 433777 440037 446395 452418 458206 464897 473558 483749 493706
53531D93706Q352O913O308N579L787J767J414L273N716O773O119M884M101L955
$$ 493706 502058 508971 515279 520858 524645 526412 527826 531099 536815 543588 549707 554591 558692 562647
53517E62647M061L950L323K347J531J083O51P8OJ129K993M231L938K347J51k041
$$ 562647 566708 570658 573981 576328 577859 578942 579593 579671 579677 580806 583799 588030 591968 594315 594466 592425
53501E92425l467l316j693K0N65K76M62J544K718L446M130M844M624L035J550
$$ 592425 588958 585642 583949 583969 584534 584810 585272 586816 589534 592980 597110 601954 606578 609613 611163
53486F11163J988L943N237M905M217M422N047N114M749M549M513M623N484P207
$$ 611163 613151 617094 622331 627236 631453 635875 640922 646036 650785 655334 659847 664470 669954 677161
53472F77161Q526Q386P620P641Q105P626O404O272P998J0286J1879J3094J4628
$$ 677161 685687 694073 701693 709334 717439 725065 731469 737741 745739 756025 767904 780998 795626
53459G95626J6197J7143J7524J7829J8301J8975J9831K0601K1051K1616K2971
$$ 795626 811823 828966 846490 864319 882620 901595 921426 942027 963078 984694 1007665
53448A007665K4795K5896K5850K5701K6706K9086L2150L4890L6406L6702L7087
$$ 1007665 1032460 1058356 1084206 1109907 1136613 1165699 1197849 1232739 1269145 1305847 1342934
53437A342934L8718M0820M1585M0980M0937M2428M4045M4329M3938M4370M5745
$$ 1342934 1381652 1422472 1464057 1505037 1545974 1588402 1632447 1676776 1720714 1765084 1810829
53426A810829M7003M7372M6692M5286M4358M5265M7566M8963M8158M6418M5210
$$ 1810829 1857832 1905204 1951896 1997182 2041540 2086805 2134371 2183334 2231492 2277910 2323120
53415B323120M4055M2334M1500M2990M5038M4359M0747L7485L6892L7780L7715
$$ 2323120 2367175 2409509 2451009 2493999 2539037 2583396 2624143 2661628 2698520 2736300 2774015
53404B774015L5876L2846K9272K5769K2943K0571J7552J3424R243O345M635K680
$$ 2774015 2809891 2842737 2872009 2897778 2920721 2941292 2958844 2972268 2981511 2987856 2992491 2995171
53392B995171p78n577j0268j3585j5846j8448k1744k4368k5442k6241k8362l1129
$$ 2995171 2994393 2988816 2978548 2964963 2949117 2930669 2908925 2884557 2859115 2832874 2804512 2773383
53380B773383l2613l2716l3193l4810l6568l7893l9499m1466m2408m1402l9072
$$ 2773383 2740770 2708054 2674861 2640051 2603483 2565590 2526091 2484625 2442217 2400815 2361743
53369B361743l6025l2049k7799k5383k5678k6518k5273k2099j9008j6631j3900
$$ 2361743 2325718 2293669 2265870 2240487 2214809 2188291 2163018 2140919 2121911 2105280 2091380
53358B091380j0363o958m524l043k308j928o68K708P589J1825J4304J6187J9009
$$ 2091380 2081017 2074059 2069535 2066492 2064184 2062256 2061588 2064296 2071885 2083710 2098014 2114201 2133210
53345B133210K2522K5235K6541K7491K9572L3145L7182M0335M2284M4018M6737
$$ 2133210 2155732 2180967 2207508 2234999 2264571 2297716 2334898 2375233 2417517 2461535 2508272
53334B508272N0596N4712N8170O0650O2338O3767O5765O8905P2744P6044P8083
$$ 2508272 2558868 2613580 2671750 2732400 2794738 2858505 2924270 2993175 3065919 3141963 3220046
53323C220046P9579Q1884Q5267Q8350Q9568Q9057Q8644Q9656R1209R1249Q9158
$$ 3220046 3299625 3381509 3466776 3555126 3644694 3733751 3822395 3912051 4003260 4094509 4183667
53312D183667Q6510Q4939Q4104Q2353P8843P4245O9446O4385N8318N0939M2951
$$ 4183667 4270177 4355116 4439220 4521573 4600416 4674661 4744107 4808492 4866810 4917749 4960700
53301D960700L5588K9451K3802J7314R677J940n035j1817j9418k7580l5028m1284
$$ 4960700 4996288 5025739 5049541 5066855 5076532 5078472 5073437 5061620 5042202 5014622 4979594 4938310
53289D938310m7088n2902n8041o1872o4982o8380p2095p5374p7913p9986q1515
$$ 4938310 4891222 4838320 4780279 4718407 4653425 4585045 4512950 4437576 4359663 4279677 4198162
53278D198162q1970q1373q0656q0575q0828q0692p9914p8495p6157p2865o9647
$$ 4198162 4116192 4034819 3954163 3873588 3792760 3712068 3632154 3553659 3477502 3404637 3334990
53267C334990o7809o7150o5842o2555n8027n3983n1111m8784m6354m3804m1261
$$ 3334990 3267181 3200031 3134189 3071634 3013607 2959624 2908513 2859729 2813375 2769571 2728310
53256B728310l8706l6288l4275l2551l0746k9020k8057k7970k7769k6381k3937
$$ 2728310 2689604 2653316 2619041 2586490 2555744 2526724 2498667 2470697 2442928 2416547 2392610
53245B392610k1542j9988j8948j7420j4712j1133p804n681m673l781k050P60M188
$$ 2392610 2371068 2351080 2332132 2314712 2300000 2288867 2281063 2275382 2270709 2266928 2264878 2265638 2269826
53232B269826P409R674J0894J1794J3134J4876J6670J8892K2296K6529L0047L1978
$$ 2269826 2277235 2286909 2297803 2309597 2322731 2337607 2354277 2373169 2395465 2421994 2452041 2484019
53220B484019L3229L5147L7829M0411M2263M3077M2357M0033L7220L5416L4748
$$ 2484019 2517248 2552395 2590224 2630635 2672898 2715975 2758332 2798365 2835585 2871001 2905749
53209B905749L3847L1496K7758K3415J9023J4771J0678O727K989k93l084n914
$$ 2905749 2939596 2971092 2998850 3022265 3041288 3056059 3066737 3073464 3076453 3076160 3073076 3067162
53197C067162r370j3325j6967j9695k1622k3310k5391k8305l1893l5354l8018
$$ 3067162 3057792 3044467 3027500 3007805 2986183 2962873 2937482 2909177 2877284 2841930 2803912
53186B803912m0045m1936m3581m4512m4918m5616m6941m8303m8953m8569m7142
$$ 2803912 2763867 2721931 2678350 2633838 2588920 2543304 2496363 2448060 2399107 2350538 2303396
53175B303396m5025m3215m2690m3190m3363m2415m0856l9377l7813l5776l3436
$$ 2303396 2258371 2215156 2172466 2129276 2085913 2043498 2002642 1963265 1925452 1889676 1856240
53164A856240l1190k9057k7034k5406k4195k2983k1842k1544k2014k1529j8803
$$ 1856240 1825050 1795993 1768959 1743553 1719358 1696375 1674533 1652989 1630975 1609446 1590643
53153A590643j5232j3477j4025j4846j4627j4514j5818j7466j7276j5046j2920
$$ 1590643 1575411 1561934 1547909 1533063 1518436 1503922 1488104 1470638 1453362 1438316 1425396
53142A425396j2790j4449j6426j7632j7730j6711j4948j3476j3413j4714j5907
$$ 1425396 1412606 1398157 1381731 1364099 1346369 1329658 1314710 1301234 1287821 1273107 1257200
53131A257200j5480j3612j2045j2187j3720j5419j6809j8328j9999k0914k0459
$$ 1257200 1241720 1228108 1216063 1203876 1190156 1174737 1157928 1139600 1119601 1098687 1078228
53120A078228j9353j8875j9329j9936k0096k0096k0381k0785k0775k0162j9156
$$ 1078228 1058875 1040000 1020671 1000735 980639 960543 940162 919377 898602 878440 859284
53109H59284j7923j6462j4872j3499j2700j2636j3228j4160j4948j5272j5227
$$ 859284 841361 824899 810027 796528 783828 771192 757964 743804 728856 713584 698357
53098F98357j5075j4726j3813j2386j1128j0626j0687j0750j0668j0781j1343
$$ 698357 683282 668556 654743 642357 631229 620603 609916 599166 588498 577717 566374
53087E66374j2261j3173j3470j2497j0331q192p328p586p762p359o963o843o313
$$ 566374 554113 540940 527470 514973 504642 496450 489122 481536 473774 466415 459452 452609 446296
53074D46296n074m062m043m301l827l137l463m522m639l311k183k853m678n649
$$ 446296 441222 437160 433117 428816 424989 421852 418389 413867 409228 405917 403734 400881 396203 390554
53060C90554m875l480l184m435n939n912l945j521m29r16j833k372k734l184l408
$$ 390554 385679 382199 379015 374580 368641 362729 358784 357263 356834 355918 354085 351713 348979 345795 342387
53045C42387l208k937k881k763k253j439n05L74N96m48k104k665j473J17P39J079
$$ 342387 339179 336242 333361 330598 328345 326906 326401 326775 327371 326923 324819 322154 320681 320798 321537 322616
53029C22616K618M976O051M808K683J861L001M909N739M388J339j563k598j703
$$ 322616 325234 330210 336261 341069 343752 345613 348614 353523 359262 363650 364989 363426 360828 359125
53015C59125l78j85j569l706n107m742l224k450l352m596m441l400l508n128o269
$$ 359125 358747 358562 356993 353287 348180 343438 340214 337764 334412 329816 325375 321975 318467 313339 307070
53000C07070n465l795l164l880m954n816o466o613n844m423k980j704o14l19j374
$$ 307070 301605 297810 294646 290766 285812 279996 273530 266917 261073 256650 253670 251966 251352 251033 249659
52985B49659l041l715k791j316n82q03j365j680j432o72q3o37k340l725l304j449
$$ 249659 246618 242903 240112 238796 238214 237411 236046 234366 232934 232262 232179 231542 229202 225477 222173 220724
52969B20724q8m33j691k326j949j346j085r92r40j276k054k601k337j568r68o70
$$ 220724 220636 220203 218512 216186 214237 212891 211806 210814 209874 208598 206544 203943 201606 200038 199070 198400
52953A98400m81n00r12j353j242n63K58J036J744J956J205j60j284j880k128j762
$$ 198400 197919 197419 196507 195154 193912 193349 193607 194643 196387 198343 199548 199388 198104 196224 194096 192334
52937A92334m21J004Q37j004k401j653L31J454J205P79R38J135Q10L42M15J026
$$ 192334 191913 192917 193754 192750 190349 188696 189027 190481 191686 192465 193403 194538 195348 195690 196105 197131
52921A97131J486J135L4q59m12J389L024K820P41j567k481j803n00N08J020J195
$$ 197131 198617 199752 199786 198927 198515 199904 202928 205748 206489 204922 202441 200638 200138 200646 201666 202861
52905B02861R52J46p07n40R20K469K843K469K701L541L559K209P88M78Q86J314
$$ 202861 203813 203959 203252 202712 203632 206101 208944 211413 214114 217655 221214 223423 224211 224689 225575 226889
52889B26889K082L444M398M079L368L628M566M941M839N380O518O973O475O237
$$ 226889 228971 232415 236813 240892 244260 247888 252454 257395 262234 267614 274132 281105 287580 293817
52875B93817O867P454P267O871O672N773L295k4k610l731l674k845j705j119j761
$$ 293817 300684 308138 315405 322276 328948 334721 338016 337992 335382 331651 327977 325132 323427 322308 320547
52860C20547l092l770l100j680m52M01J222J807J176j036l372l666j674L33K54
$$ 320547 317455 313685 310585 308905 308453 308854 310076 311883 313059 312023 308651 304985 303311 303644 303898
52845C03898j308k172j536n83m22q45j207j289j015l35J64l66j721k523j904m80
$$ 303898 302590 300418 298882 298299 297877 297032 295825 294536 293521 293186 293350 292984 291263 288740 286836 286356
52829B86356P20J510K193K859L464L891L496J499j562l596l034o74J238J383L11
$$ 286356 287076 288586 290779 293638 297102 300993 304489 305988 304426 300830 297796 297122 298360 299743 300054
52814C00054m78J36K006L620L306J029j378k184j361L9J273J939J494r5j632j674
$$ 300054 299576 299712 301718 305338 308644 309673 308295 306111 304750 304789 306062 308001 309495 309400 307768 306094
52798C06094k33J321J997J949J583P73n11j510j240L56K266L518M062M344M274
$$ 306094 305861 307182 309179 311128 312711 313484 312973 311463 310223 310579 312845 316363 320425 324769 329043
52783C29043L385K047J616K687L994M006L050K578K773K419J199L42M68N50k06
$$ 329043 332428 334475 336091 338778 342772 346778 349828 352406 355179 357598 358797 359139 359607 360157 359951
52768C59951r71q78n82r78j397o49J000K295K815K940K589J584P88J317K581K723
$$ 359951 358980 358102 357520 356542 355145 354496 355496 357791 360606 363546 366135 367719 368507 369824 372405 375128
52752C75128J083r65j928j755j235r48j128j772k481k854l126l709m210l786k646
$$ 375128 376211 375246 373318 371563 370328 369380 368252 366480 363999 361145 358019 354310 350100 346314 343668
52737C43668k210l255m698m797l214j399j034k400m233n239n578o325p534p811
$$ 343668 341458 338203 333505 328708 325494 324095 323061 320661 316428 311189 305611 299286 291752 283941
52723B83941o375m436l576l538k981j829j292j727k107j735j099q67j233k381
$$ 283941 277566 273130 269554 266016 263035 261206 259914 258187 256080 254345 253246 252379 251146 248765
52709B48765m257n702n284l368j920j846j991j380q11j220k015k309k604l767
$$ 248765 244508 238806 233522 230154 228234 226388 224397 223017 222206 220986 218971 216662 214058 210291
52695B10291n190n435m168k250m21Q22O52j311l722m403k696J0J925K181O97j925
$$ 210291 205101 199666 195498 193248 192827 193649 194301 192990 189268 184865 182169 182179 184104 186285 186982 185057
52679A85057m251m885l938k764k085j244K16J361J002n32j691j479m22J82m73
$$ 185057 180806 175921 171983 169219 167134 165890 166106 167467 168469 167937 166246 164767 164345 164527 164054
52664A64054k054l343l293k087j090j372k405k659j432L00J049L57j059k418l432
$$ 164054 162000 158657 155364 153277 152187 150815 148410 145751 144319 144619 145668 146025 144966 142548 139116
52649A39116l921l537k327j097o70q62p64J5Q44R29J97p58j266r55Q0J281K060
$$ 139116 135195 131658 129331 128234 127564 126702 125938 125953 126797 127726 127923 127165 125899 124944 125024 126305 128365
52632A28365K335K365K005Q15q64j660o68J166J987J212L1k89J69O17R57J727
$$ 128365 130700 133065 135070 135885 135021 133361 132693 133859 135846 137058 137089 136800 136969 137586 138543 140270
52616A40270K932L702L422K668K488K925K903J777M18L23J889M026N431N775N507
$$ 140270 143202 146904 150326 152994 155482 158407 161310 163087 163505 163828 165717 169743 175174 180949 186456
52601A86456M883L533J062j996m105m083k593j620k169l085k829j652j059j571
$$ 186456 191339 194872 195934 193938 189833 185750 183157 181537 179368 176283 173454 171802 170743 169172
52587A69172k365k817l035k817j697l96n48k215l285k429j117j145j618m97J742
$$ 169172 166807 163990 160955 158138 156441 156045 155497 153282 149997 147568 146451 145306 143688 143191 144933
52572A44933K505R83p68j109q64j274j907k023k250l209l747k470l19M84k19k89
$$ 144933 147438 148421 147653 146544 145680 144406 142499 140476 138226 135017 131270 128800 128481 128965 128746 128457
52556A28457J296K861K683J541J258J832J747O04k48%K61q27k838m047l525j885
$$ 128457 129753 132614 135297 136838 138096 139928 141675 142279 142031 142031 142292 141465 138627 134580 131055 129170
52540A29170r9J477K767L345K775J381K67L80J605K818K854J616J27m85r8N37
$$ 129170 129071 130548 133315 136660 139435 140816 141083 141463 143068 145886 148740 150356 150483 149998 149900 150437
52524A50437Q08P84O86M59J49K76J188K177J984L65j334j646n84O38J316J928
$$ 150437 151245 152029 152715 153174 153323 153599 154787 156964 158948 159313 157979 156333 155749 156387 157703 159631
52508A59631L043M174M264L003J232P6Q8J106K438L169K775J680Q40O92Q03O98
$$ 159631 162674 166848 171112 174115 175347 175423 175511 176617 179055 182224 184999 186679 187519 188211 189014 189712
52492A89712M93M93O73R55J565K564L416L581L196K643J747K19j359j919j291
$$ 189712 190205 190698 191371 192326 193891 196455 199871 203452 206648 209291 211038 211257 209898 207979 206688
52477B06688m32j03q5J25N73J113J738K308K491K305K125J982J431O15N59J752
$$ 206688 206256 206153 206068 206193 206766 207879 209617 211925 214416 216721 218846 220828 222259 222874 223433 225185
52461B25185K941K323j28k231j791J057L820M030J664q51j252K34J654J926J581
$$ 225185 228126 230449 230321 228090 226299 227356 231176 235206 236870 236019 234767 235001 236655 238581 240162
52446B40162R89n39l122n081m678k417l24O44J161J756J839Q29p97k101k629k392
$$ 240162 241151 240612 237490 232409 227731 225314 224990 225634 226795 228551 230390 231219 230422 228321 225692 223300
52430B23300j477j37J102J763J775J431J171J320J807K137J899J113J04p26p96
$$ 223300 221823 221686 222788 224551 226326 227757 228928 230248 232055 234192 236091 237204 237308 236582 235786
52415B35786M07K480M037M133L374K932K913K623J993J607J391N35j007k071j741
$$ 235786 236193 238673 242710 246843 250217 253149 256062 258685 260678 262285 263676 264211 263204 261133 259392
52400B59392n16M29N71K68K05P79J699K111J644J128J502K311K355J624J280J544
$$ 259392 258876 259305 259876 260144 260349 261128 262827 264938 266582 267710 269212 271523 273878 275502 276782 278326
52384B78326J169m23j936j893m50J341K911L877L550J884J71m43k76J5P61K070
$$ 278326 279495 279072 277136 275243 274793 276134 279045 282922 286472 288356 288527 288084 287808 287823 288584 290654
52368B90654K440M98k458l698k649j264q83p86j77M38O53J027J604J160q05k589
$$ 290654 293094 293592 291134 287436 284787 283523 282640 281854 281677 282115 282768 283795 285399 286559 285754 283165
52352B83165k197J69K710M371N358N962O089N679M643K796O48l83M53J976K478
$$ 283165 280968 281137 283847 288218 293576 299538 305627 311306 315949 318745 319393 319010 319463 321439 323917
52337C23917J871J300J192J134J232J961K750K442J344J067J829J773j51k330
$$ 323917 325788 327088 328280 329414 330646 332607 335357 337799 339143 340210 342039 343812 343661 341331
52323C41331k756j778r87m92P29K329K515O84j457k025j034J46N64K90l1K76J393
$$ 341331 338575 336797 335810 335318 336047 338376 340891 341575 340118 338093 337059 337205 337769 338059 338028 338304 339697
52306C39697K686L311L213L045L014K608J661Q98R65J615K373L284M350M900M412
$$ 339697 342383 345694 348907 351952 354966 357574 359235 360133 361098 362713 365086 368370 372720 377620 382032
52291C82032L452K955K980L019L204M075N213N474M746M342N027N775N253L745
$$ 382032 385484 388439 391419 394438 397642 401717 406930 412404 417150 421492 426519 432294 437547 441292
52277D41292K568K210K277K828M303N980O023L999K199L142O216Q242P468N609
$$ 441292 443860 446070 448347 451175 455478 461458 467481 471480 473679 476821 483037 491279 498747 504356
52263E04356N298O693P776P368O377O068O523P409Q997J1366J3327J3431J1957
$$ 504356 509654 516347 524123 531491 537868 543936 550459 557868 566865 578231 591558 604989 616946
52250F16946J0755J0986J2134J3483J5415J8332K1094K1871K0444J8680J8452
$$ 616946 627701 638687 650821 664304 679719 698051 719145 741016 761460 780140 798592
52239G98592J9956K2314K4885K7313K8908K9116K8549K8586K9662L0751L0976
$$ 798592 818548 840862 865747 893060 921968 951084 979633 1008219 1037881 1068632 1099608
52228A099608L0991L1947L3562L4251L3159L1092K9250K8011K7443K7976K9555
$$ 1099608 1130599 1162546 1196108 1230359 1263518 1294610 1323860 1351871 1379314 1407290 1436845
52217A436845L0745K9912K7138K4040K1629J9478J7143J5230J4351J3875J2505
$$ 1436845 1467590 1497502 1524640 1548680 1570309 1589787 1606930 1622160 1636511 1650386 1662891
52206A662891R780O294K812j57k173k935k596j648p11n48j798l978n352m618k516
$$ 1662891 1672671 1678965 1681777 1681620 1679447 1676512 1673916 1672268 1671557 1671009 1669211 1665233 1659881 1655263 1652747
52191A652747q04M1R64K328L291L644M781P771J1590J4372J5772J6809J7931J8671
$$ 1652747 1651943 1651984 1652948 1655276 1658567 1662211 1666992 1674763 1686353 1700725 1716497 1733306 1751237 1769908
52177A769908J9044J9826K1162K2093K1849K0755J9432J8016J6616J5653J5094
$$ 1769908 1788952 1808778 1829940 1852033 1873882 1894637 1914069 1932085 1948701 1964354 1979448
52166A979448J4092J2073R634P664O061M056J380j664m867q002j0468j1972j3401
$$ 1979448 1993540 2005613 2015247 2022911 2028972 2033028 2034408 2032744 2027877 2019875 2009407 1997435 1984034
52153A984034j5985j9485k2235k3169k2956k2891k3480k4516k5667k6364k5794
$$ 1984034 1968049 1948564 1926329 1903160 1880204 1857313 1833833 1809317 1783650 1757286 1731492
52142A731492k3843k1686k0738k1091k1541k1036j9615j8058j6999j6427j5708
$$ 1731492 1707649 1685963 1665225 1644134 1622593 1601557 1581942 1563884 1546885 1530458 1514750
52131A514750j4271j2393j1109j1029j1499j1435j0704j0018r571q540o319l670
$$ 1514750 1500479 1488086 1476977 1465948 1454449 1443014 1432310 1422292 1412721 1404181 1397862 1394192
52119A394192k074k123l071l914m482n088n500n059l879l303m430o546p770p299
$$ 1394192 1392118 1389995 1386924 1383010 1378528 1373440 1367940 1362881 1359002 1355699 1351269 1344723 1336953 1329654
52105A329654o134n441n173m743m257m188m343m162l801l998m874n650n679n128
$$ 1329654 1323520 1318079 1312906 1308163 1303906 1299718 1295375 1291213 1287412 1283414 1278540 1272890 1267211 1262083
52091A262083m561m385m744n349n457m551l062j838j089n44n39j665l305l795
$$ 1262083 1257522 1253137 1248393 1243044 1237587 1233036 1229974 1228136 1227047 1226503 1225964 1224299 1220994 1217199
52077A217199k642j404j535k375k372j373n21m35q12j516k597l373k851j364m96
$$ 1217199 1214557 1213153 1211618 1209243 1206871 1205498 1204977 1204542 1203730 1202214 1199617 1196244 1193393 1192029 1191533
52062A191533j008j767j337L35K245L532L831L284K932M175P014R438R642Q446
$$ 1191533 1190525 1188758 1187421 1187756 1190001 1193533 1197364 1200648 1203580 1207755 1214769 1224207 1233849 1242295
52048A242295Q388J0557J3449J5192J5868J7035J9548K2623K5011K6596K8416
$$ 1242295 1250683 1261240 1274689 1289881 1305749 1322784 1342332 1364955 1389966 1416562 1444978
52037A444978L1055L3510L4315L3786L4018L6171L8730L9575L9011L9082M0149
$$ 1444978 1476033 1509543 1543858 1577644 1611662 1647833 1686563 1726138 1765149 1804231 1844380
52026A844380M0150L7806L4723L3067L2498L0998K7989K4832K2371J9780J6291
$$ 1844380 1884530 1922336 1957059 1990126 2022624 2053622 2081611 2106443 2128814 2148594 2164885
52015B164885J2542R436O632L289k81k854m099n210p405j0468j3206j4938j5933
$$ 2164885 2177427 2186863 2193495 2196784 2196503 2193649 2189550 2184340 2176935 2166467 2153261 2138323 2122390
52002B122390j6631j7139j7546j8028j8189j7005j4219j1378j0427j1240j1564
$$ 2122390 2105759 2088620 2071074 2053046 2034857 2017852 2003633 1992255 1981828 1970588 1959024
51991A959024r773o735m424l476k979j971k66J924M296O565Q879J1706J4646J5992
$$ 1959024 1949251 1942516 1938092 1934616 1931637 1929666 1929400 1931324 1935620 1942185 1951064 1962770 1977416 1993408
51977A993408J4623J1966J0633J1123J1473J0480R576J0418J1966J1549Q363M392
$$ 1993408 2008031 2019997 2030630 2041753 2053226 2063706 2073282 2083700 2095666 2107215 2115578 2119970
51965B119970J711J84j660m280o596p701q314r929j2886j6018j8357k0401k3019
$$ 2119970 2121681 2121865 2120205 2115925 2109329 2101628 2093314 2083385 2070499 2054481 2036124 2015723 1992704
51952A992704k5899k8035k9353l0653l1969l2370l1688l1287l2447l4778l6812
$$ 1992704 1966805 1938770 1909417 1878764 1846795 1814425 1782737 1751450 1719003 1684225 1647413
51941A647413l7572l7118l6380l6703l8650m0777m0660l7932l5153l4773l6164
$$ 1647413 1609841 1572723 1536343 1499640 1460990 1420213 1379553 1341621 1306468 1271695 1235531
51930A235531l6921l6193l5249l5189l5603l5468l4204l1827k9030k7055k6511
$$ 1235531 1198610 1162417 1127168 1091979 1056376 1020908 986704 954877 925847 898792 872281
51919H72281k6367k5134k2822k0780j9692j8962j8142j7645j7778j8074j7973
$$ 872281 845914 820780 797958 777178 757486 738524 720382 702737 684959 666885 648912
51908F48912j7299j5820j3344j0587q925q804r250r384r471r894j0097r367q006
$$ 648912 631613 615793 602449 591862 582937 574133 564883 555499 546028 536134 526037 516670 508664
51895E08664o889o341o198o406o851o964o376n705n858o703p169o608n413m258
$$ 508664 501775 495434 489236 482830 475979 469015 462639 456934 451076 444373 437204 430596 425183 420925
51881D20925l408k999l284m167m847m577l713l541m736o280o343m302j506J14
$$ 420925 417517 414518 411234 407067 402220 397643 393930 390389 385653 379373 373030 368728 367222 367336
51867C67336k19j917l979n540n848m704l065k479l528n175o016n706m866m025
$$ 367336 367117 365200 361221 355681 349833 345129 342064 339585 336057 330882 324866 319160 314294 310269
51853C10269l170k281j696j712j903j410j43O25m77l003m818m468k674r80J69
$$ 310269 307099 304818 303122 301410 299507 298097 297954 298579 298102 295099 290281 285813 283139 282159 282328
51838B82328J046J254K24j183j277j6O71m25k104k588j957j560j809j839j127
$$ 282328 283374 284628 284852 283669 282392 282376 283047 282622 280518 277930 275973 274413 272604 270765 269638
51823B69638l10k28q59j475j412n87M90J114R52K37m99q32n88K09J340K422K960
$$ 269638 269328 269100 268241 266766 265354 264767 265257 266371 267323 267560 267061 266229 265641 265850 267190 269612 272572
51806B72572K528J309L59O04J403J011q60k023n79K221L543K878K347L150L954
$$ 272572 275100 276409 276768 277372 278775 279786 278926 276903 276324 278545 282088 284966 287313 290463 294417
51791B94417L555K947L472M482M461L425K587K308J782N10r95j890j783j052p09
$$ 294417 297972 300919 304391 308873 313334 316759 319346 321654 323436 323946 322951 321061 319278 318226 317517
51776C17517j339k065j528j82r7j851l321k713j053j00M47J518J986K34k379k780
$$ 317517 316178 314113 312585 312403 312306 310455 307134 304421 303368 303268 303715 305233 307219 307453 305074 302294
51760C02294q06M95l67j237j58J492J458J38m46J92J013J669K593L246K329r5
$$ 302294 301488 301983 301616 300379 300221 301713 303171 303309 302863 303055 304068 305737 308330 311576 313905 313810
51744C13810k223k685j939j175p60m13j89n32j508k471k622j844q58m78p00p63
$$ 313810 311587 308902 306963 305788 305028 304615 304426 303894 302386 299915 297293 295449 294591 294113 293413 292650
51728B92650k07L72p1j723l492l938k594l31J404J824J295P91R71J840L115M547
$$ 292650 292443 292815 292744 291021 287529 283591 280997 280666 282070 283894 285189 285980 286951 288791 291906 296453
51712B96453N805O290N381L099M75j038q04M13J299J305Q32L58N3J99J132K520
$$ 296453 302258 308548 313929 317028 317503 316465 315661 316074 317373 318678 319510 319868 319921 320120 321252 323772
51696C23772L425L535L577M022M129L156J937K242M633P757R712R610Q085O855
$$ 323772 327197 330732 334309 338331 342460 345616 347553 349795 354428 362185 371897 381507 389592 396447
51682C96447P507R994J2501J3394J2932J2352J1782J0200P255L964J424q2o46
$$ 396447 403954 413948 426449 439843 452775 465127 476909 487109 494364 498328 499752 499670 499024
51669D99024l33M07Q49Q06P14O07j31j617k830k768j785j201j741k745k986k112
$$ 499024 498691 499098 499947 500753 501467 502074 501943 500326 497496 494728 492943 491742 490001 487256 484270 482158
51653D82158j118j139j842j727l21Q20J02j767k686j929p11j28J2J93L83N93J142
$$ 482158 481040 479901 478059 476332 476011 476831 476933 475166 472480 470551 469840 469712 469724 469917 470300 470893 472035
51636D72035J814J814J082P09J543L050M143M447M282L994L768L702L789M130
$$ 472035 473849 475663 476745 477454 478997 482047 486190 490637 494919 498913 502681 506383 510172 514302
51622E14302N045O487P594P616O903O022M502J935j78K78K700M095L177J818J605
$$ 514302 519347 525834 533428 541044 547947 553969 558471 560406 560228 560506 563206 567301 570478 572296 573901
51607E73901J495M31j06J447L525L365J036j004j709k218l185l902m203m915n940
$$ 573901 575396 575827 575721 577168 580693 584058 585094 584090 582381 580163 576978 573076 568873 563958 558018
51592E58018o031n083m778o123q011r102r567r958r735q259o224m877m419m234
$$ 558018 551987 546904 542126 536003 527992 518890 509323 499365 489630 481371 475147 470270 465851 461617
51578D61617m154m397m650m383l933m241n393o232n738m259k967k535k674k841
$$ 461617 457463 453066 448416 444033 440100 435859 430466 424234 418496 414237 411270 408735 406061 403220
51564D03220k915l030l045k589j685r65j052j937l132m199m836m681l508j648
$$ 403220 400305 397275 394230 391641 389956 388991 387939 386002 382870 378671 373835 369154 365646 363998
51550C63998R5J036J023M02l22q67j276j558j324l05R05J250O52L15J158K567
$$ 363998 364093 365129 366152 366554 366232 365365 364089 362531 361207 360902 361807 363057 363709 364024 365182 367749
51534C67749L331L278L205L630M399N228N943O300O236O124O273O540O882P729
$$ 367749 371080 374358 377563 381193 385592 390820 396763 403063 409299 415423 421696 428236 435118 442847
51520D42847R054R781R088P664O504N100K456n61j779r32l32j695l960n213n347
$$ 442847 451901 461682 470770 478434 484938 490038 492494 491933 490154 489222 488890 487195 483235 478022 472675
51505D72675n490n816n444m047k410j505j679k526l104k608j321k48M73J851M117
$$ 472675 467185 461369 455925 451878 449468 447963 446284 443758 440654 438046 436725 436477 436950 438801 442918
51490D42918N704N322M281N084Q074J0917J1459R770P226M830K909J444J41j172
$$ 442918 448622 453944 458225 463309 471383 482300 493759 503529 510755 515585 518494 519938 520079 518907
51476E18907j978j608n40k19j240k548k937k422j562l61J198K291K167J513J794
$$ 518907 516929 515321 514781 514562 513322 510774 507837 505415 503853 503492 504690 506981 509148 510661 512455
51461E12455L251M629M999M786M631M185K662J19k355l523k945j475r20k468n241
$$ 512455 515706 520335 525334 530120 534751 538936 541598 541717 539362 535839 532894 531419 530499 528031 522790
51446E22790p035o897o187o382o973o577n528n612p211q412p567n481m085l802
$$ 522790 515755 508858 502671 496289 489316 482739 477211 471599 464388 455976 448409 442928 438843 435041
51432D35041l397j968r8R79O50o12j533j042M31R66p68l508m330j801K500N824
$$ 435041 431644 429676 429578 430557 431207 430595 429062 428020 428451 429417 428649 425141 420811 419010 421510 427334
51416D27334O876O268N185M417M355N048O074O923P616Q565R732J0503J0647J0826
$$ 427334 434210 440478 445663 450080 454435 459483 465557 472480 480096 488661 498393 508896 519543 530369
51402E30369J1587J2308J1970J0806J0217J0749J1132R929P426N053L407J999
$$ 530369 541956 554264 566234 577040 587257 598006 609138 619067 626493 631546 634953 636952
51390F36952O58j0J14J23n81j240p49Q06K272K813K546K076J843J956K240K531
$$ 636952 637610 637600 637714 637837 637256 636016 635267 636073 638345 641158 643704 645780 647623 649579 651819 654350
51374F54350K912L396L393K104k80k411l284l285l366l824m563n797p535q831
$$ 654350 657262 660658 664051 666155 665875 663464 660180 656895 653529 649705 645142 639345 631810 622979
51360F22979q678p513o739o874p182p207p446q091q143o640m155k239j686j990
$$ 622979 614301 606788 600049 593175 585993 578786 571340 563249 555106 548466 544311 542072 540386 538396
51346E38396k385k705k969k730j371R74L229M353M330L892L490L116K934L304
$$ 538396 536011 533306 530337 527607 526236 527210 530439 534792 539122 543014 546504 549620 552554 555858
51332E55858L937L829K618J205M92O7j072l096n505q097j0668j2237j1928j0522
$$ 555858 559795 563624 566242 567447 567939 568006 566934 563838 558333 550236 539568 527331 515403 504881
51318E04881r824j0296j0682j0218r770j0139j0594j0212r658j0262j1753j2312
$$ 504881 495057 484761 474079 463861 454091 443952 433358 423146 413488 403226 391473 379161
51306C79161j0894q457o514n386m451l693l991n670p379p249n152l039k599l312
$$ 379161 368267 359810 353296 347910 343459 339766 335775 330105 322726 315477 310325 307286 304687 301375
51292C01375l517k840k345k515k402j262J33M70n11j925k793k595j423j08K73
$$ 301375 297858 295018 292673 290158 287756 286494 286627 287097 286586 284661 281868 279273 277850 277742 278015
51277B78015m60j385j798k073k585k537r73J375K519J700N24J096L577O031O434
$$ 278015 277555 276170 274372 272299 269714 267177 266204 267579 270098 271798 272322 273418 276995 283026 289460
51262B89460M611K330J685L226N621P208P630P716Q034Q238P961P622P770Q025
$$ 289460 294071 296401 298086 301312 306933 314141 321771 329487 337521 345759 353720 361342 369112 377137
51248C77137P374N552L559K409J866Q19j270l847o048p419p787p163o188o045
$$ 377137 384511 390063 393622 396031 397897 398716 397446 393599 387551 380132 372345 365182 358994 352949
51234C52949p222q687q929p747o291n483n062m439l714l488l990m755n035m440
$$ 352949 345727 337040 328111 320364 314073 308590 303528 299089 295375 291887 287897 283142 278107 273667
51220B73667l337k653k986l892m247l399j741k95O8q60k389l349l168k509k395
$$ 273667 270330 267677 264691 260799 256552 253153 251412 251117 251185 250325 247936 244587 241419 238910 236515
51205B36515k932l432l516l305k666j211P55K149K305J496J13j749l502l829k042
$$ 236515 233583 230151 226635 223330 220664 219453 220208 222357 224662 226158 226271 224522 221020 217191 215149
51190B15149R11L480N040N780N626M286K175M13l59o80j508k922l777k811k34
$$ 215149 216060 219540 224580 230360 235986 240272 242447 242860 242501 241821 240313 237391 233614 230803 230569
51175B30569K039K155L11j568j945q74Q46K563L563L012R37j300k251j617K4K043
$$ 230569 232608 234763 235074 233506 231561 230687 231533 234096 237659 240671 241608 240308 238057 236440 236464 238507
51159B38507L571L431J338j198k170j172M87J480J406N15m91l51J756M836O484
$$ 238507 242078 245509 246847 245649 243479 242307 242794 244274 245680 246195 245704 245353 247109 251945 258429
51144B58429N334K603P52R78K375L290K965J880Q70K76r5n09j085j789k237j759
$$ 258429 263763 266366 267118 268096 270471 273761 276726 278606 279476 279752 279657 279148 278063 276274 274037 272278
51128B72278k42J149R40p83k286k324j500j038j096j167j296j778k125j567m55
$$ 272278 272036 273185 274125 273342 271056 268732 267232 266194 265098 263931 262635 260857 258732 257165 256710
51113B56710n8q50j906k162j462k69R66J868K172J939J328J84j669l657m673m288
$$ 256710 256652 255802 253896 251734 250272 250003 250969 252837 255009 256948 258276 258460 256791 253134 248461 244173
51097B44173l244k525k325k095j311j00P16K53j447l168l681l021k148j598j073
$$ 244173 240929 238404 236079 233984 232673 232573 233289 233542 232095 228927 225246 222225 220077 218479 217406
51082B17406l74J47K40K18L65M09K0n44p50n25k99l07k86Q4O68J092J376K040
$$ 217406 217032 217179 217419 217637 218002 218411 218431 217887 217137 216612 216313 216006 215720 215804 216472 217564 218940 220980
51064B20980L330M611N014M508L851L455K927J897O17n29j562k500l045l070k835
$$ 220980 224310 228921 233935 238443 242294 245749 248676 250573 251190 250661 249099 246599 243554 240484 237649
51049B37649k333j167L71J052L80k96M59J979K359J116l68r56q49n30O7R15J453
$$ 237649 235316 234149 234520 235572 235952 235656 236115 238094 240453 241569 241201 240245 239396 238866 238933 239848 241301
51032B41301J307P07k2o71p90P2J682L334M747N833N897M341K089Q41O41j98k226
$$ 241301 242608 243315 243293 242622 241832 241904 243586 246920 251667 257500 263397 267738 269827 270668 271309 271111 268885
51015B68885l578k510J29K168K796K771K797L001L335L413K426K76j681k104j322
$$ 268885 265307 262797 262926 265094 267890 270661 273458 276459 279794 283207 285633 285909 284228 282124 280802
51000B80802n97l03m3j0p65j841k026j126j86J85N47J420K426L076L421L508L054
$$ 280802 280205 279902 279859 279849 279084 277243 275217 274091 273905 274090 274637 276057 278483 281559 284980 288488 291542
50983B91542K077J211Q92Q91Q71Q25P44N91P75J681K551K055M57j23J361L035
$$ 291542 293619 294830 295722 296613 297484 298309 299053 299644 300419 302100 304651 306706 307163 307040 308401 311436
50967C11436K594O01m52K94J464K114K765L461L098J669J210K890M751M160J539
$$ 311436 314030 314631 314179 314473 315937 318051 320816 324277 327375 329044 330254 333144 337895 342055 343594
50952C43594k73J94J822L234M316N231N646N629N891O544O717O041N380N596O553
$$ 343594 343321 343515 345337 348571 352887 358118 363764 369393 375284 381828 388545 394586 399966 405562 412115
50937D12115P908R698J1464J2094J1453J1051J2021J3514J4245J4603J5706J7328
$$ 412115 420023 429721 441185 453279 464732 475783 487804 501318 515563 530166 545872 563200
50925E63200J8455J9407K1431K4332K6377K6872K7291K9169L2163L4879L6752
$$ 563200 581655 601062 622493 646825 673202 700074 727365 756534 788697 823576 860328
50914H60328L8415M0766M4230M8575N3210N7827O2726O8213P4064Q0059Q6448
$$ 860328 898743 939509 983739 1032314 1085524 1143351 1206077 1274290 1348354 1428413 1514861
50903A514861R3052R8623J02272J05031J08443J11983J13634J12920J11339J09331
$$ 1514861 1607913 1706536 1808808 1913839 2022282 2134265 2247899 2360819 2472158 2581489
50893B581489J04995R6856Q6203P5270O4452N2877M0740K9356J9210R382j070
$$ 2581489 2686484 2783340 2869543 2944813 3009265 3062142 3102882 3132238 3151448 3160830 3159760
50882C159760j2014k2391l0786l6221l9116m1140m3398m5105m4913m3268m2449
$$ 3159760 3147746 3125355 3094569 3058348 3019232 2978092 2934694 2889589 2844676 2801408 2758959
50871B758959m4073m7307m9957n0979n1444n2920n5325n7219n8336o0545o5176
$$ 2758959 2714886 2667579 2617622 2566643 2515199 2462279 2406954 2349735 2291399 2230854 2165678
50860B165678p0336p2878p2667p2550p3676p3523p0018o5150o2147o0709n7835
$$ 2165678 2095342 2022464 1949797 1877247 1803571 1730048 1660030 1594880 1532733 1472024 1414189
50849A414189n2713m7801m4962m3114m0579l7618l5230l2963k9486k4698j9974
$$ 1414189 1361476 1313675 1268713 1225599 1185020 1147402 1112172 1079209 1049723 1025025 1005051
50838A005051j6456j4036j2033j0171q637p440o102m172j894KJ338K839N048P303
$$ 1005051 988595 974559 962526 952355 943718 936278 930176 926004 924110 924112 925450 928289 933337 940640
50824I40640Q408Q165P599P733Q727J0291J2384J5096J8078K0466K1560K1656
$$ 940640 949048 957213 964812 972545 981272 991563 1003947 1019043 1037121 1057587 1079147 1100803
50812A100803K1953K3346K5435K7206K8589L0546L3495L6649L9316M2091M6031
$$ 1100803 1122756 1146102 1171537 1198743 1227332 1257878 1291373 1328022 1367338 1409429 1455460
50801A455460N1333N7514O4245P1208P7755Q3670Q9864R7457J06522J16537J27630
$$ 1455460 1506793 1564307 1628552 1699760 1777515 1861185 1951049 2048506 2155028 2271565 2399195
50790B399195J40257J53956J67487J80296J92939K05993K19180K31472K41401
$$ 2399195 2539452 2693408 2860895 3041191 3234130 3440123 3659303 3890775 4132176
50781D132176K47436K49041K47315K43865K38847K30613K17137J97394J71787
$$ 4132176 4379612 4628653 4875968 5119833 5358680 5589293 5806430 6003824 6175611
50772F175611J42198J11315Q0911N0807K0258r861l7122n9640p7190r0447j00089
$$ 6175611 6317809 6429124 6510035 6560842 6581100 6571239 6534117 6474477 6397287 6306840 6206751
50761F206751j06611j10030j09822j06078j00587r5714r2350r0073q9129r0767
$$ 6206751 6100140 5990110 5880288 5774210 5673623 5577909 5485559 5395486 5306357 5215590
50751E215590r5468j02353j10725j20657j31488j41271j48691j54346j59144j62580
$$ 5215590 5120122 5017769 4907044 4786387 4654899 4513628 4364937 4210591 4051447 3888867
50741C888867j63800j63361j62377j60444j55909j48253j38922j29627j20766
$$ 3888867 3725067 3561706 3399329 3238885 3082976 2934723 2795801 2666174 2545408
50732B545408j11943j03163r4784q6599p7838o8350n9249n1820m5873l9924l3280
$$ 2545408 2433465 2330302 2235518 2148919 2071081 2002731 1943482 1891662 1845789 1805865 1772585
50721A772585k7124k2934k0539j8689j7010j6089j5728j4630j2287r987r186r608
$$ 1772585 1745461 1722527 1701988 1683299 1666289 1650200 1634472 1619842 1607555 1597568 1588382 1578774
50709A578774r716q678p293p160r156j2429j4904j5105j3410j1202r057o582l740
$$ 1578774 1569058 1560380 1553087 1545927 1536771 1524342 1509438 1494333 1480923 1469721 1460664 1454082 1450342
50696A450342j217O06K216M212O777R983J3778J7678K1260K4917K9249L3866L8102
$$ 1450342 1449125 1449731 1451947 1456159 1462936 1472919 1486697 1504375 1525635 1550552 1579801 1613667 1651769
50683A651769M2530M8258N4698O0044O4316O9875P8020Q7065R4918J01791J08820
$$ 1651769 1694299 1742557 1797255 1857299 1921615 1991490 2069510 2156575 2251493 2353284 2462104
50672B462104J15763J21947J28110J35119J41716J45739J47111J47651J48035
$$ 2462104 2577867 2699814 2827924 2963043 3104759 3250498 3397609 3545260 3693295
50663C693295J46929J43121J36870J28650J17969J04074Q6990O7497M6599K5003
$$ 3693295 3840224 3983345 4120215 4248865 4366834 4470908 4557898 4625395 4671994 4696997
50653D696997K833j9788m1463n9718p3333q3619r2093r7848r8935r5795r1241
$$ 4696997 4699830 4680042 4638579 4578861 4505528 4421909 4329816 4231968 4133033 4037238 3945997
50642C945997q6971q2184p6117p0130o6171o4395o3456o2577o2479o4506o9287
$$ 3945997 3859026 3776842 3700725 3630595 3564424 3500029 3436573 3373996 3311517 3247011 3177724
50631C177724p5987q2723q7985r1656r4348r6111r6423r5158r2701q9280q4854
$$ 3177724 3101737 3019014 2931029 2839373 2745025 2648914 2552491 2457333 2364632 2275352 2190498
50620B190498p9491p3142o5506n6992m9242m3482l8739l3100k6347j9930j4511
$$ 2190498 2111007 2037865 1972359 1915367 1866125 1822643 1783904 1750804 1724457 1704527 1690016
50609A690016r340m013J021N969J1768J8122K3322K6730K9604L2529L3923L2525
$$ 1690016 1680676 1676663 1677684 1683653 1695421 1713543 1736865 1763595 1793199 1825728 1859651 1892176
50597A892176K9825K8327K8454K8761K8387K7883K8098K9519L2148L5054L6678
$$ 1892176 1922001 1950328 1978782 2007543 2035930 2063813 2091911 2121430 2153578 2188632 2225310
50586B225310L6733L7045L9422M3445M7650N2088N7963O5084P1472P5769P8781
$$ 2225310 2262043 2299088 2338510 2381955 2429605 2481693 2539656 2604740 2676212 2751981 2830762
50575B830762Q2212Q6688R1310R4461R5052R3348R0438Q6585Q0780P2560O3281
$$ 2830762 2912974 2999662 3090972 3185433 3280485 3373833 3464271 3550856 3631636 3704196 3767477
50564C767477N4638M6666L8447L0008K2043J4469P129J538j72J716M396N799O299
$$ 3767477 3822115 3868781 3907228 3937236 3959279 3973748 3980877 3982415 3982243 3983959 3988355 3994154 4000453
50551D000453O794P044O826O989Q066Q941Q102N360J315l892j0324j7505k5026
$$ 4000453 4007247 4014291 4021117 4028106 4036172 4045113 4053215 4058575 4059890 4055998 4045674 4028169 4003143
50538D003143l3349m2930n3211o3306p3092q2561r0758r6596j00437j03601j06470
$$ 4003143 3969794 3926864 3873653 3810347 3737255 3654694 3563936 3467340 3366903 3263302 3156832
50527C156832j08180j08166j06877j04821j01908r8079r3761q9389q4886q0000
$$ 3156832 3048652 2940486 2833609 2728788 2626880 2528801 2435040 2345651 2260765 2180765
50517B180765p4605o8658o2265n5886m9998m4456l8700l2636k6782k1371j5987
$$ 2180765 2106160 2037502 1975237 1919351 1869353 1824897 1786197 1753561 1726779 1705408 1689421
50506A689421j0350n035q30K335N395R091J3197J6941K0008K2972K6655L1198
$$ 1689421 1679071 1674036 1673206 1675541 1680936 1690027 1703224 1720165 1740173 1763145 1789800 1820998
50494A820998L5969M0269M3906M7047M9853N2375N4558N6194N7161N7770N8530
$$ 1820998 1856967 1897236 1941142 1988189 2038042 2090417 2144975 2201169 2258330 2316100 2374630
50483B374630N9479O0251O0784O1362O1754O1344O0526O0900O3286O6430O8958
$$ 2374630 2434109 2494360 2555144 2616506 2678260 2739604 2800130 2861030 2924316 2990746 3059704
50472C059704P1720P6641Q3724R0905R6987J03008J10275J18616J27264J36131
$$ 3059704 3131424 3208065 3291789 3382694 3479681 3582689 3692964 3811580 3938844 4074975
50462D074975J45137J53214J59032J62255J63353J62615J60005J55427J48450
$$ 4074975 4220112 4373326 4532358 4694613 4857966 5020581 5180586 5336013 5484463
50453E484463J38145J23915J06336Q6725O6128M5009K3676K586j7635l6492n4165
$$ 5484463 5622608 5746523 5852859 5939584 6005712 6050721 6074397 6076983 6059348 6022856 5968691
50442E968691p1354q7804j01375j09829j13424j14120j12165j05677r4402q1527
$$ 5968691 5897337 5809533 5708158 5598329 5484905 5370785 5258620 5152943 5058541 4977014
50432D977014o9947n8638m5073k9793j5814m351N715J4117J8075J5824Q818p65
$$ 4977014 4907067 4848429 4803356 4773563 4757749 4753398 4759113 4773230 4791305 4807129 4815947 4815182
50420D815182j2790k8117m6476o6738q7927j08497j25819j38035j45827j51031
$$ 4815182 4802392 4774275 4727799 4661061 4573134 4464637 4338818 4200783 4054956 3903925
50410C903925j54140j54419j51868j47636j42623j36903j30448j23461j15974
$$ 3903925 3749785 3595366 3443498 3295862 3153239 3016336 2885888 2762427 2646453
50401B646453j07943r9635r1188q2109p2128o2270n4050m7591m1601l5287k9187
$$ 2646453 2538510 2438875 2347687 2265578 2193450 2131180 2077130 2029539 1987938 1952651 1923464
50390A923464k3769j8327j2053n441L61N149R648J4138J8097K1537K5513L0484
$$ 1923464 1899695 1881368 1869315 1863874 1864235 1869384 1879032 1893170 1911267 1932804 1958317 1988801
50378A988801L4863L6676L6513L7321M0589M4203M5331M4415M4363M6294M8160
$$ 1988801 2023664 2060340 2096853 2134174 2174763 2218966 2264297 2308712 2353075 2399369 2447529
50367B447529M7951M6227M4516M2918M0771L8545L7346L6988L6032L3720L0795
$$ 2447529 2495480 2541707 2586223 2629141 2669912 2708457 2745803 2782791 2818823 2852543 2883338
50356B883338K8478K7505K8089L0001L2619L5466L8559M1832M4660M6666M8574
$$ 2883338 2911816 2939321 2967410 2997411 3030030 3065496 3104055 3145887 3190547 3237213 3285787
50345C285787N1285N4349N6255N6186N4579N2151M9179M5666M1369L5627K8041
$$ 3285787 3337072 3391421 3447676 3503862 3558441 3610592 3659771 3705437 3746806 3782433 3810474
50334C810474J9132R645o20j2301k5029l7663m9932o2426p4760q5115r2267r6854
$$ 3810474 3829606 3839251 3838631 3826330 3801301 3763638 3713706 3651280 3576520 3491405 3399138 3302284
50322C302284r9857j00924r9146r4665q8398q0700p1503o1424n1693m2801l4144
$$ 3302284 3202427 3101503 3002357 2907692 2819294 2738594 2667091 2605667 2553974 2511173 2477029
50311B477029k5242j6655r351l508J464N705Q123P237K858l641j0885j8716k7272
$$ 2477029 2451787 2435132 2425781 2422273 2423737 2429442 2437565 2444802 2447660 2444019 2433134 2414418 2387146
50298B387146l5511m1924m6548n0836n5246n8194n8238n6185n4008n2405n0613
$$ 2387146 2351635 2309711 2263163 2212327 2157081 2098887 2040649 1984464 1930456 1878051 1827438
50287A827438m8153m5463m2871m0138l7274l4815l2843l0548k7329k3848k1264
$$ 1827438 1779285 1733822 1690951 1650813 1613539 1578724 1545881 1515333 1488004 1464156 1442892
50276A442892j9737j8338j6321j3843j1261q479n407k444J53L118P343J2223J5905
$$ 1442892 1423155 1404817 1388496 1374653 1363392 1354913 1349506 1347062 1347215 1350333 1357676 1369899 1385804
50263A385804J7536J8225J9274K0541K1548K2943K5331K7452K7602K6649K7458
$$ 1385804 1403340 1421565 1440839 1461380 1482928 1505871 1531202 1558654 1586256 1612905 1640363
50252A640363L0769L3665L3252L0231K7473K6257K5540K4215K2422K0639J8859
$$ 1640363 1671132 1704797 1738049 1768280 1795753 1822010 1847550 1871765 1894187 1914826 1933685
50241A933685J6899J4839J2974J1684J1105J0587Q894N497J275k552n694q502
$$ 1933685 1950584 1965423 1978397 1990081 2001186 2011773 2020667 2026164 2027439 2024887 2019193 2010691
50229B010691j1064j3419j5990j8923k1497k3157k4690k7329l0986l4369l6489
$$ 2010691 1999627 1986208 1970218 1951295 1929798 1906641 1881951 1854622 1823636 1789267 1752778
50218A752778l7056l5889l3222l0432k9050k8956k8747k7843k6900k6180k5058
$$ 1752778 1715722 1679833 1646611 1616179 1587129 1558173 1529426 1501583 1474683 1448503 1423445
50207A423445k3452k2231k1637k0735j9047j7417j6364j4935j2327r424p503o324
$$ 1423445 1399993 1377762 1356125 1335390 1316343 1298926 1282562 1267627 1255300 1245876 1238373 1232049
50195A232049m978l826l964n063n366m000k039j002j332k554m006m974m912l953
$$ 1232049 1227071 1223245 1219281 1214218 1208852 1204852 1202813 1201811 1200479 1197925 1193919 1188945 1184033 1180080
50181A180080k843k162j994k409l522m884n554n215m763n219o378p027o428n119
$$ 1180080 1177237 1175075 1173081 1170672 1167150 1162266 1156712 1151497 1146734 1141515 1135137 1128110 1121682 1116563
50167A116563m154l924l863l313k339j527j065n34K62P49L69m39o33J24J190J993
$$ 1116563 1112409 1108485 1104622 1101309 1098970 1097443 1096378 1095844 1096106 1096855 1097224 1096785 1096152 1096276 1097466 1099459
50151A099459K682L581M560N238N375M724L059P34j191j990k169k850m333n805
$$ 1099459 1102141 1105722 1110282 1115520 1120895 1125619 1128678 1129412 1128221 1126231 1124062 1121212 1116879 1111074
50137A111074o413o141n603n414n742o109n654m128k631k661m157n266m604l115
$$ 1111074 1104661 1098520 1092917 1087503 1081761 1075652 1069998 1065870 1063239 1060578 1056421 1051155 1046551 1043436
50123A043436k844m239n662n616m434l512l680m820o344p405p115n492l806l283
$$ 1043436 1040592 1036353 1030691 1025075 1020641 1017129 1013449 1008629 1002285 994880 987765 982273 978467 975184
50109I75184l511l043j461K9K85m93j618l196n582q139r562r543r093r065r131
$$ 975184 971673 968630 967169 967198 967483 966990 965372 962176 956594 948455 938893 929350 920257 911192 902061
50094I02061q747q429r076j0396j0948j0073q835q435q346p019m367k276k210
$$ 902061 893314 884885 875809 865413 854465 844392 835557 827122 818776 811757 807390 805114 802904
50081H02904l200l127j506M6K7j289k655l306l070j775M80K725L650K970J867
$$ 802904 799704 796577 795071 795117 795144 793855 791200 787894 784824 783049 783529 786254 789904 792874 794741
50066G94741J862L549O385R343J1572J2683J2753J2077J0893R458Q361Q445J0054
$$ 794741 796603 800152 806537 815880 827452 840135 852888 864965 875858 885316 893677 902122 912176
50053I12176J2360J3786J3403J1845J0665J0800J1865J2905J3261J2619J0799
$$ 912176 924536 938322 951725 963570 974235 985035 996900 1009805 1023066 1035685 1046484
50042A046484Q221O142N565N898N648M531L857M385M971M344L310L718N559O686
$$ 1046484 1054705 1060847 1066412 1072310 1077958 1082489 1086346 1090731 1095702 1100046 1103356 1107074 1112633 1119319
50028A119319N811M393M623O513Q081Q047P221P079P906Q834R347J0044J1821
$$ 1119319 1125130 1129523 1134146 1140659 1148740 1156787 1164008 1171087 1178993 1187827 1197174 1207218 1219039
50015A219039J4584J7169J8537J8790J8791J9123J9825K0953K2736K4915K6557
$$ 1219039 1233623 1250792 1269329 1288119 1306910 1326033 1345858 1366811 1389547 1414462 1441019
50004A441019K6961K6425K5730K5084K4063K2477K0775J9528J8875J8548J8170
$$ 1441019 1467980 1494405 1520135 1545219 1569282 1591759 1612534 1632062 1650937 1669485 1687655
49993A687655J7415J6118J4372J2425J0342P990N322K468m77l501o310q170q540
$$ 1687655 1705070 1721188 1735560 1747985 1758327 1766317 1771639 1774107 1773630 1770129 1763819 1755649 1747109
49980A747109p948p798r077j1325j3173j3852j3920j4412j5585j6748j7011j5970
$$ 1747109 1739161 1731363 1722286 1710961 1697788 1683936 1670016 1655604 1640019 1623271 1606260 1590290
49968A590290j3827j1306r373q457p809o002k392K167O223Q983J0570J1589J2929
$$ 1590290 1576463 1565157 1555784 1547327 1539518 1533516 1531124 1533291 1539514 1548497 1559067 1570656 1583585
49955A583585J5622K0063K5398L0185L3690L6195L8060L9145L9271L8583L7118
$$ 1583585 1599207 1619270 1644668 1674853 1708543 1744738 1782798 1821943 1861214 1899797 1936915
49944A936915L4458L0354K5320K0091J4791R244M074O50m83n61j368l280n281
$$ 1936915 1971373 2001727 2027047 2047138 2061929 2071173 2075247 2075897 2075414 2074853 2073485 2070205 2064924
49931B064924o856r084j3375j9840k7467l5376m2962m9112n2652n3891n4639n5954
$$ 2064924 2058068 2048984 2035609 2015769 1988302 1952926 1909964 1860852 1808200 1754309 1699670 1643716
49919A643716n6822n5815n3206n0280m7283m3499l9070l5156l2159k9317k6441
$$ 1643716 1586894 1531079 1477873 1427593 1380310 1336811 1297741 1262585 1230426 1201109 1174668
49908A174668k4612k4292k4153k2786k0632j8930j7611j5652j3129j1398j1170
$$ 1174668 1150056 1125764 1101611 1078825 1058193 1039263 1021652 1006000 992871 981473 970303
$$ [...]
##END NTUPLES=NMR SPECTRUM
##END=
