
##TITLE=AC1112_Colombia_5867538_v5MueiK8Sv
##JCAMPDX= 6.0         $$ Bruker NMR JCAMP-DX V2.0
##DATA TYPE= NMR SPECTRUM
##DATA CLASS= NTUPLES
##ORIGIN= BRUKER
##OWNER= Administrator
$$ 1.72 TOPSPIN		Version 2.1
$$ 2012-04-10 10:25:16.500 -0500  Administrator@TOPSPIN
$$ Compression mode = diff/dup
##.OBSERVE FREQUENCY= 400.13188235
##.OBSERVE NUCLEUS= ^1H
##.ACQUISITION MODE= SIMULTANEOUS (DQD)
##.ACQUISITION SCHEME= undefined
##.AVERAGES= 8
##.DIGITISER RES= 22
##SPECTROMETER/DATA SYSTEM= spect
##.PULSE SEQUENCE= zg30
##.SOLVENT NAME= COFFEE_meoh
##.SHIFT REFERENCE= INTERNAL, COFFEE_meoh, 1, 14.98061
##AUDIT TRAIL= $$ (NUMBER, WHEN, WHO, WHERE, PROCESS, VERSION, WHAT)
$$ ##TITLE= Audit trail, TOPSPIN		Version 2.1
$$ ##JCAMPDX= 5.01
$$ ##ORIGIN= Bruker BioSpin GmbH
$$ ##OWNER= Administrator
$$ $$ C:\Bruker\TOPSPIN/data/COFFEE/nmr/AC1112_Colombia_5867538_v5MueiK8Sv/10/pdata/1/auditp.txt
$$ ##AUDIT TRAIL=  $$ (NUMBER, WHEN, WHO, WHERE, PROCESS, VERSION, WHAT)
(   1,<2012-03-30 19:08:27.281 -0500>,<Administrator>,<TOPSPIN>,<go>,<TOPSPIN 2.1>,
      <created by zg
	started at 2012-03-30 19:07:20.578 -0500,
	POWCHK enabled, PULCHK disabled,
       configuration hash MD5:
       1A 1E CE 29 27 FD 77 03 67 4E F0 E3 C4 B2 CB 90
       data hash MD5: 64K
       3A A2 70 EB 1C 5F 64 74 8F D0 11 8C FC 7E 35 06>)
(   2,<2012-03-30 19:08:30.359 -0500>,<Administrator>,<TOPSPIN>,<proc1d>,<TOPSPIN 2.1>,
      <Start of raw data processing
       efp LB = 0 FT_mod = 6 PKNL = 1 PHC0 = 0 PHC1 = 0 SI = 32K 
       data hash MD5: 32K
       1B AF 64 79 08 B1 9B 15 2C 03 92 AB 88 15 8E 41>)
(   3,<2012-03-30 19:08:30.703 -0500>,<Administrator>,<TOPSPIN>,<proc1d>,<TOPSPIN 2.1>,
      <pk PHC0 = 213.1238 PHC1 = 0 
       data hash MD5: 32K
       64 C1 20 4C AC 58 5F EA F3 D6 A2 72 C0 B0 6E D0>)
(   4,<2012-03-30 19:08:30.750 -0500>,<Administrator>,<TOPSPIN>,<proc1d>,<TOPSPIN 2.1>,
      <abs ABSG = 1 
       data hash MD5: 32K
       C3 16 46 98 2A 92 B3 79 19 E1 3F A4 C8 D1 72 8E>)
(   5,<2012-03-30 19:08:30.781 -0500>,<Administrator>,<TOPSPIN>,<proc1d>,<TOPSPIN 2.1>,
      <abs ABSG = 2 
       data hash MD5: 32K
       24 4E A0 63 4D B6 E0 93 A9 77 D6 AD 1E B8 B5 7E>)
(   6,<2012-03-30 19:08:30.828 -0500>,<Administrator>,<TOPSPIN>,<proc1d>,<TOPSPIN 2.1>,
      <abs ABSG = 3 
       data hash MD5: 32K
       72 FA 87 94 48 4C 93 BF CD A0 1D C8 6B B0 F0 FC>)
(   7,<2012-03-30 19:08:30.859 -0500>,<Administrator>,<TOPSPIN>,<proc1d>,<TOPSPIN 2.1>,
      <abs ABSG = 4 
       data hash MD5: 32K
       C7 49 F5 33 EF 69 5E DA 01 62 A0 FF 57 2D 90 96>)
(   8,<2012-03-30 19:08:30.890 -0500>,<Administrator>,<TOPSPIN>,<proc1d>,<TOPSPIN 2.1>,
      <abs ABSG = 5 
       data hash MD5: 32K
       53 61 62 B5 0B F3 73 35 6E F8 1F 1B CD 46 FA CE>)
(   9,<2012-03-30 19:08:35.437 -0500>,<Administrator>,<TOPSPIN>,<audit>,<TOPSPIN 2.1>,
      <user comment:
       ICON-NMR User ID: COFFEE
       data hash MD5: 32K
       53 61 62 B5 0B F3 73 35 6E F8 1F 1B CD 46 FA CE>)
$$ ##END=
$$ 
$$ [...]
##$TP= (0..7)
150 150 150 150 150 150 150 150
##$TP07= 0
##$TPNAME0= <>
##$TPNAME1= <>
##$TPNAME2= <>
##$TPNAME3= <>
##$TPNAME4= <>
##$TPNAME5= <>
##$TPNAME6= <>
##$TPNAME7= <>
##$TPOAL= (0..7)
0.5 0.5 0.5 0.5 0.5 0.5 0.5 0.5
##$TPOFFS= (0..7)
0 0 0 0 0 0 0 0
##$TUNHIN= 0
##$TUNHOUT= 0
##$TUNXOUT= 0
##$USERA1= <user>
##$USERA2= <user>
##$USERA3= <user>
##$USERA4= <user>
##$USERA5= <user>
##$V9= 5
##$VALIST= <valist>
##$VCLIST= <CCCCCCCCCCCCCCC>
##$VD= 0
##$VDLIST= <DDDDDDDDDDDDDDD>
##$VPLIST= <PPPPPPPPPPPPPPP>
##$VTLIST= <TTTTTTTTTTTTTTT>
##$WBST= 2048
##$WBSW= 25
##$XGAIN= (0..3)
0 0 0 0
##$XL= 0
##$YL= 0
##$YMAX_a= 549677
##$YMIN_a= -652506
##$ZGOPTNS= <>
##$ZL1= 120
##$ZL2= 120
##$ZL3= 120
##$ZL4= 120
##$ABSF1= 14.98061
##$ABSF2= -5.57192
##$ABSG= 5
##$ABSL= 3
##$ALPHA= 0
##$AQORDER= 0
##$ASSFAC= 0
##$ASSFACI= 0
##$ASSFACX= 0
##$ASSWID= 0
##$AUNMP= <proc_prof1d_extract_pilot.lims>
##$AXLEFT= 0
##$AXNAME= <>
##$AXNUC= <1H>
##$AXRIGHT= 0
##$AXTYPE= 0
##$AXUNIT= <>
##$AZFE= 0.1
##$AZFW= 0.1
##$BCFW= 0
##$BC_mod= 0
##$BYTORDP= 0
##$COROFFS= 0
##$CY= 15
##$DATMOD= 1
##$DC= 0
##$DFILT= <>
##$DTYPP= 0
##$F1P= 0
##$F2P= 0
##$FCOR= 0.5
##$FTSIZE= 32768
##$FT_mod= 6
##$GAMMA= 0
##$GB= 0
##$INTBC= 1
##$INTSCL= 1
##$ISEN= 128
##$LB= 0
##$LEV0= 0
##$LPBIN= 0
##$MAXI= 10000
##$MC2= 0
##$MEAN= 0
##$ME_mod= 0
##$MI= 0
##$NCOEF= 0
##$NC_proc= -8
##$NLEV= 6
##$NOISF1= 0
##$NOISF2= 0
##$NSP= 0
##$NTH_PI= 0
##$NZP= 0
##$OFFSET= 14.98061
##$PC= 1
##$PHC0= 213.1238
##$PHC1= 0
##$PH_mod= 1
##$PKNL= yes
##$PPARMOD= 0
##$PPDIAG= 0
##$PPIPTYP= 0
##$PPMPNUM= 2147483647
##$PPRESOL= 1
##$PSCAL= 4
##$PSIGN= 0
##$PYNMP= <proc.py>
##$REVERSE= no
##$SF= 400.13
##$SI= 32768
##$SIGF1= 0
##$SIGF2= 0
##$SINO= 400
##$SIOLD= 32768
##$SPECTYP= <>
##$SREGLST= <1H.CDCl3>
##$SSB= 0
##$STSI= 32768
##$STSR= 0
##$SW_p= 8223.68421052632
##$SYMM= 0
##$S_DEV= 0
##$TDeff= 65536
##$TDoff= 0
##$TI= <>
##$TILT= no
##$TM1= 0
##$TM2= 0
##$TOPLEV= 0
##$USERP1= <user>
##$USERP2= <user>
##$USERP3= <user>
##$USERP4= <user>
##$USERP5= <user>
##$WDW= 1
##$XDIM= 32768
##$YMAX_p= 464070066
##$YMIN_p= -732008
##$CURPLOT= <Network HP LaserJet P1505>
##$CURPRIN= <$Network HP LaserJet P1505>
##$DFORMAT= <normdp>
##$LAYOUT= <+/1D_H.xwp>
##$LFORMAT= <normlp>
##$PFORMAT= <normpl>
##$SURQMSG= 1
$$ End of Bruker specific parameters
$$ ---------------------------------
##NTUPLES= NMR SPECTRUM
##VAR_NAME=  FREQUENCY,     SPECTRUM/REAL,   SPECTRUM/IMAG
##SYMBOL=    X,             R,               I
##VAR_TYPE=  INDEPENDENT,   DEPENDENT,       DEPENDENT
##VAR_FORM=  AFFN,          ASDF,            ASDF
##VAR_DIM=   32768,         32768,           32768
##UNITS=     HZ,            ARBITRARY UNITS, ARBITRARY UNITS
##FACTOR=    0.250966925370066, 1,           1
##FIRST=     8223.43324360095, 100335,       -37107
##LAST=      0,             -8705,           -41076
##MIN=       0,             -732008,         0
##MAX=       8223.43324360095, 464070066,    0
$$ Real data points
##PAGE= N=1
##DATA TABLE= (X++(R..R)), XYDATA
$$ [...]
19580A66681b41972C33275h777I3136J20836b9524j08195l7970F6710K1856c82563
$$ 166681 -241972 333275 -8777 93136 213972 -29524 -137719 -175689 66710 88566 -382563
19568D5809a38212j46492c0494A17211a03436H2553e1304J7446B12254a36476
$$ 45809 -138212 -284704 -30494 117211 -103436 82553 -51304 -33858 212254 -136476
19557g4873D4307g1032B26766a35514B34730i4278N196j1876C36899a93119D99606
$$ -74873 44307 -71032 226766 -135514 234730 -94278 -89082 -100958 336899 -193119 499606
19545b16311G7847J60593j06963e94448A75997C883O8649Q2196o3210N0686C5560
$$ -216311 77847 238440 131477 -594448 175997 3883 72532 154728 91518 142204 35560
19533c37659B76836I1771J07743a43166G3157k1276j0313M9615C7031a5393A6012
$$ -337659 276836 91771 199514 -143166 73157 51881 41568 91183 37031 -15393 16012
19521G4880b09776A8062a53125e8632C1586J32476d48134a53954J902F292d2056
$$ 74880 -209776 18062 -153125 -58632 31586 164062 -448134 -153954 -152052 6292 -42056
19509e5008j63696K2626p4145f9814m9731B20293D6778I743L00608i8567A4603
$$ -55008 -218704 -196078 -270223 -69814 -119545 220293 46778 9743 310351 -98567 14603
19497b22864j23151D29092B3307J75142a62983n5932e1165D0808b89673A04006
$$ -222864 -346015 429092 23307 198449 -162983 -218915 -51165 40808 -289673 104006
19486d1132k13407g0668B87052F5091c2769r3998d6234C62856G7436h9781J0988
$$ -41132 -254539 -70668 287052 65091 -32769 -126767 -46234 362856 77436 -89781 -78793
19475g8793k40449c2618m24182B06540p1337a02592k43157A59784a327k37799
$$ -78793 -319242 -32618 -456800 206540 135203 -102592 -345749 159784 -1327 -239126
19465b39126P8233l5950a402B9023a14988C1277c77173a02682M3000A19452d1388
$$ -239126 -160893 -196843 -1402 29023 -114988 31277 -377173 -102682 -59682 119452 -41388
19453E4642a49130i268j56687M8405F3249a22235L6906j05163A21312m6276b53036
$$ 54642 -149130 -9268 -165955 -117550 63249 -122235 -85329 -190492 121312 75036 -253036
19441B24333j6593c43988J40336H0594a17482c7078j35688f4348m1335J5677d3693
$$ 224333 207740 -343988 -203652 80594 -117482 -37078 -172766 -64348 -105683 -90006 -43693
19429c3387j57142e4357A78747G4481i2572M2309r790p6698r1883c711l07964
$$ -33387 -190529 -54357 178747 74481 -92572 -50263 -60053 -136751 -228634 -3711 -311675
19418c11675a5917j7060H0193R2215b62878N1744E3960B4176b27031F4220i1766
$$ -311675 -15917 -32977 80193 172408 -262878 -211134 53960 24176 -227031 64220 -91766
19406a16675K7252A51753b79408G3821a64182N8562N46L4297J5068A54937a13525
$$ -116675 -89423 151753 -279408 73821 -164182 -105620 -105074 -70777 -55709 154937 -113525
19394a22509n7694A84420A3852f416j2335j36895j00211B5577q211b37565B0695
$$ -122509 -180203 184420 13852 -6416 -18751 -155646 -255857 25577 17366 -237565 20695
19382A9876J82187b25998r8577J55969M7864B01051I7722B2680l848h3753j29022
$$ 19876 202063 -225998 -324575 -168606 -120742 201051 97722 22680 18832 -83753 -212775
19371b12775O1664F3418c8728a6207l10590l7416g605F7790b21477E0662J11100
$$ -212775 -151111 63418 -38728 -16207 -326797 -364213 -7605 67790 -221477 50662 161762
19360A61762b83611Q0768B48959c1055m22016J72775j64676F6114c36000Q1896
$$ 161762 -283611 -202843 248959 -31055 -453071 -280296 -444972 66114 -336000 -254104
19350b54104i8679D570N0345a17866N2806k59469G170K69477b11936k05127G43
$$ -254104 -98679 4570 54915 -117866 -65060 -324529 7170 276647 -211936 -417063 743
19338b24377J07618A08767a91563B21010J4851a34166q9071b8651A9468c8592
$$ -224377 -116759 108767 -191563 221010 235861 -134166 -223237 -28651 19468 -38592
19327H861g9537B80243i5252H5976J0238b91778A5947a38670j7539G2696J27786
$$ 8861 -79537 280243 -95252 85976 96214 -291778 15947 -138670 -156209 72696 200482
19316B00482b1580j20597A0440a12293A7204g3510i423A48459a5800m2025j09756
$$ 200482 -21580 -142177 10440 -112293 17204 -73510 -9423 148459 -15800 -57825 -167581
19305a67581H3126d9123B25402c72199g2563A18406C9246J04702a37514C1548
$$ -167581 83126 -49123 225402 -372199 -72563 118406 39246 143948 -137514 31548
19294H6398A4710f465k09766j91988J7672A45023m2475e4373A14447a91077g4980
$$ 86398 14710 -6465 -216231 -408219 -390547 145023 102548 -54373 114447 -191077 -74980
19282b45328d1553A70027a30424n6101C5816A3418Q9032L2959e7593B20575e7723
$$ -245328 -41553 170027 -130424 -186525 35816 13418 102450 135409 -57593 220575 -57723
19270a13979A85226a17165F8527J21905a40992j71639J34796f0718m25594K24316
$$ -113979 185226 -117165 68527 190432 -140992 -312631 -177835 -60718 -486312 -261996
19260b61996q6396B57742a62690J494A89571l0543b01709e0177l3133j01995O8434
$$ -261996 -348392 257742 -162690 -161196 189571 159028 -201709 -50177 -83310 -185305 -116871
19249a16871m3922j51936D2120K69332j51694b83483F9851K26291a20058j211
$$ -116871 -160793 -312729 42120 311452 159758 -283483 69851 296142 -120058 -121269
19239a21269d5707J5676A35087N8875h1822k49034J32981F2598a55640p2456C15857
$$ -121269 -45707 -30031 135087 193962 -81822 -330856 -197875 62598 -155640 -228096 315857
19227a62l09833Q1864Q1093B8838P9149c18166O559R4721e235H9572a59049f3222
$$ -162 -309995 -228131 -147038 28838 107987 -318166 -311607 -216886 -5235 89572 -159049 -63222
19214a12076r2250B27829p1128b56373A13990i1435a9140m8748F5453J8240B1817
$$ -112076 -204326 227829 156701 -256373 113990 -91435 -19140 -67888 65453 83693 21817
19202E297f7616R422l196I7506A564a74555j16844h7627L4640r0026O744j80507
$$ 5297 -67616 -58194 -61390 97506 1564 -174555 -291399 -87627 -52987 -143013 -136269 -316776
19190c16776a07964B38263c7821m09253e2448F1095F161h7311j41949m8160i6413
$$ -316776 -107964 238263 -37821 -447074 -52448 61095 6161 -87311 -229260 -277420 -96413
19178A13550c00915A33086b27093a397D0414a48712b9081p6848M3289B01528A4026
$$ 113550 -300915 133086 -227093 -1397 40414 -148712 -29081 -105929 -62640 201528 14026
19166E5817e4885j14701F4249a21478o9775B93046A179K14038n5661a79888B436
$$ 55817 -54885 -169586 64249 -121478 -191253 293046 1179 215217 159556 -179888 2436
19154a93549f1325C3584F596i939j93648A97651l6142d0514k04988K6911g7007
$$ -193549 -61325 33584 6596 -9939 -203587 197651 161509 -40514 -245502 -218591 -77007
19142A47580J30846f5124A02065a00419L10F532a15517B37179a51793j5953A82786
$$ 147580 278426 -65124 102065 -100419 -100109 6532 -115517 237179 -151793 -167746 182786
19130a77445j7413B27547b035r9179b8221A9289J28083a01725n7677P2037j74324
$$ -177445 -194858 227547 -2035 -101214 -28221 19289 147372 -101725 -159402 -87365 -261689
19119b61689g3566k4066C31295c21201A44353g3162j52657O36C16117a01796A8491
$$ -261689 -73566 -97632 331295 -321201 144353 -73162 -225819 -225183 316117 -101796 18491
19107f9640p361j47635j41099h1106B00812d30202I4674a17914J583D7957e1858
$$ -69640 -77001 -224636 -365735 -81106 200812 -430202 94674 -117914 -116331 47957 -51858
19095b04946c9662j96594k3916D6220M9097c44083A29845a87683r2205C00530
$$ -204946 -39662 -236256 -260172 46220 95317 -344083 129845 -187683 -279888 300530
19084A56676o5587K52895A37048D4371L4840b22750A98765a49267H5814k025J18345
$$ 156676 91089 343984 137048 44371 79211 -222750 198765 -149267 85814 83789 202134
19073B02134d28211K07212R9769E7105a84278d2269j72482k47133a13259j47002
$$ 202134 -428211 -220999 -121230 57105 -184278 -42269 -214751 -461884 -113259 -260261
19063b60261d3070p7474l4478A5628e3686C4855K0992b07479L5818a105j5035
$$ -260261 -43070 -120544 -155022 15628 -53686 34855 55847 -207479 -171661 -1105 -16140
19052a6140l9299j90314r4251E052b70148m3275a37919M2595A70684c45946b8346
$$ -16140 -55439 -245753 -340004 5052 -270148 -313423 -137919 -95324 170684 -345946 -28346
19040a02843M8087C12084I1651d03185H8479C3113O9171a64493a7671E4785b69057
$$ -102843 -54756 312084 91651 -403185 88479 33113 102284 -164493 -17671 54785 -269057
19028A1799O5836j6659R264b4257k5286E0154a86332A06642i6620F1180j7565
$$ 11799 77635 60976 70240 -24257 -49543 50154 -186332 106642 -96620 61180 43615
19017D3615L0787k4526c58512A52873l9026D660e19975d1897J8056j38281B32245
$$ 43615 74402 49876 -358512 152873 113847 4660 -519975 -41897 -23841 -162122 232245
19005b10073C34158a73888A15189B1933a78111a3682A33492c19066A86615b44456
$$ -210073 334158 -173888 115189 21933 -178111 -13682 133492 -319066 186615 -244456
18994A6929M1343d52603K18494R6491B4564a0996j44477o842E523L76130I774
$$ 16929 58272 -452603 -234109 -137618 24564 -10996 -155473 -162315 5523 381653 9774
18982a93792A54181c48609C2232J73849B2338b3853m0765l12509P7647d7360G5214
$$ -193792 154181 -348609 32232 206081 22338 -23853 -64618 -377127 -299480 -47360 75214
18970E9095h7521F9345c12088A6595F716a79389C3591b22623B24953a88919F3143
$$ 59095 -87521 69345 -312088 16595 6716 -179389 33591 -222623 224953 -188919 63143
18958E27789b69383b4253k89900A98883f1264k73509A74266b40792H4454K1912
$$ 527789 -269383 -24253 -314153 198883 -61264 -334773 174266 -240792 84454 106366
18948A06366b04459A96373i3134j3982D7390d00733a03235D5136a20891j35500
$$ 106366 -204459 196373 -93134 -107116 47390 -400733 -103235 45136 -120891 -256391
18938b56391b7506D4618n647j3263a00699F0765B931b06678A58717h3123k81108
$$ -256391 -27506 44618 38971 25708 -100699 60765 2931 -206678 158717 -83123 -364231
18927c64231b6501r8242A18017g0051a477k78319g5612B35549a3275A82794a96515
$$ -364231 -26501 -124743 118017 -70051 -1477 -279796 -75612 235549 -13275 182794 -196515
18915a1449k10527k5084B5569a45822L7909k30832a33046a2320l2447P514q3651
$$ -11449 -221976 -247060 25569 -145822 -107913 -338745 -133046 -12320 -44767 -37253 -120904
18904a20904k10401B65484k4362a62992k26288a42507L9410O017K6399j94119
$$ -120904 -331305 265484 241122 -162992 -389280 -142507 -103097 -97080 -70681 -264800
18894b64800A88384E4993b56474j8216A81428e0817j1038k66961b9029j25481
$$ -264800 188384 54993 -256474 -274690 181428 -50817 -61855 -328816 -29029 -154510
18884a54510j2400B4229K17252F6171g341k86390a37784n9254A65607f5576j12349
$$ -154510 -166910 24229 241481 66171 -7341 -293731 -137784 -197038 165607 -65576 -177925
18873a77925B91335a905H684N2170c19375c4174k42446k00727A19743i0623A42510
$$ -177925 291335 -1905 8684 60854 -319375 -34174 -276620 -477347 119743 -90623 142510
18861B08134d3376A05806b36834K053B8981J54095a23354m4858e9121D4820a40381
$$ 208134 -43376 105806 -236834 -234781 28981 183076 -123354 -168212 -59121 44820 -140381
18849A07720F661d3001D2682d45292A45793a27915C93788E6137K47854f3222A36716
$$ 107720 6661 -43001 42682 -445292 145793 -127915 393788 56137 303991 -63222 136716
18837a13704B45812G5717N4197N3309h0332C93633b07105g0351j57669k00295
$$ -113704 245812 75717 129914 183223 -80332 393633 -207105 -70351 -228020 -428315
18827d28315B72893b19227k2200f2523q5797j56967B0122f6828k52557r990J40856
$$ -428315 272893 -219227 -241427 -62523 -148320 -305287 20122 -66828 -319385 -329375 -188519
18816a88519E564b60016B6060b47224J03013E857O9177d5637l32744g1708I1999
$$ -188519 5564 -260016 26060 -247224 -144211 5857 75034 -45637 -378381 -71708 91999
18804B72497f7505C6120i8737H1586L24096b58385B13674A8305J20500K31350
$$ 272497 -67505 36120 -98737 81586 405682 -258385 213674 18305 138805 370155
18794C70155E2318d6510k04376G8129E103b48377G9353a92344j85020a02546j06440
$$ 370155 52318 -46510 -250886 78129 5103 -248377 79353 -192344 -377364 -102546 -208986
18783b08986A90103c75206h2881j32133D6378K59522F959J07333O0532d15632
$$ -208986 190103 -375206 -82881 -215014 46378 305900 6959 114292 174824 -415632
18772a56200f0249a192B42430N1053A801P3639a65997A84389b65865c6686B49989
$$ -156200 -60249 -1192 242430 293483 1801 75440 -165997 184389 -265865 -36686 249989
18760A13277a4783F8790a72282g9830J2911m3889A31027a02930j11346Q5239C0732
$$ 113277 -14783 68790 -172282 -79830 -66919 -110808 131027 -102930 -214276 -129037 30732
18748a36214f7939G7874f9633j82828I7154c0061B60803A08842c30241a21211
$$ -136214 -67939 77874 -69633 -252461 97154 -30061 260803 108842 -330241 -121211
18737A1732a38722a5696g727k83074L9157h7790B0880i7347A23659i2744l8530
$$ 11732 -138722 -15696 -7727 -290801 -251644 -87790 20880 -97347 123659 -92744 -131274
18726a31274L2320H5690c43242E6874O1457h0265c9718j52009A97488h4038a3975
$$ -131274 -98954 85690 -343242 56874 118331 -80265 -39718 -191727 197488 -84038 -13975
18714b3365j46435h2818j19814R1809j22236N4295L291A213K6288f9848C52263
$$ -23365 -169800 -82818 -202632 -110823 -233059 -178764 -175473 1213 27501 -69848 352263
18702A79896B1158o668J13259n3953a33496D1671K21708p0962L8397c22094d2013
$$ 179896 21158 14490 127749 73796 -133496 41671 263379 192417 230814 -322094 -42013
18690b23483C6248b97722d023j27456j73786j0418a51047k58869J44627E7184
$$ -223483 36248 -297722 -4023 -131479 -305265 -315683 -151047 -409916 -265289 57184
18679G0767b20814d9573k6829d1k7976k31899E2450i3715B16087D3684K21561
$$ 70767 -220814 -49573 -76402 -41 -28017 -259916 52450 -93715 216087 43684 265245
18668B65245h1725B0154f3559o5077C5716b2254n4650K1020k36346A49085i0540
$$ 265245 -81725 20154 -63559 -128636 35716 -22254 -76904 -55884 -292230 149085 -90540
18656b99247A82620k580a53001B78681b46358e5127j86893j15839A01490h4713
$$ -299247 182620 180040 -153001 278681 -246358 -55127 -242020 -357859 101490 -84713
18645D0267b10330E5867b13673E4436c47184d908o7476j96001f4398k05025A87133
$$ 40267 -210330 55867 -213673 54436 -347184 -4908 -72384 -268385 -64398 -269423 187133
18633A46402K5166c61054G1636R486c59942J16650P2607A16679a48108j5647p6974
$$ 146402 171568 -361054 71636 81122 -359942 -243292 -170685 116679 -148108 -163755 -240729
18622b40729B3044L1910a64681P290g3833a0790j30492r7628k69527B6966a01708
$$ -240729 23044 54954 -164681 -157391 -73833 -10790 -141282 -238910 -508437 26966 -101708
18610a31306c8620C1829a24785L6535C55808a45382K5235q926k2170j7148H990
$$ -131306 -38620 31829 -124785 -88250 355808 -145382 -120147 -129073 -151243 -168391 8990
18598i4012k34311a04012D7195a8029A940b0072k29094q5619J29839B96788a20746
$$ -94012 -328323 -104012 47195 -18029 1940 -20072 -249166 -334785 -204946 296788 -120746
18586a75574B3542d9100a7649p0640a8916k6048a7957G3579c01284p326A91621
$$ -175574 23542 -49100 -17649 -88289 -18916 -44964 -17957 73579 -301284 -308610 191621
18574c04823C7983e9428A02692E653a5635C92827a29779b8064A60943m0355A7344
$$ -304823 37983 -59428 102692 5653 -15635 392827 -129779 -28064 160943 120588 17344
18562i4621A81070G9994P4512b83118A46714b58800d2042A32200f6308A02949
$$ -94621 181070 79994 154506 -283118 146714 -258800 -42042 132200 -66308 102949
18551G4274f44l91460a16607a9182A9747K34707a20842a484j88141j36189C6684
$$ 74274 -644 -392104 -116607 -19182 19747 254454 -120842 -1484 -189625 -325814 36684
18539c50598f3746r7919C7236c4431B17474I5729c0643A67974d3612n0824l8352
$$ -350598 -63746 -161665 37236 -34431 217474 95729 -30643 167974 -43612 -94436 -132788
18528a32788A93116k500I2662N8876E2039L8367m0196j5349h1054k5008L4804
$$ -132788 193116 190616 92662 151538 52039 90406 50210 34861 -81054 -106062 -71258
18517g1258A05379J55678j10230c2172E8862a66677N9230D4831r037K44331j01229
$$ -71258 105379 261057 150827 -32172 58862 -166677 -107447 44831 35794 280125 178896
18506A78896J04508a96195b3139j35071A28510n1017a38372C1421a32152J289
$$ 178896 283404 -196195 -23139 -158210 128510 77493 -138372 31421 -132152 -130863
18496a30863B7009a26845N9556H9032c75385h1024k73442J71343O169b3069E4833
$$ -130863 27009 -126845 -67289 89032 -375385 -81024 -354466 -183123 -176954 -23069 54833
18484g3835k56574a42415I136J02070h6762k26630a01994F0073R1283d8120C41187
$$ -73835 -330409 -142415 9136 111206 -86762 -313392 -101994 60073 151356 -48120 341187
18472A15418E6727J82631j02882E8702R0444C0240J34290g3358C3135J34559b89529
$$ 115418 56727 239358 136476 58702 149146 30240 164530 -73358 33135 167694 -289529
18460F7414e9755j71575C62948A10718n1544B2992c5214D4436Q185a64056a1794
$$ 67414 -59755 -231330 362948 110718 59174 22992 -35214 44436 52621 -164056 -11794
18448c36237J2426i5983m4146M6470o2842B17553g6115j72319B02498A1787e6615
$$ -336237 -323811 -95983 -140129 -93659 -156501 217553 -76115 -248434 202498 11787 -56615
18436B37063p1245i2362A68830c8152P609l5781P02K5079j4368A23968M1896a23510
$$ 237063 165818 -92362 168830 -38152 -30543 -66324 -65622 -40543 -54911 123968 165864 -123510
18423a60786I8121b40433J11369C4528L71727c2155k60762a15065B1083K76148
$$ -160786 98121 -240433 -129064 34528 406255 -32155 -292917 -115065 21083 297231
18413B97231a01151a3164k70725H2754B7519f2111E746a63913j9260g8023A95353
$$ 297231 -101151 -13164 -283889 82754 27519 -62111 5746 -163913 -183173 -78023 195353
18401A2751a90798B104L98427b9572j72560f4230j18691F3736Q64b3497A47357
$$ 12751 -190798 2104 400531 -29572 -202132 -64230 -182921 63736 64600 -23497 147357
18389c40503D8572a60853j9177B7308h7679A64864P9160n1812d37509d0369m06708
$$ -340503 48572 -160853 -180030 27308 -87679 164864 244024 192212 -437509 -40369 -447077
18378d47077B6052a27369p7457m0213I1618c66869C44014b17324Q1495j96866
$$ -447077 26052 -127369 -204826 -245039 91618 -366869 344014 -217324 -135829 -332695
18368c32695d6990E5510g6446E9809c30555J13687q4506J38322B18094b08293
$$ -332695 -46990 55510 -76446 59809 -330555 -216868 -301374 -163052 218094 -208293
18357b98653H634N9571a49445A99311h9407A78597q5240b9166A18282b7772l3014
$$ -298653 8634 68205 -149445 199311 -89407 178597 93357 -29166 118282 -27772 -60786
18346f0786E1431L31242g8689H7203J37881e3733j04712C07019a6240j13890p976
$$ -60786 51431 382673 -78689 87203 225084 -53733 -158445 307019 -16240 -130130 -138106
18335a38106A22805D0001J19454c05866I8241O4892C6991b0403A85301G1484a23333
$$ -138106 122805 40001 159455 -305866 98241 163133 36991 -20403 185301 71484 -123333
18323D4782g4074j14151E9921a114j71191j39461b0626C18888d32499a25259j92165
$$ 44782 -74074 -188225 59921 -1114 -172305 -311766 -20626 318888 -432499 -125259 -317424
18312c17424J54197P2058B3429L7591J49070h2390L2454j7836l36613M9184B49050
$$ -317424 -163227 -91169 23429 61020 210090 -82390 -49936 -67772 -404385 -355201 249050
18300i1379m906F4534a2697j27518L1131q8295B84942C0561c19435d1791A6009
$$ -91379 -96285 64534 -12697 -140215 -109084 -197379 284942 30561 -319435 -41791 16009
18288i2351A4633a54137k27627J24353J13988m8356j82358D9010O6539R0479F5060
$$ -92351 14633 -154137 -381764 -257411 -143423 -191779 -374137 49010 115549 206028 65060
18276A031c4583j24366c2690k19035C1970e9940m2525c1434f853k08329c0073
$$ 1031 -34583 -158949 -32690 -251725 31970 -59940 -102465 -31434 -6853 -215182 -30073
18264c40642G6597a76877L7687A33958a3854j39366B56630b45033I4981F553a67710
$$ -340642 76597 -176877 -139190 133958 -13854 -153220 256630 -245033 94981 6553 -167710
18252C2505J17704J73396j56388J07664c10375h3518Q012n5525I3975b08731k13956
$$ 32505 150209 323605 167217 274881 -310375 -83518 -75506 -131031 93975 -208731 -422687
18241d22687D8252a49913A75906d5052B56668a96508k05244a52779I9256Q0080
$$ -422687 48252 -149913 175906 -45052 256668 -196508 -401752 -152779 99256 179336
18231A79336a75930O8202K6175L4626H7596c43155H9998a76916P3323k89280H4294
$$ 179336 -175930 -107728 -81553 -46927 87596 -343155 89998 -176916 -103593 -392873 84294
18219D65870A76067G6941c8329n1216D7570P9878J23685I4768J60062a54269I8476
$$ 465870 176067 76941 -38329 -89545 47570 127448 251133 94768 254830 -154269 98476
18207B13564D3253b73364j09011I5690j9404b8065k95439H7144D0917b15158A80721
$$ 213564 43253 -273364 -382375 95690 76286 -28065 -323504 87144 40917 -215158 180721
18195A87883m9387B2481b77623g4777j77227I1854b26028f9205O805D6439J22369
$$ 187883 138496 22481 -277623 -74777 -252004 91854 -226028 -69205 -62400 46439 168808
18184A68808F2272J12761a88830l29740f6728D22657C592d0477A86770g2791I3795
$$ 168808 62272 175033 -188830 -518570 -66728 422657 3592 -40477 186770 -72791 93795
18172C3128Q0525a07199H619a89983A52837b40211G2258d8584J5610B33964b4872
$$ 33128 113653 -107199 8619 -189983 152837 -240211 72258 -48584 -32974 233964 -24872
18160F5989E129a3377k2604C242a04949k25277a00675j280C4792C892a54861G587
$$ 65989 5129 -13377 -35981 3242 -104949 -330226 -100675 -101955 34792 3892 -154861 7587
18147G2288a56151e0471o911A0634J60215F6782N0067K7795K67730D2465b53826
$$ 72288 -156151 -50471 -57382 10634 170849 66782 116849 144644 412374 42465 -253826
18135e09230e2683b5829j73423A0063a84871L0164N9070C4497J4114b78888I1907
$$ -509230 -52683 -25829 -199252 10063 -184871 -154707 -95637 34497 48611 -278888 91907
18123A23587a51254A06949b72474a02057A04401a01284C4525J65558b2766j53212
$$ 123587 -151254 106949 -272474 -102057 104401 -101284 34525 200083 -22766 -175978
18113a75978j53527K1957G3124d60374d9194F4856e8300E4354J74500f0896B3987
$$ -175978 -329505 -307548 73124 -460374 -49194 64856 -58300 54354 228854 -60896 23987
18101c91313i6378B03026a04191B09781F8724a21041q1358I9577L1024m8068J18468
$$ -391313 -96378 203026 -104191 209781 68724 -121041 -202399 99577 130601 82533 201001
18090B01001a48692r1666a05806p6357B64250q4898h3428A34068C5564M3585b52921
$$ 201001 -148692 -240358 -105806 -182163 264250 179352 -83428 134068 35564 79149 -252921
18078d0678P876E5090a28689A94639f4164F436K39955c1933j26731n1790H470
$$ -40678 -32802 55090 -128689 194639 -64164 6436 246391 -31933 -158664 -210454 8470
18066a47741B07565E3096f8969k66914A93559d6621C46835F5537d0995m5369A00536
$$ -147741 207565 53096 -68969 -335883 193559 -46621 346835 65537 -40995 -86364 100536
18054a66652M8535C96985a76821l8316B5082a44671m9493C633a07841c8367A42382
$$ -166652 -118117 396985 -176821 -215137 25082 -144671 -194164 3633 -107841 -38367 142382
18042A84949I552g9982M608B40225D9087n305d1239A27756i7415A04570f7363
$$ 184949 9552 -79982 -75374 240225 49087 43782 -41239 127756 -97415 104570 -67363
18030A8404i6409o2687B02214r4651L5166K8862o0516M514k940b00026O7134c980
$$ 18404 -96409 -159096 202214 107563 142729 171591 111075 115589 112649 -200026 -132892 -3980
18017A43800a4306l02057O0932A57653a55383B73421b18648g6949n6961a7982
$$ 143800 -14306 -316363 -255431 157653 -155383 273421 -218648 -76949 -133910 -17982
18006h4046c6869l90685e7088j74007A36930a05815j64827A8750J1424d48121
$$ -84046 -36869 -427554 -57088 -231095 136930 -105815 -270642 18750 30174 -448121
17995C1558g0044A50365D1361P9913J8560a22050j08195F2904a5179m02205a56029
$$ 31558 -70044 150365 41361 121274 139834 -122050 -230245 62904 -15179 -417384 -156029
17983a42217B64836O4927a8221r5187k72531a51890A84581N2911n0327J15811
$$ -142217 264836 329763 -18221 -113408 -385939 -151890 184581 237492 187165 302976
17973C02976j07225N2818a97933h7356C0299K15369b35328K7483Q2052D4366M2490
$$ 302976 195751 248569 -197933 -87356 30299 245668 -235328 -207845 -125793 44366 86856
17962H6856a31297m6199K5513A86244f8786k94491A89672b19904I4232f969n2600
$$ 86856 -131297 -177496 -151983 186244 -68786 -363277 189672 -219904 94232 -6969 -59569
17951e9569k30103J06999i1336B017N1871A5867N6514i6085A74641d0292C3865
$$ -59569 -289672 -182673 -91336 2017 53888 15867 72381 -96085 174641 -40292 33865
17939I8933i694j8946K90l04171c3312j21797A62519a06386j10585J5875D8033
$$ 98933 -9694 -28640 -28350 -332521 -33312 -155109 162519 -106386 -216971 -201096 48033
17927A13176d590j98751A18414m4704i3526a3888E9879b2949m1799K3694L872
$$ 113176 -4590 -203341 118414 73710 -93526 -13888 59879 -22949 -64748 -41054 -37182
17916c7182j53666b5465A44369a66315E4783i3238a75r7845C7277L17769j26028
$$ -37182 -190848 -25465 144369 -166315 54783 -93238 -175 -98020 37277 355046 229018
17905B29018A6325n660b90795A58867e7440I6348L1344b4518k0854l4208A1949
$$ 229018 16325 10665 -290795 158867 -57440 96348 127692 -24518 -45372 -79580 11949
17893a54492A41185C4152a42933n3720d8240B72576m2045d0490A23799b00007
$$ -154492 141185 34152 -142933 -196653 -48240 272576 230531 -40490 123799 -200007
17882a49936D7030a33265D7616K95511I7171K444M3032Q394d31804D7604M9473
$$ -149936 47030 -133265 47616 343127 97171 99615 142647 151041 -431804 47604 97077
17871I7077b43336A32665f3147i535A61290B9749J12919F7581B8041M2697J65582
$$ 97077 -243336 132665 -63147 -9535 161290 29749 142668 67581 28041 70738 236320
17860B36320i0042A5289K74877a31672G5751B8011g4242j5286n7578A23973n5654
$$ 236320 -90042 15289 290166 -131672 75751 28011 -74242 -89528 -147106 123973 68319
17849F8319J46788c68165J73217B07519K19686f1101o9138B07504b94247F3377
$$ 68319 215107 -368165 -194948 207519 427205 -61101 -130239 207504 -294247 63377
17838a17820E8387A8370L48540a87360A91278a35257A813b27069A79599D77e2845
$$ -117820 58387 18370 366910 -187360 191278 -135257 1813 -227069 179599 477 -52845
17826d3087A81849b02437B31509b08936b4875j16397A08279D3800a8480B75031
$$ -43087 181849 -202437 231509 -208936 -24875 -141272 108279 43800 -18480 275031
17815a27988e7875j68679H6050K63860J7035b7480A6223n8J29464a07171C69421
$$ -127988 -57875 -226554 86050 349910 366945 -27480 16223 16165 145629 -107171 369421
17803e409j78577A57399A9369a13374l58593K15409B39523b37221a7893l8510
$$ -5409 -183986 157399 19369 -113374 -471967 -256558 239523 -237221 -17893 -56403
17793e6403J9102A42087A2110e6547j72670o1056C07997A51063J33382D1538J06266
$$ -56403 -37301 142087 12110 -56547 -229217 -290273 307997 151063 284445 41538 147804
17782A47804G3850f1654m6747j11834D1575a29849k61642h8058F6147a43743d9048
$$ 147804 73850 -61654 -108401 -220235 41575 -129849 -391491 -88058 66147 -143743 -49048
17770a48819k5514C60537b5761A298K49458a66347H2578b73565a6055p8970A12992
$$ -148819 -174333 360537 -25761 1298 250756 -166347 82578 -273565 -16055 -95025 112992
17758f938H567a78282A457M02602C3644b5169m5305K3550B30560a12765j01258
$$ -6938 8567 -178282 1457 404059 33644 -25169 -70474 -46924 230560 -112765 -214023
17747b14023A11660E1435f8006H3698b48210E25688A17350M6392P1343f7045F7465
$$ -214023 111660 51435 -68006 83698 -248210 525688 117350 163742 235085 -67045 67465
17735d33957A63191R2610k2020j3076d6246A13973a57092J8896H948e0774j37266
$$ -433957 163191 255801 233781 220705 -46246 113973 -157092 -138196 8948 -50774 -188040
17724a88040B08380i0572C6164G952N9784a34529A18483b39169R8534N697C11262
$$ -188040 208380 -90572 36164 7952 67736 -134529 118483 -239169 -140635 -134938 311262
17712A18241J18391L8561c61745h9332A02029f595j14405k52295a70832A23085
$$ 118241 236632 275193 -361745 -89332 102029 -6595 -121000 -373295 -170832 123085
17701A28535h4514j1618D5534L2502a62370A71730a51518M3448I4533Q4848K52773
$$ 128535 -84514 -96132 45534 78036 -162370 171730 -151518 -108070 94533 179381 432154
17690D32154b2206C2893J7969c7698B17557a16813A27943K78291b89738A0754
$$ 432154 -22206 32893 50862 -37698 217557 -116813 127943 406234 -289738 10754
17679b66799A11586c3555N199E6287C669J9891J70723a13574B24314e3943B15187
$$ -266799 111586 -33555 -28356 56287 3669 23560 194283 -113574 224314 -53943 215187
17667C54615f278j2486l4195l97754e3532A5094f1133n618g934G391K9145N5205
$$ 354615 -6278 -18764 -52959 -450713 -53532 15094 -61133 -66751 -7934 7391 36536 91741
17655I1741J47640q8951E266b89989k933J5088c7431j74082B20149Q4135F4244
$$ 91741 239381 150430 5266 -289989 -292922 -277834 -37431 -211513 220149 304284 64244
17643B65786C0732d44526a98176C8605o774J14688J1216m4396d2009B4330b04361
$$ 265786 30732 -444526 -198176 38605 31831 146519 157735 113339 -42009 24330 -204361
17631B87343J9296B1828M2019a32233M5353n3458b6244B6312J5663b25794A00675
$$ 287343 306639 21828 63847 -132233 -86880 -140338 -26244 26312 41975 -225794 100675
17619B28279E999J97448O693l6921D9424a40782L4622g455B6746h3151e471C66087
$$ 228279 5999 203447 210140 173219 49424 -140782 -106160 -7455 26746 -83151 -5471 366087
17606A92716L00796B24562A04583M8010c6388H1227A4383e6005A74835k2117n2279
$$ 192716 493512 224562 104583 152593 -36388 81227 14383 -56005 174835 152718 100439
17595A00439f6657A87757k2857N8002p6505F408a98621D67224j99758E5130b06494
$$ 100439 -66657 187757 164900 222902 146397 6408 -198621 467224 267466 55130 -206494
17583a54730g7197j20428j99867A7633e4797I2789d1444A15717m0727K8835a65477
$$ -154730 -77197 -197625 -397492 17633 -54797 92789 -41444 115717 74990 103825 -165477
17571c53083J34793F6718J24127a83266e2179n0711K624J1491j11843A29476o2432
$$ -353083 -218290 66718 190845 -183266 -52179 -102890 -100266 -88775 -200618 129476 67044
17560F7044b196j77395N9931E8520I430J36588K67921e21682C04273a32665B01116
$$ 67044 -2196 -179591 -119660 58520 9430 146018 413939 -521682 304273 -132665 201116
17548B51112g297B15399J8655k0247A2080a68078g6050A82401B7359a8290A7784
$$ 251112 -7297 215399 234054 213807 12080 -168078 -76050 182401 27359 -18290 17784
17536B83844A9744J47319o8394o978K11657j0927A34425K42976B9855a10765B28373
$$ 283844 19744 167063 98669 91691 303348 292421 134425 377401 29855 -110765 228373
17524C24527j07663J122d2612B41663l833a41116I0286J25293N4001n6977P2441
$$ 324527 216864 217986 -42612 241663 237830 -141116 90286 215579 269580 212603 285044
17513B85044F9754J9490R4974p8828K7482O2482P3547c9228A97196K44400A57837
$$ 285044 69754 89244 184218 105390 132872 195354 268901 -39228 197196 441596 157837
17501B58499a5892C03652L9145b5201b442G4306M4509j3392J31728g731I8239
$$ 258499 -15892 303652 342797 -25201 -2442 74306 118815 105423 237151 -7731 98239
17489B85941e3907E2122d0458p285N179j31150B01040D4748L56594a6316E4775
$$ 285941 -53907 52122 -40458 -47743 -42564 -173714 201040 44748 401342 -16316 54775
17477a73243H6478J38040D7308c7864E85599A32737J65323A03816i5988B56018
$$ -173243 86478 224518 47308 -37864 585599 132737 298060 103816 -95988 256018
17466A35457a17065B82599a8494C34120b0475G1004J39961F4521J13792H7762
$$ 135457 -117065 282599 -18494 334120 -20475 71004 210965 64521 178313 87762
17455g8958Q331A63454K7456Q6107e7178A82757C6112M10184A59759g9437A49081
$$ -78958 -70627 163454 190910 277017 -57178 182757 36112 446296 159759 -79437 149081
17443A25977e7515B84224j01678i7078D86828A03951R6438e6365A17147L55061
$$ 125977 -57515 284224 182546 -97078 486828 103951 200389 -56365 117147 472208
17433D72208H7039L18256I7735N187M24993A16359J92975A15696j8153J08297
$$ 472208 87039 405295 97735 102922 527915 116359 309334 115696 97543 205840
17423B05840N0094D956L22092J39200k07731H144N15647k15568J20729A82274
$$ 205840 255934 4956 327048 466248 258517 8144 523791 308223 428952 182274
17412B1663K00590b19751D48606B19872J54347j75007E3612J38266C3925K63265
$$ 21663 222253 -219751 448606 219872 374219 199212 53612 191878 33925 297190
17402B97190j05923J63946L245j20499p1434O2359K28542h5702A77232a23629
$$ 297190 191267 355213 358458 237959 166525 228884 457426 -85702 177232 -123629
17391C1542a07410B74691j04462R4874A05084g6335b1525m6248D33387A74240
$$ 31542 -107410 274691 170229 265103 105084 -76335 -21525 -67773 433387 174240
17380H4353b5526I7652c974F6331Q8570R2196C2858o439L80136E7668J21768Q5053
$$ 84353 -25526 97652 -3974 66331 154901 247097 32858 26419 406555 57668 179436 264489
17368B64489A16904L9225L0867m7530J03053c1465C08295Q3718M8846r208k09814
$$ 264489 116904 156129 186996 139466 242519 -31465 308295 392013 440859 431651 221837
17357B21837N0905r7608N087j4134c0995k98590A12885K9596c9537B04030b00124
$$ 221837 272742 175134 180221 166087 -30995 -329585 112885 142481 -39537 204030 -200124
17345A03340Q7486k1855L1248E5152a32031C28890a33352I9103l7514a39467c8922
$$ 103340 190826 168971 200219 55152 -132031 328890 -133352 99103 61589 -139467 -38922
17333B43410r0438I105J66150a18467D32364e6859j23929A61583M48627I2066
$$ 243410 152972 9105 175255 -118467 432364 -56859 -180788 161583 610210 92066
17322A60a4636B44103A6287J70574K20016A44034a47309D37639k09312K6246n0814
$$ 160 -14636 244103 16287 186861 406877 144034 -147309 437639 228327 254573 203759
17311B03759K4255K63812B6463d155D5036J1032B864K83837M299F1649K71322
$$ 203759 228014 491826 26463 -4155 45036 56068 2864 286701 291000 61649 332971
17300C32971M3682A04040O925Q9566m9611n121b58328B29417r6711n6609P0614
$$ 332971 376653 104040 110965 200531 150920 145799 -258328 229417 132706 76097 146711
17289A46711K59516L6328q1319A32099J6113K83254B08494L21676j07280A78850
$$ 146711 406227 442555 361236 132099 148212 431466 208494 530170 422890 178850
17278G8388J33835J90445I1899K98857E1029Q8784L28086B3132L50963p9905C0741
$$ 78388 212223 402668 91899 390756 51029 139813 467899 23132 374095 294190 30741
17266A22616E0578M1234i0449J0733C8608J95942l4759A5094L27653A09315d4511
$$ 122616 50578 91812 -90449 -79716 38608 234550 199791 15094 342747 109315 -44511
17254B04360c2429A79057q339a95850A70329m0563M6325M3485a8718E0432a72158
$$ 204360 -32429 179057 170718 -195850 170329 129766 176091 219576 -18718 50432 -172158
17242A76784q7939M05237A31396J24219f1625D45679q3729c6295E17555I0727
$$ 176784 88845 494082 131396 255615 -61625 445679 361950 -36295 517555 90727
17231B76648r5540K37180q1948j14317o0865J14257J29463A94250o6537J61346
$$ 276648 181108 418288 336340 222023 161158 275415 404878 194250 127713 289059
17221B89059j14253F1213J37626n3321o4729P0819k2565N6958K9325e0193B03077
$$ 289059 174806 61213 198839 145518 80789 151608 129043 186001 215326 -50193 203077
17209a00701A33867c49B82425J1599J42363j2452j52639e4151A99016L22814A28508
$$ -100701 133867 -349 282425 294024 436387 423935 271296 -54151 199016 521830 128508
17197A41172O8735B9329O4469R2774L3778J18407J4536n7751o7377J78258A21275
$$ 141172 209907 29329 93798 186572 220350 338757 353293 295542 228165 406423 121275
17185B74962a7476B44268d3191B41139b07877D84588A62595M13813B87332O8080
$$ 274962 -17476 244268 -43191 241139 -207877 484588 162595 576408 287332 355412
17175C55412G8481L17449n6025A60543B9070J84370r6105O5462D3106L70591j11017
$$ 355412 78481 395930 339905 160543 29070 213440 117335 182797 43106 413697 302680
17164C02680b7013l7112B45432D7519J75534K16185k06253k6864d2328D09706
$$ 302680 -27013 -64125 245432 47519 223053 439238 232985 206121 -42328 409706
17153C86320A34654K63194k5114P43c09847A05383m6337L11473A58106J63528
$$ 386320 134654 397848 372734 373477 -309847 105383 59046 370519 158106 321634
17143C21634J35042B03237K29917q7681l1805r1169m7966L4133J79041A29580
$$ 321634 456676 203237 433154 345473 313668 222499 174533 208666 387707 129580
17132D17785j31210J55651C1749a9187B81158m5147A0506K67851j20807m3925
$$ 417785 286575 442226 31749 -19187 281158 236011 10506 278357 157550 113625
17122A13625K16288l9652L30123E6170J72069k1839J01109N2745q4432j33218
$$ 113625 329913 290261 620384 56170 228239 206400 307509 360254 275822 142604
17112A42604M18091B27306Q0479k9851r2650J69601k5073o2144j9557O2343K69445
$$ 142604 560695 227306 307785 277934 185284 354885 329812 267668 248111 310454 579899
17101E79899k06385j751J62737B30344K23139j84936J35788A22658L48448K0265
$$ 579899 373514 371763 534500 230344 453483 268547 404335 122658 471106 491371
17091D91371m8713J66462B51155j10091L06232m3688r5044p2729K27198k07724
$$ 491371 442658 609120 251155 141064 447296 403608 308564 235835 463033 255309
17081B55309M17779B52581K35893J4554k9509J43059j490o0927J61013A59778
$$ 255309 673088 252581 488474 503028 473519 616578 615088 554161 715174 159778
17070C01550j32699n0232L90507o4526J70304l1610F8168N81004o8962o2441c5085
$$ 301550 168851 118619 509126 444600 614904 583294 68168 649172 580210 517769 -35085
17058E38340k29627l3297H4750L32594L39074B51984J4914J75728j83813J30122
$$ 538340 308713 275416 84750 417344 756418 251984 266898 442626 258813 388935
17048C88935P5860F8447J21561N46936j91785L34391J52930C89100J89003B88032
$$ 388935 464795 68447 190008 736944 545159 879550 1032480 389100 578103 288032
17037D44081L791j86441M7491J45296j48916N29957A81141J75183k1925p680K7004
$$ 444081 447872 261431 308922 454218 305302 835259 181141 356324 334399 326719 353723
17026C53723O2218K37457j94374M28478k27748j82463K14463R3938k93723q6453
$$ 353723 415941 653398 459024 887502 659754 477291 691754 785692 491969 405516
17016D05516O5823L4579m6988j35815L41056C14604K19068p463K00293l02498
$$ 405516 471339 505918 458930 323115 664171 314604 533672 526209 726502 424004
17006D24004L06562j12666j97715J38400k65287K69224j6417Q6123j98397J39566
$$ 424004 730566 617900 420185 558585 293298 562522 546105 632228 433831 573397
16996E73397M3190j30099q6280J45290J44159q9052J29L1405L05383m23251j9739
$$ 573397 616587 486488 400208 545498 689657 600605 600734 632139 937522 514271 494532
16985D94532K6636K6921J62505j69022K93546l13935L96455j99653J9755N059
$$ 494532 521168 548089 710594 541572 835118 521183 917638 717985 737740 742799
16975G42799K6557n333L6879k94202p7293L85065L3033j33826L44185m65641J42666
$$ 742799 769356 764023 800902 506700 429407 814472 847505 713679 1057864 592223 734889
16964G34889j6960o9960j03077N6907P2354J79687k09946k26233N58616J85998
$$ 734889 717929 647969 544892 601799 674153 853840 643894 417661 976277 1162275
16954A162275k00910j52782j6932N3877M0767L5238K21184j62609m8648L8577
$$ 1162275 961365 808583 791651 845528 886295 921533 1142717 980108 931460 970037
16944I70037O7641L9340j61107k1394l79748L98884J79950m06910N66575m32603
$$ 970037 1037678 1077018 915911 894517 514769 913653 1093603 686693 1253268 820665
16934H20665q8044J13756M24962o09431M85384k11446K51679r7831J45343l75948
$$ 820665 732621 846377 1271339 661908 1147292 935846 1187525 1089694 1235037 859089
16924H59089K95775J89276k30466P1653l52519J79878L58053j61415k52714L54991
$$ 859089 1154864 1344140 1113674 1185327 832808 1012686 1370739 1209324 956610 1311601
16914A311601l80180J73997j50554J95965l57937N58085j78746p1408K2042J96837
$$ 1311601 931421 1105418 954864 1150829 792892 1350977 1172231 1100823 1122865 1319702
16904A319702k55711m6203R2751L29638j67922j42680J58877J52545p9849L6101
$$ 1319702 1063991 1017788 1110539 1440177 1272255 1129575 1288452 1440997 1361148 1397249
16894A397249J41125M8576l30853O6842M90743k72455k36600M55887j23523j10218
$$ 1397249 1538374 1586950 1256097 1322939 1813682 1541227 1304627 1760514 1636991 1526773
16884A526773Q144p072N4759J29503J19049k81287R1270K60301K6848L2207o4971
$$ 1526773 1534917 1527845 1582604 1712107 1831156 1549869 1641139 1901440 1928288 1960495 1895524
16873A895524L46442o01206J08243p900R4397N4183M482J99265j61285J87080
$$ 1895524 2241966 1640760 1749003 1741103 1835500 1889683 1894165 2093430 1932145 2119225
16863B119225J20601m22498K29295K65249l60748K36906j17871J84497N7029K5901
$$ 2119225 2239826 1817328 2046623 2311872 1951124 2188030 2070159 2254656 2311685 2337586
16853B337586J98372k64151r6777K66643k03752M95587p0765l88468L07033O6102
$$ 2337586 2535958 2271807 2175030 2441673 2237921 2733508 2662743 2274275 2581308 2647410
16843B647410J9193J8891K18262o8296J19310P3363k11193K9576K8164j57397
$$ 2647410 2666603 2685494 2903756 2835460 2954770 3028133 2816940 2846516 2874680 2717283
16833B717283L44794K41417l26707J93381K29549o01638N11663j04450M64008
$$ 2717283 3062077 3303494 2976787 3170168 3399717 2798079 3309742 3205292 3669300
16824C669300P2604k60226m9704J67136L00214L6925P7920j2222o2149P8135J63573
$$ 3669300 3741904 3481678 3431974 3599110 3899324 3936249 4014169 4001947 3939798 4017933 4181506
16813D181506k83789L09272J14759K73619m7771J90581J5726L26714k12169J99518
$$ 4181506 3897717 4206989 4321748 4595367 4547596 4738177 4753903 5080617 4868448 5067966
16803E067966K28091k67257L92773j19948j1744M70289L8744K11991J21001R3948
$$ 5067966 5296057 5028800 5421573 5301625 5289881 5760170 5798914 6010905 6131906 6225854
16793F225854P3179K82413j25248M22067K15463j0308J83459p6292j28525J058544
$$ 6225854 6299033 6581446 6456198 6878265 7093728 7083420 7266879 7190587 7062062 8120606
16783H120606j46082J67781M47515R3650K24289K51199J78905L57117k9141M35264
$$ 8120606 7974524 8142305 8589820 8683470 8907759 9158958 9337863 9694980 9665839 10101103
16773A0101103J04721O76829n8613O20491K20917L60217Q7834M22256M50004P05392
$$ 10101103 10205824 10882653 10824040 11444531 11665448 12025665 12113499 12535755 12985759 13691151
16763A3691151K16927N08046M18657K96478O65762K94491R71807L47440M76811
$$ 13691151 13908078 14416124 14834781 15131259 15797021 16091512 17063319 17410759 17887570
16754A7887570P65313R28990M60575J012453Q09609P66078J030757P16673J290396
$$ 17887570 18652883 19581873 20042448 21054901 21864510 22630588 23661345 24378018 25668414
16745B5668414R18334J219981J477793J067963J721759J363555J614986J843047
$$ 25668414 26586748 27806729 29284522 30352485 32074244 33437799 35052785 36895832
16737C6895832J868465J624257K618316K270168K260617K464581L208816K831117
$$ 36895832 38764297 40388554 43006870 45277038 47537655 50002236 53211052 56042169
16729E6042169L276716L871584L807694L807333M518023N109026N304285N683536
$$ 56042169 59318885 63190469 66998163 70805496 75323519 80432545 85736830 91420366
16721I1420366N982770O203484P061735P142881P941031Q244579Q274442Q615266
$$ 91420366 97403136 103606620 110668355 117811236 125752267 133996846 142271288 150886554
16713A50886554R409873Q713303R155031Q293063Q590406P498224O741402N565772
$$ 150886554 160296427 169009730 178164761 186457824 195048230 202546454 209287856 214853628
16705B14853628M276930K501682J313054q83268k779250l979483n521765o833702
$$ 214853628 219130558 221632240 222945294 222062026 219282776 215303293 209781528 202947826
16697B02947826p729881q734741r252618r032356r712372r125539q772230q689999
$$ 202947826 195217945 186483204 177230586 168198230 158485858 149360319 140588089 131898090
16689A31898090q194919q283037o983602p398672o082347n794965n718732n335741
$$ 131898090 123703171 115420134 108436532 101037860 94955513 89160548 83441816 78106075
16681G8106075m975534m458715m466938l481401l794277l392269k920431k991134
$$ 78106075 73130541 68671826 64204888 60723487 56929210 53536941 50616510 47625376
16673D7625376k633335k213007k318119k352874j740154k104364j519629j505531
$$ 47625376 44992041 42779034 40460915 38108041 36367887 34263523 32743894 31238363
16665C1238363j354226j595267j082069j373071j259021q90456r52769r92610
$$ 31238363 29884137 28288870 27206801 25833730 24574709 23684253 22731484 21738874
16657B1738874n35456j261466m68245q80152j017024n59540m21729q34980l36292
$$ 21738874 21203418 19941952 19473707 18593555 17576531 17016991 16595262 15760282 15423990
16648A5423990p84836k81562l54875n71643m25594n49156q72842J65491l92485
$$ 15423990 14639154 14357592 14002717 13431074 13005480 12456324 11583482 11748973 11356488
16639A1356488m72397n20737m24341M6267n84174l78689m6940k46689k00529k87615
$$ 11356488 10884091 10363354 9939013 9985280 9401106 9022417 8975477 8728788 8528259 8240644
16629H240644l00696q307k55421k864m64634k09378K27974n04554k15863R3313
$$ 8240644 7939948 7931641 7676220 7673356 7208722 6999344 7227318 6722764 6506901 6600214
16619F600214m0185n79003j78848j68684M54879p07933J0175k65429j10304L03952
$$ 6600214 6560029 5981026 5802178 5633494 6088373 5380440 5390615 5125186 5014882 5318834
16609E318834j24362m42961K86451p03608L78364m27865Q659K94680o58978L15814
$$ 5318834 5194472 4751511 5037962 4334354 4712718 4284853 4293512 4588192 3929214 4245028
16599D245028n51201L25060j34983j40932j10688j28180L48431m05641j4833L0730
$$ 4245028 3693827 4018887 3883904 3742972 3632284 3504104 3852535 3446894 3432061 3462791
16589C462791l53868K98320k46507K16043m39223J53581m25254M6798R8652J67396
$$ 3462791 3108923 3407243 3160736 3376779 2937556 3091137 2665883 2712681 2811333 2978729
16579B978729k93697j51071J90781k64235j03734J60820P6295l33122J89534k8749
$$ 2978729 2685032 2533961 2724742 2460507 2356773 2517593 2593888 2260766 2450300 2421551
16569B421551q0985p006j5481J45089m93464j03529l6753P4743K05529m13270
$$ 2421551 2340566 2333560 2318079 2463168 1969704 1866175 1829422 1904165 2109694 1696424
16559A696424K64889o81j16299j00150J04854m1198k97080M20865k08334J95254
$$ 1696424 1961313 1960632 1844333 1744183 1849037 1807839 1510759 1931624 1723290 1918544
16549A918544l23048K23018k77174r9569J79949l54236K93213J495K86264m99447
$$ 1918544 1595496 1818514 1541340 1441771 1621720 1267484 1560697 1562192 1848456 1349009
16539A349009O506J39286j71281p5794J38228k91823L22998j26951j03820J18339
$$ 1349009 1355515 1494801 1323520 1247726 1385954 1094131 1417129 1290178 1186358 1304697
16529A304697j24121p8274N0144N09821p72356L29850l46514K37773J77379j92244
$$ 1304697 1180576 1102302 1152446 1662267 889911 1219761 873247 1111020 1288399 1096155
16519A096155R6326N5057r7775k6665o5205l98833J37415J10357L55085n19433
$$ 1096155 1192481 1247538 1149763 1123098 1057893 659060 796475 906832 1261917 742484
16509G42484N53070k77746j38963J60060j71438P4710J9558j15140L04772n23253
$$ 742484 1295554 1017808 878845 1038905 867467 942177 961735 846595 1151367 628114
16499F28114K24058p7017Q3880q6843J55307j28204K18446l82680k26182L54613
$$ 628114 852172 775155 859035 772192 927499 799295 1017741 635061 408879 763492
16489G63492N7226K9528J64555l24767J08699k80607L05213j84925n4429q6960
$$ 763492 820718 850246 1014801 690034 798733 518126 823339 638414 583985 497025
16479D97025M69436l81232k91433K04137Q7014J22633J12891k61046L64666j52384
$$ 497025 966461 585229 293796 497933 584947 707580 820471 559425 924091 771707
16469G71707k53808q32J2751Q8399L3047k69093J42598K08128j27180j23051k9039
$$ 771707 517899 517067 529818 618217 651264 382171 524769 732897 605717 482666 453627
16458D53627J25779K31705B19948L36701A39529M56652K01059j38339k57227j61813
$$ 453627 579406 811111 219948 556649 139529 596181 797240 658901 401674 239861
16448B39861M15465l8802k81017A35869O32425k87775K01346k5616j36189n7365
$$ 239861 655326 616524 335507 135869 768294 480519 681865 656249 520060 462695
16438D62695K26380k89643L35452l56020K47054J81215M0787m11966r9506J3722
$$ 462695 689075 399432 734884 378864 625918 807133 847920 435954 336448 350170
16428C50170j23647M72100p7946k39316L22206k76005j0963N9874N1350R1123
$$ 350170 226523 698623 620677 381361 703567 427562 416599 476473 527823 618946
16418F18946j74557J07952k67891J07899P6442j86904R2961L26484a41746B52380
$$ 618946 444389 552341 284450 392349 468791 281887 374848 701332 -141746 252380
16407C97638a04768B34844K2801K36873k25865P5750j54537K9910R4364J99755
$$ 397638 -104768 234844 257645 494518 268653 344403 189866 219776 314140 513895
16397E13895r0985K05521B45696J39357r9014q6797h297A91923J378M7840M08795
$$ 513895 422910 628431 245696 385053 286039 199242 -8297 191923 193301 241141 649936
16386F49936k38818j44410k2550J74790A56401K95307F8491K24203A42814M86482
$$ 649936 411118 266708 244158 418948 156401 451708 68491 292694 142814 629296
16376F29296A96188K91325B36526k3419K6309P7411q6632m417J63030j32018J21534
$$ 629296 196188 487513 236526 213107 239416 316827 230195 225778 388808 256790 378324
16365C78324L5987A50410l8212b9907I6333k1158J70913M8508F1985K22106f2789
$$ 378324 414311 150410 112198 -29907 96333 75175 246088 294596 61985 284091 -62789
16353D79491a0106A03530M29557a4249D02345q7570J82966k36805j08180c9547
$$ 479491 -10106 103530 533087 -14249 402345 314775 497741 260936 152756 -39547
16342B81633a42767H1482a06003A36090J82864d8184I0031L26801A91503L69085
$$ 281633 -142767 81482 -106003 136090 318954 -48184 90031 416832 191503 560588
16332E60588A95260J72496E7289L5922K5858f5168B2978N054K38121j11952R0606
$$ 560588 195260 367756 57289 93211 119069 -65168 22978 28032 266153 154201 244807
16321B44807B969f5578A49678B3706J92079N6954j8724b6478A55538L45665e0183
$$ 244807 2969 -65578 149678 23706 215785 272739 254015 -26478 155538 501203 -50183
16309b00006C42844j05340Q7045D8236J80M5191a48279B65176j03823N3517b6988
$$ -200006 342844 237504 324549 48236 48416 93607 -148279 265176 161353 214870 -26988
16297A83535K2921f3601B33610A7407M09841j75149A25996F2573J01661k6868
$$ 183535 206456 -63601 233610 17407 427248 252099 125996 62573 164234 137366
16287A37366J24867a24048D07949H4241j5204M23049A59101B1598J70603b33674
$$ 137366 262233 -124048 407949 84241 69037 492086 159101 21598 192201 -233674
16276B87482j43616p0453Q3351k9648C7288L45180a01527A11242Q4030o1777B6942
$$ 287482 143866 73413 156764 127116 37288 382468 -101527 111242 195272 133495 26942
16264D3835R0062b96761G8607K44817C8120g9958K5813n0724A59074b52399A26748
$$ 43835 133897 -296761 78607 323424 38120 -79958 -54145 -104869 159074 -252399 126748
16252C69324b3079D443e3659l6771A06338M56940B7098J15356B1297K59736A37924
$$ 369324 -23079 4443 -53659 -90430 106338 563278 27098 142454 21297 281033 137924
16240h7679B19744K0703n8372q829a2248B0051L35399F0545c92286J59062H2275
$$ -87679 219744 240447 182075 173246 -12248 20051 355450 60545 -392286 -233224 82275
16228A57459G1481c8106m760m8243A05249A7571b47688A43803b077j37314A45578
$$ 157459 71481 -38106 -42866 -91109 105249 17571 -247688 143803 -2077 -139391 145578
16216A44398b26367M873A6350R8932c8324H0604D91P7332b71720g3523D60973
$$ 144398 -226367 -221494 16350 115282 -38324 80604 491 77823 -271720 -73523 460973
16204B31521I5076B5587Q4147d26437E0792K13691j29236J66738o7245e7354I860
$$ 231521 95076 25587 109734 -426437 50792 264483 135247 301985 234740 -57354 9860
16192A94074O7306A9040K34787c15973G3759Q9686c14369C09433a55674F8810
$$ 194074 261380 19040 253827 -315973 73759 163445 -314369 309433 -155674 68810
16181h5319D32552I7484C822J81491I1406b19504B16575J0412K00117a58672l6131
$$ -85319 432552 97484 3822 185313 91406 -219504 216575 226987 427104 -158672 -194803
16170a94803A75197G2841J84866N7160j19119l5718O771n5520i9519C45698D9010
$$ -194803 175197 72841 257707 314867 195748 160030 166801 111281 -99519 345698 49010
16158e0269A95831b3109A9615J12395b11533B59713d58636A13316P445J6537L7664
$$ -50269 195831 -23109 19615 132010 -211533 259713 -458636 113316 120761 137298 174962
16147A74962J13335p8463p2093J3658a19305A78584k7075b42831j45300A80574
$$ 174962 288297 209834 137741 151399 -119305 178584 151509 -242831 -388131 180574
16136A0843J72084F7112J10592g3918B31887b19766D7322L8597O1949a03208A16314
$$ 10843 182927 67112 177704 -73918 231887 -219766 47322 85919 147868 -103208 116314
16124D9021O406c00658B36509b17406o7142G6173b3943G6137b01700D2590d52796
$$ 49021 55427 -300658 236509 -217406 -284548 76173 -23943 76137 -201700 42590 -452796
16112g344H5614d4846m429a5288E514P5164a58479M2676M8998n9556b8524D42566
$$ -7344 85614 -44846 -49275 -15288 5514 80678 -158479 -115803 -66805 -126361 -28524 442566
16099a68907e6306j15340n1805A57177c03175B65694H4274b75057J28473e6293
$$ -168907 -56306 -171646 -223451 157177 -303175 265694 84274 -275057 -146584 -56293
16088I9172i6903A29271C1571K53980n1538g592m7314G9094A0858e5526j23919
$$ 99172 -96903 129271 31571 285551 234013 -7592 -54906 79094 10858 -55526 -179445
16077a79445B0117P025g0407l6281j95353a30884b6250l16111O3786H3649B307
$$ -179445 20117 27142 -70407 -106688 -302041 -130884 -26250 -342361 -278575 83649 2307
16065c2004o9602n3850c4567B19902K69163a8859m29133C66728d0992j23630J7414
$$ -32004 -101606 -155456 -34567 219902 489065 -18859 -447992 366728 -40992 -164622 -147208
16054a47208k9660Q8098F5943f5212A06647J03525p6589j9264b21402a1975E1673
$$ -147208 -176868 -88770 65943 -65212 106647 210172 133583 114319 -221402 -11975 51673
16042C492J01936a85234k52801C25175b1848C65022b70201C52678E356K8796a38051
$$ 3492 105428 -185234 -438035 325175 -21848 365022 -270201 352678 5356 34152 -138051
16030b6599A6274M6637H334a83868O0448j47524a0153k87903f8596k20713G8720
$$ -26599 16274 62911 8334 -183868 -123420 -270944 -10153 -298056 -68596 -289309 78720
16018D07602b30434B8370f1187a7767k30465D4147R4420a59154c1360l51067N7472
$$ 407602 -230434 28370 -61187 -17767 -248232 44147 138567 -159154 -31360 -382427 -324955
16007c24955H5367l9576J32664a93590B04186e6790j66844b5535j33280B9246
$$ -324955 85367 45791 178455 -193590 204186 -56790 -223634 -25535 -158815 29246
15996B21062q8834O7089b17144h6613k35883J1431A63431g8319D5463b02558g6500
$$ 221062 132228 199317 -217144 -86613 -322496 -311065 163431 -78319 45463 -202558 -76500
15984G5730c12119J27316b4141A4493c8667j49459g8999A66558E2838a43617M8910
$$ 75730 -312119 -184803 -24141 14493 -38667 -188126 -78999 166558 52838 -143617 -94707
15973i4707j32880J00627A81214K3260h0599A23200O5382H6437N1386o6143a50790
$$ -94707 -227587 -126960 181214 204474 -80599 123200 188582 86437 137823 71680 -150790
15961B29576a45129c6749q3171a9692C86062a58123B56190a36112a9468K375o9289
$$ 229576 -145129 -36749 -119920 -19692 386062 -158123 256190 -136112 -19468 -17093 -86382
15950h6382f449A11319b11594A72362E0048h217k57810f8616E7792R3145a02832
$$ -86382 -6449 111319 -211594 172362 50048 -8217 -266027 -68616 57792 150937 -102832
15938b13951E6046a48486M6001o7893j52659a04001n7393p8764A49895d4675o3002
$$ -213951 56046 -148486 -102485 -170378 -323037 -104001 -161394 -240158 149895 -44675 -107677
15927a07677A94719K995g1419G348b18366H9142J38221A8302O0288e8047K2147
$$ -107677 194719 197714 -71419 7348 -218366 89142 227363 18302 78590 -58047 -35900
15916c5900a0044D3824P8261a70934B50546j9745a92610h6759l08480C14182C2170
$$ -35900 -10044 43824 122085 -170934 250546 230801 -192610 -86759 -395239 314182 32170
15904i5953H2468b8860A1498i9389k76368a19878B19480q987c14592A5778c42090
$$ -95953 82468 -28860 11498 -99389 -375757 -119878 219480 210493 -314592 15778 -342090
15892d96407a83049A98541K3261H5226d9780A75823a54758f0572D6320J03858
$$ -496407 -183049 198541 221802 85226 -49780 175823 -154758 -60572 46320 150178
15882A50178a90818A9567b38842K217c1029k14807j60218B7165b63057a2227j74424
$$ 150178 -190818 19567 -238842 -236625 -31029 -245836 -406054 27165 -263057 -12227 -186651
15871a86651n3425m6898e7669A37819i9054j79453G7202b45964d9207C3223N4430
$$ -186651 -240076 -286974 -57669 137819 -99054 -278507 77202 -245964 -49207 33223 87653
15860H7653i8939B72055f4070K9701o2656b0400A18098J1006o3975q579a24989
$$ 87653 -98939 272055 -64070 -34369 -97025 -20400 118098 129104 65129 56550 -124989
15848A82474G3487a71170C593L7414A7329a55128m1668A49592b51469A32116A4161
$$ 182474 73487 -171170 3593 41007 17329 -155128 -196796 149592 -251469 132116 14161
15836g2344D0784L937b31309D5685Q641a1002A16289P4369I2430O5852M338n3526
$$ -72344 40784 44721 -231309 45685 54326 -11002 116289 190658 92430 158282 162620 109094
15824A09094c6273C3948j092r792b44435d8021D8536b2519j26324D0436g4255
$$ 109094 -36273 33948 32856 23064 -244435 -48021 48536 -22519 -148843 40436 -74255
15812b27150A4068J97001d93022a89162j673d529j46535K9020e3788d271l56948
$$ -227150 14068 211069 -493022 -189162 -190835 -4529 -151064 -122044 -53788 -4271 -361219
15801c61219d9853l0518j38863f9254C2722F638c7874j50992P5754K3164A6272
$$ -361219 -49853 -80371 -219234 -69254 32722 6638 -37874 -188866 -113112 -89948 16272
15789A59415a58612A44799a17327d1303a6190f764B70454d2967n2335j31048Q6235
$$ 159415 -158612 144799 -117327 -41303 -16190 -6764 270454 -42967 -95302 -226350 -140115
15778a40115A321b71197O7600A62396B0627J85874E1651K9493J30683M8599b35912
$$ -140115 1321 -271197 -203597 162396 20627 206501 51651 81144 211827 260426 -235912
15766h1649j63306A81541E7740a65373k8578A68076c30971k9661J09249a4044
$$ -81649 -244955 181541 57740 -165373 -193951 168076 -330971 -360632 -251383 -14044
15755A02244a8006N347j4750j43266j37201C5130K80109a32594D1817j9121Q6949
$$ 102244 -18006 -12659 -27409 -170675 -307876 35130 315239 -132594 41817 22696 109645
15744A09645K4765J9039o9388a69269D5409J61682H2320a12951C10321a19460
$$ 109645 134410 153449 84061 -169269 45409 207091 82320 -112951 310321 -119460
15733a5723j05640k218A8833K78429d5947C45150a69383E6801O9259K0511A3796
$$ -15723 -121363 -123581 18833 297262 -45947 345150 -169383 56801 126060 146571 13796
15721b12066J05208G6410b2357k7494k44246A2410a73464b0309A0353b67961G5120
$$ -212066 -106858 76410 -22357 -49851 -294097 12410 -173464 -20309 10353 -267961 75120
15709a75643l8112c9502A87922b39850J7668a08385j41284A0973a6056B75162
$$ -175643 -213755 -39502 187922 -239850 -222182 -108385 -249669 10973 -16056 275162
15698a32083P185j54205B1189h7767Q933a2817E1401b5132A23765a7064q0594
$$ -132083 -124898 -279103 21189 -87767 -78834 -12817 51401 -25132 123765 -17064 -97658
15687i7658C76329d1740n3226C26551h8449j12140b2801r9968A37372d036l86296
$$ -97658 376329 -41740 -94966 326551 -88449 -200589 -22801 -122769 137372 -4036 -390332
15676c90332A92984i2348j59393r255a419l15453a34274E7958b93488B48419d7918
$$ -390332 192984 -92348 -251741 -260996 -1419 -316872 -134274 57958 -293488 248419 -47918
15664D5614j12L23218B5417f9396E2000n371M8331a49441l34931f3003j07939
$$ 45614 45502 368720 25417 -69396 52000 46629 94960 -149441 -484372 -63003 -170942
15653a70942Q5396B39799a96276M4274O3379D3510b87074f0887j9057g468C43432
$$ -170942 -85546 239799 -196276 -152002 -88623 43510 -287074 -60887 -79944 -7468 343432
15641a59660A90003c43511e0413O189j11424A35441R8740a67584l2171q4648a16449
$$ -159660 190003 -343511 -50413 -44224 -155648 135441 234181 -167584 -199755 -284403 -116449
15629b10666A14833a29217A01444K2859d41650B2596J5928p937h2179J0234A46962
$$ -210666 114833 -129217 101444 124303 -441650 22596 38524 30587 -82179 -71945 146962
15617d3740B14698d2865j53639E8723b16748A71697a3767B7793a56767n1942B4448
$$ -43740 214698 -42865 -196504 58723 -216748 171697 -13767 27793 -156767 -208709 24448
15605i3767B39631a73702H5503f9043H3690M2606E6884L94002C7679b69372C7224
$$ -93767 239631 -173702 85503 -69043 83690 126296 56884 450886 37679 -269372 37224
15593b7764k57455i0081B7329a92552I0152a53457G3212f0788F7922J15210h2900
$$ -27764 -285219 -90081 27329 -192552 90152 -153457 73212 -60788 67922 183132 -82900
15581d588G7227J20461H3466b68887r8413a10804L8153H4237a44705b07E447b87243
$$ -4588 77227 197688 83466 -268887 -367300 -110804 -72651 84237 -144705 -207 5447 -287243
15568h6256C5330a58238O7511E3799a00624A7770c14981a5324C0105N3187J02124
$$ -86256 35330 -158238 -90727 53799 -100624 17770 -314981 -15324 30105 83292 185416
15557A85416d7403k4847j42807F8703d7343C7814o89P1172b0681B51361c17981
$$ 185416 -47403 -72250 -215057 68703 -47343 37814 37125 108297 -20681 251361 -317981
15545a56310G2458I518N2293a27955n3800f0056n3119a4039ij65616j12612d0341
$$ -156310 72458 9518 61811 -127955 -181755 -60056 -113175 -14039 -9 -165625 -278237 -40341
15532A60526h3412k019A19243c98736B28136C9716J03341i524k31925C914c42572
$$ 160526 -83412 -85431 119243 -398736 228136 39716 143057 -9524 -241449 3914 -342572
15520b5521E2644K6121P4364a49311A80079C9959J84220m3021a45809A54318h7044
$$ -25521 52644 78765 153129 -149311 180079 39959 224179 181158 -145809 154318 -87044
15508b92632C32165a98184P6365A00738q621P7778l0409R5807i0865A94258M4328
$$ -292632 332165 -198184 -121819 100738 92117 169895 139486 235293 -90865 194258 238586
15497B38586A03852g3247L567A5934R9596B1406o260K21497E9782d7155A3972
$$ 238586 103852 -73247 -69680 15934 115530 21406 15146 236643 59782 -47155 13972
15485e1988l09164E5888b34911A79277c60052i8997j42117A0554a11960C09331
$$ -51988 -361152 55888 -234911 179277 -360052 -98997 -241114 10554 -111960 309331
15474E0154A7944d70323C0748K94163a4756D5907K3756R9501d9147j02690j1374
$$ 50154 17944 -470323 30748 324911 -14756 45907 69663 169164 -49147 -151837 -163211
15463a63211A44609M4936n9375a92445A20629n0146h2781n5819B3155J08396b77025
$$ -163211 144609 189545 130170 -192445 120629 70483 -82781 -138600 23155 131551 -277025
15451A25259a36737f5202j36489A21398k2643N015N0897i8932k0686G9381b3089
$$ 125259 -136737 -65202 -201691 121398 98755 103770 154667 -98932 -119618 79381 -23089
15439B06912q0359b80772O0655M1563A86930E7035Q2893K117a38442j00182C2271
$$ 206912 126553 -280772 -220117 -178554 186930 57035 139928 142045 -138442 -238624 32271
15427E5185g3179k14754D6975n335b46490A45209b066B25065d9053J6667j19451
$$ 55185 -73179 -287933 46975 41640 -246490 145209 -2066 225065 -49053 -32386 -151837
15416a51837A02193c1483m6454B87040e23515a40068B20296E9395g9956L3806
$$ -151837 102193 -31483 -77937 287040 -523515 -140068 220296 59395 -79956 -46150
15406d6150E7247K27343N5324b18430n4478J20057K3484B10354m3552C3149l285
$$ -46150 57247 284590 339914 -218430 -272908 -152851 -129367 210354 166802 33149 29864
15395B9864g3088b4930k02215c7625q6472C7324O2857k3426f50722c00205A88851
$$ 29864 -73088 -24930 -227145 -37625 -124097 37324 100181 76755 -650722 -300205 188851
15383B8590a41551A05545a74825D02J21970b190B62551b22927B8203b70186a22228
$$ 28590 -141551 105545 -174825 402 122372 -2190 262551 -222927 28203 -270186 -122228
15371A73914K766K2393h729r16j56128k16895a80548G9744b9318j74450l5227
$$ 173914 176680 199073 -8729 -9645 -165773 -382668 -180548 79744 -29318 -203768 -238995
15360b38995E6195C715a49614N2833K31H2656i6919B77814a81561H7957D2755
$$ -238995 56195 3715 -149614 -96781 -96550 82656 -96919 277814 -181561 87957 42755
15348A47399e6406a2985q4789r908j77489C38201A25480b03003C1445a42780G8902
$$ 147399 -56406 -12985 -97774 -107682 -285171 338201 125480 -203003 31445 -142780 78902
15336a34178F8196J29900J53423a02052H3436j8656K35518F5549c7321k126B56167
$$ -134178 68196 198096 351519 -102052 83436 64780 300298 65549 -37321 -39447 256167
15324A97285d337j00855G0415K82412j28248M431I9788b05411P0345B70628K01777
$$ 197285 -4337 -105192 70415 352827 224579 229010 99788 -205411 -135066 270628 472405
15313D72405g5485F5307O9543q286a3879F1677J3596R5401a38310C2629a73643
$$ 472405 -75485 65307 134850 126564 -13879 61677 75273 170674 -138310 32629 -173643
15301D9406N2331b80673B30157L2960B4636J66019i8069B4018d1884j38425e7054
$$ 49406 101737 -280673 230157 263117 24636 190655 -98069 24018 -41884 -180309 -57054
15289B17707c37534J41067A49350a05864k7417J7395l8441A25400k5525h9907
$$ 217707 -337534 -196467 149350 -105864 -133281 -115886 -154327 125400 99875 -89907
15278b0846k17284A38887l9202b01011E7061f1213C7864d0815G123L7407p336
$$ -20846 -238130 138887 99685 -201011 57061 -61213 37864 -40815 7123 44530 37194
15267C7194J54100d5928H0224i7591A39638a03043A234h5717G8747c3431H7458
$$ 37194 191294 -45928 80224 -97591 139638 -103043 1234 -85717 78747 -33431 87458
15255B55328F0629J494c7690m1163A93896L9985H2893l0136k1440J21022b52186
$$ 255328 60629 62123 -37690 -78853 193896 233881 82893 52757 31317 152339 -252186
15243A64130D0654M36529c40341B18413f730E55938B33426P0133N90766M10749
$$ 164130 40654 477183 -340341 218413 -6730 555938 233426 303559 894325 1305074
15233A305074m98082M78406m50543k56650A66541b11011C39732K9714a17025q381
$$ 1305074 806992 1285398 834855 578205 166541 -211011 339732 369446 -117025 -125406
15223a25406A16740a02041A03455b0555A75934n4074e2811A69477h1809B45644
$$ -125406 116740 -102041 103455 -20555 175934 121860 -52811 169477 -81809 245644
15212C35828A62810N9749J25390H2805p089J56313C8378J00849J4880m6376b4425
$$ 335828 162810 222559 347949 82805 75716 232029 38378 139227 154107 107731 -24425
15200a13504o5825j84302a53902A2512J54648L5062o2089k6067K60510g2780l50513
$$ -113504 -179329 -363631 -153902 12512 167160 202222 140133 114066 374576 -72780 -423293
15189d23293A20523J11057A13633K12053e5162B15730a33777F5987K32478b92142
$$ -423293 120523 231580 113633 325686 -55162 215730 -133777 65987 298465 -292142
15178B77187e1038A29409J21484g6208B83122e6186C33765a12084A28320C0420
$$ 277187 -51038 129409 250893 -76208 283122 -56186 333765 -112084 128320 30420
15167F5880j1314a8865n1833K9924B19325i3432n5271B98390G9219i7867A65419
$$ 65880 54566 -18865 -70698 -40774 219325 -93432 -148703 298390 79219 -97867 165419
15155f466D29887J19335e827q5031B84965A18771h5257A92362c4993F1677k6967
$$ -6466 429887 549222 -5827 -90858 284965 118771 -85257 192362 -34993 61677 34710
15144C4710M05962j1360A13523c45078a14993D4184J06709L1247L5781J72020
$$ 34710 440672 429312 113523 -345078 -114993 44184 150893 182140 217921 389941
15134C89941A49990i7812o8809p0616c2438J4085A94979F4584J18058K8771p7537
$$ 389941 149990 -97812 -166621 -237237 -32438 -18353 194979 64584 182642 211413 133876
15123A33876a06047B3292K10712I504L84808l8947A37660m7211R3773J10389J01101
$$ 133876 -106047 23292 234004 9504 394312 355365 137660 90449 184222 294611 395712
15112C95712j19710e2174J322I6712M00863j60050j49250J62128A31959a56797
$$ 395712 276002 -52174 -50852 96712 497575 337525 188275 350403 131959 -156797
15101A39353O5257A4976J49094i6756A69958p9005a63443I9345J76051C6851h3854
$$ 139353 204610 14976 164070 -96756 169958 90953 -163443 99345 275396 36851 -83854
15089A32829o0062J11435K3740C8698a1105A45994L90031E0565J41322I771N5258
$$ 132829 72767 184202 207942 38698 -11105 145994 536025 50565 191887 9771 65029
15078F5029Q2428K2197d7329A8335J1254R3052K4052F0488J66137k1356b5764
$$ 65029 147457 169654 -47329 18335 29589 122641 146693 60488 226625 205269 -25764
15066A61682m5200b09818C54592d1673B08886p0906e6414A20357E9618a16528
$$ 161682 116482 -209818 354592 -41673 208886 137980 -56414 120357 59618 -116528
15055B10953k1836R7125i187B54722G8327N29804A47389F6662a71827A45562C7219
$$ 210953 189117 286242 -9187 254722 78327 608131 147389 66662 -171827 145562 37219
15043D31376F503M79855k27276J09120m8698E8357M4414J64706J15020A25249
$$ 431376 6503 486358 259082 368202 319504 58357 102771 267477 382497 125249
15032A51474J85121b3986C33255A20261b65598C09839j759j07312J25825q2234
$$ 151474 336595 -23986 333255 120261 -265598 309839 308080 200768 326593 244359
15022B44359j8779p5596J813Q9703b2152B19661D8346L52392H2265L24145q7895
$$ 244359 225580 149984 151797 241500 -22152 219661 48346 400738 82265 406410 318515
15011C18515p9971I3350k1221K38415p1870a04181A96186N3204o9326c9993D7536
$$ 318515 238544 93350 72129 310544 238674 -104181 196186 249390 180064 -39993 47536
14999D46948R1255p9418B12193K37060B7649J28775j8864C2668J44890L04674
$$ 446948 538203 458785 212193 449253 27649 156424 137560 32668 177558 482232
14989D82232P9236k33364l7969l7939n9002G284f9698F6082A0515K13605J22957
$$ 482232 561468 328104 290135 252196 193194 7284 -69698 66082 10515 224120 347077
14978C47077j46486K7333o7134g864A93169l8249B5310M44507j44870A27600O8034
$$ 347077 200591 227924 160790 -7864 193169 154920 25310 469817 324947 127600 195634
14967A95634q1772k2738K19805Q4791n6519j13499K11886L8005j17464r0368b19636
$$ 195634 113862 91124 310929 395720 339201 225702 437588 475593 358129 267761 -219636
14955D50976c8847B27074J07762A50291J48816G8325K44881K77380A9512K87881
$$ 450976 -38847 227074 334836 150291 299107 78325 323206 600586 19512 307393
14945C07393r2866l0454J10062K20105I5196J29932L89137j17114j10852j62145
$$ 307393 214527 184073 294135 514240 95196 225128 614265 497151 386299 224154
14935B24154D8456R9815K00406l8959Q6085N8358A30192Q6923H2521m575K09750
$$ 224154 48456 148271 348677 309718 395803 454161 130192 217115 82521 77946 287696
14924B87696N263f357G55686l58307j07793J0790j37931L7994k6970p754b2638
$$ 287696 292959 -6357 755686 397379 289586 300376 162445 200439 173469 165715 -22638
14912C127J10068K12350n6252a1247D33768A28084C29O4583N01796C2850J89659
$$ 3127 113195 325545 269293 -11247 433768 128084 329 64912 566708 32850 222509
14901B22509f1053A10775K4111J53778R3135j89818J60292K53325A00300N57232
$$ 222509 -61053 110775 134886 288664 381799 191981 352273 605598 100300 657532
14891F57532A1465L76412J99622k38089J2844q1297G1745M38952k42791c6273
$$ 657532 11465 387877 587499 349410 362254 280957 71745 510697 267906 -36273
14880B46427L64257k73497l647A62902J40873A50411K4942J53645N00121D10684
$$ 246427 610684 337187 333540 162902 303775 150411 175353 328998 829119 410684
14869F88789A18258L33665j86989M72466l38901j98870K30053J94745O4309l04130
$$ 688789 118258 451923 264934 737400 398499 199629 429682 624427 688736 384606
14859C84606J15979j47889J28038K78443k15146I4325N26216k62269A31313L25826
$$ 384606 500585 352696 480734 759177 544031 94325 620541 358272 131313 457139
14849D57139O2262k20780j32957J82588M6706p6365q2146J99501J18664K90474
$$ 457139 519401 298621 165664 348252 394958 318593 236447 435948 554612 845086
14839H45086j91012A24662J53481K6607J40257K7111o5084Q9747j78982J63340
$$ 845086 654074 124662 278143 304750 445007 472118 407034 496781 317799 481139
14829D81139N1703K8664k09144K79998k04976m6467K05179J4328j293P844k17437
$$ 481139 532842 561506 352362 632360 427384 380917 586096 600424 599131 606975 389538
14818C89538K7414K99745k70708J43300j85303N4157m8293J94905F5450N05771
$$ 389538 416952 716697 445989 589289 403986 458143 409850 604755 65450 571221
14808E71221O7287o9967k13167K32378j17646K04142B84158O7981m1966K57261
$$ 571221 638508 568541 355374 587752 470106 674248 284158 352139 310173 567434
14798E67434A78378M89264J7880A43145L59576j5024L58459k10288M2999l18392
$$ 567434 178378 667642 685522 143145 502721 487697 846156 635868 678867 360475
14788C60475J01056K35464k93711J32761J43047N116k27605O6997N4920J86824
$$ 360475 461531 696995 403284 536045 679092 684208 456603 523600 578520 765344
14778G65344m3525j95172l6087K25436r5938k57117L18874j03028j60882R9078
$$ 765344 721819 526647 490560 715996 620058 362941 681815 578787 417905 516983
14768E16983n6558K27658k85910K78109o3212B75782L84826j13454j60759K39343
$$ 516983 460425 688083 402173 680282 617070 275782 660608 547154 386395 625738
14758F25738j7386n7281K20481j89551p7193L9352J75675p2146j84114K89950
$$ 625738 608352 551071 771552 582001 504808 544160 719835 647689 463575 753525
14748G53525j91392K21845k72669J73496o8011J21941n884P3937k08245k48262
$$ 753525 562133 783978 511309 684805 616794 738735 732851 806788 598543 350281
14738C50281L15160m7189J83725k92696K94140j7839L788k65409L54616D09186
$$ 350281 665441 618252 801977 509281 803421 785582 789370 523961 878577 409186
14727G76105r7748L77863k72142L53299j93270p4059Q1622J00540m63545J15593
$$ 776105 678357 1056220 784078 1137377 944107 870048 951670 1052210 588665 704258
14717G04258L13228j77089r6855K63462B87379O72761j45010k63151N65331n36648
$$ 704258 1017486 840397 743542 1007004 287379 960140 815130 551979 1117310 580662
14707E80662N03082m34517K10550o9648o6629K87078o7045j25280m176L2723k63134
$$ 580662 1083744 649227 859777 790129 723500 1010578 943533 818253 814077 846800 583666
14696E83666K31110M5713J79150j01942j08504n1650K33451q0392N9695J593j10820
$$ 583666 814776 860489 1039639 937697 829193 777543 1010994 930602 990297 991890 881070
14685H81070K77200m12590J95644j74003M39185m88442L55281j36364K20258o3952
$$ 881070 1158270 745680 941324 767321 1206506 718064 1073345 936981 1157239 1093287
14675A093287k47889q856J72974k12818J58647M7399K50430k87302j29703K91859
$$ 1093287 845398 836542 1009516 796698 955345 1002744 1253174 965872 836169 1128028
14665A128028o0990j97853K85451k22277J90423J46841j83352k71000L55938o9511
$$ 1128028 1067038 869185 1154636 932359 1122782 1269623 1086271 815271 1171209 1101698
14655A101698N197k51167L78838J6021j426k83526L4834J00988O1429N6561L0446
$$ 1101698 1106895 855728 1234566 1250587 1249161 965635 1000469 1101457 1162886 1219447 1249893
14644A249893l62874K53791N070l35L87042k15418J30623q1604m30161M02282
$$ 1249893 887019 1140810 1145880 1145545 1532587 1317169 1447792 1366188 936027 1338309
14634A338309J02264l25060Q7525J51843J76615m72213K88740j62137K9321L47658
$$ 1338309 1440573 1115513 1203038 1354881 1531496 1059283 1348023 1185886 1215207 1562865
14624A562865L8280l23550n4265J64912J1135O8109q6508n4293J73045J6109j46527
$$ 1562865 1601145 1277595 1223330 1388242 1399377 1467486 1380978 1326685 1499730 1515839 1369312
14613A369312N055r982J31378n3606k29847K64244O2932P6733L9452k07464M9922
$$ 1369312 1374367 1364385 1495763 1442157 1212310 1476554 1539486 1616219 1655671 1448207 1498129
14602A498129Q0641m6101J23091j7130r2213K1717m6927K60987j45014o9605P9872
$$ 1498129 1578770 1532669 1655760 1638630 1546417 1568134 1521207 1782194 1637180 1567575 1647447
14591A647447L55863k32402M4629m446j08635j24854N42085n42439L50389k52223
$$ 1647447 2003310 1770908 1815537 1811091 1702456 1577602 2119687 1577248 1927637 1675414
14581A675414K23181j10659J192j74345L20583r2039o3344K68920j70831j22885
$$ 1675414 1898595 1787936 1789128 1614783 1935366 1843327 1779983 2048903 1878072 1755187
14571A755187K70146Q4384J95623n25378L49705m6888O7153J40240j58111J8219
$$ 1755187 2025333 2109717 2305340 1779962 2129667 2082779 2149932 2290172 2132061 2150280
14561B150280J86815j04743k61747M94813k21560m7922L76973J23436j70965p709
$$ 2150280 2337095 2232352 1970605 2465418 2243858 2195936 2572909 2696345 2525380 2517671
14551B517671j10181K32867k32664M07846J421N6200l6295K51257L76208l4994
$$ 2517671 2407490 2640357 2407693 2815539 2816960 2873160 2836865 3088122 3464330 3429336
14541C429336K84558N76343K50746N82466P86645Q96158J546365K631136M181246
$$ 3429336 3713894 4290237 4540983 5123449 5910094 6806252 8352617 10983753 15164999
14532A5164999O982144J0083665j979766j1045957p594638m350336k440509j065465
$$ 15164999 22147143 32230808 30251042 19205085 11610447 7260111 4819602 3754137
14524C754137l95160k20734j94298l11079j45475N0721K17315l63220J67329j87451
$$ 3754137 3358977 3138243 2943945 2632866 2487391 2538112 2755427 2392207 2559536 2372085
14514B372085K2370M35471r1745J45602j14738k32457J78915k22902o5021J83312
$$ 2372085 2394455 2829926 2738181 2883783 2769045 2536588 2715503 2492601 2427580 2610892
14504B610892q6195L18203o7022M783J43940k04369L83570k34136R1613l71498
$$ 2610892 2524697 2842900 2775878 2780661 2924601 2720232 3103802 2869666 2961279 2589781
14494B589781N50627k25k0473j86771K43053N00306o44361K40538L77293j99772
$$ 2589781 3140408 3140183 3119710 2932939 3175992 3676298 3031937 3272475 3649768 3449996
14484C449996J90168l6124l59069M00286j44578J60777j55916K04173j96982L72142
$$ 3449996 3640164 3604040 3244971 3645257 3500679 3661456 3505540 3709713 3512731 3884873
14474C884873j39638o5748L27174J5454j88090j1377M12770l98132J99732j11987
$$ 3884873 3745235 3679487 4006661 4022115 3834025 3822648 4235418 3837286 4037018 3925031
14464C925031K12006M21190m71036N15726j46363n19936L80570O6281J98526k41368
$$ 3925031 4137037 4558227 4087191 4602917 4456554 3936618 4317188 4383469 4581995 4340627
14454D340627K61035L78537k36034L67111m38273M60066m2367K47895l1763m9448
$$ 4340627 4601662 4980199 4744165 5111276 4673003 5133069 5090702 5338597 5306834 5257386
14444E257386K23820k30781J79209O872J43956o4101R254K64636J52302J18168
$$ 5257386 5481206 5250425 5429634 5436506 5580462 5516361 5525615 5790251 5942553 6060721
14434F060721k15206O3404K3718K51367j5484L41510l58905P14887l55128K57588
$$ 6060721 5845515 5908919 5932637 6184004 6168520 6510030 6151125 6866012 6510884 6768472
14424F768472m13981K20788K52113M84101k65906j96930O07864p5259K7862L7122
$$ 6768472 6354491 6575279 6827392 7311493 7045587 6848657 7456521 7381262 7409124 7446246
14414G446246j4988L3480j0386R45414k69572R3620P6423Q3493J06738N5955L26767
$$ 7446246 7431258 7464738 7454352 8399766 8130194 8223814 8300237 8383730 8490468 8546423 8873190
14403H873190o3799j2466K34489M83117k48603j56140M62319Q4691K32060J85639
$$ 8873190 8809391 8796925 9031414 9514531 9265928 9109788 9572107 9656798 9888858 10074497
14393A0074497M10559k26469R7252K19179l1637L21051M26117j5662j47529O07141
$$ 10074497 10485056 10258587 10355839 10575018 10543381 10864432 11290549 11274887 11127358 11734499
14383A1734499L55400J58064J50859K51229k71309O39588K26083R9352O07245
$$ 11734499 12089899 12247963 12398822 12650051 12378742 13018330 13244413 13343765 13951010
14374A3951010n95424M59425K99999J93159N80905J92195l6825M63423P11419
$$ 13951010 13355586 13815011 14115010 14308169 14889074 15081269 15044444 15507867 16219286
14365A6219286j801L77875j9260L66439J77742O72253J12385N23813M70462J53350
$$ 16219286 16217485 16595360 16576100 16942539 17120281 17792534 17904919 18428732 18899194 19052544
14355A9052544N67433M84063K60557O12385L19280K58500P27175K01482J74972
$$ 19052544 19619977 20104040 20364597 20976982 21296262 21554762 22281937 22483419 22658391
14346B2658391R67517M67502L70194Q46322O35491J11014P76039J077742L82244
$$ 22658391 23625908 24093410 24463604 25309926 25945417 26056431 26832470 27910212 28292456
14337B8292456M70833R18688P75936Q94172N29011R25739R57609P14449P02606
$$ 28292456 28763289 29681977 30457913 31352085 31881096 32806835 33764444 34478893 35181499
14328C5181499J065515P67315J199799J266694J045656R19767J425597J097462
$$ 35181499 36247014 37014329 38214128 39480822 40526478 41446245 42871842 43969304
14320D3969304J181286J837061J183743J268861J874131J365049J746145J573452
$$ 43969304 45150590 46987651 48171394 49440255 51314386 52679435 54425580 55999032
14312E5999032K146628J536871K506871K020280K049270K573747K322088K481668
$$ 55999032 58145660 59682531 62189402 64209682 66258952 68832699 71154787 73636455
14304G3636455K950895K614904K804680L322894L185989L468069L609547M093488
$$ 73636455 76587350 79202254 82006934 85329828 88515817 91983886 95593433 99686921
14296I9686921M328141M035455M582216N054152M769555N585717N753453O160873
$$ 99686921 104015062 108050517 112632733 117686885 122456440 128042157 133795610 139956483
14288A39956483O324680O934492P228314P503855Q541430Q480362Q875621R569237
$$ 139956483 146281163 153215655 160443969 167947824 176489254 184969616 193845237 203414474
14280B03414474J0289365J0328047J1179314J1749224J2128341J2942548J3349754
$$ 203414474 213703839 224031886 235211200 246960424 259088765 272031313 285381067
14273B85381067J3747327J4315011J4274042J4462100J3973398J3634993J3329825
$$ 285381067 299128394 313443405 327717447 342179547 356152945 369787938 383117763
14266C83117763J2556437J1605821J0822359J0107162R335863Q405277P129634
$$ 383117763 395674200 407280021 418102380 428209542 437545405 445950682 453080316
14259D53080316N227279K524647Q57151J616461P64212m009521l968707n662931
$$ 453080316 458307595 460832242 461689393 463305854 464070066 460060545 456091838 450428907
14251D50428907p175039r619163j1380888j2863577j3755093j3713306j4093588
$$ 450428907 443253868 433634705 422253817 409390240 395635147 381921841 367828253
14244C67828253j3948765j4304082j3863299j3347321j3434528j3058924j2565060
$$ 367828253 353879488 339575406 325712107 312364786 298930258 285871334 273306274
14237B73306274j2180191j2101908j1308950j0576159j1447108j0272598r871628
$$ 273306274 261126083 249024175 237715225 227139066 215691958 205419360 195547732
14230A95547732r547352r029979q434718p822652p642843o931050o649130n997466
$$ 195547732 186000380 176970401 168535683 160713031 153070188 146139138 139490008 133492542
14222A33492542o211017n184086n408853m679330m840461m065833m045994l721378
$$ 133492542 127281525 122097439 116688586 112009256 107168795 103102962 99056968 95335590
14214I5335590l889960l392141l515671l089071l060851k813654k570902k459887
$$ 95335590 91445630 88053489 84537818 81448747 78387896 75574242 73003340 70543453
14206G0543453k373264k191244k698986j714671k203463j938609j787102j271309
$$ 70543453 68170189 65978945 63279959 61565288 59361825 57423216 55636114 54364805
14198E4364805j941772j753527j252442j566274j336529j281991j024392j231118
$$ 54364805 52423033 50669506 49417064 47850790 46514261 45232270 44207878 42976760
14190D2976760j274663j195431j084929j172444q08402q40756r50616j428451
$$ 42976760 41702097 40506666 39421737 38249293 37440891 36600135 35649519 34221068
14182C4221068n42293o72395r90403o53221p45523j093101o70040q25725m61194
$$ 34221068 33678775 33006380 32015977 31362756 30617233 29524132 28854092 28028367 27567173
14173B7567173p08715l6660r95144m62775o90283l85471n30892m86748n90372
$$ 27567173 26858458 26821798 25826654 25363879 24673596 24288125 23757233 23270485 22680113
14164B2680113q14946O8435o46543m98826m17838k65567n21986k58812p33265
$$ 22680113 21865167 21933602 21287059 20788233 20370395 20104828 19582842 19324030 18590765
14155A8590765j75508j05476m57903k71770m00072m69255l58142l77893k40890
$$ 18590765 18415257 18309781 17851878 17580108 17180036 16710781 16352639 15974746 15733856
14146A5733856k3926l27635m04398j93294o1097n18749k77591j15711J38764j41059
$$ 15733856 15709930 15382295 14977897 14784603 14723506 14204757 13927166 13811455 13950219 13809160
14136A3809160m98012l46410j59594k28770K0780p80816L29828p36295j61752
$$ 13809160 13311148 12964738 12805144 12576374 12597154 11816338 12146166 11409871 11248119
14127A1248119K93191n760p41946j08877J82346k21060j66895j3145L4976n98293
$$ 11248119 11541310 11535550 10793604 10684727 10867073 10646013 10479118 10465973 10500949 9902656
14117I902656o3163k03879K23999m59167k56944j17283M0461q4973m17383J16926
$$ 9902656 9839493 9635614 9859613 9400446 9143502 9026219 9066680 8981707 8564324 8681250
14107H681250k69283O0823j32433l6776j08962j92388j56164J81607j67976q5699
$$ 8681250 8411967 8472790 8340357 8303581 8194619 8002231 7846067 8027674 7859698 7773999
14097G773999k48419m70820J17323p9920l7723j12820O257k3728J06077l74649
$$ 7773999 7525580 7054760 7172083 7092163 7054440 6941620 6947877 6924149 7030226 6655577
14087F655577l41780N75235n41917J03841N6824O5494k23046k27644N2994l13636
$$ 6655577 6313797 6889032 6347115 6450956 6507780 6573274 6350228 6122584 6175578 5861942
14077E861942K96691l05658j87312J03240R7760m94403K82264k14407K94490l36230
$$ 5861942 6158633 5852975 5665663 5768903 5866663 5372260 5654524 5440117 5734607 5398377
14067E398377j67853j45467l0657J06834N1831j58774o6737K12266k98508l9145
$$ 5398377 5230524 5085057 5054400 5161234 5213065 5054291 4987554 5199820 4901312 4862167
14057D862167k74851L30035j52108k76472j52750K90588o6263j23191n6185K92139
$$ 4862167 4587316 4917351 4765243 4488771 4336021 4626609 4560346 4437155 4380970 4673109
14047D673109l93660j84540J20157J70129j08272k40627K92961k91247j91897
$$ 4673109 4279449 4094909 4215066 4385195 4276923 4036296 4329257 4038010 3846113
14038C846113J7415k85891L06732L4352j74326L41500m95509L25008j73808l5080
$$ 3846113 3863528 3577637 3884369 3918721 3744395 4085895 3590386 3915394 3741586 3706506
14028C706506o4275j39833Q7036J25160l40172k23992J4655J25668j60140M01800
$$ 3706506 3642231 3502398 3589434 3714594 3374422 3150430 3165085 3290753 3130613 3532413
14018C532413n32873K37590k8413r7641q7941J11518J75653j98362k9959N231
$$ 3532413 2999540 3237130 3208717 3111076 3023135 3134653 3310306 3111944 3081985 3087216
14008C087216j14764Q0788l40633J03924k9875L42197n03133p2949N48523p31103
$$ 3087216 2972452 3053240 2712607 2816531 2786656 3128853 2625720 2552771 3101294 2370191
13998B370191J03828L01419Q544L0320M5553m64228j6253J08211q1390k1712P4668
$$ 2370191 2474019 2775438 2783982 2814302 2859855 2395627 2379374 2487585 2406195 2384483 2459151
13987B459151j3435K93616q9412p7425K97283o03811N19139R3983J69252K22558
$$ 2459151 2445716 2739332 2649920 2572495 2869778 2265967 2785106 2879089 3048341 3270899
13977C270899K33209Q07261J105556K117948L846721N513255J0500833L058680
$$ 3270899 3504108 4311369 5416925 7534873 11381594 16894849 27395682 30454362
13969C0454362q168062p874376m228520k535593j578725p18367o31172j69271
$$ 30454362 22286300 14411924 10183404 7647811 6069086 5350719 4719547 4550276
13961D550276l75023m82162k66949p4781l0751k65899j22519J82398l71774r9455
$$ 4550276 4175253 3693091 3426142 3351361 3320610 3054711 2932192 3114590 2742816 2643361
13951B643361N9055j28383m1894R3818j4020l09219j20538K18166P0147j55538
$$ 2643361 2702416 2574033 2532139 2625957 2611937 2302718 2182180 2400346 2470493 2314955
13941B314955k20388J66134j03061M426k28881P4182j98485O19009n87779M75660
$$ 2314955 2094567 2260701 2157640 2162066 1933185 2007367 1808882 2427891 1840112 2315772
13931B315772k21624l31918L76583j11068K7557O1012n33590N12466j43478J23606
$$ 2315772 2094148 1762230 2138813 2027745 2055302 2116314 1582724 2095190 1951712 2075318
13921B075318n64465M82247J09241m90504m7788J56371j84167K7399L15762k08732
$$ 2075318 1510853 1993100 2102341 1611837 1564049 1720420 1536253 1563652 1879414 1670682
13911A670682J80483j97371Q4359k9849o774q4324k4312J56326k0611k45692K28356
$$ 1670682 1851165 1653794 1738153 1708304 1701530 1617206 1592894 1749220 1728609 1482917 1711273
13900A711273j58367J96019j12909k72734K21295j84887J86165q2624J33945K55885
$$ 1711273 1552906 1748925 1636016 1363282 1584577 1399690 1585855 1503231 1637176 1893061
13890A893061k79015J18088j49530k73971q5804J13257L2466J19737k14939M69035
$$ 1893061 1614046 1732134 1582604 1308633 1222829 1336086 1368552 1488289 1273350 1742385
13880A742385l78492m3559M10728q7400k66126k72096j84661O96375k95593J39831
$$ 1742385 1363893 1320334 1731062 1643662 1377536 1105440 920779 1617154 1321561 1461392
13870A461392j47907J15340j11541m0460m2317K70303j03518j45885L1829k61836
$$ 1461392 1313485 1428825 1317284 1276824 1234507 1504810 1401292 1255407 1287236 1025400
13860A025400J36210L5792o5981l5060M43716m19540j40751L39431m64839N74940
$$ 1025400 1161610 1197402 1131421 1096361 1540077 1120537 979786 1319217 854378 1429318
13850A429318l69232R9975J76084M6552k79822N9763j42203K26851k25452M43683
$$ 1429318 1060086 1160061 1336145 1382697 1102875 1162638 1020435 1247286 1021834 1465517
13840A465517l08959p2779J66401r4835m1193K03649k42883l1153k6788L8650
$$ 1465517 1156558 1083779 1250180 1155345 1114152 1317801 1074918 1043765 1016977 1055627
13830A055627J89561Q8191m09822N03864o6400n57151J56616k50363N33085m68347
$$ 1055627 1245188 1333379 923557 1427421 1361021 803870 960486 710123 1243208 774861
13820G74861J92267J12774n0240j85756Q266M18097k39592J95164j30869J35995
$$ 774861 967128 1079902 1029662 843906 852172 1270269 1030677 1225841 1094972 1230967
13810A230967m67716k4594N71836m21690R9151J82933n5496j27124k69765K74771
$$ 1230967 763251 738657 1310493 888803 987954 1170887 1115391 988267 718502 993273
13800I93273j73097J66325j28345K86200k69580J15750L3341n4914J88348m46279
$$ 993273 820176 986501 858156 1144356 874776 990526 1023867 968953 1157301 711022
13790G11022J19918n7529j87159J23006K44086k17659J57187O0330l12918J57480
$$ 711022 830940 773411 586252 709258 953344 735685 892872 953202 640284 797764
13780G97764K59188l55580N4119R9317q6662P1668k7543j46061L09281k31886
$$ 797764 1056952 701372 755491 854808 768146 839814 812271 666210 975491 743605
13770G43605j92267M14992j66266A81621M85335J77007Q0575m53579o2258K38675
$$ 743605 551338 966330 800064 181621 666956 843963 924538 470959 408701 647376
13760F47376m2253M3120K7818K44879j40088K69931D24820L22905L4104j0412
$$ 647376 605123 648243 676061 920940 780852 1050783 424820 747725 781829 771417
13750G71417J60646l03671Q6354m7734j93799J18871p5054M23261p6474k93788
$$ 771417 932063 628392 714746 667012 473213 592084 517030 940291 863817 570029
13740E70029Q156K50225B91626K46694K35028J19355l01777j13672r2203O10287
$$ 570029 578185 828410 291626 538320 773348 892703 590926 477254 385051 995338
13730I95338l18364K11838k37q3000j19381O5539J87453j64482C85337K14991
$$ 995338 676974 888812 888575 805575 686194 751733 939186 774704 385337 600328
13720F00328J3144J2305L7537k5630m1198L55258k56830k3508J67450l60053M2423
$$ 600328 613472 625777 663314 637684 596486 951744 694914 671406 838856 478803 521226
13709E21226L03334j60160q3863K40038p1422l17394L97206j54702k49328L1009
$$ 521226 824560 664400 580537 820575 749153 431759 828965 674263 424935 455944
13699D55944P5814O0330Q9579J33837q6369p3357K39811k88537k6169O318K01141
$$ 455944 531758 592088 681667 815504 729135 655778 895589 607052 580883 587201 788342
13688G88342j80012m6689J6071n7752K66477k6525k74030N12539l70899P0468
$$ 788342 608330 561641 577712 519960 786437 759912 485882 998421 627522 697990
13678F97990N0230F8059M69506m3690J60320k5988Q9643l43903J10097A35514
$$ 697990 748220 68059 537565 493875 654195 628207 717850 373947 484044 135514
13667G20411k524l58282L01715o1867O2709k72725N0679R2907k9315J1398J15518
$$ 720411 717887 359605 661320 599453 662162 389437 440116 533023 503708 515106 630624
13656F30624k38907J49949o2037j3563p5320K63990k39562K12568q5027k51489
$$ 630624 391717 541666 479629 466066 390746 654736 415174 627742 542715 291226
13646B91226L87050j64347J33798k78282J83197j06573J9780l3632p1098J95110
$$ 291226 678276 513929 647727 369445 552642 446069 465849 432217 361119 556229
13636E56229p6590J12051J03245j37740k69001J12303J14453k9391k12945K71952
$$ 556229 479639 591690 694935 557195 288194 400497 514950 485559 272614 544566
13626E44566k69683J11111m6193m2214J14505J62857j66263j3625K82940k88570
$$ 544566 274883 385994 339801 297587 412092 574949 408686 395061 678001 389431
13616C89431J84485A05848N14577A6459L13664Q3482L3393j31341J65718J98082
$$ 389431 573916 105848 620425 16459 330123 413605 446998 315657 481375 679457
13606F79457j84873o8204J37111k48669M55071k68952k08572K56951p3434p8456
$$ 679457 494584 426380 563491 314822 769893 500941 292369 549320 475886 397430
13596C97430l2771K64825r496j63933j61490n8628J76521A67762M19508m0726
$$ 397430 364659 629484 619988 456055 294565 235937 412458 167762 587270 546544
13586E46544J29230k89080J28511k08857P5204j07873J07031j65220K01582J57219
$$ 546544 675774 386694 515205 306348 381552 273679 380710 215490 417072 574291
13576E74291M1102A86611M02838j95968K96164A58935L10356j95977K4105j5614
$$ 574291 615393 186611 589449 393481 689645 158935 469291 273314 297419 281805
13566B81805A23632J39640J77303J26171B64143L90622n7082k78620N5064J20335
$$ 281805 123632 263272 440575 566746 264143 654765 597683 319063 374127 494462
13556D94462J5023N6882k73889B2029M09904K66137k78661k6318A68201b4068
$$ 494462 509485 566367 292478 22029 431933 698070 419409 393091 168201 -24068
13545D13283F8826K62316F3397L12571H1320K16332r7444J44408G5837L03546
$$ 413283 68826 331142 63397 375968 81320 297652 200208 344616 75837 379383
13535C79383A02268J95603E3817J84437K43284j18922L00836C05690A21146L52270
$$ 379383 102268 297871 53817 238254 481538 362616 663452 305690 121146 473416
13525D73416l8396r9299m3720A01434M56118k68032Q4189j10465b28315E41604
$$ 473416 435020 335721 292001 101434 557552 289520 373709 263244 -228315 541604
13514B88589O3425L7211J53313j95856M5780j69126j245m0149L04466j66175A4214
$$ 288589 352014 389225 542538 346682 392462 223336 222091 181942 486408 320233 14214
13502D89093E8788N05349j87673J28034k04517o7714O6979r7072J82980o1071
$$ 489093 58788 564137 376464 504498 299981 232267 299246 202174 385154 324083
13492C24083A54045K32569O831j24162J06894j19977P3576k4102P8890j55395
$$ 324083 154045 386614 393445 269283 376177 256200 329776 305674 384564 229169
13482B29169M8414M3198K95744B39723J99534F6609K08051K56070r7874A88549
$$ 229169 277583 320781 616525 239723 439257 66609 274660 530730 432856 188549
13471B31799J7282K08111N3695A69896M1477l0128L56672B09874J18530C5935
$$ 231799 249081 457192 510887 169896 211373 181245 537917 209874 328404 35935
13460B36684J41139a4819A57328a3615o7249C87275J31635A67563d5133B65979
$$ 236684 377823 -14819 157328 -13615 -80864 387275 518910 167563 -45133 265979
13449E3552J07982j3512J59227Q4218A59880C5201L70382J48575k8256A44092
$$ 53552 161534 148022 307249 391467 159880 35201 405583 554158 525902 144092
13438B68936j24744K01919M0749q7879m9378M252C0660K86487F3474K18976a1224
$$ 268936 144192 346111 386860 298981 249603 253855 30660 317147 63474 282450 -11224
13426A88953R3459A24878L58125G5205K48091L5518J84741A32980P1422P8107
$$ 188953 282412 124878 483003 75205 323296 358814 543555 132980 204402 282509
13416B82509K13475o7771k5311a9281j8425I0129C7480c9007A41041J12274I2074
$$ 282509 495984 428213 402902 -19281 -37706 90129 37480 -39007 141041 253315 92074
13404D89695q6447j19599E0938K39317M67876E6667M56439A6858K1401n568L28093
$$ 489695 403248 283649 50938 290255 758131 56667 513106 16858 38259 32691 360784
13393C60784B0008M6085P5095J91506b14201C85974j84746b2133n8446E31827
$$ 360784 20008 66093 141188 332694 -214201 385974 201228 -22133 -80579 531827
13382E6664M31196G7441J35575a02142M9851E6631b9823A70145J95605j58990
$$ 56664 487860 77441 213016 -102142 -52291 56631 -29823 170145 365750 206760
13372B06760K06979a97805E64731B49166K28970B22458o319b73812a3508A60314
$$ 206760 413739 -197805 564731 249166 478136 222458 216139 -273812 -13508 160314
13361C18476k346Q1022m0663A02311K56239n5800n2654C5124N42053B6728J91242
$$ 318476 316130 397152 356489 102311 358550 302750 250096 35124 577177 26728 217970
13350B17970q0255a6741B2531K41422a4168C26813q7861N4448N1470F0731J56398
$$ 217970 137715 -16741 22531 263953 -14168 326813 238952 293400 344870 60731 217129
13339B17129K60128m1568j07371A54080J93090J13703A72654P9974j10805J92195
$$ 217129 477257 435689 328318 154080 347170 460873 172654 252628 141823 334018
13329C34018j5495J79933l1124A85170J50402r555A29349J44226Q285r1613M0729
$$ 334018 318523 498456 467332 185170 335572 326017 129349 273575 281860 190247 230976
13318B30976m6353K06531A53676L7243H7625J57478l9930M5950J6233n9483a6819
$$ 230976 184623 391154 153676 190919 87625 245103 205173 251123 267356 207873 -16819
13306g9973C16560a4156C51328O3601o9554p7344J27443g8275D63908p3088j51624
$$ -79973 316560 -14156 351328 414929 345375 268031 395474 -78275 463908 390820 239196
13295B39196j8407Q2997Q4472H7282J83568q3690G2557K88114j43366I4531R5009
$$ 239196 220789 303786 388258 87282 270850 187160 72557 360671 217305 94531 189540
13284A89540L12327k20558l3057G9139K48313L7777A59641J72654H8579L51710
$$ 189540 501867 281309 248252 79139 327452 365229 159641 332295 88579 440289
13274D40289A10800J99559a97755C35361F1183J73074L77306I3628N7595P0461
$$ 440289 110800 310359 -197755 335361 61183 234257 611563 93628 151223 221684
13264B21684P70n0635C740c6268A76359K6141F4514J68472a12382M8239b9838
$$ 221684 222454 171819 3740 -36268 176359 202500 64514 232986 -112382 -64143 -29838
13252B27423B9734O3392f8976D9174L70712A42444c218B18377f9216c1871F0610
$$ 227423 29734 93126 -68976 49174 419886 142444 -3218 218377 -69216 -31871 60610
13240A36150M7022N9732H0528K30062r0460b573C70311j04798i057A28052n3626
$$ 136150 183172 242904 80528 310590 220130 -2573 370311 265513 -9057 128052 74426
13229G4426K28351j14876J9252a3663B49611b0399A80333J29433A23162m2077
$$ 74426 302777 187901 207153 -13663 249611 -20399 180333 309766 123162 81085
13219H1085N334P6172b2558A27743N2044i556I3191N0966N2248J74415a35772
$$ 81085 86419 162591 -22558 127743 179787 -9556 93191 144157 196405 370820 -135772
13207A86974l3497Q4672J02049c0961C63912j56332J06249H9472K2K3047A5810
$$ 186974 153477 238149 340198 -30961 363912 207580 313829 89472 89494 112541 15810
13195a43973i674B36277O5478J8080B8562O116j1701L42287j38727K1409p499
$$ -143973 -9674 236277 301755 319835 28562 34678 22977 365264 226537 247946 240447
13184B40447n5255b30457E04078A7465J69387O4490A09126j8789i453A44468a22182
$$ 240447 185192 -230457 504078 17465 186852 251342 109126 90337 -9453 144468 -122182
13172e6486H1452J34475J82656p4897A31968F4921J0945A3831K8148c3142A93286
$$ -56486 81452 215927 398583 323686 131968 64921 75866 13831 41979 -33142 193286
13160B26291a89486d2102b0160l02068b6462j1417A12666B3199J28604n9786L28098
$$ 226291 -189486 -42102 -20160 -322228 -26462 -37879 112666 23199 151803 92017 420115
13149D20115A51737e7441A41099l2728j6124K9902a59727F9260J84231a31121
$$ 420115 151737 -57441 141099 108371 92247 122149 -159727 69260 253491 -131121
13138A00503f1935A88082L28103A31156e05425a25617G5545M29573A55986k4836
$$ 100503 -61935 188082 516185 131156 -505425 -125617 75545 505118 155986 131150
13128A31150a59813B88602h3238C1659i6688A45204l9119N67Q1593J23463e7876
$$ 131150 -159813 288602 -83238 31659 -96688 145204 106085 106652 188245 311708 -57876
13116A57067B9618A3220Q161a14306I8954a49703A88302a13194N5945B06229a0869
$$ 157067 29618 13220 21381 -114306 98954 -149703 188302 -113194 -57249 206229 -10869
13104A92195b38488B52384a38492O6870B22488F8977a32004I2527J8368l4088
$$ 192195 -238488 252384 -138492 -71622 222488 68977 -132004 92527 110895 76807
13094G6807J81737j09973i1402k56565C8079h3420A53438D1647P3893J65971j29841
$$ 76807 258544 148571 -91402 -347967 38079 -83420 153438 41647 115540 281511 151670
13083A51670R5395g1006A10484d3449H3441b2231I9881m6022K50641j23091a5911
$$ 151670 247065 -71006 110484 -43449 83441 -22231 99881 53859 304500 181409 -15911
13071B50165c9966A66683B4835J02109f1023j44897D68146I815N5056c2243A01357
$$ 250165 -39966 166683 24835 126944 -61023 -205920 468146 9815 64871 -32243 101357
13059g3129A171N0153J4178J91342a77292D1893D936J47987K18054A59859i3806
$$ -73129 1171 51324 65502 256844 -177292 41893 4936 152923 370977 159859 -93806
13047E7110R8587J74132A23428P623j7523K8616J90858j43660a24792Q94A04137
$$ 57110 155697 329829 123428 131051 113528 142144 333002 189342 -124792 -123898 104137
13035A51638K66688a9247j07341I8613J21348K4250K58046j85729F5542B0606
$$ 151638 418326 -19247 -126588 98613 219961 244211 502257 316528 65542 20606
13024A53252a99277A1551c9673H7377R8826L35737B2503a78790A92065a6253B63701
$$ 153252 -199277 11551 -39673 87377 186203 521940 22503 -178790 192065 -16253 263701
13012B18979j8557h8882b6090B39904r0266J32817B2938L16157A42351N10790
$$ 218979 200422 -88882 -26090 239904 149638 282455 22938 339095 142351 653141
13002F53141A25938L3421K27981D9907e326C52494A08159k264B6574d0638F1213
$$ 653141 125938 159359 387340 49907 -5326 352494 108159 105895 26574 -40638 61213
12990b8102C9625a4854A17399J38101c0561A39646b5134B80485b57370A25485
$$ -28102 39625 -14854 117399 255500 -30561 139646 -25134 280485 -257370 125485
12979B59190d69694B93308j1179c1530C1705K49834a94344H6105C6489e7618o0523
$$ 259190 -469694 293308 282129 -31530 31705 281539 -194344 86105 36489 -57618 -118141
12968a18141K2865j64800a4369A32545m0602b14049N1396d9072b0709j24016F560
$$ -118141 -95276 -260076 -14369 132545 91943 -214049 -162653 -49072 -20709 -144725 6560
12956a9326C81552A66147g1808l26034C47374a84975j6762i2792E546L54941b2477
$$ -19326 381552 166147 -71808 -397842 347374 -184975 -201737 -92792 5546 360487 -22477
12944a91438p0940g9134R491A60592i5489C23390a20944A22234L5562P2771A0151
$$ -191438 -262378 -79134 -69643 160592 -95489 323390 -120944 122234 157796 230567 10151
12932a87358d9335J1215D99015i2854C17898n0716e1935B4877g0321E35842H3411
$$ -187358 -49335 -38120 499015 -92854 317898 267182 -51935 24877 -70321 535842 83411
12920e2852C65629A34476Q4941C3020J77701H5227h5122C99426d1740J6521B61510
$$ -52852 365629 134476 219417 33020 210721 85227 -85122 399426 -41740 -25219 261510
12908a2274q5508C2409c6895D1569M10350A32995a41353f0542C4382a35845A63501
$$ -12274 -97782 32409 -36895 41569 451919 132995 -141353 -60542 34382 -135845 163501
12896A62784f0841F7787b28726I7348a54091B40036G4801d33l3109B9032J26741
$$ 162784 -60841 67787 -228726 97348 -154091 240036 74801 -433 -33542 29032 155773
12885A55773L4067L6792e3181G4318J28564K81542k26687j06431p4822K45328
$$ 155773 189840 226632 -53181 74318 202882 484424 257737 151306 76484 321812
12875C21812b8639j66096c2437I0230f1177L0182G2373e5958l7315B25950P6765
$$ 321812 -28639 -194735 -32437 90230 -61177 -30995 72373 -55958 -93273 225950 302715
12864C02715q8258q6750C1927j2272f3982D4298g9636o5346j05656I040J41482
$$ 302715 214457 127707 31927 19655 -63982 44298 -79636 -144982 -250638 9040 150522
12853A50522d6222g252j40776l5842M9834n7456g1809j56367F2442J61087c18354
$$ 150522 -46222 -7252 -148028 -183870 -134036 -191492 -71809 -228176 62442 223529 -318354
12841d9930f425B7441a4926A01785a44383B30337L25153G3409b06765b6035j26023
$$ -49930 -6425 27441 -14926 101785 -144383 230337 555490 73409 -206765 -26035 -152058
12830a52058o54n6281D2872J13286B3728a59148E61671A82881L928D0349b1205
$$ -152058 -152712 -208993 42872 156158 23728 -159148 561671 182881 186809 40349 -21205
12818d6713A91332p4580B9279b74222A75751J00467F7647J10713E4390h733D9987
$$ -46713 191332 116752 29279 -274222 175751 276218 67647 178360 54390 -8733 49987
12806B05225o524I9074h7213j46045i8179E658O965P1746a3227o6520A70346h5053
$$ 205225 198701 99074 -87213 -233258 -98179 5658 12623 84369 -13227 -79747 170346 -85053
12793a56265k1023b6425l13696a12729C35118b10941A16554l4373f0358j87508
$$ -156265 -177288 -26425 -340121 -112729 335118 -210941 116554 82181 -60358 -247866
12783b47866d5065p2541m1893q5433C03030a89729I1296g7458Q142A56883A9931
$$ -247866 -45065 -117606 -159499 -244932 303030 -189729 91296 -77458 -69316 156883 19931
12771b80408A76937B3446L2115J87093b43428B87159E4233h1531C35799f3204
$$ -280408 176937 23446 55561 242654 -243428 287159 54233 -81531 335799 -63204
12760a82214k02081A22104J0343D6208a73397b3879I4387g5271a148B41661n2528
$$ -182214 -384295 122104 132447 46208 -173397 -23879 94387 -75271 -1148 241661 189133
12749A89133A7681M12582b03457C58260A52628N3441J85401a35448j76143h5696
$$ 189133 17681 430263 -203457 358260 152628 206069 391470 -135448 -311591 -85696
12738B62797f8544L4086F4569J42158g8583K2760k36863B83280C4171b69221B20934
$$ 262797 -68544 -34458 64569 206727 -78583 -55823 -292686 283280 34171 -269221 220934
12726F964f8027C11851B9846M6955k6267a42652A46722D3022J44541N713c01858
$$ 6964 -68027 311851 29846 76801 50534 -142652 146722 43022 187563 193276 -301858
12714A62426J65445j46450j9882O3219a55617d7589K3024k06449e4977A50978
$$ 162426 327871 181421 161539 224758 -155617 -47589 -24565 -231014 -54977 150978
12703a28443A21003K97942a20856M6891J6942c987A02594L3184c02554A88691
$$ -128443 121003 418945 -120856 -73965 -57023 -3987 102594 135778 -302554 188691
12692I8627J90570q602A15562J77628J3534j43995L00074B14805f1063A789K86062
$$ 98627 289197 280595 115562 293190 306724 162729 462803 214805 -61063 1789 287851
12681B87851q6252A0401J32592j8232F2210M5405K09052C1165i776A63497H341
$$ 287851 201599 10401 142993 124761 62210 107615 316667 31165 -9776 163497 8341
12669b59832j0131a33889B35124a26179F6431J7798K6135J80695n9296F3338J58484
$$ -259832 -269963 -133889 235124 -126179 66431 84229 110364 291059 231763 63338 221822
12658B21822k3316b1293A09914G407O7244r420h7665c3735C0071R6126E2638b56957
$$ 221822 198506 -21293 109914 7407 74651 65231 -87665 -33735 30071 126197 52638 -256957
12645b24765N4302I3410J84570E0572J43379a08729B33368q2688G3015a78964
$$ -224765 -170463 93410 277980 50572 193951 -108729 233368 150680 73015 -178964
12634i8054C6569M9763k7990J39442b56559C79639F0616K83807H1628g7339k5789
$$ -98054 36569 86332 58342 197784 -256559 379639 60616 344423 81628 -77339 -103128
12623a03128h128j18058f0282q6029c843C61807j6107F9294J02065R8095K02474
$$ -103128 -8128 -126186 -60282 -146311 -3843 361807 345700 69294 171359 269454 471928
12612D71928A28116J16706J56289j05949j04851J04293f8293G0243K3151l5945
$$ 471928 128116 244822 401111 295162 190311 294604 -68293 70243 93394 57449
12602E7449K19373h004B56528a29954N7489o3126I5178b02217A604b58690a1507
$$ 57449 276822 -8004 256528 -129954 -72465 -135591 95178 -202217 1604 -258690 -11507
12590B59924E2866a86806F9941L6042J74641f1039A89782J16724j44005A1559
$$ 259924 52866 -186806 69941 105983 280624 -61039 189782 306506 162501 11559
12579B40190j20076a78236D9813J95346b11300A52205c5552m33343A96363O2000
$$ 240190 120114 -178236 49813 245159 -211300 152205 -35552 -468895 196363 258363
12569B58363j87H3661d7400A53321a0119A94017K34593a44473j3957B5970Q8430
$$ 258363 258176 83661 -47400 153321 -10119 194017 428610 -144473 -158430 25970 114400
12558A14400h2194J2625J084j37975j2598C5816J0870a56177o0021a4974k38083
$$ 114400 -82194 -69569 -68485 -206460 -219058 35816 46686 -156177 -216198 -14974 -253057
12547b53057p997O7091f6837A41396a02223j20005B42522L1061k8252H8325a15762
$$ -253057 -261054 -193963 -66837 141396 -102223 -222228 242522 273583 245331 88325 -115762
12535A2105M09036c1226j0137C21504E0774c6140a1479E001a08996k36127B6401
$$ 12105 421141 -31226 -41363 321504 50774 -36140 -11479 5001 -108996 -345123 26401
12523a35659e8622j51063C9199K24102a37177G9724a02761r0131g5863B17227
$$ -135659 -58622 -209685 39199 263301 -137177 79724 -102761 -192892 -75863 217227
12512B19255D8264K54458C7711a02739K3187p5919j10519I1151a82008A06503
$$ 219255 48264 302722 37711 -102739 -79552 -155471 -265990 91151 -182008 106503
12501E2980K6338a5414B9744O5702B7976J31982n9403a84269A80935A4379b71526
$$ 52980 79318 -15414 29744 95446 27976 159958 100555 -184269 180935 14379 -271526
12489e8449k45424A23581K6877a24544n3017g2274A33905b72077C46219A38407
$$ -58449 -303873 123581 150458 -124544 -177561 -72274 133905 -272077 346219 138407
12478e373H1161k0585P0443e3815B09580B5957f9908B67150b87010B95019g022
$$ -5373 81161 60576 131019 -53815 209580 25957 -69908 267150 -287010 295019 -7022
12466F3582Q5410a39932j21639A9161J0387b32980A6603M4430A234J64510G2671
$$ 63582 148992 -139932 -261571 19161 29548 -232980 16603 61033 1234 165744 72671
12454a91120A08568c28548a51823B16157a80107l2029G6356c43059I8502j9459
$$ -191120 108568 -328548 -151823 216157 -180107 -212136 76356 -343059 98502 79043
12444G9043K65108C6817d4845A16824E1504K04850b2352C2966a81890A55736J10386
$$ 79043 344151 36817 -44845 116824 51504 256354 -22352 32966 -181890 155736 266122
12433B66122a31521A60433e2351o7296a4948j09083l0316A11267f7337B33245
$$ 266122 -131521 160433 -52351 -119647 -14948 -124031 -154347 111267 -67337 233245
12422h7273A38797a0888r0912A19697b38869A54338J92016b74129C32499n5771
$$ -87273 138797 -10888 -101800 119697 -238869 154338 346354 -274129 332499 276728
12412B76728b5931l44472C3978K29149g2679a5719A19126R597k997P1178o7621
$$ 276728 -25931 -370403 33978 263127 -72679 -15719 119126 128723 125726 196904 129283
12401A29283c01763i0398m3532A53520K8458F5570J32850B4659i423j39734A37886
$$ 129283 -301763 -90398 -133930 153520 181978 65570 198420 24659 -9423 -149157 137886
12389b07314j69091A60709J33276e5986j04920C0081J46506c85343a25733a0922
$$ -207314 -376405 160709 293985 -55986 -160906 30081 176587 -385343 -125733 -10922
12378B81928o0935a74413B95263f4726l0091C0924a44969A2410L8641h3098B14438
$$ 281928 220993 -174413 295263 -64726 -94817 30924 -144969 12410 51051 -83098 214438
12366A59581b02242d0899G0071J56454J06986a15723J2956D30419j28956b88177
$$ 159581 -202242 -40899 70071 226525 333511 -115723 -102767 430419 301463 -288177
12355i0378K0113A81413a82246j1590C59581a47777e8123j30565q3161F7533K01257
$$ -90378 -70265 181413 -182246 -193836 359581 -147777 -58123 -188688 -271849 67533 268790
12344B68790e3712j04J4995A32184f2622A47345n2552j714a2353D9530a32695
$$ 268790 -53712 -53816 -38821 132184 -62622 147345 94793 93079 -12353 49530 -132695
12332a81786E4877J74912a96902N5451J961K2971m4840p2948h3101G7501K39591
$$ -181786 54877 229789 -196902 -141451 -139490 -116519 -161359 -234307 -83101 77501 317092
12321C17092a08845A67729a62374m5177N3552B58660g8862C60684a33020I6255
$$ 317092 -108845 167729 -162374 -207551 -153999 258660 -78862 360684 -133020 96255
12310b58654A04869E0602K3023K49677a05171k5184j75946D6366a71498B80875
$$ -258654 104869 50602 73625 323302 -105171 -130355 -306301 46366 -171498 280875
12299b2022k03783E3868b0630F2179e0293j49838P1673I6949K56784b30149B84243
$$ -22022 -225805 53868 -20630 62179 -50293 -200131 -128458 96949 353733 -230149 284243
12287a14201F0945K39379p1530I5963N780a71458G0860a84908E6308a61278j15684
$$ -114201 60945 300324 228794 95963 101743 -171458 70860 -184908 56308 -161278 -276962
12276b76962j6486a32945e2844r0219j8674B46069m3179a31687H1439J4576a64273
$$ -276962 -293448 -132945 -52844 -143063 -161737 246069 202890 -131687 81439 96015 -164273
12264d4173l4120G7907Q2598K8486C22K59831c93762G8143O4539R6640j07570
$$ -44173 -78293 77907 160505 188991 322 260153 -393762 78143 142682 239322 131752
12253A31752L9726g2143A07635J97601r78A07938O5807D8861B0608b3940a1689
$$ 131752 171478 -72143 107635 305236 304258 107938 173745 48861 20608 -23940 -11689
12241A96110G1461M4583a31822E2814J25702K20848j74470B3046c2366B315a26211
$$ 196110 71461 116044 -131822 52814 178516 399364 224894 23046 -32366 2315 -126211
12229a80979g5516A59015j0039o892A7148m337a02754o7355A74216a11193B95720
$$ -180979 -75516 159015 148976 142084 17148 12811 -102754 -170109 174216 -111193 295720
12217a31019I3210K62011A21571n0610J35369o0450e678A10181J33290j13276
$$ -131019 93210 355221 121571 70961 206330 145880 -5678 110181 243471 130195
12207A30195Q7883k8427J27218k0236I7677K81301e2560B90135j28889P3631O653
$$ 130195 218078 189651 316869 296633 97677 378978 -52560 290135 161246 234877 241530
12196B41530A13763b49824B50964j317m3604M6139j13343P8992i1928A99289J32264
$$ 241530 113763 -249824 250964 249647 206043 252182 138839 217831 -91928 199289 331553
12185C31553G4664K63945H6855K51488l5554j28453J02106C318K12540J81469
$$ 331553 74664 338609 86855 338343 302789 174336 276442 3318 215858 397327
12175C97327A37657n4925K9783P823R7480i8010G4972a4193E0820M13389C3241
$$ 397327 137657 82732 112515 120338 217818 -98010 74972 -14193 50820 464209 33241
12163D16411G5929a2183o9539I4019m3627L58484d7363H5811J10381G5898Q6161
$$ 416411 75929 -12183 -81722 94019 50392 408876 -47363 85811 196192 75898 162059
12152A62059J26758j35187b50656B65579a79629Q4433k8187A85218I0352g048
$$ 162059 288817 153630 -250656 265579 -179629 -95196 -123383 185218 90352 -7048
12141A46443c699j43199A06893E2099g4136B72268C6674b74960A92441r102M6819
$$ 146443 -3699 -146898 106893 52099 -74136 272268 36674 -274960 192441 183339 230158
12130B30158a30210B96807B0534H316K96207C9742M01775g4159b9166m8321A41752
$$ 230158 -130210 296807 20534 8316 304523 39742 441517 -74159 -29166 -77487 141752
12118a30361k87969b9254j06429b4018a0226j4478B4632a5967A04806a82421A60903
$$ -130361 -418330 -29254 -135683 -24018 -10226 -24704 24632 -15967 104806 -182421 160903
12106b70424C97723D1996f5989A93651a40498I8046a42091N4079c9844A51445
$$ -270424 397723 41996 -65989 193651 -140498 98046 -142091 -88012 -39844 151445
12095C34153b7075A24353a63233B96553A25952H036L8857K12947b1360m58822
$$ 334153 -27075 124353 -163233 296553 125952 8036 46893 259840 -21360 -480182
12085d80182g8420A38962o5125i583A7053d2398F5256F229J37613d09024J22467
$$ -480182 -78420 138962 73837 -9583 17053 -42398 65256 6229 143842 -409024 -286557
12074b86557b1981l6426B90031C0598g6392k22841P5750j26600a73941n715F2510
$$ -286557 -21981 -58407 290031 30598 -76392 -299233 -223483 -350083 -173941 -179656 62510
12062B2424b38230A4049J50260Q5314a7245F08833k36878P56035K95599o01153
$$ 22424 -238230 14049 164309 249623 -17245 608833 371955 1127990 1423589 822436
12052H22436B99054j44613a62382O970o2719A98341F1529J2965K36034H7038M5732
$$ 822436 299054 154441 -162382 -155412 -218131 198341 61529 74494 310528 87038 132770
12041A32770A1622K32680H2846a09636k9742j60705a7012A39274a9711G640J43103
$$ 132770 11622 244302 82846 -109636 -139378 -300083 -17012 139274 -19711 7640 150743
12030A50743m5891A3554a02588A74611G1201a25297B6596J67280a12706C40261
$$ 150743 104852 13554 -102588 174611 71201 -125297 26596 193876 -112706 340261
12019g0656r0285p4595G8643L4875K5917d1332J2022i525D2430a95405A59963
$$ -70656 -160941 -235536 78643 113518 139435 -41332 -29310 -9525 42430 -195405 159963
12007b19177c554D4165b95921B46350c1727r7334A11272m6973J11323a78480C1968
$$ -219177 -3554 44165 -295921 246350 -31727 -129061 111272 64299 175622 -178480 31968
11995a796l5001j92135H5213D1603g8990j64617i8467k03750C346a89051H3682
$$ -1796 -36797 -228932 85213 41603 -78990 -243607 -98467 -302217 3346 -189051 83682
11983D3966b14419B34462c5761B1933g124o4756A54628d9473A05822c6770o4971
$$ 43966 -214419 234462 -35761 21933 -7124 -71880 154628 -49473 105822 -36770 -101741
11972a01741A46862L1853i391B69457a16833N7835j47963k49141C39559a1425
$$ -101741 146862 178715 -9391 269457 -116833 -58998 -206961 -456102 339559 -11425
11961B1597d53813A01783e3118A39072l3701p924b293l9589A04211a86891N1298
$$ 21597 -453813 101783 -53118 139072 105371 97447 -2293 -41882 104211 -186891 -135593
11950a35593k7060A38565C812h4328b3522o1230J2699B01038D6848h0632b6062
$$ -135593 -162653 138565 3812 -84328 -23522 -84752 -72053 201038 46848 -80632 -26062
11938B83746E5238a52834A34963d34549d0434D8709K1905O0114o1118b17733J01441
$$ 283746 55238 -152834 134963 -434549 -40434 48709 70614 130728 69610 -217733 -116292
11927a16292M4575L1501D38298e3179b272j2586j88068a8036j26981e5340A03334
$$ -116292 -71717 -40216 438298 -53179 -2272 -14858 -202926 -18036 -145017 -55340 103334
11915A271a58877N2303A62663c7094C86679A38072O70d8120A72286K08316d49467
$$ 1271 -158877 -106574 162663 -37094 386679 138072 138742 -48120 172286 380602 -449467
11903A1518O4456c11215D30241c00830B70837d00405J42529f2171n2400A39457
$$ 11518 75974 -311215 430241 -300830 270837 -400405 -257876 -62171 -114571 139457
11892A43688c58009M2846O8365A55043c82968A82662o9691d9213j31680b6813
$$ 143688 -358009 -315163 -246798 155043 -382968 182662 112971 -49213 -180893 -26813
11881b77981F5491M6417k3462a3423A46311j9823a21525A25869c86543C4125P8273
$$ -277981 65491 111908 88446 -13423 146311 126488 -121525 125869 -386543 34125 112398
11870A12398d1491j29934H2746O0785J76964c88303a28271B0792e1380F433a03504
$$ 112398 -41491 -171425 82746 143531 320495 -388303 -128271 20792 -51380 6433 -103504
11858A82320N9283a15675k36407d8556j8941k18626d8813a4305n9741A33033d9780
$$ 182320 241603 -115675 -352082 -48556 -67497 -286123 -48813 -14305 -74046 133033 -49780
11846g999l6282C02408i7427B4760M2787c2772q1030A07247a2919k92435J20490
$$ -7999 -44281 302408 -97427 24760 67547 -32772 -113802 107247 -12919 -305354 -184864
11835a84864m8837A41938c23377a60106d8069j72231O853A03259i0946A79338
$$ -184864 -233701 141938 -323377 -160106 -48069 -220300 -213447 103259 -90946 179338
11824B58412l0101k0512c90486A62310k7833g8797G8349C1290N249a34512B9164
$$ 258412 228311 207799 -390486 162310 134477 -78797 78349 31290 36539 -134512 29164
11812e5013B42663G5507a88957r8300j46677a70597E3993i3424j16062O048p9746
$$ -55013 242663 75507 -188957 -287257 -433934 -170597 53993 -93424 -209486 -203438 -283184
11801b83184G4512l573K11314j17704a8073j38846A5841J15569m4035K20938i3397
$$ -283184 74512 70939 282253 164549 -18073 -156919 15841 131410 87375 308313 -93397
11789A4683L294L66514a13316J2257A55679o1965a27242b4985B2236a75475k14710
$$ 14683 17977 384491 -113316 -101059 155679 93714 -127242 -24985 22236 -175475 -390185
11778c90185g0400A92156f6866k73025a39121I6858M1721b69978i9011I5792J5882
$$ -390185 -70400 192156 -66866 -339891 -139121 96858 138579 -269978 -99011 95792 111674
11767A11674C1464J37290c10805E8407J56937b3016E1064a78323j10347G9798
$$ 111674 31464 168754 -310805 58407 215344 -23016 51064 -178323 -288670 79798
11756a99026B07570b6545I5285j4183l4834L35214A22531d3759O650A26284a44054
$$ -199026 207570 -26545 95285 81102 46268 381482 122531 -43759 -37109 126284 -144054
11744A03615a41508e6531p2615A72330g3340A84877G6727h7052p7418A2587b60143
$$ 103615 -141508 -56531 -129146 172330 -73340 184877 76727 -87052 -164470 12587 -260143
11732a43032C08127a61427N8331j62125A89511L6752C3831a54911A25914D0868
$$ -143032 308127 -161427 -103096 -265221 189511 226263 33831 -154911 125914 40868
11721f57926g3950I8078a58996l4828j47421C37420j62351E7035M14004B34589
$$ -657926 -73950 98078 -158996 -193824 -341245 337420 175069 57035 471039 234589
11710C690P2774j4492b74166B33280O7857C7653K6728e4709B78630b55981D35504
$$ 3690 76464 61972 -274166 233280 301137 37653 64381 -54709 278630 -255981 435504
11698a750A93749f9508B40571a54920A2931L4096g9593C65220j72561j097i9505
$$ -1750 193749 -69508 240571 -154920 12931 47027 -79593 365220 192659 191562 -99505
11686d9021k100A16522C7051b50461D0991d1114J85A4567O6719J79819i4857M5050
$$ -49021 -51121 116522 37051 -250461 40991 -41114 -40929 14567 81286 261105 -94857 -49807
11674d9807A31265c34539C6365L19324a05929j10179C1558L5680K24825A12299
$$ -49807 131265 -334539 36365 355689 -105929 -216108 31558 67238 292063 112299
11663A39549f3329B4735J4545Q5060b19082A86269a05616j00088g0662A43524
$$ 139549 -63329 24735 39280 124340 -219082 186269 -105616 -205704 -70662 143524
11652A19895h9923B6122Q7218n0804B1759c6799B49311k4254n996C1688n522R920
$$ 119895 -89923 26122 113340 62536 21759 -36799 249311 225057 219061 31688 26166 36086
11640C6086J75009a61386b920F3110a89267D8512J07121d6007j76601A80607C0337
$$ 36086 211095 -161386 -2920 63110 -189267 48512 155633 -46007 -222608 180607 30337
11628A69271E847K32865a2253n1225C51847a39714D3249b34882D3711a59025A34418
$$ 169271 5847 238712 -12253 -63478 351847 -139714 43249 -234882 43711 -159025 134418
11616f6804H9396L02600G9680J48608J06286A2446b53266b3731j82041B53152
$$ -66804 89396 391996 79680 228288 334574 12446 -253266 -23731 -205772 253152
11605a31488j02093P4308A07632a24650N7673B02922a29026I4453R0320i7232
$$ -131488 -233581 -159273 107632 -124650 -66977 202922 -129026 94453 184773 -97232
11594f7687F3757a81185A4729a50052A4501f2929A17511c3496C90560a30364B3953
$$ -67687 63757 -181185 14729 -150052 14501 -62929 117511 -33496 390560 -130364 23953
11582a32698H0467f0192a7925O137B15043E8905f9064B30662a8721p9254G3396
$$ -132698 80467 -60192 -17925 -11788 215043 58905 -69064 230662 -18721 -97975 73396
11570C9936c5782A75052c63960i8949q0229j53950B37956f8661C49945C2456a40084
$$ 39936 -35782 175052 -363960 -98949 -179178 -333128 237956 -68661 349945 32456 -140084
11558c00549c0010k24125G5645h0734E8572k7863L1571P1007l2475i1386A06319
$$ -300549 -30010 -254135 75645 -80734 58572 30709 62280 133287 100812 -91386 106319
11546B05025a28619A04749j9984a93409B03957j2864I3774K51658a71560D664
$$ 205025 -128619 104749 84765 -193409 203957 191093 93774 345432 -171560 4664
11535a77026A34110l5457K7094J83834b1422o015A9780f612A46545K6392K4744
$$ -177026 134110 98653 125747 309581 -21422 -27437 19780 -6612 146545 172937 197681
11524A97681a81943A37359R2923d6147m56548a02854b310I7011b72395A78582
$$ 197681 -181943 137359 230282 -46147 -502695 -102854 -2310 97011 -272395 178582
11513A66442F138K0081b07007R8933A9370P1114g8324A50560b43995A59222a3304
$$ 166442 6138 26219 -207007 -108074 19370 90484 -78324 150560 -243995 159222 -13304
11501H6272b87179B0572K20831r068F7856j2535O7660J72897B6449J56585E6993
$$ 86272 -287179 20572 241403 232335 67856 55321 122981 295878 26449 183034 56993
11489I333J57521B3673J63746a1321B66167c5410A67714g2947J7776A90315H5273
$$ 9333 166854 23673 187419 -11321 266167 -35410 167714 -72947 -55171 190315 85273
11477B23871m5876j3729M8143H7064L4179L46796i2783j6486B28609G9108K95845
$$ 223871 177995 164266 212409 87064 121243 468039 -92783 -109269 228609 79108 374953
11466C74953J56675A82065j0922a91642h9569A7545J87413D8116J53090n4954
$$ 374953 531628 182065 171143 -191642 -89569 17545 204958 48116 201206 146252
11456A46252a72285C45120L4853j49560P9423a03105D09237a9108B26848m8268
$$ 146252 -172285 345120 379973 230413 309836 -103105 409237 -19108 226848 178580
11446A78580a51395A71941M1113F1392J72746b45743B42201a72700A35802n1612
$$ 178580 -151395 171941 213054 61392 234138 -245743 242201 -172700 135802 84190
11436H4190J59235a30841b3949B43304L05293C6317d5295J5484B48481A18779
$$ 84190 243425 -130841 -23949 243304 548597 36317 -45295 -29811 248481 118779
11425a0485B01503F4335b0997A29866j1829k4628b945A12863k3972a963j23139
$$ -10485 201503 64335 -20997 129866 118037 93409 -2945 112863 88891 -1963 -125102
11414a25102B03471a80610a6172C78096F1819L7021b8261A32535f2689C9061L6390
$$ -125102 203471 -180610 -16172 378096 61819 98840 -28261 132535 -62689 39061 75451
11403G5451M2445a34428I8241D2309a80555a3143o7700B4889K63311a11978A32054
$$ 75451 117896 -134428 98241 42309 -180555 -13143 -80843 24889 288200 -111978 132054
11391b01581k75129b8636B14981m0292a90929G6075P8777Q5433h9642F8601e0318
$$ -201581 -476710 -28636 214981 174689 -190929 76075 154852 240285 -89642 68601 -50318
11379F4a79228I3146a53604B697d35682a20034D30166d7585k27348F3680K3697
$$ 64 -179228 93146 -153604 2697 -435682 -120034 430166 -47585 -274933 63680 87377
11368H7377b95334B83415a33226A79190N303a36888E0645b05179e5765A2304j408
$$ 87377 -295334 283415 -133226 179190 184493 -136888 50645 -205179 -55765 12304 10896
11357A0896a68710A07080M3964b4031q3320d272C48010K0554C1023a70730F026
$$ 10896 -168710 107080 151044 -24031 -107351 -4272 348010 368564 31023 -170730 6026
11345d7716A39889o3294a33649F9656c22370M0406f5015j5350F1371f1732B6873
$$ -47716 139889 76595 -133649 69656 -322370 -281964 -65015 -80365 61371 -61732 26873
11333b097A4649b8841C41936a72472I8199N5215N3013A1298b41189D0341i5524
$$ -2097 14649 -28841 341936 -172472 98199 153414 206427 11298 -241189 40341 -95524
11321a02463A58880k135D5342f1326B35025p9672c76442a46106A12039i6275d8050
$$ -102463 158880 156745 45342 -61326 235025 155353 -376442 -146106 112039 -96275 -48050
11309A5511c2112J2258n8419H4185b81935A02222h5246c6660A74804g9422F8482
$$ 15511 -32112 -19854 -78273 84185 -281935 102222 -85246 -36660 174804 -79422 68482
11297A59M6895r418b77789H7380a61078A51169c5402o9089B86568b7469j9283
$$ 159 47054 37636 -277789 87380 -161078 151169 -35402 -104491 286568 -27469 -46752
11286d6752j22492n755h5163p7534A6380b681k14910k38375G8379j3469P7631
$$ -46752 -169244 -174999 -85163 -162697 16380 -2681 -217591 -455966 78379 64910 142541
11275A42541b68565h4058K4838l8931I9580a81319c0404A00021g1268D4190g5029
$$ 142541 -268565 -84058 -59220 -98151 99580 -181319 -30404 100021 -71268 44190 -75029
11263b22685a05530b1133k55099f4084m5267d8813A63203a09050B71488b02204
$$ -222685 -105530 -21133 -276232 -64084 -109351 -48813 163203 -109050 271488 -202204
11252e9246H8838L274f1583j33358F5652a31510l26136a27261m160I7569m7164
$$ -59246 88838 92112 -61583 -194941 65652 -131510 -457646 -127261 -131421 97569 50405
11241E0405j1412L9466C2539g7334C2567K94614e8148j63495e8209K4938A12683
$$ 50405 38993 78459 32539 -77334 32567 327181 -58148 -221643 -58209 -33271 112683
11229h1822f281A51246o7139b13749J06670n2553a6873k1180B62215c80412I2506
$$ -81822 -6281 151246 84107 -213749 -107079 -159632 -16873 -38053 262215 -380412 92506
11217a01165E1778f0787k16930N831C0820Q4384e7918B81301c4453r3618B28305
$$ -101165 51778 -60787 -277717 -271886 30820 115204 -57918 281301 -34453 -128071 228305
11205b98479F3546b12913d5540A35562J79410a24389A49176h2219G5819c02195
$$ -298479 63546 -212913 -45540 135562 314972 -124389 149176 -82219 75819 -302195
11194a28235e6788A62914a25005J1639B0005a21908c7602m53857B89350F7396
$$ -128235 -56788 162914 -125005 -113366 20005 -121908 -37602 -491459 289350 67396
11183b10581R5112d1150j58766I9112d2079K0997k97839P3670I3695l9865f0417
$$ -210581 -115469 -41150 -199916 99112 -42079 -21082 -318921 -245251 93695 53830 -60417
11171B88163j41918K4316G7916b22524j47159J51562J02967j660j01909M0715
$$ 288163 146245 170561 77916 -222524 -369683 -218121 -115154 -116814 -218723 -178008
11161a78008A74407i5680b6787n3853B48880f4329j51734F3330i3864j41442K2114
$$ -178008 174407 -95680 -26787 -80640 248880 -64329 -216063 63330 -93864 -235306 -213192
11150b13192H7147c02963M8296Q3898F2377M354Q1567B0274a60505c5725F7001
$$ -213192 87147 -302963 -254667 -170769 62377 66731 148298 20274 -160505 -35725 67001
11138B18610a31178B71133g6677B23408q8292a30772K4214J1656d1650A53353
$$ 218610 -131178 271133 -76677 223408 135116 -130772 -106558 -94902 -41650 153353
11127a39088A13270b16496i0558F0390Q8322n3612l4981a24100A13131a21739
$$ -139088 113270 -216496 -90558 60390 148712 95100 60119 -124100 113131 -121739
11116b77328h7545j50220k4129A66464J46030a70116H8725j4798K28760k9306
$$ -277328 -87545 -237765 -261894 166464 312494 -170116 88725 73927 302687 273381
11106B73381J04669o0841J80124d5739B99661n4144F2016L61689B2374B191J23657
$$ 273381 378050 317209 497333 -45739 299661 245517 62016 423705 22374 2191 125848
11095A25848a3187J38A45487K05988a68046j02737A49922O0504Q8864d4007A16773
$$ 125848 -13187 -13049 145487 351475 -168046 -270783 149922 210426 299290 -44007 116773
11083C865J74797K027K51958A23034K6945K20528J52275G6030a59869e068n1514
$$ 3865 178662 180689 432647 123034 149979 370507 522782 76030 -159869 -5068 -56582
11072e6582A91967b41191A24140K96844j99444I1153j2958C5408L61306j43908
$$ -56582 191967 -241191 124140 420984 221540 91153 78195 35408 396714 252806
11062B52806K44377k31900o9519q7309K13663q0142O8759p0401B2656K62771o8317
$$ 252806 497183 265283 195764 108455 322118 241976 310735 240334 22656 285427 217110
11051B17110A5261K22032L32998k40635J40872R2564j60482R5162R6417j51053
$$ 217110 15261 237293 570291 329656 470528 563092 402610 497772 594189 443136
11041D43136q1823L0283K34246M21167m31458j62436N6149j74052L12591n990
$$ 443136 361313 391596 625842 1047009 615551 453115 509264 335212 647803 641813
11031F41813j27854L18303k82202j87475K12478M392J62391J82846k09822K22668
$$ 641813 513959 832262 550060 362585 575063 579455 741846 924692 714870 937538
11021I37538j72472N3268k84782K02889J58790l19941K42782k22197j82522K08516
$$ 937538 765066 818334 533552 736441 895231 575290 818072 595875 413353 621869
11011F21869J24648l2013J179l47835J58367K76851n9626J23261j49074j29513
$$ 621869 746517 714504 715683 367848 526215 803066 743440 866701 717627 588114
11001E88114O6159M2928k58748P3177K13917j99535K13301k67095Q2325j37978
$$ 588114 654273 697201 438453 511630 725547 526012 739313 472218 554543 416565
10991D16565M28872j38805J5065B82870K46914J1337A85957M41082O8476K13745
$$ 416565 845437 706632 721697 282870 529784 541121 185957 627039 695515 909260
10981I09260k47736j1307P75665G02804K08422k4214j76651J21144P3871M2212
$$ 909260 661524 650217 1425882 702804 911226 887012 710361 831505 905376 947588
10971I47588j12916L88131l92478M10139K2559k8024N1637L20376j13386J54752
$$ 947588 834672 1222803 830325 1240464 1263023 1234999 1286636 1607012 1493626 1648378
10961A648378K94074M00789k66149O88717R677m1160j63005l24378j30677r3500
$$ 1648378 1942452 2343241 2077092 2765809 2775486 2734326 2571321 2246943 2116266 2022766
10951B022766j74512l8590l01461l8345J10628K8569R5824k282j28516j37807
$$ 2022766 1848254 1809664 1508203 1469858 1580486 1609055 1704879 1702597 1574081 1436274
10941A436274O1969m03707J30224j34717j33584k9697k45513K11717k11251C00198
$$ 1436274 1498243 1094536 1224760 1090043 956459 926762 681249 892966 681715 300198
10930E89436l3848k01963O9290I7053K30915o8696L26112A76266J63977h9973
$$ 589436 555588 353625 422915 97053 327968 259272 585384 176266 340243 -89973
10919a1323m1595J3614C79326a7001j30034j2685D9628L2908P5314J1140a02377
$$ -11323 -52918 -39304 379326 -17001 -147035 -159720 49628 82536 157850 168990 -102377
10907H6949J18013E2010j3024i3307A28824c67260a43924B98585A02799O5917
$$ 86949 204962 52010 38986 -93307 128824 -367260 -143924 298585 102799 168716
10897A68716b66632A96011r6281d1529A57695n5442a39229l6654A38728b69251
$$ 168716 -266632 196011 99730 -41529 157695 102253 -139229 -175883 138728 -269251
10886A14909P6337a80866a0972H6738H890b0425k45598a06858L7376A53472d0947
$$ 114909 191246 -180866 -10972 86738 8890 -20425 -266023 -106858 -69482 153472 -40947
10874C10350a53817f7716k88338G5430f66B8262a94763A51662J02061b26913A98872
$$ 310350 -153817 -67716 -356054 75430 -666 28262 -194763 151662 253723 -226913 198872
10862G4724c51242C7619C756O5920a36004j4459e1489k28859B56400I4589l4313
$$ 74724 -351242 37619 3756 69676 -136004 -150463 -51489 -280348 256400 94589 60276
10851F0276a2431C1157j376J91834b09242L0620A40001a86491G8979l8948J1813
$$ 60276 -12431 31157 29781 221615 -209242 -178622 140001 -186491 78979 40031 51844
10840E1844a79654H3980g3478A9280L43736i9077J3528A32893b73567C69479a75160
$$ 51844 -179654 83980 -73478 19280 363016 -99077 -85549 132893 -273567 369479 -175160
10828b96810m4769E6885a9810I4603b54035J22458D20659g8739j96139f4022F1850
$$ -296810 -341579 56885 -19810 94603 -254035 -131577 420659 -78739 -274878 -64022 61850
10816d4523D7361h614r5854B64676g2783L4941l89291I7801L5620d73767c470
$$ -44523 47361 -8614 -104468 264676 -72783 -37842 -427133 97801 133421 -473767 -3470
10804B4347a9180C2435M02910I4727e5865m0273H6410g4487k644a7746B01925
$$ 24347 -19180 32435 435345 94727 -55865 -96138 86410 -74487 -77131 -17746 201925
10792b44280i8686r3446A13904Q9105e98259b27050a2767n5911j7915L6549B3787
$$ -244280 -98686 -192132 113904 203009 -598259 -227050 -12767 -68678 -86593 -50044 23787
10780F319d8524A21347a12980E4556n63b75940c2875B24182I6850k0873c3437
$$ 6319 -48524 121347 -112980 54556 53993 -275940 -32875 224182 96850 75977 -33437
10768d9824B4206f142m4008k14801H3522a94951j80320J43943f9951C00979c97374
$$ -49824 24206 -6142 -50150 -264951 83522 -194951 -375271 -231328 -69951 300979 -397374
10756d40223I6623a34505A32396c57164i6380M260D2746K75036B902d9626j61597
$$ -440223 96623 -134505 132396 -357164 -96380 -92120 42746 317782 2902 -49626 -211223
10745b11223j1190O9584b8289m04392E7628A7515b57414O8745B10277c19865A56500
$$ -211223 -222413 -152829 -28289 -432681 57628 17515 -257414 -188669 210277 -319865 156500
10733b123r7371a4694A3122P0584a4958A01748J10140Q4296h2610B04236a68002
$$ -2123 -99494 -14694 13122 83706 -14958 101748 211888 296184 -82610 204236 -168002
10721B17989b96958I0710A9330b07989A80504b02986l312C1577i0731j5306b024
$$ 217989 -296958 90710 19330 -207989 180504 -202986 -206298 31577 -90731 -106037 -2024
10709C1087P000c4264C43170f2696J6522j48628r0894C7047a42531I7963A2041
$$ 31087 38087 -34264 343170 -62696 -46174 -194802 -285696 37047 -142531 97963 12041
10697c72078E4668a96738f1144k04113e4825j87795e2821H1429J6470a1094j25473
$$ -372078 54668 -196738 -61144 -265257 -54825 -242620 -52821 81429 97899 -11094 -136567
10686a36567k12609a34454a0926j03990C8223f651H0055a21755D6338a08529M0767
$$ -136567 -349176 -134454 -10926 -114916 38223 -6651 80055 -121755 46338 -108529 -67762
10675f7762C26607b19584I385J94231a10746k35867a70911l8557A04995m8833
$$ -67762 326607 -219584 9385 203616 -110746 -346613 -170911 -209468 104995 56162
10665E6162b99608a13639K7173F7558a27886k04820Q2426E0551J62153d49772
$$ 56162 -299608 -113639 -86466 67558 -127886 -332706 -250280 50551 212704 -449772
10654b50912B6533N2764h6569B85825E0607a10847B34776a74942C04338a01495
$$ -250912 26533 79297 -86569 285825 50607 -110847 234776 -174942 304338 -101495
10643f2558a6287k2802j01449l01949F7792J34456a90526A44892N6561a18943
$$ -62558 -16287 -39089 -140538 -442487 67792 202248 -190526 144892 201453 -118943
10632A31935j3775b43287A20085E498J3521c60997F5169a54073B95554b30131
$$ 131935 118160 -243287 120085 5498 19019 -360997 65169 -154073 295554 -230131
10621b22954R2870l11659a70478b5107J262q2260k31250I951a44371J0777q6975
$$ -222954 -130084 -441743 -170478 -25107 -23845 -106105 -337355 9951 -144371 -133594 -220569
10610b20569B35721o9419a63552A01306a94127A75354a06792d3444D974b7953
$$ -220569 235721 166302 -163552 101306 -194127 175354 -106792 -43444 4974 -27953
10599F13M325c0408B10143c6855a2565e798l840l08414G8727J45812b00915c5528
$$ 613 4938 -30408 210143 -36855 -12565 -5798 -9638 -318052 78727 224539 -200915 -35528
10586a78446b6777k39948a01461b6683k21156a01296M0346j33544h3895M1327
$$ -178446 -26777 -266725 -101461 -26683 -247839 -101296 -60950 -194494 -83895 -42568
10576d2568B8571b46708b84A6280c1783j49772A59297a1467k94405d1333j9941
$$ -42568 28571 -246708 -284 16280 -31783 -181555 159297 -11467 -305872 -41333 -61274
10565f1274K713A53614b8226k40593A0262K94842e90127b07600Q1903C10208A817
$$ -61274 -58561 153614 -28226 -268819 10262 305104 -590127 -207600 -125697 310208 1817
10553b13042k9307J5373d9748B30285p8667G4324r13a56914j38662D2912b20748
$$ -213042 -242349 -226976 -49748 230285 151618 74324 73411 -156914 -295576 42912 -220748
10541a18264H4543P2214d01336c3204G7149g7796B71796M6491i7399H5699b76406
$$ -118264 84543 156757 -401336 -33204 77149 -77796 271796 318287 -97399 85699 -276406
10529c9536j46923o903M7750p9075C25774f8334l60771D39631A72345A9516J32712
$$ -39536 -186459 -193362 -145612 -224687 325774 -68334 -429105 439631 172345 19516 152228
10518A52228J37180j37732E4796O8277e4243A67489n8243J16052b31004C9219
$$ 152228 289408 151676 54796 123073 -54243 167489 109246 225298 -231004 39219
10507E882L18536a83282C3549b77149A01590h4291k21180R6469b8830j95397A38440
$$ 5882 324418 -183282 33549 -277149 101590 -84291 -305471 -209002 -28830 -224227 138440
10495b57855A94005b57580b422m27522G7350a18105A64143O4625j12802b27550
$$ -257855 194005 -257580 -2422 -429944 77350 -118105 164143 228768 115966 -227550
10484b39787O4935b9711k23029j29h9878C1682b25731A47239d1818o2779j54561
$$ -239787 -174852 -29711 -252740 -252869 -89878 31682 -225731 147239 -41818 -104597 -259158
10473b59158c43A46432K773J2256o7031K09164l5520M9640J38727j69124h9270
$$ -259158 -343 146432 149205 161461 94430 303594 268074 317714 456441 287317 -89270
10461A40432n0786N843a75165B0376o461O0985C505K12617a4915l82045f9669
$$ 140432 89646 95489 -175165 20376 13915 74900 3505 216122 -14915 -396960 -69669
10449A22279b63161k5423e5215a9448D9310a52213d7188B49966B5864J89451l6049
$$ 122279 -263161 -288584 -55215 -19448 49310 -152213 -47188 249966 25864 215315 179266
10438A79266F1353h5744I7748C2393Q8367b60132E4506K13779a69398e989E3495
$$ 179266 61353 -85744 97748 32393 120760 -260132 54506 268285 -169398 -5989 53495
10426a1948j52981j03610B62143N6326C7414b28548K9999f8289k1906Q538A80776
$$ -11948 -164929 -268539 262143 318469 37414 -228548 -198549 -68289 -90195 -81657 180776
10414B75244A13041L7126n1158M7810a09150J061M5233m4882l0673j54202J03021
$$ 275244 113041 150167 99009 146819 -109150 -108089 -62856 -107738 -138411 -292613 -189592
10403a89592j63227c7763m5086j3657A4465c47366B81434o1546l5828E7299e0052
$$ -189592 -352819 -37763 -82849 -96506 14465 -347366 281434 219888 184060 57299 -50052
10391h4355E8949e6595j43930H3388B3163L8331J34883B3294K79591a10604b2930
$$ -84355 58949 -56595 -200525 83388 23163 61494 196377 23294 302885 -110604 -22930
10379A23564K59314A27083f1022C8570a16545r5090A66005J25354p7174J19572
$$ 123564 382878 127083 -61022 38570 -116545 -211635 166005 291359 214185 333757
10369C33757b3952A69456P7370C7422K47381B2428K35100O0424p8858g0903B36607
$$ 333757 -23952 169456 246826 37422 284803 22428 257528 317952 239094 -70903 236607
10357A18689g1580A27668D4205K23102A08066J57133J65854A90474p2638g455
$$ 118689 -71580 127668 44205 267307 108066 265199 431053 190474 117836 -7455
10346A93316J41003H5583L48894A12959k9860R5830J38584E2055K01645M21984
$$ 193316 334319 85583 434477 112959 83099 178929 317513 52055 253700 675684
10336F75684k02636J60834j84976A97393L49785p8846j61585K59079j71037A17647
$$ 675684 473048 633882 448906 197393 547178 468332 306747 565826 394789 117647
10325C95848A64708L07946a3990A51662J53140j24263K7011c9021G1673A4261
$$ 395848 164708 472654 -13990 151662 304802 180539 207550 -39021 71673 14261
10314a8245l1099q1739B63403B263J9311a25475a5083j97040B01873D2964R5088
$$ -18245 -49344 -131083 263403 2263 21574 -125475 -15083 -212123 201873 42964 138052
10303A38052N76J98776B5658f6205A17801K9051h6796B73719F5356b29993G4841
$$ 138052 138628 337404 25658 -66205 117801 146852 -86796 273719 65356 -229993 74841
10291i1636K5702A88208g8569j48088N3723O2080A02605J51743H8602c17357A67405
$$ -91636 -65934 188208 -78569 -226657 -172934 -110854 102605 254348 88602 -317357 167405
10279B80213r3082d50709a68001O4036k54321N0653A04229a46673d4047H7639
$$ 280213 187131 -450709 -168001 -103965 -358286 -307633 104229 -146673 -44047 87639
10268A15673P446n9603g8545B46429C3394Q0825i7164B11690J29773p7440b8450
$$ 115673 123119 63516 -78545 246429 33394 114219 -97164 211690 341463 264023 -28450
10256a34561o3651O1183B24129d5056j5716A92355E2339g6087a2600A13411b06130
$$ -134561 -198212 -137029 224129 -45056 -60772 192355 52339 -76087 -12600 113411 -206130
10244I7135K22373G1790K54763b43565i64k7484A61283e1116A37569f8031k25354
$$ 97135 319508 71790 326553 -243565 -964 -28448 161283 -51116 137569 -68031 -293385
10233b93385A55373E6910e5662p9707c8562r1857A7979K74511e5494k3802B5565
$$ -293385 155373 56910 -55662 -135369 -38562 -130419 17979 292490 -55494 -79296 25565
10221a10162k40901F1076J19186N3562c16083a43179e0896I9620g8076k17727
$$ -110162 -351063 61076 180262 233824 -316083 -143179 -50896 99620 -78076 -295803
10211b95803f0661A04354b84222A32145a99901P4762b1517D0198d9453A48962
$$ -295803 -60661 104354 -284222 132145 -199901 -125139 -21517 40198 -49453 148962
10200a20336A31572J44264c08634D3368n122g2965e968B23290c19837J47527A39250
$$ -120336 131572 275836 -308634 43368 38246 -72965 -5968 223290 -319837 -172310 139250
10188C00586A19572N8113b42507M3097d0299p0988D01925A07035a29378F6313
$$ 300586 119572 177685 -242507 -199410 -40299 -111287 401925 107035 -129378 66313
10177h6068m876J239l2079F7006K20517A00477C8008P0248i4210k34245e6787
$$ -86068 -90944 -89705 -121784 67006 287523 100477 38008 108256 -94210 -328455 -56787
10165c18830J08814F0282k9728a13622p5202c4799m22795E209M4879J33305F8750
$$ -318830 -210016 60282 30554 -113622 -188824 -34799 -457594 5209 50088 183393 68750
10153a24062B30812c80363q1136a67921k75593E3436f4040k9113G8069b83685
$$ -124062 230812 -380363 -461499 -167921 -443514 53436 -64040 -93153 78069 -283685
10142c4422q2130j40955L1012L6200D6800f9602o8851c6408k01284h6277c805
$$ -34422 -116552 -257507 -226495 -190295 46800 -69602 -138453 -36408 -237692 -86277 -3805
10130d21059A75460a25847I9146d66182G8736k3844A1095h4925b6278G4767a35038
$$ -421059 175460 -125847 99146 -466182 78736 54892 11095 -84925 -26278 74767 -135038
10118a60119G7553C0669N6811d9019J8373H5902A1162a05300F3094A5555C573
$$ -160119 77553 30669 87480 -49019 -30646 85902 11162 -105300 63094 15555 3573
10106a78853f8303E5192a75082r0556l6990C97449A78881G4236c64982g9162E1224
$$ -178853 -68303 55192 -175082 -265638 -302628 397449 178881 74236 -364982 -79162 51224
10094b19025J05572B03415a36355b4823A57155c38873a13536j50210B95825b6759
$$ -219025 -113453 203415 -136355 -24823 157155 -338873 -113536 -263746 295825 -26759
10083A53722d04851a53682O1790r3071A30889H050O0098O7193b15160H1004e3383
$$ 153722 -404851 -153682 -91892 -184963 130889 8050 68148 135341 -215160 81004 -53383
10071C673d5329p212C28735c09423B76320A30015a02297L1099j09903H9063h9059
$$ 3673 -45329 -52541 328735 -309423 276320 130015 -102297 -71198 -181101 89063 -89059
10059a74390C4926b6465m21261a02738k56134A3016O5041f618B08437F514L139
$$ -174390 34926 -26465 -447726 -102738 -358872 13016 78057 -6618 208437 6514 9653
10048I653e9327k20991h491C10729f9557E0726c70839F5088K53457b67624A16385
$$ 9653 -59327 -280318 -8491 310729 -69557 50726 -370839 65088 318545 -267624 116385
10036a0099m75653C1359b35109i9255D9789b3403j94904f2950E48717b6171j50743
$$ -10099 -485752 31359 -235109 -99255 49789 -23403 -218307 -62950 548717 -26171 -176914
10025a76914K3946H3387j7375a65362j48982A38065M6015o798a75400A18857k4752
$$ -176914 -152968 83387 66012 -165362 -314344 138065 184080 177282 -175400 118857 94105
10014I4105b71131N6972g3870B48819A21993a38176p5591N0502A54910a86120
$$ 94105 -271131 -214159 -73870 248819 121993 -138176 -213767 -163265 154910 -186120
10003c35160J49935P9707C022c26905c7243q6604c5204A93847a63756j56234d4609
$$ -335160 -185225 -105518 3022 -326905 -37243 -123847 -35204 193847 -163756 -319990 -44609
9991a1965j8011j64981m9341J05539A33435d5026e841k41786l25571a29345j44748
$$ -11965 -29976 -194957 -244298 -138759 133435 -45026 -5841 -247627 -573198 -129345 -274093
9980b74093A83147a00620r2375c660A7410a54383g4207q740m1121L3542D4237
$$ -274093 183147 -100620 -192995 -3660 17410 -154383 -74207 -82947 -124068 -90526 44237
9968d3346o4356A68287b89265f6671b3498l5560b4567j77540C6436j566e5517
$$ -43346 -107702 168287 -289265 -66671 -23498 -59058 -24567 -202107 36436 34870 -55517
9956a03863H5029a06259b5603E2764a98462B30516h5077j84320A7455J56692a74950
$$ -103863 85029 -106259 -25603 52764 -198462 230516 -85077 -269397 17455 174147 -174950
9944a86843Q6210l34655a11959A7532K49309c8765H269b18911l8195B44385b09626
$$ -186843 -100633 -435288 -111959 17532 266841 -38765 8269 -218911 -257106 244385 -209626
9932g2805j4686o7060c4409A46686c05557a20011H6558h6783A08526a09080j15461
$$ -72805 -87491 -154551 -34409 146686 -305557 -120011 86558 -86783 108526 -109080 -224541
9921b24541A48692m2652R8146i6759G2417e6251B34819c658F1607b74768c3474
$$ -224541 148692 106040 204186 -96759 72417 -56251 234819 -3658 61607 -274768 -33474
9909C5577M0442K12863H3779a84787L9734j9110j02191C3062f6187j50312M9823
$$ 35577 76019 288882 83779 -184787 -145053 -164163 -266354 33062 -66187 -216499 -166676
9898a66676l5426B2583a51721r8072A6024o112f0225E3726b6355j34114k89844
$$ -166676 -202102 22583 -151721 -249793 16024 9912 -60225 53726 -26355 -160469 -450313
9887d50313a74754j9404J8966j00696O3250F9651f8886r557J0536D9609c75158
$$ -450313 -174754 -194158 -175192 -275888 -212638 69651 -68886 -78443 -67907 49609 -375158
9875G5893d4580E9204K43203A08204b21601A7531a63658A93653a03902j21411
$$ 75893 -44580 59204 302407 108204 -221601 17531 -163658 193653 -103902 -225313
9865b25313q2420J44794K7954C97576a50748E2261j9451L0074a34448A44409D8690
$$ -225313 -307733 -162939 -134985 397576 -150748 52261 32810 62884 -134448 144409 48690
9853b66416C306a13012l8524M7613P680d1219l4943H8589A9088C8J49376A603
$$ -266416 3306 -113012 -151536 -103923 -96243 -41219 -76162 88589 19088 38 149414 1603
9840C1633b38165R6323I6757h4641P419L4952f415j63002C2390K0984e1986G1855
$$ 31633 -238165 -141842 96757 -84641 -77222 -42270 -6415 -169417 32390 53374 -51986 71855
9827c59190F7518a55203e4478a0116j20404C11563c57552a38523m5902A15265
$$ -359190 67518 -155203 -54478 -10116 -130520 311563 -357552 -138523 -184425 115265
9816B95623a31339J7530A05693b98583f5549E5344a38345k42425B28700a02838
$$ 295623 -131339 -113809 105693 -298583 -65549 55344 -138345 -380770 228700 -102838
9805e0984k0230A0351R3866a3492C20533e3376P497A47803D4162c56518a9976
$$ -50984 -71214 10351 104217 -13492 320533 -53376 -45879 147803 44162 -356518 -19976
9793b3656k62214a27685q2566r662C0960e606B6034b05545O0520e597k3539G4029
$$ -23656 -285870 -127685 -210251 -219913 30960 -5606 26034 -205545 -145025 -5597 -29136 74029
9780a97567i212o0692c3772B13732d2842j74251c9959r5791k4922k44279B14882
$$ -197567 -9212 -69904 -33772 213732 -42842 -217093 -39959 -135750 -160672 -404951 214882
9768A19457I459J553c4107j04879l7981B21982h4928F0023R177c0825l08228A29532
$$ 119457 9459 11012 -34107 -138986 -176967 221982 -84928 60023 69200 -30825 -339053 129532
9755c73937O1988R7293j20304B34836d23170a17629A58689N784a25394l1776D7684
$$ -373937 -311949 -214656 -334960 234836 -423170 -117629 158689 164473 -125394 -157170 47684
9743B4608P8622b10469I2200F038b14077A32399a81316C50944a00162c1729j58470
$$ 24608 103230 -210469 92200 6038 -214077 132399 -181316 350944 -100162 -31729 -190199
9732a90199i0533j21039h9058A75074a51134o6774J8321e6900M710l04262F2815
$$ -190199 -90533 -211572 -89058 175074 -151134 -217908 -199587 -56900 -52190 -356452 62815
9720f2312o7019e0328a6338p0258n4042A91608g9736A10208b02042B16576f6279
$$ -62312 -129331 -50328 -16338 -86596 -140638 191608 -79736 110208 -202042 216576 -66279
9708A51605P8126l2943m3326g209k92673J01282j24528a44570A6132J91664A00026
$$ 151605 229731 196788 153462 -7209 -299882 -198600 -323128 -144570 16132 207796 100026
9696A38341b23154B75841d87383h1764j3800B07219G6802a01370G7760a33822
$$ 138341 -223154 275841 -487383 -81764 -95564 207219 76802 -101370 77760 -133822
9685f2559G9152a06740j48733g8321j16081A9609Q244b70936d7293l50638o2560
$$ -62559 79152 -106740 -255473 -78321 -194402 19609 27853 -270936 -47293 -397931 -460491
9674d60491J96423K1316b9840G0457a99933I0693K65133E9222L056c20825A2713
$$ -460491 -264068 -242752 -29840 70457 -199933 90693 355826 59222 62278 -320825 12713
9662B84135j03625h1195G069N921b14401A72616a50890e0706F4571n130b98101
$$ 284135 180510 -81195 7069 12990 -214401 172616 -150890 -50706 64571 59441 -298101
9650c96403H3780h6326A59173a84448f9111c1113I1584a89205Q9617n4672r7305
$$ -396403 83780 -86326 159173 -184448 -69111 -31113 91584 -189205 -99588 -154260 -251565
9639b51565r1876h2516p2686B2896h4524b6865i849j85807I0101f4132B04417
$$ -251565 -343441 -82516 -155202 22896 -84524 -26865 -9849 -195656 90101 -64132 204417
9627c7595j60100F4386e3395o7519k9222o1473D756R5869B0530a32017c8434n3997
$$ -37595 -197695 64386 -53395 -120914 -150136 -211609 4756 100625 20530 -132017 -38434 -92431
9615i2431j93107B12245a96455I009K07698c7184n1673M1427A44610g4553m11113
$$ -92431 -285538 212245 -196455 9009 216707 -37184 -88857 -47430 144610 -74553 -485666
9604d85666b1034k37774a12812j00350g0157K4750A66507c76303R561A8196a63235
$$ -485666 -21034 -258808 -112812 -213162 -70157 -45407 166507 -376303 -366742 18196 -163235
9592F3070i3389o3661D8598b43711h2714I8641b30168G3026B8697L2782h862o0979
$$ 63070 -93389 -157050 48598 -243711 -82714 98641 -230168 73026 28697 61479 -8862 -69841
9580f9841B44957a11730k43247a70337B52027a20691M8110A66106c45016i5315
$$ -69841 244957 -111730 -354977 -170337 252027 -120691 -72581 166106 -345016 -95315
9569E9449J3182J82785K49460b24930P7231j96646a37399N2434K0968A81494M5012
$$ 59449 72631 255416 504876 -224930 -147699 -344345 -137399 -84965 -63997 181494 226506
9558B26506E2528a16172l854A7015h8646A89189b7991j59086e5061j26843A68152
$$ 226506 52528 -116172 -120026 17015 -88646 189189 -27991 -187077 -55061 -181904 168152
9546h0945F8321a08010b8325A3742j710a33879N0293j56733A06656c20382h9107
$$ -80945 68321 -108010 -28325 13742 12032 -133879 -83586 -240319 106656 -320382 -89107
9534b06366L5052j53333C8173c8127k08324b0970j07578L9738j41602O4187p3516
$$ -206366 -171314 -324647 38173 -38127 -246451 -20970 -128548 -88810 -230412 -166225 -239741
9523b39741O6528Q6119K8408J1544o1408F183Q8951a907B20176e5752j50417l987
$$ -239741 -173213 -87094 -58686 -47142 -108550 6183 95134 -1907 220176 -55752 -206169 -210156
9511b10156M1373L5079d5041D65919a6483B50250a58376p1668A39620c4200j49041
$$ -210156 -168783 -133704 -45041 465919 -16483 250250 -158376 -230044 139620 -34200 -183241
9500a83241n5382A74594k0120l878h6597j4830c6843F3317L0914R928B3700h0937
$$ -183241 -238623 174594 154474 150596 -86597 -101427 -36843 63317 94231 104159 23700 -80937
9487b51782J04354J0986j34238J23926o3493e8868j86298B7334b23028D6677J8649
$$ -251782 -147428 -136442 -270680 -146754 -210247 -58868 -245166 27334 -223028 46677 65326
9476F5326b00503A01336p757K59983g7270D4152c11161B47127g8996j7676k88332
$$ 65326 -200503 101336 93579 353562 -77270 44152 -311161 247127 -78996 -96672 -385004
9465c85004k365A56176E1229a63974J8493L1611M7690r6420P9796B1337b30734
$$ -385004 -387369 156176 51229 -163974 -145481 -113870 -66180 -162600 -82804 21337 -230734
9453G5470J47913D0859a10359A38716F1879P3075e7653A10116n2988b75874C56
$$ 75470 223383 40859 -110359 138716 61879 134954 -57653 110116 57128 -275874 356
9441A98318a79316A53485e8377j56944A09135k3953E217a96764a0747m29626g1855
$$ 198318 -179316 153485 -58377 -215321 109135 85182 5217 -196764 -10747 -440373 -71855
9429b20911A35698a81975B52375m4862b23485a02061B3383L11556H2747c23730
$$ -220911 135698 -181975 252375 207513 -223485 -102061 23383 334939 82747 -323730
9418i5301G501b4685l6184j3053k98263a64992N9482A10455b85334f4726l0305
$$ -95301 7501 -24685 -60869 -73922 -372185 -164992 -105510 110455 -285334 -64726 -95031
9407i5031L8989C4976J05891O6926C1554b8435A77907g0935j52404L5496N5320
$$ -95031 -56042 34976 140867 207793 31554 -28435 177907 -70935 -223339 -187843 -132523
9396a32523A85973c44352i4834A31607M5006N0358a01507B39972g9563p7117O8258
$$ -132523 185973 -344352 -94834 131607 176613 226971 -101507 239972 -79563 -156680 -88422
9385h8422r0517B56329b02239A6679b54834N1187i7799C88052q8589A22317a73458
$$ -88422 -178939 256329 -202239 16679 -254834 -203647 -97799 388052 299463 122317 -173458
9373b8287B7329a50194D5129L504d5803B41865e1216m719k75465A32994g4187
$$ -28287 27329 -150194 45129 48633 -45803 241865 -51216 -55935 -331400 132994 -74187
9361a38684M4183j3543B06527h4648p7039N2401k30973A00613b95698R1948g6590
$$ -138684 -94501 -108044 206527 -84648 -161687 -109286 -340259 100613 -295698 -203750 -76590
9349G6200d8113G1908a3653k15605J00640K1019A5497i8284B49096c5594j19777
$$ 76200 -48113 71908 -13653 -229258 -128618 -107599 15497 -98284 249096 -35594 -155371
9338a55371j3705k9559I3255P8189a62096A02143e6145a0625j9162j80852Q728
$$ -155371 -169076 -198635 93255 171444 -162096 102143 -56145 -10625 -29787 -210639 -201911
9327b01911q5816B74993b47346l2723d242n7931D7586k2615a0088A13888l8938
$$ -201911 -287727 274993 -247346 -280069 -4242 -62173 47586 24971 -10088 113888 74950
9316G4950d5768k83728a27143L8890G4246a43118A4097P735d1010B08362a48718
$$ 74950 -45768 -329496 -127143 -88253 74246 -143118 14097 21832 -41010 208362 -148718
9304c6306H6879a00186E2631a71339C9365b1143B3260d1044k88116A25743D2733
$$ -36306 86879 -100186 52631 -171339 39365 -21143 23260 -41044 -329160 125743 42733
9292b80801d3371j06210p8799R6859j23241I9825a26851m3171J3256A4994J753
$$ -280801 -43371 -149581 -228380 -131521 -254762 99825 -126851 -170022 -156766 14994 16747
9281A6747N721d35402b09766a03942K9185B0076L3431R1925a72922B2988h5410
$$ 16747 22468 -435402 -209766 -103942 -74757 20076 53507 145432 -172922 22988 -85410
9269a46655B1139a07026e1124A66734I229b44125j4872c8070A2209c3163A6363
$$ -146655 21139 -107026 -51124 166734 9229 -244125 -258997 -38070 12209 -33163 16363
9257a97342R5052a2651G6684g8231j49711h3658G6656c0293n0236C23811i7965
$$ -197342 -102290 -12651 76684 -78231 -227942 -83658 76656 -30293 -80529 323811 -97965
9245f02714b10094B0864c3657E1153O382a28362l5765K050n0684A35129c05420
$$ -602714 -210094 20864 -33657 51153 57535 -128362 -164127 -162077 -212761 135129 -305420
9233G5791a51487H0249e2654f002A34408f4465J86k12175D1078n997E449a35834
$$ 75791 -151487 80249 -52654 -6002 134408 -64465 -64279 -276454 41078 35081 5449 -135834
9220A10619b50694A09926J88907A7417J55078c14189J39713f9754j56182G2333
$$ 110619 -250694 109926 298833 17417 172495 -314189 -174476 -69754 -225936 72333
9209b55232f9345A6109L03555A07182a26245l3776a5656F3268a69157n1445h5395
$$ -255232 -69345 16109 319664 107182 -126245 -160021 -15656 63268 -169157 -220602 -85395
9197a79732k65740F8071a72368E9658J07625M71e5540C4265O0467i0495j14821
$$ -179732 -445472 68071 -172368 59658 167283 167754 -55540 34265 94732 -90495 -205316
9186b05316e2166I2770a35605m23889C02899B1425c87152a16351A49332h6821
$$ -205316 -52166 92770 -135605 -559494 302899 21425 -387152 -116351 149332 -86821
9175c26231i9378L8570l6841m0152e4820m6515E6900J8802a17817j13082B5377
$$ -326231 -99378 -60808 -97649 -137801 -54820 -101335 56900 75702 -117817 -230899 25377
9163b24986A79993p6860b64627G5096a41378A25329a75050A8553a18511H8567
$$ -224986 179993 103133 -264627 75096 -141378 125329 -175050 18553 -118511 88567
9152d8864k8444k79373d9737H2935R2471A9333P9500a90071j40340F026b7960
$$ -48864 -77308 -356681 -49737 82935 175406 19333 98833 -190071 -330411 6026 -27960
9140e5916C46102B8457f3412j59200r1736K6755A9953i3352B89219c348n18286
$$ -55916 346102 28457 -63412 -222612 -314348 -287593 19953 -93352 289219 -3348 -521634
9129e21634B19026b05412O9536f3665K4050C26294A14701I12c70084J46778F1021
$$ -521634 219026 -205412 -135876 -63665 -39615 326294 114701 912 -370084 -223306 61021
9117G5436h7427A15338L3518d58710I1687P9511a25111d929A8528b55357a11322
$$ 75436 -87427 115338 148856 -458710 91687 171198 -125111 -4929 18528 -255357 -111322
9105E8575b60254I4069b83968a30875C05459k0153j35168Q6394h2697J4991A82238
$$ 58575 -260254 94069 -283968 -130875 305459 285306 150138 236532 -82697 -67706 182238
9093B02032e8661r8276k0968P5085j26479A53680k9042a37309F3726a77303h6103
$$ 202032 -58661 -156937 -177905 -102820 -229299 153680 124638 -137309 63726 -177303 -86103
9081b86853J19283j35337A78237f1303C12067A3960f3912j67533A1410R6989K43145
$$ -286853 -167570 -302907 178237 -61303 312067 13960 -63912 -231445 11410 108399 351544
9070C51544A39256a33771k7101L866k13550a36279j17245J01047k61290a08000
$$ 351544 139256 -133771 -160872 -157006 -370556 -136279 -253524 -152477 -413767 -108000
9059a22633e0480A12987a66907d7624B6566a41946A52050J4435b67262k84462
$$ -122633 -50480 112987 -166907 -47624 26566 -141946 152050 166485 -267262 -551724
9049e51724B47936a49110q8668A34913b06952Q4030h42A75603E7291f1960n8627
$$ -551724 247936 -149110 -237778 134913 -206952 -122922 -842 175603 57291 -61960 -120587
9038a20587j12167d1485l50725a66498C69034j67983h9237j63079H2481M1835
$$ -120587 -232754 -41485 -392210 -166498 369034 201051 -89237 -252316 82481 124316
9028A24316i4968o37040A19420O3910a53348A21200b06672m373L0745B35934b18674
$$ 124316 -94968 -732008 119420 183330 -153348 121200 -206672 -211045 -180300 235934 -218674
9016I500a6255j19898d9842J678j06016A85688E3510a82760a9955k50977G0618
$$ 9500 -16255 -136153 -49842 -48164 -154180 185688 53510 -182760 -19955 -270932 70618
9004a89962Q8722n1899d2180q9726d9423G952a12066a5585j51781L9306a7997
$$ -189962 -101240 -153139 -42180 -131906 -49423 7952 -112066 -15585 -167366 -128060 -17997
8992a83642Q3668K3240l08838B18454B8953K14787G8851O1609f8362I373e2334
$$ -183642 -99974 -76734 -385572 218454 28953 243740 78851 140460 -68362 9373 -52334
8980b54177H763c1677j63507D5589c37606e0036j80972E7913c10576E1767B011
$$ -254177 8763 -31677 -195184 45589 -337606 -50036 -231008 57913 -310576 51767 2011
8968B1827a08835A95100C5463c05770k021O0070C04947b0143k4335A38699i2314
$$ 21827 -108835 195100 35463 -305770 -307791 -247721 304947 -20143 -44478 138699 -92314
8956b03265f3044B7874a43716f3885A60101g3523A6884i46B52032C4720G01h5912
$$ -203265 -63044 27874 -143716 -63885 160101 -73523 16884 -946 252032 34720 701 -85912
8943E3142b78230a24338p2332A12017a04327k24460A10088c7347G7146I759J7805
$$ 53142 -278230 -124338 -196670 112017 -104327 -328787 110088 -37347 77146 9759 27564
8932B7564b3430l9389n56419h2762j8661b436F3586B4422J45725j6238P1208B547
$$ 27564 -23430 -62819 -619238 -82762 -101423 -2436 63586 24422 170147 153909 225117 2547
8919B15166G8055a48970b7343m6321A67696G4154K32797J87862p8067G8230P34732
$$ 215166 78055 -148970 -27343 -73664 167696 74154 306951 494813 416746 78230 812962
8908H12962O65027J363052L546230k170200A944343p99781D64407n9845n266J4959
$$ 812962 1477989 2841041 6387271 4217071 1944343 1144562 464407 404562 399296 414255
8898D14255b3241A92993R2012C8736Q7920Q5707H6864a91673D8060a61162K567
$$ 414255 -23241 192993 285005 38736 126656 212363 86864 -191673 48060 -161162 -158595
8887a58595L9195A30865c62613H7391i443l0414G0930c45223q757I5540k7539
$$ -158595 -119400 130865 -362613 87391 -9443 -39857 70930 -345223 -353980 95540 68001
8876F8001M2939b25570a01961M4938E4678f8884E9225A8876b53305A44341g4150
$$ 68001 110940 -225570 -101961 -57023 54678 -68884 59225 18876 -253305 144341 -74150
8864i8200j02299i1582m577l14830J37223M1984E8272A5083c9817n6137C59750
$$ -98200 -200499 -91582 -96159 -410989 -273766 -231782 58272 15083 -39817 -95954 359750
8852a05784K9898b2605B47160g0646b9568A06282c75441B85148b00456j36214
$$ -105784 -75886 -22605 247160 -70646 -29568 106282 -375441 285148 -200456 -336670
$$ [...]
##END NTUPLES=NMR SPECTRUM
##END=
