
##TITLE=AC1112_Colombia_5867538_v5MueiK8Sv
##JCAMPDX= 6.0         $$ Bruker NMR JCAMP-DX V2.0
##DATA TYPE= NMR SPECTRUM
##DATA CLASS= NTUPLES
##ORIGIN= BRUKER
##OWNER= Administrator
$$ 1.72 TOPSPIN		Version 2.1
$$ 2012-04-10 10:25:24.546 -0500  Administrator@TOPSPIN
$$ Compression mode = diff/dup
##.OBSERVE FREQUENCY= 400.13188235
##.OBSERVE NUCLEUS= ^1H
##.ACQUISITION MODE= SIMULTANEOUS (DQD)
##.ACQUISITION SCHEME= undefined
##.AVERAGES= 64
##.DIGITISER RES= 22
##SPECTROMETER/DATA SYSTEM= spect
##.PULSE SEQUENCE= noesygpps1d.comp
##.SOLVENT NAME= COFFEE_meoh
##.SHIFT REFERENCE= INTERNAL, COFFEE_meoh, 1, 14.96665
##AUDIT TRAIL= $$ (NUMBER, WHEN, WHO, WHERE, PROCESS, VERSION, WHAT)
$$ ##TITLE= Audit trail, TOPSPIN		Version 2.1
$$ ##JCAMPDX= 5.01
$$ ##ORIGIN= Bruker BioSpin GmbH
$$ ##OWNER= Administrator
$$ $$ C:\Bruker\TOPSPIN/data/COFFEE/nmr/AC1112_Colombia_5867538_v5MueiK8Sv/12/pdata/1/auditp.txt
$$ ##AUDIT TRAIL=  $$ (NUMBER, WHEN, WHO, WHERE, PROCESS, VERSION, WHAT)
(   1,<2012-03-30 19:22:04.062 -0500>,<Administrator>,<TOPSPIN>,<go>,<TOPSPIN 2.1>,
      <created by zg
	started at 2012-03-30 19:10:32.437 -0500,
	POWCHK enabled, PULCHK disabled,
       configuration hash MD5:
       1A 1E CE 29 27 FD 77 03 67 4E F0 E3 C4 B2 CB 90
       data hash MD5: 64K
       1E 8C EF 6E B1 64 D4 2E 2B 95 B6 32 A1 BA 24 07>)
(   2,<2012-03-30 19:22:06.953 -0500>,<Administrator>,<TOPSPIN>,<proc1d>,<TOPSPIN 2.1>,
      <Start of raw data processing
       efp LB = 0.3 FT_mod = 6 PKNL = 1 PHC0 = 0 PHC1 = 0 SI = 128K 
       data hash MD5: 128K
       40 DC 45 4C 74 87 AC 94 1B 9F B3 68 57 37 0F 45>)
(   3,<2012-03-30 19:22:08.078 -0500>,<Administrator>,<TOPSPIN>,<proc1d>,<TOPSPIN 2.1>,
      <pk PHC0 = 31.46484 PHC1 = 0 
       data hash MD5: 128K
       2E CD C6 AF 8C 91 1F 99 59 29 CF 84 88 CD 3B 7E>)
(   4,<2012-03-30 19:22:08.828 -0500>,<Administrator>,<TOPSPIN>,<proc1d>,<TOPSPIN 2.1>,
      <abs ABSG = 1 
       data hash MD5: 128K
       A4 E7 78 56 E9 2E 92 4E C1 1E 29 67 8B 51 83 EA>)
(   5,<2012-03-30 19:22:08.906 -0500>,<Administrator>,<TOPSPIN>,<proc1d>,<TOPSPIN 2.1>,
      <abs ABSG = 2 
       data hash MD5: 128K
       73 E2 E8 99 83 CB 82 1C 85 5F C7 35 5A 39 8A 9F>)
(   6,<2012-03-30 19:22:08.953 -0500>,<Administrator>,<TOPSPIN>,<proc1d>,<TOPSPIN 2.1>,
      <abs ABSG = 3 
       data hash MD5: 128K
       6D F2 6A 5C 7C 34 08 87 81 B7 F1 E5 75 EE 72 91>)
(   7,<2012-03-30 19:22:09.015 -0500>,<Administrator>,<TOPSPIN>,<proc1d>,<TOPSPIN 2.1>,
      <abs ABSG = 4 
       data hash MD5: 128K
       C5 9D 93 1B 25 36 DB 0E 91 34 58 54 F9 6F B8 FA>)
(   8,<2012-03-30 19:22:09.078 -0500>,<Administrator>,<TOPSPIN>,<proc1d>,<TOPSPIN 2.1>,
      <abs ABSG = 5 
       data hash MD5: 128K
       B8 29 AE 69 96 CA 33 5D 41 DF 90 F4 20 C4 22 84>)
(   9,<2012-03-30 19:22:11.000 -0500>,<Administrator>,<TOPSPIN>,<audit>,<TOPSPIN 2.1>,
      <user comment:
       ICON-NMR User ID: COFFEE
       data hash MD5: 128K
$$ [...]
##$TP07= 0
##$TPNAME0= <>
##$TPNAME1= <>
##$TPNAME2= <>
##$TPNAME3= <>
##$TPNAME4= <>
##$TPNAME5= <>
##$TPNAME6= <>
##$TPNAME7= <>
##$TPOAL= (0..7)
0.5 0.5 0.5 0.5 0.5 0.5 0.5 0.5
##$TPOFFS= (0..7)
0 0 0 0 0 0 0 0
##$TUNHIN= 0
##$TUNHOUT= 0
##$TUNXOUT= 0
##$USERA1= <user>
##$USERA2= <user>
##$USERA3= <user>
##$USERA4= <user>
##$USERA5= <user>
##$V9= 5
##$VALIST= <valist>
##$VCLIST= <CCCCCCCCCCCCCCC>
##$VD= 0
##$VDLIST= <DDDDDDDDDDDDDDD>
##$VPLIST= <PPPPPPPPPPPPPPP>
##$VTLIST= <TTTTTTTTTTTTTTT>
##$WBST= 2048
##$WBSW= 25
##$XGAIN= (0..3)
0 0 0 0
##$XL= 0
##$YL= 0
##$YMAX_a= 10207273
##$YMIN_a= -5913532
##$ZGOPTNS= <>
##$ZL1= 120
##$ZL2= 120
##$ZL3= 120
##$ZL4= 120
##$ABSF1= 14.96665
##$ABSF2= -5.58588
##$ABSG= 5
##$ABSL= 3
##$ALPHA= 0
##$AQORDER= 0
##$ASSFAC= 0
##$ASSFACI= 0
##$ASSFACX= 0
##$ASSWID= 0
##$AUNMP= <proc_prof1d_extract.lims>
##$AXLEFT= 0
##$AXNAME= <>
##$AXNUC= <1H>
##$AXRIGHT= 0
##$AXTYPE= 0
##$AXUNIT= <>
##$AZFE= 0.1
##$AZFW= 0.1
##$BCFW= 0
##$BC_mod= 0
##$BYTORDP= 0
##$COROFFS= 0
##$CY= 15
##$DATMOD= 1
##$DC= 0
##$DFILT= <>
##$DTYPP= 0
##$F1P= 0
##$F2P= 0
##$FCOR= 0.5
##$FTSIZE= 131072
##$FT_mod= 6
##$GAMMA= 0
##$GB= 0
##$INTBC= 1
##$INTSCL= 1
##$ISEN= 128
##$LB= 0.3
##$LEV0= 0
##$LPBIN= 0
##$MAXI= 10000
##$MC2= 0
##$MEAN= 0
##$ME_mod= 0
##$MI= 0
##$NCOEF= 0
##$NC_proc= -3
##$NLEV= 6
##$NOISF1= 0
##$NOISF2= 0
##$NSP= 0
##$NTH_PI= 0
##$NZP= 0
##$OFFSET= 14.96665
##$PC= 1
##$PHC0= 31.46484
##$PHC1= 0
##$PH_mod= 1
##$PKNL= yes
##$PPARMOD= 0
##$PPDIAG= 0
##$PPIPTYP= 0
##$PPMPNUM= 2147483647
##$PPRESOL= 1
##$PSCAL= 4
##$PSIGN= 0
##$PYNMP= <proc.py>
##$REVERSE= no
##$SF= 400.130005585605
##$SI= 131072
##$SIGF1= 0
##$SIGF2= 0
##$SINO= 400
##$SIOLD= 131072
##$SPECTYP= <>
##$SREGLST= <1H.CDCl3>
##$SSB= 0
##$STSI= 131072
##$STSR= 0
##$SW_p= 8223.68421052632
##$SYMM= 0
##$S_DEV= 0
##$TDeff= 65536
##$TDoff= 0
##$TI= <>
##$TILT= no
##$TM1= 0
##$TM2= 0
##$TOPLEV= 0
##$USERP1= <user>
##$USERP2= <user>
##$USERP3= <user>
##$USERP4= <user>
##$USERP5= <user>
##$WDW= 1
##$XDIM= 131072
##$YMAX_p= 446848104
##$YMIN_p= -220286099
##$CURPLOT= <Network HP LaserJet P1505>
##$CURPRIN= <$Network HP LaserJet P1505>
##$DFORMAT= <normdp>
##$LAYOUT= <+/1D_H.xwp>
##$LFORMAT= <normlp>
##$PFORMAT= <normpl>
##$SURQMSG= 1
$$ End of Bruker specific parameters
$$ ---------------------------------
##NTUPLES= NMR SPECTRUM
##VAR_NAME=  FREQUENCY,     SPECTRUM/REAL,   SPECTRUM/IMAG
##SYMBOL=    X,             R,               I
##VAR_TYPE=  INDEPENDENT,   DEPENDENT,       DEPENDENT
##VAR_FORM=  AFFN,          ASDF,            ASDF
##VAR_DIM=   131072,        131072,          131072
##UNITS=     HZ,            ARBITRARY UNITS, ARBITRARY UNITS
##FACTOR=    0.0627417313425165, 1,          1
##FIRST=     8223.62146879498, -2988,        -93799
##LAST=      0,             289,             -95115
##MIN=       0,             -220286099,      0
##MAX=       8223.62146879498, 446848104,    0
$$ Real data points
##PAGE= N=1
##DATA TABLE= (X++(R..R)), XYDATA
$$ [...]
$$ plain form
63701 334939 338962 343322 345957 346428 345189 342822 340379 339107 339053 338825 337457 335830 335573 337036 339125
63686 339125 340832 342278 344318 347569 351779 355849 358641 360108 361499 364069 367650 370943 373279 375591
63672 375591 379199 383814 387492 388995 389789 392950 400052 409776 419625 428181 435332 441273 446195 450442
63658 450442 454066 456598 458082 459814 462884 466266 467702 466499 464173 462183 460422 458373 456314 454595
63644 454595 452888 451124 450250 450962 452344 452711 451364 448791 445853 443644 443381 445262 447845 449673 451126
63629 451126 453550 456938 459863 461629 463133 465324 468020 470751 473816 477927 483251 489117 494290 497620
63615 497620 499076 500085 502037 504498 505871 505937 506502 509020 512618 515329 516495 517027 517724 518297 518037 516777
63599 516777 514956 512913 510197 505831 499708 493524 489485 487793 486274 483063 478968 476378 476315 477481 478173
$$ packed form
63701C34939M023M360K635M71j239k367k443j272n4k28j368j627k57J463K089
63686C39125J707J446K040L251M210M070K792J467J391K570L581L293K336K312
63672C75591L608M615L678J503P94L161P102R724R849Q556P151N941M922M247
63658D50442L624K532J484J732L070L382J436j203k326j990j761k049k059j719
63644D54595j707j764q74P12J382L67j347k573k938k209k63J881K583J828J453
63629D51126K424L388K925J766J504K191K696K731L065M111N324N866N173L330
63615D97620J456J009J952K461J373O6N65K518L598K711J166N32O97N73k60j260
63599E16777j821k043k716m366o123o184m039j692j519l211m095k590o3J166O92
$$ plain form
63584 478173 478429 480024 484607 491931 499834 506095 510392 514267 519319 525894 533485 541684 550464 560225
63570 560225 571823 585870 601571 617011 631211 645308 661187 679594 700133 722240 745344
63559 745344 768847 793040 819476 849358 882070 916341 952338 991314 1033664 1078756 1126365
63548 1126365 1176714 1229232 1282983 1338394 1396600 1456373 1513420 1563735 1606363 1641931 1669853
63537 1669853 1688440 1697105 1697265 1691485 1682406 1671698 1659003 1642440 1621018 1595928 1568671 1538787
63525 1538787 1504724 1466320 1424983 1381770 1336751 1290394 1244273 1200061 1158624 1120199 1084681
63514 1084681 1051754 1021594 995510 975027 960234 949824 942758 939039 938841 941881 947825 956351 966552
63501 966552 977263 988464 1001645 1018383 1039129 1063577 1091384 1122113 1155291 1190939 1229451
$$ packed form
63584D78173K56J595M583P324P903O261M297L875N052O575P591Q199Q780R761
63570E60225J1598J4047J5701J5440J4200J4097J5879J8407K0539K2107K3104
63559G45344K3503K4193K6436K9882L2712L4271L5997L8976M2350M5092M7609
63548A126365N0349N2518N3751N5411N8206N9773N7047N0315M2628L5568K7922
63537A669853J8587Q665J60n780r079j0708j2695j6563k1422k5090k7257k9884
63525A538787l4063l8404m1337m3213m5019m6357m6121m4212m1437l8425l5518
63514A084681l2927l0160k6084k0483j4793j0410p066l719j98L040N944Q526J0201
63501I66552J0711J1201J3181J6738K0746K4448K7807L0729L3178L5648L8512
$$ plain form
63490 1229451 1270692 1314075 1359861 1409351 1463194 1520496 1580286 1642694 1707334 1771079 1828718
63479 1828718 1875724 1909741 1930132 1937572 1934137 1922608 1905232 1883623 1859589 1834964 1810391 1785031
63467 1785031 1757741 1727911 1694966 1657778 1615067 1566178 1511393 1451797 1388911 1324181 1258999
63456 1258999 1195415 1136167 1083032 1035261 990601 947901 907889 871494 838630 808898 782249
63445 782249 758294 735956 714613 694833 677272 661595 647272 634615 623970 614601 605720 598273
63433 598273 594179 593561 593897 592359 588273 583064 578610 576013 575277 575661 576642 578554 581677 584783 585754 584242
63417 584242 582700 583828 587592 591818 595229 598528 602410 605925 607597 607370 606440 605492 604046 601642 598845
63402 598845 596571 594867 593098 591326 590833 592909 597525 603557 609963 616199 621856 626856 632177 639407
$$ packed form
63490A229451M1241M3383M5786M9490N3843N7302N9790O2408O4640O3745N7639
63479A828718M7006L4017K0391P440l435j1529j7376k1609k4034k4625k4573k5360
63467A785031k7290k9830l2945l7188m2711m8889n4785n9596o2886o4730o5182
63456A258999o3584n9248n3135m7771m4660m2700m0012l6395l2864k9732k6649
63445G82249k3955k2338k1343j9780j7561j5677j4323j2657j0645r369q881p447
63433E98273m094o18L36j538m086n209m454k597p36L84R81J912L123L106R71j512
63417E84242j542J128L764M226L411L299L882L515J672k27r30r48j446k404k797
63402E98845k274j704j769j772m93K076M616O032O406O236N657N000N321P230
$$ plain form
63388 639407 649086 660151 671696 684592 700456 719381 739874 761012 783574 808644 836091 865114
63376 865114 895719 928947 965925 1007151 1052358 1100433 1149576 1197979 1244368 1287781 1327320
63365 1327320 1362728 1394974 1425680 1455995 1486496 1518078 1552268 1590539 1633800 1682644 1737479
63354 1737479 1798024 1862912 1930016 1996933 2061007 2119260 2168640 2206496 2230984 2241557 2239331
63343 2239331 2226823 2207030 2182605 2155527 2126939 2096890 2064355 2027760 1985792 1938064 1885328
63332 1885328 1828810 1769057 1705777 1639392 1572460 1508577 1449744 1395584 1345210 1298754 1256556
63321 1256556 1218057 1182597 1150685 1123389 1100894 1082733 1069166 1061077 1058368 1059613 1063762 1071350
63309 1071350 1083533 1100523 1121531 1145776 1172932 1202800 1235093 1269733 1307274 1349025 1396486
$$ packed form
63388F39407R679J1065J1545J2896J5864J8925K0493K1138K2562K5070K7447K9023
63376H65114L0605L3228L6978M1226M5207M8075M9143M8403M6389M3413L9539
63365A327320L5408L2246L0706L0315L0501L1582L4190L8271M3261M8844N4835
63354A737479O0545O4888O7104O6917O4074N8253M9380L7856K4488J0573k226
63343B239331j2508j9793k4425k7078k8588l0049l2535l6595m1968m7728n2736
63332A885328n6518n9753o3280o6385o6932o3883n8833n4160n0374m6456m2198
63321A256556l8499l5460l1912k7296k2495j8161j3567q089k709J245M149P588
63309A071350J2183J6990K1008K4245K7156K9868L2293L4640L7541M1751M7461
$$ plain form
63298 1396486 1450169 1508836 1570299 1633188 1697717 1764589 1833492 1902716 1969761 2031821 2085975
63287 2085975 2129489 2160308 2177486 2181464 2174167 2158630 2138033 2114631 2089198 2061313 2030288 1995978
63275 1995978 1958639 1917990 1872849 1822191 1766366 1706889 1645273 1582675 1520498 1460319 1402859
63264 1402859 1347725 1294692 1244942 1200559 1163003 1132158 1106447 1083547 1061283 1038266 1013772
63253 1013772 987321 958985 929973 901851 874704 846864 817286 787589 760856 738570 719535
63242 719535 701628 683782 666155 649191 633072 617895 604071 592371 583305 576372 570325 564485
63230 564485 559397 555851 553741 552399 551385 550023 546675 539919 530723 522281 517127 515093 514437 514040 513745
63215 513745 513359 512503 511416 511045 512110 514543 517956 522195 527069 531822 535335 537182 538399 540922 546042
$$ packed form
63298A396486N3683N8667O1463O2889O4529O6872O8903O9224O7045O2060N4154
63287B085975M3514L0819J7178L978p297j5537k0597k3402k5433k7885l1025l4310
63275A995978l7339m0649m5141n0658n5825n9477o1616o2598o2177o0179n7460
63264A402859n5134n3033m9750m4383l7556l0845k5711k2900k2264k3017k4494
63253A013772k6451k8336k9012k8122k7147k7840k9578k9697k6733k2286j9035
63242G19535j7907j7846j7627j6964j6119j5177j3824j1700r066o933o047n840
63230E64485n088l546k110j342j014j362l348o756r196q442n154k034o56l97k95
63215E13745l86q56j087l71J065K433L413M239M874M753L513J847J217K523N120
$$ plain form
63200 546042 553446 561807 570027 577772 585252 593096 602256 613410 626375 640597 655990 672649 689889
63187 689889 706694 723382 741751 762986 786395 810984 837342 866762 899129 932997 967622
63176 967622 1003618 1041600 1081386 1122770 1165893 1210294 1254461 1297039 1337990 1378122 1417992
63165 1417992 1457598 1496548 1534073 1569447 1602884 1635566 1668372 1701016 1732629 1762316 1788666
63154 1788666 1809706 1824375 1833315 1837137 1834434 1822699 1800901 1770070 1731781 1687502 1639262 1589335
63142 1589335 1538977 1488825 1440703 1397271 1359203 1324312 1290575 1258757 1230948 1207794 1188723
63131 1188723 1173959 1164497 1160391 1160580 1164272 1171165 1180398 1190696 1201758 1214359 1228966 1245304 1263320
63118 1263320 1283267 1304394 1324628 1342214 1357076 1370286 1382800 1394835 1405573 1413128 1415568 1412446
$$ packed form
63200E46042P404Q361Q220P745P480P844R160J1154J2965J4222J5393J6659J7240
63187F89889J6805J6688J8369K1235K3409K4589K6358K9420L2367L3868L4625
63176I67622L5996L7982L9786M1384M3123M4401M4167M2578M0951M0132L9870
63165A417992L9606L8950L7525L5374L3437L2682L2806L2644L1613K9687K6350
63154A788666K1040J4669Q940L822k703j1735k1798l0831l8289m4279m8240m9927
63142A589335n0358n0152m8122m3432l8068l4891l3737l1818k7809k3154j9071
63131A188723j4764r462m106J89L692O893R233J0298J1062J2601J4607J6338J8016
63118A263320J9947K1127K0234J7586J4862J3210J2514J2035J0738P555K440l122
$$ plain form
63106 1412446 1404897 1394155 1380624 1364222 1344667 1321232 1293309 1261544 1227609 1192690 1157158
63095 1157158 1121719 1087382 1053915 1019899 985113 951506 920917 893202 867685 844995 825946
63084 825946 809709 794819 781248 769865 760426 751731 743431 736074 729627 723597 718504 715661 715245
63071 715245 715813 715915 715212 714127 713538 714661 717970 722335 726434 730722 736511 743439 749807 755362 761542
63056 761542 768520 774366 778217 782113 788138 795503 802246 808443 815660 824027 831980 838654 844703 850650
63042 850650 856068 860800 865797 872114 879724 887628 894684 900223 904366 907898 911614 915857 920832 926849
63028 926849 933727 940415 945962 950693 955743 961609 967903 974486 982085 991603 1003232 1016379 1030166
63015 1030166 1044124 1058806 1075680 1096026 1119971 1146841 1176152 1207758 1241305 1276289 1312737
$$ packed form
63106A412446p549j0742j3531j6402j9555k3435k7923l1765l3935l4919l5532
63095A157158l5439l4337l3467l4016l4786l3607l0589k7715k5517k2690j9049
63084H25946j6237j4890j3571j1383r439q695q300p357o447o030n093k843m16
63071G15245N68J02p03j085n89J123L309M365M099M288N789O928O368N555O180
63056G61542O978N846L851L896O025P365O743O197P217Q367P953O674O049N947
63042H50650N418M732M997O317P610P904P056N539M143L532L716M243M975O017
63028I26849O878O688N547M731N050N866O294O583P599R518J1629J3147J3787
63015A030166J3958J4682J6874K0346K3945K6870K9311L1606L3547L4984L6448
$$ plain form
63004 1312737 1351278 1392458 1436442 1483493 1534275 1589433 1649137 1713237 1781692 1854727 1932681
62993 1932681 2015712 2103507 2195260 2290034 2387159 2486273 2587002 2688566 2789563 2888300 2983779
62982 2983779 3076465 3167820 3258970 3350081 3440766 3530283 3617160 3699510 3776235 3847199 3911542
62971 3911542 3966418 4008300 4035190 4046644 4041911 4019212 3977224 3916584 3839497 3748434 3645809
62960 3645809 3534830 3419978 3305882 3195307 3088450 2984660 2884732 2790993 2705414 2628641
62950 2628641 2560966 2503016 2454846 2415516 2384588 2363170 2352254 2350625 2355719 2366059 2381373 2400566
62938 2400566 2421304 2442027 2463080 2485318 2508760 2533134 2558509 2584333 2608591 2629066 2645207
62927 2645207 2657861 2667190 2671588 2668828 2657725 2638364 2611022 2575420 2531260 2479064 2420018 2355099
$$ packed form
63004A312737L8541M1180M3984M7051N0782N5158N9704O4100O8455P3035P7954
62993A932681Q3031Q7795R1753R4774R7125R9114J00729J01564J00997R8737R5479
62982B983779R2686R1355R1150R1111R0685Q9517Q6877Q2350P6725P0964O4343
62971C911542N4876M1882K6890J1454m733k2699m1988o0640p7087r1063j02625
62960C645809j10979j14852j14096j10575j06857j03790r9928r3739q5579p6773
62950B628641o7675n7950m8170l9330l0928k1418j0916j629N094J0340J5314J9193
62938B400566K0738K0723K1053K2238K3442K4374K5375K5824K4258K0475J6141
62927B645207J2654R329M398k760j1103j9361k7342l5602m4160n2196n9046o4919
$$ plain form
62915 2355099 2285012 2211069 2135337 2059465 1984127 1910247 1839898 1774916 1715091 1658923 1605855
62904 1605855 1556527 1510989 1468253 1428020 1391486 1359631 1331579 1305346 1279554 1253915 1228728
62893 1228728 1204592 1182089 1161115 1140827 1120656 1100907 1082082 1064103 1046562 1029182 1011676
62882 1011676 993796 975870 958655 942285 926188 910565 897021 886770 878912 871490 863723 856074
62870 856074 848583 840565 832036 824144 817755 812499 807757 803853 801675 801417 802084 802017 799902 795859 791784
62855 791784 789973 790752 791856 790777 787570 784564 783244 782260 779138 773441 767317 762893 760066 757332 753913
62840 753913 750049 745619 739936 733294 727540 724224 722812 721623 720079 719044 719102 719628 719746 719266 718271 716658
62824 716658 714819 714129 715763 719077 721946 722799 721798 720058 718601 718315 719972 723315 726578 727887 727111
$$ packed form
62915B355099p0087p3943p5732p5872p5338p3880p0349o4982n9825n6168n3068
62904A605855m9328m5538m2736m0233l6534l1855k8052k6233k5792k5639k5187
62893A228728k4136k2503k0974k0288k0171j9749j8825j7979j7541j7380j7506
62882A011676j7880j7926j7215j6370j6097j5623j3544j0251p858p422p767p649
62870H56074p491q018q529p892o389n256m742l904k178k58O67o7k115m043m075
62855G91784j811P79J104j079l207l006j320r84l122n697o124m424k827k734l419
62840G53913l864m430n683o642n754l316j412j189j544j035N8N26J18m80r95j613
62824G16658j839o90J634L314K869Q53j001j740j457k86J657L343L263J309p76
$$ plain form
62809 727111 725564 724053 722346 720704 720476 722150 723847 723192 720362 717965 717846 719298 720702 721711 723018
62794 723018 724863 726816 728633 730388 731745 731958 730952 729972 730646 733384 736858 739154 739432 738439 737512 737267
62778 737267 737301 736938 735976 734796 733924 733579 733598 733918 734984 737296 740525 743648 746307 749461 754189 760351
62762 760351 767124 774387 782616 791561 800048 807270 813591 820052 827765 837759 850446 864946 879768
62749 879768 894509 910272 928131 947917 968974 991381 1015748 1042055 1069260 1096143 1122557
62738 1122557 1149994 1180714 1215893 1254873 1296629 1341393 1389968 1442068 1496843 1554988 1618715
62727 1618715 1689380 1766680 1850573 1942203 2042086 2149133 2262739 2384282 2514787 2652180
62717 2652180 2792707 2934375 3077093 3219687 3358650 3490040 3610996 3718892 3810211 3881134
$$ packed form
62809G27111j547j511j707j642k28J674J697o55k830k397j19J452J404J009J307
62794G23018J845J953J817J755J357K13j006r80O74K738L474K296K78r93r27k45
62778G37267L4l63r62j180q72l45J9L20J066K312L229L123K659L154M728O162
62762G60351O773P263Q229Q945Q487P222O321O461P713R994J2687J4500J4822
62749H79768J4741J5763J7859J9786K1057K2407K4367K6307K7205K6883K6414
62738A122557K7437L0720L5179L8980M1756M4764M8575N2100N4775N8145O3727
62727A618715P0665P7300Q3893R1630R9883J07047J13606J21543J30505J37393
62717B652180J40527J41668J42718J42594J38963J31390J20956J07896R1319P0923
$$ plain form
62707 3881134 3928925 3952575 3952445 3929288 3883375 3814885 3725359 3618170 3497123 3365453 3226684
62696 3226684 3085045 2943527 2802342 2661052 2521748 2388382 2263252 2145919 2035449
62687 2035449 1931769 1834592 1743148 1657761 1579962 1510052 1446020 1385946 1330184 1279998 1235232
62676 1235232 1194801 1158612 1127455 1101281 1078920 1059435 1042616 1028070 1014742 1001728 989092
62665 989092 977690 968448 961810 957648 955723 956338 960336 968297 979914 994165 1009715 1025215 1040014
62652 1040014 1055066 1072656 1094748 1121834 1153526 1189560 1229583 1272541 1317281 1363827 1413640
62641 1413640 1468653 1530212 1598455 1672040 1748597 1826018 1903357 1980199 2055578 2128132 2196950
62630 2196950 2261196 2318769 2366459 2402105 2425819 2438209 2437911 2422173 2390122 2344385 2288877 2225835
$$ packed form
62707C881134M7791K3650j30k3157m5913o8490q9526j07189j21047j31670j38769
62696C226684j41639j41518j41185j41290j39304j33366j25130j17333j10470
62687B035449j03680r7177r1444q5387p7799o9910o4032o0074n5762n0186m4766
62676A235232m0431l6189l1157k6174k2361j9485j6819j4546j3328j3014j2636
62665I89092j1402r242o638m162j925O15L998P961J1617J4251J5550J5500J4799
62652A040014J5052J7590K2092K7086L1692L6034M0023M2958M4740M6546M9813
62641A413640N5013O1559O8243P3585P6557P7421P7339P6842P5379P2554O8818
62630B196950O4246N7573M7690L5646K3714J2390k98j5738l2051m5737n5508o3042
$$ plain form
62618 2225835 2155912 2080442 2001978 1922312 1841403 1759120 1677100 1597749 1521959 1449159 1379548
62607 1379548 1314958 1256938 1204808 1156284 1109670 1064928 1022910 984210 948913 917064 888893
62596 888893 864382 842849 823445 806052 791168 778749 767778 757364 747588 738626 729664 719666
62584 719666 708987 699231 691538 685706 680967 676840 673278 670758 670239 672218 675763 679172 681586 683222
62570 683222 684178 684115 683243 682604 683050 684741 687834 692693 699094 706148 713320 720668 727887 734294 740180 747055
62554 747055 755978 766767 779441 795095 814279 835634 857505 880219 905485 934028 965104 998141
62542 998141 1033660 1072461 1114741 1160130 1208139 1258712 1312658 1371113 1434152 1500478 1568909
62531 1568909 1639212 1710485 1779497 1842105 1896112 1941555 1978356 2005041 2020087 2023373 2015621 1996974
$$ packed form
62618B225835o9923p5470p8464p9666q0909q2283q2020p9351p5790p2800o9611
62607A379548o4590n8020n2130m8524m6614m4742m2018l8700l5297l1849k8171
62596H88893k4511k1533j9404j7393j4884j2419j0971j0414r776q962q962r998
62584G19666j0679r756p693n832m739m127l562k520n19J979L545L409K414J636
62570F83222R56o3q72o39M46J691L093M859O401P054P172P348P219O407N886O875
62554G47055Q923J0789J2674J5654J9184K1355K1871K2714K5266K8543L1076L3037
62542I98141L5519L8801M2280M5389M8009N0573N3946N8455O3039O6326O8431
62531A568909P0303P1273O9012O2608N4007M5443L6801K6685J5046L286p752j8647
$$ plain form
62519 1996974 1966792 1924890 1872895 1814276 1752595 1689475 1624657 1558165 1491574 1426691 1363984
62508 1363984 1303294 1245301 1191092 1140839 1094250 1051863 1014357 980708 948662 917335 888099
62497 888099 862573 841041 823224 809264 799084 791675 785788 780753 776072 770851 764261 756134 746853
62484 746853 737197 728564 722552 719705 719154 719827 721439 724060 727512 731808 737471 744698 752698 760529 768279
62469 768279 776812 786683 797839 810104 823349 837429 852539 869569 889560 912820 938930 967581
62457 967581 999074 1033971 1072472 1114145 1158144 1203684 1250259 1297330 1344050 1389618 1433619
62446 1433619 1475386 1513146 1544711 1569295 1587940 1601849 1610965 1614487 1611883 1602926 1587783 1568065
62434 1568065 1547072 1527801 1511020 1496226 1483979 1475921 1472622 1472953 1476077 1482929 1495047 1512788
$$ packed form
62519A996974l0182m1902n1995n8619o1681o3120o4818o6492o6591o4883o2707
62508A363984o0690n7993n4209n0253m6589m2387l7506l3649l2046l1327k9236
62497H88099k5526k1532j7817j3960j0180p409n887n035m681n221o590q127r281
62484G46853r656q633o012k847n51O73J612K621L452M296N663P227Q000P831P750
62469G68279Q533R871J1156J2265J3245J4080J5110J7030J9991K3260K6110K8651
62457I67581L1493L4897L8501M1673M3999M5540M6575M7071M6720M5568M4001
62446A433619M1767L7760L1565K4584J8645J3909R116L522k604q957j5143j9718
62434A568065k0993j9271j6781j4794j2247q058l299L31L124O852J2118J7741
$$ plain form
62422 1512788 1535421 1562333 1593398 1628623 1668165 1712298 1760528 1810904 1861049 1909970 1958145
62411 1958145 2005549 2050054 2088104 2116766 2134996 2143231 2142012 2130937 2108960 2075821 2032987 1982678
62399 1982678 1926125 1863578 1796194 1726863 1658288 1590886 1523653 1456811 1392464 1332645 1277904
62388 1277904 1228012 1182854 1142019 1104674 1070815 1041927 1019289 1001970 987431 973910 961459
62377 961459 950984 943162 938118 935179 932940 930366 927768 925863 923985 920267 913669 904777 894423 882732
62363 882732 869986 857222 845067 832773 819281 804652 789650 774543 759379 745082 733182
62352 733182 724369 717959 712701 707475 701379 694120 686568 680247 675927 673105 671008 669562 669179 670172 672753
62337 672753 677021 682267 686615 688292 687572 686869 688404 692082 696168 699759 703705 708980 715121 720996 726538
$$ packed form
62422A512788K2633K6912L1065L5225L9542M4133M8230N0376N0145M8921M8175
62411A958145M7404M4505L8050K8662J8230Q235j219j1075k1977l3139m2834n0309
62399A982678n6553o2547o7384o9331o8575o7402o7233o6842o4347n9819n4741
62388A277904m9892m5158m0835l7345l3859k8888k2638j7319j4539j3521j2451
62377I61459j0475p822n044k939k239k574k598j905j878l718o598q892j0354j1691
62363H82732j2746j2764j2155j2294j3492j4629j5002j5107j5164j4297j1900
62352G33182q813o410n258n226o096p259p552o321m320k822k097j446l83R93K581
62337F72753M268N246M348J677p20p03J535L678M086L591L946N275O141N875N542
$$ plain form
62322 726538 732749 740282 749107 759643 772977 789305 806960 823931 840071 857187 877225 900958
62310 900958 928044 957470 987912 1018642 1050610 1086183 1127192 1173340 1222966 1275371 1331940
62299 1331940 1394736 1464329 1539522 1619173 1703560 1793545 1888854 1987858 2088662 2189353 2286992
62288 2286992 2377373 2456660 2522975 2575875 2614567 2637390 2643191 2632785 2608701 2573375 2527543
62277 2527543 2470595 2402645 2326080 2244665 2161278 2077062 1992719 1909827 1830479 1756242 1687878
62266 1687878 1625608 1569197 1518175 1472382 1431878 1396012 1363075 1331388 1300323 1269885 1239863
62255 1239863 1209906 1179841 1149315 1117738 1085346 1053771 1024640 998097 973462 950701 929984
62244 929984 910414 890928 872417 857247 846165 837146 827970 818681 810722 804851 800983 799167 799430
$$ packed form
62322G26538O211P533Q825J0536J3334J6328J7655J6971J6140J7116K0038K3733
62310I00958K7086K9426L0442L0730L1968L5573M1009M6148M9626N2405N6569
62299A331940O2796O9593P5193P9651Q4387Q9985R5309R9004J00804J00691R7639
62288B286992R0381P9287O6315N2900L8692K2823N801j0406k4084l5326m5832
62277B527543n6948o7950p6565q1415q3387q4216q4343q2892p9348p4237o8364
62266A687878o2270n6411n1022m5793m0504l5866l2937l1687l1065l0438l0022
62255A239863k9957l0065l0526l1577l2392l1575k9131k6543k4635k2761k0717
62244I29984j9570j9486j8511j5170j1082r019r176r289p959n871l868j816K63
$$ plain form
62231 799430 801072 803161 805484 808167 810708 812421 813826 816737 822741 831970 843264 855078 866378
62218 866378 877231 888627 901425 915655 931066 947813 965983 984931 1004120 1024508 1048049
62207 1048049 1075618 1106349 1139362 1175262 1215354 1260085 1308992 1361827 1419015 1481196 1548884
62196 1548884 1622550 1702592 1789129 1881994 1980619 2083493 2187874 2290415 2387941 2477239 2554542
62185 2554542 2616298 2660954 2689426 2703377 2703381 2689109 2660712 2619190 2565483 2500028 2423541 2337684
62173 2337684 2244612 2146269 2044644 1942461 1842932 1748523 1660148 1577649 1500868 1430123 1365831
62162 1365831 1307872 1255500 1207972 1165282 1128006 1096238 1068971 1044938 1023883 1006373 992312
62151 992312 980449 969834 961058 955233 952084 950082 948495 948218 950077 953277 956545 960333 966632 976372
$$ packed form
62231G99430J642K089K323K683K541J713J405K911O004R229J1294J1814J1300
62218H66378J0853J1396J2798J4230J5411J6747J8170J8948J9189K0388K3541
62207A048049K7569L0731L3013L5900M0092M4731M8907N2835N7188O2181O7688
62196A548884P3666Q0042Q6537R2865R8625J02874J04381J02541R7526Q9298P7303
62185B554542O1756M4656K8472J3951Mj4272k8397m1522n3707o5455p6487q5857
62173B337684r3072r8343j01625j02183r9529r4409q8375q2499p6781p0745o4292
62162A365831n7959n2372m7528m2690l7276l1768k7267k4033k1055j7510j4061
62151I92312j1863j0615q776n825l149k002j587k77J859L200L268L788O299R740
$$ plain form
62137 976372 987917 998671 1007582 1015458 1023250 1030889 1037849 1044120 1050309 1057209 1065520 1075602 1087138
62124 1087138 1099314 1111717 1124830 1139162 1154120 1168414 1181666 1195002 1209831 1226591 1245044
62113 1245044 1265218 1287446 1311866 1338624 1368450 1402431 1441259 1485241 1534899 1590750 1652454
62102 1652454 1718983 1789746 1864525 1941794 2018050 2089532 2153790 2208683 2250858 2277091 2287345
62091 2287345 2285164 2274524 2256949 2231772 2198041 2155539 2104832 2047260 1984775 1919462 1853488
62080 1853488 1789360 1729312 1673966 1622418 1574214 1530446 1492339 1459733 1432003 1409672 1393700
62069 1393700 1383430 1376677 1371995 1369740 1370622 1374100 1378589 1382507 1384834 1385296 1384286 1382160 1378606 1373335
62055 1373335 1367241 1361734 1356740 1350509 1341877 1331555 1320479 1308041 1293212 1276731 1260833 1247029
$$ packed form
62137I76372J1545J0754Q911P876P792P639O960O271O189O900Q311J0082J1536
62124A087138J2176J2403J3113J4332J4958J4294J3252J3336J4829J6760J8453
62113A245044K0174K2228K4420K6758K9826L3981L8828M3982M9658N5851O1704
62102A652454O6529P0763P4779P7269P6256P1482O4258N4893M2175K6233J0254
62091B287345k181j0640j7575k5177l3731m2502n0707n7572o2485o5313o5974
62080A853488o4128o0048n5346n1548m8204m3768l8107l2606k7730k2331j5972
62069A393700j0270o753m682k255Q82L478M489L918K327M62j010k126l554n271
62055A373335o094n507m994o231q632j0322j1076j2438j4829j6481j5898j3804
$$ plain form
62043 1247029 1235331 1225543 1218069 1213082 1209925 1208034 1207940 1210693 1216462 1224096 1232078 1239642 1246953 1254484
62029 1254484 1262578 1271677 1282557 1295707 1310496 1325586 1340485 1356181 1373888 1393659 1414762 1436957
62017 1436957 1460723 1486491 1514435 1544890 1578208 1614119 1651893 1691211 1732159 1774266 1816484
62006 1816484 1858717 1902709 1950614 2002879 2058172 2115128 2173293 2232137 2289852 2343620 2390769
61995 2390769 2429342 2457963 2475914 2483371 2480977 2468874 2446561 2413903 2371735 2321047 2262041 2194741
61983 2194741 2120326 2041165 1959658 1877721 1797124 1719117 1643431 1568876 1495687 1426397 1363518
61972 1363518 1307105 1255514 1207829 1164118 1123745 1085246 1048394 1015093 987307 964784 945446
61961 945446 927370 909702 892309 875585 860502 847802 836787 825533 812848 799768 788644
$$ packed form
62043A247029j1698r788p474m987l157j891r4K753N769P634P982P564P311P531
62029A254484Q094R099J0880J3150J4789J5090J4899J5696J7707J9771K1103K2195
62017A436957K3766K5768K7944L0455L3318L5911L7774L9318M0948M2107M2218
62006A816484M2233M3992M7905N2265N5293N6956N8165N8844N7715N3768M7149
61995B390769L8573K8621J7951P457k394j2103k2313l2658m2168n0688n9006o7300
61983B194741p4415p9161q1507q1937q0597p8007p5686p4555p3189o9290o2879
61972A363518n6413n1591m7685m3711m0373l8499l6852l3301k7786k2523j9338
61961I45446j8076j7668j7393j6724j5083j2700j1015j1254j2685j3080j1124
$$ plain form
61950 788644 780760 775225 770226 765019 760404 757489 756451 756490 756646 756534 756591 757727 760478 764447 768847 773581
61934 773581 779178 785479 791082 794685 796574 798126 800092 801856 802190 800153 795413 788407 780294 772299
61920 772299 764977 758238 751802 745272 738154 730395 722681 715621 708956 702275 696129 691381 687578 683133
61906 683133 677408 671572 667049 664064 662249 661687 662524 664111 665430 666086 666333 666366 666193 666040 666345 667434
61890 667434 669513 672793 677456 683743 692194 703185 715884 728358 739468 750301 762963 778090
61878 778090 794297 810092 825630 842300 861051 881425 902032 921619 939671 956102 970695
61867 970695 983068 993094 1000950 1006802 1010881 1013774 1015842 1016088 1012572 1004652 994210 983843 974443
61854 974443 965629 958069 953674 953051 954133 954336 953418 953337 955800 961011 968725 979257 992700 1007650 1021542
$$ packed form
61950G88644p884n535m999n207m615k915j038L9J56j12N7J136K751L969M400M734
61934G73581N597O301N603L603J889J552J966J764L34k037m740p006q113p995
61920G72299p322o739o436o530p118p759p714p060o665o681o146m748l803m445
61906F83133n725n836m523k985j815n62Q37J587J319O56K47L3j73j53L05J089
61890F67434K079L280M663O287Q451J0991J2699J2474J1110J0833J2662J5127
61878G78090J6207J5795J5538J6670J8751K0374K0607J9587J8052J6431J4593
61867I70695J2373J0026P856N852M079K893K068K46l516p920j0442j0367r400
61854I74443q814p560m395o23J082K03r18q1K463N211P714J0532J3443J4950J3892
$$ plain form
61839 1021542 1032334 1039486 1043313 1044030 1041778 1037126 1030826 1023094 1013636 1002452 990104 976952 962618
61826 962618 946650 929551 912802 897860 885265 874574 864930 855676 846487 837014 826836 816163
61814 816163 806322 798733 793304 788552 783589 779199 776526 775548 775626 776882 779900 784322 788974 793623 799764
61799 799764 809282 822777 839391 857697 876495 895293 914559 935383 958599 984223 1011721 1040572
61787 1040572 1070357 1100403 1129636 1157093 1182768 1207674 1232515 1256343 1277162 1293881 1306739
61776 1306739 1315427 1318214 1314196 1305565 1295896 1286402 1275518 1262352 1248798 1237557 1229593 1224579 1222633
61763 1222633 1224101 1228141 1232887 1237158 1241201 1245715 1250521 1254013 1253640 1247446 1235663 1220335 1202799
61750 1202799 1182117 1156783 1127407 1096596 1066415 1037131 1008452 980796 954848 930736 908165
$$ packed form
61839A021542J0792P152L827P17k252m652o300p732r458j1184j2348j3152j4334
61826I62618j5968j7099j6749j4942j2595j0691r644r254r189r473j0178j0673
61814H16163r841p589n429m752m963m390k673r78P8J256L018M422M652M649O141
61799G99764R518J3495J6614J8306J8798J8798J9266K0824K3216K5624K7498K8851
61787A040572K9785L0046K9233K7457K5675K4906K4841K3828K0819J6719J2858
61776A306739Q688K787m018q631r669r494j0884j3166j3554j1241p964n014j946
61763A222633J468M040M746M271M043M514M806L492l73o194j1783j5328j7536
61750A202799k0682k5334k9376l0811l0181k9284k8679k7656k5948k4112k2571
$$ plain form
61739 908165 886874 866623 847208 828780 811736 796068 781257 767002 753536 741032 729249
61728 729249 718101 708058 699612 692654 686654 681152 675940 671229 667799 666339 666362 666392 665566 664335 663149
61713 663149 661376 658346 654742 651862 649965 648432 647261 647131 648035 649047 649683 650516 652153 654538 657568
61698 657568 661434 665927 670202 673668 676391 678372 679422 680258 682502 686674 691033 693566 694414 695112 695926
61683 695926 695435 692777 689021 685905 684076 682997 681996 680965 680316 680478 681339 682293 682966 683566 684216 684530
61667 684530 684441 684917 686976 690348 693933 697250 700473 703419 705641 707333 708969 710235 710654 711100 713032
61652 713032 716123 718459 719471 720662 722640 723529 721810 718881 716866 715213 711721 706143 700437 695687
61638 695687 691020 685796 680914 677318 674708 672386 670157 667784 664634 660575 656446 653030 650166 647276
$$ packed form
61739I08165k1291k0251j9415j8428j7044j5668j4811j4255j3466j2504j1783
61728G29249j1148j0043q446o958o000n502n212m711l430j460K3L0q26j231j186
61713F63149j773l030l604k880j897j533j171j30R04J012O36Q33J637K385L030
61698F57568L866M493M275L466K723J981J050Q36K244M172M359K533Q48O98Q14
61683F95926m91k658l756l116j829j079j001j031o49J62Q61R54O73O00O50L14
61667F84530q9M76K059L372L585L317L223K946K222J692J636J266M19M46J932
61652G13032L091K336J012J191J978Q89j719k929k015j653l492n578n706m750
61638F95687m667n224m882l596k610k322k229k373l150m059m129l416k864k890
$$ plain form
61624 647276 644178 641022 637979 635143 632234 628491 623752 619547 617860 618501 619016 617852 616401 616867 618992
61609 618992 620136 618297 614073 609758 607291 607018 607882 608635 608964 609298 609668 609459 608521 607630 607321 606991 605859
61592 605859 604265 603304 603646 605366 608304 611715 614078 614434 613739 613934 615721 618098 619998 621411 622926
61577 622926 625226 629182 635280 642334 647593 648955 646819 643359 640348 638063 635813 632863 628904 624175
61563 624175 619363 615252 612260 610150 608112 605333 601749 598077 594840 591686 588154 584847 583058 583217
61549 583217 584446 585660 586197 585151 581295 574510 566536 559232 552548 545204 537054 529514 523539 518351
61535 518351 512759 506882 501805 497963 494548 490380 484917 478566 472420 467572 464249 461697 459171 456821
61521 456821 455177 454042 452641 450824 449260 448135 446494 443588 440223 437837 436463 434603 431217 427026
$$ packed form
61624F47276l098l156l043k836k909l743m739m205j687O41N15j164j451M66K125
61609F18992J144j839m224m315k467k73Q64P53L29L34L70k09r38q91l09l30j132
61592F05859j594r61L42J720K938L411K363L56o95J95J787K377J900J413J515
61577F22926K300L956O098P054N259J362k136l460l011k285k250k950l959m729
61563F24175m812m111k992k110k038k779l584l672l237l154l532l307j789J59
61549E83217J229J214N37j046l856o785p974p304o684p344q150p540n975n188
61535E18351n592n877n077l842l415m168n463o351o146m848l323k552k526k350
61521D56821j644j135j401j817j564j125j641k906l365k386j374j860l386m191
$$ plain form
61507 427026 423652 422150 422604 424321 425941 426073 424577 422760 421740 421107 419986 418904 419409 421888 424859
61492 424859 426742 427439 427750 428041 428142 428165 428783 430782 434462 439114 442978 444370 443276 441435 440449 440252
61476 440252 439763 438464 436735 435234 434732 436089 439311 442731 444134 443004 441015 440167 441000 442708 444204
61461 444204 444718 443971 442253 440093 437689 434964 432152 429809 428167 427086 426684 427302 428603 429618 430064
61446 430064 430751 432038 432760 431606 428923 426136 423928 422188 421369 422388 424906 427001 427175 425898 424677
61431 424677 424404 425148 426837 429314 432066 434624 436955 438928 439686 438332 435313 432525 431760 433266 435922
61416 435922 438567 440958 443503 446287 448647 449868 450153 450465 451353 452347 452776 452727 452718 452688 452059 450925 450527 451994
61398 451994 454797 456956 456896 454795 452067 450003 449274 450292 453084 456639 459242 460148 460514 461990 464635
$$ packed form
61507D27026l374j502M54J717J620J32j496j817j020o33j121j082N05K479K971
61492D24859J883O97L11K91J01K3O18J999L680M652L864J392j094j841r86j97
61476D40252m89j299j729j501n02J357L222L420J403j130j989q48Q33J708J496
61461D44204N14p47j718k160k404k725k812k343j642j081m02O18J301J015M46
61446D30064O87J287P22j154k683k787k208j740q19J019K518K095J74j277j221
61431D24677k73P44J689K477K752K558K331J973P58j354l019k788p65J506K656
61416D35922K645K391K545K784K360J221K85L12Q88R94M29m9rl0o29j134l98J467
61398D51994K803K159o0k101k728k064p29J018K792L555K603R06L66J476K645
$$ plain form
61383 464635 466951 467800 467497 466977 466711 466684 466729 466514 465781 465022 465481 468028 472357 477468 482512 486894 490208
61366 490208 492593 494716 496900 498713 499879 501074 503162 506026 508882 511478 514259 517540 521243 525246
61352 525246 529203 532120 533070 532556 532412 534007 537012 540065 542057 542549 541587 539600 537151 534490 531625
61337 531625 528858 526740 525264 523712 521740 520092 519652 520141 520441 520069 519549 519233 518485 516594 514108 512521
61321 512521 512477 512846 512067 510254 509392 511208 515254 519455 522365 524389 526839 530277 534120 537584 540600
61306 540600 543747 547442 551407 554895 557395 559061 560559 562497 564888 567022 568061 568031 568156 569973 574242
61291 574242 580918 589696 599728 609062 615653 619486 622824 627754 634184 640843 647213 653413 659001 663441
61277 663441 667555 673059 680386 688077 694620 699920 704630 709047 713197 717191 720818 723369 724534 725101
$$ packed form
61383D64635K316Q49l03n20k66k7M5k15p33p59M59K547M329N111N044M382L314
61366D90208K385K123K184J813J166J195K088K864K856K596K781L281L703M003
61352E25246L957K917R50n14j44J595L005L053J992M92r62j987k449k661k865
61337E31625k767k118j476j552j972j648m40M89L00l72n20l16p48j891k486j587
61321E12521m4L69p79j813q62J816M046M201K910K024K450L438L843L464L016
61306E40600L147L695L965L488K500J666J498J938K391K134J039l0J25J817M269
61291E74242O676Q778J0032R334O591L833L338M930O430O659O370O200N588M440
61277F63441M114N504P327P691O543N300M710M417M150L994L627K551J165N67
$$ plain form
61263 725101 726238 728256 730418 731775 731970 731555 731764 733692 737434 742208 747366 753032 759779 768204 778922
61248 778922 792366 808150 824917 841092 855749 868870 881137 893482 906303 918954 930228
61237 930228 939252 945449 947956 946118 940847 934663 929716 926065 922129 916409 908520 899006 888601 877569
61223 877569 865698 853055 840446 828696 817800 807442 797936 789778 782606 775884 770387 767545 767229
61210 767229 767760 768401 770093 773163 776209 778290 780473 783924 788090 792363 797844 805383 813147 818647 822470
61195 822470 827472 834551 841729 847504 852586 857695 861958 864614 866501 868647 870930 873266 876723 881936
61181 881936 887443 891182 893164 895280 898764 902964 906562 908974 910501 911927 914147 917547 921513 924866
61167 924866 926977 928316 929947 932706 936856 942393 949544 958714 969703 981155 991304 999495 1006702
$$ packed form
61263G25101J137K018K162J357J95m15K09J928L742M774N158N666O747Q425J0718
61248G78922J3444J5784J6767J6175J4657J3121J2267J2345J2821J2651J1274
61237I30228R024O197K507j838n271o184m947l651l936n720p889r514j0405j1032
61223H77569j1871j2643j2609j1750j0896j0358r506q158p172o722n497k842l16
61210G67229N31O41J692L070L046K081K183L451M166M273N481P539P764N500L823
61195H22470N002P079P178N775N082N109M263K656J887K146K283K336L457N213
61181H81936N507L739J982K116L484M200L598K412J527J426K220L400L966L353
61167I24866K111J339J631K759M150N537P151R170J0989J1452J0149Q191P207
$$ plain form
61154 1006702 1014573 1024146 1035345 1047087 1057869 1066818 1074362 1081536 1088697 1095506 1102027 1108871 1116068
61141 1116068 1122921 1129500 1137184 1146758 1156864 1165607 1173287 1182119 1193212 1205190 1216261 1226431 1236703
61128 1236703 1246849 1255251 1260923 1264554 1267135 1268459 1267793 1265468 1262688 1259787 1255806 1250262 1244287 1239100
61114 1239100 1234078 1227526 1219171 1210690 1203586 1197495 1190962 1183113 1174157 1164877 1156125 1148367 1141287 1134111
61100 1134111 1126448 1118316 1109282 1098512 1086186 1074063 1063709 1054574 1044731 1033431 1022134 1012938
61088 1012938 1006520 1001748 996882 990968 984266 977472 970599 962910 954006 944492 935253 926577 918501 911565
61074 911565 906478 903242 901372 900810 901761 903649 905287 906544 908978 914078 921465 929574 937766 946917 958044
61059 958044 971289 986426 1003559 1022783 1043719 1066017 1090104 1116817 1146368 1178140 1211448
$$ packed form
61154A006702P871R573J1199J1742J0782Q949P544P174P161O809O521O844P197
61141A116068O853O579P684R574J0106Q743P680Q832J1093J1978J1071J0170J0272
61128A236703J0146Q402N672L631K581J324o66k325k780k901l981n544n975n187
61114A239100n022o552q355q481p104o091o533p849q956r280q752p758p080p176
61100A134111p663q132r034j0770j2326j2123j0354r135r843j1300j1297r196
61088A012938o418m772m866n914o702o794o873p689q904r514r239q676q076o936
61074I11565n087l236j870n62R51J888J638J257K434N100P387Q109Q192R151J1127
61059I58044J3245J5137J7133J9224K0936K2298K4087K6713K9551L1772L3308
$$ plain form
61048 1211448 1245832 1280485 1314091 1345747 1375597 1403979 1430323 1453689 1474342 1493884 1513309
61037 1513309 1531394 1545606 1554437 1558393 1558774 1556109 1550104 1540709 1528630 1514652 1498938 1481362 1462230
61024 1462230 1442164 1421306 1399252 1375999 1352412 1329331 1306607 1283623 1260587 1238722 1219116
61013 1219116 1201858 1186429 1172506 1160227 1149935 1141866 1135881 1131516 1128505 1127307 1128864 1133810 1142056
61000 1142056 1152989 1165765 1179650 1194749 1212375 1233937 1259183 1286363 1314683 1345787 1381751
60989 1381751 1422074 1464067 1506463 1551335 1601646 1657972 1718876 1783853 1854144 1930476 2011734
60978 2011734 2096888 2187063 2284359 2389267 2500601 2617581 2740565 2869895 3005676 3149072
60968 3149072 3302490 3468094 3647432 3842883 4057671 4293467 4549513 4825694 5125538
$$ packed form
61048A211448L4384L4653L3606L1656K9850K8382K6344K3366K0653J9542J9425
61037A513309J8085J4212Q831L956L81k665o005r395j2079j3978j5714j7576j9132
61024A462230k0066k0858k2054k3253k3587k3081k2724k2984k3036k1865j9606
61013A219116j7258j5429j3923j2279j0292q069n985m365l011j198J557M946Q246
61000A142056J0933J2776J3885J5099J7626K1562K5246K7180K8320L1104L5964
60989A381751M0323M1993M2396M4872N0311N6326O0904O4977P0291P6332Q1258
60978B011734Q5154R0175R7296J04908J11334J16980J22984J29330J35781J43396
60968C149072J53418J65604J79338J95451K14788K35796K56046K76181K99844
$$ plain form
60959 5125538 5455129 5820422 6227316 6683178 7196136 7773348 8421704 9149330 9964455
60950 9964455 10874339 11889352 13028887 14321294 15799203 17497026 19442929 21625843
60942 21625843 23943398 26180658 28068236 29400551 30129257 30364022 30298121 30131417 30030568
60933 30030568 30101549 30344345 30617597 30672952 30267246 29280077 27753086 25838878 23718606
60924 23718606 21547332 19437614 17460609 15651167 14017531 12554324 11251761 10098412
60916 10098412 9081770 8189522 7410031 6731428 6141421 5628491 5182549 4794392 4455380
60907 4455380 4157819 3894921 3660451 3449319 3258730 3087841 2935708 2799858 2677040
60898 2677040 2565027 2463364 2372330 2291067 2216826 2146502 2079081 2016062 1959224 1908689 1863508
$$ packed form
60959E125538L29591L65293M06894M55862N12958N77212O48356P27626Q15125
60950I964455R09884J015013J139535J292407J477909J697823J945903K182914
60942B1625843K317555K237260J887578J332315P28706K34765o5901j66704j00849
60933C0030568P0981K42796K73252N5355m05706r87169j526991j914208k120272
60924B3718606k171274k109718j977005j809442j633636j463207j302563j153349
60916A0098412j016642q92248p79491o78603n90007n12930m45942l88157l39012
60907D455380k97561k62898k34470k11132j90589j70889j52133j35850j22818
60898B677040j12013j01663r1034q1263p4241p0324o7421o3019n6838n0535m5181
$$ plain form
60887 1863508 1823121 1787250 1755097 1725874 1699899 1678060 1660334 1645790 1633935 1624997 1618883 1615034
60875 1615034 1613453 1614729 1618395 1622197 1623898 1623561 1623409 1625475 1629806 1635003 1640192 1646047 1653652 1662689
60861 1662689 1671527 1679348 1687411 1697566 1709943 1722804 1734297 1743577 1750497 1755165 1757839 1758530 1756586
60848 1756586 1751286 1742845 1732205 1719736 1704815 1686812 1665838 1642332 1616492 1588454 1558756 1528446
60836 1528446 1498936 1471569 1446775 1423560 1400318 1376260 1351672 1326864 1301587 1275804 1250335
60825 1250335 1226087 1202869 1179687 1156398 1134561 1115977 1100337 1084913 1067132 1047166 1027439
60814 1027439 1009924 994844 981804 970763 961289 952067 942135 931924 922285 913181 904227 895714 887944
60801 887944 880125 871192 861346 851580 842011 832017 821884 812940 805868 799992 794362 788473 781776 773618
$$ packed form
60887A863508m0387l5871l2153k9223k5975k1839j7726j4544j1855q938o114l849
60875A615034j581J276L666L802J701l37j52K066M331N197N189N855P605R037
60861A662689Q838P821Q063J0155J2377J2861J1493R280O920M668K674O91j944
60848A756586n300q441j0640j2469j4921j8003k0974k3506k5840k8038k9698l0310
60836A528446k9510k7367k4794k3215k3242k4058k4588k4808k5277k5783k5469
60825A250335k4248k3218k3182k3289k1837j8584j5640j5424j7781j9966j9727
60814A027439j7515j5080j3040j1041r474r222r932j0211r639r104q954q513p770
60801H87944p819q933r846r766r569r994j0133q944p072n876n630n889o697q158
$$ plain form
60787 773618 764179 754772 746911 741517 738737 737577 735930 732107 726382 720048 713248 705192 696432 688914
60773 688914 683175 677189 669058 659539 650860 644186 639457 636644 635591 635032 633181 629466 624995 621432
60759 621432 619789 619955 620803 621207 621522 623522 628117 633631 637210 637765 636760 636175 636484 636816 636511 636103 636763
60742 636763 638879 641474 643318 644363 645394 646376 646137 644042 641062 638516 636483 634244 631811 630116 629734
60727 629734 630026 629616 627588 624258 620762 617507 613292 606801 598921 592289 588039 584283 578781 572110 566882
60712 566882 564564 564437 565331 566777 568280 568825 567778 565618 563328 561442 559916 558433 556674 554696 553263
60697 553263 553445 555708 559514 563800 567634 570546 572684 574792 577716 581703 586129 589972 592629 594543
60683 594543 597041 601249 606949 612646 616816 618896 619115 617883 615525 612130 607337 600621 592168 583185
$$ packed form
60787G73618r439r407p861n394k780j160j647l823n725o334o800q056q760p518
60773F88914n739n986q131r519q679o674m729k813j053n59j851l715m471l563
60759F21432j643J66Q48M04L15K000M595N514L579N55j005n85L09L32l05m08O60
60742F36763K116K595J844J045J031R82k39k095k980k546k033k239k433j695l82
60727F29734K92m10k028l330l496l255m215o491p880o632m250l756n502o671n228
60712E66882k318j27Q94J446J503N45j047k160k290j886j526j483j759j978j433
60697E53263J82K263L806M286L834K912K138K108K924L987M426L843K657J914
60683E94543K498M208N700N697M170K080K19j232k358l395m793o716q453q983
$$ plain form
60669 583185 574992 567900 561146 553765 545565 537548 531340 527755 525929 524322 522406 520582 518579 515171
60655 515171 509935 504271 500006 497677 496597 495742 493983 490469 485704 481530 479154 477804 476189 474534
60641 474534 474135 475371 477274 478760 479394 479242 478851 479010 479868 480761 481684 484098 489084 495365 500617 504408
60625 504408 508319 513296 518467 522765 526214 529168 531534 533364 535335 538116 541957 547084 553659 561109
60611 561109 568451 575588 583373 591963 599998 605892 609320 610961 611557 611736 612199 613386 615154 617018 618408
60596 618408 618738 617813 616251 614854 613524 611564 609072 606946 605207 602583 598650 595372 595210 598005 600747
60581 600747 600468 596713 591227 585981 581754 578171 574666 571220 568117 565170 561610 556981 551860 547372
60567 547372 543993 541015 537295 532638 528384 526408 527360 530127 533066 535293 536553 536682 535958 535386 535600
$$ packed form
60669E83185q193p092o754p381q200q017o208l585j826j607j916j824k003l408
60655E15171n236n664m265k329j080q55j759l514m765m174k376j350j615j655
60641D74534l99J236J903J486O34j52l91J59Q58Q93R23K414M986O281N252L791
60625E04408L911M977N171M298L449K954K366J830J971K781L841N127O575P450
60611E61109P342P137P785Q590Q035N894L428J641N96J79M63J187J768J864J390
60596F18408L30r25j562j397j330j960k492k126j739k624l933l278j62K795K742
60581F00747k79l755n486n246m227l583l505l446l103k947l560m629n121m488
60567E47372l379k978l720m657m254j976R52K767K939K227J260J29p24n72K14
$$ plain form
60552 535600 535837 535105 534096 534690 537515 541299 544764 547816 550494 552196 552793 553302 554451 555547 555852 556337
60536 556337 558782 563479 568841 573121 575691 576876 577377 577817 578141 577585 575799 573802 573057 573775 574915 575831
60520 575831 577072 579337 582395 585548 588788 592989 599018 606989 616564 627744 640937 655975 671437
60507 671437 685663 698428 710897 723685 735668 745222 751915 756311 758605 758379 755639 751276 746397
60494 746397 741624 737056 732548 728163 724779 723978 726715 732298 739508 748620 761232 777652 795528 812097
60480 812097 827246 843268 861571 880687 897874 911742 922527 930466 935138 936494 935474 933066
60468 933066 929465 924704 919528 914848 910728 906690 902757 899312 896087 892305 887998 884331 882333 882051
60454 882051 883247 886161 891178 898430 908173 920903 936573 954261 973279 994234 1018464 1046753
$$ packed form
60552E35600K37p32j009N94K825L784L465L052K678J702N97N09J149J096L05M85
60536E56337K445M697N362M280K570J185N01M40L24n56j786j997p45P18J140R16
60520E75831J241K265L058L153L240M201O029P971R575J1180J3193J5038J5462
60507F71437J4226J2765J2469J2788J1983R554O693M396K294k26k740m363m879
60494G46397m773m568m508m385l384q01K737N583P210R112J2612J6420J7876J6569
60480H12097J5149J6022J8303J9116J7187J3868J0785P939M672J356j020k408
60468I33066l601m761n176m680m120m038l933l445l225l782m307l667j998k82
60454H82051J196K914N017P252R743J2730J5670J7688J9018K0955K4230K8289
$$ plain form
60442 1046753 1079038 1114945 1154041 1195825 1239983 1286473 1335064 1385092 1435769 1485978 1533315
60431 1533315 1574198 1605829 1627495 1638977 1638286 1622496 1591078 1547397 1496546 1442298 1386250 1328949
60419 1328949 1271136 1214129 1159443 1108085 1060434 1017024 978964 946697 918463 891113 862989
60408 862989 835417 810942 790651 773647 758382 743628 728550 712990 697999 685376 676091 669369
60396 669369 663563 657737 652075 646951 642138 637111 631882 627177 623799 621849 620517 618691 615958 613044
60382 613044 610949 609586 607757 604825 601813 600114 599431 597992 594889 591229 588674 587715 587870 588760 590124
60367 590124 591221 591123 589550 586925 583729 580370 577534 576079 576403 578154 580583 583041 585183 586863 587796
60352 587796 587532 586155 584878 585220 587398 590225 592817 595517 598628 601331 602854 603968 606118 609467 612955
$$ packed form
60442A046753L2285L5907L9096M1784M4158M6490M8591N0028N0677N0209M7337
60431A533315M0883L1631K1666J1482o91j5790l1418m3681n0851n4248n6048n7301
60419A328949n7813n7007n4686n1358m7651m3410l8060l2267k8234k7350k8124
60408H62989k7572k4475k0291j7004j5265j4754j5078j5560j4991j2623r285o722
60396F69369n806n826n662n124m813n027n229m705l378j950j332j826k733k914
60382F13044k095j363j829k932l012j699o83j439l103l660k555r59J55Q90J364
60367E90124J097r8j573k625l196l359k836j455L24J751K429K458K142J680R33
60352E87796k64j377j277L42K178K827K592K700L111K703J523J114K150L349L488
$$ plain form
60337 612955 616078 619346 622997 626376 628869 630602 632075 633903 636923 641554 646877 651312 654558 657952
60323 657952 662634 668332 674359 680660 687035 692301 695464 697371 700038 704352 709247 713317 716576 720314
60309 720314 725616 732359 739498 746045 751588 756096 759716 763134 767639 774095 781863 789438 796261 803207
60295 803207 811261 820625 831499 844649 860211 876606 891781 905331 918414 931498 943032 950566
60283 950566 952591 949134 941295 930653 918708 906372 893958 881660 869717 858077 846505 835431
60271 835431 826249 820018 815895 811625 806016 800464 797376 797139 797336 795293 790965 786839 785208 786144 788247
60256 788247 790740 794263 799777 807253 815794 824872 835092 847549 862743 880513 900945 924672 951762
60243 951762 980573 1008259 1032398 1051786 1065659 1072639 1070750 1058519 1036410 1007551 976718 947720
$$ packed form
60337F12955L123L268L651L379K493J733J473J828L020M631N323M435L246L394
60323F57952M682N698O027O301O375N266L163J907K667M314M895M070L259L738
60309G20314N302O743P139O547N543M508L620L418M505O456P768P575O823O946
60295H03207Q054R364J0874J3150J5562J6395J5175J3550J3083J3084J1534P534
60283I50566K025l457p839j0642j1945j2336j2414j2298j1943j1640j1572j1074
60271H35431r182o231m123m270n609n552l088k37J97k043m328m126j631R36K103
60256G88247K493L523N514P476Q541R078J0220J2457J5194J7770K0432K3727K7090
60243I51762K8811K7686K4139J9388J3873O980j889j2231k2109k8859l0833k8998
$$ plain form
60231 947720 921335 896110 871154 847525 826774 809076 793533 779720 768021 758606 750957 744415
60219 744415 738543 732807 726724 720731 716292 714511 714892 715925 716598 716752 716179 714318 711162 707675 704674
60204 704674 701696 697715 692832 688496 685937 684971 684450 683257 680668 676526 671663 667595 665091 663303 660919
60189 660919 657883 655346 654216 654628 656703 660792 666585 672724 677686 680685 681653 681088 680267 680830 683466
60174 683466 687268 690808 693498 695527 696966 697646 697787 698120 699275 701197 703153 704196 703936 703115 703111 704626
60158 704626 707209 710285 713984 718406 722706 725953 728629 732198 737130 742401 747237 752398 759129 767582
60144 767582 776961 786697 796733 806944 816988 826569 835315 842666 848624 854348 861088 868462 874753
60131 874753 879254 883331 888550 894568 899793 903537 906330 908412 909213 908573 907265 905583 902336 896228 888007
$$ packed form
60231I47720k6385k5225k4956k3629k0751j7698j5543j3813j1699r415p649o542
60219G44415n872n736o083n993m439j781L81J033O73J54n73j861l156l487l001
60204G04674k978l981m883m336k559r66n21j193k589m142m863m068k504j788k384
60189F60919l036k537j130M12K075M089N793O139M962K999R68n65q21N63K636
60174F83466L802L540K690K029J439O80J41L33J155J922J956J043k60q21mJ515
60158G04626K583L076L699M422M300L247K676L569M932N271M836N161O731Q453
60144G67582R379R736J0036J0211J0044R581Q746P351N958N724O740P374O291
60131H74753M501M077N219O018N225L744K793K082Q01o40j308j682l247o108q221
$$ plain form
60116 888007 880431 875944 874604 874106 871656 866196 859100 852470 846628 839933 831346 822273 815031 810203
60102 810203 806652 803604 801240 799300 796734 793292 790213 788538 787712 786675 785532 785165 785731 786515 787046
60087 787046 787549 788387 789706 791532 793744 796069 798521 801553 805390 809568 813679 818226 824076 831411 839889
60072 839889 849387 859551 868798 875141 878442 880845 884306 888355 891000 891431 891112 892298 895939 901034
60058 901034 905738 909093 911782 915107 919282 923040 925022 925195 924731 924894 926374 929381 933846 939433 945622
60043 945622 951794 957215 961112 963009 962950 961269 958315 954609 951096 948836 948221 948539 948382 946617 943194
60028 943194 939149 935760 933610 932522 932257 932897 934372 935964 936674 935985 934054 931416 928837 927162 926619
60013 926619 926163 924152 919909 914178 907758 900274 890906 879950 868802 858400 848483 838595 829012 820150
$$ packed form
60116H88007p576m487j340m98k450n460p096o630n842o695q587r073p242m828
60102H10203l551l048k364j940k566l442l079j675q26j037j143l67N66P84N31
60087G87046N03Q38J319J826K212K325K452L032L837M178M111M547N850P335Q478
60072H39889R498J0164R247O343L301K403L461M049K645M31l19J186L641N095
60058I01034M704L355K689L325M175L758J982J73m64J63J480L007M465N587O189
60043I45622O172N421L897J897n9j681k954l706l513k260o15L18j57j765l423
60028I43194m045l389k150j088k65O40J475J592P10o89j931k638k579j675n43
60013I26619m56k011m243n731o420p484r368j0956j1148j0402r917r888r583q862
$$ plain form
59999 820150 811680 802961 794031 785383 777019 768677 760980 755232 751589 748416 744368 740488 739139 741011
59985 741011 744215 746473 747303 747764 748868 750851 753476 756392 759362 762540 766380 770962 775722 780177 784603
59970 784603 789432 794197 797612 798699 797509 794923 792239 790652 790320 789868 787578 783300 778536 774401 770330
59955 770330 765256 759153 752592 745488 737449 729038 721417 714677 707703 700020 692698 686852 682186 677766
59941 677766 673439 669478 665397 660393 654933 650783 649030 648802 648301 646659 644469 642975 643073 644779 647300
59926 647300 649722 651750 653598 655336 656999 659366 663690 669951 676048 679664 680760 681340 682857 684812
59912 684812 686008 686174 685749 684873 683464 682025 681556 682600 684821 687487 689993 691984 693454 694769 696225
59897 696225 697534 697994 697061 694475 690195 684914 680435 678456 678664 678991 678309 677865 679167 681255 681513 678995
$$ packed form
59999H20150q470q719q930q648q364q342p697n748l643l173m048l880j349J872
59985G41011L204K258Q30M61J104J983K625K916K970L178L840M582M760M455M426
59970G84603M829M765L415J087j190k586k684j587l32m52k290m278m764m135m071
59955G70330n074o103o561p104q039q411p621o740o974p683p322n846m666m420
59941F77766m327l961m081n004n460m150j753k28n01j642k190j494R8J706K521
59926F47300K422K028J848J738J663K367M324O261O097L616J096N80J517J955
59912F84812J196J66m25q76j409j439m69J044K221K666K506J991J470J315J456
59897F96225J309M60r33k586m280n281m479j979K08L27o82m44J302K088K58k518
$$ plain form
59881 678995 675561 673519 673310 674128 675727 678579 682481 685967 687399 686479 684556 683352 683350 683712 684024 685511
59865 685511 689656 695901 701965 706719 711541 718163 726274 734208 741226 747881 754549 760856 766567 772066
59851 772066 777750 783568 789202 794130 797636 799433 800170 800621 800534 799185 797059 795875 796551 798053 798794 798418
59835 798418 797566 796580 795397 794492 794899 797027 800031 802831 805515 809205 814503 820564 826172 831370 837292
59820 837292 844410 851944 859365 867357 876324 884793 890727 894133 896928 900192 902992 904218 904149 903481 902070
59805 902070 899638 896824 894428 892268 889914 888124 888214 890064 891934 892678 893282 895607 900158 905730 911029
59790 911029 915886 920583 924543 926432 925819 924170 923605 924667 925631 923974 918251 908777 897085 884786
59776 884786 872530 859972 846971 834575 824264 816386 809980 804098 798549 793409 788770 785217 783687
$$ packed form
59881F78995l434k042k09Q18J599K852L902L486J432r20j923j204kL62L12J487
59865F85511M145O245O064M754M822O622Q111P934P018O655O668O307N711N499
59851G72066N684N818N634M928L506J797P37M51q7j349k126j184O76J502P41l76
59835G98418q52r86j183r05M07K128L004K800K684L690N298O061N608N198N922
59820H37292P118P534P421P992Q967Q469N934L406K795L264K800J226o9o68j411
59805I02070k432k814k396k160k354j790R0J850J870P44O04K325M551N572N299
59790I11029M857M697L960J889o13j649n65J062R64j657n723r474j1692j2299
59776H84786j2256j2558j3001j2396j0311p878o406n882n549n140m639l553j530
$$ plain form
59763 783687 784390 786464 788949 791382 793186 793430 791823 789193 786404 783418 779999 776561 773639 771170 769043
59748 769043 767728 767396 766941 764917 761240 757067 753176 749371 745484 742056 739663 738043 736271 733699 730630
59733 730630 728007 726374 725346 724403 723797 723926 724111 723190 721402 720284 720389 720633 720519 721245 723411 725278
59717 725278 725044 723536 722647 722093 720097 716823 714684 715022 716642 718100 719567 721772 724747 728368 732779
59702 732779 737491 741383 744391 748090 753727 760477 766355 770168 772138 773401 775303 778370 781668 784068
59688 784068 786278 790347 796813 803858 809984 815956 822969 830289 836248 840656 844701 849029 853390 857792
59674 857792 862605 867625 872194 876154 879695 882495 884039 884673 885189 885453 884551 882432 880241 878724 877282
59659 877282 875038 871954 868454 864789 861451 859440 859159 859380 858237 855240 851617 848663 846551 844983 844117
$$ packed form
59763G83687P03K074K485K433J804K44j607k630k789k986l419l438k922k469k127
59748G69043j315l32m55k024l677m173l891l805l887l428k393j620j772k572l069
59733G30630k623j633j028r43o06J29J85r21j788j118J05K44j14P26K166J867
59717G25278k34j508q89n54j996l274k139L38J620J458J467K205K975L621M411
59702G32779M712L892L008L699N637O750N878L813J970J263J902L067L298K400
59688G84068K210M069O466P045O126N972P013P320N959M408M045M328M361M402
59674H57792M813N020M569L960L541K800J544O34N16K64r02k119k191j517j442
59659H77282k244l084l500l665l338k011k81K21j143k997l623k954k112j568q66
$$ plain form
59644 844117 844123 844375 844114 843739 844311 845616 845963 844630 843397 844398 847139 849175 849497 849692 851598 855317 860076
59627 860076 865448 870682 874041 874362 872828 871905 872576 873478 872677 869562 865068 860825 858042 856551 854847
59612 854847 851562 846836 841744 836590 830617 823557 816592 811183 807330 803677 799344 795150 792626 792041
59598 792041 791896 790645 788555 787401 788480 791517 795509 799963 804822 809637 813341 814891 814004 811442 808629
59583 808629 806746 806084 806349 807379 809058 810644 810861 808873 804821 799460 793819 789077 785830 783348 780454
59568 780454 777329 775458 775502 776356 776803 776795 776332 774458 770723 766566 763622 761366 758171 754211 751268 749554
59552 749554 746844 741688 735914 732621 732540 733612 733777 732981 732372 732425 732442 731624 730157 729070 729170 730339 731878
59535 731878 733180 733960 734080 733463 732097 730171 728449 728353 730925 735457 739866 742832 744808 746477 747211 746131
$$ packed form
59644H44117OK52k61l75N72J305L47j333j233J001K741K036L22J95J906L719M759
59627H60076N372N234L359L21j534r23O71R02q01l115m494m243k783j491j704
59612H54847l285m726n092n154n973p060o965n409l853l653m333m194k524n85
59598G92041j45j251k090j154J079L037L992M454M859M815L704J550q87k562k813
59583H08629j883o62K65J030J679J586K17j988m052n361n641m742l247k482k894
59568G80454l125j871M4Q54M47qm63j874l735m157k944k256l195l960k943j714
59552G49554k710n156n774l293q1J072J65p96o09N3J7q18j467j087J00J169J539
59535G31878J302P80J20o17j366j926j722r6K572M532M409K966J976J669P34j080
$$ plain form
59519 746131 743955 742407 741918 741182 739094 735985 732695 729436 726076 722869 720377 719019 718879 719537 719956
59504 719956 719073 716737 713816 711307 709672 708929 708909 709415 710539 712735 716139 719991 723376 726356 729707
59489 729707 733580 737208 740033 742494 745731 751061 759469 770595 782258 792173 800486 809720 821993
59476 821993 837328 854874 874026 893093 908179 915533 915194 910963 906365 901577 894778 885522 875718
59463 875718 867437 860815 854707 848807 844268 842196 842417 844032 846350 848555 849280 847766 845213 843637 843220
59448 843220 841922 838135 832614 827144 822291 817426 812318 807455 802848 797524 790635 782601 774750 767991
59434 767991 762171 756748 751817 748094 745869 744414 742692 740405 738136 736854 737585 740875 745923 750688
59420 750688 753764 755874 758649 762263 765450 767748 770493 775289 782448 791172 800254 808389 814859 820203
$$ packed form
59519G46131k176j548m89p36k088l109l290l259l360l207k492j358j40O58M19
59504G19956q83k336k921k509j635p43k0N06J124K196L404L852L385K980L351
59489G29707L873L628K825K461L237N330Q408J1126J1663R915Q313R234J2273
59476H21993J5335J7546J9152J9067J5086P354l39m231m598m788o799r256r804
59463H75718q281o622o108n900m539k072K21J615K318K205P25j514k553j576m17
59448H43220j298l787n521n470m853m865n108m863m607n324o889q034p851o759
59434G67991n820n423m931l723k225j455j722k287k269j282P31L290N048M765
59420G50688L076K110K775L614L187K298K745M796P159Q724R082Q135O470N344
$$ plain form
59406 820203 825235 829239 830504 829091 827598 828260 830551 832729 834559 837084 840519 843949 846932 850137
59392 850137 854344 859653 865643 871747 877649 883719 890653 898294 905471 911500 916889 921900 925509 926920
59378 926920 927027 926854 925354 920630 912964 904783 897708 891460 885794 881505 878804 876495 873934 872593 874450
59363 874450 879607 886523 894090 902534 912631 924887 939309 955440 972744 991312 1012002 1035750
59351 1035750 1063050 1094058 1128180 1162846 1193255 1214345 1223363 1220734 1209284 1193136 1176551 1162521
59339 1162521 1152173 1145898 1144722 1149534 1158594 1166534 1166823 1155688 1133915 1105327 1073957 1042548 1012852
59326 1012852 986262 963608 944645 928255 913358 899605 887364 877311 869924 865083 862132 860486
59314 860486 860074 860946 862522 863662 863625 862925 863146 865798 871027 877265 882431 885783 888539 892599 898962 907457
$$ packed form
59406H20203N032M004J265j413j493O62K291K178J830K525L435L430K983L205
59392H50137M207N309N990O104N902O070O934P641P177O029N389N011L609J411
59378I26920J07j73j500m724p666q181p075o248n666m289k701k309k561j341J857
59363H74450N157O916P567Q444J0097J2256J4422J6131J7304J8568K0690K3748
59351A035750K7300L1008L4122L4666L0409K1090R018k629j1450j6148j6585j4030
59339A162521j0348o275j176M812R060P940K89j1135k1773k8588l1370l1409k9696
59326A012852k6590k2654j8963j6390j4897j3753j2241j0053p387m841k951j646
59314H60486m12Q72J576J140l7p00K21K652N229O238N166L352K756M060O363Q495
$$ plain form
59298 907457 917371 927808 937869 947145 955853 964148 971775 978987 987236 997990 1011119 1025336 1039892
59285 1039892 1054837 1069878 1084396 1098727 1114045 1130528 1146781 1161668 1175577 1189118 1201515
59274 1201515 1211228 1217572 1220931 1221967 1221403 1220102 1218465 1215838 1211011 1203183 1192251 1178823 1164344
59261 1164344 1150485 1137733 1125165 1112204 1099910 1089753 1081857 1075521 1070868 1068765 1069261 1071330 1074084
59248 1074084 1077362 1081266 1086171 1093027 1102347 1112656 1121023 1125391 1125442 1121171 1112103 1098669 1083098 1067784
59234 1067784 1053386 1039359 1025641 1012724 1000590 988835 977831 968605 961354 954968 948372 941653
59222 941653 935482 930116 925638 922635 921798 922867 924674 926353 928047 930280 933301 937418 943373 951588
59208 951588 961222 970723 979336 987493 995756 1004168 1012765 1021777 1030725 1038074 1042541 1044310 1044321 1042878 1039769
$$ packed form
59298I07457R914J0437J0061R276Q708Q295P627P212Q249J0754J3129J4217J4556
59285A039892J4945J5041J4518J4331J5318J6483J6253J4887J3909J3541J2397
59274A201515R713O344L359J036n64j301j637k627m827p828j0932j3428j4479
59261A164344j3859j2752j2568j2961j2294j0157p896o336m653k103M96K069K754
59248A074084L278L904M905O856R320J0309Q367M368N1m271r068j3434j5571j5314
59234A067784j4398j4027j3718j2917j2134j1755j1004r226p251o386o596o719
59222I41653o171n366m478l003q37J069J807J679J694K233L021M117N955Q215
59208I51588R634R501Q613Q157Q263Q412Q597R012Q948P349M467J769J1j443l109
$$ plain form
59193 1039769 1035276 1030037 1024094 1017072 1009204 1001214 993169 984574 975841 968439 963055 958617 953941 949563
59179 949563 946933 946263 946181 945440 944190 943449 943869 945181 946514 947194 947457 948405 951067 955396 960191 963917
59163 963917 965692 965782 965156 964288 962492 958872 953918 949371 946221 943508 939661 934476 929126 924581 920777
59148 920777 917200 913635 910219 907167 904597 902424 900508 898966 898143 898142 898696 899667 901234 903373 905670 908023
59132 908023 910925 914520 917980 920553 922743 925539 928784 931264 932335 932562 932685 932858 933118 933880 935535
59117 935535 937957 940569 942692 943920 944572 945675 948118 951967 956918 962893 969552 975782 980762 985280
59103 985280 990851 997581 1003998 1009030 1013003 1016640 1020362 1024791 1030541 1036946 1042108 1044769 1045014 1042837
59089 1042837 1037696 1030446 1024068 1020772 1019259 1016412 1011041 1004429 997734 990701 983018 975352 968396 961863
$$ packed form
59193A039769m493n239n943p022p868p990q045q595q733p402n384m438m676m378
59179I49563k630o70q2p41j250p41M20J312J333O80K63R48K662M329M795L726
59163I63917J775R0o26q68j796l620m954m547l150k713l847n185n350m545l804
59148I20777l577l565l416l052k570k173j916j542q23jN54R71J567K139K297K353
59132I08023K902L595L460K573K190K796L245K480J071K27J23J73K60P62J655
59117I35535K422K612K123J228O52J103K443L849M951N975O659O230M980M518
59103I85280N571O730O417N032L973L637L722M429N750O405N162K661K45k177
59089A042837n141p250o378l296j513k847n371o612o695p033p683p666o956o533
$$ plain form
59075 961863 954968 947375 939418 931748 924870 918718 912884 907467 903260 900703 899270 898489 898845 900815 903746
59060 903746 906858 910697 916165 922452 927584 931063 934431 939022 944654 950947 958340 966920 975510 983042
59046 983042 990062 997805 1006192 1013690 1018940 1021996 1024093 1026563 1029773 1032840 1034509 1034344 1032812 1030473
59032 1030473 1027798 1025618 1024793 1025182 1025763 1025968 1026039 1025887 1024701 1022183 1019140 1016187 1012726 1007932 1001956 995408
59016 995408 988413 980963 973502 966341 959118 951630 944402 937561 929954 920643 910678 902019 895131 889053
59002 889053 883654 880076 878630 877650 875200 871059 866499 862752 860150 858088 855432 851523 847150 844008
58988 844008 842853 842822 842873 843144 844289 846141 847924 849419 851019 852708 853926 854649 855806 858059 860700 862522
58972 862522 863614 865511 869367 874603 879784 884345 888833 893789 899183 904946 911314 918447 926297 935033
$$ packed form
59075I61863o895p593p957p670o878o152n834n417m207k557j433p81L56J970K931
59060I03746L112L839N468O287N132L479L368M591N632O293P393Q580Q590P532
59046I83042P020P743Q387P498N250L056K097K470L210L067J669j65j532k339
59032A030473k675k180q25L89N81K05P1j52j186k518l043k953l461m794n976o548
59016I95408o995p450p461p161p223p488p228o841p607r311r965q659o888o078
59002H89053n399l578j446r80k450m141m560l747k602k062k656l909m373l142
58988H44008j155l1N1K71J145J852J783J495J600J689J218P23J157K253K641J822
58972H62522J092J897L856N236N181M561M488M956N394N763O368P133P850Q736
$$ plain form
58958 935033 944915 955518 965811 975544 985875 997883 1010848 1022717 1032051 1038953 1044373 1049192 1053832
58945 1053832 1058058 1061156 1062759 1063414 1063969 1064674 1065372 1066189 1067365 1068754 1070488 1073850 1080264 1089096 1097532
58930 1097532 1103218 1106367 1108930 1112498 1117568 1123892 1130514 1135899 1139080 1140664 1141963 1143302 1144125 1144842
58916 1144842 1147395 1153286 1161801 1171056 1180475 1191221 1204262 1219107 1234766 1251018 1267998 1285226
58904 1285226 1301987 1318293 1334567 1350594 1365715 1379867 1393375 1405729 1415763 1423309 1429433 1434575
58892 1434575 1437653 1437658 1434958 1430204 1423137 1413614 1402703 1391299 1378617 1363773 1348194 1334456 1322873
58879 1322873 1311217 1298115 1284823 1273057 1262769 1253002 1243512 1234413 1225265 1215736 1206530 1198674 1192330
58866 1192330 1187028 1182422 1178034 1173056 1167497 1163018 1161323 1161866 1162260 1161012 1158893 1157468 1157422 1158707 1161269
$$ packed form
58958I35033R882J0603J0293R733J0331J2008J2965J1869R334O902N420M819M640
58945A053832M226L098J603O55N55P05O98Q17J176J389J734L362O414Q832Q436
58930A097532N686L149K563L568N070O324O622N385L181J584J299J339Q23P17
58916A144842K553N891Q515R255R419J0746J3041J4845J5659J6252J6980J7228
58904A285226J6761J6306J6274J6027J5121J4152J3508J2354J0034P546O124N142
58892A434575L078Nk700m754p067r523j0911j1404j2682j4844j5579j3738j1583
58879A322873j1656j3102j3292j1766j0288r767r490r099r148r529r206p856o344
58866A192330n302m606m388m978n559m479j695N43L94j248k119j425m6J285K562
$$ plain form
58851 1161269 1164622 1167262 1167892 1167538 1169557 1176609 1187847 1199814 1210179 1219814 1230983 1244462 1259345
58838 1259345 1274994 1291800 1309870 1328100 1345121 1360479 1374411 1387061 1398568 1409610 1421197
58827 1421197 1433886 1447446 1461266 1474988 1488850 1503293 1518023 1531692 1543018 1552184 1560447 1568272
58815 1568272 1574504 1577579 1576893 1572726 1565526 1555822 1544320 1531505 1517324 1501554 1484207 1465529 1446118
58802 1446118 1427205 1410070 1394743 1379897 1364529 1349157 1334838 1321649 1308816 1295886 1282956
58791 1282956 1269999 1256668 1242704 1228092 1213011 1197982 1183627 1169899 1156066 1142057 1129188
58780 1129188 1118758 1110423 1102867 1095629 1089059 1082628 1074755 1064836 1054441 1045791 1039491 1034255 1028478
58767 1028478 1021683 1014696 1008849 1004984 1003047 1002428 1002463 1002604 1002671 1003284 1005473 1009215 1012843 1014835 1015939 1018460
$$ packed form
58851A161269L353K640O30l54K019P052J1238J1967J0365R635J1169J3479J4883
58838A259345J5649J6806J8070J8230J7021J5358J3932J2650J1507J1042J1587
58827A421197J2689J3560J3820J3722J3862J4443J4730J3669J1326R166Q263P825
58815A568272O232L075o86m167p200r704j1502j2815j4181j5770j7347j8678j9411
58802A446118j8913j7135j5327j4846j5368j5372j4319j3189j2833j2930j2930
58791A282956j2957j3331j3964j4612j5081j5029j4355j3728j3833j4009j2869
58780A129188j0430q335p556p238o570o431p873r919j0395q650o300n236n777
58767A028478o795o987n847l865j937o19L5J41O7O13K189L742L628J992J104K521
$$ plain form
58751 1018460 1023375 1029247 1034188 1037818 1040717 1042967 1044174 1044418 1044262 1043954 1043190 1041579 1038934 1035310 1031157
58736 1031157 1027101 1023133 1018194 1011120 1001881 991510 981103 971432 963220 956810 951379 945399 938474
58723 938474 932225 928704 928140 928836 929142 928878 928724 928869 928736 927783 926165 924528 923289 922106 919958 915856
58707 915856 909647 902154 894520 887533 881555 876703 872828 869454 866079 862464 858538 854305 850165 847016
58693 847016 845534 845489 846256 847895 851082 855901 861338 866179 870010 873205 876498 880674 886024 891784 896676
58678 896676 900392 904002 908579 914107 920203 927057 934768 942407 948942 954918 962042 970890 979966 987429
58664 987429 993030 997977 1003382 1009320 1015092 1020079 1024473 1029269 1035282 1042117 1048540 1053947 1058973 1064420
58650 1064420 1070091 1075164 1079379 1083274 1087266 1090957 1093499 1094347 1093528 1091354 1088046 1083502 1077266 1068845
$$ packed form
58751A018460M915N872M941L630K899K250J207K44j56l08p64j611k645l624m153
58736A031157m056l968m939p074r239j0371j0407r671q212o410n431n980o925
58723I38474o249l521n64O96L06k64j54J45j33r53j618j637j239j183k148m102
58707I15856o209p493p634o987n978m852l875l374l375l615l926m233m140l149
58693H47016j482m5P67J639L187M819N437M841L831L195L293M176N350N760M892
58678H96676L716L610M577N528O096O854P711P639O535N976P124Q848R076P463
58664I87429N601M947N405N938N772M987M394M796O013O835O423N407N026N447
58650A064420N671N073M215L895L992L691K542Q48q19k174l308m544o236q421
$$ plain form
58636 1068845 1058243 1046086 1032896 1018262 1001233 981863 961972 943839 928366 914999 903124
58625 903124 892541 882575 871918 860087 848211 837583 828065 818824 810138 803270 798648 795279 792157
58612 792157 789303 787126 785613 784675 784645 785794 787746 789891 792160 794973 798662 803357 809190 816041 823071
58597 823071 828921 832603 834081 833936 832636 830233 826663 822136 817055 811625 805814 799929 794975 791981
58583 791981 790915 790610 789940 788746 787418 785914 783756 780998 778649 777825 778681 780467 782459 784442 786385
58568 786385 788261 790364 793202 796658 799730 801749 803426 805828 808498 809695 808800 807455 807788 810230 813707
58553 813707 817281 820740 824047 827149 830282 833852 838027 842877 848639 855208 861508 866067 868392 869519
58539 869519 871274 875151 881408 888595 894239 896726 896616 895843 895981 897699 901249 906357 911813 916235 919508
$$ packed form
58636A068845j0602j2157j3190j4634j7029j9370j9891j8133j5473j3367j1875
58625I03124j0583r966j0657j1831j1876j0628r518r241q686o868m622l369l122
58612G92157k854k177j513r38l0J149J952K145K269K813L689M695N833O851P030
58597H23071N850L682J478j45j300k403l570m527n081n430n811n885m954k994
58583G91981j066l05o70j194j328j504k158k758k349q24Q56J786J992J983J943
58568G86385J876K103K838L456L072K019J677K402K670J197q95j345L33K442L477
58553H13707L574L459L307L102L133L570M175M850N762O569O300M559K325J127
58539H69519J755L877O257P187N644K487j10p73J38J718L550N108N456M422L273
$$ plain form
58524 919508 922754 926912 932255 939359 949264 961950 975355 986802 995265 1001929 1008776 1016912 1026011
58511 1026011 1035173 1044359 1054845 1067858 1082959 1098376 1112898 1126777 1140868 1155780 1172091 1190459
58499 1190459 1211057 1233439 1257220 1282169 1307400 1331439 1353566 1374234 1393563 1410373 1423560
58488 1423560 1433493 1440897 1444966 1444123 1438573 1430797 1423197 1416149 1408654 1399984 1390139 1379257 1367174 1353460
58474 1353460 1337701 1319965 1301023 1281785 1262471 1242726 1222574 1202805 1184217 1166918 1150605
58463 1150605 1135120 1120423 1106427 1093407 1082367 1074494 1070055 1067999 1066623 1064507 1061009 1056371 1051484
58450 1051484 1047208 1043615 1040005 1035888 1031782 1028749 1027144 1026115 1024406 1021492 1017932 1014953 1013774 1014891
58436 1014891 1017518 1019865 1020406 1019142 1017554 1017362 1019321 1022958 1027166 1031141 1035057 1039842 1046084 1053221
$$ packed form
58524I19508L246M158N343P104R905J2686J3405J1447Q463O664O847Q136R099
58511A026011R162R186J0486J3013J5101J5417J4522J3879J4091J4912J6311J8368
58499A190459K0598K2382K3781K4949K5231K4039K2127K0668J9329J6810J3187
58488A423560R933P404M069q43n550p776p600p048p495q670r845j0882j2083j3714
58474A353460j5759j7736j8942j9238j9314j9745k0152j9769j8588j7299j6313
58463A150605j5485j4697j3996j3020j1040p873m439k056j376k116l498m638m887
58450A051484m276l593l610m117m106l033j605j029j709k914l560k979j179J117
58436A014891K627K347N41j264j588j92J959L637M208L975L916M785O242P137
$$ plain form
58422 1053221 1060115 1066380 1072768 1080193 1088759 1098002 1107758 1118378 1130123 1142712 1155650 1168729 1181885
58409 1181885 1194565 1205697 1214606 1221639 1227348 1231194 1231924 1229537 1226186 1224438 1224992 1226690 1228424 1230246
58395 1230246 1232567 1235129 1237242 1238815 1240826 1244720 1251190 1259413 1267519 1273870 1277702 1278731 1276965 1273312
58381 1273312 1269472 1266227 1262213 1255482 1246219 1236975 1230190 1226302 1224304 1223014 1221548 1219702 1218554 1219878
58367 1219878 1224159 1229791 1235028 1240312 1247757 1258428 1270895 1282579 1291988 1299460 1306166 1312748 1318835
58354 1318835 1323518 1326142 1326732 1325948 1324734 1323643 1322158 1318920 1313039 1305148 1296836 1289304 1283019 1278272
58340 1278272 1275150 1272895 1270318 1267384 1265812 1267463 1272406 1278945 1285242 1290534 1295082 1299561 1304611 1310611
58326 1310611 1317560 1325057 1332510 1339576 1346547 1354059 1362218 1370332 1377777 1384733 1391596 1398095 1403773 1409147
$$ packed form
58422A053221O894O265O388P425Q566R243R756J0620J1745J2589J2938J3079J3156
58409A181885J2680J1132Q909P033N709L846P30k387l351j748N54J698J734J822
58395A230246K321K562K113J573K011L894O470Q223Q106O351L832J029j766l653
58381A273312l840l245m014o731r263r244o785l888j998j290j466j846j148J324
58367A219878M281N632N237N284P445J0671J2467J1684R409P472O706O582O087
58354A318835M683K624N90p84j214j091j485l238n881p891q312p532o285m747
58340A278272l122k255k577k934j572J651M943O539O297N292M548M479N050O000
58326A310611O949P497P453P066O971P512Q159Q114P445O956O863O499N678N374
$$ plain form
58312 1409147 1415453 1423196 1431858 1441190 1451719 1463391 1474646 1483802 1491085 1498407 1507202 1517168 1527267
58299 1527267 1537303 1548014 1559926 1572892 1586901 1602714 1620918 1640618 1659942 1677967 1695292
58288 1695292 1712430 1728647 1742969 1755436 1766578 1776516 1785616 1795300 1806927 1820342 1834697 1850294
58276 1850294 1868165 1888112 1908624 1928762 1948815 1969076 1989418 2010309 2032832 2057244 2082631
58265 2082631 2108271 2134207 2160157 2185107 2208434 2230362 2251000 2270065 2287912 2305584 2323347
58254 2323347 2340343 2356141 2371471 2386989 2402678 2419107 2437786 2459271 2482126 2504845 2527872
58243 2527872 2552640 2579428 2607291 2635564 2664509 2694908 2727732 2763707 2802520 2842814 2883572
58232 2883572 2925251 2969312 3016904 3068012 3121388 3175487 3230274 3287869 3350421 3417600 3487323
$$ packed form
58312A409147O306P743Q662R332J0529J1672J1255R156P283P322Q795R966J0099
58299A527267J0036J0711J1912J2966J4009J5813J8204J9700J9324J8025J7325
58288A695292J7138J6217J4322J2467J1142R938R100R684J1627J3415J4355J5597
58276A850294J7871J9947K0512K0138K0053K0261K0342K0891K2523K4412K5387
58265B082631K5640K5936K5950K4950K3327K1928K0638J9065J7847J7672J7763
58254B323347J6996J5798J5330J5518J5689J6429J8679K1485K2855K2719K3027
58243B527872K4768K6788K7863K8273K8945L0399L2824L5975L8813M0294M0758
58232B883572M1679M4061M7592N1108N3376N4099N4787N7595O2552O7179O9723
$$ plain form
58221 3487323 3558422 3630884 3703952 3776474 3849453 3925756 4006398 4089354 4173197 4259662 4351099
58210 4351099 4447311 4546718 4649131 4755592 4866648 4982537 5104181 5232513 5367546 5509256
58200 5509256 5658574 5816591 5983833 6161146 6350022 6551180 6764258 6989882 7230437
58191 7230437 7487553 7760257 8046800 8346880 8661054 8989823 9334853 9699541 10086757
58182 10086757 10497200 10931011 11389320 11873026 12382074 12917556 13482858 14081355 14714852
58173 14714852 15385699 16098287 16856708 17663004 18519396 19430032 20398578 21426131 22513350
58164 22513350 23662659 24876985 26159115 27514428 28951985 30481529 32112511 33857603
58156 33857603 35733286 37754777 39934467 42288118 44838571 47610943 50629490 53923160
$$ packed form
58221C487323P1099P2462P3068P2522P2979P6303Q0642Q2956Q3843Q6465R1437
58210D351099R6212R9407J02413J06461J11056J15889J21644J28332J35033J41710
58200E509256J49318J58017J67242J77313J88876K01158K13078K25624K40555
58191G230437K57116K72704K86543L00080L14174L28769L45030L64688L87216
58182A0086757M10443M33811M58309M83706N09048N35482N65302N98497O33497
58173A4714852O70847P12588P58421Q06296Q56392R10636R68546J027553J087219
58164B2513350J149309J214326J282130J355313J437557J529544J630982J745092
58156C3857603J875683K021491K179690K353651K550453K772372L018547L293670
$$ plain form
58148 53923160 57529782 61491818 65854660 70674854 76024955 81985153 88635036 96056839
58140 96056839 104338430 113568721 123843310 135286393 148056906 162317757 178201032
58133 178201032 195807591 215231207 236592898 260100513 286075718 314750939 345719756
58126 345719756 377320429 406529956 429680982 443656880 446848104 439412391 422912136
58119 422912136 399680077 372206401 342695936 312851835 283859409 256471191 231102697
58112 231102697 207918269 186918202 168014518 151075830 135950511 122486250 110541282
58105 110541282 99978166 90654433 82428115 75170060 68765058 63104972 58088500 53626587
58097 53626587 49642476 46067663 42842582 39920169 37264295 34844783 32635937 30616955
$$ packed form
58148E3923160L606622L962036M362842M820194N350101N960198O649883P421803
58140I6056839Q281591R230291J0274589J1443083J2770513J4260851J5883275
58133A78201032J7606559J9423616K1361691K3507615K5975205K8675221L0968817
58126C45719756L1600673K9209527K3151026J3975898L191224p435713j6500255
58119D22912136k3232059k7473676k9510465k9844101k8992426k7388218k5368494
58112B31102697k3184428k1000067j8903684j6938688j5125319j3464261j1944968
58105A10541282j0563116r323733q226318p258055o405002n660086n016472m461913
58097E3626587l984111l574813l225081k922413k655874k419512k208846k018982
$$ plain form
58089 30616955 28769190 27073386 25511808 24071104 22740237 21507571 20362863 19299992
58081 19299992 18314240 17398197 16543241 15743504 14995331 14294336 13636182 13019148 12442723
58072 12442723 11904286 11399703 10926299 10482551 10065562 9671477 9297919 8943638 8606329
58063 8606329 8283234 7973503 7677567 7394198 7120428 6854601 6597828 6352187 6118757
58054 6118757 5897389 5687165 5486930 5296025 5114105 4939825 4770722 4605259 4443954
58045 4443954 4287580 4135639 3987919 3846130 3712059 3584903 3462105 3342205 3225310
58036 3225310 3111453 3000418 2893009 2790989 2695622 2607040 2524636 2447311 2374020 2305054
58026 2305054 2242023 2185595 2134156 2085716 2040063 1997752 1958146 1920096 1883492 1848260 1812696
$$ packed form
58089C0616955j847765j695804j561578j440704j330867j232666j144708j062871
58081A9299992r85752r16043q54956p99737p48173p00995o58154o17034n76425
58072A2442723n38437n04583m73404m43748m16989l94085l73558l54281l37309
58063H606329l23095l09731k95936k83369k73770k65827k56773k45641k33430
58054F118757k21368k10224k00235j90905j81920j74280j69103j65463j61305
58045D443954j56374j51941j47720j41789j34071j27156j22798j19900j16895
58036C225310j13857j11035j07409j02020r5367q8582q2404p7325p3291o8966
58026B305054o3031n6428n1439m8440m5653m2311l9606l8050l6604l5232l5564
$$ plain form
58015 1812696 1775106 1736735 1700782 1668400 1637714 1607072 1577150 1548945 1521430 1492562 1461750
58004 1461750 1430193 1399301 1369766 1341913 1316006 1291842 1268533 1245216 1222033 1199977 1179473
57993 1179473 1159588 1139212 1118692 1099326 1081463 1064155 1046824 1030128 1014981 1001886 991413
57982 991413 983870 977829 970460 960404 949260 939320 930886 922793 914446 906016 897440 888560 879656 870736
57968 870736 860890 849400 836983 824947 813757 803362 794176 786524 779753 773090 766867 761676 756829
57955 756829 751031 744347 738172 733229 728635 723144 716593 710036 704810 701189 697654 692092 684205 676085
57941 676085 669878 665676 662243 658729 654778 650009 644577 639434 634849 629533 622478 614866 608633 603817
57927 603817 598922 593471 588576 585031 582258 579229 575379 570669 565726 561676 558995 556869 554522 552558
$$ packed form
58015A812696l7590l8371l5953l2382l0686l0642k9922k8205k7515k8868l0812
58004A461750l1557l0892k9535k7853k5907k4164k3309k3317k3183k2056k0504
57993A179473j9885k0376k0520j9366j7863j7308j7331j6696j5147j3095j0473
57982I91413p543o041p369j0056j1144r940q434q093q347q430q576q880q904q920
57968H70736r846j1490j2417j2036j1190j0395r186p652o771o663o223n191m847
57955G56829n798o684o175m943m594n491o551o557n226l621l535n562p887q120
57941F76085o207m202l433l514l951m769n432n143m585n316p055p612o233m816
57927F03817m895n451m895l545k773l029l850m710m943m050k681k126k347j964
$$ plain form
57913 552558 551893 552034 551725 550676 549281 547232 544094 540843 539036 538552 537811 536191 534592 533571 532653 531740
57897 531740 531535 532087 532365 531810 531080 530723 530331 529494 528515 527631 526555 525281 524480 524607 525375 526475 528095
57880 528095 530387 533052 535761 538448 541144 544050 547574 551688 555690 559462 564414 571814 580453 587438
57866 587438 591347 593277 594869 596698 598529 599509 597905 592467 584558 577410 572690 569235 565623 562203
57852 562203 559719 557621 555001 551919 548593 544439 539255 534407 531432 530048 528739 526747 524349 521562
57838 521562 517829 512906 507253 501557 496389 492114 488669 485687 483036 480793 478529 475501 471988 469496
57824 469496 468974 469681 470539 471605 473143 474124 473096 470175 466819 463802 460707 457493 455226 454745 455431 455873
57808 455873 455178 453175 449885 445548 441165 438359 438158 439796 441039 440176 437787 436351 437924 442338 447589
$$ packed form
57913E52558o65J41l09j049j395k049l138l251j807m84p41j620j599j021r18r13
57897E31740k05N52K78n55p30l57l92q37r79q84j076j274q01J27P68J100J620
57880E28095K292K665K709K687K696K906L524M114M002L772M952P400Q639O985
57866E87438L909J930J592J829J831R80j604n438p909p148m720l455l612l420
57852E62203k484k098k620l082l326m154n184m848k975j384j309j992k398k787
57838E21562l733m923n653n696n168m275l445k982k651k243k264l028l513k492
57824D69496n22P07Q58J066J538R81j028k921l356l017l095l214k267m81O86M42
57808D55873o95k003l290m337m383k806k01J638J243q63k389j436J573M414N251
$$ plain form
57793 447589 451617 453657 454276 454511 454903 455189 454844 453714 452022 450069 448276 447163 446630 445465 442380 437559
57777 437559 432508 428228 424288 419798 414568 409077 404100 400645 399424 399792 399837 398242 395747 394269 394837
57762 394837 396828 398990 400753 402519 404869 407513 409215 408969 407039 404459 401775 398775 395113 390531
57748 390531 384880 378865 374260 371963 370031 365430 358097 351502 348464 348154 348426 349323 352229 356506 359287
57733 359287 358807 356331 354328 353834 354077 353943 353353 353516 355994 361223 367954 374374 379612 383965 388045 392134
57717 392134 396110 399578 402340 404982 408453 412524 415265 414919 412158 409676 409520 411389 413538 414721 414925
57702 414925 414521 413184 410083 405300 400534 397595 396233 394387 390715 385907 381249 377139 373782 372110
57688 372110 372796 375065 377695 380587 384183 387935 390826 393059 395661 398411 399696 398757 396736 395102 394241
$$ packed form
57793D47589M028K040O19K35L92K86l45j130j692j953j793j113n33j165l085m821
57777D37559n051m280l940m490n230n491m977l455j221L68M5j595k495j478N68
57762C94837J991K162J763J766K350K644J702k46j930k580k684l000l662m582
57748C90531n651o015m605k297j932m601p333o595l038l10K72Q97K906M277K781
57733C59287m80k476k003m94K43j34n90J63K478N229O731O420N238M353M080M089
57717C92134L976L468K762K642L471M071K741l46k761k482j56J869K149J183K04
57702D14925m04j337l101m783m766k939j362j846l672m808m658m110l357j672
57688C72110O86K269K630K892L596L752K891K233K602K750J285r39k021j634q61
$$ plain form
57673 394241 394136 395137 397222 399481 401370 403719 407429 411684 414581 415344 414769 413474 410846 406259 400503
57658 400503 395275 391621 389391 387877 386299 383930 380622 377300 375054 373486 370793 365981 360123 354645
57644 354645 349266 342915 336088 330640 327194 324354 320948 317657 315637 314705 313845 312669 311432 310202 308966
57629 308966 308064 307746 307768 308085 309352 311987 315351 318708 322398 327108 332604 338251 344361 351825 360790
57614 360790 370913 382827 398017 417174 439745 465267 494096 526540 562042 599112 634979
57603 634979 665204 684972 691632 685643 669126 644425 614074 580870 547212 514942 485938 461671
57591 461671 441685 423733 406312 390228 376797 365527 354851 344520 335740 329070 323676 318947
57579 318947 315572 314314 314466 314372 313119 311093 309164 307936 307652 308090 308385 307526 305407 303008 301140 299339
$$ packed form
57673C94241j05J001K085K259J889K349L710M255K897P63n75j295k628m587n756
57658D00503n228l654k230j514j578k369l308l322k246j568k693m812n858n478
57644C54645n379o351o827n448l446k840l406l291k020r32q60j176j237j230j236
57629C08966r02l18K2L17J267K635L364L357L690M710N496N647O110P464Q965
57614C60790J0123J1914J5190J9157K2571K5522K8829L2444L5502L7070L5867
57603F34979L0225J9768O660n989j6517k4701l0351l3204l3658l2270k9004k4267
57591D61671j9986j7952j7421j6084j3431j1270j0676j0331q780o670n394m729
57579C18947l375j258J52r4j253k026j929j228k84M38K95q59k119k399j868j801
$$ plain form
57563 299339 296486 292370 288029 284519 281975 280019 278453 277153 275840 274421 273226 272358 271176 269025
57549 269025 266248 263798 261973 260283 258634 257895 258841 260953 262708 262973 261863 260372 259406 259227 259644 260445
57533 260445 261401 261978 261422 259290 255669 250896 245493 240400 236600 234043 231388 227341 221992 216504 211914
57518 211914 208703 207030 206608 206571 206087 204956 203166 200357 196513 192796 190563 189642 188611 186867 185306
57503 185306 184622 184077 182627 180478 178699 177749 177171 176524 175972 175991 177003 179312 182991 187593 192088 195306
57487 195306 196711 196933 197416 199174 201845 204149 205193 205082 204414 203785 203874 205399 208483 212204 215072 216068
57471 216068 215337 214074 213590 214138 214643 213935 212290 211309 212097 213931 214993 214111 211533 208280 205202 202700
57455 202700 200878 199586 198355 196622 194204 191377 188315 184620 179738 173701 167106 160529 154419 149401
$$ packed form
57563B99339k853m116m341l510k544j956j566j300j313j419j195q68j182k151
57549B69025k777k450j825j690j649p39R46K112J755K65j110j491r66j79M17Q01
57533B60445R56N77n56k132l621m773n403n093l800k557k655m047n349n488m590
57518B11914l211j673m22l7m84j131j790k809l844l717k233r21j031j744j561
57503A85306o84n45j450k149j779r50n78o47n52J9J012K309L679M602M495L218
57487A95306J405K22M83J758K671K304J044j11o68o29Q9J525L084L721K868R96
57471B16068p31j263m84N48N05p08j645r81P88J834J062q82k578l253l078k502
57455B02700j822j292j231j733k418k827l062l695m882o037o595o577o110n018
$$ plain form
57441 149401 145872 143231 140377 137186 134593 132882 130942 127949 124785 122837 122189 122133 122708 124291 126086
57426 126086 126455 124700 121342 116830 111410 106286 103348 103196 104588 106220 107931 109766 111086 111431 111345
57411 111345 111533 111899 112058 112102 112166 111855 110912 110069 110510 112718 116213 120114 123517 125760 126836 127328 127656
57394 127656 127660 127195 126759 127107 128408 130000 130815 130087 127998 125646 124082 123504 123811 125479 128944 133254 136530
57377 136530 137971 138303 138056 136786 134646 133348 134276 136403 137345 136282 134860 135180 137467 139844 140209 138494
57361 138494 136986 137966 141168 144315 145948 146488 146500 145664 144226 143785 145251 147228 147908 147665 148253 150209
57345 150209 152634 154956 157119 158408 157972 156621 156318 157503 158424 157666 156006 155018 154878 154383 152602 150047
57329 150047 148560 149991 154179 158301 159391 157683 156267 157033 158445 158187 156601 156011 157421 159503 160655
$$ packed form
57441A49401l529k641k854l191k593j711j940k993l164j948o48n6N75J583J795
57426A26086L69j755l358m512n420n124k938j52J392J632J711J835J320L45q6
57411A11345J88L66J59M4O4l11r43q43M41K208L495L901L403K243J076M92L28
57394A27656Mm65m36L48J301J592Q15p28k089k352j564n78L07J668L465M310L276
57377A36530J441L32k47j270k140j298R28K127R42j063j422L20K287K377L65j715
57361A38494j508R80L202L147J633N40J2q36j438m41J466J977O80k43N88J956
57345A50209K425K322K163J289m36j351l03J185R21p58j660r88j40m95j781k555
57329A50047j487J431M188M122J090j708j416P66J412k58j586n90J410K082J152
$$ plain form
57314 160655 160593 159740 158356 156782 155642 155115 154559 153518 152697 153272 155266 157181 157431 155865 153776 152660
57298 152660 153174 155042 157634 160448 163172 165494 167121 168185 169534 172195 176272 180597 183824 185742
57284 185742 187111 188307 188746 187866 186158 184765 184227 184009 183211 181457 179136 177062 176040 176596 178761 181858
57268 181858 184614 185970 186130 186588 188815 193117 199028 206285 214769 223933 233352 243766 256450 271220
57254 271220 286138 299789 312956 327231 342559 357089 369100 378369 385747 392142 398050 403730
57242 403730 409696 416914 426132 436966 448157 458926 469509 480237 490915 501522 512600 524169
57230 524169 534989 543850 551109 557955 564443 569292 571705 572640 574129 577742 583567 590242 596152 601069
57216 601069 606439 613716 622778 632424 641932 651608 662341 675372 691868 711631 732562 752443 771090
$$ packed form
57314A60655o2q53j384j574j140n27n56j041q21N75J994J915K50j566k089j116
57298A52660N14J868K592K814K724K322J627J064J349K661M077M325L227J918
57284A85742J369J196M39q80j708j393n38k18p98j754k321k074j022N56K165L097
57268A81858K756J356J60M58K227M302N911P257Q484R164R419J0414J2684J4770
57254B71220J4918J3651J3167J4275J5328J4530J2011R269P378O395N908N680
57242D03730N966P218R218J0834J1191J0769J0583J0728J0678J0607J1078J1569
57230E24169J0820Q861P259O846O488M849K413R35J489L613N825O675N910M917
57216F01069N370P277R062R646R508R676J0733J3031J6496J9763K0931J9881J8647
$$ plain form
57203 771090 789874 809451 829244 848984 869262 890161 910655 930067 949091 968481 987447
57192 987447 1004386 1019007 1032977 1048399 1066118 1085589 1105959 1126825 1147918 1168523 1187871
57181 1187871 1206219 1224857 1244603 1264685 1283545 1300297 1315043 1328355 1341244 1355250 1371787
57170 1371787 1391488 1414527 1440800 1469043 1496624 1521614 1544773 1568228 1592595 1617008 1641805
57159 1641805 1669156 1700328 1733904 1767669 1801037 1834621 1868440 1901822 1934518 1966853 1999158
57148 1999158 2031918 2066243 2103327 2143560 2186786 2233239 2283582 2338099 2396463 2458300 2523257
57137 2523257 2590186 2656707 2720251 2779885 2837021 2894015 2951838 3009270 3064386 3116363 3165536
57126 3165536 3212208 3256233 3297629 3336673 3373114 3405922 3434321 3458923 3481671 3504595 3528369
$$ packed form
57203G71090J8784J9577J9793J9740K0278K0899K0494J9412J9024J9390J8966
57192I87447J6939J4621J3970J5422J7719J9471K0370K0866K1093K0605J9348
57181A187871J8348J8638J9746K0082J8860J6752J4746J3312J2889J4006J6537
57170A371787J9701K3039K6273K8243K7581K4990K3159K3455K4367K4413K4797
57159A641805K7351L1172L3576L3765L3368L3584L3819L3382L2696L2335L2305
57148A999158L2760L4325L7084M0233M3226M6453N0343N4517N8364O1837O4957
57137B523257O6929O6521O3544N9634N7136N6994N7823N7432N5116N1977M9173
57126C165536M6672M4025M1396L9044L6441L2808K8399K4602K2748K2924K3774
$$ plain form
57115 3528369 3551827 3573217 3592341 3611096 3631341 3652552 3672304 3688857 3702532 3714668 3726144
57104 3726144 3736985 3746738 3755105 3762695 3770856 3780068 3788861 3795336 3799635 3803882 3809786 3817386 3826060 3835445
57090 3835445 3845100 3854410 3863155 3871175 3877338 3879988 3878565 3873288 3862767 3843434 3812178 3768451 3713046
57077 3713046 3645948 3566141 3472320 3362834 3236119 3092493 2934722 2765526 2584748 2389609
57067 2389609 2176915 1944041 1688553 1408131 1100604 763066 391075 -20614 -476672 -980745
57057 -980745 -1535818 -2144627 -2810641 -3539370 -4338079 -5213872 -6173276 -7224699 -8380300
57048 -8380300 -9654536 -11062097 -12619009 -14345402 -16265960 -18408199 -20802119 -23482381
57040 -23482381 -26491035 -29879318 -33707949 -38044968 -42960840 -48522354 -54786262 -61793102
$$ packed form
57115C528369K3458K1390J9124J8755K0245K1211J9752J6553J3675J2136J1476
57104C726144J0841R753Q367P590Q161R212Q793O475M299M247N904P600Q674R385
57090C835445R655R310Q745Q020O163K650j423n277j0521j9333l1256m3727n5405
57077C713046o7098p9807r3821j09486j26715j43626j57771j69196j80778j95139
57067B389609k12694k32874k55488k80422l07527l37538l71991b0614m56058n04073
57057i80745n55073o08809o66014p28729p98709q75793r59404j051423j155601
57048h380300j274236j407561j556912j726393j920558k142239k393920k680262
57040b3482381l008654l388283l828631m337019m915872n561514o263908p006840
$$ plain form
57032 -61793102 -69564879 -78109894 -87426186 -97486871 -108209954 -119448757 -131036318
57025 -131036318 -142858521 -154875664 -167038058 -179140235 -190731416 -201166187 -209768418
57018 -209768418 -216000142 -219543484 -220286099 -218264616 -213620922 -206586646 -197480265 -186697592
57010 -186697592 -174686801 -161909787 -148800173 -135731795 -123004772 -110844298 -99403938
57003 -99403938 -88772342 -78986467 -70048771 -61940961 -54631432 -48079792 -42240527 -37064095
56995 -37064095 -32495793 -28476484 -24946576 -21849685 -19133411 -16749185 -14653271 -12807534
56987 -12807534 -11178677 -9737298 -8457907 -7318583 -6299586 -5382714 -4552468 -3797216
56979 -3797216 -3108715 -2480618 -1906974 -1380766 -893474 -437089 -7184 396413 771543 1114864
$$ packed form
57032f1793102p771777q545015r316292j0060685j0723083j1238803j1587561
57025a31036318j1822203j2017143j2162394j2102177j1591181j0434771q602231
57018b09768418o231724l543342p42615K021483M643694P034276R106381J0782673
57010a86697592J2010791J2777014J3109614J3068378J2727023J2160474J1440360
57003i9403938J0631596R785875Q937696Q107810P309529O551640N839265N176432
56995c7064095M568302M019309L529908L096891K716274K384226K095914J845737
56987a2807534J628857J441379J279391J139324J018997R16872Q30246P55252
56979c797216O88501O28097N73644N26208M87292d37089g184C96413L75130L43321
$$ plain form
56969 1114864 1421417 1685848 1906277 2086443 2233120 2352265 2448498 2526770 2592225 2648268
56959 2648268 2696004 2735712 2768019 2793611 2812626 2824556 2828507 2823814 2810870 2791126 2765980 2735984
56947 2735984 2701311 2662340 2619308 2572040 2520486 2464684 2403507 2334294 2254894 2165680 2068717
56936 2068717 1965635 1857586 1746833 1636633 1528998 1423492 1318755 1214640 1112706
56927 1112706 1015128 923326 837123 755205 676785 602707 534406 471948 413715 357900 303549
56916 303549 250380 198698 149738 105018 64739 27524 -7815 -40945 -70900 -97474 -120850 -140415
56904 -140415 -155039 -164340 -168775 -168588 -163801 -155482 -145879 -136525 -127038 -116731 -106890 -100279 -98415 -100468
56890 -100468 -105068 -111962 -121181 -131553 -141319 -149908 -157979 -165737 -172145 -176026 -177130 -175886 -172863 -168848
$$ packed form
56969A114864L06553K64431K20429J80166J46677J19145R6233P8272O5455N6043
56959B648268M7736L9708L2307K5592J9015J1930L951m693j2944j9744k5146k9996
56947B735984l4673l8971m3032m7268n1554n5802o1177o9213p9400q9214r6963
56936B068717j03082j08049j10753j10200j07635j05506j04737j04115j01934
56927A112706r7578r1802q6203q1918p8420p4078o8301o2458n8233n5815n4351
56916C03549n3169n1682m8960m4720m0279B7524g815l3130k9955k6574k3376j9565
56904a40415j4624r301m435J87M787Q319R603R354R487J0307R841O611J864k053
56890a00468m600o894r219j0372r766q589q071p758o408l881j104J244L023M015
$$ plain form
56876 -168848 -164692 -160398 -154668 -145973 -133956 -119686 -104999 -92026 -82829 -78671 -79525 -84721 -93973
56863 -93973 -107227 -123464 -140426 -156238 -171216 -187445 -206259 -226454 -245335 -261146 -273808 -283493
56851 -283493 -289763 -292845 -294698 -297479 -301202 -304129 -305425 -306185 -307520 -308846 -308708 -306444 -302270 -296401 -288892
56836 -288892 -280023 -270057 -258793 -245853 -231296 -215612 -199308 -182749 -165985 -148388 -128831 -106716
56824 -106716 -82745 -58572 -36050 -16769 -1490 10463 20710 30230 38821 46381 53812 61885 70083
56811 70083 77745 85815 96163 109358 124311 140110 156962 175270 195092 217038 242467 271822
56799 271822 303395 334564 363630 389523 410092 422139 423760 416216 403118 388046 373217 359835
56787 359835 348785 340631 335485 333490 335343 341996 353864 370600 391537 415993 443391 473803
$$ packed form
56876a68848M156M294N730Q695J2017J4270J4687J2973R197M158q54n196r252
56863i3973j3254j6237j6962j5812j4978j6229j8814k0195j8881j5811j2662r685
56851b83493o270l082j853k781l723k927j296p60j335j326J38K264M174N869P509
56836b88892Q869R966J1264J2940J4557J5684J6304J6559J6764J7597J9557K2115
56824a06716K3971K4173K2522a6769a490A0463J0247R520Q591P560P431Q073Q198
56811G0083P662Q070J0348J3195J4953J5799J6852J8308J9822K1946K5429K9355
56799B71822L1573L1169K9066K5893K0569J2047J621p544j3098j5072j4829j3382
56787C59835j1050q154n146j995J853O653J1868J6736K0937K4456K7398L0412
$$ plain form
56775 473803 508383 548344 592803 637825 678039 709124 728826 736415 731917 715887 689574 655399
56763 655399 617237 579539 545503 516023 490475 468129 448771 432736 420983 414708 414272 418837
56751 418837 427455 440121 457234 478437 502479 527590 551242 570114 581313 583573 576736 560745
56739 560745 536335 506265 474450 443613 414636 387989 364406 344000 326139 310761 298691
56728 298691 290031 283495 278297 275795 278059 285320 295880 308155 321552 335231 347092 354662 356642
56715 356642 353240 345193 332874 316499 297035 276381 256191 236614 216792 196712 177915 161986
56703 161986 148883 137291 126195 115394 104869 94659 85479 78444 73551 69059 63193 56285 50439
56690 50439 47052 45471 44376 43579 43619 44029 43288 40683 37359 35093 34684 35886 38092 40353 41430 40875
$$ packed form
56775D73803L4580L9961M4459M5022M0214L1085J9702P589m498j6030k6313l4175
56763F55399l8162l7698l4036k9480k5548k2346j9358j6035j1753o275m36M565
56751D18837Q618J2666J7113K1203K4042K5111K3652J8872J1199K260o837j5991
56739E60745k4410l0070l1815l0837k8977k6647k3583k0406j7861j5378j2070
56728B98691q660o536n198k502K264P261J0560J2275J3397J3679J1861P570J980
56715C56642l402q047j2319j6375j9464k0654k0190j9577j9822k0080j8797j5929
56703A61986j3103j1592j1096j0801j0525j0210r180p035m893m492n866o908n846
56690E0439l387j581j095p97M0M10p41k605l324k266m09J202K206K261J077n55
$$ plain form
56674 40875 39884 40140 41794 43297 43212 41516 39090 36763 35080 34299 34146 33847 32675 30327 26908 22981
56658 22981 19563 17467 16543 15980 15360 14850 14458 13849 13056 12649 12966 13828 15201 17344 19883 21556 21528
56641 21528 20485 19851 20392 22141 25141 29398 34263 38702 42314 45653 49373 53355 56765 58945 60299
56626 60299 62175 65540 69822 73636 76743 80550 86258 93313 100333 106832 113018 118356 121653 122731
56612 122731 122980 123798 125163 126209 126702 127435 129392 132824 136906 140000 140574 138388 134886 132085 130867
56597 130867 130329 128834 125668 121684 118423 116703 116027 115144 112984 109250 104585 100370 97994 97882 99181
56582 99181 100595 101520 102217 103022 103782 104185 104296 104357 104174 103226 101619 100497 100963 102723 104401 105223 105729 106627
56564 106627 107800 108924 110279 112121 113743 114170 113414 112096 110194 107481 104961 104316 105579 106856 106919
$$ packed form
56674D0875r91K56J654J503q5j696k426k327j683p81j53k99j172k348l419l927
56658B2981l418k096r24n63o20n10l92o09p93m07L17Q62J373K143K539J673k8
56641B1528j043o34N41J749L000M257M865M439L612L339L720L982L410K180J354
56626F0299J876L365M282L814L107L807N708P055P020O499O186N338L297J078
56612A22731K49Q18J365J046M93P33J957L432M082L094N74k186l502k801j218
56597A30867n38j495l166l984l261j720o76q83k160l734m665m215k376j12J299
56582I9181J414R25O97Q05P60M03J11O1j83r48j607j122M66J760J678Q22N06Q98
56564A06627J173J124J355J842J622M27p56j318j902k713k520o45J263J277O3
$$ plain form
56549 106919 106679 107259 108116 108321 108491 109866 112231 114423 116409 119154 122585 125444 127378 129533 132509
56534 132509 135134 136112 135805 135535 136030 137492 140415 145030 150188 153951 155534 155946 156528 157514 158394 159151
56518 159151 160436 162564 164908 166738 168335 170719 174133 177368 178953 178668 177570 176956 177913 181477 188199
56503 188199 197365 207400 217302 227203 237335 247247 256547 265846 276222 287820 299413 309258 316161
56490 316161 320044 321967 323428 325145 326470 326302 324510 321984 319233 315632 310545 304859 300562 298519
56476 298519 297313 294877 290920 286992 284229 282008 279123 275339 271131 266672 262100 258213 255727 254077
56462 254077 252158 250163 249378 250028 250719 250451 249678 248720 246692 243312 240393 239701 240108 238820 235161 231174
56446 231174 228409 226175 223564 221217 219780 218145 214912 210850 208217 207905 208702 209333 209856 210655 211274 210986
$$ packed form
56549A06919k40N80Q57K05J70J375K365K192J986K745L431K859J934K155K976
56534A32509K625R78l07k70M95J462K923M615N158L763J583M12N82R86Q80P57
56518A59151J285K128K344J830J597K384L414L235J585k85j098o14R57L564O722
56503A88199R166J0035R902R901J0132R912R300R299J0376J1598J1593R845O903
56490C16161L883J923J461J717J325j68j792k526k751l601n087n686m297k043
56476B98519j206k436l957l928k763k221k885l784m208m459m572l887k486j650
56462B54077j919j995p85O50O91k68p73r58k028l380k919o92M07j288l659l987
56446B31174k765k234k611k347j437j635l233m062k633l12P97O31N23P99O19k88
$$ plain form
56430 210986 209879 208671 207785 207183 206965 207541 209110 211208 212987 214016 214786 216289 218977 222193 224795
56415 224795 226130 226239 225384 223890 222419 221859 222679 224616 227041 229368 231144 232251 233224 234925 237582
56400 237582 240467 242783 244508 246073 247577 248839 249950 251157 252220 252416 251387 249686 248350 248140 249237
56385 249237 251351 253901 256206 257778 258603 259207 260308 262208 264402 265944 266293 265785 265421 266376 269411 274061
56369 274061 278326 279962 278618 276211 274776 274476 274286 273905 273957 274672 275544 276308 277188 278017 278196 277877 278150
56352 278150 279393 280299 279329 276651 273881 272310 272105 272940 274560 276669 278811 280503 281266 280748 279272 278176
56336 278176 279076 282561 287671 292642 296101 297836 298755 299974 301703 303105 303394 302826 302406 302885 304370 306579
56320 306579 308992 310871 311718 311772 311708 311796 311733 311371 311226 312069 314179 317212 320647 324138 327419 330087 331708
$$ packed form
56430B10986j107j208q86o02k18N76J569K098J779J029P70J503K688L216K602
56415B24795J335J09q55j494j471n60Q20J937K425K327J776J107R73J701K657
56400B37582K885K316J725J565J504J262J111J207J063J96j029j701j336k10J097
56385B49237K114K550K305J572Q25O04J101J900K194J542L49n08l64R55L035M650
56369B74061M265J636j344k407j435l00j90l81N2P15Q72P64Q80Q29J79l19K73
56352B78150J243R06r70k678k770j571k05Q35J620K109K142J692P63n18j476j096
56336B78176R00L485N110M971L459J735R19J219J729J402K89n68m20M79J485K209
56320C06579K413J879Q47N4o4Q8o3l62j45Q43K110L033L435L491L281K668J621
$$ plain form
56303 331708 332214 332076 331934 332135 332764 333983 335965 338483 340902 342681 343748 344478 345617 348067 352232 357496
56287 357496 362841 368050 373729 380064 386216 391254 395103 398236 401014 403719 406614 409533 412043 414487
56273 414487 418162 423754 430111 435341 438666 440519 441513 442381 444442 448791 454964 461367 467008 471881 475836
56258 475836 478283 479282 479730 480078 479852 478937 478299 478745 479817 480819 482242 485124 489312 493506 497105 501060
56242 501060 506423 512696 518365 522942 527768 534542 543469 553372 563285 573159 583055 592643 602014 612136
56228 612136 623668 635866 647605 659038 671192 684169 696949 709048 721193 734105 747708
56217 747708 762027 777931 796375 817457 840659 865344 890745 916384 943117 972896 1006678
56206 1006678 1043222 1080865 1119922 1162179 1208320 1257176 1307907 1361961 1422129 1489952 1564594
$$ packed form
56303C31708N06j38j42K01O29J219J982K518K419J779J067P30J139K450M165N264
56287C57496N345N209N679O335O152N038L849L133K778K705K895K919K510K444
56273D14487L675N592O357N230L325J853R94Q68K061M349O173O403N641M873L955
56258D75836K447R99M48L48k26r15o38M46J072J002J423K882M188M194L599L955
56242E01060N363O273N669M577M826O774Q927R903R913R874R896R588R371J0122
56228F12136J1532J2198J1739J1433J2154J2977J2780J2099J2145J2912J3603
56217G47708J4319J5904J8444K1082K3202K4685K5401K5639K6733K9779L3782
56206A006678L6544L7643L9057M2257M6141M8856N0731N4054O0168O7823P4642
$$ plain form
56195 1564594 1644254 1728426 1818601 1916861 2024119 2139942 2263782 2395823 2536692 2686993
56185 2686993 2847247 3017514 3196513 3381593 3570005 3759790 3948847 4133646 4309668
56176 4309668 4472925 4620271 4748228 4852385 4928605 4974705 4990893 4978655 4939243 4873008
56166 4873008 4780235 4662860 4525276 4373026 4210469 4039884 3862870 3682314 3502644 3328036
56156 3328036 3160475 2999559 2844211 2694594 2552435 2419663 2296885 2183099 2076710
56147 2076710 1976765 1883394 1797207 1718299 1645891 1578988 1517223 1460871 1410121 1364553 1323284
56136 1323284 1285403 1250266 1217637 1187652 1160593 1136703 1116146 1098772 1083713 1069570 1055461
56125 1055461 1041748 1029381 1018791 1009884 1002769 997802 995011 994138 995109 997670 1000587 1002204 1002077 1001367
$$ packed form
56195A564594P9660Q4172R0175R8260J07258J15823J23840J32041J40869J50301
56185B686993J60254J70267J78999J85080J88412J89785J89057J84799J76022
56176D309668J63257J47346J27957J04157P6220M6100J6188j2238l9412o6235
56166D873008r2773j17375j37584j52250j62557j70585j77014j80556j79670j74608
56156C328036j67561j60916j55348j49617j42159j32772j22778j13786j06389
56147B076710r9945r3371q6187p8908p2408o6903o1765n6352n0750m5568m1269
56136A323284l7881l5137l2629k9985k7059k3890k0557j7374j5059j4143j4109
56125A055461j3713j2367j0590q907p115m967k791q73R71K561K917J617j27p10
$$ plain form
56111 1001367 1001345 1002259 1003912 1006383 1009627 1013172 1016956 1021877 1028749 1037187 1046297 1056096 1067352 1080255
56097 1080255 1094241 1109290 1126492 1146828 1169917 1194554 1220339 1248222 1279332 1313729 1350803
56086 1350803 1390868 1435800 1487849 1548126 1616432 1692036 1774016 1861131 1951900 2044466 2135746
56075 2135746 2221191 2296634 2360733 2415132 2462435 2504842 2544253 2581931 2617345 2648376 2673321
56064 2673321 2691944 2704285 2709765 2708356 2701587 2691159 2676975 2657328 2630403 2594774 2549186 2493314
56052 2493314 2428873 2359171 2287569 2216854 2149668 2088313 2033691 1984898 1940256 1898844 1861325
56041 1861325 1829525 1804854 1786752 1772847 1760925 1750622 1743024 1738966 1737932 1738327 1738629 1738628 1739638 1743220
56027 1743220 1749668 1758106 1767773 1778399 1789598 1801104 1813781 1829040 1846805 1865232 1882984 1900538
$$ packed form
56111A001367k2R14J653K471L244L545L784M921O872Q438R110R799J1256J2903
56097A080255J3986J5049J7202K0336K3089K4637K5785K7883L1110L4397L7074
56086A350803M0065M4932N2049O0277O8306P5604Q1980Q7115R0769R2566R1280
56075B135746Q5445P5443O4099N4399M7303M2407L9411L7678L5414L1031K4945
56064B673321J8623J2341N480j409o769j0428j4184j9647k6925l5629m5588n5872
56052B493314o4441o9702p1602p0715o7186o1355n4622m8793m4642m1412l7519
56041A861325l1800k4671j8102j3905j1922j0303p598m058j034L95L02jJ010L582
56027A743220O448Q438R667J0626J1199J1506J2677J5259J7765J8427J7752J7554
$$ plain form
56015 1900538 1918587 1936552 1953882 1971680 1991614 2013813 2037001 2060303 2083917 2108399 2134085
56004 2134085 2160891 2188153 2215232 2242702 2272034 2303613 2336178 2368956 2403060 2439864 2479313
55993 2479313 2520953 2565192 2612089 2660313 2709094 2760045 2815070 2873438 2933011 2993546 3056407
55982 3056407 3121484 3186808 3251309 3315810 3381166 3447432 3515290 3586367 3661483 3739894 3820749
55971 3820749 3904210 3990965 4081765 4177413 4278064 4382613 4489983 4600890 4716991 4838564
55961 4838564 4964591 5095162 5232398 5378936 5536796 5707585 5892224 6090228 6300445
55952 6300445 6522769 6758398 7008747 7274997 7558046 7857810 8173372 8504991 8854929
55943 8854929 9224896 9614181 10022249 10451655 10905836 11385419 11889748 12421048 12983677
$$ packed form
56015A900538J8049J7965J7330J7798J9934K2199K3188K3302K3614K4482K5686
56004B134085K6806K7262K7079K7470K9332L1579L2565L2778L4104L6804L9449
55993B479313M1640M4239M6897M8224M8781N0951N5025N8368N9573O0535O2861
55982C056407O5077O5324O4501O4501O5356O6266O7858P1077P5116P8411Q0855
55971C820749Q3461Q6755R0800R5648J00651J04549J07370J10907J16101J21573
55961D838564J26027J30571J37236J46538J57860J70789J84639J98004K10217
55952F300445K22324K35629K50349K66250K83049K99764L15562L31619L49938
55943H854929L69967L89285M08068M29406M54181M79583N04329N31300N62629
$$ plain form
55934 12983677 13579954 14210417 14878012 15588201 16344489 17147303 17997765 18899167 19854106
55925 19854106 20863720 21930807 23060514 24257033 25522841 26862604 28285370 29802332
55917 29802332 31425333 33168110 35045762 37072421 39262791 41636878 44220430 47041194
55909 47041194 50129093 53520519 57258522 61389369 65965062 71050705 76724466 83069424
55901 83069424 90170454 98118488 107010115 116942039 128014475 140342721 154058752 169303078
55893 169303078 186228705 205016892 225873478 248990010 274470270 302177536 331441301
55886 331441301 360714417 387488071 408736665 421787779 425144009 418813485 404079952
55879 404079952 382967058 357690178 330255546 302250264 274803858 248655386 224246576
$$ packed form
55934A2983677N96277O30463O67595P10189P56288Q02814Q50462R01402R54939
55925A9854106J009614J067087J129707J196519J265808J339763J422766J516962
55917B9802332J623001J742777J877652K026659K190370K374087K583552K820764
55909D7041194L087899L391426L738003M130847M575693N085643N673761O344958
55901H3069424P101030P948034Q891627R931924J1072436J2328246J3716031J5244326
55893A69303078J6925627J8788187K0856586K3116532K5480260K7707266K9263765
55886C31441301K9273116K6773654K1248594J3051114L356230o330524j4733533
55879D04079952k1112894k5276880k7434632k8005282k7446406k6148472k4408810
$$ plain form
55872 224246576 201799865 181383060 162965213 146456016 131729072 118640478 107044528
55865 107044528 96798280 87758114 79782110 72739847 66517256 61012709 56133871 51799324
55857 51799324 47938057 44485070 41380522 38574092 36026631 33706195 31585131 29641324
55849 29641324 27858178 26220940 24714506 23325088 22041355 20853029 19750567 18726896
55841 18726896 17777206 16896215 16077226 15313872 14600695 13932087 13303189 12712063 12158439
55832 12158439 11640016 11152561 10693888 10264522 9863153 9484084 9120831 8770340 8432345
55823 8432345 8106542 7792043 7488279 7194910 6911586 6638523 6376317 6124784 5883395
55814 5883395 5653167 5436175 5232217 5037791 4849609 4667627 4493265 4326116 4164177
$$ packed form
55872B24246576k2446711k0416805j8417847j6509197j4726944j3088594j1595950
55865A07044528j0246248r040166p976004p042263o222591n504547m878838m334547
55857E1799324l861267l452987l104548k806430k547461k320436k121064j943807
55849B9641324j783146j637238j506434j389418j283733j188326j102462j023671
55841A8726896r49690q80991q18989p63354p13177o68608o28898n91126n53624
55832A2158439n18423m87455m58673m29366m01369l79069l63253l50491l37995
55823H432345l25803l14499l03764k93369k83324k73063k62206k51533k41389
55814E883395k30228k16992k03958j94426j88182j81982j74362j67149j61939
$$ plain form
55805 4164177 4006352 3853030 3704620 3561105 3422958 3291265 3166666 3048782 2936664
55796 2936664 2829413 2726502 2627924 2534032 2445211 2361922 2284767 2213711 2147080 2082238 2017854
55785 2017854 1955187 1896840 1844423 1797313 1753163 1709607 1666074 1624088 1585426 1550168 1517073
55774 1517073 1485410 1455377 1426816 1398689 1370150 1341321 1312699 1284536 1256972 1230133 1203984
55763 1203984 1178697 1154999 1133225 1112123 1089826 1066222 1043200 1022142 1002284 982170 961749
55752 961749 942155 924018 906842 889836 872770 856081 840419 826151 813424 802789 795211 790860
55740 790860 788314 785814 782986 780446 778075 775016 771336 768308 766732 766112 765732 765420 764976 764111 763522 764861
55724 764861 768920 774705 780746 786252 790329 791200 787355 778987 767524 754196 739675 724586 709664
$$ packed form
55805D164177j57825j53322j48410j43515j38147j31693j24599j17884j12118
55796B936664j07251j02911r8578r3892q8821q3289p7155p1056o6631o4842o4384
55785B017854o2667n8347n2417m7110m4150m3556m3533m1986l8662l5258l3095
55774A517073l1663l0033k8561k8127k8539k8829k8622k8163k7564k6839k6149
55763A203984k5287k3698k1774k1102k2297k3604k3022k1058j9858k0114k0421
55752I61749j9594j8137j7176j7006j7066j6689j5662j4268j2727j0635p578m351
55740G90860k546k500k828k540k371l059l680l028j576o20l80l12m44q65n89J339
55724G64861M059N785O041N506M077Q71l845q368j1463j3328j4521j5089j4922
$$ plain form
55711 709664 695524 682531 670523 658670 646289 633839 622237 611107 598924 585267 571696
55700 571696 559732 549254 539718 531716 525989 521723 517245 512024 506760 501755 496286 489608 481734 473251
55686 473251 464997 457765 451679 445872 439255 431480 422913 414063 405584 398493 393676 391099 389691 387854
55672 387854 384256 378737 372748 368249 365833 364326 362302 359193 354803 348935 342024 335081 328277 320672
55658 320672 312115 304254 298556 294468 290906 288546 288833 291255 293524 294413 294851 296083 298192 300687 303174
55643 303174 305036 305578 304932 303980 303108 301866 299930 297429 294203 289893 285109 281353 279210 277540 275077
55628 275077 272028 269467 267950 267385 267586 268144 268227 267278 265660 264068 262602 260942 259067 257173 255077 252325
55612 252325 248861 245128 241519 238142 235184 233208 232910 234523 237379 240141 241817 242613 243451 244576 245104
$$ packed form
55711G09664j4140j2993j2008j1853j2381j2450j1602j1130j2183j3657j3571
55700E71696j1964j0478r536q002n727m266m478n221n264n005n469o678p874q483
55686D73251q254p232o086n807o617p775q567q850q479p091m817k577j408j837
55672C87854l598n519n989m499k416j507k024l109m390n868o911o943o804p605
55658C20672q557p861n698m088l562k360K87K422K269Q89M38J232K109K495K487
55643C03174J862N42o46r52q72j242j936k501l226m310m784l756k143j670k463
55628B75077l049k561j517n65K01N58Q3r49j618j592j466j660j875j894k096k752
55612B52325l464l733l609l377k958j976k98J613K856K762J676P96Q38J125N28
$$ plain form
55597 245104 244194 242166 240122 238885 238833 240247 242976 245776 246865 245544 242832 240196 238057 235977 234012
55582 234012 233188 234373 237092 239849 241636 242824 244510 247127 249838 251196 250321 247504 243849 240330 237106
55567 237106 233675 229609 224958 219894 214286 208004 201571 196075 192209 189603 187265 184448 180885 176607
55553 176607 172115 168608 167196 167472 167504 165834 163053 160627 158571 155441 150673 145593 141551 138291 135147
55538 135147 132860 132649 133839 133936 131356 127034 123153 121273 121847 124372 127397 129212 129239 128261 127000 125166
55522 125166 122284 118722 115404 113132 112616 114359 117860 121594 124525 127138 130410 134341 138092 140995
55508 140995 142811 143549 143674 143900 144127 143324 141173 139005 138152 138176 137810 136808 135567 133636 130318 126332
55492 126332 123137 120707 117657 113588 109654 106674 104469 103365 104406 107294 109955 111195 112170 113949
$$ packed form
55597B45104r10k028k044j237n2J414K729K800J089j321k712k636k139k080j965
55582B34012q24J185K719K757J787J188J686K617K711J358q75k817l655l519l224
55567B37106l431m066m651n064n608o282o433n496l866k606k338k817l563m278
55553A76607m492l507j412K76L2j670k781k426k056l130m768n080m042l260l144
55538A35147k287k11J190R7k580m322l881j880N74K525L025J815K7r78j261j834
55522A25166k882l562l318k272n16J743L501L734K931K613L272L931L751K903
55508A40995J816P38J25K26K27q03k151k168q53K4l66j002j241j931l318l986
55492A26332l195k430l050m069l934k980k205j104J041K888K661J240R75J779
$$ plain form
55478 113949 115234 114271 111970 111202 113428 117622 122137 125881 127763 126948 124356 122623 123671 126971 130752
55463 130752 134098 137071 139330 139770 137753 134133 130647 128382 127054 125731 123942 121893 119863 117947
55449 117947 116422 115708 115605 114991 112889 109676 106763 105126 104543 104106 102947 100533 96949 93211 90828
55434 90828 90464 91101 90865 88794 85730 83641 84202 87837 93522 99256 103120 104489 104321 103954 103534 101991
55418 101991 98688 94653 91823 91299 92661 94759 96736 98344 99632 100408 100003 97859 94446 91057 88286
55403 88286 85344 81554 77833 75576 74454 72796 70252 68586 69202 71136 72438 72578 72411 72449 72430 72320
55387 72320 72607 73516 74681 75750 76746 77818 79087 80650 82232 83044 82659 81921 82240 83789 85019 84270
55371 84270 81470 78109 75866 75384 75985 76411 76088 75748 76463 78154 79596 80109 80677 82942 87278 92242
$$ packed form
55478A13949J285r63k301p68K226M194M515L744J882q15k592j733J048L300L781
55463A30752L346K973K259M40k017l620l486k265j328j323j789k049k030j916
55449A17947j525p14j03o14k102l213k913j637n83m37j159k414l584l738k383
55434I0828l64O37k36k071l064k089N61L635N685N734L864J369j68l67m20j543
55418A01991l303m035k830n24J362K098J977J608J288P76m05k144l413l389k771
55403H8286k942l790l721k257j122j658k544j666O16J934J302J40j67L8j9j10
55387G2320K87R09J165J069R96J072J269J563J582Q12l85p38L19J549J230p49
55371H4270k800l361k243m82O01M26l23l40P15J691J442N13N68K265M336M964
$$ plain form
55355 92242 95761 96540 94520 90475 85451 80392 76036 72961 71576 71942 73519 75186 75705 74548 72469
55340 72469 71164 71992 74860 78363 80925 81719 80706 78339 75462 73072 71766 71451 71883 73198 75391
55325 75391 77422 77791 76475 75581 77117 80373 82557 82158 80618 80140 80877 81288 80724 80267 80920 82102 82464
55308 82464 81570 80164 79123 78625 78272 77828 77770 78947 81324 83290 82890 79912 76155 73435 72048 71531
55292 71531 72117 74538 78691 83352 87218 89752 91037 91427 91481 91721 92159 92210 91287 89515 87785 87064 87417
55275 87417 87740 86768 84575 82768 82837 84423 85566 84626 81719 78344 75974 75204 75971 78131 81449 85139
55259 85139 87993 89440 90208 91317 92562 92710 91264 89195 87613 86542 85653 85461 86805 89413 91887
55244 91887 93190 93574 93964 94900 96128 96876 96563 95466 94501 94028 93206 91117 88255 86132 85394 85074 84007
$$ packed form
55355I2242L519P79k020m045n024n059m356l075j385L66J577J667N19j157k079
55340G2469j305Q28K868L503K562P94j013k367k877k390j306l15M32J315K193
55325G5391K031L69j316q94J536L256K184l99j540m78P37M11n64m57O53J182L62
55308H2464q94j406j041m98l53m44n8J177K377J966m00k978l757k720j387n17
55292G1531N86K421M153M661L866K534J285L90N4K40M38N1r23j772j730p21L53
55275H7417L23r72k193j807O9J586J143r40k907l375k370p70P67K160L318L690
55259H5139K854J447P68J109J245J48j446k069j582j071q89j92J344K608K474
55244I1887J303L84L90R36J228P48l13j097r65m73q22k089k862k123p38l20j067
$$ plain form
55227 84007 82416 81731 83088 86305 90090 93013 94334 94125 92863 91175 89904 89897 91303 93300 94824 95406
55211 95406 95147 94294 93301 92889 93388 94199 94471 94140 93792 93752 93944 94386 95081 95542 95237 94490 94130 94230 94028
55192 94028 93226 92418 92061 91913 91837 92253 93269 94156 94349 94298 94634 95071 94900 94147 93408 92778 91808 90507 89632
55173 89632 89775 90684 91617 91965 91319 89326 85991 82168 79448 79117 81075 83943 86485 88722 91366 94393
55157 94393 96788 97718 97456 96999 97126 97854 98376 97591 95249 92552 90935 90235 88949 86511 84298 83864 85112
55140 85112 86862 88269 88818 87861 85506 83496 83818 86485 89765 92510 95050 97744 99975 101106 101476
55125 101476 101818 102321 102746 102938 102827 102359 101784 101517 101490 101224 100788 100956 101981 103036 103529 104238 106181 108914
55107 108914 111059 112272 113440 114830 115272 113796 111181 109139 108498 108865 109538 109913 109283 107281 104687 102992
$$ packed form
55227H4007j591o85J357L217L785K923J321k09j262j688j271pJ406J997J524N82
55211I5406k59q53r93m12M99Q11K72l31l48m0J92M42O95M61l05p47l60J00k02
55192I4028q02q08l57j48p6M16J016Q87J93n1L36M37j71p53p39o30r70j301q75
55173H9632J43R09R33L48o46j993l335l823k720l31J958K868K542K237K644L027
55157I4393K395R30k62m57J27P28N22p85k342k697j617p00j286k438k213m34J248
55140H5112J750J407N49r57k355k010L22K667L280K745K540K694K231J131L70
55125A01476L42N03M25J92j11m68n75k67k7k66m36J68J025J055M93P09J943K733
55107A08914K145J213J168J390M42j476k615k042o41L67O73L75o30k002k594j695
$$ plain form
55091 102992 102859 103588 104317 105012 105831 106258 105713 104668 104248 104788 105521 105709 105313 104463 103110 101546 100498
55074 100498 100149 99712 98599 97574 97942 99775 101660 102218 101319 99729 98064 96367 94475 92604 91498
55059 91498 91819 93414 95500 97740 100651 104668 109278 113510 116796 118826 119196 118064 116702 116266 116234 115244
55043 115244 113497 112905 114424 116486 116965 115857 115079 116073 118374 120124 119473 115911 110960 107264 106450 108117
55027 108117 111083 114746 118542 121139 121544 120602 120005 119932 119065 117050 115453 115675 117042 117798 117175 115706
55011 115706 114080 112591 111449 110969 111393 112761 114737 116476 117211 117206 117587 118930 120596 121854 122883 124138
54995 124138 125467 126690 128326 130724 132999 134023 134123 134459 134892 133935 131131 128106 126627 126699 127275 127863
54979 127863 128620 129568 130579 131587 132043 130841 127694 124046 121591 120233 118617 116399 114641 113869 113114
$$ packed form
55091A02992j33P29P29O95Q19M27n45j045m20N40P33J88l96q50j353j564j048
55074A00498l49m37j113j025L68J833J885N58q99j590j665j697j892j871j106
55059I1498L21J595K086K240K911M017M610M232L286K030L70j132j362m36l2r90
55043A15244j747n92J519K062M79j108p78R94K301J750o51l562m951l696q14J667
55027A08117K966L663L796K597M05r42n97p3q67k015j597K22J367P56o23j469
55011A15706j626j489j142m80M24J368J976J739P35nL81J343J666J258J029J255
54995A24138J329J223J636K398K275J024J00L36M33r57k804l025j479P2N76N88
54979A27863P57R48J011J008M56j202l147l648k455j358j616k218j758p72p55
$$ plain form
54964 113114 111567 110207 110767 113465 116584 118388 119000 120185 123352 127907 131765 133505 133734 134040 135054
54949 135054 136116 136530 136256 135337 133605 131325 129397 128454 128274 128395 128699 129023 128942 128548 128711 129741 130407
54932 130407 129372 127282 126231 127149 128905 130308 131807 134390 137615 139672 139262 136737 133558 131240 130720
54917 130720 132014 134085 135477 135513 134835 134492 134557 133968 131892 128981 126926 126835 128340 130281 131765 132430 132292
54900 132292 131921 132345 134021 135955 136646 135996 135588 136789 139295 142004 144623 147561 150552 152303 151742 149093
54884 149093 145547 142274 139900 138559 138100 138286 138943 139924 141054 142198 143222 143698 142901 140650 138086 136942
54868 136942 137747 139173 139518 138600 137879 138956 142259 146940 151582 155069 157216 158661 160065 161526 163039
54853 163039 165237 169061 174512 180279 184943 188344 191451 195088 199169 203115 206451 208744 209310 207627
$$ packed form
54964A13114j547j360N60K698L119J804O12J185L167M555L858J740K29L06J014
54949A35054J062M14k74r19j732k280j928r43j80J21L04L24q1l94J63J030O66
54932A30407j035k090j051R18J756J403J499K583L225K057m10k525l179k318n20
54917A30720J294K071J392L6o78l43O5n89k076k911k055r1J505J941J484O65j38
54900A32292l71M24J676J934O91o50m08J201K506K709K619K938K991J751n61k649
54884A49093l546l273k374j341m59J86O57R81J130J144J024M76p97k251k564j144
54868A36942Q05J426L45r18p21J077L303M681M642L487K147J445J404J461J513
54853A63039K198L824N451N767M664L401L107L637M081L946L336K293N66j683
$$ plain form
54839 207627 204250 200871 198923 198160 197034 194495 190858 186728 181877 176018 170273 166698 166101 167050 167480
54824 167480 166625 164943 162812 160209 157499 155700 155596 156872 158347 158985 158762 158742 160368 164539 171154 179267
54808 179267 187427 194067 198291 200680 202942 206364 210730 214890 217948 219587 219743 218553 216315 212936
54794 212936 207763 200643 192896 186379 181568 177287 172324 166630 160905 155915 152511 151535 152997 155617
54780 155617 157515 157212 154177 149151 144117 141126 140545 140851 140444 139125 137604 136384 135786 136304 137984 139833
54764 139833 140683 140477 140002 139608 139045 138451 138512 139381 140174 140000 139099 138637 139507 141409 143004 143088 141855 140879
54746 140879 141508 143502 145678 147588 149733 152125 153652 153500 152570 152610 154029 155296 154757 152557 150321 149179
54730 149179 148714 148059 147378 147582 148762 149828 149962 149630 149622 149764 149408 148820 149037 150339 151735 152233 151997 151887
$$ packed form
54839B07627l377l379j948p63j126k539l637m130m851n859n745l575n97R49M30
54824A67480q55j682k131k603k710j799j04J276J475O38k23k0J626M171O615Q113
54808A79267Q160O640M224K389K262L422M366M160L058J639J56j190k238l379
54794B12936n173p120p747o517m811m281m963n694n725m990l404r76J462K620
54780A55617J898l03l035n026n034k991n81L06m07j319j521j220n98N18J680J849
54764A39833Q50k06m75l94n63n94O1Q69P93j74r01m62Q70J902J595Q4j233r76
54746A40879O29J994K176J910K145K392J527j52r30M0J419J267n39k200k236j142
54730A49179m65o55o81K04J180J066J34l32qJ42l56n88K17J302J396M98k36j10
$$ plain form
54712 151887 152393 153463 155040 157261 160101 163013 165115 165927 166052 166892 169353 173010 176892 180898 185888
54697 185888 192407 199958 207633 214910 221520 226973 230693 232563 233133 233215 233172 232479 230230 226335 221933 218231
54681 218231 215255 212302 209294 206781 204716 202222 198864 195281 192203 189682 187664 186461 185958 185089 182922
54666 182922 179851 177042 175207 174586 175589 178382 181981 184774 186115 186747 187610 188941 190679 193033 196211
54651 196211 199969 203803 207442 211018 214847 218957 222621 224536 223883 221162 217630 214032 210375 206714
54637 206714 203324 199916 195633 190431 185834 183482 183128 182873 181311 178684 175821 172810 169356 165878 163333
54622 163333 161969 161063 160096 159448 159435 159245 157730 155141 153283 153643 155811 157919 158339 156876 154728 153456
54606 153456 153646 154419 154471 153552 152341 150966 148567 144775 140715 137804 136169 135170 134966 136410 139428 142580
$$ packed form
54712A51887N06J070J577K221K840K912K102Q12J25Q40K461L657L882M006M990
54697A85888O519P551P675P277O610N453L720J870N70Q2m3o93k249l895m402l702
54681B18231k976k953l008k513k065k494l358l583l078k521k018j203n03q69k167
54666A82922l071k809j835o21J003K793L599K793J341O32Q63J331J738K354L178
54651A96211L758L834L639L576L829M110L664J915o53k721l532l598l657l661
54637B06714l390l408m283n202m597k352l54k55j562k627k863l011l454l478k545
54622A63333j364r06r67o48j3j90j515k589j858L60K168K108M20j463k148j272
54606A53456J90P73N2r19j211j375k399l792m060k911j635r99k04J444L018L152
$$ plain form
54590 142580 144461 144793 144070 143053 142867 144588 147919 150836 151417 149929 148542 149014 151059 152995 153609 153183
54574 153183 152859 153225 153747 153666 153169 153223 154265 155600 156328 156413 156424 156513 156160 154889 152847 150700 149235 149073
54556 149073 150252 151838 152286 150784 148359 147250 148779 151977 154640 155713 156100 157105 158728 159997 160406
54541 160406 160164 159228 157096 153890 150864 149265 149127 149649 150359 151303 152330 152936 152945 152813 153078 153801 154717 155550
54523 155550 155941 155437 154067 152793 152774 153889 154459 153019 150219 148350 148850 150826 152357 152593 152002 151074
54507 151074 149809 148440 147634 147577 147630 147391 147510 148750 150680 152088 152634 153287 154952 157233 158921 159428 159378
54490 159378 159804 161090 162786 164390 166005 168096 170686 173090 174476 174501 173427 171948 170939 170890 171352 171315
54474 171315 170417 169370 168905 168850 168811 169138 170200 171025 170015 167345 165374 165885 167762 168460 167283 166023 166425
$$ packed form
54590A42580J881L32p23j017j86J721L331K917N81j488j387M72K045J936O14m26
54574A53183l24L66N22q1m97N4J042J335P28Q5J1Q9l53j271k042k147j465j62
54556A49073J179J586M48j502k425j109J529L198K663J073L87J005J623J269M09
54541A60406k42r36k132l206l026j599j38N22P10R44J027O06Rj32K65P23R16Q33
54523A55550L91n04j370j274j9J115N70j440k800j869N00J976J531K36n91r28
54507A51074j265j369q06n7N3k39J19J240J930J408N46O53J665K281J688N07n0
54490A59378M26J286J696J604J615K091K590K404J386K5j074j479j009m9M62l7
54474A71315q98j047m65n5l9L27J062Q25j010k670j971N11J877O98j177j260M02
$$ plain form
54457 166425 168213 169993 171119 171908 172545 172688 172208 171706 171973 173079 174187 174275 173127 171632 170924 171077 170922
54440 170922 169462 167243 165834 165957 166691 166780 166301 166553 168453 171395 173704 174067 172611 170670 169320 168141
54424 168141 165833 162296 159437 159272 161577 164332 166374 168639 172443 177504 182336 185974 188492 190142
54410 190142 190874 190826 190597 190695 190976 190877 190140 189186 188737 189066 189696 190024 190120 190539 191353 191984 192152 192311 192647 192362
54390 192362 190812 188913 188360 189470 190748 190778 189718 188656 188249 188414 188708 188506 187307 185393 183769 182968
54374 182968 182333 181060 179582 179125 180006 181114 181318 180831 180814 181903 183572 184949 185917 187027 188391 189168
54358 189168 188625 187446 187324 189127 191978 194276 195100 194431 192788 191199 190946 192597 195513 198771 202143
54343 202143 205528 207977 208300 206546 203972 201526 199280 197407 196659 197360 198665 199412 199309 198977 199329 201116
$$ packed form
54457A66425J788J780J126P89O37J43m80n02K67J106J108Q8j148j495p08J53j55
54440A70922j460k219j409J23P34Q9m79K52J900K942K309L63j456j941j350j179
54424A68141k308l537k859j65K305K755K042K265L804N061M832L638K518J650
54410A90142P32m8k29R8K81r9p37r54m49L29O30L28R6M19Q14O31J68J59L36k85
54390A92362j550j899n53J110J278L0j060j062m07J65K94k02j199j914j624q01
54374A82968o35j273j478m57Q81J108K04m87j7J089J669J377R68J110J364P77
54358A89168n43j179j22J803K851K298Q24o69j643j589k53J651K916L258L372
54343B02143L385K449L23j754k574k446k246j873p48P01J305P47j03l32L52J787
$$ plain form
54327 201116 204481 208458 211475 212867 213487 214404 215551 216162 215973 215194 213787 211721 209807 209241 210162 211415
54311 211415 212006 212082 212198 212274 211881 211263 211525 213685 217656 222122 225440 226881 227125 227463 228601 230396 232541
54294 232541 235022 237811 240625 243295 246083 249277 252652 255599 257725 259115 260021 260406 259813 257767 254493
54279 254493 251169 249026 248009 246669 243774 239804 236331 233985 231525 227260 221048 214526 209487 206438
54265 206438 204804 203956 203573 203289 202774 202398 203144 205271 207466 208067 207062 206100 206334 207003 206600 204931 203300
54248 203300 202866 203550 204647 205867 207332 208843 209717 209510 208618 207930 207927 208304 208461 208062 206966 205021 202405
54231 202405 200059 199125 199688 200554 200595 199930 199363 199058 198497 197599 197074 197466 198491 199732 201416 203910 206805
54214 206805 209177 210674 211726 212648 213201 213219 213084 213096 212874 211918 210575 209937 210816 213164 216303 219235 220833
$$ packed form
54327B01116L365L977L017J392O20R17J147O11j89p79j407k066j914n66R21J253
54311B11415N91P6J16P6l93o18K62K160L971M466L318J441K44L38J138J795K145
54294B32541K481K789K814K670K788L194L375K947K126J390R06L85n93k046l274
54279B54493l324k143j017j340k895l970l473k346k460m265o212o522n039l049
54265B06438j634q48l83k84n15l76P46K127K195O01j005r62K34O69m03j669j631
54248B03300m34O84J097J220J465J511Q74k07q92o88lL77J57l99j096j945k616
54231B02405k346r34N63Q66M1o65n67l05n61q98n25L92J025J241J684K494K895
54214B06805K372J497J052R22N53J8j35J2k22r56j343o38Q79K348L139K932J598
$$ plain form
54197 220833 220419 218376 215900 214076 213415 214008 215443 216610 216449 215206 214283 214587 215752 217218 218986 220605
54181 220605 220542 217880 214043 211411 210501 209857 208600 207527 207364 207473 207148 206998 207992 209875 211526 212441 212905
54164 212905 212982 212318 210963 209634 208924 208669 208234 207172 205551 203949 203223 204112 206782 210545 213980 215670
54148 215670 215221 213464 211338 208857 205694 202520 200881 201590 203941 206600 208524 209004 207897 206271 205828
54133 205828 207074 208813 209921 210667 211588 212130 211450 209818 208154 206786 205694 205339 206016 206884 206821 205899 204809
54116 204809 203328 200846 198223 197487 199462 202947 206399 209146 210838 211200 210816 210767 210935 209928 207352 204862
54100 204862 204118 204849 205933 207312 209513 212036 213662 214083 214058 214006 213458 211913 209407 206191 202653 199731
54084 199731 198623 199565 201179 201555 200123 198380 198530 201299 205170 207896 208532 207786 206893 206859 208401 211518
$$ packed form
54197B20833m14k043k476j824o61N93J435J167j61j243r23L04J165J466J768J619
54181B20605o3k662l837k632r10o44j257j073j63J09l25j50R94J883J651R15M64
54164B12905P7o64j355j329p10k55m35j062j621j602p26Q89K670L763L435J690
54148B15670m49j757k126k481l163l174j639P09K351K659J924M80j107j626m43
54133B05828J246J739J108P46R21N42o80j632j664j368j092l55O77Q68o3r22j090
54116B04809j481k482k623p36J975L485L452K747J692L62l84m9J68j007k576k490
54100B04862p44P31J084J379K201K523J626M21k5n2n48j545k506l216l538k922
54084A99731j108R42J614L76j432j743J50K769L871K726O36p46q93l4J542L117
$$ plain form
54068 211518 214855 216472 215721 213837 212448 212185 212972 214782 217489 220424 222552 222811 220552 216525 213376
54053 213376 213795 217616 221859 224159 224900 225389 225573 224886 224016 224077 224758 224860 224174 223367 222558 221525 220939 221799
54035 221799 223862 226084 228343 231183 234149 236103 237117 238206 239121 238394 235917 233438 231809 229778 226573
54020 226573 223825 223460 225174 227533 230399 234561 239790 244905 249199 252412 253929 253553 252674 253077 254808
54005 254808 256654 258567 261854 266840 272050 276298 280244 285093 290968 297439 304565 312273 319346 324286
53991 324286 326947 328302 328720 327536 324535 320849 317783 315387 313015 311027 310994 313848 318492 322898 326397
53976 326397 330134 335164 340840 345689 349497 353683 359507 366507 373053 378096 381916 385391 389039 392917
53962 392917 396981 401100 404812 407435 408604 408565 407913 407126 406356 405379 403612 400480 395992 390631 384427 376527
$$ packed form
54068B11518L337J617p51j884j389k63P87J810K707K935K128K59k259m027l149
54053B13376M19L821M243K300P41M89J84o87q70O1O81J02o86q07q09j033n86Q60
54035B21799K063K222K259K840K966J954J014J089R15p27k477k479j629k031l205
54020B26573k748l65J714K359K866M162N229N115M294L213J517l76q79M03J731
54005B54808J846J913L287M986N210M248L946M849N875O471P126P708P073M940
53991C24286K661J355M18j184l001l686l066k396k372j988l3K854M644M406L499
53976C26397L737N030N676M849L808M186N824P000O546N043L820L475L648L878
53962C92917M064M119L712K623J169l9o52p87p70r77j767l132m488n361o204p900
$$ plain form
53946 376527 366300 354793 344406 336990 332577 329915 327671 325037 321962 319252 317938 317990 317968 316413
53932 316413 313368 310091 307451 305090 302137 298384 294704 292403 291991 292487 292279 290924 289684 289831 290849
53917 290849 291056 289773 288056 287212 287540 288841 291269 294786 298232 299977 299769 299294 300584 304243 309492
53902 309492 315480 321886 328372 334261 339108 343094 346454 348922 350190 350527 350344 349531 348056 347035 348045
53887 348045 351152 354586 356888 358463 360385 362569 364114 364903 365929 368296 372656 379147 386946 394251
53873 394251 399924 405057 411852 420966 431026 440714 449978 459028 467603 475867 484675 494124 503117 511468
53859 511468 521244 534470 550335 566457 582527 600679 621846 643440 661427 673585 679954 681246
53847 681246 678050 671093 661092 648370 633368 617561 603170 591700 583003 575717 568369 560228 551617
$$ packed form
53946C76527j0227j1507j0387p416m413k662k244k634l075k710j314N2k2j555
53932C16413l045l277k640k361k953l753l680k301m12M96k08j355j240J47J018
53917B90849K07j283j717q44L28J301K428L517L446J745k08m75J290L659N249
53902C09492N988O406O486N889M847L986L360K468J268L37j83q13j475j021J010
53887C48045L107L434K302J575J922K184J545P89J026K367M360O491P799P305
53873C94251N673N133O795R114J0060R688R264R050Q575Q264Q808R449Q993Q351
53859E11468R776J3226J5865J6122J6070J8152K1167K1594J7987J2158O369J292
53847F81246l196o957j0001j2722j5002j5807j4391j1470q697p286p348q141q611
$$ plain form
53834 551617 543514 536506 529935 522257 512426 500846 488910 477627 466800 455621 444100 433606
53822 433606 425579 419751 414222 407603 400558 394730 390605 387117 383103 378191 372339 365567 358649 353123
53808 353123 349718 347149 343343 337772 331888 327309 324256 321922 319715 317706 316242 315548 315547 315786 315615 314704
53792 314704 313295 311798 310260 308461 306451 304711 303671 303220 302745 301582 299489 296965 295253 295634 298172
53777 298172 301058 301810 299683 296719 295862 298094 301915 305550 308726 311872 314567 315884 315883 315590 315470 314944
53761 314944 313706 312511 312147 312416 312819 313596 315285 317691 320144 322519 325231 328385 331762 335548 340254
53746 340254 345743 351122 355826 360236 364958 370121 375658 381676 388164 394790 401362 407954 414167 418838
53732 418838 421125 421603 421699 422273 423247 424309 425180 425339 424303 422476 421024 420502 419925 417602 412850 406719
$$ packed form
53834E51617q103p008o571p678r831j1580j1936j1283j0827j1179j1521j0494
53822D33606q027n828n529o619p045n828m125l488m014m912n852o772o918n526
53808C53123l405k569l806n571n884m579l053k334k207k009j464o94jK39j71r11
53792C14704j409j497j538j799k010j740j040m51m75j163k093k524j712L81K538
53777B98172K886P52k127k964q57K232L821L635L176L146K695J317jk93j20n26
53761C14944j238j195l64K69M03P77J689K406K453K375K712L154L377L786M706
53746C40254N489N379M704M410M722N163N537O018O488O626O572O592O213M671
53732D18838K287M78R6N74R74J062Q71J59j036j827j452n22n77k323m752o131
$$ plain form
53716 406719 401086 397087 394332 391604 388256 384635 381101 377191 372295 366766 361547 356779 351604 345566
53702 345566 339430 334211 330003 326206 322464 318856 315567 312889 311284 310970 311538 312316 312933 313331 313507 313571
53686 313571 313744 314005 314051 313829 313653 313528 313027 312385 312982 315790 319808 322997 324537 325190 325817 326725 328301
53669 328301 330874 333793 336014 338007 341667 347629 353963 358494 361364 364247 367921 371937 375948 379933
53655 379933 383348 385471 386610 387888 389787 391966 394562 398420 403648 408980 413208 416606 420296 424695
53641 424695 429163 432925 435831 438316 440931 443918 447088 450026 452367 453883 454685 455477 457119 459470 461224
53626 461224 461659 462038 464182 467844 470794 471665 471342 471028 470301 468143 464850 461623 458754 455573 452037 449172
53610 449172 447750 447460 447627 447973 448339 448354 447861 447268 447074 447320 447766 448228 448445 447973 446705 445312 444641 444746
$$ packed form
53716D06719n633l999k755k728l348l621l534l910m896n529n219m768n175o038
53702C45566o136n219m208l797l742l608l289k678j605l14N68P78O17L98J76O4
53686C13571J73K61M6k22j76j25n01o42N97K808M018L189J540O53O27R08J576
53669C28301K573K919K221J993L660N962O334M531K870K883L674M016M011L985
53655C79933L415K123J139J278J899K179K596L858N228N332M228L398L690M399
53641D24695M468L762K906K485K615K987L170K938K341J516Q02P92J642K351J754
53626D61224M35L79K144L662K950Q71l23l14p27k158l293l227k869l181l536k865
53610D49172j422k90J67L46L66J5m93n93j94K46M46M62K17m72j268j393o71J05
$$ plain form
53592 444746 444915 444691 444358 444372 444846 445994 448487 452705 457828 462407 465863 468769 471573 473876 475381 476760
53576 476760 478873 481622 484339 486945 489913 493330 496946 501112 506709 513884 521673 529101 535984 542376
53562 542376 548036 552845 557162 561344 565568 570523 577494 586920 597396 607031 615545 624206 633869 644043
53548 644043 653994 663753 673407 682059 688391 692257 694960 697556 699318 698627 695322 691379 688781 687336
53534 687336 685370 682167 678647 675552 672128 667196 660870 654581 649824 647296 646734 647008 646752 645446 643730
53519 643730 642312 640958 638937 635984 632253 627756 622631 617708 614042 611864 610637 610078 610439 611665 613014
53504 613014 613875 614604 616128 618889 622472 626179 629734 633367 637372 641846 646886 652691 659160 665692 671824
53489 671824 677867 684262 690497 695590 699854 705273 713654 725068 738422 752656 766836 780084 792535
$$ packed form
53592D44746J69k24l33J4M74J148K493M218N123M579L456K906K804K303J505J379
53576D76760K113K749K717K606K968L417L616M166N597P175P789P428O883O392
53562E42376N660M809M317M182M224M955O971R426J0476R635Q514Q661R663J0174
53548F44043R951R759R654Q652O332L866K703K596J762o91l305l943k598j445
53534F87336j966l203l520l095l424m932o326o289m757k528n62K74k56j306j716
53519F43730j418j354k021k953l731m497n125m923l666k178j227n59L61J226J349
53504F13014Q61P29J524K761L583L707L555L633M005M474N040N805O469O532O132
53489F71824O043O395O235N093M264N419Q381J1414J3354J4234J4180J3248J2451
$$ plain form
53476 792535 805895 822031 841139 861908 883048 903951 924442 944919 966520 990202 1015655
53465 1015655 1041782 1068010 1094509 1121588 1149816 1180311 1213726 1249069 1284632 1320096 1356634
53454 1356634 1394994 1434722 1475508 1517989 1562586 1608363 1653707 1697546 1739552 1779844 1819083
53443 1819083 1858384 1898567 1939543 1980484 2020428 2058809 2095812 2132110 2167989 2203066 2237292
53432 2237292 2271525 2306241 2340359 2372534 2403092 2433156 2462246 2488667 2512453 2535976 2561011
53421 2561011 2586736 2611181 2632850 2650159 2661281 2666117 2667040 2666134 2662846 2655770 2645458 2633490 2619669
53408 2619669 2602303 2580887 2556554 2530012 2501120 2470722 2440947 2412873 2385296 2356540 2326251
53397 2326251 2294602 2260982 2224786 2187000 2149863 2114940 2082165 2050627 2019763 1989799 1961601
$$ packed form
53476G92535J3360J6136J9108K0769K1140K0903K0491K0477K1601K3682K5453
53465A015655K6127K6228K6499K7079K8228L0495L3415L5343L5563L5464L6538
53454A356634L8360L9728M0786M2481M4597M5777M5344M3839M2006M0292L9239
53443A819083L9301M0183M0976M0941L9944L8381L7003L6298L5879L5077L4226
53432B237292L4233L4716L4118L2175L0558L0064K9090K6421K3786K3523K5035
53421B561011K5725K4445K1669J7309J1122M836R23r06l288p076j0312j1968j3821
53408B619669j7366k1416k4333k6542k8892l0398k9775k8074k7577k8756l0289
53397B326251l1649l3620l6196l7786l7137l4923l2775l1538l0864k9964k8198
$$ plain form
53386 1961601 1936264 1914572 1896584 1881732 1869376 1859314 1851819 1847172 1845224 1845484 1847694 1852186 1859595
53373 1859595 1870177 1883327 1897791 1912699 1928655 1947458 1970209 1995949 2022826 2050395 2079896
53362 2079896 2112412 2147961 2186577 2228881 2274770 2322614 2370844 2419699 2470544 2524152 2580656
53351 2580656 2640552 2704437 2771925 2841898 2913841 2988193 3065589 3146553 3231640 3320942 3413574
53340 3413574 3508485 3605486 3704487 3803996 3901704 3996760 4090353 4183798 4277035 4369285 4459963
53329 4459963 4548253 4632689 4712056 4786373 4856322 4921916 4982136 5035647 5081500 5119349 5149269
53318 5149269 5171388 5185654 5192022 5190620 5181350 5163531 5136403 5099922 5054490 5000039 4936078 4862771
53306 4862771 4781456 4694035 4602358 4508079 4412322 4315276 4216845 4117970 4020606 3925996 3833529
$$ packed form
53386A961601k5337k1692j7988j4852j2356j0062p495m647j948K60K210M492P409
53373A859595J0582J3150J4464J4908J5956J8803K2751K5740K6877K7569K9501
53362B079896L2516L5549L8616M2304M5889M7844M8230M8855N0845N3608N6504
53351B580656N9896O3885O7488O9973P1943P4352P7396Q0964Q5087Q9302R2632
53340C413574R4911R7001R9001R9509R7708R5056R3593R3445R3237R2250R0678
53329D459963Q8290Q4436P9367P4317O9949O5594O0220N3511M5853L7849K9920
53318E149269K2119J4266O368j402r270j7819k7128l6481m5432n4451o3961p3307
53306D862771q1315q7421r1677r4279r5757r7046r8431r8875r7364r4610r2467
$$ plain form
53295 3833529 3741871 3650934 3562308 3477909 3398371 3322550 3248447 3174870 3102423 3032758 2967031
53284 2967031 2905340 2847463 2793425 2743172 2696208 2651837 2609573 2569311 2531447 2496829 2466193
53273 2466193 2439581 2416501 2396308 2377944 2359726 2340421 2320493 2301452 2283839 2266749 2249487
53262 2249487 2232706 2217441 2203873 2191649 2180802 2171830 2165311 2161821 2161696 2164467 2168975 2174419 2180972
53249 2180972 2189238 2199800 2213477 2231050 2252206 2275462 2299844 2326031 2355223 2387509 2422061
53238 2422061 2458338 2496184 2535124 2574562 2614607 2655877 2698386 2741164 2783001 2823154 2861257
53227 2861257 2896868 2929139 2956948 2979624 2997609 3011887 3022500 3028127 3027434 3020230 3006957 2987870
53215 2987870 2963489 2935173 2904129 2870113 2832091 2790226 2746335 2702143 2657705 2611753 2563219
$$ packed form
53295C833529r1658r0937q8626q4399p9538p5821p4103p3577p2447o9665o5727
53284B967031o1691n7877n4038n0253m6964m4371m2264m0262l7864l4618l0636
53273B466193k6612k3080k0193j8364j8218j9305j9928j9041j7613j7090j7262
53262B249487j6781j5265j3568j2224j0847q972o519l490j25K771M508N444O553
53249B180972Q266J0562J3677J7573K1156K3256K4382K6187K9192L2286L4552
53238B422061L6277L7846L8940L9438M0045M1270M2509M2778M1837M0153L8103
53227B861257L5611L2271K7809K2676J7985J4278J0613N627o93p204j3273j9087
53215B987870k4381k8316l1044l4016l8022m1865m3891m4192m4438m5952m8534
$$ plain form
53204 2563219 2512165 2459349 2405045 2348642 2289939 2230718 2173972 2121063 2070428 2019807 1968905
53193 1968905 1918966 1870532 1822977 1775790 1728935 1682125 1635265 1589746 1547834 1510216 1475199
53182 1475199 1440829 1406913 1374453 1344142 1316105 1290313 1266393 1243545 1221381 1200497 1181565
53171 1181565 1164118 1146779 1128460 1108964 1088773 1068780 1049915 1032425 1015441 997605 978097
53160 978097 956974 934882 912712 891201 870409 849801 829256 809752 792506 777510 763368
53149 763368 748656 733082 717320 702070 687509 673460 659729 646104 632092 617049 600938
53138 600938 584789 569916 556633 544301 532687 522492 514125 506711 499078 491220 483873 477112 470545
53125 470545 464779 461198 459797 458553 455817 452278 449379 446673 442480 436995 432822 431632 431677 429748 424909
$$ packed form
53204B563219n1054n2816n4304n6403n8703n9221n6746n2909n0635n0621n0902
53193A968905m9939m8434m7555m7187m6855m6810m6860m5519m1912l7618l5017
53182A475199l4370l3916l2460l0311k8037k5792k3920k2848k2164k0884j8932
53171A181565j7447j7339j8319j9496k0191j9993j8865j7490j6984j7836j9508
53160I78097k1123k2092k2170k1511k0792k0608k0545j9504j7246j4996j4142
53149G63368j4712j5574j5762j5250j4561j4049j3731j3625j4012j5043j6111
53138F00938j6149j4873j3283j2332j1614j0195q367p414p633p858p347o761o567
53125D70545n766l581j401j244k736l539k899k706m193n485m173j190M5j929m839
$$ plain form
53110 424909 419150 414810 412485 411487 411187 411413 411974 412302 411591 409440 406529 404352 403770 403965 403303 401006
53094 401006 397478 393349 389091 385365 382654 380457 377937 375602 375108 376889 379156 380130 380202 380787 381900
53079 381900 382209 380977 378647 375777 372695 370195 369319 370226 372147 374545 377418 380441 382959 385031 387341
53064 387341 389664 390504 389002 386348 384518 384214 384836 385928 387672 390081 392509 394155 394651 394054 392494
53049 392494 389937 386277 381855 377926 376151 377214 379954 382165 382335 380672 378541 376961 375606 373328
53035 373328 369611 365209 361247 358304 356750 357207 359585 362055 362336 360249 357888 357054 357608 358664 360018
53020 360018 361596 362656 362689 362348 362354 362107 360562 357984 355622 353915 352324 350847 350323 350884 351276 350339 348379
53003 348379 346416 344727 342918 341180 340638 342143 345068 347725 349059 349586 350459 351956 353472 354740 356075
$$ packed form
53110D24909n759m340k325r98l00K26N61L28p11k151k911k177n82J95o62k297
53094D01006l528m129m258l726k711k197k520k335m94J781K267R74P2N85J113
53079C81900L09j232k330k870l082k500q76R07J921K398K873L023K518K072K310
53064C87341K323Q40j502k654j830l04O22J092J744K409K428J646M96n97j560
53049C92494k557l660m422l929j775J063K740K211J70j663k131j580j355k278
53035C73328l717m402l962k943j554M57K378K470K81k087k361q34N54J056J354
53020C60018J578J060L3l41Ok47j545k578k362j707j591j477n24N61L92r37j960
53003C48379j963j689j809j738n42J505K925K657J334N27Q73J497J516J268J335
$$ plain form
52988 356075 357322 357674 357117 356982 358192 359857 360669 360867 361498 362359 362285 361179 360104 359383 358229 356471 355001
52971 355001 354088 352889 351288 350591 351413 352388 352204 351624 352029 353026 353217 352687 352938 354519 356380 357724 359093
52954 359093 361186 363662 365545 366191 365581 364203 362779 361634 360364 358569 356654 355246 354217 353191 352748
52939 352748 353926 356404 358317 358195 356252 353649 351444 350513 351354 353402 355352 356677 358089 360099 362052
52924 362052 363207 363886 364782 365792 366326 366242 365838 365425 365552 366993 369791 372874 375288 377224 379128 380611
52908 380611 381268 381897 383635 386411 389496 393144 398151 403846 408138 409869 409855 409299 408420 407082 405547 403969
52892 403969 402169 400479 399813 400186 400059 397946 393918 388918 383550 378412 374704 373200 373028 372510 370976
52877 370976 368847 366343 363293 360112 357878 357165 357590 358685 360499 363052 365712 367404 367260 365181 362112
$$ packed form
52988C56075J247L52n57j35J210J665Q12J98O31Q61p4j106j075p21j154j758j470
52971C55001r13j199j601o97Q22R75j84n80M05R97J91n30K51J581J861J344J369
52954C59093K093K476J883O46o10j378j424j145j270j795j915j408j029j026m43
52939C52748J178K478J913j22j943k603k205r31Q41K048J950J325J412K010J953
52924C62052J155O79Q96J010N34q4m04m13J27J441K798L083K414J936J904J483
52908C80611O57O29J738K776L085L648N007N695M292J731j4n56q79j338j535j578
52892D03969j800j690o66L73j27k113m028n000n368n138l708j504j72n18j534
52877C70976k129k504l050l181k234p13M25J095J814K553K660J692j44k079l069
$$ plain form
52862 362112 359525 358125 357211 355784 353995 352768 352231 351511 350196 349005 348584 348426 347627 346273 345499 346254
52846 346254 348372 350776 352479 353423 354277 355284 355543 353897 350384 346325 343084 341280 341069 342344 344424
52831 344424 346301 347538 348448 349215 349507 349147 348502 347852 347171 346897 348010 350656 353435 354893 355135 355171 355330
52814 355330 355406 355851 357499 360181 362763 364651 366135 367118 366685 364420 361318 358935 358303 359819 363170 366896
52798 366896 369157 369780 370722 373583 377365 379683 379516 377615 374761 371216 367746 365515 364486 363215 360898
52783 360898 358502 357128 356225 354393 351225 347362 343291 339248 336069 334940 336073 338340 340314 341186 340865
52768 340865 339962 339616 340463 341648 341687 340387 338997 338178 336998 334602 331916 330588 330737 330839 329751 327976
52752 327976 326800 326866 327814 328845 329416 329625 329991 330707 331272 331153 330601 330323 330405 330138 328964 327165 325340 323628
$$ packed form
52862C62112k587j400r14j427j789j227n37p20j315j191m21j58p99j354p74P55
52846C46254K118K404J703R44Q54J007K59j646l513m059l241j804k11J275K080
52831C44424J877J237R10P67K92l60o45o50o81k74J113K646K779J458K42L6J59
52814C55330P6M45J648K682K582J888J484R83m33k265l102k383o32J516L351L726
52798C66896K261O23R42K861L782K318j67j901k854l545l470k231j029j271k317
52783C60898k396j374r03j832l168l863m071m043l179j129J133K267J974Q72l21
52768C40865r03l46Q47J185L9j300j390q19j180k396k686j328J49J02j088j775
52752C27976j176O6R48J031N71K09L66P16N65j19n52k78Q2k67j174j799j825j712
$$ plain form
52734 323628 321783 319878 318515 318187 318662 319241 319606 319993 320401 320203 319159 318364 319108 320796 321285 319734 317937
52717 317937 317964 319603 321364 323046 325597 328780 330829 330837 330051 330212 331623 333415 334770 335297 334989 334420 334345
52700 334345 334607 334097 332276 330055 328642 328216 328315 328758 329347 329271 327901 325960 325018 325821 327761 329871 331730
52683 331730 333369 334925 336532 338157 339475 340175 340439 340877 342084 344376 347723 351640 355338 358295 360585
52668 360585 362525 364336 366235 368395 370433 371366 370539 368307 365455 362381 359316 356802 355212 354126 352930
52653 352930 351796 351244 350847 349348 346326 343026 341166 341257 342306 342899 342387 341213 340146 339290 338204 337147
52637 337147 337436 339832 343064 345006 345242 345355 346549 348108 348777 348705 349083 350321 351487 351566 350603 349408 348541
52620 348541 347877 346997 345771 344558 343905 344148 345204 346533 347354 347189 346362 345807 346322 348201 351414 355555
$$ packed form
52734C23628j845j905j363l28M75N79L65L87M08j98j044p95P44J688M89j551j797
52717C17937K7J639J761J682K551L183K049Qp86J61J411J792J355N27l08n69p5
52700C34345K62n10j821k221j413m26R9M43N89p6j370j941r42Q03J940K110J859
52683C31730J639J556J607J625J318P00K64M38J207K292L347L917L698K957K290
52668C60585J940J811J899K160K038R33q27k232k852l074l065k514j590j086j196
52653C52930j134n52l97j499l022l300j860R1J049N93n12j174j067q56j086j057
52637C37147K89K396L232J942K36J13J194J559O69p2L78J238J166P9r63j195q67
52620C48541o64q80j226j213o53K43J056J329Q21j65q27n55N15J879L213M141
$$ plain form
52604 355555 359508 361971 362749 362931 363367 363779 363969 364826 366954 369030 369098 367224 365466 365357 366952 370282
52588 370282 375783 382695 388724 392308 393936 394375 393088 389700 385712 383020 381444 379423 376813 375264
52574 375264 375814 377551 379010 379753 380242 381152 383140 386402 390054 392708 394132 395799 399381 405100 411640
52559 411640 417062 419702 419013 416134 413207 411593 410933 410049 408249 405450 401691 397194 392640 388734 385536
52544 385536 382588 379573 376550 373762 371666 370961 372003 374062 375638 375676 374299 372346 370591 369553 369622
52529 369622 370952 373260 375961 378445 380140 380633 380054 379261 379216 380096 381262 382119 382576 382652 382191 381341 380860
52512 380860 381319 382235 382626 382361 382297 382974 383831 384044 383606 383200 383347 384096 385227 386374 387165 387559 387815 387792 386695
52493 386695 384052 380710 378264 377542 378169 379490 381252 383236 384876 385646 385480 384552 382999 381181 379927
$$ packed form
52604C55555L953K463P78J82M36M12J90Q57K128K076O8j874j758j09J595L330
52588C70282N501O912O029L584J628M39j287l388l988k692j576k021k610j549
52574C75264N50J737J459P43M89R10J988L262L652K654J424J667L582N719O540
52559D11640N422K640o89k879k927j614o60q84j800k799l759m497m554l906l198
52544C85536k948l015l023k788k096p05J042K059J576L8j377j953j755j038O9
52529C69622J330K308K701K484J695M93n79p93m5Q80J166Q57M57P6m61q50m81
52512C80860M59R16L91k65o4O77Q57K13m38m06J47P49J131J147P91L94K56k3j097
52493C86695k643l342k446p22O27J321J762J984J640P70j66r28j553j818j254
$$ plain form
52478 379927 380075 381662 383679 384656 383639 380928 378030 376626 377367 379650 382448 384958 386443 386156 384094
52463 384094 381666 380879 382508 385333 387424 387956 387474 386621 385237 383007 380563 379286 379903 381764 383751
52448 383751 385566 387732 390570 393646 396241 398006 399232 400828 403895 408655 413650 416627 416663 414962 413166
52433 413166 411386 408605 404746 401306 399665 399454 399095 397578 395226 392918 391108 389717 388603 387906 387950
52418 387950 388847 390160 391039 390894 389912 388862 388449 389081 391105 394727 399325 403147 404400 402960 400760 400186
52402 400186 402010 405011 407470 408835 409952 411967 415159 418677 421255 422265 422276 422593 424042 426100 427343
52387 427343 426717 424271 420683 416460 411857 407237 403004 399246 395969 393635 392864 393357 393795 393296 392526 392603
52371 392603 393239 392904 390914 388547 387684 388953 391635 394861 398281 401825 405469 409227 412979 416250 418504
$$ packed form
52478C79927J48J587K017R77j017k711k898j404P41K283K798K510J485k87k062
52463C84094k428p87J629K825K091N32m82q53j384k230k444j277O17J861J987
52448C83751J815K166K838L076K595J765J226J596L067M760M995K977L6j701j796
52433D13166j780k781l859l440j641k11l59j517k352k308j810j391j114o97M4
52418C87950Q97J313Q79j45r82j050m13O32K024L622M598L822J253j440k200n74
52402D00186J824L001K459J365J117K015L192L518K578J010J1L17J449K058J243
52387D27343o26k446l588m223m603m620m233l758l277k334p71M93M38m99p70P7
52371C92603O36l35j990k367q63J269K682L226L420L544L644L758L752L271K254
$$ plain form
52356 418504 419678 420251 420938 422491 425504 429855 434477 438340 441826 446585 453781 462993 473237 484528
52342 484528 497516 511398 523052 529030 528550 524089 518820 513727 507595 499536 490769 483479 478510 474899
52328 474899 471531 468478 466501 466027 467083 469654 473265 476444 477577 476690 475724 476518 478918 481518 484007
52313 484007 487867 494347 502485 509893 515380 520124 526102 533892 542328 549939 556252 561799 567251 572704
52299 572704 577707 581872 585358 588639 591871 594837 597616 600871 605167 610293 615681 621310 627670 634971
52285 634971 642921 651412 660907 671937 684566 698606 714026 730895 749117 768600 789581 812498
52273 812498 837481 864034 891333 918901 947048 976522 1007655 1040064 1073419 1108132 1144816
52262 1144816 1183235 1222433 1261857 1301546 1341099 1379292 1415107 1448417 1479199 1506930 1531526
$$ packed form
52356D18504J174N73O87J553L013M351M622L863L486M759P196R212J0244J1291
52342D84528J2988J3882J1654N978m80m461n269n093o132q059q767p290m969l611
52328D74899l368l053j977m74J056K571L611L179J133q87r66P94K400K600K489
52313D84007L860O480Q138P408N487M744N978P790Q436P611O313N547N452N453
52299E72704N003M165L486L281L232K966K779L255M296N126N388N629O360P301
52285F34971P950Q491R495J1030J2629J4040J5420J6869J8222J9483K0981K2917
52273H12498K4983K6553K7299K7568K8147K9474L1133L2409L3355L4713L6684
52262A144816L8419L9198L9424L9689L9553L8193L5815L3310L0782K7731K4596
$$ plain form
52251 1531526 1554103 1575659 1595426 1611728 1624379 1635035 1645011 1653851 1660436 1664444 1666079 1665242 1661921
52238 1661921 1657035 1652060 1647801 1643978 1639905 1635304 1630479 1625799 1620867 1614453 1605944 1596885 1590132 1586981
$$ packed form
52251A531526K2577K1556J9767J6302J2651J0656R976Q840O585M008J635q37l321
52238A661921m886m975m259l823m073m601m825m680m932o414q509r059o753l151
$$ [...]
##END NTUPLES=NMR SPECTRUM
##END=
