
##TITLE=AC1113_Huila1_5835735_E5EMHUawKj
##JCAMPDX= 6.0         $$ Bruker NMR JCAMP-DX V2.0
##DATA TYPE= NMR SPECTRUM
##DATA CLASS= NTUPLES
##ORIGIN= BRUKER
##OWNER= Administrator
$$ 1.72 TOPSPIN		Version 2.1
$$ 2012-03-28 11:05:40.921 -0500  Administrator@TOPSPIN
$$ Compression mode = diff/dup
##.OBSERVE FREQUENCY= 400.13188235
##.OBSERVE NUCLEUS= ^1H
##.ACQUISITION MODE= SIMULTANEOUS (DQD)
##.ACQUISITION SCHEME= undefined
##.AVERAGES= 64
##.DIGITISER RES= 22
##SPECTROMETER/DATA SYSTEM= spect
##.PULSE SEQUENCE= noesygpps1d.comp
##.SOLVENT NAME= COFFEE_meoh
##.SHIFT REFERENCE= INTERNAL, COFFEE_meoh, 1, 14.96824
##AUDIT TRAIL= $$ (NUMBER, WHEN, WHO, WHERE, PROCESS, VERSION, WHAT)
$$ ##TITLE= Audit trail, TOPSPIN		Version 2.1
$$ ##JCAMPDX= 5.01
$$ ##ORIGIN= Bruker BioSpin GmbH
$$ ##OWNER= Administrator
$$ $$ C:\Bruker\TOPSPIN/data/COFFEE/nmr/AC1113_Huila1_5835735_E5EMHUawKj/12/pdata/1/auditp.txt
$$ ##AUDIT TRAIL=  $$ (NUMBER, WHEN, WHO, WHERE, PROCESS, VERSION, WHAT)
(   1,<2012-03-27 21:01:14.078 -0500>,<Administrator>,<TOPSPIN>,<go>,<TOPSPIN 2.1>,
      <created by zg
	started at 2012-03-27 20:49:42.187 -0500,
	POWCHK enabled, PULCHK disabled,
       configuration hash MD5:
       1A 1E CE 29 27 FD 77 03 67 4E F0 E3 C4 B2 CB 90
       data hash MD5: 64K
       C3 16 88 FE 36 96 85 22 6D EA 56 E1 B0 B5 51 F7>)
(   2,<2012-03-27 21:01:29.203 -0500>,<Administrator>,<TOPSPIN>,<proc1d>,<TOPSPIN 2.1>,
      <Start of raw data processing
       efp LB = 0.3 FT_mod = 6 PKNL = 1 PHC0 = 0 PHC1 = 0 SI = 128K 
       data hash MD5: 128K
       7B 8B 0F 33 95 E5 C6 9E F5 C6 0A A4 4B B3 94 94>)
(   3,<2012-03-27 21:01:30.843 -0500>,<Administrator>,<TOPSPIN>,<proc1d>,<TOPSPIN 2.1>,
      <pk PHC0 = 39.0564 PHC1 = 0 
       data hash MD5: 128K
       48 55 99 E5 01 26 0F 42 3E 66 4F 9C 4E AA 80 DD>)
(   4,<2012-03-27 21:01:32.500 -0500>,<Administrator>,<TOPSPIN>,<proc1d>,<TOPSPIN 2.1>,
      <abs ABSG = 1 
       data hash MD5: 128K
       CD 4F 5E 5D BC 78 C9 4F E4 09 99 67 24 54 29 D4>)
(   5,<2012-03-27 21:01:32.625 -0500>,<Administrator>,<TOPSPIN>,<proc1d>,<TOPSPIN 2.1>,
      <abs ABSG = 2 
       data hash MD5: 128K
       B4 2D 53 0C B9 AD 01 C5 3A 66 33 99 7B 29 49 E4>)
(   6,<2012-03-27 21:01:32.703 -0500>,<Administrator>,<TOPSPIN>,<proc1d>,<TOPSPIN 2.1>,
      <abs ABSG = 3 
       data hash MD5: 128K
       A0 D7 8D 7E 2A DE D0 5F E7 F6 B4 B9 94 8A E0 8A>)
(   7,<2012-03-27 21:01:32.781 -0500>,<Administrator>,<TOPSPIN>,<proc1d>,<TOPSPIN 2.1>,
      <abs ABSG = 4 
       data hash MD5: 128K
       CF 39 15 90 33 BC 40 E2 FA 65 C9 16 44 72 13 B3>)
(   8,<2012-03-27 21:01:32.859 -0500>,<Administrator>,<TOPSPIN>,<proc1d>,<TOPSPIN 2.1>,
      <abs ABSG = 5 
       data hash MD5: 128K
       70 A2 E6 EA 80 01 86 4B C1 B6 4D 60 FF EB E5 04>)
(   9,<2012-03-27 21:01:34.703 -0500>,<Administrator>,<TOPSPIN>,<audit>,<TOPSPIN 2.1>,
      <user comment:
       ICON-NMR User ID: COFFEE
       data hash MD5: 128K
$$ [...]
##$TP07= 0
##$TPNAME0= <>
##$TPNAME1= <>
##$TPNAME2= <>
##$TPNAME3= <>
##$TPNAME4= <>
##$TPNAME5= <>
##$TPNAME6= <>
##$TPNAME7= <>
##$TPOAL= (0..7)
0.5 0.5 0.5 0.5 0.5 0.5 0.5 0.5
##$TPOFFS= (0..7)
0 0 0 0 0 0 0 0
##$TUNHIN= 0
##$TUNHOUT= 0
##$TUNXOUT= 0
##$USERA1= <user>
##$USERA2= <user>
##$USERA3= <user>
##$USERA4= <user>
##$USERA5= <user>
##$V9= 5
##$VALIST= <valist>
##$VCLIST= <CCCCCCCCCCCCCCC>
##$VD= 0
##$VDLIST= <DDDDDDDDDDDDDDD>
##$VPLIST= <PPPPPPPPPPPPPPP>
##$VTLIST= <TTTTTTTTTTTTTTT>
##$WBST= 2048
##$WBSW= 25
##$XGAIN= (0..3)
0 0 0 0
##$XL= 0
##$YL= 0
##$YMAX_a= 12829306
##$YMIN_a= -6202018
##$ZGOPTNS= <>
##$ZL1= 120
##$ZL2= 120
##$ZL3= 120
##$ZL4= 120
##$ABSF1= 14.96824
##$ABSF2= -5.584291
##$ABSG= 5
##$ABSL= 3
##$ALPHA= 0
##$AQORDER= 0
##$ASSFAC= 0
##$ASSFACI= 0
##$ASSFACX= 0
##$ASSWID= 0
##$AUNMP= <proc_prof1d_extract.lims>
##$AXLEFT= 0
##$AXNAME= <>
##$AXNUC= <1H>
##$AXRIGHT= 0
##$AXTYPE= 0
##$AXUNIT= <>
##$AZFE= 0.1
##$AZFW= 0.1
##$BCFW= 0
##$BC_mod= 0
##$BYTORDP= 0
##$COROFFS= 0
##$CY= 15
##$DATMOD= 1
##$DC= 0
##$DFILT= <>
##$DTYPP= 0
##$F1P= 0
##$F2P= 0
##$FCOR= 0.5
##$FTSIZE= 131072
##$FT_mod= 6
##$GAMMA= 0
##$GB= 0
##$INTBC= 1
##$INTSCL= 1
##$ISEN= 128
##$LB= 0.3
##$LEV0= 0
##$LPBIN= 0
##$MAXI= 10000
##$MC2= 0
##$MEAN= 0
##$ME_mod= 0
##$MI= 0
##$NCOEF= 0
##$NC_proc= -3
##$NLEV= 6
##$NOISF1= 0
##$NOISF2= 0
##$NSP= 0
##$NTH_PI= 0
##$NZP= 0
##$OFFSET= 14.96824
##$PC= 1
##$PHC0= 39.0564
##$PHC1= 0
##$PH_mod= 1
##$PKNL= yes
##$PPARMOD= 0
##$PPDIAG= 0
##$PPIPTYP= 0
##$PPMPNUM= 2147483647
##$PPRESOL= 1
##$PSCAL= 4
##$PSIGN= 0
##$PYNMP= <proc.py>
##$REVERSE= no
##$SF= 400.130004948875
##$SI= 131072
##$SIGF1= 0
##$SIGF2= 0
##$SINO= 400
##$SIOLD= 131072
##$SPECTYP= <>
##$SREGLST= <1H.CDCl3>
##$SSB= 0
##$STSI= 131072
##$STSR= 0
##$SW_p= 8223.68421052632
##$SYMM= 0
##$S_DEV= 0
##$TDeff= 65536
##$TDoff= 0
##$TI= <>
##$TILT= no
##$TM1= 0
##$TM2= 0
##$TOPLEV= 0
##$USERP1= <user>
##$USERP2= <user>
##$USERP3= <user>
##$USERP4= <user>
##$USERP5= <user>
##$WDW= 1
##$XDIM= 131072
##$YMAX_p= 489744489
##$YMIN_p= -450980712
##$CURPLOT= <Network HP LaserJet P1505>
##$CURPRIN= <$Network HP LaserJet P1505>
##$DFORMAT= <normdp>
##$LAYOUT= <+/1D_H.xwp>
##$LFORMAT= <normlp>
##$PFORMAT= <normpl>
##$SURQMSG= 1
$$ End of Bruker specific parameters
$$ ---------------------------------
##NTUPLES= NMR SPECTRUM
##VAR_NAME=  FREQUENCY,     SPECTRUM/REAL,   SPECTRUM/IMAG
##SYMBOL=    X,             R,               I
##VAR_TYPE=  INDEPENDENT,   DEPENDENT,       DEPENDENT
##VAR_FORM=  AFFN,          ASDF,            ASDF
##VAR_DIM=   131072,        131072,          131072
##UNITS=     HZ,            ARBITRARY UNITS, ARBITRARY UNITS
##FACTOR=    0.0627417313425165, 1,          1
##FIRST=     8223.62146879498, 7742,         -101877
##LAST=      0,             12924,           -99915
##MIN=       0,             -450980712,      0
##MAX=       8223.62146879498, 489744489,    0
$$ Real data points
##PAGE= N=1
##DATA TABLE= (X++(R..R)), XYDATA
$$ [...]
$$ plain form
60692 1572099 1581095 1590609 1599000 1604878 1609139 1613831 1619816 1626628 1634162 1643168 1653846 1664736 1673336
60679 1673336 1677692 1677628 1674840 1671755 1669849 1668824 1667263 1663982 1658966 1653480 1649171 1646464 1643791 1638972
60665 1638972 1631438 1622527 1613617 1604737 1595308 1585516 1576473 1569295 1564170 1560034 1555314 1549547 1543993 1539911
60651 1539911 1536602 1532358 1527190 1523042 1520886 1519217 1516350 1512883 1510599 1509759 1508793 1506213 1501665 1495284
60637 1495284 1487280 1478383 1469843 1462445 1455787 1448810 1441094 1433564 1427857 1424889 1424163 1424542 1425256 1425735 1425057
60622 1425057 1422629 1419354 1417066 1416398 1415838 1413247 1407767 1399985 1390711 1379911 1366762 1350852 1333455
60609 1333455 1317005 1302764 1289704 1276463 1263478 1251830 1240894 1229214 1217561 1208878 1204713 1203536
60597 1203536 1203155 1202954 1203029 1202945 1202523 1202453 1203111 1204025 1205306 1207996 1211915 1214806 1215036 1213736 1212774 1212054 1210591
$$ packed form
60692A572099Q996R514Q391N878M261M692N985O812P534R006J0678J0890Q600
60679A673336M356o4k788l085j906j025j561l281n016n486m309k707k673m819
60665A638972p534q911q910q880r429r792r043p178n125m136m720n767n554m082
60651A539911l309m244n168m148k156j669k867l467k284q40r66k580m548o381
60637A495284q004q897q540p398o658o977p716p530n707k968p26L79P14M79o78
60622A425057k428l275k288o68n60k591n480p782r274j0800j3149j5910j7397
60609A333455j6450j4241j3060j3241j2985j1648j0936j1680j1653q683m165j177
60597A203536l81k01P5q4m22p0O58R14J281K690L919K891K30j300r62p20j463
$$ plain form
60580 1210591 1208964 1208456 1208428 1206784 1202924 1198445 1194967 1192855 1192063 1192582 1193799 1194736 1195368 1196854 1200356 1206337
60564 1206337 1214848 1225522 1237473 1250187 1264472 1281580 1301571 1323456 1346756 1371847 1398849
60553 1398849 1427352 1457256 1488813 1521706 1555038 1588332 1621495 1653670 1683141 1708699 1730231
60542 1730231 1747567 1759592 1765012 1763472 1755649 1742828 1726713 1709053 1690848 1672053 1652288 1631709
60530 1631709 1611077 1591087 1571761 1552612 1533652 1516112 1501613 1490480 1481594 1474151 1468618 1465289
60518 1465289 1462905 1459760 1455468 1450449 1444417 1436966 1429267 1423384 1419685 1416479 1412579 1408738 1405950 1403794
60504 1403794 1401565 1400038 1400980 1405435 1413371 1424364 1437588 1451567 1465251 1479547 1496896 1518813
60492 1518813 1544225 1570489 1595838 1620706 1646947 1675998 1707714 1740866 1774780 1810387 1849345
$$ packed form
60580A210591j627n08k8j644l860m479l478k112p92N19J217R37O32J486L502N981
60564A206337Q511J0674J1951J2714J4285J7108J9991K1885K3300K5091K7002
60553A398849K8503K9904L1557L2893L3332L3294L3163L2175K9471K5558K1532
60542A730231J7336J2025N420j540p823j2821j6115j7660j8205j8795j9765k0579
60530A631709k0632j9990j9326j9149j8960j7540j4499j1133q886p443n533l329
60518A465289k384l145m292n019o032p451p699n883l699l206l900l841k788k156
60504A403794k229j527R42M455P936J0993J3224J3979J3684J4296J7349K1917
60492A518813K5412K6264K5349K4868K6241K9051L1716L3152L3914L5607L8958
$$ plain form
60481 1849345 1892022 1936709 1981247 2025162 2069451 2114038 2156156 2191798 2218193 2234268 2239432
60470 2239432 2233430 2217634 2195303 2169820 2143146 2116136 2089504 2064073 2040947 2022093 2010013
60459 2010013 2006108 2009730 2019339 2033954 2052934 2075131 2099242 2124624 2151175 2179076 2209500 2244900
60447 2244900 2287368 2336970 2392730 2454996 2525842 2607442 2701258 2808743 2931515 3070645 3226998
60436 3226998 3402638 3600677 3823120 4069851 4340559 4636793 4960964 5313598 5692533
60427 5692533 6094596 6516452 6952012 7388099 7802642 8167820 8456255 8646047 8722587 8678773
60417 8678773 8516027 8245799 7888956 7471781 7020267 6555856 6094423 5647716 5224786
60408 5224786 4831801 4471196 4142275 3843202 3572347 3328092 3108560 2912111 2737370
$$ packed form
60481A849345M2677M4687M4538M3915M4289M4587M2118L5642K6395J6075N164
60470B239432o002j5796k2331k5483k6674k7010k6632k5431k3126j8854j2080
60459B010013l905L622R609J4615J8980K2197K4111K5382K6551K7901L0424L5400
60447B244900M2468M9602N5760O2266P0846Q1600R3816J07485J22772J39130J56353
60436C226998J75640J98039K22443K46731K70708K96234L24171L52634L78935
60427E692533M02063M21856M35560M36087M14543L65178K88435J89792P6540m3814
60417H678773j62746k70228l56843m17175m51514m64411m61433m46707m22930
60408E224786l92985l60605l28921k99073k70855k44255k19532j96449j74741
$$ plain form
60399 2737370 2582188 2443350 2318101 2205435 2105100 2015840 1935628 1863235 1798325 1739919
60389 1739919 1685899 1634540 1585910 1541277 1501425 1465889 1433584 1403778 1376265 1350706 1326328
60378 1326328 1302753 1280810 1261634 1244929 1229105 1213473 1199158 1187091 1176206 1164785 1152824
60367 1152824 1141734 1132084 1123057 1114095 1105740 1098581 1092404 1086857 1082285 1079490 1078969 1080462 1082899 1084939
60353 1084939 1086077 1087192 1089595 1093766 1099450 1106521 1114902 1123957 1132973 1142149 1152051 1161988 1170016 1175142
60339 1175142 1178857 1183924 1192009 1202761 1214639 1226069 1236091 1244585 1252235 1260143 1269169 1279335 1289814
60326 1289814 1299590 1308012 1314614 1318867 1320793 1321609 1322768 1324268 1324890 1324322 1323892 1324663 1325895 1326157 1324936
60311 1324936 1322388 1318615 1314336 1311274 1310539 1311337 1312480 1314364 1317951 1322497 1326154 1328671 1331793 1336866
$$ packed form
60399B737370j55182j38838j25249j12666j00335q9260q0212p2393o4910n8406
60389A739919n4020n1359m8630m4633l9852l5536l2305k9806k7513k5559k4378
60378A326328k3575k1943j9176j6705j5824j5632j4315j2067j0885j1421j1961
60367A152824j1090r650r027q962q355p159o177n547m572k795n21J493K437K040
60353A084939J138J115K403M171N684P071Q381R055R016R176R902R937Q028N126
60339A175142L715N067Q085J0752J1878J1430J0022Q494P650P908R026J0166J0479
60326A289814R776Q422O602M253J926Q16J159J500O22n68m30P71J232K62j221
60311A324936k548l773m279l062p35P98J143J884L587M546L657K517L122N073
$$ plain form
60297 1336866 1343563 1351255 1360263 1371183 1383813 1397192 1410223 1422346 1434173 1447185 1462059 1477637
60285 1477637 1492322 1505886 1518908 1531086 1541435 1549668 1556060 1560435 1562769 1564145 1565393 1565243 1562023
60272 1562023 1557035 1553944 1554443 1556625 1558253 1559613 1562298 1566930 1573016 1579554 1584823 1587032 1586034 1583223
60258 1583223 1579171 1572821 1563653 1552910 1541854 1530579 1519570 1510541 1504133 1498476 1491805 1485237 1481065
60245 1481065 1479422 1478687 1478376 1479426 1481895 1484497 1486589 1489012 1492554 1496858 1501069 1504537 1506746 1507633 1508191
60230 1508191 1509763 1512504 1515335 1517599 1519936 1523259 1527654 1532676 1538091 1543915 1550202 1557311 1566086 1577311
60216 1577311 1590939 1606111 1621850 1637493 1652389 1665634 1676785 1686918 1698272 1712279 1728354
60205 1728354 1745150 1762529 1781464 1802446 1825182 1849818 1877320 1908447 1943342 1982315 2025926
$$ packed form
60297A336866O697P692R008J0920J2630J3379J3031J2123J1827J3012J4874J5578
60285A477637J4685J3564J3022J2178J0349Q233O392M375K334J376J248j50l220
60272A562023m988l091M99K182J628J360K685M632O086O538N269K209r98k811
60258A583223m052o350r168j0743j1056j1275j1009r029o408n657o671o568m172
60245A481065j643p35l11J050K469K602K092K423L542M304M211L468K209Q87N58
60230A508191J572K741K831K264K337L323M395N022N415N824O287P109Q775J1225
60216A577311J3628J5172J5739J5643J4896J3245J1151J0133J1354J4007J6075
60205A728354J6796J7379J8935K0982K2736K4636K7502L1127L4895L8973M3611
$$ plain form
60194 2025926 2073935 2125338 2179924 2238831 2303093 2372770 2448218 2531076 2622948 2723972 2833656
60183 2833656 2952407 3081059 3219350 3366024 3520300 3682455 3853122 4032582 4220319
60174 4220319 4414401 4611270 4806707 4997018 5179158 5350261 5507653 5649158 5773190
60165 5773190 5878844 5966019 6034732 6084146 6113239 6122933 6116591 6097704 6068039 6029006 5983800
60154 5983800 5936754 5891127 5848950 5812746 5785765 5770336 5767381 5778116 5805027 5850151 5913037
60143 5913037 5991502 6084488 6193409 6320171 6464168 6621820 6788989 6962943 7141410 7320557
60133 7320557 7495225 7661006 7814786 7953107 8071444 8165908 8234831 8278082 8295680 8287696
60123 8287696 8254685 8197528 8117701 8018480 7905063 7782650 7655065 7525967 7400300 7283156
$$ packed form
60194B025926M8009N1403N4586N8907O4262O9677P5448Q2858R1872J01024J09684
60183B833656J18751J28652J38291J46674J54276J62155J70667J79460J87737
60174D220319J94082J96869J95437J90311J82140J71103J57392J41505J24032
60165E773190J05654Q7175O8713M9414K9093R694o342j8887k9665l9033m5206
60154E983800m7046m5627m2177l6204k6981j5429k955J0735K6911M5124O2886
60143E913037P8465R2986J08921J26762J43997J57652J67169J73954J78467J79147
60133G320557J74668J65781J53780J38321J18337R4464O8923M3251J7598p984
60123H287696l3011n7157p9827r9221j13417j22413j27585j29098j25667j17144
$$ plain form
60113 7283156 7177696 7085484 7008501 6949619 6911281 6894883 6901301 6930838 6982517 7054360 7144436
60102 7144436 7250738 7369914 7496995 7626542 7753505 7873151 7981382 8075757 8155681 8221200
60092 8221200 8271919 8307331 8327791 8335022 8331985 8322492 8310753 8301147 8298311 8306983 8331183 8373400
60080 8373400 8434795 8516335 8619886 8748497 8905689 9094039 9314245 9565833 9848854 10164455
60070 10164455 10513755 10896918 11313583 11763323 12244954 12755929 13292886 13851952 14427545
60061 14427545 15011371 15593652 16165178 16717274 17240116 17722552 18154306 18527800 18837380
60052 18837380 19077318 19241312 19324175 19323713 19240776 19077807 18838182 18527393 18154125 17729251
60042 17729251 17264112 16770838 16263763 15758289 15267108 14798426 14358395 13953871 13591642
$$ packed form
60113G283156j05460r2212p6983n8882l8338j6398O418K9537N1679P1843R0076
60102G144436J06302J19176J27081J29547J26963J19646J08231R4375P9924O5519
60092H221200N0719L5412K0460P231l037r493j1739r606k836Q672K4200M2217
60080H373400O1395Q1540J03551J28611J57192J88350K20206K51588K83021L15601
60070A0164455L49300L83163M16665M49740M81631N10975N36957N59066N75593
60061A4427545N83826N82281N71526N52096N22842M82436M31754L73494L09580
60052A8837380K39938J63994Q2863m62q2937j62969k39625l10789l73268m24874
60042A7729251m65139m93274n07075n05474m91181m68682m40031m04524l62229
$$ plain form
60033 13591642 13276020 13008588 12789735 12619244 12495953 12418082 12383575 12389047 12428803 12496056
60023 12496056 12584785 12689172 12801492 12912129 13012072 13094722 13155450 13190669 13197728 13174886 13121188
60012 13121188 13037044 12924845 12787839 12627866 12444752 12238210 12009844 11763236 11502944
60003 11502944 11233862 10960931 10688797 10421633 10163204 9916700 9684462 9468371 9270751
59994 9270751 9094582 8942598 8816386 8716592 8643940 8599789 8585406 8600653 8643760 8712761 8806849
59983 8806849 8925549 9066593 9225428 9396960 9576782 9760197 9940912 10111604 10265456
59974 10265456 10396856 10501473 10576536 10620538 10631991 10608851 10549913 10456363 10331365 10178641
59964 10178641 10002190 9806935 9598660 9383236 9166183 8952529 8746611 8552527 8375116
$$ packed form
60033A3591642l15622k67432k18853j70491j23291p7871l4507N472L9756O7253
60023A2496056Q8729J04387J12320J10637R9943Q2650O0728L5219P059k2842n3698
60012A3121188q4144j12199j37006j59973j83114k06542k28366k46608k60292
60003A1502944k69082k72931k72134k67164k58429k46504k32238k16091j97620
59994I270751j76169j51984j26212r9794p2652m4151j4383J5247M3107O9001R4088
59983H806849J18700J41044J58835J71532J79822J83415J80715J70692J53852
59974A0265456J31400J04617P5063M4002J1453k3140n8938r3550j24998j52724
59964A0178641j76451j95255k08275k15424k17053k13654k05918j94084j77411
$$ plain form
59955 8375116 8219553 8089100 7983919 7902969 7846538 7816114 7812623 7836098 7886758 7965183 8071618
59944 8071618 8206043 8368594 8558788 8774416 9012165 9268992 9541626 9824558 10109550
59935 10109550 10387502 10650423 10891845 11106324 11288808 11434303 11538485 11599082 11616075 11589877
59925 11589877 11520117 11407431 11256142 11074012 10869476 10650034 10422895 10195616 9975425
59916 9975425 9768442 9579589 9412624 9270280 9154873 9068618 9012921 8987786 8992560 9026757
59906 9026757 9089524 9178822 9291917 9426088 9578103 9743848 9919589 10102813 10290584 10477839
59896 10477839 10658959 10830608 10991732 11141393 11278384 11402500 11514150 11612730 11697537 11770750
59886 11770750 11837772 11904016 11972875 12047476 12132807 12234970 12359203 12509621 12690451 12906867
$$ packed form
59955H375116j55563j30453j05181q0950n6431l0424l491K3475N0660P8425J06435
59944H071618J34425J62551J90194K15628K37749K56827K72634K82932K84992
59935A0109550K77952K62921K41422K14479J82484J45495J04182O0597J6993k6198
59925A1589877o9760j12686j51289j82130k04536k19442k27139k27279k20191
59916I975425k06983j88853j66965j42344j15407q6255n5697k5135M774L4197
59906I026757O2767Q9298J13095J34171J52015J65745J75741J83224J87771J87255
59896A0477839J81120J71649J61124J49661J36991J24116J11650R8580Q4807P3213
59886A1770750O7022O6244O8859P4601Q5331J02163J24233J50418J80830K16416
$$ plain form
59876 12906867 13164559 13468272 13820202 14219837 14665520 15155304 15685393 16248701 16836114
59867 16836114 17438086 18042800 18633124 19187513 19684260 20103815 20428235 20642053 20735427
59858 20735427 20705485 20554825 20291060 19928148 19485109 18981144 18432762 17855737 17267093
59849 17267093 16683009 16116000 15575562 15070087 14606222 14187433 13815247 13491673 13219129
59840 13219129 12998546 12829042 12709374 12638680 12615982 12639827 12708170 12817747 12963631 13139748
59830 13139748 13339295 13554042 13773759 13986992 14182046 14347021 14469980 14540352 14550208 14494051
59820 14494051 14368402 14172746 13910679 13589485 13218663 12808981 12371736 11917509 11455205
59811 11455205 10992469 10536535 10094053 9670297 9268988 8892691 8543049 8220928 7926709
$$ packed form
59876A2906867K57692L03713L51930L99635M45683M89784N30089N63308N87413
59867A6836114O01972O04714N90324N54389M96747M19555L24420K13818R3374
59858B0735427k9942j50660k63765l62912m43039n03965n48382n77025n88644
59849A7267093n84084n67009n40438n05475m63865m18789l72186l23574k72544
59840A3219129k20583j69504j19668p0694k2698K3845O8343J09577J45884J76117
59830A3139748J99547K14747K19717K13233J95054J64975J22959P0372R856n6157
59820A4494051j25649j95656k62067l21194l70822m09682m37245m54227m62304
59811A1455205m62736m55934m42482m23756m01309l76297l49642l22121k94219
$$ plain form
59802 7926709 7660348 7421153 7207894 7019272 6854002 6710469 6586749 6480848 6390378 6312131
59792 6312131 6242713 6179560 6120762 6064241 6008331 5953199 5900567 5851654 5806245 5763790 5724270
59781 5724270 5687685 5653667 5621842 5591488 5560641 5526512 5487037 5441138 5387863 5327100 5261402
59770 5261402 5195160 5131066 5068755 5007507 4948542 4893699 4843516 4798045 4758281 4725496 4700290
59759 4700290 4683560 4677139 4681751 4695080 4713467 4735253 4761489 4794171 4835177 4886275 4948372 5020494
59747 5020494 5100441 5186631 5278790 5377005 5480486 5586723 5691435 5790084 5880181 5961680 6034889
59736 6034889 6099111 6154081 6201520 6244128 6283820 6321954 6360460 6401638 6447743 6501966 6568873
59725 6568873 6652274 6753087 6870719 7006163 7162367 7342069 7547100 7779968 8044620 8345008
$$ packed form
59802G926709k66361k39195k13259j88622j65270j43533j23720j05901r0470p8247
59792F312131o9418o3153n8798n6521n5910n5132n2632m8913m5409m2455l9520
59781E724270l6585l4018l1825l0354l0847l4129l9475m5899n3275o0763o5698
59770E261402o6242o4094o2311o1248n8965n4843n0183m5471l9764l2785k5206
59759D700290j6730o421M612J3329J8387K1786K6236L2682M1006N1098O2097P2122
59747E020494P9947Q6190R2159R8215J03481J06237J04712R8649R0097Q1499P3209
59736F034889O4222N4970M7439M2608L9692L8134L8506M1178M6105N4223O6907
59725F568873Q3401J00813J17632J35444J56204J79702K05031K32868K64652L00388
$$ plain form
59715 8345008 8683611 9061527 9479165 9936448 10432419 10963825 11522706 12094643 12658906
59706 12658906 13189250 13654453 14021247 14261996 14363480 14329915 14178569 13933119 13619511
59697 13619511 13263870 12890080 12517252 12158912 11824267 11520015 11251251 11021371 10831910
59688 10831910 10682988 10573924 10503357 10469262 10469647 10503235 10569009 10665505 10791630 10948110 11136850
59677 11136850 11358713 11613295 11901291 12225367 12587628 12987584 13424075 13898384 14414195
59668 14414195 14975266 15584461 16244464 16957867 17726596 18552242 19436639 20380877 21383669
59659 21383669 22441302 23548749 24699602 25884648 27091068 28303211 29504366 30679227
59651 30679227 31816567 32910494 33959689 34966426 35936721 36880162 37807944 38730515 39656372
$$ packed form
59715H345008L38603L77916M17638M57283M95971N31406N58881N71937N64263
59706A2658906N30344M65203L66794K40749J01484l3565j51346k45450l13608
59697A3619511l55641l73790l72828l58340l34645l04252k68764k29880j89461
59688A0831910j48922j09064p0567l4095L85L3588O5774R6496J26125J56480J88740
59677A1136850K21863K54582K87996L24076L62261L99956M36491M74309N15811
59668A4414195N61071O09195O60003P13403P68729Q25646Q84397R44238J002792
59659B1383669J057633J107447J150853J185046J206420J212143J201155J174861
59651C0679227J137340J093927J049195J006737R70295R43441R27782R22571R25857
$$ plain form
59642 39656372 40590762 41533242 42476244 43406668 44308358 45162645 45948198 46643108 47228407
59633 47228407 47690079 48019388 48213522 48276658 48220094 48061497 47823846 47532969 47213693 46887820
59623 46887820 46575998 46300021 46081356 45937800 45883054 45929046 46086795 46365030 46769786 47305684
59613 47305684 47975990 48780483 49713799 50765578 51920639 53157954 54449388 55758806
59605 55758806 57041164 58242582 59303250 60162627 60764653 61062442 61023504 60634493 59902932
59596 59902932 58855459 57534330 55992909 54289844 52483248 50626915 48768265 46946303
59588 46946303 45189931 43518208 41941758 40463003 39075211 37762223 36499529 35256649
59580 35256649 34002279 32712319 31376474 29998669 28592609 27177540 25775519 24407822
$$ packed form
59642C9656372R34390R42480R43002R30424R01690Q54287P85553O94910N85299
59633D7228407M61672L29309J94134O3136n6564j58597k37651k90877l19276l25873
59623D6887820l11822k75977k18665j43556n4746M5992J57749K78235M04756N35898
59613D7305684O70306Q04493R33316J051779J155061J237315J291434J309418
59605E5758806J282358J201418J060668Q59377O02026K97789l8938l89011p31561
59596E9902932j047473j321129j541421j703065j806596j856333j858650j821962
59588D6946303j756372j671723j576450j478755j387792j312988j262694j242880
59580C5256649j254370j289960j335845j377805j406060j415069j402021j367697
$$ plain form
59572 24407822 23091030 21836369 20652186 19545102 18518294 17570564 16698402 15898261
59564 15898261 15166395 14497936 13887560 13330826 12824298 12364780 11948870 11572910 11233184
59555 11233184 10926578 10650979 10404227 10182580 9981055 9795531 9623687 9463687 9312830
59546 9312830 9167833 9025540 8882911 8737111 8586298 8429946 8268176 8101513 7931742
59537 7931742 7762160 7596002 7434705 7278325 7127564 6984865 6853217 6734064 6626652
59528 6626652 6529582 6442809 6367818 6305955 6257213 6220746 6195817 6181764 6177681 6182701 6196304 6217960
59516 6217960 6246989 6283049 6326021 6375019 6428437 6485629 6547563 6615059 6687401 6763674 6844366
59505 6844366 6930398 7021803 7119093 7225131 7343583 7475712 7620429 7777328 7948000 8134457
$$ packed form
59572B4407822j316792j254661j184183j107084j026808r47730q72162q00141
59564A5898261p31866o68459o10376n56734n06528m59518m15910l75960l39726
59555A1233184l06606k75599k46752k21647k01525j85524j71844j60000j50857
59546I312830j44997j42293j42629j45800j50813j56352j61770j66663j69771
59537G931742j69582j66158j61297j56380j50761j42699j31648j19153j07412
59528F626652r7070q6773p4991o1863m8742l6467k4929j4053m083N020J3603K1656
59516F217960K9029L6060M2972M8998N3418N7192O1934O7496P2342P6273Q0692
59505F844366Q6032R1405R7290J06038J18452J32129J44717J56899J70672J86457
$$ plain form
59495 8134457 8338062 8560210 8802446 9065655 9350451 9658361 9991010 10347983 10727132
59486 10727132 11127127 11547720 11986833 12439234 12899086 13362224 13824695 14280562 14723049
59477 14723049 15147372 15550744 15929231 16275601 16581197 16840405 17053606 17225797 17362295
59468 17362295 17466097 17539275 17585693 17611237 17622106 17624253 17624203 17628987 17645128 17678654 17735865 17822529
59456 17822529 17941750 18093055 18272946 18474821 18688151 18898960 19091561 19249807 19358063
59447 19358063 19403257 19376283 19270350 19078813 18797140 18427558 17979922 17467535 16903697 16302353
59437 16302353 15679072 15049083 14424882 13816448 13232451 12680072 12164428 11688986 11255710
59428 11255710 10864372 10512974 10199871 9924813 9687532 9486516 9319992 9187105 9087305
$$ packed form
59495H134457K03605K22148K42236K63209K84796L07910L32649L56973L79149
59486A0727132L99995M20593M39113M52401M59852M63138M62471M55867M42487
59477A4723049M24323M03372L78487L46370L05596K59208K13201J72191J36498
59468A7362295J03802P3178M6418K5544J0869K147n0M784J6141L3526N7211Q6664
59456A7822529J19221J51305J79891K01875K13330K10809J92601J58246J08256
59447A9358063M5194k6974j05933j91537k81673l69582m47636n12387n63838o01344
59437A6302353o23281o29989o24201o08434n83997n52379n15644m75442m33276
59428A1255710l91338l51398l13103k75058k37281k01016j66524j32887r9800
$$ plain form
59419 9087305 9019454 8982347 8975360 8997988 9049615 9130327 9240984 9381706 9551056 9747388 9970298
59408 9970298 10220056 10496150 10796538 11117212 11451882 11793008 12133676 12467481 12785997
59399 12785997 13077602 13329901 13532738 13678366 13760001 13771817 13710477 13576199 13372860 13107539
59389 13107539 12789346 12427878 12032616 11613341 11179902 10741050 10304056 9875430 9460675
59380 9460675 9062854 8682590 8320382 7978189 7658292 7361580 7087762 6836520 6607716
59371 6607716 6400868 6214852 6047634 5896303 5758456 5633952 5524413 5430699 5351799 5286292
59361 5286292 5233519 5192793 5162871 5143025 5133494 5134032 5143032 5158919 5181668 5212368 5252109 5301418
59349 5301418 5359015 5420160 5477834 5527437 5570143 5611118 5655453 5706505 5766679 5837959 5921932
$$ packed form
59419I087305o7851l7107o987K2628N1627Q0712J10657J40722J69350J96332K22910
59408I970298K49758K76094L00388L20674L34670L41126L40668L33805L18516
59399A2785997K91605K52299K02837J45628Q1635J1816o1340j34278k03339k65321
59389A3107539l18193l61468l95262m19275m33439m38852m36994m28626m14755
59380I460675l97821l80264l62208l42193l19897k96712k73818k51242k28804
59371F607716k06848j86016j67218j51331j37847j24504j09539r3714p8900o5507
59361E286292n2773m0726k9922j9846r531N38R000J5887K2749L0700L9741M9309
59349E301418N7597O1145N7674M9603M2706M0975M4335N1052O0174P1280Q3973
$$ plain form
59338 5921932 6020134 6133538 6260538 6396110 6534663 6674100 6816841 6967621 7131103 7311040
59328 7311040 7510398 7731902 7978673 8254093 8560902 8900982 9276207 9688821 10140797
59319 10140797 10633832 11170496 11754529 12389359 13076784 13817041 14608654 15447321 16325575
59310 16325575 17233908 18161112 19093147 20013342 20905428 21756383 22556406 23297793 23975191
59301 23975191 24586181 25130530 25609237 26024754 26380886 26680916 26925541 27112642 27238288
59292 27238288 27297670 27286063 27199637 27035036 26788633 26457959 26044458 25553706 24992626 24368089
59282 24368089 23688491 22964194 22204650 21416457 20605599 19780212 18949563 18121329 17301403
59273 17301403 16495467 15709377 14948788 14219451 13526759 12873541 12259244 11682698 11144892
$$ packed form
59338E921932R8202J13404J27000J35572J38553J39437J42741J50780J63482J79937
59328G311040J99358K21504K46771K75420L06809L40080L75225M12614M51976
59319A0140797M93035N36664N84033O34830O87425P40257P91613Q38667Q78254
59310A6325575R08333R27204R32035R20195Q92086Q50955Q00023P41387O77398
59301B3975191O10990N44349M78707M15517L56132L00030K44625J87101J25646
59292B7238288N9382j1607q6426j64601k46403l30674m13501m90752n61080o24537
59282B4368089o79598p24297p59544p88193q10858q25387q30649q28234q19926
59273A7301403q05936p86090p60589p29337o92692o53218o14297n76546n37806
$$ plain form
59264 11144892 10647745 10191112 9772581 9389615 9040457 8723523 8437251 8180129 7949830
59255 7949830 7742988 7557033 7391714 7247789 7124830 7021232 6935385 6865624 6809877 6766779
59245 6766779 6736653 6720356 6717740 6728104 6751292 6787425 6836517 6899204 6976606 7068297 7171680
59234 7171680 7284794 7408624 7545299 7695221 7857422 8031416 8216927 8412969 8619086
59225 8619086 8836430 9065614 9304326 9548837 9796793 10046550 10294954 10538491 10776037
59216 10776037 11007808 11231494 11441699 11633440 11804533 11954731 12084448 12194258 12283628
59207 12283628 12349661 12388315 12396779 12373635 12317473 12227318 12104230 11950937 11770444 11566771
59197 11566771 11346484 11117336 10885417 10655257 10431992 10220917 10025024 9845356 9683922
$$ packed form
59264A1144892m97147m56633m18531l82966l49158l16934k86272k57122k30299
59255G949830k06842j85955j65319j43925j22959j03598q5847o9761n5747m3098
59245F766779l0126j6297k616J0364K3188L6133M9092O2687P7402R1691J03383
59234G171680J13114J23830J36675J49922J62201J73994J85511J96042K06117
59225H619086K17344K29184K38712K44511K47956K49757K48404K43537K37546
59216A0776037K31771K23686K10205J91741J71093J50198J29717J09810Q9370
59207A2283628O6033L8654Q464k3144n6162r0155j23088j53293j80493k03673
59197A1566771k20287k29148k31919k30160k23265k11075j95893j79668j61434
$$ plain form
59188 9683922 9543930 9426787 9331308 9256783 9204955 9178066 9176414 9198495 9242216 9305389 9386350
59177 9386350 9484698 9600630 9733649 9883012 10048971 10231760 10429408 10638517 10857638 11088375
59167 11088375 11332895 11591843 11865070 12153065 12457532 12781813 13130502 13506894 13910640
59158 13910640 14339017 14789517 15258542 15737499 16212701 16669556 17094392 17471694 17782664
59149 17782664 18008674 18135293 18152702 18054877 17840456 17513526 17082597 16559828 15961666 15307977
59139 15307977 14618386 13909492 13195413 12489007 11801248 11140583 10513764 9926047 9379719
59130 9379719 8873947 8407229 7978765 7586534 7225895 6892148 6583768 6301568 6045226
59121 6045226 5811984 5598380 5402003 5221704 5057125 4908090 4773798 4652467 4541837
$$ packed form
59188I683922j39992j17143r5479p4525n1828k6889j652K2081M3721O3173Q0961
59177I386350R8348J15932J33019J49363J65959J82789J97648K09109K19121K30737
59167A1088375K44520K58948K73227K87995L04467L24281L48689L76392M03746
59158A3910640M28377M50500M69025M78957M75202M56855M24836L77302L10970
59149A7782664K26010J26619J7409r7825k14421l26930m30929n22769n98162o53689
59139A5307977o89591p08894p14079p06406o87759o60665o26819n87717n46328
59130I379719n05772m66718m28464l92231l60639l33747l08380k82200k56342
59121F045226k33242k13604j96377j80299j64579j49035j34292j21331j10630
$$ plain form
59112 4541837 4439831 4345017 4257210 4177660 4107589 4046340 3991850 3943057 3900677 3865452 3837072
59101 3837072 3815360 3801029 3794308 3794038 3799178 3810290 3828532 3853974 3885911 3924107 3968634 4018857
59089 4018857 4073604 4132213 4194825 4261955 4334415 4413471 4500458 4596031 4699799 4810573 4927090
59078 4927090 5048879 5176357 5309919 5449372 5594649 5746227 5903903 6065939 6230806
59069 6230806 6399156 6572317 6749013 6925415 7098412 7266923 7429787 7584775 7730755
59060 7730755 7868941 8000727 8125711 8243083 8353584 8458674 8559008 8655500 8751271 8850852
59050 8850852 8957470 9072212 9195775 9330150 9478350 9642904 9824447 10021472 10231434
59041 10231434 10451931 10680232 10911676 11139307 11355126 11550773 11716898 11843508 11922332
$$ packed form
59112D541837j02006r4814q7807p9550p0071o1249n4490m8793m2380l5225k8380
59101C837072k1712j4331o721k70N140J1112J8242K5442L1937L8196M4527N0223
59089D018857N4747N8609O2612O7130P2460P9056Q6987R5573J03768J10774J16517
59078D927090J21789J27478J33562J39453J45277J51578J57676J62036J64867
59069F230806J68350J73161J76696J76402J72997J68511J62864J54988J45980
59060G730755J38186J31786J24984J17372J10501J05090J00334R6492R5771R9581
59050H850852J06618J14742J23563J34375J48200J64554J81543J97025K09962
59041A0231434K20497K28301K31444K27631K15819J95647J66125J26610P8824
$$ plain form
59032 11922332 11948788 11921428 11840455 11707824 11528733 11312201 11069623 10812011 10547696 10282064
59022 10282064 10019408 9764512 9522065 9295118 9084918 8891796 8715130 8552777 8401722
59013 8401722 8259178 8122137 7986422 7847902 7704720 7556909 7403814 7243475 7074820
59004 7074820 6898832 6717087 6530575 6340553 6149118 5958077 5768260 5580461 5396064
58995 5396064 5216297 5041948 4874234 4714757 4564016 4421017 4284974 4156444 4036236
58986 4036236 3923958 3818080 3716782 3618720 3523869 3433539 3348504 3267223 3187340 3108904 3034549
58975 3034549 2966310 2903875 2846206 2793141 2744812 2701089 2662228 2628654 2599598 2573530 2550410
58964 2550410 2531881 2518604 2509031 2501421 2495346 2490401 2485255 2479099 2472596 2466404 2460200 2454048 2449129
$$ packed form
59032A1922332K6456k7360q0973j32631j79091k16532k42578k57612k64315k65632
59022A0282064k62656k54896k42447k26947k10200j93122j76666j62353j51055
59013H401722j42544j37041j35715j38520j43182j47811j53095j60339j68655
59004G074820j75988j81745j86512j90022j91435j91041j89817j87799j84397
58995E396064j79767j74349j67714j59477j50741j42999j36043j28530j20208
58986D036236j12278j05878j01298r8062r4851r0330q5035q1281p9883p8436p4355
58975C034549o8239o2435n7669n3065m8329m3723l8861l3574k9056k6068k3120
58964B550410j8529j3277r573p610o075m945n146o156o503o192o204o152m919
$$ plain form
58951 2449129 2446040 2443906 2442337 2442694 2446071 2451340 2456596 2461411 2466369 2471588 2477188 2484287 2494052 2506171
58937 2506171 2519189 2531729 2542795 2551920 2559991 2569032 2580278 2593159 2606607 2620301 2634105 2647754
58925 2647754 2661896 2678079 2696798 2716804 2737201 2758804 2782439 2807311 2832293 2857721 2884876
58914 2884876 2914743 2948015 2984925 3024239 3063906 3103651 3145383 3190133 3236522 3283485 3332461
58903 3332461 3385138 3440802 3497931 3556831 3618455 3681843 3745172 3808637 3874240 3943228 4015607
58892 4015607 4091631 4171908 4256267 4344236 4436528 4534759 4639843 4751688 4870066 4994819
58882 4994819 5125796 5263613 5409921 5566059 5732134 5908126 6094922 6293449 6504049
58873 6504049 6727817 6967229 7224104 7498168 7789036 8098467 8429167 8782522 9159287
$$ packed form
58951B449129l089k134j569L57L377N269N256M815M958N219N600P099R765J2119
58937B506171J3018J2540J1066R125Q071R041J1246J2881J3448J3694J3804J3649
58925B647754J4142J6183J8719K0006K0397K1603K3635K4872K4982K5428K7155
58914B884876K9867L3272L6910L9314L9667L9745M1732M4750M6389M6963M8976
58903C332461N2677N5664N7129N8900O1624O3388O3329O3465O5603O8988P2379
58892D015607P6024Q0277Q4359Q7969R2292R8231J05084J11845J18378J24753
58882D994819J30977J37817J46308J56138J66075J75992J86796J98527K10600
58873F504049K23768K39412K56875K74064K90868L09431L30700L53355L76765
$$ plain form
58864 9159287 9561551 9992242 10453302 10945993 11472492 12035891 12639283 13286015 13979820
58855 13979820 14723183 15516304 16358985 17252465 18197817 19193301 20234536 21315815 22428924
58846 22428924 23561087 24695525 25813234 26892419 27906981 28827838 29626154 30275072
58838 30275072 30750528 31033800 31114565 30991401 30670707 30166629 29500631 28698311 27785738
58829 27785738 26788778 25733687 24645296 23544328 22447664 21370422 20325917 19323925
58821 19323925 18370542 17469387 16621721 15826484 15082247 14388854 13745714 13149304 12594155
58812 12594155 12075876 11591721 11139106 10715459 10319031 9948086 9599957 9272644 8966509
58803 8966509 8682366 8418669 8172810 7944562 7735669 7546270 7374193 7217878 7077598
$$ packed form
58864I159287M02264M30691M61060M92691N26499N63399O03392O46732O93805
58855A3979820P43363P93121Q42681Q93480R45352R95484J041235J081279J113109
58846B2428924J132163J134438J117709J079185J014562R20857P98316O48918
58838C0275072M75456K83272Q0765j23164l20694n04078o65998q02320r12573
58829B7785738r96960j055091j088391j100968j096664j077242j044505j001992
58821A9323925r53383r01155q47666p95237p44237o93393o43140n96410n55149
58812A2594155n18279m84155m52615m23647l96428l70945l48129l27313l06135
58803H966509k84143k63697k45859k28248k08893j89399j72077j56315j40280
$$ plain form
58794 7077598 6953242 6842921 6744554 6657478 6582176 6519607 6470895 6436487 6415506 6406828 6410422
58783 6410422 6426642 6454969 6494807 6546718 6611211 6687064 6772733 6868925 6977915 7100808 7237326
58772 7237326 7387784 7553115 7733231 7927535 8137041 8363924 8609075 8872127 9154050
58763 9154050 9457724 9785638 10138773 10518151 10925828 11363972 11834304 12338856 12880265
58754 12880265 13461288 14084956 14754895 15474396 16245416 17069160 17946445 18875911 19852662
58745 19852662 20869977 21920874 22995588 24078153 25147519 26181146 27155180 28042154
58737 28042154 28812108 29437090 29893686 30162988 30232353 30098799 29769349 29258091 28584467
58728 28584467 27773085 26851173 25844400 24776191 23670330 22550817 21437740 20344835
$$ packed form
58794G077598j24356j10321r8367q7076p5302o2569m8712l4408k0981q678L594
58783F410422J6220K8327L9838N1911O4493P5853Q5669R6192J08990J22893J36518
58772G237326J50458J65331J80116J94304K09506K26883K45151K63052K81923
58763I154050L03674L27914L53135L79378M07677M38144M70332N04552N41409
58754A2880265N81023O23668O69939P19501P71020Q23744Q77285R29466R76751
58745A9852662J017315J050897J074714J082565J069366J033627R74034Q86974
58737B8042154P69954O24982M56596K69302O9365j33554l29450n11258o73624
58728B8584467q11382r21912j006773j068209j105861j119513j113077j092905
$$ plain form
58720 20344835 19281479 18255226 17272114 16336633 15452234 14620491 13839727 13106282 12417431
58711 12417431 11771645 11166526 10598982 10067589 9572361 9111678 8681666 8279207 7903421
58702 7903421 7553402 7226517 6920001 6632729 6364547 6115040 5883492 5668832 5469266
58693 5469266 5283048 5109756 4949755 4802563 4666877 4541715 4426171 4318752 4218510
58684 4218510 4126081 4041750 3963399 3888492 3817161 3750779 3688314 3627016 3566309 3508052 3453219
58673 3453219 3401202 3352120 3306491 3262544 3217227 3170435 3125207 3083236 3043132 3003467 2964246
58662 2964246 2924682 2882821 2838454 2793442 2748106 2700261 2648897 2595874 2542791 2489144 2434929
58651 2434929 2382180 2332289 2284287 2237275 2192156 2149545 2108361 2067876 2028970 1992250 1957289
$$ packed form
58720B0344835j063356j026253r83112r35481q84399q31743p80764p33445o88851
58711A2417431o45786o05119n67544n31393m95228m60683m30012m02459l75786
58702G903421l50019l26885l06516k87272k68182k49507k31548k14660j99566
58693E469266j86218j73292j60001j47192j35686j25162j15544j07419j00242
58684D218510r2429q4331p8351p4907p1331o6382o2465o1298o0707n8257n4833
58673C453219n2017m9082m5629m3947m5317m6792m5228m1971m0104l9665l9221
58662B964246l9564m1861m4367m5012m5336m7845n1364n3023n3083n3647n4215
58651B434929n2749m9891m8002m7012m5119m2611m1184m0485l8906l6720l4961
$$ plain form
58640 1957289 1924653 1895901 1870373 1844889 1818138 1792462 1769566 1747426 1723483 1698234 1673316
58629 1673316 1648545 1623397 1599380 1578297 1559674 1542104 1525815 1511946 1500608 1491418 1484672 1480443
58617 1480443 1477843 1476497 1477274 1480408 1484649 1489516 1496420 1506150 1517210 1528097 1539143 1550459 1560127
58604 1560127 1566349 1569592 1570976 1570425 1568153 1565917 1564748 1563127 1559286 1553725 1547828 1541967 1536916 1535048
58590 1535048 1537737 1543188 1549087 1555931 1565558 1577999 1592220 1608706 1628781 1652362 1678603 1707898
58578 1707898 1741060 1777365 1815474 1855672 1899258 1946407 1996488 2049886 2107727 2170186 2236667
58567 2236667 2307343 2383286 2465376 2553984 2649321 2751591 2861744 2982450 3116923 3266104
58557 3266104 3428580 3603985 3794654 4002865 4228423 4470337 4728948 5004667 5296085
$$ packed form
58640A957289l2636k8752k5528k5484k6751k5676k2896k2140k3943k5249k4918
58629A673316k4771k5148k4017k1083j8623j7570j6289j3869j1338r190o746m229
58617A480443k600j346P77L134M241M867O904R730J1060J0887J1046J1316R668
58604A560127O222L243J384n51k272k236j169j621l841n561n897n861n051j868
58590A535048K689N451N899O844R627J2441J4221J6486K0075K3581K6241K9295
58578A707898L3162L6305L8109M0198M3586M7149N0081N3398N7841O2459O6481
58567B236667P0676P5943Q2090Q8608R5337J02270J10153J20706J34473J49181
58557C266104J62476J75405J90669K08211K25558K41914K58611K75719K91418
$$ plain form
58548 5296085 5600885 5917043 6241411 6568074 6889195 7195973 7477620 7721323 7915211
58539 7915211 8050825 8122456 8126617 8064017 7940476 7764329 7544167 7289763 7012458 6722297
58529 6722297 6426106 6129511 5838689 5558401 5290383 5035721 4797013 4576383 4373445
58520 4373445 4187376 4019097 3869101 3734927 3613325 3503510 3405864 3318807 3239428 3166330
58510 3166330 3099616 3038867 2983039 2931559 2883822 2838437 2794348 2751777 2710902 2671021 2632132
58499 2632132 2595566 2561626 2528385 2494292 2460047 2426278 2391419 2353816 2314072 2273367 2231304
58488 2231304 2187410 2142917 2098923 2054510 2008801 1963293 1920162 1879780 1841770 1806767 1775234
58477 1775234 1746131 1718518 1692721 1668376 1643587 1617841 1593565 1572900 1555161 1539219 1525556
$$ packed form
58548E296085L04800L16158L24368L26663L21121L06778K81647K43703J93888
58539G915211J35614P1631M161o2600j23541j76147k20162k54404k77305k90161
58529F722297k96191k96595k90822k80288k68018k54662k38708k20630k02938
58520D373445j86069j68279j49996j34174j21602j09815r7646q7057p9379p3098
58510C166330o6714o0749n5828n1480m7737m5385m4089m2571m0875l9881l8889
58499B632132l6566l3940l3241l4093l4245l3769l4859l7603l9744m0705m2063
58488B231304m3894m4493m3994m4413m5709m5508m3131m0382l8010l5003l1533
58477A775234k9103k7613k5797k4345k4789k5746k4276k0665j7739j5942j3663
$$ plain form
58466 1525556 1513807 1501203 1486203 1470982 1457537 1444128 1428684 1413065 1400440 1390770 1382372 1375694
58454 1375694 1371791 1369031 1365266 1361795 1361494 1364330 1368125 1372409 1378130 1384749 1390891 1396678 1402471 1406695
58440 1406695 1407859 1407144 1406009 1403075 1396526 1387668 1378750 1369200 1357624 1345544 1335222 1325534 1314105
58427 1314105 1301939 1291653 1282465 1271238 1257584 1243913 1231409 1219905 1210642 1204834 1200196 1193034
58415 1193034 1183475 1175046 1169816 1167361 1167376 1169296 1170273 1167629 1162687 1158492 1154822 1149565 1143874 1141215 1141599
58400 1141599 1141239 1137925 1132763 1126843 1120254 1114458 1111764 1112260 1114456 1118492 1125362 1133747 1141341 1148655
58386 1148655 1157836 1168588 1179169 1190506 1204997 1221855 1237887 1252372 1267036 1281750 1294486
58375 1294486 1305018 1314441 1321635 1324476 1323905 1322363 1318954 1310984 1299641 1289026 1279834 1269171 1256648
$$ packed form
58466A525556j1749j2604j5000j5221j3445j3409j5444j5619j2625r670q398o678
58454A375694l903k760l765l471l01K836L795M284N721O619O142N787N793M224
58440A406695J164p15j135k934o549q858q918r550j1576j2080j0322r688j1429
58427A314105j2166j0286r188j1227j3654j3671j2504j1504r263n808m638p162
58415A193034r559q429n230k455J5J920R77k644m942m195l670n257n691k659L84
58400A141599l60l314n162n920o589n796k694M96K196M036O870Q385P594P314
58386A148655R181J0752J0581J1337J4491J6858J6032J4485J4664J4714J2736
58375A294486J0532R423P194K841n71j542l409p970j1343j0615r192j0663j2523
$$ plain form
58362 1256648 1245349 1236376 1227555 1218203 1210310 1204182 1197568 1190006 1183670 1179177 1174880 1171016 1170279 1173362
58348 1173362 1177914 1182557 1188231 1195183 1202325 1209739 1218156 1226260 1232411 1238459 1247656 1259483 1271014
58335 1271014 1282334 1295456 1308883 1319171 1327555 1338937 1354167 1369336 1383033 1398062 1415130
58324 1415130 1431072 1444673 1458537 1473897 1488985 1503572 1519463 1535438 1547542 1555728 1564328 1574401
58312 1574401 1581525 1582991 1581494 1579720 1576898 1572882 1570267 1570047 1570043 1569662 1571459 1576119 1580703 1583726 1587302
58297 1587302 1592641 1598035 1602669 1607717 1612584 1615060 1616200 1619797 1625973 1630642 1632320 1633810 1636280 1637671
58283 1637671 1638187 1641157 1647016 1652412 1656525 1662123 1669269 1674649 1678457 1684944 1694634 1703357 1710910 1723015
58269 1723015 1741994 1762887 1781833 1801183 1823265 1846169 1869043 1894759 1923872 1952348 1978405
$$ packed form
58362A256648j1299q973q821r352p893o128o614p562o336m493m297l864p37L083
58348A173362M552M643N674O952P142P414Q417Q104O151O048R197J1827J1531
58335A271014J1320J3122J3427J0288Q384J1382J5230J5169J3697J5029J7068
58324A415130J5942J3601J3864J5360J5088J4587J5891J5975J2104Q186Q600J0073
58312A574401P124J466j497j774k822m016k615k20ml81J797M660M584L023L576
58297A587302N339N394M634N048M867K476J140L597O176M669J678J490K470J391
58283A637671N16K970N859N396M113N598P146N380L808O487R690Q723P553J2105
58269A723015J8979K0893J8946J9350K2082K2904K2874K5716K9113K8476K6057
$$ plain form
58258 1978405 2005146 2033627 2060239 2083859 2108414 2135150 2159678 2180177 2201246 2225924 2251061
58247 2251061 2274334 2298611 2325474 2351497 2374915 2398904 2424562 2448123 2469144 2493866 2525978
58236 2525978 2561249 2595567 2631012 2669858 2710137 2751542 2798196 2851097 2905327 2958937 3016792
58225 3016792 3081369 3147868 3212981 3280295 3352373 3425755 3498412 3573658 3652241 3729555 3805445
58214 3805445 3887389 3978839 4073878 4168482 4267030 4372201 4479040 4585290 4697171 4818319
58204 4818319 4943435 5069624 5203402 5349536 5503769 5663698 5835608 6022929 6219367
58195 6219367 6421362 6635732 6866971 7109157 7358983 7624040 7908768 8204972 8506363
58186 8506363 8819836 9152189 9498959 9857541 10238105 10649531 11087155 11546080 12033366
$$ packed form
58258A978405K6741K8481K6612K3620K4555K6736K4528K0499K1069K4678K5137
58247B251061K3273K4277K6863K6023K3418K3989K5658K3561K1021K4722L2112
58236B525978L5271L4318L5445L8846M0279M1405M6654N2901N4230N3610N7855
58225C016792O4577O6499O5113O7314P2078P3382P2657P5246P8583P7314P5890
58214C805445Q1944R1450R5039R4604R8548J05171J06839J06250J11881J21148
58204D818319J25116J26189J33778J46134J54233J59929J71910J87321J96438
58195F219367K01995K14370K31239K42186K49826K65057K84728K96204L01391
58186H506363L13473L32353L46770L58582L80564M11426M37624M58925M87286
$$ plain form
58177 12033366 12555019 13104543 13677008 14280920 14923790 15600628 16309755 17064604 17875855
58168 17875855 18737542 19644964 20609355 21639448 22726388 23863747 25064451 26340467
58160 26340467 27685082 29094569 30588060 32185774 33887438 35692936 37622578 39694395
58152 39694395 41904353 44254281 46777297 49511536 52474816 55692239 59220075 63111541
58144 63111541 67389064 72084929 77280377 83073573 89549760 96825797 105084612 114521542
58136 114521542 125304415 137638564 151814319 168121495 186765885 207925727 231814253
58129 231814253 258644779 288702017 322503690 360360717 400905602 439732787 470122113
58122 470122113 486104325 485518751 470520584 445561949 415024255 382151951 349104052
$$ packed form
58177A2033366N21653N49524N72465O03912O42870O76838P09127P54849Q11251
58168A7875855Q61687R07422R64391J030093J086940J137359J200704J276016
58160B6340467J344615J409487J493491J597714J701664J805498J929642K071817
58152C9694395K209958K349928K523016K734239K963280L217423L527836L891466
58144F3111541M277523M695865N195448N793196O476187P276037Q258815R436930
58136A14521542J0782873J2334149J4175755J6307176J8644390K1159842K3888526
58129B31814253K6830526L0057238L3801673L7857027M0544885L8827185L0389326
58122D70122113J5982212n85574j4998167k4958635l0537694l2872304l3047899
$$ plain form
58115 349104052 317235019 287296526 259675062 234597111 212159930 192298084 174851269
58108 174851269 159663275 146583230 135432580 126040697 118284554 112047022 107161746
58101 107161746 103415467 100533745 98107770 95600739 92534004 88696152 84159380 79130959
58093 79130959 73830131 68458635 63189644 58144275 53396841 49001704 44992243 41363473
58085 41363473 38086749 35140932 32510013 30161209 28052353 26156474 24457954 22931390
58077 22931390 21545679 20282874 19133087 18077223 17093926 16177048 15327596 14534989 13784501
58068 13784501 13076548 12419832 11810690 11236724 10695503 10192255 9723636 9280546 8863041
58059 8863041 8476565 8116899 7773493 7443780 7130230 6828001 6530146 6241060 5970428
$$ packed form
58115C49104052l1869033k9938493k7621464k5077951k2437181j9861846j7446815
58108A74851269j5187994j3080045j1150650r391883p756143o237532m885276
58101A07161746l746279k881722k425975k507031l066735l837852m536772n028421
58093G9130959n300828n371496n268991n045369m747434m395137m009461l628770
58085D1363473l276724k945817k630919k348804k108856j895879j698520j526564
58077B2931390j385711j262805j149787j055864r83297r16878q49452p92607p50488
58068A3784501p07953o56716o09142n73966n41221n03248m68619m43090m17505
58059H863041l86476l59666l43406l29713l13550l02229k97855k89086k70632
$$ plain form
58050 5970428 5717363 5473982 5240517 5022827 4818629 4620385 4429123 4251786 4087348
58041 4087348 3928743 3776357 3636678 3509251 3387436 3270548 3163221 3064086 2966928 2872060
58031 2872060 2785275 2706434 2629952 2555693 2488756 2429134 2371695 2315697 2264464 2216532 2166984
58020 2166984 2116946 2072203 2032841 1993470 1953080 1915624 1881360 1846575 1811574 1780218 1751813
58009 1751813 1721710 1689647 1659553 1631815 1603760 1576916 1555439 1537935 1518996 1498350 1480341
57998 1480341 1464995 1448002 1429372 1413668 1401335 1387965 1372745 1359845 1350566 1341428 1331033 1322059
57986 1322059 1315683 1310339 1306324 1305246 1304760 1300328 1292460 1285964 1282018 1277334 1271102 1266130 1262823 1258486
57972 1258486 1253016 1249124 1246597 1242339 1236292 1231352 1227312 1220920 1212012 1203596 1195938 1186595 1176108 1167349
$$ packed form
58050E970428k53065k43381k33465k17690k04198j98244j91262j77337j64438
58041D087348j58605j52386j39679j27427j21815j16888j07327r9135r7158r4868
58031B872060q6785p8841p6482p4259o6937n9622n7439n5998n1233m7932m9548
58020B166984n0038m4743l9362l9371m0390l7456l4264l4785l5001l1356k8405
58009A751813l0103l2063l0094k7738k8055k6844k1477j7504j8939k0646j8009
57998A480341j5346j6993j8630j5704j2333j3370j5220j2900r279r138j0395q974
57986A322059o376n344m015j078m86m432p868o496l946m684o232m972l307m337
57972A258486n470l892k527m258o047m940m040o392q908q416p658r343j0487q759
$$ plain form
57958 1167349 1159344 1148367 1135239 1124788 1117681 1109715 1099949 1092511 1088998 1085680 1079950 1073241 1065804
57945 1065804 1054806 1039948 1025579 1014954 1007054 1000485 995652 991643 986018 979369 975481 975536 976547
57932 976547 976583 976929 978095 978544 978465 979982 982348 981689 976927 971443 967782 965196 963348 963505 964719 963619
57916 963619 959588 955837 954065 952372 949596 947114 945058 941355 935987 931796 929550 926359 920378 912976
57902 912976 905132 895984 886160 878137 872044 865443 858293 853525 851433 848411 842817 837387 834030 830975
57888 830975 827109 824447 823956 823303 821271 820414 822782 826509 828920 829737 829392 827592 825264 824422 824578 822878
57872 822878 819048 816114 814916 812443 807413 802716 799908 795916 788206 779163 772101 766588 760871 755682
57858 755682 752373 749991 747187 744771 744017 744716 746806 751339 758068 764827 770913 778124 786969 795191 801641
$$ packed form
57958A167349q005j0977j3128j0451p107p966r766p438l513l318n730o709p437
57945A065804j0998j4858j4369j0625p900o569m833m009n625o649l888N5J011
57932I76547L6L46J166M49p9J517K366o59m762n484l661k586j848J57J214j100
57916I63619m031l751j772j693k776k482k056l703n368m191k246l191n981p402
57902I12976p844r148r824q023o093o601p150m768k092l022n594n430l357l055
57888H30975l866k662m91o53k032q57K368L727K411Q17l45j800k328q42J56j700
57872H22878l830k934j198k473n030m697k808l992p710r043p062n513n717n189
57858G55682l309k382k804k416p54O99K090M533O729O759O086P211Q845Q222O450
$$ plain form
57843 801641 808054 815181 820974 824732 829048 835074 839627 839893 837484 834920 831575 826378 821227 818140
57829 818140 815565 810889 804292 797255 789703 781603 774873 770477 765844 758347 749468 742633 738771 736684
57815 736684 735836 735950 735567 733778 731978 731810 733016 735210 739484 746132 753078 758937 765270 773373 781313
57800 781313 786966 791666 797765 804456 809044 810742 810363 807792 802626 795995 789236 782000 773929 766587
57786 766587 761283 756528 750121 742445 735380 729271 723237 717161 711205 704629 697089 689875 684104 679116
57772 679116 674158 669787 665943 660669 652752 643722 635377 627342 618953 611284 605235 599795 594213 589493
57758 589493 585644 580216 572085 564057 558914 555423 551105 546327 542481 538759 534332 531364 532052 534716
57744 534716 536545 538262 542053 546734 549386 550495 553085 557502 561109 562620 562924 562246 560318 558926 560483
$$ packed form
57843H01641O413P127N793L758M316O026M553K66k409k564l345n197n151l087
57829H18140k575m676o597p037p552q100o730m396m633p497q879o835l862k087
57815G36684q48J14l83j789j800j68J206K194M274O648O946N859O333Q103P940
57800G81313N653M700O099O691M588J698l79k571n166o631o759p236q071p342
57786G66587n304m755o407p676p065o109o034o076n956o576p540p214n771m988
57772F79116m958m371l844n274p917r030q345q035q389p669o049n440n582m720
57758E89493l849n428q131q028n143l491m318m778l846l722m427k968O88K664
57744E34716J829J717L791M681K652J109K590M417L607J511L04o78j928j392J557
$$ plain form
57729 560483 564221 567374 569955 574749 582543 590805 597452 602751 607241 610673 613438 616386 619014 620154
57715 620154 620249 620495 620208 617768 613708 609927 606281 601174 595350 591584 590333 589017 586294 584025 584153
57700 584153 586350 589581 593477 597380 600433 603430 608306 615089 621589 627014 633686 643935 656908 669580
57686 669580 679824 687787 695204 703732 713170 721459 727253 731911 737786 745442 754105 763722 774356 784331
57672 784331 791572 796613 801977 808774 816271 824636 835446 849034 863573 877414 890564 903519 916532
57659 916532 930455 946623 965281 985274 1005426 1025227 1044533 1063899 1084849 1108392 1133715
57648 1133715 1159633 1186656 1216161 1248516 1283608 1322040 1363704 1406338 1448048 1490499 1537145
57637 1537145 1589016 1644767 1703981 1767466 1834784 1904675 1977990 2057414 2144212 2237867 2338898
$$ packed form
57729E60483L738L153K581M794P794Q262O647N299M490L432K765K948K628J140
57715F20154R5K46k87k440m060l781l646n107n824l766j251j316k723k269J28
57700E84153K197L231L896L903L053K997M876O783O500N425O672J0249J2973J2672
57686F69580J0244P963P417Q528R438Q289N794M658N875P656Q663R617J0634R975
57672G84331P241N041N364O797P497Q365J0810J3588J4539J3841J3150J2955J3013
57659I16532J3923J6168J8658J9993K0152J9801J9306J9366K0950K3543K5323
57648A133715K5918K7023K9505L2355L5092L8432M1664M2634M1710M2451M6646
57637A537145N1871N5751N9214O3485O7318O9891P3315P9424Q6798R3655J01031
$$ plain form
57626 2338898 2449325 2570317 2702190 2846903 3007758 3186271 3381906 3595262 3828922
57617 3828922 4084607 4361734 4659006 4975053 5307139 5651253 6003251 6357413 6703984
57608 6703984 7030336 7323582 7568764 7745716 7833611 7821673 7713966 7524172 7269375 6968874
57598 6968874 6642870 6307639 5972955 5645416 5331729 5037279 4764281 4513490 4285768
57589 4285768 4080478 3894706 3726086 3574729 3440972 3323213 3219532 3129578 3053101 2988306
57579 2988306 2933306 2887869 2852397 2826422 2809097 2799777 2797335 2800635 2810535 2829573 2858747 2896444
57567 2896444 2941373 2994495 3057049 3128948 3210595 3304285 3412107 3533923 3668697 3816342
57557 3816342 3977140 4150792 4336938 4534890 4741839 4952883 5163401 5369253 5563714
$$ packed form
57626B338898J10427J20992J31873J44713J60855J78513J95635K13356K33660
57617C828922K55685K77127K97272L16047L32086L44114L51998L54162L46571
57608F703984L26352K93246K45182J76952Q7895j1938j07707j89794k54797l00501
57598F968874l26004l35231l34684l27539l13687k94450k72998k50791k27722
57589D285768k05290j85772j68620j51357j33757j17759j03681q9954p6477o4795
57579B988306n5000m5437l5472k5975j7325r320k442L300R900J9038K9174L7697
57567B896444M4929N3122O2554P1899Q1647R3690J07822J21816J34774J47645
57557C816342J60798J73652J86146J97952K06949K11044K10518K05852J94461
$$ plain form
57548 5563714 5736468 5877030 5977710 6033042 6039488 5997426 5911129 5785186 5623067 5430495
57538 5430495 5217188 4992705 4762361 4529210 4297762 4073132 3858071 3653306 3459656
57529 3459656 3277764 3107021 2946922 2798533 2662888 2539019 2425248 2321211 2226909 2141025
57519 2141025 2061916 1989168 1922737 1861887 1806515 1757872 1716057 1678231 1641448 1606123 1574740
57508 1574740 1548233 1525576 1505883 1488773 1473493 1459626 1448000 1439219 1432074 1425181 1419469 1417380
57496 1417380 1420127 1427028 1436681 1447473 1457966 1468300 1480324 1495056 1511195 1527515 1545227 1566131
57484 1566131 1589873 1615211 1642951 1675224 1712384 1752748 1795194 1840242 1888788 1941323 1998215
57473 1998215 2059632 2125485 2196262 2273065 2356035 2444037 2537100 2637693 2748107 2867876 2995349
$$ packed form
57548E563714J72754J40562J00680N5332O446m2062q6297j25943j62119j92572
57538E430495k13307k24483k30344k33151k31448k24630k15061k04765j93650
57529C459656j81892j70743j60099j48389j35645j23869j13771j04037r4302q5884
57519B141025p9109p2748o6431o0850n5372m8643m1815l7826l6783l5325l1383
57508A574740k6507k2657j9693j7110j5280j3867j1626q781p145o893n712k089
57496A417380K747O901R653J0792J0493J0334J2024J4732J6139J6320J7712K0904
57484A566131K3742K5338K7740L2273L7160M0364M2446M5048M8546N2535N6892
57473A998215O1417O5853P0777P6803Q2970Q8002R3063J00593J10414J19769J27473
$$ plain form
57462 2995349 3130312 3273135 3422596 3576623 3734024 3893206 4049765 4197222 4329416
57453 4329416 4440679 4525073 4577913 4597509 4583712 4536001 4455267 4346501 4216928 4071932
57443 4071932 3915006 3750895 3585774 3424187 3268174 3119504 2980350 2851416 2731668
57434 2731668 2620629 2519327 2428470 2347198 2274179 2208896 2151586 2102807 2062985 2031529 2006772
57423 2006772 1987663 1974800 1968617 1967499 1969435 1974932 1986515 2005475 2030677 2060399 2093996 2132021
57411 2132021 2175929 2227375 2286692 2352608 2424465 2503799 2592511 2690521 2796784 2911493 3035386
57400 3035386 3167786 3307187 3452937 3604184 3757614 3907960 4049985 4178096 4285085
57391 4285085 4363756 4409550 4419873 4392096 4325185 4223003 4093208 3942656 3775844 3597406
$$ packed form
57462B995349J34963J42823J49461J54027J57401J59182J56559J47457J32194
57453D329416J11263Q4394N2840J9596j3797m7711q0734j08766j29573j44996
57443D071932j56926j64111j65121j61587j56013j48670j39154j28934j19748
57434B731668j11039j01302r0857q1272p3019o5283n7310m8779l9822l1456k4757
57423B006772j9109j2863o183j118J936N497J1583J8960K5202K9722L3597L8025
57411B132021M3908N1446N9317O5916P1857P9334Q8712R8010J06263J14709J23893
57400C035386J32400J39401J45750J51247J53430J50346J42025J28111J06989
57391D285085P8671M5794J0323k7777o6911j02182j29795j50552j66812j78438
$$ plain form
57381 3597406 3413222 3228517 3046965 2871843 2705941 2549985 2403146 2265371 2137433
57372 2137433 2018801 1907824 1804386 1710211 1625903 1549527 1478770 1412961 1352489 1297699 1248748
57361 1248748 1205214 1165632 1128584 1094169 1063150 1035103 1008984 985013 964069 945581 928083
57350 928083 911710 898055 887551 878931 871271 864492 857921 850477 842494 835441 829775 824989 821570
57337 821570 820554 821042 820570 818345 816000 814781 814191 813727 813705 813855 813330 812752 814197 818452 824114 829810
57321 829810 835338 840213 843338 844961 847041 850874 855921 861374 867055 872353 876317 879421 883454 889054
57307 889054 895089 900814 906767 913164 919352 925322 931792 938462 944186 949250 955215 962104 968105 972698
57293 972698 977673 984183 991056 997078 1002837 1009309 1016485 1024402 1033719 1044347 1055027 1064834 1073606 1080819
$$ packed form
57381C597406j84184j84705j81552j75122j65902j55956j46839j37775j27938
57372B137433j18632j10977j03438r4175q4308p6376p0757o5809o0472n4790m8951
57361A248748m3534l9582l7048l4415l1019k8047k6119k3971k0944j8488j7498
57350I28083j6373j3655j0504q620p660o779o571p444p983p053n666m786l419
57337H21570j016M88m72k225k345j219n90m64k2J50n25n78J445M255N662N696
57321H29810N528M875L125J623K080L833N047N453N681N298L964L104M033N600
57307H89054O035N725N953O397O188N970O470O670N724N064N965O889O001M593
57293I72698M975O510O873O022N759O472P176P917R317J0628J0680R807Q772P213
$$ plain form
57279 1080819 1086049 1090562 1096150 1102376 1107676 1113120 1121671 1133180 1143819 1151803 1160075 1171547 1185093
57266 1185093 1198501 1212317 1228087 1245293 1262731 1280913 1300542 1320353 1338870 1356807 1375577
57255 1375577 1394871 1413598 1431612 1448666 1463518 1476280 1489928 1507077 1526630 1545880 1564581
57244 1564581 1584512 1606135 1628274 1650518 1673658 1698067 1723550 1750619 1780297 1812689 1846751
57233 1846751 1881257 1915415 1949371 1984793 2024047 2068054 2115815 2166276 2219300 2274592 2331631
57222 2331631 2391204 2454756 2521310 2587444 2651541 2715638 2781450 2846875 2908424 2964846 3016040
57211 3016040 3060260 3095224 3120947 3139169 3150655 3154879 3151740 3141989 3126620 3107087 3085354 3062825
57199 3062825 3040130 3018497 2999746 2984162 2970193 2957235 2946979 2941142 2939846 2943099 2951577 2964885
$$ packed form
57279A080819N230M513N588O226N300N444Q551J1509J0639P984Q272J1472J3546
57266A185093J3408J3816J5770J7206J7438J8182J9629J9811J8517J7937J8770
57255A375577J9294J8727J8014J7054J4852J2762J3648J7149J9553J9250J8701
57244A564581J9931K1623K2139K2244K3140K4409K5483K7069K9678L2392L4062
57233A846751L4506L4158L3956L5422L9254M4007M7761N0461N3024N5292N7039
57222B331631N9573O3552O6554O6134O4097O4097O5812O5425O1549N6422N1194
57211C016040M4220L4964K5723J8222J1486M224l139r751j5369j9533k1733k2529
57199C062825k2695k1633j8751j5584j3969j2958j0256n837j296L253Q478J3308
$$ plain form
57187 2964885 2981504 3001665 3027552 3059195 3093020 3126186 3159413 3193559 3226670 3257050 3286410
57176 3286410 3317137 3349218 3382934 3421712 3468584 3521876 3578114 3637279 3701333 3769051 3836452
57165 3836452 3901831 3966989 4033964 4103517 4176266 4252354 4330204 4407862 4485103 4562326 4638421
57154 4638421 4711781 4782347 4850792 4917111 4982025 5047972 5116518 5186509 5256893 5329093 5404043
57143 5404043 5479377 5552706 5625401 5699656 5773912 5845145 5914107 5984331 6057073 6131000 6205892
57132 6205892 6282864 6361546 6440209 6518039 6594575 6668256 6738505 6807745 6878133 6947887 7014133
57121 7014133 7077524 7140297 7201620 7259104 7313486 7367426 7420720 7470964 7518039 7563708 7607455
57110 7607455 7646757 7680753 7709925 7733137 7748992 7759061 7765803 7768560 7765797 7759852 7754706 7749962
$$ packed form
57187B964885J6619K0161K5887L1643L3825L3166L3227L4146L3111L0380K9360
57176C286410L0727L2081L3716L8778M6872N3292N6238N9165O4054O7718O7401
57165C836452O5379O5158O6975O9553P2749P6088P7850P7658P7241P7223P6095
57154D638421P3360P0566O8445O6319O4914O5947O8546O9991P0384P2200P4950
57143E404043P5334P3329P2695P4255P4256P1233O8962P0224P2742P3927P4892
57132F205892P6972P8682P8663P7830P6536P3681P0249O9240P0388O9754O6246
57121G014133O3391O2773O1323N7484N4382N3940N3294N0244M7075M5669M3747
57110G607455L9302L3996K9172K3212J5855J0069O742K757k763n945n146m744
$$ plain form
57098 7749962 7741741 7728747 7712996 7695597 7676627 7658347 7643777 7632884 7624745 7622069 7628204 7640607
57086 7640607 7652579 7660441 7663335 7657022 7634284 7591595 7529935 7449491 7349358 7232119 7102761
57075 7102761 6962956 6811483 6649072 6476506 6288803 6077906 5840616 5577512 5285514
57066 5285514 4959163 4598317 4206131 3779331 3308639 2788881 2220087 1598016 912235
57057 912235 154505 -679334 -1596691 -2608953 -3724504 -4949832 -6298140 -7788031 -9434006
57048 -9434006 -11248510 -13253600 -15480300 -17957535 -20714813 -23796825 -27262774 -31170990
57040 -31170990 -35578362 -40555670 -46188279 -52561454 -59763147 -67903930 -77116414 -87532818
57032 -87532818 -99279830 -112489009 -127279575 -143723695 -161850431 -181670186 -203145585
$$ packed form
57098G749962q221j2994j5751j7399j8970j8280j4570j0893q139k676O135J2403
57086G640607J1972P862K894o313k2738m2689o1660q0444j00133j17239j29358
57075G102761j39805j51473j62411j72566j87703k10897k37290k63104k91998
57066E285514l26351l60846l92186m26800m70692n19758n68794o22071o85781
57057I12235A54505f79334r17357j012262j115551j225328j348308j489891j645975
57048i434006j814504k005090k226700k477235k757278l082012l465949l908216
57040c1170990m407372m977308n632609o373175p201693q140783r212484j0416404
57032h7532818j1747012j3209179j4790566j6444120j8126736j9819755k1475399
$$ plain form
57025 -203145585 -226153985 -250583662 -276506675 -304102879 -333178916 -362660679 -390617066
57018 -390617066 -414864292 -433628250 -445817961 -450980712 -449235311 -441243253 -428073112
57011 -428073112 -410935663 -390944266 -369009294 -345834204 -321955201 -297806952 -273782661
57004 -273782661 -250241255 -227473945 -205693679 -185065046 -165728468 -147793336 -131327700
56997 -131327700 -116363350 -102897743 -90884817 -80237025 -70846178 -62599346 -55378195
56990 -55378195 -49060115 -43530527 -38689677 -34446012 -30712459 -27413789 -24490495 -21891704
56982 -21891704 -19570873 -17491197 -15627695 -13959145 -12462562 -11117654 -9910286 -8827763
56974 -8827763 -7855444 -6980770 -6195853 -5493435 -4864662 -4302914 -3804827 -3364842 -2973067
$$ packed form
57025b03145585k3008400k4429677k5923013k7596204k9076037k9481763k7956387
57018c90617066k4247226j8763958j2189711n162751J745401P992058J3170141
57011d28073112J7137449J9991397K1934972K3175090K3879003K4148249K4024291
57004b73782661K3541406K2767310K1780266K0628633J9336578J7935132J6465636
56997a31327700J4964350J3465607J2012926J0647792R390847Q246832P221151
56990e5378195O318080N529588M840850M243665L733553L298670K923294K598791
56982b1891704K320831K079676J863502J668550J496583J344908J207368J082523
56974h827763R72319Q74674P84917P02418O28773N61748M98087M39985L91775
$$ plain form
56965 -2973067 -2620979 -2305005 -2022121 -1766354 -1532512 -1319403 -1126354 -949862 -786361
56956 -786361 -635092 -495559 -365132 -241675 -125590 -16569 88899 194122 299042 403905
56946 403905 513780 634677 763689 883899 969411 996769 955506 851471 700986 521530
56936 521530 327360 130750 -57696 -231849 -390535 -533703 -659626 -766672 -855594 -928700
56926 -928700 -988316 -1036876 -1076740 -1109023 -1134337 -1155283 -1176198 -1199684 -1225387 -1252869 -1283301
56915 -1283301 -1317209 -1352827 -1388016 -1421822 -1452902 -1478621 -1497393 -1510165 -1518057 -1520219 -1515551 -1504869
56903 -1504869 -1489678 -1470012 -1444977 -1414342 -1378421 -1337659 -1293483 -1248396 -1204433 -1162969 -1126557
56892 -1126557 -1098515 -1079190 -1064846 -1052114 -1041716 -1035772 -1033376 -1031267 -1027459 -1021696 -1013519 -1002641
$$ packed form
56965b973067L52088L15974K82884K55767K33842K13109J93049J76492J63501
56956g86361J51269J39533J30427J23457J16085a6569H8899J05223J04920J04863
56946D03905J09875J20897J29012J20210Q5512K7358m1263j04035j50485j79456
56936E21530j94170A30750e7696j74153j58686j43168j25923j07046q8922p3106
56926i28700n9616m8560l9864l2283k5314k0946k0915k3486k5703k7482l0432
56915a283301l3908l5618l5189l3806l1080k5719j8772j2772p892k162M668J0682
56903a504869J5191J9666K5035L0635L5921M0762M4176M5087M3963M1464L6412
56892a126557K8042J9325J4344J2732J0398N944K396K109L808N763Q177J0878
$$ plain form
56880 -1002641 -990529 -978959 -967227 -952986 -935529 -915994 -894589 -869980 -841531 -809877 -775104
56869 -775104 -736835 -697124 -661389 -635104 -620245 -615197 -616895 -622483 -630237 -639871 -651472 -663925
56857 -663925 -675114 -683698 -689617 -692754 -692614 -689882 -686883 -685323 -684422 -682250 -678302 -673724 -669461 -665290
56843 -665290 -660571 -655009 -648541 -641274 -633771 -626792 -620206 -612548 -602321 -589839 -577213 -565990 -555025
56830 -555025 -541254 -522647 -499848 -474779 -448334 -420070 -389721 -358369 -328223 -301695 -280446
56819 -280446 -264709 -253503 -245889 -241816 -241307 -243028 -244425 -243384 -239349 -232885 -224711 -215147 -203900 -190166
56805 -190166 -173288 -153234 -129926 -102207 -68418 -28336 15891 60864 103184 139411 165918
56794 165918 180155 182212 174510 159904 140544 118485 96556 77757 63747 54386 49060 48183 52861
$$ packed form
56880a002641J2112J1570J1732J4241J7457J9535K1405K4609K8449L1654L4773
56869g75104L8269L9711L5735K6285J4859N048j698n588p754r634j1601j2453
56857f63925j1189q584n919l137J40K732K999J560R01K172L948M578M263M171
56843f65290M719N562O468P267P503O979O586P658J0227J2482J2626J1223J0965
56830e55025J3771J8607K2799K5069K6445K8264L0349L1352L0146K6528K1249
56819b80446J5737J1206P614M073N09j721j397J041M035O464Q174R564J1247J3734
56805a90166J6878K0054K3308K7719L3789b8336A5891M4973M2320L6227K6507
56794A65918J4237K057p702j4606j9360k2059k1929j8799j4010r361n326q77M678
$$ plain form
56781 52861 63201 77911 96248 119790 151230 191433 238623 290584 346531 405825 465194 517948
56769 517948 556329 575027 573486 555662 527440 493544 456397 417353 378240 341374 308611 281031
56757 281031 259343 244070 235282 232379 234297 240198 250331 266095 288670 317517 350794 387046
56745 387046 425151 462101 492081 509104 510300 496218 469130 432427 390800 348777 308556 270263
56733 270263 234394 202661 176199 154297 135648 119942 107699 99517 96273 99240 108954 124177
56721 124177 142604 162401 182461 201366 216688 225531 225846 217549 202613 183857 163348 141809
56709 141809 119221 95653 71709 48656 27955 10202 -5313 -19557 -32625 -44262 -54818 -64526
56697 -64526 -72300 -76895 -79301 -82268 -86866 -91082 -92757 -92519 -92671 -94246 -96477 -98438 -99879 -100709 -100844
$$ packed form
56781E2861J0340J4710J8337K3542L1440M0203M7190N1961N5947N9294N9369N2754
56769E17948L8381J8698j541j7824k8222l3896l7147l9044l9113l6866l2763k7580
56757B81031k1688j5273q788k903J918N901J0133J5764K2575K8847L3277L6252
56745C87046L8105L6950K9980J7023J196j4082k7088l6703m1627m2023m0221l8293
56733B70263l5869l1733k6462k1902j8649j5706j2243q182l244K967R714J5223
56721A24177J8427J9797K0060J8905J5322Q843L15q297j4936j8756k0509k1539
56709A41809k2588k3568k3944k3053k0701A0202e313j4244j3068j1637j0556r708
56697f4526p774m595k406k967m598m216j675K38j52j575k231j961j441q30j35
$$ plain form
56682 -100844 -100647 -100807 -101707 -103146 -104354 -104199 -102035 -98660 -95758 -94051 -92823 -91591 -91131 -92217 -94377
56667 -94377 -96687 -98874 -100795 -101951 -102476 -103593 -105980 -108606 -110287 -111342 -112432 -112933 -112151 -111154 -111434 -112311
56651 -112311 -111800 -109726 -107811 -106615 -104538 -100449 -95502 -91546 -89099 -87598 -86425 -84921 -82370 -78793
56637 -78793 -75134 -72168 -69757 -67367 -64557 -60767 -55499 -49112 -42785 -37401 -33011 -29460 -26775 -24705
56623 -24705 -22638 -20300 -18153 -16980 -17444 -19834 -23691 -27831 -31271 -33833 -35298 -34819 -32224 -29268 -28098
56608 -28098 -28709 -29403 -29561 -30304 -32267 -34474 -35999 -37225 -38636 -39662 -39822 -40229 -43000 -49377 -58739 -69119
56592 -69119 -78628 -86965 -95574 -105708 -116602 -126453 -134974 -143659 -153590 -164348 -175277 -186187 -196286
56579 -196286 -203900 -208143 -209809 -209874 -208210 -204608 -199993 -195492 -190980 -185547 -178966 -171848 -164653 -157298 -149629
$$ packed form
56682a00844J97j60r00j439j208J55K164L375K902J707J228J232M60j086k160
56667i4377k310k187j921j156n25j117k387k626j681j055j090n01P82R97k80q77
56651a12311N11K074J915J196K077M089M947L956K447J501J173J504K551L577
56637g8793L659K966K411K390K810L790N268O387O327N384M390L551K685K070
56623b4705K067K338K147J173m64k390l857m140l440k562j465M79K595K956J170
56608b8098o11o94j58p43j963k207j525j226j411j026j60m07k771o377r362j0380
56592f9119r509q337q609j0134j0894r851q521q685r931j0758j0929j0910j0099
56579a96286p614m243j666o5J664L602M615M501M512N433O581P118P195P355P669
$$ plain form
56564 -149629 -141861 -134670 -128991 -125292 -122908 -120517 -117401 -113775 -109890 -105548 -100632 -95454 -90310 -85210
56550 -85210 -80110 -74855 -69034 -62581 -56380 -51462 -47809 -44880 -43116 -43608 -46252 -49443 -51770 -52849 -52418
56535 -52418 -50158 -46826 -44193 -43115 -42603 -41293 -38878 -35720 -32186 -28884 -26564 -25218 -24063 -22737 -21582
56520 -21582 -20566 -19083 -17079 -15133 -13113 -10043 -5793 -1558 1802 4517 6488 6751 5331 4229 5403
56505 5403 8738 12946 17412 22157 26987 31771 36793 41981 46523 50031 53241 56843 60616 64447 69089
56490 69089 74780 80069 83247 84430 85177 86558 88380 89854 90210 89093 86993 84915 83272 81697 80129
56475 80129 79139 78798 78292 77310 76806 77711 79782 82248 84582 86030 85601 83417 81133 80118 80003 79725 79037
56458 79037 78216 77233 76092 75197 74576 73550 71848 70242 69314 68428 66640 63961 61174 59132 58600 59806
$$ packed form
56564a49629P768P191N679L699K384K391L116L626L885M342M916N178N144N100
56550h5210N100N255N821O453O201M918L653K929J764m92k644l191k327j079M31
56535e2418K260L332K633J078N12J310K415L158L534L302K320J346J155J326J155
56520b1582J016J483K004J946K020L070M250a558A802K715J971K63j420j102J174
56505E403L335M208M466M745M830M784N022N188M542L508L210L602L773L831M642
56490F9089N691N289L178J183P47J381J822J474L56j117k100k078j643j575j568
56475H0129r90l41n06r82n04R05K071K466K334J448m29k184k284j015j15k78o88
56458G9037q21r83j141q95o21j026j702j606r28q86j788k679k787k042n32J206
$$ plain form
56442 59806 61713 62653 62079 60813 59538 58355 57815 58595 59823 59661 58116 57331 58357 59752 60259 60629
56426 60629 61531 61986 61530 61877 64482 68242 71466 74368 77585 79932 80120 79425 80262 83022 86412 89953
56410 89953 93886 97389 99213 99763 100692 102893 106477 111946 119502 127702 134565 139594 143381 146162 148486
56395 148486 152195 158507 165672 170588 172406 172738 172971 173417 174586 176998 179682 180793 179886 178137 176473
56380 176473 175008 174060 174112 174893 175809 176940 178190 178099 175282 170610 166153 162172 157037 150051 142553 136130
56364 136130 131339 128308 127065 126980 127131 127424 128367 129786 130758 130725 129847 128581 127726 128236 129953 131152 130545
56347 130545 129139 128881 130027 131082 130788 128978 126052 122849 120578 119841 120217 121451 123908 127007 128696
56332 128696 127932 126316 125802 126114 126069 125972 126740 127915 128552 128942 129489 129260 127896 127690 131169 137577 144240
$$ packed form
56442E9806J907R40n74j266j275j183n40P80J228j62j545p85J026J395N07L70
56426F0629R02M55m56L47K605L760L224K902L217K347J88o95Q37K760L390L541
56410H9953L933L503J824N50R29K201L584N469P556Q200O863N029L787K781K324
56395A48486L709O312P165M916J818L32K33M46J169K412K684J111r07j749j664
56380A76473j465r48N2P81R16J131J250r1k817m672m457l981n135o986p498o423
56364A36130m791l031j243q5J51K93R43J419R72l3q78j266q55N10J717J199o07
56347A30545j406k58J146J055k94j810k926l203k271p37L76J234K457L099J689
56332A28696p64j616n14L12m5r7P68J175O37L90N47k29j364k06L479O408O663
$$ plain form
56315 144240 150502 157688 165975 174058 181558 189181 196789 203600 209904 216318 221866 225045 226137 226256
56301 226256 225094 222253 219842 220572 223809 226655 228591 231792 236964 242306 246929 252057 258147 263737
56287 263737 267953 271660 275437 278814 282093 286573 292445 298676 305346 313697 323458 332580 340269 347983
56273 347983 356729 365457 372818 378719 383711 388563 394551 402325 410500 417335 423655 431957 442860 454694
56259 454694 466330 477895 488993 499012 509135 521136 534144 545606 555631 567210 581701
56248 581701 597301 612634 628635 645846 662893 678945 695062 711762 727553 741026 752349
56237 752349 761885 769502 776077 783586 792874 803231 814507 827565 842396 858078 874806 893603
56225 893603 914038 934902 957106 982825 1011615 1040739 1069821 1101727 1138184 1178013 1220640
$$ packed form
56315A44240O262P186Q287Q083P500P623P608O811O304O414N548L179J092J19
56301B26256j162k841k411P30L237K846J936L201N172N342M623N128O090N590
56287B63737M216L707L777L377L279M480N872O231O670Q351R761R122P689P714
56273C47983Q746Q728P361N901M992M852N988P774Q175O835O320Q302J0903J1834
56259D54694J1636J1565J1098J0019J0123J2001J3008J1462J0025J1579J4491
56248E81701J5600J5333J6001J7211J7047J6052J6117J6700J5791J3473J1323
56237G52349R536P617O575P509R288J0357J1276J3058J4831J5682J6728J8797
56225H93603K0435K0864K2204K5719K8790K9124K9082L1906L6457L9829M2627
$$ plain form
56214 1220640 1267746 1320144 1376441 1436380 1502251 1575386 1654316 1738194 1829166 1929511 2039119
56203 2039119 2157483 2285626 2424363 2573237 2732839 2905759 3093647 3295622 3510843
56194 3510843 3739823 3981588 4232315 4488605 4749623 5014131 5277715 5534662 5780241
56185 5780241 6009438 6215857 6393928 6540480 6652971 6728665 6767221 6771852 6746250 6692339
56175 6692339 6612202 6509799 6389211 6253404 6105921 5951275 5792095 5628188 5459702 5288822
56165 5288822 5117177 4944306 4770001 4595480 4420834 4244321 4065818 3888246 3713950
56156 3713950 3542474 3373418 3208460 3048855 2893962 2744098 2601698 2467716 2340126
56147 2340126 2218140 2104607 2001648 1907039 1817719 1734082 1657975 1589070 1526179 1469750 1420022
$$ packed form
56214A220640M7106N2398N6297N9939O5871P3135P8930Q3878R0972J00345J09608
56203B039119J18364J28143J38737J48874J59602J72920J87888K01975K15221
56194C510843K28980K41765K50727K56290K61018K64508K63584K56947K45579
56185E780241K29197K06419J78071J46552J12491P5694L8556M631k5602n3911
56175F692339q0137j02403j20588j35807j47483j54646j59180j63907j68486j70880
56165E288822j71645j72871j74305j74521j74646j76513j78503j77572j74296
56156C713950j71476j69056j64958j59605j54893j49864j42400j33982j27590
56147B340126j21986j13533j02959r4609q9320q3637p6107o8905o2891n6429m9728
$$ plain form
56136 1420022 1374716 1331404 1290478 1253368 1219575 1187769 1158060 1131093 1106671 1085065 1067648
56125 1067648 1054435 1043117 1032209 1022830 1015750 1009470 1003187 998834 997916 998981 1000513 1003689 1009889
56112 1009889 1018071 1026987 1037535 1050518 1064555 1078579 1094068 1112482 1132845 1153955 1176462 1200602
56100 1200602 1224584 1247489 1271123 1296638 1321927 1344580 1364940 1384194 1402244 1419542 1438077
56089 1438077 1458353 1478303 1497178 1517479 1541220 1567843 1597821 1634297 1678846 1729776 1787355
56078 1787355 1856316 1939843 2035170 2138539 2250184 2370294 2493963 2614585 2729204 2836647
56068 2836647 2933971 3019149 3094385 3162557 3222928 3273820 3316193 3350680 3374243 3383925 3381090 3368368
56056 3368368 3345715 3313234 3274114 3230131 3177292 3110369 3029037 2935775 2831357 2717236 2599269
$$ packed form
56136A420022m5306m3312m0926l7110l3793l1806k9709k6967k4422k1606j7417
56125A067648j3213j1318j0908r379p080o280o283m353r18J065J532L176O200
56112A009889Q182Q916J0548J2983J4037J4024J5489J8414K0363K1110K2507K4140
56100A200602K3982K2905K3634K5515K5289K2653K0360J9254J8050J7298J8535
56089A438077K0276J9950J8875K0301K3741K6623K9978L6476M4549N0930N7579
56078A787355O8961Q3527R5327J03369J11645J20110J23669J20622J14619J07443
56068B836647R7324Q5178P5236O8172O0371N0892M2373L4487K3563R682k835j2722
56056C368368k2653l2481l9120m3983n2839o6923q1332r3262j04418j14121j17967
$$ plain form
56045 2599269 2484169 2374376 2270108 2173355 2085840 2006349 1934383 1873215 1825057 1786513 1753033
56034 1753033 1724480 1702223 1684654 1670227 1661029 1658458 1659067 1659426 1661154 1666216 1671502 1673521 1674430 1677825
56020 1677825 1682392 1685214 1687346 1690584 1692959 1693290 1695825 1704198 1715012 1723567 1731431 1741907 1753026
56007 1753026 1762232 1773139 1789731 1808361 1823781 1838933 1860008 1885586 1909803 1933041 1960248
55996 1960248 1991129 2021214 2050715 2083681 2120047 2156832 2195513 2240130 2289647 2339801 2390660
55985 2390660 2445074 2502098 2559392 2619381 2685385 2754624 2822801 2892149 2966842 3044227 3119483
55974 3119483 3195252 3277273 3363938 3449842 3536452 3629388 3728202 3828826 3933211 4046427 4167076
55963 4167076 4290552 4418780 4556741 4702842 4853211 5011775 5185044 5370555 5561894
$$ packed form
56045B599269j15100j09793j04268r6753q7515p9491p1966o1168m8158l8544l3480
56034A753033k8553k2257j7569j4427r198k571O09L59J728N062N286K019R09L395
56020A677825M567K822K132L238K375L31K535Q373J0814Q555P864J0476J1119
56007A753026R206J0907J6592J8630J5420J5152K1075K5578K4217K3238K7207
55996A960248L0881L0085K9501L2966L6366L6785L8681M4617M9517N0154N0859
55985B390660N4414N7024N7294N9989O6004O9239O8177O9348P4693P7385P5256
55974C119483P5769Q2021Q6665Q5904Q6610R2936R8814J00624J04385J13216J20649
55963D167076J23476J28228J37961J46101J50369J58564J73269J85511J91339
$$ plain form
55954 5561894 5761466 5976417 6205540 6442547 6688755 6949803 7223156 7501833 7787422
55945 7787422 8086646 8398814 8720121 9056599 9418704 9806552 10214326 10645013 11106055
55936 11106055 11595025 12105256 12641248 13212769 13818936 14455263 15130846 15859872 16640902
55927 16640902 17463723 18331770 19257858 20242924 21280143 22375019 23539577 24772242 26066885
55918 26066885 27436235 28901864 30466876 32124113 33884356 35768362 37778849 39912354
55910 39912354 42193119 44663186 47346678 50259489 53446212 56967788 60860156 65148750
55902 65148750 69898392 75206181 81158647 87851720 95444256 104131883 114079193 125449631
55894 125449631 138497619 153560090 170976419 191106874 214392072 241248177 271907395
$$ packed form
55954E561894J99572K14951K29123K37007K46208K61048K73353K78677K85589
55945G787422K99224L12168L21307L36478L62105L87848M07774M30687M61042
55936A1106055M88970N10231N35992N71521O06167O36327O75583P29026P81030
55927A6640902Q22821Q68047R26088R85066J037219J094876J164558J232665J294643
55918B6066885J369350J465629J565012J657237J760243J884006K010487K133505
55910C9912354K280765K470067K683492K912811L186723L521576L892368M288594
55902F5148750M749642N307789N952466O693073P592536Q687627R947310J1370438
55894A25449631J3047988J5062471J7416329K0130455K3285198K6856105L0659218
$$ plain form
55887 271907395 306471270 344879800 386113327 426890478 461463248 483626458 489744489
55880 489744489 480268464 458690764 429323899 395811849 360827094 326236541 293233790
55873 293233790 262499583 234421584 209199187 186820530 167094747 149773236 134612077
55866 134612077 121345344 109692068 99420036 90360474 82358402 75258045 68940003
55859 68940003 63323801 58324227 53842779 49805052 46168109 42886228 39903928 37186014
55851 37186014 34720146 32483818 30438116 28557386 26835600 25259114 23800700 22445087
55843 22445087 21194452 20043636 18973605 17973691 17047233 16190444 15386960 14627893 13917377
55834 13917377 13254288 12627525 12033063 11477287 10959657 10469346 10002058 9563185 9151433
$$ packed form
55887B71907395L4563875L8408530M1233527M0777151L4572770K2163210O118031
55880D89744489r476025k1577700k9366865l3512050l4984755l4590553l3002751
55873B93233790l0734207k8077999k5222397k2378657j9725783j7321511j5161159
55866A34612077j3266733j1653276j0272032r059562q002072p100357o318042
55859F8940003n616202m999574m481448m037727l636943l281881k982300k717914
55851C7186014k465868k236328k045702j880730j721786j576486j458414j355613
55843B2445087j250635j150816j070031r99914r26458q56789q03484p59067p10516
55834A3917377o63089o26763n94462n55776n17630m90311m67288m38873m11752
$$ plain form
55825 9151433 8756127 8373982 8012433 7673229 7348251 7034614 6738535 6460942 6193981
55816 6193981 5935306 5691821 5465854 5250928 5044375 4851132 4672081 4501215 4337122
55807 4337122 4184802 4043548 3905593 3769710 3644049 3532294 3428398 3327558 3230763 3135856
55797 3135856 3035986 2930646 2827694 2731345 2638213 2547282 2462813 2384785 2307464 2230621 2161581
55786 2161581 2102882 2048235 1994015 1944576 1902597 1864151 1827267 1795951 1771617 1749347 1726516
55775 1726516 1706625 1691025 1675368 1657999 1643651 1634858 1627300 1617251 1606293 1595328 1581231 1562796
55763 1562796 1543169 1523482 1500786 1474483 1447662 1419985 1387035 1349152 1313026 1281750 1251145
55752 1251145 1218904 1189399 1165822 1145121 1124530 1106066 1090787 1075563 1059458 1046761 1039738
$$ packed form
55825I151433l95306l82145l61549l39204l24978l13637k96079k77593k66961
55816F193981k58675k43485k25967k14926k06553j93243j79051j70866j64093
55807D337122j52320j41254j37955j35883j25661j11755j03896j00840r6795r4907
55797C135856r9870j05340j02952r6349r3132r0931q4469p8028p7321p6843o9040
55786B161581n8699n4647n4220m9439m1979l8446l6884l1316k4334k2270k2831
55775A726516j9891j5600j5657j7369j4348q793p558j0049j0958j0965j4097j8435
55763A562796j9627j9687k2696k6303k6821k7677l2950l7883l6126l1276l0605
55752A251145l2241k9505k3577k0701k0591j8464j5279j5224j6105j2697p023
$$ plain form
55741 1039738 1034508 1027804 1021866 1019205 1018425 1018578 1021543 1026575 1028412 1024466 1018468 1013681 1008027 999184
55727 999184 988846 978428 965954 950727 936025 923837 911668 897520 883247 870441 858111
55716 858111 846754 839040 833675 824386 808246 789623 773002 757532 741694 727285 714993 701674
55704 701674 686152 672526 663696 656503 647104 636152 624729 610383 591878 573393 559272 548319
55692 548319 537390 526631 516980 506373 492932 478731 466299 454429 441215 428224 417876 409514
55680 409514 401521 394571 389538 384936 379473 374435 370782 366835 361593 357278 355704 355046 352951 349956
55666 349956 347238 343978 339535 335279 331835 327446 321343 315559 311287 306789 301088 296089 292777 289060
55652 289060 283939 280056 279371 279954 279749 279903 281767 284328 287299 292793 301020 308192 311767 313926 316775
$$ packed form
55741A039738n230o704n938k661p80J53K965N032J837l946n998m787n654q843
55727I99184j0338j0418j2474j5227j4702j2188j2169j4148j4273j2806j2330
55716H58111j1357p714n365r289j6140j8623j6621j5470j5838j4409j2292j3319
55704G01674j5522j3626q830p193r399j0952j1423j4346j8505j8485j4121j0953
55692E48319j0929j0759r651j0607j3441j4201j2432j1870j3214j2991j0348q362
55680D09514p993o950n033m602n463n038l653l947n242m315j574o58k095k995
55666C49956k718l260m443m256l444m389o103n784m272m498n701m999l312l717
55652B89060n121l883o85N83k05J54J864K561K971N494Q227P172L575K159K849
$$ plain form
55637 316775 318184 315921 312017 309240 306805 303335 300614 300509 301391 301400 302129 305333 309191 311705 314678 320327
55621 320327 326945 332046 336964 344155 352481 359350 365120 371275 376471 378484 378049 377009 374783 370439
55607 370439 366051 363997 362941 360376 357310 356561 358187 360277 362517 365224 366631 364992 362025 360703
55593 360703 361046 361285 361504 362735 364175 364747 365769 368654 371577 371816 369780 367560 365286 362187 359177
55578 359177 356772 352417 343721 332545 322119 311969 299793 286605 275566 266985 258806 250973 244931
55565 244931 239635 232479 223841 216636 211558 206500 200474 194511 188870 182833 177122 173213 170352 166359
55551 166359 161127 156358 152342 148153 144493 142957 142699 141123 137814 134721 132565 130156 127284 125330
55537 125330 124909 125383 126609 128648 130097 129271 126687 124009 121195 117358 113466 111145 109504 106513 103015
$$ packed form
55637C16775J409k263l904k777k435l470k721j05Q82RP29L204L858K514K973N649
55621C20327O618N101M918P191Q326O869N770O155N196K013m35j040k226m344
55607C70439m388k054j056k565l066p49J626K090K240K707J407j639k967j322
55593C60703L43K39K19J231J440N72J022K885K923K39k036k220k274l099l010
55578C59177k405m355q696j1176j0426j0150j2176j3188j1039q581q179p833o042
55565B44931n296p156q638p205n078n058o026n963n641o037n711l909k861l993
55551A66359n232m769m016m189l660j536k58j576l309l093k156k409k872j954
55537A25330m21M74J226K039J449q26k584k678k814l837l892k321j641k991l498
$$ plain form
55522 103015 101823 102981 103399 101390 98259 95134 91567 87888 85736 85203 84193 81664 79244 78679 79727
55507 79727 81397 83448 85819 88032 89764 90863 90866 89767 88863 89197 89494 87433 82715 77302 73007 70433
55491 70433 69605 69781 69338 67865 67703 71293 77589 83213 86563 88503 89642 89499 88255 87141 87074 88577
55475 88577 92418 98345 103945 106944 108009 109265 111051 112554 114490 118098 122188 124467 125517 128214
55461 128214 133073 137353 139200 139807 140758 141898 142746 143845 145751 148236 150976 153703 155764 156916 158075
55446 158075 159567 159442 155737 149708 144316 140103 135340 129826 125384 122402 118891 113554 107150 100270
55432 100270 92401 83991 77066 72785 70150 67730 64989 61604 57403 53477 51637 52286 54037 55257
55418 55257 54689 51317 45723 40915 39402 39838 39047 36908 36249 38024 39782 39427 37600 35630 33825 32628
$$ packed form
55522A03015j192J158M18k009l131l125l567l679k152n33j010k529k420n65J048
55507G9727J670K051K371K213J732J099Lj099r04L34K97k061m718n413m295k574
55491G0433q28J76m43j473j62L590O296N624L350J940J139j43j244j114o7J503
55475H8577L841N927N600K999J065J256J786J503J936L608M090K279J050K697
55461A28214M859M280J847O07R51J140Q48J099J906K485K740K727K061J152J159
55446A58075J492j25l705o029n392m213m763n514m442k982l511n337o404o880
55432A00270p869q410o925m281k635k420k741l385m201l926j840O49J751J220
55418E5257n68l372n594m808j513M36p91k139o59J775J758l55j827j970j805j197
$$ plain form
55402 32628 32857 33765 33138 30233 26673 23745 20972 18137 16553 17271 19682 22617 25340 27103 27475 27344
55386 27344 27759 27794 25771 22596 21176 22120 22767 21391 19633 19529 20521 20957 20667 20538 20970 21923 23271
55369 23271 24305 24150 23178 22721 23093 23557 24330 26556 29907 32338 32892 32771 33073 33456 33628 34064 34533 33960
55351 33960 32403 31181 30460 28962 26710 25597 26290 27066 26912 27261 29125 30815 30348 28232 26096 24256
55335 24256 22405 21246 21598 23010 24642 26363 27769 27622 25720 23941 23782 24008 22447 19227 16540
55320 16540 15767 16337 17086 17487 17644 17925 18547 19197 19317 18845 18140 17324 16485 16206 16655 16431 13894 9651
55302 9651 6056 4123 2726 961 -704 -2025 -3592 -5143 -5200 -3164 -89 3114 6302 8491 8077 5668
55286 5668 4261 5234 6444 5905 5024 6059 8207 8804 7344 5902 5987 6898 7033 5479 2450 -824 -2855
$$ packed form
55402C2628K29R08o27k905l560k928k773k835j584P18K411K935K723J763L72j31
55386B7344M15L5k023l175j420R44O47j376j758j04R92M36k90j29M32R53J348
55369B3271J034j55r72m57L72M64P73K226L351K431N54j21L02L83J72M36M69n73
55351C3960j557j222p21j498k252j113O93P76j54L49J864J690m67k116k136j840
55335B4256j851j159L52J412J632J721J406j47j902j779j59K26j561l220k687
55320A6540p73N70P49M01J57K81O22O50J20m72p05q16q39k79M49k24k537m243
55302I651l595j933j397I61g04j321j567j551n7K036h9C114L188K189m14k409
55286E668j407R73J210n39q81J035K148N97j460j442Q5R11J35j554B450h24k031
$$ plain form
55269 -2855 -3175 -2582 -1844 -988 -128 177 -139 -445 -524 -668 -307 1780 5300 8156 9180 9476 10201 10803
55251 10803 10664 10621 11247 11173 8984 5646 3308 2461 1911 971 217 430 1891 4308 6617 7452 6680 5888
55233 5888 6578 8423 9917 10039 8781 6820 5302 5212 6499 8358 10428 12828 15147 16744 17945 19389
55217 19389 20219 18908 16068 14189 14063 13772 11998 9990 9108 8752 8082 7674 7953 8038 7724 8546 11111
55200 11111 13356 13478 12781 13481 15249 16190 15861 15114 14142 12852 12096 12423 12607 11447 9963 9755 10246
55183 10246 9819 8658 8124 8057 7224 5889 5516 6225 6887 7449 8809 10393 10270 8038 5586 4568 4910
55166 4910 6178 8570 11888 14973 16881 17575 17089 15194 12407 10312 10233 11989 14160 15212 14573 13161
55150 13161 12608 13321 13754 12312 9565 7663 7906 9757 11905 13369 13832 13756 14015 14788 15188 14545 13457
$$ packed form
55269b855l20N93P38Q56a28A77a39l06p9j44c07A780L520K856J024K96P25O02
55251A0803j39m3O26p4k189l338k338q47n50r40B17K13J461K417K309Q35p72p92
55233E888O90J845J494J22j258j961j518r0J287J859K070K400K319J597J201J444
55217A9389Q30j311k840j879j26k91j774k008q82l56o70m08K79Q5l14Q22K565
55200A1111K245J22o97P00J768R41l29p47r72j290p56L27J84j160j484k08M91
55183A0246m27j161n34o7q33j335l73P09O62N62J360J584j23k232k452j018L42
55166D910J268K392L318L085J908O94m86j895k787k095p9J756K171J052o39j412
55150A3161n53P13M33j442k747j902K43J851K148J464M63p6K59P73M00o43j088
$$ plain form
55133 13457 12779 12192 10755 8401 5998 4389 4178 5881 9246 12815 15018 15501 14885 13930 13506 14444
55117 14444 16390 17600 16897 15132 13747 12792 11593 10559 10776 12213 13654 14233 13875 12568 10343 7897
55101 7897 6273 5942 6785 8509 10516 11964 12699 13426 14271 14134 12372 10186 9075 8744 7871 6326 5312
55084 5312 5674 7255 9535 11839 13311 13705 13808 14258 14500 13746 12259 10912 10289 11039 13921 18263 21408
55067 21408 21164 18166 14711 12267 11297 12169 14376 15834 14920 12631 10997 10273 9652 9890 12671 17542
55051 17542 21900 24255 25510 26801 28140 29648 32163 35717 38900 40619 41449 42507 43815 44416 43615
55036 43615 41866 40787 42113 45940 50186 52475 52318 50859 49117 47520 46637 47046 48534 50350 52170
55021 52170 54086 56042 58004 60107 61866 62053 60439 58775 58703 59446 59017 57031 54726 52824 51206 50386
$$ packed form
55133A3457o78n87j437k354k403j609k11J703L365L569K203M83o16r55m24R38
55117A4444J946J210p03j765j385r55j199j034K17J437J441N79l58j307k225k446
55101G897j624l31Q43J724K007J448P35P27Q45j37j762k186j111l31q73j545j014
55084E312L62J581K280K304J472L94J03M50K42p54j487j347o23P50K882M342L145
55067B1408k44k998l455k444r70Q72K207J458r14k289j634p24o21K38K781M871
55051A7542M358K355J255J291J339J508K515L554L183J719Q30J058J308O01q01
55036D3615j749j079J326L827M246K289j57j459j742j597q83M09J488J816J820
55021E2170J916J956J962K103J759J87j614j664p2P43m29j986k305j902j618q20
$$ plain form
55005 50386 51379 54003 56836 59015 60793 62339 63180 62870 61235 58352 55321 54414 56869 60894 63315
54990 63315 62918 60756 57716 53720 49130 45043 41869 39078 36521 34652 33398 32170 30999 30408 30240
54975 30240 29947 29949 31312 34176 37687 41280 44717 47246 48196 48115 47889 47264 45831 44752 45450 47033 47318
54958 47318 46158 45346 45351 44890 44134 45429 49713 54691 57969 60050 62770 66415 70015 73083 75517 76599
54942 76599 75694 73506 71534 70446 69710 68623 67226 66209 65975 65862 64781 62901 61812 62291 63014 62651
54926 62651 62072 62796 64260 64774 64438 64651 65169 64313 62118 60594 60509 60529 60137 60788 63233 66150 68578 71510
54908 71510 75786 80447 84551 88748 93565 97814 100172 100895 100695 99391 97161 95722 96719 99851 103827
54893 103827 108150 112791 117286 121442 126106 132155 139604 148494 159452 172327 185602 198438 212195
$$ packed form
55005E0386R93K624K833K179J778J546Q41l10j635k883l031r07K455M025K421
54990F3315l97k162l040l996m590m087l174k791k557j869j254j228j171n91j68
54975C0240k93KJ363K864L511L593L437K529R50q1k26o25j433j079O98J583K85
54958D7318j160q12Nm61p56J295M284M978L278K081K720L645L600L068K434J082
54942G6599r05k188j972j088p36j087j397j017k34j13j081j880j089M79P23l63
54926F2651n79P24J464N14l36K13N18q56k195j524q5K0l92O51K445K917K428K932
54908G1510M276M661M104M197M817M249K358P23k00j304k230j439R97L132L976
54893A03827M323M641M495M156M664O049P449Q890J0958J2875J3275J2836J3757
$$ plain form
54880 212195 228549 247078 265989 284150 300874 314640 323907 328985 331450 331654 328022 319023 305016
54867 305016 287983 270137 252926 237000 222741 210465 199806 189402 178152 166664 156563
54856 156563 148521 142041 137045 134148 133185 133039 133347 134964 138138 141662 144524 147120 150194 153996 159178
54841 159178 167079 178094 190947 204507 219200 235699 253284 270364 285679 298230 307212 312725
54829 312725 315482 315139 310268 300730 288536 275322 260495 243179 224671 207445 192593 179565
54817 179565 167560 156062 144902 134869 127310 122069 116869 109890 101904 94764 89028 84470 81689
54804 81689 81282 82071 81926 80113 77584 75368 73861 73270 73550 74174 74756 75416 75882 75216 73358 71808 71537
54787 71537 71319 69727 67773 67650 69347 70503 69522 67129 64629 62151 59107 55361 51435 48042 45629
$$ packed form
54880B12195J6354J8529J8911J8161J6724J3766R267N078K465K04l632q999j4007
54867C05016j7033j7846j7211j5926j4259j2276j0659j0404j1250j1488j0101
54856A56563q042o480m996k897r63j46L08J617L174L524K862K596L074L802N182
54841A59178P901J1015J2853J3560J4693J6499J7585J7080J5315J2551Q982N513
54829C12725K757l43m871r538j2194j3214j4827j7316j8508j7226j4852j3028
54817A79565j2005j1498j1160j0033p559n241n200o979p986p140n736m558k781
54804H1689m07P89j45j813k529k216j507n91K80O24N82O60M66o66j858j550k71
54787G1537k18j592j954j23J697J156r81k393k500k478l044l746l926l393k413
$$ plain form
54772 45629 44043 42818 41967 42070 43325 45142 47034 49049 50939 52000 52352 53256 55296 57425 58748
54757 58748 60024 62228 64839 66907 68710 70797 72429 72789 73031 75243 79771 85205 90631 96141 101341
54742 101341 105148 107329 108905 110842 113397 116670 120752 125390 130569 137245 146404 157515 168959 180002
54728 180002 191443 204488 219807 237417 256558 275867 294436 312310 329204 343399 352943 357319
54716 357319 356858 351288 340394 325660 309751 294497 280530 268456 258766 250731 242887 234771 227142
54703 227142 220565 215002 210642 207751 205651 203144 200265 198574 199390 202489 206677 210983 215323 220558
54689 220558 227807 237310 248368 260690 274712 289974 304621 318026 332669 351417 373583 395512
54677 395512 414480 430007 441757 448626 450213 447127 439334 426032 407734 386952 366102 345932
$$ packed form
54772D5629j586j225q51J03J255J817J892K015J890J061L52R04K040K129J323
54757E8748J276K204K611K068J803K087J632L60K42K212M528N434N426N510N200
54742A01341L807K181J576J937K555L273M082M638N179O676R159J1111J1444J1043
54728A80002J1441J3045J5319J7610J9141J9309J8569J7874J6894J4195R544M376
54716C57319m61n570j0894j4734j5909j5254j3967j2074r690q035p844q116p629
54703B27142o577n563m360k891k100k507k879j691Q16L099M188M306M340N235
54689B20558P249R503J1058J2322J4022J5262J4647J3405J4643J8748K2166K1929
54677C95512J8968J5527J1750O869J587l086p793j3302j8298k0782k0850k0170
$$ plain form
54665 345932 326288 307085 288141 269415 251835 236661 223716 211478 199225 187764 177769 168777
54653 168777 160314 152695 146232 140735 136208 132780 129765 126118 122148 119231 117436 115086 111390 107837
54639 107837 106019 105550 105323 105463 106618 108348 109690 110672 111996 113618 114743 114961 114539 113874 113368 113518
54623 113518 114438 115580 116392 116894 117240 117349 117455 118313 120148 122040 123176 124316 127115 132172 138463 144514
54607 144514 149499 153283 156063 158248 160365 162884 166063 169831 173867 178057 182837 188681 195129 200801
54593 200801 204615 206829 208712 211330 214668 217720 219574 220621 222408 225921 230346 234089 236589 238353
54579 238353 239698 240660 242099 245569 251766 260077 269915 281421 294360 307555 320207 332910 346370
54566 346370 359748 371255 380029 386433 390661 392053 390034 384971 377622 368107 356017 341560 326066
$$ packed form
54665C45932j9644j9203j8944j8726j7580j5174j2945j2238j2253j1461r995q992
54653A68777q463p619o463n497m527l428l015l647l970k917j795k350l696l553
54639A07837j818m69k27J40J155J730J342R82J324J622J125K18m22o65n06J50
54623A13518R20J142Q12N02L46J09J06Q58J835J892J136J140K799N057O291O051
54607A44514M985L784K780K185K117K519L179L768M036M190M780N844O448N672
54593B00801L814K214J883K618L338L052J854J047J787L513M425L743K500J764
54579B38353J345R62J439L470O197Q311R838J1506J2939J3195J2652J2703J3460
54566C46370J3378J1507Q774O404M228J392k019n063p349r515j2090j4457j5494
$$ plain form
54553 326066 310976 296595 282360 268324 255730 245939 239399 235863 234707 234437 232886 229064 224348
54540 224348 220682 217863 213840 207644 200806 195561 192555 190595 187887 183287 176976 170202 164026 158390
54526 158390 152930 148237 145322 143944 142499 139670 135412 130406 125584 122088 120446 119494 117154 112704
54512 112704 107444 102985 99943 98447 98574 99608 99950 98674 96514 94707 93508 92395 91108 89772 88446
54497 88446 87145 86008 85051 84039 82783 81299 79710 78390 78060 79064 80725 82176 83598 85580 87540
54482 87540 88276 88135 88920 91078 92705 92376 91491 92461 95613 99358 102612 105554 108428 111147 114071 117885
54466 117885 122604 127674 133144 139702 147199 154078 158904 162032 165200 169698 175359 181180 186291 190063
54452 190063 191863 191481 189775 188026 186321 183350 178302 172136 166094 159851 152472 144685 138518 134613
$$ packed form
54553C26066j5090j4381j4235j4036j2594r791o540l536j156k70j551l822m716
54540B24348l666k819m023o196o838n245l006j960k708m600o311o774o176n636
54526A58390n460m693k915j378j445k829m258n006m822l496j642r52k340m450
54512A12704n260m459l042j496J27J034L42j276k160j807j199j113j287j336j326
54497H8446j301j137r57j012j256j484j589j320l30J004J661J451J422J982J960
54482H7540P36j41P85K158J627l29q85R70L152L745L254K942K874K719K924L814
54466A17885M719N070N470O558P497O879M826L128L168M498N661N821N111L772
54452A90063J800l82j706j749j705k971n048o166o042o243p379p787o167l905
$$ plain form
54438 134613 131517 128072 125028 123570 123385 123095 121771 119325 116158 113101 111023 109895 108792 107248 105834
54423 105834 104976 104106 102686 101215 100420 100222 100307 101002 102603 104460 105755 106799 108540 111115 113888 116683
54407 116683 119936 123688 127334 130467 133057 134728 134758 133214 131326 130237 129905 129745 129839 130608 131468 130830
54391 130830 128028 124568 122547 122085 121233 118570 114929 112184 111259 111932 113657 115544 116128 114466 111331
54376 111331 108459 106713 105689 104733 103359 101059 97888 95137 94281 95256 96723 97814 98537 98705 97945 96806
54360 96806 96438 96997 97638 98191 99374 101142 102357 102546 102536 102867 103164 103695 105875 110211 115033 118335 119912
54343 119912 120940 122675 126278 132525 140497 147716 152775 156887 161825 167415 172300 176180 179837 183565
54329 183565 186903 189579 191655 193031 193553 193188 191577 188241 183831 180109 177851 175810 172704 169100 166026
$$ packed form
54438A34613l096l445l044j458j85k90j324k446l167l057k078j128j103j544j414
54423A05834q58q70j420j471p95j98Q5O95J601J857J295J044J741K575K773K795
54407A16683L253L752L646L133K590J671L0j544j888j089l32j60R4P69Q60o38
54391A30830k802l460k021m62q52k663l641k745r25O73J725J887N84j662l135
54376A11331k872j746j024r56j374k300l171k751q56R75J467J091P23J68p60j139
54360I6806l68N59O41N53J183J768J215J89j0L31K97N31K180M336M822L302J577
54343A19912J028J735L603O247P972P219N059M112M938N590M885L880L657L728
54329A83565L338K676K076J376N22l65j611l336m410l722k258k041l106l604l074
$$ plain form
54314 166026 162870 158329 152754 147937 144784 142609 140440 137848 134735 131501 129204 128540 128826 128890 128492
54299 128492 127977 126956 124637 121297 118382 117179 118009 120329 122893 124315 124325 124062 124465 125121 125476 126145
54283 126145 127810 129801 131254 132894 135960 139989 143446 146219 149543 153524 156602 157803 157890 157885 157933 158038
54267 158038 158507 158985 158236 155675 152353 149766 148203 146686 144063 139935 134876 129913 125509 121229 116653
54252 116653 112091 107878 103622 99053 95041 92686 91811 91385 91001 90732 89996 88065 85530 83783 83016 82103
54236 82103 80444 78552 76705 74509 72123 70558 70328 70953 72087 73898 75878 76589 75274 72799 70502
54221 70502 68975 68300 68542 69450 70461 71419 72637 74139 75655 77324 79271 80457 79498 77132 76369 79208
54205 79208 84198 88139 89333 88429 87029 86520 87632 90050 92641 94618 96195 97680 98562 98112 96465
$$ packed form
54314A66026l156m541n575m817l153k175k169k592l113l234k297o64K86O4l98
54299A28492n15j021k319l340k915j203Q30K320K564J422J0k63M03O56L55O69
54283A26145J665J991J453J640L066M029L457K773L324L981L078J201Q7nM8J05
54267A58038M69M78p49k561l322k587j563j517k623m128n059m963m404m280m576
54252A16653m562m213m256m569m012k355q75m26l84k69p36j931k535j747p67r13
54236H2103j659j892j847k196k386j565k30O25J134J811J980P11j315k475k297
54221G0502j527o75K42R08J011R58J218J502J516J669J947J186r59k366p63K839
54205G9208M990L941J194r04j400n09J112K418K591J977J577J485Q82m50j647
$$ plain form
54190 96465 94600 93480 93484 94268 94908 94634 93611 92524 91431 89833 87901 86558 86035 85507 84677 84586 86052
54173 86052 88345 90258 91512 92094 91259 88648 85855 85298 87479 90547 92619 93474 93787 93757 93098 91759
54157 91759 90128 88724 88022 88444 90249 93336 97049 100281 102187 102976 103688 104968 106472 107666 108620 109453
54141 109453 109534 108097 105433 102605 99968 96899 93200 89861 87814 86486 84384 80888 76777 73118 70363
54126 70363 68642 68102 68433 68596 67727 66094 64616 63710 63206 63152 63826 64974 65894 66417 67006 67733 68136 68379
54108 68379 69454 71664 73949 75458 76726 78302 79280 78544 76698 75224 74219 72570 70145 68167 67332
54093 67332 67112 67246 68403 70799 73280 74423 73692 71200 67402 63482 60948 60013 59164 56993 53791 50802
54077 50802 48567 46748 45072 43719 42972 42908 43288 43635 43720 43908 44558 45174 44922 43955 43349 43671 44571 45818
$$ packed form
54190I6465j865j120MP84O40k74j023j087j093j598j932j343n23n28q30r1J466
54173H6052K293J913J254N82q35k611k793n57K181L068K072Q55L13l0o59j339
54157I1759j631j404p02M22J805L087L713L232J906P89P12J280J504J194R54Q33
54141A09453Q1j437k664k828k637l069l699l339k047j328k102l496m111l659k755
54126G0363j721n40L31J63q69j633j478r06n04n4O74J148R20N23N89P27M03K43
54108F8379J075K210K285J509J268J576R78p36j846j474j005j649k425j978q35
54093F7332k20J34J157K396K481J143p31k492l798l920k534r35q49k171l202k989
54077E0802k235j819j676j353p47o4L80L47Q5J88O50O16k52r67o06L22R00J247
$$ plain form
54059 45818 47507 48966 49025 48162 48904 52738 57604 60011 59139 57314 56608 56526 55395 52849 50185 48807
54043 48807 49028 50312 52234 54964 58721 62885 66026 67050 66140 64437 62976 62102 61605 61155 60652 60305
54027 60305 60318 60630 61191 62314 64307 66782 68928 70571 72407 74881 77346 78702 78628 77958 78013 79616 82486
54010 82486 85467 87499 88360 88334 87657 86775 86722 88282 90799 92633 92910 92189 91524 91715 93488 97351 102839
53993 102839 108645 113688 117447 119351 118995 117306 116319 117180 119152 121007 122586 124503 127196 130779 134991
53978 134991 138815 141006 141692 142723 145879 151410 158623 166829 175269 183287 191329 200530 210525 219128
53964 219128 225410 231677 240598 251400 260938 267875 273551 278889 282843 284591 285300 286628 288732 290859
53950 290859 292981 295629 298608 300797 301148 299387 296011 292036 288433 285200 281038 274503 265660 256381
$$ packed form
54059D5818J689J459N9q63P42L834M866K407q72j825p06q2j131k546k664j378
54043D8807K21J284J922K730L757M164L141J024r10j703j461q74m97m50n03l47
54027F0305J3L12N61J123J993K475K146J643J836K474K465J356p4o70N5J603K870
54010H2486K981K032Q61k6o77q82n3J560K517J834K77p21o65J91J773L863N488
53993A02839N806N043L759J904l56j689r87Q61J972J855J579J917K693L583M212
53978A34991L824K191O86J031L156N531P213Q206Q440Q018Q042R201R995Q603
53964B19128O282O267Q921J0802R538O937N676N338L954J748P09J328K104K127
53950B90859K122K648K979K189L51j761l376l975l603l233m162o535q843r279
$$ plain form
53936 256381 248802 243552 239532 235304 230426 225405 220673 216085 211364 206592 202029 197709 193424 189017
53922 189017 184700 181240 179659 180293 182126 183450 183327 182087 180525 179149 178182 177633 177113 176154 174864 173833
53906 173833 173394 173549 174581 176894 180145 183348 185943 187855 188477 186884 183466 180055 177812 176165 174575
53891 174575 174063 175851 179557 183962 188723 194045 199369 203769 207186 210102 212490 214292 216423 219881
53877 219881 224288 228689 233469 239828 247458 254444 259825 264731 270437 276539 281796 285771 288831 291257
53863 291257 293196 295108 297529 300472 303472 306211 308926 312241 316582 321790 327398 333342 340005 347467
53849 347467 355191 362682 369862 376557 382504 388405 395923 405545 415194 422223 426260 428802 430544 430727
53835 430727 429043 426509 424028 421341 417810 413266 407669 400908 393273 385288 376815 367201 356617 346259
$$ packed form
53936B56381p579n250m020m228m878n021m732m588m721m772m563m320m285m407
53922A89017m317l460j581O34J833J324j23j240j562j376r67n49n20r59j290j031
53906A73833m39J55J032K313L251L203K595J912O22j593l418l411k243j647j590
53891A74575n12J788L706M405M761N322N324M400L417K916K388J802K131L458
53877B19881M407M401M780O359P630O986N381M906N706O102N257L975L060K426
53863B91257J939J912K421K943L000K739K715L315M341N208N608N944O663P462
53849C47467P724P491P180O695N947N901P518R622R649P029M037K542J742J83
53835D30727j684k534k481k687l531m544n597o761p635p985q473r614j0584j0358
$$ plain form
53821 346259 336841 327793 318406 308905 299911 291595 283964 277220 271184 264911 257608 249677 242384 236613
53807 236613 232203 228273 223965 219156 214497 210541 206963 202939 198052 192279 185549 178258 171980 168391
53793 168391 167258 166653 165486 164629 164914 165131 163116 158345 152588 148202 146221 145773 144984 142715 139719 137734
53777 137734 137437 137964 138499 139303 140644 141709 141502 140223 138901 138134 137958 138491 139721 140865 140891 139800 138703
53760 138703 138532 139140 139770 139988 140047 140557 141770 143074 143580 143537 144747 148829 155102 160934 164391 166057 167899
53743 167899 170880 174355 177628 181172 185767 190967 195446 198963 203087 209417 217741 226561 234851 242448
53729 242448 249214 255054 260630 266801 273035 277393 278645 277630 276144 275257 275189 275965 277334 278460 278408 276829
53713 276829 273941 270228 266384 262961 259641 255423 250012 244517 240278 237441 235206 232925 230390 227501
$$ packed form
53821C46259r418r048r387r501q994q316p631o744o036o273p303p931p293n771
53807B36613m410l930m308m809m659l956l578m024m887n773o730p291o278l589
53793A68391j133o05j167q57K85K17k015m771n757m386j981m48p89k269k996j985
53777A37734k97N27N35Q04J341J065k07j279j322p67j76N33J230J144K6j091j097
53760A38703j71O08O30K18N9N10J213J304N06m3J210M082O273N832L457J666J842
53743A67899K981L475L273L544M595N200M479L517M124O330Q324Q820Q290P597
53729B42448O766N840N576O171O234M358J252j015j486q87o8P76J369J126n2j579
53713B76829k888l713l844l423l320m218n411n495m239k837k235k281k535k889
$$ plain form
53699 227501 224381 221559 219411 217577 215366 212513 209185 205697 202724 201243 201529 202464 202583 201745 201251
53684 201251 202483 205776 210228 214041 215493 214364 212276 211046 211069 211884 213742 217377 222376 227000 229862
53669 229862 230902 230498 228627 225379 221566 218226 215865 214380 213277 211839 209677 207305 205560 204314
53655 204314 202585 200260 198821 199630 202154 204701 206452 207839 209244 210408 211216 212172 213668 215364 216752
53640 216752 217974 219666 222214 225498 229237 233172 236931 240136 242825 245544 248802 252670 257133 262582
53626 262582 269297 276367 281833 284568 285720 287683 291641 296646 301028 304012 305836 307058 308269 309936
53612 309936 311804 312665 311514 309052 307470 308400 311225 313576 313396 310460 306126 301851 298060 294439 291000
53597 291000 288360 286784 285528 283694 281496 279973 279465 279158 278437 277952 278682 280337 281507 281379 280662 280609
$$ packed form
53699B27501l120k822k148j834k211k853l328l488k973j481K86R35J19q38m94
53684B01251J232L293M452L813J452j129k088j230K3Q15J858L635M999M624K862
53669B29862J040m04j871l248l813l340k361j485j103j438k162k372j745j246
53655B04314j729k325j439Q09K524K547J751J387J405J164Q08R56J496J696J388
53640B16752J222J692K548L284L739L935L759L205K689K719L258L868M463N449
53626B62582O715P070N466K735J152J963L958N005M382K984J824J222J211J667
53612C09936J868Q61j151k462j582R30K825K351j80k936m334m275l791l621l439
53597B91000k640j576j256j834k198j523n08l07p21m85P30J655J170j28p17n3
$$ plain form
53581 280609 281614 283066 284228 284867 285134 285244 285442 286076 287542 290036 293255 296342 298368 299153 299631 301047
53565 301047 303652 306375 308133 309295 311376 315184 319791 323648 326331 328723 331779 335810 340793 346599
53551 346599 352628 357944 362156 365696 368928 371621 373916 377173 382847 390570 398199 404068 408575 413331
53537 413331 419290 426125 433160 440268 447648 455056 461769 467533 473103 479270 485532 490530 493928 496919
53523 496919 500405 503615 505406 506208 507515 509820 512220 513949 515228 516531 517969 519485 520843 521478 521241
53508 521241 521144 522260 524014 524909 525053 526374 529873 534208 537730 540477 543106 545236 546342 547488 550614
53493 550614 556351 563539 570579 576463 580987 584831 589096 594018 598677 602593 606823 612464 618847 624445
53479 624445 629080 633989 640136 647650 656531 666544 676634 685747 694247 703377 713446 723702 733823
$$ packed form
53581B80609J005J452J162O39K67J10J98O34J466K494L219L087K026P85M78J416
53565C01047K605K723J758J162K081L808M607L857K683K392L056M031M983N806
53551C46599O029N316M212L540L232K693K295L257N674P723P629N869M507M756
53537D13331N959O835P035P108P380P408O713N764N570O167O262M998L398K991
53523D96919L486L210J791Q02J307K305K400J729J279J303J438J516J358O35k37
53508E21241r7J116J754Q95J44J321L499M335L522K747K629K130J106J146L126
53493E50614N737P188P040N884M524L844M265M922M659L916M230N641O383N598
53479F24445M635M909O147P514Q881J0013J0090R113Q500R130J0069J0256J0121
$$ plain form
53466 733823 744223 754904 765393 776041 788059 801958 817077 833009 850280 869182 888960
53455 888960 908820 928996 950353 973556 998781 1025435 1052019 1077230 1101515 1126773 1154363
53444 1154363 1184304 1216349 1250488 1285967 1321296 1356104 1392018 1430748 1472034 1514139 1555618
53433 1555618 1595965 1635291 1674200 1713305 1752227 1789676 1825189 1860058 1895817 1932500 1969193
53422 1969193 2005525 2041736 2077846 2113803 2149971 2186519 2222721 2257855 2292363 2327014 2361281
53411 2361281 2393801 2424407 2454292 2483819 2511358 2535075 2554995 2572464 2588118 2601229 2610873
53400 2610873 2616840 2619337 2618555 2615032 2609835 2603693 2596035 2585498 2571403 2554133 2534072 2511167 2485973
53387 2485973 2460131 2434779 2409148 2381829 2353050 2324324 2296023 2266774 2235594 2203343 2171492
$$ packed form
53466G33823J0400J0681J0489J0648J2018J3899J5119J5932J7271J8902J9778
53455H88960J9860K0176K1357K3203K5225K6654K6584K5211K4285K5258K7590
53444A154363K9941L2045L4139L5479L5329L4808L5914L8730M1286M2105M1479
53433A555618M0347L9326L8909L9105L8922L7449L5513L4869L5759L6683L6693
53422A969193L6332L6211L6110L5957L6168L6548L6202L5134L4508L4651L4267
53411B361281L2520L0606K9885K9527K7539K3717J9920J7469J5654J3111R644
53400B610873N967K497p82l523n197o142p658j0537j4095j7270k0061k2905k5194
53387B485973k5842k5352k5631k7319k8779k8726k8301k9249l1180l2251l1851
$$ plain form
53376 2171492 2140546 2110304 2080672 2051462 2022288 1993511 1966654 1943049 1922534 1904215 1887905
53365 1887905 1874008 1862494 1852924 1845227 1839581 1835690 1833015 1831740 1832832 1837066 1844423 1854440 1866630
53352 1866630 1880481 1895490 1911410 1928369 1946687 1966638 1988356 2011984 2037913 2066645 2098164
53341 2098164 2131841 2167476 2206094 2248861 2295325 2343705 2393011 2443864 2497052 2552454 2609839
53330 2609839 2669546 2731662 2795574 2861105 2929182 3000431 3073978 3148636 3224504 3302135 3380778
53319 3380778 3458789 3535504 3611396 3686429 3759509 3829718 3897107 3961985 4024182 4083309 4139120
53308 4139120 4191204 4238616 4280001 4314104 4340420 4359571 4372739 4380437 4382137 4377276 4366009 4348547
53296 4348547 4324409 4293054 4254803 4210609 4161408 4108317 4052745 3995423 3935763 3873072 3807940
$$ packed form
53376B171492l0946l0242k9632k9210k9174k8777k6857k3605k0515j8319j6310
53365A887905j3897j1514r570p697n646l891k675j275J092M234P357J0017J2190
53352A866630J3851J5009J5920J6959J8318J9951K1718K3628K5929K8732L1519
53341B098164L3677L5635L8618M2767M6464M8380M9306N0853N3188N5402N7385
53330B609839N9707O2116O3912O5531O8077P1249P3547P4658P5868P7631P8643
53319C380778P8011P6715P5892P5033P3080P0209O7389O4878O2197N9127N5811
53308D139120N2084M7412M1385L4103K6316J9151J3168P698J700m861j1267j7462
53296D348547k4138l1355l8251m4194m9201n3091n5572n7322n9660o2691o5132
$$ plain form
53285 3807940 3741615 3674582 3606843 3539087 3472371 3406907 3342332 3278872 3216918 3155697 3093954
53274 3093954 3032023 2971668 2913492 2856042 2798128 2740681 2685519 2633595 2585478 2542336 2504739
53263 2504739 2471028 2438480 2406177 2375482 2347466 2321122 2294902 2269147 2245744 2225438 2206618
53252 2206618 2187328 2167706 2149441 2133105 2117218 2100374 2083309 2068157 2056208 2047194 2040387 2035574
53240 2035574 2033030 2033136 2035934 2040709 2046288 2052275 2059628 2069373 2081232 2094320 2108856 2126059 2146380
53227 2146380 2168876 2192541 2217335 2243617 2271427 2300825 2332247 2365971 2401491 2437703 2473453
53216 2473453 2507862 2540535 2571574 2601044 2628427 2652992 2674644 2693756 2710182 2723118 2732174
53205 2732174 2737909 2741016 2741453 2738652 2732106 2721486 2706642 2687864 2665935 2641720 2615946 2589236
$$ packed form
53285C807940o6325o7033o7739o7756o6716o5464o4575o3460o1954o1221o1743
53274C093954o1931o0355n8176n7450n7914n7447n5162n1924m8117m3142l7597
53263B504739l3711l2548l2303l0695k8016k6344k6220k5755k3403k0306j8820
53252B206618j9290j9622j8265j6336j5887j6844j7065j5152j1949r014o807m813
53240B035574k544J06K798M775N579N987P353R745J1859J3088J4536J7203K0321
53227B146380K2496K3665K4794K6282K7810K9398L1422L3724L5520L6212L5750
53216B473453L4409L2673L1039K9470K7383K4565K1652J9112J6426J2936R056
53205B732174N735L107M37k801o546j0620j4844j8778k1929k4215k5774k6710
$$ plain form
53193 2589236 2561818 2533103 2502243 2469407 2435979 2403036 2370086 2335773 2299551 2262154 2224612
53182 2224612 2187341 2150225 2113206 2076520 2040440 2005005 1970197 1936356 1904128 1873746 1844709
53171 1844709 1816594 1790040 1766244 1745191 1724898 1702953 1678853 1654508 1632322 1612855 1594545
53160 1594545 1575687 1556434 1538587 1523630 1511355 1500389 1489564 1478587 1467840 1457653 1447447
53149 1447447 1435552 1420503 1402744 1384371 1366850 1349665 1331582 1312410 1292912 1273784 1255619
53138 1255619 1239156 1224512 1210600 1196343 1182030 1168362 1154529 1138598 1119808 1099246 1078040
53127 1078040 1056028 1032563 1007735 982452 958103 936354 918254 903002 888301 872456 855634
53116 855634 838760 821968 804862 787714 771523 756819 742997 729073 714819 700811 687507
$$ packed form
53193B589236k7418k8715l0860l2836l3428l2943l2950l4313l6222l7397l7542
53182B224612l7271l7116l7019l6686l6080l5435l4808l3841l2228l0382k9037
53171A844709k8115k6554k3796k1053k0293k1945k4100k4345k2186j9467j8310
53160A594545j8858j9253j7847j4957j2275j0966j0825j0977j0747j0187j0206
53149A447447j1895j5049j7759j8373j7521j7185j8083j9172j9498j9128j8165
53138A255619j6463j4644j3912j4257j4313j3668j3833j5931j8790k0562k1206
53127A078040k2012k3465k4828k5283k4349k1749j8100j5252j4701j5845j6822
53116H55634j6874j6792j7106j7148j6191j4704j3822j3924j4254j4008j3304
$$ plain form
53105 687507 674658 661886 649452 637843 626846 615831 604907 594750 585036 574278 561868 549251
53093 549251 538141 528503 519184 509576 499610 489094 478464 469353 462886 458022 452990 447693 443095
53080 443095 439028 434540 429837 425706 421340 415130 407686 401684 398392 396608 395307 394787 394529 392729 389330
53065 389330 387011 387344 388029 385977 381491 377245 374485 372410 370314 368009 364672 359447 353159 347736 343803
53050 343803 340227 336016 331427 327123 323262 319547 315534 311076 307021 304881 305055 305939 305788 304831 304419
53035 304419 304660 304324 302898 301416 301094 302136 304027 306215 308383 310605 313235 316261 319167 321894 325298
53020 325298 329809 334180 336625 336836 335948 334858 333671 332444 331184 329087 325003 318982 312515 307017 302624
53005 302624 298474 293442 286701 278398 269869 262463 256097 249730 243228 237866 234764 233642 233435 233415 233227
$$ packed form
53105F87507j2849j2772j2434j1609j0997j1015j0924j0157r714j0758j2410j2617
53093E49251j1110r638r319r608r966j0516j0630r111o467m864n032n297m598
53080D43095m067m488m703m131m366o210p444o002l292j784j301n20k58j800l399
53065C89330k319L33O85k052m486m246k760k075k096k305l337n225o288n423l933
53050C43803l576m211m589m304l861l715m013m458m055k140J74Q84j51r57m12
53035C04419K41l36j426j482l22J042J891K188K168K222K630L026K906K727L404
53020C25298M511M371K445K11q88j090j187j227j260k097m084o021o467n498m393
53005C02624m150n032o741q303q529p406o366o367o502n362l102j122k07k0j88
$$ plain form
52990 233227 232388 230452 227583 224574 222056 219804 217018 213466 210078 207967 206976 205918 204236 202559 201357
52975 201357 200125 198475 197001 196281 195934 195681 196431 198925 201914 203158 202056 200039 198507 197621 197115 196887
52959 196887 196495 195164 192693 189614 186318 182882 179861 178357 178909 180915 183310 185199 185898 185251 184074
52944 184074 183440 183318 182621 180890 179154 178771 180043 182228 184325 185576 185841 185882 186820 188927 191181 192206
52928 192206 191565 190127 189443 190518 192748 194263 193786 191993 190543 190224 190796 192222 194784 197924 200120
52913 200120 200324 198810 196477 194134 192657 192767 194142 195464 195930 196234 197657 200620 204444 208059 210677
52898 210677 212223 213360 214763 216431 218180 220593 224477 229278 233180 235236 236475 238309 240826 243468
52884 243468 246487 250668 255962 261522 266922 272425 278012 283047 287160 290822 294700 298910 303256 307822
$$ packed form
52990B33227q39j936k869l009k518k252k786l552l388k111r91j058j682j677j202
52975B01357j232j650j474p20l47k53P50K494K989J244j102k017j532q86n06k28
52959A96887l92j331k471l079l296l436l021j504N52K006K395J889O99o47j177
52944A84074o34j22o97j731j736l83J272K185K097J251K65M1R38K107K254J025
52928A92206o41j438o84J075K230J515m77j793j450l19N72J426K562L140K196
52913B00120K04j514k333k343j477J10J375J322M66L04J423K963L824L615K618
52898B10677J546J137J403J668J749K413L884M801L902K056J239J834K517K642
52884B43468L019M181N294N560N400N503N587N035M113L662L878M210M346M566
$$ plain form
52870 307822 312773 317661 321452 323492 324152 324269 324286 324357 324928 326354 327837 327725 325383 322067 319371 317474
52854 317474 315658 313725 311804 309303 305557 301466 298980 298601 298620 297328 294825 291942 288540 284194 280002
52839 280002 278248 279900 283239 285459 285339 283980 283104 283146 283274 282908 282484 282626 283267 284074 285173 286834 288820
52822 288820 290697 292412 293954 294808 294508 293465 292424 291364 289763 287707 285793 284191 282783 282058 282689
52807 282689 284315 285899 287265 288987 290710 291018 289408 287117 285593 285363 286735 290100 294735 298621 300484
52792 300484 301002 301204 300800 299159 296909 295353 294921 295216 295889 296500 296252 295023 294126 294941 297277 300054 302991
52775 302991 306386 309739 311895 312499 312199 311637 311241 311762 313780 316643 318959 320264 321393 323183 325653
52760 325653 328408 330922 332449 332728 332822 334305 337332 340473 342651 344305 346173 347814 348027 346251 342996
$$ packed form
52870C07822M951M888L791K040O60J17J7P1N71J426J483j12k342l316k696j897
52854C17474j816j933j921k501l746m091k486l79J9j292k503k883l402m346m192
52839B80002j754J652L339K220j20j359q76M2J28l66m24J42O41Q07J099J661J986
52822B88820J877J715J542Q54l00j043j041j060j601k056j914j602j408p25O31
52807B82689J626J584J366J722J723L08j610k291j524k30J372L365M635L886J863
52792C00484N18K02m04j641k250j556m32K95O73O11k48j229q97Q15K336K777K937
52775C02991L395L353K156O04l00n62l96N21K018K863K316J305J129J790K470
52760C25653K755K514J527K79R4J483L027L141K178J654J868J641K13j776l255
$$ plain form
52745 342996 339183 335502 332146 328933 325798 323074 320976 318824 315370 310081 303791 297989 293752 291140
52731 291140 289066 285831 280560 274287 268988 265419 262534 259190 255489 252037 248741 245102 241108 236993
52717 236993 232482 227116 221228 215831 211508 208029 205187 203268 202413 202038 201444 200686 200255 199896 198329 194486
52701 194486 188796 182942 178451 175790 174645 174473 174547 173910 171962 169146 166683 165363 164640 162999 159322
52686 159322 154036 148997 146063 145642 146609 147503 147469 146133 143326 139550 136279 134889 135192 135536 134452 131692
52670 131692 127656 122658 117335 113089 111199 111409 112121 112141 111764 111891 112584 113075 113019 113008 113597 114288 113987 112349
52652 112349 110224 108656 107777 106878 105346 103290 101263 99567 97936 95895 93504 91672 91579 93596 96751
52637 96751 99359 100298 99807 99139 99417 100733 102309 103400 103827 103683 102962 101905 101478 102885 106367 110806
$$ packed form
52745C42996l813l681l356l213l135k724k098k152l454n289o290n802m237k612
52731B91140k074l235n271o273n299l569k885l344l701l452l296l639l994m115
52717B36993m511n366n888n397m323l479k842j919q55l75n94p58m31l59j567l843
52701A94486n690n854m491k661j145j72P4o37j948k816k463j320p23j641l677
52686A59322n286n039k934m21R67Q94l4j336k807l776l271j390L03L44j084k760
52670A31692m036m998n323m246j890K10P12K0l77J27O93M91n6j1N89O91l01j638
52652A12349k125j568q79q99j532k056k027j696j631k041k391j832r3K017L155
52637I6751K608R39m91o68K78J316J576J091M27j44p21j057m27J407L482M439
$$ plain form
52621 110806 114788 117945 121096 125144 129988 134602 138152 140832 143336 145676 147162 147724 148483 150334 152558
52606 152558 153886 154644 156549 160097 163460 164671 164018 163258 163011 162086 159391 155550 152230 150377 149576 148965
52590 148965 148312 147970 147907 147350 145673 143289 141046 138910 136060 132415 129240 127754 127736 127978 127619 126508
52574 126508 124695 122337 119884 117799 116140 114788 113902 113741 114247 115238 116762 118728 120329 120420 118551 115343
52558 115343 111992 109782 109807 112334 116091 118658 118179 114905 111059 109115 109967 112554 115113 116634 117113
52543 117113 116798 115888 114878 114457 114670 114772 114351 114126 115126 117409 120021 121886 122339 121223 119148 117447
52527 117447 117278 118697 120831 122653 123408 122903 121977 122245 124597 128151 131304 133524 135395 137248 138725
52512 138725 139672 140516 141473 142062 141731 140590 139398 139167 140631 143551 146570 148303 148630 148517 148779 149728 151787
$$ packed form
52621A10806L982L157L151M048M844M614L550K680K504K340J486N62P59J851K224
52606A52558J328P58J905L548L363J211o53p60k47r25k695l841l320j853q01o11
52590A48965o53l42o3n57j677k384k243k136k850l645l175j486j8K42l59j111
52574A26508j813k358k453k085j659j352q86j61N06R91J524J966J601R1j869l208
52558A15343l351k210K5K527L757K567m79l274l846j944Q52K587K559J521M79
52543A17113l15r10j010m21K13J02m21k25J000K283K612J865M53j116k075j701
52527A17447j69J419K134J822P55n05r26K68K352L554L153K220J871J853J477
52512A38725R47Q44R57N89l31j141j192k31J464K920L019J733L27j13K62R49K059
$$ plain form
52495 151787 155274 159311 161934 162002 160493 159395 159672 160760 161663 161941 161777 161543 161496 161785 162727 164821 168211
52478 168211 172169 175564 178004 180201 183025 186369 189108 190198 189880 189812 191706 195613 199803 202554 203671
52463 203671 203954 203890 203644 203779 204917 206823 208753 210645 212982 215580 217680 219332 221397 223750 224771
52448 224771 223337 220296 217199 214491 211922 209949 209490 210553 212081 213124 213513 213563 213784 214823 217118
52433 217118 220466 224129 227288 229399 230614 231901 234084 236506 237465 236432 234926 234447 234477 233512 231276
52418 231276 228699 226404 224639 224289 226175 229170 230654 229359 226634 224386 222932 221570 220207 219563 220330
52403 220330 222823 226881 231507 235126 236783 236838 236276 235971 236842 239635 243773 247318 249072 250047 251811 254092
52387 254092 255358 255229 254673 253944 252226 249867 249145 251582 255587 258130 258128 256977 256247 256338 257231 258980 260882
$$ packed form
52495A51787L487M037K623O8j509j098K77J088R03K78j64k34m7K89R42K094L390
52478A68211L958L395K440K197K824L344K739J090l18o8J894L907M190K751J117
52463B03671K83o4k46J35J138J906J930J892K337K598K100J652K065K353J021
52448B24771j434l041l097k708k569j973m59J063J528J043L89N0K21J039K295
52433B17118L348L663L159K111J215J287K183K422R59j033j506m79L0r65k236
52418B31276k577k295j765l50J886K995J484j295k725k248j454j362j363o44P67
52403B20330K493M058M626L619J657N5n62l05Q71K793M138L545J754R75J764K281
52387B54092J266j29n56p29j718k359p22K437M005K543kj151p30R1Q93J749J902
$$ plain form
52370 260882 261446 260164 258632 258887 260871 262496 262200 260623 259533 259861 261315 263256 265104 266097 265653 264338
52354 264338 263811 265179 267649 269291 268980 267109 264602 261942 259359 257381 256668 257471 259587 262758 266829
52339 266829 271438 275637 277992 277404 274205 270333 267860 267231 267323 267283 267639 269362 272588 276829 281785 287021
52323 287021 291316 293594 294581 296449 300242 304459 306887 307265 307384 308755 310994 312657 313062 312863 313082 314043
52307 314043 315364 316620 317605 318186 318424 318990 320875 324309 328359 332013 335253 338597 342055 345354 348839
52292 348839 353157 358034 362335 365502 368137 370986 374190 377753 381840 386188 390154 393832 398169 403303
52278 403303 407688 409927 410842 412602 416148 420557 424850 429419 435439 443465 452807 462046 470329 478415
52264 478415 487874 498793 509024 516722 523024 530975 541986 554744 567601 580457 593760 607164
$$ packed form
52370B60882N64j282j532K55J984J625k96j577j090L28J454J941J848R93m44j315
52354B64338n27J368K470J642l11j871k507k660k583j978p13Q03K116L171M071
52339B66829M609M199K355n88l199l872k473o29R2m0L56J723L226M241M956N236
52323B87021M295K278R87J868L793M217K428L78J19J371K239J663M05j99K19R61
52307C14043J321J256R85N81K38N66J885L434M050L654L240L344L458L299L485
52292C48839M318M877M301L167K635K849L204L563M087M348L966L678M337N134
52278D03303M385K239R15J760L546M409M293M569O020Q026R342R239Q283Q086
52264D78415R459J0919J0231P698O302P951J1011J2758J2857J2856J3303J3404
$$ plain form
52252 607164 620329 634123 649810 667380 685736 704366 723946 745263 768338 792798 818467
52241 818467 845207 872450 899266 924983 949773 974737 1001344 1030471 1061711 1093582 1124482
52230 1124482 1153603 1181146 1207871 1234518 1261484 1288728 1315767 1341829 1366308 1389154 1410599
52219 1410599 1430410 1447721 1461909 1473454 1483575 1492890 1500713 1505853 1508134 1508914 1509915 1511552 1512757
52206 1512757 1512591 1511549 1510810 1510636 1510376 1509860 1509597 1509436 1508270 1505859 1503990 1504770 1508348 1513398 1519419 1527449
52190 1527449 1538544 1552540 1568386 1584946 1601437 1617766 1634594 1652554 1671516 1691136 1711705
52179 1711705 1733612 1756107 1777701 1797896 1817560 1837309 1856420 1873702 1888610 1901072 1910924
52168 1910924 1918150 1923296 1927192 1930429 1933152 1934818 1934080 1929549 1921051 1909804 1897206 1883967 1870428
$$ packed form
52252F07164J3165J3794J5687J7570J8356J8630J9580K1317K3075K4460K5669
52241H18467K6740K7243K6816K5717K4790K4964K6607K9127L1240L1871L0900
52230A124482K9121K7543K6725K6647K6966K7244K7039K6062K4479K2846K1445
52219A410599J9811J7311J4188J1545J0121R315P823N140K281P80J001J637J205
52206A512757j66j042p39j74k60n16k63j61j166k411j869P80L578N050O021Q030
52190A527449J1095J3996J5846J6560J6491J6329J6828J7960J8962J9620K0569
52179A711705K1907K2495K1594K0195J9664J9749J9111J7282J4908J2462R852
52168A910924P226N146L896L237K723J666p38m531q498j1247j2598j3239j3539
$$ plain form
52155 1870428 1856885 1843145 1828391 1811981 1793952 1774467 1753368 1730782 1707694 1685275 1663926
52144 1663926 1643457 1623945 1605845 1589276 1573624 1558095 1542681 1528531 1517140 1508936 1502841 1497450
52132 1497450 1492281 1487440 1482622 1477433 1472421 1468593 1465704 1462150 1457002 1451167 1445911 1441054 1435410 1428566
52118 1428566 1421590 1416146 1413098 1411567 1409318 1404689 1398176 1391439 1384987 1378088 1370965 1365350 1362059 1359529
52104 1359529 1355816 1350744 1344884 1337837 1329254 1320569 1313665 1308245 1302350 1295333 1288513 1282870 1277834 1272736
52090 1272736 1267914 1263816 1260324 1257476 1255621 1254264 1251970 1248274 1244658 1242687 1242005 1241147 1239681 1238388
52076 1238388 1237572 1236326 1233673 1229846 1226177 1223922 1223241 1223174 1222656 1221566 1220559 1219946 1219406 1219083 1220286 1224272
52060 1224272 1230591 1237340 1243172 1248460 1254409 1261629 1270073 1279949 1291896 1306066 1321511 1336985 1352318
$$ packed form
52155A870428j3543j3740j4754j6410j8029j9485k1099k2586k3088k2419k1349
52144A663926k0469j9512j8100j6569j5652j5529j5414j4150j1391q204o095n391
52132A497450n169m841m818n189n012l828k889l554n148n835n256m857n644o844
52118A428566o976n444l048j531k249m629o513o737o452o899p123n615l291k530
52104A359529l713n072n860p047q583q685o904n420n895p017o820n643n036n098
52090A272736m822m098l492k848j855j357k294l696l616j971o82q58j466j293
52076A238388q16j246k653l827l669k255o81o7n18j090j007o13n40l23J203L986
52060A224272O319O749N832N288N949P220Q444R876J1947J4170J5445J5474J5333
$$ plain form
52047 1352318 1368622 1387171 1408468 1432530 1459500 1489394 1521337 1553675 1585231 1616319 1648272
52036 1648272 1681898 1716536 1750810 1784195 1817430 1851155 1884578 1916131 1945184 1972234 1997370
52025 1997370 2019674 2038711 2055624 2071754 2086681 2098675 2106777 2111374 2112871 2111096 2106405 2100400
52013 2100400 2094707 2089331 2082671 2073000 2059739 2043658 2026216 2008616 1991280 1974179 1957488 1941735
52001 1941735 1927436 1914936 1904543 1896459 1890566 1886573 1884308 1883592 1883917 1884830 1886621 1890190 1896084 1903997
51987 1903997 1913075 1922298 1930729 1938173 1945740 1955029 1966392 1978472 1989634 1999261 2007451 2014274 2019971
51974 2019971 2025300 2030799 2035896 2039314 2040207 2038443 2034092 2027326 2018640 2008474 1996579 1982420 1966205
51961 1966205 1948841 1930657 1911000 1889444 1866667 1843382 1818954 1792013 1762346 1731224 1699777
$$ packed form
52047A352318J6304J8549K1297K4062K6970K9894L1943L2338L1556L1088L1953
52036A648272L3626L4638L4274L3385L3235L3725L3423L1553K9053K7050K5136
52025A997370K2304J9037J6913J6130J4927J1994Q102M597J497j775m691o005
52013B100400n693n376o660r671j3261j6081j7442j7600j7336j7101j6691j5753
52001A941735j4299j2500j0393q084n893l993k265p16L25R13J791L569N894P913
51987A903997R078R223Q431P444P567R289J1363J2080J1162R627Q190O823N697
51974B019971N329N499N097L418Q93j764m351o766q686j0166j1895j4159j6215
51961A966205j7364j8184j9657k1556k2777k3285k4428k6941k9667l1122l1447
$$ plain form
51950 1699777 1668005 1635845 1604240 1574195 1545202 1515633 1484656 1452853 1420943 1388849 1356457
51939 1356457 1324329 1292985 1262032 1230712 1198862 1166712 1134269 1101784 1070444 1041474 1014491
51928 1014491 987790 960429 933113 906760 881205 855999 831565 808695 787303 766588 746135
51917 746135 726065 706274 686486 667169 649630 634737 621939 609790 597164 583910 570782
51906 570782 558934 549065 540786 533094 525590 518709 512540 506137 498686 490859 484112 478842 474171 469546
51892 469546 465445 462096 458515 453586 447473 441095 434751 428248 422149 417704 415298 413831 412015 409746
51878 409746 407811 406756 406402 406132 405442 404511 404271 405406 407123 407568 405774 402588 399288 396044 392406 388609
51862 388609 385327 382376 378837 374565 370570 367433 364185 359451 353307 347265 342587 339267 336590 333946
$$ packed form
51950A699777l1772l2160l1605l0045k8993k9569l0977l1803l1910l2094l2392
51939A356457l2128l1344l0953l1320l1850l2150l2443l2485l1340k8970k6983
51928A014491k6701k7361k7316k6353k5555k5206k4434k2870k1392k0715k0453
51917G46135k0070j9791j9788j9317j7539j4893j2798j2149j2626j3254j3128
51906E70782j1848r869q279p692p504o881o169o403p451p827o747n270m671m625
51892D69546m101l349l581m929o113o378o344o503o099m445k406j467j816k269
51878D09746j935j055l54k70o90r31k40J135J717M45j794l186l300l244l638l797
51862C88609l282k951l539m272l995l137l248m734o144o042m678l320k677k644
$$ plain form
51848 333946 330767 326356 320649 314943 311053 309475 308952 308153 307098 306412 305785 304176 301323 298088 295232
51833 295232 292647 290000 287405 285217 283803 283562 284353 284694 282658 278272 274138 272745 273789 274971 274870
51818 274870 273887 272725 271321 269612 268339 268390 269736 271439 272546 272737 272253 271454 270623 270148 270547 271925
51802 271925 273534 274538 275301 277225 280943 285277 288539 290369 291841 294161 297835 302636 307642 311514
51788 311514 313350 313347 312458 311784 312466 315463 320693 326724 331880 335467 337601 338510 338576 338424 338212 337339 335558
51771 335558 333763 332826 332242 330930 328863 326826 325096 323556 322687 322986 323618 323147 321582 320267 319642 318698
51755 318698 317013 315833 316315 317927 319380 320150 320283 319549 317826 315867 314901 315624 317920 321178 324461 326765
51739 326765 327535 326821 324922 322223 319334 316849 314941 313588 312899 312595 311578 309100 306227 304937 305710
$$ packed form
51848C33946l179m411n707n706l890j578n23p99j055o86o27j609k853l235k856
51833B95232k585k647k595k188j414k41P91L41k036m386m134j393J044J182j01
51818B74870r83j162j404j709j273N1J346J703J107J91m84p99q31m75L99J378
51802B71925J609J004P63J924L718M334L262J830J472K320L674M801N006L872
51788C11514J836lq89o74O82K997N230O031N156L587K134R09O6j52k12q73j781
51771C35558j795r37n84j312k067k037j730j540q69K99O32m71j565j315o25r44
51755C18698j685j180M82J612J453P70J33p34j723j959r66P23K296L258L283K304
51739C26765P70p14j899k699k889k485j908j353o89l04j017k478k873j290P73
$$ plain form
51724 305710 307210 308429 309707 311294 312478 313013 314184 317324 322050 326707 329799 330407 328293 324612 321693
51709 321693 320976 321676 322329 322973 324739 327843 331236 334102 336626 339210 341742 343852 345439 346802 348307
51694 348307 349827 350574 350104 349485 350575 353750 357261 359420 360614 362462 365821 370487 376065 382092 387949
51679 387949 393708 400586 409407 419044 427619 435037 443002 452503 462600 472138 481582 492376 504948
51666 504948 517990 529691 539378 547886 556368 564860 572205 577198 579359 578726 575743 571527 567303 563055
51652 563055 557623 550711 543924 538877 535063 530681 525020 518902 513161 507904 503188 499273 496089 493253
51638 493253 490683 488594 487042 486160 486556 488549 491142 492695 492769 492568 493503 495963 499511 503572 507813 512366
51622 512366 517719 523905 529926 534503 537270 538800 539739 540397 540815 540654 539572 538401 539227 543157 548519
$$ packed form
51724C05710J500J219J278J587J184N35J171L140M726M657L092O08k114l681k919
51709C21693p17P00O53O44J766L104L393K866K524K584K532K110J587J363J505
51694C48307J520P47m70o19J090L175L511K159J194J848L359M666N578O027N857
51679C87949N759O878Q821R637Q575P418P965R501J0097R538R444J0794J2572
51666E04948J3042J1701R687Q508Q482Q492P345M993K161o33k983m216m224m248
51652E63055n432o912o787n047l814m382n661o118n741n257m716l915l184k836
51638D93253k570k089j552q82L96J993K593J553P4k01R35K460L548M061M241M553
51622E12366N353O186O021M577K767J530R39O58M18j61j082j171Q26L930N362
$$ plain form
51607 548519 552525 554377 555412 556584 557617 558734 561362 566283 572350 577860 582262 585913 589079 591851
51593 591851 594201 595506 594694 591485 586901 582055 577016 571235 564346 556173 546693 536499 526631 517488
51579 517488 508607 499851 491895 484953 477968 469908 461135 452734 445242 438884 434253 431484 429199 425497
51565 425497 419902 413365 406608 399657 393052 388165 385700 384611 383215 380947 378532 376758 375604 374563
51551 374563 373338 371960 370396 368439 366210 364529 364264 365235 366180 366090 365233 364672 365165 366843 369558 372951
51535 372951 376363 379200 381358 382986 384039 384592 385479 387955 392505 398374 404504 410632 417201 424521 432367
51520 432367 440340 448273 456157 463824 470992 477665 484347 491546 499014 505748 510990 515100 519050 523003
51506 523003 525780 526030 523704 520022 516077 511924 507154 501770 496124 490404 484840 480235 477529 476693 476688
$$ packed form
51607E48519M006J852J035J172J033J117K628M921O067N510M402L651L166K772
51593E91851K350J305q12l209m584m846n039n781o889q173r480j0194r868r143
51579E17488q881q756p956o942o985q060q773q401p492o358m631k769k285l702
51565D25497n595o537o757o951o605m887k465j089j396k268k415j774j154j041
51551C74563j225j378j564j957k229j681k65R71R45r0q57n61M93J678K715L393
51535C72951L412K837K158J628J053N53Q87K476M550N869O130O128O569P320P846
51520D32367P973P933P884P667P168O673O682P199P468O734N242M110L950L953
51506E23003K777K50k326l682l945m153m770n384n646n720n564m605k706q36n
$$ plain form
51491 476688 476722 476975 477855 479291 481289 484516 489557 495921 502515 508908 515456 522369 529367 536264 543218
51476 543218 550347 557573 564758 571382 576225 578237 577960 577321 577610 578150 577293 574293 569781 564842 560166
51461 560166 555998 552432 549531 547226 545279 543618 542748 543515 546135 549658 552799 555112 557069 559251 561963
51446 561963 565457 569835 574726 579495 583742 587296 589916 591510 592348 592501 591366 588488 584412 579746 573751
51431 573751 565174 554508 544042 535324 527898 521007 515137 511005 508150 505678 503585 502159 500680 498014
51417 498014 494347 491227 489844 490000 490916 492353 494731 498465 503286 508151 512045 515115 518781 524517 532737
51402 532737 542854 553839 564598 574516 584117 594591 606281 618242 629659 640760 651625 661075
51390 661075 667939 672815 677273 681672 685052 686979 687930 687690 684928 679249 672595 667502 664422 661670 657876
$$ packed form
51491D76688L4K53Q80J436J998L227N041O364O594O393O548O913O998O897O954
51476E43218P129P226P185O624M843K012k77o39K89N40q57l000m512m939m676
51461E60166m168l566k901k305j947j661q70P67K620L523L141K313J957K182K712
51446E61963L494M378M891M769M247L554K620J594Q38J53j135k878m076m666n995
51431E73751q577j0666j0466q718p426o891n870m132k855k472k093j426j479k666
51417D98014l667l120j383J56R16J437K378L734M821M865L894L070L666N736Q220
51402E32737J0117J0985J0759R918R601J0474J1690J1961J1417J1101J0865R450
51390F61075O864M876M458M399L380J927R51k40k762n679o654n093l080k752l794
$$ plain form
51375 657876 653700 650992 650756 652288 654113 655468 656705 658533 661287 664977 669446 674098 677855 680003
51361 680003 680864 681078 680431 678168 674519 671051 669028 667886 665821 661584 655134 646710 636119 623391
51347 623391 609803 597580 588264 581588 576136 570891 565889 561567 557910 554295 549949 544703 539532 536038
51333 536038 534866 534856 534456 533710 533819 534823 535106 533785 532279 532496 534458 536918 539544 543010 547251 551179
51317 551179 554255 557050 559855 561808 561802 559423 554535 546796 536248 523929 511267 499091 487450 476013
51303 476013 464285 451920 439353 427895 418601 411029 403450 394441 384159 374072 365609 359050 353556
51290 353556 347997 341695 334577 326978 319478 312715 307119 302825 299789 297817 296421 294958 292973 290242
51276 290242 286642 282457 278753 276610 275782 274959 273777 273633 275750 279243 282029 282994 282279 280220 277481
$$ packed form
51375F57876m176k708k36J532J825J355J237J828K754L690M469M652L757K148
51361F80003Q61K14o47k263l649l468k023j142k065m237o450q424j0591j2728
51347F23391j3588j2223r316o676n452n245n002m322l657l615m346n246n171l494
51333E36038j172j0m00p46J09J004K83j321j506K17J962K460K626L466M241L928
51317E51179L076K795K805J953ok379m888p739j0548j2319j2662j2176j1641j1437
51303D76013j1728j2365j2567j1458r294p572p579r009j0282j0087q463o559n494
51290C53556n559o302p118p599p500o763n596m294l036j972j396j463j985k731
51276B90242l600m185l704k143q28q23j182j44K117L493K786R65p15k059k739
$$ plain form
51261 277481 275812 276948 280506 284317 287106 289591 292678 296098 299474 303440 308640 314571 320360 325927
51247 325927 331425 336266 339908 343220 347819 354072 360698 366474 371657 377492 384822 393402 402219 410299
51233 410299 417231 422850 426529 427352 425366 422109 419196 416538 412501 405780 396630 386335 376000 365998
51219 365998 356238 346699 337641 329230 321001 312161 302668 293649 286357 281038 277152 274224 271740 268542
51205 268542 263388 256404 249219 243215 238095 232715 227003 222386 220206 220127 220433 219784 218290 216783 215593
51190 215593 214605 214239 215338 217679 219520 219479 218389 218329 220049 222416 224378 226235 228505 230638 231808 232312
51174 232312 233199 234776 236424 237760 239021 240163 240514 239761 238599 237864 237492 236938 236170 235514 234764 233362
51158 233362 231546 230539 231127 232589 233489 233189 232163 231203 230847 231366 232690 234290 235604 236644 237907 239666
$$ packed form
51261B77481j669J136L558L811K789K485L087L420L376L966N200N931N789N567
51247C25927N498M841L642L312M599O253O626N776N183N835P330Q580Q817Q080
51233D10299O932N619L679Q23j986l257k913k658m037o721r150j0295j0335j0002
51219C65998r760r539r058q411q229q840r493r019p292n319l886k928k484l198
51205B68542n154o984p185o004n120n380n712m617k180p9L06o49j494j507j190
51190B15593r88l66J099K341J841m1j090o0J720K367J962J857K270K133J170N04
51174B32312Q87J577J648J336J261J142L51p53j162p35l72n54p68o56p50j402
51158B33362j816j007N88J462R00l00j026r60l56N19J324J600J314J040J263J759
$$ plain form
51142 239666 241720 243800 245769 247360 248117 247804 246557 244578 241997 239147 236563 234615 233474 233357 234246
51127 234246 235279 235238 234020 232868 232584 232272 230736 228574 227734 229091 231471 233166 233490 232583 230610 227714
51111 227714 224303 220944 218174 216495 216040 216059 215367 213692 212118 211865 213075 215069 217179 218851 219559 219336
51095 219336 219020 219282 219731 219564 218726 217643 216197 213992 211527 209942 209410 208783 207241 205424 204376 204111
51079 204111 203759 202495 199844 195804 191436 188658 188373 189028 188002 184480 180206 177451 177060 178532 181100
51064 181100 184212 187510 190957 194863 199515 204814 210269 215112 218526 220180 220678 221156 222327 224197 226598
51049 226598 229539 232923 236442 239936 243384 246345 247946 247786 246535 245236 244318 243591 242853 242102 241330 240516
51033 240516 239609 238289 236122 233427 231663 232248 234915 237862 239709 240902 242849 246012 249246 251009 250848
$$ packed form
51142B39666K054K080J969J591P57l13j247j979k581k850k584j948j141j17Q89
51127B34246J033m1j218j152k84l12j536k162q40J357K380J695L24r07j973k896
51111B27714l411l359k770j679m55J9o92j675j574k53J210J994K110J672P08k23
51095B19336l16K62M49j67q38j083j446k205k465j585n32o27j542j817j048k65
51079B04111l52j264k651m040m368k778k85O55j026l522m274k755l91J472K568
51064A81100L112L298L447L906M652N299N455M843L414J654M98M78J171J870K401
51049B26598K941L384L519L494L448K961J601j60j251j299r18p27p38p51p72q14
51033B40516r07j320k167k695j764N85K667K947J847J193J947L163L234J763j61
$$ plain form
51018 250848 249512 247880 246236 244620 243343 242727 242685 243086 244211 246138 247892 248252 247580 247752 249798 252516
51002 252516 254120 254403 254378 254568 254823 255327 256469 257757 258093 257249 256061 255024 253756 252108 250749 250130
50986 250130 249785 249290 249065 249475 249801 249189 248324 249167 252789 258058 262761 265715 267617 270045 273906 278831
50970 278831 283823 288131 291485 294050 296618 300438 306005 312108 316958 320346 323753 327955 331629 333235
50956 333235 333477 334670 337878 341816 344783 346673 348586 351148 353982 356664 359455 362727 366019 368305
50942 368305 369508 371253 375468 382311 390232 398155 406697 416718 427578 437826 447233 457077 468505
50929 468505 481489 495494 510279 525861 542376 560293 580079 601369 623133 645033 667973
50918 667973 692819 719243 746607 775591 808096 845522 887763 933865 983180 1035778 1092282
$$ packed form
51018B50848j336j632j644j616j277o16m2M01J125J927J754L60o72J72K046K718
51002B52516J604K83k5J90K55N04J142J288L36q44j188j037j268j648j359o19
50986B50130l45m95k25M10L26o12q65Q43L622N269M703K954J902K428L861M925
50970B78831M992M308L354K565K568L820N567O103M850L388L407M202L674J606
50956C33235K42J193L208L938K967J890J913K562K834K682K791L272L292K286
50942C68305J203J745M215O843P921P923Q542J0021J0860J0248R407R844J1428
50929D68505J2984J4005J4785J5582J6515J7917J9786K1290K1764K1900K2940
50918F67973K4846K6424K7364K8984L2505L7426M2241M6102M9315N2598N6504
$$ plain form
50907 1092282 1153519 1220005 1291625 1367908 1448551 1533464 1622456 1715157 1811093 1909375 2008542
50896 2008542 2107327 2205504 2303155 2398850 2489223 2570748 2641525 2701210 2750084 2788820 2818338
50885 2818338 2838930 2849851 2850720 2843080 2829648 2812108 2790605 2765370 2737669 2708747 2678993 2648798
50873 2648798 2619327 2591386 2563952 2534717 2501933 2465038 2423847 2378074 2327758 2273372 2215256
50862 2215256 2153404 2087982 2019536 1948517 1875009 1799249 1722178 1645350 1570544 1499400 1432812
50851 1432812 1370384 1310915 1253909 1200416 1151995 1109136 1071163 1037461 1008004 982491 959771
50840 959771 938800 919816 903783 890758 879625 869636 861322 855298 850936 847227 844653 844985 848937
50827 848937 854900 860430 864502 868028 872772 880146 890480 902834 915757 928624 942101 957216 974410
$$ packed form
50907A092282O1237O6486P1620P6283Q0643Q4913Q8992R2701R5936R8282R9167
50896B008542R8785R8177R7651R5695R0373Q1525P0777N9685M8874L8736K9518
50885B818338K0592J0921Q69p640j3432j7540k1503k5235k7701k8922k9754l0195
50873B648798k9471k7941k7434k9235l2784l6895m1191m5773n0316n4386n8116
50862B215256o1852o5422o8446p1019p3508p5760p7071p6828p4806p1144o6588
50851A432812o2428n9469n7006n3493m8421m2859l7973l3702k9457k5513k2720
50840I59771k0971j8984j6033j3025j1133r989q314o024m362l709k574L32L952
50827H48937N963N530M072L526M744P374J0334J2354J2923J2867J3477J5115J7194
$$ plain form
50814 974410 993560 1014237 1035665 1057244 1079622 1104548 1132997 1164127 1196721 1230816 1267169
50803 1267169 1306098 1348097 1394781 1447534 1505581 1567081 1632123 1703068 1781832 1868527 1963124
50792 1963124 2066742 2180492 2304558 2439323 2586081 2745462 2916235 3096760 3286677
50783 3286677 3485880 3692738 3904833 4120915 4340513 4561613 4779805 4989716 5186358
50774 5186358 5365378 5523264 5657499 5765838 5845818 5896155 5918552 5916878 5894528 5853842 5798110
50763 5798110 5732250 5660601 5585449 5508819 5434376 5365771 5303554 5245175 5187805 5129718 5069007
50752 5069007 5002818 4928794 4846204 4754709 4652798 4538478 4411057 4271260 4119877 3957580
50742 3957580 3786407 3610429 3434181 3260696 3091408 2927597 2771302 2624677 2488642
$$ packed form
50814I74410J9150K0677K1428K1579K2378K4926K8449L1130L2594L4095L6353
50803A267169L8929M1999M6684N2753N8047O1500O5042P0945P8764Q6695R4597
50792A963124J03618J13750J24066J34765J46758J59381J70773J80525J89917
50783C286677J99203K06858K12095K16082K19598K21100K18192K09911J96642
50774E186358J79020J57886J34235J08339P9980N0337K2397j674k2350m0686n5732
50763E798110o5860p1649p5152p6630p4443o8605o2217n8379n7370n8087o0711
50752E069007o6189p4024q2590r1495j01911j14320j27421j39797j51383j62297
50742C957580j71173j75978j76248j73485j69288j63811j56295j46625j36035
$$ plain form
50733 2488642 2362264 2243750 2132448 2029867 1938268 1858233 1788128 1725892 1670426 1620969
50723 1620969 1576399 1536231 1501463 1473038 1449775 1429103 1409739 1392305 1377182 1363238 1349276
50712 1349276 1335595 1323281 1312702 1303434 1294967 1286834 1278625 1270584 1263639 1258205 1253451 1248500 1243825
50699 1243825 1240607 1239113 1238657 1239019 1240904 1244951 1251186 1259757 1271514 1287331 1307070 1329546 1353466
50686 1353466 1378470 1405510 1436318 1472343 1513982 1560593 1611027 1664321 1720546 1781221 1848421
50675 1848421 1923102 2004559 2091761 2184699 2284090 2390461 2504222 2626055 2756087 2892565
50665 2892565 3032083 3171335 3308307 3441861 3570755 3693176 3806706 3908602 3996391 4068262
50655 4068262 4122680 4157831 4171985 4164538 4136560 4090535 4029968 3958969 3881604 3801323 3721062
$$ packed form
50733B488642j26378j18514j11302j02581r1599q0035p0105o2236n5466m9457
50723A620969m4570m0168l4768k8425k3263k0672j9364j7434j5123j3944j3962
50712A349276j3681j2314j0579r268q467q133q209q041o945n434m754m951m675
50699A243825l218j494m56L62J885M047O235Q571J1757J5817J9739K2476K3920
50686A353466K5004K7040L0808L6025M1639M6611N0434N3294N6225O0675O7200
50675A848421P4681Q1457Q7202R2938R9391J06371J13761J21833J30032J36478
50665B892565J39518J39252J36972J33554J28894J22421J13530J01896Q7789P1871
50655D068262N4418L5151J4154p447k7978m6025o0567p0999p7365q0281q0261
$$ plain form
50644 3721062 3643583 3571229 3505441 3446849 3395618 3351221 3311963 3275185 3237988 3197598 3151554
50633 3151554 3098268 3037352 2968897 2892607 2808222 2716570 2619495 2518840 2416209 2313598 2213305
50622 2213305 2116978 2025427 1939511 1860420 1788808 1724351 1666542 1615459 1571426 1534374 1503793
50611 1503793 1478903 1458806 1443033 1432062 1426642 1426359 1429571 1435016 1442731 1453043 1465558 1479822
50599 1479822 1496078 1514467 1534068 1553973 1574991 1599044 1626653 1656051 1685305 1714637 1746089
50588 1746089 1781314 1820343 1862386 1907253 1955733 2008804 2066821 2129450 2196188 2266672 2340598
50577 2340598 2417639 2497533 2580052 2664737 2750733 2836886 2921875 3004315 3083098 3157655 3227541
50566 3227541 3291634 3348181 3395941 3435122 3466925 3492405 3512010 3526024 3535097 3540433 3543732 3546761
$$ packed form
50644C721062p7479p2354o5788n8592n1231m4397l9258l6778l7197m0390m6044
50633C151554n3286o0916o8455p6290q4385r1652r7075j00655j02631j02611j00293
50622B213305r6327r1551q5916p9091p1612o4457n7809n1083m4033l7052l0581
50611A503793k4890k0097j5773j0971n420k83L212N445P715J0312J2515J4264
50599A479822J6256J8389J9601J9905K1018K4053K7609K9398K9254K9332L1452
50588A746089L5225L9029M2043M4867M8480N3071N8017O2629O6738P0484P3926
50577B340598P7041P9894Q2519Q4685Q5996Q6153Q4989Q2440P8783P4557O9886
50566C227541O4093N6547M7760L9181L1803K5480J9605J4014R073N336L299L029
$$ plain form
50554 3546761 3550675 3555743 3561910 3569467 3578871 3590156 3602950 3617016 3632173 3647452 3660764 3669792
50542 3669792 3673082 3669990 3659813 3641254 3612700 3572722 3520500 3456257 3381322 3297318 3205145 3105298
50530 3105298 2999387 2890592 2781967 2674700 2568807 2465085 2365383 2271092 2182572 2100233
50520 2100233 2024937 1956772 1894512 1837069 1784623 1737580 1695422 1657708 1625328 1599376 1579285
50509 1579285 1563488 1551554 1544131 1541061 1541275 1544719 1552584 1565127 1580859 1598701 1619486 1644332
50497 1644332 1672730 1703373 1735734 1769548 1803764 1837664 1872630 1911189 1954349 2000993 2049797
50486 2049797 2100374 2152366 2204621 2255871 2305629 2354023 2401277 2447610 2493370 2539273 2586892
50475 2586892 2638576 2696032 2758876 2825475 2895472 2970759 3053565 3144407 3242638 3348547 3463895
$$ packed form
50554C546761L914N068O167P557R404J1285J2794J4066J5157J5279J3312R028
50542C669792L290l092j0177j8559k8554l9978n2222o4243p4935q4004r2173r9847
50530C105298j05911j08795j08625j07267j05893j03722r9702r4291q8520q2339
50520B100233p5296o8165o2260n7443n2446m7043m2158l7714l2380k5952k0091
50509A579285j5797j1934p423l070K14L444P865J2543J5732J7842K0785K4846
50497A644332K8398L0643L2361L3814L4216L3900L4966L8559M3160M6644M8804
50486B049797N0577N1992N2255N1250M9758M8394M7254M6333M5760M5903M7619
50475B586892N1684N7456O2844O6599O9997P5287Q2806R0842R8231J05909J15348
$$ plain form
50464 3463895 3590088 3726392 3870461 4020532 4176663 4339357 4507122 4675846 4840719
50455 4840719 4998270 5146379 5283046 5406034 5513456 5603852 5675588 5726855 5756361 5763498
50445 5763498 5747876 5709529 5649952 5572341 5480284 5376566 5263548 5144361 5023447 4906122
50435 4906122 4797685 4702290 4622051 4557367 4508290 4475244 4458150 4455386 4464256 4482138 4506339
50424 4506339 4532744 4555341 4567650 4564663 4543500 4502630 4440851 4357247 4252161 4128102 3989336
50413 3989336 3840396 3685078 3526758 3368822 3213986 3063546 2918227 2779848 2651200
50404 2651200 2533914 2427166 2329072 2238748 2156382 2081973 2015190 1956411 1906747 1866530 1834369
50393 1834369 1808090 1786256 1768672 1756022 1749334 1749133 1754540 1763639 1775300 1790234 1809639 1833283
$$ packed form
50464C463895J26193J36304J44069J50071J56131J62694J67765J68724J64873
50455D840719J57551J48109J36667J22988J07422R0396P1736N1267K9506P137
50445E763498j5622l8347n9577p7611r2057j03718j13018j19187j20914j17325
50435D906122j08437r5395q0239o4684m9077l3046j7094k764Q870J7882K4201
50424D506339K6405K2597J2309k987k1163m0870o1779q3604j05086j24059j38766
50413C989336j48940j55318j58320j57936j54836j50440j45319j38379j28648
50404B651200j17286j06748r8094r0324q2366p4409o6783n8779m9664m0217l2161
50393A834369k6279k1834j7584j2650o688k01N407R099J1661J4934J9405K3644
$$ plain form
50381 1833283 1859742 1888201 1918955 1952066 1986651 2021872 2057766 2094651 2132492 2171391 2211915
50370 2211915 2254075 2296501 2337469 2376439 2413768 2449258 2482031 2511712 2538589 2562408 2582224
50359 2582224 2598109 2612123 2626665 2642311 2658131 2673865 2690850 2710846 2734790 2762937 2795423
50348 2795423 2832235 2873169 2918293 2968112 3022713 3080919 3140732 3200428 3258722 3314079 3364633
50337 3364633 3408964 3446321 3475793 3495742 3504527 3501476 3486731 3460353 3421960 3371131 3307994 3233654
50325 3233654 3150277 3060439 2966192 2869222 2772234 2679292 2593781 2516457 2446572 2384741 2333316
50314 2333316 2293925 2266043 2248498 2240825 2242098 2249577 2259947 2271331 2282751 2292077 2296017 2292174
50302 2292174 2279876 2258867 2228575 2189192 2142373 2090128 2033718 1974191 1913161 1852146 1791708
$$ packed form
50381A833283K6459K8459L0754L3111L4585L5221L5894L6885L7841L8899M0524
50370B211915M2160M2426M0968L8970L7329L5490L2773K9681K6877K3819J9816
50359B582224J5885J4014J4542J5646J5820J5734J6985J9996K3944K8147L2486
50348B795423L6812M0934M5124M9819N4601N8206N9813N9696N8294N5357N0554
50337C364633M4331L7357K9472J9949Q785l051j4745k6378l8393n0829o3137p4340
50325C233654q3377q9838r4247r6970r6988r2942q5511p7324o9885o1831n1425
50314B333316l9391k7882j7545p673J273P479J0370J1384J1420R326L940l843
50302B292174j2298k1009l0292l9383m6819n2245n6410n9527o1030o1015o0438
$$ plain form
50291 1791708 1732168 1674891 1621933 1574392 1531859 1493580 1459428 1429404 1402749 1378111 1354681
50280 1354681 1332913 1314048 1298872 1286944 1277116 1268777 1262354 1258476 1257094 1257778 1260567 1265843 1273335
50267 1273335 1281884 1290563 1299723 1310735 1324890 1342623 1363334 1385579 1407733 1429012 1449954 1471711
50255 1471711 1494859 1518984 1543216 1566952 1590170 1613277 1636522 1659362 1680598 1699319 1715524
50244 1715524 1729599 1741637 1751832 1761134 1770453 1779090 1784952 1786905 1786219 1784960 1783370 1779685 1772450
50231 1772450 1762176 1750484 1738211 1724902 1709974 1693809 1677269 1660187 1640944 1618120 1592379
50220 1592379 1565948 1540163 1514430 1488087 1462252 1438721 1417436 1396315 1373775 1350474 1328339
50209 1328339 1308758 1292168 1278496 1267078 1256385 1244813 1232092 1219695 1209645 1202905 1198871 1196102
$$ packed form
50291A791708n9540n7277n2958m7541m2533l8279l4152l0024k6655k4638k3430
50280A354681k1768j8865j5176j1928r828q339o423l878j382O84K789N276P492
50267A273335Q549Q679R160J1012J4155J7733K0711K2245K2154K1279K0942K1757
50255A471711K3148K4125K4232K3736K3218K3107K3245K2840K1236J8721J6205
50244A715524J4075J2038J0195R302R319Q637N862J953o86j259j590l685p235
50231A772450j0274j1692j2273j3309j4928j6165j6540j7082j9243k2824k5741
50220A592379k6431k5785k5733k6343k5835k3531k1285k1121k2540k3301k2135
50209A328339j9581j6590j3672j1418j0693j1572j2721j2397j0050o740m034k769
$$ plain form
50197 1196102 1193354 1189946 1185578 1180353 1175077 1170923 1168311 1166292 1163438 1159227 1154233 1149160 1144094 1138531
50183 1138531 1131711 1123076 1112909 1102515 1093334 1085856 1079585 1073771 1067835 1061490 1055067 1049399 1044658
50170 1044658 1039714 1033607 1027310 1022795 1020334 1018170 1015195 1012664 1012436 1014516 1017240 1019237 1020446 1021695
50156 1021695 1023950 1027560 1031718 1035121 1037554 1040184 1043763 1047140 1048160 1045640 1040135 1033398 1027417 1023039
50142 1023039 1018954 1012992 1004957 997001 990305 982770 971537 956742 941040 926295 912794 901198
50130 901198 892630 886352 879675 871186 862480 855656 850537 845530 840092 834970 830724 827294 824545 822119
50116 822119 819110 814999 810731 807822 806338 804701 801645 797438 792867 787818 781705 774879 768667 763770
50102 763770 759280 753806 747159 740216 733255 725371 715859 705303 694695 684226 673784 664027 655787
$$ packed form
50197A196102k748l408m368n225n276m154k612k019k854m211m994n073n066n563
50183A138531o820q635j0167j0394r181p478o271n814n936o345o423n668m741
50170A044658m944o107o297m515k461k164k975k531k28K080K724J997J209J249
50156A021695K255L610M158L403K433K630L579L377J020k520n505o737n981m378
50142A023039m085n962q035p956o696p535j1233j4795j5702j4745j3501j1596
50130I01198q568o278o677q489q706o824n119n007n438n122m246l430k749k426
50116H22119l009m111m268k909j484j637l056m207m571n049o113o826o212m897
50102G63770m490n474o647o943o961p884r512j0556j0608j0469j0442r757q240
$$ plain form
50089 655787 648797 642229 636437 632729 631159 629871 627237 623588 620204 617677 616088 615784 616729 617714 617574
50074 617574 616951 617601 619824 621756 621607 619809 618399 618899 621395 625327 630417 636654 643874 651752 660159
50059 660159 669228 679022 689451 700690 713221 726968 740640 752806 763726 775391 789359 805198
50047 805198 821543 837958 854905 872285 889085 904662 919562 934664 949903 964208 976461
50036 976461 986300 994221 1001157 1007884 1014643 1021324 1027981 1034910 1042050 1048565 1053413 1056497 1058961 1062172
50022 1062172 1066429 1070872 1074567 1077430 1080067 1083030 1086535 1090769 1096142 1103179 1112286 1123733 1137839
50009 1137839 1155051 1175490 1198075 1220470 1240811 1259779 1280117 1303441 1328160 1351358 1372161
49998 1372161 1392172 1412882 1434032 1454589 1473947 1491553 1506495 1518384 1528028 1536422 1543480 1548359
$$ packed form
50089F55787o990o568n792l708j570j288k634l649l384k527j589l04R45R85j40
50074F17574o23O50K223J932j49j798j410N00K496L932N090O237P220P878Q407
50059F60159R069R794J0429J1239J2531J3747J3672J2166J0920J1665J3968J5839
50047H05198J6345J6415J6947J7380J6800J5577J4900J5102J5239J4305J2253
50036I76461R839P921O936O727O759O681O657O929P140O515M848L084K464L211
50022A062172M257M443L695K863K637K963L505M234N373P037R107J1447J4106
50009A137839J7212K0439K2585K2395K0341J8968K0338K3324K4719K3198K0803
49998A372161K0011K0710K1150K0557J9358J7606J4942J1889R644Q394P058M879
$$ plain form
49986 1548359 1550571 1550181 1547374 1542421 1535683 1526995 1515458 1500588 1483348 1465380 1447531 1429779 1412259
49973 1412259 1395297 1378599 1361458 1343938 1327028 1311477 1297280 1284557 1273993 1265838 1259097 1252393
49961 1252393 1245377 1238866 1233871 1230766 1229064 1227640 1225435 1222289 1218834 1215402 1211528 1206959 1202591 1199589
49947 1199589 1197650 1194925 1189830 1182386 1173500 1163467 1151755 1138108 1123355 1108851 1095326 1082444
49935 1082444 1069445 1055924 1041880 1027422 1013070 1000283 990834 984978 980620 975076 967651 959970
49923 959970 953878 949778 947128 945663 945582 947170 950902 957514 967328 979686 993603 1008722 1025133 1042655
49909 1042655 1061080 1080744 1101666 1122094 1139147 1151432 1160198 1167380 1173431 1177792 1180493 1182079
49897 1182079 1182344 1180438 1176364 1171387 1166639 1161948 1156341 1149098 1139821 1127761 1111647 1090418 1064180
$$ packed form
49986A548359K212l90k807m953o738q688j1537j4870j7240j7968j7849j7752j7520
49973A412259j6962j6698j7141j7520j6910j5551j4197j2723j0564q155o741o704
49961A252393p016o511m995l105j702j424k205l146l455l432l874m569m368l002
49947A199589j939k725n095p444q886j0033j1712j3647j4753j4504j3525j2882
49935A082444j2999j3521j4044j4458j4352j2787r449n856m358n544p425p681
49923I59970o092m100k650j465q1J588L732O612R814J2358J3917J5119J6411J7522
49909A042655J8425J9664K0922K0428J7053J2285Q766P182O051M361K701J586
49897A182079K65j906m074m977m748m691n607p243r277j2060j6114k1229k6238
$$ plain form
49884 1064180 1034451 1003288 972059 941128 910639 881156 853299 827271 803213 781598 762612
49873 762612 745398 728615 711842 695861 681594 669242 658458 648869 640308 632940 627238 623477
49861 623477 621237 619634 618046 616331 614582 613019 611872 610925 609517 607593 606373 607069 609019 610092 609072
$$ packed form
49884A064180k9729l1163l1229l0931l0489k9483k7857k6028k4058k1615j8986
49873G62612j7214j6783j6773j5981j4267j2352j0784r589q561p368n702l761
49861F23477k240j603j588j715j749j563j147r47j408j924j220O96J950J073j020
$$ [...]
##END NTUPLES=NMR SPECTRUM
##END=
