
##TITLE=AC1113_Huila1_5835735_E5EMHUawKj
##JCAMPDX= 6.0         $$ Bruker NMR JCAMP-DX V2.0
##DATA TYPE= NMR SPECTRUM
##DATA CLASS= NTUPLES
##ORIGIN= BRUKER
##OWNER= Administrator
$$ 1.72 TOPSPIN		Version 2.1
$$ 2012-04-16 19:06:58.671 -0500  Administrator@TOPSPIN
$$ Compression mode = diff/dup
##.OBSERVE FREQUENCY= 400.13188235
##.OBSERVE NUCLEUS= ^1H
##.ACQUISITION MODE= SIMULTANEOUS (DQD)
##.ACQUISITION SCHEME= undefined
##.AVERAGES= 8
##.DIGITISER RES= 22
##SPECTROMETER/DATA SYSTEM= spect
##.PULSE SEQUENCE= zg30
##.SOLVENT NAME= COFFEE_meoh
##.SHIFT REFERENCE= INTERNAL, COFFEE_meoh, 1, 14.98061
##AUDIT TRAIL= $$ (NUMBER, WHEN, WHO, WHERE, PROCESS, VERSION, WHAT)
$$ ##TITLE= Audit trail, TOPSPIN		Version 2.1
$$ ##JCAMPDX= 5.01
$$ ##ORIGIN= Bruker BioSpin GmbH
$$ ##OWNER= Administrator
$$ $$ C:\Bruker\TOPSPIN/data/COFFEE/nmr/AC1113_Huila1_5835735_E5EMHUawKj/20/pdata/1/auditp.txt
$$ ##AUDIT TRAIL=  $$ (NUMBER, WHEN, WHO, WHERE, PROCESS, VERSION, WHAT)
(   1,<2012-04-15 17:56:35.296 -0500>,<Administrator>,<TOPSPIN>,<go>,<TOPSPIN 2.1>,
      <created by zg
	started at 2012-04-15 17:55:28.531 -0500,
	POWCHK enabled, PULCHK disabled,
       configuration hash MD5:
       1A 1E CE 29 27 FD 77 03 67 4E F0 E3 C4 B2 CB 90
       data hash MD5: 64K
       70 A8 49 5D 26 99 E8 8A 43 1C 35 DA B8 88 4D 74>)
(   2,<2012-04-15 17:56:38.171 -0500>,<Administrator>,<TOPSPIN>,<proc1d>,<TOPSPIN 2.1>,
      <Start of raw data processing
       efp LB = 0 FT_mod = 6 PKNL = 1 PHC0 = 0 PHC1 = 0 SI = 32K 
       data hash MD5: 32K
       9A 56 D0 BA 24 19 B9 2C B0 07 B9 DC 8B 1B E2 ED>)
(   3,<2012-04-15 17:56:38.500 -0500>,<Administrator>,<TOPSPIN>,<proc1d>,<TOPSPIN 2.1>,
      <pk PHC0 = 214.1071 PHC1 = 0 
       data hash MD5: 32K
       0D 8C 13 2E 6E 51 43 77 A6 44 5B AC A7 CD EE 53>)
(   4,<2012-04-15 17:56:38.578 -0500>,<Administrator>,<TOPSPIN>,<proc1d>,<TOPSPIN 2.1>,
      <abs ABSG = 1 
       data hash MD5: 32K
       E0 82 6D 97 40 CB 07 36 78 CE C7 AE F6 DC DA BB>)
(   5,<2012-04-15 17:56:38.609 -0500>,<Administrator>,<TOPSPIN>,<proc1d>,<TOPSPIN 2.1>,
      <abs ABSG = 2 
       data hash MD5: 32K
       8C 8B 10 55 05 D9 58 46 C9 05 C2 A7 46 27 A3 DC>)
(   6,<2012-04-15 17:56:38.640 -0500>,<Administrator>,<TOPSPIN>,<proc1d>,<TOPSPIN 2.1>,
      <abs ABSG = 3 
       data hash MD5: 32K
       E7 AE 67 D3 AA 69 72 09 89 0C 92 49 E9 0C 9A 33>)
(   7,<2012-04-15 17:56:38.671 -0500>,<Administrator>,<TOPSPIN>,<proc1d>,<TOPSPIN 2.1>,
      <abs ABSG = 4 
       data hash MD5: 32K
       ED E5 D3 CF 55 9E EA C3 80 82 5E 09 4B 0E 0D 5B>)
(   8,<2012-04-15 17:56:38.703 -0500>,<Administrator>,<TOPSPIN>,<proc1d>,<TOPSPIN 2.1>,
      <abs ABSG = 5 
       data hash MD5: 32K
       CF 88 8F BA 1C DF AA 44 DD E8 22 89 D6 25 75 D3>)
(   9,<2012-04-15 17:56:42.562 -0500>,<Administrator>,<TOPSPIN>,<audit>,<TOPSPIN 2.1>,
      <user comment:
       ICON-NMR User ID: COFFEE
       data hash MD5: 32K
       CF 88 8F BA 1C DF AA 44 DD E8 22 89 D6 25 75 D3>)
$$ ##END=
$$ 
$$ [...]
##$TP= (0..7)
150 150 150 150 150 150 150 150
##$TP07= 0
##$TPNAME0= <>
##$TPNAME1= <>
##$TPNAME2= <>
##$TPNAME3= <>
##$TPNAME4= <>
##$TPNAME5= <>
##$TPNAME6= <>
##$TPNAME7= <>
##$TPOAL= (0..7)
0.5 0.5 0.5 0.5 0.5 0.5 0.5 0.5
##$TPOFFS= (0..7)
0 0 0 0 0 0 0 0
##$TUNHIN= 0
##$TUNHOUT= 0
##$TUNXOUT= 0
##$USERA1= <user>
##$USERA2= <user>
##$USERA3= <user>
##$USERA4= <user>
##$USERA5= <user>
##$V9= 5
##$VALIST= <valist>
##$VCLIST= <CCCCCCCCCCCCCCC>
##$VD= 0
##$VDLIST= <DDDDDDDDDDDDDDD>
##$VPLIST= <PPPPPPPPPPPPPPP>
##$VTLIST= <TTTTTTTTTTTTTTT>
##$WBST= 2048
##$WBSW= 25
##$XGAIN= (0..3)
0 0 0 0
##$XL= 0
##$YL= 0
##$YMAX_a= 495225
##$YMIN_a= -593717
##$ZGOPTNS= <>
##$ZL1= 120
##$ZL2= 120
##$ZL3= 120
##$ZL4= 120
##$ABSF1= 14.98061
##$ABSF2= -5.57192
##$ABSG= 5
##$ABSL= 3
##$ALPHA= 0
##$AQORDER= 0
##$ASSFAC= 0
##$ASSFACI= 0
##$ASSFACX= 0
##$ASSWID= 0
##$AUNMP= <proc_prof1d_extract_pilot.lims>
##$AXLEFT= 0
##$AXNAME= <>
##$AXNUC= <1H>
##$AXRIGHT= 0
##$AXTYPE= 0
##$AXUNIT= <>
##$AZFE= 0.1
##$AZFW= 0.1
##$BCFW= 0
##$BC_mod= 0
##$BYTORDP= 0
##$COROFFS= 0
##$CY= 15
##$DATMOD= 1
##$DC= 0
##$DFILT= <>
##$DTYPP= 0
##$F1P= 0
##$F2P= 0
##$FCOR= 0.5
##$FTSIZE= 32768
##$FT_mod= 6
##$GAMMA= 0
##$GB= 0
##$INTBC= 1
##$INTSCL= 1
##$ISEN= 128
##$LB= 0
##$LEV0= 0
##$LPBIN= 0
##$MAXI= 10000
##$MC2= 0
##$MEAN= 0
##$ME_mod= 0
##$MI= 0
##$NCOEF= 0
##$NC_proc= -8
##$NLEV= 6
##$NOISF1= 0
##$NOISF2= 0
##$NSP= 0
##$NTH_PI= 0
##$NZP= 0
##$OFFSET= 14.98061
##$PC= 1
##$PHC0= 214.1071
##$PHC1= 0
##$PH_mod= 1
##$PKNL= yes
##$PPARMOD= 0
##$PPDIAG= 0
##$PPIPTYP= 0
##$PPMPNUM= 2147483647
##$PPRESOL= 1
##$PSCAL= 4
##$PSIGN= 0
##$PYNMP= <proc.py>
##$REVERSE= no
##$SF= 400.13
##$SI= 32768
##$SIGF1= 0
##$SIGF2= 0
##$SINO= 400
##$SIOLD= 32768
##$SPECTYP= <>
##$SREGLST= <1H.CDCl3>
##$SSB= 0
##$STSI= 32768
##$STSR= 0
##$SW_p= 8223.68421052632
##$SYMM= 0
##$S_DEV= 0
##$TDeff= 65536
##$TDoff= 0
##$TI= <>
##$TILT= no
##$TM1= 0
##$TM2= 0
##$TOPLEV= 0
##$USERP1= <user>
##$USERP2= <user>
##$USERP3= <user>
##$USERP4= <user>
##$USERP5= <user>
##$WDW= 1
##$XDIM= 32768
##$YMAX_p= 464775164
##$YMIN_p= -686691
##$CURPLOT= <Network HP LaserJet P1505>
##$CURPRIN= <$Network HP LaserJet P1505>
##$DFORMAT= <normdp>
##$LAYOUT= <+/1D_H.xwp>
##$LFORMAT= <normlp>
##$PFORMAT= <normpl>
##$SURQMSG= 1
$$ End of Bruker specific parameters
$$ ---------------------------------
##NTUPLES= NMR SPECTRUM
##VAR_NAME=  FREQUENCY,     SPECTRUM/REAL,   SPECTRUM/IMAG
##SYMBOL=    X,             R,               I
##VAR_TYPE=  INDEPENDENT,   DEPENDENT,       DEPENDENT
##VAR_FORM=  AFFN,          ASDF,            ASDF
##VAR_DIM=   32768,         32768,           32768
##UNITS=     HZ,            ARBITRARY UNITS, ARBITRARY UNITS
##FACTOR=    0.250966925370066, 1,           1
##FIRST=     8223.43324360095, -167705,      9879
##LAST=      0,             -79815,          -1500
##MIN=       0,             -686691,         0
##MAX=       8223.43324360095, 464775164,    0
$$ Real data points
##PAGE= N=1
##DATA TABLE= (X++(R..R)), XYDATA
$$ [...]
$$ plain form
19511 -415023 -228102 -491035 -119015 -154864 -39701 -281143 -85018 -135825 -309507 206914
19500 156486 -6560 -247233 -233463 -21226 -153340 152117 220518 -285683 -23051 248857 634
19488 33562 -97112 -17041 225808 -32764 -178652 -199854 -6885 -231522 180321 -146501 -165254
19477 -165254 252237 -163594 41892 81937 54004 204468 -463758 139527 53331 -249910
19466 -40032 -123775 -224244 70587 -36031 -111362 -110164 -17052 -13341 -227951 -39904 55973 139137
19454 139137 -48984 86722 178797 -54457 -446994 24125 296334 -47495 -334037 -33758 -70943
19443 -70943 -280723 20906 -33110 -130505 -125159 -31660 -110208 -139642 -217220 -107387 59271
19431 196432 -321441 -100959 -48853 -207836 -270352 33535 349597 -189211 -220052 150451
$$ packed form
19511d15023J86921k62933a19015l5849c9701k41442h5018n0807j73682B06914
19500A56486f560k40673J3770b1226j32114A52117O8401b85683b3051B48857F34
19488C3562i7112a7041B25808c2764j45888k1202f885k24637A80321a46501j8753
19477a65254B52237a63594D1892M0045k7933J50464d63758A39527E3331b49910
19466d0032q3743j00469G0587c6031p5331J198a7052L711k14610c9904E5973Q3164
19454A39137d8984H6722R2075e4457l92537B4125K72209d7495k86542c3758l7185
19443g0943k09780B0906c3110r7395N346c1660p8548k9434p7578a07387E9271
19431A96432c21441a00959d8853j58983o2516C3535L16062a89211l0841A50451
$$ plain form
19420 -424380 -167457 135489 -326768 -341919 -222831 -112495 -171205 -34499 -142359 -429707
19410 -429707 208594 420755 -70644 -301106 -528948 13027 -44551 27662 22475 -455066 -251743
19399 -251743 119323 1589 -205770 -128063 232511 39355 211934 212881 -140771 129123 -297049
19387 9133 37870 -67647 -20912 -276254 44679 25272 -523525 5732 -130402 191526 -87044
19375 -290707 110842 89083 53573 -175774 -55330 -416046 152819 -23106 -182665 -294814
19365 -294814 -118084 463494 168995 -198169 170904 -21028 -182667 51467 -250686 40523
19354 -58189 -185989 -332536 38283 -155524 167581 -101067 -192434 114655 85218 -123365
19343 -392859 -333791 -132571 105782 -243899 143801 -84814 35122 -167448 -235496 5055 34872
$$ packed form
19420d24380a67457A35489c26768j5151J19088J10336n8710c4499j07860k87348
19410d29707B08594K12161g0644k30462k27842A3027d4551B7662n187d55066K03323
19399b51743A19323A589b05770P7707B32511C9355J72579R47a40771A29123b97049
19387I133K8737f7647b0912k55342D4679j9407e23525E732a30402A91526h7044
19375b90707A10842k1759l5510a75774e5330l60716A52819b3106j59559j12149
19365b94814a18084D63494A68995a98169A70904b1028j61639E1467b50686D0523
19354e8189j27800j46547C8283a55524A67581a01067r1367A14655k9437a23365
19343c92859N9068a32571A05782b43899A43801h4814C5122a67448o8048E055K9817
$$ plain form
19332 34872 32178 -108004 -166703 -246463 -245335 -166739 164219 -33036 -4799 141629 -156760
19320 -39587 -361924 -264022 78500 -253710 -98645 -100537 -126008 228914 21282 -341418 34255
19308 -117747 -15737 -81558 17466 4075 104706 266970 195771 111346 -205893 309569 -199531
19296 -69498 -196499 -309329 -296866 -244017 85424 -58343 -303474 2692 14608 -18487 -130296
19285 -130296 -10269 135673 44069 142933 167758 -281680 -126317 186159 -159893 -14760
19274 -302442 -135254 -213410 89861 -504959 -65163 -127004 8043 -177006 -205288 -309743 343147
19262 132118 182992 -97199 141735 209591 307822 -81587 151937 30860 113670 100021 -85820
19250 -123707 15420 107213 -308504 -143832 -83246 -127941 27747 113246 -103622 -160301 -31084
$$ packed form
19332C4872k694a08004n8699p9760J128P8596A64219c3036d799A41629a56760
19320c9587l22337R7902G8500b53710i8645j892k5471B28914B1282c41418C4255
19308a17747a5737o5821A7466D075J00631J62264p1199q4425b05893C09569a99531
19296f9498j27001j12830J2463N2849H5424e8343k45131B692J1916a8487j11809
19285a30296a0269A35673D4069R8864K4825b81680a26317A86159a59893a4760
19274c02442a35254p8156H9861e04959f5163o1841H043a77006k8282j04455C43147
19262A32118N0874i7199A41735O7856R8231h1587A51937C0860Q2810j3649h5820
19250a23707A5420R1793c08504a43832O0586m4695B7747Q5499a03622n6679c1084
$$ plain form
19238 -123414 -59329 -113386 -66119 -100868 -221756 27366 209888 -87214 -253514 66252 45751
19227 45751 -175668 -329748 72916 -146276 -131993 -47043 35555 59155 -442055 42962 -273766
19215 -123732 -359283 -104983 33065 -132479 182525 -340402 53893 -118789 -4494 -3850 156756
19203 -173324 3831 90164 55987 -98592 -95015 -153883 -260490 -137897 -169008 -155013 2417 -64728
19190 116271 -342957 -154575 -146482 -55388 -52912 -141640 227296 -179180 -44859 -102469 230457
19178 -65986 -250574 26973 -40704 221362 -118991 89749 -190779 79377 -238292 -19698 39729
19166 239738 13749 -277707 -132587 27610 -196864 -171106 23688 12850 -129354 72749 13016
19154 34869 201807 227983 -216462 -170293 -139286 -172307 -52288 63152 -318746 -43367 -338453
$$ packed form
19238a23414e9329n4057M7267l4749j20888B7366J82522h7214j66300F6252k0501
19227D5751a75668j54080G2916a46276J4283d7043C5555K3600d42055D2962b73766
19215a23732k35551a04983C3065a32479A82525c40402E3893a18789d494O44A56756
19203a73324C831Q6333l4177i8592L577n8868j06607J22593l1111J3995B417f4728
19190A16271c42957a54575Q093e5388K476q8728B27296a79180d4859n7610B30457
19178f5986j84588B6973d0704B21362a18991H9749a90779G9377b38292a9698C9729
19166B39738A3749b77707a32587B7610a96864K5758B3688j0838a29354G2749A3016
19154C4869J66938K6176b16462M6169L1007l3021e2288F3152c18746d3367k95086
$$ plain form
19143 -338453 -119825 -107032 -52223 -34451 -3216 -85930 83033 -50669 64734 -88809 93117
19131 -222766 127609 15356 -35653 212372 -141007 185068 112823 175130 -187251 -130554
19121 -130554 -165653 -58627 -250341 164935 -109612 -180270 115495 -512551 93763 -61798
19110 -29641 342700 -4199 -132555 167243 8124 127804 -57264 -9996 -257077 -233727 -208697
19099 -208697 -29039 -1719 -391228 -101073 -220964 -220307 94407 -160639 -3225 -69597 -173793
19088 -173793 -101659 -130884 -320633 -467997 -114327 -258164 -115115 -330998 -133290 -131796
19078 -131796 296487 84598 95102 150654 -123366 24555 -15603 87111 -82875 261 -447802
19066 -84369 17502 53347 204933 -256905 179624 123150 21795 -107690 142509 47580 222355
$$ packed form
19143c38453a19825J2793e2223J7772c216q2714H3033e0669F4734h8809I3117
19131b22766A27609A5356c5653B12372a41007A85068p2245O2307a87251N6697
19121a30554l5099e8627j91714A64935a09612p0658A15495e12551I3763f1798
19110b9641C42700d199j28356A67243H124J19680e7264i996k47081K3350K5030
19099b08697b9039a719l89509a01073j19891O57I4407a60639c225o6372j04196
19088a73793P2134k9225j89749j47364a14327j43837a15115k15883a33290J494
19078a31796B96487H4598J0504N5552a23366B4555a5603H7111h2875B61d47802
19066h4369A7502L5845J51586b56905A79624n6474B1795a07690A42509D7580J74775
$$ plain form
19055 222355 68315 -28482 14525 30602 -35538 -159516 83486 36903 -77996 411511 18161
19043 -289709 -23343 -159508 -16508 321456 -71565 -154489 52526 62391 150912 -235831 -111395
19031 -45461 -212672 51793 -83014 -66935 -289001 -356237 16003 -197461 -213966 284622 43217
19019 -316315 -256207 137602 36231 -256779 -69735 91815 164411 13103 -171109 224035 142956
19008 142956 -338803 180977 -7359 171302 1734 14426 -72782 -354813 -62996 -68313 -30008
18996 -248473 324621 90942 186370 -84896 -205424 -74520 70862 91824 123230 -151955 -137140
18985 -137140 185068 41623 239076 45993 185251 136580 80177 225826 162437 -281227
18974 59835 131851 -327261 77303 108583 348692 -384149 -50881 -150983 -73491 34340 108747
$$ packed form
19055B22355F8315b8482A4525J6077c5538j23978H3486C6903g7996D11511A8161
19043b89709b3343j36165a6508C21456g1565q2924E2526R865Q8521b35831a11395
19031d5461j67211E1793h3014J6079k22066o7236A6003a97461j6505B84622D3217
19019c16315O0108A37602C6231b56779f9735I1815P2596A3103a71109B24035q1079
19008A42956c38803A80977g359A71302A734J2692g2782k82031f2996n317c0008
18996b48473C24621I0942R5428h4896j20528g4520G0862K0962L1406a51955J4815
18985a37140A85068D1623J97453D5993J39258m8671n6403J45649o3389b81227
18974E9835P2016c27261G7303L1280K40109c84149e0881j00102g3491C4340P4407
$$ plain form
18963 108747 -52412 112022 -36086 -156281 135889 631502 402733 319911 184734 -57250
18952 -130938 60855 96951 201678 250481 24760 -32835 126182 -229788 37167 95000 -8684
18940 280189 -76522 65038 -7817 102694 29428 -87505 73600 60436 162398 -221450 -290226
18929 -290226 -370909 -201359 -2477 104810 -198260 -150015 -2511 -195917 61587 118961 254186
18918 254186 3388 82711 -330046 -227367 43321 -161696 -46647 -35128 -262089 -133134 128078
18906 -40305 121498 -36611 -125588 -375532 228864 31857 51165 -210136 176073 -15338 31820
18894 167077 202181 446303 186311 -219818 163237 240803 123448 78886 141898 13697
18883 -81367 -137613 -253274 195687 -119194 -222790 128261 241421 -390363 151198 62982
$$ packed form
18963A08747e2412A12022c6086j20195A35889M95613k28769q2822j35177e7250
18952a30938F0855L6096J04727M8803B4760c2835A26182b29788C7167N7833h684
18940B80189g6522F5038g817A02694B9428h7505G3600j3164J01962b21450o8776
18929b90226q0683J69550b477A04810a98260M8245b511j93406F1587N7374J35225
18918B54186C388P9323c30046J02679D3321a61696d6647J1519k26961J28955A28078
18906d0305A21498c6611q8977k49944B28864C1857J9308b10136A76073a5338C1820
18894A67077L5104K44122A86311b19818A63237P7566j17355m4562O3012A3697
18883h1367n6246j15661A95687a19194j03596A28261J13160c90363A51198F2982
$$ plain form
18872 -206676 -7043 -8012 -67756 -266214 133471 -21061 3145 -408741 228983 273366 -30826
18860 130392 -133659 -321119 -477081 48034 -92841 215821 152592 22637 -283007 -124758
18849 -144884 284100 171416 -1567 220661 348330 -108269 -174145 -435459 34313 -263389
18838 -160549 49013 -199418 -388436 -36840 -211834 -81245 62827 157524 58787 -1686 -328523
18827 -328523 85694 -63590 -169667 -123373 -125388 3808 49768 28185 -261494 -96388 60734
18815 -240578 -154291 -135536 -223781 -146556 -197438 -193085 -124420 -416 -61994 -30815 195793 56732
18802 276617 73881 -134973 -294026 169015 -157547 105138 -72768 -87649 155051 376634
18792 376634 229681 -366796 -107621 -252033 -461424 44581 -80917 -237820 35613 -259046
$$ packed form
18872b06676g043r69n9744j98458A33471b1061C145d08741B28983M4383c0826
18860A30392a33659j87460j55962D8034i2841B15821o3229B2637b83007a24758
18849a44884B84100j12684a567B20661J27669a08269o5876k61314C4313b63389
18838a60549D9013a99418j89018c6840j74994h1245F2827R4697E8787a686l26837
18827c28523H5694f3590j06077M6294k015C808M5960k1583b61494i6388F0734
18815b40578Q6287J8755q8245P7225n0882M353O8665d16o1578c0815A95793E6732
18802B76617G3881a34973j59053A69015a57547A05138g2768j4881A55051K21583
18792C76634j46953c66796a07621j44412k09391D4581h0917j56903C5613b59046
$$ plain form
18781 58594 -89155 -216753 -287037 -32103 -116418 -236923 -96126 -85454 225731 -151064 -145061
18770 -145061 61373 -267278 -210650 205620 61482 131442 -196164 -323339 -41094 62362 -265895
18758 13045 40475 -153459 -365951 36100 139499 -258870 16376 -127158 -269428 42211
18747 -30332 354999 -8186 -294394 122153 -246563 -190635 -80541 -278006 213484 10400 -265494
18735 80103 -20340 24574 67262 -40886 128009 51658 -238746 -19838 -125407 -322288 -55987
18723 36943 85049 -48083 1149 -200202 -165908 -154796 -194041 413900 -216170 -63717 83309
18711 -9436 32895 292412 -46739 46451 -194916 8507 146210 -19069 88957 24609 -140216
18699 40341 -135180 -29404 -72323 256014 -414575 2886 -131037 -80087 -170395 85595 51002
$$ packed form
18781E8594h9155j27598p0284c2103q4315j20505i6126J0672B25731a51064O003
18770a45061F1373b67278N6628B05620F1482O9960a96164j27175d1094F2362b65895
18758A3045K7430a53459k12492C6100J03399b58870A6376a27158j42270D2211
18747c0332C54999h186k86208A22153b46563N5928h0541j97465B13484A0400b65494
18735H0103b0340B4574M2688d0886A28009E1658b38746a9838j05569j96881e5987
18723C6943M8106d8083A149b00202L4294J1112l9245D13900b16170f3717H3309
18711i436C2895K59517d6739D6451a94916H507J37703a9069H8957B4609a40216
18699D0341a35180b9404m2919B56014d14575B886a31037N0950r0308H5595l4593
$$ plain form
18688 51002 121550 -274051 4230 -458730 -135501 -41550 -149026 -231059 -78240 -146966 282882
18676 -131319 -146281 -69141 -38105 -29077 47565 260306 -42338 -84385 242584 -256174 5481
18664 -65823 133190 238551 205641 -200828 32930 -99481 106809 242803 -178023 95438
18653 28169 -237054 -410555 68938 -124211 -249145 -117473 69328 -166614 88867 258786
18643 258786 -13166 -174383 -90927 153475 -119090 36571 313881 18826 -526383 152036
18632 -110595 114485 -182467 15824 163817 186127 6084 -64495 208465 -341551 -170858
18622 -170858 -99941 -17966 12079 107041 61613 -225070 -130531 -318806 -432873 -45031 -161360
18611 -161360 -206522 -61822 -23659 3301 -123877 -83711 80796 -62495 27874 -251105 14529
$$ packed form
18688E1002P0548b74051D230d58730a35501d1550j07476q2033g8240o8726B82882
18676a31319j4962f9141L1036R028D7565K12741d2338m2047B42584b56174E481
18664f5823A33190J05361l2910b00828C2930i9481A06809J35994a78023I5438
18653B8169b37054j73501F8938a24211j24934a17473F9328a66614H8867J69919
18643B58786a3166j61217Q3456A53475a19090C6571K77310A8826e26383A52036
18632a10595A14485a82467A5824J47993K2310F084f4495B08465c41551J70693
18622a70858P0917a7966A2079R4962m5428b25070R4539j88275j14067d5031j16329
18611a61360m5162f1822b3659C301a23877M0166H0796f2495B7874b51105A4529
$$ plain form
18599 -140024 83582 -424841 -359492 -43663 -507778 -215814 -222464 47492 -328010 49095 76400
18588 76400 -167107 -205339 -422520 -65645 -138867 40344 -240414 62256 -256088 16805 -13279
18576 -57365 -22318 -314810 16899 -73863 -39917 -345945 -123282 -78178 242076 228926 -245217
18564 -242670 -360504 -371542 157360 8853 69021 31877 -63294 -32641 -16191 73214 175740
18553 175740 -388193 143182 96480 146074 -101843 -294732 182764 92066 273304 72543
18542 -164619 -157094 -160182 -268558 120732 337920 77388 -69113 -143825 -189959 -18967 70505
18530 208034 -183759 74957 -243255 17024 -83572 106983 354616 -97330 -121195 620429
18519 -224849 -159371 165567 -468447 -79188 -23441 -206921 145024 -270651 -173289 -138315
$$ packed form
18599a40024H3582d24841O5349d3663m64115b15814o650D7492c28010D9095K7305
18588G6400a67107l8232k17181f5645p3222D0344b40414F2256b56088A6805a3279
18576e7365b2318k92492A6899g3863L3946l06028a23282M5104B42076j3150b45217
18564b42670j17834j1038A57360H853O0168C1877f3294L0653a6191G3214J02526
18553A75740c88193A43182m6702M9594a01843j92889A82764r0698J81238G2543
18542a64619P525l088j08376A20732K17188G7388f9113p4712m6134a8967G0505
18530B08034a83759G4957b43255A7024h3572A06983K47633i7330k3865F20429
18519b24849O5478A65567d68447g9188b3441j83480A45024b70651R7362L4974
$$ plain form
18509 -138315 82609 24218 -47215 68641 -8779 21962 -73740 -68567 -241939 51721 -27303 81984
18496 96617 36323 -147830 16794 -99316 -85504 -116422 -154229 -202879 -119961 -196517 -80977
18484 404833 -7643 -104815 -40772 -49813 -77191 -281170 8917 -165856 71737 -252308 279295
18472 48617 -140319 174143 -447745 -14167 -34902 202733 -86414 -211287 -68231 169194
18461 -2963 -144587 -22137 -268560 -135010 -189418 54393 -11090 7713 94966 9518 -228733
18449 173680 -69948 -88340 -177795 -134177 13572 -253936 -32865 -281869 147981 27926 82888
18438 82888 -30843 -197031 -126781 291550 -23527 -14448 -111722 -257257 -200039 177153 -336553
18426 -70157 -272074 -134152 96510 6680 -335350 -116526 107992 -14845 -302066 89757 -122789
$$ packed form
18509a38315H2609B4218d7215F8641h779B1962g3740N173j73372E1721b7303H1984
18496I6617C6323a47830A6794i9316J3812l0918l7807m8650Q2918p6556h0977
18484D04833g643r7172d0772r041k7378k03979H917a65856G1737b52308B79295
18472D8617a40319A74143d47745a4167k0735B02733h6414j24873f8231A69194
18461b963j41624b2137k46423J33550n4408E4393a1090G713Q7253I518b28733
18449A73680f9948j8392q9455M3618A3572b53936c2865k49004A47981B7926N4962
18438H2888c0843j66188P0250B91550b3527R079r7274j45535N7218A77153c36553
18426g0157k01917a34152I6510F680c35350a16526A07992a4845k87221H9757a22789
$$ plain form
18414 -180433 132633 37871 102719 58023 -40413 32500 -44206 132110 207072 165135 222084
18403 222084 50660 -41599 -54067 -592955 -318311 158106 28649 327573 -74095 -128582 180739
18391 -39586 113034 -38221 -6734 -198098 295561 -2816 -215576 -31358 321830 -140318 188206
18379 -90278 -301234 -432701 47630 227295 -350228 -97672 -319187 -284749 68830 222014
18369 222014 144473 -130163 -188827 115383 -86220 142521 142429 -291284 -38347 -81811 -239409
18358 -239409 -845 -3996 105016 43392 -1890 49800 -7410 -281587 -140063 98499 -77080 93142
18345 369172 -279397 57664 -181697 -40187 201596 50279 84960 -24678 108317 -209795
18334 146214 -218491 162250 -347212 13976 -19887 200347 322970 11730 -28252 141209
$$ packed form
18414a80433A32633C7871O4848m4696d0413C2500d4206A32110P4962m1937N6949
18403B22084E0660d1599j2468n38888K74644A58106B8649K98924g4095n4487A80739
18391c9586A13034c8221f734j91364B95561b816k12760c1358C21830a40318A88206
18379i0278k10956j31467D7630J79665c50228i7672k21515L4438F8830J53184
18369B22014p7541a30163n8664A15383h6220A42521r2b91284c8347m3464j57598
18358b39409h45l151A05016D3392a890D9800g410k74177a40063I8499g7080I3142
18345C69172b79397E7664a81697d0187B01596E0279L4681b4678A08317b09795
18334A46214b18491A62250c47212A3976a9887B00347J22623A1730b8252A41209
$$ plain form
18323 -62777 -82010 -34536 -380082 202611 15828 -298260 -94947 3714 109277 -434724 139001
18311 -130126 206801 151215 193246 -45539 158140 -13512 -176659 117258 157249 73593 -253721
18299 -51180 -5280 65938 -239406 -81234 -267381 32779 -13260 78577 -227476 196353 60182
18287 -17795 71750 40872 -133901 -210145 -238984 363107 370550 -348183 178549 -151281 -95689
18276 -95689 103893 118993 -200373 -73530 21462 -62349 2561 146273 -216504 -256213 -153240
18265 -153240 -191949 56887 229162 -118140 143185 145616 -25797 78612 202729 -232357 -57798
18253 62892 -6703 20595 -236691 -130590 205605 -281176 -210113 -132815 218304 -63613 -172536
18242 -172536 -13427 -208159 -57480 -190356 -3127 137833 -103465 -205765 -125788 -287833
$$ packed form
18323f2777j9233c4536l45546B02611A5828b98260i4947C714J05563d34724A39001
18311a30126B06801n5586M2031d5539A58140a3512j63147A17258L9991G3593b53721
18299e1180e280F5938b39406h1234j86147C2779a3260G8577b27476A96353F0182
18287a7795G1750l0878a33901p6244k8839C63107P443c48183A78549a51281N5592
18276i5689A03893J5100b00373g3530B1462f2349B561J43712b16504l9709J02973
18265a53240l8709E6887J72275a18140A43185K431b5797G8612J24117b32357e7798
18253F2892f703B0595b36691J06101B05605b81176P1063P7298B18304f3613j08923
18242a72536a3427j94732e7480j32876c127A37833a03465j02300P9977j62045
$$ plain form
18232 -287833 -116129 -47072 -261081 -321108 208777 32553 -129420 145980 -291212 -181134
18222 -181134 -81795 38518 259975 -191494 -191906 -54666 58903 -213324 112808 -320999 -140966
18210 130976 -143735 -136393 -158261 -276865 -47391 -110264 -102685 114963 -125336 310365 233028
18199 233028 -156721 -161295 -66390 1200 13345 -50070 -220969 50610 77581 122525 2601 4959
18187 4959 112247 -188223 19943 50086 -207340 -142134 -147202 -32364 -291292 -398709 -1248
18175 5368 -5172 -113462 -246685 -102062 -269862 204495 160995 342478 -154945 244543
18164 -423674 156584 315338 -163670 -40789 -184100 -41035 -5905 -117969 20252 -508205
18153 -187178 10434 90829 19872 -50211 -20365 -51934 75591 59754 68450 -268077 320320
$$ packed form
18232b87833a16129d7072k14009o0027B08777C2553a29420A45980b91212J10078
18222a81134h1795C8518K21457a91494m12e4666E8903b13324A12808c20999a40966
18210A30976a43735P342k1868j18604d7391o2873P579A14963a25336C10365p7337
18199B33028a56721m574f6390A200J2145e0070j70899E0610K6971M4944B601K358
18187D959J07288a88223A9943L0143b07340O5206n068c2364k58928j07417a248
18175E368e172j08290j33223a02062j67800B04495m3500J81483a54945B44543
18164d23674A56584J58754a63670d0789j43311d1035e905j12064B0252e08205
18153a87178A0434Q0395A9872e0211b0365l1569G5591j5837Q696b68077C20320
$$ plain form
18141 -295664 231926 -239434 -395084 43332 -153799 44074 272715 64814 -55019 -141716
18131 -141716 -102108 232277 63724 114777 243437 -330678 95591 -101108 -20913 -151646
18121 -151646 277999 -73996 -201106 -16400 -51829 -109824 -21608 81140 338898 47861 15199
18109 -9614 -202986 33114 129079 107635 -137072 -236873 57357 -94486 100044 -145315 -223946
18098 -223946 191060 -87685 87253 69637 205263 -307165 194760 -231174 -192144 -4570 240930
18086 -59034 206679 -179567 26138 135670 17013 -174338 -29548 -116631 -126354 213231 70049
18074 -125199 200375 -132755 -39530 105763 -202288 78298 -164866 106993 -241477 -287642
18064 -287642 251626 -50794 62889 -106877 -117492 20590 -31631 106018 55382 58626 -210184
$$ packed form
18141b95664B31926b39434j55650D3332a53799D4074K28641F4814e5019q6697
18131a41716L9608B32277F3724N1053J28660c30678I5591a01108b0913j30733
18121a51646B77999g3996j27110a6400l5429n7995b1608H1140K57758D7861A5199
18109i614j93372C3114R5965k1444a37072r9801E7357i4486A00044a45315p8631
18098b23946A91060h7685H7253j7616J35626c07165A94760b31174L9030d570B40930
18086e9034B06679a79567B6138J09532A7013a74338b9548q7083r723B13231G0049
18074a25199B00375a32755c9530A05763b02288G8298a64866A06993b41477m6165
18064b87642B51626e0794F2889a06877j0615B0590c1631A06018n0636L244b10184
$$ plain form
18052 -69596 373132 428582 -257611 -58202 254422 225299 -686691 302570 165365 -11208
18041 -112192 -175092 -157474 -82144 408714 3194 230507 -116760 13513 -24166 -266155 92055
18029 -129982 110540 -3772 -61829 -93084 35519 -22200 -55527 -39921 22741 5417 100694 -87600
18016 124852 -144708 -61803 311874 246518 -297502 241761 -158442 -23378 -212111 51190
18005 -134122 -223521 -36093 182874 84172 297502 198082 269603 99905 16478 129955 -162958
17993 -138604 95105 -102019 -48657 -8312 245599 204520 157733 -282031 -84033 251549 -111684
17981 -86257 152669 159396 343168 -32944 -227150 -489550 -90430 251895 92232 -277884 316978
17969 368294 292317 -155232 -122360 66392 34274 -92929 195681 -167151 -123608 -103257 65146
$$ packed form
18052f9596C73132N5450b57611e8202B54422k9123f86691C02570j37205a1208
18041a12192o2900J7618P5330D08714C194K27313a16760A3513b4166k41989I2055
18029a29982A10540c772n8057l1255C5519b2200l3327J5606B2741E417R5277h7600
18016A24852a44708f1803C11874o5356b97502B41761a58442b3378j88733E1190
18005a34122q9399c6093A82874H4172K13330r9420P1521I9905A6478J13477a62958
17993a38604I5105a02019d8657h312B45599m1079m6787b82031h4033B51549a11684
17981h6257A52669O727J83772c2944j94206k62400i0430B51895I2232b77884C16978
17969C68294p5977a55232L2872F6392l2118i2929A95681a67151M3543K0351F5146
$$ plain form
17957 194192 -85904 -314794 -212446 -73349 60081 -267161 24823 72878 -271 227520 -1141
17945 193050 -152023 301014 166896 -86453 110372 45781 -349067 236167 288941 70393
17934 131035 -133596 150751 -157335 -245249 198121 -200092 212560 110051 -63334 173028
17923 27971 -105668 -33908 15127 234110 -282985 302197 37893 545461 -161112 -253749
17913 -253749 -42592 -156230 -98067 -162218 18532 -207156 -116266 -206462 222684 434482 47613
17901 124727 121516 24723 64003 -59436 118552 52858 -89874 91025 -1650 -12607 67563 -213420
17888 -209957 84235 232606 205833 157517 123011 -19419 -83990 149393 -77374 -143155 138122
17876 131238 -134695 39014 -13179 29709 -47100 62638 304817 32235 186424 -131027 -235247
$$ packed form
17957A94192h5904k28890J02348g3349F0081b67161B4823M8055b71B27520a141
17945A93050a52023C01014j34118h6453A10372D5781c49067B36167N2774G0393
17934A31035a33596A50751a57335q7914A98121b00092B12560j02509f3334A73028
17923B7971a05668c3908A5127K18983b82985C02197C7893N07568a61112r2637
17913b53749d2592j13638N8163o4151A8532b07156R0890r0196B22684K11798D7613
17901A24727l211B4723L9280e9436A18552E2858h9874I1025a650j0957F7563b13420
17888b09957H4235J48371k6773m8316l4506a9419o4571A49393g7374o5781A38122
17876A31238a34695C9014a3179B9709d7100F2638K42179C2235J54189a31027j04220
$$ plain form
17865 -235247 -78243 -154355 -184745 -2929 -7700 -40978 161102 407009 283284 -156646 3768
17853 222915 31893 19790 100376 270792 -88124 -119118 94444 195576 -43116 168835 159297
17842 159297 -66741 -284643 324769 -92877 12514 175315 91869 209645 133399 -40156 -48363
17831 -48363 50324 -62733 36470 301819 -147938 164470 -129803 274609 -131791 -209858
17821 -209858 -105972 -54431 -59846 273036 119046 -76830 -158163 111017 74574 -197868 172587
17809 41153 37088 -91474 -78605 134421 136475 -183665 23756 136688 -3487 137688 6301 -14457
17796 -30033 -62911 247101 -87655 -3780 -102014 308767 335883 43027 75016 364490 49213
17784 20780 74815 53932 -109660 47912 -137818 131406 -30070 8440 119106 -107490 -243359
$$ packed form
17865b35247g8243p6112l0390b929m771l3278A61102K45907j23725a56646C768
17853B22915C1893j2103Q0586J70416h8124l0994I4444J01132d3116A68835r538
17842A59297f6741k17902C24769i2877A2514J62801q3446J17776p6246d0156q207
17831d8363E0324f2733C6470K65349a47938A64470a29803B74609a31791p8067
17821b09858J03886N1541n415B73036A19046g6830q1333A11017l6443a97868A72587
17809D1153m065i1474J2869A34421K054a83665B3756J12932c487A37688F301a4457
17796c0033l2878B47101h7655c780r8234C08767K7116D3027L1989K89474D9213
17784B0780N4035k0883a09660D7912a37818A31406c0070H440J10666a07490j35869
$$ plain form
17773 -243359 -149949 23101 -41242 73146 63992 -66131 189484 96112 211715 278676 335843
17762 335843 409023 -278108 84308 41963 73094 -20702 -326152 -8465 336747 -246408 -50275
17750 282238 -56120 89628 349895 -5049 -59400 -165486 42967 -66829 22793 -79641 -32446
17738 129479 178668 275595 26915 -347164 -208595 -123305 -165577 -88237 -81086 45437 -40243
17726 -243846 166449 78870 287291 107001 -117481 328835 -112112 120543 51382 -68168
17715 57792 -10909 -60178 477644 550152 153347 120829 -69887 97441 -23494 160343 -14082
17703 190299 38597 37100 132816 -193279 393625 223761 -177110 250567 -17353 252192
17692 187900 180073 189435 -190026 223967 -300231 -145692 248515 216385 68453 257237 -241960
$$ packed form
17773b43359R3410B3101d1242G3146r154f6131A89484r3372J15603O6961N7167
17762C35843P3180b78108H4308D1963L1131b0702l05450h465C36747b46408e0275
17750B82238e6120H9628K60267e049n4351j06086D2967f6829B2793g9641c2446
17738A29479M9189R6927B6915c47164J38569Q5290m2272P7340P151D5437d0243
17726b43846A66449G8870K08421A07001a17481C28835a12112A20543E1382f8168
17715E7792a0909m9269D77644P2508A53347l2518f9887I7441b3494A60343a4082
17703A90299C8597j497R5716a93279C93625j69864a77110B50567a7353B52192
17692A87900p827R362a90026B23967c00231a45692B48515l2130F8453J88784b41960
$$ plain form
17680 -96697 -179639 -181660 349249 210713 262933 -43643 156313 -45385 -1162 227990 16668
17668 -125310 60170 335793 11653 342681 129919 40207 -74392 38987 150281 111875 103981
17657 103981 77355 48980 -208200 76362 -66110 -252027 6920 -140675 232367 559259 178065
17645 228041 81046 115566 208038 142337 -142076 -159116 147085 468605 -51251 -207107 155714
17633 287836 -31468 -267943 232354 21191 56246 -73478 158702 10499 371092 63139 -87252
17621 98191 178887 9174 65108 32155 14637 57505 -79373 148790 71342 221857 42331
17609 230275 -90825 69982 -81402 57378 399302 195143 160573 132999 211057 -63956 141132
17597 5301 121347 385098 56985 -139979 218882 168578 212340 -24937 189024 193335 403471
$$ packed form
17680i6697q2942k021C49249j38536N2220d3643A56313d5385a162B27990A6668
17668a25310F0170K75623A1653L31028A29919D0207g4392C8987J11294l8406p894
17657A03981k6626k8375b08200G6362f6110j85917F920a40675B32367L26892A78065
17645B28041H1046L4520R2472o5701a42076j7040A47085L21520e1251j55856A55714
17633B87836c1468k36475B32354B1191L5055g3478A58702A0499L60593F3139h7252
17621I8191Q0696I174N5934C2155A4637M2868g9373A48790G1342J50515D2331
17609B30275i0825F9982h1402E7378L41924A95143l4570k7574P8058f3956A41132
17597E301J16046K63751E6985a39979B18882n0304M3762b4937A89024M311K10136
$$ plain form
17586 403471 29531 123181 -37065 294740 -160970 185244 -45092 -32578 213493 206207 30108
17574 323175 44707 225366 -154590 -247968 368637 150442 31188 153590 278757 48823
17563 -57683 -59624 244696 404546 368466 -77824 366156 261215 343711 150668 451273 231174
17552 231174 231917 95384 156912 -134689 152371 197759 161844 90949 324858 -2684 162116
17540 197282 223249 366123 274266 -12516 -98733 -92882 237557 -33850 333372 291278 284405
17529 284405 205946 -56 -18539 148802 143613 161864 -92867 -103387 -21794 -85662 250950 93873
17516 -70032 40502 230710 -37626 371068 360794 529687 697887 1036595 747851 1073647
17506 1073647 792691 529576 467445 22630 -6149 550685 701144 427509 292108 160742
$$ packed form
17586D03471B9531R3650c7065B94740a60970A85244d5092J2514B13493p286C0108
17574C23175D4707J80659a54590r3378C68637A50442C1188J22402J25167D8823
17563e7683j941B44696J59850l6080g7824C66156j04941Q2496A50668L00605k20099
17552B31174P43I5384O1528a34689A52371M5388l5915p0895K33909b684A62116
17540A97282K5967J42874r1857a2516q6217N851B37557c3850C33372m2094o873
17529B84405p8459e6j8483A48802n189J8251i2867j0520b1794o3868B50950I3873
17516g0032D0502J90208c7626C71068j0274J68893J68200L38708k88744L25796
17506A073647k80956k63115o2131B2630f149E50685J50459k73635j35401j31366
$$ plain form
17496 160742 452127 659324 669872 1023876 1110986 510492 325496 389224 1019491 235319
17485 600212 548961 167649 134931 366266 270569 163976 51419 75537 439207 183907
17474 323821 275166 260923 296659 488161 258845 -159899 451324 380848 261386 -24814
17463 303552 408467 103758 220315 769540 -27795 23743 119305 375431 148721 378214
17453 378214 442537 138487 257711 199555 21152 328525 294667 197610 -130717 -21643 -37798
17442 -37798 280419 33535 -64672 344071 325287 254604 334644 147286 211368 447064 340677
17431 340677 185503 440541 230312 34700 239736 20537 158223 426389 614853 4047
17420 547530 544785 379423 179975 678030 383951 -6204 69447 243388 80835 301618 227665
$$ packed form
17496A60742K91385K07197J0548L54004Q7110E10492j84996O3728O30267B35319
17485F00212n1251A67649l2718K31335r5697j06593E1419K4118L63670A83907
17474C23821m8655j4243L5736J91502k29316a59899D51324p0476j19462b4814
17463C03552J04915A03758J16557N49225b7795B3743R5562K56126A48721K29493
17453C78214O4323A38487J19224n8156B1152L07373l3858r7057a30717b1643j6155
17442c7798B80419C3535f4672C44071j8784p0683Q0040A47286O4082K35696j06387
17431C40677j55174K55038k10229C4700K05036B0537J37686K68166J88464D047
17420E47530k745j65362A79975M98055k94079f204F9447J73941H0835K20783p3953
$$ plain form
17409 227665 453600 520019 218120 412576 451295 500788 599331 233246 294458 644463
17399 644463 275311 223010 674132 125733 -122528 357565 -12009 585461 287633 177187
17389 177187 85677 483300 448007 -174485 217164 455212 347942 134837 11092 431208
17379 431208 463156 539483 390448 68400 241079 31639 42582 475871 261479 225355 138258
17368 138258 406982 118970 136615 243543 283438 67878 373047 423696 114826 412184
17358 412184 262785 150016 89946 263200 -167851 223469 188315 -56263 192368 513543
17348 513543 253235 227872 378699 342813 -71224 309431 311670 212470 -77171 31124 392211
17337 392211 240751 130101 -11409 232799 26161 371402 328708 396929 306197 290346 339469
$$ packed form
17409B27665K25935O6419B18120J94456L8719M9493R8543B33246O1212L50005
17399F44463B75311n2301M51122A25733a22528C57565a2009E85461B87633j10446
17389A77187H5677L97623l5293a74485B17164K38048j07270A34837A1092M20116
17379D31208L1948P6327j49035F8400J72679C1639J0943M33289k14392l6124q7097
17368A38258K68724A18970J7645J06928L9895F7878L05169N0649A14826K97358
17358D12184j49399j12769o0070J73254a67851B23469l5154e6263A92368L21175
17348E13543B53235k5363J50827l5886g1224C09431K239r9200g7171C1124L61087
17337C92211j51460j10650a1409B32799B6161L45241m2694O8221r0732j5851M9123
$$ plain form
17326 339469 343418 103538 51380 -33792 8919 160544 369872 291925 273451 6226 386587
17315 386587 160079 226360 479791 462697 364441 67394 225315 18084 112786 138316 66221
17303 46324 -29525 36789 538103 63839 409584 -11901 345966 340676 151949 499168 424586
17292 424586 110946 205939 753441 469197 69703 -69581 386732 358575 270431 81229 366346
17281 366346 229024 248406 438934 146637 243139 319211 270608 362762 218339 186072 289759
17270 289759 272435 49798 -69345 236541 384406 419630 -83717 80299 546882 123002 31873
17258 171772 334767 114458 115307 276045 339644 282244 415873 176451 124007 202267 173865
17247 173865 446948 182794 162947 363453 98801 239791 380037 364986 -220594 -26101
$$ packed form
17326C39469L949A03538E1380c3792H919J51625K09328p7947j8474F226L80361
17315C86587A60079O6281K53431j7094r8256F7394J57921A8084R4702K5530F6221
17303D6324b9525C6789N01314F3839L45745a1901C45966n290A51949L47219p4582
17292D24586A10946R4993N47502k84244F9703f9581C86732k8157q8144H1229K85117
17281C66346j37322J9382J90528A46637R6502P6072m8603R2154j44423l2267J03687
17270B89759j7324D9798f9345B36541J47865L5224h3717H0299M66583A23002C1873
17258A71772J62995A14458Q49J60738O3599n7400J33629A76451n2444P8260k8402
17247A73865K73083A82794j9847K00506I8801J40990J40246j5051b20594b6101
$$ plain form
17236 -77079 308286 286802 144077 343774 116817 338518 302580 183106 -15066 370562
17225 365940 420447 526494 111346 505973 223274 426779 484403 119142 290083 390059
17215 390059 362688 398283 412484 345476 482860 559118 409291 -104188 250462 355644
17205 355644 461350 338380 329971 331771 301935 548769 334640 488434 327009 513893
17195 513893 168031 513729 491648 -5870 243534 202049 85608 132539 262646 417076 468337
17184 468337 303980 297968 110134 125780 101920 365493 547138 398929 274979 519226
17174 519226 540738 471680 512881 116059 251921 445042 323458 260148 395691 697541
17164 697541 355496 401051 484200 443305 283739 464093 289010 171311 718103 339804
$$ packed form
17236g7079C08286k1484j42725J99697A16817K21701l5938j19474a5066C70562
17225C65940N4507J06047A11346L94627B23274K03505N7624A19142J70941R9976
17215C90059k7371L5595J4201o7008J37384P6258j49827a04188B50462J05182
17205C55644J05706j22970q409J800k9836K46834k14129J53794j61425J86884
17195E13893A68031L45698k2081e870B43534m1485H5608M6931J30107J54430N1261
17184D68337j64357o012A10134J5646k3860K63573J81645j48209j23950K44247
17174E19226K1512o9058M1201A16059J35862J93121j21584o3310J35543L01850
17164F97541l42045M5555Q3149m0895j59566J80354j75083j17699N46792C39804
$$ plain form
17153 259946 108061 628423 335801 350146 652079 582192 201656 475765 477985 31314
17142 580926 415005 657980 610300 462064 372791 338936 602485 423949 567705 406144
17132 406144 702690 163996 653388 326793 330831 545814 211634 359629 424188 358312
17122 358312 506181 386865 584481 205589 321667 417421 437434 394174 479349 512981
17112 512981 550317 658404 713574 531249 389852 335123 393808 394218 381521 563976 280152
17100 224838 216015 476749 754671 471352 614369 314349 225518 707825 694298 322831
17089 463221 610528 466705 554910 605143 347171 671832 827164 575528 644280 576413
17079 576413 767896 252412 490520 97084 491497 380342 757764 704217 813268 517710
$$ packed form
17153B59946A08061N20362k92622J4345L01933o9887B01656K74109K220C1314
17142E80926j65921K42975m7680j48236q9273l3855K63549j78536J43756j61561
17132D06144K96546A63996M89392l26595M038K14983B11634J47995O4559o5876
17122C58312J47869j19316J97616B05589J16078R5754K0013m3260Q5175L3632
17112E12981L7336J08087N5170j82325j41397n4729N8685M10j2697J82455B80152
17100B24838q823K60734K77922k83319J43017l00020q8831M82307j3527C22831
17089D63221J47307j43823Q8205N0233k57972L24661J55332k51636O8752o7867
17079E76413J91483B52412K38108I7084L94413j11155L77422n3547J09051k95558
$$ plain form
17069 517710 862873 814154 717462 594016 491671 888077 678798 534170 356529 551330
17059 551330 659816 658626 469653 342880 412075 525616 948656 830417 451685 714538
17049 714538 889000 314831 222110 891500 923604 987105 716230 783951 829612 876904 869558
17038 869558 702689 964406 502427 834040 536489 698733 550461 1064199 584756 410194
17028 410194 93214 863701 761403 805364 485102 913336 576393 583885 886463 814752
17018 814752 906734 635906 831666 449252 820067 884064 835417 632300 678606 993462
17008 993462 587814 982905 644836 1060879 769348 1058182 1109159 866886 743754 938234
16998 938234 939259 1208656 876661 995259 1109165 598619 975035 937543 907351 1100687
$$ packed form
17069E17710L45163m8719r6692j23446j02345L96406k09279j44628j77641J94801
17059E51330J08486j190j88973j26773O9195J13541M23040j18239l78732K62853
17049G14538J74462C14831r2721O69390L2104O3501k70875O7721M5661M7292p346
17038H69558j66869K61717m61979L31613k97551J62244j48272N13738m79443j74562
17028D10194I3214P70487j02298M3961l20262M28234l36943P492L02578p1711
17018H14752R1982k70828J95760l82414L70815O3997m8647k03117M6306L14856
17008I93462m05648L95091l38069M16043k91531K88834N0977k42273j23132J94480
16998I38234J025K69397l31995J18598J13906n10546L76416l7492l0192J93336
$$ plain form
16988 1100687 963255 1027746 826307 1104263 1096418 957338 1124073 1181736 1486886 1001349
16978 1001349 1234139 1096562 1080816 905288 1165041 1040996 1132555 1077954 996206 1034605
16968 1034605 1031316 1112795 1216789 1179685 1107647 1238732 1142435 1111569 1040360 1090998 1157823
16957 1157823 1283775 1299528 1289045 1197471 1451637 1301462 1498309 1197712 1295200 1545679
16947 1545679 1552545 1311380 1256444 1218992 1203838 1591281 1244563 1194625 1386745 1236742
16937 1236742 1635150 1526079 1100328 1328285 1491431 1077192 1443554 1426603 1328534 1489070
16927 1489070 1751104 1784464 1508762 1483055 1638626 1684916 1514754 1703038 1494047 1849126
16917 1849126 1668259 1453124 1593993 1679103 1447630 1951940 1595512 1853205 1776708 2215656
$$ packed form
16988A100687j37432O4491k01439K77956p845j39080J66735N7663L05150m85537
16978A001349K32790j37577j5746j75528K59753j24045R1559n4601q1748L8399
16968A034605l289Q1479J03994l7104p2038J31085r6297l0866p1209N0638O6825
16957A157823J25952J5753j0483r1574K54166j50175J96847l00597R7488K50479
16947A545679O866k41165n4936l7452j5154L87443l46718m9938J92120j50003
16937A236742L98408j09071m25751K27957J63146m14239L66362j6951r8069J60536
16927A489070K62034L3360k75702k5707J55571M6290j70162J88284k08991L55079
16917A849126j80867k15135J40869Q5110k31473N04310l56428K57693p6497M38948
$$ plain form
16907 2215656 1833374 1835056 1965133 1685883 1964547 2376937 1932642 2347869 2136193 1832985
16897 1832985 2542852 2041161 2170135 1955447 2109457 2246270 2179463 2295470 2201571 2401155
16887 2401155 2300208 2087820 2091903 2200463 2707683 2373348 2406484 2821263 2564751 2632898
16877 2632898 2468044 2557922 2769535 2754185 2897243 2593384 2876963 2692643 2812268 2954633
16867 2954633 2667713 2897719 2888904 2952608 3077752 3232018 3201579 3251480 2910997 3263998
16857 3263998 3473783 3503714 3227960 3597712 3284333 3360120 3417986 3482604 3694205 3556565
16847 3556565 3685670 3463282 3568087 4074640 4241965 3811879 4020015 4027076 4099045 4472159
16837 4472159 4177093 4106339 4433670 4717099 4474487 4582703 4509643 4879170 4831871 5048101
$$ packed form
16907B215656l82282J682J30077k79250K78664M12390m44295M15227k11676l03208
16897A832985P09867n01691J28974k14688J54010J36813o6807J16007r3899J99584
16887B401155j00947k12388M083J08560N07220l34335L3136M14779k56512O8147
16877B632898j64854Q9878K11613j5350J43058l03859K83579j84320J19625J42365
16867B954633k86920K30006q815O3704J25144J54266l0439M9901l40483L53001
16857C263998K09785K9931k75754L69752l13379P5787N7866O4618K11601j37640
16847C556565J29105k22388J04805N06553J67325m30086K08136P061P1969L73114
16837D472159k95066p0754L27331K83429k42612J08216p3060L69527m7299K16230
$$ plain form
16827 5048101 5173732 4973734 5062657 5167003 5641908 5501341 5252561 5650119 5820792 6118581
16817 6118581 5948941 6043819 6116954 6527289 6138212 6530272 6325388 6738437 6782484 6769005
16807 6769005 6805306 7447419 7350766 7329074 7419223 7706932 7844137 8397718 8176667 8249641
16797 8249641 8757670 8637799 8979755 9376538 9414483 9400662 9784414 9543036 9720931 10205300
16787 10205300 10252990 11028440 10818998 11183934 11481493 11856620 12280556 12399076 12643520
16778 12643520 12855783 13367583 13696325 13952949 14557134 14895107 15314968 15377342 15808575
16769 15808575 16746837 17036105 17444436 17718654 18308537 19115794 19115634 20145715 20498916 21194388
16759 21194388 22061115 22639998 23282900 24134403 25342357 25836648 26665188 27148617 28881209
$$ packed form
16827E048101J25631j99998Q8923J04346M74905j40567k48780L97558J70673K97789
16817F118581j69640R4878P3135M10335l89077L92060k04884M13049M4047j3479
16807F769005L6301O42113r6653k1692R0149K87709J37205N53581k21051P2974
16797H249641N08029j19871L41956L96783L7945j3821L83752k41378J77895M84369
16787A0205300M7690P75450k09442L64936K97559L75127M23936J18520K44444
16778A2643520K12263N11800L28742K56624O04185L37973M19861O2374M31233
16769A5808575R38262K89268M08331K74218N89883Q07257j60J030081L53201O95472
16759B1194388Q66727N78883O42902Q51503J207954M94291Q28540M83429J732592
$$ plain form
16750 28881209 29494638 30392470 31498739 33013557 33998774 35097506 36616559 37799883
16742 37799883 39298427 41091218 42639753 44407564 46136333 47822651 49665287 52018993
16734 52018993 54077192 56441538 58706020 60928424 63946776 66347765 68934670 72116942
16726 72116942 74637301 78147976 81235997 84130572 87502598 90912934 94270460 97496230
16718 97496230 101259237 104577114 107650856 110892204 113974645 116873111 119403686 122029851
16710 122029851 124223239 126374406 127419818 128248515 129134767 129636619 129052701 129126585 127546578
16701 127546578 126616269 124817180 122773488 120334536 117884892 114982070 111909747 108536782
16693 108536782 105499653 102153820 98521485 95043944 92028370 87929919 85067562 81543192
$$ packed form
16750B8881209O13429Q97832J106269J514818R85217J098732J519053J183324
16742C7799883J498544J792791J548535J767811J728769J686318J842636K353706
16734E2018993K058199K364346K264482K222404L018352K400989K586905L182272
16726G2116942K520359L510675L088021K894575L372026L410336L357526L225770
16718I7496230L763007L317877L073742L241348L082441K898466K530575K626165
16710A22029851K193388K151167J045412Q28697Q86252N01852n83918P3884j580007
16701A27546578r30309j799089k043692k438952k449644k902822l072323l372965
16693A08536782l037129l345833l632335l477541l015574m098451k862357l524370
$$ plain form
16685 81543192 78049715 75162005 72283207 69148338 66433767 63484378 61342040 58346713
16677 58346713 56068156 53580814 51682885 49625570 47560171 45560144 43771706 42099497
16669 42099497 40372441 38989641 37474483 35858061 34659170 33461682 32427543 30926065
16661 30926065 30013423 28901704 27635103 26920729 26338452 25142767 24250691 23585994 22619557
16652 22619557 21886449 21047189 20834434 19641504 19791348 18611991 18229064 17762415 16911851
16643 16911851 16774076 16213421 15666260 15345265 15005701 14536582 14204466 13822051 13710754
16634 13710754 13136901 12947730 12381634 11610241 11838288 11600387 10977800 11152985 10896514
16625 10896514 10675547 10287055 9943150 9646381 9722529 9284628 9354798 8872539 8642909 8777616
$$ packed form
16685H1543192l493477k887710k878798l134869k714571k949389k142338k995327
16677E8346713k278557k487342j897929k057315k065399k000027j788438j672209
16669D2099497j727056j382800j515158j616422j198891j197488j034139j501478
16661C0926065r12642j111719j266601p14374n82277j195685q92076o64697r66437
16652B2619557p33108q39260k12755j192930J49844j179357l82927m66649q50564
16643A6911851j37775n60655n47161l20995l39564m69119l32116l82415j11297
16634A3710754n73853j89171n66096p71393K28047k37901o22587J75185k56471
16625A0896514k20967l88492l43905k96769P6148m37901P0170m82259k29630J34707
$$ plain form
16615 8777616 8294727 8451681 8158724 7883850 7592700 7635677 7491023 7274292 7182099 6844792
16605 6844792 6778029 6593075 6577852 6526619 5993004 6414537 5894606 6001564 5983240 5868145
16595 5868145 5945892 5677585 5422096 5373919 5351086 5133484 5188981 5024494 4988134 4801819
16585 4801819 4579951 5062582 4746237 4812919 4596217 4542386 4177765 4411009 4466055 4252960
16575 4252960 4277512 4032349 4171009 4072790 4108142 3802683 3729599 3956057 3721582 3869730
16565 3869730 3493422 3707826 3553488 3272514 3090042 3369388 3431190 2732048 3611556 2859727
16555 2859727 2937465 2998215 2685033 2885706 2873569 2915571 2670317 2858634 3050390 2857558
16545 2857558 2692243 2665182 2852969 2451300 2408316 2604983 2396479 2467254 2570252 2544702
$$ packed form
16615H777616m82889J56954k92957k74874k91150M2977j44654k16731r2193l37307
16605F844792o6763j84954j5223n1233n33615M21533n19931J06958j8324j15095
16595E868145P7747k68307k55489m8177k2833k17602N5497j64487l6360j86315
16585D801819k21868M82631l16345O6682k16702n3831l64621K33244N5046k13095
16575D252960K4552k45163J38660r8219L5352l05459p3084K26458k34475J48148
16565C869730l76308K14404j54338k80974j82472K79346O1802o99142Q79508p51829
16555B859727P7738O0750l13182K00673j2137M2002k45254J88317J91756j92832
16545B857558j65315k7061J87787m01669m2984J96667k08504P0775J02998k5550
$$ plain form
16535 2544702 2642498 2285246 2368339 2620228 2529486 2309710 2166191 2342141 2159805 2318766
16525 2318766 2322384 2193429 2212200 2011221 2004581 1955170 2025672 1702973 2066358 2068869 1634160
16514 1634160 1855722 1960149 1689765 1664891 2053589 1739467 1731422 1690091 1912833 1664618
16504 1664618 1698622 1696922 1538504 1724071 1538966 1771947 1475106 1759882 1709021 1425601
16494 1425601 1431207 1813315 1542118 1555811 1618359 1484049 1690906 1734893 1540220 1403278
16484 1403278 1529577 1555653 1435576 1834996 1582680 1504631 1454693 1282273 1293742 1157360
16474 1157360 1678113 1245451 1450927 949978 1484529 1690070 1200781 1068381 1476392
16465 1476392 1273440 1251046 1285439 1422773 1302993 1353369 1308224 973186 1369610 1407636
$$ packed form
16535B544702R7796l57252Q3093K51889r0742k19776j43519J75950j82336J58961
16525B318766L618j28955J8771k00979o640m9411P0502l22699L63385K511m34709
16514A634160K21562J04427k70384k4874L88698l14122q045m1331K22742k48215
16504A664618L4004j700j58418J85567j85105K32981k96841K84776n0861k83420
16494A425601N606L82108k71197J3693O2548j34310K06857M3987j94673j36942
16484A403278J26299K6076j20077L99420k52316p8049m9938j72420J1469j36382
16474A157360N20753m32662K05476n00949N34551K05541m89289j32400M08011
16465A476392k02952k2394L4393J37334j19780N0376m5145l35038L96424L8026
$$ plain form
16455 1407636 1247697 1158696 1263069 1397601 1189146 1312022 1085262 882727 1071322 1280583
16445 1280583 1257381 809337 934450 1039185 798514 902011 900442 883137 1012438 923904
16435 923904 1109583 957739 978777 893223 887559 848900 798407 336330 845018 1022032 1136407
16424 1136407 851418 1064939 1056363 826977 753294 583068 719224 1059261 789301 921547
16414 921547 648601 852172 805663 904314 834340 1109289 828283 803073 564873 880083
16404 880083 612088 588171 748689 981864 690438 707611 617908 852433 810375 748201
16394 748201 634185 884074 803217 856317 389800 827001 656448 653381 730298 661669 867666
16383 867666 670722 942282 628277 702931 1040328 595309 831219 568661 757842 515237
$$ packed form
16455A407636j59939q9001J04373J34532k08455J22876k26760k02535J88595K09261
16445A280583k3202m48044J25113J04735k40671J03497j569j7305J29301q8534
16435I23904J85679j51844K1038q5554n664l8659n0493C36330N08688J77014J14375
16424A136407k84989K13521q576k29386p3683j70226J36156L40037k69960J32246
16414I21547k72946K03571m6509R8651o9974K74949k81006k5210k38200L15210
16404H80083k67995k3917J60518K33175k91426J7173q9703K34525m2058o2174
16394G48201j14016K49889q0857N3100C89800M37201j70553l067P6917o8629K05997
16383H67666j96944K71560l14005P4654L37397m45019K35910k62558J89181k42605
$$ plain form
16373 515237 604822 543771 364684 450117 244511 478212 689021 671859 973682 549215
16363 549215 550730 489517 589942 627365 801317 998122 603710 724852 744375 519526
16353 519526 768603 895075 838556 850251 304658 497412 625244 576476 469854 276406
16343 276406 666025 581335 374466 554979 692695 630405 410254 533523 362106 658248
16333 658248 569144 443001 220730 551086 364292 569620 380514 644739 470463 435992
16323 435992 304817 360626 513148 563123 689894 809260 292512 351341 360030 601518
16313 601518 787882 310951 472952 600909 513760 612202 311819 571475 401864 233998
16303 233998 475616 91865 200331 506349 268233 340863 464438 159249 308044 140969
$$ packed form
16373E15237Q9585o1051j79087Q5433k05606K33701K10809j7162L01823m24467
16363E49215J515o1213J00425L7423J73952J96805l94412J21142J9523k24849
16353E19526K49077J26472n6519J1695C04658J92754J27832m8768j06622j93448
16343B76406L89619q4690k06869J80513J37716o2290k20151J23269j71417K96142
16333F58248q9104j26143B20730L30356j86794K05328j89106K64225j74276l4471
16323D35992j31175N5809J52522M9975J26771J19366B92512N8829Q689K41488
16313F01518J86364C10951J62001J27957q7149R8442l00383K59656j69611j67866
16303B33998K41618I1865J08466L06018k38116P2630J23575A59249J48795A40969
$$ plain form
16292 293700 412347 401868 305509 254483 382382 542133 192864 810511 686735 220567
16281 112066 500745 540327 123318 299517 477754 390279 349505 342426 391629 188780 287737
16270 287737 613022 486160 399232 530513 362579 260486 232811 180279 182798 257763 319041
16259 319041 115493 710216 173977 671979 287120 515261 298189 429517 306652 280231
16249 280231 195578 387471 567953 54010 -130504 370049 453298 443333 294676 243752 57525
16237 434466 164055 133486 -11991 215473 236539 401223 -101189 168884 -10961 554921
16226 396153 190849 409222 142333 94407 96082 222490 107384 516577 373688 271517
16216 271517 384264 298465 296680 45766 502585 184887 103958 124817 389412 155942 118642
$$ packed form
16292B93700J18647j0479r6359n1026J27899J59751A92864O17647j23776B20567
16281A12066L88679L9582A23318J76199J78237q7475m0774p079M9203A88780R8957
16270B87737L25285j26862q6928J31281j67934j02093k7675n2532K519P4965O1278
16259C19041A15493N94723A73977M98002B87120K28141k17072J31328j22865k6421
16249B80231q4653J91893J80482E4010a30504C70049Q3249r965j48657n0924E7525
16237D34466A64055l0569a1991B15473K1066J64684a01189A68884a0961E54921
16226C96153A90849K18373A42333m7926J675J26408A07384M09193j42889j02171
16216B71517J12747q5799j785D5766M56819A84887q0929K0859K64595A55942l7300
$$ plain form
16205 118642 443277 -36109 374420 169997 359572 358942 476110 528508 383517 304412 203139
16194 203139 298845 178906 142716 270610 395281 617177 338907 331360 148808 81908
16184 81908 -18883 408608 135623 288837 302724 70545 -159850 337156 293778 253750 58214
16172 268601 508019 130022 587136 389403 343707 190579 -91721 295920 435258 24446
16161 46941 41124 -53049 371093 -3738 80873 119342 60952 284263 66429 -31885 169546
16149 -167277 232223 -49356 226341 138747 214206 635366 505002 262652 41361 -123555
16138 498205 14607 257932 36359 79208 351255 80063 164144 22693 312857 80722 208261
16127 208261 56835 453377 115166 136676 220466 323149 293660 120815 -118416 181185
$$ packed form
16205A18642L24635c6109C74420A69997J89575o30J17168N2398j44991p9105j01273
16194B03139R5706j19939l6190J27894J24671K21896k78270p547A48808o6900
16184H1908a8883D08608A35623J53214J3887G0545a59850C37156m3378m0028E8214
16172B68601K39418A30022M57114j97733m5696j53128i1721B95920J39338B4446
16161D6941n817e3049C71093c738H0873L8469n8390K23311F6429c1885A69546
16149a67277B32223d9356B26341q7594P5459M21160j30364k42350D1361a23555
16138D98205A4607K43325C6359M2849K72047H0063Q4081B2693K90164H0722J27539
16127B08261E6835L96542A15166K1510Q3790J02683k9489A20815a18416A81185
$$ plain form
16116 -35819 -115540 101841 105051 -4696 160882 148156 108633 -218371 52221 234204 274390
16105 274390 245622 132669 146736 180240 311594 270910 320260 60224 -13860 22826 293950
16094 293950 255232 -72887 -186281 269476 101697 -54483 294980 24979 -88330 -58258 151816
16082 343383 280933 -96863 17423 -194101 332318 -224556 -169776 226524 56583 473984
16072 473984 -134347 30045 44338 -359842 -26841 83240 -33810 66038 260400 411621 -94841
16060 63651 97254 -122959 90041 -71753 -14286 187215 -67256 251881 79201 -110886 524498
16048 244343 453747 -70548 100438 164869 114994 341406 140341 -252368 -99578 -79954
16038 -79954 29422 -82232 25183 66245 104411 -305038 -142732 77619 129608 173774 -177697
$$ packed form
16116c5819p9721A01841L210d696A60882j2726l9523b18371E2221J81983M0186
16105B74390k8768j12953J4067L3504J31354m0684M9350F0224a3860B2826K71124
16094B93950l8718g2887j13394B69476A01697e4483B94980B4979h8330L0072A51816
16082C43383o2450i6863A7423a94101C32318b24556N4780B26524E6583M17401
16072D73984a34347C0045J4293c59842b6841H3240c3810F6038J94362J51221i4841
16060F3651L3603a22959I0041g1753a4286A87215f7256B51881G9201a10886E24498
16048B44343K09404g0548A00438O4431m9875K26412A40341b52368i9578J9624
16038g9954B9422h2232B5183M1062L8166c05038a42732G7619N1989M4166a77697
$$ plain form
16026 -171325 -212801 -82285 396455 119535 171091 -40814 444498 79287 96424 -100810 402447
16014 65839 264728 -319135 -95783 8929 -105632 185882 94239 173804 15750 28147 -213863
16002 23377 170770 -22091 25912 73846 -57849 -30613 -169654 -41155 -319868 -245028 22214
15990 -13834 201601 -365573 -8696 108400 -273779 -303093 150071 173132 53663 203991 319784
15979 319784 -23548 -162844 203698 528451 280444 181090 34349 478041 440413 839627
15969 839627 866508 537322 561408 525496 392647 275668 60216 -53891 -1795 209131 263967
15958 263967 -52926 -14202 16840 122287 -64871 92114 -50251 -150873 -85601 -2664 -12703
15947 -12703 -148166 141797 141392 50030 -34592 24413 -62011 300539 70330 155979 14789
$$ packed form
16026a71325m1476h2285C96455A19535N1556d0814D44498G9287J7137a00810D02447
16014F5839J98889c19135i5783H929a05632A85882r1643P9565A5750J2397b13863
16002B3377J47393b2091B5912M7934e7849K7236j39041d1155k78713P4840B2214
15990a3834B01601c65573h696A08400b73779k9314A50071K3061E3663J50328J15793
15979C19784b3548j39296B03698L24753k48007r9354C4349M43692l7628L99214
15969H39627K6881l29186K4086l5912j32849j16979F0216e3891a795B09131N4836
15958B63967e2926a4202A6840J05447f4871I2114e0251j00622O5272b664j0039
15947a2703j35463A41797m05E0030c4592B4413f2011C00539G0330Q5649A4789
$$ plain form
15935 132555 -9445 38340 75618 43554 -233469 -122501 37676 115400 184386 -33894 -260390
15924 -260390 -208869 -345198 74963 -72816 -157560 -16499 -121997 -165436 -83121 -9334 245620
15912 -217101 165052 -302176 126274 10884 76011 6559 154851 108822 -209751 34035 291639
15901 291639 217704 -248538 -9234 61238 -41333 -116692 328597 -9335 -168109 -75974 14797
15889 102653 -199714 -68856 175892 -250821 -129745 -247012 209549 14916 159047 214082
15879 214082 -215031 192955 -118214 294357 -236236 -218583 49831 -101835 -51892 44956
15868 -211 -169531 100901 196713 124343 -30301 -145598 -272601 -107947 -224443 -260063 147577
15856 92090 1031 -188388 -162113 -214791 131940 90067 -77690 39380 -181157 41492 -131678
$$ packed form
15935A32555i445C8340L7278l2064b33469J10968C7676P7724O8986c3894k26496
15924b60390N1521j36329G4963g2816q4744a6499j05498m3439Q2315i334B45620
15912b17101A65052c02176A26274A0884O5127F559J48292m6029b09751C4035K57604
15901B91639p3935b48538i234F1238d1333p5359C28597i335j58774g5974A4797
15889A02653a99714f8856A75892b50821J21076j17267B09549A4916J44131N5035
15879B14082b15031A92955a18214B94357b36236J7653D9831a01835M9943D4956
15868b11j69320A00901R5812p2370c0301j15297j27003a07947j16496l5620A47577
15856I2090A031a88388K6275n2678A31940m1873g7690C9380a81157D1492a31678
$$ plain form
15844 -21214 67649 -221755 364626 -249231 -289467 227860 -182331 -151160 -249257 -75389 83825
15832 22127 108556 -73950 -118563 -375585 151498 45860 191457 -44663 -22220 363885 108997
15820 325952 -448904 56674 289621 63822 -148938 134633 -33756 -163277 -380240 -108389
15809 274360 -83469 57985 -82383 65092 111733 140314 110550 13949 296656 -87406 399045
15797 64414 22481 19502 -223147 190448 -28563 315089 204487 13839 -190805 25952 922
15785 -194772 87918 182096 4544 -170399 42108 103054 115815 -195465 74377 -109400 -124623
15774 -124623 -191605 -49123 -230660 -288963 136878 -94764 220519 -62262 65719 289660 320466
15763 320466 -3268 -84136 200712 102016 -117430 135695 -184573 -2151 47679 -43924 -24373
$$ packed form
15844b1214F7649b21755C64626b49231m0236B27860a82331L1171r8097g5389H3825
15832B2127Q6429g3950m4613k57022A51498D5860J45597d4663b2220C63885A08997
15820C25952d48904E6674K32947F3822a48938A34633c3756j29521k16963a08389
15809B74360h3469E7985h2383F5092M6641K8581k9764A3949K82707h7406C99045
15797F4414B2481k979b23147A90448b8563C15089j10602A3839a90805B5952I22
15785a94772H7918R4178D544a70399D2108O0946J2761a95465G4377a09400j5223
15774a24623o6982d9123j81537n8303A36878i4764B20519f2262F5719K23941L0806
15763C20466c268q0868B00712r8696a17430A35695a84573b151D7679d3924J9551
$$ plain form
15752 -24373 142352 12888 13712 18698 35839 -152563 13056 -6164 63615 15371 -197213 77740
15739 -108973 -129799 -47877 -31734 278742 121354 128107 -10237 268853 -320773 7315 -282531
15727 66620 -7698 -128216 -253312 -313724 182710 156915 -135298 238595 192984 -55022 -258945
15716 -258945 -278900 -73364 -89919 199557 -187543 -646 2286 -278965 -34764 -191522 86208
15704 265792 -260699 5171 -131579 148772 -244436 -96255 12082 -71125 -136315 -170835 -74644
15692 -200974 12313 187957 62233 -18277 -123115 -188363 1614 -20511 -116233 200432 192229
15681 192229 -17089 137761 166400 97481 -27894 72688 118251 -347389 -197450 -328520 -9338
15669 -149159 -199003 57855 121314 128363 113171 -37841 -79393 3422 216238 -58050 13326 -226122
$$ packed form
15752b4373A42352A2888Q24M986J7141a52563A3056f164F3615A5371a97213G7740
15739a08973k0826d7877J6143B78742A21354O753a0237B68853c20773G315b82531
15727F6620g698j20518j25096o0412A82710k5795a35298B38595m5611e5022k03923
15716b58945j9955g3364j6555A99557a87543f46B286b78965c4764j56758H6208
15704B65792b60699E171a31579A48772b44436i6255A2082g1125o5190l4520g4644
15692b00974A2313J75644F2233a8277j04838o5248A614b0511r5722B00432q203
15681A92229a7089A37761K8639o8919b7894G2688M5563c47389J49939j31070i338
15669a49159m9844E7855O3459P049j5192c7841m1552C422K12816e8050A3326b26122
$$ plain form
15656 -180210 -195211 -153619 -168351 301613 -36663 20936 -117820 -135208 -90863 -278902 242747
15644 -79855 -136998 -281726 -99007 -318389 183013 25965 -179340 -25246 -72931 111682 50957
15632 -56085 173396 -22969 346685 332749 -161545 -252436 -462674 -3150 89226 538342 -281101
15620 207888 -57397 -18014 -170955 195660 133591 140570 48418 60006 133556 -287435 276011
15608 -22770 -69977 -305418 28559 80935 36536 266589 38988 161833 1077 -55161 -37440
15597 -37440 -207393 208677 -329870 362893 -196444 170178 74042 -257784 -105729 -274853
15587 -274853 -466861 -4390 179747 -409777 128452 -74644 -57927 -170253 -106314 -202942 -167109
15576 -167109 -186844 203040 -187383 3772 171016 365801 248086 -12060 -95864 -17449 -269511
$$ packed form
15656a80210j5001M1592j4732C01613c6663B0936a17820j7388M4345j88039B42747
15644g9855n7143j44728i9007k19382A83013B5965a79340b5246m7685A11682E0957
15632e6085A73396b2969C46685j3936a61545r0891k10238c150H9226M49116b81101
15620B07888e7397a8014j52941A95660o2069O979D8418J1588P3550b87435B76011
15608b2770m7207k35441B8559N2376C6536K30053C8988J22845A077e5161J7721
15597c7440j69953B08677c29870C62893a96444A70178G4042b57784a05729j69124
15587b74853j92008d390A79747d09777A28452g4644J6717j12326O3939r6628L5833
15576a67109j9735B03040a87383C772J67244J94785j17715a2060q3804a7449k52062
$$ plain form
15565 -269511 -51478 -192702 -179669 26740 186265 -124732 137976 -96113 37671 84466 87772
15554 87772 112726 73260 165846 -132016 -30313 192314 -123364 187214 153729 -131311 72555
15542 272415 245240 -45138 -258047 -108732 35137 27995 117393 -419354 -326065 -202669 -219239
15531 -219239 -5905 -122209 -63504 167954 -33299 185031 7030 167027 112847 -143560 145565
15519 158577 162222 8063 -45235 -380510 223389 -143219 -55878 2133 286173 356701 3803
15507 43640 9932 178562 112316 58784 202853 89016 259832 -78822 284806 236075 61004
15495 1389 153492 47049 68224 -15988 23333 341948 175904 190148 54849 45876 402206
15484 402206 -20488 -2966 -111727 173327 181411 99454 -26497 -22643 349304 -144011 260139
$$ packed form
15565b69511e1478j41224J3033B6740J59525a24732A37976i6113C7671M6795L306
15554H7772K4954l9466R2586a32016c0313A92314a23364A87214l3485a31311G2555
15542B72415k7175d5138k12909a08732C5137p142Q9398d19354R3289J23396j6570
15531b19239e905j16304N8705A67954c3299A85031G030J59997n4180a43560A45565
15519A58577L645H063d5235l35275B23389a43219e5878B133K84040P0528C803
15507D3640I932J68630o6246n3532J44069H9016J70816g8822B84806m8731F1004
15495A389J52103D7049K1175a5988B3333L18615j66044J4244E4849q973L56330
15484D02206b0488b966j08761A73327Q084q1957b6497L854C49304a44011B60139
$$ plain form
15472 262526 -89603 5322 243522 -315228 158532 23045 -64765 40728 416548 -183435 352304
15460 168410 392636 330226 308852 481198 422112 719284 328249 190609 239016 -130802
15449 400792 -137332 79805 -238960 149529 -209599 111528 120056 62575 -89965 -188560 149237
15437 18031 601557 -99245 74712 -243569 297571 -59571 202623 276823 -20105 215281 369683
15426 369683 1017612 374072 1187468 826689 353126 622516 470055 67677 174765 88866
15416 88866 164323 -47806 11787 -21990 -116680 238160 -140152 134386 190279 -274355 67348
15404 -235814 66610 -160235 -222619 167450 129902 -147357 -92867 108737 -171897 -251764
15394 -251764 -108831 -34294 162982 32617 -93740 29978 75483 304851 -186005 -5464 89689
$$ packed form
15472B62526h9603E322K38200c15228A58532B3045f4765D0728L75820a83435C52304
15460A68410K24226o2410k1374J72346n9086K97172C28249j37640M8407a30802
15449D00792a37332G9805b38960A49529b09599A11528Q528n7481h9965r8595A49237
15437A8031N83526i9245G4712b43569B97571e9571B02623P4200b0105B15281J54402
15426C69683O47929C74072Q13396l60779C53126K69390j52461F7677J07088q5899
15416H8866P5457d7806A1787b1990r4690B38160a40152A34386N5893b74355F7348
15404b35814F6610a60235o2384A67450l7548a47357N4490A08737a71897p9867
15394b51764a08831c4294A62982C2617i3740B9978M5505K29368a86005e464H9689
$$ plain form
15382 -89036 5194 -199873 170466 29321 -19898 82513 -406362 -46192 60314 90994 143699
15371 143699 245606 46648 244118 161510 -134404 1134 222000 -207013 6570 64919 214
15359 -140548 292095 227476 104633 -32700 80793 -158028 -18618 -14132 -386619 179957 31417
15347 23682 -73753 -55223 360307 327436 -271880 25759 223707 325821 175750 -261505
15336 317327 -22538 69423 294182 214708 306811 56462 163047 333015 119694 328547
15326 328547 84135 -59856 333274 108509 18093 239504 92204 92009 63231 213562 318780
15315 318780 254069 -98193 108217 315387 -140649 -182711 -93608 92389 2427 254094 262847
15304 262847 -34044 -61057 -63252 -8050 125246 39114 177360 113383 -47717 -4021 240273
$$ packed form
15382h9036E194a99873A70466B9321a9898H2513d06362d6192F0314L0680N2705
15371A43699J01907D6648J97470q2608a34404A134K20866b07013F570N8349B14
15359a40548B92095o4619A04633c2700H0793a58028a8618M486l72487A79957C1417
15347B3682g3753J8530C60307l2871b71880B5759J97948J02114j50071b61505
15336C17327b2538F9423K24759p9474R2103E6462J06585J69968A19694K08853
15326C28547H4135e9856C33274A08509A8093K21411I2204j95k8778J50331J05218
15315C18780o4711i8193A08217K07170a40649m2062Q9103I2389B427K51667Q753
15304B62847c4044k7013k195h050A25246C9114J38246o3977d7717d021B40273
$$ plain form
15292 -75847 -46139 -25211 21265 -2820 -195793 -185544 -262578 -312705 -16917 -108319 75294 227921
15280 227921 -40821 155809 -90415 -117719 34363 100894 1643 1725 47284 -16320 -57944 35293
15267 -19902 123439 396613 312436 -150251 -150247 -275884 140154 25944 -35177 -99610 -11508
15255 222743 427853 -12974 142285 177245 201 89234 319228 402874 -187628 -80454 164127
15243 89683 232340 263463 288906 266417 -57041 62832 28617 165003 129493 149436 480574
15232 480574 402089 325435 548169 843574 1422922 1099598 1370564 1265620 372067 577770
15222 577770 62423 -144490 -447 303469 -32904 -126105 256925 -83446 -48855 147190 190026
15211 190026 69164 -34756 209509 -102906 -108318 144360 33564 197346 -76150 -52298 25348
$$ packed form
15292g5847K9708K0928B1265b820j92973J0249p7034n0127a6917r1402G5294J52627
15280B27921d0821A55809i0415k7304C4363O6531A643Q2M5559a6320m1624C5293
15267a9902A23439K73174q4177a50251Mj25637A40154B5944c5177o4433a1508
15255B22743K05110a2974A42285L4960B01Q9033K29994Q3646a87628h0454A64127
15243H9683J42657L1123K5443k2489e7041F2832B8617J36386l5510J9943L31138
15232D80574p8485p6654K22734K95405N79348l23324K70966j04944C72067K05703
15222E77770F2423a44490d47C03469c2904r3201B56925h3446L4591A47190M2836
15211A90026F9164c4756B09509a02906n412A44360C3564J63782g6150K3852B5348
$$ plain form
15199 17699 -163560 -216223 191093 -82497 -151233 -64776 -63244 230411 -172198 97607 263062
15188 263062 14856 63419 120145 473766 124111 239836 245632 89666 74954 147747 -52669
15176 -27819 315981 85477 155110 261039 487392 341868 -47046 -62042 229109 126000
15166 126000 90687 56382 299554 26799 131134 184162 208364 228305 379017 62236 -293952
15154 -86134 165839 -187637 -31973 -62201 114258 135063 -22971 -16305 -53963 105195 -7325
15142 -19483 -82997 -188289 207748 309714 -75605 -176 468457 279569 -52671 -227288 162272
15130 397279 87510 -111877 70009 -20006 86825 76159 87546 124765 93691 100191 34621
15118 287189 261148 -66184 56632 238288 88881 -47541 71190 46974 75686 527635 277479
$$ packed form
15199A7699a63560n2663A91093h2497o8736f4776J532B30411a72198I7607J65455
15188B63062A4856M8563N6726L53621A24111J15725N796H9666j4712P2793e2669
15176b7819C15981H5477O9633J05929K26353j45524d7046j4996B29109j03109
15166A26000l5313l4305K43172B6799J04335N3028K4202J9941J50712F2236b93952
15154h6134A65839a87637c1973l0228A14258K0805b2971O666l7658A05195g325
15142a9483o3514j05292B07748J01966g5605a76D68457j88888e2671j74617A62272
15130C97279H7510a11877G0009b0006H6825j0666J1387L7219l1074O500C4621
15118B87189k6041f6184E6632J81656H8881d7541G1190k4216K8712M51949k50156
$$ plain form
15107 277479 155118 342265 383065 155520 222160 252679 273400 135247 165349 -15333 167222
15095 -48043 13312 -227554 -1363 -2584 349094 -5895 131686 316799 -59959 346168 123423
15083 51523 -314490 333215 94035 -41535 265563 56203 153062 -124967 167447 -212318
15072 312574 324545 50633 234961 207044 207355 -68522 38185 -3279 258730 227365 -32075 -126767
15060 -126767 -48919 54737 307942 263101 29526 238472 161986 253105 101593 187356 66599
15048 270162 402504 62881 183053 -71843 -22773 73236 207907 109001 257974 280197 466002
15037 466002 -26588 -28617 150574 130983 198645 423897 293409 501205 135336 348825
15027 348825 138441 245413 126847 244470 385704 90787 220883 121015 524706 318918
$$ packed form
15107B77479j22361J87147M0800A55520O6640L0519K0721A35247L0102a5333A67222
15095d8043A3312b27554a363j221C49094e895A31686J85113e9959C46168A23423
15083E1523c14490C33215I4035d1535B65563E6203R6859a24967A67447b12318
15072C12574J1971E0633J84328k7917L11f8522C8185c279B58730l1365c2075r4692
15060a26767d8919E4737K53205m4841B9526K08946p6486R1119A01593Q5763F6599
15048B70162J32342F2881J20172g1843b2773G3236J34671r8906J48973K2223J85805
15037D66002b6588k029A50574j9591O7662K25252j30488K07796A35336K13489
15027C48825A38441J06972j18566J17623J41234I0787J30096r9868M03691k05788
$$ plain form
15017 318918 184933 434543 520435 529163 463356 656158 657230 272035 270395 365610 285136
15006 285136 207245 533908 346229 200073 769185 417152 316711 884219 212099 456926
14996 456926 165202 393922 471944 638886 579723 318690 360319 304214 447207 412189
14986 412189 198122 637393 638879 361267 503002 510195 522427 360438 251223 378446
14976 378446 75410 357297 505306 65966 415848 419949 381589 148596 794174 594246
14966 594246 566543 667584 899591 661057 688649 681065 425216 639259 534369 407282
14956 407282 551635 381541 678853 426126 476345 352972 526141 421803 -15119 3799
14945 638060 -94516 274176 340230 128651 553262 452956 66332 68956 132241 346308 512027
$$ packed form
15017C18918j33985K49610Q5892Q728o5807J92802J072B72035j640R5215q0474
15006B85136p7891L26663j87679j46156N69112l52033j00441N67508B12099K44827
14996D56926A65202K28720P8022J66942n9163k61033M1629n6105J42993l5018
14986D12189A98122M39271J486k77612J41735P193J2232j61989j09215J27223
14976C78446G5410K81887J48009F5966L49882M101l8360A48596O45578j99928
14966E94246k7703J01041K32007k38534K7592p584k55849K14043j04890j27087
14956D07282J44353j70094K97312k52727N0219j23373J73169j04338a5119C799
14945F38060i4516B74176O6054A28651M24611j00306F6332K624O3285K14067J65719
$$ plain form
14934 512027 114357 722752 614073 -41049 -69678 287029 723401 590537 697407 496532
14924 496532 190482 244310 306999 145712 370672 401650 717754 598535 303110 831227
14914 831227 946433 1132747 769908 1212723 1324354 1167409 1550635 1703706 1612130 1204978
14904 1204978 1168484 1323506 1782204 1981059 1982885 1752938 1439248 1079085 1301750 1286902
14894 1286902 779248 807715 494929 327507 480344 363952 331992 476813 495274 463962
14884 463962 271422 413156 729569 317497 338653 159923 388633 216259 129272 210420
14874 210420 606222 176287 331462 265745 582190 596415 784003 737903 532945 831837
14864 831837 537572 748123 919044 985994 769275 454112 448735 647671 319027 519559
$$ packed form
14934E12027A14357O08395j08679d1049k8629B87029M36372j32864J06870k00875
14924D96532A90482N3828O2689A45712K24960L0978L16104j19219k95425N28117
14914H31227J15206J86314l62839M42815J11631j56945L83226J53071r1576m07152
14904A204978l6494J55022M58698J98855J826k29947l13690l60163K22665j4848
14894A286902n07654K8467l12786j67422J52837j16392l1960J44821J8461l1312
14884D63962j92540J41734L16413C17497K1156A59923K28710j72374q6987Q1148
14874B10420L95802A76287J55175o5717L16445J4225J87588m6100k04958K98892
14864H31837k94265K10551J70921O6950k16719l15163n377J98936C19027K00532
$$ plain form
14854 519559 609129 598096 532001 721477 755822 780828 721788 729535 691643 483470 514923
14843 514923 729767 489282 31660 280787 738635 360113 744613 701184 505725 372809
14833 372809 613766 285001 379366 621312 651227 541305 914257 983024 841466 889090
14823 889090 787909 839478 1127560 992725 761578 480912 298307 615313 580180 164941
14812 416008 151161 471221 572241 656734 670362 940528 575951 710477 368573 784385
14802 784385 843488 642882 652729 376586 683132 627573 1014225 540800 740641 601686
14792 601686 437384 666548 873251 758552 1028773 791093 1002466 587991 497023 529623
14782 529623 436341 625416 565904 435875 252930 363021 526117 349432 550462 582803
$$ packed form
14854E19559Q9570j1033o6095J89476L4345K5006n9040P747l7892k08173L1453
14843E14923K14844k40485C1660K49127M57848C60113L84500m3429j95459j32916
14833C72809K40957B85001R4365K41946K9915j09922L72952O8767j41558M7624
14823H89090j01181N1569K88082j34835k31147k80666j82605L17006l5133A64941
14812D16008A51161L20060J01020Q4493J3628K70166l64577J34526l41904M15812
14802G84385N9103k00606R847k76143L06546n5559L86652m73425J99841j38955
14792F01686j64302K29164K06703j14699K70221k37680K11373m14475r0968L2600
14782E29623r3282J89075n9512j30029j82945J10091J63096j76685K01030L2341
$$ plain form
14772 582803 765161 694497 681421 715663 374388 659490 617226 527811 727618 540781
14762 540781 781632 355981 816719 508414 742339 927043 841765 672802 725473 645004
14752 645004 865906 498698 708936 465212 316121 414977 452055 673931 694747 233963
14741 625796 789627 689991 943823 616205 559106 325463 460430 534943 591701 680370
14731 680370 461478 427105 509096 275474 864196 692036 686152 390824 827462 422174
14721 422174 739981 875994 753038 753988 835539 827068 635742 1034657 935447 1306559 1421112
14710 1421112 1456352 1659813 1540866 1480077 1120595 1169295 658250 1300735 719420 679708
14700 679708 1002742 628426 913727 731062 870537 992444 708948 1529942 824137 721038
$$ packed form
14772E82803J82358p0664j3076L4242l41275K85102m2264q9415J99807j86837
14762E40781K40851C55981M60738l08305K33925J84704q5278j68963N2671q0469
14752F45004K20902l67208K10238k43724j49091R8856L7078K21876K0816B33963
14741F25796J63831r9636K53832l27618n7099k33643J34967P4513N6758Q8669
14731F80370k18892l4373Q1991k33622N88722j72160n884k95328M36638m05288
14721D22174L17807J36013j22956R50Q1551q471j91326L98915r9210L71112J14553
14710A421112L5240K03461j18947o0789l59482M8700n11045O42485n81315l9712
14700F79708L23034l74316K85301j82665J39475J21907k83496Q20994p05805j03099
$$ plain form
14690 721038 754034 852695 1379367 1208123 1064998 1555056 1570879 1639245 1552699 1327746
14680 1327746 1115689 1229953 1217735 1197707 1186786 1046499 906278 1040537 680095 445903
14670 445903 736387 853368 937539 954439 788304 904634 642353 876096 842228 661855
14660 661855 735655 759224 457167 854176 844973 657701 395478 693519 928071 879099
14650 879099 820801 1020140 835070 567247 879541 962841 864600 883075 914713 725314
14640 725314 975544 876008 1162340 1514259 1188082 1224213 1170209 1162650 1112920 976463 1028269
14629 1028269 1183884 697927 1082452 1220034 884280 1005412 1223258 1303293 1004369 1169905
14619 1169905 1073786 1184827 750492 1126232 860220 993970 1211241 1186478 1290466 1226147
$$ packed form
14690G21038L2996R8661N26672j71244j43125M90058J5823O8366q6546k24953
14680A327746k12057J14264j2218k0028j0921j40287j40221J34259l60442k34192
14670D45903K90484J16981Q4171J6900j66135J16330k62281K33743l3868j80373
14660F61855P3800K3569l02057L97009r203j87272k62223K98041K34552m8972
14650H79099n8298J99339j85070k67823L12294Q3300r8241J8475L1638j89399
14640G25314K50230r9536K86332L51919l26177L6131n4004p559m9730j36457N1806
14629A028269J55615m85957L84525J37582l35754J21132K17846Q0035k98924J65536
14619A169905r6119J11041m34335L75740k66012J33750K17271k4763J03988o4319
$$ plain form
14609 1226147 1135754 1091934 1387469 1131011 1110596 943299 1226370 1143163 1365622 828206
14599 828206 1193012 1284611 1083249 1417881 1085421 961545 1089286 1563019 1156265 1048274
14589 1048274 1340580 1486061 1227524 1617030 1203583 1283029 1175455 1408639 1367601 1448249
14579 1448249 1649957 1673642 1339283 1617541 1292911 1423444 1556705 1428511 1460326 1626765
14569 1626765 1369624 1671739 1634815 1864352 1606323 1845814 1996728 1539781 1549808 1926180
14559 1926180 1535129 1972448 1996370 1687901 1913139 1996773 1715447 1849564 2217391 2007436
14549 2007436 2108676 2147013 2178472 2551670 2679183 2721075 2942687 2803032 3330047 3404589
14539 3404589 3747675 3982324 4474413 5202011 6495903 8290918 11262727 17135053 25493641
$$ packed form
14609A226147r0393m3820K95535k56458k0415j67297K83071q3207K22459n37416
14599H28206L64806R1599k01362L34632l32460j23876J27741M73733m06754j07991
14589A048274K92306J45481k58537L89506m13447P9446j07574K33184m1038Q0648
14579A448249K01708K3685l34359K78258l24630J30533J33261j28194L1815J66439
14569A626765k57141L02115l6924K29537k58029K39491J50914m56947J0027L76372
14559A926180l91051M37319K3922l08469K25238Q3634k81326J34117L67827k09955
14549B007436J01240L8337L1459L73198J27513M1892K21612j39655N27015P4542
14539C404589L43086K34649M92089P27598J293892J795015K971809N872326Q358588
$$ plain form
14530 25493641 32107245 20403847 11715784 7149032 4889263 4570312 4797604 4133585
14522 4133585 3019142 2420379 2225683 2170417 2135842 2100332 2359557 2116187 2092160 2090204
14512 2090204 1792616 1882967 1887945 2262148 2137682 1863298 2052531 2235035 2207621 1859533
14502 1859533 2144798 1980163 2368104 2278787 2334597 2102355 2382255 2180636 2378946 2481781
14492 2481781 2370469 2475487 2532676 2418534 2639531 2675877 2639851 2578287 2701988 2751031
14482 2751031 2926056 2721785 2840406 2880552 2990748 3018143 3106662 2755477 3176110 3126968
14472 3126968 3181360 3359026 2913895 2948899 3232147 3295980 3423051 3168513 3479780 3351183
14462 3351183 3412995 3088675 3237687 3452093 3599779 3511562 3759209 3920873 3863663 3458482
$$ packed form
14530B5493641O613604j1703398q688063m566752k259769l18951K27292o64019
14522D133585j114443n98763j94696n5266l4575l5510K59225k43370k4027j956
14512B090204k97588R0351M978L74203j24466k74384J89233J82504k7414l48088
14502A859533K85265j64635L87941q9317N5810k32242K79900k01619J98310J02835
14492B481781j11312J05018N7189j14142K20997L6346l6026o1564J23701M9043
14482B751031J75025k04271J18621M0146J10196K7395Q8519l51185M20633m9142
14472C126968N4392J77666m45131L5004K83248O3833J27071k54538L11267j28597
14462C351183O1812l24320J49012K14406J47686q8217K47647J61664n7210m05181
$$ plain form
14452 3458482 3944338 3815778 3849543 4084590 3841811 4108771 4186479 4056271 4714940 4388124
14442 4388124 4514518 4370959 4124114 4495230 4317340 4727505 4342744 4865353 4672909
14433 4672909 4913749 4790211 5211495 5115615 4949025 5194260 5216103 5173342 5183419 5440218
14423 5440218 5465626 5296586 5367863 5703205 5584544 5817441 5659246 5929596 6267667 6177318
14413 6177318 6445987 6166944 6572245 6526078 6329908 6452816 6853908 6955908 6957329 7169969
14403 7169969 7570693 7669173 7542207 7537479 7957001 7651586 7648708 7948578 7985487 8381863
14393 8381863 8742197 8475550 8583627 8717320 8946478 9017291 9535764 9577687 9312048 9732317
14383 9732317 9760134 9992762 9707114 9633767 10043114 10252058 10357360 10567139 10995445 10961180
$$ packed form
14452C458482M85856j28560L3765K35047k42779K66960P7708j30208O58669l26816
14442D388124J26394j43559k46845L71116j77890M10165l84761N22609j92444
14433D672909K40840j23538M21284r5880j66590K45235K1843m2761J0077K56799
14423E440218K5408j69040P1277L35342j18661K32897j58195K70350L38071r0349
14413F177318K68669k79043M05301m6167j96170J22908M01092J02000J421K12640
14403G169969M00724R8480j26966m728M19522l05415k878K99870L6909L96376
14393H381863L60334k66647J08077J33693K29158P0813N18473M1923k65639M20269
14383I732317K7817K32628k85648p3347M09347K08944J05302K09779M28306l4265
$$ plain form
14373 10961180 11487987 11683536 11562854 11905696 11873092 12216463 12501738 12832088 13108605
14364 13108605 13487872 13740713 14211806 14347571 14011406 14679835 14772508 15280359 15417219
14355 15417219 15753609 16272940 16421594 16750980 17416404 17671771 18183142 18455469 18851426
14346 18851426 19186191 19650326 20235735 20472899 20943743 21335170 21492838 22133996 22695630
14337 22695630 23411665 23715404 24416166 24910623 25798321 26093287 26735408 27206385 28293772
14328 28293772 29017071 29613211 30694562 31601431 32435781 33356404 34242485 35461390 36726300
14319 36726300 37552573 38493088 39887975 40907662 42600357 43765443 45138739 46728764
14311 46728764 48239611 49706627 51839913 53386748 55518820 57607734 59922430 62073535
$$ packed form
14373A0961180N26807J95549j20682L42842l2604L43371K85275L30350K76517
14364A3108605L79267K52841M71093J35765l36165O68429R2673N07851J36860
14355A5417219L36390N19331J48654L29386O65424K55367N11371K72327L95957
14346A8851426L34765M64135N85409K37164M70844L91427J57668O41158N61634
14337B2695630P16035L03739P00762M94457Q87698K94966O42121M70977J087387
14328B8293772P23299N96140J081351R06869Q34350R20623Q86081J218905J264910
14319C6726300Q26273R40515J394887J019687J692695J165086J373296J590025
14311D6728764J510847J467016K133286J546835K132072K088914K314696K151105
$$ plain form
14303 62073535 64564449 66856476 69582338 71883237 75146926 78168207 81234555 84727425
14295 84727425 88438953 92486773 96610871 101282696 105839799 110984339 116200399 121864106
14287 121864106 128025482 134617807 141229948 148901464 156650714 164738638 173580864 182729621
14279 182729621 193497465 203593646 214928911 227050946 239351332 252758943 266116235
14272 266116235 280428748 294935112 309684981 324987276 339988036 355457127 370160234
14265 370160234 384376284 397249373 409778447 421515104 432757628 442847353 452110538
14258 452110538 457599883 460066267 462011762 463847079 464775164 457422854 452166995 444760773
14250 444760773 433924201 420901211 407483141 393436620 378570144 363350555 348198967
$$ packed form
14303F2073535K490914K292027K725862K300899L263689L021281L066348L492870
14295H4727425L711528M047820M124098M671825M557103N144540N216060N663707
14287A21864106O161376O592325O612141P671516P749250Q087924Q842226R148757
14279A82729621J0767844J0096181J1335265J2122035J2300386J3407611J3357292
14272B66116235J4312513J4506364J4749869J5302295J5000760J5469091J4703107
14265C70160234J4216050J2873089J2529074J1736657J1242524J0089725R263185
14258D52110538N489345K466384J945495J835317R28085p352310n255859p406222
14250D44760773j0836572j3022990j3418070j4046521j4866476j5219589j5151588
$$ plain form
14243 348198967 333000500 317813963 302712875 288310304 274390442 260685005 247806720
14236 247806720 235561259 222910172 210936470 199147903 188377461 178343163 168530097
14229 168530097 160072748 152035042 144030085 137029920 130594180 124034181 118543769 113033950
14221 113033950 107671713 102770570 97977505 93692225 89694170 86264589 82887786 79103697
14213 79103697 75762491 73132183 69965998 67378357 64929710 62501783 60224870 57783703
14205 57783703 56223313 53879495 52413618 50607963 48935318 47067896 45532790 44638233
14197 44638233 43098887 41743832 40159287 39069700 38577981 36987081 36193147 35156798
14189 35156798 34166265 32882218 32410149 31295913 30606626 30064228 29139328 27915635 27545075
$$ packed form
14243C48198967j5198467j5186537j5101088j4402571j3919862j3705437j2878285
14236B47806720j2245461j2651087j1973702j1788567j0770442j0034298r813066
14229A68530097q457349q037706q004957p000165o435740o559999n490412n509819
14221A13033950n362237m901143m793065m285280l998055l429581l376803l784089
14213G9103697l341206k630308l166185k587641k448647k427927k276913k441167
14205E7783703j560390k343818j465877j805655j672645j867422j535106q94557
14197D4638233j539346j355055j584545j089587m91719j590900p93934j036349
14189C5156798r90533j284047m72069j114236o89287n42398r24900j223693l70560
$$ plain form
14180 27545075 26745818 26338968 25416580 24827106 24542516 23470089 23100524 22661109 21695287
14171 21695287 21638645 21145947 20408137 19878360 19593769 19398650 18781457 18445895 17957704
14162 17957704 17527588 17152808 16817255 16622140 16051921 16029337 15365870 14995377 14853722
14153 14853722 14825756 14634741 13883785 13823756 13457676 13401902 13278156 12792751 12734310 12214940
14143 12214940 12132287 12071223 11749507 11745600 11215568 11512089 11021994 10967851 10808877 10693635
14133 10693635 10318586 10474582 10066943 9850758 9837079 9383523 9457974 9312567 9266856 8931730
14123 8931730 8761212 8888524 8701871 8541676 8136070 8342148 7984585 7982818 7994229 7779526
14113 7779526 7657983 7582523 7432898 7480622 7313507 7315921 6917441 7254076 6762618 6587474
$$ packed form
14180B7545075p99257m06850r22388n89474k84590j072427l69565m39415r65822
14171B1695287n6642m92698p37810n29777k84591j95119o17193l35562m88191
14162A7957704m30116l74780l35553j95115n70219k2584o63467l70493j41655
14153A4853722k7966j91015p50956o0029l66080n5774j23746m85405n8441n19370
14143A2214940q2653o1064l21716l907n30032K96521m90095n4143j58974j15242
14133A0693635l75049J55996m07639k16185j3679m53556P4451j45407m5711l35126
14123H931730j70518J27312j86653j60195m05606K06078l57563j767J1411k14703
14113G779526j21543p5460j49625M7724j67115K414l98480L36635m91458j75144
$$ plain form
14103 6587474 6524554 6603781 6681164 6562915 6302653 6352212 6051602 6156721 6041901 6060037
14093 6060037 5932488 5843297 5705770 5666409 5239792 5600631 5358289 5344103 5840840 5362562
14083 5362562 5482506 5294285 4992644 5378729 4772677 4832970 4954663 4909827 4660296 4646720
14073 4646720 4814957 4479063 4625308 4558833 4361537 4253338 4486300 4296440 4113004 4221928
14063 4221928 4241974 4454677 4093116 4105687 3845628 3936244 3973284 4263632 3906477 3737072
14053 3737072 3705917 3868829 3510159 3566964 3766396 3607984 4055914 3787581 3519578 3524712
14043 3524712 3593171 3915717 3647421 3684646 3804291 3282887 3032530 3027411 3307122 3101358
14033 3101358 3093209 2958591 3261588 2955126 2897443 2818470 2804398 3079041 2937066 2775208
$$ packed form
14103F587474o2920P9227P7383j18249k60262M9559l00610J05119j14820J8136
14093F060037j27549q9191j37527l9361m26617L60839k42342j4186M96737m78278
14083E362562J19944j88221l01641L86085o06052O0293J21693m4836k49531j3576
14073D646720J68237l35894J46245o6475j97296j08199K32962j89860j83436J08924
14063D221928K0046K12703l61561J2571k60059R0616L7040K90348l57155j69405
14053C737072l1155J62912l58670N6805J99432j58412M47930k68333k68003N134
14043C524712O8459L22546k68296L7225J19645n21404k50357n119K79711k05764
14033C101358q149j34618L02997l06462n7683p8973j4072K74643j41975j61858
$$ plain form
14023 2775208 2852916 2878055 2987593 2711668 2892400 2866417 2533185 2830052 2873253 2725455
14013 2725455 2845337 2462327 2324719 2771403 2388099 2043606 2581597 2423596 2401864 2109349
14003 2109349 1846655 2475768 2432969 2430885 2117007 2394783 2292107 2197479 2406866 2051616
13993 2051616 2018402 2083729 1922341 2203908 2094079 2141592 1831880 2232933 2361273 2205747
13983 2205747 2068350 2174435 2442182 2274140 2109812 2788693 2685142 3130455 4226436
13974 4226436 5475669 8166369 12375931 21226480 31811037 24430088 15648114 9967996
13966 9967996 7003877 5317220 4738096 3872609 3605125 3421742 3167407 2649501 2792369
13957 2792369 2665763 2368971 2319663 2236561 1977854 2148446 2164244 2193143 2100346 1953733
$$ packed form
14023B775208P7708K5139J09538k75925J80732k5983l33232K96867M3201j47798
14013B725455J19882l83010j37608M46684l83304l44493N37991j58001k1732k92515
14003B109349k62694O29113m2799k084l13878K77776j02676r4628K09387l55250
13993B051616l3214O5327j61388K81567j09829M7513l09712M01053J28340j55526
13983B205747j37397J06085K67747j68042j64328O78881j03551M45313J095981
13974D226436J249233K690700M209562Q850549J0584557p380949q781974n680118
13966I967996k964119j686657n79124q65487k67484j83383k54335n17906J42868
13957B792369j26606k96792m9308q3102k58707J70592J5798K8899r2797j46613
$$ plain form
13947 1953733 1845829 1872266 2106630 1625496 1837955 1740330 1623706 1949449 1887823 1932932
13937 1932932 1862946 1448876 1530168 1907234 1470440 1523144 1626159 1679837 1795271 1768615
13927 1768615 1704914 1689224 1462215 1426822 1440124 1712103 1447225 1473964 1509630 1410537 1485283
13916 1485283 1218577 1261451 1626113 1424702 1365221 1375983 1414457 1556932 1219869 1210150
13906 1210150 1442413 1334167 1438855 1329870 1363815 1051955 1362684 1480968 1402501 1425888
13896 1425888 1267202 1212382 1111380 1456368 1193423 1477112 1175915 914282 1161785 1257833
13886 1257833 1125168 1179929 1345523 1026218 1191001 1417436 1093942 1183396 1137813 1299229
13876 1299229 1225843 990982 1317406 1021776 1045624 1302201 1018648 1003568 1316088 817239
$$ packed form
13947A953733j07904K6437K34364m81134K12459r7625j16624L25743o1626M5109
13937A932932o9986m14070Q1292L77066m36794N2704J03015N3678J15434k6656
13927A768615o3701j5690k27009l5393J3302K71979k64878K6739L5666r9093P4746
13916A485283k66706M2874L64662k01411n9481J0762L8474J42475l37063r719
13906A210150K32263j08246J04688j08985L3945l11860L10729J18284p8467K3387
13896A425888j58686n4820j01002L44988k62945K83689l01197k61633K47503R6048
13886A257833j32665N4761J65594l19305J64783K26435l23494Q9454m5583J61416
13876A299229p3386k34861L26424k95630K3848K56577k83553j5080L12520m98849
$$ plain form
13866 817239 1150688 953799 1183058 1067776 1030588 797077 1112134 852721 842868 1281965
13856 1281965 935240 1098860 998653 756151 888002 957184 1012177 892654 1022288 1233327
13846 1233327 1062017 1263278 977592 1208680 607301 1029738 823100 1035364 872150
13837 872150 944915 677075 1085987 887524 1268313 1190212 991608 707503 932032 1052454
13827 1052454 1125154 842539 895507 853550 889892 794596 1045831 1149334 1076365 1029144 899806
13816 899806 899561 811935 697111 670950 1081835 919502 927324 866432 583103 1030141 748808
13805 748808 828806 1029194 738461 584045 928333 656249 737998 883897 883742 649577
13795 649577 686703 886981 537910 493108 815231 881716 906056 452236 642821 485157
$$ packed form
13866H17239L33449j96889K29259j15282l7188k33511L15057k59413r853M39097
13856A281965l46725J63620j00207k42502J31851O9182N4993j19523J29634K11039
13846A233327j71310K01261k85686K31088o01379M22437k06638K12264j63214
13837H72150P2765k67840M08912j98463L80789p8101j98604k84105K24529J20422
13827A052454P2700k82615N2968m1957L6342r5296K51235J03503p2969m7221j29338
13816H99806k45q7626j14824k6161M10885j62333P822o0892k83329M47038k81333
13805G48808P9998K00388k90733j54416L44288k72084Q1749J45899j55k34165
13795F49577L7126K00278l49071m4802L22123O6485K4340D52236J90585j57664
$$ plain form
13785 485157 846930 804560 620318 798150 344473 530692 802502 629678 808424 240036
13774 360602 438279 453497 583369 558302 489439 418392 723663 584059 749875 695985 405099
13763 405099 877678 607232 747568 328280 683548 493573 559540 600133 875667 713553
13753 713553 453143 702292 649746 702498 474217 279149 275611 446432 596372 627234
13743 627234 514313 511387 323077 559072 501448 730931 710732 417794 756499 516319
13733 516319 564107 548691 576107 828254 915314 415582 494453 968362 578293 393140
13723 393140 565837 528534 588875 778818 319218 529560 577444 401042 405377 442799 409969
13712 409969 121696 352340 439229 372930 455663 260957 551849 389580 154121 707449
$$ packed form
13785D85157L61773m2370j84242J77832C44473J86219K71810j72824J78746B40036
13774C60602P7677J5218J29872k5067o8863p1047L05271j39604J65816n3890k90886
13763D05099M72579k70446J40336C28280L55268j89975O5967M0593K75534j62114
13753G13553k60410K49149n2546N2752k28281j95068l538J70821J49940L0862
13743F27234j12921k926j88310K35995n7624K29483k0199k92938L38705k40180
13733E16319M7788j5416K7416K52147Q7060D15582P8871M73909l90069j85153
13723C93140J72697l7303O0341J89943C19218K10342M7884j76402M335L7422l2830
13712D09969A21696K30644Q6889o6299Q2733j94706K90892j62269A54121N53328
$$ plain form
13702 707449 525915 413604 714190 192584 408058 587297 381759 476338 529092 628450
13692 628450 484270 475117 387744 438604 343595 -29934 334419 548254 535172 670446 408118
13681 408118 602544 373163 468102 579954 510487 523869 672904 297928 356035 481264
13671 481264 328951 535004 272534 466120 367524 472872 368149 648315 600752 234058
13660 696609 90652 539214 232820 262776 403815 331077 538174 81147 490494 467278
13650 467278 295050 511975 421861 450629 556733 -239989 289233 438584 414810 303833
13640 303833 361886 552107 655579 217420 747170 307522 121733 251961 259492 195290
13630 195290 169769 48445 304513 487309 454786 358757 431583 576340 473507 86954 611415
$$ packed form
13702G07449j81534j12311L00586A92584K15474J79239k05538R4579N2754R9358
13692F28450j44180r153q7373N0860r5009b9934C34419K13835j3082J35274k62328
13681D08118J94426k29381R4939J11852o9467J3382J49035B97928N8107J25229
13671D81264j52313K06053k62470J93586r8596J05348j04723K80166m7563B34058
13660F96609I0652M48562B32820K9956J41039p2738K07097H1147M09347k3216
13650D67278j72228K16925r0114K8768J06104b39989B89233J49351k3774j10977
13640C03833N8053J90221J03472B17420N29750C07522A21733J30228P531o4202
13630A95290k5521D8445K56068J82796l2523r6029P2826J44757j02833H6954N24461
$$ plain form
13619 611415 237385 361616 123853 561121 240858 407144 515213 289905 439601 365698
13609 365698 378090 404148 450595 268449 244330 216740 475720 277198 261039 309720 431804
13598 431804 590858 84229 383001 315831 371330 367983 291538 121936 261200 476525 453656
13587 453656 198539 651172 196211 561417 168847 146975 412167 20561 407922 293760
13577 293760 391659 336065 210592 205558 194929 369355 410053 412898 199400 108837 162146
13566 162146 481052 55636 316299 249841 296655 297932 167132 319860 223899 426710 672511
13555 672511 339906 171231 318609 325813 346519 417706 366302 225384 96707 10271 5917
13544 5917 195956 215730 419175 191509 227924 436763 472943 325290 189311 305990
$$ packed form
13619F11415B37385J24231A23853M37268B40858J66286J08069k25308J49696p3903
13609C65698J2392K6058M6447j82146k4119k7590K58980j98522j6159M8681J22084
13598D31804J59054H4229K98772o7170N5499l347p6445A21936J39264K15325k2869
13587D53656A98539M52633A96211L65206A68847k1872K65192B0561L87361j14162
13577B93760R7899n5594j25473n034j0629J74426M0698K845A99400r0563N3309
13566A62146L18906E5636K60663o6458M6814J277j30800J52728r5961K02811K45801
13555F72511l32605j68675J47378P204K0706P1187n1404j40918I6707A0271m354
13544E917J90039J9774K03445A91509L6415K08839L6180j47653j35979J16679
$$ plain form
13534 305990 393112 -27846 403679 -180894 193661 389066 7520 217811 105821 -64993
13523 391242 -24510 -58262 147754 182315 -96350 315369 198898 259305 406751 480550 292730
13512 292730 504699 134400 281365 292140 175617 150703 226786 295492 316825 205505
13502 205505 270368 125211 321249 558848 473109 -18633 84292 242856 140730 109864
13492 109864 182017 385689 157115 188308 620964 277489 365491 100223 276805 -70831
13481 -128007 231884 25783 355694 477024 372860 462386 188968 37711 507099 459562
13471 459562 -106600 83987 26216 19369 212204 237950 91 390894 273101 257048 290817
13460 290817 371591 -12125 327836 -230919 348327 448299 -100300 216945 227046 208375
$$ packed form
13534C05990Q7122b7846D03679a80894A93661J95405G520K10291A05821f4993
13523C91242b4510l3752A47754L4561i6350C15369j16471O0407J47446P3799j87820
13512B92730K11969A34400J46965J0775j16523k4914P6083O8706K1333j11320
13502B05505O4863A25211J96038K37599q5739a8633H4292J58564j02126l0866
13492A09864P2153K03672A57115L1193M32656B77489Q8002A00223J76582g0831
13481a28007B31884B5783L29911J21330j04164Q9526A88968C7711M69388m7537
13471D59562a06600H3987B6216o847J92835K5746I1L90803j17793j6053L3769
13460B90817Q0774a2125C27836b30919C48327R9972a00300B16945J0101j8671
$$ plain form
13450 208375 266141 -62028 169272 380168 44357 146587 -108409 229574 416074 -140390
13439 154299 96818 -145509 -15407 92273 -49919 346345 68946 299237 276351 54708 291003
13428 291003 71077 309371 146758 127044 288050 425666 166865 393813 281589 204822
13418 204822 268766 -247586 83287 -5589 214850 150128 132086 -11020 282692 157074 117254
13407 117254 -42691 -45977 208734 319962 305897 246551 271781 62942 -206732 268746 139206
13396 139206 199500 65328 -141038 168970 185998 581157 103098 55779 214504 97005
13385 202088 -163867 284703 -298646 -192815 95252 140880 324351 283068 -26698 -755 304472
13373 82977 440420 221680 -27811 196890 -88895 174892 47754 313230 -14690 440428
$$ packed form
13450B08375N7766f2028A69272K10896D4357J02230a08409B29574J86500a40390
13439A54299n7481a45509a5407I2273d9919C46345F8946K30291k2886E4708K36295
13428B91003G1077K38294A46758j9714J61006J37616A66865K26948j12224p6767
13418B04822O3944b47586H3287e589B14850o4722j8042a1020B82692j25618l9820
13407A17254d2691l286B08734J11228j4065n9346K5230F2942b06732B68746j29540
13396A39206O0294F5328a41038A68970J7028L95159A03098m7319J58725I7005
13385B02088a63867B84703b98646J05831I5252M5628J83471m1283b6698g55C04472
13373H2977L57443k18740b7811A96890h8895A74892D7754K65476a4690D40428
$$ plain form
13362 24427 -51307 129815 145769 405424 285467 305947 270744 321623 222875 312889 651442
13351 651442 251367 -6428 114525 -204500 134615 188628 343181 330259 -32618 317637
13340 22429 231527 246529 232044 -99751 43840 241636 42150 142517 215111 364413 362821
13329 362821 48392 114935 135187 346297 54043 69557 185934 292856 125349 255763
13319 255763 -35553 251032 470587 217893 155485 175596 271833 470703 263473 127426
13308 41084 438328 54432 173099 44648 267894 182766 285099 159953 322178 480004
13298 480004 277059 -18390 16774 -29591 464557 424928 -145554 26038 2758 33341 267455
13287 267455 197765 343347 34535 217503 73754 178664 380064 22955 78425 140551 -122989
$$ packed form
13362B4427e1307A29815J5954K59655j19957K0480l5203N0879r8748R0014L38553
13351F51442B51367f428A14525b04500A34615N4013J54553j2922c2618C17637
13340B2429K09098J5002j4485i9751D3840J97796D2150J00367P2594J49302j592
13329C62821D8392O6543K0252K11110E4043J5514J16377J06922A25349J30414
13319B55763c5553B51032K19555B17893o2408K0111R6237J98870k07230A27426
13308D1084L97244E4432J18667D4648K23246q5128J02333j25146J62225J57826
13298D80004k02945a8390A6774b9591D64557l9629a45554B6038B758L0583K34114
13287B67455o9690J45582C4535J82968G3754J04910K01400B2955N5470O2126a22989
$$ plain form
13275 334706 52709 -59389 -18815 41843 18436 252786 239582 267756 131663 101339 64754
13264 64754 178943 177834 -174254 278269 366674 -153615 93933 70085 70498 112323 -203740
13252 139032 -97703 -241510 56694 135819 175426 147842 280398 199954 -196342 112091 175156
13241 175156 151361 208139 172197 73672 -81408 209806 -268425 201189 42130 291315 450378
13230 450378 231769 125971 -123471 -186146 246446 46911 171194 -282818 23518 -72220
13219 -59082 59493 54117 358750 428106 255905 257466 -79395 -34160 236550 86555 206856
13208 206856 355066 161654 -81333 410816 229177 265079 -132693 198636 133151 13343
13197 176661 241210 -100707 140066 -159686 280088 -45839 115256 183695 -112028 326191
$$ packed form
13275C34706E2709e9389a8815D1843A8436K34350j3204K8174A31663l0324l6585
13264F4754J14189j109a74254B78269Q8405a53615I3933k3848M13M1825b03740
13252A39032i7703j43807E6694P9125L9607k7584J32556q0444a96342A12091O3065
13241A75156k3795N6778l5942G3672h1408B09806b68425B01189D2130K49185J59063
13230D50378k18609j05798a23471o2675B46446D6911J24283b82818B3518g2220
13219e9082E9493n376L04633O9356j72201J561g9395c4160B36550H6555J20301
13208B06856J48210A61654h1333D10816j81639L5902a32693A98636o5485A3343
13197A76661O4549a00707A40066a59686B80088d5839A15256O8439a12028C26191
$$ plain form
13186 251188 -226258 383788 221916 323870 -186586 141727 182671 34637 -29770 -235410
13176 -235410 233777 -169160 -142094 375826 -25371 -179595 216455 111841 238940 -146364
13165 99566 -138057 -50527 -239948 -338421 4761 -34698 72321 -8295 -35132 376227 363542
13154 363542 -155291 132435 17001 266777 -120477 -21140 -129997 107521 129556 -202211
13143 425726 -36382 36373 366585 -196986 129591 -87747 147690 -32108 -4985 206823 -76724
13131 -52171 56754 85124 69803 100160 -39679 149025 113948 -17653 103168 -24626 -134559
13120 -134559 42176 139101 -176197 281362 298224 -67504 -49653 254118 14043 69741 -104184
13108 -65282 65812 84438 -149193 158854 334080 -54524 162346 174055 -18996 -82834 -60698
$$ packed form
13186B51188b26258C83788j61872J01954a86586A41727M0944C4637b9770k05640
13176b35410B33777a69160K7066C75826b5371j54224B16455j04614J27099a46364
13165I9566a38057e0527j89421r8473D761c4698G2321h295k6837C76227j2685
13154C63542a55291A32435A7001K49776a20477b1140j08857A07521K2035b02211
13143D25726c6382C6373L30212a96986A29591h7747A47690c2108d985B06823g6724
13131e2171E6754K8370j5321L0357c9679A49025l5077a7653A03168b4626j09933
13120a34559D2176R6925a76197B81362J6862f7504J7851B54118A4043N5698a04184
13108f5282F5812J8626a49193A58854J75226e4524A62346J1709a8996o3838K2136
$$ plain form
13097 -60698 -64825 -273907 -45180 -47469 155358 193824 27103 -53813 57280 -162196 -222156
13086 -222156 155215 -62839 123062 34893 150261 -107982 31046 -26849 -102990 346999
13075 209314 48856 55259 268159 155839 117533 68149 288314 330720 59345 -312460 -74648
13063 192270 -330212 -79552 55799 84234 236854 80069 265132 115721 -39893 -94187 -91639
13052 -91639 -73253 114280 -143835 -169844 5095 221019 299059 22582 244721 63438 -89096
13040 -107175 -144399 157918 106104 -279362 -34679 14206 48504 10376 229760 -106373 -276550
13029 -276550 -76808 221305 -13820 -24764 106480 129606 523205 49348 97217 148604 100791
13018 100791 99929 183066 16147 -5334 175146 73196 -52322 -36421 135644 51056 318076
$$ packed form
13097f0698m127k09082d5180k289A55358L8466B7103e3813E7280a62196n9960
13086b22156A55215f2839A23062C4893J15368a07982C1046b6849p6141C46999
13075B09314D8856O403K12900j12320l8306m9384K20165M2406E9345c12460g4648
13063A92270c30212g9552E5799K8435J52620H0069J85063A15721c9893n4294K548
13052i1639J8386A14280a43835k6009E095K15924P8040B2582K22139F3438h9096
13040a07175l7224A57918n1814b79362c4679A4206L4298A0376K19384a06373j70177
13029b76550g6808B21305a3820j0944A06480K3126L93599D9348M7869N1387m7813
13018A00791q62Q3137A6147e334A75146G3196e2322J5901A35644E1056K67020
$$ plain form
13007 318076 505814 -145069 -287867 -4778 206109 -90782 107489 -31981 375517 306667
12997 306667 464959 375633 189401 94670 76815 465452 -105962 273885 175747 -164304
12986 62146 3080 219613 -59874 419614 -108811 266660 -21202 -11881 -93487 105531 15312
12974 -92403 74657 -34409 268951 -219361 -262061 -135859 153744 -257915 -215436 -142470 -146169
12963 -146169 -97628 -92340 -243737 -56447 272403 150647 -253450 226825 22374 779 321003
12952 321003 37843 371191 176821 -45695 96461 -30718 -82438 -172752 -46609 254218 -321254
12940 163422 132969 303905 -277700 -153420 -216183 -79540 75761 -121496 78179 40340 168387
12929 168387 12897 -33570 111193 -112916 21814 147500 -286619 116008 93891 -40129
$$ packed form
13007C18076J87738a45069j42798d778B06109i0782A07489c1981C75517o8850
12997C06667J58292q9326j86232I4670j7855L88637a05962B73885r8138a64304
12986F2146C080K16533e9874D19614a08811B66660b1202R321q1606A05531A5312
12974i2403G4657c4409B68951b19361m2700J26202A53744b57915M2479P2966l699
12963a46169M8541N288j51397e6447B72403j21756b53450B26825B2374G79L20224
12952C21003C7843L33348A76821d5695I6461c0718n1720r0314d6609B54218c21254
12940A63422l0453J70936b77700J24280o2763g9540G5761a21496G8179l7839J28047
12929A68387A2897c3570A11193a12916B1814J25686b86619A16008k2117d0129
$$ plain form
12918 10482 100946 -173800 -64353 183044 -367757 -18431 -35795 -56858 61769 -206662 -294461
12907 -294461 5101 93645 53871 244772 84380 8857 -186449 108604 378282 114165 256449
12896 256449 28319 7480 -188150 -191975 27482 -316476 -184007 84140 -86229 80545 129301
12885 129301 -330742 -104653 -426043 -27446 -357626 -26469 168263 -8922 -79041 -325876
12875 -325876 -87412 -178657 -99354 -57429 -591951 206025 254371 204275 39785 227159 78197
12863 38582 184727 32759 201880 156395 203879 -302823 -9219 39692 -34401 32031 -226731
12851 86530 65808 49964 -176585 188471 106093 -41384 -464303 -150609 125132 -40613 219327
12839 -312771 -136428 -140957 -61515 -241097 -244132 196900 59120 294879 12956 -206838 -168281
$$ packed form
12918A0482R0464a73800f4353A83044c67757a8431j7364k1063F1769b06662q7799
12907b94461E101Q8544l9774J90901H4380H857a86449A08604K69678A14165J42284
12896B56449B8319G480a88150l825B7482c16476J32469H4140h6229H0545M8756
12885A29301c30742a04653l21390b7446l30180b6469A68263h922p0119k46835
12875c25876h7412r1245P9303M1925n34522B06025M8346n0096C9785J87374G8197
12863C8582J46145C2759J69121m5485M7484c02823i219C9692c4401C2031b26731
12851H6530k0722j5844a76585A88471q2378d1384m22919a50609A25132d0613B19327
12839c12771a36428m529f1515j79582l035A96900E9120K35759A2956b06838L8557
$$ plain form
12828 -168281 34836 99901 -108997 49227 -172392 -46128 -277517 73602 -36326 66027 2554
12816 159038 163178 441475 -69610 10832 13164 -194650 77287 55093 -140659 216211 114543
12805 114543 -186122 43352 -344161 16058 -20830 229424 -38831 190771 -135389 -33282
12794 145139 -207826 -126236 -238571 -190463 -318252 -145387 -123675 -118697 89481 185157 -142002
12782 196620 -50834 -228404 -68399 81887 113250 -206141 30670 57697 -19092 182328 378214
12771 378214 -161440 -9171 173841 283005 -231856 73703 -48253 107992 22703 -242810
12760 -31253 -13401 -93873 -124567 131334 441190 68481 -313167 144438 120866 -205058 -173141
12749 -173141 10863 -345790 -220813 22716 79155 -32099 -258106 -77910 207361 263147 -148823
$$ packed form
12828a68281C4836O5065a08997D9227a72392d6128k31389G3602c6326F6027B554
12816A59038M140K78297f9610A0832K332a94650G7287k2194a40659B16211j01668
12805A14543a86122D3352c44161A6058b0830B29424c8831A90771a35389c3282
12794A45139b07826Q1590j12335M8108j27789a45387K1712M978H9481R5676a42002
12782A96620e0834j77570f8399H1887L1363b06141C0670K7027a9092A82328J95886
12771C78214a61440i171A73841J09164b31856G3703d8253A07992B2703b42810
12760c1253a3401q0472l0694A31334L09856F8481c13167A44438k3572b05058L1917
12749a73141A0863c45790J24977B2716N6439c2099k26007g7910B07361N5786a48823
$$ plain form
12737 -10320 -25675 107779 -216277 -147193 -154361 36837 98458 -315976 275261 -143619 194933
12725 333834 198114 341608 23653 -184337 -6189 -84531 -34427 -60518 156896 -24473 200672
12713 -218454 -290111 191234 -27537 -83177 -238856 47138 54896 -164950 64581 -134293 -77061
12702 -77061 174388 71512 8952 -9540 4092 -56490 341402 88269 253788 -34906 -44083 204780
12689 198447 245440 137052 18431 62946 260672 193926 329 164087 161411 -184343 330906
12677 -70869 -514895 277904 -356031 47638 64964 -46506 -87630 -11646 -284397 -24105 153919
12665 108087 -21872 635808 133217 175096 -30042 241580 42951 393076 -86518 150476
12654 -156956 213086 -176065 -202090 439333 21909 -154691 -24296 38510 -19480 128416
$$ packed form
12737a0320j5355A07779b16277O9084p168C6837O1621c15976B75261a43619A94933
12725C33834j35720J43494B3653a84337f189p8342c4427k6091A56896b4473B00672
12713b18454p1657A91234b7537n5640j55679D7138P758a64950F4581a34293N7232
12702g7061A74388G1512H952i540D092e6490C41402H8269J65519c4906r177B04780
12689A98447M6993j08388A8431M4515J97726o6746C29J63758k676a84343C30906
12677g0869m44026B77904c56031D7638J7326d6506m1124a1646k72751b4105A53919
12665A08087b1872F35808A33217M1879c0042B41580D2951L50125h6518A50476
12654a56956B13086a76065k6025D39333B1909a54691b4296C8510a9480A28416
$$ plain form
12643 252385 36505 -11104 32114 -149283 257109 -6714 122959 -67295 114787 1422 -116967
12631 75378 -220908 88499 -217537 -140393 -70317 -121158 163246 -49664 -39125 240911 -175233
12619 294231 -71585 -152908 -72116 197483 210502 -105184 -4037 146837 -9574 46157 63161
12608 63161 21204 -9556 173206 193434 -36860 545861 284887 56254 11099 178560 254050
12597 254050 185958 -100052 -318966 10555 57884 137107 37832 -239344 66973 -92080 80896
12585 -143533 70577 -325727 -199457 -1687 201222 211610 145659 -27403 165150 -59787 348719
12573 308291 254650 -93693 109400 46974 123777 178260 -55189 -340696 169177 -75657 50851
12561 -85124 6709 -227925 -153785 147119 -253838 -211691 -159417 -127028 -231299 59236 33253
$$ packed form
12643B52385C6505a1104C2114a49283B57109f714A22959f7295A14787A422a16967
12631G5378b20908H8499b17537P7144P0076n0841A63246d9664J0539B40911a75233
12619B94231g1585q1323g2116A97483J3019a05184d037A46837i574D6157J7004
12608F3161B1204i556A73206K0228c6860E45861k60974E6254A1099J67461P5490
12597B54050o8092a00052k18914A0555M7329P9223C7832b39344F6973i2080H0896
12585a43533G0577c25727J26270a687B01222J0388o5951b7403A65150e9787C48719
12573C08291n3641i3693A09400D6974P6803N4483e5189k85507A69177g5657E0851
12561h5124F709b27925P4140A47119b53838M2147N2274L2389j04271E9236k5983
$$ plain form
12550 33253 -134120 -512151 183992 -46612 5955 141722 36017 -27667 103586 -85039 -137829
12539 -137829 -54121 -50454 -99871 -127783 231612 -53723 -236086 297202 126042 -158666 116646
12527 490221 -483627 -12271 -55414 229401 -162138 276025 153158 218125 110873 34566
12516 -95214 59676 -221068 206300 -187599 71741 -107675 -272281 56836 99311 63806 105915
12505 105915 -160986 12609 -130246 -69906 -94567 -329510 97641 232758 -2897 -283625 204495
12493 -32916 -309548 199654 24953 -46322 104685 -119766 206079 177728 -214114 -37884
12482 -36770 -141589 25097 180738 298915 61530 -79361 190216 95379 -165488 -206226 106659
12470 -355910 107514 -211784 -86464 143975 110326 -52212 -12023 118180 -196855 -169719
$$ packed form
12550C3253a34120l78031A83992d6612E955J35767C6017b7667A03586h5039n2790
12539a37829e4121L667m9417k7912B31612e3723j82363B97202A26042a58666A16646
12527D90221d83627a2271m3143B29401a62138B76025j22867O4967j07252C4566
12516i5214E9676b21068B06300a87599G1741a07675j64606E6836M2475l5505M2109
12505A05915a60986A2609a30246O0340k4661k34943I7641J35117b897k80728B04495
12493c2916k76632A99654B4953d6322A04685a19766B06079k8351b14114c7884
12482c6770j04819B5097J55641J18177F1530g9361A90216r4837a65488m0738A06659
12470c55910A07514b11784h6464A43975l3649e2212a2023A18180a96855K7136
$$ plain form
12460 -169719 -168287 -239149 230212 -374368 201804 326710 -276211 66726 -40254 159943
12449 106856 -186902 -286544 184932 -225663 -76186 86827 -111685 -120780 -87961 -3879 97687
12437 145229 -20194 228544 84122 -143366 183224 -208023 231528 95003 -235430 -86599
12426 144159 16126 -31947 -175000 418351 4122 336189 -296898 46633 -43193 28952 76932
12415 76932 329181 -56323 -17942 -218503 -104842 -177117 -22381 -95280 -91076 60580 -120791
12403 -112390 -102296 -84037 -234019 -124439 -220336 -199925 153235 115665 -392893 -99005 -97830
12392 -97830 -160585 336295 -23421 16601 10805 -277964 91920 -42422 -59431 60652 -63541
12380 171679 -454052 -149068 222201 -81502 -279130 30485 -203129 96719 418498 -35992
$$ packed form
12460a69719J432p0862B30212c74368B01804J24906b76211F6726d0254A59943
12449A06856a86902r9642A84932b25663g6186H6827a11685r095L2819c879I7687
12437A45229b0194B28544H4122a43366A83224b08023B31528I5003b35430h6599
12426A44159A6126c1947j43053D18351D122L32067b96898D6633d3193B8952M7980
12415G6932K52249e6323a7942k00561a04842p2275b2381p2899M204F0580a20791
12403a12390J0094J8259j49982J09580r5897K0411A53235l7570c92893i9005J175
12392i7830o2755C36295b3421A6601n796b77964I1920d2422j7009F0652f3541
12380A71679d54052a49068B22201h1502j97628C0485b03129I6719L21779c5992
$$ plain form
12369 -56920 -154077 -163751 163139 103998 210171 233623 181871 -223539 -164539 -12923 38299
12357 -162627 -136166 -253732 201197 164705 -161463 142593 -68454 -289645 -140115 31524
12346 -287364 101517 -5165 -108534 41547 100037 77921 -38059 43859 172605 115521 77197
12335 77197 -164800 200579 152353 244268 69314 -124194 43393 3448 -169356 83195 203637
12324 203637 189733 384081 -20796 193726 -189729 -282782 8447 41010 408868 -2700 368333
12312 434208 498113 318066 -33034 108238 262422 111440 14703 -75646 125244 -85469
12301 208711 -15565 149122 -86133 77870 -188968 -189647 -165858 40381 -338682 -194117 -48456
12289 226177 -76213 6510 -39952 -185666 -145970 70454 -24909 -100041 45094 121657 251688
$$ packed form
12369e6920r7157r674A63139n9141J06173K3452n1752b23539N9000a2923C8299
12357a62627K6461j17566B01197l6492a61463A42593f8454k21191a40115C1524
12346b87364A01517e165j03369D1547N8490k2116c8059D3859J28746n7084l8324
12335G7197a64800B00579m8226R1915F9314a24194D3393C448a69356H3195J20442
12324B03637j3904J94348b0796A93726a89729r3053H447L2563L67858b700C68333
12312D34208O3905j80047c3034A08238J54184A11440A4703g5646A25244h5469
12301B08711a5565A49122h6133G7870a88968o79K3789D0381c38682J44565d8456
12289B26177g6213F510c9952j45714L9696G0454b4909p5132D5094P6563J30031
$$ plain form
12278 251688 21468 187799 -18796 92089 539455 280791 72747 136781 59288 205808 30210
12266 90667 157705 232096 140937 495876 241873 -109997 -180633 193672 243870 73104 39334
12255 39334 197623 206685 107025 -32882 -28923 1730 309420 -119278 181489 280169 322692
12244 322692 190358 205474 135764 145698 -112979 142274 -91759 337151 223150 187749 161325
12233 161325 390141 121378 -32295 -33706 46374 293833 -384324 294223 111157 228374
12223 228374 5158 -134159 22241 199373 99760 191415 34544 296295 41813 488184 200295
12211 108078 103467 -160036 96897 -260828 342454 400404 239811 -1254 164006 112494 13825
12199 228790 244759 213014 171989 245216 131988 -37457 -195283 230046 -139850 178852
$$ packed form
12278B51688B1468J66331a8796I2089M47366k58664G2747O4034E9288J46520C0210
12266I0667O7038P4391r1159L54939B41873a09997p0636A93672N0198G3104l3770
12255C9334J58289R062r9660c2882L959A730L07690a19278A81489R8680M2523
12244C22692j32334J5116o9710R934a12979A42274i1759C37151j14001l5401k6424
12233A61325K28816A21378c2295j411D6374K47459c84324B94223A11157J17217
12223B28374E158a34159B2241J77132r9613R1655C4544K61751D1813M46371B00295
12211A08078m611a60036I6897b60828C42454N7950j60593a254A64006n1512A3825
12199B28790J5969l1745m1025P3227j13228c7457j57826B30046a39850A78852
$$ plain form
12188 506664 183397 -122506 -266202 75160 -15101 98722 90154 -3611 37402 -3746 -69203
12177 -69203 37328 279044 -4067 198023 23200 -82907 143572 164025 61579 194345 57669
12165 130299 -303511 -158470 54904 -303368 187096 -11582 -32354 237486 282081 -40568
12154 186686 30606 -274076 78355 136213 99150 28961 69724 299554 437987 299013 260298
12143 260298 155766 8009 129538 226149 122505 153 69590 -122867 137146 279279 -37087
12131 246408 137693 172566 52589 -7467 327401 -173431 267785 -104306 55517 160850
12121 160850 -153889 49202 54519 -169679 -202810 322889 -20061 -45330 -181993 -19900 205231
12109 -196142 64181 203003 166938 286035 101595 -33606 137690 -62874 121050 296517
$$ packed form
12188E06664A83397a22506j43696G5160a5101I8722q568c611C7402c746o5457
12177f9203C7328K41716d067A98023B3200h2907A43572K0453F1579J32766E7669
12165A30299c03511J45041E4904c03368A87096a1582k0772B37486M4595d0568
12154A86686C0606b74076G8355N7858l7063B8961M0763K29830J38433j38974l8715
12143B60298j04532H009J21529R6611j03644A53O9437a22867A37146J42133c7087
12131B46408j08715L4873E2589g467C27401a73431B67785a04306E5517J05333
12121A60850a53889D9202N317a69679l3131C22889b0061k5269j36663a9900B05231
12109a96142F4181J38822l6065J19097A01595c3606A37690f2874A21050J75467
$$ plain form
12099 296517 19899 56412 143306 -248294 81700 40390 233241 54108 -10797 34024 129195
12088 129195 71018 -27858 -123376 -47494 265757 -18394 244835 -7839 296702 202864 15516
12076 -86921 77565 -72674 -188975 51985 -280450 59164 -20789 5951 -35698 81854 303044
12065 303044 -34884 250698 202675 -121025 168085 249381 -17124 213175 -115190 60763
12054 -18668 -10379 129176 90280 -12690 35767 -140491 259371 221537 245444 -37885 289698
12042 102272 -186179 252273 -191969 251501 265217 80504 -79027 -128778 -120865 173056 -398100
12030 -40897 -216312 272797 -127592 -84128 167891 251246 162159 2972 149586 45228 -35914
12018 -190006 -7299 82257 15914 259775 116079 179253 153598 -48637 -244306 -173909 182700
$$ packed form
12099B96517A9899L6513Q6894b48294H1700D0390J92851E4108a0797C4024R5171
12088A29195n8177b7858r5518d7494B65757a8394B44835g839B96702r3838A5516
12076h6921G7565g2674j16301E1985b80450E9164b0789E951c5698H1854K21190
12065C03044c4884B50698m8023a21025A68085Q1296a7124B13175a15190F0763
12054a8668Q289A29176l8896a2690C5767a40491B59371l7834K3907c7885B89698
12042A02272a86179B52273a91969B51501J3716H0504g9027m9751P913A73056c98100
12030d0897j75415B72797a27592M3464A67891Q3355q9087B972J46614D5228c5914
12018a90006g299H2257A5914K43861A16079O3174k5655d8637j95669P0397A82700
$$ plain form
12006 41977 4207 -347046 197088 234062 112895 133138 267552 49315 -58870 39250 73651
11995 73651 373679 108618 61185 277117 -308226 132404 -40332 9634 -288949 -147243
11985 -147243 -30398 -7570 -182759 47100 149863 -47064 99009 10964 245725 45422 -68789
11973 -450715 97029 -142798 215805 213722 -280967 90659 -316570 -68138 -171458 -27957 -203183
11962 -203183 -4950 6710 129789 1605 -35340 -15108 287432 -28022 -56569 -19715 49895 136839
11950 136839 -176119 58994 -216851 182959 316095 -127134 186009 50038 -131355 255674
11939 -14570 -79434 -287733 -127232 -135185 -166913 -2858 -361647 -219945 -341406 -80760 -42177
11928 -42177 -131759 3033 -212058 250027 114344 14618 -185394 200950 21887 151601 118674
$$ packed form
12006D1977D207c47046A97088L6974A12895K0243J34414D9315e8870C9250L4401
11995G3651L00028A08618m7433K15932c08226A32404d0332I634b88949J41706
11985a47243c0398g570j75189D7100J02763d7064I9009A0964K34761D5422f8789
11973d50715I7029a42798B15805k083b80967I0659c16570f8138j03320b7957j75226
11962b03183d950F710J23079A605c5340a5108B87432b8022k8547a9715D9895Q6944
11950A36839a76119E8994b16851A82959J33136a27134A86009E0038a31355B55674
11939a4570o4864k08299a27232p953l1728b858l58789J41702j21461h0760L8583
11928d2177q9582C033b12058B50027A14344A4618a85394B00950B1887J29714l2927
$$ plain form
11917 118674 123816 -206788 173295 -423981 -129893 -147048 -9752 -28163 -7991 -9723 69612
11905 -214657 128623 226661 -174625 328585 174314 120805 -239170 6007 -81994 103111
11894 -165095 95973 256133 -91544 -357103 278228 -83266 -148717 -94256 333995 307837 44808
11882 32357 -245341 -155938 -236929 -156081 72190 -213184 74653 -102231 -171211 -124657 -256996
11871 -256996 89853 -139305 -311471 440745 217875 -33464 58128 -205612 -72118 364446
11860 -186186 -87884 -110434 -425 162987 -66459 -393762 -225140 234823 -287183 -263132 11095
11848 -17668 -237323 -341526 285879 -43589 313165 -32326 19092 66569 -14773 -454307 25987
11836 -250349 -30461 -97770 136646 -111702 250055 -102810 52155 61490 10580 18163 162239
$$ packed form
11917A18674N142b06788A73295d23981a29893j7155i752j8411g991j732F9612
11905b14657A28623R8038a74625C28585j54271n3509b39170F007h1994A03111
11894a65095I5973J60160i1544k65559B78228h3266o5451N4461C33995k6158D4808
11882C2357b45341Q9403q0991Q0848G2190b13184G4653a02231o8980M6554j32339
11871b56996H9853a39305j72166D40745B17875c3464E8128b05612g2118C64446
11860a86186h7884k2550d25A62987f6459l27303J68622B34823b87183K4051A1095
11848a7668k19655j04203B85879d3589C13165c2326A9092M7477a4773m39534B5987
11836b50349c0461o7309A36646a11702B50055a02810E2155R335A0580P583J44076
$$ plain form
11825 162239 45477 -404249 1552 -39013 16426 -143526 323971 173373 -74499 -51956 -417855
11814 -417855 32030 -368618 -242174 -19295 20551 169897 -106324 -261335 -339120 -303822
11804 -303822 5863 70626 -340572 -44907 247965 -90457 194066 240719 -159025 116420 214688
11793 214688 144031 -212730 -79698 -302097 -173023 -235963 -23102 -346426 -4961 -317422 8698
11781 -266720 -145888 -207610 -206640 -69854 -44267 -79551 -277895 -75338 7539 -99556 -145964 76478
11768 -192023 -81468 -12458 68266 -153851 39997 10761 -258938 -48760 -238370 117328 1035
11756 190778 222078 37908 152500 -88241 -29422 53485 143670 -281536 -404963 -3301 -17995
11745 -17995 200470 186768 -54364 -193232 27054 22633 115946 -251984 27481 118457 -185928
$$ packed form
11825A62239D5477d04249A552c9013A6426a43526C23971j50598g4499K2543l65899
11814d17855C2030c68618J26444a9295B0551J49346a06324j55011p7785L5298
11804c03822E863O4763c40572d4907B47965i0457A94066M6653a59025A16420R8268
11793B14688p0657b12730g9698k22399J29074o2940b3102l23324d961l12461H698
11781b66720J20832o1722R70f9854K5587l5284j98344g5338G539i9556m6408G6478
11768a92023h1468a2458F8266a53851C9997A0761b58938d8760j89610A17328A035
11756A90778L1300C7908J14592h8241b9422E3485R0185b81536j23427c301j4694
11745a7995B00470j3702e4364j38868B7054m421R3313b51984B7481R0976a85928
$$ plain form
11733 53858 -83812 19326 -175749 -64113 -41556 -18958 44758 359151 99889 -161624 85177
11721 231499 9927 119046 227174 -3303 150539 -104318 -222631 199985 13391 -87786 -65629
11710 -65629 -59558 -331462 306566 14239 87536 -135419 63926 -118669 -278552 -31221 79258
11698 -16772 53217 6532 -14000 -205047 -166589 -67599 -25481 72639 92241 -97990 -274320
11687 -274320 -31718 44292 -51294 162375 -1218 308931 -54496 114258 -110534 270272 -254276
11675 -194078 172106 265795 -145113 -48254 173609 -112731 -26508 -170059 171394 238080
11665 238080 293716 211098 -125570 -5036 65230 4528 -200181 98239 48470 243614 57908
11653 255709 -151579 173623 -21688 117860 -95119 323682 -85120 2433 -76656 222967 -10128
$$ packed form
11733E3858h3812A9326a75749f4113K2557a8958D4758L14393I9889a61624H5177
11721B31499I927J09119J08128c303A50539a04318j18313A99985A3391h7786K2157
11710f5629O071k71904C06566A4239P3297a35419F3926a18669j59883c1221G9258
11698a6772E3217F532a4000j91047L8458f7599b5481G2639J9602i7990j76330
11687b74320c1718D4292e1294A62375a218C08931e4496A14258a10534B70272b54276
11675a94078A72106R3689a45113d8254A73609a12731b6508j43551A71394O6686
11665B38080N5636q2618a25570e036F5230D528b00181I8239D8470J95144E7908
11653B55709a51579A73623b1688A17860i5119C23682h5120B433g6656B22967a0128
$$ plain form
11641 -16300 117965 -204608 204145 -112008 213860 246210 110685 77388 -289420 -97539
11630 -60082 -33961 18413 -7051 193005 211242 31055 -309005 157393 -366267 -4513 -84792
11619 -84792 -60867 -90878 -321991 82663 25123 -3732 -31569 -135468 -110390 29963 907 33059
11607 33059 -8446 66802 89518 -33944 -98362 41551 107745 -293064 39353 81886 -192646
11595 11306 183287 326190 136237 220992 -57377 -163431 -207376 113740 -45394 11024 145348
11584 145348 -276462 233344 250690 -240199 -66579 165222 154973 26443 -19237 165487
11573 285485 276767 -103107 142428 154765 168148 273720 242259 124153 251257 118299
11562 27855 181043 161177 21253 -196271 59781 -147714 -228172 110607 -30547 21586 264469
$$ packed form
11641a6300A17965b04608B04145a12008B13860L2350A10685l3297b89420i7539
11630f0082K6121A8413g051A93005J8237C1055c09005A57393c66267d513q0279
11619h4792K3925l0011k31113H2663B5123c732k7837j03899K5078B9963I07L2152
11607C3059h446F6802K2716c3944o4418D1551O6194b93064C9353M2533a92646
11595A1306J71981J42903A36237Q4755e7377j06054m3945A13740d5394A1024J34324
11584A45348b76462B33344J7346b40199f6579A65222j0249B6443a9237A65487
11573B85485q718a03107A42428J2337J3383J05572l1461j18106J27104A18299
11562B7855J53188j9866B1253a96271E9781a47714q0458A10607c0547B1586K42883
$$ plain form
11551 264469 98824 -115441 219441 -67687 -263142 -71461 -99018 63695 118797 107496 45448
11539 133635 184475 -80410 14181 146296 -57571 -254774 47187 -103117 131570 297607
11529 297607 -78909 80733 258654 -148213 -137338 -20252 -179639 14474 -84481 -105856 -279451
11518 -279451 143724 232873 49757 -157891 57600 87477 39324 292986 190017 53031 -373624
11506 -42024 282680 -70327 100853 -158192 -277118 9877 202794 -95163 56496 76151 171831
11495 171831 -145413 -8846 -113746 154076 248597 -249131 314901 190765 99474 -90814
11484 483983 195214 -235490 435183 267269 -19376 128142 53503 206226 100413 34434
11473 138478 88692 -123973 -77585 133160 -242955 -58589 13771 211047 63040 574440
$$ packed form
11551B64469I8824a15441B19441f7687j95455g1461k7557F3695N5102j1301D5448
11539A33635N0840h0410A4181J32115e7571j97203D7187a03117A31570J66037
11529B97607g8909H0733J77921a48213J0875b0252j59387A4474h4481k1375j73595
11518b79451A43724Q9149D9757a57891E7600K9877C9324K53662j02969E3031c73624
11506d2024B82680g0327A00853a58192j18926I877J92917i5163E6496J9655R5680
11495A71831a45413h846j04900A54076R4521b49131C14901j24136r1291i0814
11484D83983A95214b35490D35183j67914a9376A28142E3503J52723A00413C4434
11473A38478m9786a23973M6388A33160b42955e8589A3771J97276F3040N11400
$$ plain form
11463 574440 -64814 255457 191888 326562 179371 388847 155554 -252455 -37031 227780
11452 266456 165739 280578 44090 179338 342432 34988 262298 61018 125575 463906
11442 463906 -87788 74872 -156762 -54561 143953 42129 332431 101887 16743 -213734
11431 137106 -131316 62441 -266475 -122117 219406 -28868 92273 237166 -16103 34500
11420 -51031 33317 129710 -122502 206065 320122 -131256 -37895 -160647 52961 -164523
11409 103839 182214 -283941 -40277 -196958 -260649 -156685 -46951 -278896 -54351 -223284
11399 -223284 -261860 205675 -64509 240525 -169197 406801 252776 -45605 -317677 55221
11388 -248647 -32103 86337 195699 30886 117760 -112883 -24248 34931 84761 7911 -85322
$$ packed form
11463E74440f4814B55457o3569J34674j47191K09476A55554b52455c7031B27780
11452B66456j00717J14839D4090J35248J63094C4988K27310F1018O4557L38331
11442D63906h7788G4872a56762e4561A43953D2129K90302A01887A6743b13734
11431A37106a31316F2441b66475a22117B19406b8868I2273J44893a6103C4500
11420e1031C3317R6393a22502B06065J14057a31256c7895j22752E2961a64523
11409A03839P8375b83941d0277j56681o3691J03964d6951k31945e4351j68933
11399b23284l8576B05675f4509B40525a69197D06801j54025d5605k72072E5221
11388b48647c2103H6337J09362C0886Q6874a12883b4248C4931M9830G911h5322
$$ plain form
11376 -124714 66527 73498 -100886 -188604 -62565 56693 -171043 -265694 -42481 -7304 184334
11364 268026 207590 -18598 84107 246777 -141164 334772 -173873 141162 321046 210410
11354 210410 276000 110651 75330 286749 76823 74074 -215150 -190290 272519 290995 -353838
11342 33754 -4971 46410 133385 16615 -59262 54079 -199654 -124644 -48734 -136224 255263
11330 76153 -213258 -134051 -139895 47971 -96458 39127 -3107 322084 -321879 -189365 144601
11318 -208701 2081 -63907 -96165 13482 274018 -35294 -12094 -13189 136868 544731 107279
11306 12614 14156 -299236 -24915 -346490 -114276 -21685 -271879 23703 -191215 47064 -236764
11294 101354 -211352 78521 144435 -60325 35404 -148882 330540 51840 44320 -282026 -117267
$$ packed form
11376a24714F6527O971a00886q7718f2565E6693a71043r4651d2481g304A84334
11364B68026o0436a8598H4107J62670a41164C34772a73873A41162J79884j10636
11354B10410O5590A10651l5321K11419G6823k749b15150K4860B72519J8476c53838
11342C3754d971D6410Q6975A6615e9262E4079a99654P5010d8734q7490B55263
11330G6153b13258P9207n844D7971i6458C9127c107C22084c21879J32514A44601
11318b08701B081f3907l2258A3482K60536c5294a2094j095A36868M07863A07279
11306A2614J542b99236b4915l21575a14276b1685k50194B3703a91215D7064b36764
11294A01354b11352G8521O5914f0325C5404a48882C30540E1840p520b82026a17267
$$ plain form
11282 -137594 24398 -135464 143479 89085 -237506 59568 85947 225511 -105400 13490
11271 -185459 -224189 1231 -211742 -14095 -85947 114920 169427 -88112 397097 -89850 -106362
11260 -106362 123349 -226792 158340 44277 110074 -92440 -57616 -80606 -67937 30683 -318846
11248 -25760 94616 -373937 51140 181633 64420 -186923 -262310 -114542 187901 -40293 111323
11236 -143776 -46564 -263061 -416342 -295599 160988 -61036 -414727 -162629 309127 -96353
11225 -193655 69697 -69956 125513 -285448 -210606 -161716 -90329 -68524 -253650 104698 19042
11213 149545 3802 -62626 51307 -223851 -95241 18065 5553 -176697 -13515 -334098 6887
11201 94406 9962 -72768 -174773 135431 65480 34008 -58178 -173147 -163247 317714 357877
$$ packed form
11282a37594B4398a35464A43479n4394b37506E9568K6379J39564a05400A3490
11271a85459l8730A231b11742a4095p1852A14920N4507h8112C97097h9850j6512
11260a06362A23349b26792A58340D4277O5797i2440L4824k2990J2669C0683c18846
11248b5760I4616c73937E1140J30493F4420a86923p5387a14542A87901d0293A11323
11236a43776d6564k16497j53281J20743A60988f1036l53691a62629C09127i6353
11225a93655F9697f9956A25513b85448P4842M8890P1387K1805j85126A04698A9042
11213A49545C802f2626E1307b23851i5241A8065E553a76697a3515l20583F887
11201I4406I962g2768j02005A35431F5480l1472e8178j14969R900C17714M0163
$$ plain form
11190 357877 213903 -53572 -3675 -189892 -275666 283499 -76823 -114372 -262292 113810 180372
11179 180372 34725 25100 -88322 211401 229553 191751 -56032 145544 -103887 -268152 -147616
11168 -147616 -262415 -26465 -148818 189677 -264461 134236 218655 80792 126251 53605
11157 -394122 -358713 -146225 166839 -281879 45871 -283305 -74629 -44557 -372828 225094
11146 42759 7851 125796 -111004 -31119 273467 34876 -88149 -33152 -203228 -232423 -134305
11135 -134305 216629 277050 -43348 -156815 219686 -159624 -40215 -127970 151350 27760
11124 58456 321032 -82682 -537413 -195837 141972 -137297 -163716 214927 136362 -98652
11113 -18098 77309 242744 356931 52727 -242651 94430 -48051 -354902 -184819 -56963 219077
$$ packed form
11190C57877j43974e3572c675j86217q5774B83499g6823l7549j47920A13810O6562
11179A80372C4725r625h8322B11401J8152l7802e6032A45544a03887j64265J20536
11168a47616j14799b6465j22353A89677b64461A34236Q4419H0792M5459E3605
11157c94122L5409a46225A66839b81879D5871b83305g4629L0072l28271B25094
11146D2759G851J17945a11004c1119B73467C4876h8149c3152j70076k9195R8118
11135a34305B16629O0421d3348j13467B19686a59624d0215q7755A51350B7760
11124E8456K62576h2682m54731a95837A41972a37297k6419B14927p8565i8652
11113a8098G7309J65435J14187E2727b42651I4430d8051l06851J70083e6963B19077
$$ plain form
11101 -42821 -46820 -221263 91408 -169946 129684 -128860 26870 -20553 3855 -282182 -156587
11090 -156587 228992 -12060 296671 265100 97667 171885 -81843 57654 84997 -14956 50217
11078 61291 101238 424188 -125196 278899 -34292 39918 214453 316310 61027 19828 202164
11067 202164 503411 243953 217940 185621 291704 172640 -181897 102990 69303 104858
11057 104858 143197 75026 301685 352842 154569 220556 77437 478362 175793 176389 254339
11046 254339 213931 256573 276370 410238 411201 474355 210899 249026 528847 403925 636861
11035 636861 562916 670121 347889 606912 434567 894354 702204 455603 302442 349119
11025 349119 609271 588705 506354 432033 486833 452717 636372 548079 475956 877075 807024
$$ packed form
11101d2821l999j74443I1408a69946A29684a28860B6870b0553C855b82182J25595
11090a56587B28992a2060B96671l1571I7667P4218h1843E7654K7343a4956E0217
11078F1291L9947L22950a25196B78899c4292C9918J74535J01857F1027A9828J82336
11067B02164L01247B43953k6013l2319J06083j19064a81897A02990l3687L5555
11057A04858L8339o8171K26659N1157A54569O5987G7437M00925A75793N96P7950
11046B54339m0408M2642J9797J33868R63O3154B10899L8127K79821j24922K32936
11035F36861p3945J07205l22232K59023j72345M59787j92150k46601j53161M6677
11025C49119K60152k0566q2351p4321N4800l4116J83655q8293p2123M01119p0051
$$ plain form
11014 807024 266207 417476 711229 350843 740914 566969 663915 574872 535756 684055
11004 684055 581025 568483 421553 763917 296362 680699 431342 221268 318119 614123
10994 614123 419006 363327 578896 495065 424713 391773 292172 170697 619573 418586
10984 418586 812189 323072 700352 371507 390316 374097 597271 300620 488567 536714
10974 536714 222260 963625 348197 747140 688849 577257 800180 817732 1104646 894968
10964 894968 734279 649104 802518 969706 863187 1028409 1015684 1282826 1427076 1757349
10954 1757349 1719815 2295709 1847864 1720956 1627862 1619158 1289414 1382339 1592402 1451354
10944 1451354 1307067 1292335 1204201 1263979 1325383 1736847 1302221 1284569 1197261 1249487 928135
$$ packed form
11014H07024B66207J51269K93753C50843L90071j73945R6946q9043l9116J48299
11004F84055j03030j2542j46930L42364B96362L84337k49357k10074R6851K96004
10994F14123j95117n5679K15569q3831p0352l2940r9601j21475M48876k00987
10984D18586L93603C23072L77280l28845J8809j6219K23174k96651J87947M8147
10974E36714B22260P41365C48197L98943n8291j11592K22923J7552K86914k09678
10964H94968j60689q5175J53414J67188j06519J65222j2725K67142J44250L30273
10954A757349l7534N75894m47845j26908r3094q704l29744R2925K10063j41048
10944A451354j44287j4732q8134N9778O1404M11464m34626j7652q7308N2226l21352
$$ plain form
10933 928135 640598 827412 850123 261944 556401 -26696 251830 181444 168563 333847
10923 333847 381082 148968 -8940 15841 -36698 164855 287370 124559 -32225 151992 -7724
10911 -162858 85493 -197487 -58501 -50350 -352746 157774 173592 -123696 442890 -215163
10900 -213857 -165762 -225128 -153404 134481 -44976 -7731 -164986 255072 56199 -302656 -129733
10888 -92458 -347014 172378 -327337 250382 -240170 -435893 -41256 -237610 -232519 -240396 141611
10876 -329025 56687 61119 244129 272253 -34170 118783 -9531 -129681 -122859 -267563 174511
10864 19261 126198 17567 -179528 14903 58886 -159562 -174361 -61130 -15402 72610 -222675
10852 -235649 156935 -30568 -37198 2915 -371905 -206320 82702 -63683 -149958 145983 71826
$$ packed form
10933I28135k87537J86814K2711B61944K94457b6696B51830p0386j2881J65284
10923C33847M7235A48968h940A5841c6698A64855J22515A24559c2225A51992g724
10911a62858H5493a97487e8501Q151l02396A57774J5818a23696D42890b15163
10900b13857M8095n9366P1724A34481d4976g731j57255B55072E6199c02656a29733
10888i2458k54556A72378c27337B50382b40170j95723d1256j96354N091p877A41611
10876c29025E6687M432J83010K8124c4170A18783i531j20150O822j44704A74511
10864A9261J06937A7567a79528A4903M3983a59562j4799f1130a5402G2610b22675
10852b35649A56935c0568o630B915c71905J65585H2702f3683q6275A45983G1826
$$ plain form
10840 24663 110351 58531 -427310 68690 250991 -88054 -185256 -320223 -238658 -30402 -64325
10829 -64325 59205 -25685 77504 165307 85256 -119747 -147270 -79937 42475 151748 268876
10818 268876 124033 -104056 -69957 64118 85971 -18697 -309320 -179999 -97770 -182678 148005
10806 248301 131040 -128142 -36066 201192 -153222 -410177 -101886 13854 88906 -97970
10795 -292952 181452 -176375 186037 120435 489690 -413632 -91398 268585 -121694 -456015
10785 -456015 -87577 5519 -114793 -220921 -127870 -266403 -86504 178588 -532895 -287591
10775 -287591 -180736 -119424 2494 99447 79879 -130615 -109718 285643 -172125 115865 -206314
10763 -237325 234620 -405763 6388 -170027 45028 12220 119662 -317509 -164100 133110
$$ packed form
10840B4663Q5688n1820d27310F8690J82301h8054r7202j34967Q1565c0402l3923
10829f4325E9205b5685G7504Q7803q0051a19747k7523O7333D2475J09273J17128
10818B68876A24033a04056L4099F4118K1853a8697k90623J29321Q2229q4908A48005
10806B48301j17261a28142c6066B01192a53222k56955a01886A3854P5052i7970
10795b92952A81452a76375A86037o5602L69255d13632i1398B68585a21694l34321
10785d56015h7577E519a14793j06128R3051j38533h6504A78588e32895K45304
10775b87591J06855O1312B494R6953j9568a30615K0897B85643a72125A15865b06314
10763b37325B34620d05763F388a70027D5028A2220J07442c17509J53409A33110
$$ plain form
10752 24296 -141662 197553 -190341 -243003 51534 -70328 125252 -83139 -208788 -251620 80727
10740 -135643 -52901 155200 -403401 -29692 -236370 -246858 -4438 283491 -148284 60094 226886
10729 226886 21375 -108241 93389 -25771 -81733 -120770 -93470 -81588 -97565 131790 -213614
10717 -155775 47997 166929 -257579 -42255 31008 30887 -116716 71010 257531 -97112 -187510
10706 -187510 -142550 -64868 87990 12871 72546 -66486 53156 82206 -308593 -247032 291205
10694 -188789 7167 85284 -47204 -51646 143776 -36218 105362 127719 -199823 220981 -70023
10682 -19588 228434 -263951 -266603 33178 -249191 -12200 -281497 206182 18193 -402972 101032
10670 -76869 12343 -10318 -181672 -120018 -164552 -158945 -215990 -115353 -61983 -172934 -31532
$$ packed form
10752B4296a41662A97553a90341n2662E1534g0328A25252h3139j25649m2832H0727
10740a35643e2901A55200d03401b9692k06678j0488d438B83491a48284F0094J66792
10729B26886B1375a08241I3389b5771n5962l9037K7300J1882j5977A31790b13614
10717a55775D7997J18932b57579d2255C1008j21a16716G1010J86521i7112r0398
10706a87510M4960f4868H7990A2871N9675f6486E3156K9050c08593O1561B91205
10694a88789G167P8117d7204m442A43776c6218A05362K2357a99823B20981g0023
10682a9588B28434b63951k652C3178b49191a2200k69297B06182A8193d02972A01032
10670g6869A2343a0318j71354O1654m4534N607n7045J00637N3370j10951c1532
$$ plain form
10658 -292182 138669 -103041 47908 37086 -200328 -273302 -29121 -213316 -71398 103092
10647 -400203 -363866 -19136 -247463 -149405 78225 -314654 -163842 -59309 -83562 -50298 -56631
10636 -56631 76571 -237191 85616 296565 -44152 -71803 -90783 -89406 81311 63927 -17641
10624 28976 -90612 87540 19541 -64713 155706 -158418 -64798 31767 141733 -16945 -6882
10612 18750 146404 -70721 174028 -172990 119328 67616 203882 -6675 121529 -306 255165
10600 77767 131955 -186774 -160349 -243378 -17347 -107992 -330670 -218207 -22916 52181 268274
10589 268274 -317032 204459 -88901 -35188 -201922 -202268 -109715 -100694 -21738 -574888 291472
10577 -402 256055 -510452 85600 191244 43319 -288247 161621 -96339 -456470 -179370 -44581
$$ packed form
10658b92182A38669a03041D7908j0822b00328p2974b9121j84195g1398A03092
10647d00203L6337a9136k28327R8058G8225c14654J50812e9309k4253L3264o333
10636e6631G6571b37191H5616K10949d4152k7651j8980J377H1311j7384a7641
10624B8976i0612H7540A9541f4713A55706a58418f4798C1767J09966a6945f882
10612A8750J27654g0721A74028a72990A19328n1712J36266f675A21529c06B55165
10600G7767N4188a86774K6425q3029a7347r0645k22678J12463b2916E2181K16093
10589B68274c17032B04459h8901c5188j66734l46R2553R021b1738n53150B91472
10577d02B56055e10452H5600J05644D3319b88247A61621i6339l60131a79370d4581
$$ plain form
10565 -110921 -160050 -37115 -11026 -4853 -95905 130749 -359772 33971 125965 277175 381265
10554 381265 61241 14043 45666 -195109 -7677 -87363 98656 55044 -20525 -82589 -131564
10543 -131564 144767 -391 259927 -4010 -196905 95878 -409615 62474 94139 -17416 242138
10531 37876 -460730 18920 65822 48400 -42413 26696 -201168 86796 -40357 136544 124937
10520 124937 -282733 -81791 93791 130119 -126150 -28421 131589 -59968 -228133 -292944 145683
10508 155984 122229 -194531 -277838 -232274 -99801 -36102 -172576 -239886 -410605 -3280 -143420
10497 -143420 122466 438071 -156136 -30219 -4043 -151716 223672 35473 201139 129911
10487 129911 43369 104234 -137470 -60395 -36264 180637 -48923 -60556 9313 -11779 -4411
$$ packed form
10565a10921m9129c7115a1026d853r1052A30749c59772C3971R1994J51210J04090
10554C81265F1241A4043L1623a95109g677p9686I8656m3612b0525o2064m8975
10543a31564A44767c91B59927d010j92895I5878d09615F2474L1665a7416B42138
10531C7876d60730A8920M6902j7422d2413B6696b01168H6796d0357A36544j1607
10520A24937b82733h1791I3791L6328a26150b8421A31589e9968j68165o4811A45683
10508A55984l3755a94531q3307M5564i9801c6102j36474o7310j70719c280j40140
10497a43420A22466L15605a56136c0219d043j47673B23672C5473J65666p1228
10487A29911D3369O0865a37470f0395K4131A80637d8923j1633I313a1779d411
$$ plain form
10475 105931 125566 74633 297249 -245074 -212060 8111 -20138 -143493 -38837 -31565 101951
10463 128024 60580 129407 158853 213245 178600 -51108 555705 148665 19762 -132161 -50854
10451 -226453 -59013 11817 109666 -339207 246009 -41130 -148542 179279 -28953 -56302 -235498
10440 -235498 -93883 22999 -252794 -176150 -338332 75301 -77638 29540 -50973 -345069 -207617
10429 -207617 -112065 -91204 -286730 286456 -80515 -68059 4694 -68086 -41201 146576 -207397
10417 82384 -128974 -111765 95011 -341924 44873 -28146 -127138 7780 104378 -17331 -201627
10406 -201627 -192524 13101 -100103 78123 -178002 302143 130839 -59509 304845 -64768 7130
10394 -217910 -185829 5940 -70127 -170014 -53890 -245146 -68476 79975 84358 -196596 -238792
$$ packed form
10475A05931J9635n0933K22616b45074L3014H111b0138j23355c8837P272A01951
10463A28024F0580O8827K9446N4392l4645e1108E55705A48665A9762a32161e0854
10451b26453e9013A1817R7849c39207B46009d1130j07412A79279b8953k7349j79196
10440b35498i3883B2999b52794P6644j62182G5301g7638B9540e0973k94096J37452
10429b07617R5552K0861j95526B86456h0515J2456D694f8086K6885A46576b07397
10417H2384a28974J7209I5011c41924D4873b8146r8992G780R6598a7331j84296
10406b01627R103A3101a00103G8123a78002C02143A30839e9509C04845f4768G130
10394b17910L2081E940g0127r9887e3890j91256f8476G9975M383a96596m2196
$$ plain form
10383 -238792 -43329 75823 294791 -89388 -137025 -48590 278154 -154451 61331 75151 123269
10372 123269 369911 133697 59430 -38509 131492 -47012 77633 269069 -363154 315179
10361 260398 -29581 -154244 262606 -22686 294177 -134195 104609 276073 -50413 322395
10350 251102 93436 316193 366185 14564 333215 173340 235017 303408 253795 -75105 403509
10338 517675 -117803 167726 280453 381124 459985 291066 417248 280680 289542 422127
10328 422127 326190 -246609 434275 312476 91006 182168 115767 -12297 263057 -358797
10317 209052 -26122 176996 341734 46824 64640 -45141 186569 144295 116156 273617 -69167
10305 -136525 -131956 296005 2322 -108318 166201 161942 63433 165769 -4866 497460 -41562
$$ packed form
10383b38792d3329G5823K18968h9388m7637d8590B78154a54451F1331J3820M8118
10372A23269K46642A33697E9430c8509A31492d7012G7633J91436c63154C15179
10361B60398b9581j24663B62606b2686B94177a34195A04609J71464e0413C22395
10350B51102I3436K22757M9992A4564L18651j59875O1677O8391m9613g5105D03509
10338E17675a17803A67726J12727J00671P8861j68919J26182j36568Q862J32585
10328D22127r5937b46609D34275j21799I1006R1162o6401a2297B63057c58797
10317B09052b6122A76996J64738D6824J7816d5141A86569m2274k8139J57461f9167
10305a36525M569B96005B322a08318A66201m259F3433J02336d866D97460d1562
$$ plain form
10293 42319 127479 83749 25670 116972 192354 24754 201461 -113545 -317547 -169508 302471
10281 -222076 108364 177525 -209117 61485 84338 44775 -75504 -288901 -206753 -51135 -147391
10270 -147391 -66587 -278216 -168166 3879 -87530 -68567 -246582 -76357 -403683 -201040 -261756
10259 -261756 -160283 34113 -150788 -114957 73544 415186 -244783 101286 340 264020 -89466
10247 -58591 -510101 198119 -3003 316340 -90296 -124416 -127707 7264 144061 195104 149603
10236 149603 128132 -81232 196436 175414 126790 -102683 -104145 -234392 -291631 124110 93917
10225 93917 -100306 -295375 180947 -75720 -118392 -255738 -132704 112292 -3488 142549
10214 -203385 -67567 -78272 -490522 -117129 -188809 -82948 -171043 -14896 -102912 -56952 -82093
$$ packed form
10293D2319Q5160m3730B5670R1302P5382B4754J76707a13545k04002J48039C02471
10281b22076A08364O9161b09117F1485K2853l9563g5504k13397Q2148e1135r6256
10270a47391f6587k11629J10050C879h7530J8963j78015g6357l27326b01040o0716
10259b61756J01473C4113a50788L5831G3544L41642b44783A01286C40K63680h9466
10247e8591m51510A98119c003C16340i0296l4120l291G264J36797N1043m5501
10236A49603k1471h1232A96436k1022m8624a02683j462j30247n7239A24110l0193
10225I3917a00306j95069A80947g5720m2672j37346J23034A12292c488A42549
10214b03385f7567j0705m12250a17129p1680h2948q8095a4896q8016M5960k5141
$$ plain form
10203 -82093 -110179 -11025 -462781 131030 87337 -331709 -335251 -174554 -171113 -138902 -29249
10191 -122587 127881 118966 4672 56845 -72969 -142315 -126044 -82089 -225479 -62391 323570
10179 -154927 -661177 -172496 290765 -78288 -364307 -169009 -189701 171389 -92435 -233286
10169 -233286 -62782 -163399 -233431 -267704 -74707 -86791 4406 58342 -94636 -166128 -17169
10157 -73439 -247471 -166315 -215728 -198247 -814 119287 -68073 159041 -67107 88261 -363815
10145 -257184 63307 201786 27516 44659 150913 -113075 271246 -239554 -76050 26068
10134 80324 -77817 -119318 35136 -27399 -5766 430208 -230918 -92875 81710 -106473 -43587
10122 -165161 237827 -191434 -74592 151641 -111032 101633 111382 -112105 315437 98950
$$ packed form
10203h2093k8086a1025m51756A31030m3693c31709l542J60697L441L2211b9249
10191a22587A27881q915D672N2173g2969o9346J6271M3955j43390f2391C23570
10179a54927n06250a72496B90765g8288k86019a69009k0692A71389i2435j40851
10169b33286f2782j00617p0032l4273g4707j2084D406N3936i4636p1492a7169
10157g3439j74032Q1156m9413J7481h14A19287f8073A59041f7107H8261c63815
10145b57184F3307J38479B7516J7143J06254a13075B71246b39554g6050B6068
10134H0324g7817m1501C5136b7399e766D30208b30918i2875H1710a06473d3587
10122a65161B37827a91434g4592A51641a11032A01633R749a12105C15437I8950
$$ plain form
10111 -279422 -180677 318542 150696 -143950 210662 25118 28090 -147792 131256 -97875
10100 -145038 30694 133010 156911 193472 -144034 13741 -218411 34459 -97262 -535526 -190176
10088 64549 -207522 -186354 87490 51253 -176648 -27003 -268674 -5277 -228650 -263807 254901
10076 200875 -107914 57958 -13941 -352674 -127479 -212755 240794 -479895 -258099 -521397
10066 -521397 -239901 197807 -70996 -207887 -58509 458708 4919 -62736 15954 86431 30835
10054 130539 36015 279510 -64448 76178 -81217 -204125 -342858 -355566 -268177 -221275 92803
10042 -60233 -194041 63714 -7868 -47124 -71358 -150223 28914 65466 -32403 -79689 72417 -62890
10029 -11338 72041 -106943 130546 31430 142304 8136 -14928 -62629 -95918 -226634 -5394
$$ packed form
10111b79422R8745C18542A50696a43950B10662B5118K972a47792A31256i7875
10100a45038C0694J02316K3901L6561a44034A3741b18411C4459i7262m38264a90176
10088F4549b07522K1168H7490l6237a76648b7003k41671e277k23373l5157B54901
10076B00875a07914E7958a3941l38733a27479q5276B40794d79895K21796k63298
10066e21397b39901A97807g0996j36891e8509D58708D919f2736A5954P0477C0835
10054A30539C6015K43495f4448G6178h1217j22908j38733j2708Q7389M6902I2803
10042f0233j33808F3714g868l9256k4234p8865B8914L6552c2403m7286G2417f2890
10029a1338G2041a06943A30546C1430J10874H136a4928m7701l3289j30716e394
$$ plain form
10017 -37753 -309656 217120 101165 8302 145982 54568 -140525 75362 -79326 -93611 -109259
10006 -109259 -256727 146539 -182395 -176034 314414 229729 71525 -153715 -7204 57135 -29488
9994 -2635 -182406 -158167 -133804 137628 -181259 44664 -335206 223391 30219 -327732 -146654
9982 -191656 -233336 68501 55633 -15561 -145867 -75997 -170770 -6469 -136866 -169447 -102256
9971 -102256 199173 -146946 -129070 -292794 7807 -41025 119146 -43234 -155008 34814 -157193
9959 -359594 238394 -241346 -2582 -1098 112481 -306950 -90303 -107086 -147910 1974 -86609
9947 -369082 -373654 -47297 -245099 243717 59198 29965 225543 -84108 -906 -210547 63202
9935 -217538 -14144 -271438 258255 -26069 -243312 -465841 -106775 84450 74789 -132130 54091
$$ packed form
10017c7753k71903B17120A01165H302J37680E4568a40525G5362g9326j4285j5648
10006a09259j47468A46539a82395O361C14414q4685G1525a53715g204E7135b9488
9994b635j79771K4239K4363A37628a81259D4664c35206B23391C0219c27732a46654
9982a91656m1680F8501j2868a5561j30306O9870r4773f469j30397l2581O7191
9971a02256A99173a46946J7876j63724G807d1025A19146d3234j11774C4814a57193
9959c59594B38394b41346b582a098A12481c06950i0303j6783m0824A974h6609
9947c69082m572d7297j97802B43717E9198k9233J95578h4108i06k09641F3202
9935b17538a4144k57294B58255b6069k17243k22529a06775H4450r661a32130E4091
$$ plain form
9923 173417 48083 -257916 27171 109202 27077 -20601 -53116 273201 269051 -99235 -236793
9912 -236793 111935 -32387 -180386 -261064 -111363 103963 -190548 -55132 -144175 -149898 67341
9900 -51636 156546 -182020 129468 263131 -143407 8922 -116354 -123496 220470 248945 -91060
9888 -70000 -18837 -385873 21467 -2913 -531628 -618 -338344 -89541 -51751 -42337 86927 -248882
9875 113538 291887 -97563 299665 -99162 -67268 121656 -149875 104601 -70860 -233561
9865 -233561 59994 105619 -611179 130037 44235 -177455 -34165 -131952 106905 -143291 -174883
9854 -174883 -75373 41936 -96285 -178406 -90800 101725 191672 -345069 182697 -25957 176770
9842 -44283 -86495 -110845 86894 81522 247811 18029 -51020 -17730 -379135 -376897 -211778 -50845
$$ packed form
9923A73417D8083b57916B7171Q2031B7077b0601l2515B73201m150i9235j37558
9912b36793A11935c2387j47999q0678a11363A03963a90548e5132q9043n723F7341
9900e1636A56546a82020A29468J33663a43407H922a16354p142B20470K8475i1060
9888g0000a8837l67036B1467b913n28715f18l37726h9541L7790R414H6927b48882
9875A13538J78349i7563B99665i9162L1894A21656a49875A04601g0860j62701
9865b33561E9994M5625f11179A30037D4235a77455c4165r7787A06905a43291l1592
9854a74883g5373D1936i6285q2121Q7606A01725Q9947c45069A82697b5957A76770
9842d4283m2212k4350H6894n372J66289A8029e1020a7730l61405K238J65119e0845
$$ plain form
9829 -193582 -23182 -61221 -330586 -50846 -164138 -429046 -177669 -114793 99023 -123433 -240649
9818 -240649 -237347 123853 -218146 -184243 26049 -171461 1171 -171703 -169089 -117750 -258407
9807 -258407 -208612 30375 -121277 99302 -194330 13415 -28406 137338 -35705 -73820 -57748
9796 -57748 56226 114237 28191 -236195 128591 -55844 -67377 -115166 -48908 -181442 64755
9784 -80018 -256698 -118036 27035 -189123 -446919 -286552 22739 -26184 -59092 11855 -102494
9772 -294067 269729 -91850 83784 24635 -97671 -239536 4190 143853 44873 -224092 80706
9760 16954 96256 -190459 171763 9432 39671 -210479 -148618 70211 61100 91036 78005 -60587
9747 -298446 -251103 21172 -71504 -349837 91358 -2890 82312 -75170 -271583 -151327 -86853
$$ packed form
9829a93582b3182l8039k69365e0846j13292k64908a77669O2876I9023a23433j17216
9818b40649L302A23853b18146L3903B6049a71461A171a71703K614N1339j40657
9807b58407M9795C0375a21277I9302a94330A3415b8406A37338c5705l8115J6072
9796e7748E6226N8011B8191b36195A28591e5844j1533m7789d8908j32534F4755
9784h0018j76680a18036B7035a89123k57796J60367B2739b6184l2908A1855a02494
9772b94067B69729i1850H3784B4635i7671j41865D190J39663D4873b24092H0706
9760A6954P9302a90459A71763I432L0239b10479O1861G0211r111K9936j3031f0587
9747b98446M7343B1172g1504k78333I1358b890H2312g5170j96413J20256O4474
$$ plain form
9736 -86853 29739 108593 -226072 -152340 -305765 -286895 -6105 119108 -245038 -289419 36507
9724 -75821 170614 -166172 12856 14291 -377652 -96219 -106892 23600 -47761 -55059 -74996 -115971
9712 -115971 -218755 3839 160394 -123798 -38801 -275755 -151476 150367 -120623 -377281
9702 -377281 98128 108953 -260033 -243007 -158977 -65902 -82917 -62179 -191143 -101799 -386164
9691 -386164 -294939 -176416 -350360 -308594 -106129 -274507 106726 92779 -148451 -183748
9681 -183748 -320818 134323 -17542 149095 -122011 2483 -81907 33836 -21068 -206881 182126
9669 85755 291119 -15267 52480 61237 -134538 37828 60908 -206989 -43531 142784 -99176
9657 -56217 175047 -117018 -54177 -157912 12034 -5158 -273234 -200500 7164 -199259 -219622
$$ packed form
9736h6853B9739P8854b26072P3732j53425J8870f105A19108b45038m4381C6507
9724g5821A70614a66172A2856J435c77652i6219j0673B3600d7761p298j9937m0975
9712a15971j02784C839J56555a23798c8801k36954J24279A50367a20623k56658
9702c77281I8128J0825b60033J7026Q4030f5902j7015K0738j28964Q9344k84365
9691c86164R1225J18523j73944M1766a06129j68378A06726j3947a48451l5297
9681a83748j37070A34323a7542A49095a22011B483h1907C3836b1068j85813A82126
9669H5755K05364a5267E2480Q757a34538C7828K3080b06989d3531A42784i9176
9657e6217A75047a17018e4177j03735A2034e158k68076P2734G164a99259k0363
$$ plain form
9646 -219622 -172787 225024 -129501 17201 24681 83549 -224251 228660 -59820 147160 -69240
9634 -266905 218309 -142767 80985 73430 -184515 172619 -2255 42667 -20749 -31888 -230417
9623 -230417 -146013 -28653 -175649 -139059 -30769 -37674 -25318 122021 -211641 -184278 -160184
9612 -160184 -96224 -35669 -366904 -207758 -8226 -68995 -76315 -237165 120010 -49121 -157810
9601 -157810 -270724 -125950 -179977 -134750 18318 -261944 -297133 57839 48634 -79190 -243783
9590 -243783 -90282 -273249 -62194 105390 -60550 -1237 -94620 113599 -408161 -248692 -195555
9579 -195555 -464000 151022 -200104 185043 189929 -210955 71536 184310 214363 -124074
9568 -183846 -13692 381673 -88651 24382 348262 78201 143421 -68008 -226139 -157904 -333376
$$ packed form
9646b19622M6835B25024a29501A7201P480N8868b24251B28660e9820A47160f9240
9634b66905B18309a42767H0985p555a84515A72619b255D2667b0749j1139j98529
9623b30417Q4404b8653j46996L6590c0769o905J2356A22021b11641K7363K4094
9612a60184O3960c5669l31235J59146h226o0769p320j60850A20010d9121j08689
9601a57810j12914a25950n4027M5227A8318b61944l5189E7839r205g9190j64593
9590b43783i0282j82967f2194A05390f0550a237r3383A13599d08161J59469N3137
9579a95555k68445A51022b00104A85043M886b10955G1536J12774L0053a24074
9568a83846a3692C81673h8651B4382L23880G8201O5220f8008j58131O8235j75472
$$ plain form
9557 -333376 -78231 -146093 194202 163625 -27683 -4418 68608 -58471 -183142 -247847 -74689
9545 109923 162179 -380251 -80473 10037 -92316 136850 236103 -251114 -207786 -224507 -223487
9534 -223487 -155938 -272602 -262275 -182016 -46842 -212467 -98007 -53749 127975 -149142 -58321
9522 112138 -127709 -101597 -54397 70351 130296 -36948 -125764 47570 30405 -295429 26161
9510 179666 195652 84842 -6111 -213688 -103893 -51962 -33179 6281 -79884 8427 270864 -117276
9497 -69385 -155936 71486 -227148 184780 -353618 -288928 -178487 155900 -444539 -136095
9486 -93067 31323 -22849 392764 47272 111893 238305 145995 26597 -148860 101637 -76203
9474 -177402 -219698 45315 50423 80502 53889 9370 -209081 -50312 333038 -101104 -89213
$$ packed form
9557c33376g8231o7862A94202l0577b7683d418F8608e8471j24671o4705g4689
9545A09923N2256c80251h0473A0037i2316A36850R9253b51114M3328j6721J020
9534b23487O7549j16664J0327Q0259d6842j65625i8007M4258A27975a49142e8321
9522A12138a27709K6112M7200G0351N9945c6948q8816D7570j7165b95429B6161
9510A79666J5986H4842f111k07577a03893N1931J8783F281g9884H427K62437a17276
9497f9385q6551G1486b27148A84780c53618O4690J10441A55900d44539a36095
9486i3067C1323b2849C92764D7272O4621J26412r2310B6597a48860A01637g6203
9474a77402m2296D5315N108L0079k6613I370b09081e0312C33038a01104J1891
$$ plain form
9463 -89213 -162745 17984 -152414 25498 31921 89654 -128375 13532 110011 -5944 32036 -150591
9450 -160223 -327798 -20745 -217976 -303805 209992 111446 -129732 80838 -108931 171825
9439 -134921 99010 -216383 -82603 -173471 96121 36672 44321 267959 -106272 98208 -60483
9427 -105242 -157563 -385080 -282295 -125965 110380 -100186 -241336 53468 -439207 -65636
9416 -213026 2907 -232737 -362903 270178 6155 -99765 -176491 -219771 -176983 -114382 11510
9404 11900 59894 102860 -41974 78763 -378420 -201487 34756 -15492 -94426 9813 -52536 -12386
9391 -15027 -52951 124502 1483 -95843 -98005 -128467 47768 -146743 62588 -12067 41711 -27208
9378 -105590 50300 -26579 -304847 339403 309152 98236 -665 -237882 -9322 99445 -351402
$$ packed form
9463h9213p3532A7984a52414B5498O423N7733a28375A3532R6479e944C2036a50591
9450a60223j67575b0745j97231q5829B09992r8546a29732H0838a08931A71825
9439a34921I9010b16383h2603r0868I6121C6672P649K23638a06272I8208f0483
9427a05242n2321k27517J02785a25965A10380a00186j41150E3468d39207f5636
9416b13026B907b32737j30166B70178F155i9765p6726m3280M2788O2601A1510
9404A1900M7994M2966d1974G8763c78420J76933C4756a5492p8934I813e2536a2386
9391a5027l7924A24502A483i5843k162l0462D7768a46743F2588a2067D1711b7208
9378a05590E0300b6579k78268C39403l0251I8236f65k37217i322I9445c51402
$$ plain form
9366 46952 -168659 172348 -316599 54796 -260850 -23365 146612 -33357 -113287 -256448 62934
9354 -381081 214041 -97269 -82978 165984 -116829 1957 -106270 -349658 -6121 -125336 -192385
9343 -192385 -97353 111284 -31800 -339979 -307216 -49593 245301 -28083 6576 176818 -75931
9331 7353 26208 182478 -19065 48145 -590881 -16000 118863 -286119 103444 -20121 -155985
9320 -155985 -77924 -175026 -4514 -94197 6896 -233170 -64074 -141586 -116557 -325305 -318549 -130309
9307 -74120 36384 -108924 130344 68123 -77846 181886 -77314 -99397 -44877 127108 -103536
9295 -66225 128499 -323445 83509 63133 357901 -60972 -120422 -128239 -242541 -311685 128087
9283 23986 167303 -32692 -218717 6137 -235453 86836 -2068 196130 202453 -97817 -171299 -187838
$$ packed form
9366D6952a68659A72348c16599E4796b60850b3365A46612c3357p9930j43161F2934
9354c81081B14041i7269J4291A65984a16829A957a06270k43388f121j19215o7049
9343a92385R5032A11284c1800l08179L2763d9593B45301b8083F576J70242g5931
9331G353J8855J56270a9065D8145e90881a6000A18863b86119A03444b0121j35864
9320a55985g7924r7102d514q9683F896b33170f4074p7512K5029k08748O756a30309
9307g4120C6384a08924A30344o2221g7846A81886g7314k2083d4877A27108a03536
9295f6225A28499c23445H3509k0376K94768f0972n9450p817j14302o9144A28087
9283B3986J43317c2692j86025F137b35453H6836b068A96130O323i7817p3482j6539
$$ plain form
9271 -187838 -249079 -42962 257256 111613 -293268 191392 -158568 -45759 188350 159423
9261 159423 -198392 -24659 21799 -68501 58720 -161866 -64898 -244719 175284 -62532 -78875
9250 -78875 -526421 -205221 -312303 -171976 -142994 27628 -280857 -19097 -345571 28908 67526
9239 67526 163422 267385 -277211 139994 -42143 135426 29714 145746 -164860 -418848
9229 -418848 107547 251769 254859 -140467 -29138 62454 -74704 -379479 -2378 -4379 17323
9217 -322926 90824 -332011 9219 147119 -330147 94702 28109 -400357 -88266 -300821 -283384
9206 -283384 120533 -8298 72005 -89542 -247252 56387 -171704 -89136 -150520 -82104 -15968
9194 233532 193038 338783 -323465 -223638 -100307 110501 -60890 -168287 -169869 82213 180113
$$ packed form
9271a87838o1241d2962B57256A11613b93268A91392a58568d5759A88350k8927
9261A59423a98392b4659B1799f8501E8720a61866f4898j79821A75284f2532j6343
9250g8875m47546b05221j07082J40327K8982B7628b80857a9097l26474B8908L8618
9239F7526R5896J03963b77211A39994d2143A35426B9714J16032a64860k53988
9229d18848A07547J44222L090a40467b9138F2454g4704l04775b378k001A7323
9217c22926I0824c32011I219J37900c30147I4702B8109d00357h8266k12555J7437
9206b83384A20533h298G2005h9542j57710E6387a71704Q2568o1384O8416a5968
9194B33532m0494J45745c23465R9827a00307A10501f0890j07397j582H2213R7900
$$ plain form
9183 180113 48684 -176687 -342627 -108835 -317931 -279066 260186 -193031 58399 -171027
9172 -207165 -220794 -106555 -8692 161603 -152324 78511 -210642 -50198 179415 -230707 151372
9160 9740 -29740 92563 25224 5648 -181888 -20728 -291608 197878 -55960 -187769 -7931 -135924
9148 -135924 42820 -184155 -176361 -16833 -213425 71257 -144845 -90561 232951 -110826 -75176
9137 -75176 24591 -158902 307442 -13059 141285 -84663 -247268 -333238 -278534 -91964 -289701
9126 -289701 117900 -207429 -422450 235620 6006 29993 -45624 49513 -32661 178224 -255967
9114 87735 82466 158818 81088 -7172 -230790 -20155 -163003 31562 -255077 96894 -165907
9102 -50547 -86497 77796 -98947 -266383 -207741 -21744 -259626 -168112 -44378 214768 -214324
$$ packed form
9183A80113D8684a76687j65940a08835k09096L8865B60186a93031E8399a71027
9172b07165j3629a06555h692A61603a52324G8511b10642e0198A79415b30707A51372
9160I740b9740I2563B5224E648a81888b0728k70880A97878e5960j31809g931j27993
9148a35924D2820a84155P794a6833j96592G1257a44845N4284B32951a10826L5650
9137g5176B4591a58902C07442a3059A41285h4663j62605q5970N4704i1964j97737
9126b89701A17900b07429k15021B35620F006K3987d5624D9513c2661A78224b55967
9114H7735n269P6352p7730g172k23618b0155j42848C1562b55077I6894a65907
9102e0547l5950G7796i8947j67436N8642b1744k37882R1514d4378B14768b14324
$$ plain form
9090 148842 294578 -2851 -27599 168436 123249 126938 34479 480 -495 -87267 -197291 47238
9077 243472 -180315 -353470 -460590 103922 -125289 -146305 -283297 20014 -177879 -263463
9067 -263463 -82997 -59929 -150556 -183362 108364 16144 -337250 -170126 136982 -197924 -213082
9056 -213082 -376253 -54983 -80502 109935 -105892 -100800 -323171 146070 -34625 -97575 -57428
9045 -57428 -153874 -105912 -22973 238625 -65970 -81925 -113022 -137722 2047 37341 -60907 -15342
9032 -312874 224248 -92108 -478387 -145968 -34757 -159342 40106 84324 -198805 -382812
9022 -382812 -353867 78260 -102906 155644 -122063 -155702 -324545 -204577 -92958 3149 115580
9011 115580 -7593 -28988 -286347 -34203 -54921 49037 281907 -34009 48213 209117 59737
$$ packed form
9090A48842J45736b851k4748A68436m5187L689C4479D80d95q6772j10024D7238
9077B43472a80315j73155j07120A03922a25289k1016j36992B0014a77879q5584
9067b63463h2997K3068r0627l2806A08364A6144c37250J67124A36982a97924j5158
9056b13082j63171e4983k5519A09935a05892N092k22371A46070c4625o2950M0147
9045e7428r6446M7962b2973B38625f5970j5955l1097k4700B047L5294f0907a5342
9032c12874B24248i2108l86279a45968c4757j24585D0106M4218a98805j84007
9022c82812K8945G8260a02906A55644a22063l3639j68843J19968i2958C149J12431
9011A15580g593k1395k57359c4203k0718D9037K32870c4009D8213J60904E9737
$$ plain form
8999 -63288 65903 -81242 -113724 -348608 901 -37393 -424457 -94502 -44852 -29602 -214711 -297155
8987 -297155 47021 187034 -345850 81434 -460024 -231810 91048 -150969 151914 144357 24682
8975 -2925 -141181 -267503 -284313 -234030 -232391 320390 -140740 154332 123244 -193693 -216863
8964 -216863 61785 -45675 -251534 -282251 -119808 101731 116531 36607 -53230 -108898 -154296
8953 -154296 371107 -224254 -351382 -45569 -259051 -101926 71827 -351445 63911 -394307
8942 -23458 11693 -177762 -153017 353759 151232 -284505 178615 -29202 -266847 87177 -152747
8930 -285304 208293 -103287 -200588 -178609 28595 -92833 210069 -24164 -141179 47123 -242358
8918 -61005 79104 -111532 -207899 -23473 181415 -123524 260489 226679 105530 390212 449877
$$ packed form
8999f3288F5903h1242l2482k34884I01c7393l87064i4502d4852J5250j85109q2444
8987b97155D7021J40013c45850H1434d60024K28214I1048a50969A51914p557B4682
8975b925j38256j26322j6810N0283J639C20390a40740A54332l1088a93693k3170
8964b16863F1785d5675k05859l0717a19808A01731J4800C6607e3230n5668m5398
8953a54296C71107b24254j27128d5569k13482a01926G1827c51445F3911c94307
8942b3458A1693a77762K4745C53759A51232b84505A78615b9202k37645H7177a52747
8930b85304B08293a03287r7301K1979B8595i2833B10069b4164j17015D7123b42358
8918f1005G9104a11532r6367b3473A81415a23524B60489l3810A05530K84682N9665
$$ plain form
8907 449877 515808 1147930 1714473 2666730 5859886 3415874 1640815 1021018 171259
8897 220279 86106 185723 248659 175194 -302414 -182742 -49466 36040 40630 -78871 -193264
8886 -193264 298972 24709 105631 -148213 190650 20476 -61506 -9988 195450 -297001 132836
8874 -112711 -287175 346192 -312381 64797 191163 -34620 -244643 -73168 -127250 235613
8863 119998 7177 -140749 -185066 -137420 138937 -256178 -178563 -156055 -262900 -302468 -63543
$$ packed form
8907D49877O5931O32122N66543R52257L193156k444012A640815o19797A71259
8897B20279H6106R9617O2936p3465c02414J19672d9466C6040M590g8871j14393
8886a93264B98972B4709Q0922a48213A90650B0476f1506i988A95450b97001A32836
8874a12711j74464C46192c12381F4797J26366c4620k10023g3168n4082B35613
8863A19998G177a40749m4317M7646A38937b56178P7615K2508j06845l9568f3543
$$ [...]
##END NTUPLES=NMR SPECTRUM
##END=
