
##TITLE=AC1114_Huila2_5835470_OSrS25wEln
##JCAMPDX= 6.0         $$ Bruker NMR JCAMP-DX V2.0
##DATA TYPE= NMR SPECTRUM
##DATA CLASS= NTUPLES
##ORIGIN= BRUKER
##OWNER= Administrator
$$ 1.72 TOPSPIN		Version 2.1
$$ 2012-03-26 22:34:24.078 -0500  Administrator@TOPSPIN
$$ Compression mode = diff/dup
##.OBSERVE FREQUENCY= 400.13188235
##.OBSERVE NUCLEUS= ^1H
##.ACQUISITION MODE= SIMULTANEOUS (DQD)
##.ACQUISITION SCHEME= undefined
##.AVERAGES= 64
##.DIGITISER RES= 22
##SPECTROMETER/DATA SYSTEM= spect
##.PULSE SEQUENCE= noesygpps1d.comp
##.SOLVENT NAME= COFFEE_meoh
##.SHIFT REFERENCE= INTERNAL, COFFEE_meoh, 1, 14.96813
##AUDIT TRAIL= $$ (NUMBER, WHEN, WHO, WHERE, PROCESS, VERSION, WHAT)
$$ ##TITLE= Audit trail, TOPSPIN		Version 2.1
$$ ##JCAMPDX= 5.01
$$ ##ORIGIN= Bruker BioSpin GmbH
$$ ##OWNER= Administrator
$$ $$ C:\Bruker\TOPSPIN/data/COFFEE/nmr/AC1114_Huila2_5835470_OSrS25wEln/12/pdata/1/auditp.txt
$$ ##AUDIT TRAIL=  $$ (NUMBER, WHEN, WHO, WHERE, PROCESS, VERSION, WHAT)
(   1,<2012-03-26 22:34:19.359 -0500>,<Administrator>,<TOPSPIN>,<go>,<TOPSPIN 2.1>,
      <created by zg
	started at 2012-03-26 22:22:47.906 -0500,
	POWCHK enabled, PULCHK disabled,
       configuration hash MD5:
       1A 1E CE 29 27 FD 77 03 67 4E F0 E3 C4 B2 CB 90
       data hash MD5: 64K
       78 8E 00 A5 35 85 7E 9A E9 DE 1E DD 50 C3 70 CF>)
(   2,<2012-03-26 22:34:22.156 -0500>,<Administrator>,<TOPSPIN>,<proc1d>,<TOPSPIN 2.1>,
      <Start of raw data processing
       efp LB = 0.3 FT_mod = 6 PKNL = 1 PHC0 = 0 PHC1 = 0 SI = 128K 
       data hash MD5: 128K
       77 C2 3F 9D 3F BF F8 65 42 91 AC FF 2D DC EF C6>)
(   3,<2012-03-26 22:34:23.375 -0500>,<Administrator>,<TOPSPIN>,<proc1d>,<TOPSPIN 2.1>,
      <pk PHC0 = 31.70105 PHC1 = 0 
       data hash MD5: 128K
       08 27 95 CD BF D8 09 2B E3 01 5F F6 00 77 9C 8B>)
(   4,<2012-03-26 22:34:23.593 -0500>,<Administrator>,<TOPSPIN>,<proc1d>,<TOPSPIN 2.1>,
      <abs ABSG = 1 
       data hash MD5: 128K
       9F C2 B1 F2 44 59 C5 56 3B 96 13 80 38 D0 7C 0C>)
(   5,<2012-03-26 22:34:23.656 -0500>,<Administrator>,<TOPSPIN>,<proc1d>,<TOPSPIN 2.1>,
      <abs ABSG = 2 
       data hash MD5: 128K
       03 A6 CD BB 79 60 7A 7B 15 FE EB F9 94 27 C2 D9>)
(   6,<2012-03-26 22:34:23.718 -0500>,<Administrator>,<TOPSPIN>,<proc1d>,<TOPSPIN 2.1>,
      <abs ABSG = 3 
       data hash MD5: 128K
       20 34 02 78 50 7D 33 40 13 AA EA 28 66 3C 0D 52>)
(   7,<2012-03-26 22:34:23.953 -0500>,<Administrator>,<TOPSPIN>,<proc1d>,<TOPSPIN 2.1>,
      <abs ABSG = 4 
       data hash MD5: 128K
       A9 33 F9 A6 99 48 7E 67 C6 E2 EB AA A9 10 AE 19>)
(   8,<2012-03-26 22:34:24.000 -0500>,<Administrator>,<TOPSPIN>,<proc1d>,<TOPSPIN 2.1>,
      <abs ABSG = 5 
       data hash MD5: 128K
       A0 96 29 D3 19 DE 10 59 20 89 A1 50 14 1F EC 5E>)
$$ ##END=
$$ 
$$ $$ hash MD5
$$ $$ 79 47 50 A6 4D 49 1F 04 F7 A4 42 DE 78 69 58 45
##$RELAX= 
##$RELAX= 
##$RELAX= 
##$RELAX= 
##$RELAX= 
##$RELAX= 
##$RELAX= 
##$RELAX= 
$$ Bruker specific parameters
$$ [...]
##$TP07= 0
##$TPNAME0= <>
##$TPNAME1= <>
##$TPNAME2= <>
##$TPNAME3= <>
##$TPNAME4= <>
##$TPNAME5= <>
##$TPNAME6= <>
##$TPNAME7= <>
##$TPOAL= (0..7)
0.5 0.5 0.5 0.5 0.5 0.5 0.5 0.5
##$TPOFFS= (0..7)
0 0 0 0 0 0 0 0
##$TUNHIN= 0
##$TUNHOUT= 0
##$TUNXOUT= 0
##$USERA1= <user>
##$USERA2= <user>
##$USERA3= <user>
##$USERA4= <user>
##$USERA5= <user>
##$V9= 5
##$VALIST= <valist>
##$VCLIST= <CCCCCCCCCCCCCCC>
##$VD= 0
##$VDLIST= <DDDDDDDDDDDDDDD>
##$VPLIST= <PPPPPPPPPPPPPPP>
##$VTLIST= <TTTTTTTTTTTTTTT>
##$WBST= 1024
##$WBSW= 4
##$XGAIN= (0..3)
0 0 0 0
##$XL= 0
##$YL= 0
##$YMAX_a= 13364584
##$YMIN_a= -5662739
##$ZGOPTNS= <>
##$ZL1= 120
##$ZL2= 120
##$ZL3= 120
##$ZL4= 120
##$ABSF1= 14.96813
##$ABSF2= -5.5844
##$ABSG= 5
##$ABSL= 3
##$ALPHA= 0
##$AQORDER= 0
##$ASSFAC= 0
##$ASSFACI= 0
##$ASSFACX= 0
##$ASSWID= 0
##$AUNMP= <proc_prof1d_extract.lims>
##$AXLEFT= 0
##$AXNAME= <>
##$AXNUC= <1H>
##$AXRIGHT= 0
##$AXTYPE= 0
##$AXUNIT= <>
##$AZFE= 0.1
##$AZFW= 0.1
##$BCFW= 0
##$BC_mod= 0
##$BYTORDP= 0
##$COROFFS= 0
##$CY= 15
##$DATMOD= 1
##$DC= 0
##$DFILT= <>
##$DTYPP= 0
##$F1P= 0
##$F2P= 0
##$FCOR= 0.5
##$FTSIZE= 131072
##$FT_mod= 6
##$GAMMA= 0
##$GB= 0
##$INTBC= 1
##$INTSCL= 1
##$ISEN= 128
##$LB= 0.3
##$LEV0= 0
##$LPBIN= 0
##$MAXI= 10000
##$MC2= 0
##$MEAN= 0
##$ME_mod= 0
##$MI= 0
##$NCOEF= 0
##$NC_proc= -3
##$NLEV= 6
##$NOISF1= 0
##$NOISF2= 0
##$NSP= 0
##$NTH_PI= 0
##$NZP= 0
##$OFFSET= 14.96813
##$PC= 1
##$PHC0= 31.70105
##$PHC1= 0
##$PH_mod= 1
##$PKNL= yes
##$PPARMOD= 0
##$PPDIAG= 0
##$PPIPTYP= 0
##$PPMPNUM= 2147483647
##$PPRESOL= 1
##$PSCAL= 4
##$PSIGN= 0
##$PYNMP= <proc.py>
##$REVERSE= no
##$SF= 400.13000499348
##$SI= 131072
##$SIGF1= 0
##$SIGF2= 0
##$SINO= 400
##$SIOLD= 131072
##$SPECTYP= <>
##$SREGLST= <1H.CDCl3>
##$SSB= 0
##$STSI= 131072
##$STSR= 0
##$SW_p= 8223.68421052632
##$SYMM= 0
##$S_DEV= 0
##$TDeff= 65536
##$TDoff= 0
##$TI= <>
##$TILT= no
##$TM1= 0
##$TM2= 0
##$TOPLEV= 0
##$USERP1= <user>
##$USERP2= <user>
##$USERP3= <user>
##$USERP4= <user>
##$USERP5= <user>
##$WDW= 1
##$XDIM= 131072
##$YMAX_p= 505101292
##$YMIN_p= -294974464
##$CURPLOT= <Network HP LaserJet P1505>
##$CURPRIN= <$Network HP LaserJet P1505>
##$DFORMAT= <normdp>
##$LAYOUT= <+/1D_H.xwp>
##$LFORMAT= <normlp>
##$PFORMAT= <normpl>
##$SURQMSG= 1
$$ End of Bruker specific parameters
$$ ---------------------------------
##NTUPLES= NMR SPECTRUM
##VAR_NAME=  FREQUENCY,     SPECTRUM/REAL,   SPECTRUM/IMAG
##SYMBOL=    X,             R,               I
##VAR_TYPE=  INDEPENDENT,   DEPENDENT,       DEPENDENT
##VAR_FORM=  AFFN,          ASDF,            ASDF
##VAR_DIM=   131072,        131072,          131072
##UNITS=     HZ,            ARBITRARY UNITS, ARBITRARY UNITS
##FACTOR=    0.0627417313425165, 1,          1
##FIRST=     8223.62146879498, -6270,        -99575
##LAST=      0,             -3926,           -100523
##MIN=       0,             -294974464,      0
##MAX=       8223.62146879498, 505101292,    0
$$ Real data points
##PAGE= N=1
##DATA TABLE= (X++(R..R)), XYDATA
$$ [...]
62951C161837p7109o8493n9247m9934m0615l1003k1009j1290k721M694J1715J8623
62939B835448K4762K9552L3272L6572L9627M2041M3285M3140M2074M1020M0457
62928C251250L9747L7891L4665L0462K5183J8210R463k60j0203k0242l0439m0790
62916C344937n1544o2899p4087q3519r0325r5101r8683j00945j01363j00069r7564
62905B388838r3818q8576q2354p6285p0951o6024o1193n6905n3809n1691m9381
62894A637851m5934m1750l8087l5297l2190k7855k3551k1387k1223k0492j7739
62883A312346j4666j3381j3117j1670r147p790q260q578p503o660p913j0330j1533
62870A181798j1045j0417j0577j0793j0340r612r278r338r423r247q524p069n337
$$ plain form
62951 3161837 3084728 3016235 2956988 2907054 2866439 2835436 2814427 2803137 2800416 2805110 2816825 2835448
62939 2835448 2860210 2889762 2923034 2959606 2999233 3041274 3084559 3127699 3169773 3210793 3251250
62928 3251250 3290997 3328888 3363553 3394015 3419198 3437408 3446871 3446611 3436408 3416166 3385727 3344937
62916 3344937 3293393 3230494 3156407 3072888 2982563 2887462 2788779 2687834 2586471 2486402 2388838
62905 2388838 2295020 2206444 2124090 2047805 1976854 1910830 1849637 1792732 1738923 1687232 1637851
62894 1637851 1591917 1550167 1512080 1476783 1444593 1416738 1393187 1371800 1350577 1330085 1312346
62883 1312346 1297680 1284299 1271182 1259512 1250365 1242575 1234315 1225737 1218234 1211574 1203661 1193331 1181798
62870 1181798 1170753 1160336 1149759 1138966 1128626 1119014 1109736 1100398 1090975 1081728 1073204 1066135 1060798
62857A060798m211m067m515n115n808o517o945o950o643n896m352k209n01k46
62843I96823j440k934l167j265J906L872K563j486n384o559m737j451J500K925
62829I81166K581J252N3p43j655k763l342l127k873l047l003k329k064l342n412
62814I51352o317n326l553k263j710j695k242l289m403n184n594n830o175o781
62800H90990p292p056o259o220p677r239q798o368m232m013m841m930l887k689
62786H07489k072j891j742j446q70K67K130M260N549N142L584K500K741L380L233
62771H32254K669K794L413L309K477K416L792N302N592N033M631M346L502K283
62757H83813J679K299L914N694O433N381L525L241N686R099J0782J0257R372R699
$$ plain form
62857 1060798 1056587 1052520 1048005 1042890 1037082 1030565 1023620 1016670 1010027 1004131 999779 997570 997069 996823
62843 996823 995383 992449 989282 988017 989923 993795 996358 994872 989488 982929 978192 976741 978241 981166
62829 981166 983747 984999 985052 984309 982654 979891 976549 973422 970549 967502 964499 962170 960106 956764 951352
62814 951352 945035 939709 936156 933893 932183 930488 928246 924957 920554 915370 909776 903946 897771 890990
62800 890990 883698 876642 870383 864163 856486 847247 838449 832081 827849 823836 818995 814065 810178 807489
62786 807489 805417 803526 801784 800338 799468 799735 801865 806125 811674 816816 820400 822900 825641 829021 832254
62771 832254 834923 837717 841130 844439 846916 849332 853124 858426 864018 869051 873682 878028 881530 883813
62757 883813 885492 887791 891705 897399 903832 909213 912738 915979 921665 930764 941546 951803 961175 970874
62743I70874J1162J3005J4849J6429J7469J8227J9546K1805K4308K6104K7156
62732A180934K8508L1295L5509L9816M2931M5368M9059N4863O1172O5853O8887
62721A704195P2069P6601Q2270Q8612R5374J01841J07207J11921J17190J22715
62711B679995J26378J26811J24820J21320J15312J05366R1955P6750O0324M2186
62701C671217K2559K390j8124l9218n9852p8079r3228j05974j16078j22226j24764
62690B938623j26291j28133j28294j24823j19368j14857j10947j04920r6519q8666
62680A795805q2787p6768o8886o1082n6072n3173m9461m4091l8995l5701l3538
62669A195251l1141k8023k4330k0398j6912j4527j3000j1409r277o773m097j610
$$ plain form
62743 970874 982036 995041 1009890 1026319 1043788 1062015 1081561 1103366 1127674 1153778 1180934
62732 1180934 1209442 1240737 1276246 1316062 1358993 1404361 1453420 1508283 1569455 1635308 1704195
62721 1704195 1776264 1852865 1935135 2023747 2119121 2220962 2328169 2440090 2557280 2679995
62711 2679995 2806373 2933184 3058004 3179324 3294636 3400002 3491957 3568707 3629031 3671217
62701 3671217 3693776 3696166 3678042 3638824 3578972 3500893 3407665 3301691 3185613 3063387 2938623
62690 2938623 2812332 2684199 2555905 2431082 2311714 2196857 2085910 1980990 1884471 1795805
62680 1795805 1713018 1636250 1567364 1506282 1450210 1397037 1347576 1303485 1264490 1228789 1195251
62669 1195251 1164110 1136087 1111757 1091359 1074447 1059920 1046920 1035511 1026234 1019461 1015364 1013754
62657A013754k23l24l73J991P091J2576J6067J7391J8004J9351K2255K6709L1568
62644A185837L5416L8261M1577M6206N1382N6276O1115O5963O9871P2590P5794
62633A800288Q0928Q6670R0379R1538R1871R2147R0969Q6939Q0260P1460O0236
62622B723685M6552L1643J6639J096j5878l3571m9923o3529p4319q2599q8642
62611B411154r3254r7364j00577j01176r8375r3708q9355q5716q1721p7034p2576
62600A420298o8804o4929o0365n5721n1540m7062m1466l5632l1334k9028k7760
62589I06657k7051k7295k7968k7101k3610j9103j6186j5378j4844j3099j0937
62578F84085j0248j1481j2958j2765j0995r451r175r101p783n707m577m716m626
$$ plain form
62657 1013754 1013531 1013207 1012834 1014825 1021916 1034492 1050559 1067950 1085954 1105305 1127560 1154269 1185837
62644 1185837 1221253 1259514 1301091 1347297 1398679 1454955 1516070 1582033 1651904 1724494 1800288
62633 1800288 1881216 1967886 2058265 2149803 2241674 2333821 2424790 2511729 2591989 2663449 2723685
62622 2723685 2770237 2801880 2818519 2819615 2803737 2770166 2720243 2656714 2582395 2499796 2411154
62611 2411154 2317900 2220536 2119959 2018783 1920408 1826700 1737345 1651629 1569908 1492874 1420298
62600 1420298 1351494 1286565 1226200 1170479 1118939 1071877 1030411 994779 963445 934417 906657
62589 906657 879606 852311 824343 797242 773632 754529 738343 722965 708121 695022 684085
62578 684085 673837 662356 649398 636633 625638 616187 607012 597911 590128 584421 579844 575128 570502
62565E70502l380j911j297j097m11M94Q48R25J645L055M415N519O770Q030Q612
62550F02719Q507Q636R572J0873J1981J3039J4420J6017J7576J9423K2300K6459
62538G81522L1165L5274L8285M0739M3400M6338M9189N2128N5761N9810O2918
62527A296529O4320O4861O5335O4588O0535N3017M4190L5876K7661J8171P341
62516A802424l434j2988k1449k9605l7658m4788m9936n2883n4401n5307n5694
62505A384281n5356n4492n3421n1788m8876m4772m0600l7236l4310l0857k6747
62494I05826k3038k0880k0277j9991j8753j6549j4593j3879j4026j3755j2471
62483G17614j0952j0453j1273j2262j1812r360n970l280j949j335n97M36J495
$$ plain form
62565 570502 567122 565211 563914 562817 562406 562900 563748 564673 566318 569373 573788 579307 586077 594107 602719
62550 602719 611226 619862 629434 640307 652288 665327 679747 695764 713340 732763 755063 781522
62538 781522 812687 847961 886246 926985 970385 1016723 1065912 1118040 1173801 1233611 1296529
62527 1296529 1360849 1425710 1491045 1555633 1616168 1669185 1713375 1749251 1776912 1795083 1802424
62516 1802424 1798990 1786002 1764553 1734948 1697290 1652502 1602566 1549683 1495282 1439975 1384281
62505 1384281 1328925 1274433 1221012 1169224 1120348 1075576 1034976 997740 963430 932573 905826
62494 905826 882788 861908 841631 821640 802887 786338 771745 757866 743840 730085 717614
62483 717614 706662 696209 684936 672674 660862 651502 645532 642252 640303 638968 638371 638807 640302
62470F40302K438L293M218N589P666R914J1289J1609J2089J4049J7523K1448K4671
62457G86098K6346K6309K5804K7056L1024L6102M0009M2422M4648M7239M9416
62446A182473N0669N1367N1486N0102M6625M1541L5464K8334K0100J1376K927
62435A572464m927j2150j8884k5672l2917l9768m4400m5893m5165m3758m2483
62424A216447m1608m1371m1498m0914l8703l5025l0671k6335k2727k0466j9148
62413H57981j7387j4649j2279j1611j1819j1041r105p453o387m306l32L783N621
62400G61016N046M101M412N732O942P482P628P957Q820J0131J1537J2818J3929
62387H67551J4463J3653J1542R681R627J0776J0854Q841O235M592L069j97m989
$$ plain form
62470 640302 642740 646033 650251 655840 663506 673420 684709 696318 708407 722456 739979 761427 786098
62457 786098 812444 838753 864557 891613 922637 958739 998748 1041170 1085818 1133057 1182473
62446 1182473 1233142 1284509 1335995 1386097 1432722 1474263 1509727 1538061 1558161 1569537 1572464
62435 1572464 1567537 1555387 1536503 1510831 1477914 1438146 1393746 1347853 1302688 1258930 1216447
62424 1216447 1174839 1133468 1091970 1051056 1012353 977328 946657 920322 897595 877129 857981
62413 857981 840594 825945 813666 802055 790236 779195 770090 762637 756250 751944 751612 755395 761016
62400 761016 766062 770163 774575 780307 787249 794731 802359 810316 819136 829267 840804 853622 867551
62387 867551 882014 895667 907209 916890 926517 937293 948147 956988 963223 967815 970884 970687 965698
62374I65698r123j1639j4064j7796k1761k3863k3818k3163k2897k2385k0649j7741
62362G36799j4575j2049j0632j0186r964r121p463n510l745k077j15K145M068
62349F57575M916M775M768N852P539Q423Q131P860Q562R560R837R935J1321J4137
62335G73191J6702J7248J5365J1863Q151N703N071N278M930L894K999K224O03
62322H73222j776l132k245j93J235K013L532O247R088J1262J3459J6754K1059
62309I50525K5264K8710L1939L5907M0720M5452M9305N2772N7268O3527P0587
62298A451976P6663Q0742Q3070Q4222Q4204Q2632P9276P3999O6425N6310M4427
62287B263946L2338K0909R510k583j4545k4721l2869m0455m8504n6231o2355o6661
$$ plain form
62374 965698 956575 944936 930872 913076 891315 867452 843634 820471 797574 775189 754540 736799
62362 736799 722224 710175 699543 689357 679393 670272 662809 657299 653554 651477 651362 653507 657575
62349 657575 662491 667266 672034 677886 685425 693848 701979 709839 718401 727961 737798 747733 759054 773191
62335 773191 789893 807141 822506 834369 842520 848223 853294 858572 863502 867396 870395 872619 873222
62322 873222 871446 868314 866069 865876 867111 869124 872656 878903 887991 899253 912712 929466 950525
62309 950525 975789 1004499 1036438 1072345 1113065 1158517 1207822 1260594 1317862 1381389 1451976
62298 1451976 1528639 1609381 1692451 1776673 1860877 1943509 2022785 2096784 2163209 2219519 2263946
62287 2263946 2296284 2317193 2326703 2324120 2309575 2284854 2251985 2211530 2163026 2106795 2044440 1977779
62275A977779o9487p0654o9952o8046o5768o3018n9365n5383n2139m9613m6815
62264A307539m3472m0481l8533l7171l5481l2964k9683k6179k3228k1038j8838
62253I60471j5930j2872j0663r184p519n600m134l020j336Q41K062J375o30k952
62239H90909n027o069n236l227k199k987l782k808j177j309l311m697l621r31
62225H44528J287K170K689M361P582J1090J3199J3703J3981J4995J6050J6301
62213I61936J6632J8775K2798K6776K9109L0252L1761L4379L7549M0487M3131
62202A293585M6001M9393N3108N7104O1955O7979P4019P7960P8764P7296P4789
62191B011953P1212O5682N7707M7306L4710K0844P493m186j4981k6232l7382m6381
$$ plain form
62275 1977779 1908292 1837638 1767686 1699640 1633872 1570854 1511489 1456106 1403967 1354354 1307539
62264 1307539 1264067 1223586 1185053 1147882 1112401 1079437 1049754 1023575 1000347 979309 960471
62253 960471 944541 931669 921006 911822 904303 898703 894569 891549 890213 891054 893116 894491 893861 890909
62239 890909 885882 879813 874577 871350 869151 866164 862382 859574 858397 857088 853777 849080 845459 844528
62225 844528 845815 847985 850674 855035 862617 873707 886906 900609 914590 929585 945635 961936
62213 961936 978568 997343 1020141 1046917 1076026 1106278 1138039 1172418 1209967 1250454 1293585
62202 1293585 1339586 1388979 1442087 1499191 1561146 1629125 1703144 1781104 1859868 1937164 2011953
62191 2011953 2083165 2148847 2206554 2253860 2288570 2309414 2316907 2312721 2297740 2271508 2234126 2187745
62179B187745n2710n8410o5247p1994p5852p5895p3708p0787o6969o1949n6902
62168A457322n3242n0446m6677m1502l6423l2344k8092k2523j6895j3463j2257
62157A103458j0976q103m645k419j851k135k529k700k379j392J30J830L184L575
62143A073048K875J985K040L014L813M020M678O922J0442J3706J5386J5408J5082
62130A172419J6096J8810K1677K3165K3932K5765K8576L0060K8784K6052K3932
62119A439268K2975K2806K3492K5011K6373K6797K7126K8777L1800L5129L8287
62108A747841M1632M5184M8436N1236N3866N6188N7373N6603N3547M8319M1502
62097B301727L4053K6731J9680J2724N757j259q192j4409j9218k2816k6077k9160
$$ plain form
62179 2187745 2135035 2076625 2011378 1939384 1863532 1787637 1713929 1643142 1576173 1514224 1457322
62168 1457322 1404080 1353634 1306957 1265455 1229032 1196688 1168596 1146073 1129178 1115715 1103458
62157 1103458 1092482 1084379 1079734 1077315 1075464 1073329 1070800 1068100 1065721 1064329 1064459 1066289 1069473 1073048
62143 1073048 1075923 1077908 1079948 1082962 1086775 1090795 1095473 1102395 1112837 1126543 1141929 1157337 1172419
62130 1172419 1188515 1207325 1229002 1252167 1276099 1301864 1330440 1360500 1389284 1415336 1439268
62119 1439268 1462243 1485049 1508541 1533552 1559925 1586722 1613848 1642625 1674425 1709554 1747841
62108 1747841 1789473 1834657 1883093 1934329 1988195 2044383 2101756 2158359 2211906 2260225 2301727
62097 2301727 2335780 2362511 2382191 2394915 2400672 2399413 2391221 2376812 2357594 2334778 2308701 2279541
62085B279541l1201l1715l1270l0443k9146k7552k6407k5747k4456k2005j9489
62074A980110j8032j7302j6546j5901j5454j4311j1991r731q803q511p314n131
62062A831083k964j093P69K314L349M973Q102J1473J3082J3212J4053J6531J9491
62049A934375K1944K4147K6401K8584L1035L4133L7018L8530L9502M1990M5989
62038B303648M8958M9275M8120M7155M6332M5155M4419M5229M7282M9375N0845
62027B825793N1604N1569N0922N0371N0525N1469N3182N5624N8177N9977O1166
62016C420379O2771O5153O7625O9883P2435P5115P6618P6412P5930P6875P9139
62005D218335Q1374Q2750Q3304Q3181Q2372Q0780P7924P3105O6374N8758N1203
$$ plain form
62085 2279541 2248340 2216625 2185355 2154912 2125766 2098214 2071807 2046060 2021604 1999599 1980110
62074 1980110 1962078 1944776 1928230 1912329 1896875 1882564 1870573 1860842 1852039 1843528 1836214 1831083
62062 1831083 1828119 1827026 1827795 1830109 1833458 1838431 1846533 1858006 1871088 1884300 1898353 1914884 1934375
62049 1934375 1956319 1980466 2006867 2035451 2066486 2100619 2137637 2176167 2215669 2257659 2303648
62038 2303648 2352606 2401881 2450001 2497156 2543488 2588643 2633062 2678291 2725573 2774948 2825793
62027 2825793 2877397 2928966 2979888 3030259 3080784 3132253 3185435 3241059 3299236 3359213 3420379
62016 3420379 3483150 3548303 3615928 3685811 3758246 3833361 3909979 3986391 4062321 4139196 4218335
62005 4218335 4299709 4382459 4465763 4548944 4631316 4712096 4790020 4863125 4929499 4988257 5039460
61994E039460M3988L7470L2393K8718K5069K0231J4713J0113P399O299N937N647
61982E277437N609O900J0251J4668J8249K0629K3419K7658L2059L4769L5851L6864
61970E544363L8585M0366M1381M1501M1041M0278L9303L7931L6009L4008L2762
61959E967528L2327L1602K9576K6405K2911J9631J6807J4732J3484J2639J1585
61948F199227R831P101L713Q49m91q00j265j617l55K482M559M296L102L132L992
61933F237756L498R85k026m159n622p117q598r440r155p869o451n872o023n728
61919F164179m541l640m070m996n045m536m745n505n509m977n824q591j1132j1480
61905F079588j0576j0902j3414j7147k1000k4406k6691k7446k7561k8553l0543
$$ plain form
61994 5039460 5083448 5120918 5153311 5182029 5207098 5227329 5242042 5252155 5259554 5265853 5271790 5277437
61982 5277437 5283046 5289946 5300197 5314865 5333114 5353743 5377162 5404820 5436879 5471648 5507499 5544363
61970 5544363 5582948 5623314 5664695 5706196 5747237 5787515 5826818 5864749 5900758 5934766 5967528
61959 5967528 5999855 6031457 6061033 6087438 6110349 6129980 6146787 6161519 6175003 6187642 6199227
61948 6199227 6209058 6216159 6219872 6220721 6220230 6219430 6218165 6216548 6216193 6218675 6223234 6227530 6230632 6233764 6237756
61933 6237756 6241254 6242239 6240213 6236054 6230432 6223315 6214717 6205277 6196122 6188253 6181802 6175930 6169907 6164179
61919 6164179 6159638 6155998 6151928 6146932 6141887 6137351 6132606 6127101 6121592 6116615 6110791 6102200 6091068 6079588
61905 6079588 6069012 6058110 6044696 6027549 6006549 5982143 5955452 5928006 5900445 5871892 5841349
61894E841349l2111l2524l2837l3968l4966l4434l2887l1967l1752l0615k7954
61883E485334k5257k3811k2890k1242j8978j6679j3937j0267o537l726r84L196
61871E324222Q289J2282J4799J7709K2385K8246L4345M0617M6950N2858N8791
61860E661493O6144P5179Q4532R3637J03901J16346J29900J43544J58636J77170
61850F810482J98791K21557K45163K71565L02362L37085L74184M12751M53010
61841I626950M95881N42024N90849O40602O89547P36438P79160Q13342Q32499
61832A5747292Q28763P93562P19437O03225M47840K61365N5699j53907l50957
61823A8952319n22474o62182p68743q42348q84441q99218q92685q69901q34197
$$ plain form
61894 5841349 5809238 5776714 5743877 5709909 5674943 5640509 5607622 5575655 5543903 5513288 5485334
61883 5485334 5460077 5436266 5413376 5392134 5373156 5356477 5342540 5332273 5325736 5322010 5321026 5324222
61871 5324222 5332511 5344793 5359592 5377301 5399686 5427932 5462277 5502894 5549844 5602702 5661493
61860 5661493 5727637 5802816 5887348 5980985 6084886 6201232 6331132 6474676 6633312 6810482
61850 6810482 7009273 7230830 7475993 7747558 8049920 8387005 8761189 9173940 9626950
61841 9626950 10122831 10664855 11255704 11896306 12585853 13322291 14101451 14914793 15747292
61832 15747292 16576055 17369617 18089054 18692279 19140119 19401484 19457183 19303276 18952319
61823 18952319 18429845 17767663 16998920 16156572 15272131 14372913 13480228 12610327 11776130
61814A1776130p88664p36805o81815o26375n73066n23801m78974m37899l99818
61805F528913l63978l29808k98057k70637k48047k27986k08035j88601j71411
61796D222353j56300j41773j27958j16279j06569r7107q7587p9414p2869o6535
61786C169962o0004n4598n0606m6418m1457l7515l5669l4144l1027k7108k4033
61775B727383k1301j7527j3418j0972j0137q687n438j529J766M583P158Q568Q012
61762B668461O522O166P757J0187J2131J3633J5598J8178K0434K1745K2889K5372
61750B849073L0054L6669M4093N0661N5041N7715O1098O7176P5421Q3898R1862
61739C502761R9884J08127J16196J24654J34568J45300J54817J62972J72573J85920
$$ plain form
61814 11776130 10987466 10250661 9568846 8942471 8369405 7845604 7366630 6928731 6528913
61805 6528913 6164935 5835127 5537070 5266433 5018386 4790400 4582365 4393764 4222353
61796 4222353 4066053 3924280 3796322 3680043 3573474 3476367 3388780 3309366 3236497 3169962
61786 3169962 3109958 3055360 3004754 2958336 2916879 2879364 2843695 2809551 2778524 2751416 2727383
61775 2727383 2706082 2688555 2675137 2664165 2654028 2645341 2639903 2638374 2640140 2644723 2651881 2660449 2668461
61762 2668461 2674983 2681149 2688906 2699093 2711224 2724857 2740455 2758633 2779067 2800812 2823701 2849073
61750 2849073 2879127 2915796 2959889 3010550 3065591 3123306 3184404 3251580 3327001 3410899 3502761
61739 3502761 3602645 3710772 3826968 3951622 4086190 4231490 4386307 4549279 4721852 4907772
61729D907772K01920K18033K33812K50882K70478K92796L18127L46799L78140
61720G418759M11150M46352M85777N30912N81661O37423O98034P63336Q32696
61711A2806100R05615R82416J063896J150237J239866J328704J410516J478426
61703B2365776J525867J545298J525876J453573J315008J102840Q19848M80455
61695C2134541J09094k64919o14429r19640j169051j357624j485450j557383j581826
61686B3293313j568071j524398j458284j377090j287258j193139j097649j003913
61678A2783511r15195q33092p57257o87295o23920n67543n17039m70952m28930
61669F982288l90870l55701l22562k92436k66763k44877k24619k05356j88321
$$ plain form
61729 4907772 5109692 5327725 5561537 5812419 6082897 6375693 6693820 7040619 7418759
61720 7418759 7829909 8276261 8762038 9292950 9874611 10512034 11210068 11973404 12806100
61711 12806100 13711715 14694131 15758027 16908264 18148130 19476834 20887350 22365776
61703 22365776 23891643 25436941 26962817 28416390 29731398 30834238 31654086 32134541
61695 32134541 32243635 31978716 31364287 30444647 29275596 27917972 26432522 24875139 23293313
61686 23293313 21725242 20200844 18742560 17365470 16078212 14885073 13787424 12783511
61678 12783511 11868316 11035224 10277967 9590672 8966752 8399209 7882170 7411218 6982288
61669 6982288 6591418 6235717 5913155 5620719 5353956 5109079 4884460 4679104 4490783
61660D490783j73891j60643j47778j36333j26904j18030j08316r8753r1275q6021
61650C242839q1544p6935p2181o7002o1064n5141n0596m7645m5313m3116m1575
61639B600727m1033m1050m1101m0921m0094l8454l6987l7120l8601l9361l8100
61628B167905l5994l4859l4672l4145l3128l2708l2938l2161k9379k5998k4012
61617A817911k3307k2141j9854j7437j5393j2914r898q105q756j0197r811p712
61605A652386o462p165p948o919m787l374k989k722k417k770l868m932n419n407
61591A585207m945m015l056k655k619k136r64K41Q67Q75L89n47j564k063j934
61576A561081j576j043m8Q80M27j441k444m82L223N229M281K876L639N764O543
$$ plain form
61660 4490783 4316892 4156249 4008471 3872138 3745234 3627204 3518888 3420135 3328860 3242839
61650 3242839 3161295 3084360 3012179 2945177 2884113 2828972 2778376 2730731 2685418 2642302 2600727
61639 2600727 2559694 2518644 2477543 2436622 2396528 2358074 2321087 2283967 2245366 2206005 2167905
61628 2167905 2131911 2097052 2062380 2028235 1995107 1962399 1929461 1897300 1867921 1841923 1817911
61617 1817911 1794604 1772463 1752609 1735172 1719779 1706865 1696967 1688862 1680106 1669909 1660098 1652386
61605 1652386 1645924 1638759 1630811 1623892 1619105 1615731 1612742 1610020 1607603 1604833 1600965 1596033 1590614 1585207
61591 1585207 1580262 1576247 1573191 1570536 1567917 1565781 1564817 1565058 1565925 1566800 1567189 1566642 1565078 1563015 1561081
61576 1561081 1559505 1558462 1558414 1559294 1559721 1558280 1555836 1555354 1558577 1563806 1568087 1570963 1574602 1580366 1586909
61561A586909N377M203M312M780M479L785L342K579N98k268m829o291o328m939
61547A595709l126k748m392o247o506n998o747q590r435q661p958q370q578p077
61533A501276m379k058q46n98j003j367p22R77K635L676M837O648Q299R008R494
61518A535877J0905J3241J6001J9499K4246K9513L3857L6733L8568L9802M0889
61507A839131M2799M6138M9972N2551N3191N2565N1470N0269M9276M8660M7974
61496B383996M6710M5055M3382M1279L8151L4432L1091K8101K4551K0167J5551
61485B752466J0892N783N09l836o945r835j3135j5882j6870j6485j6238j6815
61473B653609j7369j6700j4640j2066r713p185l342K137Q094J3239J7738K2707
$$ plain form
61561 1586909 1592286 1596489 1600801 1605581 1610060 1613845 1617187 1619766 1620364 1618096 1613267 1606976 1600648 1595709
61547 1595709 1592583 1589835 1585443 1579196 1572690 1566692 1559945 1551355 1541920 1533259 1525301 1516931 1508353 1501276
61533 1501276 1496897 1494839 1493993 1493395 1492392 1491025 1490303 1491280 1493915 1497591 1502428 1509076 1517375 1526383 1535877
61518 1535877 1546782 1560023 1576024 1595523 1619769 1649282 1683139 1719872 1758440 1798242 1839131
61507 1839131 1881930 1928068 1978040 2030591 2083782 2136347 2187817 2238086 2287362 2336022 2383996
61496 2383996 2430706 2475761 2519143 2560422 2598573 2633005 2664096 2692197 2716748 2736915 2752466
61485 2752466 2763358 2769141 2769650 2765814 2758869 2749034 2735899 2720017 2703147 2686662 2670424 2653609
61473 2653609 2636240 2619540 2604900 2592834 2583121 2575936 2572594 2574731 2582825 2596064 2613802 2636509
61461B636509K8425L4125L9581M5786N3589O2571P1873Q1425R1718J02860J14575
61450C363037J26889J40168J54611J70113J86531K03650K20989K38029K54609
61441E058626K70928K87044L02447L15756L24727L26741L19677L02385K74427
61432G782758K35837J87585J32132P3068J4050m1865r2221j35162j69817j96344
61422G790021k15201k26580k30876k29484k24318k16297k04991j90181j73133
61413E878960j55497j37510j18537r9239q1677o6637n2218l6199j9083l353R947
61402E118957K2427L5781M9271O0616O8806P5053Q0919Q6340R0006R1369R1448
61391E870993R1392R0917Q8918Q5298Q1285P7889P4892P1652O8139O4732O1619
$$ plain form
61461 2636509 2664934 2699059 2738640 2784426 2838015 2900586 2972459 3053884 3145602 3248462 3363037
61450 3363037 3489926 3630094 3784705 3954818 4141349 4344999 4565988 4804017 5058626
61441 5058626 5329554 5616598 5919045 6234801 6559528 6886269 7205946 7508331 7782758
61432 7782758 8018595 8206180 8338312 8411380 8425430 8383565 8291344 8156182 7986365 7790021
61422 7790021 7574820 7348240 7117364 6887880 6663562 6447265 6242274 6052093 5878960
61413 5878960 5723463 5585953 5467416 5368177 5286500 5219863 5167645 5131446 5112363 5109010 5118957
61402 5118957 5141384 5177165 5226436 5287052 5355858 5430911 5511830 5598170 5688176 5779545 5870993
61391 5870993 5962385 6053302 6142220 6227518 6308803 6386692 6461584 6533236 6601375 6666107 6727726
61380F727726N8795N6118N3042M8930M3961L8972L4058K8342K1765J5934J2100
61369G139743R313N780J302l141p524j2724j8520k3489k7101l0307l3548l5709
61357F964075l5718l4027l1687k9015k5973k3054k0849j9194j7526j5866j4971
61346F696195j5594j7812k0877k3740k6074k8466l0974l2018k9898k5347k0883
61335F424512j7306j2391l898P702K0655L4818N1399P0683R1667J13727J37025
61324F918593J61225J85212K08401K31277K54279K76960K98471L18034L34537
61315I186989L46245L51322L48165L35229L11179K75750K30163J76584J17522
61306A1679148N5770n663o4107j17727j65522k07328k43723k75415l02398l23912
$$ plain form
61380 6727726 6786521 6842639 6895681 6944611 6988572 7027544 7061602 7089944 7111709 7127643 7139743
61369 7139743 7149056 7154836 7156138 7152997 7145473 7132749 7114229 7090740 7063639 7033332 6999784 6964075
61357 6964075 6928357 6894330 6862643 6833628 6807655 6784601 6763752 6744558 6727032 6711166 6696195
61346 6696195 6680601 6662789 6641912 6618172 6592098 6563632 6532658 6500640 6470742 6445395 6424512
61335 6424512 6407206 6394815 6390917 6398619 6419274 6454092 6505491 6576174 6667841 6781568 6918593
61324 6918593 7079818 7265030 7473431 7704708 7958987 8235947 8534418 8852452 9186989
61315 9186989 9533234 9884556 10232721 10567950 10879129 11154879 11385042 11561626 11679148
61306 11679148 11734918 11729255 11665148 11547421 11381899 11174571 10930848 10655433 10353035 10029123
61296A0029123l39308l48590l52190l50720l45001l35760l23143l07274k89368
61287G037769k71428k54257k36648k17357j97203j78034j60119j42020j23134
61278E257569j04745q7952p1777n4644l7033k1264q683J767J1936K2351L2347
61267D939872M1481M9985N7889O4567O9340P2221P3686P3987P2955P0453O6679
61256E653115O1913N6272M9983M3663L7883L2466K6696K0357J4062Q265K433m224
61244F002884j1633j9088k6329l3483m0081m5119m8521n1648n5747o0490o4654
61233E546091o7698o9899p1363p1870p1678p1515p1378p0147o6901o2233n7671
61222D793738n3938n0320m5857m0630l5601l1555k8726k7345k7813k9966l2617
$$ plain form
61296 10029123 9689815 9341225 8989035 8638315 8293314 7957554 7634411 7327137 7037769
61287 7037769 6766341 6512084 6275436 6058079 5860876 5682842 5522723 5380703 5257569
61278 5257569 5152824 5064872 4993095 4938451 4901418 4880154 4871471 4873238 4885174 4907525 4939872
61267 4939872 4981353 5031338 5089227 5153794 5223134 5295355 5369041 5443028 5515983 5586436 5653115
61256 5653115 5715028 5771300 5821283 5864946 5902829 5935295 5961991 5982348 5996410 6004675 6007108 6002884
61244 6002884 5991251 5972163 5945834 5912351 5872270 5827151 5778630 5726982 5671235 5610745 5546091
61233 5546091 5478393 5408494 5337131 5265261 5193583 5122068 5050690 4980543 4913642 4851409 4793738
61222 4793738 4739800 4689480 4643623 4602993 4567392 4535837 4507111 4479766 4451953 4421987 4389370
61211D389370l4417l5021l4917l4255l2542k9458k5365k0684j5401r363k624M774
61199D120097J2894K1469K9885L7886M5997N4959O5278P7321R1002J04976J17134
61188D778898J26726J35047J43062J49251J51159J48285J41515J29984J10802
61179F014729Q2676M7997J0331k8592o8036j05751j38459j64484j84217j98015
61169E268179k05361k06428k03038j97131j89276j79401j68156j56509j44635
61160C618244j32303j20068j08960r9006q9149p8899o9249o1469n5687n1048m6631
61149B705775m1708l5788k9137k2870j7807j3491q937l969R11N559J0039J3601
61137B562178J5120J4789J4275J4580J4641J2778Q886M434P53j927m068o292r204
$$ plain form
61211 4389370 4354953 4319932 4285015 4250760 4218218 4188760 4163395 4142711 4127310 4117947 4115323 4120097
61199 4120097 4132991 4154460 4184345 4222231 4268228 4323187 4388465 4465786 4556788 4661764 4778898
61188 4778898 4905624 5040671 5183733 5332984 5484143 5632428 5773943 5903927 6014729
61179 6014729 6097405 6145402 6155733 6127141 6059105 5953354 5814895 5650411 5466194 5268179
61169 5268179 5062818 4856390 4653352 4456221 4266945 4087544 3919388 3762879 3618244
61160 3618244 3485941 3365873 3256913 3157907 3068758 2989859 2920610 2859141 2803454 2752406 2705775
61149 2705775 2664067 2628279 2599142 2576272 2558465 2544974 2536037 2532068 2532979 2538538 2548577 2562178
61137 2562178 2577298 2592087 2606362 2620942 2635583 2648361 2657247 2661681 2662434 2660507 2656439 2650147 2640943
61124B640943j3020j7107k0284k1883k2391k2931k4137k5583k6390k6379k6301
61113B394537k6789k7513k7866k8040k8679k9733l0627l1513l3225l5679l7441
61102B057432l7455l6420l5844l6374l7547l8450l8113l5962l2560k9394k7517
61091A671796k6934k7521k9402l1922l3492l3438l2918l3049l3136l1974k9944
61080A328066k8235k6682k4034k0000j5669j2139r964r457j0016r625o764k659
61068A152822M5P68J365L024M834N934P055Q964J1035J2392J3210J3786J3533
61055A248767J1987R950Q572Q017P910Q231Q983R649R988J0560J1566J1832J0092
61042A376104O862L962K343J313j58k130l726m047l126k086k002k482k073l94
$$ plain form
61124 2640943 2627923 2610816 2590532 2568649 2546258 2523327 2499190 2473607 2447217 2420838 2394537
61113 2394537 2367748 2340235 2312369 2284329 2255650 2225917 2195290 2163777 2130552 2094873 2057432
61102 2057432 2019977 1983557 1947713 1911339 1873792 1835342 1797229 1761267 1728707 1699313 1671796
61091 1671796 1644862 1617341 1587939 1556017 1522525 1489087 1456169 1423120 1389984 1358010 1328066
61080 1328066 1299831 1273149 1249115 1229115 1213446 1201307 1191343 1181886 1171870 1162245 1155481 1152822
61068 1152822 1152867 1153635 1155000 1158024 1162858 1168792 1175847 1184811 1195846 1208238 1221448 1235234 1248767
61055 1248767 1260754 1270704 1279276 1287293 1295203 1303434 1312417 1322066 1332054 1342614 1354180 1366012 1376104
61042 1376104 1382966 1386928 1389271 1390584 1390426 1388296 1384570 1380523 1377397 1375311 1373309 1370827 1368754 1368360
61028A368360J140J186J39r22j984l582n198n701n112m670n056n713n937n628
61014A321322m786l374k000j709k650l726l958l587l284l097k810k670k953l194
61000A277524k711j688r75q34n77L32J527K379K887L508M345N098N727O757Q691
60985A311990J1348J3969J6002J7561J8996K0143K0457K0074K0244K2057K4921
60974A517762K7210K8515L0247L3473L7231L9927M1731M4216M7973N1998N5470
60963A955753N8807O2618O6824P1239P5989Q0838Q5164Q9095R3800J00006J07127
60952B847260J14447J22198J30764J39708J48303J56393J64310J72865J83706
60943D179954J98253K15779K34147K53357K76456L05657L39451L75353M14033
$$ plain form
61028 1368360 1369500 1370686 1370825 1369903 1367919 1364337 1359139 1353438 1348326 1343656 1338600 1332887 1326950 1321322
61014 1321322 1316536 1313162 1311162 1309453 1306803 1303077 1299119 1295532 1292248 1289151 1286341 1283671 1280718 1277524
61000 1277524 1274813 1273125 1272150 1271316 1270739 1271071 1272598 1274977 1277864 1281372 1285717 1290815 1296542 1303299 1311990
60985 1311990 1323338 1337307 1353309 1370870 1389866 1410009 1430466 1450540 1470784 1492841 1517762
60974 1517762 1544972 1573487 1603734 1637207 1674438 1714365 1756096 1800312 1848285 1900283 1955753
60963 1955753 2014560 2077178 2144002 2215241 2291230 2372068 2457232 2546327 2640127 2740133 2847260
60952 2847260 2961707 3083905 3214669 3354377 3502680 3659073 3823383 3996248 4179954
60943 4179954 4378207 4593986 4828133 5081490 5357946 5663603 6003054 6378407 6792440
60934F792440M58721N11950N74669O46912P27528Q15223R12071J023607J153241
60925A3616362J300642J469403J670693J911954K187469K489598K816946L139283
60917C0602350L344064L256595K768779J966102J103432M32948N5903o6632o378
60908D3457163J75469L70354L90473O4695o14843j460557k216969k722246k961966
60899C4481573l006789k930744k781155k588385k375029k154769j933597j715917
60891A4995188j507133j311690j132711r73630q37320p23480o29013n50878m86830
60882F842503m33799l88001l47189l11355k80890k55149k33030k13741j96767
60873D182582j81881j69263j59041j50811j44233j39529j36493j33465j28535
$$ plain form
60934 6792440 7251161 7763111 8337780 8984692 9712220 10527443 11439514 12463121 13616362
60925 13616362 14917004 16386407 18057100 19969054 22156523 24646121 27463067 30602350
60917 30602350 33946414 37203009 39971788 41937890 43041322 43474270 43530173 43463541 43457163
60908 43457163 43632632 44002986 44393459 44458154 43843311 42382754 40165785 37443539 34481573
60899 34481573 31474784 28544040 25762885 23174500 20799471 18644702 16711105 14995188
60891 14995188 13488055 12176365 11043654 10070024 9232704 8509224 7880211 7329333 6842503
60882 6842503 6408704 6020703 5673514 5362159 5081269 4826120 4593090 4379349 4182582
60873 4182582 4000701 3831438 3672397 3521586 3377353 3237824 3101331 2967866 2839331
60864B839331j21634j14407j08090j02532r7249r2301q7810q3489p8950p4064
60854A878805o8912o3909n9874n7355n5814n4057n1385m7848m3671l9230l5560
60843A301190l3858l3998l4123l2283k8394k4320k2036k1796k2075k1185j8805
60832A008317j5877j3349j1542j0418r784r060p630n672m024l012j971k30K054
60819I17802M317O183P312P383O741O381O866P745Q333Q488Q304P781P238P275
60805A018149P944Q508Q433P900P127N997M673L689L133K635K367K848L570L277
60791A090250K068J594K435L096K633K518M359P244Q975Q832P576N833M097L316
60777A154826L793M389M300M546N994P132O049L620K440L022L513L035K926M437
$$ plain form
60864 2839331 2717697 2603290 2495200 2392668 2295419 2203118 2115308 2031819 1952869 1878805
60854 1878805 1809893 1745984 1686110 1628755 1572941 1518884 1467499 1419651 1375980 1336750 1301190
60843 1301190 1267332 1233334 1199211 1166928 1138534 1114214 1092178 1070382 1048307 1027122 1008317
60832 1008317 992440 979091 967549 957131 947347 938287 930657 924985 920961 917949 915978 915748 917802
60819 917802 922119 928302 935614 942997 949738 956119 962985 970730 979063 987551 995855 1003636 1010874 1018149
60805 1018149 1026093 1034601 1043034 1050934 1058061 1064058 1068731 1072420 1075553 1078188 1080555 1083403 1086973 1090250
60791 1090250 1092318 1093912 1096347 1099443 1102076 1104594 1108953 1116197 1125172 1134004 1141580 1147413 1151510 1154826
60777 1154826 1158619 1163008 1167308 1171854 1177848 1184980 1191029 1194649 1197089 1200111 1203624 1206659 1209585 1214022
60763A214022P059R616J1417J2162J1954J1565J1591J1549J1029J1035J2649J4862
60751A350510J5557J4243J2056R590O828M708M339M649L263j15l319n019o047
60738A411243p162p937q439r708j1752j3265j4063j5489j7573j8193j6336j3969
60726A257357j3083j2940j1896j0168q940q248p563p196p224o180k688K270O338
60713A169839Q434R145R292R586J1024J4043J7614K0230K1474K1741K1233K0223
60701A353878J9606J9994K0857K1467K1881K1975K0584J7077J3124J1185J1641
60690A553269J2721J2952J2281J1089R554Q142P486P545P693P607P324O539M710
60677A668912J964q17k769l517l344l304m583o934q455p921o699p098r257j1098
$$ plain form
60763 1214022 1221081 1230697 1242114 1254276 1266230 1277795 1289386 1300935 1311964 1322999 1335648 1350510
60751 1350510 1366067 1380310 1392366 1401956 1408784 1413492 1417831 1422480 1425743 1425628 1422309 1417290 1411243
60738 1411243 1404081 1396144 1387705 1377997 1366245 1352980 1338917 1323428 1305855 1287662 1271326 1257357
60726 1257357 1244274 1231334 1219438 1209270 1200330 1192082 1184519 1177323 1170099 1163919 1161231 1163501 1169839
60713 1169839 1178273 1187418 1196710 1206296 1217320 1231363 1248977 1269207 1290681 1312422 1333655 1353878
60701 1353878 1373484 1393478 1414335 1435802 1457683 1479658 1500242 1517319 1530443 1541628 1553269
60690 1553269 1565990 1578942 1591223 1602312 1611866 1620008 1627494 1635039 1642732 1650339 1657663 1664202 1668912
60677 1668912 1670876 1670059 1667290 1663773 1660429 1657125 1652542 1645608 1637153 1629232 1622533 1615435 1606178 1595080
60663A595080j1199j0241r447r020q709q756r348r858r450q255p284p174p390
60650A478949o808n009k780j251p35p41r13j290j615j308n17l59j500l184m369
60635A446570n090n761n890m743k979k218k819l266k284o14j5r83k150j923k89
60620A405546J079M91k150n441q056r828j1264j2553j3485j3957j4111j4169j4432
60607A287670j5114j5950j6249j5620j4199j2017r014o081n035o454q250p787
60595A155900n109k623j691j095O30K838L811L138J938J183Q62O08K41l79j289
60580A158963k115k451k530k927l530l581l003k696k981k588k48L186N517O090
60566A145106O556Q442J1062J2619J2541J1866J1894J3234J5852J9234K2614K5507
$$ plain form
60663 1595080 1583881 1573640 1564193 1555173 1546464 1537708 1528360 1518502 1509052 1500797 1493513 1486339 1478949
60650 1478949 1472141 1467132 1464352 1463101 1462366 1461625 1460712 1459422 1457807 1456499 1455982 1455623 1454123 1450939 1446570
60635 1446570 1441480 1435719 1429829 1425086 1422107 1419889 1417070 1413804 1411520 1410906 1410891 1409908 1407758 1405835 1405546
60620 1405546 1406625 1407116 1404966 1399525 1391469 1381641 1370377 1357824 1344339 1330382 1316271 1302102 1287670
60607 1287670 1272556 1256606 1240357 1224737 1210538 1198521 1189507 1183426 1178391 1171937 1163687 1155900
60595 1155900 1150791 1148168 1146477 1145382 1146012 1148850 1152661 1155799 1157737 1158920 1159782 1160390 1160631 1160252 1158963
60580 1158963 1156848 1154397 1151867 1148940 1145410 1141829 1138826 1136130 1133149 1130561 1130313 1133499 1139016 1145106
60566 1145106 1151662 1160104 1171166 1183785 1196326 1208192 1220086 1233320 1249172 1268406 1291020 1316527
60554A316527K7778K9047K8839K7840K8072L0692L4181L5870L4893L2537K9996
60543A656272K7090K3154J7985J1705M725j911p104j0784j3721j6256j8047j8985
60531A654123j9457j9700j9768k0022k0702k1091k0231j8305j6240j4197j1801
60520A452609r709r175r901r972q474o555n397m706m027l897m572m869l531j014
60506A366810J052J627Q92j77l14J194L736O170Q301J0605J2648J3493J3813J5661
60492A455511J9503K3393K5943K8143L1126L4160L6342L8512M1729M5311M8080
60481A827753N0271N2520N4231N4665N4276N3054M8871L9779K7070J3896J627
60470B278013j0095k0538k7841l1736l3886l5163l4603l1451k6457k0720j4751
$$ plain form
60554 1316527 1344305 1373352 1402191 1430031 1458103 1488795 1522976 1558846 1593739 1626276 1656272
60543 1656272 1683362 1706516 1724501 1736206 1740931 1739020 1731916 1721132 1707411 1691155 1673108 1654123
60531 1654123 1634666 1614966 1595198 1575176 1554474 1533383 1513152 1494847 1478607 1464410 1452609
60520 1452609 1442900 1433725 1423824 1413852 1405378 1398823 1393426 1388720 1384693 1380796 1376224 1371355 1367824 1366810
60506 1366810 1367862 1369489 1370381 1370204 1369890 1371084 1374820 1380990 1389291 1399896 1412544 1426037 1439850 1455511
60492 1455511 1475014 1498407 1524350 1552493 1583619 1617779 1654121 1692633 1734362 1779673 1827753
60481 1827753 1878024 1930544 1984775 2039440 2093716 2146770 2195641 2235420 2262490 2276386 2278013
60470 2278013 2267918 2247380 2219539 2187803 2153917 2118754 2084151 2052700 2026243 2005523 1990772
60459A990772q967l649J807Q227J4990K0348K3693K6225K9121L2249L5070L7848
60447B207734M1508M6981N4649O3916P3656Q3887R6363J12473J31157J50206J69145
60436C231675J89214K11003K33689K56480K79239L01817L24300L47778L73204
60427E748399L99341M22765M39126M42693M25763L81705L09542K14093J02023
60418H885450j9799j42336k54505l47274m16272m60226m79817m79325m66201m46195
60408E373500m20365l88611l54004l20922k90390k60471k30771k03661j80913
60399B723392j61575j43994j27984j14084j02091r1388q1920p4022o7640o2315
60389A696379n7595n3195m9015m5164m1749l8619l5555l2771l0778k9571k8282
$$ plain form
60459 1990772 1981805 1978156 1979963 1988190 2003180 2023528 2047221 2073446 2102567 2134816 2169886 2207734
60447 2207734 2249242 2296223 2350872 2414788 2488444 2572331 2668694 2781167 2912324 3062530 3231675
60436 3231675 3420889 3631892 3865581 4122061 4401300 4703117 5027417 5375195 5748399
60427 5748399 6147740 6570505 7009631 7452324 7878087 8259792 8569334 8783427 8885450
60418 8885450 8865651 8723315 8468810 8121536 7705264 7245038 6765221 6285896 5819695 5373500
60408 5373500 4953135 4564524 4210520 3889598 3599208 3338737 3107966 2904305 2723392
60399 2723392 2561817 2417823 2289839 2175755 2073664 1982276 1900356 1826334 1758694 1696379
60389 1696379 1638784 1585589 1536574 1491410 1449661 1411042 1375487 1342716 1311938 1282367 1254085
60378A254085k5914k2524j9385j7819j7812j7988j6963j4565j1716r602q992r739
60366A061066j0496r750p786o797p927r129p561l627o17k03n37N29K402L361L453
60351A006381L977N085N776N842O039O465O298N303M396M369N117O280P718R071
60337A088117R661R360Q871Q790Q921Q899Q827Q808Q381P116N495M513M486M815
60323A195060M901M725M378L638K336Q01m56j203j437j185p53p35j334j990k232
60308A204514k499l329m080l504j493P77K444L584M195L988L583M416O618Q390
60294A227604Q525Q212R090J0684J1571J2030J3487J5781J7104J6759J5970J5546
60282A382363J4487J1719P791L901L60k922n296n897m997l890l424l206k446j116
$$ plain form
60378 1254085 1228171 1205647 1186262 1168443 1150631 1132643 1115680 1101115 1089399 1079797 1070805 1061066
60366 1061066 1050570 1040820 1033034 1026237 1018310 1009181 1001620 997993 997376 997173 996636 997165 999567 1002928 1006381
60351 1006381 1010358 1015443 1021219 1027061 1033100 1039565 1045863 1051166 1055562 1059931 1065048 1071328 1079046 1088117
60337 1088117 1097778 1107138 1116009 1124799 1133720 1142619 1151446 1160254 1168635 1175751 1181246 1185759 1190245 1195060
60323 1195060 1199961 1204686 1209064 1212702 1215038 1215839 1215383 1214180 1212743 1211558 1210805 1210070 1208736 1206746 1204514
60308 1204514 1202015 1198686 1194606 1191102 1189609 1190386 1192830 1196414 1200609 1204597 1208180 1212596 1219214 1227604
60294 1227604 1236129 1244341 1253431 1264115 1275686 1287716 1301203 1316984 1334088 1350847 1366817 1382363
60282 1382363 1396850 1408569 1416360 1420261 1420621 1417699 1412403 1406506 1401509 1397619 1394195 1390989 1388543 1387427
60268A387427RM69Q55K022L728M711M139K295k24l002n169n654m999n491q160
60253A372956j0641r890o325l367l037l879l410j037J833L264K147o49k404j146
60239A334415J802L310K480J329J240R04r56k770k003J072L421K983R01l29J85
60224A347984J412K489M044O849R906J1192J0436R791J1002J3180J4528J5060
60212A457873J5921J6966J6987J6102J5781J6467J6981J6660J6443J7333J9202
60201A642716K1528K4112K6806K9507L2540L5974L8986M1221M4247M9726N6507
60190B043870O1869O5667P0663P8260Q6513R3360R9424J06313J14161J22356J30955
60179C073411J40025J48926J57422J65961J73909J79222J80922J80095J77343
$$ plain form
60268 1387427 1387436 1387905 1388760 1390782 1394510 1399221 1403360 1405655 1405431 1402429 1397260 1391606 1386607 1381116 1372956
60253 1372956 1362315 1352425 1346100 1342733 1339696 1335817 1332407 1331370 1333203 1336467 1338614 1337965 1335561 1334415
60239 1334415 1336217 1339527 1342007 1343336 1344576 1345480 1344524 1341754 1339751 1340823 1344244 1347227 1348128 1347799 1347984
60224 1347984 1349396 1351885 1355929 1362778 1372684 1383876 1394312 1404103 1415105 1428285 1442813 1457873
60212 1457873 1473794 1490760 1507747 1523849 1539630 1556097 1573078 1589738 1606181 1623514 1642716
60201 1642716 1664244 1688356 1715162 1744669 1777209 1813183 1852169 1893390 1937637 1987363 2043870
60190 2043870 2105739 2171406 2242069 2320329 2406842 2500202 2599626 2705939 2820100 2942456 3073411
60179 3073411 3213436 3362362 3519784 3685745 3859654 4038876 4219798 4399893 4577236
60170D577236J71323J61308J49091J36374J22137J04865Q5735O7119M9069K9979
60160E654236J0233p400k1000l1101l8884m4387m6866m5791m1301l4298k5843
60149E327598j5954l735J0811K6083M0818N5545P1122Q7083J02704J18380J34363
60138E954818J49070J60297J67313J70453J69684J65048J57406J47065J32715
60129G373869J13554R1359O8459M4619J8316r615l6046n8977p8609r5105j07657
60118G324167j15958j20617j21808j19170j13077j04341r2680p7370n9319m0594
60108F359233k1774j781J9521M0540O0030P7863R3307J04735J11786J15766J16953
60097G076179J13517J04392R1550P7979O4700N1185L7655K5374J5171O908L49
$$ plain form
60170 4577236 4748559 4909867 5058958 5195332 5317469 5422334 5508069 5575188 5624257 5654236
60160 5654236 5664469 5657069 5636069 5604968 5566084 5521697 5474831 5429040 5387739 5353441 5327598
60149 5327598 5311644 5307909 5318720 5344803 5385621 5441166 5512288 5599371 5702075 5820455 5954818
60138 5954818 6103888 6264185 6431498 6601951 6771635 6936683 7094089 7241154 7373869
60129 7373869 7487423 7578782 7647241 7691860 7710176 7700561 7664515 7605538 7526929 7431824 7324167
60118 7324167 7208209 7087592 6965784 6846614 6733537 6629196 6536516 6459146 6399827 6359233
60108 6359233 6337459 6335678 6355199 6395739 6455769 6533632 6626939 6731674 6843460 6959226 7076179
60097 7076179 7189696 7294088 7385638 7463617 7528317 7579502 7617157 7642531 7657702 7664610 7664959
60086G664959m054n000p80R400K4238M1333N9786Q0755J05009J31096J56953J82473
60074H446168K09439K39158K71007L03136L34042L63657L93093M23109M52773
60065A1435582M80104N03833N23588N38193N45115N42405N30379N10441M82834
60056A6092474M46426M00540L46091K84875K18297J47074P1983n343q2581j57737
60046A7762099k29646k96954l56912m06000m41954m64667m75135m74225m62716
60037A4153890m41775m12795l77131l36298k92064k45964j98997j52088j06531
60028A1590247o3576k3816J2494M4415P0082Q7871R7809J01397R9647R1743P6239
60017A2184552N3630K6929o48k7956n5463q3178j09886j34308j56403j77237j97615
$$ plain form
60086 7664959 7660905 7655905 7655125 7664525 7688763 7730096 7789882 7870637 7975646 8106742 8263695 8446168
60074 8446168 8655607 8894765 9165772 9468908 9802950 10166607 10559700 10982809 11435582
60065 11435582 11915686 12419519 12943107 13481300 14026415 14568820 15099199 15609640 16092474
60056 16092474 16538900 16939440 17285531 17570406 17788703 17935777 18007760 18002417 17919836 17762099
60046 17762099 17532453 17235499 16878587 16472587 16030633 15565966 15090831 14616606 14153890
60037 14153890 13712115 13299320 12922189 12585891 12293827 12047863 11848866 11696778 11590247
60028 11590247 11526671 11502855 11515349 11559764 11629846 11717717 11815526 11916923 12016570 12108313 12184552
60017 12184552 12238182 12265111 12264463 12236507 12181044 12097866 11987980 11853672 11697269 11520032 11322417
60006A1322417k16841k32960k44475k51511k54827k54200k48906k39526k27777
59997I151394k14264j97933j78295j56631j34198j10766q5987o0719l5598r741
59987G967262J7458M4450O9212R1763J13060J32357J47840J59252J67592J72296
59977I082542J71050J62598J47932J28447J04639P6913M6080J2855k1797n5794
59967I855465q7125j15884j43384j69015j89810k03449k10075k10762k06116j96878
59957H122967j84172j68453j49680j28937j07922q6281o1641l3470m865K1141
59947G218687M5391P0806R8068J25109J50336J74308J98151K21530K42365K57745
59937H802496K65327K64581K56706K43044K23985J99664J70834J38278J02115
$$ plain form
60006 11322417 11105576 10872616 10628141 10376630 10121803 9867603 9618697 9379171 9151394
59997 9151394 8937130 8739197 8560902 8404271 8270073 8159307 8073320 8012601 7977003 7967262
59987 7967262 7984720 8029170 8098382 8190145 8303205 8435562 8583402 8742654 8910246 9082542
59977 9082542 9253592 9416190 9564122 9692569 9797208 9874121 9920201 9933056 9911259 9855465
59967 9855465 9768340 9652456 9509072 9340057 9150247 8946798 8736723 8525961 8319845 8122967
59957 8122967 7938795 7770342 7620662 7491725 7383803 7297522 7235881 7202411 7197546 7218687
59947 7218687 7264078 7334884 7432952 7558061 7708397 7882705 8080856 8302386 8544751 8802496
59937 8802496 9067823 9332404 9589110 9832154 10056139 10255803 10426637 10564915 10667030
59928A0667030O2574K1011k0732o1543j00615j36059j65122j86235k00235k08966
59918I671108k12855k10370k00115j83028j61756j37918j11145q1350n0657k1695
59908H300219N261L1719N7951Q2406J04164J23958J42082J57028J67240J72956
59898I344984J75280J74507J70441J63563J54742J44253J32065J18829J05898
59889A0684562R4400Q4705P6646P0204O6355O7087P3949Q6630J03713J24751J50536
59878A1683538J81307K15934K53187K92648L33880L75713M16786M55820M90966
59869A4699779N19761N40114N50398N48342N31009M96293M43359L71717K81762
59860A8982534J77060O4399m9546j60351k63980l54983m28649m83918n22458n45521
$$ plain form
59928 10667030 10729604 10750615 10729883 10668340 10567725 10431666 10266544 10080309 9880074 9671108
59918 9671108 9458253 9247883 9047768 8864740 8702984 8565066 8453921 8372571 8321914 8300219
59908 8300219 8305480 8337199 8395150 8477556 8581720 8705678 8847760 9004788 9172028 9344984
59898 9344984 9520264 9694771 9865212 10028775 10183517 10327770 10459835 10578664 10684562
59889 10684562 10778962 10863667 10940313 11010517 11076872 11143959 11217908 11304538 11408251 11533002 11683538
59878 11683538 11864845 12080779 12333966 12626614 12960494 13336207 13752993 14208813 14699779
59869 14699779 15219540 15759654 16310052 16858394 17389403 17885696 18329055 18700772 18982534
59860 18982534 19159594 19223993 19174447 19014096 18750116 18395133 17966484 17482566 16960108 16414587
59850A6414587n53389n47308n29914n03596m69696m29462l84790l37738k89872
59841A2368822k41955j93814j44952r5915m8645m760L5983P4661J11063J43499
59831A2003987J70351J90696K03411K06677J98784J79116J48242J07475N8306
59822A3467045K110n9631j24774j90377k53106l09580l56779l93012m18558m34610
59812A0928728m41660m39777m30391m16241l99188l79282l56496l31909l06467
59803G427317k80035k52797k26337k02022j79268j56837j35041j15208r7561q1148
59793E701063o5788n2764m3513l8425l6686l6613l6333l5096l3716l3174l3148
59782E255807l2598l1255k9691k8279k7078k6521k7344k9942l4303m0262m7064
$$ plain form
59850 16414587 15861198 15313890 14783976 14280380 13810684 13381222 12996432 12658694 12368822
59841 12368822 12126867 11933053 11788101 11692186 11643541 11638781 11674764 11749425 11860488 12003987
59831 12003987 12174338 12365034 12568445 12775122 12973906 13153022 13301264 13408739 13467045
59822 13467045 13469155 13409524 13284750 13094373 12841267 12531687 12174908 11781896 11363338 10928728
59812 10928728 10487068 10047291 9616900 9200659 8801471 8422189 8065693 7733784 7427317
59803 7427317 7147282 6894485 6668148 6466126 6286858 6130021 5994980 5879772 5782211 5701063
59793 5701063 5635275 5582511 5538998 5500573 5463887 5427274 5390941 5355845 5322129 5288955 5255807
59782 5255807 5223209 5191954 5162263 5133984 5106906 5080385 5053041 5023099 4988796 4948534 4901470
59771D901470n3070n6725n7829n7395n6471n5537n4487n2663m9194m3844l7170
59760D327085k9560k0861j1446k710M319J0124J5571K0449K4235K7783L2912M0474
59748D438375M9753N9570O8977P7030Q3035Q7211R0456R3093R4265R2634Q7557
59737E321956P9756P0970O2670N5090M7914M1732L7877L6764L7595M0002M4776
59726E877102N2384O2111P3444Q7045J03474J22148J42520J65067J89919K15801
59716G091015K41731K68619K97716L28648L60583L94202M30245M66699M99103
59707A0378561N22798N32654N21358M81154M08688L07460J86231N6868o6991j73004
59697A3155777k54349l10681l44778l59505l57868l43643l20199k89546k53399
$$ plain form
59771 4901470 4848400 4791675 4733846 4676451 4619980 4564443 4509956 4457293 4408099 4364255 4327085
59760 4327085 4297525 4276664 4265218 4262508 4266827 4276951 4292522 4312971 4337206 4364989 4397901 4438375
59748 4438375 4488128 4547698 4616675 4693705 4776740 4863951 4954407 5047500 5141765 5234399 5321956
59737 5321956 5401712 5472682 5535352 5590442 5638356 5680088 5717965 5754729 5792324 5832326 5877102
59726 5877102 5929486 5991597 6065041 6152086 6255560 6377708 6520228 6685295 6875214 7091015
59716 7091015 7332746 7601365 7899081 8227729 8588312 8982514 9412759 9879458 10378561
59707 10378561 10901359 11434013 11955371 12436525 12845213 13152673 13338904 13395772 13328781 13155777
59697 13155777 12901428 12590747 12245969 11886464 11528596 11184953 10864754 10575208 10321809
59688A0321809k14391j75268j37377j00508o3917k7226R080M3808P6057J06222
59678I838289J35543J64878J94433K24462K55377K87307L20311L54921L91770
59669A2167291M30860M71945N15228N60910O08424O57138P07299P59279Q12526
59660A7690900Q66456R21474R77232J030420J076450J113082J140210J156085
59652B5972309J156834J140823J111354J073785J032003R89046R49053R16181
59644C4341388Q92258Q76948Q69243Q67081Q66195Q61068Q46925Q19841P75818
59635D2016765P11638O26955N24591M09018K85546J60591M1007o7565j61059k35768
59625D4311719k88067l15996l20452l03963k68499k14976j44579n9783L6345J41425
$$ plain form
59688 10321809 10107418 9932150 9794773 9694265 9630348 9603122 9612202 9656010 9732067 9838289
59678 9838289 9973832 10138710 10333143 10557605 10812982 11100289 11420600 11775521 12167291
59669 12167291 12598151 13070096 13585324 14146234 14754658 15411796 16119095 16878374 17690900
59660 17690900 18557356 19478830 20456062 21486482 22562932 23676014 24816224 25972309
59652 25972309 27129143 28269966 29381320 30455105 31487108 32476154 33425207 34341388
59644 34341388 35233646 36110594 36979837 37846918 38713113 39574181 40421106 41240947 42016765
59635 42016765 42728403 43355358 43879949 44288967 44574513 44735104 44776111 44708546 44547487 44311719
59625 44311719 44023652 43707656 43387204 43083241 42814742 42599766 42455187 42395404 42431749 42573174
59615D2573174K53829L71601M92011O12543P31686Q47846R57504J054915J133500
59606D9028609J186693J207494J188206J121539J002222Q28128O01192L28328
59598E6492411K1659l02491o25359r28011j194256j413124j579317j691871j753078
59589D7026563j768361j745436j692319j616160j524222j424955j327323j239622
59581C4688165j169819j125854j113047j129878j166903j210628j248564j271571
59573B5251901j274018j254422j216086j165152j106687j042781r74375r03543
59565A6314837q33052p64557o98628o36064n77849n24022m73963m27962l87039
59556A0991701l50948l17817k86455k57701k32666k10913j91425j74333j60290
$$ plain form
59615 42573174 42827003 43198604 43690615 44303158 45034844 45882690 46840194 47895109 49028609
59606 49028609 50215302 51422796 52611002 53732541 54734763 55562891 56164083 56492411
59598 56492411 56514070 56211579 55586220 54658209 53463953 52050829 50471512 48779641 47026563
59589 47026563 45258202 43512766 41820447 40204287 38680065 37255110 35927787 34688165
59581 34688165 33518346 32392492 31279445 30149567 28982664 27772036 26523472 25251901
59573 25251901 23977883 22723461 21507375 20342223 19235536 18192755 17218380 16314837
59565 16314837 15481785 14717228 14018600 13382536 12804687 12280665 11806702 11378740 10991701
59556 10991701 10640753 10322936 10036481 9778780 9546114 9335201 9143776 8969443 8809153
59547H809153j49026j40007j33877j31668j32771j35196j37866j41322j45965
59538G561455j50797j54258j55312j53525j49055j43003j36904j31188j24654
59529F262759j15879j04807r2686q0853o9822n9351m9005l8637k8402j8373q509
59518E596435R94R744J7743K5528L3298M0472M6455N1400N5760N9670O3269O7022
59506F067790P1054P4847P8316Q2658Q9216R8005J08247J19838J33190J47854
59496G071015J62543J76625J90781K06080K22994K41337K60644K80682L01806
59487I114507L24406L47611L69198L87441M02485M15162M25046M30503M30201
59478A2646560M23904M12415L97146L78693L54991L22469K80755K35303J93405
$$ plain form
59547 8809153 8660127 8520120 8386243 8254575 8121804 7986608 7848742 7707420 7561455
59538 7561455 7410658 7256400 7101088 6947563 6798508 6655505 6518601 6387413 6262759
59529 6262759 6146880 6042073 5949387 5868534 5798712 5739361 5690356 5651719 5623317 5604944 5596435
59518 5596435 5597429 5607173 5624916 5650444 5683742 5724214 5770669 5822069 5877829 5937499 6000768 6067790
59506 6067790 6138844 6213691 6292007 6374665 6463881 6561886 6670133 6789971 6923161 7071015
59496 7071015 7233558 7410183 7600964 7807044 8030038 8271375 8532019 8812701 9114507
59487 9114507 9438913 9786524 10155722 10543163 10945648 11360810 11785856 12216359 12646560
59478 12646560 13070464 13482879 13880025 14258718 14613709 14936178 15216933 15452236 15645641
59469A5645641J57900J26314R5559O5495L8159J5707l90r621j2553r857j279J3525
59457A6124600L3586N7374Q4532J15114J47038J75815J96884K06958K03400J84171
59447A7529472J48979R9330L7351l4424j12564j93685k75679l56342m31025m93703
59437A5917710n40755n72104n88804n91623n82201n63281n36857n03786m65798
59428A0972501m26010l86591l47628l08973k71433k35277j99437j63445j28699
59419H505008r6631o6743l7609q636J9938M7847P4752J00568J26329J53469J81604
59408H999896K08396K32313K53974K74034K91294L04015L11593L13647L08642
59399A1497804K94670K70773K36697J92497J39386P9902J6317n0084j17438j82272
$$ plain form
59469 15645641 15803541 15929855 16025414 16090909 16129068 16144775 16144385 16134764 16122211 16112354 16111075 16124600
59457 16124600 16158186 16215560 16300092 16415206 16562244 16738059 16934943 17141901 17345301 17529472
59447 17529472 17678451 17777781 17815132 17780708 17668144 17474459 17198780 16842438 16411413 15917710
59437 15917710 15376955 14804851 14216047 13624424 13042223 12478942 11942085 11438299 10972501
59428 10972501 10546491 10159900 9812272 9503299 9231866 8996589 8797152 8633707 8505008
59419 8505008 8408377 8341634 8304025 8295389 8315327 8363174 8437926 8538494 8664823 8818292 8999896
59408 8999896 9208292 9440605 9694579 9968613 10259907 10563922 10875515 11189162 11497804
59399 11497804 11792474 12063247 12299944 12492441 12631827 12711729 12728046 12677962 12560524 12378252
59389A2378252k41135k92178l34465l67141l90303m05309m13084m13319m06329
59380I114989l94289l79361l61918l41906l20532k99088k77351k54836k32607
59371F253101k12220j93766j76441j60085j44549j28691j11965r6142q3380p3054
59361D872808o2521n0778l9411k9823k1346j2525k870P146J6815K5655L3690M1216
59349D778056M7550N0531M8423M2334L5801L1954L1742L4581L9768M7109N6857
59338E244706O9014Q2417R4770J04025J09558J12156J13903J18321J28861J45786
59328F323517J65435J83984K01397K20600K43719K70717L01069L34632L70672
59319H615742M07722M45023M83196N23160N65271O09701O56509P04716P51881
$$ plain form
59389 12378252 12137117 11844939 11510474 11143333 10753030 10347721 9934637 9521318 9114989
59380 9114989 8720700 8341339 7979421 7637515 7316983 7017895 6740544 6485708 6253101
59371 6253101 6040881 5847115 5670674 5510589 5366040 5237349 5125384 5029242 4945862 4872808
59361 4872808 4810287 4759509 4720098 4690275 4668929 4656404 4653534 4660680 4677495 4703150 4736840 4778056
59349 4778056 4825606 4876137 4924560 4966894 5002695 5034649 5066391 5100972 5140740 5187849 5244706
59338 5244706 5313720 5396137 5490907 5594932 5704490 5816646 5930549 6048870 6177731 6323517
59328 6323517 6488952 6672936 6874333 7094933 7338652 7609369 7910438 8245070 8615742
59319 8615742 9023464 9468487 9951683 10474843 11040114 11649815 12306324 13011040 13762921
59310A3762921P94999Q31527Q59187Q75331Q77202Q63365Q34826P94449P45057
59301B1238864O88372O26137N61433M97717M36658L77967L21257K66701K13592
59292B5228698J59647J02402M0447k6847r9410j75909k54365l33838m13964m92321
59282B3734540n64157o25890o77473p20359p54808p80422p97718q07348q08922
59273A7197443q02098p87799p67069p40011p07331o71490o34467n95712n54397
59264A0937069n12505m73136m36582m00728l65003l31318l00818k72215k44203
59255G600561k17596j93984j73436j54489j35737j16923r8867q2529o7919n4174
59245F304907m0880k8469j6815m522R271K3386L6234M8109O0420P3375Q6043R8147
$$ plain form
59310 13762921 14557920 15389447 16248634 17123965 18001167 18864532 19699358 20493807 21238864
59301 21238864 21927236 22553373 23114806 23612523 24049181 24427148 24748405 25015106 25228698
59292 25228698 25388345 25490747 25531194 25504347 25404937 25229028 24974663 24640825 24226861 23734540
59282 23734540 23170383 22544493 21867020 21146661 20391853 19611431 18813713 18006365 17197443
59273 17197443 16395345 15607546 14840477 14100466 13393135 12721645 12087178 11491466 10937069
59264 10937069 10424564 9951428 9514846 9114118 8749115 8417797 8116979 7844764 7600561
59255 7600561 7382965 7188981 7015545 6861056 6725319 6608396 6509529 6427000 6359081 6304907
59245 6304907 6264027 6235558 6218743 6214221 6223492 6246878 6283112 6331221 6391641 6465016 6551059 6649206
59233F649206J10139J21858J32766J43319J54576J66587J78592J90518K02814
59224H050375K14917K25475K33967K40812K45864K48372K48416K46855K43538
59215A0198591K36754K24810K07435J85882J62531J40078J19770J00361P9530
59206A1655742N5953K9423n0l1833o4107r5354j25753j55542j82666k03932k18173
59195A0663708k26391k29299k26842k19934k10216j97852j81643j61752j40260
59186H869519j18605r6451p3646n1224k9657p997J4118L5371N4789P3455R2774
59175H762446J12124J29619J44614J58325J72244J86642K00419K12125K21541
59166A0300099K30475K41309K54639K68960K82875K96843L12537L31089L52190
$$ plain form
59233 6649206 6759345 6881203 7013969 7157288 7311864 7478451 7657043 7847561 8050375
59224 8050375 8265292 8490767 8724734 8965546 9211410 9459782 9708198 9955053 10198591
59215 10198591 10435345 10660155 10867590 11053472 11216003 11356081 11475851 11576212 11655742
59206 11655742 11711695 11741118 11741068 11709235 11645128 11549774 11424021 11268479 11085813 10881881 10663708
59195 10663708 10437317 10208018 9981176 9761242 9551026 9353174 9171531 9009779 8869519
59186 8869519 8750914 8654463 8580817 8529593 8499936 8491939 8506057 8541428 8596217 8669672 8762446
59175 8762446 8874570 9004189 9148803 9307128 9479372 9666014 9866433 10078558 10300099
59166 10300099 10530574 10771883 11026522 11295482 11578357 11875200 12187737 12518826 12871016
59157A2871016L74263L95216M13273M26895M33535M29145M09897L74239L22649
59148A6450128K56047J75552Q3388j7259j22956k29659l32327m26309n08682n77030
59138A4750893o28041o59585o73724o75154o66434o47011o17269n80938n42463
59129I060274n03972m66007m29366l94710l61718l30181l01070k75316k52354
59120E745580k30943k10898j92877j76874j61899j47162j32987j20475j10267
59111D261198j01614r2971q3809p5267o8302o1957n4638m6608l9626l4185k8740
59100C573481k1946j4314p198j286L589Q165J3568K0393K7759L4234L9677M5086
59088C721208N0772N6142O1339O7445P4676Q1784Q7880R3520R9454J05554J11652
$$ plain form
59157 12871016 13245279 13640495 14053768 14480663 14914198 15343343 15753240 16127479 16450128
59148 16450128 16706175 16881727 16965115 16947856 16824900 16595241 16262914 15836605 15327923 14750893
59138 14750893 14122852 13463267 12789543 12114389 11447955 10800944 10183675 9602737 9060274
59129 9060274 8556302 8090295 7660929 7266219 6904501 6574320 6273250 5997934 5745580
59120 5745580 5514637 5303739 5110862 4933988 4772089 4624927 4491940 4371465 4261198
59111 4261198 4159584 4066613 3982804 3907537 3839235 3777278 3722640 3676032 3636406 3602221 3573481
59100 3573481 3551535 3537221 3530023 3528737 3532326 3540491 3554059 3574452 3602211 3636445 3676122 3721208
59088 3721208 3771980 3828122 3889461 3956906 4031582 4113366 4201246 4294766 4394220 4499774 4611426
59077D611426J18267J25655J32934J38900J43228J46600J50176J54940J60838
59068E882964J66530J70789J73827J76356J77693J76267J71932J66284J60478
59059G423120J54203J47086J39722J32776J26210J19913J14260J09764J06938
59050H573992J06552J09199J14628J22192J31592J42307J53011J62919J72885
59041I789277J83620J93335J98932J98851J92804J79329J56254J23508Q3230L7190
59031A1336330j3380o5367j14077j56560j92452k21266k41564k53323k58429k57874
59021I562038k51118k38966k24228k08332j90216j70198j51946j38521j28839
59012G859674j20509j14018j11487j12803j15772j19335j24337j31496j40314
$$ plain form
59077 4611426 4729693 4855348 4988282 5127182 5270410 5417010 5567186 5722126 5882964
59068 5882964 6049494 6220283 6394110 6570466 6748159 6924426 7096358 7262642 7423120
59059 7423120 7577323 7724409 7864131 7996907 8123117 8243030 8357290 8467054 8573992
59050 8573992 8680544 8789743 8904371 9026563 9158155 9300462 9453473 9616392 9789277
59041 9789277 9972897 10166232 10365164 10564015 10756819 10936148 11092402 11215910 11299140 11336330
59031 11336330 11322950 11257583 11143506 10986946 10794494 10573228 10331664 10078341 9819912 9562038
59021 9562038 9310920 9071954 8847726 8639394 8449178 8278980 8127034 7988513 7859674
59012 7859674 7739165 7625147 7513660 7400857 7285085 7165750 7041413 6909917 6769603
59003F769603j49717j58466j65422j70406j74280j77498j79352j79179j77096
58994E238187j73102j66935j59524j52912j47739j42371j35484j27814j20403
58985C911903j12974j05446r9120r4769r1110q6863q2773p9920p7487p4030o9829
58974B937582o6077o2717n8801n4206m9495m4790m0018l5422l0855k5659k0145
58963B449397j5844j3279j1054q401o816p636r619j0617j0168q759o281l101j065
58950B336757j217j938j554j192k486l907k477J594N028O134O472P640Q942Q947
58936B366743P521N556L899K996K725K598K768M247P210J0074J1538J2585J4783
58923B455243J7463J8650J8286J8375J9983K2064K3425K4224K5085K6140K7318
$$ plain form
59003 6769603 6619886 6461420 6295998 6125592 5951312 5773814 5594462 5415283 5238187
58994 5238187 5065085 4898150 4738626 4585714 4437975 4295604 4160120 4032306 3911903
58985 3911903 3798929 3693483 3594363 3499594 3408484 3321621 3238848 3158928 3081441 3007411 2937582
58974 2937582 2871505 2808788 2749987 2695781 2646286 2601496 2561478 2526056 2495201 2469542 2449397
58963 2449397 2433553 2420274 2409220 2400819 2394003 2386367 2376748 2366131 2355963 2347204 2340923 2337822 2336757
58950 2336757 2335540 2333602 2332048 2330856 2328370 2324463 2321986 2323580 2328608 2334742 2341214 2348854 2357796 2366743
58936 2366743 2374264 2379820 2383719 2386715 2389440 2392038 2394806 2399053 2406263 2416337 2427875 2440460 2455243
58923 2455243 2472706 2491356 2509642 2528017 2548000 2570064 2593489 2617713 2642798 2668938 2696256
58912B696256K8589K9693L0498L1619L3783L6690L9407M1733M4253M7089M9474
58901C109084N0764N1288N2037N3651N5714N7170N7792N8809O1280O4429O7045
58890C739063O9947P4932Q1417Q6780R0468R4850J01020J06899J11245J16521
58880D673142J25208J35810J45395J54146J64270J75961J87766K00010K14545
58871F176253K31355K48191K63645K78589K94892L14445L38792L67578L97958
58862H911698M27498M57048M89084N24269N61806O01864O44886O89311P32911
58853A4040375P76078Q21082Q68159R14715R58070R96417J027195J047151J054243
58844B2503485J047070J022148R74118Q99248P97003O68438N15550L42884J57709
$$ plain form
58912 2696256 2724845 2754538 2785036 2816655 2850438 2887128 2926535 2968268 3012521 3059610 3109084
58901 3109084 3159848 3211136 3263173 3316824 3372538 3429708 3487500 3546309 3607589 3672018 3739063
58890 3739063 3809010 3883942 3965359 4052139 4142607 4237457 4338477 4445376 4556621 4673142
58880 4673142 4798350 4934160 5079555 5233701 5397971 5573932 5761698 5961708 6176253
58871 6176253 6407608 6655799 6919444 7198033 7492925 7807370 8146162 8513740 8911698
58862 8911698 9339196 9796244 10285328 10809597 11371403 11973267 12618153 13307464 14040375
58853 14040375 14816453 15637535 16505694 17420409 18378479 19374896 20402091 21449242 22503485
58844 22503485 23550555 24572703 25546821 26446069 27243072 27911510 28427060 28769944 28927653
58835B8927653l2312k20505m00260n64602p07434q24747r15009r79421j021117
58826B3262246j042669j045007j029825j001547r64810r21291q71368q17688p64212
58817A4803829p12427o61562o12220n66662n25597m87652m52305m20583l92661
58808I972160l67587l45515l27279l11252k93715k73425k53098k35263k19080
58799G345946k02431j85034j68020j52289j38330j26162j14566j01856q8118p5240
58789E993900o4259n4281m4260l4044k3311j1470Q42J2062K2133L2817M5021N7664
58777E932814O9833Q2127R5101J08087J20387J32228J43989J55992J69311J85098
58767G194967K02743K20418K37761K56214K76457K97608L19395L43044L69311
$$ plain form
58835 28927653 28895341 28674836 28274576 27709974 27002540 26177793 25262784 24283363 23262246
58826 23262246 22219577 21174570 20144745 19143198 18178388 17257097 16385729 15568041 14803829
58817 14803829 14091402 13429840 12817620 12250958 11725361 11237709 10785404 10364821 9972160
58808 9972160 9604573 9259058 8931779 8620527 8326812 8053387 7800289 7565026 7345946
58799 7345946 7143515 6958481 6790461 6638172 6499842 6373680 6259114 6157258 6069140 5993900
58789 5993900 5929641 5875360 5831100 5797056 5773745 5762275 5763117 5775179 5797312 5830129 5875150 5932814
58777 5932814 6002647 6084774 6179875 6287962 6408349 6540577 6684566 6840558 7009869 7194967
58767 7194967 7397710 7618128 7855889 8112103 8388560 8686168 9005563 9348607 9717918
58758I717918L97547M27348M59278M93448N29415N68057O11149O58297P06319
58749A4568776P52692P97631Q41835Q84194R22826R56305R82417R97271R96912
58740B2700859R78452R38823Q74236P82368O64007N21823L59129J80845n853j93140
58730B7801549l73957n41420o88707q11030r07013r77588j024519j050163j057054
58721B0370098j047056j022171r86399r44882r00598q53623q04227p54817p07885
58712A2348440o63789o21582n80685n41108n03430m69073m39030m11935l85245
58703G732563l58708l34501l13405k93407k73110k53929k37307k22115k06591
58694E239490j91115j77028j64323j52320j41329j31760j22628j12784j02806
$$ plain form
58758 9717918 10115465 10542813 11002091 11495539 12024954 12593011 13204160 13862457 14568776
58749 14568776 15321468 16119099 16960934 17845128 18767954 19724259 20706676 21703947 22700859
58740 22700859 23679311 24618134 25492370 26274738 26938745 27460568 27819697 28000542 27994689 27801549
58730 27801549 27427592 26886172 26197465 25386435 24479422 23501834 22477315 21427152 20370098
58721 20370098 19323042 18300871 17314472 16369590 15468992 14615369 13811142 13056325 12348440
58712 12348440 11684651 11063069 10482384 9941276 9437846 8968773 8529743 8117808 7732563
58703 7732563 7373855 7039354 6725949 6432542 6159432 5905503 5668196 5446081 5239490
58694 5239490 5048375 4871347 4707024 4554704 4413375 4281615 4158987 4046203 3943397
58685C943397r4159q7140q1126p6153p2783p0651o8233o4046n7814n0927m5853
58674C174512m4166m4819m5156m3782m1473l9391l7867l7091l7339l8029l7952
58663B727447l6943l6063l5970l6477l7724m0122m2968m4937m6083m7588m9412
58652B273160n0236m9821m9272m8662m6822m3765m0975l8826l6242l3352l1685
58641A803502l1052k9225k5838k3571k4017k5232k5012k3937k3277k2521k1123
58630A528697k0466k1706k3454k3669k2376k0713j8840j6575j4600j3371j2035
58619A320892r844p361n293l571k344k030j683M67M063O691P778R480J2535J4460
58605A344240J3675J2169J1811J1081Q071L887L03l225p171r259p710n024m787
$$ plain form
58685 3943397 3849238 3762098 3680972 3604819 3532036 3461385 3393152 3329106 3271292 3220365 3174512
58674 3174512 3130346 3085527 3040371 2996589 2955116 2915725 2877858 2840767 2803428 2765399 2727447
58663 2727447 2690504 2654441 2618471 2581994 2544270 2504148 2461180 2416243 2370160 2322572 2273160
58652 2273160 2222924 2173103 2123831 2075169 2028347 1984582 1943607 1904781 1868539 1835187 1803502
58641 1803502 1772450 1743225 1717387 1693816 1669799 1644567 1619555 1595618 1572341 1549820 1528697
58630 1528697 1508231 1486525 1463071 1439402 1417026 1396313 1377473 1360898 1346298 1332927 1320892
58619 1320892 1311048 1303687 1298394 1294823 1292479 1290449 1288766 1289233 1293296 1299987 1307765 1317245 1329780 1344240
58605 1344240 1357915 1370084 1381895 1392976 1401047 1404934 1405237 1402012 1394841 1385582 1377872 1372848 1368061
58592A368061o351o270l732r55R95L265O479R901J3114J6115J8249J9249K0655
58579A458775K3865K7706L0253L2083L5210L9586M3364M6045M8801N2072N5365
58568A893125N9185O4722P1645P8277Q3995Q9696R6154J03549J12265J22451J33160
58557B908224J43500J54182J66594J80894J96369K12747K29659K45808K60344
58548D698321K74005K87173K97744L02782L01306K93394K77453K50621K11645
58539G194444J61811J03735M0955k2037q1278j34856j81870k20800k50204k70075
58529F339825k81203k84173k80336k72497k62871k51277k36799k20138k02905
58520D047626j85782j68885j52794j37768j23161j08956r6562q6752p8540p1296
$$ plain form
58592 1368061 1361710 1355440 1351708 1350753 1351748 1355013 1361492 1371393 1384507 1400622 1418871 1438120 1458775
58579 1458775 1482640 1510346 1540599 1572682 1607892 1647478 1690842 1736887 1785688 1837760 1893125
58568 1893125 1952310 2017032 2088677 2166954 2250949 2340645 2436799 2540348 2652613 2775064 2908224
58557 2908224 3051724 3205906 3372500 3553394 3749763 3962510 4192169 4437977 4698321
58548 4698321 4972326 5259499 5557243 5860025 6161331 6454725 6732178 6982799 7194444
58539 7194444 7356255 7459990 7500945 7478908 7397630 7262774 7080904 6860104 6609900 6339825
58529 6339825 6058622 5774449 5494113 5221616 4958745 4707468 4470669 4250531 4047626
58520 4047626 3861844 3692959 3540165 3402397 3279236 3170280 3073718 2986966 2908426 2837130
58510B837130o5938o2446n8470n2643m7039m3963m2235l9424l5906l3824l3415
58499B321827l3187l2590l1817l0129k7015k4021k2965k3318k3607k4175k6166
58488B022837k9008l1358l3329l5542l7289l7914l8454l9577l9635l7405l4847
58477A628479l4137l3815l1214k7190k4907k5023k5505k5224k4452k2679j9253
58466A335080j5479j3152j1901j0691j0567j2675j5011j4724j2669j2001j3151
58455A193059j3821j3085j1778r572n599j499K4m98j21J749L103L593N039P473
58441A158067Q465P038N008L864L286L022L325L167Q80l085o415q036q735r058
58427A160793r035r367j0401j0678r241q188r905j2818j3457j1776j0614j0588
$$ plain form
58510 2837130 2771192 2708746 2650276 2597633 2550594 2506631 2464396 2424972 2389066 2355242 2321827
58499 2321827 2288640 2256050 2224233 2194104 2167089 2143068 2120103 2096785 2073178 2049003 2022837
58488 2022837 1993829 1962471 1929142 1893600 1856311 1818397 1779943 1740366 1700731 1663326 1628479
58477 1628479 1594342 1560527 1529313 1502123 1477216 1452193 1426688 1401464 1377012 1354333 1335080
58466 1335080 1319601 1306449 1294548 1283857 1273290 1260615 1245604 1230880 1218211 1206210 1193059
58455 1193059 1179238 1166153 1154375 1144803 1139204 1137705 1137729 1137231 1137110 1138859 1141962 1145555 1150594 1158067
58441 1158067 1166532 1173570 1178578 1182442 1185728 1188750 1192075 1195242 1196122 1193037 1186622 1178586 1169851 1160793
58427 1160793 1151758 1142391 1131990 1121312 1112071 1103883 1093978 1081160 1067703 1055927 1045313 1034725
58415A034725r639p446o127o323o278n243m434m270l789l045l170m038m542m825
58401I61556n452n283l330j685k923n481n615l204j366r18K16K290L066K197J842
58386I35910K563K775K730M705Q512J0980J0818J0335J1350J3042J4446J5755
58374A043921J6438J5417J3461J2361J1558Q917M662J126j268m029o907q080p799
58361A099778q056q906q952q941j0553j2314j1284q283o604o078l655L51K267
58348A008770J500J388L047L933L330L781N964P387P263P677Q957Q895P490P351
58334A086733Q526Q165O141N641P224P814O579O252P586Q211P987R524J2272J2497
58320A201152J0448J0998J5217J8116J7065J5785J7058J7976J5849J2837J1135
$$ plain form
58415 1034725 1025086 1017640 1011513 1005190 998912 993669 989235 984965 981176 978131 974961 970923 966381 961556
58401 961556 956104 950821 947491 945806 942883 937402 931787 928583 927217 926299 926515 928805 931871 934068 935910
58386 935910 938473 941248 943978 948683 957195 968175 978993 989328 1000678 1013720 1028166 1043921
58374 1043921 1060359 1075776 1089237 1101598 1113156 1122073 1126735 1127861 1126593 1122564 1115657 1107577 1099778
58361 1099778 1091722 1082816 1073864 1064923 1054370 1042056 1030772 1022489 1015885 1009807 1006152 1006503 1008770
58348 1008770 1010270 1011658 1014705 1018638 1021968 1025749 1031713 1039100 1046363 1054040 1062997 1071892 1079382 1086733
58334 1086733 1095259 1103424 1109565 1115206 1122430 1130244 1136823 1143075 1150661 1158872 1166859 1176383 1188655 1201152
58320 1201152 1211600 1222598 1237815 1255931 1272996 1288781 1305839 1323815 1339664 1352501 1363636
58309A363636R045N404K775K743K819J155k41K93J238J761L462O027O269L900
58295A410286K919M875O319N399N109P237Q965Q561Q527R939R579O019K905K715
58281A499354K909J570J075K706L510K112J915M783P358P338P648J0430J2680
58268A565388J1937J0868J2265J4776J7001K0200K3744K3934K0876K0135K3968
58257A765092K7466K7160K6456K8328K9625K7551K5139K5363K6031K5176K5123
58246B058510K6822K6753K3931K3113K6464K9220K8300K7670L0245L2213L0946
58235B364187L0631L4297L7892L8176L8804M2577M5567M5087M5450M9531N2833
58224B825032N2423N3137N8043O1660O0064N8852O3034O7878O8195O8019P2265
$$ plain form
58309 1363636 1372681 1378085 1380860 1383603 1386422 1387577 1387336 1387629 1388867 1390628 1394090 1400117 1406386 1410286
58295 1410286 1413205 1418080 1424399 1429798 1434907 1442144 1451109 1459670 1468197 1478136 1487715 1493734 1496639 1499354
58281 1499354 1502263 1503833 1504908 1507614 1511124 1513236 1515151 1519934 1527292 1534630 1542278 1552708 1565388
58268 1565388 1577325 1588193 1600458 1615234 1632235 1652435 1676179 1700113 1720989 1741124 1765092
58257 1765092 1792558 1819718 1846174 1874502 1904127 1931678 1956817 1982180 2008211 2033387 2058510
58246 2058510 2085332 2112085 2136016 2159129 2185593 2214813 2243113 2270783 2301028 2333241 2364187
58235 2364187 2394818 2429115 2467007 2505183 2543987 2586564 2632131 2677218 2722668 2772199 2825032
58224 2825032 2877455 2930592 2988635 3050295 3110359 3169211 3232245 3300123 3368318 3436337 3508602
58213C508602P7285P8803Q0908Q7944R5616R9328J03150J11215J18683J20868
58203D482402J22849J30121J38272J42002J45924J55909J68137J77106J86066
58194E848788J99290K12660K22274K33184K49335K64538K74040K84578L01906
58185H090593L19415L30888L42941L62421L83445M00055M19056M46330M73582
58176A1568726M93824N16785N52921N95384O34328O75058P24487P74202Q16135
58167A7351850Q60495R18222R80319J035307J091817J161806J237376J307835
58159B5945027J383634J478604J585072J692626J814168J965892K139447K322493
58151D0326963K526844K765471L023734L288346L583091L939913M359533M839815
$$ plain form
58213 3508602 3585887 3664690 3745598 3833542 3929158 4028486 4131636 4242851 4361534 4482402
58203 4482402 4605251 4735372 4873644 5015646 5161570 5317479 5485616 5662722 5848788
58194 5848788 6048078 6260738 6483012 6716196 6965531 7230069 7504109 7788687 8090593
58185 8090593 8410008 8740896 9083837 9446258 9829703 10229758 10648814 11095144 11568726
58176 11568726 12062550 12579335 13132256 13727640 14361968 15037026 15761513 16535715 17351850
58167 17351850 18212345 19130567 20110886 21146193 22238010 23399816 24637192 25945027
58159 25945027 27328661 28807265 30392337 32084963 33899131 35865023 38004470 40326963
58151 40326963 42853807 45619278 48643012 51931358 55514449 59454362 63813895 68653710
58143F8653710N413573O110271O907247P769143Q707793R754113J0912010J2203411
58135A36431271J3713015J5509424J7563106J9817870K2281268K4969193K7896614
58128B78181761L1255130L5291664L9434470M1467310L8282438K8240848J2947671
58121E05101292l549138j7401414k6879387l2231960l4475758l4589833l3368973
58114C22604829l1407671k9041714k6425783k3690750k0967421j8322918j5788037
58107A56960535j3425593j1292053r364434p584238n946588m481803l200435k155930
58099I9509461j531697j538566k179776l175071m145696m845081n223813n351038
58091G1518723n318776n187039m972913m679479m329358l958328l585741l214483
$$ plain form
58143 68653710 74067283 80177554 87084801 94853944 103561737 113315850 124227860 136431271
58135 136431271 150144286 165653710 183216816 203034686 225315954 250285147 278181761
58128 278181761 309436891 344728555 384163025 425630335 463912773 492153621 505101292
58121 505101292 501552154 484150740 457271353 425039393 390563635 355973802 322604829
58114 322604829 291197158 262155444 235729661 212038911 191071490 172748572 156960535
58107 156960535 143534942 132242889 122878455 115294217 109347629 104865826 101665391 99509461
58099 99509461 97977764 96439198 94259422 91084351 86938655 82093574 76869761 71518723
58091 71518723 66199947 61012908 56039995 51360516 47031158 43072830 39487089 36272606
58083C6272606k855888k530630k246100j994895j774871j590771j437719j303249
58075B0538483j184703j086798j004512r26830q54874p97855p53209p08732o62395
58066A2558575o22296n88624n53133n15457m83030m55317m24226l89941l61294
58057H165257l40655l22695l07175k98822k95167k88480k79115k73560k70296
58048E489292k61179k46137k33011k23144k10308j93793j79600j68400j54888
58039C618832j39545j28902j23390j16557j07011r9962r6246r0921q3488p8857
58029B553953p7249p3471o7095o3246o2463n9656n4097n0841n1180n0834m8604
58018A895217m7863m8646m6969m2795m0242l9347l6086l0933k8907l0457l0681
$$ plain form
58083 36272606 33416718 30886088 28639988 26645093 24870222 23279451 21841732 20538483
58075 20538483 19353780 18266982 17262470 16335640 15480766 14682911 13929702 13220970 12558575
58066 12558575 11936279 11347655 10794522 10279065 9796035 9340718 8916492 8526551 8165257
58057 8165257 7824602 7501907 7194732 6895910 6600743 6312263 6033148 5759588 5489292
58048 5489292 5228113 4981976 4748965 4525821 4315513 4121720 3942120 3773720 3618832
58039 3618832 3479287 3350385 3226995 3110438 3003427 2903465 2807219 2716298 2632810 2553953
58029 2553953 2476704 2403233 2336138 2272892 2210429 2150773 2096676 2045835 1994655 1943821 1895217
58018 1895217 1847354 1798708 1751739 1708944 1668702 1629355 1593269 1562336 1533429 1502972 1472291
58007A472291k8138k6295k5779k3461j9683j8265j8753j6671j1963r257r406q768
57995A255852p195q385j1800j2690j0899j1242j4166j4456j0669p573p490p183
57983A132104n200m459n541n004k503k284n326p061n209l140l182l216k214k724
57969A075041n291o483m920l739m918o455o900p362p702o187m069m717p216o998
57955I92084l921l148o380q987p981o410p156q444q279p894q129p474o075o666
57941H95140r353j0494q708p029p128o682m395k523k239j471O07J966K283M039
57927H44013P223Q352O566N349O115N691K554p9n2J18j707l694m232m766n885
57912H65566n514l651l688o312p478n388m032o266q801q055n932n475n423l633
$$ plain form
58007 1472291 1444153 1417858 1392079 1368618 1348935 1330670 1311917 1295246 1283283 1274026 1264620 1255852
57995 1255852 1248657 1240272 1228472 1215782 1204883 1193641 1179475 1165019 1154350 1146777 1139287 1132104
57983 1132104 1126904 1122445 1116904 1111900 1109397 1107113 1101787 1094726 1089517 1086377 1083195 1079979 1077765 1075041
57969 1075041 1069750 1063267 1058347 1054608 1049690 1043235 1036335 1028973 1021271 1015084 1011015 1006298 999082 992084
57955 992084 988163 985015 978635 969648 961667 955257 948101 939657 931378 923484 915355 907881 901806 895140
57941 895140 885787 875293 866585 859556 852428 845746 841351 838828 836589 835118 835725 837691 839974 844013
57927 844013 851236 859588 866154 871503 877618 883309 885863 885784 885732 885850 884143 880449 876217 871451 865566
57912 865566 860052 856401 852713 846401 838923 833535 829503 823237 814436 806381 800449 794974 789551 785918
57898G85918j881k591m279m559m462n618o394m929l100l308m018k607k44J34j278
57883G36784k107j921j995k382k271j892j685r97L19Q33m3o67k0L20j140l599
57867G17537o046q850j1464j1632q951o287n542n037l265j820k005j862L66K812
57853F47954L152K559L259M598M741M216M654N704O006N669N490N298M929M922
57839G13151M687K578n70j156J766M107K506q10k121k028l344n714o511n502m850
57824F96189n418o300p107q029q505q091p680p913p712o164m217k872j635m03
57810F14143m69j671j262K067N592O655O623P849R281Q509O100M384L659K825
57796F74285K233K598K496K24k955m474m244m100m607n275o630r211j1442j1355
$$ plain form
57898 785918 784037 781446 777167 772608 768146 762528 756134 751205 748105 744797 740779 738172 737928 738062 736784
57883 736784 734677 732756 730761 728379 726108 724216 722531 721534 721853 722686 722643 721976 721956 722276 721136 717537
57867 717537 711491 702641 691177 679545 670594 664307 658765 653728 650463 648643 646638 644776 645142 647954
57853 647954 651106 653665 656924 661522 666263 670479 675133 680837 686843 692512 698002 703300 708229 713151
57839 713151 717838 720416 719846 718690 720456 724563 727069 726259 724138 722110 718766 713052 706541 701039 696189
57824 696189 690771 684471 677364 669335 660830 652739 645059 637146 629434 623270 619053 616181 614546 614143
57810 614143 613674 612003 610741 612808 618400 625055 631678 639527 648808 657317 663417 667801 671460 674285
57796 674285 676518 679116 681612 681836 678881 674407 670163 666063 661456 656181 649551 640340 628898 617543
57782F17543r637q481q294p948p266o824o225m870l590l458m010m436n188o683
57768E30633p912q216q622r581r547p990p324r243j1521j1458j0174j0178j0920
57755D07947j0367r117q870q463n658j793m52j985l328k875j758n05J821M788
57741C59385O368O070N516N571N348M361L302K604K238K618L743M082K557Q53
57727D14616J227K845L060J621O30Q51J076R84J558K527K209J33k467m794o776
57712D19300p371n311j799N9j037l435n110n499m700l005j449j042j292r61L0
57697C77378R71J952L380M564M714M644N539O807P111O695O622O629N999N480
57683D48485N863N809L803J341J131K881M037M131N079P295Q828Q667P935P374
$$ plain form
57782 617543 607906 599425 591131 583183 575917 569093 562868 557998 554408 550950 546940 542504 537316 530633
57768 530633 522721 514505 505883 496302 486755 478765 471441 462198 450677 439219 429045 418867 407947
57755 407947 397580 388463 379593 371130 365472 363679 363227 361242 357914 355039 353281 352776 354597 359385
57741 359385 365753 371823 377339 382910 388258 392619 395921 398525 400763 403381 407124 411206 413763 414616
57727 414616 415843 418688 421748 423369 423999 424850 425926 426910 428468 430995 433204 433337 430870 426076 419300
57712 419300 411929 406618 404819 404878 403841 400406 395296 389797 385097 382092 380643 379601 378309 377348 377378
57697 377378 378349 380301 383681 388245 392959 397603 403142 409949 417060 423755 430377 437006 443005 448485
57683 448485 454348 460157 463960 465301 466432 469313 473350 477481 482560 489855 498683 507350 515285 522659
57669E22659O292M516L091K763L592N850R178J1478J1174J0046J1030J3788J5407
57656F30864J5166J5168J6241J6665J5623J4762J5460J7158J9105K1308K3268
57645H20788K4183K4823K6817K9844L1980L3050L4876L7970M0811M2878M5582
57634A193602M9501N3421N6917O1244O6889P2669P8132Q4467R2365J01285J11411
57623B021903J23745J37678J51089J63701J77756J94416K12085K29362K47210
57614C658945K66790K87252L06851L24519L39208L49165L52032L43677L16894
57605F545333K64641J86659R1822o734r7666j73610k31233k71131k96201l08978
57595E702902l11347l06085k96072k81920k63050k41298k20498k02017j83825
$$ plain form
57669 522659 528951 533467 536558 539321 542913 548763 557941 569419 580593 590639 601669 615457 630864
57656 630864 646030 661198 677439 694104 709727 724489 739949 757107 776212 797520 820788
57645 820788 844971 869794 896611 926455 958435 991485 1026361 1064331 1105142 1148020 1193602
57634 1193602 1243103 1296524 1353441 1414685 1481574 1554243 1632375 1716842 1809207 1910492 2021903
57623 2021903 2145648 2283326 2434415 2598116 2775872 2970288 3182373 3411735 3658945
57614 3658945 3925735 4212987 4519838 4844357 5183565 5532730 5884762 6228439 6545333
57605 6545333 6809974 6996633 7088455 7081721 6984055 6810445 6579212 6308081 6011880 5702902
57595 5702902 5391555 5085470 4789398 4507478 4244428 4003130 3782632 3580615 3396790
57586C396790j64725j46550j30983j17229j04090r1706p9949o7771n5479m5189
57576B393119l7600l0709k2836j4538o505J679R541J5503K0147K6773L6923M7953
57564B439450N6947O4337P1903P9927Q8525R9102J11990J24872J35933J46576
57554C419562J58684J71241J81917J89978J95165J95516J88926J75419J55649
57545E032057J28750R4075N3642J0552l3601p7532j18033j51651j77659j97213
57535D563387k10592k17515k19057k16896k11453k02845j92738j82903j72697
57526B736691j60326j46195j32806j21542j11595j02041r3185q5571p8935p2550
57516A631945o6051n9922n5335n2677n0212m5573l9080l3846l1746l1002k8896
$$ plain form
57586 3396790 3232065 3085515 2954532 2837303 2733213 2641507 2561558 2493787 2438308 2393119
57576 2393119 2355519 2324810 2301974 2287436 2280931 2282610 2292151 2307654 2327801 2354574 2391497 2439450
57564 2439450 2496397 2560734 2632637 2712564 2801089 2900191 3012181 3137053 3272986 3419562
57554 3419562 3578246 3749487 3931404 4121382 4316547 4512063 4700989 4876408 5032057
57545 5032057 5160807 5254882 5308524 5319076 5285475 5207943 5089910 4938259 4760600 4563387
57535 4563387 4352795 4135280 3916223 3699327 3487874 3285029 3092291 2909388 2736691
57526 2736691 2576365 2430170 2297364 2175822 2064227 1962186 1869001 1783430 1704495 1631945
57516 1631945 1565894 1505972 1450637 1397960 1347748 1302175 1263095 1229249 1197503 1166501 1137605
57505A137605k5155k1279j8122j5814j4605j4127j2965j0458p893o584n989m957
57493I79657l420j555J232M838P496Q054Q001R502J2527J5620J8343K1227K4235
57480A105757K6865K9038L0731L1759L2994L6353M2226M8365N2805N6379O0927
57469A554199O6646P2877P9829Q7565R4798J00800J07202J15776J25500J33831
57459B539023J40025J45329J50690J55840J59604J59693J53366J39808J20686
57450C864064R7156O8260L3861k943l8457p1560j02012j27583j45689j56526j62023
57439C256548j62979j59761j54316j48564j41824j32560j21554j10717j00035
57430B024238q8673p7976o9996o3811n6550m7740l9497l2779k6497k0250j4864
$$ plain form
57505 1137605 1112450 1091171 1073049 1057235 1042630 1028503 1015538 1005080 997187 990603 984614 979657
57493 979657 976237 974682 975914 980752 988248 996302 1004303 1013805 1026332 1041952 1060295 1081522 1105757
57480 1105757 1132622 1161660 1192391 1224150 1257144 1293497 1335723 1384088 1436893 1493272 1554199
57469 1554199 1620845 1693722 1773551 1861116 1955914 2056714 2163916 2279692 2405192 2539023
57459 2539023 2679048 2824377 2975067 3130907 3290511 3450204 3603570 3743378 3864064
57450 3864064 3961220 4029480 4063341 4060398 4021941 3950381 3848369 3720786 3575097 3418571 3256548
57439 3256548 3093569 2933808 2779492 2630928 2489104 2356544 2234990 2124273 2024238
57430 2024238 1935565 1857589 1787593 1723782 1667232 1619492 1579995 1547216 1520719 1500469 1485605
57419A485605j0133m821Q36N344Q885J3522K0109K7319L3993M0377M6740N2841
57407A720617N8962O5601P2245P8299Q4816R3111J02040J09085J14057J19262
57397B618095J25824J32145J36177J36979J33785J25689J12710R5315P2799M3943
57387C733461R485k7640o4308r7888j25648j45862j59421j68404j73288j73518
57377B606969j70194j65566j59976j51878j41028j29442j18971j09999j02469
57368A357446r6132q9823q2517p4941o8304o2107n5358m9161m5335m3113m0187
57357F50468l6592l4298l3210l1109k7739k5486k5337k5511k4816k4154k3775
57346C38441k2222j9205j6695j5915j5770j5292j4975j4732j3230j0491q549q289
$$ plain form
57419 1485605 1475472 1470651 1471487 1476831 1485716 1499238 1519347 1546666 1580659 1621036 1667776 1720617
57407 1720617 1779579 1845180 1917425 1995724 2080540 2173651 2275691 2384776 2498833 2618095
57397 2618095 2743919 2876064 3012241 3149220 3283005 3408694 3521404 3616719 3689518 3733461
57387 3733461 3742946 3715306 3650998 3553110 3427462 3281600 3122179 2953775 2780487 2606969
57377 2606969 2436775 2271209 2111233 1959355 1818327 1688885 1569914 1459915 1357446
57368 1357446 1261314 1171491 1088974 1014033 945729 883622 828264 779103 733768 690655 650468
57357 650468 613876 579578 546368 515259 487520 462034 436697 411186 386370 362216 338441
57346 338441 316219 297014 280319 264404 248634 233342 218367 203635 190405 179914 171365 163076
57334A63076q076o690n152m402l749k914l197n069o893p398p232o936n697l578
57320H6093k503l397m490m152l345l600m496m905m922m993m714m002l799m313
57306B8462m238k966j652r60J99K264L608L158K238K064J528m12k165j782k55
57291B9091n5j466k675k626j746m65J005J905J545L89o23j297j824k059k020k143
57275A4936k123p08K224M618M523K475N45n6N75J896L056L125K251J854K840M451
57259D6482N484N682N427N186N700P370R189R772R843J1739J5790J9319K0271
57246A77254J9869K0316K1600K2155K1311J9597J7637J5897J4661J3555J2077
57235C75929J0938J1506J3608J5570J6695J7823J9173J9937K0434K2070K4479
$$ plain form
57334 163076 155000 148310 143158 138756 135007 132093 128896 123827 116934 109536 102304 95368 89671 86093
57320 86093 83590 80193 75703 71551 68206 64606 60110 55205 50283 45290 40576 36574 32775 28462
57306 28462 24224 21258 19606 18646 18845 21109 24717 27875 30113 32177 33705 33293 31128 29346 29091
57291 29091 29036 27570 24895 22269 20523 20058 21063 22968 24513 24902 24279 22982 21158 19099 17079 14936
57275 14936 12813 12105 14329 18947 23470 25945 26490 26434 27009 28905 31961 35086 37337 39191 42031 46482
57259 46482 51966 57648 63075 68261 73961 81331 90520 100292 110135 121874 137664 156983 177254
57246 177254 197123 217439 239039 261194 282505 302102 319739 335636 350297 363852 375929
57235 375929 386867 398373 411981 427551 444246 462069 481242 501179 521613 543683 568162
57224E68162K5281K3811K2341K2407K2635K1722K0830K1204K1927K1993K2357
57213H14670K3837K5123K4754K3201K1213J8121J3468Q280L042l319j0852j7366
57201I44172k1625k5253k9553l3064l4418l4910l5744l5425l2747k9868k9249
57190F02316k9671k8439k5687k3363k1530j8840j5371j2135q962n422k478q56
57178D09562P62L545O230P455Q381J0475J2727J3882J5358J8779K2558K4321K4971
57165E79006K6985L0175L2485L3589L4394L4375L2825L1397L2098L3961L4942
57154I36232L5619L7620L9912M0339L9681M0459M2716M4376M4766M4522M3349
57143A389591M1161M0019M1440M3392M3566M3679M6482N0585N2911N4365N7740
$$ plain form
57224 568162 593443 617254 639595 662002 684637 706359 727189 748393 770320 792313 814670
57213 814670 838507 863630 888384 911585 932798 950919 964387 972667 975709 972390 961538 944172
57201 944172 922547 897294 867741 834677 800259 765349 729605 694180 661433 631565 602316
57190 602316 572645 544206 518519 495156 473626 454786 439415 427280 418318 412896 410418 409562
57178 409562 410324 413869 420099 427554 435935 446410 459137 473019 488377 507156 529714 554035 579006
57165 579006 605991 636166 668651 702240 736634 771009 803834 835231 867329 901290 936232
57154 936232 971851 1009471 1049383 1089722 1129403 1169862 1212578 1256954 1301720 1346242 1389591
57143 1389591 1430752 1470771 1512211 1555603 1599169 1642848 1689330 1739915 1792826 1847191 1904931
57132A904931O1453O1319N7920N6347N8546O1405O2879O4552O7225O8964O8800
57121B594341O8045O7009O4533O1324N9539N8453N4982M9073M4158M1564L9044
57110C202065L5684L3579L3372L2721L0669K9437L0300L1599L2204L3262L5185
57099C560077L6546L7048L8043L9255L8673L6412L4809L3991L1461K6807K2631
57088C935753J9709J5458Q144j344j2658k6585m1755n5087o6399p8406r1689j04290
57076C500851j16620j31535j48883j65292j80127j96326k14598k32641k50924
57067A863905k73010k98949l24840l50598B34799a86608m67510n18652n77133
57058a749903o43403p14685p91113q76467r70943j070551j175719j292658j424399
$$ plain form
57132 1904931 1966384 2027703 2085623 2141970 2200516 2261921 2324800 2389352 2456577 2525541 2594341
57121 2594341 2662386 2729395 2793928 2855252 2914791 2973244 3028226 3077299 3121457 3163021 3202065
57110 3202065 3237749 3271328 3304700 3337421 3368090 3397527 3427827 3459426 3491630 3524892 3560077
57099 3560077 3596623 3633671 3671714 3710969 3749642 3786054 3820863 3854854 3886315 3913122 3935753
57088 3935753 3955462 3970920 3979064 3977720 3965062 3938477 3896722 3841635 3775236 3696830 3605141 3500851
57076 3500851 3384231 3252696 3103813 2938521 2758394 2562068 2347470 2114829 1863905
57067 1863905 1590895 1291946 967106 616508 234799 -186608 -654118 -1172770 -1749903
57058 -1749903 -2393306 -3107991 -3899104 -4775571 -5746514 -6817065 -7992784 -9285442 -10709841
57049a0709841j568860j727987j909413k116100k343515k589724k858276l148802
57041b8972518l457024l788498m160875m588975n079884n644992o300649p052374
57033f9045789p893655q819440r816206j0837955j1825016j2744533j3552749
57026a44535343j4104390j4211391j3914369j3652267j3974667j4955786j5924063
57019b45272276j5861789j4122849j0817959o619359k280232J720780N248084
57012b88005600Q366560J1143311J3534980J5420871J6713961J7423912J7629237
57005a87772768J7422944J6890969J6111350J5147761J4047629J2856183J1626531
56998h3669401J0410065R244449Q155891P164265O278658N494607M803085M198707
$$ plain form
57049 -10709841 -12278701 -14006688 -15916101 -18032201 -20375716 -22965440 -25823716 -28972518
57041 -28972518 -32429542 -36218040 -40378915 -44967890 -50047774 -55692766 -61993415 -69045789
57033 -69045789 -76939444 -85758884 -95575090 -106413045 -118238061 -130982594 -144535343
57026 -144535343 -158639733 -172851124 -186765493 -200417760 -214392427 -229348213 -245272276
57019 -245272276 -261134065 -275256914 -286074873 -292694232 -294974464 -293253684 -288005600
57012 -288005600 -279639040 -268495729 -254960749 -239539878 -222825917 -205402005 -187772768
57005 -187772768 -170349824 -153458855 -137347505 -122199744 -108152115 -95295932 -83669401
56998 -83669401 -73259336 -64014887 -55858996 -48694731 -42416073 -36921466 -32118381 -27919674
56990b7919674L675868L223609K830504K490475K199100J948539J730788J542279
56982h278512J380830J241130J117254J006612R07816Q17518P33089d18372A69913
56972F99286M76560M29196L87383L49284L12924K79292K50572K26248K03578J81199
56962C795522J60108J41697J26489J14066J02884R1068P8666O7949O0293N4264
56952D793006M8280M3605M2463M3859M3615L9256L3556L1697L3420K7862j151
56941E179468o0816j39501k13528k64939k91631l01463l01191k93265k79318k61852
56931B771964k42596k22044k00837j80157j60960j43956j29789j18114j07301
56922A266210r6362q6579q0042p7128p6450p6556p6498p5449p3080p0063o7179
$$ plain form
56990 -27919674 -24243806 -21020197 -18189693 -15699218 -13500118 -11551579 -9820791 -8278512
56982 -8278512 -6897682 -5656552 -4539298 -3532686 -2624870 -1807352 -1074263 -418372 169913
56972 699286 1175846 1605042 1992425 2341709 2654633 2933925 3184497 3410745 3614323 3795522
56962 3795522 3955630 4097327 4223816 4337882 4440766 4531834 4610500 4678449 4738742 4793006
56952 4793006 4841286 4884891 4927354 4971213 5014828 5054084 5087640 5119337 5152757 5180619 5179468
56941 5179468 5118652 4979151 4765623 4500684 4209053 3907590 3606399 3313134 3033816 2771964
56931 2771964 2529368 2307324 2106487 1926330 1765370 1621414 1491625 1373511 1266210
56922 1266210 1169848 1083269 1003227 926099 849649 773093 696595 621146 548066 478003 410824
56911D10824o4348o1127n7523n3477m8415m2212l5699A8736c339j3648n607K51
56899b2343M849f613A2399K6481K9744K7715K2214J6171J1446P742L655r90m438
56886A52139n277m512m262n015n360m140j558J622M790P459R562J1739J4446J7059
56872A88692J8822K0185K1882K2942K1186J5699P499k182j2563k1899k7364k7645
56860B25254k4573k1223j9012j7400j5613j3577j1554r702q041o531n294m725
56848F8009m934n196m633l453k672k498k045q85K25O59J009K103L782N260O049
56833F0780N966N119M416N148P315R361J0380J1574J4249J7363J8589J7463J5842
56820B03565J5359J5733J5781J5011J3956J3624J4773J7133J9440K0784K1586
$$ plain form
56911 410824 346476 285349 227826 174349 125934 83722 48023 18736 -3339 -16987 -22594 -22343
56899 -22343 -17494 -6613 12399 38880 68624 96339 118553 134724 146170 153912 157567 156577 152139
56886 152139 146862 142350 138088 133073 127713 123573 122015 123637 128427 135886 145448 157187 171633 188692
56872 188692 207514 227699 249581 272523 293709 309408 316907 314725 302162 280263 252899 225254
56860 225254 200681 179458 160446 143046 127433 113856 102302 92600 84559 78028 72734 68009
56848 68009 63075 57879 53246 49793 47121 44623 42578 41693 41918 42577 43586 45689 49471 54731 60780
56833 60780 66746 71865 76281 81429 88744 98105 108485 120059 134308 151671 170260 187723 203565
56820 203565 218924 234657 250438 265449 279405 293029 307802 324935 344375 365159 386745
56809C86745K2637K3767K4440K5133K6772K9096L1144L3212L6713M1681M5867
56798G27207M6798M3498L5816K3817R040m942j4803k0029k2317k3060k2448k0545
56786G58032j7849j4592j0446n255M87O256J2087J8298K4867L1535L8445M6154
56774H88019N4498O1460O3763N8970M6994K9714R859r430k5045l5312m0888m3515
56762A059087m4058m2495l9349l5820l2347k8179k2658j5984q562n73P530J4949
56750H11541K1376K7062L1885L5103L6089L4329K8785J8592M818r628k2281l2258
56738I85413l9080m2169m2218m1302m0412l8168l3250k6782k0919j6168j1736
56727F33209p504l939o40L211P234J0295J2345J4148J5321J4211J0028L715l407
$$ plain form
56809 386745 409382 433149 457589 482722 509494 538590 569734 602946 639659 681340 727207
56798 727207 774005 817503 853319 877136 886176 881234 866431 846402 824085 801025 778577 758032
56786 758032 740183 725591 715145 709890 710377 716633 728720 747018 771885 803420 841865 888019
56774 888019 942517 1003977 1067740 1126710 1173704 1203418 1213277 1203847 1178802 1143490 1102602 1059087
56762 1059087 1015029 972534 933185 897365 865018 836839 814181 798197 789635 789062 796592 811541
56750 811541 832917 859979 891864 926967 963056 997385 1026170 1044762 1049580 1039952 1017671 985413
56738 985413 946333 904164 861946 820644 780232 742064 708814 682032 661113 644945 633209
56727 633209 625705 621766 621126 624337 631571 641866 654211 668359 683680 697891 707919 711634 708227
56714G08227j0601j7044k1639k4081k5171k5527k4842k2971k0910j9889j9866
56703D75686j9577j7853j4698j1248q892q155q313q172p228n876m604l387j954
56690C55729l93O58N93l06q30j38J001J090L7n26M43J811J727q2k381m013m411
56673C50009l276j096L96k80k252l032j575M70J000r7j414k125k687l622m399
56658C26020m027k432q62o77j921l237l233j669M40J684J405M74O09K346M069
56643C18989L918K251J036J106J545J806K440L258K720L86j684j421N38K028K097
56628C41013J109p57l363n578o110n190m190l813l805l950m247m362l906k927
56614B89924j490N64K691L492K501J122O37M77k11n96M26J892J988P68l18j032
$$ plain form
56714 708227 697626 680582 658943 634862 609691 584164 559322 536351 515441 495552 475686
56703 475686 456109 438256 423558 412310 403418 395263 386950 378778 371550 365674 361070 357683 355729
56690 355729 355336 355994 356587 356281 355451 355313 356314 357404 357441 356915 357358 359169 360896 360814 358433 354420 350009
56673 350009 346733 345637 346033 345753 343501 340469 338894 339364 340364 340267 338853 336728 334041 330419 326020
56658 326020 321993 319561 318699 318022 316101 312864 309631 307962 308402 310086 311491 311965 312574 314920 318989
56643 318989 322907 325158 326194 327300 328845 330651 333091 336349 339069 339455 337771 336350 336888 338916 341013
56628 341013 342122 341365 338002 332424 326314 321124 316934 313121 309316 305366 301119 296757 292851 289924
56614 289924 288434 288998 291689 295181 297682 298804 299441 299918 299707 299111 299537 301429 303417 304185 303867 302835
56598C02835k176l291k874r90M94N92K59M84J028J330J260O59m54j253r64l03
56582B96636n87j524j489MJ692K460K375J797R97N39O89N46o86j929j503M1M99
56565C00557o73j691j294k22M79O99M83k45q27m59K74K03j18R43L019L740K191
56548C07059J81n81l96l3N37J059P57j7Q6R74R82j28m89O00J266K90o83J03J680
56529C13247K193J790J732K092K097J656R78j43j420j654n33M38R5n80j46J108
56513C22950K019K397K705K980L263M054N255N839N516N323N637N313L958L300
56499C80509M710O937P938P618P076O487N489M531M168L989L654L819M653M808
56485D56386L471K035J926K072O11j932l395l179k778l395m748n915o067m834
$$ plain form
56598 302835 300659 297368 294494 293504 293998 294590 294849 295333 296361 297691 298951 299610 299156 297903 296939 296636
56582 296636 296049 294525 293036 293040 294732 297192 299567 301364 302361 302900 303589 304135 303449 301520 300017 300058 300557
56565 300557 299884 298193 296899 296677 297156 297855 298338 298093 297266 296807 297081 297284 297166 298109 301128 304868 307059
56548 307059 307240 306659 306263 306230 306767 307826 308583 308566 308652 309626 310608 310480 309991 310591 311857 312147 311464 311567 313247
56529 313247 315440 317230 318962 321054 323151 324807 325785 325642 324222 322568 322035 322473 322568 321988 321842 322950
56513 322950 324969 327366 330071 333051 336314 340368 345623 351462 356978 362301 367938 373251 377209 380509
56499 380509 385219 392156 400094 407712 414788 421275 426764 431295 435463 439452 443106 446925 451578 456386
56485 456386 459857 461892 463818 465890 466501 464569 461174 457995 455217 451822 447074 441159 435092 430258
56471D30258l043k354l230m158l981l501l650l725l080k859l980m854l525q78
56457C83440O59O83N68N23m01j792k108j337j093j839k307j902j660k391l533
56442C65510m194l981k715p28O83N17l88n18pr0o13j20J479K357J342o20k099
56425C55815k755k744j878j80J642K860L320L217K771K194J449L06q42q89M94
56410C64780K021K474K429L064M053M260M025M790O604P820P530O728O527O576
56396D33681N854M191K485J839K650M192N154M942M084L063J617j89j218o53N95
56381D72287J110Q70P19N32n62k455l900m106l507k974l045l735m467m530m019
56366D38218l706l612k761r92K73J04l84J97J275J283k6j568k516k711k264j751
$$ plain form
56471 430258 427215 424861 421631 417473 413492 409991 406341 402616 399536 396677 392697 387843 384318 383440
56457 383440 384099 384782 385350 385873 385472 383680 381572 380235 379142 377303 374996 373094 371434 369043 365510
56442 365510 361316 357335 354620 353892 354575 355092 354704 354186 354179 354089 353476 353356 354835 357192 358534 357914 355815
56425 355815 353060 350316 348438 348258 349900 352760 356080 359297 362068 364262 365711 366017 365175 364286 364780
56410 364780 366801 369275 371704 374768 378821 383081 387106 391896 398500 406320 413850 420578 427105 433681
56396 433681 439535 443726 446211 448050 450700 454892 460046 464988 469072 472135 473752 473563 472345 471692 472287
56381 472287 473397 474267 474986 475518 474956 472501 468601 464495 460988 458014 454969 451234 446767 442237 438218
56366 438218 434512 430900 428139 427147 427420 427524 427140 427337 428612 429895 429869 428301 425785 423074 420810 419059
56350D19059j942k577k590k208k983m787n011k504J21K61p60l46Q72M77j246j822
56334C92014p24L73Q78J574K051J222K15J335M107N593M979M464N061M981L284
56319D31407J978K724M012L440J004j429k492j919n7K155L679M385M688M253K546
56304D60374O48O13K653M779N652N928O251N853M112J977Q21R40J783K734L154
56289E08272K732K042J821J749J062K57P14K592M474N250N082M562M176M475N472
56274E54732O007N140L802L643M667N576N921O106N853M734L854M727O663P575
56260F29000P268P558R039J0249J0375J0367J0808J0975J0730J1127J2360J3111
56248G52967J2734J2383J3089J4311J5207J5864J6574J7101J7238J6964J5865
$$ plain form
56350 419059 417117 414540 411950 409742 406759 401972 396961 394457 394578 394839 394079 393733 394605 395082 393836 392014
56334 392014 391290 391663 392541 394115 396166 397388 397603 398938 403045 408638 413617 418081 423142 428123 431407
56319 431407 433385 436109 440121 443561 444565 443136 440644 438725 438668 440823 444502 448887 453575 457828 460374
56304 460374 461022 461635 464288 469067 474719 480647 486898 492751 496863 498840 499661 500601 502384 505118 508272
56289 508272 511004 513046 514867 516616 517678 517935 518649 521241 525715 530965 536047 540609 544785 549260 554732
56274 554732 560739 565879 569681 573324 577991 583567 589488 595594 601447 606181 610035 614762 621425 629000
56260 629000 636268 643826 652865 663114 673489 683856 694664 705639 716369 727496 739856 752967
56248 752967 765701 778084 791173 805484 820691 836555 853129 870230 887468 904432 920297
56237I20297J3577J0973R609R902J0895J1703J1961J1376J0253R931J1220J3061
56225A054758J4292J5728J8504K1459K2744K3209K5341K9312L3005L5644L8377
56214A332373M1404M3700M5822M9945N6445O3170O8611P3365P8224Q3463R0229
56203B026751R9859J11400J22520J33010J44542J56824J67386J75876J85148J97033
56193C520349K09958K21825K32202K40443K44691K44350K40981K35166K24813
56184E614778K08196J86474J61672J33988J02723O8560L3831J385k6585m9967
56174F435055p0933r1154j09240j22830j32358j40112j46437j50098j51956j54493
56164E165444j57643j58903j58011j57812j59641j61553j62037j61907j61555
$$ plain form
56237 920297 933874 944847 954456 964358 975253 986956 998917 1010293 1020546 1030477 1041697 1054758
56225 1054758 1069050 1084778 1103282 1124741 1147485 1170694 1196035 1225347 1258352 1293996 1332373
56214 1332373 1373777 1417477 1463299 1513244 1569689 1632859 1701470 1774835 1853059 1936522 2026751
56203 2026751 2126610 2238010 2360530 2493540 2638082 2794906 2962292 3138168 3323316 3520349
56193 3520349 3730307 3952132 4184334 4424777 4669468 4913818 5154799 5389965 5614778
56184 5614778 5822974 6009448 6171120 6305108 6407831 6476391 6510222 6511607 6485022 6435055
56174 6435055 6364122 6272968 6163728 6040898 5908540 5768428 5621991 5471893 5319937 5165444
56164 5165444 5007801 4848898 4690887 4533075 4373434 4211881 4049844 3887937 3726382
56155C726382j59775j56542j53636j51312j47523j41460j34655j27803j19882
56146B433794j11312j04144r8148r0656q1583p4412p0476o6483n9899n2946m8563
56135A575172m5832m2209l7544l3312l0115k7997k7118k6493k4249k0352j6775
56124A243176j4227j1581r070q569r758r715p483n422m805l862j456J082L099
56111A161409N736Q686R991J0241J2539J6888J9420J8839J8611K0758K2677K2472
56099A348267K2317K3697K4418K3403K3465K6020K7885K6858K5734K7086K8699
56088A627849K8035K6841K7467K8917L0367L4139M1177M8069N2831N9230P0686
56077B075608Q4117R4589J02294J09902J16677J20155J20511J18594J12804J02538
$$ plain form
56155 3726382 3566607 3410065 3256429 3105117 2957594 2816134 2681479 2553676 2433794
56146 2433794 2322482 2218338 2120190 2029534 1947951 1873539 1803063 1736580 1676681 1623735 1575172
56135 1575172 1529340 1487131 1449587 1416275 1386160 1358163 1331045 1304552 1280303 1259951 1243176
56124 1243176 1228949 1217368 1208298 1199729 1189971 1180256 1172773 1167351 1162546 1158684 1157228 1158310 1161409
56111 1161409 1167145 1175831 1185822 1196063 1208602 1225490 1244910 1263749 1282360 1303118 1325795 1348267
56099 1348267 1370584 1394281 1418699 1442102 1465567 1491587 1519472 1546330 1572064 1599150 1627849
56088 1627849 1655884 1682725 1710192 1739109 1769476 1803615 1844792 1892861 1945692 2004922 2075608
56077 2075608 2159725 2254314 2356608 2466510 2583187 2703342 2823853 2942447 3055251 3157789
56067C157789R1638Q3896P7995P0961O3176N5666M5933L1434J4352j411j5079
56056C676350k6956l5267l9607m4094n2389o2686p1895q1066r1948j01828j07060
56045B961554j08583j09109j07787j02452r4140q4968p4686o3557n4841m9917
56035B111514m4877l6581k7983k2569j8099j1317m493j347m96J201K747K287K146
56022A952133M552O485M885K798L956N678L967J302K150M848N490N943J0032J5294
56008B029513J6600J5079J5642J8333J9694K0059K2009K4234K4155K3930K6779
55997B256027L0387L1035L0835L3584L7124L7514L6922L9421M2776M2777M1875
55986B660277M4810M9297N0100M8751N0222N3454N4498N5377O0122O5507O5731
$$ plain form
56067 3157789 3249427 3333323 3411318 3482279 3545455 3601121 3647054 3678488 3692840 3691429 3676350
56056 3676350 3649394 3614127 3574520 3530426 3478037 3415351 3343456 3262390 3170442 3068614 2961554
56045 2961554 2852971 2743862 2636075 2533623 2439483 2354515 2279829 2216272 2161431 2111514
56035 2111514 2066637 2030056 2002073 1979504 1961405 1950088 1945595 1944248 1943752 1944953 1947700 1949987 1952133
56022 1952133 1956685 1963170 1968055 1970853 1974809 1980487 1984454 1985756 1987906 1992754 1998244 2004187 2014219 2029513
56008 2029513 2046113 2061192 2076834 2095167 2114861 2134920 2156929 2181163 2205318 2229248 2256027
55997 2256027 2286414 2317449 2348284 2381868 2418992 2456506 2493428 2532849 2575625 2618402 2660277
55986 2660277 2705087 2754384 2804484 2853235 2903457 2956911 3011409 3066786 3126908 3192415 3258146
55975C258146O3185O4490O9065P1733P3549P9425Q7888R3742R8202J05839J14342
55964D179606J18049J18967J23474J30969J36450J41255J50144J61014J68758
55955E428686J76011J88550K03556K14237K22327K33977K47376K56992K65521
55946G437233K78649K92735L01446L09482L25183L44869L59801L73212L94065
55937A0416675M19561M41180M62623M93486N30325N63170N95341O36577O82018
55928A5240956P19749P54399Q00365Q55969R07978R57687J017845J087364J154909
55919B3497221J224076J308516J405560J502521J605463J732476J882304K040428
55911C6198565K211500K412218K637043K868133L115926L411937L766154M173132
$$ plain form
55975 3258146 3321331 3385821 3454886 3526619 3600168 3679593 3767481 3861223 3959425 4065264 4179606
55964 4179606 4297655 4416622 4540096 4671065 4807515 4948770 5098914 5259928 5428686
55955 5428686 5604697 5793247 5996803 6211040 6433367 6667344 6914720 7171712 7437233
55946 7437233 7715882 8008617 8310063 8619545 8944728 9289597 9649398 10022610 10416675
55937 10416675 10836236 11277416 11740039 12233525 12763850 13327020 13922361 14558938 15240956
55928 15240956 15960705 16715104 17515469 18371438 19279416 20237103 21254948 22342312 23497221
55919 23497221 24721297 26029813 27435373 28937894 30543357 32275833 34158137 36198565
55911 36198565 38410065 40822283 43459326 46327459 49443385 52855322 56621476 60794608
55903F0794608M653573N241243N931950O696262P538614Q489749R550750J0712948
55895A19609697J2028835J3591044J5451637J7646516K0273150K3416439K7006986
55888B49024304L0884856L4893751L8493427M0104569L7336452K8617648J4883285
55881D74238292n79751j4169345k3923527k9799005l2673561l3446338l2804996
55874C06841769l1271941k9196426k6778366k4176148k1551125j9015139j6620533
55867A38232091j4420686j2480164j0818146r399796q192933p186245o350933
55860F9383188n636201n012438m478937m025340l624825l268768k969588k723298
55852C7643793k503475k296953k112914j951979j797706j644699j506145j386962
$$ plain form
55903 60794608 65448181 70689424 76621374 83317636 90856250 99345999 108896749 119609697
55895 119609697 131638532 145229576 160681213 178327729 198600879 222017318 249024304
55888 249024304 279909160 314802911 353296338 393400907 430737359 459355007 474238292
55881 474238292 473658541 459489196 435565669 405766664 373093103 339646765 306841769
55874 306841769 275569828 246373402 219595036 195418888 173867763 154852624 138232091
55867 138232091 123811405 111331241 100513095 91113299 82920366 75734121 69383188
55860 69383188 63746987 58734549 54255612 50230272 46605447 43336679 40367091 37643793
55852 37643793 35140318 32843365 30730451 28778472 26980766 25336067 23829922 22442960
55844B2442960j275572j168064j075644j002023r36115q72589q18439p74304p29790
55835A3790420o82090o40138o06050n70828n32166m98671m72652m45955m16477
55826H925393l92155l75043l57330l36591l19642l07978k94197k76002k59572
55817F006883k46543k31580k15173k04771k00828j95413j86813j81795j81178
55808D162789j77098j67226j58157j51893j42262j27843j15495j07845r9864r1019
55798B824087q8005r1846r4432r1807q9201q9195q6571p9102p2381o9471o6122
55787A905954o0358n6639n6422n4402m8247m2772m0627l7871l2412k7998k6425
55776A421781k4353k0836j9296j9274j5505q070m004n733p229n055l586n479o614
$$ plain form
55844 22442960 21167388 19999324 18923680 17921657 16985542 16112953 15294514 14520210 13790420
55835 13790420 13108330 12468192 11862142 11291314 10759148 10260477 9787825 9341870 8925393
55826 8925393 8533238 8158195 7800865 7464274 7144632 6836654 6542457 6266455 6006883
55817 6006883 5760340 5528760 5313587 5108816 4907988 4712575 4525762 4343967 4162789
55808 4162789 3985691 3818465 3660308 3508415 3366153 3238310 3122815 3014970 2915106 2824087
55798 2824087 2736082 2644236 2549804 2457997 2368796 2279601 2193030 2113928 2041547 1972076 1905954
55787 1905954 1845596 1788957 1732535 1678133 1629886 1587114 1546487 1508616 1476204 1448206 1421781
55776 1421781 1397428 1376592 1357296 1338022 1322517 1314447 1310443 1304710 1297481 1292426 1288840 1283361 1276747
55763A276747n004n630j1362j7487k0174k2290k6014k7651k5041k2594k3711k5026
55751A044763k3368k1716k3027k4328k2201j8640j6667j5151j2368r819q744p529
55739H41205n709n560o879n810j604J232M15n27Q40J646j96j962j918l059p070
55724H05044j0396j0295r370j0038r950o995l639k277j348M4j106o170j1148j2672
55710G09684j3055j5166j7157j6543j4974j4596j3917j1576j0120j1662j3704
55699E57214j3402j2272j2596j2938j1323r254q496p284l883p26q76l216m866
55686D56082n681o844p735p627p968r823j1471j1273j0435j0432j0540j0131j0273
55673C35849j0789r165m862j256p45j359p77o0p50j826k244l050m445m412k827
$$ plain form
55763 1276747 1271743 1266113 1254751 1237264 1217090 1194800 1168786 1141135 1116094 1093500 1069789 1044763
55751 1044763 1021395 999679 976652 952324 930123 911483 894816 879665 867297 857478 848734 841205
55739 841205 835496 829936 823057 817247 815643 816875 817290 816763 817603 819249 819053 817091 815173 812114 805044
55724 805044 794648 784353 774983 764945 754995 748000 744361 742084 740736 740780 739674 733504 722356 709684
55710 709684 696629 681463 664306 647763 632789 618193 604276 592700 582580 570918 557214
55699 557214 543812 531540 518944 506006 494683 485429 476933 469649 465766 465040 464164 460948 456082
55686 456082 450401 443557 435822 428195 420227 410404 398933 387660 377225 366793 356253 346122 335849
55673 335849 325060 315895 311033 309777 309032 307673 306896 306836 306086 304260 302016 298966 294521 290109 287282
55658B87282k910n775p676n760k562j404j286l5J278R93N88J809L056K320R62
55643B70880J019J468N30r30j442j791k812l060j414O37J774K864L938K866l52
55628B74175j901J99K751K948K910N064P247O920O325Q527J1625J1753R177O697
55614C54417M564J490j616l232m323n928o202l833j483j640k020K39K852K095
55600C35380l70q8K753M090K853J647J490J176J111K750M667L953J229p8P04J051
55584C64318N7n60l33p92k098k601k114k268l438m347m816n990p887r348j0168
55569C07615j0800j0546q785p139p591r110r162p911p758r180j0077r149p215
55556A93192n299l694k722k476k307k095k851m442m696k789j319k350l828l046
$$ plain form
55658 287282 284372 278597 270921 265161 262599 261195 259909 259874 261152 262145 262733 264542 267598 269918 270880
55643 270880 271899 273367 273897 272967 271525 269734 266922 263862 262448 263085 264859 267723 271661 274527 274175
55628 274175 272274 272473 275224 278172 281082 286146 293393 300313 306638 315165 326790 338543 347720 354417
55614 354417 358981 360471 358855 355623 351300 345372 339170 335337 333854 332214 330194 330433 333285 335380
55600 335380 335010 334922 337675 341765 344618 346265 347755 348931 350042 352792 357459 361412 362641 362563 363267 364318
55584 364318 364375 363815 363482 362690 360592 357991 355877 353609 350171 345824 341008 335018 327131 317783 307615
55569 307615 296815 286269 277484 270345 262754 253644 244482 236571 228813 219633 209556 200407 193192
55556 193192 187893 184199 181477 179001 176694 174599 171748 167306 162610 159821 158502 156152 152324 149278
55542A49278j260j123j801r08N67o4j887j651M01P86j357l220l295l005k984j972
55526A26505k35j22k106l612k896j245m26n52j225k368l267k982k068j924k430
55511I9047k322j594j311j382r36m21q60j452o36R95J429M79m44j114k203k758
55495H4517j222J393K517K036K165L520M459M326M075L660K039q3o70J55J76j086
55479A11977j664p32K54M53Q20J797K535K934L721M233K945N90j62J254K546K406
55463A35907K214L067L911L672K904K367K070K222L052L497K322N60L36J206O59
55448A69966j575k930k233j417k001k944l172l494m596n563n696n826o635p450
55434A14434p481o653m870k372q44j855m097m601k828j016m84m54o50j824l313
$$ plain form
55542 149278 148018 146895 145094 144186 144753 144689 142802 141151 141552 142338 140981 137761 134466 131461 128477 126505
55526 126505 126270 126148 124042 120430 117534 116289 115863 115311 114086 111718 108451 105469 103401 101477 99047
55511 99047 96725 95131 93820 92438 91502 91081 90221 88769 88133 89128 90557 91036 90592 89478 87275 84517
55495 84517 83295 84688 87205 89241 91406 94926 99385 103711 107786 111446 113485 113402 112732 112887 113063 111977
55479 111977 110313 109581 109835 110288 111108 112905 115440 118374 122095 126328 129273 129863 129701 130955 133501 135907
55463 135907 138121 141188 145099 148771 151675 154042 156112 158334 161386 164883 167205 167765 168101 169307 169966
55448 169966 168391 165461 163228 161811 159810 156866 153694 150200 145604 140041 134345 128519 121884 114434
55434 114434 106953 100300 95430 93058 92214 90359 86262 81661 78833 77817 77333 76879 76229 74405 71092
55419G1092l409k726l740o154o446l252L71J685J730K194K201O59r98j074l24
55404E1809j71k51M0l45k227m180m460l427k242q79Q20J770J234L13J57R9q34
55387C7226j989k288j920j431n22P53J089k57k059k871k829k509j557K04J730
55372B0770K227K351K748K871K310J754J546R15k09n23K88N43o72j826j693j623
55356C1777k928l977k450Q96L226L474K937K752K854K968K879K106O58m26m83
55341D6263k43l29M3J455K519J484j162l224l381k025l25M19n79k363k702r25
55325C4925Q35N39r34j356l99N42P81P89Q51Q92J110J499J346M40j41K69N38m02
55307D2124j476j128j67p48k969m579m027k010J6J274J563J099O68Q51J143Q19
$$ plain form
55419 71092 67683 64957 61217 55063 48617 45365 45736 47421 49151 51345 53546 54205 53207 52133 51809
55404 51809 51638 51387 51427 51082 48855 44675 40215 36788 34546 33667 34487 36257 37491 37804 37961 38060 37226
55387 37226 35237 32949 31029 29598 29076 29829 30918 30661 28602 25731 22902 20393 18836 19040 20770
55372 20770 22997 25348 28096 30967 33277 35031 36577 37492 37283 36760 37048 37591 36919 35093 33400 31777
55356 31777 28849 24872 22422 23318 26544 30018 32955 35707 38561 41529 44408 46514 47172 46746 46263
55341 46263 46020 45691 45734 47189 49708 51192 50030 46806 43425 41400 41075 41494 40915 38552 35850 34925
55325 34925 35760 36299 35365 34009 33610 34152 34933 35722 36573 37465 38575 40074 41420 41860 41719 41988 42526 42124
55307 42124 40648 39520 39353 38605 35636 31057 27030 25020 25036 26310 27873 28972 29640 30491 31634 32453
55291C2453K74L94R01P09j58m54K53P65L6j116r18J053L045K897N55j747k075
55274C6867r58j95j79N7N24pj708l017k899j977p40J246L333L240K22l107l998
55257B6704k960j975j095O62K333K002K31l01J331L144L308K196R29k08j129j304
55241C3868n32N54J249J309N91q70k348k873k447j944j706j061N36K621M145M405
55225C5497L548K469J973J720O02j417k636j767N6O51k74j051o04L39Q48J237
55209D1191K147L152L101J626l29j580j957k204k669k682j636j53O57Q09J081
55194D0554J295M30j330k305j733q79p77m65J157L002L070J271o34j393j164m70
55178C9629L19O06n5j135j564r47K49J415K068J921J359J295J810J726L64j057
$$ plain form
55291 32453 32727 33121 34022 34731 34573 34119 34372 35137 35173 34057 33139 34192 37237 40134 40689 38942 36867
55274 36867 35909 35714 35535 35592 36116 36109 34401 31384 28485 26508 25768 27014 30347 33587 33809 30702 26704
55257 26704 23744 21769 20674 21336 23669 25671 25902 25601 26932 30076 33384 35580 36509 36301 35172 33868
55241 33868 33336 33890 35139 36448 37039 36169 33821 30948 28501 26557 24851 23790 24326 26947 31092 35497
55225 35497 39045 41514 43487 45207 45809 44392 41756 39989 40045 40696 40422 39371 38767 39106 39954 41191
55209 41191 43338 46490 49591 51217 50888 49308 47351 45147 42478 39796 38160 38007 38664 39473 40554
55194 40554 41849 42279 40949 38644 36911 36032 35255 34790 35947 38949 42019 43290 42656 41263 40099 39629
55178 39629 39948 40554 40499 39364 37800 36853 37102 38517 40585 42506 43865 45160 46970 48696 49060 48003
55162D8003j013J9K74o61j358o69Q16J719J357J05j135j625j275n07M46J579K440
55145D8515K181P24q37j503j278n21O07J543J343M9j062j315j493k037j885m50
55129D2581P44J50j164r46Q62K093J477K7p25m20J93J8j495l412l690j538J300
55112C6055K644K436J972J565P54O4N08J596J743O49n26j287k298l527l652j905
55096C6791P37K681L005J587p90k387j854Q1J356J198Q00J156J517O53j286k786
55080D2459k452l17J925K187J49k145k515j076L79Q60Q89J127J667K547L643M021
55064E3348K732L64j362j597r11J3R60J383N60j116k133j586OJ804L422M416M189
55047F4492K923J665J057P89O04Q63J670K314K152J484J120J385J823J518j10
$$ plain form
55162 48003 46990 47009 47283 46622 45264 44595 45411 47130 48487 48592 47457 45832 44557 44050 44496 46075 48515
55145 48515 50696 51420 50583 49080 47802 47281 47888 49431 50774 50823 49761 48446 46953 44916 43031 42581
55129 42581 43325 43475 42311 41365 42227 44320 45797 45824 45099 44679 44872 44890 43395 39983 36293 34755 36055
55112 36055 38699 41135 43107 44672 45426 45490 45998 47594 49337 49986 49460 48173 45875 42348 38696 36791
55096 36791 37528 40209 43214 44801 44011 41624 39770 39851 41207 42405 43205 44361 45878 46531 45245 42459
55080 42459 40007 39690 41615 43802 43951 41806 39291 38215 38594 39454 40343 41470 43137 45684 49327 53348
55064 53348 56080 56444 55082 53485 52574 52587 53547 54930 55490 54374 52241 50655 50661 52465 55887 60303 64492
55047 64492 67415 69080 70137 70926 71530 72393 74063 76377 78529 80013 81133 82518 84341 85859 85749
55032H5749k339l251j621J303K789J517j105k550j489J310L716L953K231N15J96
55017I0924N92M87L03J327L192L888K373j94k121k823k490j379L7J005J162P99
55001I7082L51J05L13Q77J071K92j100k382l462m478m876m079k704j833j361l65
54985G3451J101J998J879J141q1j719k702j916k70J45q01r74N76K049J772P60
54969G6409Q73J836J874N30p72o90O41K124K771K342J383O38L04J69K61O99R70
54952I2362L96n42l98J335L393M207L422J745J29n58n5O84L46q01q78J128L720
54935A09635M551L132J088J19L75O84J7j321k045j593r64j249j924j729q45p03
54919A07228j664k440k152j459j051n21M59J226J321J533K534L422K870J204L
$$ plain form
55032 85749 83410 80159 78538 79841 82630 84147 83042 80492 79003 80313 84029 87982 90213 90728 90924
55017 90924 91516 92003 92306 93633 96825 100713 103086 102892 100771 97948 95458 94079 94116 95121 96283 97082
55001 97082 97433 97538 97851 98728 99799 100091 98991 96609 93147 88669 83793 79714 77010 75177 73816 73451
54985 73451 74552 76550 78429 79570 79489 77770 75068 73152 72882 73027 72226 71252 71828 73877 75649 76409
54969 76409 77282 79118 80992 81522 80750 80060 80701 82825 85596 87938 89321 89959 90263 90432 90693 91392 92362
54952 92362 92758 92216 91818 93153 96546 100753 104175 105920 106049 105491 105436 106120 106466 105665 104787 105915 109635
54935 109635 114186 117318 118406 118525 118900 119584 119601 118280 116235 114642 113678 112429 110505 108776 107931 107228
54919 107228 105564 103124 100972 99513 98462 97941 98400 99626 100947 102480 105014 108436 111306 112510 112513
54904A12513p4N8m71j160q24Q21K758L782L745L330K787J682J32o15L49K213L603
54887A34629M563O127Q318R918J0245R964J0094J1252J3640J6635J8651J8744
54875B72780J7993J7777J7172J4122Q912M088N83l368q702j3537j6152j7523j8963
54862B75182j9281j6688j2296r214q693r232r216q569p674o352m365k106l78J74
54848A61292l78r96l94J477L256L973M300N420P309Q960R824J0287J0988J2229
54834B37547J3730J4710J4517J3370J1858R860O863L265nl238p702j3099j7062
54821B84614j8080j7311j6441j5385j3499j1459j0187r112p382n787n594o258
54809A48119o189n207m384l899l093k354k805m052m176k440l45N60M11R8m6M0
$$ plain form
54904 112513 112439 112497 112026 110866 110042 110863 113621 117403 121148 124478 127265 128947 129079 128464 128813 131026 134629
54887 134629 139192 145319 153637 163555 173800 183764 193858 205110 218750 235385 254036 272780
54875 272780 290773 308550 325722 339844 348756 352844 353427 350059 341357 327820 311668 294145 275182
54862 275182 255901 239213 226917 217703 209010 199778 190562 181993 174319 167967 163602 161496 161118 161292
54848 161292 160914 159918 159524 161001 164257 168230 172530 177950 185259 194219 204043 214330 225318 237547
54834 237547 251277 265987 280504 293874 305732 315592 322455 325720 325715 322477 314775 301676 284614
54821 284614 266534 249223 232782 217397 203898 192439 182252 173140 165758 159971 154377 148119
54809 148119 141930 136723 132339 128440 125347 122993 120188 116136 111960 109520 109175 109735 110146 110244 110198 110238
54793A10238M77P40k50k470m038l221p08J005L41j888l705m001l182k230j592
54778H5516j124p52o66q32p60j60N41N93k45j530k525k621j662j17J224J870J814
54761G8564J316Q16R47J986L305L977L777L050J842K32p94j83J372J996J370J229
54745A04802K437L487L053K329L030M355M119K294J184K105L760M402M117M304
54731A49778N810Q238J0553J1900J2187J2129J2623J3986J5734J6962J6966J5925
54719C02791J4868J4327J3092R356L387k096m863n513o157p754r653j0883j0909
54706B99993r729q154p339p322o753m910l017k529l052l073j944RK515N057O336
54691B56088N683M501M760O393P666P826P891Q868J0706J3119J6029J8909K0914
$$ plain form
54793 110238 110715 111455 111205 108735 104697 101476 100768 101773 102114 100226 96521 92520 89338 87108 85516
54778 85516 84392 83640 82974 82142 81382 81222 81763 82356 82111 80581 78056 75435 73773 73656 74880 76750 78564
54761 78564 79880 80696 81643 83629 86934 90911 94688 97738 99580 99812 99018 98835 100207 102203 103573 104802
54745 104802 107239 110726 113779 116108 119138 123493 127612 129906 131090 133195 136955 141357 145474 149778
54731 149778 155588 163826 174379 186279 198466 210595 223218 237204 252938 269900 286866 302791
54719 302791 317659 331986 345078 354434 357821 355725 350862 345349 339192 331438 321785 310902 299993
54706 299993 290264 282110 274771 267449 260696 255786 252769 250240 247188 244115 242171 242180 244695 249752 256088
54691 256088 261771 266272 271032 277425 285091 292917 300808 309676 320382 333501 349530 368439 389353
54678C89353K1901K2400K2456K1324J8438J3984Q532K749k783q028j3355j8364
54666D78607k1624k2495k2246k2183k1598j9286j6249j4754j5083j5289j4260
54655B73540j2935j2221j1646j0666r598q586p187n678n203n803n752l911j591
54642A72763q33j709k486j953n75M60O43M80P38J381J526P14k40l55M5j3m02j94
54624A69990M65L59o46j040J29J808K578K586K852L495L661K856J602R89J790
54609A93474L711N378N589M586L429K361R92M7J254M785Q184Q919P149M857L211
54594B57926J995J113J149K225L366L455K504J608J804L021M192M479M172M173
54580B97182M810N605O071O155O052O176P209R477J2367J4960J7133J9195K0738
$$ plain form
54678 389353 411254 433654 456110 477434 495872 509856 518388 521137 518354 510326 496971 478607
54666 478607 456983 434488 412242 390059 368461 349175 332926 318172 303089 287800 273540
54655 273540 260605 248384 236738 226072 216474 207888 200701 195023 189820 184017 178265 174354 172763
54642 172763 171930 170221 167735 165782 165207 165667 166310 166790 167528 168909 170435 171149 170909 170554 170599 170586 170184 169990
54624 169990 170455 170814 170168 169128 169257 171065 173643 176229 179081 182576 186237 189093 190695 191684 193474
54609 193474 197185 202563 208152 212738 216167 218528 219520 219567 220821 225606 233790 242709 249858 254715 257926
54594 257926 259921 261034 262183 264408 267774 271229 273733 275341 277145 280166 284358 288837 293009 297182
54580 297182 301992 307597 313668 319823 325875 332051 339260 348737 361104 376064 393197 412392 433130
54567D33130K0969K0201J9708J9747J8853J5611J0255M062j931p115j1252j4776
54555E27462j8355k1628k3203k2532k0811j9383j8196j6624j4831j3219j1286
54544C27394q447n516m119m628n778o401o530o718p044p303p490p589p205n871
54530B36755l832k218k218l943o226p651p708o820n525m097k785j883j472j513
54516A78864k157l440m732n172m694l998l397k531j436r68j528k151j705n41l7
54501A40377o69j313p40P18J441M72j193j662n16N40j16j765k266r88M65P19M32
54484A33936Q65J676J492K10o33l4J143J561J355J718K879L581K921J783J683
54469A56136K744L926M918O429Q354R215Q321P218P793R715J1016J0671R313P860
$$ plain form
54567 433130 454099 474300 494008 513755 532608 548219 558474 562536 560605 553490 542238 527462
54555 527462 509107 487479 464276 441744 420933 401550 383354 366730 351899 338680 327394
54544 327394 318947 313431 309312 304684 298906 292505 285975 279257 272213 264910 257420 249831 242626 236755
54530 236755 232923 230705 228487 224544 218318 210667 202959 196139 190614 186517 183732 181849 180377 178864
54516 178864 176707 173267 168535 163363 158669 154671 151274 148743 147307 146339 144811 142660 140955 140414 140377
54501 140377 139708 138395 137655 138373 139814 140286 139093 137431 136915 137455 137339 135574 133308 132320 132785 133504 133936
54484 133936 134801 136477 137969 138179 137546 137512 138655 140216 141571 143289 146168 149749 152670 154453 156136
54469 156136 158880 162806 167724 174153 182507 191722 200043 207261 215054 224769 235785 246456 255769 263629
54455B63629O797O427O489N639K718j452m850o715p923q979r359r049r047r727
54441B24598j0122r469q214o898n494m481n023o950q005o527l857k548k894k885
54427A41231j377L56N06q84k082j790m95L85L97N53J623K685K362J073O86J826
54411A47055K991K798J753J155J353J978K720L004J946k93j900j355O47K203K533
54396A68588K171J471K91r78j396o95L08O99L08n49j569k505l071l091k741k616
54380A54625l237m236m297k626k53Q46q3k041l704m327l381q43J883K888K100
54365A33314J358J600J659N44q51j417j551j707r18J441L720L964K804K275K539
54350A48774K053N91k79K50J359K505M056N612N657L754J623J106K249L983N477
$$ plain form
54455 263629 270426 276853 283342 288981 291699 290247 285397 278682 270759 261780 252421 243372 234325 224598
54441 224598 214476 205007 196793 189895 184401 179920 174897 167947 159942 153415 149558 147010 144116 141231
54427 141231 139854 140210 140716 139832 137750 135960 135465 135850 136247 136800 138423 141108 143470 144543 145229 147055
54411 147055 150046 152844 154597 155752 157105 159083 161803 164807 166753 166460 164560 163205 163852 166055 168588
54396 168588 170759 172230 172521 171543 170147 169452 169760 170459 170767 170218 168649 166144 163073 159982 157241 154625
54380 154625 151388 147152 142855 140229 139976 140822 140739 138698 134994 130667 127286 126443 128326 131214 133314
54365 133314 134672 136272 137931 138475 137624 136207 134656 132949 132031 133472 137192 141156 143960 146235 148774
54350 148774 150827 151418 151139 151389 152748 155253 159309 164921 170578 174332 175955 177061 179310 183293 188770
54335A88770O157N614M407L968M880N998N989N039M207L847L480K769J738L58
54321B47221j321k721l168k790k505k868l373l188k524k810m980p804q706o656
54307A91807l521j877k049k339j665o85l15m42o28j018j846k741l202l311l420
54292A62748l420k902j772k61J298K408K522J741J140J615K647K914K228K002
54278A74908L420N760P206O927N611M148K718J373O01O50R23P34L03K84O18N25
54262B16709n09k373m604o283o137l931j627j765m428p038p503o366n244m461
54248A54440l307j865j250k121l773m817m535l620l559m813n898m985k365j41
54234A07391N66P45J427J989J297n48k493l609l255j291J089J900P20n86m61L19
$$ plain form
54335 188770 194927 200541 204948 208916 213796 219794 225783 230822 235029 238876 242356 245125 246863 247221
54321 247221 245900 243179 240011 237221 234716 231848 228475 225287 222763 219953 214973 207169 198463 191807
54307 191807 188286 186409 184360 182021 180356 179671 179356 178914 178286 177268 175422 172681 169479 166168 162748
54292 162748 159328 156426 154654 154393 155691 158099 160621 162362 163502 165117 167764 170678 172906 174908
54278 174908 178328 184088 191294 198221 203832 207980 210698 212071 212672 213322 214245 214979 215282 215566 216184 216709
54262 216709 216200 213827 209223 202940 196803 192872 191245 189480 185052 178014 170511 164145 158901 154440
54248 154440 151133 149268 148018 145897 142124 137307 132772 129152 125593 120780 114882 109897 107532 107391
54234 107391 107957 108702 110129 112118 113415 112867 110374 106765 103510 102219 103308 105208 105928 105342 104881 105200
54218A05200L84J22P57K125L053L179K826J884L74n79p9R55J140Q15J077J398
54202A24631L99j486k410j962j296n57J310L845M660K740p3j850k894m108m879
54187A16070m200k580j208j26J343K844L113J734j57j063n53M86P91k0j136j611
54171A13727j356o88M44J919K736K102R95J104K352K964K083P79J08j97n41m33
54155A28098L86J049P55J1j94K28N60K02r50k370k847j428J227L138L046J466
54139A32377l84j800k538k574k262j955j451p12p35k243l749k946k26J412N98
54124A10812o28l06M95j0j079p75P41J555R21k11j095j791k113j632p18k14j71
54107A03781qL52O15R62J607J872R30o60j426q10N00J813K841L040J888n5j369
$$ plain form
54218 105200 105584 105706 106463 108588 111641 114820 117646 119530 119904 119325 119246 120201 121341 122156 123233 124631
54202 124631 125030 123544 121134 119172 117876 117319 118629 122474 127134 129874 129801 127951 125057 120949 116070
54187 116070 111870 109290 108082 107956 109299 112143 115256 116990 116833 115770 115217 115703 116494 116474 115338 113727
54171 113727 112371 111683 112127 114046 116782 118884 119879 120983 123335 126299 128382 129161 129269 129072 128531 128098
54155 128098 128484 129533 130288 130299 130105 130333 130893 131095 130145 127775 124928 123500 124727 127865 130911 132377
54139 132377 131993 130193 127655 125081 122819 120864 119413 118701 117966 115723 111974 109028 108802 110214 110812
54124 110812 110184 109878 110373 110363 109284 108509 109250 110805 111726 111515 110420 108629 106516 104884 104166 103952 103781
54107 103781 103773 104125 104740 105702 107309 109181 110111 109451 108025 107215 107715 109528 112369 115409 117297 117242 115873
54090A15873j337n25J41J87m30j395k122k387k665l197l241k090m24M41K74j12
54074I6991l09n29o37l12p5p76j960k068o37Q95J076R9q71j128o85M2M12P0l43
54055H9255K23J614K354J583J44p63j173j741k359k403j930j521j233o17K25N32
54039H2190R6k33L81J759L131L998M111L089J007q57q21J249L543M281L528K484
54023A12936J617N39o87j318j173r20q91o19j8R8o20j127m01R58J581J352J340
54006A12647J975K418J938R78N63J136K167K545J432p83k490k313n54J217J830
53991A24706J412Q41R26J925L194L538K548J431J688L179M398M648M795N630O576
53976A71435O696O162N885O216O731O964O774O238N741N946P016Q072Q087P285
$$ plain form
54090 115873 114536 114011 114152 114339 113909 112514 110392 108005 105340 102143 98902 96812 96388 96829 97103 96991
54074 96991 96682 96153 95516 95204 95129 94353 92393 90325 89688 90583 91659 91758 90887 89759 89074 89116 89528 89598 89255
54055 89255 89478 91092 93446 95029 95173 94410 93237 91496 89137 86734 84804 83283 82050 81433 81658 82190
54039 82190 82286 82053 82434 84193 87324 91322 95433 98522 99529 98672 97851 99100 102643 106924 110452 112936
54023 112936 114553 115092 114405 113087 111914 110994 110103 109484 109466 109564 108944 107817 107416 108374 109955 111307 112647
54006 112647 114622 117040 118978 119956 120519 121655 123822 126367 127799 127016 124526 122213 121659 122876 124706
53991 124706 126118 126959 127885 129810 133004 136542 139090 140521 142209 145388 149786 154434 159229 164859 171435
53976 171435 178131 184293 190178 196394 203125 210089 216863 223101 228842 234788 241804 249876 257963 265248
53962B65248O908P502Q181P856O611N233M105L197K781L131L602L022J317k28
53948C28466p21p81j309k049k313k413l119m270n146n857o889p462o126l333j679
53933B74999k719m950n970n496n013n286n543m830l188j636j395k668l937l324
53919B19044j127J93p25k240k299j563k061l642l993k026P36K477K973K780K075
53904B10602J057L94M57Q84J268J521J370M29q18j156j51J254K039K120J686N97
53888B23553q25j378k92J526K492K192J551J475K085L153M568O130P339P544O393
53873B67506M221K075J089J624L114M777O162O956O779N647M414M248N367O562
53859C30541O357M709L260L503M987N931N498M602M292M498M902N948P782R061
$$ plain form
53962 265248 272156 279658 287839 295695 302306 307539 311644 314841 317622 320753 324355 327377 328694 328466
53948 328466 327745 326964 325655 323606 321293 318880 315761 311491 306345 300488 293599 286137 280011 276678 274999
53933 274999 272280 267330 261360 255864 250851 245565 240022 235192 232004 230368 228973 226305 222368 219044
53919 219044 217917 218110 217385 215145 212846 211283 209222 205580 201587 199561 200297 202774 205747 208527 210602
53904 210602 211659 212053 212510 213394 214662 216183 217553 217982 217164 216008 215857 217111 219150 221270 222956 223553
53888 223553 222728 221350 221058 222584 225076 227268 228819 230294 232379 235532 240100 246230 253569 261113 267506
53873 267506 271727 273802 274891 276515 279629 284406 290568 297524 304303 309950 314364 318612 323979 330541
53859 330541 336898 341607 344867 348370 353357 359288 364786 369388 373680 378178 383080 389028 396810 405871
53845D05871Q339O217M719M538M423L415K136J335O01o84k034k583k415k321k633
53830D28924l048l351l739m521n822p392q668r197r084q655p907o885o375p204
53816C37076q757r309q172o555n800n836o069o613p594q113p217n545m723n245
53802B41528n893n387l721j865r18j585l701n905o470n011k903j741j674j716
53788A93038j352j159j673k376k364j711j329j490j437q44o76j744l075l034j674
53773A67100o10o70j051r99q55r24o94K5M99M58Q75K189K921J603o43j223N06
53756A68507K511K874J890J056J214K144L029K872J306o50j264j1J895L152L868
53741A94393M844O185P314Q020Q498Q581P726O026M562M309N003N547N409N153
$$ plain form
53845 405871 414210 420427 425146 429684 434107 437522 439658 440993 441594 440910 438876 436293 433878 431557 428924
53830 428924 425876 422525 418786 414265 408443 401051 392383 383186 374102 365447 357540 350655 344280 337076
53816 337076 328319 319010 310838 304283 298483 292647 286578 279965 272371 264258 257041 251496 246773 241528
53802 241528 235635 230248 226527 224662 223744 222159 218458 212553 206083 201072 198169 196428 194754 193038
53788 193038 191686 190527 188854 186478 184114 182403 181074 179584 178147 177303 176627 174883 171808 168774 167100
53773 167100 166490 165820 164769 163770 162915 161991 161297 161322 161821 162279 163154 165343 168264 169867 169224 168001 168507
53756 168507 171018 173892 175782 176838 178052 180196 183225 186097 187403 186753 185489 185478 187373 190525 194393
53741 194393 199237 205422 212736 220756 229254 237835 245561 251587 256149 260458 265461 271008 276417 281570
53727B81570N414N792N307L782K149J237Q46M17R3M33J301J869J710J188M38j250
53711C12296m310p499q628p004m504l603m633n721n332l966k912k318j593j059
53697B49214j789l571m532l440j445m98q15r57j49P47N88n69j763k225j878j077
53681B25841j50Q26J865K697K836K264J675J660J922J829J451J403J820K244K474
53666B52657K682K610J564l96k022k219j252j26O17Q72L69r49k141j938m04Q36
53650B50760M66j004j969j483J04J868L079L427L155K958L245L446K665J185N32
53635B72434J528L007L305K709L096N115O903O485M487L338M091N290N222M149
53621C31159L605M083M477L718K118O79k87j125j732j369P6J381J267O7o88l55
$$ plain form
53727 281570 286984 292776 298083 301865 304014 305251 306097 306514 306607 307040 308341 310210 311920 313108 313546 312296
53711 312296 307986 300487 291859 284855 280351 276748 272115 266394 261062 257096 254184 251866 250273 249214
53697 249214 247425 243854 239322 235882 234437 233939 233124 232167 232018 232765 233353 232784 231021 228796 226918 225841
53681 225841 225691 226517 228382 231079 233915 236179 237854 239514 241436 243265 244716 246119 247939 250183 252657
53666 252657 255339 257949 259513 259117 257095 254876 253624 253498 254115 254987 255356 254407 252266 250328 249924 250760
53650 250760 251226 250222 248253 246770 246874 248742 251821 255248 258403 261361 264606 268052 270717 271902 272434
53635 272434 273962 276969 280274 282983 286079 291194 298097 304582 309069 312407 316498 321788 327010 331159
53621 331159 334764 338847 343324 347042 349160 349839 349552 348427 346695 345326 345402 346783 348050 348117 347429 347074
53605C47074L5n93j797k360k063j680j441o29Q74J702O04j574k628j757o26j118
53589C32023k837l763k950j558j038j320j340o43L18J071J520J562J105N52N46
53574C23248J151J765K063K428L127L597L053J581K63J27J204K464K804K171J704
53559C52750K445M078N322N506N090M566L721K474J713K477M534O493P375P533
53545D16077P890Q676R214Q829P668O428N432M347L000K027K188L405N027O686
53531D96894Q101Q292O385L387J764K590M126M134K644J371J220J599J799J823
53517E46129J903K232K956L689L347J471o32j266n82j65m88l44Q64J898J588O11
53501E63211L43Q12J120J181J790L094M136M119L312K537K315K792L888N183N918
$$ plain form
53605 347074 347109 346516 344719 342359 340296 338616 337175 336546 337420 339122 339726 338152 335524 333767 333141 332023
53589 332023 329186 325423 322473 320915 319877 318557 317217 316574 316892 317963 319483 321045 322150 322702 323248
53574 323248 324399 326164 328227 330655 333782 337379 340432 342013 342276 342403 343607 346071 348875 351046 352750
53559 352750 355195 359273 364595 370101 375191 379757 383478 385952 387665 390142 394676 401169 408544 416077
53545 416077 423967 432643 441857 450686 458354 464782 470214 474561 477561 479588 481776 485181 490208 496894
53531 496894 504995 513287 519672 523059 524823 527413 531539 535673 538317 539688 540908 542507 544306 546129
53517 546129 548032 550264 553220 556909 560256 561727 561095 559829 559247 559082 558594 558250 559114 561012 562600 563211
53501 563211 563554 564366 565486 566667 568457 571551 575687 579806 583118 585655 587970 590762 594650 599833 605751
53486F05751N609M666M191M977O736Q363Q977Q517P421O150N308N723P627R860
53472F99876J0720R795Q423Q040Q796J0128J1880J3994J5676J5993J5381J5524
53460H44226J7307J9610K0757K0660K0708K1678K2740K2918K2736K3549K5595
53449A082484K7632K8681K9213L0131L1326L2036L2264L2969L4819L7395L9723
53438A438673M1184M1767M1773M1393M0500L9020L7612L7450L8825M0418M0714
53427A879329L9756L8693L7920L6839L5425L4728L5391L6759L7915L8592L8591
53416B289938L7422L5311L3580L3058L2868L1823L0213K9015K7940K5789K2463
53405B629420J9227J6825J4592J1674Q036L968l38m325p221r162j1235j3851j6026
$$ plain form
53486 605751 611360 616026 620217 625194 631930 640293 649270 657787 665208 671358 676666 682389 690016 699876
53472 699876 710596 720391 728814 736854 745650 755778 767658 781652 797328 813321 828702 844226
53460 844226 861533 881143 901900 922560 943268 964946 987686 1010604 1033340 1056889 1082484
53449 1082484 1110116 1138797 1168010 1198141 1229467 1261503 1293767 1326736 1361555 1398950 1438673
53438 1438673 1479857 1521624 1563397 1604790 1645290 1684310 1721922 1759372 1798197 1838615 1879329
53427 1879329 1919085 1957778 1995698 2032537 2067962 2102690 2138081 2174840 2212755 2251347 2289938
53416 2289938 2327360 2362671 2396251 2429309 2462177 2494000 2524213 2553228 2581168 2606957 2629420
53405 2629420 2648647 2665472 2680064 2691738 2699774 2703742 2703404 2699079 2691858 2682696 2671461 2657610 2641584
53392B641584j6936j7361j8628k0827k3112k5244k7556k9637l0470l0161l0337
53381B371315l2001l3904l3961l1927k9676k8901k9419k9975k9936k9494k8625
53370B033496k6782k3807k0503j7875j6059j4422j2448j0152p677n133k851j237
53358A874550p0J595M341P486R829J1138J2283J3948J5967J8183K1049K4686K7963
53345B042948K9630L0154L1364L4085L7248L9700M1753M4061M6154M7417M8820
53334B473334N1938N6394O0143O2463O4871O8347P1436P2524P2513P3564P6059
53323C203586P8621Q0437Q1582Q1471P9167P5490P2761P1789P0888O8567O5478
53312D029837O2660N9549N5177N0112M5492M0994L5385K8572K1556J4852Q280
$$ plain form
53392 2641584 2624648 2607287 2588659 2567832 2544720 2519476 2491920 2462283 2431813 2401652 2371315
53381 2371315 2339314 2305410 2271449 2239522 2209846 2180945 2151526 2121551 2091615 2062121 2033496
53370 2033496 2006714 1982907 1962404 1944529 1928470 1914048 1901600 1891448 1883771 1878638 1875787 1874550
53358 1874550 1874480 1876075 1880416 1887902 1897731 1908869 1921152 1935100 1951067 1969250 1990299 2014985 2042948
53345 2042948 2072578 2102732 2134096 2168181 2205429 2245129 2286882 2330943 2377097 2424514 2473334
53334 2473334 2525272 2581666 2641809 2704272 2769143 2837490 2908926 2981450 3053963 3127527 3203586
53323 3203586 3282207 3362644 3444226 3525697 3604864 3680354 3753115 3824904 3895792 3964359 4029837
53312 4029837 4092497 4152046 4207223 4257335 4302827 4343821 4379206 4407778 4429334 4444186 4452466
53301D452466K058l513r227j6340k4624l2446l8843m4221m9012n3085n6723o0575
53289D065915o4157o5885o5329o4182o4201o5338o6654o7706o8162o7338o5408
53278C341555o3950o3838o3633o1604n8645n7256n7903n8316n6639n3583n0878
53267B695310m8903m6785m3977m0885l8211l6117l4008l1127k7640k4817k3614
53256B299226k3407k2967k2357k2748k4251k5075k3474j9765j5905j3518j2713
53245B073046j2387j1336r311p072n180l015L34M473P895R758J0565J1031J1421
53232B080222J2280J4492J7886K0875K2425K3635K6312L0473L4230L5994L5894
53221B354718L5136L4724L4909L5358L5575L5182L3909L1643K8715K5930K3603
$$ plain form
53301 4452466 4454524 4451011 4441784 4425444 4400820 4368374 4329531 4285310 4236298 4183213 4126490 4065915
53289 4065915 4001758 3935873 3870544 3806362 3742161 3676823 3610169 3542463 3474301 3406963 3341555
53278 3341555 3277605 3213767 3150134 3088530 3029885 2972629 2914726 2856410 2799771 2746188 2695310
53267 2695310 2646407 2599622 2555645 2514760 2476549 2440432 2406424 2375297 2347657 2322840 2299226
53256 2299226 2275819 2252852 2230495 2207747 2183496 2158421 2134947 2115182 2099277 2085759 2073046
53245 2073046 2060659 2049323 2040012 2032940 2027760 2024745 2025079 2029552 2037447 2047205 2057770 2068801 2080222
53232 2080222 2092502 2106994 2124880 2145755 2168180 2191815 2218127 2248600 2282830 2318824 2354718
53221 2354718 2389854 2424578 2459487 2494845 2530420 2565602 2599511 2631154 2659869 2685799 2709402
53210B709402K0852J6691J1780P899N524L158m16m563q124j1057j3737j5867j7296
53197B704246j8985k1771k4897k7168k8845l0876l2895l3657l3256l3219l4408
53186B384269l6287l8156l9581l9682l7834l5362l4678l6146l7336l6188l3479
53175A979540l1252l0246k9912k9830k9730k8933k7098k5084k3998k3674k2958
53164A676825k1285j9144j7258j5968j5298j4971j4560j3969j3595j3648j3796
53153A503333j3785j3822j3915j3566j2751j2479j3567j5277j6145j5870j5442
53142A346714j5675j6418j7027j6909j5803j4328j4002j5707j8215j9278j8264
53131A165088j6829j6737j7938j9148j9463j8832j7675j6735j6891j8361k0151
$$ plain form
53210 2709402 2730254 2746945 2758725 2766624 2772148 2775306 2774890 2770327 2762203 2751146 2737409 2721542 2704246
53197 2704246 2685261 2663490 2638593 2611425 2582580 2551704 2518809 2485152 2451896 2418677 2384269
53186 2384269 2347982 2309826 2270245 2230563 2192729 2157367 2122689 2086543 2049207 2013019 1979540
53175 1979540 1948288 1918042 1888130 1858300 1828570 1799637 1772539 1747455 1723457 1699783 1676825
53164 1676825 1655540 1636396 1619138 1603170 1587872 1572901 1558341 1544372 1530777 1517129 1503333
53153 1503333 1489548 1475726 1461811 1448245 1435494 1423015 1409448 1394171 1378026 1362156 1346714
53142 1346714 1331039 1314621 1297594 1280685 1264882 1250554 1236552 1220845 1202630 1183352 1165088
53131 1165088 1148259 1131522 1113584 1094436 1074973 1056141 1038466 1021731 1004840 986479 966328
53120I66328k0812j9820j7993j6621j6371j6915j7370j7014j5785j4256j3264
53109G80107j3388j4507j5677j5756j4481j2848j2034j2089j1975j0997r697r157
53097F27501r575j0030r565q368p585p999r182j0196j0723j0923j0462q756o422
53084E07715n286o126p291o705m716l569m311n646o078n752n535n434m821l559
53070D32886k053p59k83j387l987o536p370o518n386m770m107k842j588j416k436
53055C81448l662m156l973l964m768o002o547n741m090k656j857j298o96m66j188
53040C30384k762m346n056m603l347j813k46J292K409K404J211J0K29J804L066
53025C20636K674J177K84Q95K423L912N129O295P177P017N415K954O83q96k016
$$ plain form
53120 966328 945516 925696 907703 891082 874711 857796 840426 823412 807627 793371 780107
53109 780107 766719 752212 736535 720779 706298 693450 681416 669327 657352 646355 636658 627501
53097 627501 617926 607896 598331 589963 582378 574379 565197 555001 544278 533355 522893 514137 507715
53084 507715 502429 496303 489012 482307 477591 474022 469711 464065 457987 452235 446700 441266 436445 432886
53070 432886 430833 430074 429791 428404 424417 417881 410511 403993 398607 393837 389730 386888 385300 383884 381448
53055 381448 377786 373630 369657 365693 360925 354923 348376 342635 338545 335889 334032 332734 332038 331572 330384
53040 330384 327622 323276 318220 313617 310270 308457 308211 309503 311912 314316 315527 315537 315766 317570 320636
53025 320636 323310 324487 324771 325666 328089 332001 337130 343425 350602 357619 363034 365988 366671 365775 363759
53010C63759k864l104k451j392q59j251k239l372m452n272n631n690n819n908
52996C13455n407m306l492l650m401m941n095n132n012m544l992l730l532k885
52982B53336j839q46N4R81J370M22j446k691k520j782j570j877k119k199k230
52967B35044k023j595j641k558l474l195j840o41k31r8K70N75L78j13m06m81q00
52950B17171j615k468k506j394J63J113J223J050P85N9q23n93J076K397J626k50
52934B17014o64Q73K178J658L25k46k65o32q83N2J695K342J480L92J66L65N6q09
52916B25097j608j921j633p42M37J326J819K466L442L841K891J454J240K417L162
52901B43688K179N69J89R71J343R59J226K738L930L412K257K509M132N229M913
$$ plain form
53010 363759 360895 357791 355340 353948 353089 351838 349599 346227 341775 336503 330872 325182 319363 313455
52996 313455 308048 303742 300250 296600 292199 287258 282163 277031 272019 267475 263483 259753 256221 253336
52982 253336 251497 250651 250705 251686 253056 253478 252032 249341 246821 245039 243469 241592 239473 237274 235044
52967 235044 233021 231426 229785 227227 223753 220558 218718 218077 217846 217748 218018 218593 218971 218858 218452 217971 217171
52950 217171 215556 213088 210582 209188 209351 210464 211687 212737 213522 213581 212758 212165 213241 215638 217264 217014
52934 217014 216350 217223 219401 221059 221384 221138 220873 220241 219358 219410 221105 223447 224927 225319 225485 225850 225906 225097
52916 225097 223489 221568 219935 219193 219630 220956 222775 225241 228683 232524 235415 236869 238109 240526 243688
52901 243688 245867 246436 246625 247596 248939 249898 251124 253862 257792 261204 263461 265970 270102 275331 280244
52886B80244M216L954L378J732j27o54N49K566M333N285N341M983N075O055P392
52871C34322Q105P624O143M483L644L860M102L277J925J555K017J190j864m851
52857C75532m970k722j211k027l697m276l735l206l217l392l233k583j765j403
52843C34095j596j509o25j05j481l981m851k976n73k65j776k903k631j693p25
52828C06405M27J649K255J847N12j539l520l731j365J561K093M21m6K322M585
52813C13876L273m70k357q74J071O60j163j732m97R20J425J485J608J422N83l25
52797C18905m29L13J129J436J434J613J847J388p7j670k069r32R21K568L559L512
52781C33448K183L59k60J076K962L363K017M74N5O27J319J600J414R17L32k44
$$ plain form
52886 280244 284460 288414 291792 293524 293397 292743 293292 295858 300191 305476 310817 315800 320875 326930 334322
52871 334322 342427 350051 356194 360677 364321 368181 372283 375560 377485 379040 381057 382247 380383 375532
52857 375532 370562 367840 366629 364602 360905 356629 352894 349688 346471 343079 339846 337263 335498 334095
52843 334095 332499 330990 330365 330260 328779 324798 319947 316971 316398 316133 314357 311454 308823 307130 306405
52828 306405 306832 308481 310736 312583 313095 311556 308036 304305 302940 304501 306594 307015 306969 309291 313876
52813 313876 317149 316679 314322 313448 314519 315179 314016 312284 311787 312707 314132 315617 317225 318647 319230 318905
52797 318905 318476 318789 319918 321354 322788 324401 326248 327636 327559 325889 323820 322888 323809 326377 329936 333448
52781 333448 335631 335990 335730 336806 339768 343131 345148 345622 345677 346304 347623 349223 350637 351554 351886 351642
52765C51642r91k002k893l086k372r05J029K855L737L413K705K511K698K642K439
52750C63422K561K631J786J68j070j360j141p20R5R49Q58m22j991l180m251n312
52734C53023n833n752n826o236o135n379n285o591p872p392n524m016l676m090
52720B73416m878n723n794m564k896k049k005j972j967k523l325l588l449l477
52706B25206l338k493j781k417l598l330j632p28j551k354j678n29l52o56l12
52691A98457K93J39n53j056j912l986o291o720m998l137k649k824k435j864k344
52676A58120l723m311l065j102l57j165j894j215N3Q4j386k646k322j098n84j136
52660A32253j516o33J063K120J838J112J223J925J600l92k427k658j554j040j598
$$ plain form
52765 351642 350651 348649 345756 342670 340298 339393 340422 343277 347014 350427 353132 355643 358341 360983 363422
52750 363422 365983 368614 370400 370568 369498 368138 366997 366277 366372 367321 368179 367757 365766 362586 358335 353023
52734 353023 347190 341438 335612 329376 323241 317862 312577 305986 298114 290722 285198 281182 277506 273416
52720 273416 268538 262815 257021 252457 249561 247512 245507 243535 241568 239045 235720 232132 228683 225206
52706 225206 221868 219375 217594 215177 211579 208249 206617 205889 204338 201984 200306 199777 199425 198769 198457
52691 198457 198750 198889 198336 197280 195368 191382 185091 178371 173373 170236 167587 164763 162328 160464 158120
52676 158120 154397 150086 147021 145919 145562 144397 142503 141288 141341 141425 140039 137393 135071 133973 133389 132253
52660 132253 130737 130104 131167 133287 135125 136237 137460 139385 140985 140593 138166 135508 133954 132914 131316
52645A31316j851j118m84q09j316j068m48j66M8N66P39q9j161j234k91P25J379
52628A24738J825J999J943K392L762M871M060J571l95j01K077M347M984L419Q13
52613A62305o31R8J419J131m94r74R81L835N350N064M025L179K857L099L662M106
52597A99012M240M179L773K730J358M53J55j73o58n52K12J80j817m661o022n205
52581A97204l829l548m158m516m469m914n983o342m940k710j456j192j50K193
52567A51190L705K534J16o53N10J180P0j407j856j957k692l419l186k553k518
52552A39064k659j913m90N46R16R99N84o86j980j961o96M75Q52Q50O54m9q25m92
52534A33189J068K355K098Q21JM08J666K817K971K025R32O66R85J097J277K463
$$ plain form
52645 131316 129465 128347 127863 127054 125738 124670 124222 124056 124104 124670 125409 125320 124159 122925 122634 123359 124738
52628 124738 126563 128562 130505 132897 136659 141530 145590 147161 146766 146665 148742 153089 158073 161492 162305
52613 162305 161674 161772 163191 164322 163828 162854 163835 167670 173020 178084 182109 185288 188145 191244 194906 199012
52597 199012 203252 207431 211204 213934 215292 215745 215900 215727 215069 214517 214729 214909 213092 208431 202409 197204
52581 197204 193375 189827 185669 181153 176684 171770 165787 159445 154505 151795 150339 149147 148997 151190
52567 151190 154895 157429 157545 156892 157402 158582 158652 157245 155389 153432 150740 147321 144135 141582 139064
52552 139064 136405 134492 134002 134548 135464 136463 137047 136361 134381 132420 131724 132199 133051 133901 134555 134506 133681 133189
52534 133189 134257 136612 138710 139531 139532 139940 141606 144423 147394 149419 150351 151017 152002 153099 154376 156839
52518A56839M107M122J828n88o77J174K572K256J065K30O4L44Q59J328J411J014
52502A77948L05m78r58p65m3O11J120K012L127L176J653K11O99K367K759J226
52486A94970k63j16Q84J343J480K307L632M257L724K675J700Q64L69O77J722K617
52470B22842K541J617O26J82L67J079K280L747M745M375K529K67j149j483j398
52455B43167j274p45L81J391J351K84p41p51J05O95M7j543k739k588j543o55j39
52438B34703N23J267J330P18O64J853L023K457M61q28j46J459K188J630P59L73
52422B52434L43K29qj89k61j88K53J115J831J578K00j584k960l537l080j482N81
52405B45275J756J557J251K220L896M516L621K375J475L77r91j483n83M05K48
$$ plain form
52518 156839 160946 165068 166896 166308 165631 166805 169377 171633 172698 172928 172992 173336 174195 175523 176934 177948
52502 177948 178253 177775 176817 176052 176009 176620 177740 179752 182879 186055 187708 187919 188618 190985 193744 194970
52486 194970 194707 194591 195475 196818 198298 200605 204237 208494 212218 214893 216593 217457 217826 218503 220225 222842
52470 222842 225383 227000 227626 227808 228175 229254 231534 235281 240026 244401 246930 247197 246048 244565 243167
52455 243167 241893 241148 241529 242920 244271 244555 243814 243063 243168 243863 243910 242367 239628 237040 235497 234842 234703
52438 234703 235226 236493 237823 238541 239205 241058 244081 246538 246999 246171 246025 247484 249672 251302 252061 252434
52422 252434 252777 253006 252998 252809 252548 252360 252613 253728 255559 257137 257337 255753 252793 249256 246176 244694 245275
52405 245275 247031 248588 249839 252059 255955 260471 264092 266467 267942 268319 267328 265845 265262 265667 265915
52390B65915l33N3J261K187K712L384L672K484L63o76J23J300J486J152J300J746
52374B88129J771J477J334J071K13p06o56K57P81K33p28j322j706k209k275j142
52358B84522O69J607J070K59M56J156Q04q97k529k752j614J02J737K539J794L9
52342B88962p95M71K601L503K792J562K18j760l948m659l080m76J454K415L038
52327B92298L614M106M676N197M776K764J44j028K32K684M111L546K181K028L679
52312C35008N618O005M765L362K706K233J224Q7l38l1M13Q21J500K390K917K827
52296C71507K580K621K642J969O28m48m24N10J597K655M093N811O872O730O028
$$ plain form
52390 265915 265582 265635 266896 269083 271795 275179 278851 281335 281698 281022 281145 282445 283931 285083 286383 288129
52374 288129 289900 291377 292711 293782 293995 293289 292633 292890 293671 293904 293176 291854 290148 287939 285664 284522
52358 284522 285191 286798 287868 288127 288583 289739 290543 289646 287117 284365 282751 282853 284590 287129 288923 288962
52342 288962 288167 288638 291239 294742 297534 299096 299314 297554 293606 288947 285867 285391 286845 289260 292298
52327 292298 295912 300018 304694 309891 314667 317431 317575 316547 316779 319463 323574 327120 329301 331329 335008
52312 335008 340626 346631 351396 354758 357464 359697 360921 361008 360670 360639 361052 361873 363373 365763 368680 371507
52296 371507 374087 376708 379350 381319 381947 381499 381075 381585 383182 385837 389930 395741 402613 409343 415371
$$ [...]
##END NTUPLES=NMR SPECTRUM
##END=
