
##TITLE=AC1114_Huila2_5835470_OSrS25wEln
##JCAMPDX= 6.0         $$ Bruker NMR JCAMP-DX V2.0
##DATA TYPE= NMR SPECTRUM
##DATA CLASS= NTUPLES
##ORIGIN= BRUKER
##OWNER= Administrator
$$ 1.72 TOPSPIN		Version 2.1
$$ 2012-03-28 11:07:53.593 -0500  Administrator@TOPSPIN
$$ Compression mode = diff/dup
##.OBSERVE FREQUENCY= 400.13188235
##.OBSERVE NUCLEUS= ^1H
##.ACQUISITION MODE= SIMULTANEOUS (DQD)
##.ACQUISITION SCHEME= undefined
##.AVERAGES= 64
##.DIGITISER RES= 22
##SPECTROMETER/DATA SYSTEM= spect
##.PULSE SEQUENCE= noesygpps1d.comp
##.SOLVENT NAME= COFFEE_meoh
##.SHIFT REFERENCE= INTERNAL, COFFEE_meoh, 1, 14.9682
##AUDIT TRAIL= $$ (NUMBER, WHEN, WHO, WHERE, PROCESS, VERSION, WHAT)
$$ ##TITLE= Audit trail, TOPSPIN		Version 2.1
$$ ##JCAMPDX= 5.01
$$ ##ORIGIN= Bruker BioSpin GmbH
$$ ##OWNER= Administrator
$$ $$ C:\Bruker\TOPSPIN/data/COFFEE/nmr/AC1114_Huila2_5835470_OSrS25wEln/22/pdata/1/auditp.txt
$$ ##AUDIT TRAIL=  $$ (NUMBER, WHEN, WHO, WHERE, PROCESS, VERSION, WHAT)
(   1,<2012-03-28 03:35:27.296 -0500>,<Administrator>,<TOPSPIN>,<go>,<TOPSPIN 2.1>,
      <created by zg
	started at 2012-03-28 03:23:55.671 -0500,
	POWCHK enabled, PULCHK disabled,
       configuration hash MD5:
       1A 1E CE 29 27 FD 77 03 67 4E F0 E3 C4 B2 CB 90
       data hash MD5: 64K
       27 D6 C1 EC 78 A4 AB 74 89 EB A1 7C 6A DE 52 0C>)
(   2,<2012-03-28 03:35:32.234 -0500>,<Administrator>,<TOPSPIN>,<proc1d>,<TOPSPIN 2.1>,
      <Start of raw data processing
       efp LB = 0.3 FT_mod = 6 PKNL = 1 PHC0 = 0 PHC1 = 0 SI = 128K 
       data hash MD5: 128K
       83 22 F8 C4 B7 5A 52 F7 0C A2 A8 47 01 52 61 C6>)
(   3,<2012-03-28 03:35:33.640 -0500>,<Administrator>,<TOPSPIN>,<proc1d>,<TOPSPIN 2.1>,
      <pk PHC0 = 33.72253 PHC1 = 0 
       data hash MD5: 128K
       71 8C E2 B0 22 E5 46 79 64 19 70 8D C7 05 2A 45>)
(   4,<2012-03-28 03:35:34.312 -0500>,<Administrator>,<TOPSPIN>,<proc1d>,<TOPSPIN 2.1>,
      <abs ABSG = 1 
       data hash MD5: 128K
       92 BA 38 84 90 CA F8 55 7A 1E B0 C0 36 41 9C FB>)
(   5,<2012-03-28 03:35:34.421 -0500>,<Administrator>,<TOPSPIN>,<proc1d>,<TOPSPIN 2.1>,
      <abs ABSG = 2 
       data hash MD5: 128K
       86 0B 2B 74 30 7C 3D 18 70 84 DD 33 D7 0C 52 9D>)
(   6,<2012-03-28 03:35:34.484 -0500>,<Administrator>,<TOPSPIN>,<proc1d>,<TOPSPIN 2.1>,
      <abs ABSG = 3 
       data hash MD5: 128K
       AD D9 B5 39 CA BF 02 B7 27 33 A6 96 BE F3 4E 66>)
(   7,<2012-03-28 03:35:34.562 -0500>,<Administrator>,<TOPSPIN>,<proc1d>,<TOPSPIN 2.1>,
      <abs ABSG = 4 
       data hash MD5: 128K
       89 BD DF 82 43 DD 48 70 BF 94 FF E2 23 13 61 43>)
(   8,<2012-03-28 03:35:34.640 -0500>,<Administrator>,<TOPSPIN>,<proc1d>,<TOPSPIN 2.1>,
      <abs ABSG = 5 
       data hash MD5: 128K
       93 C0 DC E9 C7 20 F7 5B F5 3F BF 54 31 87 AE 72>)
(   9,<2012-03-28 03:35:35.515 -0500>,<Administrator>,<TOPSPIN>,<audit>,<TOPSPIN 2.1>,
      <user comment:
       ICON-NMR User ID: COFFEE
       data hash MD5: 128K
$$ [...]
##$TP07= 0
##$TPNAME0= <>
##$TPNAME1= <>
##$TPNAME2= <>
##$TPNAME3= <>
##$TPNAME4= <>
##$TPNAME5= <>
##$TPNAME6= <>
##$TPNAME7= <>
##$TPOAL= (0..7)
0.5 0.5 0.5 0.5 0.5 0.5 0.5 0.5
##$TPOFFS= (0..7)
0 0 0 0 0 0 0 0
##$TUNHIN= 0
##$TUNHOUT= 0
##$TUNXOUT= 0
##$USERA1= <user>
##$USERA2= <user>
##$USERA3= <user>
##$USERA4= <user>
##$USERA5= <user>
##$V9= 5
##$VALIST= <valist>
##$VCLIST= <CCCCCCCCCCCCCCC>
##$VD= 0
##$VDLIST= <DDDDDDDDDDDDDDD>
##$VPLIST= <PPPPPPPPPPPPPPP>
##$VTLIST= <TTTTTTTTTTTTTTT>
##$WBST= 2048
##$WBSW= 25
##$XGAIN= (0..3)
0 0 0 0
##$XL= 0
##$YL= 0
##$YMAX_a= 12959733
##$YMIN_a= -5888405
##$ZGOPTNS= <>
##$ZL1= 120
##$ZL2= 120
##$ZL3= 120
##$ZL4= 120
##$ABSF1= 14.9682
##$ABSF2= -5.584331
##$ABSG= 5
##$ABSL= 3
##$ALPHA= 0
##$AQORDER= 0
##$ASSFAC= 0
##$ASSFACI= 0
##$ASSFACX= 0
##$ASSWID= 0
##$AUNMP= <proc_prof1d_extract.lims>
##$AXLEFT= 0
##$AXNAME= <>
##$AXNUC= <1H>
##$AXRIGHT= 0
##$AXTYPE= 0
##$AXUNIT= <>
##$AZFE= 0.1
##$AZFW= 0.1
##$BCFW= 0
##$BC_mod= 0
##$BYTORDP= 0
##$COROFFS= 0
##$CY= 15
##$DATMOD= 1
##$DC= 0
##$DFILT= <>
##$DTYPP= 0
##$F1P= 0
##$F2P= 0
##$FCOR= 0.5
##$FTSIZE= 131072
##$FT_mod= 6
##$GAMMA= 0
##$GB= 0
##$INTBC= 1
##$INTSCL= 1
##$ISEN= 128
##$LB= 0.3
##$LEV0= 0
##$LPBIN= 0
##$MAXI= 10000
##$MC2= 0
##$MEAN= 0
##$ME_mod= 0
##$MI= 0
##$NCOEF= 0
##$NC_proc= -3
##$NLEV= 6
##$NOISF1= 0
##$NOISF2= 0
##$NSP= 0
##$NTH_PI= 0
##$NZP= 0
##$OFFSET= 14.9682
##$PC= 1
##$PHC0= 33.72253
##$PHC1= 0
##$PH_mod= 1
##$PKNL= yes
##$PPARMOD= 0
##$PPDIAG= 0
##$PPIPTYP= 0
##$PPMPNUM= 2147483647
##$PPRESOL= 1
##$PSCAL= 4
##$PSIGN= 0
##$PYNMP= <proc.py>
##$REVERSE= no
##$SF= 400.130004967011
##$SI= 131072
##$SIGF1= 0
##$SIGF2= 0
##$SINO= 400
##$SIOLD= 131072
##$SPECTYP= <>
##$SREGLST= <1H.CDCl3>
##$SSB= 0
##$STSI= 131072
##$STSR= 0
##$SW_p= 8223.68421052632
##$SYMM= 0
##$S_DEV= 0
##$TDeff= 65536
##$TDoff= 0
##$TI= <>
##$TILT= no
##$TM1= 0
##$TM2= 0
##$TOPLEV= 0
##$USERP1= <user>
##$USERP2= <user>
##$USERP3= <user>
##$USERP4= <user>
##$USERP5= <user>
##$WDW= 1
##$XDIM= 131072
##$YMAX_p= 491341835
##$YMIN_p= -422341604
##$CURPLOT= <Network HP LaserJet P1505>
##$CURPRIN= <$Network HP LaserJet P1505>
##$DFORMAT= <normdp>
##$LAYOUT= <+/1D_H.xwp>
##$LFORMAT= <normlp>
##$PFORMAT= <normpl>
##$SURQMSG= 1
$$ End of Bruker specific parameters
$$ ---------------------------------
##NTUPLES= NMR SPECTRUM
##VAR_NAME=  FREQUENCY,     SPECTRUM/REAL,   SPECTRUM/IMAG
##SYMBOL=    X,             R,               I
##VAR_TYPE=  INDEPENDENT,   DEPENDENT,       DEPENDENT
##VAR_FORM=  AFFN,          ASDF,            ASDF
##VAR_DIM=   131072,        131072,          131072
##UNITS=     HZ,            ARBITRARY UNITS, ARBITRARY UNITS
##FACTOR=    0.0627417313425165, 1,          1
##FIRST=     8223.62146879498, 793,          -96058
##LAST=      0,             5761,            -96287
##MIN=       0,             -422341604,      0
##MAX=       8223.62146879498, 491341835,    0
$$ Real data points
##PAGE= N=1
##DATA TABLE= (X++(R..R)), XYDATA
$$ [...]
62942B788381N67Q242J5792K3543L0470L4611L5645L5775L7256L9995M2288M2893
62930C135458M1711L9386L6903L4933L2982K9918K5389J9822J3019M189o410j7452
62918C389848k8526m0363n2465o2592o9752p5831q2710q9601r4837r8452j00918
62907B593801j00887r6953r0623q5009q1004p7143p2711o8440o4283n9186n3400
62896A744162m8587m5165m1671l7474l3949l2144l1111k9524k7277k4609k1312
62885A371339j7893j5857j5599j5332j3435j0761r277r374r901j0110j0198j0264
62873A223338j0000r355q796q900r976j1708j2971j2733j1405j0459j0419j0263
62861A096353r235q023p352o731n561m397l908l668l170l097m112n279n291m648
$$ y = [2788381, 2788948, 2797190, 2812982, 2836525, 2866995, 2901606, 2937251, 2973026, 3010282, 3050277, 3092565, 3135458, 3177169, 3216555, 3253458, 3288391, 3321373, 3351291, 3376680, 3396502, 3409521, 3413710, 3407300, 3389848, 3361322, 3320959, 3268494, 3205902, 3136150, 3060319, 2977609, 2888008, 2793171, 2694719, 2593801, 2492914, 2395961, 2305338, 2220329, 2139325, 2062182, 1989471, 1921031, 1856748, 1797562, 1744162, 1695575, 1650410, 1608739, 1571265, 1537316, 1505172, 1474061, 1444537, 1417260, 1392651, 1371339, 1353446, 1337589, 1321990, 1306658, 1293223, 1282462, 1273185, 1263811, 1253910, 1243800, 1233602, 1223338, 1213338, 1203983, 1195187, 1186287, 1176311, 1164603, 1151632, 1138899, 1127494, 1117035, 1106616, 1096353, 1087118, 1079095, 1071743, 1065012, 1059451, 1055054, 1051146, 1047478, 1044308, 1041211, 1037099, 1031820, 1026529, 1021881]
62847A021881m831n619n148k768j86O94j22j272j597q16N66J618J847J805K265
62832A008317K965L000K175J058j30j532k697k969k808l327m378m607l792l401
62818I87874m195m914m376l418l373l885l816l302l264l525l267k950l916o019
62804I33654p328o628m862l689l715m603n811o661o574n781n162n056m969m596
62790H58219m212l745k656j127l02n93q60j69O79M36o06j052k10J661M170O658
62774H56291P858P105N543M727M444L411J750J000J586K279K452L039M502N614
62760I11601N327M384L945L848L553L666N085P266Q729Q898Q371P693O950O318
62746I95634O107O470P588R646J2105J3822J4660J5974J8492K0767K1285K1071
$$ y = [1021881, 1017050, 1011431, 1006283, 1003515, 1003329, 1004023, 1003901, 1002629, 1001032, 1000216, 1000782, 1002400, 1004247, 1006052, 1008317, 1011282, 1014282, 1016457, 1017515, 1017385, 1015853, 1013156, 1010187, 1007379, 1004052, 999674, 995067, 991275, 987874, 983679, 978765, 974389, 970971, 967598, 963713, 959897, 956595, 953331, 949806, 946539, 943589, 939673, 933654, 926326, 919698, 914836, 911147, 907432, 902829, 897018, 890357, 883783, 878002, 872840, 867784, 862815, 858219, 854007, 850262, 847606, 846479, 846177, 845584, 844724, 844555, 845234, 845670, 845064, 844012, 843802, 845463, 849633, 856291, 864149, 871254, 876797, 881524, 885968, 889379, 891129, 892129, 893715, 895994, 898446, 901485, 905987, 911601, 916928, 921312, 925257, 929105, 932658, 936324, 941409, 948675, 957404, 966302, 974673, 982366, 989316, 995634, 1001741, 1008211, 1015799, 1025445, 1037550, 1051372, 1066032, 1082006, 1100498, 1121265, 1142550, 1163621]
62734A163621K2322K5028K7182K8248L0152L4306L9635M4445M8579N2704N6881
62723A573103O1004O5610P0959P6074P9942Q3271Q7912R4660J02349J09143J14112
62712B518139J17590J20311J22259J22212J18718J11537J01746R0333P7178O1700
62702C561723M3891K4495M453j5490l4903n3534p0887q6090r8614j08859j17348
62691C048837j23524j26340j25978j23885j20907j16575j10647j04168r8249r2754
62681A905810q7010q1010p5090o9117o2999n7384n2918m9245m5626m2097l8999
62670A244315l5708l1023k4942j9169j5534j4375j4503j4232j2532r616o576m179
62658A041926k186j50J599K484L062M944Q947J3778J7124J8055J8033J9389K2938
$$ y = [1163621, 1185943, 1210971, 1238153, 1266401, 1296553, 1330859, 1370494, 1414939, 1463518, 1516222, 1573103, 1634107, 1699717, 1770676, 1846750, 1926692, 2009963, 2097875, 2192535, 2294884, 2404027, 2518139, 2635729, 2756040, 2878299, 3000511, 3119229, 3230766, 3332512, 3422845, 3500023, 3561723, 3605614, 3630109, 3634562, 3619072, 3584169, 3530635, 3459748, 3373658, 3275044, 3166185, 3048837, 2925313, 2798973, 2672995, 2549110, 2428203, 2311628, 2200981, 2096813, 1998564, 1905810, 1818800, 1737790, 1662700, 1593583, 1530584, 1473200, 1420282, 1371037, 1325411, 1283314, 1244315, 1208607, 1177584, 1152642, 1133473, 1117939, 1103564, 1089061, 1074829, 1062297, 1052681, 1046105, 1041926, 1039740, 1039590, 1041189, 1043673, 1046735, 1051679, 1060626, 1074404, 1091528, 1109583, 1127616, 1147005, 1169943]
62645A169943K7426L1351L4704L8411M2655M6841N0987N5907O1647O7042P1414
62634A698328P5534Q0028Q3879Q5788Q6234Q6771Q7690Q7666Q5482Q0711P2863
62623B610974O1426M7097L1671J6189L67j5644l0349m2806n4242o6267p8003q6708
62611B393705r1308r3725r6110r8055r7645r4463r0005q5380q0151p3956o8005
62600A424902o3881o1436n9008n5435n0934m6180m1554l7472l4434l2350l0419
62589I11799k8134k5845k4100k2812k1471j9781j7892j6285j5420j5074j4173
62578F90812j1968r346q084q657r682r770q910p667o083m099k266j231j037j366
62564F00646j772j434L08K599L500K497J367J679K640K782K476L133M779O334
$$ y = [1169943, 1197369, 1228720, 1263424, 1301835, 1344490, 1391331, 1442318, 1498225, 1559872, 1626914, 1698328, 1773862, 1853890, 1937769, 2023557, 2109791, 2196562, 2284252, 2371918, 2457400, 2538111, 2610974, 2672400, 2719497, 2751168, 2767357, 2767724, 2752080, 2721731, 2678925, 2624683, 2558416, 2480413, 2393705, 2302397, 2208672, 2112562, 2014507, 1916862, 1822399, 1732394, 1647014, 1566863, 1492907, 1424902, 1361021, 1299585, 1240577, 1185142, 1134208, 1088028, 1046474, 1009002, 974568, 942218, 911799, 883665, 857820, 833720, 810908, 789437, 769656, 751764, 735479, 720059, 704985, 690812, 678844, 669498, 661414, 652757, 643075, 633305, 624395, 616728, 610645, 606546, 604280, 603049, 602012, 600646, 598874, 597440, 597748, 600347, 603847, 606344, 607711, 609390, 612030, 614812, 617288, 620421, 625200, 631534]
62550F31534P707R704J2097J3594J3777J3504J3434J3758J5270J8848K3602K7332
62538H14161K9355L1272L4429L8275M1894M5488M9275N2435N4422N6094N8376
62527A305476O0664O1848O1867O0943N8156N2467M4778L7289L0639K2973J2326
62516A809426q45j3794k3762l0075l4500l9560m6051n2332n6200n7203n6548n5278
62504A343278n3428n0871m8037m5392m2787l9769l6306l2985l0446k8707k7036
62493I07514k4630k1563j8815j7168j6350j5509j4328j3292j2920j3094j3137
62482G26708j2409j0919r395q569q277p637o220m541l128j712J00J871K847L236
62468F61955M074N921Q347J0735J2836J4446J5295J5498J5515J5543J5698J6900
$$ y = [631534, 639241, 648945, 661042, 674636, 688413, 701917, 715351, 729109, 744379, 763227, 786829, 814161, 843516, 874788, 909217, 947492, 989386, 1034874, 1084149, 1136584, 1191006, 1247100, 1305476, 1366140, 1427988, 1489855, 1550798, 1608954, 1661421, 1706199, 1743488, 1774127, 1797100, 1809426, 1808581, 1794787, 1771025, 1740950, 1706450, 1666890, 1620839, 1568507, 1512307, 1455104, 1398556, 1343278, 1289850, 1238979, 1190942, 1145550, 1102763, 1062994, 1026688, 993703, 963257, 934550, 907514, 882884, 861321, 842506, 825338, 808988, 793479, 779151, 765859, 752939, 739845, 726708, 714299, 703380, 693985, 685416, 677139, 669502, 663282, 658741, 655613, 653901, 654001, 655872, 658719, 661955, 666029, 671950, 680297, 691032, 703868, 718314, 733609, 749107, 764622, 780165, 795863, 812763]
62456H12763K0442K6082L1441L4374L5368L6564L8901M1428M3373M5344M7983
62445A214063N0424N1014M9039M5127M0294L5139K9711K3719J6875R286J324o874
62433A559141j5249k3114k9429l4220l8743m3496m6926m7326m5355m3316m2153
62422A149814m0644l7687l3944l0766k8634k7213k5975k4223k1433j8122j5532
62411H45641j3888j1933q894n996m995n820o584n715l316p02Q72J310J848L636
62397G85464O114P585P592P449P948Q162P581P738R888J2442J2919J1711J1498
62384I04091J3112J4405J3523J1194R041P388N599L099n74n446j0196j3066j4286
62371I37884j6080j9430k2430k2989k1604k0009j8480j6386j4424j4047j4870
$$ y = [812763, 833205, 859287, 890728, 925102, 960470, 997034, 1035935, 1077363, 1120736, 1166080, 1214063, 1264487, 1315501, 1364540, 1409667, 1449961, 1485100, 1514811, 1538530, 1555405, 1564691, 1566015, 1559141, 1543892, 1520778, 1491349, 1457129, 1418386, 1374890, 1327964, 1280638, 1235283, 1191967, 1149814, 1109170, 1071483, 1037539, 1006773, 978139, 950926, 924951, 900728, 879295, 861173, 845641, 831753, 819820, 810926, 804930, 799935, 794115, 787531, 781816, 778500, 777798, 778670, 779980, 781828, 785464, 791578, 799163, 806755, 814204, 822152, 830314, 837895, 845633, 855521, 867963, 880882, 892593, 904091, 917203, 931608, 945131, 956325, 965366, 972754, 978353, 981452, 980878, 975432, 965236, 952170, 937884, 921804, 902374, 879944, 856955, 835351, 815342, 796862, 780476, 766052, 752005, 737135]
62360G37135j4604j1887p823m397k600k377l201m045l726k080j75J109K244M108
62346F87681O466Q165Q736Q883R243R488R268R402J1115J4036J6083J5844J4245
62333H28655J3024J2286J0757Q147N874N138N429N358M191K106k35j852j926p50
62319H96202M21R45J590L207N458P563R682J2491J5968J9582K3337K7536L1656
62306A055638L4723L6995M0232M5766N2932N9833O5198O9111P2419P5846P9429
62295A688122Q2397Q3622Q2363P8542P2385O4105N4099M3133L2010K1085J0281
62284B312144n17j1247k1772l1884m1101m8760n4748n9923o5271p0360p3215p2260
62272A761086o8149o3165n9054n5997n3451n1003m8294m5073m1783l9454l8450
$$ y = [737135, 722531, 710644, 702821, 698424, 695824, 693447, 690246, 686201, 682475, 680395, 680220, 681329, 683573, 687681, 694147, 702312, 711048, 719931, 729174, 738662, 747930, 757332, 768447, 782483, 798566, 814410, 828655, 841679, 853965, 864722, 872869, 878743, 883881, 889310, 894668, 898859, 900965, 900730, 898878, 896952, 896202, 896623, 897568, 899158, 902365, 907823, 915386, 925068, 937559, 953527, 973109, 996446, 1023982, 1055638, 1090361, 1127356, 1167588, 1213354, 1266286, 1326119, 1391317, 1460428, 1532847, 1608693, 1688122, 1770519, 1854141, 1936504, 2015046, 2087431, 2151536, 2205635, 2248768, 2280778, 2301863, 2312144, 2311627, 2300380, 2278608, 2246724, 2205623, 2156863, 2102115, 2042192, 1976921, 1906561, 1833346, 1761086, 1692937, 1629772, 1570718, 1514721, 1461270, 1410267, 1361973, 1316900, 1275117, 1235663, 1197213]
62261A197213l7812l6325l3735l0535k7033k3293j9577j6230j3309j0816r002
62250I39546p899o829n152l282k277k452l037l241k988k544k033j633j625k010
62236H92544k520l200m413n824o099m347j616n0m59j469j376j30J115J879K912
62221H66947M955P769J0660J3324J5734J7682J8920J9508J9761K0101K1198K3651
62209A060210K7118L0294L2356L4013L6405L9382M1881M3779M6259N0218N5152
62198A497067N9938O3994O7451P0705P3873P6150P5823P1695O4362N5313M5018
62187B221389L3171K0604R124r35j1292k2932l4413m4138n2664o0993o7792p0675
62175A918454o9827o8155o7612o7248o5377o1932n7726n2748m6592m0034l4880
$$ y = [1197213, 1159401, 1123076, 1089341, 1058806, 1031773, 1008480, 988903, 972673, 959364, 948548, 939546, 931647, 924818, 919666, 916384, 914107, 911655, 908618, 905377, 902389, 899845, 897812, 896179, 894554, 892544, 890024, 886824, 882411, 876587, 870488, 866141, 864525, 864475, 864016, 862547, 861171, 861041, 862156, 864035, 866947, 871902, 879671, 890331, 903655, 919389, 937071, 955991, 975499, 995260, 1015361, 1036559, 1060210, 1087328, 1117622, 1149978, 1183991, 1220396, 1259778, 1301659, 1345438, 1391697, 1441915, 1497067, 1557005, 1620999, 1688450, 1759155, 1833028, 1909178, 1985001, 2056696, 2121058, 2176371, 2221389, 2254560, 2275164, 2284288, 2283353, 2272061, 2249129, 2214716, 2170578, 2117914, 2056921, 1989129, 1918454, 1848627, 1780472, 1712860, 1645612, 1580235, 1518303, 1460577, 1407829, 1361237, 1321203, 1286323]
62164A286323l2012l0281k7724k3761j9799j7383j6041j3773r829n964m189m096
62152A081471l696k334j196r66o19Q30K702L619L273K400J710J626K473M039N371
62137A100703N831O137P548J0186J2905J4811J6116J7382J8699J9923K1184K2712
62125A274137K4407K5892K6816K6979K6436K5672K5298K5309K4936K3707K2387
62114A551976K2355K4090K6845K9816L3011L6752M0937M5301M9943N4823N8870
62103A974719O0413N8777N5034N0784M6460M1182L4183K5937J7756J0504M098
62092B379847j852p420j2624j7773k2909k7145k9346k9510k8793k8082k7489k7159
62080B119745k7354k7243k5145k1070j7685j7196j8192j7516j4662j2212j1893
$$ y = [1286323, 1254311, 1224030, 1196306, 1172545, 1152746, 1135363, 1119322, 1105549, 1095720, 1089756, 1085567, 1081471, 1077775, 1075441, 1074245, 1073279, 1072660, 1073490, 1076192, 1079811, 1083084, 1085484, 1087194, 1088820, 1091293, 1095332, 1100703, 1106534, 1112671, 1120219, 1130405, 1143310, 1158121, 1174237, 1191619, 1210318, 1230241, 1251425, 1274137, 1298544, 1324436, 1351252, 1378231, 1404667, 1430339, 1455637, 1480946, 1505882, 1529589, 1551976, 1574331, 1598421, 1625266, 1655082, 1688093, 1724845, 1765782, 1811083, 1861026, 1915849, 1974719, 2035132, 2093909, 2148943, 2199727, 2246187, 2287369, 2321552, 2347489, 2365245, 2375749, 2379847, 2377995, 2370575, 2357951, 2340178, 2317269, 2290124, 2260778, 2231268, 2202475, 2174393, 2146904, 2119745, 2092391, 2065148, 2040003, 2018933, 2001248, 1984052, 1965860, 1948344, 1933682, 1921470, 1909577]
62069A909577j2521j2418j1763j1356j0625q459n135k097k34P16J507K880N220
62056A845292Q102J0682J2917J5652J8960K1436K2035K1767K2483K4586K7072
62045B050984K9378L1926L4977L8073M0790M3252M5661M7794M9053M8882M7304
62034B508074M5292M4213M4585M5768M7039M8410N0075N1768N3124N3967N3876
62023C046191N2407N0309M9503N0918N3318N5228N7060N9999O3686O6582O8228
62012C673429O9562P1270P3187P5264P7552P9264P9374P8503P8842Q1496Q4840
62001D522583Q6035Q3601P8189P1632O5583O0489N5392M9087M1576L4093K7812
61990E176072K3019J9372J6291J3117R607O419M693N036P219J0530J4066J7088
$$ y = [1909577, 1897056, 1884638, 1872875, 1861519, 1850894, 1842435, 1837300, 1835203, 1834969, 1835685, 1837192, 1840072, 1845292, 1853394, 1864076, 1876993, 1892645, 1911605, 1933041, 1955076, 1976843, 1999326, 2023912, 2050984, 2080362, 2112288, 2147265, 2185338, 2226128, 2269380, 2315041, 2362835, 2411888, 2460770, 2508074, 2553366, 2597579, 2642164, 2687932, 2734971, 2783381, 2833456, 2885224, 2938348, 2992315, 3046191, 3098598, 3148907, 3198410, 3249328, 3302646, 3357874, 3414934, 3474933, 3538619, 3605201, 3673429, 3742991, 3814261, 3887448, 3962712, 4040264, 4119528, 4198902, 4277405, 4356247, 4437743, 4522583, 4608618, 4692219, 4770408, 4842040, 4907623, 4968112, 5023504, 5072591, 5114167, 5148260, 5176072, 5199091, 5218463, 5234754, 5247871, 5257478, 5263897, 5268590, 5273626, 5280845, 5291375, 5305441, 5322529]
61978E322529J9674K2627K6123K9017L0257L0510L1295L2945L4547L5572L6432
61967E651528L7496L8652L9757M0555M0288L8394L5454L2513K9728K6836K4430
61956F035631K3281K2594K0644J7289J4234J2460J1026Q848O174L702J664M81
61944F178028R11K679M065L775K265O97k94k66J220L412M259K743L44r98j522
61929F201318k928n621q133r133q782q098p806p857p527o094l852k139j987l077
61915F118284m437n562o313o316n391m299m246n673q036j0508j2471j3570j3939
61902F017523j4311j5535j7994k1553k5547k8748l0042k9707k9387l0182l1266
61891E743251l1180k9934k9025k9437l0550l1001k9998k7617k4439k1133j8198
$$ y = [5322529, 5342203, 5364830, 5390953, 5419970, 5450227, 5480737, 5512032, 5544977, 5579524, 5615096, 5651528, 5689024, 5727676, 5767433, 5807988, 5848276, 5886670, 5922124, 5954637, 5984365, 6011201, 6035631, 6058912, 6081506, 6102150, 6119439, 6133673, 6146133, 6157159, 6166007, 6172181, 6175883, 6177547, 6178028, 6178939, 6181618, 6185683, 6189458, 6191723, 6192420, 6192126, 6191860, 6193080, 6196492, 6200751, 6203494, 6203838, 6202840, 6201318, 6198390, 6192769, 6184636, 6175503, 6166721, 6158623, 6150817, 6142960, 6135433, 6129339, 6125487, 6123348, 6121361, 6118284, 6113847, 6108285, 6101972, 6095656, 6090265, 6085966, 6081720, 6076047, 6068011, 6057503, 6045032, 6031462, 6017523, 6003212, 5987677, 5969683, 5948130, 5922583, 5893835, 5863793, 5834086, 5804699, 5774517, 5743251, 5712071, 5682137, 5653112, 5623675, 5593125, 5562124, 5532126, 5504509, 5480070, 5458937, 5440739]
61880E440739j5827j3977j2413j0611p957m259P8M516Q799J2776J6266J9355K2562
61867E460047K6387L0869L5787M1072M6827N3162O0239O8245P7123Q6465R5919
61856F082142J05600J15963J27334J39686J53011J67993J86076K08344K34203
61847G520352K61839K90361L20894L55073L93191M34636M79277N27190N77440
61838A1160253O28363O78705P26945P69511Q00906Q15563Q08142P72136P00456
61829A7860980N88998M39532K59475O0436j43008l35666n05450o45408p52608
61820A6827281q26584q69299q84912q78183q53512q15778p70571p22272o72594
61811I533576o21861n70924n21246m74094m30556l91406l56167l23304k92219
$$ y = [5440739, 5424912, 5410935, 5398522, 5387911, 5379954, 5375695, 5375773, 5380289, 5389088, 5401864, 5418130, 5437485, 5460047, 5486434, 5517303, 5553090, 5594162, 5640989, 5694151, 5754390, 5822635, 5899758, 5986223, 6082142, 6187742, 6303705, 6431039, 6570725, 6723736, 6891729, 7077805, 7286149, 7520352, 7782191, 8072552, 8393446, 8748519, 9141710, 9576346, 10055623, 10582813, 11160253, 11788616, 12467321, 13194266, 13963777, 14764683, 15580246, 16388388, 17160524, 17860980, 18449978, 18889510, 19148985, 19209421, 19066413, 18730747, 18225297, 17579889, 16827281, 16000697, 15131398, 14246486, 13368303, 12514791, 11699013, 10928442, 10206170, 9533576, 8911715, 8340791, 7819545, 7345451, 6914895, 6523489, 6167322, 5844018, 5551799]
61802E551799k64044k39686k18330j98935j81914j67810j55353j42612j29474
61793C853641j17397j07025r7590q8414p9695p1728o4474n7915n2093m6918m2524
61782C027868l9297l6910l4124l0439k7123k5432k4509k2416j8756j4887j1776
61771B742199r029o005k722M72L264N438P082Q525R624R860R624J0375J2592J4695
61757B815994J5316J5540J7351K0748K4257K7642L1975L7301M2253M6155M9877
61746C144409N4395N9919O6364P3318P9663Q4794R0045R7280J06220J14958J22996
61735D094361J31801J42241J53546J65252J78017J91853K05522K18742K33254
61726E714589K50709K70793K92444L15450L39934L65772L93708M25820M63626
$$ y = [5551799, 5287755, 5048069, 4829739, 4630804, 4448890, 4281080, 4125727, 3983115, 3853641, 3736244, 3629219, 3531629, 3443215, 3363520, 3291792, 3227318, 3169403, 3117310, 3070392, 3027868, 2988571, 2951661, 2917537, 2887098, 2859975, 2834543, 2810034, 2787618, 2768862, 2753975, 2742199, 2733170, 2727165, 2724443, 2724915, 2728179, 2733617, 2740699, 2749224, 2758848, 2768708, 2778332, 2788707, 2801299, 2815994, 2831310, 2846850, 2864201, 2884949, 2909206, 2936848, 2968823, 3006124, 3048377, 3094532, 3144409, 3198804, 3258723, 3325087, 3398405, 3478068, 3562862, 3652907, 3750187, 3856407, 3971365, 4094361, 4226162, 4368403, 4521949, 4687201, 4865218, 5057071, 5262593, 5481335, 5714589, 5965298, 6236091, 6528535, 6843985, 7183919, 7549691, 7943399, 8369219, 8832845]
61717H832845N06677N54071O06425O65184P30838Q02764Q80098R61868J046911
61708A5587681J134293J222894J309790J389877J457395J506184J527208J507341
61700B6642663J432667J293298J085456Q12026M84437J23768k42926n89462q95113
61691C0146814j145701j334142j461086j533128j558764j545962j502707j437593
61683A8627731j358495j271155j179588j087021r95975r08240q25613p49943o81868
61674I569833o19996n62480n09239m61825m20979l85188l52166l21115k92810
61665E644035k67684k44902k23594k04202j87683j73735j60803j47984j35995
61656C897453j25828j17204j09057j01106r4000q7940q1980p5233o8294o2832
$$ y = [8832845, 9339522, 9893593, 10500018, 11165202, 11896040, 12698804, 13578902, 14540770, 15587681, 16721974, 17944868, 19254658, 20644535, 22101930, 23608114, 25135322, 26642663, 28075330, 29368628, 30454084, 31266110, 31750547, 31874315, 31631389, 31041927, 30146814, 29001113, 27666971, 26205885, 24672757, 23113993, 21568031, 20065324, 18627731, 17269236, 15998081, 14818493, 13731472, 12735497, 11827257, 11001644, 10251701, 9569833, 8949837, 8387357, 7878118, 7416293, 6995314, 6610126, 6257960, 5936845, 5644035, 5376351, 5131449, 4907855, 4703653, 4515970, 4342235, 4181432, 4033448, 3897453, 3771625, 3654421, 3545364, 3444258, 3350258, 3262318, 3180338, 3105105, 3036811, 2973979]
61646B973979n9626n7525n4688n0752m7147m5234m4732m4315m3252m1811m0378
61635B444519l8954l7515l6291l5462l5013l4949l5229l5543l5472l4893l3899
61624B051299l2477l0783k9514k9288k9551k8754k5870k1455j7203j4796j4843
61613A776765j6294j7002j5652j3040j0845r370p580n363m303n518p791q815p766
61600A647426n888m760m752n090m961m358l889l842l706k898j634n89q8k67j596
61585A599108m060o109n790l252r42q43k463l911l887k203M65K643K903J414m8
61570A573025j96N77J422K325L415M231M601N111N762N403L699K374K928M214
61556A618891M106K664J545Q45r57l837n505m694l073k807l829m819n548o554
$$ y = [2973979, 2914353, 2856828, 2802140, 2751388, 2704241, 2659007, 2614275, 2569960, 2526708, 2484897, 2444519, 2405565, 2368050, 2331759, 2296297, 2261284, 2226335, 2191106, 2155563, 2120091, 2085198, 2051299, 2018822, 1988039, 1958525, 1929237, 1899686, 1870932, 1845062, 1823607, 1806404, 1791608, 1776765, 1760471, 1743469, 1727817, 1714777, 1703932, 1694562, 1686982, 1681619, 1677316, 1671798, 1664007, 1655192, 1647426, 1641538, 1636778, 1632026, 1626936, 1621975, 1617617, 1613728, 1609886, 1606180, 1603282, 1601648, 1601059, 1600971, 1600704, 1599108, 1595048, 1588939, 1583149, 1579897, 1578955, 1578112, 1575649, 1571738, 1567851, 1565648, 1566113, 1568756, 1571659, 1573073, 1573025, 1572829, 1573406, 1574828, 1577153, 1580568, 1584799, 1589400, 1594511, 1600273, 1605676, 1609375, 1611749, 1614677, 1618891, 1622997, 1625661, 1627206, 1628051, 1627094, 1623257, 1617752, 1613058, 1609985, 1607178, 1603349, 1598530, 1592982, 1586428]
61542A586428p326o642m656l302m127o478q304q358p179o056n499n005m093k983
61528A506420k028j042K72J639K623L520N027P197R495J1846J4672J7789K0353
61515A597783K2249K4540K7871L1354L3867L5704L7888M0392M2302M3542M5160
61504A982652M7583M9703N0297M9574M8654M8039M7341M6212M4786M3229M1456
61493B499526L9503L7563L5451L2534K8564K4282K0677J7719J4379J0045N426
61482B765669J655j336m875r724j4655j7542j7866j7363j7670j8029j6320j2123
61470B619821p612m964l874k294J118O094J1717J7119K1595K5132K9059L5099
61458B748010M3477N2590O0921O8598P6771Q6116R6532J07840J20084J33272J47190
$$ y = [1586428, 1579102, 1572460, 1567804, 1564502, 1560375, 1553897, 1545593, 1537235, 1530056, 1524000, 1518501, 1513496, 1509403, 1506420, 1504392, 1503350, 1503622, 1505261, 1507884, 1511404, 1516431, 1523628, 1533123, 1544969, 1559641, 1577430, 1597783, 1620032, 1644572, 1672443, 1703797, 1737664, 1773368, 1811256, 1851648, 1893950, 1937492, 1982652, 2030235, 2079938, 2130235, 2179809, 2228463, 2276502, 2323843, 2370055, 2414841, 2458070, 2499526, 2539029, 2576592, 2612043, 2644577, 2673141, 2697423, 2718100, 2735819, 2750198, 2760243, 2765669, 2767324, 2765988, 2761113, 2751389, 2736734, 2719192, 2701326, 2683963, 2666293, 2648264, 2631944, 2619821, 2612209, 2607245, 2603371, 2601077, 2602195, 2608289, 2620006, 2637125, 2658720, 2683852, 2712911, 2748010, 2791487, 2844077, 2904998, 2973596, 3050367, 3136483, 3233015, 3340855, 3460939, 3594211, 3741401]
61447C741401J61575J76353J91835K08579K26731K45462K63552K80482K96308
61438E792278L10275L20154L23399L18335L03866K78919K43081J97557J44820
61429H232684Q7632K9081k6960p6883j19243j54706j83813k05693k19498k26134
61419G136467k27430k24142k15992k03587j88862j73269j56674j38855j20928
61410E486728j04071q7627p0098n1832l4984k0459o629Q065K2699L5276M5495
61399E222563N4652O3351P0888P6728Q1243Q4923Q7806Q9802R0736R0141Q7829
61388F100662Q4546Q1226P7831P3877O9825O6568O3834O0556N6960N4508N3235
61377F843628N0834M5515L8526L2643K8887K5878K1932J6714J1063N932J543k779
$$ y = [3741401, 3902976, 4079329, 4271164, 4479743, 4706474, 4951936, 5215488, 5495970, 5792278, 6102553, 6422707, 6746106, 7064441, 7368307, 7647226, 7890307, 8087864, 8232684, 8320316, 8349397, 8322437, 8245554, 8126311, 7971605, 7787792, 7582099, 7362601, 7136467, 6909037, 6684895, 6468903, 6265316, 6076454, 5903185, 5746511, 5607656, 5486728, 5382657, 5295030, 5224932, 5173100, 5138116, 5117657, 5111028, 5119093, 5141792, 5177068, 5222563, 5277215, 5340566, 5411454, 5488182, 5569425, 5654348, 5742154, 5831956, 5922692, 6012833, 6100662, 6185208, 6266434, 6344265, 6418142, 6487967, 6554535, 6618369, 6678925, 6735885, 6790393, 6843628, 6894462, 6939977, 6978503, 7011146, 7040033, 7065911, 7087843, 7104557, 7115620, 7121552, 7123095, 7120316]
61365G120316p704j2832j7129k0382k3392k6461k8855l0184l1145l2058l1879
61354F858295k9769k6675k4076k1888j9063j5849j3841j3789j4697j5377j5858
61343F647413j6946j9161k2410k6141k9397l1192l0933k8284k2884j4786n004
61332F400275N273J6199K9294M5572O4199Q3527J03076J23891J46957J71796J96805
61321G386864K20736K43555K65962K88326L09866L28524L41634L47217L44709
61312A0077393L34042L14079K82992K40547J89183J32199P1971J0752m8163j01934
61302A1503061j50249j94114k32988k65143k90667l11771l29505l42222l48100
61293I038302l47442l41564l31297l17753l02864k87683k71364k53179k34364
$$ y = [7120316, 7112612, 7099780, 7082651, 7062269, 7038877, 7012416, 6983561, 6953377, 6922232, 6890174, 6858295, 6828526, 6801851, 6777775, 6755887, 6736824, 6720975, 6707134, 6693345, 6678648, 6663271, 6647413, 6630467, 6611306, 6588896, 6562755, 6533358, 6502166, 6471233, 6442949, 6420065, 6405279, 6400275, 6405548, 6421747, 6451041, 6496613, 6560812, 6644339, 6747415, 6871306, 7018263, 7190059, 7386864, 7607600, 7851155, 8117117, 8405443, 8715309, 9043833, 9385467, 9732684, 10077393, 10411435, 10725514, 11008506, 11249053, 11438236, 11570435, 11642406, 11653158, 11604995, 11503061, 11352812, 11158698, 10925710, 10660567, 10369900, 10058129, 9728624, 9386402, 9038302, 8690860, 8349296, 8017999, 7700246, 7397382, 7109699, 6838335, 6585156, 6350792]
61284F350792k16543j99458j81774j63219j44519j25991j07590q9788p3122n7482
61274D991306m2804k9615j7743n615P824K1318L2804M1850M9276N5439O0470O5156
61262E229666O9735P2640P2398P0014O7530O4959O0892N5421N0056M5033L9296
61251E897640L3087K7869K3458J7850J0556L557j967p556j4826k2992l0403l6818
61239E899455m2690m7729n1686n5500o0053o4616o7807o9425p0216p0515p0235
61228E228983o9603o8825o7359o4480o0318n5731n1378m7419m3742m0041l6127
61217D623960l2518l0180k9382k9353k9396k9644l0384l1308l1954l2305l2418
61206D285118l1852k9864k5905j9896j2564n350Q47O952J4758K4534L4623M3714
$$ y = [6350792, 6134249, 5934791, 5753017, 5589798, 5445279, 5319288, 5211698, 5121910, 5048788, 4991306, 4948502, 4918887, 4901144, 4895529, 4903353, 4924671, 4957475, 4999325, 5048601, 5104040, 5164510, 5229666, 5299401, 5372041, 5444439, 5514453, 5581983, 5646942, 5707834, 5763255, 5813311, 5858344, 5897640, 5930727, 5958596, 5982054, 5999904, 6010460, 6014017, 6012050, 6004494, 5989668, 5966676, 5936273, 5899455, 5856765, 5809036, 5757350, 5701850, 5641797, 5577181, 5509374, 5439949, 5369733, 5299218, 5228983, 5159380, 5090555, 5023196, 4958716, 4898398, 4842667, 4791289, 4743870, 4700128, 4660087, 4623960, 4591442, 4561262, 4531880, 4502527, 4473131, 4443487, 4413103, 4381795, 4349841, 4317536, 4285118, 4253266, 4223402, 4197497, 4177601, 4165037, 4159687, 4160534, 4167486, 4182244, 4206778, 4241401, 4285115]
61194D285115N2524O2597P4401Q7114R9606J10977J20838J29529J37503J44151
61184E304355J47744J46751J40517J28572J10308Q5767N5848K1506j6376n5990
61174F069002r4446j29056j58003j79828j93666k00389k02103k00028j94214j85599
61164D331670j76435j67642j57678j45435j32694j21855j12530j02357r0491p8432
61154C046121o8055o0366n5636n2828m9333m3155l5328k8591k3805j9416j4339
61143B595269r377n289j352L209P750J1095J2940J3562J3066J1825J0820J0528
61131B674046R898P455L243j168m571p283j0262j3619j6529j8382j9555k0810
61119B582463k2216k3126k3290k3516k4875k7347k9704l0747l0505l0040l0152
$$ y = [4285115, 4337639, 4400236, 4474637, 4561751, 4661357, 4772334, 4893172, 5022701, 5160204, 5304355, 5452099, 5598850, 5739367, 5867939, 5978247, 6064014, 6119862, 6141368, 6124992, 6069002, 5974556, 5845500, 5687497, 5507669, 5314003, 5113614, 4911511, 4711483, 4517269, 4331670, 4155235, 3987593, 3829915, 3684480, 3551786, 3429931, 3317401, 3215044, 3124553, 3046121, 2978066, 2917700, 2862064, 2809236, 2759903, 2716748, 2681420, 2652829, 2629024, 2609608, 2595269, 2585892, 2580603, 2579251, 2582460, 2590210, 2601305, 2614245, 2627807, 2640873, 2652698, 2663518, 2674046, 2683944, 2691399, 2694642, 2693474, 2688903, 2681620, 2671358, 2657739, 2641210, 2622828, 2603273, 2582463, 2560247, 2537121, 2513831, 2490315, 2465440, 2438093, 2408389, 2377642, 2347137, 2317097, 2286945]
61108B286945l0578l0701l0888l2320l5135l7526l7706l6308l5594l6448l7559
61097A906182l7667l7058l6173l4463l1828k9858l0020l1404l1837l0815k9820
61086A545239l0019l1114l2374l3330l3249l1302k7717k3901k1022j9201j8044
61075A243966j7042j5347j2395r047p029o706o354m252n41L491P046R838J1382
61062A197010J1512J1110J1158J1288J0416Q782Q042Q995J0332J0484R842J0017
61050A318988J1288J2123J1459J0342J0428J1532J1677R555O023K942J157P2j299
61037A416287l362n742p451p299m778r00K119K440K04k542l672k886j686j490
61023A379242k129k524k390k587l684m930n038l692j914j084j754l267m401m580
$$ y = [2286945, 2256367, 2225666, 2194778, 2162458, 2127323, 2089797, 2052091, 2015783, 1980189, 1943741, 1906182, 1868515, 1831457, 1795284, 1760821, 1728993, 1699135, 1669115, 1637711, 1605874, 1575059, 1545239, 1515220, 1484106, 1451732, 1418402, 1385153, 1353851, 1326134, 1302233, 1281211, 1262010, 1243966, 1226924, 1211577, 1199182, 1190135, 1183106, 1176400, 1170046, 1165794, 1165253, 1168744, 1175790, 1185628, 1197010, 1208522, 1219632, 1230790, 1242078, 1252494, 1261276, 1269318, 1278313, 1288645, 1299129, 1308971, 1318988, 1330276, 1342399, 1353858, 1364200, 1374628, 1386160, 1397837, 1407392, 1413415, 1416357, 1417514, 1417586, 1416287, 1412925, 1407183, 1399732, 1392433, 1387655, 1386755, 1388874, 1391314, 1391518, 1388976, 1385304, 1382418, 1380732, 1379242, 1377113, 1374589, 1372199, 1369612, 1365928, 1360998, 1355960, 1352268, 1350354, 1349270, 1347516, 1344249, 1339848, 1335268]
61009A335268m412m861n894o453n783m292k999k527k824l316l134j738K91J626
60995A288952J755J663K435L674M093L409K875L877O545R932J2994J5296J7077
60982A374577J8841K0705K2228K3127K4032K5978K8894L1241L1748L1270L2144
60971A664785L5475L9843M3198M5393M7935N1571N5476N8975O2739O7431P2320
60960B245141P6354P9963Q4424Q9873R5249J00184J05609J12286J19831J27548
60950C236462J35247J42955J50655J58802J68256J79263J91129K03370K16732
60941D782871K32571K51516K73098K96610L22174L50875L83683M20787M63118
60932G777303N14372N79372O59390P51218Q52609R66562J097966J248780J420137
$$ y = [1335268, 1330856, 1325995, 1320101, 1313648, 1307865, 1303573, 1300574, 1298047, 1295223, 1291907, 1288773, 1287035, 1287326, 1288952, 1290707, 1292370, 1294805, 1298479, 1302572, 1305981, 1308856, 1312733, 1319278, 1329210, 1342204, 1357500, 1374577, 1393418, 1414123, 1436351, 1459478, 1483510, 1509488, 1538382, 1569623, 1601371, 1632641, 1664785, 1700260, 1740103, 1783301, 1828694, 1876629, 1928200, 1983676, 2042651, 2105390, 2172821, 2245141, 2321495, 2401458, 2485882, 2575755, 2671004, 2771188, 2876797, 2989083, 3108914, 3236462, 3371709, 3514664, 3665319, 3824121, 3992377, 4171640, 4362769, 4566139, 4782871, 5015442, 5266958, 5540056, 5836666, 6158840, 6509715, 6893398, 7314185, 7777303, 8291675, 8871047, 9530437, 10281655, 11134264, 12100826, 13198792, 14447572, 15867709]
60923A5867709J616009J839008K085590K353261K645555K944786L165692L159393
60915C5677003K808095K140672J345235O50295J88989k8849m8643P6171K53975
60906D3062943L23432J14382m28344j185842j940094k511988k839461k954994
60898C1640034k920972k790164k600967k381788k151690j922182j701439j495566
60890A3675266j307141j136225r83338q49698p35121o37843n56121m88270m31856
60881F549653l84684l45854l14073k86116k59301k34505k14085j97512j82106
60872D131417j67635j56862j50963j47551j44082j40347j36513j31459j24756
60863B831249j18043j12597j07326j00881r4205q8999q4908q0222p4616o9386
$$ y = [15867709, 17483718, 19322726, 21408316, 23761577, 26407132, 29351918, 32517610, 35677003, 38485098, 40625770, 41971005, 42621300, 42810289, 42781440, 42732797, 42808968, 43062943, 43386375, 43500757, 43072413, 41886571, 39946477, 37434489, 34595028, 31640034, 28719062, 25928898, 23327931, 20946143, 18794453, 16872271, 15170832, 13675266, 12368125, 11231900, 10248562, 9398864, 8663743, 8025900, 7469779, 6981509, 6549653, 6164969, 5819115, 5505042, 5218926, 4959625, 4725120, 4511035, 4313523, 4131417, 3963782, 3806920, 3655957, 3508406, 3364324, 3223977, 3087464, 2956005, 2831249, 2713206, 2600609, 2493283, 2392402, 2298197, 2209198, 2124290, 2044068, 1969452, 1900066]
60853A900066o5391o2265n9432n6575n3243m9141m4879m1602l9715l8501l6948
60842A352374l4633l1872k9293k7124k4955k2532k0520j9694j9553j8787j7145
60831A086266j5567j4345j2619j0274q622q258p659n348k215q8J069K717M958
60818A010015O153N461M140L756M412N320O061O508O352N608N217O223Q321J0002
60804A093549J0214R430Q653P943O647M917L942M235M531L295Q05j211j818j543
60790A153589r05N21L057N879P756Q122P079N147L504L681N961Q602R502Q429
60776A229924O871N911N122L646J537k72r63m55P60K184L728N534P445Q850R287
60761A289109R135R421J0781J2613J3525J2826J1435J0973J1924J3218J3731J3378
$$ y = [1900066, 1834675, 1772410, 1712978, 1656403, 1603160, 1554019, 1509140, 1467538, 1427823, 1389322, 1352374, 1317741, 1285869, 1256576, 1229452, 1204497, 1181965, 1161445, 1141751, 1122198, 1103411, 1086266, 1070699, 1056354, 1043735, 1033461, 1024839, 1016581, 1008922, 1003574, 1001359, 1001271, 1002340, 1005057, 1010015, 1016168, 1021629, 1025769, 1029525, 1033937, 1039257, 1045318, 1051826, 1058178, 1063786, 1069003, 1075226, 1083547, 1093549, 1103763, 1113193, 1121846, 1129789, 1136436, 1141353, 1145295, 1149530, 1154061, 1157356, 1158161, 1156950, 1155132, 1153589, 1152684, 1153205, 1156262, 1162141, 1169897, 1178019, 1185098, 1190245, 1193749, 1197430, 1203391, 1211993, 1221495, 1229924, 1236795, 1242706, 1247828, 1251474, 1253011, 1252739, 1251776, 1251321, 1252081, 1254265, 1257993, 1263527, 1270972, 1279822, 1289109, 1298244, 1307665, 1318446, 1331059, 1344584, 1357410, 1368845, 1379818, 1391742, 1404960, 1418691, 1432069]
60749A432069J2413J0567P804N190L781L057J709k64j823l096n545r380j2534
60736A443948j3323j2739j2781j3601j3822j3035j2432j3055j4661j6241j6724
60725A291534j5311j2294r438q422q707q104n682k881j212j87J450L514M942N899
60711A235101P680J0504J3030J4573J6117J8285J9771J9317J8236J8940K1440
60700A412994K3272K3022K1790K0729J9232J6715J4359J3436J3196J2228J0898
60689A601871J0530J0877J0423R043Q310R009J0071J0235R313P428M583J443p46
60676A702390j710k504l865n282o143o572o606n768m324l846n516q587j1264j2545
60662A617858j2494j1478j0018q890q560q740q954r054q798p573n175k514q54
$$ y = [1432069, 1444482, 1455049, 1462853, 1468043, 1471824, 1474881, 1476590, 1476326, 1474503, 1471407, 1465862, 1456482, 1443948, 1430625, 1417886, 1405105, 1391504, 1377682, 1364647, 1352215, 1339160, 1324499, 1308258, 1291534, 1276223, 1263929, 1254491, 1246069, 1237362, 1229258, 1223576, 1220695, 1219483, 1219296, 1220746, 1224260, 1229202, 1235101, 1242781, 1253285, 1266315, 1280888, 1297005, 1315290, 1335061, 1354378, 1372614, 1391554, 1412994, 1436266, 1459288, 1481078, 1501807, 1521039, 1537754, 1552113, 1565549, 1578745, 1590973, 1601871, 1612401, 1623278, 1633701, 1642744, 1651054, 1660063, 1670134, 1680369, 1689682, 1697110, 1701693, 1703136, 1702390, 1700680, 1698176, 1694311, 1689029, 1682886, 1676314, 1669708, 1663940, 1659616, 1655770, 1650254, 1641667, 1630403, 1617858, 1605364, 1593886, 1583868, 1574978, 1566418, 1557678, 1548724, 1539670, 1530872, 1523299, 1518124, 1515610, 1514756]
60649A514756n96j107j457j140m80n17j956m077n312n050m260m114m817n955p100
60634A466818p599o658m275j587K29Q86O16l51j479j898j265k92m2j001k876m734
60618A434492n491n062m928o471q948j0439j0804j1932j4686j7477j8703j8817
60606A300734j8730j7844j5264j1791r086p542o472n621n167m736l749k450j548
60593A190734j214j255j603j826j081N04J445R99N35J281J982P65j529k336j273
60578A186128o55j850l415l626k821k163j549j35J935L515L924L671L892N455
60564A192306Q337J1532J3754J4499J4395J4540J5587J7359J9191K0771K2533
60553A364804K4899K7314K8916L0098L2152L4999L6696L5963L3765L1282K7787
$$ y = [1514756, 1514160, 1513053, 1511596, 1510456, 1509976, 1509459, 1507503, 1503426, 1498114, 1493064, 1488804, 1484690, 1479873, 1473918, 1466818, 1459219, 1452561, 1448286, 1446699, 1446928, 1447814, 1448430, 1448079, 1446600, 1444702, 1443437, 1443145, 1443103, 1442102, 1439226, 1434492, 1429001, 1423939, 1419011, 1412540, 1403592, 1393153, 1382349, 1370417, 1355731, 1338254, 1319551, 1300734, 1282004, 1264160, 1248896, 1237105, 1228019, 1220477, 1214005, 1208384, 1203217, 1198481, 1194732, 1192282, 1190734, 1189520, 1188265, 1186662, 1184836, 1183755, 1184259, 1185704, 1186703, 1187238, 1188519, 1190501, 1191266, 1189737, 1187401, 1186128, 1185473, 1183623, 1180208, 1176582, 1173761, 1171598, 1170049, 1169914, 1171849, 1175364, 1179288, 1182959, 1186851, 1192306, 1200643, 1212175, 1225929, 1240428, 1254823, 1269363, 1284950, 1302309, 1321500, 1342271, 1364804, 1389703, 1417017, 1445933, 1476031, 1508183, 1543182, 1579878, 1615841, 1649606, 1680888, 1708675]
60542A708675K2216J5647J0152N902J454l559q124j2053j6124j9935k1810k1497
60530A660944k0895k1267k1512k0336j8450j7262j6515j4784j1823r094q118r035
60518A471853j0620j1198r818p042m520l513m012n188o134o200n230l813k772
60505A391793k219j462J04K355M673O289O693O336O674Q750J1920J4813J7279
60492A473998K0282K3996K7332K9623L1557L4021L6971L9882M2454M4550M6227
60481A850893M8106N0732N3334N4224N2808N0007M6183L9938K9919J7018L763
60470B296925p866j7180k4033k8329l0227l0180k8734k6468k3751k0353j5716
60459B044088r834l417K900Q912J4378J8926K2733K6429L0100L3181L5710L8671
$$ y = [1708675, 1730891, 1746538, 1756690, 1762592, 1764046, 1760487, 1752363, 1740310, 1724186, 1704251, 1682441, 1660944, 1640049, 1618782, 1597270, 1576934, 1558484, 1541222, 1524707, 1509923, 1498100, 1489006, 1480888, 1471853, 1461233, 1450035, 1440217, 1433175, 1428655, 1425142, 1421130, 1415942, 1409808, 1403608, 1398378, 1394565, 1391793, 1389574, 1388112, 1388216, 1390571, 1395244, 1401533, 1408226, 1414562, 1421236, 1429986, 1441906, 1456719, 1473998, 1494280, 1518276, 1545608, 1575231, 1606788, 1640809, 1677780, 1717662, 1760116, 1804666, 1850893, 1898999, 1949731, 2003065, 2057289, 2110097, 2160104, 2206287, 2246225, 2276144, 2293162, 2296925, 2289059, 2271879, 2247846, 2219517, 2189290, 2159110, 2130376, 2103908, 2080157, 2059804, 2044088, 2034254, 2030837, 2033737, 2042649, 2057027, 2075953, 2098686, 2125115, 2155215, 2188396, 2224106, 2262777]
60447B262777M2710M7371N2295N8283O6500P7258R0247J05108J21189J37638J54659
60436C216035J73858J96376K21298K46771K71901K96540L20069L41987L63326
60427E648161L85604M07760M24768M29372M14637L75725L11212K23774J19043
60418H740056L661j14933k27326l23000l94327m39873m63289m69341m61440m42259
60408E407929m15161l84060l51965l20121k88712k58267k30102k05336j83830
60399B770375j64375j45933j28492j12846r9818q9594q1536p4626o8311o2823
60389A742021n8443n4746n1016m7206m3789m0682l7115l2976k9463k7703k7114
60378A291768k6013k3651k0846j8570j6802j5142j3684j2694j1975j1176j0471
$$ y = [2262777, 2305487, 2352858, 2405153, 2463436, 2529936, 2607194, 2697441, 2802549, 2923738, 3061376, 3216035, 3389893, 3586269, 3807567, 4054338, 4326239, 4622779, 4942848, 5284835, 5648161, 6033765, 6441525, 6866293, 7295665, 7710302, 8086027, 8397239, 8621013, 8740056, 8743717, 8628784, 8401458, 8078458, 7684131, 7244258, 6780969, 6311628, 5850188, 5407929, 4992768, 4608708, 4256743, 3936622, 3647910, 3389643, 3159541, 2954205, 2770375, 2606000, 2460067, 2331575, 2218729, 2118911, 2029317, 1947781, 1873155, 1804844, 1742021, 1683578, 1628832, 1577816, 1530610, 1486821, 1446139, 1409024, 1376048, 1346585, 1318882, 1291768, 1265755, 1242104, 1221258, 1202688, 1185886, 1170744, 1157060, 1144366, 1132391, 1121215, 1110744]
60367A110744j0253j0435j0615j0687j0597r845q052n874m375l517k344q25j17
60354A023208n17m66J363L995N407N212M768N051N791O555P382Q041P846O777
60340A090413O048O968R439J1883J2588J1167Q836P199O660O404O046O412Q088
60327A198151R935J0160Q496O275M665L750L151K419J033r49k390k354j721k172
60313A238449l647m295l204j591q30q12q58p97k94J453M114N658M771K955K670
60298A243742M065N212N189N233O644R061J1322J2936J3994J4408J4103J3633
60286A359542J3826J4670J4928J3154R174M451Q59q54j376j712k129k211j662
60273A420660q23l55m50m50M02J773K417J893J445K354L951M431L298J684K25
$$ y = [1110744, 1100491, 1090056, 1079441, 1068754, 1058157, 1048312, 1040260, 1034386, 1030011, 1026494, 1024150, 1023325, 1023208, 1022691, 1022225, 1023588, 1027583, 1032990, 1038202, 1042970, 1048021, 1053812, 1060367, 1067749, 1075790, 1083636, 1090413, 1096461, 1103429, 1112868, 1124751, 1137339, 1148506, 1157342, 1164541, 1171201, 1177605, 1183651, 1190063, 1198151, 1208086, 1218246, 1226742, 1233017, 1237682, 1241432, 1244583, 1247002, 1248035, 1247086, 1244696, 1242342, 1240621, 1238449, 1234802, 1230507, 1227303, 1225712, 1224882, 1224070, 1223212, 1222415, 1222121, 1223574, 1227688, 1233346, 1238117, 1241072, 1243742, 1247807, 1253019, 1258208, 1263441, 1270085, 1279146, 1290468, 1303404, 1317398, 1331806, 1345909, 1359542, 1373368, 1388038, 1402966, 1416120, 1425294, 1429745, 1430604, 1429750, 1428374, 1426662, 1424533, 1422322, 1420660, 1419837, 1419482, 1419032, 1418582, 1418984, 1420757, 1423174, 1425067, 1426512, 1428866, 1432817, 1437248, 1440546, 1442230, 1442455]
60258A442455j804m775p486q581q169p206o073m757l717l432l470k986j988j308
60244A376703j296j191l3K106L877L717J475j008j593j48J370J303o1j447k219
60229A381555k416k032j162k99K60Q73J910L151M413O048Q191J0217J1693J3193
60215A435595J5263J7317J8462J8755J8633J7885J6466J5516J5980J6766J6180
60204A622818J4927J5577J8865K2593K4909K6712K9697L3695L7399M0443M3260
60193A930895M5774M7954N1018N6367O3401P0044P5595Q1647Q9647R8777J07008
60182B718127J13564J19511J26450J35089J44803J54040J61401J66690J70627
60173D010302J73453J74271J72199J67440J60528J51123J38511J23049J06014
$$ y = [1442455, 1440651, 1435876, 1428390, 1419809, 1411640, 1404434, 1398361, 1393604, 1389887, 1386455, 1382985, 1379999, 1378011, 1376703, 1375407, 1374216, 1374183, 1376289, 1380166, 1383883, 1385358, 1384350, 1382757, 1382609, 1383979, 1385282, 1385221, 1383774, 1381555, 1379139, 1377107, 1375945, 1375646, 1375906, 1376779, 1378689, 1381840, 1386253, 1392301, 1400492, 1410709, 1422402, 1435595, 1450858, 1468175, 1486637, 1505392, 1524025, 1541910, 1558376, 1573892, 1589872, 1606638, 1622818, 1637745, 1653322, 1672187, 1694780, 1719689, 1746401, 1776098, 1809793, 1847192, 1887635, 1930895, 1976669, 2024623, 2075641, 2132008, 2195409, 2265453, 2341048, 2422695, 2512342, 2611119, 2718127, 2831691, 2951202, 3077652, 3212741, 3357544, 3511584, 3672985, 3839675, 4010302, 4183755, 4358026, 4530225, 4697665, 4858193, 5009316, 5147827, 5270876, 5376890]
60164E376890Q8081O9086M9565L1254J5319J059j2678k5495l5821m2837m6778
60153E467645m7490m4033l6204k5593j4356l221Q752K2613L8075N3779O8750Q3391
60141E572108R8776J15055J30908J44638J55359J62916J67225J68090J65331J58644
60131G039050J47716J32826J14890R4513P1628M6693K1397k724k5724m8200o9355
60120G522710q7437j01741j12708j20160j23005j20904j14885j05878r3922p9108
60110F462962o2145m3418k2732n97K1324M1612O0073P6751R1027J02216J10188
60099F837261J14692J15085J11410J04828R6194Q5119P1306N6048M1518K9052
60089G662513J8803J0547M223K53l03L432J0918K0874L3512N0653P2792R7579
$$ y = [5376890, 5464971, 5534057, 5583622, 5614876, 5630195, 5631254, 5618576, 5593081, 5557260, 5514423, 5467645, 5420155, 5376122, 5339918, 5314325, 5299969, 5296748, 5305500, 5328113, 5366188, 5419967, 5488717, 5572108, 5670884, 5785939, 5916847, 6061485, 6216844, 6379760, 6546985, 6715075, 6880406, 7039050, 7186766, 7319592, 7434482, 7528995, 7600623, 7647316, 7668713, 7665989, 7640265, 7592065, 7522710, 7435273, 7333532, 7220824, 7100664, 6977659, 6856755, 6741870, 6635992, 6542070, 6462962, 6400817, 6357399, 6334667, 6334070, 6355394, 6397006, 6457079, 6533830, 6624857, 6727073, 6837261, 6951953, 7067038, 7178448, 7283276, 7379470, 7464589, 7535895, 7591943, 7633461, 7662513, 7681316, 7691863, 7696086, 7696339, 7696036, 7699468, 7710386, 7731260, 7764772, 7815425, 7888217, 7985796]
60077G985796J22366J47063J73067K00627K28915K57830K87793L18286L48445
60068A0070188L78665M09859M41080M69661M93762N13297N28032N36369N36526
60059A4377439N27896N10722M85260M51461M08813L56592K95310K27735J57191
60050A7798419Q4800R713o7640j44042k15849k81435l40306l90806m30046m55778
60040A5567030m67673m67059m56079m36784m10372l77358l38731k96524k52723
60031A2063727k08024j62362j16547p2684l2773K622L3937O1022Q2369R6106J01491
60020A1848884R9185R0252P5459N5552L1726N356k2386n0377p7445j02826j26481
60009A1826899j48675j69540j89256k07947k24788k37891k45862k49191k49208
$$ y = [7985796, 8108162, 8255225, 8428292, 8628919, 8857834, 9115664, 9403457, 9721743, 10070188, 10448853, 10858712, 11299792, 11769453, 12263215, 12776512, 13304544, 13840913, 14377439, 14905335, 15416057, 15901317, 16352778, 16761591, 17118183, 17413493, 17641228, 17798419, 17883219, 17892932, 17825292, 17681250, 17465401, 17183966, 16843660, 16452854, 16022808, 15567030, 15099357, 14632298, 14176219, 13739435, 13329063, 12951705, 12612974, 12316450, 12063727, 11855703, 11693341, 11576794, 11504110, 11471337, 11473959, 11507896, 11568918, 11651287, 11747393, 11848884, 11948069, 12038321, 12113780, 12169332, 12201058, 12206414, 12184028, 12133651, 12056206, 11953380, 11826899, 11678224, 11508684, 11319428, 11111481, 10886693, 10648802, 10402940, 10153749, 9904541]
60000I904541k46100k39042k28081k14575j99445j82109j61781j39036j15270
59991H179102r1111o6136m0025j3426J2435L6710N9455Q1370J03029J24168J43545
59980H529116J59383J69979J74239J71927J63515J49641J30781J07382Q0178N0108
59970I886249J7985j5517m9426q2172j11939j37574j59070j76936j90958k00012
59960H780630k03263k01089j94379j83465j68514j50554j31084j10662q8760o5084
59950G283776m0172j4654J1264L7402O3525Q9771J16237J42238J66912J90396
59940H046695K12997K33267K48470K57307K60463K57976K48136K29931K04783
59931A0200025J74721J40619J03594O6050K9256q441m8600q8967j25181j55194
$$ y = [9904541, 9658441, 9419399, 9191318, 8976743, 8777298, 8595189, 8433408, 8294372, 8179102, 8087991, 8021855, 7981830, 7968404, 7980839, 8017549, 8077004, 8158374, 8261403, 8385571, 8529116, 8688499, 8858478, 9032717, 9204644, 9368159, 9517800, 9648581, 9755963, 9836141, 9886249, 9904234, 9888717, 9839291, 9757119, 9645180, 9507606, 9348536, 9171600, 8980642, 8780630, 8577367, 8376278, 8181899, 7998434, 7829920, 7679366, 7548282, 7437620, 7348860, 7283776, 7243604, 7228950, 7240214, 7277616, 7341141, 7430912, 7547149, 7689387, 7856299, 8046695, 8259692, 8492959, 8741429, 8998736, 9259199, 9517175, 9765311, 9995242, 10200025, 10374746, 10515365, 10618959, 10685009, 10714265, 10705824, 10657224, 10568257, 10443076, 10287882]
59921A0287882j79536j97885k08375k10422k05633j95402j79765j59192j35462
59912H616210j09999q2937n4569k6085J757K9266N6324Q1566J03736J22802J39111
59901H877182J52601J63322J71578J76900J78046J74583J67497J57723J45377
59892A0364809J31039J16511J03269R1221Q0028P0713O4901O3048O4565O9307
59882A1219411P8068R1821J11181J36304J66591K00674K37284K76049L16972L59261
59872A3193616M01172M41019M77721N10033N35259N49349N48771N32213M99780
59863A7688933M50656L82966K96704J95913Q6817k5256j35859k39543l30530m05641
59853A7965160m64801n08239n34981n44857n40373n25275n02067m71758m35177
$$ y = [10287882, 10108346, 9910461, 9702086, 9491664, 9286031, 9090629, 8910864, 8751672, 8616210, 8506211, 8423274, 8368705, 8342620, 8344377, 8373643, 8429967, 8511533, 8615269, 8738071, 8877182, 9029783, 9193105, 9364683, 9541583, 9719629, 9894212, 10061709, 10219432, 10364809, 10495848, 10612359, 10715628, 10806849, 10886877, 10957590, 11022491, 11085539, 11150104, 11219411, 11297479, 11389300, 11500481, 11636785, 11803376, 12004050, 12241334, 12517383, 12834355, 13193616, 13594788, 14035807, 14513528, 15023561, 15558820, 16108169, 16656940, 17189153, 17688933, 18139589, 18522555, 18819259, 19015172, 19101989, 19076733, 18940874, 18701331, 18370801, 17965160, 17500359, 16992120, 16457139, 15912282, 15371909, 14846634, 14344567, 13872809, 13437632]
59844A3437632l93569l48419l01328k53592k05419j56329j06776n8630j3550K8346
59834A1628366O7560J03692J35553J62200J82960J96771K02145J97632J82126
59825A3059005J55099J16997O9034J2651n0180j15973j80213k39510k92599l38685
59815A2195626l75924m02767m20061m30210m34216m30863m19188m00731l78662
59806H503004l55301l31215l06210k80361k54013k27653k02165j78597j57196
59797F210293j37058j17411r8904q2934o9935n9266n0604m4382m0671l8669l7561
59786E432898l6858l5807l3845l1896l1462l1841l0331k6444k3747k5533l0356
59775E094778l4408l6918m0270m5435n0469n3681n5463n6337n5730n3590n1249
$$ y = [13437632, 13044063, 12695644, 12394316, 12140724, 11935305, 11778976, 11672200, 11613570, 11600020, 11628366, 11695926, 11799618, 11935171, 12097371, 12280331, 12477102, 12679247, 12876879, 13059005, 13214104, 13331101, 13400135, 13412786, 13362606, 13246633, 13066420, 12826910, 12534311, 12195626, 11819702, 11416935, 10996874, 10566664, 10132448, 9701585, 9282397, 8881666, 8503004, 8147703, 7816488, 7510278, 7229917, 6975904, 6748251, 6546086, 6367489, 6210293, 6073235, 5955824, 5856920, 5773986, 5704051, 5644785, 5594181, 5549799, 5509128, 5470459, 5432898, 5396040, 5360233, 5326388, 5294492, 5263030, 5231189, 5200858, 5174414, 5150667, 5125134, 5094778, 5060370, 5023452, 4983182, 4937747, 4887278, 4833597, 4778134, 4721797, 4666067, 4612477, 4561228]
59764D561228m9487m7269m3208l7129k9705k1685j3884o723L22P696J4414J9346
59752D353916K3449K8770L5432M1934M8412N6769O7083P6636Q3454Q8144R1293
59741D995292R1915Q9986Q7613Q5621Q1585P3687O4379N7399N2844M8079M2389
59730E770789L7912L6610L8783M4116N1936O0825P0170Q1666R7355J16521J36636
59719F543319J57037J79417K04859K32665K62371K94584L29038L63749L97108
59710H964147M29371M60961M89961N11806N20417N08980M70985M02654L05728
59701A3065010J88425O3608n5121j57391k37877k95435l31197l47396l46867l32619
59691A1213140l07792k75954k40605k03881j66355j28418r1061n4877j9486J5165
$$ y = [4561228, 4511741, 4464472, 4421264, 4384135, 4354430, 4332745, 4318861, 4312138, 4312460, 4320156, 4334570, 4353916, 4377365, 4406135, 4441567, 4483501, 4531913, 4588682, 4655765, 4732401, 4815855, 4903999, 4995292, 5087207, 5177193, 5264806, 5350427, 5432012, 5505699, 5570078, 5627477, 5680321, 5728400, 5770789, 5808701, 5845311, 5884094, 5928210, 5980146, 6040971, 6111141, 6192807, 6290162, 6406683, 6543319, 6700356, 6879773, 7084632, 7317297, 7579668, 7874252, 8203290, 8567039, 8964147, 9393518, 9854479, 10344440, 10856246, 11376663, 11885643, 12356628, 12759282, 13065010, 13253435, 13317043, 13261922, 13104531, 12866654, 12571219, 12240022, 11892626, 11545759, 11213140, 10905348, 10629394, 10388789, 10184908, 10018553, 9890135, 9799074, 9744197, 9724711, 9739876]
59681I739876M7959P8188J07092J36558J66817J96750K26152K56228K87862L20550
59671A1564032L53485L86980M22472M61279N03480N48047N94343O43103O95102
59662A6172323P49106Q02610Q54764R06869R59213J009077J052931J088831J115165
59653B4710889J128883J127473J112021J086254J053166J014744R74545R37862
59645C3145837R08544Q87191Q72742Q64284Q60442Q58278Q53423Q40701Q14693
59636D0906135P71071P08193O27069N29820M19019K98705J75012N5102n4502j48847
59626D4286777k24636k79720l12439l21844l08842k76314k27176j62658q3129
59617D2090019R940J13884K26129L44437M66129N88335P08904Q25827R35500J032362
$$ y = [9739876, 9787835, 9866023, 9973115, 10109673, 10276490, 10473240, 10699392, 10955620, 11243482, 11564032, 11917517, 12304497, 12726969, 13188248, 13691728, 14239775, 14834118, 15477221, 16172323, 16921429, 17724039, 18578803, 19485672, 20444885, 21453962, 22506893, 23595724, 24710889, 25839772, 26967245, 28079266, 29165520, 30218686, 31233430, 32207975, 33145837, 34054381, 34941572, 35814314, 36678598, 37539040, 38397318, 39250741, 40091442, 40906135, 41677206, 42385399, 43012468, 43542288, 43961307, 44260012, 44435024, 44490126, 44435624, 44286777, 44062141, 43782421, 43469982, 43148138, 42839296, 42562982, 42335806, 42173148, 42090019, 42099959, 42213843, 42439972, 42784409, 43250538, 43838873, 44547777, 45373604, 46309104, 47341466]
59607D7341466J110150J162588J182955J164137J099729R84920Q17095N97347
59599E5460387L32276L4059k81404n96473q93232j155654j372249j537270j649816
59590D8340624j712348j729925j709494j658824j585699j497884j403353j310279
59582C5732818j226875j161088j119669j106263j119267j151092j190264j225458
59574B6432842j248306j253462j238091j202958j153058j094661j031240r63523
59566A7247543q93021q23078p55914o91279o29175n71657n20187m73220m28538
59557A1461474l86542l49043l15904k85210k56265k30137k07445j87580j70269
59548I073079j56312j46319j39790j35652j33130j32066j32862j35818j40206
$$ y = [47341466, 48451616, 49614204, 50797159, 51961296, 53061025, 54045945, 54863040, 55460387, 55792663, 55826722, 55545318, 54948845, 54055613, 52899959, 51527710, 49990440, 48340624, 46628276, 44898351, 43188857, 41530033, 39944334, 38446450, 37043097, 35732818, 34505943, 33344855, 32225186, 31118923, 29999656, 28848564, 27658300, 26432842, 25184536, 23931074, 22692983, 21490025, 20336967, 19242306, 18211066, 17247543, 16354522, 15531444, 14775530, 14084251, 13455076, 12883419, 12363232, 11890012, 11461474, 11074932, 10725889, 10409985, 10124775, 9868510, 9638373, 9430928, 9243348, 9073079, 8916767, 8770448, 8630658, 8495006, 8361876, 8229810, 8096948, 7961130, 7820924]
59539G820924j44600j48262j51248j53091j52842j50639j47424j42550j34094
59530F496174j22569j11626j03184r4488q2360o8168n5596m5405l5609k5474j5971
59519E735724p073K154J1375J9662K7634L6066M3342M7512N0059N4020N9070O2407
59507F141952O4245O7980P4440Q0397Q4079Q8070R5002J04076J13988J25921J40994
59496G181144J57332J72426J86603K01791K18478K36057K54825K75438K97278
59487I181372L18995L39900L59547L77004L91738M04283M14850M22052M24016
59478A2633757M19960M10067L94697L74185L48358L16297K78159K37293J98425
59469A5611198J63045J28783R4140O1487L4211J3165k388j2308j5984j3663n551
$$ y = [7820924, 7676324, 7528062, 7376814, 7223723, 7070881, 6920242, 6772818, 6630268, 6496174, 6373605, 6261979, 6158795, 6064307, 5981947, 5913779, 5858183, 5812778, 5777169, 5751695, 5735724, 5728651, 5730805, 5742180, 5761842, 5789476, 5825542, 5868884, 5916396, 5966455, 6020475, 6079545, 6141952, 6206197, 6274177, 6348617, 6429014, 6513093, 6601163, 6696165, 6800241, 6914229, 7040150, 7181144, 7338476, 7510902, 7697505, 7899296, 8117774, 8353831, 8608656, 8884094, 9181372, 9500367, 9840267, 10199814, 10576818, 10968556, 11372839, 11787689, 12209741, 12633757, 13053717, 13463784, 13858481, 14232666, 14581024, 14897321, 15175480, 15412773, 15611198, 15774243, 15903026, 15997166, 16058653, 16092864, 16106029, 16103641, 16091333, 16075349, 16061686, 16056135]
59458A6056135R194L0813N7341Q6110J15741J45170J71792J91937K02309J99910
59448A7266452J82082J48192J00302M0859k8980j07359j89684k70579l46871m16751
59438A6377663m77050n23757n55042n71986n76383n69448n52515n27421m95979
59429A1528082m60036m21910l83649l45843l08087k70480k33847j98709j64986
59420H740535j32689j02100p3174m5228j7374J0855L9155O6843R3909J21256J49150
59409H851138J75932J99756K21386K43325K65863K85709K99374L06152L06860
59400A1155495L01269K88061K66094K34528J92886J42138Q4760K2889m2323j08759
59390A2537038j72444k29932k80269l23341l57782l82260l97452m04914m04988
$$ y = [16056135, 16065329, 16096142, 16153483, 16239593, 16355334, 16500504, 16672296, 16864233, 17066542, 17266452, 17448534, 17596726, 17697028, 17737887, 17708907, 17601548, 17411864, 17141285, 16794414, 16377663, 15900613, 15376856, 14821814, 14249828, 13673445, 13103997, 12551482, 12024061, 11528082, 11068046, 10646136, 10262487, 9916644, 9608557, 9338077, 9104230, 8905521, 8740535, 8607846, 8505746, 8432572, 8387344, 8369970, 8380825, 8419980, 8486823, 8580732, 8701988, 8851138, 9027070, 9226826, 9448212, 9691537, 9957400, 10243109, 10542483, 10848635, 11155495, 11456764, 11744825, 12010919, 12245447, 12438333, 12580471, 12665231, 12688120, 12645797, 12537038, 12364594, 12134662, 11854393, 11531052, 11173270, 10791010, 10393558, 9988644, 9583656]
59381I583656l97728l85068l70055l54201l37074l18170k97800k76422k54534
59372F592604k32908k12031j91732j72273j54929j40291j26867j12781r8206q4668
59362E065918p2532o0734m8660l6793k5708j5673p021K28O920J4002K1559K9416
59350D870922L7830M6233N2006N2359M7604M1376L7476L7403M0653M6207N3444
59339E363513O2436P3579Q6522R9542J10282J17053J19590J19554J20549J26356
59329F398976J38098J53860J71543J91059K13102K37280K62862K90330L20692
59320H377802L53906L89217M26448M65796N07054N50021N94925O41337O87418
59311A2993924P31211P71654Q07157Q34312Q49638Q51886Q41306Q17677P80871
$$ y = [9583656, 9185928, 8800860, 8430805, 8076604, 7739530, 7421360, 7123560, 6847138, 6592604, 6359696, 6147665, 5955933, 5783660, 5628731, 5488440, 5361573, 5248792, 5150586, 5065918, 4993386, 4932652, 4883992, 4847199, 4821491, 4805818, 4798797, 4799025, 4805945, 4819947, 4841506, 4870922, 4908752, 4954985, 5006991, 5059350, 5106954, 5148330, 5185806, 5223209, 5263862, 5310069, 5363513, 5425949, 5499528, 5586050, 5685592, 5795874, 5912927, 6032517, 6152071, 6272620, 6398976, 6537074, 6690934, 6862477, 7053536, 7266638, 7503918, 7766780, 8057110, 8377802, 8731708, 9120925, 9547373, 10013169, 10520223, 11070244, 11665169, 12306506, 12993924, 13725135, 14496789, 15303946, 16138258, 16987896, 17839782, 18681088, 19498765, 20279636]
59302B0279636P32803O77087O16966N54791M92833M32959L75677L20616K67472
59293B4750840K15397J62204J05578M4607k0838r1180j66166k43901l22305m00423
59283B4033813m76583n46676o06772o56784o99136p34417p60949p78281p88115
59274A7986100p91315p86588p73082p52238p26138o95736o61571o24802n86649
59265A1587981n47827n09047m70953m33277l95375l58049l23680k93825k67572
59256G988376k42675k17700j92869j69526j48954j31095j14498r8029q2185o7919
59246F522926n4984m2489l0391j8856o769P271K2598L6914M9130O0278P1526Q2836
59234F699990R3797J04352J14558J24880J36583J50312J64389J76357J86252J96494
$$ y = [20279636, 21012439, 21689526, 22306492, 22861283, 23354116, 23787075, 24162752, 24483368, 24750840, 24966237, 25128441, 25234019, 25278626, 25257788, 25166608, 25000442, 24756541, 24434236, 24033813, 23557230, 23010554, 22403782, 21746998, 21047862, 20313445, 19552496, 18774215, 17986100, 17194785, 16408197, 15635115, 14882877, 14156739, 13461003, 12799432, 12174630, 11587981, 11040154, 10531107, 10060154, 9626877, 9231502, 8873453, 8549773, 8255948, 7988376, 7745701, 7528001, 7335132, 7165606, 7016652, 6885557, 6771059, 6673030, 6590845, 6522926, 6467942, 6425453, 6395062, 6376206, 6369437, 6376708, 6399306, 6436220, 6485350, 6545628, 6617154, 6699990, 6793787, 6898139, 7012697, 7137577, 7274160, 7424472, 7588861, 7765218, 7951470, 8147964]
59224H147964K08190K19411K27835K33281K36793K38783K39083K37573K33654
59215A0222567K26016K13894J98065J80081J61177J42078J22917J02864Q0748
59206A1650407N6406L0551L199k6495n8342r0282j20179j47388j71815j92421
59196A0933641k07727k17274k21610k21126k15762k05783j92123j75762j57124
59187I119350j36384j14223r1855p0045m8469k6674n458J3785L1191M8620O7231
59176H787069Q6083J03924J20881J37292J52250J64946J76402J88041J99329K08783
59166A0325000K16932K26286K38420K52669K67821K83637L00661L19680L41130
59157A2772236L64008L85725M04047M18172M26424M24071M05869L70459L20079
$$ y = [8147964, 8356154, 8575565, 8803400, 9036681, 9273474, 9512257, 9751340, 9988913, 10222567, 10448583, 10662477, 10860542, 11040623, 11201800, 11343878, 11466795, 11569659, 11650407, 11706813, 11737364, 11740563, 11714068, 11655726, 11565444, 11445265, 11297877, 11126062, 10933641, 10725914, 10508640, 10287030, 10065904, 9850142, 9644359, 9452236, 9276474, 9119350, 8982966, 8868743, 8776888, 8706843, 8658374, 8631700, 8626242, 8640027, 8671218, 8719838, 8787069, 8873152, 8977076, 9097957, 9235249, 9387499, 9552445, 9728847, 9916888, 10116217, 10325000, 10541932, 10768218, 11006638, 11259307, 11527128, 11810765, 12111426, 12431106, 12772236, 13136244, 13521969, 13926016, 14344188, 14770612, 15194683, 15600552, 15971011, 16291090]
59148A6291090K56451J79533R0378p552j10559k15862l19597m15799m98763n65359
59138A4683961o14555o46259o61463o62318o51222o30422o02478n69896n34160
59129I111188m96345m58389m22315l88392l55837l25160k97752k73252k49686
59120E844060k26668k06040j88758j73470j58996j45904j34395j22910j10442
59111D376477r8425q8666q0811p3368o5969n9024n2186m4740l6925k9724k3729
59100C722910j8915j4824j0436m737K020Q489J4071J9531K5448L1404L7258M3729
59088C855948N0997N8070O4362P0589P7196Q3233Q7846R1664R5763J00414J05800
59077D741882J12697J21077J29085J34782J38405J41901J46709J52907J59745
$$ y = [16291090, 16547541, 16727074, 16817452, 16809900, 16699341, 16483479, 16163882, 15748083, 15249320, 14683961, 14069406, 13423147, 12761684, 12099366, 11448144, 10817722, 10215244, 9645348, 9111188, 8614843, 8156454, 7734139, 7345747, 6989910, 6664750, 6366998, 6093746, 5844060, 5617392, 5411352, 5222594, 5049124, 4890128, 4744224, 4609829, 4486919, 4376477, 4278052, 4189386, 4108575, 4035207, 3969238, 3910214, 3858028, 3813288, 3776363, 3746639, 3722910, 3703995, 3689171, 3678735, 3673998, 3676018, 3684507, 3698578, 3718109, 3743557, 3774961, 3812219, 3855948, 3906945, 3965015, 4029377, 4099966, 4177162, 4260395, 4348241, 4439905, 4535668, 4636082, 4741882, 4854579, 4975656, 5104741, 5239523, 5377928, 5519829, 5666538, 5819445, 5979190]
59068E979190J66027J70368J71990J71323J69472J67314J64948J61437J55343
59059G477412J46484J36895J28835J22148J15152J07942J02665J00287R9414R9126
59049H636360J00817J05914J13790J23306J34753J48459J62740J75093J84593
59040I885825J91708J96297J97017J92159J80015J59096J29067R1129M7047j422
59030A1267938n1661r9991j43293j80108k09700k31220k44627k51128k51680k46008
59020I358522k34205k18282k01066j84181j68022j52927j39482j28244j19878
59011G812235j14962j13206j13690j16097j20711j26947j33385j39823j47571
59002F685843j56874j65533j71399j74844j77468j79468j79622j77090j72013
$$ y = [5979190, 6145217, 6315585, 6487575, 6658898, 6828370, 6995684, 7160632, 7322069, 7477412, 7623896, 7760791, 7889626, 8011774, 8126926, 8234868, 8337533, 8437820, 8537234, 8636360, 8737177, 8843091, 8956881, 9080187, 9214940, 9363399, 9526139, 9701232, 9885825, 10077533, 10273830, 10470847, 10663006, 10843021, 11002117, 11131184, 11222313, 11269360, 11267938, 11216277, 11116286, 10972993, 10792885, 10583185, 10351965, 10107338, 9856210, 9604530, 9358522, 9124317, 8906035, 8704969, 8520788, 8352766, 8199839, 8060357, 7932113, 7812235, 7697273, 7584067, 7470377, 7354280, 7233569, 7106622, 6973237, 6833414, 6685843, 6528969, 6363436, 6192037, 6017193, 5839725, 5660257, 5480635, 5303545, 5131532]
58993E131532j65046j57365j50335j44226j37876j30474j22834j16160j10446
58984C896770j04889r9150r3466q8329q4551q2638q1558p9274p5086p0289o6052
58973B971488o2026n7742n3745n0390m6954m2875l8574l4147k8843k2818j7786
58962B515588j4537j1465p213l399k738n248q055q704p348n831n489n815n065
58949B424681k566n5M75k58K27K372M206M903N924P760Q487P096N609N877O644
58934B481382N912M223L456M040N490P894J0821J2376J1652J0699J1832J4474
58922B584251J6661J8171J9904K1554K2344K2881K4080K5411K6212K7407K9806
58911B838682L2200L3438L4792L7745M0988M2410M2699M4051M6471M8469N0293
$$ y = [5131532, 4966486, 4809121, 4658786, 4514560, 4376684, 4246210, 4123376, 4007216, 3896770, 3791881, 3692731, 3599265, 3510936, 3426385, 3343747, 3262189, 3182915, 3107829, 3037540, 2971488, 2909462, 2851720, 2797975, 2747585, 2700631, 2657756, 2619182, 2585035, 2556192, 2533374, 2515588, 2501051, 2489586, 2482373, 2478974, 2476236, 2470988, 2462933, 2454229, 2446881, 2441050, 2435561, 2429746, 2424681, 2422115, 2422060, 2422535, 2422277, 2422504, 2424876, 2429082, 2433985, 2439909, 2447669, 2456156, 2463252, 2468861, 2474738, 2481382, 2487294, 2491517, 2494973, 2499013, 2504503, 2512397, 2523218, 2535594, 2547246, 2557945, 2569777, 2584251, 2600912, 2619083, 2638987, 2660541, 2682885, 2705766, 2729846, 2755257, 2781469, 2808876, 2838682, 2870882, 2904320, 2939112, 2976857, 3017845, 3060255, 3102954, 3147005, 3193476, 3241945, 3292238]
58900C292238N3265N6562N8023N7773N8006N9499O1219O3131O6342P0621P4677
58889C971356P8756Q4114R0132R5014R9258J05172J12679J19084J23631J29100
58879E008296J37587J47668J57117J66076J75925J87005J99002K12025K26083
58870F616784K40667K55795K72398K91038L11358L33152L56713L81895M08140
58861I467940M35732M65704M98303N32945N69810O10011O53928P00577P48599
58852A4683549P96655Q43074Q86628R27591R66303J000557J025639J036932J031277
58843B3198205J006225R59618Q89806P95101O73797N26646L58970J78708p016
58834B8580060j91822l68092n28218o67781p85221q78805r46727r90010j012399
$$ y = [3292238, 3345503, 3402065, 3460088, 3517861, 3575867, 3635366, 3696585, 3759716, 3826058, 3896679, 3971356, 4050112, 4134226, 4224358, 4319372, 4418630, 4523802, 4636481, 4755565, 4879196, 5008296, 5145883, 5293551, 5450668, 5616744, 5792669, 5979674, 6178676, 6390701, 6616784, 6857451, 7113246, 7385644, 7676682, 7988040, 8321192, 8677905, 9059800, 9467940, 9903672, 10369376, 10867679, 11400624, 11970434, 12580445, 13234373, 13934950, 14683549, 15480204, 16323278, 17209906, 18137497, 19103800, 20104357, 21129996, 22166928, 23198205, 24204430, 25164048, 26053854, 26848955, 27522752, 28049398, 28408368, 28587076, 28580060, 28388238, 28020146, 27491928, 26824147, 26038926, 25160121, 24213394, 23223384, 22210985]
58825B2210985j016920j005101r79594r44720r03600q57288q07222p55975p05017
58816A4235548o54348o05120n59973n19831m82852m47727m15799l88657l65722
58807I795519l45257l25929l06525k86191k65915k47700k31520k15197j98064
58798G373221j82148j68538j55215j40202j24529j10228r7379q5191p4098o4483
58788F171210n4746m2950k9655j7249o850K603J2737K4329L7066M9737O1164P1553
58776F278949Q2196R3652J05313J17092J29926J43996J58027J71263J84625J99083
58766G664122K14477K30832K49061K69184K89629L09771L31454L56379L83469
58757A0298378M10848M39167M70795N06473N44856N85115O27885O73537P20994
$$ y = [22210985, 21194065, 20188964, 19209370, 18264650, 17361050, 16503762, 15696540, 14940565, 14235548, 13581200, 12976080, 12416107, 11896276, 11413424, 10965697, 10549898, 10161241, 9795519, 9450262, 9124333, 8817808, 8531617, 8265702, 8018002, 7786482, 7571285, 7373221, 7191073, 7022535, 6867320, 6727118, 6602589, 6492361, 6394982, 6309791, 6235693, 6171210, 6116464, 6073514, 6043859, 6026610, 6019760, 6022363, 6035100, 6059429, 6096495, 6146232, 6207396, 6278949, 6361145, 6454797, 6560110, 6677202, 6807128, 6951124, 7109151, 7280414, 7465039, 7664122, 7878599, 8109431, 8358492, 8627676, 8917305, 9227076, 9558530, 9914909, 10298378, 10709226, 11148393, 11619188, 12125661, 12670517, 13255632, 13883517, 14557054, 15278048]
58748A5278048P68616Q15116Q59309Q99712R34519R61432R77389R78857R62294
58739B3435292R24332Q62143P74208O60685N23100L64543J90477Q443j73832l49776
58729B7219615n13492o59049p81496q78477r50327r98674j025355j032501j023078
58720A9357166j000770r69018r30294q86575q40277p93660p47302p00499o53816
58711A1834955o09885n70614n34914n00613m67452m36557m08058l81310l56583
58702G568969l34297l13055k90873k68313k48233k32197k18849k05974j92438
58693E264740j78297j64618j52987j43468j33736j22191j11029j03473r8701r2863
58683C963377q4988p8109p3899p0033o4428n8770n5654n4671n3523n1166m7989
$$ y = [15278048, 16046664, 16861780, 17721089, 18620801, 19555320, 20516752, 21494141, 22472998, 23435292, 24359624, 25221767, 25995975, 26656660, 27179760, 27544303, 27734780, 27743223, 27569391, 27219615, 26706123, 26047074, 25265578, 24387101, 23436774, 22438100, 21412745, 20380244, 19357166, 18356396, 17387378, 16457084, 15570509, 14730232, 13936572, 13189270, 12488771, 11834955, 11225070, 10654456, 10119542, 9618929, 9151477, 8714920, 8306862, 7925552, 7568969, 7234672, 6921617, 6630744, 6362431, 6114198, 5882001, 5663152, 5457178, 5264740, 5086443, 4921825, 4768838, 4625370, 4491634, 4369443, 4258414, 4154941, 4056240, 3963377, 3878389, 3800280, 3726381, 3656348, 3591920, 3533150, 3477496, 3422825, 3369302, 3318136, 3270147]
58672C270147m4433m1061l8815l7794l6994l6083l5925l6668l7019l6434l6194
58661B852727l7233l8692l9775m1244m3705m6056m7118m7512m8468m9788n0190
58650B362946m8966m6456m3656m1681m0743l9523l6802l3484l1402l0329k8396
58639A941508k5407k3300k3021k3421k3728k4405k5045k4238k2370k1771k2998
58628A681804k3872k3244k2745k3358k3376k1547j9190j7242j4167r256n136m126
58616A474545m378k640R54L719M597M760N288O669R481J3199J5395J4338J1590
58603A557517R995R941R404O874K588k217n790o617n139l769m014m770m455l199
58589A556349j670M25L139N400O883R092J2981J7228K0479K3440K7019L0230L1992
$$ y = [3270147, 3225714, 3184653, 3145838, 3108044, 3071050, 3034967, 2999042, 2962374, 2925355, 2888921, 2852727, 2815494, 2776802, 2737027, 2695783, 2652078, 2606022, 2558904, 2511392, 2462924, 2413136, 2362946, 2313980, 2267524, 2223868, 2182187, 2141444, 2101921, 2065119, 2031635, 2000233, 1969904, 1941508, 1916101, 1892801, 1869780, 1846359, 1822631, 1798226, 1773181, 1748943, 1726573, 1704802, 1681804, 1657932, 1634688, 1611943, 1588585, 1565209, 1543662, 1524472, 1507230, 1493063, 1483807, 1478671, 1474545, 1470167, 1467527, 1468481, 1472200, 1476797, 1481557, 1486845, 1493514, 1502995, 1516194, 1531589, 1545927, 1557517, 1567512, 1577453, 1586857, 1593731, 1596319, 1594102, 1588312, 1581695, 1576556, 1572787, 1568773, 1564003, 1559548, 1556349, 1554679, 1555104, 1558243, 1563643, 1570526, 1579618, 1592599, 1609827, 1630306, 1653746, 1680765, 1710995, 1742987]
58576A742987L3262L5455L8280M0989M4036M7709N0934N3392N6887O2629O9009
58565B275569P4308P9620Q6655R4587J01731J08730J17270J27138J37335J48859
58555C351802J63437J80297J96887K12295K27735K44053K60491K75356K86594
58546E398947K92718K94270K92626K86222K70255K41926K03536J58400J06603
58537G545503M7662j4990p5650j30641j78165k16047k43191k61699k74065k79660
58527E919057k77263k69350k59889k49121k34529k16322j98004j81700j66533
58518C866346j51601j37343j23820j10550r8062q7219p7423o7939o0238n6217
58508B895934n4797n3031n0018m6987m4322m1426l8740l6983l5086l1855k8726
$$ y = [1742987, 1776249, 1811704, 1849984, 1890973, 1935009, 1982718, 2033652, 2087044, 2143931, 2206560, 2275569, 2349877, 2429497, 2516152, 2610739, 2712470, 2821200, 2938470, 3065608, 3202943, 3351802, 3515239, 3695536, 3892423, 4104718, 4332453, 4576506, 4836997, 5112353, 5398947, 5691665, 5985935, 6278561, 6564783, 6835038, 7076964, 7280500, 7438900, 7545503, 7593165, 7578175, 7502525, 7371884, 7193719, 6977672, 6734481, 6472782, 6198717, 5919057, 5641794, 5372444, 5112555, 4863434, 4628905, 4412583, 4214579, 4032879, 3866346, 3714745, 3577402, 3453582, 3343032, 3244970, 3157751, 3080328, 3012389, 2952151, 2895934, 2841137, 2788106, 2738088, 2691101, 2646779, 2605353, 2566613, 2529630, 2494544, 2462689, 2433963]
58497B433963k7674k7515k5791k3413k3390k5615k7138k7463k9198l2925l5733
58486B128108l5962l5526l6077l6323l4961l3390l3552l5025l5901l5120l2982
58475A743289l0599k9284k9264k8898k6582k3018k0019j7719j5045j2364j1238
58464A499259j1849j2940j3949j4921j4957j3191j0942j0272j0745j0211q449
58453A366833p235p015o365m741l132j845j78J683K825L573N017O760P493P343
58439A371016P291O837M938K619J732J520m64m227p159p941p793p876q149q754
58425A343590r916j0602r745q351p970p951o952o092p273r374r709q476p988q126
58411A225065o689l919k475k879l105k805l816o077p139o299n459n360m756l741
$$ y = [2433963, 2406289, 2378774, 2352983, 2329570, 2306180, 2280565, 2253427, 2225964, 2196766, 2163841, 2128108, 2092146, 2056620, 2020543, 1984220, 1949259, 1915869, 1882317, 1847292, 1811391, 1776271, 1743289, 1712690, 1683406, 1654142, 1625244, 1598662, 1575644, 1555625, 1537906, 1522861, 1510497, 1499259, 1487410, 1474470, 1460521, 1445600, 1430643, 1417452, 1406510, 1396238, 1385493, 1375282, 1366833, 1359598, 1352583, 1346218, 1341477, 1338345, 1336500, 1336322, 1338005, 1340830, 1344403, 1349420, 1356180, 1363673, 1371016, 1378307, 1385144, 1390082, 1392701, 1394433, 1395953, 1395489, 1391262, 1384103, 1376162, 1368369, 1360493, 1352344, 1343590, 1333674, 1323072, 1313327, 1304976, 1297006, 1289055, 1282103, 1276011, 1268738, 1259364, 1249655, 1241179, 1233191, 1225065, 1218376, 1214457, 1211982, 1209103, 1205998, 1203193, 1199377, 1193300, 1186161, 1179862, 1174403, 1169043, 1164287, 1160546]
58397A160546l905m647l421l59J360P21M34K161M066M479M445N117N756N764N947
58382A188464O760P832R669J3056J6637J8173J8079J8322J8242J5488J1027Q558
58370A350307Q604P785M703J856O31r35m007o933q818j0956j3265j3522j1531
58357A303919j0077j0239r907q215p190p472o756m136j806p60R26L872N768N692
58343A253619N715O562O230M720N206Q276R998Q320O602P768R639R445Q676R745
58329A360521J1634J2449J3003J4424J5309J4575J4199J5912J7861J7500J5378
58318A522765J3426J1983J0753J0253J0196R062O866N603N570M628K428J525K624
58305A617682K842P07j151m72J428L074N334Q193R149P385N706N972O589O564
$$ y = [1160546, 1156641, 1151994, 1148573, 1148214, 1149574, 1150295, 1150729, 1152890, 1156956, 1161435, 1165880, 1170997, 1176753, 1182517, 1188464, 1195224, 1203056, 1212725, 1225781, 1242418, 1260591, 1278670, 1296992, 1315234, 1330722, 1341749, 1350307, 1358911, 1366696, 1371399, 1373255, 1373886, 1372951, 1368944, 1362011, 1353193, 1342237, 1328972, 1315450, 1303919, 1293842, 1283603, 1273696, 1265481, 1258291, 1250819, 1244063, 1239927, 1238121, 1237361, 1238287, 1242159, 1247927, 1253619, 1259334, 1265896, 1272126, 1276846, 1282052, 1290328, 1300326, 1308646, 1315248, 1323016, 1332655, 1342100, 1350776, 1360521, 1372155, 1384604, 1397607, 1412031, 1427340, 1441915, 1456114, 1472026, 1489887, 1507387, 1522765, 1536191, 1548174, 1558927, 1569180, 1579376, 1588438, 1595304, 1600907, 1606477, 1611105, 1613533, 1615058, 1617682, 1620524, 1621231, 1620080, 1619608, 1621036, 1624110, 1629444, 1637637, 1646786, 1654171, 1659877, 1665849, 1672438, 1679002]
58291A679002P652J0044J0528P766N097N176O114N801N642P104Q666R126R844
58278A777562J1076J0537Q175P622J0134J2081J1361J1031J3273J5192J4438J3593
58266A916075J5047J6610J6468J7270K0821K3752K3068K1346K1810K2984K2791
58255B138042K3131K5569K7269K6180K5573K8280L1033K9851K6745K5710K6199
58244B433582K5854K5762K7537K9002K7943K6726K8320L1263L3065L4818L8120
58233B761992M1418M3436M6071M9879N1577N0064M9588N2708N5763N5888N6468
58222C314852O0448O4420O4984O5078O8203P2152P4303P7230Q3128Q8528R0465
58211D123791R1998R5927R9523J01191J05399J14752J24486J31257J39649J53047
$$ y = [1679002, 1686654, 1696698, 1707226, 1714992, 1720089, 1725265, 1731379, 1737180, 1742822, 1749926, 1758592, 1767718, 1777562, 1788638, 1799175, 1807350, 1814972, 1825106, 1837187, 1848548, 1859579, 1872852, 1888044, 1902482, 1916075, 1931122, 1947732, 1964200, 1981470, 2002291, 2026043, 2049111, 2070457, 2092267, 2115251, 2138042, 2161173, 2186742, 2214011, 2240191, 2265764, 2294044, 2325077, 2354928, 2381673, 2407383, 2433582, 2459436, 2485198, 2512735, 2541737, 2569680, 2596406, 2624726, 2655989, 2689054, 2723872, 2761992, 2803410, 2846846, 2892917, 2942796, 2994373, 3044437, 3094025, 3146733, 3202496, 3258384, 3314852, 3375300, 3439720, 3504704, 3569782, 3637985, 3710137, 3784440, 3861670, 3944798, 4033326, 4123791, 4215789, 4311716, 4411239, 4512430, 4617829, 4732581, 4857067, 4988324, 5127973, 5281020]
58201E281020J66120J73939J80466J90182J99699K05976K14124K27971K41599
58192G081096K49687K57412K70254K83277K91231K99913L15944L34552L49664
58183I733030L66873L93364M23868M50082M75341N06312N38896N66925N96154
58174A4050845O34537O76929P14611P51589P95761Q42583Q83810R23952R71667
58165B1246284J023736J074367J130654J201083J278734J354421J435801J534095
58157C1279175J643610J755257J877935K023713K184306K346416K517405K710381
58149D8338198K918083L129572L359069L629858L945928M310369M753137N306001
58141G9690215N970323O746567P670197Q774324J0046314J1474462J3105089J4987757
$$ y = [5281020, 5447140, 5621079, 5801545, 5991727, 6191426, 6397402, 6611526, 6839497, 7081096, 7330783, 7588195, 7858449, 8141726, 8432957, 8732870, 9048814, 9383366, 9733030, 10099903, 10493267, 10917135, 11367217, 11842558, 12348870, 12887766, 13454691, 14050845, 14685382, 15362311, 16076922, 16828511, 17624272, 18466855, 19350665, 20274617, 21246284, 22270020, 23344387, 24475041, 25676124, 26954858, 28309279, 29745080, 31279175, 32922785, 34678042, 36555977, 38579690, 40763996, 43110412, 45627817, 48338198, 51256281, 54385853, 57744922, 61374780, 65320708, 69631077, 74384214, 79690215, 85660538, 92407105, 100077302, 108851626, 118897940, 130372402, 143477491, 158465248]
58133A58465248J7092081J9344243K1708371K4176799K6787528K9763287L3385749
58126C30723306L7226580L9371337L6953876K8179395J4086246j812775j5727254
58119D69000711k5551157l1152128l3452899l3538602l2293867l0328845k7986380
58112B54696833k5441465k2826436k0254125j7778948j5417145j3198668j1153883
58105A28626163r272707p529161n933664m524351l333725k411210j853660j749084
58097I2018601k079262k706094l447557m144034m679395m996971n108726n061036
58089E9795526m886128m602106m245050l865901l495638l139457k803212k499994
58081C0258040k231776j989278j771530j585363j426746j283162j153714j047419
$$ y = [158465248, 175557329, 194901572, 216609943, 240786742, 267574270, 297337557, 330723306, 367949886, 407321223, 444275099, 472454494, 486540740, 484727965, 469000711, 443449554, 412297426, 378844527, 345305925, 313012058, 282683213, 254696833, 229255368, 206428932, 186174807, 168395859, 152978714, 139780046, 128626163, 119353456, 111824295, 105890631, 101366280, 98032555, 95621345, 93767685, 92018601, 89939339, 87233245, 83785688, 79641654, 74962259, 69965288, 64856562, 59795526, 54909398, 50307292, 46062242, 42196341, 38700703, 35561246, 32758034, 30258040, 28026264, 26036986, 24265456, 22680093, 21253347, 19970185, 18816471, 17769052]
58073A7769052r62635q87541q20025p67686p28042o87688o42303o00036n63844
58064A1109252n27408m90164m59899m37523m14104l85995l59663l39211l21607
58055G373678l06112k96127k89843k80661k68310k58605k51511k40927k26896
58046D954686k16143k09255j99040j83472j69082j59307j50179j39679j31160
58037C397369j24991j16694j05968r8406r5662r2571q6340q0290p6386p2202o7398
58026B380461o5140o5030o2365n6444n2093n1079m9423m5197m1720m0908m0331
58015A810731l8706l7765l7119l3910k9016k6951k8194k8295k5788k4100k4237
58004A476650k2665j8373j5132j4636j3854j1352r926j0782j1266j0458j0996
$$ y = [17769052, 16806417, 15918876, 15098851, 14331165, 13603123, 12915435, 12273132, 11673096, 11109252, 10581844, 10091680, 9631781, 9194258, 8780154, 8394159, 8034496, 7695285, 7373678, 7067566, 6771439, 6481596, 6200935, 5932625, 5674020, 5422509, 5181582, 4954686, 4738543, 4529288, 4330248, 4146776, 3977694, 3818387, 3668208, 3528529, 3397369, 3272378, 3155684, 3049716, 2951310, 2855648, 2763077, 2676737, 2596447, 2520061, 2447859, 2380461, 2315321, 2250291, 2187926, 2131482, 2079389, 2028310, 1978887, 1933690, 1891970, 1851062, 1810731, 1772025, 1734260, 1697141, 1663231, 1634215, 1607264, 1579070, 1550775, 1524987, 1500887, 1476650, 1453985, 1435612, 1420480, 1405844, 1391990, 1380638, 1370712, 1359930, 1348664, 1338206, 1327210]
57993A327210j3180j3352j0414q092q325q158n748l879m737o338o823p511r159
57980A221494r741q402p306p511p219n821n146n113k936J507M358L811K716L151
57966A177842L137J016j514l093m995p429p962o047m915o468q274q094p373p832
57952A107999q402q103q246r408r729q568q181r583j0395r112p853q338q839p720
57938I85522o478o460n995l741j792k287l721l587k266j341l27J892M260M982
57924I58661M359L904L927L897L887M062L883L088K225J472M62m13n10r40l512
57909I88452p396r570r263q880r827j0615j0062r150q487p131n248m797o042o465
57895H75519m770l026l215m464n247n586n583m536k937k562l286k734l45J482
$$ y = [1327210, 1314030, 1300678, 1290264, 1282172, 1273847, 1265689, 1259941, 1256062, 1251325, 1244987, 1238164, 1230653, 1221494, 1211753, 1203351, 1196045, 1188534, 1181315, 1175494, 1170348, 1165235, 1162299, 1163806, 1168164, 1171975, 1174691, 1177842, 1180979, 1181995, 1180481, 1177388, 1172393, 1164964, 1157002, 1150955, 1146040, 1139572, 1131298, 1123204, 1115831, 1107999, 1099597, 1091494, 1083248, 1073840, 1064111, 1055543, 1047362, 1037779, 1027384, 1018272, 1010419, 1002081, 993242, 985522, 979044, 972584, 966589, 962848, 961056, 958769, 955048, 951461, 949195, 947854, 947527, 949419, 953679, 958661, 963020, 966924, 970851, 974748, 978635, 982697, 986580, 989668, 991893, 993365, 993827, 993414, 992904, 991964, 988452, 981056, 971486, 962223, 953343, 943516, 932901, 922839, 913689, 905202, 898071, 892823, 888026, 881984, 875519, 870749, 867723, 864508, 860044, 854797, 849211, 843628, 839092, 836155, 833593, 830307, 827573, 827228, 828710]
57881H28710J610J999L671M371K474j80j553k342l376l325j658p74k443m697n053
57866H17434m300m507n538o143o311o171m695j796N31J244J999L788M658L163
57852G93356J335J449K518K839L388N447P320O861N406N604P106P592O637N296
57838H62154L323J43k561k582q05j53j578l659n346o511o595n334m255n056p016
57823H14169q064p717o920n986m774m121m793n747n391l870k304p22J320L077
57809G58157L519L173L293M058N105O672Q547R214P810N792M862M590L831K944
57795H31567K672K269Q75o45j288j932l605n229n365m835n271o367o897p064p467
57780G81418p166n342l542l610m624m574l957m729o692p780p356o551n952n492
$$ y = [828710, 830320, 832319, 835990, 840361, 842835, 842655, 841102, 838760, 835384, 832059, 830401, 829627, 827184, 822487, 817434, 813134, 808627, 803089, 796946, 790635, 784464, 779769, 777973, 778504, 779748, 781747, 785535, 790193, 793356, 794691, 796140, 798658, 801497, 804885, 810332, 817652, 824513, 829919, 835523, 842629, 850221, 856858, 862154, 865477, 865620, 863059, 860477, 859672, 859519, 857941, 854282, 848936, 842425, 835830, 830496, 826241, 821185, 814169, 806105, 798388, 791468, 785482, 780708, 776587, 771794, 766047, 760656, 756786, 754482, 753760, 755080, 758157, 761676, 764849, 768142, 772200, 777305, 783977, 792524, 801738, 809548, 815340, 820202, 824792, 828623, 831567, 834239, 836508, 837383, 836738, 835450, 833518, 829913, 824684, 819319, 814484, 809213, 802846, 795949, 788885, 781418, 774252, 768910, 765368, 761758, 757134, 752560, 748603, 743874, 737182, 729402, 722046, 715495, 709543, 704051]
57766G04051n840p453q964q952q314q578q966p970o506o464p174o646n393n520
57752F01311o663o462m831l986m297l725j783m86o57o06O41J817K130K645L852
57737E78900M345L133J194j36n31O6J583K903K845K226K789M081M104L067L403
57722F13972N398O128M027J453Q43R91n12l111m186l116k132l229n700o988n373
57707E98465j792J010J378L77pN48R72Q47N82K45K7J063L789O125N803M117M578
57690F28127P805J0668J0970J0000R539R169P963O546N856N559N115M941N371
57677G27629N757N632N461N544N508N492O287P744Q545Q265Q010Q410Q730Q681
57663H25695R283J0984J2513J2833J2646J2972J3560J3860J4312J5672J7907K0490
$$ y = [704051, 698211, 690758, 681794, 672842, 664528, 655950, 646984, 639014, 632508, 626044, 618870, 612224, 606831, 601311, 594648, 588186, 583355, 579369, 575072, 571347, 569564, 569078, 568421, 567815, 568456, 570273, 572403, 575048, 578900, 583245, 586378, 587572, 587436, 586905, 586971, 588554, 591457, 594302, 596528, 599317, 603398, 607502, 610569, 613972, 619370, 625498, 629525, 630978, 631821, 632812, 632300, 629189, 625003, 621887, 619755, 616526, 610826, 603838, 598465, 596673, 597683, 599061, 599438, 599431, 599979, 600951, 601798, 602380, 602625, 602652, 603715, 607504, 613629, 619432, 623549, 628127, 635932, 646600, 657570, 667570, 677109, 686278, 694241, 700787, 706643, 712202, 717317, 722258, 727629, 733386, 739018, 744479, 750023, 755531, 761023, 767310, 775054, 783599, 791864, 799874, 808284, 817014, 825695, 834978, 845962, 858475, 871308, 883954, 896926, 910486, 924346, 938658, 954330, 972237, 992727]
57651I92727K2824K3957K3253K1760K1555K3206K5332K7035K9030L1727L4075
57640A276481L5400L6812L9635M3599M7500N0570N2647N4108N6110N9627O4045
57629A816534O8248P3080Q0565R0333R9450J06762J14896J26408J40252J53908
57619B870436J67163J81784J98820K18102K39160K60920K81486K99698L15904
57610E033473L29842L38790L38952L27157K99877K52557J83070R6008K017q7161
57600G114582j62824k20555k60138k84561k97541l01514k97948k88520k74827
57591D726154k57598k37387k15710j94630j75368j57798j41010j24234j07838
57582C114581r3482q2238p2742o2582n1619m2092l5051k8737k1348j3397o180
$$ y = [992727, 1015551, 1039508, 1062761, 1084521, 1106076, 1129282, 1154614, 1181649, 1210679, 1242406, 1276481, 1311881, 1348693, 1388328, 1431927, 1479427, 1529997, 1582644, 1636752, 1692862, 1752489, 1816534, 1884782, 1957862, 2038427, 2128760, 2228210, 2334972, 2449868, 2576276, 2716528, 2870436, 3037599, 3219383, 3418203, 3636305, 3875465, 4136385, 4417871, 4717569, 5033473, 5363315, 5702105, 6041057, 6368214, 6668091, 6920648, 7103718, 7199726, 7201743, 7114582, 6951758, 6731203, 6471065, 6186504, 5888963, 5587449, 5289501, 5000981, 4726154, 4468556, 4231169, 4015459, 3820829, 3645461, 3487663, 3346653, 3222419, 3114581, 3021099, 2938861, 2866119, 2803537, 2751918, 2709826, 2674775, 2646038, 2624690, 2611293, 2605113]
57571B605113L43O879J3514K0353K7940L5973M3210M9628N6925O5805P4920Q3870
57559C084473R4788J08881J23636J35958J46358J57360J69156J79555J87153J91765
57549D579083J92425J87438J75926J57259J29981R3797N1897Q773l3695p5496
57539E467388j14724j47805j73385j92918k07043k14308k14339k09664k03129
57530C790073j95422j86187j75860j65213j54440j43640j33208j23120j12881
57521B400102j02686r3470q5354p7360o9216o2246n7583n4482n1251m7172m2753
57510A656529l8572l4719l1242k8469k6617k5220k3224k0055j6409j3544j1779
57499A386679j0353q756p201n684l849k112j423j230O10M828R232J1601J2593
$$ y = [2605113, 2605456, 2612335, 2625849, 2646202, 2674142, 2710115, 2753325, 2802953, 2859878, 2925683, 3000603, 3084473, 3179261, 3288142, 3411778, 3547736, 3694094, 3851454, 4020610, 4200165, 4387318, 4579083, 4771508, 4958946, 5134872, 5292131, 5422112, 5515909, 5567806, 5576579, 5542884, 5467388, 5352664, 5204859, 5031474, 4838556, 4631513, 4417205, 4202866, 3993202, 3790073, 3594651, 3408464, 3232604, 3067391, 2912951, 2769311, 2636103, 2512983, 2400102, 2297416, 2203946, 2118592, 2041232, 1972016, 1909770, 1852187, 1797705, 1746454, 1699282, 1656529, 1617957, 1583238, 1551996, 1523527, 1496910, 1471690, 1448466, 1428411, 1412002, 1398458, 1386679, 1376326, 1367570, 1360369, 1354685, 1350836, 1348724, 1347301, 1346071, 1346681, 1351509, 1360741, 1372342, 1384935]
57486A384935J4050J5889J6794J7016J8230K1013K4486K8004L1457L4267L5919
57475A642060L7269L9620M2908M6394N0559N6359O3044O8847P3782P9773Q7923
57464B288538R7453J07278J16922J25922J34135J42438J51362J59202J63488J64030
57454C650768J62163J57007J45194J24958R8122O7329L3718j575l5940o6944r3936
57443D240864j16769j34433j46397j53937j58481j59549j55780j47452j36761
57434B931305j25863j15615j05934r6479q7016p7624o8778o1001n4498m8979m3690
57423B045828l7887l1592k5427j9439j2798n366J428O263R753J3410J7532K1447
57411A983152K5286K9943L5663M2073M9229N7172O5005P2017P9272Q8252R8257
$$ y = [1384935, 1398985, 1414874, 1431668, 1448684, 1466914, 1487927, 1512413, 1540417, 1571874, 1606141, 1642060, 1679329, 1718949, 1761857, 1808251, 1858810, 1915169, 1978213, 2047060, 2120842, 2200615, 2288538, 2385991, 2493269, 2610191, 2736113, 2870248, 3012686, 3164048, 3323250, 3486738, 3650768, 3812931, 3969938, 4115132, 4240090, 4338212, 4405541, 4439259, 4437684, 4401744, 4334800, 4240864, 4124095, 3989662, 3843265, 3689328, 3530847, 3371298, 3215518, 3068066, 2931305, 2805442, 2689827, 2583893, 2487414, 2400398, 2322774, 2253996, 2192995, 2138497, 2089518, 2045828, 2007941, 1976349, 1950922, 1931483, 1918685, 1913319, 1914747, 1921010, 1930763, 1944173, 1961705, 1983152, 2008438, 2038381, 2074044, 2116117, 2165346, 2222518, 2287523, 2359540, 2438812, 2527064, 2625321]
57400B625321J07097J14189J20965J28105J34294J37954J38471J35472J28354
57391C770222J16664R9626P5678M4415Q752k6801n9927r0603j17863j39139j53202
57380C527822j61375j65175j65040j61852j57367j52196j45355j36592j27293
57371B155577j18395j09293r9533q9808q0688p2251o5377o1234n8919n5825n1020
57360A293234m6179m2516l9218l5702l2853l0936k8667k5641k3338k2447k1524
57349I44213j9656j8092j7766j7497j6233j4833j3954j2477r942q205q580r365
57337G77613q488o720n919n884n416n032n950p445p663o284m387k548j022p90
57323G04065k352m259m687l818l030k762k699k978l434k851p73R95P06o61r84
$$ y = [2625321, 2732418, 2846607, 2967572, 3095677, 3229971, 3367925, 3506396, 3641868, 3770222, 3886886, 3986512, 4062190, 4106605, 4115357, 4088556, 4028629, 3938026, 3820163, 3681024, 3527822, 3366447, 3201272, 3036232, 2874380, 2717013, 2564817, 2419462, 2282870, 2155577, 2037182, 1927889, 1828356, 1738548, 1657860, 1585609, 1520232, 1458998, 1400079, 1344254, 1293234, 1247055, 1204539, 1165321, 1129619, 1096766, 1065830, 1037163, 1011522, 988184, 965737, 944213, 924557, 906465, 888699, 871202, 854969, 840136, 826182, 813705, 803763, 795558, 786978, 777613, 769125, 762405, 756486, 750602, 745186, 740154, 734204, 726759, 719096, 712812, 708425, 705877, 704855, 704065, 701713, 697454, 692767, 688949, 685919, 683157, 680458, 677480, 674046, 671195, 670422, 671417, 672123, 671462, 670478]
57308F70478k43m4p64j393j642j971j941n62J917M172N495N851M806K154p39j845
57292F83729o35J717L883M976M439K700J363J635L036M524N852O804O447M678
57278G35148L307M006O082P801Q876J0123J1613J2801J3715J4509J4703J4164
57266H56848J3904J4662J5708J6218J6525J6842J6378J5015J4219J4683J4998
57255A026000J4186J3561J4180J4689J3916J3290J4108J4680J3299J1852J2992
57244A176753J5447J6099J5329J6188J9020K1035K1131K1191K2329K3324K3402
57233A391248K3560K4485K5581K6506K7472K7975K7465K7014K8044K9790L0451
57222A689591L0375L1458L3718L5304L5575L5637L6046L6681L8385M1766M4830
$$ y = [670478, 670235, 670191, 669427, 668034, 666392, 664421, 662480, 661918, 663835, 668007, 673502, 679353, 684159, 686313, 685574, 683729, 683094, 684811, 688694, 693670, 698109, 700809, 702172, 703807, 706843, 711367, 717219, 724023, 730470, 735148, 738455, 742461, 748543, 756344, 765220, 775343, 786956, 799757, 813472, 827981, 842684, 856848, 870752, 885414, 901122, 917340, 933865, 950707, 967085, 982100, 996319, 1011002, 1026000, 1040186, 1053747, 1067927, 1082616, 1096532, 1109822, 1123930, 1138610, 1151909, 1163761, 1176753, 1192200, 1208299, 1223628, 1239816, 1258836, 1279871, 1301002, 1322193, 1344522, 1367846, 1391248, 1414808, 1439293, 1464874, 1491380, 1518852, 1546827, 1574292, 1601306, 1629350, 1659140, 1689591, 1719966, 1751424, 1785142, 1820446, 1856021, 1891658, 1927704, 1964385, 2002770, 2044536, 2089366]
57211B089366M4930M2740M1138M0342L7594L1761K4753J8020J0943L355l447q914
57199B372581j3706j7446j8786j8093j7334j6887j5333j2720j0971j0554r626
57188B211125p121l802J38N484J1344J5107J6058J6456J8245K1062K3857K6026
57176B353979K6714K5725K5146K7251L0878L2966L3310L4174L5348L4199L1119
57165B690809L0307L3650L8066M0759M3155M7424N2555N6383N8803O0793O2469
57154C215173O3923O5856O8115O9563P0293P1694P3778P4963P4854P4515P3849
57143C996576P1920O9983P0448P2474P2718P0945P0510P2201P2414O9032O4744
57132D773965O2464O1602O0939O1215O2518O2779O1080N9102N7551N4835N0989
$$ y = [2089366, 2134296, 2177036, 2218174, 2258516, 2296110, 2327871, 2352624, 2370644, 2381587, 2384942, 2381495, 2372581, 2358875, 2341429, 2322643, 2304550, 2287216, 2270329, 2254996, 2242276, 2231305, 2220751, 2211125, 2204004, 2200202, 2200340, 2205824, 2217168, 2232275, 2248333, 2264789, 2283034, 2304096, 2327953, 2353979, 2380693, 2406418, 2431564, 2458815, 2489693, 2522659, 2555969, 2590143, 2625491, 2659690, 2690809, 2721116, 2754766, 2792832, 2833591, 2876746, 2924170, 2976725, 3033108, 3091911, 3152704, 3215173, 3279096, 3344952, 3413067, 3482630, 3552923, 3624617, 3698395, 3773358, 3848212, 3922727, 3996576, 4068496, 4138479, 4208927, 4281401, 4354119, 4425064, 4495574, 4567775, 4640189, 4709221, 4773965, 4836429, 4898031, 4958970, 5020185, 5082703, 5145482, 5206562, 5265664, 5323215, 5378050, 5429039]
57121E429039M8864M9399M9780M8402M7642M9403N1991N3779N6016N9454O2002
57110F005771O2253O1709O1219N9026N4586N0444M8206M6695M6045M9089N6235
57099F601278O3493O8042P1408P4984P7292P8055P9775Q2671Q3095P9463P4426
57088G433982O8926O0273M8767L9396L3578K6208J4721L866l022j0111k1311l3706
57076G661567m4453n7119p4845r3874j10307j26864j46612j66678j84978k06405
57066F449432k35076k66992k97636l30342l69862m14553m62553n18431n85560
57057B968427o59148p35023G56447a55535j013286j118127j232973j364241j508036
57048f392198j660722j830854k030045k262100k532897k860409l262633l747149
$$ y = [5429039, 5477903, 5527302, 5577082, 5625484, 5673126, 5722529, 5774520, 5828299, 5884315, 5943769, 6005771, 6068024, 6129733, 6190952, 6249978, 6304564, 6355008, 6403214, 6449909, 6495954, 6545043, 6601278, 6664771, 6732813, 6804221, 6879205, 6956497, 7034552, 7114327, 7196998, 7280093, 7359556, 7433982, 7502908, 7563181, 7611948, 7651344, 7684922, 7711130, 7725851, 7729717, 7726695, 7716584, 7695273, 7661567, 7617114, 7559995, 7485150, 7391276, 7280969, 7154105, 7007493, 6840815, 6655837, 6449432, 6214356, 5947364, 5649728, 5319386, 4949524, 4534971, 4072418, 3553987, 2968427, 2309279, 1574256, 756447, -155535, -1168821, -2286948, -3519921, -4884162, -6392198, -8052920, -9883774, -11913819, -14175919, -16708816, -19569225, -22831858, -26579007]
57040b6579007m324851n019448n848355o810068p907681r167120j0611607j2234731
57032h8502868j4014475j5922532j7890490j9799791k1541504k3046720k4222473
57025b24940853k4951370k5281702k5541387k5994277k6239278k5119418k1503468
57018c99571753j5269558p500293K56253O878635J1995833J5755106J8464047
57011c68991730K0373367K1611589K2229683K2303439K1987317K1457621K0821729
57004b18206985K0099959J9271392J8309685J7195016J5932584J4567382J3165211
56997i9665756J1779896J0447555R199760Q061585P040036O129822N328646M635643
56989c7042813M040294L526277L083932K708568K390261K116035J879177J676792
$$ y = [-26579007, -30903858, -35923306, -41771661, -48581729, -56489410, -65656530, -76268137, -88502868, -102517343, -118439875, -136330365, -156130156, -177671660, -200718380, -224940853, -249892223, -275173925, -300715312, -326709589, -352948867, -378068285, -399571753, -414841311, -422341604, -422085351, -415206716, -403210883, -387455777, -368991730, -348618363, -327006774, -304777091, -282473652, -260486335, -239028714, -218206985, -198107026, -178835634, -160525949, -143330933, -127398349, -112830967, -99665756, -87885860, -77438305, -68238545, -60176960, -53136924, -47007102, -41678456, -37042813, -33002519, -29476242, -26392310, -23683742, -21293481, -19177446, -17298269, -15621477]
56981a5621477J501436J344599J205479J087096R86104Q94878Q11265P37979O74485
56972f378156O17359N66834N25359M91123M59808M31235M07705L87435L66124
56963b125174L43681L23195L04479K84470K62862K41665a44484E2491J73422J53719
56953C79632J38195J24008J10924J01447R5444Q9638Q3310Q0670Q5984R7189J03520
56942A489961Q9124M3183k9365j08573j73895k16871k39347k44859k36523A53321
56931d5914j77773j55697j35631j20079j07973r7229q8483q2223p5012o3656n1120
56920a200790m3139m0462l9294l7902l7485l7584l6068l3350l1683l0360k6372
56909a594489j9826j4157j0605o745r80N337J0726J5189J8741K1493K5070L0806
$$ y = [-15621477, -14120041, -12775442, -11569963, -10482867, -9496763, -8601885, -7790620, -7052641, -6378156, -5760797, -5193963, -4668604, -4177481, -3717673, -3286438, -2878733, -2491298, -2125174, -1781493, -1458298, -1153819, -869349, -606487, -364822, -144484, 52491, 225913, 379632, 517827, 641835, 752759, 854206, 949650, 1039288, 1122598, 1203268, 1289252, 1386441, 1489961, 1579085, 1622268, 1592903, 1484330, 1310435, 1093564, 854217, 609358, 372835, 153321, -45914, -223687, -379384, -515015, -635094, -743067, -840296, -928779, -1011002, -1086014, -1149670, -1200790, -1243929, -1284391, -1323685, -1361587, -1399072, -1436656, -1472724, -1506074, -1537757, -1568117, -1594489, -1614315, -1628472, -1639077, -1645822, -1646802, -1641465, -1630739, -1615550, -1596809, -1575316, -1550246, -1519440]
56897a519440L6763L9675L9215L7178L3376K6491J8346J2793J0228P399L084j23
56885a255015l80J004K666N134Q578J1729J4124J6745J9795K2468K5106K8831
56873a099215L2903L5473L6985L9333M1464L9432L1543K0258Q461k734j2047j7699
56861h45843k0100k1563k2387k0659j6727j3978j3688j2970r712o029m544m491
56849a012691l953l168l011k648j288j92m82p99N57K770L987M189M598N436O175
56834a000520O885P790Q631R761J2358J6445K0231K2749K5324K9007L2316L3205
56822g75818L1694K8862K4904K0076J6079J4446J4499J4529J3968J3038J1665
56811e72058J0415J0989J3974J7339J9097K0147K2566K6244K9585L2538L6394
$$ y = [-1519440, -1482677, -1443002, -1403787, -1366609, -1333233, -1306742, -1288396, -1275603, -1265375, -1257976, -1254892, -1255015, -1255395, -1254391, -1251725, -1246591, -1238013, -1226284, -1212160, -1195415, -1175620, -1153152, -1128046, -1099215, -1066312, -1030839, -993854, -954521, -913057, -873625, -842082, -821824, -813363, -816097, -828144, -845843, -865943, -887506, -909893, -930552, -947279, -961257, -974945, -987915, -997627, -1003656, -1008200, -1012691, -1016644, -1019812, -1022823, -1025471, -1026759, -1026951, -1027433, -1028232, -1027675, -1024905, -1020918, -1016729, -1012131, -1006695, -1000520, -993635, -985845, -977214, -967453, -955095, -938650, -918419, -895670, -870346, -841339, -809023, -775818, -744124, -715262, -690358, -670282, -654203, -639757, -625258, -610729, -596761, -583723, -572058, -561643, -550654, -536680, -519341, -500244, -480097, -457531, -431287, -401702, -369164, -332770]
56800c32770M0988M4293M4595M1228L3549K1565P744l684j0184j2573j3219j3577
56788a52045j3614j2546r818n858j842J769N900J1491J8106K4720L1163L7765
56776f4809b0589B9344N4909N8986O0673N7908M9908L7388K1472L628j3662k7632
56764C32922l6970m2190m4390m4186m1726l7021l0471k3338A5572C955a616e2
56751H060J2532J5876K0298K5784L0188L2129L1957K9769K4422J5185L158r588
56739B39770k1286l0475l5898l7343l6121l4039A2645a6869k5939k1118j6019
56728g9945j1933r006n763o81N876J1887J5768J7737J8996a7045B807J7038J1090
56715C0935L137n087j2592b659k3752k5666k4839k2694k0576j8773j7265j6218
$$ y = [-332770, -291782, -247489, -202894, -161666, -128117, -106552, -98808, -102492, -112676, -125249, -138468, -152045, -165659, -178205, -188023, -193881, -195723, -193954, -188054, -176563, -158457, -133737, -102574, -64809, -20589, 29344, 84253, 143239, 203912, 261820, 311728, 349116, 370588, 374216, 360554, 332922, 295952, 253762, 209372, 165186, 123460, 86439, 55968, 32630, 15572, 3955, -1616, -52, 8060, 20592, 36468, 56766, 82550, 112738, 144867, 176824, 206593, 231015, 246200, 249358, 239770, 218484, 188009, 152111, 114768, 78647, 44608, 12645, -16869, -42808, -63926, -79945, -91878, -100884, -106647, -107328, -101452, -89565, -73797, -56060, -37064, -17045, 2807, 19845, 30935, 34072, 28985, 16393, -2659, -26411, -52077, -76916, -99610, -120186, -138959, -156224, -172442]
56703a72442j5174j3026r797p301o905p582p446o227m881l588j907k92K68p8l11
56688b56689k59n16p86o9J506K595K651K415K164J134p98k382k701k337k044j540
56672b57656m26O69Q60J92p04j419j634r24M68J407J229O48N28M41l94j404j255
56655b59374K9R51Q21Q31K096L725L897K354N96j80k08n7L00P80O67k35q61l93
56637b44261K29l32j595k116j991k455l130k219J29J278R2j039J43K438L612L996
56621b47221N059O131N676M579M865N878N250L339L026M714N291L271J376K152
56607a86614M057M338L436L666N093N511L991J948P99M00K2m88q25o59R1R60J161
56590a53113M38o31j538k399l407m502n901p985j0242j1270j0369q225n757l436
$$ y = [-172442, -187616, -200642, -210439, -217740, -224645, -232227, -239673, -245900, -250781, -254369, -256276, -256568, -256300, -256378, -256689, -256948, -257464, -258250, -258319, -256813, -254218, -251567, -249152, -246988, -245854, -246652, -249034, -251735, -254072, -256116, -257656, -258082, -257413, -256553, -256361, -257065, -258484, -260118, -261042, -260574, -259167, -257938, -257290, -256762, -256321, -256715, -258119, -259374, -259345, -258394, -257573, -256742, -254646, -250921, -247024, -244670, -244074, -244254, -244462, -244519, -244219, -243439, -242772, -243007, -243868, -244261, -244032, -244364, -245959, -248075, -250066, -252521, -255651, -257870, -257741, -256463, -256371, -257410, -257267, -254829, -251217, -247221, -242162, -236031, -230355, -225776, -220911, -215033, -209783, -206444, -203418, -198704, -193413, -190142, -188766, -186614, -182557, -178219, -174783, -171117, -166024, -160513, -156522, -154574, -153775, -153375, -153353, -153841, -154666, -155325, -155234, -154274, -153113, -152675, -153306, -154844, -157243, -160650, -165152, -171053, -179038, -189280, -200550, -210919, -219144, -224901, -228337]
56576b28337k046k485m082m597k963o06Q98J880L059L686K968J948K059K707K362
56561b23549J217P71J315J771J778J987K484K674K685L236M153M634M846N601
56547a84397O452O018M337L112L167L415K891K199K135K284J951J322Q00K10m63
56532a44567m23Q49K464L045K396J541J401K076L154M137M632M500L895L032K058
56517a05810J200P40P98J258J871K354K582K871L601M374M214L102K556L744N688
56502f4857O628O586P088Q380Q812P558O316f409B800J0109Q426N423L109K097
56488C1964J743J646K101L068L554K676R40k84n62p53j486k204k163j542r30n31
56472C7237n70j660l797n660n896m736l414k502j763j177j013j173j377G41a633
$$ y = [-228337, -230383, -232868, -236950, -241547, -244510, -245116, -244218, -242338, -239279, -235593, -232625, -230677, -228618, -225911, -223549, -222332, -221561, -220246, -218475, -216697, -214710, -212226, -209552, -206867, -203631, -199478, -194844, -189998, -184397, -177945, -171927, -167590, -164478, -161311, -157896, -155005, -152806, -150671, -148387, -146436, -145114, -144314, -144104, -144567, -144990, -144141, -141677, -138632, -136236, -134695, -133294, -131218, -128064, -123927, -119295, -114795, -110900, -107868, -105810, -104610, -103870, -103072, -101814, -99943, -97589, -95007, -92136, -88535, -84161, -79947, -76845, -74289, -70545, -64857, -58229, -51643, -44555, -36175, -27363, -19805, -13489, -6409, 2800, 12909, 21335, 26758, 29867, 31964, 33707, 35353, 37454, 40522, 44076, 46752, 47692, 47408, 46846, 46093, 44607, 42403, 40240, 38698, 37768, 37237, 36667, 35007, 31210, 25550, 19654, 14918, 11504, 9002, 7239, 6062, 5049, 3876, 2499, 741, -1633]
56456d220j871r05p50j370j842j732j317q35n12q13j751k481k519k487k643j935
56440b9983l0J032n59l138l499j514r1o48j545j333p44n98l34L70O87M91R83K381
56422c8072L000J988R46J362K276K133J479J830L013L437K529J423J495L103b738
56406C733N691M295M454O192P232O376N193N345O132O071N359N021M934M401L812
56391H4241L999M660M842M453L977L319K148P69m10j618k923l495k781j646j226
56376I8309j420j620k036k919l328k168j09R29Jk053l656l631j835N00J597J003
56360G7564n1n83j063j975k523j995j204j239j751j771j296p46J66J565K309J359
56344F6766m48j507j755k356l614m590m513l377j528K69J010P40Q77K166L284
$$ y = [-4220, -6091, -6996, -7746, -9116, -10958, -12690, -14007, -14842, -15354, -16167, -17918, -20399, -22918, -25405, -28048, -29983, -30013, -28981, -29540, -32678, -36177, -37691, -37782, -38430, -39975, -41308, -42052, -42650, -42984, -42614, -41927, -41436, -40453, -38072, -35072, -33084, -32138, -30776, -28500, -26367, -24888, -23058, -20045, -16608, -14079, -12656, -11161, -8058, -2738, 3733, 9424, 13719, 18173, 24365, 31597, 37973, 43166, 48511, 54643, 60714, 66073, 71094, 76028, 80429, 84241, 88240, 92900, 97742, 102195, 106172, 109491, 111639, 112408, 111998, 110380, 107457, 103962, 101181, 99535, 98309, 96889, 95269, 93233, 90314, 86986, 84818, 84709, 85638, 85639, 83586, 79930, 76299, 74464, 74964, 76561, 77564, 77513, 76930, 75867, 73892, 71369, 69374, 68170, 66931, 65180, 63409, 62113, 61367, 61533, 63098, 65407, 66766, 66318, 64811, 63056, 60700, 57086, 52496, 47983, 44606, 43078, 43347, 44357, 45097, 45974, 48140, 51424]
56329E1424K744J209L06J95O8J57J149K188J676J4n48R75L096M113M088M134M851
56312H1839O081P273P795P339O234N045M054L393L222L386L350K881K252J680
56298A45824J423K231M367O197N722L829L716O234Q307P386M904L558L509L655
56284B10862M348O111P412O600M727L740L280K034Q98J627L350L717K837K883
56270B64426M185M831M083L275L290L701M445N900P380P855P919Q804R888R693
56256C49675Q813R221J0991J2458J3209J4193J5221J5212J4621J4776J5223J4595
56244E08208J3694J4412J5969J5824J4070J3267J3830J3553J2084J1746J3029
56233F59686J3326J1476R807J0127J1156J1596J2470J4551J6441J7215J8209K0515
$$ y = [51424, 54168, 55377, 55683, 55878, 55946, 56103, 57252, 59440, 61116, 61130, 60582, 61557, 64653, 68766, 72854, 76988, 81839, 87920, 95193, 102988, 110327, 116561, 121606, 125660, 129053, 132275, 135661, 139011, 141892, 144144, 145824, 147247, 149478, 153845, 160042, 165764, 169593, 173309, 179543, 187850, 195236, 200140, 203698, 207207, 210862, 215210, 221321, 228733, 235333, 240060, 243800, 247080, 249114, 250012, 251639, 254989, 258706, 261543, 264426, 268611, 273442, 277525, 280800, 284090, 287791, 292236, 298136, 305516, 313371, 321290, 330094, 339982, 349675, 358488, 367709, 378700, 391158, 404367, 418560, 433781, 448993, 463614, 478390, 493613, 508208, 521902, 536314, 552283, 568107, 582177, 595444, 609274, 622827, 634911, 646657, 659686, 673012, 684488, 694295, 704422, 715578, 727174, 739644, 754195, 770636, 787851, 806060, 826575]
56221H26575K3097K5097K7425L0505L3005L4470L6779M1290M6738N1538N5869
56210A232388O0149O3915O7596P2888P9909Q6547R2151R8976J08290J18067J26835
56199B207711J36799J50240J65274J78348J89194K00199K12052K22964K31548
56190C894329K37935K42263K43896K42003K35703K24119K07207J85954J61250
56181E874659J33380J02948P0978L8016M814k6180n2330p4023r3801j11839j25323
56170E741299j33284j38731j44401j49399j52028j53191j54650j56235j57135
56161D402245j58049j59858j61801j62897j63571j64161j63449j60356j55595
56152B952508j50251j44349j38040j32257j26947j20624j12833j04989r7812r0308
$$ y = [826575, 849672, 874769, 902194, 932699, 965704, 1000174, 1036953, 1078243, 1124981, 1176519, 1232388, 1292537, 1356452, 1424048, 1496936, 1576845, 1663392, 1755543, 1854519, 1962809, 2080876, 2207711, 2344510, 2494750, 2660024, 2838372, 3027566, 3227765, 3439817, 3662781, 3894329, 4132264, 4374527, 4618423, 4860426, 5096129, 5320248, 5527455, 5713409, 5874659, 6008039, 6110987, 6181965, 6219981, 6224795, 6198615, 6146285, 6072262, 5978461, 5866622, 5741299, 5608015, 5469284, 5324883, 5175484, 5023456, 4870265, 4715615, 4559380, 4402245, 4244196, 4084338, 3922537, 3759640, 3596069, 3431908, 3268459, 3108103, 2952508, 2802257, 2657908, 2519868, 2387611, 2260664, 2140040, 2027207, 1922218, 1824406, 1734098]
56142A734098q2393p5764p0872o5770n9450n3467m8814m4213l9220l5712l4330
56131A124093l2698k9419k6473k5268k3808k0527j7567j6914j6529j3868j0365
56120H90657q635p783n315j709P43J801K533K581J560J332L479O257P478Q457
56106I03436J1538J5528J7471J7455J7814J8798J8962J8853K0525K3786K6302
56095A110468K7087K7037K6615K5681K5013K5503K6559K7354K8495L0581L2740
56084A413133L4647L7958M3484M9212N3711N8959O6966P6181Q4517R3102J03268
56073B115138J12418J17067J17775J16781J13013J04257R2579Q2577P5296O8411
56063C115312O1347N5318M8894L8488K3525P211p853k1268l2390m0241m6081n2851
$$ y = [1734098, 1651705, 1575941, 1505069, 1439299, 1379849, 1326382, 1277568, 1233355, 1194135, 1158423, 1124093, 1091395, 1061976, 1035503, 1010235, 986427, 965900, 948333, 931419, 914890, 901022, 890657, 882022, 874239, 868924, 867215, 867958, 869759, 872292, 874873, 876433, 877765, 881244, 887501, 894979, 903436, 914974, 930502, 947973, 965428, 983242, 1002040, 1021002, 1039855, 1060380, 1084166, 1110468, 1137555, 1164592, 1191207, 1216888, 1241901, 1267404, 1293963, 1321317, 1349812, 1380393, 1413133, 1447780, 1485738, 1529222, 1578434, 1632145, 1691104, 1758070, 1834251, 1918768, 2011870, 2115138, 2227556, 2344623, 2462398, 2579179, 2692192, 2796449, 2889028, 2971605, 3046901, 3115312, 3176659, 3231977, 3280871, 3319359, 3342884, 3350095, 3342242, 3320974, 3288584, 3248343, 3202262, 3149411]
56051C149411o1918p2728q4818r7310j07432j12715j13834j12674j08960j01776
56041B175246r2773q4401p6386o7195n7406m8394l9540l0278k2802j8857j5921
56030A621293j0811m961j762p39Q27K387J562m93n08J112J075q95j900j023O4
56015A605228J011K774M391M229L707N442Q723J1021J2608J5227J7694J7867J7486
56002A727408J9927K4222K6506K6398K6835K8616L0115L1422L3847L6376L7345
55991B049017L8284M1363M4849M6003M6261M8276N0370M9771M8777N1300N5610
55980B569881N7364N7503O0149O4687O7292O8474P1591P5635P7121P7647Q1693
55969C329037Q8449R3633R7915J05466J15590J23958J30822J39722J49650J56963
$$ y = [3149411, 3087493, 3014765, 2929947, 2832637, 2725205, 2612490, 2498656, 2385982, 2277022, 2175246, 2082473, 1998072, 1921686, 1854491, 1797085, 1748691, 1709151, 1678873, 1656071, 1637214, 1621293, 1610482, 1605521, 1603759, 1603020, 1603847, 1606234, 1607796, 1607303, 1606795, 1607907, 1608982, 1608087, 1606187, 1605164, 1605228, 1606239, 1609013, 1613404, 1617633, 1621340, 1626782, 1635505, 1646526, 1659134, 1674361, 1692055, 1709922, 1727408, 1747335, 1771557, 1798063, 1824461, 1851296, 1879912, 1910027, 1941449, 1975296, 2011672, 2049017, 2087301, 2128664, 2173513, 2219516, 2265777, 2314053, 2364423, 2414194, 2462971, 2514271, 2569881, 2627245, 2684748, 2744897, 2809584, 2876876, 2945350, 3016941, 3092576, 3169697, 3247344, 3329037, 3417486, 3511119, 3609034, 3714500, 3830090, 3954048, 4084870, 4224592, 4374242, 4531205]
55959D531205J63384J73293J84703J92217J97212K05613K17209K27067K35753
55950F327656K47713K61079K70006K76055K86368L01710L17244L33639L55730
55941H977200L81629M05178M27733M55194M85390N11719N37257N70808O10524
55932A3362632O46567O78579P14640P54183P88985Q20665Q59628R06779R54270
55923B0486928J004191J067218J142204J217152J291443J376840J475771J580292
55915C0642039J693087J825854J975223K124966K274564K440339K626864K825036
55907D8427972L040795L296259L600349L950591M366484M885781N524636O278412
55899H3371279P161380Q200270R389271J0708695J2196144J3939874J5994803
$$ y = [4531205, 4694589, 4867882, 5052585, 5244802, 5442014, 5647627, 5864836, 6091903, 6327656, 6575369, 6836448, 7106454, 7382509, 7668877, 7970587, 8287831, 8621470, 8977200, 9358829, 9764007, 10191740, 10646934, 11132324, 11644043, 12181300, 12752108, 13362632, 14009199, 14687778, 15402418, 16156601, 16945586, 17766251, 18625879, 19532658, 20486928, 21491119, 22558337, 23700541, 24917693, 26209136, 27585976, 29061747, 30642039, 32335126, 34160980, 36136203, 38261169, 40535733, 42976072, 45602936, 48427972, 51468767, 54765026, 58365375, 62315966, 66682450, 71568231, 77092867, 83371279, 90532659, 98732929, 108122200, 118830895, 131027039, 144966913, 160961716]
55892A60961716J8371158K1102143K4224700K7685276L1374718L5197066L8753755
55885C57670532M0730177L8924338L1548872J8886753L581163j0887017k2106136
55878D58348682k9431782l3392026l4837163l4532689l3086238l0933823k8366436
55871B33768525k5610463k2859348k0233065j7774927j5513748j3490018j1716947
55864A06570009j0168235q821906p678396o725429n924129n243250m674278m202342
55856E3132044l794637l429923l111297k838773k595282k369929k170124j999811
55848C0822268j847588j705924j581023j474351j374048j273835j182060j103651
55840A9279788j030558r57935q92758q38170p85490p29933o79252o38684o01637
$$ y = [160961716, 179332874, 200435017, 224659717, 252344993, 283719711, 318916777, 357670532, 398400709, 437325047, 468873919, 487760672, 491341835, 480454818, 458348682, 428916900, 395524874, 360687711, 326155022, 293068784, 262134961, 233768525, 208158062, 185298714, 165065649, 147290722, 131776974, 118286956, 106570009, 96401774, 87579868, 79901472, 73176043, 67251914, 62008664, 57334386, 53132044, 49337407, 45907484, 42796187, 39957414, 37362132, 34992203, 32822079, 30822268, 28974680, 27268756, 25687733, 24213382, 22839334, 21565499, 20383439, 19279788, 18249230, 17291295, 16398537, 15560367, 14774877, 14044944, 13365692, 12727008, 12125371]
55831A2125371n62973n27930n00150m73637m44235m17094l95738l75216l52788
55822H075610l34153l22224l10445k93939k77144k64068k51015k35374k22010
55813E565238k14270k07462j97592j88118j82042j75475j65073j54259j46308
55804C934639j38531j28639j19833j14350j08877j01539r6729r7861j01393j02746
55794B824141j02260j01082r7216r0069q3258p8949p4785o9592o6208o5325o2814
55783A932583n6760n1009m8211m5425m0254l5186l2024k8211k2528j8635j8692
55772A535648j9111j6743j3854j2889j1626p964m533m227n572o487q286j2265
55760A412091j6492j9450k2740k7011k9630k9475k9511l1422l2363l0257k7698
$$ y = [12125371, 11562398, 11034468, 10534318, 10060681, 9616446, 9199352, 8803614, 8428398, 8075610, 7741457, 7419233, 7108788, 6814849, 6537705, 6273637, 6022622, 5787248, 5565238, 5350968, 5143506, 4945914, 4757796, 4575754, 4400279, 4235206, 4080947, 3934639, 3796108, 3667469, 3547636, 3433286, 3324409, 3222870, 3126141, 3028280, 2926887, 2824141, 2721881, 2620799, 2523583, 2433514, 2350256, 2271307, 2196522, 2126930, 2060722, 1995397, 1932583, 1875823, 1824814, 1776603, 1731178, 1690924, 1655738, 1623714, 1595503, 1572975, 1554340, 1535648, 1516537, 1499794, 1485940, 1473051, 1461425, 1453461, 1448928, 1444701, 1439129, 1432642, 1424356, 1412091, 1395599, 1376149, 1353409, 1326398, 1296768, 1267293, 1237782, 1206360, 1173997, 1143740, 1116042]
55749A116042k7021k6106k2767j9048j7495j7070j6155j5634j5822j4389j0738
55738I13797q224q723r170p021m855n501o655m666m95K357L154L299K780P57k074
55723H68760m540o544p751p098n202m407n002m753l494m261q197j2451j4908j6669
55709G63483j7926j6315j1886q781q999r125o377l174k474l250m284p556j3803
55696F49533j9106k0303j9785k0639k1134j8762j5722j5271j5892j4354j1642
55685D56923j0738j0997r848p959p681q171o896m503l651m179l700k009r81j023
55671C74587j083j271k320l494l887m368n666o279n037l778m550o224o849p096
55657C12685q201q863p579n831n455n137l150j235j784l268k755j093j119k280
$$ y = [1116042, 1089021, 1062915, 1040148, 1021100, 1003605, 986535, 970380, 954746, 938924, 924535, 913797, 905573, 896850, 887680, 880659, 875804, 870303, 863648, 858982, 858487, 860844, 863998, 867297, 870077, 870834, 868760, 864220, 857676, 849925, 842827, 837625, 833218, 828216, 823463, 819969, 815708, 807511, 795060, 780152, 763483, 745557, 729242, 717356, 708575, 699576, 690451, 684074, 680900, 678426, 675176, 670892, 663336, 649533, 630427, 610124, 590339, 569700, 548566, 529804, 514082, 498811, 482919, 468565, 456923, 446185, 435188, 425340, 417381, 409700, 401529, 394633, 390130, 386479, 382300, 378600, 376591, 375610, 374587, 373504, 372233, 369913, 366419, 362532, 358164, 352498, 346219, 341182, 337404, 332854, 326630, 319781, 312685, 304484, 295621, 288042, 282211, 276756, 271619, 268469, 267234, 265450, 262182, 259427, 258334, 257215, 254935]
55643B54935j664O25J717R14K28L24j74j532k575l208m120m467l046j056n25p51
55627B35625M85K988M747N674P232R041R452R002R652J0971J0635Q571O943O050
55613C37068L935M42j934j928j196j326j950k546l513m703n103m610m125l615
55599C04896k120R9J507J671J669J995K012J632J564J695J121Jm03L00J170J523
55583C20332J462Q47o65k563l908m654n379o071o485p074q127q751q238p623q197
55568B44906r266r231q204p555p519p216o609o494o933p339p660p930p363n502
55554A40085l563k920l215l505m188n784p011o291m238k479j043Q28K356K321
55540A01353J559J635J819K47k372l177j265J258K365J853J67k078l451k939j888
$$ y = [254935, 253271, 253896, 255613, 256527, 256755, 257079, 256905, 255373, 252798, 249590, 245470, 241003, 237957, 236901, 236376, 235625, 236110, 239098, 243845, 249519, 256751, 265792, 275244, 284246, 293898, 304869, 315504, 324075, 331018, 337068, 341003, 341445, 339511, 337583, 336387, 335061, 333111, 330565, 327052, 322349, 317246, 312636, 308511, 304896, 302776, 302875, 304382, 306053, 307722, 309717, 311729, 313361, 314925, 316620, 317741, 317742, 317339, 317639, 318809, 320332, 321794, 322641, 321976, 319413, 315505, 310851, 305472, 299401, 292916, 285842, 277715, 268964, 260726, 253103, 244906, 235640, 226409, 218205, 210650, 203131, 195915, 189306, 182812, 175879, 168540, 160880, 152950, 145587, 140085, 136522, 133602, 130387, 126882, 122694, 116910, 109899, 103608, 99370, 96891, 95848, 96676, 99032, 101353, 102912, 104547, 106366, 106613, 104241, 101064, 99799, 101057, 103422, 105275, 105442, 103364, 99913, 96974, 95086]
55525I5086k456m231m778l485k363k824l952m414l909k527n81O88J61j271j621
55510E7523n62N96J350K329L317L356K803K993L625K847L45j871k333j834j685
55495G2799k044k641l507m440n023n392n847n740m206j872l32r8m99j177j970
55480B8011j866p2K149K768J868J283J692K240K670L380L532J837o14j003J193
55465D9068L336L498K802L037M150N173N812O036N582M669L860K825Q02j336j350
55450I7964J296M344N471M602K885R67p81j710j707j743k773m658o469p363p208
55435H3117o881p515q673q200n176j925j237k536l086k316k194l382m050l101
55421B2845j969k196l257l895l837l306B043F51f08j850k159j773j129k96Q22
$$ y = [95086, 92630, 88399, 83621, 80136, 77773, 74949, 70997, 66583, 62674, 60147, 59566, 60254, 60415, 59144, 57523, 56961, 57557, 58907, 61236, 64553, 67909, 70712, 73705, 77330, 80177, 80522, 78651, 76318, 74484, 72799, 70755, 68114, 64607, 60167, 55144, 49752, 43905, 38165, 33959, 32087, 31755, 31657, 31158, 29981, 28011, 26145, 26073, 28222, 30990, 32858, 34141, 35833, 38073, 40743, 44123, 47655, 49492, 48878, 47875, 49068, 52404, 55902, 58704, 61741, 65891, 71064, 76876, 82912, 88494, 93163, 97023, 99848, 100650, 99314, 97964, 99260, 103604, 109075, 113677, 116562, 117529, 116748, 115038, 113331, 111588, 108815, 104157, 97688, 90325, 83117, 76236, 68721, 60048, 51848, 46672, 44747, 43510, 40974, 37888, 35572, 33378, 29996, 25946, 22845, 20876, 18680, 15423, 11528, 7691, 4385, 2043, 651, -608, -2458, -4617, -6390, -7519, -7815, -6993]
55406f993J214l40k853l724k233m38Pj91P7M31J19n76j176j892k754l015k300
55389b6637j286p11n77p35j053r17K84J929K715K483K241K364K262J758J280P45
55373a3855j18n40L08J359Q82n04n36Q42J098p83k579k308r72l30k03M03J122
55356a6714Q94k97j644k630l024k728k068j437l19J951M425N191L940K228R45
55341a1287m25j699j474M74K302K548J789R28k67j913l042k939k147j347o58l94
55325a9551r40j459o18R03Q07j394l479l736k823j612K68K567L497K228L02p55
55309b5795j343k123k489k106j999k687l094k610k239k418j889j25J294J380J510
55294d6733K799L860L200J755R18J61j161j685k82J370J117k18m28L45K31r61
$$ y = [-6993, -5779, -6119, -8972, -12696, -14929, -15367, -15360, -15551, -15474, -15043, -14924, -15500, -16676, -18568, -21322, -24337, -26637, -27923, -28634, -29211, -29946, -30999, -31916, -31632, -29703, -26988, -24505, -22264, -19900, -17638, -15880, -14600, -13855, -13973, -14513, -14205, -12846, -11964, -12468, -13004, -12162, -11064, -11847, -14426, -16734, -17706, -18036, -18239, -17836, -16714, -15820, -16117, -17761, -20391, -23415, -26143, -28211, -29648, -29967, -28016, -23591, -18400, -14460, -12232, -11287, -11712, -13411, -14885, -14411, -12109, -9561, -7772, -6844, -7111, -9024, -12066, -15005, -17152, -18499, -19157, -19551, -20491, -21950, -22568, -21665, -20858, -22252, -25731, -29467, -32290, -33902, -33634, -31067, -27570, -25342, -25040, -25795, -27138, -29261, -31750, -33856, -35855, -38542, -41636, -44246, -46485, -48903, -50792, -50917, -49623, -48243, -46733, -43934, -40074, -36874, -35119, -34201, -34040, -35201, -36886, -37168, -35798, -34681, -34899, -35327, -34982, -34751, -35712]
55278c5712j692j357o39K20J281J619L71j396j811p02P32J982L070L213J705l82
55262b9498j421j538j845k051j039P37J628J327J034J176R08p5r70j155p50k8
55246c3560N57K24j078k121k119j996k471k239r1K282K217J21j048j48R58P06
55230c9806j93n81m33N8J018J801J142q39k300k008p63P7K58K76N32J283K420
55213c8058K981K028J70r23p62m39m82M0J527K387R59j857l224j549J749L836
55197c1617L297J155o36j215r98l94O09J532J304j72j386j080n9l2j210k251k240
55180c5393j580r81o02k34K89R23J303J199J238K359L978L884J025k444l371j340
55164b9747J160J907R97j93p51p39p37j125j518j169j58N11M53N17J180J468O70
$$ y = [-35712, -37404, -38761, -39400, -39180, -37899, -36280, -35909, -37305, -39116, -39818, -39086, -37104, -34034, -30821, -29116, -29498, -30919, -32457, -34302, -36353, -37392, -36655, -35027, -33700, -32666, -31490, -30582, -30657, -31627, -32782, -33532, -33560, -33003, -32779, -33857, -35978, -38097, -40093, -42564, -44803, -44894, -42612, -40395, -40274, -41322, -41470, -40512, -39806, -39999, -40580, -41013, -40955, -39937, -38136, -36994, -37833, -40133, -42141, -42904, -42827, -42569, -42293, -41761, -40478, -38058, -35077, -33049, -32879, -33802, -34564, -35003, -35485, -35445, -33918, -31531, -30572, -32429, -35653, -37202, -35453, -31617, -28320, -27165, -27801, -29016, -30014, -30408, -29799, -28267, -26963, -27135, -28521, -29601, -29660, -29692, -30902, -33153, -35393, -36973, -37954, -38556, -38790, -38501, -37578, -36275, -35076, -33838, -31479, -27501, -23617, -22592, -25036, -28407, -29747, -28587, -26680, -25683, -25876, -26627, -27366, -28103, -29228, -30746, -31915, -32073, -31562, -31109, -30592, -29412, -27944, -27274]
55147b7274p8N79J849J827L12j167j736j772j274K66K183K675J238m49q38m38
55131b4097m39o08K03J928K959K194N61l9R59K181K072N80j269k742l479k961
55115b1997j239J90j47j431j464L4J102Q15N68J199J272k48j764j492l30j79r08
55098b6019j200j120j567k078j563m70n6j78L5J10q57j854j150N40P06j049k292
55081d0062j357O12J832K025J753J267Q26P89R07O18K06L92P09j37k008k954j643
55064c6225R69K964L499L197L161L754L995K618K06p67Q68K941K728P26m42P3
55048e735R36J645b6E094N672M016J843P80N54L74L89P48P02k76j508k110k033
55031A4245j590q11K26J148J674J679R67k65j088r02m51o25r60n95k7j80m09N09
$$ y = [-27274, -27352, -26773, -24924, -23097, -22785, -23952, -25688, -27460, -28734, -28468, -26285, -23610, -22372, -22821, -23659, -24097, -24536, -25144, -24941, -23013, -20054, -17860, -17299, -17338, -16379, -14198, -12126, -11546, -12815, -15557, -19036, -21997, -23236, -23046, -23193, -24624, -26088, -26054, -24952, -24137, -23569, -22370, -21098, -21346, -23110, -24602, -24932, -25111, -26019, -27219, -28339, -29906, -31984, -33547, -34017, -34073, -34251, -34216, -34106, -34963, -36817, -37967, -37427, -36721, -37770, -40062, -41419, -40807, -38975, -36950, -35197, -33930, -33104, -32315, -31408, -30790, -30584, -30192, -29483, -29620, -31628, -34582, -36225, -35256, -32292, -28793, -25596, -22435, -18681, -14686, -12068, -11862, -12629, -11761, -8820, -6092, -5366, -5808, -5735, -4799, -3154, -26, 5094, 10766, 14782, 16625, 17405, 17959, 18333, 18722, 19470, 20172, 19896, 18388, 16278, 14245, 12655, 11844, 12070, 13218, 14892, 16571, 17538, 17273, 16185, 15283, 14832, 14207, 13247, 12652, 12625, 12445, 12036, 12545]
55013A2545J851J741L19l15N55J235M88p63j225q87k46M14N71j09p08j54O70j9
54995A5963j721j975j67J509J567J106J245J234L95l86m82q09j925k723k333j514
54979H984r08K03J987K827J622k97j108q52n09k74j42o55j558j224R97L299L809
54962A6201L061K565K396J895J436J675J990J382R4r46j359r05Q57L224M179K985
54946D0730J445J092Q74n40k024j899j016j183j771p74J437K443J576N47K07n29
54930D0615k027k695j428O49J819J789J204M45l58r28j082q17m0J113J754J049
54914D1062n50j748j986j632q35O06K239K938K285J076K41K3K90R77J968L045
54898D9999L922M149L381K170J808K664L365K676J514J837L931O122P038O893
$$ y = [12545, 14396, 16137, 16456, 16141, 16696, 17931, 18419, 17656, 16431, 15544, 15298, 15712, 16283, 16174, 15466, 15312, 15982, 15963, 14242, 12267, 12100, 13609, 15176, 16282, 17527, 18761, 19156, 18770, 18288, 17479, 15554, 12831, 10498, 8984, 8076, 8279, 10266, 13093, 14715, 14418, 13310, 12458, 11949, 11675, 11533, 10878, 9320, 8096, 9093, 12392, 16201, 19262, 21827, 24223, 26118, 27554, 29229, 31219, 32601, 32695, 31749, 30390, 29485, 30342, 33566, 37745, 40730, 42175, 43267, 44141, 43601, 41577, 39678, 38662, 37479, 35708, 34934, 36371, 38814, 40390, 40937, 41144, 40615, 38588, 35893, 34465, 35114, 36933, 38722, 39926, 40371, 40013, 39085, 38003, 37186, 37146, 38259, 40013, 41062, 40512, 38764, 36778, 35146, 34311, 34917, 37156, 40094, 42379, 43455, 43696, 43719, 44009, 44986, 46954, 49999, 53921, 58070, 61451, 63621, 65429, 68093, 71458, 74134, 75648, 77485, 81416, 87538, 94576, 101469]
54884A01469O628P003Q564J1220J3734J4741J4511J4603J5632J6370J5392J2675
54872B52542R143N616K569J29k258n501r636j3302j5053j4832j3834j3114j2756
54859A69713j2234j1241r983q809p780o798n981n619n693n791n507m610k893m82
54845G6292J800L092L712M957P362R912J1361J1590J1238J0869J1016J2140J3702
54832A89043J4034J2066Q735N837L982K400K64k640o170r822j2629j3816j3534
54819A77750j2587j1718j1357j1528j1587j0781r422q814r313r430p761n043l209
54806E5200k855k782j885m88K65k38j399j920j208j91j32q07r31l91l41p40J72
54789C9329K730M158J972k375n330n621m589l105r38J044R46j198k799k033m5
$$ y = [101469, 108097, 115100, 123664, 134884, 148618, 163359, 177870, 192473, 208105, 224475, 239867, 252542, 261685, 267301, 269870, 269999, 267741, 262240, 252604, 239302, 224249, 209417, 195583, 182469, 169713, 157479, 146238, 136255, 127446, 119666, 112868, 106887, 101268, 95575, 89784, 84277, 79667, 76774, 76292, 78092, 81184, 84896, 89853, 97215, 107127, 118488, 130078, 141316, 152185, 163201, 175341, 189043, 203077, 215143, 223878, 229715, 233697, 236097, 236361, 233721, 227551, 217729, 205100, 191284, 177750, 165163, 153445, 142088, 130560, 118973, 108192, 98770, 89956, 80643, 71213, 63452, 58409, 55200, 52345, 49563, 47678, 47190, 47455, 47217, 45818, 43898, 42690, 42499, 42367, 41560, 40629, 40238, 39897, 39157, 39329, 42059, 46217, 48189, 45814, 40484, 34863, 30274, 27169, 26231, 27275, 28221, 27023, 24224, 22191, 22146]
54774B2146J053Q94L75k62j423k768l079j726L82J557J018k69o12M68J754J992
54758B1500J423J152J626K426L031K979J785l26k045k190j015M21J647K689L243
54743C8346L140L082L815M858N206M871M572M395M145M534O354Q691R616Q732
54729A14357P587P452Q246R676J1839J4332J6202J7140J7495J6999J4935J1794
54717B68054R029O851L935j66m079o801q900j0630j0834r208p766q127q751p181
54703B05426m116k733m186o140o226m767l234j851oK014L267L642L888M371M803
54688A94152N234O259Q050R984J1600J3190J4998J6542J7401J8090J9186K0078
54676C54764J9670J8039J6098J3723R676L789k234p005j1082j5431j9466k1880
$$ y = [22146, 23199, 24093, 24468, 24206, 22783, 20015, 16936, 15210, 15592, 17149, 18167, 17898, 17286, 17754, 19508, 21500, 22923, 24075, 25701, 28127, 31158, 34137, 35922, 35596, 33551, 31361, 30346, 30767, 32414, 35103, 38346, 41486, 44568, 48383, 53241, 58447, 63318, 67890, 72285, 76430, 80964, 87318, 96009, 105625, 114357, 121944, 129396, 137642, 147318, 159157, 173489, 189691, 206831, 224326, 241325, 256260, 268054, 277083, 283934, 287869, 287703, 283624, 276823, 267923, 257293, 246459, 237251, 229485, 221358, 212607, 205426, 201310, 198577, 194391, 188251, 182025, 177258, 174024, 172173, 172167, 174181, 177448, 181090, 184978, 189349, 194152, 199386, 205645, 213695, 223679, 235279, 248469, 263467, 280009, 297410, 315500, 334686, 354764, 374434, 392473, 408571, 422294, 431970, 435759, 433525, 426520, 415438, 400007, 380541, 358661]
54664C58661k2540k2183k0950j8781j6703j6029j6268j5473j2975j0378r305r384
54652A67692r158q216p489p698q200p631n652l686l400m420m470k311M15J177
54638I6953l35k198k836k326j376l71M56R66J357J837K013J481P65P76J481K038
54622A00681K166K212K096J341L47K62J223J845J081k11k77J362L219L298J217
54607A21862j037r19J835M805N871N704O308P936Q975Q431O915N248L652K476
54593A88062K258K700K814K280J659J284J109J620L322N229N432L629J643J081
54579B24122J884L544O070Q940J0772J1024J0818J1221J1994J3005J5250J9044
54567C47688K2479K3468K2460K1358K0225J7011J0735L208l025p311j0735j4160
$$ y = [358661, 336121, 313938, 292988, 274207, 257504, 241475, 225207, 209734, 196759, 186381, 177076, 167692, 158534, 150318, 142829, 135131, 126931, 119300, 113648, 109962, 106562, 102142, 97672, 95361, 95776, 96953, 96618, 94420, 91584, 89258, 87882, 87511, 87967, 88933, 90290, 92127, 94140, 95621, 96386, 97162, 98643, 100681, 102847, 105059, 107155, 108496, 108843, 109105, 110328, 112173, 113254, 113043, 112766, 114128, 117347, 120645, 121862, 120825, 119906, 121741, 126546, 132417, 138121, 144429, 152365, 161340, 169771, 176686, 181934, 185586, 188062, 190320, 193020, 195834, 198114, 199773, 201057, 202166, 203786, 207108, 212337, 217769, 221398, 223041, 224122, 226006, 229550, 235620, 244560, 255332, 266356, 277174, 288395, 300389, 313394, 328644, 347688, 370167, 393635, 416095, 437453, 457678, 474689, 485424, 488632, 485607, 478296, 467561, 453401]
54555D53401j7320j9603k0873k1275k0748j9181j6937j4698j2783j0994r401q592
54543B60996q731q856p828n738l784l029l732n527p511q537q116o880n627m469
54529A72631l467l365m639o428p480p655p378o346m276k427k618m735o699o923
54515I8195n515l369j412n32p35p07L01P75r23l375l608j526j9m27r70m30j82
54498G5541j158j744o98K54q41k675k540l82J326J143L6m64J34J240J705P35r04
54481G0708j399j96J243J665J650K065K509K554L065M684O227O245N155M279L848
54466A14302L507L759N101O557O906O716P483R258J0744J1197J0747R345O854
54453B12476L846J058j394l333m067l880m670p409j0127j0481r219q788r419r209
$$ y = [453401, 436081, 416478, 395605, 374330, 353582, 334401, 317464, 302766, 289983, 278989, 269588, 260996, 252265, 243409, 235581, 229843, 226059, 223030, 219298, 213771, 206260, 197723, 189607, 182727, 177100, 172631, 169164, 165799, 161160, 154732, 147252, 139597, 132219, 125873, 121597, 119170, 116552, 111817, 105118, 98195, 92680, 89311, 87899, 87367, 86632, 85925, 86226, 87001, 86078, 82703, 79095, 77569, 77550, 77123, 76153, 75723, 75541, 74383, 72639, 71941, 72195, 71354, 68679, 66139, 65757, 67083, 68226, 68262, 67798, 67932, 69172, 70877, 71612, 70708, 69309, 69113, 70356, 72021, 73671, 75736, 78245, 80799, 83864, 88548, 94775, 101020, 106175, 110454, 114302, 117809, 121568, 126669, 133226, 140132, 146848, 154331, 163589, 174333, 185530, 196277, 205622, 212476, 216322, 217380, 215986, 212653, 208586, 204706, 200036, 192627, 182500, 172019, 162800, 154012, 144593, 135384]
54439A35384p663o319n799m923l263k187k598l595m125m187l719k064M57J979
54425H7378J107j426l697m218k511N63K707J983o28j949n56J444J503N7n56N20
54409H1721J916K291J814J410J532K049K747L434L727L106J522j36o80J5P77O93
54393A07938L24O90J545J658N34j048k134k409k037j468j373k003k671k557j833
54378I3156j321j287j454j839k613l229k768j219L85J132Q73q9j177j680j456
54363G5414j235j450j337j51J305J615Q16K52O42J593K613L311L039J797J030
54348H9254J886L128K778J360J199K620L523L014K697L466L802K690J745K620
54334A25782M254M825M762N591O972P184N881M279L037J764M52k63l06l80r61
$$ y = [135384, 127721, 121402, 115603, 110680, 107417, 105230, 102632, 99037, 94912, 90725, 87006, 84942, 85399, 87378, 88485, 87059, 83362, 79144, 76633, 77196, 79903, 81886, 81258, 79309, 78753, 80197, 81700, 81757, 81201, 81721, 83637, 85928, 87742, 89152, 90684, 92733, 95480, 98914, 102641, 105747, 107269, 107133, 106453, 106468, 107245, 107938, 108262, 108952, 110497, 112155, 112689, 111641, 109507, 107098, 105061, 103593, 102220, 100217, 97546, 94989, 93156, 91835, 90548, 89094, 87255, 84642, 81413, 78645, 77426, 77811, 78943, 79816, 79727, 78550, 76870, 75414, 74179, 72729, 71392, 71241, 72546, 74161, 74977, 75229, 75871, 77464, 80077, 83388, 86427, 88224, 89254, 91140, 94268, 97046, 98406, 99605, 102225, 105748, 108762, 111459, 114925, 118727, 121417, 123162, 125782, 130036, 134861, 139623, 145214, 152186, 159370, 165251, 169530, 172567, 174331, 174783, 174520, 174214, 173834, 172873]
54319A72873k046l617n311o116n410m035l125k424j118N5o62l268n365n008l057
54304A22366j862k374l342k989r85J249J865L75j890l101k606j107L74J233J253
54289A08459N57l24o84q5J458L464M889M667K856R17K40P07J365K046L318M929
54273A38779N556M511K794J799J534Q96o57k446l551l806l600l190k714k591l273
54258A30041m380m653l429j849j798l575n391n611m660m014m011l739k916k500
54244G7515l096l803l473k400j684j402n22J152K164J216r65k462k496k003k031
54229E5710k580l194l754m156l935k800j055R83L335N491N874L401o08l221k871
54214D6620p03J246K278K816K840J716m49k192k060l04J298J312L9j175j557j378
$$ y = [172873, 170827, 167210, 161899, 155783, 150373, 146338, 143213, 140789, 139671, 139726, 139064, 135796, 130431, 125423, 122366, 120504, 118130, 114788, 111799, 110814, 112063, 113928, 114303, 112413, 109312, 106706, 105599, 105973, 107206, 108459, 109016, 108692, 108008, 107923, 109381, 112845, 117734, 122401, 125257, 126174, 126414, 127121, 128486, 130532, 133850, 138779, 144335, 148846, 151640, 153439, 154973, 155869, 155212, 152766, 149215, 145409, 141809, 138619, 135905, 133314, 130041, 125661, 121008, 117579, 115730, 113932, 110357, 104966, 99355, 94695, 90681, 86670, 82931, 80015, 77515, 74419, 70616, 67143, 64743, 63059, 61657, 61135, 62287, 64451, 65667, 64702, 62240, 59744, 57741, 55710, 53130, 49936, 46182, 42026, 38091, 35291, 34236, 35219, 38554, 44045, 49919, 53320, 52712, 49491, 46620, 45917, 47163, 49441, 52257, 55097, 56813, 56364, 54172, 52112, 51808, 53106, 54418, 54457, 53282, 51725, 50347]
54198E0347j037m82L56J170J668J907J886J393N29j51m52q84j638j955j150K75
54182E1782J337J850K080J688J61j845k817k121o05O69J415J810K029K207K216
54167F1856J524n2j528j563j45J356J783J178J55p33r30j21J223K243K743L053
54151G2042K954J803q2j325j194n52n43j178j778k092k386k714k693j948o69K13
54135E7858j34j167j212K93J627J000p52j383n45N8k56l30K32K1j562k799k173
54118D8776o67K0ML02O71K46n06l99M58R17P04N63Q14J146J584K286K616J774
54100F1309K19p85j044j494k495l314l447l230k796j623L24J873J775J17j785
54085D3604k617k083r12j01%k39n33j026j590j463k75J074J443R86Q30J313J489
$$ y = [50347, 49310, 48828, 49184, 50354, 52022, 53929, 55815, 57208, 57737, 57586, 57134, 56250, 54612, 52657, 51507, 51782, 53119, 54969, 57049, 58737, 58898, 57053, 54236, 52115, 51510, 52179, 53594, 55404, 57433, 59640, 61856, 63380, 63328, 61800, 60237, 60092, 61448, 63231, 64409, 64564, 63831, 62901, 62780, 64003, 66246, 68989, 72042, 74996, 76799, 76717, 75392, 74198, 73646, 73103, 71925, 70147, 68055, 65669, 62955, 60262, 58314, 57645, 57858, 57724, 56557, 55345, 55638, 57265, 58265, 57513, 56130, 55585, 55643, 55387, 55057, 55289, 55310, 53748, 50949, 48776, 48109, 48129, 48133, 48435, 49106, 49352, 48846, 48447, 48905, 49822, 50526, 51089, 51903, 53049, 54633, 56919, 59535, 61309, 61528, 60743, 59699, 58205, 55710, 52396, 48949, 45719, 42923, 41300, 41624, 43497, 45272, 45389, 43604, 40987, 38904, 37992, 37891, 37891, 37652, 37119, 36093, 34503, 33040, 32765, 33839, 35282, 36268, 37098, 38411, 39900]
54068C9900M49j471l057l352k480j476j191j183k37J813L558L868L295K834K114
54053D3384K09k350l884l750k851j975r83J39P74O07P7m89j184j631r30R55K697
54036B8815L177K755K351K148J977K128K733K871J615k61q48M23J931J998R77
54021E4790M77J011J494R81o8p06r41j481k334k565j591o8Q72R04O55P66J149
54004E3345J168M95k95j97R96K225K363J657J376K142L260L681K979J426j41n41
53988G5939P45K612L349K701J917J669J312O51P88K293L974M718N250O647Q148
53973A22713Q165O828N737N690O191O972Q251R516R659Q606P498P014O706O204
53959B25750N885N981O015N555M751L946L404L386L737L475J748p98k536k802
$$ y = [39900, 40349, 38878, 35821, 32469, 29989, 28513, 27322, 26139, 25902, 27715, 31273, 35141, 38436, 41270, 43384, 43593, 41243, 37359, 33609, 30758, 28783, 27800, 27939, 28713, 29320, 29397, 28908, 27724, 26093, 25163, 26118, 28815, 31992, 34747, 37098, 39246, 41223, 43351, 46084, 48955, 50570, 50309, 49461, 49884, 51815, 53813, 54790, 55267, 56278, 57772, 58753, 58685, 57979, 57038, 55557, 53223, 50658, 49067, 48999, 49871, 50775, 51430, 52196, 53345, 54513, 55008, 54713, 54516, 55512, 57737, 60100, 61757, 63133, 65275, 68535, 72216, 75195, 76621, 76480, 75939, 76684, 79296, 82645, 85346, 87263, 88932, 90244, 90895, 91683, 93976, 97950, 102668, 107918, 114565, 122713, 130878, 137706, 143443, 149133, 155324, 162296, 170547, 180063, 189722, 198328, 205826, 212840, 219546, 225750, 231635, 237616, 243631, 249186, 253937, 257883, 261287, 264673, 268410, 271885, 273633, 272835, 270299, 267497]
53945B67497k441k515l289m420n268n195m526m749o585q355p874n569l880l639
53931A99192l367k456k514m440o375o144m194k450j706j629k188l243l607k346
53917A52533n13Qr07j638j180q8P13Q98N48O1J46R56J450P04m71m17R97K224K257
53898A58281J671J239Q60M35O06J791L173L563K854J944J456J188Q16N85R43J721
53882A83126K127J782J404J921L086L777L716L834M502M678L785L316M900P500
53868B33454Q376O723M484L330K857K401K566L598L966K406L47K38K023L297K924
53853B82990K419L293M917O016O806Q252J0033J0700R538P254M957L273K339J885
53839C64672J444J079J596L144M005K124j977n222n509m121l745n038o428o716
$$ y = [267497, 265056, 262541, 259252, 254832, 249564, 244369, 239843, 235094, 228509, 220154, 212280, 206711, 202831, 199192, 195825, 193369, 190855, 186415, 180040, 173896, 169702, 167252, 165546, 163917, 161729, 158486, 154879, 152533, 152020, 152028, 151121, 149483, 148303, 148215, 148928, 149826, 150374, 150435, 150581, 151537, 152987, 153691, 153220, 152803, 153800, 156024, 158281, 159952, 161191, 162051, 162486, 163092, 164883, 168056, 171619, 174473, 176417, 177873, 179061, 179877, 180462, 181405, 183126, 185253, 187035, 188439, 190360, 193446, 197223, 200939, 204773, 209275, 213953, 217738, 221054, 225954, 233454, 241830, 248553, 253037, 256367, 259224, 261625, 264191, 267789, 271755, 274161, 274508, 274746, 276769, 280066, 282990, 285409, 288702, 293619, 299635, 306441, 314693, 324726, 335426, 344964, 352218, 357175, 360448, 362787, 364672, 366116, 367195, 368791, 371935, 375940, 378064, 376087, 370865, 365356, 361235, 357490, 352452, 346024, 339308]
53825C39308o480o863q137r789j1173j1637j0681q561o502n760o448p445p401
53812B32431n958m124l385m273n857o802o675n965n154m329l524k838k239j759
53798A69549j855k934m490n446n441n179n250n390n213m945m856m565l552j995
53784A08438n09N46R44L11j226k406j958l59M70n43k417l521l304k127k86J820
53768I3873L115K600Q47l03J51J301J755J396J066J118J160R90R27J129J281J194
53752A13600J122J334J781K344K985L533L767L827M089M521M724M668M721M875
53738A61891M726M465M818N667N855N087M802O006P372P042N475M620M693L989
53724B36508K052Q05J622L074L003J476J43m40j147k293l017k911k874l729m839
$$ y = [339308, 332828, 325965, 317828, 308039, 296866, 285229, 274548, 265987, 259485, 253725, 247277, 239832, 232431, 226473, 222349, 218964, 214691, 208834, 202032, 195357, 189392, 184238, 179909, 176385, 173547, 171308, 169549, 167694, 164760, 160270, 154824, 149383, 144204, 138954, 133564, 128351, 123406, 118550, 113985, 110433, 108438, 107929, 108475, 109419, 109730, 108504, 106098, 104140, 103781, 104251, 103708, 101291, 97770, 94466, 92339, 92053, 93873, 96988, 99588, 100435, 100132, 100283, 101584, 103339, 104735, 105801, 106919, 108079, 109069, 109996, 111125, 112406, 113600, 114722, 116056, 117837, 120181, 123166, 126699, 130466, 134293, 138382, 142903, 147627, 152295, 157016, 161891, 166617, 171082, 175900, 181567, 187422, 192509, 197311, 203317, 210689, 217731, 223206, 227826, 232519, 236508, 238560, 239365, 240987, 244061, 247064, 248540, 248683, 248243, 247096, 244803, 241786, 238875, 236001, 232272, 227433]
53709B27433m950l939k949k853l256l283k863k683l124l780m110l934l144j638
53695A80927M7O23o08k618l605k888j302M8O33L75m09q90l84P45J419J234Q34
53678A74181R17J533K394L194L529L221K843L160L967M216L399J973L49j541l406
53663B03929m294l707k310j129o29q28j612k563l110l109k702j706K5J662K067
53648A79984J539J481K004J512n43k142j322R73K174J513O22J239L489O238P988
53633B06749P711N769L877L430M146M862N118N198N271N383N661N827N030L091
53619B77123J176M27P06J508K986M864N518L879J339o5o12j945l756l887j812
53604B87449L49Q13M5r44k255l958n028m664l490k461j547m97J48q3n29k07O95
$$ y = [227433, 222483, 218544, 215595, 212742, 209486, 206203, 203340, 200657, 197533, 193753, 189643, 185709, 182565, 180927, 180974, 181597, 180989, 178371, 174766, 171878, 170576, 170624, 171257, 171632, 171223, 170333, 169949, 170694, 172113, 173347, 174181, 175098, 176631, 179025, 182219, 185748, 188969, 191812, 194972, 198939, 203155, 206554, 208527, 208876, 207335, 203929, 199635, 195928, 193618, 192489, 191860, 191032, 189420, 186857, 183747, 180638, 177936, 176230, 176255, 177917, 179984, 181523, 183004, 185008, 186520, 185977, 183835, 182513, 183486, 185660, 187173, 187795, 189034, 192523, 198761, 206749, 214460, 220229, 224106, 227536, 231682, 236544, 241662, 246860, 252131, 257514, 263175, 269002, 274032, 277123, 278299, 278726, 279432, 280940, 283926, 288790, 294308, 298187, 299526, 299461, 298849, 296904, 293148, 289261, 287449, 287798, 288611, 288656, 287712, 285457, 281499, 276471, 271807, 268317, 265856, 264309, 263812, 263960, 263877, 263348, 263141, 263836]
53587B63836J019J02j421k075p05K278M784M882K878P70k11n30p59n64L24J428
53571B76036K366L286L929L606K562K085K515K584J627Q13J036J190J91o25Q09
53556C04010L937N966N442L702K724L000L745M125M069M443O167Q642R807Q673
53542C78452O865O417O989O886O011N707O166O187N500N170N413N129M105L552
53528D58549L782L461K123J350K187L222K891K082K521L792M046K949J883J610
53514D96448J604J638K231L310L836L216K055J125N54K40K00L53N62R73J645K017
53498E22007J542P96J016K466M055M704M323L547L270M316O492Q010P024M054
53484E77622J736J886L853O034P703Q742Q845Q093P364P295P407P124O860P314
$$ y = [263836, 264855, 264957, 263536, 261461, 260756, 263034, 267818, 272700, 275578, 276348, 276137, 275607, 274848, 274284, 274608, 276036, 278402, 281688, 285617, 289223, 291785, 293870, 296385, 298969, 300596, 301409, 302445, 303635, 303826, 303201, 304010, 307947, 313913, 319355, 323057, 325781, 328781, 332526, 336651, 340720, 345163, 351330, 359972, 369779, 378452, 385317, 391734, 398723, 405609, 411620, 417327, 423493, 429680, 435180, 440350, 445763, 450892, 454997, 458549, 462331, 465792, 467915, 469265, 471452, 474674, 477565, 479647, 482168, 485960, 490006, 492955, 494838, 496448, 498052, 499690, 501921, 505231, 509067, 512283, 514338, 515463, 516017, 516257, 516457, 516810, 517372, 518345, 519990, 522007, 523549, 524345, 525361, 527827, 531882, 536586, 540909, 544456, 547726, 552042, 558534, 566544, 573568, 577622, 579358, 581244, 585097, 591131, 598834, 607576, 616421, 624514, 631878, 639173, 646580, 653704, 660564, 667878]
53470F67878Q291R224J0160J1332J2316J2689J2975J3843J4855J5237J5473J6805
53458H21078J9203K1296K2316K2823K3282K3270K2674K2448K3496K5499K7499
53447A074884K9029L0187L1180L2313L3906L5776L7267L8060L8490L8825L8846
53436A458763L8471L8163L8258L8448L8416L8468L9049L9967M0558M0394L9574
53425A888529L8583L8005L7991L7935L7255L6504L6793L7863L7843L5621L2628
53414B295550L1271L2061L3247L2998L1078K8487K6193K4348K2408J9953J7346
53403B594940J5137J2906R634N500K105K26j566m836q982j2265j4408j6450j8608
53390B563333k0207k1584k3977k7203k9321k9349k8693k8979k9927l0515l0901
$$ y = [667878, 676169, 685393, 695553, 706885, 719201, 731890, 744865, 758708, 773563, 788800, 804273, 821078, 840281, 861577, 883893, 906716, 929998, 953268, 975942, 998390, 1021886, 1047385, 1074884, 1103913, 1134100, 1165280, 1197593, 1231499, 1267275, 1304542, 1342602, 1381092, 1419917, 1458763, 1497234, 1535397, 1573655, 1612103, 1650519, 1688987, 1728036, 1768003, 1808561, 1848955, 1888529, 1927112, 1965117, 2003108, 2041043, 2078298, 2114802, 2151595, 2189458, 2227301, 2262922, 2295550, 2326821, 2358882, 2392129, 2425127, 2456205, 2484692, 2510885, 2535233, 2557641, 2577594, 2594940, 2610077, 2622983, 2632617, 2638117, 2640222, 2640448, 2638882, 2634046, 2625064, 2612799, 2598391, 2581941, 2563333, 2543126, 2521542, 2497565, 2470362, 2441041, 2411692, 2382999, 2354020, 2324093, 2293578, 2262677]
53379B262677l1783l2774l2953l2459l2116l1746l0324k7810k5370k3530k1439
53368A940373j8556j5950j4854j4610j3267j0114o557m250l198k212n10J815M408
53355A842518O872Q581R333J0175J2495J6045J9098K0944K2900K5862K8435K9047
53343B052305K8798L0186L3469L6714L9256M2546M7008N0642N2019N2566N4156
53332B519665N6343N8014O0153O4343O9360P2156P2162P2058P3760P6033P7022
53321C271069P7051P7474P8189P7935P6270P3928P1690O9823O8212O6098O2406
53310D070145N7153N1898M7687M3279L6824K8873K2025J7407J3222P286l60q248
53298D387191j5575k2464k8876l4544l9554m4098m7961n1188n4728n9269o3651
$$ y = [2262677, 2230894, 2198120, 2165167, 2132708, 2100592, 2068846, 2038522, 2010712, 1985342, 1961812, 1940373, 1921817, 1905867, 1891013, 1876403, 1863136, 1853022, 1846465, 1842215, 1839017, 1836805, 1836295, 1838110, 1842518, 1849390, 1857971, 1867304, 1877479, 1889974, 1906019, 1925117, 1946061, 1968961, 1994823, 2023258, 2052305, 2081103, 2111289, 2144758, 2181472, 2220728, 2263274, 2310282, 2360924, 2412943, 2465509, 2519665, 2576008, 2634022, 2694175, 2758518, 2827878, 2900034, 2972196, 3044254, 3118014, 3194047, 3271069, 3348120, 3425594, 3503783, 3581718, 3657988, 3731916, 3803606, 3873429, 3941641, 4007739, 4070145, 4127298, 4179196, 4226883, 4270162, 4306986, 4335859, 4357884, 4375291, 4388513, 4395799, 4395439, 4387191, 4371616, 4349152, 4320276, 4285732, 4246178, 4202080, 4154119, 4102931, 4048203, 3988934, 3925283]
53287C925283o5908o5970o6000o7476o9299o9653o8580o7477o6781o5651o3772
53276C188716o2033o1183o0823o0209n9209n8035n6590n4618n2153m9499m7068
53265B567296m5260m4028m2415l9275l4868l0982k8913k7951k6643k5007k4278
53254B197676k4647k4543k2625j9532j6998j5736j4972j3819j2370j1279j0703
53243B010452j0041q618o418l993j638J015M353P919J0700J2353J3611J5142J6546
53230B061383J7062J7038J7996K1008K5502K9858L2934L4703L5740L6395L6534
53219B366153L5941L4884L3996L3444L2428L0071K6729K3832K2154K0833J8549
53208B679014J5188J1694Q640N637K091k077o464j0417j3273j4952j6361j8625
$$ y = [3925283, 3859375, 3793405, 3727405, 3659929, 3590630, 3520977, 3452397, 3384920, 3318139, 3252488, 3188716, 3126683, 3065500, 3004677, 2944468, 2885259, 2827224, 2770634, 2716016, 2663863, 2614364, 2567296, 2522036, 2478008, 2435593, 2396318, 2361450, 2330468, 2301555, 2273604, 2246961, 2221954, 2197676, 2173029, 2148486, 2125861, 2106329, 2089331, 2073595, 2058623, 2044804, 2032434, 2021155, 2010452, 2000411, 1991793, 1985375, 1981382, 1979744, 1980759, 1985112, 1993031, 2003731, 2016084, 2029695, 2044837, 2061383, 2078445, 2095483, 2113479, 2134487, 2159989, 2189847, 2222781, 2257484, 2293224, 2329619, 2366153, 2402094, 2436978, 2470974, 2504418, 2536846, 2566917, 2593646, 2617478, 2639632, 2660465, 2679014, 2694202, 2705896, 2714536, 2720173, 2722264, 2720187, 2713723, 2703306, 2690033, 2675081, 2658720, 2640095]
53196B640095k1756k4686k6700k8247l0089l2196l3872l4492l3925l2770l2352
53185B309010l3766l6475l8536l8730l7775l6845l5865l4261l2671l2383l3212
53174A918491l3339l1674k9238k7784k7833k8585k8921k7995k5523k2224j9513
53163A615862j8059j6959j4965j2290j0521j0729j2315j3823j4455j4439j4317
53152A462990j4320j4457j4737j5078j5171j4918j4963j6312j9006k1528k2025
53141A280475k0139j7277j5106j4113j3655j3031j2323j2313j3700j6187j8422
53130A114209j9036j7932j6471j6374j8288k1177k3024k2523k0330j8368j7696
53119I02990j7573j6951j6185j6347j7320j7682j6620j4942j3940j4003j4649
$$ y = [2640095, 2618339, 2593653, 2566953, 2538706, 2508617, 2476421, 2442549, 2408057, 2374132, 2341362, 2309010, 2275244, 2238769, 2200233, 2161503, 2123728, 2086883, 2051018, 2016757, 1984086, 1951703, 1918491, 1885152, 1853478, 1824240, 1796456, 1768623, 1740038, 1711117, 1683122, 1657599, 1635375, 1615862, 1597803, 1580844, 1565879, 1553589, 1543068, 1532339, 1520024, 1506201, 1491746, 1477307, 1462990, 1448670, 1434213, 1419476, 1404398, 1389227, 1374309, 1359346, 1343034, 1324028, 1302500, 1280475, 1260336, 1243059, 1227953, 1213840, 1200185, 1187154, 1174831, 1162518, 1148818, 1132631, 1114209, 1095173, 1077241, 1060770, 1044396, 1026108, 1004931, 981907, 959384, 939054, 920686, 902990, 885417, 868466, 852281, 835934, 818614, 800932, 784312, 769370, 755430, 741427, 726778]
53108G26778j5204j5159j4434j3656j3555j3913j3733j2669j1537j1012j0736
53097E81170j0295j0224j1104j2196j2140j0831r615r503r983r932r006p776o825
53084D51740o217n787n572n701n936n645m506l109k429k715l234l253k876k736
53070C92024l153l826m136l754l126l169m141n021m713l709l550m683n975o601
53056C32467p005p328o429l747j022m11j547k252j810j656k664l712l678l142
53042B86064l062l040k185q83l42p89j330j350r88k82J041K640L490L112K227
53027B84323J742J719J894K487L648M428L459Q62j356j417K78J821K021J324Q07
53012C08040R65J438J418K34j887l699m116l471k957k903k607j998k221l830n497
$$ y = [726778, 711574, 696415, 681981, 668325, 654770, 640857, 627124, 614455, 602918, 591906, 581170, 570875, 560651, 549547, 537351, 525211, 514380, 504765, 495262, 485279, 475347, 466341, 458565, 451740, 445523, 439736, 434164, 428463, 422527, 416882, 412376, 409267, 406838, 404123, 400889, 397636, 394760, 392024, 388871, 385045, 380909, 377155, 374029, 370860, 366719, 361698, 356985, 353276, 349726, 345043, 339068, 332467, 325462, 318134, 311705, 307958, 306936, 306525, 304978, 302726, 300916, 299260, 296596, 292884, 289206, 286064, 283002, 279962, 277777, 276894, 276552, 275763, 274433, 273083, 272095, 271813, 272854, 275494, 278984, 282096, 284323, 286065, 287784, 289678, 292165, 295813, 300241, 303700, 304562, 303206, 301789, 302067, 303888, 305909, 307233, 308040, 309005, 310443, 311861, 312095, 310208, 306509, 302393, 298922, 295965, 293062, 290455, 288457, 286236, 282406, 276909]
52997B76909n675m776m410n002n457n106m543m327m196l973m069m437m157k860
52983B13921j711j911k862l005k128j556k033k618k253j326j024j655k466k817
52969A84556k753k404j640o77m49j674l621m448l093n60J022O18p64j304l61J035
52953A63483J444M12j399k997l617k849q91J206K120J483L30j9P04J723K240J985
52937A65358J055j94j019p10N55J705J795Q39m48j402j756j575j126o17n4N32
52921A62938Q55P59N73N67K24j048k458k254j05K044K372J572J688L150M325L979
52905A79181K789J991J561N85j092k398k214n87J361K532K788K781L012L243K988
52890A98521K405K411L667N540O349N112K943K188L708N740O212N492N569O832
$$ y = [276909, 271234, 266458, 262048, 257046, 251589, 246483, 241940, 237613, 233417, 229444, 225375, 220938, 216781, 213921, 212210, 210299, 207437, 204432, 202304, 200748, 198715, 196097, 193844, 192518, 191494, 189839, 187373, 184556, 181803, 179399, 177759, 177082, 176633, 174959, 171338, 166890, 163797, 163237, 164259, 164877, 164113, 162809, 162448, 163483, 164927, 165339, 163940, 160943, 157326, 154477, 153586, 154792, 156912, 158395, 158725, 158706, 159410, 161133, 163373, 165358, 166413, 166219, 165200, 164490, 165045, 166750, 168545, 169384, 168936, 167534, 165778, 164203, 163077, 162460, 162406, 162938, 163793, 164552, 165125, 165692, 165916, 164868, 162410, 160156, 160051, 162095, 164467, 166039, 167727, 170877, 175202, 179181, 181970, 183961, 185522, 186107, 185015, 182617, 180403, 179816, 181177, 183709, 186497, 189278, 192290, 195533, 198521, 200926, 203337, 207004, 212544, 218893, 224005, 226948, 229136, 232844, 238584, 244796, 250288, 255857, 262689]
52876B62689P524O640N475N316N393M528L452L577M465M521L628K986K627J377
52862C24198n32j081N11K332K406J191K34l48j554l434m822m925m176l607l940
52847C02453n044n871n375l750k253j461o44O17J310M21j255j952j171m1L21j75
52831B76130r80j468j166k03N88O46M47O81J033P50L6k15J5j98j098j664j020
52814B72314M88J948K761K543J120p67j605p71N55P64k96j538k170k163j510j70
52798B71503J276J808J183K66r6N7L15O15Q98O85k96j376j613j026m39j58L00
52781B73902J055J383R27N56J271K782L915M023L320K214J200J002J768K350J484
52766C03152k71j073l88K97j45q49o52k8k2k45N27K160L197K929K072J371Q63
$$ y = [262689, 270213, 276853, 282328, 287644, 293037, 297565, 301017, 304594, 309059, 313580, 317208, 320194, 322821, 324198, 323666, 322585, 323096, 325428, 327834, 329025, 329259, 328911, 327357, 323923, 319101, 314176, 310000, 306393, 302453, 297409, 291538, 286163, 282413, 280160, 278699, 278055, 278672, 279982, 280403, 279148, 277196, 276025, 275984, 276305, 276130, 275150, 273682, 272516, 272313, 272901, 273547, 273994, 274675, 275708, 276458, 276494, 276279, 276294, 276096, 274998, 273334, 272314, 272802, 274750, 277511, 280054, 281174, 280407, 278802, 278031, 278586, 279350, 279054, 277516, 275346, 273183, 271673, 271503, 272779, 274587, 275770, 276036, 275940, 275997, 276312, 276927, 277825, 278510, 278214, 276838, 275225, 274199, 273760, 273602, 273902, 274957, 276340, 277267, 277823, 279094, 281876, 285791, 289814, 293134, 295348, 296548, 297550, 299318, 301668, 303152, 302881, 301808, 301420, 301717, 301572, 300723, 300071, 300043, 300021, 299776, 300303, 302463, 305660, 308589, 310661, 312032, 312895]
52749C12895O60J196K152K373J434L48O1J35l55j403k430l437m704n747n686m762
52733B92730m389n426p042p736p011n552m166l138k574k699l494m352m535l974
52719B26642l287k926k691k366k406l453n245o537o315m745k886j714j517j912
52705A78642k313k511k867l655m400m272l147j739n73M69J325J255k12k175l136
52690A50691k713j917j668j703j269m58l19j568l542m781m660m045m000m158l251
52675A10639j200L72K44p59j081o69o89j482k184k351k545k997k938j914p71m52
52659H9223o72n64r3J15j38m56n66l22N41J863K473J252j208k932k821j804j459
52642H2432k169l030l013j759K95K150K846K312J441J064J066P68M6l61K94J803
$$ y = [312895, 313555, 314751, 316903, 319276, 320710, 321058, 321119, 321254, 320899, 319496, 317066, 313629, 308925, 303178, 297492, 292730, 288341, 282915, 275873, 268137, 261126, 255574, 251408, 248270, 245696, 242997, 239503, 235151, 230616, 226642, 223355, 220429, 217738, 215372, 212966, 209513, 204268, 197731, 191416, 186671, 183785, 182071, 180554, 178642, 176329, 173818, 170951, 167296, 162896, 158624, 155477, 153738, 153165, 153634, 154959, 156214, 156002, 153827, 150691, 147978, 146061, 144393, 142690, 141421, 140963, 140644, 139076, 135534, 130753, 126093, 122048, 118048, 113890, 110639, 109439, 109811, 110055, 109296, 108215, 107546, 106857, 105375, 103191, 100840, 98295, 95298, 92360, 90446, 89675, 89223, 88551, 87987, 87894, 88009, 87871, 87415, 86849, 86527, 87068, 88931, 91404, 92656, 91448, 88516, 85695, 83891, 82432, 80263, 77233, 74220, 72461, 72756, 74906, 77752, 80064, 81505, 82569, 83635, 84403, 84449, 84088, 84382, 86185]
52626H6185L059L137K314J768K173K784K338O49j065j524o21P01J479J476J250
52611A06103J518K309K778K247J239J020K061L564M603N055N178M828L661J769
52597A47933j82j277p88J179L258L626J786q44k489k843k855l186l518l325k692
52582A33783k158k079k268k389k600l512n081n909m593j761K57J93p35p69N7M63
52566A00899n5r64j853k551k475j306j75o56k291k644m52K495L570K453R28J92
52550I5115k91j243k170k163j433j080j418j423k02J552K325J685O12k1k78l14
52534H9253K58J520K625K824K514K527K968L501M033M246L202O64j799k340j079
52519A14917M41J523K460K832J651n85j907j483n61k64j31L85O37J67m2J042K890
$$ y = [86185, 89244, 92381, 94695, 96463, 98636, 101420, 103758, 104407, 103342, 101818, 101197, 101898, 103377, 104853, 106103, 107621, 109930, 112708, 114955, 116194, 117214, 119275, 122839, 127442, 132497, 137675, 142503, 146164, 147933, 147751, 146474, 145686, 146865, 150123, 153749, 155535, 154691, 152202, 149359, 146504, 143318, 139800, 136475, 133783, 131625, 129546, 127278, 124889, 122289, 118777, 113696, 107787, 103194, 101433, 101690, 101883, 101148, 100379, 100436, 100899, 100844, 99880, 98027, 95476, 93001, 91695, 91520, 90864, 88573, 85929, 85477, 87972, 91542, 93995, 94923, 95115, 94824, 93581, 91411, 89248, 87815, 86735, 85317, 83894, 83692, 85244, 87569, 89254, 89866, 89845, 89567, 89253, 89511, 91031, 93656, 96480, 98994, 101521, 104489, 107990, 112023, 116269, 119471, 120135, 118336, 115996, 114917, 115358, 116881, 119341, 122173, 123824, 123239, 121332, 119849, 119288, 119024, 118893, 119278, 119915, 120082, 120040, 121082, 123972]
52502A23972M359N088M998L645J496N64K005L937L597J050j158j691j665k134
52488A48063k461j856p15L66J566K832L246K400J445J559K118J706M15j69P74
52473A61289K354L475M135M695M800L836K047L86n35o78m2J297K604K851K048
52458A94562J407J693K191J940J284J175J461J185L77K10J100J942J705P74Ro64
52442B12351j816l247l983l431j995p63o96j767k684k069j91J166Q74k39p16l06
52426A90488K63O15R34J264J439J538J739J926J861J539J005K64l31j74O26J122
52410B06118Q14L55L20K01m98j124r55o09j025j636j040P02J972J751O65k13l78
52393B05420L46J783K983K925K016J832K993M284M270L026J740J269J403J204
$$ y = [123972, 128331, 133419, 138417, 142062, 143558, 144122, 146127, 150064, 153661, 154711, 153553, 151862, 150197, 148063, 145602, 143746, 143031, 143397, 144963, 147795, 151041, 153441, 154886, 156445, 158563, 160269, 160684, 160515, 161289, 163643, 167118, 171253, 175948, 180748, 184584, 186631, 187017, 186482, 185804, 185762, 187059, 189663, 192514, 194562, 195969, 197662, 199853, 201793, 203077, 204252, 205713, 206898, 207275, 207485, 208585, 210527, 212232, 213006, 213015, 212351, 210535, 207288, 203305, 199874, 197879, 197116, 196420, 194653, 191969, 189900, 189709, 190875, 191749, 191510, 190794, 190488, 190751, 191366, 192300, 193564, 195003, 196541, 198280, 200206, 202067, 203606, 204611, 204875, 204544, 204370, 204996, 206118, 206932, 207287, 207607, 207808, 207310, 206186, 205231, 204622, 203597, 201961, 200921, 201623, 203595, 205346, 206011, 205798, 205420, 205766, 207549, 210532, 213457, 215473, 217305, 220298, 224582, 228852, 231878, 233618, 234887, 236290, 237494]
52379B37494J1j553j843k03J767K003P06n5N65J153M81n67m60P72J810J797R41
52362B44819j70r87j094n03L22R38J153P86j46r30o92L19P97R0r12j045k11R06
52344B43440J637J371j93k201k897j580K96P81l33j601j754o83Q84J955J857R51
52328B41930M88J256K681L734M155M312M273L779K854J933J539K115L640N167
52314B83856N411M249K976K464K090J150L69Q61K195K887K418J634J295J378J680
52299C16913K056K069J375M87K98Q40J338J500J844K664L472L685L227K491K240
$$ y = [237494, 237505, 235952, 234109, 233906, 235673, 237676, 238382, 238327, 238892, 240045, 240526, 239959, 239499, 240271, 242081, 243878, 244819, 244649, 243662, 242568, 242065, 242387, 243325, 244478, 245264, 245118, 244188, 243496, 243815, 244612, 244702, 243790, 242745, 242534, 243440, 245077, 246448, 246255, 244054, 241157, 239577, 239873, 240654, 240321, 238720, 236966, 236283, 237167, 239122, 240979, 241930, 242418, 243674, 246355, 250089, 254244, 258556, 262829, 266608, 269462, 271395, 272934, 275049, 278689, 283856, 289267, 293516, 296492, 298956, 301046, 302196, 302565, 303426, 305621, 308508, 310926, 312560, 313855, 315233, 316913, 318969, 321038, 322413, 322900, 323198, 324038, 325376, 326876, 328720, 331384, 334856, 338541, 341768, 344259, 346499]
$$ [...]
##END NTUPLES=NMR SPECTRUM
##END=
