
##TITLE=AC1114_Huila2_5835470_OSrS25wEln
##JCAMPDX= 6.0         $$ Bruker NMR JCAMP-DX V2.0
##DATA TYPE= NMR SPECTRUM
##DATA CLASS= NTUPLES
##ORIGIN= BRUKER
##OWNER= Administrator
$$ 1.72 TOPSPIN		Version 2.1
$$ 2012-03-28 11:07:47.046 -0500  Administrator@TOPSPIN
$$ Compression mode = diff/dup
##.OBSERVE FREQUENCY= 400.13188235
##.OBSERVE NUCLEUS= ^1H
##.ACQUISITION MODE= SIMULTANEOUS (DQD)
##.ACQUISITION SCHEME= undefined
##.AVERAGES= 8
##.DIGITISER RES= 22
##SPECTROMETER/DATA SYSTEM= spect
##.PULSE SEQUENCE= zg30
##.SOLVENT NAME= COFFEE_meoh
##.SHIFT REFERENCE= INTERNAL, COFFEE_meoh, 1, 14.98061
##AUDIT TRAIL= $$ (NUMBER, WHEN, WHO, WHERE, PROCESS, VERSION, WHAT)
$$ ##TITLE= Audit trail, TOPSPIN		Version 2.1
$$ ##JCAMPDX= 5.01
$$ ##ORIGIN= Bruker BioSpin GmbH
$$ ##OWNER= Administrator
$$ $$ C:\Bruker\TOPSPIN/data/COFFEE/nmr/AC1114_Huila2_5835470_OSrS25wEln/20/pdata/1/auditp.txt
$$ ##AUDIT TRAIL=  $$ (NUMBER, WHEN, WHO, WHERE, PROCESS, VERSION, WHAT)
(   1,<2012-03-28 03:21:50.046 -0500>,<Administrator>,<TOPSPIN>,<go>,<TOPSPIN 2.1>,
      <created by zg
	started at 2012-03-28 03:20:43.484 -0500,
	POWCHK enabled, PULCHK disabled,
       configuration hash MD5:
       1A 1E CE 29 27 FD 77 03 67 4E F0 E3 C4 B2 CB 90
       data hash MD5: 64K
       73 B8 41 77 76 84 0D FF 3A F4 08 5E 3C 35 ED 0F>)
(   2,<2012-03-28 03:21:54.484 -0500>,<Administrator>,<TOPSPIN>,<proc1d>,<TOPSPIN 2.1>,
      <Start of raw data processing
       efp LB = 0 FT_mod = 6 PKNL = 1 PHC0 = 0 PHC1 = 0 SI = 32K 
       data hash MD5: 32K
       A9 18 89 35 C5 A3 CB 1C 3D 18 0C 27 BE 4A E1 04>)
(   3,<2012-03-28 03:21:54.796 -0500>,<Administrator>,<TOPSPIN>,<proc1d>,<TOPSPIN 2.1>,
      <pk PHC0 = 210.8276 PHC1 = 0 
       data hash MD5: 32K
       FF 89 4B 8C B4 C5 85 A8 AA 4F C1 58 0F B5 BE 58>)
(   4,<2012-03-28 03:21:54.859 -0500>,<Administrator>,<TOPSPIN>,<proc1d>,<TOPSPIN 2.1>,
      <abs ABSG = 1 
       data hash MD5: 32K
       FE EA 78 06 A2 BC 2B 56 29 1E D2 10 E7 F0 75 40>)
(   5,<2012-03-28 03:21:54.890 -0500>,<Administrator>,<TOPSPIN>,<proc1d>,<TOPSPIN 2.1>,
      <abs ABSG = 2 
       data hash MD5: 32K
       3A 0A 50 63 5F 0C E7 E5 75 92 DB D9 77 F4 A9 28>)
(   6,<2012-03-28 03:21:54.921 -0500>,<Administrator>,<TOPSPIN>,<proc1d>,<TOPSPIN 2.1>,
      <abs ABSG = 3 
       data hash MD5: 32K
       20 64 5E 8D 54 A1 62 91 8F 0F 55 24 12 FF DC 51>)
(   7,<2012-03-28 03:21:54.953 -0500>,<Administrator>,<TOPSPIN>,<proc1d>,<TOPSPIN 2.1>,
      <abs ABSG = 4 
       data hash MD5: 32K
       CE 7E 9B 3F 75 F3 0F 9F 44 F0 2A FB DF D8 70 1A>)
(   8,<2012-03-28 03:21:54.984 -0500>,<Administrator>,<TOPSPIN>,<proc1d>,<TOPSPIN 2.1>,
      <abs ABSG = 5 
       data hash MD5: 32K
       68 58 BF 35 F8 7F B5 B5 CF 1F AE 8A 82 50 89 2D>)
(   9,<2012-03-28 03:21:59.515 -0500>,<Administrator>,<TOPSPIN>,<audit>,<TOPSPIN 2.1>,
      <user comment:
       ICON-NMR User ID: COFFEE
       data hash MD5: 32K
       68 58 BF 35 F8 7F B5 B5 CF 1F AE 8A 82 50 89 2D>)
$$ [...]
150 150 150 150 150 150 150 150
##$TP07= 0
##$TPNAME0= <>
##$TPNAME1= <>
##$TPNAME2= <>
##$TPNAME3= <>
##$TPNAME4= <>
##$TPNAME5= <>
##$TPNAME6= <>
##$TPNAME7= <>
##$TPOAL= (0..7)
0.5 0.5 0.5 0.5 0.5 0.5 0.5 0.5
##$TPOFFS= (0..7)
0 0 0 0 0 0 0 0
##$TUNHIN= 0
##$TUNHOUT= 0
##$TUNXOUT= 0
##$USERA1= <user>
##$USERA2= <user>
##$USERA3= <user>
##$USERA4= <user>
##$USERA5= <user>
##$V9= 5
##$VALIST= <valist>
##$VCLIST= <CCCCCCCCCCCCCCC>
##$VD= 0
##$VDLIST= <DDDDDDDDDDDDDDD>
##$VPLIST= <PPPPPPPPPPPPPPP>
##$VTLIST= <TTTTTTTTTTTTTTT>
##$WBST= 2048
##$WBSW= 25
##$XGAIN= (0..3)
0 0 0 0
##$XL= 0
##$YL= 0
##$YMAX_a= 530494
##$YMIN_a= -652445
##$ZGOPTNS= <>
##$ZL1= 120
##$ZL2= 120
##$ZL3= 120
##$ZL4= 120
##$ABSF1= 14.98061
##$ABSF2= -5.57192
##$ABSG= 5
##$ABSL= 3
##$ALPHA= 0
##$AQORDER= 0
##$ASSFAC= 0
##$ASSFACI= 0
##$ASSFACX= 0
##$ASSWID= 0
##$AUNMP= <proc_prof1d_extract_pilot.lims>
##$AXLEFT= 0
##$AXNAME= <>
##$AXNUC= <1H>
##$AXRIGHT= 0
##$AXTYPE= 0
##$AXUNIT= <>
##$AZFE= 0.1
##$AZFW= 0.1
##$BCFW= 0
##$BC_mod= 0
##$BYTORDP= 0
##$COROFFS= 0
##$CY= 15
##$DATMOD= 1
##$DC= 0
##$DFILT= <>
##$DTYPP= 0
##$F1P= 0
##$F2P= 0
##$FCOR= 0.5
##$FTSIZE= 32768
##$FT_mod= 6
##$GAMMA= 0
##$GB= 0
##$INTBC= 1
##$INTSCL= 1
##$ISEN= 128
##$LB= 0
##$LEV0= 0
##$LPBIN= 0
##$MAXI= 10000
##$MC2= 0
##$MEAN= 0
##$ME_mod= 0
##$MI= 0
##$NCOEF= 0
##$NC_proc= -8
##$NLEV= 6
##$NOISF1= 0
##$NOISF2= 0
##$NSP= 0
##$NTH_PI= 0
##$NZP= 0
##$OFFSET= 14.98061
##$PC= 1
##$PHC0= 210.8276
##$PHC1= 0
##$PH_mod= 1
##$PKNL= yes
##$PPARMOD= 0
##$PPDIAG= 0
##$PPIPTYP= 0
##$PPMPNUM= 2147483647
##$PPRESOL= 1
##$PSCAL= 4
##$PSIGN= 0
##$PYNMP= <proc.py>
##$REVERSE= no
##$SF= 400.13
##$SI= 32768
##$SIGF1= 0
##$SIGF2= 0
##$SINO= 400
##$SIOLD= 32768
##$SPECTYP= <>
##$SREGLST= <1H.CDCl3>
##$SSB= 0
##$STSI= 32768
##$STSR= 0
##$SW_p= 8223.68421052632
##$SYMM= 0
##$S_DEV= 0
##$TDeff= 65536
##$TDoff= 0
##$TI= <>
##$TILT= no
##$TM1= 0
##$TM2= 0
##$TOPLEV= 0
##$USERP1= <user>
##$USERP2= <user>
##$USERP3= <user>
##$USERP4= <user>
##$USERP5= <user>
##$WDW= 1
##$XDIM= 32768
##$YMAX_p= 467932101
##$YMIN_p= -805392
##$CURPLOT= <Network HP LaserJet P1505>
##$CURPRIN= <$Network HP LaserJet P1505>
##$DFORMAT= <normdp>
##$LAYOUT= <+/1D_H.xwp>
##$LFORMAT= <normlp>
##$PFORMAT= <normpl>
##$SURQMSG= 1
$$ End of Bruker specific parameters
$$ ---------------------------------
##NTUPLES= NMR SPECTRUM
##VAR_NAME=  FREQUENCY,     SPECTRUM/REAL,   SPECTRUM/IMAG
##SYMBOL=    X,             R,               I
##VAR_TYPE=  INDEPENDENT,   DEPENDENT,       DEPENDENT
##VAR_FORM=  AFFN,          ASDF,            ASDF
##VAR_DIM=   32768,         32768,           32768
##UNITS=     HZ,            ARBITRARY UNITS, ARBITRARY UNITS
##FACTOR=    0.250966925370066, 1,           1
##FIRST=     8223.43324360095, -63618,       -183222
##LAST=      0,             -125290,         -37099
##MIN=       0,             -805392,         0
##MAX=       8223.43324360095, 467932101,    0
$$ Real data points
##PAGE= N=1
##DATA TABLE= (X++(R..R)), XYDATA
$$ [...]
19472a45613A48416b11769J5385h3982q3103h0444C59547f6068j02242A93965
19461A20224M8164d51390F9751b10860q5556J13291b05D4434c49055a31755C2564
19449a158j9885H4970a55292E2583a58468j6984d6007j79219O2380A44148B5730
19437C13551a42968c0760l45407h5641P447B55428I7900b88727C96754A56977
19426c34424D5968b07237L0919j10658h6388d1073j27978N9073J7788j63862J18816
19415a37236N0901j20868c1983k1852r6194N6855j65260E2235i1689d1866k7505
19404f9371m11946c5325q606j27236j57545J43982B42991C0750a5497H5433R4411
19393A79844a1121j52093C5734h9597K9820b4667B5695b12656a8129k17009k2241
$$ y = [-145613, 148416, -211769, -196384, -83982, -167085, -80444, 359547, -66068, -168310, 193965, 120224, 168388, -451390, 69751, -210860, -296416, -183125, -205, 44434, -349055, -131755, 32564, -1158, -21043, 84970, -155292, 52583, -158468, -175452, -46007, -225226, -162846, 144148, 25730, 313551, -142968, -30760, -376167, -85641, -78194, 255428, 97900, -288727, 396754, 156977, -334424, 45968, -207237, -176318, -286976, -86388, -41073, -169051, -109978, -92190, -256052, -137236, -86335, -207203, -31983, -53835, -150029, -93174, -258434, 52235, -91689, -41866, -69371, -481317, -35325, -43931, -171167, -328712, -184730, 242991, 30750, -15497, 85433, 179844, -11121, -163214, 35734, -89597, -59777, -24667, 25695, -212656, -18129, -235138, -257379]
19382b57379J7280n2544f1215D42525B0030I580a62516n2424r8881J22129e8529
19370c99156D54898a66839k59857B03511c03042i4898H4951a92488N726P0359
19360a16403K0923m51591H7051a56312A71308a26930l5602j49270J02520h3729
19349a49264I2624h6464A29993c12931C1524c21251A5808a6734k06955P6745A91205
19337c10707J36455A92824b2096j03381b3931I4258b23512C0994a57447P1523
19327h5924A10138a33243B24057a72042D7720b35430r3395H0249k738E42J79953
19316A80495I369g8967j77824j18709a59537j74876E8509h1009k44992C6142K14224
19305B50366H3278m0539F587K75821d5243l5600A159M4413j7934J30391b18699
$$ y = [-257379, -240099, -292643, -61215, 442525, 20030, 9580, -162516, -214940, -313821, -191692, -58529, -399156, 454898, -166839, -426696, 203511, -303042, -94898, 84951, -192488, -186762, -116403, -95480, -547071, 87051, -156312, 171308, -126930, -162532, -311802, -209282, -83729, -149264, 92624, -86464, 129993, -312931, 31524, -321251, 15808, -16734, -223689, -146944, 191205, -310707, -174252, 192824, -22096, -125477, -23931, 94258, -223512, 30994, -157447, -85924, 110138, -133243, 224057, -172042, 47720, -235430, -328825, 80249, 77511, 542, 180495, 9369, -78967, -256791, -375500, -159537, -334413, 58509, -81009, -326001, 36142, 250366, 83278, 42739, 6587, 282408, -45243, -80843, 1159, 45572, 27638, 158029, -218699]
19293a69356A4324a13692A84989b403n2516A9350J21712b10198J01570C46357
19282b16983g5077n8033A01911b71677G8837a07088b8158r1455a0393F6498b05
19270a54931I8529a43394a5620l24149n0878A2317b55765G6107K9956d38217b6048
19258c8075j26292L4948G962c1439j50165j81776a44922n3009j42320C11142A266
19246e5260j02124K8912l2124k6069M4757f9149k83675n0806e9499G6705J23618
19235B00323F2737g9932H6748b12552H2485a41569F7481a71747A95701M5920b2015
19223b82776j51781J77974OB06323a24626C4627b38601i6558C04636d5278m18169
19212d63447b09100A30627b31556e4007E427J03751a40713o9013N4981J7235H1827
$$ y = [-169356, 14324, -113692, 184989, -2403, -54919, 19350, 141062, -210198, -108628, 346357, -216983, -75077, -133110, 101911, -271677, 78837, -107088, -28158, -119613, -10393, 66498, -205, -154931, 98529, -143394, -15620, -339769, -390647, 12317, -255765, 76107, 106063, -438217, -26048, -38075, -164367, -129419, 7962, -31439, -181604, -363380, -144922, -197931, -340251, 311142, 1266, -55260, -157384, -128472, -160596, -186665, -141908, -69149, -352824, -403630, -59499, 76705, 200323, 62737, -79932, 86748, -212552, 82485, -141569, 67481, -171747, 195701, 241621, -22015, -282776, -434557, -256583, -256577, 206323, -124626, 34627, -238601, -96558, 304636, -45278, -463447, -209100, 130627, -231556, -54007, 5427, 109178, -140713, -209726, -154745, -137510, 81827]
19200b01645a7866A4370k459a85924h7905C6902R2600a70541A97262q5253b2438
19188e6159P04j14623d132A37037j9012m2728e5019J9406P22L657E8688d68072
19175c72702a46431L1635d9820A29652d75l857j11798q5625E4547d5727C9661
19163a16079C8907j4681b1843q3964A28890b4058j5606k4382L1796j05407l86127
19152e23784K271J42687B2594c5515B93712h9204r6137A55026p0933j6156f5187
19140a01511E3864b28306J3914Q6875A17049C5632a6540j15321B03857b93622
19129e4188l8353A64973f6511k37994B07943c06721B66738j2730j15866c77962
19118b66792h7149B03953E6537b10192F3578A6592c95434g7220C7860i1950A35663
$$ y = [-201645, -17866, 14370, 11911, -185924, -87905, 36902, 129502, -170541, 197262, 112009, -22438, -56159, -55455, -170078, -4132, 137037, 118025, 75297, -55019, -35613, -34891, -31234, 58688, -468072, -372702, -146431, -114796, -49820, 129652, -475, -4332, -116130, -201755, 54547, -45727, 39661, -116079, 38907, 24226, -21843, -105807, 128890, -24058, -39664, -64046, -32250, -137657, -523784, -521513, -378826, 22594, -35515, 293712, -89204, -185341, 155026, 84093, 67937, -65187, -101511, 53864, -228306, -214392, -127517, 117049, 35632, -16540, -131861, 203857, -293622, -54188, -92541, 164973, -66511, -304505, 207943, -306721, 266738, 254008, 138142, -377962, -266792, -87149, 203953, 56537, -210192, 63578, 16592, -395434, -77220, 37860, -91950, 135663]
19106A57717c39712a08562l81897b18119J1868i7843j07344j6256j38655Q5722
19096b74376K6915J13363J4986j75021J20775f2023p1788a3924r7341a4088j37747
19085a51835G7567O1940l3279b49450g5614o9579j3060c3907m8037m5762D8428
19073f5725j56845E9028i0789H5531a79465g5082F4732c1412l23535A82979p762
19062A75217a14670B73369B2141a54932a2285D5304f8037l7624k746B2481K8011
19051E0492n527a8304j00090l55205B9526J37977o66a57984A16681e3498A39989
19039I6614J0596f562A00660d3655A89487g4626j20192A31068A3189c56391H749
19027d90856i5137J7390I1423a90095A7373a83457C1336N5267a1602m11899a20031
$$ y = [157717, -339712, -108562, -490459, -218119, -206251, -97843, -205187, -221443, -360098, -274376, -247461, -134098, -119112, -294133, -173358, -62023, -133811, -13924, -111265, -14088, -151835, 77567, 139507, 106228, -249450, -75614, -145193, -158253, -33907, -81944, -127706, 48428, -65725, -222570, 59028, -90789, 85531, -179465, -75082, 64732, -31412, -354947, 182979, 175217, -114670, 273369, 22141, -154932, -12285, 45304, -68037, -105661, -108407, 22481, 50492, 44965, -18304, -118394, -473599, 29526, 167503, 166837, -157984, 116681, -53498, 139989, 96614, 107210, -6562, 100660, -43655, 189487, -74626, -194818, 131068, 13189, -356391, 8749, -490856, -95137, -77747, 91423, -190095, 17373, -183457, 31336, 86603, -11602, -423501, -120031]
19015b3098A96174B7423K95989a6064A25356i1458r8051C96288a30094L5442A43841
19003a83678A31115a18614D0754b09200A32968c3401j31975p3173A22733c958
18992G9686h9588b2905C39694A02729a44962A08074a05807H4235L8094B3690N0839
18981G4529d39772A21479K4014K1953h6690l16313A95971c65284C76027a62223
18970G3025B3400K25266K5827c2586A01125b50832Q5654j46915J04278A76896
18959B73327Q6984O837P9675m7303L1084E0243a57029G98a6781r9999a9904m3481
18947f3385o8534n4705A68131l9872b34906j34116J46201J03635m3779b47m918
18936e165p4262k24577L6749B71255b99994I9466l0470c6393E3298J94360b33745
$$ y = [-23098, 196174, 27423, 323412, -16064, 125356, -91458, -189509, 396288, -130094, -94652, 143841, -183678, 131115, -118614, 40754, -209200, 132968, -33401, -165376, -238549, 122733, -3958, 79686, -89588, -22905, 339694, 102729, -144962, 108074, -105807, 84235, 122329, 23690, 74529, -439772, 121479, 145493, 167446, -86690, -403003, 195971, -365284, 376027, -162223, 73025, 23400, 248666, 274493, -32586, 101125, -250832, -165178, -312093, -207815, 176896, 273327, 360311, 367148, 446823, 399520, 430604, 50243, -157029, 798, -16781, -116780, -19904, -63385, -131919, -186624, 168131, 128259, -234906, -369022, -222821, -119186, -162965, -247, -5165, -79427, -304004, -267255, 271255, -299994, 99466, 68996, -36393, 53298, 247658, -233745]
18924f9503o8668D9247b33135D2470c65004a07570C59861j71770A0791f5073r4606
18913a59679a7925m0728B46872H9880e2405p1287e6454j29108N552g8979j33307
18902b12286A24744l9024b7938j23216c6077B66757A25704J47958K32214A39795
18891D63372B17271E3719a9144j10436B08631c32176N5161f6323C09472A12822
18880b61062P2627A15435b17658H3141c4589n8560F6971a85718O0914k79788d9446
18868a58076A14413f52810f185j0556B17336d440m5279A97780a18567b3818l52739
18857c76557D2621J22988c46393C8505L14787i2835p2317A31303n952a41669C9659
18845G1818P7232H444N8058g2427j7043b8101l5663A60865e07602c9651B49958
$$ y = [-69503, -138171, 49247, -233135, 42470, -365004, -107570, 359861, 188091, 10791, -65073, -159679, -17925, -58653, 246872, 89880, -52405, -123692, -56454, -185562, -180010, -78979, -212286, 124744, 85720, -27938, -151154, -36077, 266757, 125704, 273662, 505876, 139795, 463372, 217271, 53719, -19144, -129580, 208631, -332176, -277015, -66323, 309472, 112822, -261062, -188435, 115435, -217658, 83141, -34589, -93149, 66971, -185718, -124804, -404592, -49446, -158076, 114413, -652810, -6185, -16741, 217336, -4440, -49719, 197780, -118567, -23818, -376557, 42621, 165609, -346393, 38505, 353292, -92835, -165152, 131303, 125351, -141669, 39659, 71818, 149050, 8444, 66502, -72427, -89470, -28101, -63764, 160865, -507602, -39651, 249958]
18833b7865o322C1775b04811b2405k20471A03704a24500D888J04334i4725m02129
18822d96854h5904p1212I103d79927K04767J14109k7363A30372b63532i3174c252
18810a19182D780K87160a12430k84598E8209a61329N6342A33467g7275j2171l2775
18799a22221A17125A2724a16870l8918D88994h0643H7556K02141A12498b66347
18788g3071p290G7502a75222j58214J35099b0419H3222a9110E6027r165K4115
18777G0977b60994o9331h3052a4989A31337k490b64134f8303P677G6411b09222
18765a00614B14103F4791b3767k27004p5010a10889a1179C3334b6213m1671m81402
18754e49286H9484d8819k07501Q4563M1341C0012R8202a58093M4034C9534a13777
$$ y = [-27865, -34187, 31775, -204811, -22405, -242876, 103704, -124500, 4888, 109222, -94725, -496854, -85904, -157116, 9103, -479927, -275160, -161051, -188414, 130372, -263532, -93174, -3252, -119182, 4780, 291940, -112430, -397028, 58209, -161329, -104987, 133467, -77275, -89446, -122221, 117125, 12724, -116870, -155788, 488994, -80643, 87556, 289697, 112498, -266347, -73071, -80361, 77502, -175222, -333436, -198337, -20419, 83222, -19110, 56027, 46862, 70977, -260994, -330325, -83052, -14989, 131337, 128847, -264134, -68303, -60626, 76411, -209222, -100614, 214103, 64791, -23767, -250771, -325781, -110889, -11179, 33334, -26213, -67884, -549286, 89484, -48819, -256320, -171757, -130416, 30012, 128214, -158093, -114059, 39534, -113777]
18742f0447J3031A44968a33067q6758D11602b63677A49579p3231f67299b66457
18731a17152q588E6643b45450I2432a95929k59658K19132A50120J3398c59427
18720d99693g9240N891l53742a18602Q328j74150L0285m1578J30189j95026a35756
18708A10575d5988q7738p218e353F0305p700a63129l8595N7986F991L1356R5253
18696A33600O7248E041J51012f3353A83292d70283A12569l2445f4608Q403F2499
18684A97443C3673a90852A93333J71733e5441j32799D2414b94315d4798k34545
18674b79343h0426A81533b74138H0000a7877h50B91186g1112m19937G8935N2002
18663A30937D212c27926P2890D9079L3450a05565k88111a8176A796a03500A03207
$$ y = [-60447, -47416, 144968, -133067, -219825, 411602, -263677, 149579, 76348, -667299, -266457, -117152, -125740, 56643, -245450, 92432, -195929, -455587, -236455, 150120, 163518, -359427, -499693, -79240, -73349, -427091, -118602, -110274, -284424, -254139, -295717, -165528, -360554, -135756, 110575, -45988, -133726, -140944, -5353, 60305, 52605, -163129, -201724, -143738, 6991, 38347, 133600, 200848, 5041, 156053, -63353, 183292, -470283, 112569, 80124, -64608, -56205, 62499, 197443, 33673, -190852, 193333, 365066, -55441, -188240, 42414, -294315, -44798, -279343, -80426, 181533, -274138, 80000, -17877, -850, 291186, -71112, -491049, 78935, 130937, 4212, -327926, -255036, 49079, 82529, -105565, -393676, -18176, 1796, -103500, 103207]
18651i0815c8831j44554L2537k1571C37093A29738n7741c89947a55673r2792M6661
18640b01804M1299N3916A29863b02057m5886A42048E464a56398I0409c40843D18295
18628a63414B22180c17935d2543a6567D9847a46280f4057D1641c05769a05253
18617d5356a4262B43671p992a85026H5759J53418f1833q9289k19703d7859A45667
18605a6140j78131d0590n4636a7621m5722m919k2570c1768k610B5563a62044A6002
18592A15716n6221a73769I3317a19071J5422r3844j00255B36730A7716K34488
18582B52204a2814j90522J4034j5642B6048a27518B30087H574c41453E7957b5694
18570D9718a52581A69791a01749l5256B69208a96582M3234P836L341A70027c35213
$$ y = [-90815, -38831, -183385, -150848, -172419, 337093, 129738, 71997, -389947, -155673, -248465, -201804, -160505, -106589, 129863, -202057, -247943, 142048, 5464, -156398, 90409, -340843, 418295, -163414, 222180, -317935, -42543, -16567, 49847, -146280, -64057, 41641, -305769, -105253, -45356, -14262, 243671, 235679, -185026, 85759, 239177, -61833, -151122, -370825, -47859, 145667, -16140, -194271, -40590, -95226, -17621, -63343, -68262, -90832, -31768, -34378, 25563, -162044, 16002, 115716, 59495, -173769, 93317, -119071, -103649, -197493, -297748, 236730, 17716, 252204, -12814, -203336, -189302, -204944, 26048, -127518, 230087, 8574, -341453, 57957, -25694, 49718, -152581, 169791, -101749, -137005, 269208, -196582, -153348, -145512, -142171, 170027, -335213]
18558a14430A17672b20442b3707k7958n0245J6915H631c61196J41538Q639g1619
18546A1332c0652A33186b73559Q5487d081j15861J9931A05669c27782c9342l48983
18535c88325d4656F0407Q9348K18052a97398J1575B27553a92490A27320d05503
18524d2748j69608i4226B49418c05615J41857A35950K7427E7889b29328e0103
18513a30970p4238B46961c36593B70667j05553f4548K9185H6560a61019A59486
18502F3392J53852c14174J37457l075j67679O2076J23163j15687a5321a056j1320
18491a2376j72466A07490m9886c770j86908h2503l55537a77161D6277J4929d90777
18479C32658H6874d5768I8224h996k15070i7920B10866c8356A66178a16624k07387
$$ y = [-114430, 117672, -220442, -23707, -51665, -101910, -84995, 8631, -361196, -219658, -211019, -71619, 11332, -30652, 133186, -273559, -188072, -4081, -119942, -100011, 105669, -327782, -39342, -388325, -44656, 60407, 149755, 367807, -197398, -185823, 227553, -192490, 127320, -405503, -42748, -212356, -94226, 249418, -305615, -163758, 135950, 163377, 57889, -229328, -50103, -130970, -205208, 246961, -336593, 270667, 165114, -64548, -35363, 86560, -161019, 159486, 63392, 217244, -314174, -176717, -179792, -347471, -285395, -162232, -277919, -15321, -1056, -12376, -184842, 107490, 57604, -3770, -190678, -82503, -438040, -177161, 46277, 61206, -490777, 332658, 86874, -45768, 98224, -8996, -224066, -97920, 210866, -38356, 166178, -116624, -324011]
18468c24011C03959D2211c74371A35244a4551D4020J76650a77807M9296j29979
18458b58490C75580b57816j22122M8545B4954M9163b22972B6992a06362C8152
18447F2717f7295j28958P9625L9197k05012I6358b24763B32305c61500C9069h1934
18435c09728a4317j39027e3769A77985b70350p8501A22635J27701A21477a19934
18424a44199K6496J3215j16625e8624H8819d2418p4323J9871j01619f0477k5180
18413h5657C81889a64628B02583f3841C2554a20738j44160A370c7079A07859b34282
18401A09103K0935l4650q525e23050h3635F0386J69997h1195F5943a41172J8144
18390a23028q2264b4443I4044e8048K1899q574A06603K09029a59621c4617C40950
$$ y = [-324011, 303959, 42211, -374371, 135244, -14551, 44020, 220670, -177807, -128511, -258490, 375580, -257816, -379938, -331393, 24954, 74117, -222972, 26992, -106362, 38152, 62717, -67295, -196253, -116628, -77431, -282443, 96358, -224763, 232305, -361500, 39069, -81934, -309728, -14317, -153344, -53769, 177985, -270350, -348851, 122635, 250336, 121477, -119934, -144199, -117703, -104488, -221113, -58624, 88819, -42418, -116741, -96870, -198489, -60477, -85657, 381889, -164628, 202583, -63841, 32554, -120738, -264898, 1370, -37079, 107859, -234282, 109103, 130038, 95388, 86863, -523050, -83635, 60386, 230383, -81195, 65943, -141172, -123028, -205292, -24443, 94044, -58048, -36149, -44723, 106603, 315632, -159621, -34617, 340950]
18378A514g5364A9795K62965A04216O0545c52043C8209f0928F401d21291f9138
18366B7764J69730b06925i8240D6494h0184A71780a77210n2974a08951F740K23352
18355B30092G3325R4819O2476j09098E6673e6415A54161L7608a57034a6395A86041
18343E9302d7352m893k0811j39345a01185l8421D9200b97122A23416c8149a5120
18331d6563A0871J90879H4310g375H2904a34350j06515d7165K275k47418F1894
18319a27934o8103B6382M2162a64693A3179f2265H5267O1855J84558i9782d1040
18307g9137b9014j55645A15262n719a09073j9007N9390F6113h7488o6696A41522
18295G6675l8117a0235p731q0540b647l71740a1721G4533J39000a86588M2817
$$ y = [1514, -75364, 19795, 282760, 104216, 164761, -352043, 38209, -60928, 6401, -421291, -69138, 27764, 197494, -206925, -98240, 46494, -80184, 171780, -177210, -230184, -108951, 6740, 230092, 73325, 168144, 230620, 121522, 56673, -56415, 154161, 191769, -157034, -16395, 186041, 59302, -47352, -52245, -73056, -212401, -101185, -139606, 49200, -297122, 123416, -38149, -15120, -46563, 10871, 201750, 84310, -7375, 82904, -134350, -240865, -47165, -44890, -292308, 61894, -127934, -196037, 26382, 68544, -164693, 13179, -62265, 85267, 147122, 331680, -99782, -41040, -79137, -29014, -184659, 115262, 109543, -109073, -128080, -68690, 66113, -87488, -154184, 141522, 76675, 38558, -10235, -17966, -98506, -2647, -374387, -11721, 74533, 213533, -186588, -143771]
18284a43771A24085K5652b04190a1223I3791e4395B58590q6492j2296b5442B80099
18272F9518J65572B8642m824J8447e7750q2392q89B38716F7058J07394m5883a54028
18259a02482B5965b8759I0961M3437l8360B2965a2859G0847k9929K73718c521
18247a12027A22360n7536b0416r6477A36903J45752h2028D8474b13429B35369
18236I476a12057C0585b32756A28536b11922B16271b99051a4896A15129M4031
18226A59160a4313B47189g5969j61403a12722A18640a88718B21312a13143D3798
18215A16562c39356B1705Q28Q5840D9008a06898c5576k26793C35059a17296I7670
18203A6344f6480B4560a82084r1361E68760a11030c9968B03800g9579j20482k0376
$$ y = [-143771, 124085, 149737, -204190, -11223, 93791, -54395, 258590, 172098, 159802, -25442, 280099, 69518, 235090, 28642, 23818, 42265, -57750, -140142, -141031, 238716, 67058, 174452, 128569, -154028, -102482, 25965, -28759, 90961, 134398, 96038, 22965, -12859, 70847, 40918, 314636, -3521, -112027, 122360, 64824, -20416, -116893, 136903, 282655, -82028, 48474, -213429, 235369, 9476, -112057, 30585, -232756, 128536, -211922, 216271, -299051, -14896, 115129, 159160, -14313, 247189, -75969, -237372, -112722, 118640, -188718, 221312, -113143, 43798, 116562, -339356, 21705, 22533, 108373, 49008, -106898, -35576, -262369, 335059, -117296, 97670, 16344, -66480, 24560, -182084, -273445, 568760, -111030, -39968, 203800, -79579, -200061, -220437]
18192b20437P4827k591j03633p4059a41404m2518B3413e6895c789I3814b33574
18180a04157L7380E0105b03238H4118p793P9815b41568B24659k9906C3119a19648
18168a23259B17056b1348k36836D3236J2505K14484E151M9687r821Q7671N4356
18157A87044b69522E787K02070b61437K777a14653j03477a2368j09424d4658D4835
18145i6361o8523A47781a5280I7998h6596k27482c6731B49268a21632K612I1851
18133A9483b04466P7595K8987k20249E0317M00323e015G9911B529J61620a48704
18121a78000o2573G4332b69062B14538b39509C53294b9400j19108B59109b67753
18110E5647a01536B0931M99916j85912c5971C1140b06486A95698h233j94492g6206
$$ y = [-220437, -145610, -148201, -251834, -325893, -141404, -183922, 23413, -56895, -3789, 93814, -233574, -104157, -66777, 50105, -203238, 84118, 76325, 156140, -241568, 224659, 194753, 33119, -119648, -123259, 217056, -21348, -258184, 43236, 55741, 270225, 5151, 54838, 45017, 132688, 187044, -269522, 5787, 207857, -261437, -258660, -114653, -218130, -12368, -121792, -44658, 44835, -96361, -164884, 147781, -15280, 97998, -86596, -314078, -36731, 249268, -121632, -119020, 91851, 19483, -204466, -126871, -97884, -318133, 50317, 450640, -5015, 79911, 2529, 164149, -148704, -178000, -240573, 74332, -269062, 214538, -239509, 353294, -29400, -148508, 259109, -267753, 55647, -101536, 20931, 520847, 334935, -35971, 31140, -206486, 195698, -8233, -202725, -76206]
18098i6481j68041g1164B48223a15883d4461H6105c702A68151a1868k14925M7800
18087a78993A25538a25127L0855p8287N5989G7480e9483C07513c64417d2286l71416
18076d13702a62029j54829b6373o1706b6848j33943d6648B3211a45890d1455k73134
18065c14589a24121B2672a16507E1956K50557C0045K1406j3353n571m200a37781
18053F651b22273A67479a32787p3560f1379k12465A73660g5259F2183N0884K52086
18042C65153D9962c85991D8701g1036A49938c11044A68047o0414c41074a50454
18031d9038M717J2742j38452k8767A52758b0966A89249c17190A89510H9218a56456
18019a56597o758Q0868H1343K9431B2645R3884a66354C24129j48587a67558A47532
$$ y = [-96481, -264522, -71164, 248223, -115883, -44461, 86105, -3702, 168151, -11868, -226793, -178993, 125538, -125127, -94272, -172559, -116570, 77480, -59483, 307513, -364417, -42286, -413702, -162029, -316858, -26373, -88079, -26848, -160791, -46648, 23211, -145890, -41455, -314589, -124121, 22672, -116507, 51956, 302513, 30045, 51451, 38098, 32527, 28327, -137781, 6651, -222273, 167479, -132787, -206347, -61379, -273844, 173660, -75259, 62183, 113067, 365153, 49962, -385991, 48701, -71036, 149938, -311044, 168047, 107633, -341074, -150454, -49038, -44321, -31579, -170031, -198798, 152758, -20966, 189249, -317190, 189510, 89218, -156456, -156597, -163355, -82487, 81343, 110774, 22645, 116529, -166354, 324129, 175542, -167558, 147532]
18007D9003N4989N2168J74943a90629A17315a31412k44628I0475K53830j281f9708
17995e6091B4841b75596J20934B63R3557l653b29340A86871f3136I5993g1614
17983F6660M1107b70835d2672D7768d9083G6028b58117j3409A99598p6182b33984
17971a36725K3695c553j00025A95076f4431A53352B7652J14629b51289a8544A18180
17959h536A22645a02996B29890b77144f7682B93821A32906E5619A1458J39774
17949A51232B538h4761I6903J05235k7045D742a05813C61484F1238L6612K4467
17938A22317b55435A91154o9370a72318j3064f5134B11837c2664A86376N6351
17928B42727D1619J34942J68329c07198A77543o7063b23738A08917j5718b8112
$$ y = [49003, 103992, 156160, 331103, -190629, 117315, -131412, -376040, 90475, 344305, 343024, -69708, -56091, 24841, -275596, -154662, 263, 93820, 90167, -229340, 186871, -63136, 95993, -71614, 66660, 107767, -270835, -42672, 47768, -49083, 76028, -258117, -271526, 199598, 123416, -233984, -136725, -113030, -3553, -103578, 195076, -64431, 153352, 27652, 142281, -251289, -18544, 118180, -8536, 122645, -102996, 229890, -277144, -67682, 293821, 132906, 55619, 11458, 151232, 2538, -84761, 96903, 202138, 175093, 4742, -105813, 361484, 61238, 97850, 122317, -255435, 191154, 121784, -172318, -185382, -65134, 211837, -32664, 186376, 242727, 41619, 176561, 344890, -307198, 177543, 110480, -223738, 108917, 93199, -28112]
17917b67220g634j18967n1114K9771b7187B01534a67A6972b99680B28442p0974
17906A57468F1531a50168I4427B9374K38369C0660J35899g0858A94502k5255c10169
17894b2375q1386B7448J14085A2963N09989F8574a86167A07175c7228D404A853
17882D29675C8362O7573p613a28045e4099k2480A02108b35897R351A84588O2230
17871B46818A681J3924P9960a66957A9889J843J80843H9970g1045j1851b0147
17859A38369b43808J17091f1466o315j13494A05114P83O7616D1481J89289r841
17848B20929H0908R8234i362E7809J46806c2792j66671j2418D01513a92943d1967
17836A4198N5413l4370J25268L9632g4375A8970J92793J13869a45717B74368r3631
$$ y = [-267220, -7634, -126601, -177715, -147944, -27187, 201534, -167, 16972, -299680, 228442, 157468, 61531, -150168, 94427, 29374, 267743, 30660, 166559, -70858, 194502, 169247, -310169, -22375, -103761, 27448, 141533, 12963, 522952, 68574, -186167, 107175, -37228, 4404, 1853, 429675, 38362, 105935, 98322, -128045, -54099, -76579, 102108, -235897, -226546, 184588, 246818, 1681, 15605, 95565, -166957, 19889, 21732, 202575, 89970, -71045, -82896, -20147, 138369, -243808, -126717, -61466, -67781, -181275, 105114, 105897, 173513, 41481, 230770, 220929, 80908, 179142, -9362, 57809, 204615, -32792, -199463, -211881, 401513, -192943, -41967, 14198, 69611, 35241, 160509, 200141, -74375, 18970, 211763, 325632, -145717, 274368, 180737]
17825A80737e1163C3946c54110a3340I011J18042a19006M3516A44112e1807A99136
17813e28095b41210B92266b77051C58079e5576I9818A4286J65159J58398o3980
17803B73863j13588m4999P9730g7976B51427b8006o103C0527c23573A10796e4346
17791B72439C9586g3905A20656b50850F28178D4285a53888A30992a88133C85976
17780A35335a568q4280A37391J73821g0870b9913p368p920A54804b32177A40900
17768a07195A47472J15959b87837A17604K2877f6405H0454P5799L2157j7355b8641
17756F5842b90746R6208f3457b2424F5197a52372J9494r0333n3366R2846a5400
17744a88661B67423D8395N7771K30555a72446c7228C2550M364N5794J46123L0571
$$ y = [180737, -51163, 33946, -354110, -13340, 9011, 127053, -119006, -75490, 144112, -51807, 199136, -528095, -241210, 292266, -277051, 358079, -55576, 99818, 14286, 179445, 337843, 273863, 160275, 115276, 195006, -77976, 251427, -28006, -34109, 30527, -323573, 110796, -54346, 272439, 39586, -73905, 120656, -250850, 628178, 44285, -153888, 130992, -188133, 385976, 135335, -1568, -85848, 137391, 311212, -70870, -29913, -37281, -45201, 154804, -232177, 140900, -107195, 147472, 263431, -287837, 117604, 140481, -66405, 80454, 156253, 188410, 171055, -28641, 65842, -290746, -194538, -63457, -22424, 65197, -152372, -132878, -223211, -276577, -183731, -15400, -188661, 267423, 48395, 106166, 336721, -172446, -37228, 32550, 36914, 92708, 238831, 269402]
17733B69402b4601m5808D06474D4825J47197b41696K4142B03390Q4038b11804
17722A08837B8258a7906B11376J45347E9688J89650A4214L88956A52931h482C02338
17710C02546d4009p9690D12163A4658N9827J41089A2841L4751K00214B6519J59121
17699A85640n9216J31492E2026R4203J52466B5766M9930K12257J4396D9490r155
17688D0335a10544A33388b27263I2485b7362B18250l7214J0874r2556d328E1472
17676D3819b24859A07214O9794a28239I0172a97197D32852a0235n6490B91059
17665A31581J62b59081B96561E3434K95963C0785b00526A35969J3772J9889G3625
17653A22498a09822M7895A63335k6108a4230j61713C39943E390K00669F5342K9817
$$ y = [269402, -24601, -70409, 406474, 44825, 192022, -241696, -217554, 203390, 287428, -211804, 108837, 28258, -17906, 211376, 356723, 59688, 249338, 14214, 403170, 152931, -8482, 302338, 302546, -44009, -123699, 412163, 14658, 74485, 215574, 12841, 47592, 247806, 26519, 185640, 126424, 257916, 52026, 146229, 298695, 25766, 75696, 287953, 302349, 49490, 40335, -110544, 133388, -227263, 92485, -27362, 218250, 181036, 191910, 99354, -4328, 51472, 43819, -224859, 107214, 177008, -128239, 90172, -197197, 432852, -10235, -66725, 291059, 131581, 131743, -259081, 296561, 53434, 349397, 30785, -200526, 135969, 149741, 169630, 73625, 122498, -109822, -61927, 163335, 137227, -14230, -175943, 339943, 5390, 206059, 65342, 95159]
17642I5159K61624j57205n4221C7870J61824q6101e7658q1866M5241H9611q190
17631H1421J96200l8011d2961j37396A52419F8003f2904J0211B36214e1284B05227
17619A16572A3375O8645c1225F5838J20244h1279E6001d3475l984B98749B7754
17607C6925L0871c2207A74412E652J45719K1767l1757M90579d9833B67236G1167
17595h8968b3357A82644i2988E3886K9465K44352A39081D7027k1080J19231E8868
17583B56293k9093d3543B74082Q8578C2584G922L54190f0129A00467O5833q1522
17572H4778B8699K33609n1459m3594C8539O6372J40397l8701K52311e5679a2426
17560B87973m5634b31897j09863I2707C508R0860J72885G4014K46717p3842n0990
$$ y = [95159, 356783, 199578, 145357, 37870, 199694, 113593, -57658, -139524, -94283, 89611, 81421, 277621, 239610, -42961, -180357, 152419, 68003, -62904, -52693, 236214, -51284, 205227, 116572, 13375, 82020, -31225, 65838, 186082, -81279, 56001, -43475, -47459, 298749, 27754, 36925, 67796, -32207, 174412, 5652, 151371, 173138, 141381, 631960, -49833, 267236, 71167, -88968, -23357, 182644, -92988, 53886, 83351, 327703, 139081, 47027, 25947, 145178, 58868, 256293, 227200, -43543, 274082, 362660, 32584, 7922, 362112, -60129, 100467, 166300, 84778, 28699, 262308, 210849, 167255, 38539, 104911, 245308, 206607, 458918, -55679, -12426, 287973, 242339, -231897, -341760, 92707, 3508, 94368, 267253, 74014, 320731, 246889, 195899]
17549A95899b86130C33852K6996m2776e2359B21091k4001R8386k6922o9755l8174
17538A60625H155K26855j4565L8562B6978M47931j74481o5584a11550E79290B63792
17526A91710L20546d5012r0140F0293L04728k0655j01616K07780j69285n7047
17516B24198a48384D42589j82308j16979L75228k38375M19449K95943k872j51635
17506H41040k15909j33230N902l4422f8655D97924p8116j26830j45042L49291
17496D97227j81331M65082l48301Q7006K96151j54817J50848l62154B22497K20301
17486D42798p2378p1747A34495O3768J44622J43239j17162J132O3294A25780L34369
17475D60149j22376n8063M4276A40870J72746O8160A11979K55338F9470Q3081
$$ y = [195899, -286130, 333852, 360848, 318072, -52359, 221091, 197090, 295476, 268554, 198799, 160625, 8155, 235010, 220445, 259007, 26978, 474909, 300428, 234844, -111550, 579290, 263792, 191710, 512256, -45012, -135152, 60293, 365021, 344366, 242750, 450530, 281245, 224198, -148384, 442589, 260281, 143302, 518530, 280155, 699604, 995547, 992675, 841040, 625131, 491901, 497803, 463381, -68655, 497924, 419808, 292978, 147936, 497227, 315896, 780978, 432677, 519683, 815834, 661017, 811865, 449711, 222497, 442798, 370420, 298673, 134495, 198263, 342885, 486124, 368962, 370094, 433388, 125780, 460149, 337773, 279710, 323986, 140870, 313616, 381776, 111979, 367317, 69470, 152551]
17465A52551n7424M31441A62574L89772c329B75262r0967J58603I1867M4689J78916
17454C15472K66400B51495J53646I7734J9333K09399o7712H6751J07609o2824
17444A31536A4168K73398p0456K67525B41776k496J61129l2255A33218J42181
17434B75399J21766J57765o2825m4704j42635J4189j51259L26159n3785A490N23160
17423E24650l3295B40165M10380j38411j68269A34826K40568K32906B04203h561
17412C54828A71016I040P67185k94675j74748r0528J59535L38836B79378J38179
17402D17557L6478k0614P9425B42162I1247P6141K64651j70844J0333L6997J24722
17391D33247g3626B33205J0319K96033G7856B840M68c1575A88668a61838A14883
$$ y = [152551, 95127, 526568, 162574, 552346, -3329, 275262, 184295, 342898, 91867, 136556, 315472, 581872, 251495, 405141, 97734, 117067, 326466, 258754, 86751, 194360, 131536, 14168, 287566, 217110, 484635, 241776, 239280, 400409, 368154, 133218, 275399, 397165, 554930, 492105, 447401, 304766, 318955, 167696, 493855, 440070, 1490, 524650, 491355, 240165, 650545, 512134, 343865, 134826, 375394, 608300, 204203, -8561, 354828, 171016, 9040, 776225, 481550, 306802, 216274, 375809, 714645, 279378, 417557, 454035, 433421, 512846, 242162, 91247, 167388, 432039, 261195, 271528, 308525, 433247, -73626, 233205, 243524, 539557, 77856, 2840, 3308, -31575, 188668, -161838, 114883]
17379E11930k42651L3463E8856j5606p614e9375A83716a02104C56115k2425r7225
17368B36465J23469m2444j12519M2485J6052p2357K63902g704C20233m8685j34452
17357A37096Q8954p4261L18723B18835n677r2099L33407j22683K6630J30262j24763
17346C63912K3580k0238A28670J43386g9600D73960a12856B87324J71205a01925
17335G5023J61229o5895G2727k4887R7996B7952M43715A15049L62384k37942L6410
17324B75901O5808R2332j68853J30765M33677A23401i5313E0884J50610R6131
17314B97625A42808K53033j42620A07468G033K34268A00225L20698A67145e5068
17303B66042L019A02369m1087J38236o9741k5288J49945a64076A15571K84128
$$ y = [511930, 269279, 302742, 58856, 43250, 35636, -59375, 183716, -102104, 356115, 333690, 236465, 359934, 317490, 204971, 247456, 263508, 191151, 455053, -7704, 320233, 271548, 137096, 226050, 151789, 470512, 218835, 213158, 121059, 454466, 331783, 358413, 488675, 363912, 387492, 367254, 128670, 272056, -79600, 473960, -112856, 287324, 458529, -101925, 75023, 236252, 170357, 72727, 47840, 145836, 27952, 471667, 115049, 477433, 239491, 275901, 341709, 434041, 265188, 395953, 829630, 123401, -95313, 50884, 201494, 297625, 142808, 395841, 253221, 107468, 7033, 241301, 100225, 420923, 167145, -55068, 266042, 269061, 102369, 61282, 199518, 129777, 104489, 254434, -164076, 115571, 399699]
17293C99699L7362j80482M5441J27895E4187K42386N7769j04502P5767H9229K93994
17282C83223K01452b07297B0577L75453A0248L75714O3891o4228j10783K995m9878
17271B27959l6800P0751D0074K68993N1806G7860K49417O0515j68405K27695A52265
17259A58794M63609j74134N6859k1784A82541a35802D29627A29716M47411B45131
17248D51561k17122J1791N9989o1440L35514c5139E6981O2738L87217A42698C3249
17236D2291N47614A80337M19365k96993n6941j17587l3899L1582K62443r4832
17226B93475l107N860O0217Q9135R4451B25827O5107j31548J15434j2485J81492
17215D43827B05493r351L30548B60583n8604l1817J48226J63421A47807J81293
$$ y = [399699, 437061, 256579, 302020, 429915, 54187, 296573, 354342, 249840, 325607, 89229, 383223, 584675, -207297, 20577, 396030, 10248, 385962, 449853, 385625, 274842, 277837, 227959, 191159, 261910, 40074, 309067, 360873, 77860, 327277, 387792, 219387, 447082, 152265, 158794, 622403, 448269, 505128, 483344, 182541, -135802, 429627, 129716, 577127, 245131, 451561, 234439, 246230, 306219, 244779, 580293, -35139, 56981, 119719, 506936, 142698, 33249, 42291, 589905, 180337, 599702, 302709, 245768, 128181, 94282, 125864, 388307, 293475, 290368, 296228, 356445, 445580, 540031, 225827, 290934, 159386, 274820, 262335, 443827, 205493, 196142, 526690, 260583, 201979, 170162, 318388, 481809, 147807, 329100]
17205C29100K19986J6099j61711J04608L2901A11455M71942k19581K4144j49118
17195B38842M49120B91386j23770M03962B07644K20679J84493k85847M0481O1678
17185D29128k2978A92019K46881A22236J13970J90816N4246P0800n2836j58671
17175C40561O3558j46880J72129A99627K58073E8477M04203j70927F3554R8770
17165A62324J80316A56495K87675A28834N26871B67088J36047J0578o7759j26709
17155B19245L94536E3603M65780J19139k61397N2198r8325J09243K39787k99207
17145C80821K35398J2283k31808j08241J78666j24501K64029K01264l71565B00988
17134C94231L59300j16581l09836r3932K31836r3366L41636k41411K19355J75917
$$ y = [329100, 549086, 565185, 403474, 508082, 540983, 111455, 583397, 363816, 387960, 238842, 687962, 291386, 167616, 571578, 207644, 428323, 612816, 326969, 367450, 429128, 406150, 192019, 438900, 122236, 236206, 427022, 481268, 552068, 499232, 340561, 404119, 257239, 429368, 199627, 457700, 58477, 462680, 291753, 63554, 162324, 342640, 156495, 444170, 128834, 655705, 267088, 403135, 413713, 345954, 219245, 613781, 53603, 519383, 638522, 377125, 429323, 330998, 440241, 680028, 380821, 616219, 628502, 396694, 288453, 467119, 342618, 606647, 807911, 436346, 200988, 394231, 753531, 636950, 327114, 233182, 465018, 371652, 713288, 471877, 691232, 867149]
17124H67149C33166j05213L16582J26401p5347J21698j53477Q6134k33477J70847
17114E87314E91O13545B31249L02661B26578O0872L32215l3931q4210l3642L65382
17103H33264l61576J66981j22314j53734J71333j27974M014R7609k526L22723
17093H27800B83720M67948k30759o2551l1004A44524J20828K25614j42645J67466
17083E15787J10450k5889j8732K2977p4531Q141j62196K72807j82013P9393L2992
17072E79186J03159K01834D40861J38761J83050C20217N50247j60865J59983r4132
17062G75450K23777k84104j05124k57682K59062J07888j0044M9799j80724J23530
17052G01828J26816j68530J88371J81134j32939l35423k48366L00494K79435L04
$$ y = [867149, 333166, 227953, 544535, 670936, 595589, 717287, 563810, 649944, 416467, 587314, 591, 614136, 231249, 533910, 226578, 287450, 619665, 585734, 501524, 467882, 833264, 471688, 638669, 516355, 362621, 533954, 405980, 409994, 507603, 505077, 827800, 283720, 751668, 520909, 458358, 427354, 144524, 265352, 490966, 348321, 515787, 626237, 600348, 581616, 604593, 530062, 538203, 376007, 648814, 466801, 546194, 579186, 682345, 884179, 440861, 579622, 762672, 320217, 870464, 709599, 869582, 775450, 999227, 715123, 609999, 352317, 611379, 719267, 709223, 759022, 578298, 701828, 828644, 660114, 848485, 1029619, 896680, 561257, 312891, 613385, 892820, 893124]
17042H93124l06391j0234L90335k12551Q2925L4174p9474P7713j03822K68819
17032A034618j12470n0690J86320j96746O3924j41991K87075l28851J41713L1183
17022I14085J32535k61085L48444l47815r3972K69781l83944N70072l82498J3100
17012G78703Q6083M92732o22225J33777J34017l41342L62148l64121L33645L26524
17002A319941n61136J27474J56J7773O9514k94402K90911J68153p5571J54030
16992A216843n50744O50126l63532k23634L90606K7676J13804j89398k28535n904
16982H37308K01722k36223N90237k27677j83269M7331M40526n08820R8008k32106
16972H27037K41462j35035J77318N4354r5952K20153m29224K28940L56773l29046
$$ y = [893124, 586733, 576499, 966834, 754283, 837208, 871382, 791908, 869621, 765799, 1034618, 922148, 871458, 1057778, 861032, 924956, 782965, 1070040, 741189, 882902, 914085, 1046620, 785535, 1133979, 786164, 692192, 961973, 578029, 1148101, 765603, 778703, 864786, 1357518, 735293, 869070, 1003087, 661745, 1023893, 659772, 993417, 1319941, 758805, 886279, 886435, 904208, 973722, 679320, 970231, 1138384, 1062813, 1216843, 666099, 1316225, 952693, 729059, 1119665, 1147341, 1261145, 1071747, 843212, 837308, 1039030, 802807, 1393044, 1165367, 982098, 1029429, 1469955, 961135, 1059143, 827037, 1068499, 933464, 1110782, 1165136, 1069184, 1289337, 860113, 1089053, 1445826, 1116780]
16962A116780j63190N30998l47302n7653J28303K15999r0670n3657J64534J5377
16952A459519p0719k8920L2807J46884j58354k03051N07597m47792Q4698J39154
16942A461823L33665m56222L03700k0496j36982o9121J7415l9446N25475m47094
16932A472717M7206J65612q4319j2490K52180m86085K45259J73899o7977r0072
16922A615930m616J85736k27923l7417M83278m68872J07674L62619m47678M19925
16912A988656J56683j42009n9647J65887Q5767k21194J16324m44028N66809l35745
16902A877503J90986k73877K33063K3388K01812J04238o0455O9637K25881j28623
16892B463553m1455J79968k58113M24612k36874m42088Q69332l14367J26127R3000
$$ y = [1116780, 953590, 1484588, 1137286, 1079633, 1207936, 1423935, 1333265, 1279608, 1444142, 1459519, 1388800, 1359880, 1392687, 1539571, 1381217, 1178166, 1685763, 1237971, 1322669, 1461823, 1795488, 1339266, 1642966, 1622470, 1485488, 1416367, 1433782, 1394336, 1919811, 1472717, 1519923, 1685535, 1601216, 1588726, 1840906, 1354821, 1600080, 1773979, 1706002, 1615930, 1611314, 1797050, 1569127, 1531710, 2014988, 1546116, 1653790, 2016409, 1568731, 1988656, 2145339, 2003330, 1943683, 2109570, 2195337, 1974143, 2090467, 1646439, 2213248, 1877503, 2068489, 1794612, 2027675, 2051063, 2252875, 2357113, 2296658, 2366295, 2592176, 2463553, 2422098, 2602066, 2343953, 2768565, 2531691, 2089603, 2958935, 2644568, 2770695, 2863695]
16882B863695j83529n17070P39989M01460o76589J32893o4543p9342L35910j22205
16872B830669k8403J74208j53059K67039j0697N6581R1006k33668L00605N2219
16862C346500j40773M3558l8049L25825m48373M12648R6016r344O9079O2452J2411
16851C731950J30541m24673K80244K04813J36182m84349M28036J39979k37515
16842C905208M50674M7894j23892P143M93405k11456N5638M0376j03358N93704
16832E155336m66771L57449o5552N30181l16725K7589N2557J80745q255l9490
16822E407064K50519L38559j74138O6045L81242j93524M75213j84916O12220k32249
16812F746035J66531l92068L97150K41181j213R4613K90401J55582K65218J18749
$$ y = [2863695, 2680166, 2163096, 2903085, 3304545, 2627956, 2760849, 2696306, 2616964, 2952874, 2830669, 2802266, 2976474, 2823415, 3090454, 3079757, 3136338, 3227344, 2993676, 3294281, 3346500, 3205727, 3249285, 3211236, 3537061, 3088688, 3501336, 3597352, 3588008, 3657087, 3719539, 3731950, 3862491, 3437818, 3718062, 3922875, 4059057, 3574708, 4002744, 4142723, 3905208, 4355882, 4403776, 4279884, 4287027, 4780432, 4568976, 4624614, 4664990, 4561632, 5155336, 4688565, 5046014, 4980462, 5510643, 5193918, 5221507, 5274064, 5454809, 5446554, 5407064, 5657583, 5996142, 5822004, 5888049, 6269291, 6075767, 6550980, 6366064, 6978284, 6746035, 6912566, 6520498, 6917648, 7158829, 7157616, 7252229, 7542630, 7698212, 7963430, 8082179]
16802H082179L05545j94077O5563K75973L92779p6194K19724K64836L29520l054
16792I662794J00136M92325J22349M2889L39222L40207M33516J50456M85478L6525
16782A2205897J56524N87274K15794M78802o1424P12675q8076O74432K85152K91324
16772A5458374P44133K77577M89625L25321M13036N42997O52105O12275L18304
16763A9833747Q79445N76752N63341R63594L69599O65461P55681R83431J076379
16754B6667430Q36406O28775J338060J151385P36708J320623R31308J453177J420328
16745C6484200J269594J381689J614070J189491K332227J648732J970174J942803
16737D9832980J905369K048552K728231K054461K958685K298901K909514K451490
$$ y = [8082179, 8387724, 8193647, 8259210, 8535183, 8927962, 8851768, 9071492, 9336328, 9665848, 9662794, 9762930, 10255255, 10377604, 10420493, 10759715, 11099922, 11533438, 11683894, 12169372, 12205897, 12362421, 12949695, 13165489, 13644291, 13582867, 14295542, 14207466, 14881898, 15167050, 15458374, 16202507, 16480084, 16969709, 17295030, 17708066, 18251063, 18903168, 19515443, 19833747, 20713192, 21289944, 21853285, 22816879, 23186478, 23851939, 24607620, 25591051, 26667430, 27503836, 28132611, 29470671, 30622056, 31358764, 32679387, 33610695, 35063872, 36484200, 37753794, 39135483, 40749553, 41939044, 44271271, 45920003, 47890177, 49832980, 51738349, 53786901, 56515132, 58569593, 61528278, 63827179, 66736693, 69188183]
16729F9188183L548765K749999L697959K819331L706884L790914L852241L621277
16721I6975553L913160L994344M156183L810391M128569L479748L918276L350021
16713A27726245L204125L407716K744096K653312J859032J669209J127911M28355
16705A44820001N36086m59147q16832j589072j424988j835102l148370k949101
16697A33133475l253851l495342l762837l842762l556012m343061m130937l777139
16689A02971534m170312l897035l781371l948128l760740l260374l392527l267485
16681G3493562l462336k975208k668781l093973k270165k532202k482002k467309
16673E1541586k084752k061246j647969k046679k179194j172484j995682q02154
$$ y = [69188183, 72736948, 75486947, 79184906, 82004237, 85711121, 89502035, 93354276, 96975553, 100888713, 104883057, 109039240, 112849631, 116978200, 120457948, 124376224, 127726245, 130930370, 134338086, 137082182, 139735494, 141594526, 143263735, 144391646, 144820001, 145356087, 144896940, 144080108, 142491036, 141066048, 139230946, 136082576, 133133475, 129879624, 126384282, 122621445, 118778683, 115222671, 110879610, 106748673, 102971534, 98801222, 94904187, 91122816, 87174688, 83413948, 80153574, 76761047, 73493562, 70031226, 67056018, 64387237, 61293264, 59023099, 56490897, 54008895, 51541586, 49456834, 47395588, 45747619, 43700940, 41521746, 40349262, 38353580, 37551426]
16665C7551426j874269j138706j415557j296078r37144j158436r31521j400435
16657B7399280o78325j253642o10420n99585j277466m80349r29777l07181p24109
16648B0538426q01583m81459q81241l71373m45553n90707m73322l46069n36334
16639A5610785l84344l75221p67526j27437l59486j78581l25060l24446l94378
16630A2374306k03236l01623m11793j43776n65850k99026n3131j83249m89695
16621I722927J70982m46077R9927o80144K38727m12185m441j91365j70012m48463
16611G879876o9716N2708m72508q1747l7695n3470m29265j33403J05906l1459
16601F729227m2959l8017k36125m22512l9107l61751K64314r3316m46957K17741
$$ y = [37551426, 35677157, 34538451, 33122894, 31826816, 30889672, 29731236, 28799715, 27399280, 26720955, 25467313, 24856893, 24257308, 22979842, 22499493, 21569716, 21262535, 20538426, 19736843, 19255384, 18374143, 18002770, 17557217, 16966510, 16493188, 16147119, 15610785, 15226441, 14851220, 14083694, 13956257, 13596771, 13418190, 13093130, 12768684, 12374306, 12171070, 11869447, 11457654, 11313878, 10748028, 10449002, 10395871, 10212622, 9722927, 9893909, 9447832, 9547759, 8867615, 9106342, 8694157, 8689716, 8498351, 8328339, 7879876, 7810160, 7862868, 7390360, 7308613, 7270918, 7217448, 6788183, 6654780, 6760686, 6729227, 6686268, 6648251, 6412126, 5989614, 5950507, 5588756, 5853070, 5759754, 5312797, 5530538]
16591E530538m43667K5286j44298K22612j70337m93996L73456l03760J89205j03632
16581D681407O0561K3354m38991j60262K31263m5782k25414K2107m2674j89404
16571C916165J69743P7219m79345k57165L72303K0008j43616q9234k51960k6088
16561C308030p8226J15867J32385k97889Q4440m14659J95147m3857p9891N4566
16551B975913j18569L83253k78601L04138k36199j88623k26431J92465j48718
16542B658628j44171R97J19622j580k09078L34842k49289O1614o38720N10484
16532B443349j01626K01701k67722o1279N1183r18l70385p9181M48457m1752j58286
16521B063541P2275j75185J9320j56674M9408L43005j46603j29087j21389J71713
$$ y = [5530538, 5086871, 5112157, 4967859, 5190471, 5020134, 4526138, 4899594, 4595834, 4785039, 4681407, 4741968, 4765322, 4326331, 4166069, 4397332, 4351550, 4126136, 4148243, 4105569, 3916165, 4085908, 4163127, 3683782, 3426617, 3798920, 3818928, 3675312, 3586078, 3334118, 3308030, 3229804, 3345671, 3478056, 3180167, 3264607, 2849948, 3045095, 3001238, 2921347, 2975913, 2857344, 3240597, 2961996, 3266134, 3029935, 2841312, 2614881, 2807346, 2658628, 2514457, 2515454, 2635076, 2633496, 2424418, 2759260, 2509971, 2571585, 1932865, 2443349, 2341723, 2543424, 2275702, 2214423, 2265606, 2264688, 1894303, 1815122, 2263579, 2221827, 2063541, 2135816, 1960631, 1979951, 1823277, 1872685, 2215690, 2069087, 1940000, 1818611, 1990324]
16511A990324P3000k01511J22822l58118K35725n4996J87537r8993j67954j34230
16501A593606N7297k46697n2518L17448k09583K95114P7474n8618m05839J55486
16491A523170j21967K8424q278R5680j82095J20143L5680j39958J32376k18692
16481A264483K45359n74228L64516N7913k4643l66049J83812l15914N95325j72784
16471A257790l22330K10684L0332k31995L80680k400m99848N98496K8995k02883
16461A247521p1783J85470q7957o6770J30006k80493K62477k5656k21098k5710
16451A046007k20231K00815k3631K6115J87050m46974O35085k16680j41388k09556
16441H36612M21636j29822j60842j65357J12264P5560m42265J04723K54484q3005
$$ y = [1990324, 2063324, 1861813, 1984635, 1626517, 1862242, 1807246, 1994783, 1895790, 1727836, 1593606, 1650903, 1404206, 1351688, 1669136, 1459553, 1754667, 1832141, 1773523, 1367684, 1523170, 1401203, 1429627, 1421349, 1517029, 1334934, 1455077, 1490757, 1350799, 1483175, 1264483, 1509842, 935614, 1300130, 1358043, 1333400, 967351, 1151163, 835249, 1430574, 1257790, 935460, 1146144, 1176476, 944481, 1325161, 1322761, 822913, 1421409, 1450404, 1247521, 1175738, 1361208, 1273251, 1206481, 1336487, 1055994, 1318471, 1292815, 1071717, 1046007, 825776, 1026591, 1002960, 1029075, 1216125, 769151, 1404236, 1187556, 1046168, 836612, 1258248, 1128426, 967584, 802227, 914491, 990051, 547786, 652509, 906993, 823988]
16431H23988L0861k899K83317k27569m6886l9603l7631J61632k31139L77761k14919
16420H76913M7244N9727k05348l284K44563k98335R6235r7004J26940k9194J53409
16409I71866k90306k16175N46998k05718o7441J73882n6881n6437j08089l1841
16399F59858J13562m0507q9091J03881M339q7595R9702j12044k76012O03620p4124
16388I05589k67672k38995M29904o2220M3100k58662L00286o9501C84119K76034
16378F60153j10469J61760o85k78748K13245j50295J38036J39358j88375R9444
16368F83424k00704K73536k25951J29247O1632j54898J78942k56478A23341L46309
16358D69650M766O4844N4390j18906r982K46271K5080L780k66109M00868C10803
$$ y = [823988, 854849, 851950, 1135267, 907698, 860812, 821209, 783578, 945210, 714071, 1091832, 876913, 924157, 983884, 778536, 775252, 1019815, 721480, 817715, 720711, 847651, 818457, 971866, 681560, 465385, 1012383, 806665, 739224, 913106, 856225, 799788, 691699, 659858, 773420, 732913, 643822, 747703, 752042, 664447, 764149, 652105, 376093, 979713, 905589, 637917, 398922, 828826, 766606, 809706, 551044, 851330, 781829, 384119, 660153, 549684, 711444, 710759, 432011, 645256, 494961, 632997, 772355, 583980, 683424, 482720, 756256, 530305, 659552, 721184, 566286, 745228, 488750, 123341, 469650, 474416, 539260, 593650, 474744, 464762, 711033, 736113, 739893, 473784, 874652, 310803]
16346H17370l08158B07726M81691j20879k1212j2613r8321J26153j31570M5029
16336D76004j66476J85397n7744K14386m0633j44168J65905l07017A45216L68880
16326E14096n5895O8625k36626J6617M72335k80991k22439L46325B67612J62463
16316D30075L6885K58937B90963K7141r8586J65129L68911l28033J97022j77343
16306D45204A20325M59921k45166L04817k3788B15142H8478K93539R6497K54975
16296G33489j66040o4977l3769j50693M22605C30675J9217C6640J51490L80375
16286E68505k56811b7849j02277F52213G4629L89237j15977r833J99816B61450
16275B02099J81325p2668n8952K5664N1376j08396O992R21a81085B59124P6179
$$ y = [817370, 509212, 207726, 689417, 568538, 547326, 534713, 436392, 562545, 430975, 476004, 309528, 494925, 437181, 651567, 610934, 466766, 632671, 325654, 145216, 514096, 458201, 526826, 290200, 306817, 779152, 498161, 275722, 622047, 267612, 430075, 466960, 725897, 290963, 318104, 219518, 384647, 753558, 425525, 622547, 445204, 120325, 580246, 335080, 639897, 616109, 215142, 88478, 382017, 478514, 733489, 567449, 502472, 468703, 318010, 740615, 330675, 349892, 36640, 188130, 568505, 311694, -27849, -130126, 652213, 74629, 463866, 347889, 338056, 537872, 261450, 202099, 383424, 310756, 251804, 277468, 328844, 220448, 227440, 228361, -181085, 259124, 335303]
16264C35303n5706K22314j87721N117j04344A2552N22150k46386Q2168j44325
16254B26159M56411H5851L54048j92919O5357J6183j36701K76985l1172H4441
16243D26535J86928B75854J22753P1221k13439m9899K97750L4735c3544G9360
16232F93721A59802P4859L69484r1382k11448K43120k01655D1266O0650J89943
16222B91859l7036Q8484r9183J15403K1394A61164k223J70041K63719A75911O8809
16211B44720l868K5046e2721A0500d2143E06636A39636b03362B13560p9038K92837
16200D27359q017A73507F1059K49631A09815L25323J86890B45046h8656H4350
16189C02347J13167O546j61577p6791K4710H1749J73402H7288k2647O6180K96954
$$ y = [335303, 279597, 501911, 314190, 319307, 214963, 12552, 534702, 288316, 370484, 226159, 682570, 85851, 439899, 246980, 312337, 328520, 191819, 468804, 437632, 84441, 426535, 613463, 275854, 398607, 469828, 256389, 206490, 504240, 538975, -33544, 79360, 693721, 159802, 234661, 604145, 512763, 301315, 544435, 342780, 41266, 101916, 291859, 254823, 343307, 244124, 359527, 380921, 161164, 158941, 328982, 592701, 175911, 244720, 240852, 265898, -52721, 10500, -42143, 506636, 139636, -203362, 213560, 134522, 427359, 419342, 173507, 61059, 310690, 109815, 435138, 622028, 245046, -88656, 84350, 302347, 415514, 422060, 260483, 183692, 208402, 81749, 255151, 87288, 64641, 130821, 427775]
16178D27775r7555j14087G7076J78404j9848F6374L53416k07468K24164B14343
16167b8636o9534A50789J7927N7668O2098B2301Q4541J85062M37644A53277j9116
16156A34161b10210B827M03260A71229M0357K22899H657M70285o2094A55107J72996
16145C28103a42395G6180Q4950G075L83874q1386j17472J72012A53396a31930
16134C5082J67139K26323H7375e2132F60116B56691O3896a06986C02056j09511
16124A92545M2408A4673J20854D8173R1082g7956C55928B0956J49090A5985J08530
16113A24515P9409p2180f3905A76887O8741c9381C33689f6701B51328m6658L2731
16102B37401H4325e1146C57508A65139l8570b18668C04752J58490b0966A50710
$$ y = [427775, 330220, 216133, 77076, 255480, 235632, 66374, 419790, 212322, 436486, 214343, -28636, -98170, 150789, 168716, 226384, 288482, 22301, 106842, 291904, 729548, 153277, 134161, -210210, 2827, 406087, 171229, 211586, 434485, 8657, 478942, 416848, 155107, 328103, -142395, 76180, 161130, 7075, 390949, 309563, 192091, 364103, 153396, -131930, 35082, 202221, 428544, 87375, -52132, 660116, 256691, 320587, -106986, 302056, 192545, 234953, 14673, 135527, 48173, 139255, -77956, 355928, 20956, 170046, 15985, 124515, 203924, 131744, -63905, 176887, 245628, -39381, 333689, -66701, 251328, 204670, 237401, 84325, -51146, 357508, 165139, 126569, -218668, 304752, 463242, -20966, 150710]
16091b98204A40357J71285c4337j45150b4892F7314J89369a83825C3854K5321
16081E9175d7960B14811a40838E7904b29141A9947d3008j79431d5660B66317a33397
16069i5535I4371J19610O6731r7581p6939J19181G8108H624N0984K19602d96246
16057b7732j13390A73892D6698Q1028L8949C9317K8740J36228b15683Q0088o2483
16046a98078j44416B85a07551D00548I4140B8313L5430b00179A92889b31834A95461
16034F0270k1211h9339o4984C74836E9597b72n3479p4771H3454K5365b0255I6453
16021A51396b6325A80573g1243A16133f8471C3891a22069c8389j72036I009N0304
16010E9313f7509k03488H9690a23352r8613B79094A00734b73427M003j17561B86237
$$ y = [-298204, 140357, 311642, -34337, -179487, -24892, 67314, 256683, -183825, 33854, 59175, -47960, 214811, -140838, 57904, -229141, 19947, -43008, -222439, -45660, 266317, -133397, -95535, 94371, 213981, 280712, 183131, 106192, 225373, 78108, 8624, 59608, 279210, -496246, -27732, -141122, 173892, 46698, 127726, 166675, 39317, 68057, 204285, -215683, -135595, -198078, -342494, 285, -107551, 400548, 94140, 28313, 63743, -200179, 192889, -231834, 195461, 60270, 39059, -89339, -154323, 374836, 59597, -272, -53751, -128522, 83454, 108819, -20255, 96453, 151396, -26325, 180573, -71243, 116133, -68471, 33891, -122069, -38389, -210425, 9009, 59313, -67509, -270997, 89690, -123352, -221965, 279094, 100734, -273427, -269424, -386985, 286237]
15998C6441a06722a4641B73917b17456Q8891B15064L26087g0384I4985b27945
15987i0989B55770b35920G9674A7057J06072D4473a85460c3863j36605L0907I1471
15975b3811B65407a87293B41913r6213M66876R6046R2737J1970C29557K59278
15965E88835B32895a57339A55534m2452j5960J3294l6729g4939J3045j65770B30060
15953B16158K4466D2041J95597a9440j05025j1002b523j47046c2195j83742j04141
15942c20078m31Q4057E9260k3212a35440J7461A24935b52415F9015J07395c57097
15930b34537e0580j0548F6216A3854J79462a11652D19774a44537C15914A14808
15919A19258a58953A69945c23135l0719J37849A52812E8568f7942a9366k63645
$$ y = [36441, -106722, -14641, 273917, -217456, -128565, 215064, 541151, -70384, 94985, -227945, -90989, 255770, -235920, 79674, 17057, 123129, 44473, -185460, -33863, -170468, -139561, 91471, -23811, 265407, -187293, 241913, 145700, 612576, 708622, 801359, 813329, 329557, 588835, 232895, -157339, 155534, 113082, 97122, 110416, 73687, -74939, -61894, -227664, 230060, 216158, 240624, 42041, 237638, -19440, -124465, -135467, -2523, -149569, -32195, -215937, -320078, -320509, -236452, 59260, 36048, -135440, -117979, 124935, -252415, 69015, 176410, -357097, -234537, -50580, -61128, 66216, 13854, 193316, -111652, 419774, -144537, 315914, 114808, 119258, -158953, 169945, -323135, -353854, -216005, 152812, 58568, -67942, -19366, -283011]
15909b83011H2224a19192D1893a36754K1813q7659A06689N1299e9144a9200l0309
15898d9509k7868K0154A58297B0672J55460l4557c8607p6790A01418c40730D6023
15886a7894j92725i2719k36218a25265A67181F4117P3050c2974j80640P3730C42004
15874a2072I9602e3755D2062c59798B11765p252a6314A11858J63896b39014D4474
15862B07151a54372A69568b07883B45638I5872g2492A86243b25506B99432a28005
15851C18872B9870h2125k29116B71527E6219a46527o2509B16839a91607L5173
15841a56434a4596H0081K55596q1487B1336a41977I9961c31566B32740p8605f4250
15829a60132A24045c9600J3232A59217a96073c2258m3291A72794E8445a43937
$$ y = [-283011, 82224, -119192, 41893, -136754, -114941, -202600, 106689, 157988, -59144, -19200, -49509, -77377, -57223, 158297, 20672, 176132, 141575, -38607, -115397, 101418, -340730, 46023, -17894, -210619, -92719, -328937, -125265, 167181, 64117, 137167, -32974, -213614, -139884, 342004, -12072, 99602, -53755, 42062, -359798, 211765, 204513, -16314, 111858, 275754, -239014, 44474, 207151, -154372, 169568, -207883, 245638, 95872, -72492, 186243, -225506, 299432, -128005, 318872, 29870, -82125, -311241, 271527, 56219, -146527, -209036, 216839, -191607, -156434, -14596, 80081, 335677, 254190, 21336, -141977, 99961, -331566, 232740, 154135, -64250, -160132, 124045, -39600, -26368, 159217, -196073, -32258, -75549, 172794, 58445, -143937]
15818a5529b031D5930E737b17634E671c99920J97259A39492a10701q0416M5361
15807a45756C5111M7284b95827A73409a11212k04492H5331L5394a50094M7854
15797a02240j71254R4245M1167A04036a57891A66963g249k96815a5301A57533
15786A98235k5179J29706a20296j11074G8737R6887a93880j13370G4123b9094
15775A84981P2631c6538k81214C02886b0713F7590a6366n6916I8014a94813l5566
15764b30379A4684O8786J10526j8444E1250a88802h0155n2703L6327d6518o8653
15753a15171A136a08063d8202A71163b00718n0912A33462b44764B45185o7857
15743A77328a09378j90272E8150Q7769a250A82871b43368h6597C04703q5307j05322
$$ y = [-15529, -2031, 45930, 5737, -217634, 5671, -399920, -202661, 139492, -110701, -191117, -145756, 35111, 82395, -295827, 173409, -111212, -315704, 85331, 120725, -150094, -102240, -273494, -179249, -138082, 104036, -157891, 166963, -7249, -304064, -15301, 157533, 198235, 173056, 302762, -120296, -231370, 78737, 175624, -193880, -307250, 74123, -29094, 184981, 257612, -36538, -317752, 302886, -20713, 67590, -16366, -73282, 98014, -194813, -230379, 14684, 83470, 193996, 175552, 51250, -188802, -80155, -132858, -96531, -46518, -115171, 1136, -108063, -48202, 171163, -200718, -251630, 133462, -244764, 245185, 177328, -109378, -299650, 58150, 145919, -1250, 182871, -243368, -86597, 304703, 219396, 114074]
15732A14074b16477C17917H5180d4157p0883A57439O7249b725H1994Q0954m7880
15721A15068l0936c6449A19284m8961O4547C6832D501a37663c1272q3212B48618
15709A06321b06350I2781L7582a11119m41792K70348a21142j48798g0727A26671
15698A12418a90459H3193a7680B56202a09347Q963b4329g477C15182a1417D9955
15686b14517A98386B0843b93036I2458g0073A87270e2323C6673b04072F9062d1783
15674a00800A803d3382j26077N6901a2076B7687c64129i2781j34530i4203d4914
15662A45811J73971c878j04428p5391A00194l5500J18358a35070l20544b19978
15651f4336A61577J9886b74109o2402i117F864i0605J0932G1838M6387h5669m0152
$$ y = [114074, -216477, 317917, 85180, -44157, -115040, 157439, 224688, -2725, 81994, 162948, 115068, 84132, -36449, 119284, 70323, 134870, 36832, 4501, -137663, -31272, -114484, 248618, 106321, -206350, 92781, 130363, -111119, -552911, -282563, -121142, -269940, -70727, 126671, 112418, -190459, 83193, -17680, 256202, -109347, -100384, -24329, -7477, 315182, -11417, 49955, -214517, 198386, 20843, -293036, 92458, -70073, 187270, -52323, 36673, -204072, 69062, -41783, -100800, 1803, -43382, -169459, -112558, -12076, 27687, -364129, -92781, -227311, -94203, -44914, 145811, 319782, -3878, -108306, -183697, 100194, 64694, 183052, -135070, -455614, -219978, -64336, 161577, 181463, -274109, -336511, -9117, 6864, -90605, -79673, 71838, 118225, -85669, -125821]
15639a25821C03123D3690b35291N6560C3974A6943a32089j2527H4541B2819a05576
15627d34207F3932a28763B29512a70406A06134d6281n2924B4256c68329a8014
15616b24029A10376j8283i382n1405l04218C8439a9007C19126r5124a35120j283
15605a36403p7865c2471o9855A75068O9350b53424A85416a38450q4255f4919l6013
15594a00932B04258c09757D8534c5546J579A90945p9741a45729j9149b8366A62455
15582i5907L1382q2406j01356L9501B49580E7550Q3638C985a88663B87459n7496
15571B29963F8538J54551b7913n4919k75640B06765n1108i162k8797E8094A0730
15559a17752F9975a95857J0568F9085a7602n1605B08228b62110k4120N4692A82807
$$ y = [-125821, 303123, 43690, -235291, -178731, 33974, 16943, -132089, -144616, 84541, 22819, -105576, -434207, 63932, -128763, 229512, -170406, 106134, -46281, -99205, 24256, -368329, -18014, -224029, 110376, 92093, -9382, -60787, -365005, 38439, -19007, 319126, 224002, -135120, -136403, -214268, -32471, -102326, 175068, 244418, -253424, 185416, -138450, -222705, -64919, -100932, 204258, -309757, 48534, -35546, -33967, 190945, 111204, -145729, -164878, -28366, 162455, -95907, -64525, -146931, -248287, -208786, 249580, 57550, 141188, 3985, -188663, 287459, 229963, 68538, 223089, -27913, -82832, -358472, 206765, 155657, -9162, -37959, 58094, 10730, -117752, 69975, -195857, -185289, 69085, -17602, -69207, 208228, -262110, -286230, -231538, 182807]
15547a92176H7524b97953a00351l53448i9826G8444J06569i9662B09467a55697
15536b56854C8251a89280C01381a16198B9777d5887j60856g5374D5966J81897
15526B27863B5925g400j39280B72576A3365J8175K89896B869a87156N3665A18731
15514g7194k18250e2117a7733Q203k72413I8333b36156a7050A88447D4973f2385
15502G553J13478L17547j77349M5583B578J08458K55415a56009A52828e6879B7269
15490D42168A27250R145c4860m324C39825r8138a47487C6383d6490C08938l7895
15479B71043p7005c54133B91292j43407J61949A25509J11218H2097j4482J39970
15469B07585k7566c8158A24272m4184j8603A2915J30848m6872J05543P9688p7510
$$ y = [-192176, 87524, -297953, -100351, -453799, -99826, 78444, 185013, -99662, 209467, -155697, -256854, 38251, -189280, 301381, -116198, 29777, -45887, -206743, -75374, 45966, 227863, 25925, -7400, -146680, 272576, 13365, 31540, 321436, 2869, -187156, -133491, 118731, -77194, -295444, -52117, -17733, -9530, -281943, 98333, -236156, -17050, 188447, 44973, -62385, 7553, 121031, 438578, 261229, 306812, 2578, 111036, 366451, -156009, 152828, -56879, 27269, 442168, 127250, 136395, -34860, -39184, 339825, 241687, -147487, 36383, -46490, 308938, 271043, 194038, -354133, 291292, 147885, 309834, 125509, 236727, 82097, 67615, 207585, 180019, -38158, 124272, 80088, 61485, 12915, 143763, 96891, 202434, 282122, 204612]
15458B04612N75359A09479K88149l3510q994J9495C0553M16393A51382a50049
15447A47730d01576a9446I4170R5977O1054c89628I6103a41447C45906a3692A23089
15435i8684B99003d1576A71366J07547L897j08414H2068M8218N1876L29769J9978
15424E31909N62062l03812o8723r2685A25904a3975B64705c13827b5157A78142
15413B73513a90227F8838i1109B89121j20606G7870K19580d9249l9212I5154f3248
15401e9687j10057l4749A34972J3407c85207B1635R0437L6121m7650J5559a53825
15389H28R4994R1277i6969A62586b3271C76039a57287j51543a32406j88652A43211
15377B6359K97154b67176j41524E8575a42172A55114p2635i9886g537j5096B40785
$$ y = [204612, 779971, 109479, 397628, 364118, 355124, 374619, 30553, 446946, 151382, -150049, 147730, -401576, -19446, 94170, 190147, 251201, -389628, 96103, -141447, 345906, -13692, 123089, -98684, 299003, -41576, 171366, 278913, 282810, 174396, 82068, 130286, 182162, 511931, 531909, 1093971, 790159, 721436, 628751, 125904, -13975, 264705, -313827, -25157, 178142, 273513, -190227, 68838, -91109, 289121, 168515, 77870, 297450, -49249, -88461, 95154, -63248, -59687, -169744, -204493, 134972, 148379, -385207, 21635, 112072, 148193, 100543, 116102, -153825, 828, 95822, 187099, -96969, 162586, -23271, 376039, -157287, -308830, -132406, -321058, 143211, 26359, 323513, -267176, -408700, 58575, -142172, 155114, 82479, -99886, -7537, -22633, 240785]
15365A28621j8944K55961h3194K1525A13923a44916F7156L37887b1446C37991
15354C4242c7502G1775J19880q0173K10851e1859a9465E3337J48312j1358L49044
15343E39335d2751D4201a9574A57509P5638J74538D1626J64269a27365C63572
15332D5980a79183B82806M42a50563B19018b0006C94946j83535I4080J36449m7035
15321A83494c49847B37649b27734e1356B35901E9452b51666D1806j4471J05357
15311A32692g3050B10282g3231C30447A40608Q369A6000J28978a8667H9729J18671
15300B08400f5546A0996d913A91015J36788H2449e6803G7673O7420F10K55999
15289B56609a85905B6534a90854A08780C5539R5311J77280A22937b77973A17299
$$ y = [128621, 109677, 365638, -83194, -61669, 113923, -144916, 67156, 405043, -21446, 337991, 34242, -37502, 71775, 191655, 111482, 322333, -51859, -19465, 53337, 201649, 190291, 539335, -42751, 44201, -19574, 157509, 233147, 407685, 41626, 205895, -127365, 363572, 45980, -179183, 282806, 283248, -150563, 219018, -20006, 394946, 211411, 94080, 230529, 183494, -349847, 237649, -227734, -51356, 235901, 59452, -251666, 41806, 27335, 132692, -73050, 210282, -73231, 330447, 140608, 148977, 16000, 144978, -18667, 89729, 208400, -65546, 10996, -4913, 191015, 327803, 82449, -56803, 77673, 145093, 610, 256609, -185905, 26534, -190854, 108780, 35539, 130850, 308130, 122937, -277973, 117299]
15278A88837f5418m3672A68414d8894A67918a75143a6371R00A73676p888M5698
15267B11486j2137r4804Q81J39419J96320G5294b49064F3847J2293N6372P4853
15256B07365P004g6368B30563q8580D7970J14748K2597a6923H0864A5664J83672
15245A99336C1929M6590O226J23696P7066C4629a14898A59395a1135F0030g7565
15233F3913J74386A17905L73439M4950N31841L41594r7913J88463m61544D44012
15222C97575H0846N08077E1524J93847r4969b0406A57873n9900E731K64364o7062
15211B03033I6201b48695f0188n2667A42426J28341d4278k412j41412E3357O0604
15200A13961g3873b9172I8232J36716j404F9135L35666E033J33165a54556B16623
$$ y = [188837, -65418, -109090, 168414, -48894, 167918, -175143, -16371, -15471, 173676, 165788, 211486, 199349, 104545, 105426, 244845, 441165, 75294, -249064, 63847, 76140, 132512, 207365, 214369, -76368, 230563, 141983, 47970, 162718, 185315, -16923, 80864, 15664, 199336, 31929, 78519, 84745, 208441, 285507, 34629, -114898, 159395, -11135, 60030, -77565, 63913, 238299, 117905, 491344, 536294, 1068135, 1409729, 1311816, 1500279, 1038735, 444012, 397575, 80846, 588923, 51524, 245371, 150402, -20406, 157873, 97973, 5731, 270095, 203033, 96201, -248695, -60188, -112855, 142426, 270767, -44278, -46690, -188102, 53357, 113961, -73873, -29172, 98232, 234948, 233544, 69135, 404801, 5033, 138198, -154556, 216623]
15188D1048K16082a29077A09933L00358A31499a34942E20460h037k07762O8207
15178a47592b83B15176O7677A04316f2813g42D8944O0770P4014o9364K59952G8073
15165G2864a8024n2718b4616A1020a62558g9357k5117j44855B11583b17478C57408
15153a83691B71399B2776J00088K96437H3937Q019K82818a58122A165a29817L8124
15142i1693J9624F0985N86527k36533k6217B4305J88532L5511a01422C01601B8501
15130D52813I1220g6280A69164i607A43643h3146A97891a36189C29064d807A51616
15118D65305A24994c9601A25324E7542K63936o2326o8831L18619A05462J09126
15108B14588M5786K8781o7904J79781J50987A23669d1385A47757B9305M07982
$$ y = [41048, 257130, -129077, 109933, 410291, 131499, -134942, 520460, -8037, -215799, -147592, -283, 215176, 282853, 104316, -62813, -742, 48944, 109714, 183728, 114364, 374316, 78073, 72864, -18024, -70742, -24616, 11020, -162558, -79357, -104474, -249329, 211583, -217478, 357408, -183691, 271399, 22776, 122864, 419301, 83937, 91956, 374774, -158122, 1165, -129817, -91693, -72069, 60985, 647512, 410979, 384762, 24305, 212837, 248348, -101422, 301601, 28501, 452813, 91220, -76280, 169164, -9607, 143643, -83146, 197891, -136189, 329064, -4807, 151616, 465305, 124994, -39601, 125324, 57542, 321478, 259152, 190321, 508940, 105462, 214588, 260374, 289155, 221251, 401032, 552019, 123669, -41385, 147757, 29305, 437287]
15098D37287A22307l8982K22919A22342D7430e7257i57A82104a54343g2707C75050
15086A65526c3302A08756n021K59545E7898B4888f5616k04341A0914O2888L8249
15075A12051l5672c6208G3151B4427K80305a915C9042J41444O0190a72658A40702
15063d3870E8469J25873d3670A87623K92170A31198R6738J09610n6214C4393K23306
15052B57699i1548A58846e3625A57023J66875a68098A35273J28967D3568O4929
15042A08497M22843B43605a01371B98802P4982A04343N2118o8348L01446p1081
15032C18478J26063k2481E2272J07866L64337r8914j74267J25947m7626N8262
15022C87877J79698B25367O5462K09704k17361D4490M87959l3421A99721K29626
$$ y = [437287, 122307, 83325, 306244, 122342, 47430, -57257, -957, 182104, -154343, -72707, 375050, 165526, -33302, 108756, 103735, 363280, 57898, 24888, -65616, -269957, 10914, 73802, 112051, 76379, -36208, 73151, 24427, 304732, -1915, 39042, 180486, 240676, -172658, 140702, -43870, 58469, 184342, -43670, 187623, 479793, 131198, 227936, 337546, 281332, 34393, 257699, -91548, 158846, -53625, 157023, 323898, -168098, 135273, 264240, 43568, 108497, 531340, 243605, -101371, 298802, 373784, 104343, 156461, 88113, 389559, 318478, 444541, 422060, 52272, 160138, 524475, 425561, 251294, 377241, 329615, 387877, 567575, 225367, 290829, 500533, 283172, 44490, 532449, 499028, 199721, 429347]
15012D29347L41055L2197l35718m0733q9896p5143j04237J05431K08098j25351
15002C45050K11136L0747B84225P85J2698j05851J90161J04008J45386A92249
14991F27854B56005L73756j44931j69571J84846A17248N07408k85448K25242k76791
14981B87659K98405o2122G6826J87176L58662j89812R2404J32145A94943L96508
14971E91451K4389A88944K29561j12440K60770j24465K53307o8781J80993k76546
14961E31343J160k28062L5589J63627J48545k9937n0178L6618B98461L19828j38136
14950D80153A54653K89272o8346O6218A28250J63520n4226K46335J45531L548
14940F32958j5991j68983j15415K12340A10017K51487j8725K9322A51820J53769
$$ y = [429347, 770402, 802599, 466881, 426148, 336252, 261109, 156872, 262303, 470401, 345050, 556186, 586933, 284225, 285010, 297708, 191857, 382018, 486026, 631412, 192249, 627854, 256005, 629761, 484830, 315259, 500105, 117248, 624656, 339208, 564450, 287659, 586064, 523942, 76826, 264002, 622664, 432852, 525256, 657401, 194943, 591451, 615840, 188944, 418505, 306065, 566835, 442370, 695677, 626896, 807889, 531343, 532503, 304441, 340030, 503657, 652202, 622265, 572087, 608705, 298461, 618289, 480153, 154653, 443925, 375579, 441797, 128250, 291770, 237544, 483879, 629410, 632958, 616967, 447984, 332569, 544909, 110017, 361504, 342779, 372101, 151820, 305589]
14930C05589M3436j37105N03706j65879J45055K18419l82248j54233j3841J39405
14920E02304L4040q8174l2973J50156O5198L5899L98121J74661R1048j80891j31346
14909A018043K54230J17004p1066J87884k83490J38283j15323K04903L33400J65987
14899A949855J52191l79726l29002n6472l04433j14132k55518J65938r6340J94512
14889I26873C44217J47372J16586m2986P5816J42546j64604C07601K12702J1030
14879E31333J51747l26234q1571L0063M5865J91768r5954Q0107n4681r9163K74428
14868F47708m2958J6191k8504K52740j28848k45451J23733K99336k48172P6915
14858G22690J06894k24062q5393j03597J57032q1676k02405O34474l44544J49798
$$ y = [305589, 349025, 211920, 715626, 549747, 694802, 913221, 530973, 376740, 362899, 502304, 536344, 448170, 415197, 565353, 630551, 666450, 1064571, 1239232, 1330280, 1149389, 1018043, 1272273, 1389277, 1318211, 1506095, 1222605, 1360888, 1245565, 1450468, 1783868, 1949855, 2102046, 1722320, 1393318, 1336846, 1032413, 918281, 662763, 828701, 732361, 926873, 344217, 491589, 608175, 565189, 641005, 783551, 618947, 307601, 520303, 531333, 683080, 356846, 275275, 305338, 351203, 542971, 447017, 527124, 472443, 373280, 647708, 604750, 620941, 592437, 845177, 716329, 470878, 594611, 893947, 645775, 722690, 829584, 605522, 520129, 416532, 573564, 491888, 289483, 923957, 579413, 729211]
14848G29211P6010k96592k3040L9860j8164J98383j48573o8258A03586J01437
14838B05023L52034R34J843A2142M02749J91889k14847P9981J10065j7009K75064
14827H40034l92535M35142k04432M53295J42853l12258M0479K2653O9144j38038
14817I56337D22023K58011j62372p6965P8187j77406j01677N55435l2904J6847
14807G79179J0741m3657j20419K49347m6863p132j80534K70504m30642K64940
14797G45464K92500C37771L39373p437L29208j58781k97183K64592J14681j30623
14787G91601K08709k00107k7125r8692O6696k15193K35523j82520P4624J54166
14777H07682j51189k16277O6853p0565J93972k34524K84234k4702k1943J27891
$$ y = [729211, 805221, 508629, 485589, 525449, 507285, 705668, 557095, 488837, 103586, 205023, 557057, 557991, 559834, 12142, 414891, 606780, 391933, 471914, 581979, 564970, 840034, 447499, 882641, 678209, 1131504, 1274357, 962099, 1002578, 1025231, 1094375, 956337, 422023, 680034, 517662, 440697, 518884, 341478, 239801, 795236, 762332, 779179, 789920, 746263, 625844, 875191, 828328, 821196, 640662, 911166, 480524, 745464, 1037964, 337771, 677144, 669707, 998915, 840134, 542951, 807543, 922224, 791601, 1000310, 800203, 773078, 674386, 741082, 525889, 761412, 578892, 653516, 807682, 656493, 440216, 507069, 436504, 630476, 395952, 680186, 655484, 633541, 761432]
14767G61432j7701k14990j75394M31298k24221M13910j47753l0635M5280p5188
14757G66038L2400l54198M54648k11167P5278J5639j59350r2986L46232o5570
14747H06964k24979k25928J14011L13073L3004l42020J23738p2264R1578K90698
14737I07875m03030j29567N83222l34598K27306j81534j85802K03122j97249N1657
14727E41402L61900D44533K38392K71874k70793R1873k2221K3169N4167R5451
14717I26445m2281j16035M04282k07585K31267Q7050j38960L05833J41127o3745
14707A527398k69214P9170m0946m8945l17687q3400J10056m1614j58057K97247
14697A054008k63672M16393m3982k75530q1912p8833L49854j15872O3165J99103
$$ y = [761432, 743731, 528741, 353347, 784645, 560424, 974334, 826581, 795946, 841226, 766038, 798438, 444240, 898888, 687721, 762999, 778638, 619288, 526302, 872534, 806964, 581985, 356057, 470068, 783141, 816145, 474125, 597863, 525599, 617177, 907875, 504845, 375278, 958500, 623902, 851208, 669674, 483872, 686994, 489745, 541402, 903302, 444533, 682925, 954799, 684006, 775879, 753658, 776827, 830994, 926445, 884164, 768129, 1172411, 964826, 1196093, 1283143, 1144183, 1450016, 1591143, 1527398, 1258184, 1337354, 1296408, 1247463, 929776, 846376, 956432, 914818, 756761, 1054008, 790336, 1206729, 1162747, 887217, 805305, 726472, 1076326, 960454, 1023619, 1222722]
14687A222722L00006k68961j43154Q07339l80915O1020k83356J1485l65879p0932
14677H89375K04355j21468Q6690O7394j79439n6983L75729l13022n0528K67520
14667A169623l8265m4810l25682J60452J8372L1950k824M04045o14127J44427
14657I03161K03159m8368l5322K56617l76268L03759l49212O03066m46348j72945
14647H41299M12169k81338J33855r6830l0592R3396J01832k24424J46888J89652
14637A285907j07396J1260K07472k79225K75739j7169j95100l70026N39486p2836
14627A278112N4729j10628P3108N4063n2218l7677L54068m73621J18165j56452
14617A101649N8114L67881m66707M43013o2159l40115O2497K52497N7462j15180
$$ y = [1222722, 1522728, 1253767, 1110613, 1917952, 1537037, 1598057, 1314701, 1326186, 960307, 889375, 1093730, 972262, 1058952, 1126346, 946907, 889924, 1265653, 952631, 902103, 1169623, 1131358, 1086548, 760866, 921318, 939690, 971640, 968816, 1372861, 758734, 903161, 1106320, 1057952, 1022630, 1279247, 902979, 1206738, 857526, 1460592, 1014244, 841299, 1253468, 972130, 1105985, 1009155, 978563, 1071959, 1173791, 949367, 1096255, 1285907, 1178511, 1189771, 1397243, 1118018, 1393757, 1376588, 1181488, 811462, 1350948, 1278112, 1332841, 1222213, 1295321, 1349384, 1297166, 1259489, 1613557, 1139936, 1258101, 1101649, 1159763, 1527644, 1060937, 1503950, 1441791, 1101676, 1164173, 1416670, 1474132, 1358952]
14607A358952J75447j63301K29647j65552J07432p7663j95113M26936m30339J23276
14597A389722K53198k3090j38565K50842j61422k7882l5175J05569L98903n95308
14587A416792J90423k84171p836J24953K59609K13871j80974J46951k76046K50611
14577A854183m871k95923J33219l358J86851J58227k53887J38447M3395O499j56756
14566A806026J29450J68000j02462P5606j02789N0578j14343k4669R6617L10647
14556B292661j52785Q852L59534q0111l7378k2833R2743K76901K0346K294J70868
14545B931092J13122J84162j10926R8144O07165j24605N32757O06807R90046L03241
14535F131005J123204K234097M530809O457720J0059897K273448j3395097p943938
$$ y = [1358952, 1534399, 1371098, 1600745, 1435193, 1542625, 1464962, 1269849, 1696785, 1266446, 1389722, 1642920, 1619830, 1481265, 1732107, 1570685, 1542803, 1507628, 1613197, 2012100, 1416792, 1607215, 1323044, 1315208, 1440161, 1699770, 1913641, 1732667, 1879618, 1603572, 1854183, 1849312, 1553389, 1686608, 1683250, 1870101, 2028328, 1774441, 1912888, 1956283, 1962782, 1806026, 1935476, 2103476, 2001014, 2076620, 1973831, 2024409, 1910066, 1885397, 1982014, 2292661, 2139876, 2148728, 2508262, 2428151, 2390773, 2367940, 2460683, 2737584, 2757930, 2760224, 2931092, 3044214, 3228376, 3117450, 3215594, 3822759, 3698154, 4230911, 4837718, 5827764, 6131005, 7254209, 9488306, 14019115, 20476835, 30536732, 32810180, 19415083, 11471145]
14527A1471145m632973j823308N6481L95813r00686j101702o88881l1543k94676
14518B449670L1731j85985j07035J42766O6853k3708Q3518k13382j2317m2095
14508B190016n8717K10407L09361j2364l4167j51778L29377j91511L44885R9319
14498C034828k08256J74602k59913q4157R517O21372p67009L11309Q262M53264
14488C293819l59523J82641K70010j80918j93219K57254j27506L9716Q0102K2496
14478C284872M27437k98411L52743m17771j07202M67842K5911j12738k89807K69744
14468C602620J82882j60796J36300K64208m3972J4212L20801n2418k89839M60858
14458D434856k24168J94776j45682L82658n1053Q729P6310k11222r5958N94274
$$ y = [11471145, 6838172, 5014864, 5071345, 5467158, 4566472, 3464770, 2775889, 2744346, 2449670, 2481401, 2295416, 2188381, 2331147, 2398000, 2374292, 2457810, 2244428, 2232111, 2190016, 2131299, 2341706, 2651067, 2638703, 2604536, 2452758, 2782135, 2590624, 2935509, 3034828, 2826572, 3001174, 2741261, 2657104, 2666621, 3287993, 2520984, 2832293, 2840555, 3293819, 2934296, 3116937, 3386947, 3206029, 3012810, 3270064, 3142558, 3182274, 3262376, 3284872, 3712309, 3413898, 3766641, 3348870, 3241668, 3709510, 3735421, 3622683, 3332876, 3602620, 3785502, 3624706, 3761006, 4025214, 3981242, 3995454, 4316255, 4263837, 3973998, 4434856, 4210688, 4405464, 4259782, 4642440, 4591387, 4600116, 4676426, 4465204, 4369246, 4963520]
14448D963520j20815j9834K01123k39232K993O521o7706Q41694q16960M91551
14438E242855k26497J62637j1773L40851K15877J52173q5392q7551J78142P8076
14428E959398K55953n6352J64741j59374K22383M630j13341M52636J68238k48807
14418F650105K13848L20750p4595M012L8563O2165R1901J35967L07790P8768j54194
14407G675080K2807M98531K95055j13320L56003J26251R8258L38727k24542j53712
14397H919138N5099J59847K62048J50832q1069K74290M4453M97625J6663K73123
14387A0572049M40821L69538J40638K01712k13119J37393o2062L12213K6918N4157
14377A1980258M72102K90527J44784j514M98309K76126K35102L02410k5071P61267
$$ y = [4963520, 4842705, 4822871, 5023994, 4784762, 4787755, 4794276, 4726570, 5568264, 4751304, 5242855, 5016358, 5178995, 5167222, 5508073, 5723950, 5876123, 5790731, 5703180, 5881322, 5959398, 6215351, 6158999, 6323740, 6164366, 6386749, 6391379, 6278038, 6730674, 6898912, 6650105, 6863953, 7184703, 7110108, 7114120, 7152683, 7214848, 7306749, 7442716, 7750506, 7829274, 7675080, 7697887, 8196418, 8491473, 8378153, 8734156, 8860407, 8958665, 9297392, 9072850, 8919138, 8974237, 9134084, 9396132, 9546964, 9465895, 9740185, 9784638, 10282263, 10298926, 10572049, 11012870, 11382408, 11523046, 11724758, 11511639, 11649032, 11586970, 11899183, 11926101, 11980258, 12452360, 12742887, 12887671, 12886157, 13384466, 13660592, 13895694, 14198104, 14173033, 14934300]
14367A4934300M3679O6338M43863k4220M47624N72519M01510j69947O13147K03344
14357A7532157J82998N70462j17186N66688J50603N61548Q30962J99860M27945
14348B0906037M53985N66716N22181J35074R92239P8104O61315O88335M86799
14339B5490785K59423P76158P82027N62874R06426P46819R89015M38460R46632
14330C1898619P05916P29399Q30452J276109J100452P01632R61535J117097J356047
14321D0677258R37277J393836J298436J547055J350161J317922J717354J515600
14313E1754899J629260J858987K086996K011829J974645J835997K879870K114235
14305F8146718K513252K558028K863768L136205K653245L294576L537322L478154
$$ y = [14934300, 14977979, 15044317, 15488180, 15463960, 15911584, 16484103, 16885613, 16715666, 17328813, 17532157, 17715155, 18285617, 18168431, 18735119, 18885722, 19447270, 20278232, 20478092, 20906037, 21360022, 21926738, 22448919, 22583993, 23576232, 23654336, 24315651, 25003986, 25490785, 25750208, 26526366, 27308393, 27871267, 28777693, 29524512, 30513527, 30951987, 31898619, 32604535, 33333934, 34164386, 35440495, 36540947, 37242579, 38204114, 39321211, 40677258, 41614535, 43008371, 44306807, 45853862, 47204023, 48521945, 50239299, 51754899, 53384159, 55243146, 57330142, 59341971, 61316616, 63152613, 66032483, 68146718, 70659970, 73217998, 76081766, 79217971, 81871216, 85165792, 88703114, 92181268]
14297I2181268L827262L761862M436317M826520M683177N014424N406320N997197
14289A30134347O043837O505424O944568P658886P172127Q130014Q951325R181404
14281A90721932R384308J0420157J1024434J1412251J2274045J2365899J3340315
14274B70943341J3854795J4137669J4252977J3943467J4309725J4473880J4266135
14267C70181989J3319485J2926498J1529433J1018033J0750608R308868Q413732
14260D47448646P675138O939664L828001J232864l08289J116077k529752p984058
14252D57418291n660982q705124j1451666j2983954j3280361j3163574j4190196
14245C77982434j3902532j4341921j4398964j4509092j4323340j3446852j3471207
$$ y = [92181268, 96008530, 99770392, 104206709, 109033229, 113716406, 118730830, 124137150, 130134347, 136178184, 142683608, 149628176, 157287062, 164459189, 172589203, 181540528, 190721932, 200106240, 210526397, 221550831, 232963082, 245237127, 257603026, 270943341, 284798136, 298935805, 313188782, 327132249, 341441974, 355915854, 370181989, 383501474, 396427972, 407957405, 418975438, 429726046, 439034914, 447448646, 455123784, 462063448, 465891449, 467124313, 466816024, 467932101, 465402349, 457418291, 451757309, 443052185, 431600519, 418616565, 405336204, 392172630, 377982434, 364079902, 349737981, 335339017, 320829925, 306506585, 293059733, 279588526]
14238B79588526j2961812j2519648j1740404j1211442j0848426j1374361j0932106
14231A98000327j0021269r273195q953801q149089p839801p478803o637851o445195
14223A33201323o170032n410319n176585n240836m911300m534345l905089l565441
14215I4287376l868601l756572l187082l212095l065571k967695k705716k508389
14207F9015655k280240k414137k324926j982066j926732j723948j882151j742733
14199E2738722j737173j204085j683851j466765j249250j264763j105266p73362
14191D2254207j119915j356431j232161j239908q86649q02069p73774r30754j286293
14182C2626253p64097q11575m28974r42914q60971q13125m87924o36706o52422
$$ y = [279588526, 266626714, 254107066, 242366662, 231155220, 220306794, 208932433, 198000327, 187979058, 178705863, 169752062, 161602973, 153763172, 146284369, 139646518, 133201323, 127031291, 121620972, 116444387, 111203551, 106292251, 101757906, 97852817, 94287376, 90418775, 86662203, 83475121, 80263026, 77197455, 74229760, 71524044, 69015655, 66735415, 64321278, 61996352, 60014286, 58087554, 56363606, 54481455, 52738722, 51001549, 49797464, 48113613, 46646848, 45397598, 44132835, 43027569, 42254207, 41134292, 39777861, 38545700, 37305792, 36419143, 35617074, 34843300, 33912546, 32626253, 31862156, 31050581, 30621607, 29678693, 28817722, 28004597, 27516673, 26879967, 26227545]
14173B6227545o05737j42366j052192p13053k14796n95727m56255n90858K6531
14164B1883092q86217n72550m8429n23607l48302m88826n09402m74201m9804l69987
14154A7611767n45905l43454j65540k3217o70916r227p85514m4368k8783m82793
14144A4512050j28779l35345j96314k20846j38802m42911j77242q7536n36041
14135A2248234L5477k4200l07431m66496k2013q606l90345J4244l56838o0903
14125A0661123l4890k22185j54516Q0932k48031o7061j66297l52174R5927l76490
14115I216338k35403r6583j15682J1809j20651k38102l515k77911K20221m24761
14105G935760M9371J7941l30134J66464o9444k47078j22383m42668J2870M5190
$$ y = [26227545, 25621808, 25479442, 24427250, 23714197, 23499401, 22903674, 22447419, 21856561, 21883092, 20996875, 20424325, 20375896, 19852289, 19503987, 19015161, 18505759, 18031558, 17981754, 17611767, 17065862, 16722408, 16556868, 16533651, 15862735, 15853508, 15067994, 15023626, 14994843, 14512050, 14383271, 14047926, 13851612, 13630766, 13491964, 13049053, 12871811, 12784275, 12248234, 12283711, 12259511, 11952080, 11485584, 11463571, 11454965, 11064620, 11078864, 10722026, 10661123, 10626233, 10404048, 10249532, 10330464, 10082433, 10015372, 9849075, 9496901, 9592828, 9216338, 8980935, 8884352, 8768670, 8780479, 8659828, 8421726, 8418211, 8140300, 8360521, 7935760, 7985131, 8003072, 7672938, 7839402, 7769958, 7522880, 7400497, 6957829, 6970699, 7015889]
14095G015889R7502k8903l21624J66685n80979K81889j03671L9994j47596m09666
14085F009520J19608q6243j9014j56766Q4847k62100J08786k142k13633R3560
14075E676423j03384k15818k6373k99247K52462k76085J53745k31841K34690n54102
14065D610470L21909N7574k4336j66825J09448n76097J73607L8068k10636p1891
14055D261291L16590p0211j00395J9644k27015J76130j01510j95721R5963J53739
14045D328505r7574k61765N2979J23141j17248q5860J23165o4840l78315J88546
14035C810734R8054n08840L40813j83430k70431M68321l92828n9565l25869N68245
14025C545204k44399j53199J41087j7800K5248k14869J29042k211j26011J8375
$$ y = [7015889, 7113391, 7084488, 6762864, 6929549, 6348570, 6630459, 6526788, 6566782, 6419186, 6009520, 6129128, 6042885, 6023871, 5867105, 5951952, 5689852, 5798638, 5796496, 5582863, 5676423, 5573039, 5357221, 5330848, 5031601, 5284063, 5007978, 5161723, 4929882, 5164572, 4610470, 4932379, 4989953, 4965617, 4798792, 4908240, 4332143, 4505750, 4543818, 4333182, 4261291, 4577881, 4507670, 4407275, 4426919, 4199904, 4376034, 4274524, 4078803, 4174766, 4328505, 4230931, 3969166, 4022145, 4145286, 4028038, 3942178, 4065343, 4000503, 3622188, 3810734, 3908788, 3399948, 3740761, 3557331, 3286900, 3755221, 3362393, 3302828, 2976959, 3545204, 3300805, 3147606, 3288693, 3270893, 3296141, 3081272, 3210314, 3208103, 3082092, 3100467]
14015C100467m4513j1688k20245J98168o6131j81867J26834J1771k77965o5371
14005B569460J49868j69498K02416j93715P6799r8969N7594J15829k43093J18388
13995B585079M4949j18317o8307r6582J10422j11600j32062O5196J58059j20474
13985B316363k1280K04878K0966n501p8809K82769J6137L69575L07782O32893
13975D045773O75509J533955L070274O024257J0378382Q778916j1166123q026809
13967A5314134n078973k901616j235783q03735j051347k22686l65507k07476k59049
13958C187962k20053l6165Q2667m76070J85273k03752L06199k72431l70096R4783
13948B278317j75823P0659M9665J10840k7771J28465m27084J20376J30302j88416
$$ y = [3100467, 3055954, 3044266, 2824021, 3022189, 2956058, 2774191, 2901025, 2912796, 2634831, 2569460, 2719328, 2549830, 2752246, 2558531, 2635330, 2536361, 2593955, 2709784, 2466691, 2585079, 2630028, 2511711, 2443404, 2346822, 2457244, 2345644, 2213582, 2278778, 2436837, 2316363, 2295083, 2499961, 2520927, 2515426, 2436617, 2719386, 2735523, 3105098, 3412880, 4045773, 4721282, 6255237, 9325511, 15349768, 25728150, 34507066, 23340943, 15314134, 10235161, 7333545, 6097762, 5294027, 4242680, 4019994, 3654487, 3447011, 3187962, 2967909, 2931744, 3014411, 2538341, 2723614, 2519862, 2826061, 2553630, 2183534, 2278317, 2102494, 2173153, 2222818, 2333658, 2305887, 2434352, 2007268, 2127644, 2257946, 2069530]
13938B069530Q647J67875j24540q9334j77811M3473k31891K48410j70695K66452
13928B010116r7667l17716M22944J2589r3413l31050K26353j49564J921J91437
13918A875950m75896P58699n72172K90075k28159j42621J37819N7463k35424J33989
13908A599723o889k54659L19331J39946K44757n47355J41543k27570M92355k49806
13898A651376r3958J5632K51625k37633k83414J44638K47675j99766j25205j463
13888A369507J93041K37431m17212J24893n5375o2745j09685q5105K31948j935
13878A424763m7116l0717j87466J28061J26651Q4321j43543J56871k37372j5768
13868A258685j39208J8491K07167k13214k29049K65370n822R8299j13817L37121
$$ y = [2069530, 2078177, 2246052, 2121512, 2032178, 1854367, 1897840, 1665949, 1914359, 1743664, 2010116, 1912449, 1594733, 2017677, 2030266, 1936853, 1605803, 1832156, 1682592, 1684513, 1875950, 1400054, 2158753, 1586581, 1876656, 1648497, 1505876, 1643695, 1701158, 1465734, 1599723, 1592834, 1338175, 1657506, 1797452, 2042209, 1494854, 1636397, 1408827, 1901182, 1651376, 1557418, 1573050, 1824675, 1587042, 1303628, 1448266, 1695941, 1496175, 1370970, 1369507, 1562548, 1799979, 1382767, 1507660, 1452285, 1389540, 1279855, 1194750, 1426698, 1424763, 1377647, 1346930, 1159464, 1287525, 1414176, 1498497, 1354954, 1511825, 1274453, 1258685, 1119477, 1137968, 1345135, 1131921, 902872, 1168242, 1162420, 1260719, 1146902, 1484023]
13858A484023m90623J45415K08704O5083l63369J05523k98093M21811J6455l35118
13848I59811J66264l4367K17629q8157k31958j60301L81766k63556Q1995K98215
13838A327341o36567M49495J81630k70246k15634j22642J28035J76558n5427J22374
13828A084917j42301q8490n0325J93613j31775J41417j14300L3637J56509j19691
13818I63211J49360j37825j98914J70094K48945l28217K89203j22068j00654r673
13808I23462o8092k10633L74322L3328j50162o6438L43819m94642J00515K11423
13798I96902K5148j26493o9212o4682K06655M1065Q7910k74529J00273q5015o0028
13787G77994J75362j6525r1232k51870N3893j06659L14115k3942N18687k99561
$$ y = [1484023, 993400, 1138815, 1347519, 1412602, 1049233, 1154756, 856663, 1278474, 1294929, 959811, 1126075, 1091708, 1309337, 1221180, 989222, 828921, 1210687, 947131, 1029126, 1327341, 690774, 1140269, 1321899, 1051653, 836019, 713377, 841412, 1017970, 962543, 1084917, 942616, 854126, 803801, 997414, 865639, 1007056, 892756, 926393, 1082902, 963211, 1112571, 974746, 775832, 945926, 1194871, 866654, 1155857, 1033789, 933135, 923462, 855370, 644737, 1019059, 1052387, 902225, 835787, 1179606, 684964, 785479, 996902, 1022050, 895557, 826345, 761663, 968318, 1009383, 1097293, 822764, 923037, 838022, 777994, 953356, 936831, 845599, 593729, 647622, 540963, 855078, 831136, 1349823, 1050262]
13777A050262j13286j80620N9532O9419m23472K12684Q22J11222j65024B34805
13766I59669D40097M44238D15633L08135J86214k90111N04182E33748L45163k40687
13756F38224K6226J31599j37175K19386n6908r2178M9934o4450J96950l49687
13746E61921L13920m6837J02127k45022l2295J35321k5415N7731J02163l50451
13736E73163K67738l80988J94985L6503j53963L28139j58889Q7346j78142q9492
13726E26400O3016M5171K71523l0121k83064K31752m3333B12571L13260K31574
13716G57405k83214L5900k6637k34340N64854k41226N4418R4753B90898J94610
13706D85508J80196j9020O431j9124K34022B73895K37887R3060R3964j21715J25536
$$ y = [1050262, 936976, 756356, 815888, 885307, 461835, 674519, 675341, 786563, 621539, 234805, 959669, 440097, 884335, 415633, 723768, 909982, 619871, 1124053, 533748, 878911, 638224, 664450, 796049, 658874, 878260, 821352, 729174, 779108, 714658, 911608, 561921, 875841, 829004, 931131, 686109, 653814, 789135, 763720, 821451, 923614, 573163, 840901, 459913, 654898, 691401, 537438, 865577, 706688, 794034, 615892, 526400, 589416, 634587, 906110, 875989, 592925, 824677, 781344, 212571, 525831, 757405, 474191, 510091, 483454, 249114, 813968, 572742, 627160, 721913, 290898, 485508, 665704, 646684, 653115, 633991, 868013, 273895, 511782, 604842, 698806, 577091, 702627]
13695G02627j69008k40296L40001j40117J31970O592j95948J06968j40484q1378
13685C20927L54336j15446p6353J55853j40225J8253B46621L92690k59135O4075
13675D44251L03073P7476m5822k71473k7502q2916M4668J3711R5908J31511B61247
13663E45783j00924j4814j68354J38970j23794Q4457M6044L74330j19878n8715
13653F03105j50957m5404N0732n1873L30521n8940m5623j02337k5998j87678o5046
13642B50502Q590J85737K26202k73211j61659M24749O5785B57182J99888n7969
13632C99101O9008K17911j74501j39010K36459A47205K40455L6571l5158o3631
13622C25442j33025N2072L48275k71760K1349J60554J6725A08732K76877A21659
$$ y = [702627, 533619, 293323, 633324, 493207, 625177, 631769, 435821, 542789, 402305, 320927, 675263, 559817, 483464, 639317, 499092, 517345, 246621, 639311, 380176, 444251, 747324, 824800, 778978, 507505, 480003, 397087, 441755, 455466, 551374, 682885, 261247, 545783, 444859, 430045, 261691, 400661, 276867, 361324, 407368, 781698, 661820, 603105, 452148, 406744, 457476, 405603, 736124, 677184, 631561, 529224, 503226, 315548, 250502, 259092, 444829, 671031, 397820, 236161, 660910, 726695, 257182, 457070, 399101, 468109, 686020, 511519, 372509, 608968, 147205, 387660, 424231, 389073, 325442, 192417, 244489, 592764, 321004, 342353, 502907, 519632, 108732, 385609, 121659]
13611G06572k45877j15661J7460R5015A19131L03205j15271J06880J87508j54398
13601D47055j2538j74122K53492j58036J29819a38425F07176B96224J45254m0783
13591D00695j05818m0207n1142K79003p555k19318K52943F0933N43803A02848
13580A09943J15426K13403J66563B37804k109P3363M3407K4306j52003J1583E5382
13568B50013R6316H3114M33374p7097k11345K07207Q2332k01487H2239J42368
13558B24607n7979J56837L7080L13525B64049J06820A29388J9463K73086J30989
13548E52926f3182B99349p7473j08624L01493F6583M87207j86224R5358B14857
13537F00157A31195J5437J1837n8722R7491K12433j8035F6810K13430A05493O0051
$$ y = [706572, 460695, 345034, 362494, 457509, 119131, 422336, 307065, 413945, 601453, 447055, 434517, 260395, 513887, 355851, 485670, -138425, 607176, 296224, 441478, 400695, 294877, 254670, 203528, 482531, 474976, 255658, 508601, 60933, 604736, 102848, 109943, 225369, 438772, 605335, 237804, 235695, 309058, 352465, 376771, 224768, 236351, 55382, 250013, 346329, 83114, 516488, 439391, 228046, 435253, 517585, 316098, 82239, 224607, 166628, 323465, 360545, 674070, 264049, 370869, 129388, 148851, 421937, 552926, -63182, 299349, 221876, 113252, 414745, 66583, 553790, 367566, 462924, 214857, 600157, 131195, 146632, 158469, 99747, 197238, 409671, 391636, 66810, 280240, 105493, 165544]
13526A65544J65044A62856R5004J43146j04203D1823L78898A17442R3675F5359
13515B30466K46548o4836l1072j82134a9932D01023G6060L01091o6841B0611R5723
13504A16334L26662m0322j45784J9373K19398j92765j12681J91830A65942K76810
13494D42752m2785k4210j77308J37862n5613J38845C5578K66708o7062K08552
13484D43776A79372j4646L9762l2738J47464h7294B05568J26709h3431C92725
13473C42676k959J00091I0211N26342E0893j0390J63283q9016J66586o094l6226
13462B39036N8242k5618q5596J428H554J31522J08838J0080m9294r0875M02931
13451E21756k32067n6415b39850B55788j7824o6749J2090J91496A63141J25634
$$ y = [165544, 330588, 162856, 257860, 401006, 296803, 41823, 420721, 117442, 211117, 65359, 230466, 477014, 412178, 381106, 198972, -19932, 401023, 76060, 377151, 310310, 20611, 116334, 442996, 402674, 256890, 276263, 495661, 302896, 190215, 382045, 165942, 442752, 399967, 375757, 198449, 336311, 280698, 419543, 35578, 302286, 235224, 443776, 179372, 164726, 204488, 171750, 319214, -87294, 205568, 332277, -83431, 392725, 342676, 339717, 439808, 90211, 616553, 50893, 40503, 203786, 114770, 281356, 275262, 239036, 297278, 271660, 186064, 187492, 8554, 140076, 248914, 258994, 209700, 118825, 521756, 289689, 233274, -239850, 255788, 237964, 171215, 183305, 374801, 163141, 288775]
13441B88775H5114M63110a24507d9690E10785c5450k46891F56559k86347A04871
13430I4904L1367a1657H5348K13150p8762L00464A51570R4676I6270a08516A76285
13418a34891B42272o1896K7113O8830j26618D3672K21166j06224K1819g8465C26420
13406i8591B39476m133E615K84447b9021g320A14393K66024a4099B75972r9765
13395A76207J39879I8615c3934C05903i0329b4321B18008N8837j4922j0216j03787
13384A47920K16923E9031j2770J51709K6543B0975N6440J7696K98855j84423a87170
13372E29284A04353J00626q4090J7689J5696K73403j1159A37605J81166F5484
13361A41917J68928j27504J00543j13183i790D70711A86024k4587K44956J9694
$$ y = [288775, 85114, 548224, -124507, -49690, 510785, -35450, -282341, 656559, 370212, 104871, 94904, 126271, -11657, 85348, 298498, 219736, 520200, 151570, 246246, 96270, -108516, 176285, -134891, 242272, 180376, 207489, 276319, 149701, 43672, 264838, 158614, 180433, -78465, 326420, -98591, 239476, 235343, 5615, 290062, -29021, -7320, 114393, 380417, -14099, 275972, 176207, 316086, 98615, -33934, 305903, -90329, -24321, 218008, 276845, 261923, 251707, 147920, 364843, 59031, 46261, 197970, 224513, 20975, 77415, 95111, 393966, 209543, -187170, 529284, 104353, 204979, 120889, 138578, 154274, 427677, 416518, 137605, 318771, 65484, 141917, 310845, 183341, 283884, 170701, -9790, 470711, 186024, 161437, 406393, 426087]
13351D26087a95982A98088L97365I4241i9239A74096K9580b5560j9964A81379
13340D89145b4707D31786j58289m7560K48978A65844K6438K9568J28014o4094
13330B85770F9334K49796j01810N1397J47180A20069K82315j1905j0295m7774
13320C32410J06055D1975K21873j16281K11141b4032C19102M3425A4791J81774
13310A96565l9086M3745a64461A55251o6781K11461r8774p0316n1997J015L28853
13299D08712o292E8832J14002P1816P6362A02044O5531k4865K82047r8212j12586
13288B13959l6354a84182B70498J12815j27808C0475J83641c3883I174e8018q0615
13277a38633B5546K37863n6592J20956D2844c6702B7551L89131A18968J71484
$$ y = [426087, -195982, 198088, 595453, 94241, -99239, 174096, 203676, -25560, -45524, 181379, 489145, -24707, 431786, 273497, 225937, 474915, 165844, 192282, 221850, 349864, 285770, 69334, 319130, 217320, 268717, 415897, 120069, 402384, 390479, 380184, 332410, 438465, 41975, 263848, 147567, 358708, -24032, 319102, 362527, 14791, 196565, 157479, 201224, -164461, 155251, 88470, 299931, 201157, 130841, 78844, 79859, 408712, 402420, 58832, 172834, 244650, 321012, 102044, 167575, 142710, 424757, 326545, 213959, 177605, -184182, 270498, 383313, 255505, 30475, 214116, -33883, 9174, -58018, -138633, 25546, 263409, 206817, 327773, 42844, -36702, 27551, 416682, 118968, 290452]
13267B90452r7839J12815c2608D03779B3040a05936B16406J23792a34793I6791
13256B34607A1882K53645p6182E5817b67386d9330C16786P4783A55882g2926C19721
13244b1716B68591A06722b13372A9575J29139P3278p9016b2905B35982a74921
13233A35558a98211E21014I6142L97912j40144D2227J64935J73099B3463L01716
13223C25179f6724E5837k3035J03937J43799a58681A22642J65541j05429P2879
13213B55633c02875a9120m9820B42160r2090q658M9926C9605J86251j0348q8814
13202A26694n3737J50934J7179i5505A48761G1931K5741J02328I4183j5688J16029
13191A94524k8322N8175D3099a01556B05785D8529g7227H2935H006L8310M515
$$ y = [290452, 192613, 305428, -32608, 403779, 23040, -105936, 216406, 340198, -134793, 96791, 234607, 11882, 265527, 189345, 55817, -267386, -49330, 316786, 391569, 155882, -72926, 319721, -21716, 268591, 106722, -213372, 19575, 148714, 221992, 142976, -22905, 235982, -174921, 135558, -198211, 521014, 96142, 494054, 353910, 42227, 207162, 380261, 23463, 325179, -66724, 55837, 32802, 136739, 280538, -158681, 122642, 288183, 182754, 255633, -302875, -19120, -68940, 242160, 150070, 141412, 191338, 39605, 225856, 215508, 126694, 72957, 223891, 241070, -95505, 148761, 71931, 97672, 200000, 94183, 78495, 194524, 166202, 224377, 43099, -101556, 205785, 48529, -77227, 82935, 8006, 46316, 50831]
13180E0831a62020F5153J50031K64874j41252a18084I445J25906c671o189A96650
13168A60930J20110F7940K7269b6573B59836A01333P6025L28406A56815f6121
13157g7762j6005I0910M5729E6853a55481a7564B76933G1658a09007C99376A74239
13145A98981K27869a60997h399j91240D36488I2389B1396i0818A31050a7431j47301
13134a64732d5099C79470F451J78641j5883k0117K0038k8332a14838K1684K8279
13123f4875A48762Q3246B5843a84526A70581b58015a10829o1906A77208a48013
13112g6751A07919j8158C2172Q2163a13558A90819j1326q1734M5658A7715b05467
13100B1297J66276a48536C68043E5934Q0723o3255d5817A9185b3591k16695R7620
$$ y = [50831, -162020, 65153, 215184, 480058, 338806, -118084, 9445, 135351, -3671, -9860, 196650, 160930, 281040, 67940, 95209, -26573, 259836, 101333, 177358, 505764, 156815, -66121, -77762, -93767, 90910, 136639, 56853, -155481, -17564, 276933, 71658, -109007, 399376, 174239, 198981, 426850, -160997, -8399, -199639, 436488, 92389, 21396, -90818, 131050, -17431, -164732, -45099, 379470, 6451, 185092, 169209, 149092, 169130, 140798, -114838, -93154, -64875, 148762, 232008, 25843, -184526, 170581, -258015, -110829, -172735, 177208, -148013, -76751, 107919, 89761, 32172, 114335, -113558, 190819, 179493, 97759, 143417, 17715, -205467, 21297, 187573, -148536, 368043, 55934, 136657, 73402, -45817, 19185, -23591, -240286, -142666]
13089a42666B23903L06888F938L2910A1102d0129A91419a9783C4390c00887B65232
13077f2768A69187b53421O51A39312h0578l2936C1565n556M1751L67915A92942
13065g9136B28024b65392D49525G3619L38089j84486H8428k8427f4892j51334
13055b16226R3487b9005A1228K44109b5925B14892p2393a91923j14610C9849a02794
13043A5068b3557B5091J54676G1313N9076B4880M504J47740a10957B09865a38793
13031A44633o7487J19089K17425b06568K0893l148B55070a89159j58730D32659
13020A11454k6926J98164d8726j9832m3941A95511J9304a63530b1A81590A5542
13008c7467C96847C7485J17063n6316d3612A38991K02744q6598o1935c7800A79681
$$ y = [-142666, 223903, 530791, 6938, 39848, 11102, -40129, 191419, -19783, 34390, -300887, 265232, -62768, 169187, -253421, -252770, 139312, -80578, -113514, 31565, 26009, 67760, 435675, 192942, -79136, 228024, -265392, 449525, 73619, 411708, 227222, 88428, 60001, -64892, -216226, -122739, -29005, 11228, 255337, -25925, 214892, 142499, -191923, -306533, 39849, -102794, 15068, -23557, 25091, 179767, 71313, 130389, 24880, 29384, 177124, -110957, 209865, -138793, 144633, 77146, 196235, 413660, -206568, -185675, -188823, 255070, -189159, -347889, 432659, 111454, 84528, 282692, -48726, -68558, -112499, 195511, 214815, -163530, -21, 181590, 15542, -37467, 396847, 37485, 154548, 98232, -43612, 138991, 341735, 255137, 193202, -37800, 179681]
12996B46245K0488N6042b0660l0551k19520C28193A53360b10361b7912B81182
12985a02071B50073F564J89615a0272A13784k0423a55357B6413J10400a29957
12974a19194C71151b96165D2868b11484B05922n4550J79078G5174A334J27680
12964A29014J503g8703B77398P8817A69853J38370a28434E3100B1325R3691b54984
12952g5084K4444b4491B80177a43416I208J66104e864m6763A85304D4992b79959
12940a42011N7645A49826a97205A05837f4240o5748B4578b990C34698A45374m0866
12929A04508b79682F7099O2714J34245a34301A3561K55826B1981a87465f484m2724
12918d9208A8251e7085j19831A12240O1403h365j99024C45954A32894i6630B31372
$$ y = [246245, 266733, 322775, -20660, -51211, -270731, 328193, 153360, -210361, -27912, 281182, -102071, 250073, 6564, 196179, -10272, 113784, 93361, -155357, 26413, 136813, -129957, -119194, 371151, -296165, 42868, -211484, 205922, 151372, 330450, 75174, 1334, 129014, 130517, -78703, 277398, 356215, 169853, 308223, -128434, 53100, 21325, 115016, -254984, -75084, -50640, -24491, 280177, -143416, 9208, 175312, -5864, -52627, 185304, 44992, -279959, -142011, -84366, 149826, -197205, 105837, -64240, -129988, 24578, -2990, 334698, 145374, 104508, -279682, 67099, 129813, 264058, -134301, 13561, 269387, 21981, -187465, -6484, -49208, 18251, -57085, -176916, 112240, 173643, -8365, -207389, 345954, 132894, -96630, 231372]
12906B76208j16085E3982j6196a2983o5955B15399b61943A9654b53510a0438B50710
12894A89831b71825c0108l1489K595j83376P2128D29154A73580b73583f3232P030
12883e6202G6391N9773C6946Q2424b3111A60998L7136J4118C320N2398K7320a53478
12870A61113a58234A0191P119D466a15924a20C19008i6848A68460J03819o7701
12859B04578J54240a71099O9576l6294C44878a13984H87b54222D2992I551b05134
12847H3901b11327d9999A14358d4918A42724a11838A14927b20598b0323n0571
12837g0894r7441D03294K3382a86333A87130b89304a27211H898J46686b6154j32011
12826a58165D5372J63710f1784A75300a94968J8194B08715J72932b06981c1882
$$ y = [276208, 160123, 53982, 37786, -12983, -78938, 215399, -261943, 19654, -253510, -10438, 250710, 189831, -271825, -30108, -61597, -59002, -242378, -170250, 429154, 173580, -273583, -63232, -56202, 76391, 136164, 36946, 119370, -23111, 160998, 198134, 212252, 3320, 55718, 83038, -153478, 161113, -158234, 10191, 17310, 4466, -115924, -120, 319008, -96848, 168460, 272279, 204578, 358818, -171099, -101523, -137817, 344878, -113984, 887, -254222, 42992, 9551, -205134, 83901, -211327, -49999, 114358, -44918, 142724, -111838, 114927, -220598, -20323, -70894, -168335, 403294, 426676, -186333, 187130, -289304, -127211, 8898, 155584, -26154, -158165, 45372, 209082, -61784, 175300, -194968, -176774, 208715, 381647, -206981, -31882]
12815C21294a13730A02900J07379A7110b26588J06369A95765a12349k11146A82735
12804c5401B92963m6809F3397c6127B6178a35870D1001d5688M67a4992A46751
12792D68839a79501j6544b024j32407D6144b82820g6756J2912B2377f2369C51939
12780i9275n6177P5213E0607a75642Q7231l0649B08960L156L59f6885j65407k4596
12768b56888N9697G7096a05910B47610a70780f7456C3030e7081f710j14414F3496
12756B12091a11650F2274b52657B8310i6601n3244a6940j22983B04939o4209g1387
12744i9395A8714a47331k16845J52458D1360J36057f1921H4237a38263B907J59255
12733A62162l4507f6468F928M0741M7273a27331L095B4762K0519L10680j40657
$$ y = [321294, -113730, 102900, 210279, 17110, -226588, -120219, 195765, -112349, -323495, 182735, -35401, 292963, 246154, 63397, -36127, 26178, -135870, 41001, -45688, -45221, -14992, 146751, 468839, -179501, -196045, -2024, -134431, 46144, -282820, -76756, -63844, 22377, -62369, 351939, -99275, -155452, -80239, 50607, -175642, -88411, -119060, 208960, 212116, 212475, -66885, -232292, -256888, -197191, 77096, -105910, 247610, -170780, -67456, 33030, -57081, -6710, -121124, 63496, 212091, -111650, 62274, -252657, 28310, -96601, -149845, -16940, -139923, 204939, 140730, -71387, -99395, 18714, -147331, -364176, -211718, 41360, 177417, -61921, 84237, -138263, 2907, 162162, 127655, -66468, 6928, 47669, 94942, -127331, -124236, 24762, 45281, 355961, 215304]
12722B15304G7430J76930a20989E6188a94767A02046N9738i9958A05854b11061
12711G5797K15219a39587B56731B6619c3024j9503B81641i8515p5578B18031g1718
12699g4717r4005H8885A3299M6144K91013A47861K23895a28017D9832K40901j35703
12688A55030J11361m7596b04359B02629J6059g7645j48869A5795L7835J19173
12678A72803p2966k7951d73987b32425e9060N585B65691a79154B91901r0287D5546
12666C83708i0073C65851P3147a72742f9937B58479a82337A52819b9334A61527
12655A48567a41774c2908A20331J58483j00105b09778A7197b38424A12188m0513
12645G1675h559l65890b0009j92144H410b1265B16081l6209H017J55040C4872
$$ y = [215304, 77430, 254360, -120989, 56188, -194767, 102046, 161784, -99958, 105854, -211061, 75797, 291016, -139587, 256731, 26619, -33024, -52527, 281641, -98515, -174093, 218031, -71718, -74717, -168722, 88885, 13299, 59443, 350456, 147861, 371756, -128017, 49832, 290733, 155030, 266391, 218795, -204359, 202629, 218688, -77645, -226514, 15795, 53630, 172803, 99837, 71886, -473987, -232425, -59060, -53475, 265691, -179154, 291901, 201614, 45546, 383708, -90073, 365851, 438998, -172742, -69937, 258479, -182337, 152819, -29334, 161527, 148567, -141774, -32908, 120331, 278814, 178709, -209778, 17197, -238424, 112188, 71675, -8559, -374449, -20009, -212153, 8410, -21265, 216081, 179872, 8017, 163057, 34872]
12633a23591A78760a76588B95982a86551j1413G634J3646J13726J35556A27829
12622b01587g2017b0161B36690p0034b14820l4079A97889E0583J40573J44333
12612C35489L4169a29546B0729c1237A04713A6601K39445j04701l2351n8497f7534
12600A89329a62613M2867j03257A10804c17608H178J05730b1533E6099M5038R7648
12589A98785G9346e4475k08628I1920M888K5469A158K61111j01240k2730b62118
12577B40362F3161J63929A4473J62518J62808j27951J8274a65251p5032A46980
12566b80246e7828k2355J3587H7333g1383j28919E1859e4828B5714J26936D521
12554G8710p838f4151A05460B4109a07114O462P233l16315a05708E24574k20152
$$ y = [-123591, 178760, -176588, 295982, -186551, -197964, 7634, 21280, 135006, 270562, 127829, -201587, -72017, -20161, 236690, 166656, -214820, -248899, 197889, 50583, 191156, 335489, 369658, -129546, 20729, -31237, 104713, 16601, 256046, 151345, 118994, 60497, -67534, 189329, -162613, -119746, -223003, 110804, -317608, 8178, 113908, -21533, 56099, 101137, 198785, 79346, -54475, -263103, 91920, 96808, 122277, 1158, 262269, 161029, 138299, -262118, 240362, 63161, 227090, 14473, 176991, 339799, 211848, 230122, -165251, -240283, 146980, -280246, -57828, -80183, -66596, 87333, -71383, -200302, 51859, -54828, 25714, 152650, 4521, 78710, 70872, -64151, 105460, 24109, -107114, -100652, -93419, -409734, -105708, 524574, 304422]
12543C04422B478i2335m2904C55796A06598m3722O9663J27280j02778C5906b04120
12531A9040R4418D7710B662Q2259N9558a94277c5135A6655c5379n9958B2139J22857
12519A44996a13322C20636b4557J496n3229a1548j10646n9762o3879D1497f9223
12507a81129K6452H0584M4253O8453a91697R2295D3480b73926a4489j32923j12255
12496b59667e5916A70743J40406I8577P1726j3374C2956h2059A21478j6304R564
12485A14738a30692A68823c44493A97511b48126a9846C25499a24811E3606a10677
12474g080p751p6970c728j52427k3866A76958C9898P8049a8282P034F8758i1406
12461D8321d787j69777O6786q851B53756b8854A37330C2154c05263N299a09221
$$ y = [304422, 2478, -92335, -135239, 355796, 106598, 62876, 132539, 259819, 157041, 35906, -204120, 19040, 113458, 47710, 2662, 84921, 144479, -194277, -35135, 16655, -35379, -95337, 22139, 144996, -113322, 320636, -24557, -23061, -76290, -11548, -122194, -181956, -245835, 41497, -69223, -181129, -154677, 80584, 124837, 193290, -191697, -99402, 43480, -273926, -14489, -147412, -259667, -55916, 170743, 311149, 98577, 170303, 156929, 32956, -82059, 121478, 105174, 114738, -130692, 168823, -344493, 197511, -248126, -19846, 325499, -124811, 53606, -110677, -7080, -14831, -91801, -3728, -156155, -180021, 176958, 39898, 117947, -18282, -11248, 68758, -91406, 48321, -4787, -174564, -107778, -116629, 253756, -28854, 137330, 32154, -305263, -299964, -109221]
12449b74046C8774c34202e4854j11075d4477j67612G0975a7513j11224n4027B08377
12437A98438b12975m6029B40865a89062N937j48263A0816D211b17452g9527J4013
12426f5514A72503E6979c69867m9288J65575A61646a94340B78347l9519a58465
12415i2071D5924K09386a06681A55855B822J8462M7135b62713M1499b8278A16793
12403i1919c2876B14399A5743a39830c9190A67881m471d3596I6365h6216i503
12391h2833c7590l7237m7485j19372a08675k16506C4413b44590G1345j7163c3330
12379F0056i2003a6749G2046C5251c4376H7406N5368a62860A13822i4580A50840
12367H9951j7370A9314J64057a5918j49864A03939a04566B49495l569j2984c50947
$$ y = [-274046, 38774, -334202, -54854, -165929, -44477, -212089, 70975, -17513, -128737, -182764, 208377, 198438, -212975, -259004, 240865, -189062, -183125, -331388, 10816, 4211, -217452, -79527, -65514, 172503, 56979, -369867, -419155, -253580, 161646, -194340, 278347, 238828, -158465, -92071, 45924, 255310, -106681, 155855, 2822, 21284, 68419, -262713, -221214, -28278, 116793, -91919, -32876, 214399, 15743, -139830, -39190, 167881, 163410, -43596, 96365, -86216, -9503, -82833, -37590, -74827, -122312, -241684, -108675, -325181, 34413, -244590, 71345, 54182, -33330, 60056, -92003, -16749, 72046, 35251, -34376, 87406, 142774, -162860, 113822, -94580, 150840, 89951, 72581, 19314, 183371, -15918, -165782, 103939, -104566, 249495, 245926, 232942, -350947]
12355i7768a7817A00464K39061A27594A3523a14638A00059J64558J5644A38878
12344F6453b47902K7283g0462m10299A22716N6866c63363A18780J05326b3408
12333c5677B9295E445i9469A9268J85047h3973a6508M137F0898q290c3838E2850
12320C26946A04590a67984g0042p9869B252L0537J08659C0288J45227K50909j81475
12309B44949l4092a18078A30511f7126B35265D3484b0691A69036K43510F6286
12298A80491M953J72996b48952J04846A15624a00660c0357D93512H2886L6285
12288A19171J23832i6564b5615a2716B7933J90465A518b06360j54618I0208e3708
12276D3904L9969B2996K76131p9062G3056C6194P5602P6694l143l0591a17598
$$ y = [-97768, -17817, 100464, 339525, 127594, 13523, -114638, 100059, 264617, 280261, 138878, 66453, -247902, -220619, -70462, -480761, 122716, 179582, -363363, 118780, 224106, -23408, -35677, 29295, 5445, -99469, 19268, 204315, -83973, -16508, -12371, 60898, 52608, -33838, 52850, 326946, 104590, -167984, -70042, -149911, 2252, 32789, 141448, 30288, 175515, 426424, 244949, 210857, -118078, 130511, -67126, 235265, 43484, -20691, 169036, 412546, 66286, 180491, 185444, 358440, -248952, -144106, 115624, -100660, -30357, 493512, 82886, 119171, 243003, -96564, -25615, -12716, 27933, 218398, 1518, -206360, -360978, 90208, -53708, 43904, 83873, 22996, 299127, 220065, 73056, 36194, 111796, 188490, 185347, 154756, -117598]
12264C3719L80055A28105K5809h8492k36986E3810J06878K90242j79257a01804
12253a1930k13920A22475A3447J03873K6314A7216J68075a3909C37791j47402
12243A90389c5923A61092b5312F06689D0584G074L40409G066J12133c0591B75939
12231A80160G0775g46B3506a62952A99200p1606d8490l64593B74419p4301R5046
12220B95164c65724A14755m83J39415p0899a48268B64175q9503K44304j41762
12210B77214A20922K21996b21291C65801j0681n8165h292A14428k7055b24817
12199A3812K31694P6442a3030D19987E4044a59068B99505A9418a3083D83360A10212
12187G1570J4545j2078L08171j82374m2826o5365m616J58784N0052I0896F842
$$ y = [33719, 413774, 128105, 153914, -88492, -325478, 53810, 160688, 450930, 271673, -101804, -11930, -225850, 122475, 13447, 117320, 143634, 17216, 185291, -13909, 337791, 190389, -35923, 161092, -25312, 606689, 40584, 7074, 347483, 7066, 119199, -30591, 275939, 180160, 70775, -746, 23506, -162952, 199200, 127594, -48490, -413083, 274419, 200118, 295164, -365724, 114755, 114272, 253687, 182788, -148268, 264175, 174672, 418976, 277214, 120922, 342918, -221291, 365801, 355120, 296955, -8292, 114428, 87373, -224817, 13812, 245506, 321948, -13030, 419987, 54044, -159068, 299505, 19418, -13083, 483360, 110212, 71570, 86115, 74037, 382208, 199834, 157008, 91643, 87027, 245811, 295863, 90896, 6842]
12175A81486J06865K8569i8273F4433b90822D8666J93840B0026L16486K0765m1482
12164C15795I1914L27620A10579L1383L31186a52991B06085a10258o4439A16329
12153I6437C8716J69823J25251J05867M4248I8608M7945B1723O00494A19277Q26
12142A20103F265K77724A14787I740D647M9509J18258a00054B26072A1785J98837
12131B10622o54A04156M1636M7607f7017A42106a37845F5442A3758h2971a9899
12119H4510c24381f8769G740J64886N2646f6923k2846A84525e9875D78199A99369
12107i802B75071i8629k20533C2094Q4399J50221a02449j5050A32861J86371j3146
12096C06086O4118j38821a05056J77C1293b24977B34642b56701A16809n3820K11116
$$ y = [181486, 288351, 316920, -98273, 64433, -290822, 48666, 242506, 20026, 336512, 357277, 315795, 91914, 419534, 110579, 141962, 473148, -152991, 206085, -110258, -174697, 116329, 96437, 38716, 208539, 333790, 439657, 483905, 98608, 146553, 21723, 622217, 119277, 120103, 6265, 283989, 114787, 9740, 4647, 54156, 172414, -100054, 226072, 11785, 210622, 209968, 104156, 145792, 193399, -67017, 142106, -137845, 65442, 13758, -82971, -19899, 84510, -324381, -68769, 7740, 172626, 225272, -66923, -89769, 184525, -59875, 478199, 199369, -9802, 275071, -98629, -319162, 32094, 116493, 266714, -102449, -117499, 132861, 319232, 306086, 370204, 231383, -105056, -104879, 31293, -224977, 234642, -256701, 116809, 62989, 274105]
12085B74105J17347H4735l7834h4898l2920C37333k6451b46091H1367R3155E8949
12073I3359L7498A5685L6693d5275A50486a69209A22102J24896O8379e0367I8519
12061B45784l8379k7195C3248J07766c2698D51700a46798C31496I2705M7824p282
12050A33247F4109K00852d5664B4882f2810A94476a11682I5890J44041b7628B4882
12038A57975b50242H70K32795i9731j414c7293C66532j62958r2295M8691m533
12027A55437a72883D0349a05034A45672a01677B99154a75454b4760m9008B0808
12016C92479H1231B9215e2572j91140n8945B11461G4868N697d8628m8598K8439
12005f8787P384A16071b4155C2835J58100d8348R60A16976R9457a74734P388H6396
$$ y = [274105, 391452, 84735, 46901, -84898, -117818, 337333, 310882, -246091, 81367, 174522, 58949, 93359, 130857, 15685, 52378, -45275, 150486, -169209, 122102, 246998, 315377, -50367, 98519, 245784, 207405, 180210, 33248, 141014, -32698, 451700, -146798, 331496, 92705, 140529, 133247, 64109, 264961, -45664, 24882, -62810, 194476, -111682, 95890, 239931, -27628, 24882, 157975, -250242, 870, 233665, -99731, -101145, -37293, 366532, 203574, 111279, 159970, 155437, -172883, 40349, -105034, 145672, -101677, 299154, -175454, -24760, -73768, 20808, 392479, 81231, 29215, -52572, -243712, -302657, 211461, 74868, 80565, -48628, -97226, -68787, -61403, 116071, -24155, 32835, 190935, -48348, -47388, 116976, 216433, -174734, -167346, 86396]
11992B40205b6453p1266B33422K2440p1624A0978d75E3022J66907n8249n0309
11981A11371O8585a72552f1131l7625A45491A9963c38275C83111F1051c15526
11970g2874A18636b387I3735m358a95123R6434d012l1649C7798d1688B97852a57134
11957A77462b38843J07922C18431m4569b9704j65699B52098E0860M6914e2505
11946A80892a15850a7936r3579a7332A64277D9569a10380j08444J09133C11313
11935b06496A43336d10080B5945a36521P836C2634b10553B16346A2175J78866
11925A91041D4569b9268k40250B33456f4659A47385j4504g3446b3229A49268q004
11914A41264N1814a79643n9947A03907f0846D5169a7606l43203A62012a93500
$$ y = [240205, -26453, -97719, 233422, 255862, 184238, 10978, -475, 53022, 219929, 161680, 111371, 179956, -172552, -61131, -98756, 145491, 19963, -338275, 383111, 61051, -315526, -72874, 118636, -2387, 93735, 89377, -195123, -98689, -4012, -35661, 37798, -41688, 297852, -157134, 177462, -238843, -130921, 318431, 273862, -29704, -195403, 252098, 50860, 97774, -52505, 180892, -115850, -17936, -111515, -17332, 164277, 49569, -110380, -218824, -109691, 311313, -206496, 143336, -410080, 25945, -136521, -128685, 32634, -210553, 216346, 12175, 191041, 44569, -29268, -269518, 233456, -64659, 147385, 132881, -73446, -23229, 149268, 141264, 193078, -179643, -239590, 103907, -60846, 45169, -17606, -360809, 162012, -193500]
11903a08891b0117i180j16728m4701j68339K527B9538e1839E8921L5436e0810
11891e0730k00613e7617p345K0783m9600p1952k81441C2335J48015a63321A21161
11879a28932I9895K6099a12499I1819O5875d00202A2823P1787a16000A922f4702
11867b56024B00133l7815a28634j7403I1880a29266m34055c909j75124J6040d6309
11855g9386c4182k40764C557J12309H94J97849l42L0749I0626a13645A04278a73375
11842f4291B55055A2480b60960a29860C33767f5840j14767j6231Q1206a4654j49986
11831a64640A17578b40633A34274c8375e663j05117A3507i8132o077H0081R347
11820H9428F696a94779C4019a01205l66658A12394a28985J2290j5960j76615K4346
$$ y = [-108891, -20117, -9180, -125908, -170609, -338948, -336421, 29538, -51839, 58921, 94357, -50810, -50730, -251343, -57617, -64962, -44179, -93779, -165731, -447172, 32335, 180350, -163321, 121161, -128932, 99895, 125994, -112499, 91819, 157694, -400202, 12823, 84610, -116000, 1922, -64702, -256024, 200133, 162318, -128634, -146037, 91880, -129266, -563321, -3909, -179033, -162993, -46309, -79386, -34182, -274946, 3557, 115866, 894, 198743, 198401, 229150, 90626, -113645, 104278, -173375, -64291, 255055, 12480, -260960, -129860, 333767, -65840, -180607, -196838, -115632, -14654, -164640, 117578, -240633, 134274, -38375, -5663, -110780, 13507, -98132, -104209, 80081, 89428, 6696, -194779, 34019, -101205, -467863, 112394, -128985, -116695, -132655, -309270, -284924]
11809b84924A07262J71512g8066j31637M0735B79233a6789B997a05888c0861j03522
11798a34383g113A05405B830g4384a2753A23747B2413g4072j44056c9746B0656
11786A70640b6084F110K65304H6907f6306A90537a12276K0384F7501b22276f6775
11774a63700A28984b21067F2088e3685A94563J16339b42090r6682b8135r2643
11764a20778j95397B83762a11719e4330k88187D6937a03588A74354c31122A68092
11753b5775j54712f4131A4536i7307j44065B6026K50458D6608a8585F9495A6803
11741C92152b3673A80056b0186k02641D9791K3555c312B32222b33078h1499H5372
11729A89891a95706j790C1172K95907b4348j58109B03736J24897i8803C62453
$$ y = [-284924, 107262, 278774, -78066, -209703, -168968, 279233, -16789, 2997, -105888, -30861, -134383, -7113, 105405, 2830, -74384, -12753, 123747, 22413, -74072, -218128, -39746, 20656, 170640, -26084, 6110, 271414, 86907, -66306, 190537, -112276, -91892, 67501, -222276, -66775, -163700, 128984, -221067, 62088, -53685, 194563, 310902, -242090, -338772, -28135, -120778, -316175, 283762, -111719, -54330, -342517, 46937, -103588, 174354, -331122, 168092, -25775, -180487, -64131, 14536, -97307, -241372, 26026, 276484, 46608, -18585, 69495, 16803, 392152, -23673, 180056, -20186, -222827, 49791, 73346, -3312, 232222, -233078, -81499, 85372, 189891, -195706, -197496, 31172, 327079, -24348, -182457, 203736, 328633, -98803, 362453]
11718A1060M9459B950A390Q813L21577C3560J9090J90209c24625A4729K20746
11707B35475C3151d42285K10704p7218M7759H7680L4907K90772j87882B5064K47255
11696B72319E0047d33649J97393b5765E5754b74277A18030J56878M5266C0487
11685A77497K02100i7621b8505B73444n4161b77732a34950M7850F9171J5712K38886
11674C23769A11264Q7728C7897a51145D2858K47322H5920b71255A35218i4440
11663D9273b0563B651J08338B9048K04826j07512L4668N285i4029C7374b39260
11651B75059N2575E4128a16859L0454q3300B82830a1152B38926d5413k33697B18021
11639a08661A61142b08513A12992i7673F0254d8088j71165j27007G844J10525
$$ y = [11060, 60519, 2950, 1390, 10203, 331780, 33560, 52650, 242859, -324625, 14729, 235475, 33151, -442285, -231581, -308799, -261040, 87680, 122587, 413359, 225477, 25064, 272319, 50047, -433649, -236256, -25765, 55754, -274277, 118030, 274908, 320174, 30487, 177497, 379597, -97621, -28505, 273444, 219283, -277732, -134950, -87100, 69171, 84883, 323769, 111264, 198992, 37897, -151145, 42858, 290180, 85920, -271255, 135218, -94440, 49273, -20563, 2651, 110989, 29048, 233874, 126362, 161030, 166315, -94029, 37374, -239260, 275059, 327634, 54128, -116859, -86405, -169705, 282830, -11152, 238926, -45413, -279110, 218021, -108661, 161142, -208513, 112992, -97673, 60254, -48088, -219253, -346260, 7844, 118369]
11629A18369a18855F7254L6655c5176Q679c740B29649g1561A38268F1398a43196
11617h4616m7127D1407a57682F9952M2918b22625h8065L3003A36390A5648g4314
11605b6526j45884m726A06290a66969e216I3765K73788A19121a4326j85444p8282
11594b78052E6834d01497B8526j0928h8744H1631R6711b14712I4955a78041Q8778
11583h9263o555F4859d5329D02607a2404j01571A05711d8863A2146J27896F3415
11571D59417A51636J87907C492g8996j2525k10933i3061j7794A10348K46416H3382
11559B8962b6621P037C42577j19517j09840D6946b3959A53636m9835D4467L57400
11548D01867m9546I7580m5131L336g062F8709g4669A96484i7199A10189f0894
$$ y = [118369, -118855, 67254, 103909, -35176, -26497, -3740, 229649, -71561, 138268, 61398, -143196, -84616, -131743, 41407, -157682, 69952, 112870, -222625, -88065, -55062, 136390, 15648, -74314, -26526, -172410, -177136, 106290, -166969, -5216, 93765, 367553, 119121, -14326, -199770, -278052, 56834, -401497, 28526, 17598, -88744, 81631, 178342, -214712, 94955, -178041, -89263, -95818, 64859, -45329, 402607, -12404, -113975, 105711, -48863, 12146, 140042, 63415, 459417, 151636, 339543, 3492, -78996, -91521, -302454, -93061, -110855, 110348, 356764, 83382, 28962, -26621, -19584, 342577, 223060, 113220, 46946, -23959, 153636, 103801, 44467, 401867, 352321, 97580, 52449, 55785, -7062, 68709, -74669, 196484, -97199, 110189, -60894]
11536i921B0206Q4430J25472b511B23645g7498a6519p7493b9768j98855i978j58466
11524a68444e2312q749E1366L19978i4491j39305D45222j09174e3794H8815P445
11513I6260c9535j38563a1243j62616H6707c81421H3727a06958c9796a7091L435
11502a3656k77919J10182B78831k7882G7004J53064j6791p1379b51267C1379b18647
11490A19137j1168J28789F790L96850a87572m7260A66493k5953m2355P6233n8769
11479A15649g5247D6811c4548A00440D8963M5445m099l6396b20465B57121L1584
11468B88705b12004C08316j41420e4900H9496J79938a69403A29410C6198a48767
11457D07064c8951B84807b19639H751J16150K59973G3359L17348j80066J50651
$$ y = [-9921, 20206, 104636, 230108, -2511, 223645, -77498, -16519, -94012, -29768, -228623, -9978, -168444, -52312, -61061, 51366, 371344, -94491, -233796, 445222, 336048, -53794, 88815, 96260, -39535, -178098, -11243, -173859, 86707, -381421, 83727, -106958, -39796, -17091, -13656, -291575, -181393, 278831, 250949, 77004, 230068, 213277, 141898, -251267, 31379, -218647, 119137, 107969, 236758, 6790, 403640, -187572, -234832, 166493, 140540, 98185, 174418, 115649, -75247, 46811, -34548, 100440, 48963, 94408, 90309, 53913, -220465, 257121, 288705, -212004, 308316, 166896, -54900, 89496, 269434, -169403, 129410, 36198, -148767, 407064, -38951, 284807, -219639, 8751, 124901, 384874, 73359, 390707, 210641, 361292]
11447C61292I5233a65437A66221a9899C1721b16859a9227G5974a03480A69019
11436A63753c664j57990D47899A25796a16743I3230f7709A17362d8268A50154
11425a61442M5606A5197M73697a76053B49551c999A56452k3457J3241C1610J03292
11414A34902k0019l1220D722K11213D4954b76810d6759q6686b8303I2429R214
11403A01643a50594K5362o4383h8242j40067D9101b05097M2540M999G464b23647
11391B5968O7252c87121B05922L50726E5836d1695l17632C254J03846e303k09995
11380b15298I934b88892a36007A40347b212B48526B4455N7886d2281B92875A5386
11368a0415j03241A83746a31540C1631f9300A42033a22059l4972C5029K17710
$$ y = [361292, 95233, -165437, 166221, -19899, 31721, -216859, -19227, 75974, -103480, 169019, 163753, -3664, -161654, 447899, 125796, -116743, 93230, -67709, 117362, -48268, 150154, -161442, -115836, 15197, 488894, -176053, 249551, -3999, 156452, 132995, 146236, 31610, 134902, 114883, 83663, 4722, 215935, 44954, -276810, -46759, -133445, -28303, 92429, 101643, -150594, -125232, -189615, -88242, -228309, 49101, -205097, -162557, -157558, 7464, -223647, 25968, 93220, -387121, 205922, 556648, 55836, -41695, -359327, 3254, 107100, -5303, -215298, 9934, -288892, -136007, 140347, -2212, 248526, 24455, 82341, -42281, 292875, 15386, -10415, -113656, 183746, -131540, 31631, -69300, 142033, -122059, -157031, 35029, 252739]
11358B52739a5412G2245a17256C16340E9865O3379m1813K0194N0292J2494a66375
11346a36792A56153b09066A4663a81193m5517b8025k16700C46033D6803j1927
11336C4876c327H6559a28912l3304A24799b106l18926i1520J968K1134B74005
11324d0497q644C67909a91137A18732a28475K7308H1907d1952A6147K6258n307
11313C7098J0270J78176b15979I028a17312C33608j63533J19267b90048h560B5073
11301i1281n7119A22431e1341j18620A44079f239B14470G1680a83066G1438B7694
11289b00636l6805A8460P082a27657d3028m3055r969g38j56945D8476a41014B02382
11276e6105k42354A01093a70731P9590A42873D0465b05986i1070J1965A07057
$$ y = [252739, -15412, 72245, -117256, 316340, 59865, 123244, 81431, 101625, 151917, 164411, -166375, -136792, 156153, -209066, 14663, -181193, -226710, -28025, -244725, 346033, 46803, 34876, -3327, 86559, -128912, -162216, 124799, -2106, -321032, -91520, -89552, -68418, 274005, -40497, -49141, 367909, -191137, 118732, -128475, -101167, 81907, -41952, 16147, 42405, 37098, 47368, 225544, -215979, 9028, -117312, 333608, 170075, 289342, -290048, -8560, 25073, -91281, -148400, 122431, -51341, -169961, 144079, -6239, 214470, 71680, -183066, 71438, 27694, -200636, -237441, 18460, 25542, -127657, -43028, -86083, -96052, -738, -157683, 48476, -141014, 202382, -56105, -298459, 101093, -170731, -91141, 142873, 40465, -205986, -91070, -79105, 107057]
11265a91705j02511A21499B0832e7121A44407b21323q1987A92616G4542a42645
11254a67855g4687E3592J9293K8360b3381K162D60776A3308K0711J73758h981
11242F3270d6478l06703F3962J7945L430O2604m5542a65658F4693d7396A01999
11230b69739i7365B49256A024J11906J4381b03772j14044J42555M9389F120L467
11219I587b2900j5465k35413B4829K6669a57242j19663K2558O7737Q8853B15676
11207b9111j51283A72091k6393c98432J76201N6521K2346q724a556k44631E1164
11195h6470A79234B5931b54797J05937g4233b6389A7468a91038M2083n052j95540
11184c49547B63954A5606J95520g0918A38264D4441O228c21166D3994c96998A66374
$$ y = [-191705, -294216, 121499, 20832, -57121, 144407, -221323, -303310, 192616, 74542, -142645, -167855, -74687, 53592, 72885, 101245, -23381, -21219, 460776, 13308, 34019, 207777, -8981, 63270, -46478, -353181, 63962, 81907, 85337, 147941, 102399, -165658, 64693, -47396, 101999, -269739, -97365, 249256, 1024, 112930, 127311, -203772, -317816, -175261, -125872, 6120, 9587, -22900, -38365, -273778, 24829, 51498, -157242, -276905, -254347, -186610, -97757, 215676, -29111, -180394, 172091, 145698, -398432, -222231, -165710, -143364, -152088, -1556, -246187, 51164, -86470, 179234, 25931, -254797, -148860, -74233, -26389, 17468, -191038, -148955, -154007, -349547, 263954, 15606, 211126, -70918, 138264, 44441, 50669, -321166, 43994, -396998, 166374]
11172b80069B66051A14941a07845j39665m3102g5432k48120I8276B473K08761
11162B11234I9857C9312h7736D2843h5392r5668k4419A08925m2816A0923M7592
11151E8515c41458c7781j0221A09691h3434b2795j73234P1038d507j91645A29014
11139a70706G0530b45497d8107G1624a86754G816g3796G3539j2474L10099a20878
11127A07032a67274G6565O0791a20635F6566J02645a80157E9307P0845m4074J67163
11116B53241a24016B36757i6858j71966D41907a0856A13698O6750f7133A44066
11105B61570F6202h6511B9618J32465a28038q3708E957J1478J58110l8627D508
11093A16436J13465a176D3694i0516D33712b55557A62815a6604A72193J48680
$$ y = [-280069, 266051, 114941, -107845, -247510, -290612, -75432, -323552, 98276, 2473, 211234, 99857, 39312, -87736, 42843, -85392, -181060, -205479, 108925, 66109, 10923, 58515, -341458, -37781, -48002, 109691, -83434, -22795, -196029, -124991, -4507, -196152, 129014, -170706, 70530, -245497, -48107, 71624, -186754, 7816, -73796, 73539, 61065, 371164, -120878, 107032, -167274, 76565, 137356, -120635, 66566, 169211, -180157, 59307, 130152, 86078, 253241, -124016, 236757, -96858, -268824, 441907, -10856, 113698, 180448, -67133, 144066, 261570, 66202, -86511, 29618, 162083, -128038, -211746, 5957, 17435, 175545, 136918, 4508, 116436, 229901, -1176, 43694, -90516, 433712, -255557, 162815, -16604, 172193, 320873]
11083C20873G0041B4740R8988n0975B5488L85844C2693f3297k67355D6976g5970
11071C93615H4890O4596M05578B27571p6044g4267A10325K87377C8131K87054
11061C25185a27B82380G9650J84314J43644j47486q3372L14868L6030F9169k4213
11050D4956f3124B69097J19383n8788K60992E0595L75492p9354j5023A39685L1928
11039A71613M91989A39737K54943A75958J54296M92115k33301k58631M17578l01996
11029D46019L12298B94474L24348L77427j26310j06846k19791K72801j72601l13975
11019C29527K65128m4104j1876k1169j60390K20215k10888L65819k80500J84573
11009F36335B95099J69487O2346j14418m3850L79541B42006J41095M8310J45828
$$ y = [320873, 70041, 24740, 123728, 72753, 25488, 411332, 32693, -63297, -330652, 46976, -75970, 393615, 84890, 149486, 555064, 227571, 151527, -74267, 110325, 397702, 38131, 325185, -127, 282380, 79650, 263964, 407608, 260122, 176750, 491618, 527648, 69169, 44956, -63124, 269097, 388480, 329692, 590684, 50595, 426087, 346733, 331710, 139685, 171613, 663602, 139737, 394680, 175958, 330254, 822369, 589068, 330437, 748015, 446019, 758317, 294474, 618822, 996249, 869939, 763093, 543302, 816103, 643502, 329527, 594655, 550551, 538675, 517506, 357116, 577331, 366443, 732262, 451762, 636335, 295099, 464586, 526932, 412514, 368664, 748205, 242006, 383101, 431411, 577239]
10999E77239p1109N6153q5215K77300I7101N32154j19704L8289j48791j43372
10989B55677J83974J72862k93290K84424R4775j56393o952j36458J70099P7315
10979F46033k83392p4627N23344l26153K09511j79336K90218j43466O1655j87761
10969E36026J28176K82369O0266D89111J26141K37375j13505K24548K1521K81208
10959A266399j52928M34467j45880L47918O5012L15515l3489O1639l00065m55819
10949A402769M20343N0403l36323k03077k6359L38431r8381l41911J81058j03664
10939A283289J52092n5194J50242k03378O9721n09890j4934j73154J60850l38715
10929E20929A01112L89781B04810F120M5803O1321C9051N814N653K61208a41504
$$ y = [577239, 506130, 562283, 477068, 754368, 97101, 629255, 509551, 547840, 399049, 255677, 439651, 612513, 319223, 603647, 698422, 542029, 535077, 398619, 568718, 646033, 362641, 288014, 811358, 485205, 694716, 515380, 805598, 662132, 723787, 536026, 664202, 946571, 1006837, 489111, 615252, 852627, 739122, 963670, 985191, 1266399, 1113471, 1547938, 1402058, 1749976, 1814988, 2130503, 2097014, 2158653, 1858588, 1402769, 1823112, 1873515, 1537192, 1334115, 1307756, 1646187, 1547806, 1205895, 1386953, 1283289, 1435381, 1380187, 1530429, 1327051, 1396772, 886882, 871948, 698794, 859644, 520929, 101112, 490893, 204810, 6120, 51923, 113244, 39051, 44865, 50518, 311726, -141504]
10917B32783l3108B3143J20189K46349b11279A83835b42683C68413a11920A84427
10906a7158C73594b4481n6185A58926l9590d6691A32566a39286A53071b99596
10895C2279a49953G9901a32642A68231K03916e4332a5531A0208L05077q3330b19801
10883i4491B4869a26567e1414l91508d8688p0732c8430n9301j68559L3533e2460
10871c00837A23692J79915g0373o0829c1831G6293a91332A09956c40770C7542
10860b95391G3578b20809f2224j33758D4360K6000k6243J99052a82351a7408A6395
10848H2848K31175b9786J733A84108b84184Q0051e6822j12323A18097m7655P2944
10837A43386c6843n0062B44523a0096k08839G6608e37294h6327j0844g72k7822
$$ y = [232783, 199675, 23143, 143332, 389681, -211279, 183835, -242683, 368413, -111920, 184427, -17158, 373594, -24481, -80666, 158926, 119336, -46691, 132566, -139286, 153071, -299596, 32279, -149953, 79901, -132642, 168231, 372147, -54332, -15531, 10208, 315285, 231955, -219801, -94491, 24869, -126567, -51414, -442922, -48688, -119420, -38430, -97731, -266290, -232757, -52460, -300837, 123692, 303607, -70373, -131202, -31831, 76293, -191332, 109956, -340770, 37542, -295391, 73578, -220809, -62224, -195982, 44360, 70360, 44117, 243169, -182351, -17408, 16395, 82848, 314023, -29786, -28053, 184108, -284184, -204133, -56822, -169145, 118097, 70442, 143386, -36843, -86905, 244523, -10096, -218935, 76608, -537294, -86327, -97171, -772, -28594]
10826b8594o9042B16945c3749j68425C64836h5275j06787A80905J03657c3162
10815c5790A88130b62710N4142Q612i1527C36653E8803h8695L433k68442G0488
10803a45704b4845H8280a25859M9012D8613a50521k9430f0994n7988C3194O5845
10792I9039a3016p2134A08327J63905B9011c25845b2702k12452l1199b8314j41813
10781a70127L9518k5925B55152E7108a35179n1082A57090H918e02163a2665G5112
10769B13696A05549a00330C5695c7489A0678N2948b18811a5207j48995n1788h0391
10757b22228G8588a53246r0085g3597B37244I5477d5608j46288C06194c0114o9269
10746i9383J8556H6154b03771Q3011N5306p5302a3587o6427B48255a06307K5819
$$ y = [-28594, -97636, 216945, -33749, -202174, 364836, -85275, -192062, 180905, 284562, -33162, -35790, 188130, -262710, -208568, -199956, -91527, 336653, 58803, -88695, -85262, -353704, 70488, -145704, -24845, 88280, -125859, -76847, 48613, -150521, -179951, -60994, -118982, 33194, 99039, -13016, -85150, 108327, 272232, 29011, -325845, -22702, -235154, -266353, -28314, -170127, -130609, -156534, 255152, 57108, -135179, -186261, 157090, 8918, -502163, -12665, 75112, 213696, 105549, -100330, 35695, -37489, 10678, 63626, -218811, -15207, -164202, -215990, -80391, -222228, 78588, -153246, -243331, -73597, 237244, 95477, -45608, -191896, 306194, -30114, -99383, -80827, 86154, -203771, -120760, -65454, -140756, -13587, -80014, 248255, -106307, -80488]
10735h0488l52372g3216A27428d13793A69078j2390b63037f8858G2471A0301K76377
10724B86678a87168G9624J06121L67259D1181g8756l44601a63524d9048A00959
10713G7081a60229O7226K570l6122E7570B4693g7449l50730A45367a02096p684
10702a09780j26095a4747k82697G1680b3401k79859B3365N0189H48a73804A18536
10690i2540A15154e5885k69697f2205n7272A49719D3965a87391A27206a91418
10679i9302j02157a8361B74194a59234A40662B7668a49848D4152J88348e8729
10668d3220m7475K0315j74585c6379I6340a35662j89279a33328D7955N5776J80662
10657B84393a52892j28920I9810a39937j02235A22127E211h7436M3644D2450J63523
$$ y = [-80488, -432860, -73216, 127428, -413793, 169078, 156688, -263037, -68858, 72471, 10301, 286678, -187168, 79624, 185745, 553004, 41181, -78756, -423357, -163524, -49048, 100959, 77081, -160229, -93003, -90433, -126555, 57570, 24693, -77449, -428179, 145367, -102096, -109780, -235875, -14747, -297444, 71680, -23401, -303260, 23365, 73554, 848, -173804, 118536, -92540, 115154, -55885, -325582, -62205, -119477, 149719, 43965, -187391, 127206, -191418, -99302, -201459, -18361, 274194, -159234, 140662, 27668, -149848, 44152, 232500, -58729, -43220, -90695, -70380, -244965, -36379, 96340, -135662, -324941, -133328, 47955, 103731, 284393, -152892, -281812, 99810, -139937, -242172, 122127, 5211, -87436, -43792, 42450, 205973]
10646B05973a25675o8838A46469f8114j20145d0269F001c1677A88056d51026d9598
10634A69129c3065n8892L7237p4132k4083f8661k0001R25A77174b32337B15895
10622c57815D3850K37026E3330b61254B7971i5785k2085A10985c07217n7038E4179
10610C3144b92859A61723a80922L2062a8328D6818d800p9828m2654l5827J3192
10599a49917B42931A9784b40615N3793K9321O1954k1930e6887F0425g5439C88626
10587H1834J7668a94770e6714A00815e4525j90758q7624j9593l2613J50309b3014
10575C0891J09036A8585a44614j31167K5870A4917a82187Q4015A44737K115n1611
10564I5241D4805a62785H7077b60245f9913n3733j77966B2547J13582a85626l3743
$$ y = [205973, -125675, -194513, 146469, -68114, -188259, -40269, 6001, -31677, 188056, -451026, -49598, 169129, -33065, -91957, -54720, -128852, -152935, -68661, -88662, -87737, 177174, -232337, 215895, -357815, 43850, 280876, 53330, -261254, 27971, -95785, -117870, 110985, -307217, -364255, 54179, 33144, -292859, 161723, -180922, -148860, -18328, 46818, -4800, -84628, -127282, -163109, -149917, 242931, 19784, -240615, -186822, -157501, -95547, -117477, -56887, 60425, -75439, 388626, 81834, 99502, -194770, -56714, 100815, -54525, -245283, -332907, -352500, -385113, -234804, -23014, 30891, 139927, 18585, -144614, -275781, -249911, 14917, -182187, -98172, 144737, 146852, 95241, 44805, -162785, 87077, -260245, -69913, -123646, -301612, 22547, 136129, -185626, -219369]
10553b19369d556j58070B46313i8049n7569B1223b44843C27461A16287b41501
10542C11287j52985d5350E4915c30034h3299B9532J48743a02240B81063L1922
10532C12985j12081b86119J19942A31308J22297a02628j80215J37920e8727E7835
10521b77462J06283b2898F776c10291B9298c6434o1160p8697g0676k37126a17481
10509a71376j54050Q2618e729q7715k0370A30062P3945b58493n901G3257a67137
10497a29019k41103d4583k4424H180c93695B04755H221i428H5241K0938D0173
10485B25506m3047f7742D7494c6982k3844A25910c23285A6051b18046o7271B78871
10473H6326J20225j03025g8929A93104R4763g810A14032D8521a5023B04493J11780
$$ y = [-219369, -4556, -162626, 246313, -98049, -155618, 21223, -244843, 327461, 116287, -241501, 311287, 158302, -45350, 54915, -330034, -83299, 29532, 178275, -102240, 281063, 312985, 200904, -286119, -166177, 131308, 253605, -102628, -282843, -144923, -58727, 57835, -277462, -171179, -22898, 6776, -310291, 29298, -36434, -97594, -176291, -70676, -307802, -117481, -171376, -325426, -242808, -5729, -93444, -113814, 130062, 204007, -258493, -264394, 73257, -167137, -129019, -370122, -44583, -69007, 8180, -393695, 204755, 8221, -9428, 85241, 106179, 40173, 225506, 182459, -67742, 47494, -36982, -60826, 125910, -323285, 16051, -218046, -285317, 278871, 86326, 206551, 103526, -78929, 193104, 287867, -7810, 114032, 48521, -15023, 204493, 316273]
10462C16273J04290l0300J37695A22602P6780j2283J0372O928D9414N7542Q7646
10451A94602j3723O0070E6592a4842j12540E6152K75535g9838n4602l40495D5109
10439a88983p1021a23236n7915L927A33029J26022c54885a54357f8496j01923
10429a70419c2290j6899l4480B51148G0040a89671Q6328R41B00601H4961a55658
10417B10257a31893J9695M9340l2542r3478E5320d5819j94915h3503B54287b48555
10405A56821N030a36045b6852B32027e4146H0963d12039J66675n9276A92614b01910
10393a85841L0314A29188a47281j37573a20214J7940Q584B77186F2756D516L38729
10382C43245G3868a26200K7097c0927q8987B48792l3730a14584H8335C6665Q4177
$$ y = [316273, 420563, 390263, 527958, 122602, 199382, 187099, 197471, 204399, 49414, 106956, 194602, 180879, 240949, 56592, -14842, -127382, 56152, 331687, -79838, -134440, -474935, 45109, -188983, -260004, -123236, -181151, -177224, 133029, 259051, -354885, -154357, -68496, -170419, -32290, -49189, -83669, 251148, 70040, -189671, -103343, -102402, 200601, 84961, -155658, 210257, -131893, -112198, -62858, -95400, -188878, 55320, -45819, -240734, -83503, 254287, -248555, 156821, 161851, -136045, -26852, 232027, -54146, 80963, -412039, -245364, -304640, 192614, -201910, -185841, -155527, 129188, -147281, -284854, -120214, -102274, -93690, 277186, 62756, 4516, 343245, 73868, -126200, -99103, -30927, -119914, 248792, 215062, -114584, 88335, 36665, 120842]
10371A20842a42569A50742C6807J8115Q3978a57653b6789I5178l4258J39765J82500
10360C83185j09778b8182k53174b9175B44398l0091j6980J45372L91112B27862
10349D28151j96499Q208j19137J59222J9338J78062A28182J0973J06720o9181
10339A76694M3579M3370J02836A1280K75100R9130K19336A99716K50232A95732
10328b059H2179K87341r2962J41308j60443K3329H9491N2190P9132l036q1352
10317A36425b1663A05909C6646K84321D4743Q5939c12663a32288A75558C1057
10306C2083J41535i4846C33499j25841a43073N4607j36919G3359k4282Q3698e2429
10294A28115g882B79886A10283d0537B523K19320E6032J60375G0307b09122K0798
$$ y = [120842, -142569, 150742, 36807, 54922, 138900, -157653, -26789, 95178, 60920, 200685, 383185, 273407, -28182, -281356, -29175, 244398, 214307, 197327, 342699, 733811, 227862, 428151, 231652, 239860, 120723, 279945, 299283, 477345, 128182, 139155, 245875, 176694, 220273, 263643, 366479, 11280, 286380, 385510, 604846, 199716, 449948, 195732, -2059, 82179, 369520, 276558, 417866, 257423, 280752, 89491, 141681, 220813, 217777, 136425, -21663, 105909, 36646, 320967, 44743, 130682, -312663, -132288, 175558, 31057, 32083, 173618, -94846, 333499, 207658, -143073, -88466, -225385, 73359, 49077, 132775, -52429, 128115, -7882, 279886, 110283, -40537, 2523, 221843, 56032, 216407, 70307, -209122, -188324]
10283a88324I6350a80947A03586L5692c24032F4652h1750B75111c9545j35150
10273a74695M6217M4927b2451j28126j73571A21571b27911b5750G0056i0097E9044
10261b07825B16374F2666J11495B4374K9020b74322a3970j17765D67859a12094
10250e7592A13337a93173A33809F468c5753B92581n5047o3929a63282A66146R6971
10239B63117A15660N43725A62909K00310k0426o1399a41540A407J11206j5869
10229I6744K5973e7230B63701i1958A29189a20158j0129A64150a83262n3330h4630
10217a76458P9065a9163q4485I7991g8498l52037B71615H3506b32691a03051j80468
10206b83519B0698a9978l7822n5484E8977b02713g9799n4440O2442D4033d08358
$$ y = [-188324, 96350, -180947, 103586, 139278, -324032, 64652, -81750, 275111, -39545, -174695, -128478, -83551, -22451, -150577, -324148, 121571, -227911, -25750, 70056, -90097, 59044, -207825, 216374, 62666, 174161, 24374, 53394, -274322, -13970, -131735, 467859, -112094, -57592, 113337, -193173, 133809, 6468, -35753, 292581, 237534, 173605, -163282, 166146, 263117, 115660, 659385, 162909, 363219, 342793, 281394, -141540, 1407, 112613, 96744, 122717, -57230, 263701, -91958, 129189, -120158, -130287, 164150, -183262, -236592, -84630, -176458, -97393, -19163, -103648, 97991, -78498, -430535, 271615, 83506, -232691, -103051, -283519, 20698, -19978, -57800, -113284, 58977, -202713, -79799, -134239, -71797, 44033, -408358]
10194A35598e1793j26213A02227a68988A2153b51034L1944p4568a29052p0299
10184a99351M4576A70773J3669d14163a85506A87279a49973A13571a99489j9472
10174b18961D3518a50835E3396a36186M6730j27446I0668b14541b955j43963G1934
10162c17510d0477j20252d7314j8262a4924q9940k13235a9651G3906J45827a4125
10150a73363F5657b29100A27072Q85K39487a73239D128c78816a15009C1263K15394
10139B46657e8341A06499i1147k96008k6465G6113b10844A15020k9894c42096
10128c96488C0619c2191p9232i917l42515c5466o7037k82638n300J59669k05308
10117d36080B34253b2008A8081J07633a66233j68789D6932b85010a8576p7698
$$ y = [135598, -51793, -178006, 102227, -168988, 12153, -251034, -219090, -293658, -129052, -199351, -154775, 170773, 184442, -414163, -185506, 187279, -149973, 113571, -199489, -218961, 43518, -150835, 53396, -136186, -89456, -216902, 90668, -214541, -2955, -146918, 71934, -317510, -40477, -160729, -47314, -65576, -14924, -104864, -318099, -19651, 73906, 219733, -14125, -173363, 65657, -229100, 127072, 127957, 367444, -173239, 4128, -378816, -115009, 31263, 246657, -58341, 106499, -91147, -387155, -413620, 76113, -210844, 115020, 85126, -342096, -396488, 30619, -32191, -111423, -9917, -352432, -35466, -102503, -385141, -390441, -230772, -436080, 234253, -22008, 18081, 125714, -166233, -335022, 46932, -285010, -18576, -96274]
10107i6274p4205M6685A2555K03507D5630b63002Q1440f3359j45895d5873B41308
10095b52763A69791K24146I5527d8856k11708L5278N99j48621a51331l1174G9309
10083i7855q4124E2756J52520e3069j90486P6785A6380a1699o7574A51069b59338
10071C35988h5970j09094F867b12767i0574j22643i193j98012h3613L5636k39228
10060b87205d2867B5999D112K61064H7653a99805e0755B87692j06499A5988J06326
10049A22314E4530J9254K9454d6475k04864J07916l8794f2895k61909B184h7039
10037a89226g5905B40226a80225o628j30637C4522M9067a49206l09340K11547
10027b46999A00766j0407l0821e9786j01430J1102G7300K4619a47499A08721a15903
$$ y = [-96274, -170479, -123794, 12555, 216062, 45630, -263002, -181562, -63359, -209254, -45873, 241308, -252763, 169791, 393937, 95527, -48856, -260564, -225286, -224687, -373308, -151331, -182505, 79309, -97855, -181979, 52756, 205276, -53069, -243555, -166770, 16380, -11699, -79273, 151069, -259338, 335988, -85970, -195064, 6867, -212767, -90574, -213217, -9193, -207205, -83613, -47977, -287205, -42867, 25999, 4112, 265176, 87653, -199805, -50755, 287692, 181193, 15988, 122314, 54530, 73784, 103238, -46475, -251339, -143423, -182217, -62895, -324804, 2184, -87039, -189226, -75905, 240226, -180225, -186853, -317490, 34522, 83589, -149206, -458546, -246999, 100766, 90359, 59538, -59786, -161216, -150114, 77300, 101919, -147499, 108721, -115903]
10015B7543P1298b53527B0546R3688p285b22923F036c67067A02443b2665a928
10003i2014b3060j41140Q0847C40811I5699I222a88479G6218M5182c15870J43570
9992a72300c7415B33991c67318D26952A11478f4691l70090d7685A17238b24446
9981b36141j38339J66675b5376j47485b3325B02862b55891H703c7492q6581k705
9970a26778G8868d0329C2833a35557C5409L11467A72768b27080c1601l1164I6782
9958H6665O2753g2997j81399H7317i2601j76828i4690j87317a00047j81396A77588
9946a85039Q4710j08973E4870R7000a88913A49136b97857A5141D343J59121e3615
9934C50333d55373J83142H1549Q0547D2995a73236b0532j18139p7946H9183L27496
$$ y = [27543, 98841, -253527, 20546, 114234, 106949, -222923, 6036, -367067, 102443, -22665, -1928, -92014, -23060, -164200, -83353, 340811, 95699, 9222, -188479, 76218, 121400, -315870, -172300, -37415, 233991, -367318, 426952, 111478, -64691, -434781, -47685, 117238, -224446, -236141, -374480, -207805, -25376, -172861, -23325, 202862, -255891, 8703, -37492, -124073, -126778, 78868, -40329, 32833, -135557, 35409, 346876, 172768, -227080, -31601, -62765, 96782, 86665, 149418, -72997, -254396, 87317, -92601, -269429, -94690, -282007, -100047, -281443, 177588, -185039, -100329, -209302, 54870, 151870, -188913, 149136, -297857, 15141, 4343, 163464, -53615, 350333, -455373, -272231, 81549, 162096, 42995, -173236, -20532, -138671, -216617, 89183, 416679]
9923D16679b4532i017I6129c32105h1600B18682F2515g5156l41406E5469P868
9912F3337c77199d4225l5979A50789h4465l2933p7045p4265A452b04198A59833
9900d5340a1683l28569j95493a60192J9290l7257D2418o535K21079B0498c21137
9888a92758A05748a26435k80876A09601f2468j46110M1115k07196J83580d6167
9877B97040b51448l41044J77600g8130A59228c58307i0621l8603r346I6910C8387
9865A51823a8820o6911A44766o8140b00369g1013j43697E2717J55977G0898a41829
9853a96904h8768B0607a50743g0230b0221j10450j7024A69121c08156E8394a27157
9841A41930c1928A14491b99048a40313L5818H2766M0965P9176a27570p9527I7714
$$ y = [416679, -24532, -9017, 96129, -332105, -81600, 218682, 62515, -75156, -416562, 55469, 63337, -377199, -44225, -80204, 150789, -84465, -117398, -194443, -268708, 1452, -204198, 159833, -45340, -11683, -340252, -535745, -160192, -140902, -178159, 42418, 35883, 256962, 20498, -321137, -192758, 105748, -126435, -407311, 109601, -62468, -208578, -167463, -374659, -191079, -46167, 297040, -251448, -592492, -414892, -78130, 159228, -358307, -90621, -129224, -138570, 96910, 38387, 151823, -18820, -85731, 144766, 76626, -200369, -71013, -214710, 52717, 208694, 70898, -141829, -196904, -88768, 20607, -150743, -70230, -20221, -130671, -147695, 169121, -308156, 58394, -127157, 141930, -31928, 114491, -299048, -140313, -104495, 82766, 123731, 202907, -127570, -207097, 97714]
9829h5310B22969p9709l4902b10201Q3618A62681b37082A75799h1983n59957H6693
9817a25320j94411a16924D2774L8295b28244C23549a38705L7098A68905c70802
9806d20954B42806A3578a83626m0312i2989m1315j41004O74N2511L1054P0788
9795a20281F3198K03553d631j32082j18593B99278a38166k7529P3541A60672b07153
9783b0960C0864b55113B0089b37782a5525A97143e526A28829K10085e5731C47872
9771a25749e5591j80653B8605c46114e702F6380b03484L8764A24319R5410b08168
9759a32806j46349P8146A55458O1725b6572k79595R8462C85132b06721R8810q4122
9748a92033j79242c8784o8209A63131a55432d9045k33834K2161J23008e8453k1533
$$ y = [-85310, 222969, 143260, 108358, -210201, -126583, 162681, -237082, 175799, -81983, -641940, 86693, -125320, -319731, -116924, 42774, 81069, -228244, 323549, -138705, -101607, 168905, -370802, -420954, 242806, 13578, -183626, -223938, -92989, -134304, -275308, -274634, -222123, -191069, -120281, 63198, 266751, -4631, -136713, -255306, 299278, -138166, -165695, -92154, 160672, -207153, -20960, 30864, -255113, 20089, -237782, -15525, 197143, -5526, 128829, 338914, -55731, 347872, -125749, -55591, -236244, 28605, -346114, -5702, 66380, -203484, -164720, 124319, 219729, -208168, -132806, -279155, -201009, 155458, 217183, -26572, -306167, -207705, 385132, -206721, -107911, -192033, -371275, -38784, -106993, 163131, -155432, -49045, -282879, -260718, -137710, -58453, -79986]
9737g9986A10614a40652j13905A51044a35801k8185M3473e56j06151A21346i6991
9725b16953R2684d9820k59740B4087d761C5215h477A05813e2110A42866a67783
9713D892b01538A60679O2313c95939a27574k03172c9261j89078N7234b7160k25088
9702b52248D84006h0058A42421a82402e5744F1401J82687j20074J02429l9030
9692A87413b81406A29577m9358l578P6623b29928m4197c8376k64029b0879A55817
9680b27720c1776B29757d3058F7364a13346M5770G1169K504a96705c5421q2214
9669a17635A26881b41255E4594b21284K4785a4744k24029f693n5558B13305N1781
9658B65086g6683A99127F187a30849c8768j83573a07788d4298p4446C11146b97890
$$ y = [-79986, 110614, -140652, -254557, 151044, -135801, -163986, -120513, -556, -106707, 121346, -96991, -216953, -124269, -49820, -309560, 24087, -4761, 35215, -8477, 105813, -52110, 142866, -167783, 4892, -201538, 160679, 222992, -395939, -127574, -330746, -39261, -228339, -171105, -27160, -252248, 484006, -80058, 142421, -182402, -55744, 61401, 244088, 124014, 226443, 187413, -281406, 129577, 80219, 76641, 153264, -229928, -274125, -38376, -302405, -20879, 155817, -227720, -31776, 229757, -43058, 67364, -113346, -67576, 71169, 73673, -196705, -35421, -117635, 126881, -241255, 54594, -221284, -196499, -14744, -238773, -6693, -62251, 213305, 265086, -76683, 199127, 6187, -130849, -38768, -222341, -107788, -44298, -118744, 311146, -297890]
9646H3924h4538H774a10492a8210l83348a20730l5939n5531B3680J21052g2580
9634D8469f4225k79994a45069j94683J66922O9017G23a36047B0206K33582h7183
9622e6866G8558l7395a79849F1211a4010A77321g5011D0377e6873a5060j90714
9611b05774F2238J64288K8176a18876H4320b86805a33014M1782n2299f5430p7461
9600a42891L7905j67741H3302d0126E6004b93947J3507L3197A21975P0632c48229
9588a44194d2216l26393a31363B57037J55746C0523a18982B5851g9567J7030r7713
9577a60250j45486k08925J36792a02871L1078I9070a85559j23163a2826G2573
9566H9046L13283F7304b27740A30201K5957d47085B4919O1299P3176m4128h3332
$$ y = [83924, -84538, 8774, -110492, -18210, -401558, -120730, -156669, -212200, 23680, 144732, -72580, 48469, -64225, -344219, -145069, -339752, -172830, -103813, 723, -136047, 20206, 253788, -87183, -56866, 78558, 41163, -179849, 61211, -14010, 177321, -75011, 40377, -56873, -15060, -205774, 62238, 226526, 254702, -118876, 84320, -286805, -133014, -91232, -143531, -65430, -142891, -104986, -272727, 83302, -40126, 56004, -293947, -280440, -247243, 121975, 192607, -348229, -144194, -42216, -368609, -131363, 257037, 412783, 30523, -118982, 25851, -79567, -62537, -160250, -305736, -514661, -377869, -102871, -71793, 99070, -185559, -308722, -12826, 72573, 89046, 402329, 67304, -227740, 130201, 156158, -447085, 24919, 86218, 159394, 115266, -83332]
9554c3103A55478b78377p056j5900B72829d65212d2647l81416J84188e696l32193
9543c37889g1935a0710k45976i6071I23i9386k1565A40689f6345B58520E9688
9531b54664D8416b55999B664d7855C1400f1212K0535l12675b1675k23904A64249
9519a16392j32832i1491B10827F4038a4096j70914C4275a37776N3364B5688a81149
9507c5069j70706f4145k3353j99481B11886A01839a96697D2130c86055e625j18178
9496a23803K2980E5186B6857J1514a31726C50596h4276E1428D284J22826a12999
9484A5141i4419l9064G2879J79871a91525P7460B15782o0053a38354r9416A4718
9472e0509l6200A485c71115a54741j05444A1939a46012j25824G7916B0602J01189
$$ y = [-33103, 155478, -278377, -285433, -301333, 272829, -465212, -42647, -424063, -239875, -5696, -337889, -71935, -10710, -256686, -96071, 923, -99386, -120951, 140689, -66345, 258520, 59688, -254664, 48416, -255999, 2664, -47855, 31400, -61212, -40677, -353352, -21675, -245579, 164249, -116392, -249224, -91491, 210827, 64038, -14096, -185010, 34275, -137776, -84412, 25688, -181149, -35069, -205775, -64145, -87498, -286979, 211886, 101839, -196697, 42130, -386055, -5625, -123803, -100823, 55186, 26857, 38371, -131726, 350596, -84276, 51428, 4284, 127110, -112999, 15141, -94419, -133483, 72879, 252750, -191525, -114065, 215782, 155729, -138354, -237770, 14718, -50509, -86709, 1485, -371115, -154741, -260185, 11939, -146012, -271836, 77916, 20602, 121791]
9461A21791c00104B21052m9564a82953P2878k3180b6233A35343a40767e8478A95635
9449c00308L0288A08706c71598A09411i5241d6096F7511j5135b36228A30778a40590
9437a94232H3556J5845g6422m4289A8567K38401q623c75782c9930k5342K9590
9426c5682p9152a4722A84335p1854n5601a48231C15908c68429G34i0090j33753
9415b23843A26972f1672K5841A33953c4940l66977A72215i4800k5807A90608c48313
9403E22K65379h6131j19734k7310C33110a03766k50624C28772a41027C7781O1499
9392I9280c60547A15684c10634A15200b02482P9186B0090d18087J68384Q8737
9382a60966d8549C3233k476a23469o1552d4089A95383b28662A1250a81502A9540
$$ y = [121791, -300104, 221052, 171488, -182953, -110075, -133255, -26233, 135343, -140767, -58478, 195635, -300308, -270020, 108706, -371598, 109411, -95241, -46096, 67511, 52376, -236228, 130778, -140590, -194232, 83556, 99401, -76422, -120711, 18567, 256968, 248345, -375782, -39930, -65272, -35682, -114834, -14722, 184335, 112481, 56880, -148231, 315908, -368429, 734, -90090, -223843, 126972, -61672, -35831, 133953, -34940, -401917, 172215, -94800, -120607, 190608, -348313, 522, 265901, -86131, -205865, -233175, 333110, -103766, -354390, 328772, -141027, 37781, 99280, -360547, 115684, -310634, 115200, -202482, -123296, 20090, -418087, -249703, -160966, -48549, 33233, 30757, -123469, -185021, -44089, 195383, -228662, 11250, -181502, 19540]
9370b00917B2367a15058o1106j04351M7798R6929r2592k3897a10641o1263A04834
9358I084a30158J9579l1954B39206A10329f8758A04165c6210B00986f3207A7258
9346a52049I1999a40833N9444A17487d61265K02269A57364n7963c99264F5199
9335A75010a57276d0336J5510j70635l9060N8477l0655j7355N8394B3443K66736
9324B90179b03985A29500M5072b30649A65331a83634B6549a91714J8904b7250
9313A20590d45148J92730a3865A37437P8256I71c51497A99065a74298a9373G4706
9301a34382f2760A50321a57150c5878A79130a08667F0168b46251A66778c29019
9290a61207E2303b03232e555B76620c4132j94634L2650a8677k56455J04211B51738
$$ y = [-200917, 22367, -115058, -176164, -280515, -232717, -135788, -228380, -252277, -110641, -171904, 104834, 9084, -130158, -110579, -142533, 239206, 110329, -68758, 104165, -36210, 200986, -63207, 17258, -152049, 91999, -140833, -81389, 117487, -461265, -258996, 157364, 99401, -399264, 65199, 175010, -157276, -40336, -24826, -195461, -234521, -176044, -206699, -224054, -165660, 23443, 290179, -203985, 129500, 174572, -230649, 165331, -183634, 26549, -191714, -172810, -27250, 120590, -445148, -252418, -13865, 137437, 215693, 971, -351497, 199065, -174298, -19373, 74706, -134382, -62760, 150321, -157150, -35878, 179130, -108667, 60168, -246251, 166778, -329019, -161207, 52303, -203232, -5555, 276620, -34132, -228766, -196116, -18677, -275132, -170921, 251738]
9278a54175L5777K0432M7282N766D3827e9630k80387i3172j139a7533B40285a86271
9265g8828b0153A3963d75806a82499e522A36767n9991b81741G5051a30660b9178
9253a68475K2236k44350j72766A41407C4956b25126j58223J75669B5165c6091
9242b1831G9031K14760D1809a10425r8165j52685c3109m4943k8875I0026c04787
9230A32983i3233j0109k55627a69195B00089a13532n8536I3924J14147e5126d040
9218g2959r8781l4645A75019b29716j39004C7467c5928J2996B11622J32704a71200
9206b7935A94545A8208J5166L91036a65851B91570c43517j54140J97533B91609
9195h6138j20658R9602C4495k876c95661G8635a24223p5320P0309d2369p2482
$$ y = [-154175, -118398, -97966, -50684, -44918, 43827, -59630, -340017, -93172, -94311, -17533, 240285, -186271, -78828, -20153, 13963, -475806, -182499, -5522, 136767, 76776, -281741, 75051, -130660, -29178, -168475, -146239, -390589, -563355, 141407, 34956, -225126, -383349, -207680, 25165, -36091, -21831, 79031, 293791, 41809, -110425, -208590, -361275, -33109, -78052, -106927, 90026, -304787, 132983, -93233, -103342, -358969, -169195, 200089, -113532, -172068, 93924, 208071, -55126, -4040, -72959, -171740, -206385, 175019, -229716, -368720, 37467, -35928, -22932, 211622, 344326, -171200, -27935, 194545, 18208, 33374, 424410, -165851, 291570, -343517, -497657, -300124, 291609, -86138, -206796, -107194, 34495, 31619, -395661, 78635, -124223, -199543, -129234, -42369, -114851]
9184a14851E9275K38532a05855j26701C22202g2666A69823L84972g0793m36271
9174e07064a12091k8679N6724m9786q9393A03377a86961P5062k6178B84136d6394
9162B8434a37521j13452E2325g9038A09743c32549N0110C4442b65937A7848a16940
9150A54121m3213B5246d8577F9618i4549j08440k200D3855M9469c32431a8671
9138A62135N8373D3790K96951f0923j34528G8690a6974j19403M605M9257I7403
9126C9812I320a64192j15384E1016J48997H525Q952b54820B29327I3067i456o876
9114a6332A66888e8006j0493K1069P041l2901k51345e7685j25646D6419a39610
9102B83918b14099Q0573k65829B28387i3378D6428K7708c8244B73114d19471J98139
$$ y = [-114851, 59275, 297807, -105855, -232556, 322202, -72666, 169823, 554795, -70793, -507064, -112091, -140770, -84046, -133832, -223225, 103377, -186961, -111899, -138077, 284136, -46394, 28434, -137521, -250973, 52325, -79038, 109743, -332549, -282439, 34442, -265937, 17848, -116940, 154121, 110908, 25246, -48577, 69618, -94549, -202989, -205189, 43855, 93324, -332431, -18671, 162135, 220508, 43790, 340741, -60923, -195451, 78690, -16974, -136377, -131772, -82515, 97403, 39812, 9320, -164192, -279576, 51016, 200013, 8525, 17477, -254820, 229327, 93067, -9456, -16332, 166888, -58006, -68499, -47430, -40389, -73290, -324635, -57685, -183331, 46419, -139610, 283918, -214099, -133526, -399355, 228387, -93378, 46428, 74136, -38244, 273114, -419471, -221332]
9091b21332j98664A20469l5566h6598k03390J8210P3528k677b3906B55717n3365
9080B02352c23412a05090k31547a49760q9202H350b09849G910a83021D8277a06172
9068C22051A42751a70805o223A00026P5858b41816P0163A37823C8295Q438c9961
9056a66687a8799j58832J2366j060L4810j1829D82a07645G719J71926J8550a91321
9043F972a87676H0023j3477a28850A45140d24577K04845P6723B257b36043J06369
9032a29674a9987l96739a44948d79k61682h6088m8240A00343m6089b77850h2989
9020H3196C6633f04414a69580r9375F881Q5248b91567R1715H0783e4342A33579
9008f1380k44842J33414A70248c02433c0641R033G2016b96625a35604l5787L0630
$$ y = [-221332, -419996, 120469, 84903, -86598, -289988, -271778, -198250, -200927, -23906, 255717, 202352, -323412, -105090, -336637, -149760, -238962, 8350, -209849, 7910, -183021, 48277, -106172, 322051, 142751, -170805, -177028, 100026, 175884, -241816, -171653, 137823, 38295, 46733, -39961, -166687, -18799, -177631, -165265, -166325, -131515, -143344, 482, -107645, 7719, 179645, 198195, -191321, 6972, -187676, 80023, 66546, -128850, 145140, -424577, -219732, -143009, 2257, -236043, -129674, -19987, -416726, -144948, -479, -262161, -86088, -134328, 100343, 54254, -277850, -82989, 83196, 36633, -604414, -169580, -268955, 6881, 92129, -291567, -199852, 80783, -54342, 133579, -61380, -306222, -172808, 170248, -302433, -30641, -21608, 72016, -296625, -135604, -171391, -140761]
8997a40761C4811f215o3549r7031p6851A24160a26489E3478b23220K1584p8583
8986b80219E6595A4464h0612k24343H6404k0280d32990K4861A05913c18361D1916
8974a28448e7138d346B15055D3546a35385c7291H3195h2992B06275b2488r0103
8963a12591j17313J1156Q4624E9607a49824A73381b0772l7556a7588h472k1217
8952b9689B49679q5012b51595A78495A3998b05477A69873d4241A43340c92877
8941A2543b61257A39280c49100H9948j1861h5312F6444b6541j83059M9241O6302
8930i4057A36927b58913i5250A14781a75440h6105l9171G5508a71573G720K12365
8919B20085A0045J90132q1252L84989j78142A35493a9345B00285J31331N6087
$$ y = [-140761, 34811, -6215, -69764, -166795, -243646, 124160, -126489, 53478, -223220, -201636, -280219, 56595, 14464, -80612, -304955, 86404, 66124, -432990, -408129, 105913, -318361, 41916, -128448, -57138, -4346, 215055, 43546, -135385, -37291, 83195, -82992, 206275, -22488, -112591, -229904, -218748, -134124, 59607, -149824, 173381, -20772, -58328, -17588, -8472, -29689, 249679, 164667, -251595, 178495, 13998, -205477, 169873, -44241, 143340, -392877, 12543, -261257, 139280, -349100, 89948, 78087, -85312, 66444, -26541, -209600, -160359, -94057, 136927, -258913, -95250, 114781, -175440, -86105, -125276, 75508, -171573, 7720, 220085, 10045, 200177, 118925, 503914, 325772, 135493, -19345, 200285, 331616, 387703]
8909C87703J8357K40241K05691O85715J403533K566626K682299C823262j632391
8900B190871I91613n1342B82078K51499j09343j39881E5594J46486a69631E7618
8889B02549j8296p7973d2714j18783j07111H1751c0254r07m2256L2016a0878A5308
8876f3722B90733G717a48477o7768P223L4238M9753D3936A516K26262C4134b33835
8863a06376D7796a85157a6969I659a5679j00432F7359K6284Q2604D0388P112e687
$$ y = [387703, 406060, 646301, 851992, 1537707, 2941240, 5507866, 8190165, 3823262, 2190871, 991613, 940271, 282078, 533577, 424234, 284353, 55594, 202080, -169631, 57618, 202549, 184253, 106280, -42714, -161497, -268608, 81751, -30254, -31161, -73417, -41401, -10878, 15308, -63722, 290733, 7717, -148477, -216245, -209022, -174784, -125031, 43936, 1516, 227778, 34134, -233835, -106376, 47796, -185157, -16969, 9659, -15679, -116111, 67359, 93643, 176247, 40388, 47500, -5687]
$$ [...]
##END NTUPLES=NMR SPECTRUM
##END=
