
##TITLE=AC1114_Huila2_5867679_NIapYYy0eg
##JCAMPDX= 6.0         $$ Bruker NMR JCAMP-DX V2.0
##DATA TYPE= NMR SPECTRUM
##DATA CLASS= NTUPLES
##ORIGIN= BRUKER
##OWNER= Administrator
$$ 1.72 TOPSPIN		Version 2.1
$$ 2012-03-30 21:05:55.625 -0500  Administrator@TOPSPIN
$$ Compression mode = diff/dup
##.OBSERVE FREQUENCY= 400.13188235
##.OBSERVE NUCLEUS= ^1H
##.ACQUISITION MODE= SIMULTANEOUS (DQD)
##.ACQUISITION SCHEME= undefined
##.AVERAGES= 8
##.DIGITISER RES= 22
##SPECTROMETER/DATA SYSTEM= spect
##.PULSE SEQUENCE= zg30
##.SOLVENT NAME= COFFEE_meoh
##.SHIFT REFERENCE= INTERNAL, COFFEE_meoh, 1, 14.98061
##AUDIT TRAIL= $$ (NUMBER, WHEN, WHO, WHERE, PROCESS, VERSION, WHAT)
$$ ##TITLE= Audit trail, TOPSPIN		Version 2.1
$$ ##JCAMPDX= 5.01
$$ ##ORIGIN= Bruker BioSpin GmbH
$$ ##OWNER= Administrator
$$ $$ C:\Bruker\TOPSPIN/data/COFFEE/nmr/AC1114_Huila2_5867679_NIapYYy0eg/10/pdata/1/auditp.txt
$$ ##AUDIT TRAIL=  $$ (NUMBER, WHEN, WHO, WHERE, PROCESS, VERSION, WHAT)
(   1,<2012-03-30 21:05:48.000 -0500>,<Administrator>,<TOPSPIN>,<go>,<TOPSPIN 2.1>,
      <created by zg
	started at 2012-03-30 21:04:41.406 -0500,
	POWCHK enabled, PULCHK disabled,
       configuration hash MD5:
       1A 1E CE 29 27 FD 77 03 67 4E F0 E3 C4 B2 CB 90
       data hash MD5: 64K
       7C AD 61 35 A1 34 3E A0 A2 01 36 01 03 62 A8 48>)
(   2,<2012-03-30 21:05:51.296 -0500>,<Administrator>,<TOPSPIN>,<proc1d>,<TOPSPIN 2.1>,
      <Start of raw data processing
       efp LB = 0 FT_mod = 6 PKNL = 1 PHC0 = 0 PHC1 = 0 SI = 32K 
       data hash MD5: 32K
       EE DC 50 97 C9 6D 3A F1 73 BD 0A 92 7A ED E4 FA>)
(   3,<2012-03-30 21:05:51.656 -0500>,<Administrator>,<TOPSPIN>,<proc1d>,<TOPSPIN 2.1>,
      <pk PHC0 = 208.103 PHC1 = 0 
       data hash MD5: 32K
       BF E7 9A F5 7D 3C 43 3E AC 51 8B 98 82 9B AC 62>)
(   4,<2012-03-30 21:05:51.734 -0500>,<Administrator>,<TOPSPIN>,<proc1d>,<TOPSPIN 2.1>,
      <abs ABSG = 1 
       data hash MD5: 32K
       32 86 1F 39 C0 3F 0B 36 8E 19 60 7A CC 6B CC C3>)
(   5,<2012-03-30 21:05:51.812 -0500>,<Administrator>,<TOPSPIN>,<proc1d>,<TOPSPIN 2.1>,
      <abs ABSG = 2 
       data hash MD5: 32K
       5C 8F FB 56 67 B3 DF D8 B5 25 BF 03 01 5F 21 DC>)
(   6,<2012-03-30 21:05:51.968 -0500>,<Administrator>,<TOPSPIN>,<proc1d>,<TOPSPIN 2.1>,
      <abs ABSG = 3 
       data hash MD5: 32K
       14 FD 66 3F 9D 12 22 02 AD 32 B6 57 FF ED 17 DF>)
(   7,<2012-03-30 21:05:52.000 -0500>,<Administrator>,<TOPSPIN>,<proc1d>,<TOPSPIN 2.1>,
      <abs ABSG = 4 
       data hash MD5: 32K
       CF 54 4A DF C0 33 FE 69 A6 6D 64 7E 58 9A 8F 85>)
(   8,<2012-03-30 21:05:52.031 -0500>,<Administrator>,<TOPSPIN>,<proc1d>,<TOPSPIN 2.1>,
      <abs ABSG = 5 
       data hash MD5: 32K
       09 90 3B 22 93 9C 37 64 55 7F C0 CE DE 3D 67 1A>)
$$ ##END=
$$ 
$$ $$ hash MD5
$$ $$ 8F 17 DC 9E 2F 9F B9 30 11 FB 2D 68 F1 78 FD FA
##$RELAX= 
##$RELAX= 
##$RELAX= 
##$RELAX= 
##$RELAX= 
##$RELAX= 
##$RELAX= 
$$ Bruker specific parameters
$$ --------------------------
$$ [...]
##$TP= (0..7)
150 150 150 150 150 150 150 150
##$TP07= 0
##$TPNAME0= <>
##$TPNAME1= <>
##$TPNAME2= <>
##$TPNAME3= <>
##$TPNAME4= <>
##$TPNAME5= <>
##$TPNAME6= <>
##$TPNAME7= <>
##$TPOAL= (0..7)
0.5 0.5 0.5 0.5 0.5 0.5 0.5 0.5
##$TPOFFS= (0..7)
0 0 0 0 0 0 0 0
##$TUNHIN= 0
##$TUNHOUT= 0
##$TUNXOUT= 0
##$USERA1= <user>
##$USERA2= <user>
##$USERA3= <user>
##$USERA4= <user>
##$USERA5= <user>
##$V9= 5
##$VALIST= <valist>
##$VCLIST= <CCCCCCCCCCCCCCC>
##$VD= 0
##$VDLIST= <DDDDDDDDDDDDDDD>
##$VPLIST= <PPPPPPPPPPPPPPP>
##$VTLIST= <TTTTTTTTTTTTTTT>
##$WBST= 2048
##$WBSW= 25
##$XGAIN= (0..3)
0 0 0 0
##$XL= 0
##$YL= 0
##$YMAX_a= 517310
##$YMIN_a= -634243
##$ZGOPTNS= <>
##$ZL1= 120
##$ZL2= 120
##$ZL3= 120
##$ZL4= 120
##$ABSF1= 14.98061
##$ABSF2= -5.57192
##$ABSG= 5
##$ABSL= 3
##$ALPHA= 0
##$AQORDER= 0
##$ASSFAC= 0
##$ASSFACI= 0
##$ASSFACX= 0
##$ASSWID= 0
##$AUNMP= <proc_prof1d_extract_pilot.lims>
##$AXLEFT= 0
##$AXNAME= <>
##$AXNUC= <1H>
##$AXRIGHT= 0
##$AXTYPE= 0
##$AXUNIT= <>
##$AZFE= 0.1
##$AZFW= 0.1
##$BCFW= 0
##$BC_mod= 0
##$BYTORDP= 0
##$COROFFS= 0
##$CY= 15
##$DATMOD= 1
##$DC= 0
##$DFILT= <>
##$DTYPP= 0
##$F1P= 0
##$F2P= 0
##$FCOR= 0.5
##$FTSIZE= 32768
##$FT_mod= 6
##$GAMMA= 0
##$GB= 0
##$INTBC= 1
##$INTSCL= 1
##$ISEN= 128
##$LB= 0
##$LEV0= 0
##$LPBIN= 0
##$MAXI= 10000
##$MC2= 0
##$MEAN= 0
##$ME_mod= 0
##$MI= 0
##$NCOEF= 0
##$NC_proc= -8
##$NLEV= 6
##$NOISF1= 0
##$NOISF2= 0
##$NSP= 0
##$NTH_PI= 0
##$NZP= 0
##$OFFSET= 14.98061
##$PC= 1
##$PHC0= 208.103
##$PHC1= 0
##$PH_mod= 1
##$PKNL= yes
##$PPARMOD= 0
##$PPDIAG= 0
##$PPIPTYP= 0
##$PPMPNUM= 2147483647
##$PPRESOL= 1
##$PSCAL= 4
##$PSIGN= 0
##$PYNMP= <proc.py>
##$REVERSE= no
##$SF= 400.13
##$SI= 32768
##$SIGF1= 0
##$SIGF2= 0
##$SINO= 400
##$SIOLD= 32768
##$SPECTYP= <>
##$SREGLST= <1H.CDCl3>
##$SSB= 0
##$STSI= 32768
##$STSR= 0
##$SW_p= 8223.68421052632
##$SYMM= 0
##$S_DEV= 0
##$TDeff= 65536
##$TDoff= 0
##$TI= <>
##$TILT= no
##$TM1= 0
##$TM2= 0
##$TOPLEV= 0
##$USERP1= <user>
##$USERP2= <user>
##$USERP3= <user>
##$USERP4= <user>
##$USERP5= <user>
##$WDW= 1
##$XDIM= 32768
##$YMAX_p= 442766897
##$YMIN_p= -683906
##$CURPLOT= <Network HP LaserJet P1505>
##$CURPRIN= <$Network HP LaserJet P1505>
##$DFORMAT= <normdp>
##$LAYOUT= <+/1D_H.xwp>
##$LFORMAT= <normlp>
##$PFORMAT= <normpl>
##$SURQMSG= 1
$$ End of Bruker specific parameters
$$ ---------------------------------
##NTUPLES= NMR SPECTRUM
##VAR_NAME=  FREQUENCY,     SPECTRUM/REAL,   SPECTRUM/IMAG
##SYMBOL=    X,             R,               I
##VAR_TYPE=  INDEPENDENT,   DEPENDENT,       DEPENDENT
##VAR_FORM=  AFFN,          ASDF,            ASDF
##VAR_DIM=   32768,         32768,           32768
##UNITS=     HZ,            ARBITRARY UNITS, ARBITRARY UNITS
##FACTOR=    0.250966925370066, 1,           1
##FIRST=     8223.43324360095, -76916,       78310
##LAST=      0,             -27786,          103843
##MIN=       0,             -683906,         0
##MAX=       8223.43324360095, 442766897,    0
$$ Real data points
##PAGE= N=1
##DATA TABLE= (X++(R..R)), XYDATA
$$ [...]
19557a26509B60723d31318A51436B8679h9432a7706m42703a11056A8439J58642
19547A77081h43B22551a11276A61231j7802K0405a55996K225j32971B36643a25863
19535b83252C5467p075a76791A41839a00866d4696B64293d68682G876a92153H341
19523a88454C9090a55543j19283B84765A31597I050a11040J738l971q4553D1703
19511e3282B08999E5144e3163k3295g035G0484a61877H7557K12070c87910h9696
19499f3924C5352a44910k4762B61007a43458B21926C602b84969D19738d7077j12045
19488a59122O1573C03123h359p1115G5149A6468K44548d3322A40505C7205J73
19477C7378a8281k82174E4979J45076a42473f7726M301b1462j50056k42289G4943
$$ y = [-126509, 260723, -431318, 151436, 28679, -89432, -17706, -460409, -111056, 18439, 177081, -843, 222551, -111276, 161231, 143429, 163834, -155996, -153771, -286742, 236643, -125863, -283252, 35467, 28392, -176791, 141839, -100866, -44696, 264293, -468682, 7876, -192153, 8341, -188454, 39090, -155543, -274826, 284765, 131597, 9050, -111040, -109302, -113273, -197826, 41703, -53282, 208999, 55144, -53163, -76458, -7035, 70484, -161877, 87557, 299627, -387910, -89696, -63924, 35352, -144910, -169672, 261007, -143458, 221926, 3602, -284969, 419738, -47077, -159122, -97549, 303123, -8359, -79474, 75149, 16468, 261016, -43322, 140505, 37205, 37378, -18281, -300455, 54979, 200055, -142473, -67726, -63425, -21462, -171518, -413807, 74943]
19465A03909a00706l0733q6374A48996a0597E6757M0057b27433F1126k2108d40785
19453g7200m9478A4082J6619b29571a0935n3064I1015e8708A03605A4251d0720
19441b99462O7157A73398b90976J05997j27305M7579H6008a06706G5288K246i5127
19429c3321k38006r321M7023B0886a78008M7163r7688K3641c5763A16516e1887
19417b63537E7554a46220O8768B58195a74814F379M8381b27882A47127a94325
19406a72318I5929a03320j14751e4065J1948j43642b5389j5792k24500j14692
19396c80373a4205m0210j6481E1455B1300J99072j09528b3293l5764m43952E4844
19384a37111o879A38744B2745a11606H1946a54106J3099j03264j82121a19025
$$ y = [103909, -100706, -131439, -217813, 148996, -10597, 56757, 96814, -227433, 61126, 39018, -440785, -77200, -126678, 14082, 30701, -229571, -10935, -63999, 91015, -58708, 103605, 14251, -40720, -299462, -232305, 173398, -290976, -184979, -312284, -264705, 86008, -106706, 75288, 77534, -95127, -33321, -271327, -280648, -233625, 20886, -178008, -130845, -228533, -204892, -35763, 116516, -51887, -263537, 57554, -146220, -77452, 258195, -174814, 6379, 54760, -227882, 147127, -194325, -172318, 95929, -103320, -218071, -54065, -42117, -185759, -25389, -41181, -265681, -380373, -14205, -54415, -70896, 51455, 21300, 220372, 110844, -23293, -59057, -503009, 54844, -137111, -143990, 138744, 22745, -111606, 81946, -154106, -141007, -244271, -426392, -119025]
19373g7486D7498b9166A0407J14226h9255A19015E4805K1462f8097o7338l08843
19362d44278f2362A17602b59579B18995b97289A06094c81861a74654d1588j97210
19352b38798j78042J17322A69542C9757L3946N4078b88668a44258K3762d8392
19341E6970B1854b15606A39390n6753a23698P258j0589b7246k58064d0574j70308
19330b10882A11988e7069D5792c9336n85A5655b0992C2844h6924D4896R9069a96878
19317I2965Q722C1121Q2824c466m6608C4995b60897J10346B15106b0511n3893
19306g4404D4896b8486a954q3428c9237j91693D0834J14750J9178A1523b54274
19294a9650A18939b8502A35636b99735F697i2931r1994A00963a6388A95050j2768
$$ y = [-77486, 47498, -29166, 10407, 124633, -89255, 119015, 54805, 76267, -68097, -135435, -444278, -62362, 117602, -259579, 218995, -297289, 106094, -381861, -174654, -41588, -238798, -416840, -299518, 169542, 39757, 73703, 127781, -288668, -144258, -120496, -48392, 56970, 21854, -215606, 139390, 82637, -123698, -116440, -127029, -27246, -285310, -40574, -210882, 111988, -57069, 45792, -39336, -39921, 15655, -20992, 32844, -86924, 44896, 143965, -196878, 92965, 101687, 31121, 113945, -3466, -50074, 34995, -260897, -150551, 215106, -20511, -74404, 44896, -28486, -1954, -85382, -39237, -230930, 40834, 155584, 174762, 11523, -254274, -19650, 118939, -28502, 135636, -299735, 6697, -92931, -184925, 100963, -16388, 195050, 182282]
19283A82282c3862o3375C6799a80168B4932b12191J02377o5601N2805m2411K2073
19272a42948K4618d2069D4645a07927k9178M6923A87088G7130k8618J6042f1758
19260A20507a19113D3207a50769g558m68923g2790E8038f6786F4804g4040k0661
19249i4701G2350a27588B7192b3443o3959j01559A047J85402k9557I137a49255
19237a18659k78678A9382d5777l9863j29377j40245c6652n9387k15062H513b77920
19225d8703E4599J1984a63137O3218m3261q1017p5652B9255j0388J85912b47128
19213C4814a03347I2328a10219C0714a63880e2198H6178i8536A19568a33113A72086
19201a92055A39004D8029R6051a62716P0103a8617I3290d5836P257C05385a44159
$$ y = [182282, -33862, -97237, 36799, -180168, 24932, -212191, -109814, -175415, -122610, -165021, -142948, -118330, -42069, 44645, -107927, -137105, -90182, 187088, 77130, 48512, 64554, -61758, 120507, -119113, 43207, -150769, -7558, -476481, -72790, 58038, -66786, 64804, -74040, -94701, 72350, -127588, 27192, -23443, -87402, -188961, 1047, 186449, 156892, 9137, -149255, -118659, -397337, 19382, -45777, -85640, -215017, -355262, -36652, -96039, -311101, 8513, -277920, -48703, 54599, 66583, -163137, -99919, -143180, -224197, -299849, 29255, 18867, 204779, -247128, 34814, -103347, 92328, -110219, 30714, -163880, -52198, 86178, -98536, 119568, -133113, 172086, -192055, 139004, 48029, 144080, -162716, -92613, -18617, 93290, -45836, -38579, 305385, -144159]
19189G0765a18045B71981b00316G9636g4098m32639G2840d6901E3777O738L289
19178F3804i7313c1139B41178j18464d6331j22128M6939j5006A57628j3500a42843
19166d24940H0953a8718D4368K18258I9595a13134H5063k0678L4449a58441H482
19154f06227a03492K30A56127J3079c5092F0273c77838A9587K53623e4946o8066
19143a23012A03788P4405b3723j04091A89239c08152B757a66565a3587j77159
19133a90746c1739q8984A33868b29353l6126f2746B46236a38659I3649b47179
19122a80003J226m6240A78892q5335a35951A3021a75364j41772a50863G8034a100
19110B01440B7325c9231A72256c3772m1169A19114e5048k16709A58768l8600n3371
$$ y = [70765, -118045, 271981, -200316, 79636, -74098, -506737, 72840, -46901, 53777, 60515, 63804, -97313, -31139, 241178, 122714, -46331, -168459, -121520, -136526, 157628, 144128, -142843, -424940, 80953, -18718, 44368, 262626, 99595, -113134, 85063, 64385, 98834, -158441, 8482, -606227, -103492, -103262, 156127, 169206, -35092, 60273, -377838, 19587, 273210, -54946, -123012, 103788, 178193, -23723, -127814, 189239, -308152, 2757, -166565, -13587, -190746, -31739, -120723, 133868, -229353, -265479, -62746, 246236, -138659, 93649, -247179, -180003, -178777, -225017, 178892, 93557, -135951, 13021, -175364, -317136, -150863, 78034, -1100, 201440, 27325, -39231, 172256, -33772, -74941, 119114, -55048, -271757, 158768, 120168, 66797]
19099F6797a12308F0945J96789A20086J73112d61265B5348h9274D913b58964Q8719
19088a70245A08084L5444J44377e5288k98223e3287m86743b06091A69611J3499
19078A83110K01999A14695A3505b04840l9956R6296b8937n820j25313K5905j18177
19067b52342A48474b63598f5260K7136A77852a36116d0263J4687j70130N4234
19057a41472B21216a26916c1161B09266b0976A37609b10435A2060J30266K485
19047A44811b9171j74055k7236a8475B06669m4454a56045P2124J9824j55497l1585
19036b51179f7829K3210p8168A72597d3170r2996A18253c25459H8094c256m7265
19025e0521q355j44913N0807q9207J6472K8066B22252G6743k4133P506J21379
$$ y = [66797, -112308, 60945, 257734, 120086, 293198, -461265, 25348, -89274, 4913, -258964, -170245, 108084, 143528, 287905, -55288, -353511, -53287, -540030, -206091, 169611, 183110, 385109, 114695, 13505, -204840, -244796, -148500, -28937, -34757, -160070, -134165, -252342, 148474, -263598, -65260, -38124, 177852, -136116, -40263, -25576, -195706, -141472, 221216, -126916, -31161, 209266, -20976, 137609, -210435, 12060, 142326, 144811, -29171, -203226, -230462, -18475, 206669, 162215, -156045, -83921, -64097, -219594, -251179, -67829, -44619, -122787, 172597, -43170, -136166, 118253, -325459, 88094, -3256, -50521, -58876, -203789, -152982, -242189, -225717, -197651, 222252, 76743, 52610, 60116, 181495]
19014A81495b20285K0277m8612d6206D2769b05625M3482b3437j85791c0581j60172
19003a90753k7924A56089d3321j65677A2976J12312b67899B07451a98638E8882
18992H1425K55646F1181a02227h460k03857J00059g616B26806A5394d7709F9251
18980F1009c5472j11899A37248D8604J61665a32139k955m9045C2923a67612B87217
18968d08637a24254C6204b03337m8286B6543J02739D0665b29355K3633G6745a01765
18956b16115A46650j0458c48022b2495I4834R5612a54551C43645d74823B01807
18945A15480a09607N0798p1941F4552e1528E3372O4313J79565f2716j82216h0469
18933D5958c2656F5320g2694l54382c2121m5221A44295A5124a46390q7510F5182
$$ y = [181495, -220285, -200008, -248620, -46206, 42769, -205625, -162143, -23437, -209228, -30581, -190753, -218677, 156089, -43321, -208998, 12976, 125288, -267899, 207451, -198638, 58882, 81425, 337071, 61181, -102227, -8460, -212317, -112258, -7616, 226806, 15394, -47709, 69251, 61009, -35472, -147371, 137248, 48604, 210269, -132139, -135094, -184139, 32923, -167612, 287217, -408637, -124254, 36204, -203337, -251623, 26543, 129282, 40665, -229355, -205722, 76745, -101765, -216115, 146650, 136192, -348022, -22495, 94834, 190446, -154551, 343645, -474823, 201807, 115480, -109607, -58809, -130750, 64552, -51528, 53372, 117685, 297250, -62716, -244932, -80469, 45958, -32656, 65320, -72694, -427076, -32121, -77342, 144295, 15124, -146390, -233900, 65182]
18921a82648E5336a85595A19545a65666E9269a10578o4067A3074i6802A34998
18910A0300Q8034c91491J68374A0753c09118K5608G416J36667a34048C213a13247
18898c4779k57739Q0247B11920b40982m0234d6627a9214l14484B40243b74268
18887a5573k37027a9930B1508b10314G9481I902N0164c14045A53275K8915a29552
18875B8206a12627k26591B16702e8060B56651g5685B57022a20510B54367h479
18864a16451M4690o8673N7933L2496a8169k690n8048n6882A63221b25377B37201
18852a90462l3384B1355R7528a8006k72212J01890R2734p8985O2118C20151b98456
18840b57890J27567A7722P0056i6888n5549N3576B61256a53361o5443F5261O8070
$$ y = [-182648, 55336, -185595, 119545, -165666, 59269, -110578, -174645, 13074, -96802, 134998, 10300, 98334, -391491, -223117, 10753, -309118, -283510, 7416, 144083, -134048, 3213, -113247, -34779, -292518, -212271, 211920, -240982, -281216, -46627, -19214, -333698, 240243, -274268, -15573, -252600, -19930, 21508, -210314, 79481, 9902, 60066, -314045, 153275, 182190, -129552, 28206, -112627, -339218, 216702, -58060, 256651, -75685, 257022, -120510, 254367, -8479, -116451, -71761, -140434, -82501, -50005, -18169, -20859, -78907, -135789, 163221, -225377, 237201, -190462, -223846, 21355, 118883, -18006, -290218, -188328, -95594, -174579, -112461, 320151, -298456, -257890, -130323, 17722, 87778, -96888, -152437, -98861, 261256, -153361, -218804, 65261, 133331]
18829A33331J4445G381e8991j12007r566C578J13345P727k2845a24593L171B8046
18816I0466b51839P4261k61485a07138m8783j36240A68464b8744j94850D810L4585
18805C9395p091J82376o918F6399k567K23411i2549B75045r0404o8608K57395
18794C73428e6085I09i8612B1104N6537k7052c11669F9383k162L69506b81742
18782a55710c9773A76126b10497A19618a91131R2599N24A27664a45503A00011
18771a71831B09419G0934J42320b80915B93236j34633b11430A34689g2453B28220
18760c82789a05344l2440f0289k23491g9161j51642Q7359M499k3819k6251d5439
18748b78353A12286a97267A43578J95172A4821a5559k07252b3128k88413b9392
$$ y = [133331, 147776, 7381, -58991, -170998, -180564, 3578, 116923, 124650, 101805, -124593, -121422, 28046, 90466, -251839, -177578, -439063, -107138, -155921, -292161, 168464, -28744, -223594, 4810, 39395, 32304, 214680, 207762, 66399, 63832, 287243, -92549, 275045, 184641, 116033, 373428, -56085, 909, -98612, 21104, 77641, 50589, -311669, 69383, 67221, 436727, -281742, -155710, -39773, 176126, -210497, 119618, -191131, -98532, -98008, 127664, -145503, 100011, -171831, 209419, 70934, 213254, -280915, 293236, 158603, -211430, 134689, -72453, 228220, -382789, -105344, -137784, -60289, -283780, -79161, -230803, -143444, -138945, -162764, -189015, -45439, -278353, 112286, -197267, 143578, 338750, 14821, -15559, -222811, -23128, -311541, -29392]
18737B83438b44176a9554j15367A15202b25591M622C24397i0436j8039H7997h8733
18725C0522J74700b06880a03027k30513f4760F3596b41324B66959a90462O8680
18715a21782J7804e978j97908d1483F7133b17117H0387e3974F5546a64144m5722
18704b09866c2354L175F5178h7471k74746A10859O631j6616a46613B57382b61505
18692b7318F9842E57f6396A4787c90567i671q0825A15883J21849h9371F5310c1393
18679A92580a33018A06232G098c5135J857a4493A6779c26018B35366a9118E7024
18667I0701N12B7404a24206R479a9120G8613a61019j0498Q5696p5160f9306I909
18654d12277g455D6642d0294E4600a15094A59148g3410b9391k44424A19333L4171
$$ y = [283438, -244176, -19554, -134921, 115202, -225591, -220969, 324397, -90436, -108475, 87997, -88733, 30522, 205222, -206880, -103027, -333540, -64760, 63596, -241324, 266959, -190462, -121782, -103978, -5978, -203886, -41483, 67133, -217117, 80387, -53974, 65546, -164144, -209866, -32354, -29179, 65178, -87471, -362217, 110859, 117490, 100874, -146613, 257382, -261505, -27318, 69842, 557, -66396, 14787, -390567, -9671, -90496, 115883, 237732, -89371, 65310, -31393, 192580, -133018, 106232, 7098, -35135, -33278, -14493, 16779, -326018, 235366, -19118, 57024, 90701, 91213, 27404, -124206, -114727, -19120, 78613, -161019, -171517, -85821, -160981, -69306, 9909, -412277, -7455, 46642, -40294, 54600, -115094, 159148, -73410, -29391, -273815, 119333, 153504]
18643A53504a22213o9742a3499A836a24468A0143a86604B0140P7122a67436a1998
18631b9953E1158c3189n4240k8319j41270b816j89584k73447F9381c7473A82856
18619A73811O8912A5461J98784b73109Q3356m2031g9328k31639a24376J0196c9841
18607A2245E704R737J30083B8414j2345g7329j28989B56233C6141O3905a58984
18595f3334N721A65502c15687J42478g2393k22815A57949G2244L4768J03146b97373
18583E453L7665c10251a09088l1595l45875h5888a9898j413H7269L4325C0939
18571a05051q0310A34718K2544f7153j80036A01796J26952a8071k11907d123j74930
18560a79053c8779A6771K02625b23059j46038A8298c5669A73583E842J049a05766
$$ y = [153504, -122213, -191955, -13499, 1836, -124468, 10143, -186604, 20140, 97262, -167436, -11998, -29953, 51158, -33189, -87429, -115748, -257018, -2816, -192400, -465847, 69381, -37473, 182856, 173811, 242723, 15461, 214245, -273109, -189753, -231784, -79328, -310967, -124376, -114180, -39841, 12245, 5704, 15441, 145524, 28414, 16069, -77329, -206318, 256233, 36141, 100046, -158984, -63334, -57613, 165502, -315687, -173209, -72393, -295208, 157949, 72244, 107012, 210158, -297373, 5453, 43118, -310251, -109088, -140683, -486558, -85888, -19898, -21311, 87269, 121594, 30939, -105051, -185361, 134718, 157262, -67153, -247189, 101796, 228748, -18071, -229978, -4123, -179053, -38779, 16771, 219396, -223059, -369097, 18298, -35669, 173583, 5842, 6891, -105766]
18548a33171A22794c37455A22093g120B816a27230F5562b82455A45278a62406
18537a4449D324b50004d7599k48754J09774D64900A53191D1535c3487l12978c2501
18525a85677l65123a37483A5361J35558a83920k5555d2258j18841A0109g4993
18514A20296g7608B79698a25579a2155G1666i1200A0461N9445a77744D9624O0422
18503A10046M5926J15292c8785E4019d3521l7685G2292A0659J74309c09185f0142
18491g6052A02798K04089A49635K738b59760h4475j80833B29753I8120N0940G294
18479e118j23377A99802b76949J16555H7962d834l58427O2432A06039a42228H0529
18467I6892m632d2449m5996c7246l09660g1707k84888a54769C9102J47122a60814
$$ y = [-133171, 122794, -337455, 122093, -7120, 2816, -127230, 65562, -282455, 145278, -162406, -14449, 4324, -250004, -47599, -296353, -186579, 464900, 153191, 41535, -33487, -346465, -32501, -185677, -550800, -137483, 15361, 150919, -183920, -209475, -42258, -161099, 10109, -74993, 120296, -77608, 279698, -125579, -12155, 71666, -91200, 10461, 69906, -177744, 49624, 110046, 155972, 271264, -38785, 54019, -43521, -81206, 72292, 10659, 184968, -309185, -60142, -76052, 102798, 306887, 149635, 152373, -259760, -84475, -265308, 229753, 98120, 149060, 7294, -5118, -128495, 199802, -276949, -160394, 87962, -4834, -363261, -300829, 106039, -142228, 80529, 96892, 92260, -42449, -88445, -37246, -346906, -71707, -356595, -154769, 39102, 186224, -160814]
18455a03956k21808M8485p8555e2659k55129J17717A28578a28478L780b8960F7788
18443c946p2899n7087c2515j57773N8549e2907j76599L2550A25849b91146a42060
18431d0382k69434a21280b8275B28590q1561k8040g3622p0687o241G5620k1903
18420E3717e2559j73275i4648I3806Q023b03454a01524l72016C4651a13198j79352
18409b92550a171G904b29479k6657A61709k8092a09160k56893C28600B4667J16046
18398A40713i8623j20130h2354j60449A88528c12895A63137B5111a35580F8243
18387A93870b0311n6403k06376b1060B68755d7391B1501O866i1081l4169B10052
18375f9334j20649M3359o3579A11684k7218d02363B45449a25207j36250I4788
$$ y = [-103956, -325764, -277279, -355834, -52659, -307788, -190071, 128578, -128478, -124698, -28960, 67788, -3946, -76845, -133932, -32515, -190288, -131739, -52907, -229506, -196956, 125849, -291146, -142060, -40382, -309816, -121280, -28275, 228590, 147029, 118989, -73622, -144309, -150550, 75620, 53717, -52559, -225834, -94648, 93806, 101829, -203454, -101524, -473540, 34651, -113198, -292550, -1171, 7904, -229479, -256136, 161709, 133617, -109160, -366053, 328600, 24667, 140713, -98623, -218753, -82354, -242803, 188528, -312895, 163137, 25111, -135580, 68243, 193870, -20311, -76714, -283090, -21060, 268755, -47391, 21501, 28367, -91081, -125250, 210052, -69334, -189983, -146624, -210203, 111684, 84466, -402363, 245449, -125207, -261457, 94788]
18364c27183J02507A6865a52773A7864J60556Q4415a84021g3577C6096R4506g6306
18352g4433H7422A432L1047J3872a33151A00236h2906m3069n1474d365q3354F0159
18339E1601d7065m12340b5474E9821e410q7396A7943a38841j166K8502C2899K15329
18327B48228c9905B71073j12739b18608A35318K35184a94587A06030j6506a53645
18316H232b4994k09721g5676k9129j49311N1513j17363F2829k6861i8294A14193
18304A03848a48490M4573c9403j45104A94097c8149e141k08439M7430D7335b94693
18292A72458A7446J32019a79187n6806i1479j93910A34692e8179q9480I4052c01245
18280a95223h093I9197e9644o7697I7010K7785b84278a14487k33428H8940J55573
$$ y = [-327183, -224676, 16865, -152773, 17864, 178420, 262835, -184021, -73577, 36096, 130602, -76306, -74433, 87422, 1432, 32479, 46351, -133151, 100236, -82906, -125975, -177449, -4365, -87719, 60159, 51601, -47065, -459405, -25474, 59821, -5410, -92806, 17943, -138841, -140007, -111505, 32899, 248228, -39905, 271073, 158334, -218608, 135318, 370502, -194587, 106030, 89524, -153645, 8232, -24994, -234715, -75676, -104805, -254116, -202603, -319966, 62829, 35968, -98294, 114193, 103848, -148490, -103917, -39403, -184507, 194097, -38149, -5141, -213580, -166150, 47335, -294693, 172458, 17446, 149465, -179187, -235993, -91479, -285389, 134692, -58179, -147659, 94052, -301245, -195223, -8093, 99197, -59644, -127341, 97010, 124795, -284278, -114487, -347915, 88940, 244513]
18269B44513a494B2724K97498f3986j28420Q0816A2816g2950C15043j30701b25411
18257d1389j72244O8149m3197A7692c19573G1791g2182l03286F1264J53907c1351
18245E4097a83505A0948g1005j60250c7846p2977I0662J95781q7947e03506a23593
18233b9318j38225n4748l5472a22649B7100e7444C1852F576a6669A30626a83571
18221A852a92690g8583j12635A66320E7792c084n56219g4601D0853b30128Q2528
18210a47600G0392b95862B61768F8076J10153b56303a231j36546B64341a87992
18199g6468H5675a19441o4612d2840A12782a19902C25842a05005K6817j6632L4929
18188e9891m608k15331q2443a63323F5519c61706N5167Q4950C2268b76165B17654
$$ y = [244513, -1494, 22724, 320222, -63986, -192406, -111590, 12816, -72950, 315043, 184342, -225411, -41389, -213633, -145484, -188681, 17692, -319573, 71791, -72182, -375468, 61264, 215171, -31351, 54097, -183505, 10948, -71005, -231255, -37846, -110823, 90662, 286443, 198496, -503506, -123593, -29318, -167543, -222291, -257763, -122649, 27100, -57444, 31852, 6576, -16669, 130626, -183571, 1852, -192690, -78583, -191218, 166320, 57792, -3084, -559303, -74601, 40853, -230128, -147600, 70392, -295862, 261768, 68076, 178229, -256303, -1231, -137777, 264341, -187992, -76468, 85675, -119441, -184053, -42840, 112782, -119902, 325842, -105005, -78188, -94820, -59891, -64499, -279830, -362273, -163323, 65519, -361706, -306539, -221589, 32268, -276165, 217654]
18176b32168g4704k3361F3786b34240H5541g2307o1129O6386A2895R9265a38749
18164a37337B7343j2566j959a6087H9474L43082d6680m69377K16190J27344h2485
18152I6541d07951i4046H5699f3967K5278r9743q7768Q3682c6418B15795e5811
18140b1902B14843O5374g3866D48667k05891d488o8538I9680N7419C9349K5250
18129F4599a50960c6226j78919D2049J14490C4959b34824A76852a64280L2398
18119a31882p5585J00511j99206A36271F5020J85672A17041a78811I9628M3273
18109A42901h0422j25304g1562k9271A18883n5698J1320a21877n8770D785J17634
18098A22419a9874H253J97859a20493L3053k22391c5749k29737a14358a6109j55355
$$ y = [-232168, -74704, -98065, 63786, -234240, 85541, -72307, -133436, -67050, 12895, 112160, -138749, -137337, 27343, 14777, 12818, -16087, 89474, 432556, -46680, -516057, -299867, -172523, -82485, 96541, -407951, -94046, 85699, -63967, -38689, -138432, -226200, -142518, -36418, 215795, -55811, -21902, 214843, 280217, -73866, 448667, 242776, -4488, -73026, 99680, 157099, 39349, 64599, -150960, -36226, -215145, 42049, 156539, 34959, -234824, 176852, -164280, -131882, -207467, -106956, -306162, 136271, 65020, 250692, 117041, -178811, 99628, 142901, -80422, -205726, -71562, -100833, 118883, 63185, 74505, -121877, -180647, 4785, 122419, -19874, 8253, 206112, -120493, -87440, -309831, -35749, -265486, -114358, -16109, -171464]
18087a71464A40000b9417n1425D2578e0712l3109F0222h7677D6975J63796a13595
18075A39931a72875B56409A03579b51j55671B19620a42791l03753I5549b23281
18064f7955G0897O9941M5965a33022A82321a07369k2809B65214a0192j4441o6722
18053i1355C10597d6617k08334B8313Q5139c8566D0942R8679B9021a11141e3683
18041f4711j93031B71256r1725g3392j01960B78276F6831Q4605b07452C1675J60439
18030A92114b9059B15270j169F1410O0008a96096G6636A4822c38748i3536c6208
18018a08809b846j0119B55950J5731b61917J16119A60448j1985E5645N8024c1400
18006e44194J94627A24810b15290J07012A03088N4611F8990R0907I281c73509
$$ y = [-171464, 140000, -29417, -80842, 42578, -50712, -83821, 60222, -87677, 46975, 210771, -113595, 139931, -172875, 256409, 103579, -251, -155922, 219620, -142791, -446544, 95549, -223281, -67955, 70897, 140838, 186803, -133022, 182321, -107369, -130178, 265214, -10192, -24633, -91355, 310597, -46617, -254951, 28313, 113452, -38566, 40942, 139621, 29021, -111141, -53683, -64711, -257742, 271256, 179531, -73392, -175352, 278276, 66831, 151436, -207452, 31675, 192114, -29059, 215270, 214101, 61410, 121418, -196096, 76636, 14822, -338748, -93536, -36208, -108809, -2846, -12965, 255950, 271681, -261917, -145798, 160448, 148463, 55645, 113669, -31400, -544194, -349567, 124810, -215290, -108278, 103088, 157699, 68990, 159897, 9281, -373509]
17995a45916m5219H2996K3956b78548B0962a1523k64959h2268m1507e7187j48629
17984b05816F0294J61594c81863G0665P1827K20398G274f3228j514K6639B91648
17972A37825h3650D7075L390P3533c00793a7387B88902C8578B125R0939f7148
17960I7394a48106A29509l6013J79991a13890o8901P0245B892a41267A48178a24164
17948i8141C09058j48609K1206a78825g6143n9174o0769b0767j15002B2126M1325
17937F3451i1707b9236A29392a35956n6366A31105m2976b40317C77230m2831a76057
17925h1188J41l40745J29840d3322p2545m85738a91612f178r3138l50150B68812
17913b2750I3560e3606k66474c0803R107C83920a57107M8275L156G3240J05469
$$ y = [-145916, -191135, 82996, 106952, -278548, 20962, -11523, -276482, -82268, -123775, -57187, -205816, 60294, 221888, -381863, 70665, 142492, 362890, 7274, -63228, -64742, -38103, 291648, 137825, -83650, 47075, 50465, 123998, -300793, -17387, 288902, 38578, 2125, 93064, -67148, 97394, -148106, 129509, 93496, 273487, -113890, -182791, -112546, 2892, -141267, 148178, -124164, -98141, 309058, 160449, 181655, -178825, -76143, -135317, -196086, -20767, -135769, 22126, 63451, -91707, -29236, 129392, -135956, -192322, 131105, 88129, -240317, 377230, 334399, -176057, -81188, -81047, -421792, -291952, -43322, -115867, -601605, -191612, -6178, -99316, -449466, 268812, -22750, 93560, -53606, -320080, -30803, -21696, 383920, -157107, -108832, -105676, 73240, 178709]
17902A78709J571D9228J0362k8749e5252I1438C5319a2003A6509a04816k54573
17891c59389A67545e8813j21814M0992L0649m853M4393D8471Q4235A4719a76342
17879b37108N2435H6790b81301e3822n9094A38124g6838D9151M3441Q2466e4358
17867i4937j11199O2012B46254o1304d71426c3957J18n2854J8600q4924l2621
17856a85638A02333O8097h9563H2470Q605a47201g541n7873j1693A07509g596
17844g1507C3185a50722P085A20167O063a24124b6657A85084d7330K1742B00934
17832b17885k08373R1146A89908b22157f7827a6142I8038a64880A62753J01603
17822B64356c53795E714b16204A28333K0291d9327k10224j13004G0854b1288A218
$$ y = [178709, 180280, 49228, 59590, 30841, -55252, 91438, 35319, -12003, 16509, -104816, -359389, 167545, -58813, -180627, -139635, -108986, -113839, -69446, 48471, 132706, 14719, -176342, -237108, -184673, 86790, -281301, -53822, -112916, 138124, -76838, 49151, 92592, 175058, -54358, -94937, -206136, -144124, 246254, 184950, -471426, -33957, -33839, -86693, -68093, -153017, -185638, 102333, 170430, -89563, 82470, 91075, -147201, -7541, -65414, -77107, 107509, -7596, -71507, 33185, -150722, -143637, 120167, 126230, -124124, -26657, 185084, -47330, -25588, 200934, -217885, -426258, -335112, 189908, -222157, -67827, -16142, 98038, -164880, 162753, 264356, -353795, 5714, -216204, 128333, 148624, -49327, -259551, -372555, 70854, -21288, 1218]
17810B6980J56821R5459e0714I8653J72460b71808B14575c04771D5793M7810b1070
17798b80463a01384a2068C80536A88038n6463E5593a85206d542p713o5840q8179
17787a66274B54881g9844j72672D46068C827K62339b4774B46105b05101E4916
17776C5106M9535b79696e951l8771j9270A80453a52892f8851A25574e6216A47013
17764a19292k50621C7007c1625B77405b31222N6910E4903a43447D3704J31357
17754A75061a44497r1447c1880j18559j11587f9656m7441C18869A42955c90601
17743B0263K79581j4247j37978c42014a22731a8618j31330B78345r714P8605c5251
17731a43399H2480l9922Q6606a83998A50478H773c9067q3411C96135a86002B56194
$$ y = [26980, 183801, 279260, -50714, 98653, 271113, -271808, 214575, -304771, 45793, 93603, -21070, -280463, -101384, -12068, 380536, 188038, 131575, 55593, -185206, -4542, -12255, -78095, -166274, 254881, -79844, -252516, 446068, 3827, 266166, -24774, 246105, -205101, 54916, 35106, 84641, -279696, -5951, -44722, -63992, 180453, -152892, -68851, 125574, -56216, 147013, -119292, -369913, 37007, -31625, 277405, -231222, -174312, 54903, -143447, 43704, 175061, -144497, -235944, -31880, -150439, -262026, -69656, -117097, 318869, 142955, -390601, 20263, 299844, 285597, 147619, -342014, -122731, -18618, -149948, 278345, 268631, 347236, -35251, -143399, 82480, 42558, 129164, -183998, 150478, 8773, -39067, -122478, 396135, -186002, 256194]
17719b45096M4358D9456q591K47142a42400c8968A54531J7003a23185c8361j00981
17708a39342G0694M6556b08113A56164a6017k0512a909I1280N8707b63657l985
17697b67642A34682b6679j71299B56339a03612A95293o5211J41535E9981L6872
17687I6853a51178D7601j8666J69891c5950j54554f1072M313B15328b12036A69665
17675a34589a0220C2723p844J68703c7870A68745B1607i9263A92452b19436j6410
17664b35846a08173k8498B86873j15941a26172b9625k72054a34602N9088p7590
17654a53104a5689m32185A10066a71214A5232e0576n6585o3909B18124q6762k4582
17643A06780a56793d5605n6452a1390C2455J29995J43615f4850B30866A09852
$$ y = [-245096, -200738, 49456, 40865, 288007, -142400, -38968, 154531, 171534, -123185, -38361, -139342, 70694, 117250, -208113, 156164, -16017, -36529, -1909, 91280, 149987, -263657, -267642, 134682, -26679, -197978, 256339, -103612, 195293, 130082, 271617, 59981, 96853, -151178, 47601, 28935, 198826, -35950, -190504, -61072, -56759, 215328, -212036, 169665, -134589, -10220, 32723, 24879, 193582, -37870, 168745, 21607, -99263, 192452, -219436, -235846, -108173, -136671, 286873, 170932, -126172, -29625, -301679, -134602, -75514, -153104, -15689, -447874, 110066, -171214, 15232, -50576, -107161, -171070, 218124, 131362, 106780, -156793, -45605, -102057, -11390, 32455, 162450, 306065, -64850, 230866, 109852]
17632A67955D7246b75915C93066I4005d92230c4682A20399d8263j9059A94848
17621a2308G1688C4450A3560F504k057h3020q7245B5258c6023D3080c171A36362
17608G637J3040D070J10311D59M94140e3810k21290a07778m6615A73185d949j0846
17596a5795n1407A31727F307f8407I7333C3741J56100g524A82601d37937e590
17584c8395j81165O6656E2682a40851A66509K00024K2406d56585a3488A4857P4268
17573H9125K6710k5673K37067c007E0509a47916K8105A55222k0046J79284c23646
17561a36845j02998A25456b13109A38963e3237F8650B9720H17K57792a67504A30204
17549G7463g9821k7036A69084j4842J4696o6215C807J9984a47112D4509b77551
$$ y = [167955, 47246, -275915, 393066, 94005, -492230, -34682, 120399, -48263, -67322, 194848, -12308, 71688, 34450, 13560, 6504, 4447, -83020, -170265, 25258, -36023, 43080, -3171, 136362, 7637, 20677, 4070, 114381, 459, 494599, -53810, -275100, -107778, -154393, 173185, -4949, -15795, -67202, 131727, 6307, -68407, 97333, 33741, 189841, -7524, 182601, -437937, -5590, -38395, -219560, -152904, 52682, -140851, 166509, 366533, 388939, -456585, -13488, 14857, 89125, 115835, 90162, 327229, -3007, 50509, -147916, -119811, 155222, 135176, 314460, -323646, -136845, -239843, 125456, -213109, 138963, -53237, 68650, 29720, 817, 258609, -167504, 130204, 77463, -79821, -106857, 169084, 154242, 168938, 102723, 3807, 23791, -147112, 44509, -277551]
17537H3038b6216B48148F5099K63274j47231n095m4237a47358d7137B9403f8398
17525F5681a97297f7940k12629A26259a9388k35773q104A0903e8611K0322I7405
17513B12148N1579b1556B16686a15813A89054B1742J38136e0904A93286b32417
17502A87005C9509J50353G1459g546B59726o7032f6074C05266M1262A3429L4902
17491D8331c61819C29227C5654K09616a4582J484A71542l3325O1484i7567M3055
17480e4512C07116g3625B45332J8693a62729C8380J75482a96075A63108p0684
17470I2424Q1866M6996q8359k8240O2657l4335L3128J45697A31929n5561C3571
17458A23250a00052j10336A44191F5484J89645A02800q567a29058A1327K92377
$$ y = [83038, -26216, 248148, 65099, 328373, 181142, 176047, 131810, -147358, -47137, 29403, -68398, 65681, -197297, -67940, -280569, 126259, -19388, -255161, -263265, 10903, -58611, -38289, 97405, 212148, 263727, -21556, 216686, -115813, 189054, 21742, 159878, -50904, 193286, -232417, 187005, 39509, 189862, 71459, -7546, 259726, 192694, -66074, 305266, 346528, 13429, 48331, -361819, 329227, 35654, 245270, -14582, -13098, 171542, 138217, 199701, -97567, -54512, 307116, -73625, 245332, 264025, -162729, 38380, 213862, -196075, 163108, 92424, 174290, 221286, 132927, 104687, 167344, 133009, 166137, 311834, 131929, 76368, 33571, 123250, -100052, -210388, 144191, 65484, 255129, 102800, 94233, -129058, 11327, 303704]
17448C03704A38837c3429J233C6583M53454a28799A01875H002b128B26938L5099
17437B62037K40290B13609J51280A1571R9500j8758K78346J30869E8624g5087
17426A13959b9548B62175K5211j5165b0310C58350B2089M9690R5555K6101n5642
17415A37793a67467D50454A91270d6599A82084J07412j3358K70855B34585k5701
17405B08884K97943b86957A90158J58197J01954j71117b64495d5986A88155J06228
17395B94383A7356K17217C9864N9552b6569D08615j92986a51546o2882B04679
17384A14459f4681A99134c9911k01505b0863n06B67371A01335J41203H8608P7379
17373A65987P6706P0036H6950L58210q0815j10415r5297m7854b8645C17668I9282
$$ y = [303704, 138837, -33429, -32196, 36583, 490037, -128799, 101875, 8002, -2128, 226938, 262037, 502327, 213609, 364889, 11571, 111071, 92313, 370659, 501528, 58624, -75087, 113959, -29548, 262175, 287386, 272221, -20310, 358350, 22089, 71779, 167334, 193435, 137793, -167467, 450454, 191270, -46599, 182084, 289496, 276138, 546993, 234585, 208884, 506827, -286957, 190158, 348355, 450309, 279192, -264495, -45986, 188155, 294383, 17356, 234573, 39864, 99416, -26569, 408615, 215629, -151546, -214428, 204679, 114459, -64681, 199134, -39911, -241416, -20863, -21369, 267371, 101335, 242538, 88608, 165987, 242693, 312729, 86950, 445160, 364345, 253930, 158633, 110779, -28645, 317668, 99282]
17361h2734C16781j57767J28123n0136i8474I4197a40920b455q3457B9226M3660
17350G2886j9404q432K70621a50360E2999K35192K72430j17739j25472A40038
17339I8182C5732L22752c7641j78226j24233D41344b4793A85146b0855A08003
17328A33380R0052B4251a07069C88398P534H5846J4195b24758D18681G1740j4061
17317E7679M10615D3940K22982J17483c15j14764h693A68433R8822a1252m159
17306a5411j22595A89954K0193F9701P7458J46421a11062A5114J73745b32601
17295B24610E3862J30207j3008K2359L3792G7419K0348K38732a76165B16626h63
17283H8076l1018R5564O1915A04397J03044C3221L599K18565A01877a50603f6872
$$ y = [-82734, 316781, 159014, 287137, 237001, -98474, 94197, -140920, -2455, -85912, 29226, 72886, 53482, 45050, 315671, -150360, 52999, 288191, 560621, 442882, 317410, 140038, 98182, 35732, 358484, -37641, -215867, -340100, 441344, -24793, 185146, -20855, 108003, 133380, 223432, 24251, -107069, 388398, 395932, 85846, 100041, -224758, 418681, 71740, 57679, 468294, 43940, 266922, 384405, -315, -115079, -8693, 168433, 267255, -11252, -15411, -138006, 189954, 210147, 69701, 147159, 293580, -111062, 15114, 188859, -232601, 224610, 53862, 184069, 171061, 193420, 227212, 77419, 97767, 336499, -176165, 216626, -863, 88076, 57058, 152622, 214537, 104397, 207441, 33221, 36820, 255385, 101877, -150603, -66872]
17271E61419f7679C39945P6687A79859E2991K81138g6482A75664b07725c0393
17260B38984A8347M36162E1045j9696L5065g4531C64303j25935e2677q1978A75684
17248A31573a18568d3846B47719R7660j24783r6774a17029B7846J52779b20643
17237B58093H6548N6759D8957K17065r857A09376b8088A04199a34811c6211l9898
17226g6109o820B73954D3471J93463K06115k5804j61604f1334G4745a06207B65580
17214D44093j69109I86d0030B02315P366q119K27299A9863L93635j67866P0256
17203C15888A16865K49874K9704a36541C72871A36827C9630i4474H8805P6989
17193A65794L85656b6591B92485K19960B11021F612c5281k4952e82B41073e3144
$$ y = [561419, -67679, 339945, 416632, 179859, 52991, 334129, -76482, 175664, -207725, -30393, 238984, 18347, 454509, 51045, 31349, 66414, -74531, 364303, 238368, -52677, -134655, 175684, 131573, -118568, -43846, 247719, 345379, 220596, 123822, -117029, 27846, 180625, -220643, 258093, 86548, 143307, 48957, 266022, 256165, 109376, -28088, 104199, -134811, -36211, -76109, -82929, 273954, 43471, 236934, 443049, 417245, 255641, -61334, 74745, -106207, 265580, 444093, 274984, 986, -40030, 202315, 209681, 201562, 428861, 19863, 413498, 245632, 315888, 116865, 366739, 396443, -136541, 372871, 136827, 39630, -94474, 88805, 165794, 551450, -26591, 292485, 512445, 211021, 6612, -35281, -60233, -582, 241073, -53144]
17181D12831f0373D5465J39598K20833j98474e1480A48298f5122p8392f0024A32698
17169E17561A65126h143C90211J6512c6120E5575J77772m8488A7957M63158j19871
17158C61244J1970k8707k8928c385k07086A40134o4132O3955K90629E1628b6220
17146H9557K62818j8266E5694J32870K13885r7564a79329C70412B9018L33614
17136C62632j47108H7747R3531K97668j53213A18516J70227A2619J68763L36964
17126E18346j64490M048I3748L31893j51223K7341r0452J27784N68642C74468
17115C73547j77660L26133A58265J72895J93386B2244K91239g3608C61483j20047
17105B41436J14889O8883j78165O8394K3789m8668K31936A64344p6103K01731
$$ y = [412831, -60373, 45465, 185063, 405896, 207422, -51480, 148298, -65122, -143514, -60024, 132698, 517561, 165126, -8143, 390211, 406723, -36120, 55575, 233347, 184859, 17957, 481115, 361244, 373214, 344507, 315579, -3385, -210471, 140134, 76002, 139957, 430586, 51628, -26220, 89557, 352375, 334109, 55694, 188564, 402449, 304885, -179329, 370412, 29018, 362632, 215524, 87747, 181278, 478946, 325733, 118516, 288743, 12619, 181382, 518346, 353856, 357904, 93748, 425641, 274418, 301759, 211307, 339091, 907733, 374468, 373547, 195887, 522020, 158265, 331160, 524546, 22244, 313483, -73608, 361483, 241436, 356325, 425208, 247043, 315437, 339226, 290558, 522494, 164344, 88241, 289972]
17095B89972r8578K3560o0847j3861K45118j45054M9689N4639J04471R852n4251
17084D04710o5039n1689K1915A8958L17827n3006A15213K88163j8254H2990k270
17073H0720M46160R0418k30071A78335M3223k9495l2855M4448J75089J45554k12700
17062C11599A22630K00804O4024L07459C08574M096P0279R2988j65964q672I3716
17050B34689K07275j65497J47464J10703q4307k08093G4353l0138L23454K45624
17040F13293j44156A60988J17718J36399J61109q4893j03227K35030k29659j04885
17030B88580K10390j42980k4170J1810o9077N9736M28315k83895K868K10478k19261
17019D72794Q1103M214f1547E55610j08807M10112C82373Q569l5361M04927k84123
$$ y = [289972, 191394, 214954, 154107, 140246, 385364, 240310, 289999, 344638, 449109, 458961, 404710, 339671, 287982, 309897, 18958, 336785, 283779, 115213, 403376, 385122, 82990, 80720, 526880, 617298, 387227, 178335, 221558, 192063, 159208, 203656, 378745, 524299, 311599, 122630, 323434, 387458, 694917, 308574, 312670, 382949, 475937, 309973, 301301, 93716, 234689, 441964, 276467, 423931, 534634, 450327, 242234, 74353, 44215, 367669, 613293, 469137, 160988, 278706, 415105, 576214, 491321, 388094, 623124, 393465, 288580, 498970, 355990, 331820, 343630, 274553, 334289, 762604, 478709, 481577, 692055, 472794, 553897, 558111, -61547, 555610, 446803, 856915, 382373, 390942, 355581, 760508, 476385]
17008D76385N9100q2964m1916K67256j05485k13686J69921J93783M2997n3485
16998G11906k51874N63562m05225k07343j1395L54765j37763k48809M7443J99113
16988F14380j50973J93130m6651n9208L8753j18081R5589n4438J92815k68137
16978D37179J04547J72626J96319Q9479l78626R985k35674M30366L5311l72374
16968D89138j1122L1920M35958j43419O6261k41195P790K8666J88415m04247M55894
16957I04059j96916P1442K51709n00640L81932l72359M28158j08195j2605Q7252
16947I33837K4790j67269K46814m8134J1155N7985l48898K34101j01562K95962
16937A138781E09869L45706j68950M85663m43651K84328l26767L5109K48684J91215
$$ y = [476385, 535485, 452521, 410605, 677861, 572376, 358690, 528611, 722394, 765391, 711906, 460032, 1023594, 618369, 411026, 399631, 754396, 616633, 367824, 415267, 614380, 463407, 656537, 609886, 550678, 589431, 471350, 566939, 512501, 705316, 437179, 541726, 714352, 910671, 1000150, 621524, 631509, 395835, 826201, 861512, 489138, 478016, 509936, 945894, 802475, 868736, 627541, 635331, 663997, 852412, 448165, 904059, 707143, 778585, 1030294, 529654, 911586, 539227, 967385, 859190, 846585, 933837, 958627, 791358, 1038172, 990038, 1001193, 1059178, 710280, 944381, 842819, 1138781, 509869, 855575, 686625, 1172288, 728637, 1012965, 686198, 721307, 969991, 1161206]
16927A161206k54578L88322k0790n03358N27496m53355m2093M76454l87277J66321
16917A058348J31474r1069r6786q363J03771j71665J48529K28883P8716n80852
16907H00986R5932r5066L67961K62179k92881J76502L0871j09651P2173k9056
16897A279950k44198J22646K73436k32973K70548O4069k78778J45347k3595M52034
16887A828486m55320J88943o9302n0472j08016J4432J71183J00069P020j24481
16877A502542J24639J99294k82238R8297J65148J448j68593J45216j11960L30254
16867B004047j78533o9536K89381j84674j24089k1629N54661k69022J55450o2300
16857B093756K71730j29170j13122j11362M4296K89580j90584L49563k32377O06621
$$ y = [1161206, 906628, 1294950, 1274160, 770802, 1298298, 844943, 802850, 1279304, 892027, 1058348, 1189822, 1098753, 1001967, 993604, 1097375, 925710, 1074239, 1303122, 1381838, 800986, 896918, 801852, 1169813, 1431992, 1139111, 1315613, 1346484, 1236833, 1309006, 1279950, 1035752, 1158398, 1431834, 1198861, 1469409, 1533478, 1254700, 1400047, 1376452, 1828486, 1373166, 1562109, 1492807, 1442335, 1334319, 1348751, 1519934, 1620003, 1627023, 1502542, 1627181, 1826475, 1544237, 1642534, 1807682, 1809130, 1640537, 1785753, 1673793, 2004047, 1825514, 1755978, 2045359, 1860685, 1736596, 1714967, 2269628, 2000606, 2156056, 2093756, 2365486, 2236316, 2123194, 2011832, 2056128, 2345708, 2155124, 2504687, 2272310, 2878931]
16847B878931o30421K82043n7118K53759k20614L51261j08006Q0932j49522J28433
16837B809678j11585j9522L16728k35056K0221L35120Q8509r8479n3479R3522
16827C145657j58885K25590K46582N1966m2793J95942M3563n3701k39045M5792
16817C460668K34757K33616R1636Q9475K24016l697m4481J0238J55007m4989K11154
16806D617400O26693n28823L85416J89196m43909J95149j0877L57702L6464L9900
16796E464311L26851J79451k21799L19733K14364L21470j62836K9087J10531M74517
16786G055680J19492K47609O87349k49907K14497N7260K5373P1164N39082O17336
16776I384935P2940J06491Q0141K48200P29397K15141L22567J95334O03870q433
$$ y = [2878931, 2248510, 2530553, 2473435, 2727194, 2506580, 2857841, 2749835, 2830767, 2681245, 2809678, 2698093, 2678571, 2995299, 2760243, 2780464, 3115584, 3204093, 3105614, 3052135, 3145657, 2986772, 3212362, 3458944, 3510910, 3468117, 3664059, 3707622, 3653921, 3414876, 3460668, 3695425, 3929041, 4020677, 4110152, 4334168, 4330471, 4285990, 4296228, 4451235, 4406246, 4617400, 5244093, 4715270, 5100686, 5289882, 4845973, 5041122, 5030245, 5387947, 5424411, 5464311, 5791162, 5970613, 5748814, 6068547, 6282911, 6604381, 6441545, 6470632, 6581163, 7055680, 7175172, 7422781, 8110130, 7860223, 8074720, 8131980, 8157353, 8228517, 8767599, 9384935, 9457875, 9564366, 9644507, 9892707, 10622104, 10837245, 11159812, 11355146, 11959016, 11950583]
16766A1950583O15550M32467O36349J28281M20219K78530O06352L63073L90379
16757A5821783N04996Q37313Q24684P14656O87200P77004L98489J088994J277492
16748B2932611L59390J140386Q91023J322911J067768J223255J493568J506462
16740C1937374J521374J520409J537680J712988K373872J751308K500083K095674
16732D6950762K829653K738611L230726L185485L124216M114585L711325M170442
16724G4055805M760476M805449N413394N769475O217006O197869O565556P336664
16716A21121694P639656Q063405Q213773P644673Q274704P999026P626471P153551
16708A83736953O329124N663006M249690L081444J998442J50421j202276k793976
$$ y = [11950583, 12566133, 12998600, 13634949, 13763230, 14183449, 14461979, 15068331, 15431404, 15821783, 16326779, 17164092, 17988776, 18703432, 19390632, 20167636, 20566125, 21655119, 22932611, 23292001, 24432387, 25323410, 26646321, 27714089, 28937344, 30430912, 31937374, 33458748, 34979157, 36516837, 38229825, 40603697, 42355005, 44855088, 46950762, 49780415, 52519026, 55749752, 58935237, 62059453, 66174038, 69885363, 74055805, 78816281, 83621730, 89035124, 94804599, 101021605, 107219474, 113785030, 121121694, 128761350, 136824755, 145038528, 152683201, 160957905, 168956931, 176583402, 183736953, 190066077, 195729083, 199978773, 203060217, 205058659, 205209080, 204006804, 201212828]
16700B01212828l939942n372650o615992o808643q091430p592728q401325q465698
16692A45924420q174744p965484p842429p201585p225214o898683o414385n574491
16684H8627405n716442n050471m812054m453009m085765l956562l249685l593253
16676E3710164l190611k656297k235100k808134k460471j957236j814044j935386
16668C4652885k004519j457212j236432j460057j337156j105762j411523q88509
16660B3751715r47933j146847p65225q71627p62529p48341o28920o29006p16372
16651A6534915l21206j153931l53269n56329k38234n19993n49652m74235N370
16642A2373436p48953l97833n4452n58702j37814k63423o58487Q0627o85773K24227
$$ y = [201212828, 197272886, 191900236, 185284244, 178475601, 170384171, 162791443, 154390118, 145924420, 137749676, 129784192, 121941763, 114740178, 107514964, 100616281, 94201896, 88627405, 82910963, 77860492, 73048438, 68595429, 64509664, 60553102, 57303417, 53710164, 50519553, 47863256, 45628156, 42820022, 40359551, 38402315, 36588271, 34652885, 32648366, 31191154, 29954722, 28494665, 27157509, 26051747, 24640224, 23751715, 22803782, 21656935, 20891710, 20020083, 19257554, 18509213, 17880293, 17251287, 16534915, 16213709, 15059778, 14706509, 14150180, 13911946, 13391953, 12842301, 12368066, 12373436, 11624483, 11226650, 11172198, 10613496, 10475682, 10212259, 9553772, 9634399, 8948626, 9172853]
16632I172853j37547n94175P3482n44025l37555K29263p97398m484n43641K27140
16622F743913l2821k97542k61529J32295j57667p5591k30874j41978j38739l05318
16612E234149p8782k79321N4091j07132j35461p692j67135o6727l9055K1423j77821
16601D250537l96559m4188K65829m27943M49813o27637N14143m12636J30894l28700
16591C373553L4178j38560j00927q8980J32841J41336l17577j93781J29610J19254
16581C090947l15319p4796p050M5682l30951L85330l54014j27700J76141r9846
16571B388424j1126l0565K0091o6143j49190P3302j47634J47673m18523L72507
16561B178816m70392K99482l08264J53533L3732j36858n3240k4804j3253K31721
$$ y = [9172853, 9035306, 8441131, 8514613, 7970588, 7633033, 7862296, 7064898, 7060414, 6516773, 6743913, 6711092, 6413550, 6152021, 6284316, 6126649, 6051058, 5820184, 5678206, 5539467, 5234149, 5155367, 4876046, 4930137, 4823005, 4687544, 4679852, 4512717, 4445990, 4406935, 4428358, 4250537, 3853978, 3809790, 4075619, 3647676, 4097489, 3469852, 3983995, 3571359, 3702253, 3373553, 3407731, 3269171, 3168244, 3079264, 3212105, 3353441, 3035864, 2842083, 2971693, 3090947, 2775628, 2700832, 2693782, 2739464, 2408513, 2793843, 2439829, 2312129, 2488270, 2388424, 2377298, 2346733, 2366824, 2300681, 2151491, 2224793, 2077159, 2224832, 1806309, 2178816, 1708424, 2007906, 1699642, 1853175, 1886907, 1750049, 1696809, 1672005, 1658752, 1890473]
16551A890473k57219L77528l93175k01592K6774L89071j65114l04351L00799m6997
16541A616197l99707J93614k18981M53335j21253l74451L06770P3870l89629q9098
16531A050667N31652l45342J72845k02167k12023j62558L80724r9285o835K12589
16521A320267j80023n5258J24052R0077r5158r8326j23419k58170K26570K66820
16511A217432l18740J29187J32802k01733K13722n6865r2257k3659K42609l13509
16501I28989Q7733q7163m5988L78046k96306P4625j50174Q3686m15310J01113
16491F59251R9591J17869k30949j11333L85841k10132L60328m74981K12689j21067
16481F87107J71176k60678J1666K23344R4717j99874j14912M31326m35681m628
$$ y = [1890473, 1633254, 2010782, 1617607, 1416015, 1442789, 1831860, 1666746, 1362395, 1663194, 1616197, 1216490, 1410104, 1191123, 1644458, 1523205, 1148754, 1455524, 1529394, 1139765, 1050667, 1582319, 1236977, 1409822, 1207655, 995632, 833074, 1213798, 1114513, 1107678, 1320267, 1140244, 1084986, 1209038, 1299115, 1203957, 1105631, 982212, 724042, 950612, 1217432, 898692, 1027879, 1160681, 958948, 1172670, 1115805, 1023548, 999889, 1242498, 928989, 1016722, 929559, 883571, 1261617, 965311, 1039936, 889762, 973448, 558138, 659251, 758842, 876711, 645762, 534429, 920270, 710138, 1070466, 595485, 808174, 687107, 858283, 597605, 609271, 832615, 927332, 727458, 612546, 1043872, 608191, 603563]
16471F03563J84358k02428K06683C53825K59330m5873L59065l35146O3262O6597
16461G21060N912k69882Q8735O4881R0126j68632j91176L56498j94669j40139
16451C62714R4276j20629j03654P1931K34903j99971L05732M2450l07573j04367
16441B75812Q5301R5375K43746j73646k01938K86595k42928J61498J30839k98521
16431C62133A25430M27723k3175J58430j91119k26656K21327K13911A00322J24421
16421B24743M3998L89050O6519Q3214j94950J28095C50199p3503P6412J22125
16411D75233j38183K85939O8992j94016p5850j65382I5296L89807k21A58917K01305
16400C60222l8674j03552J04953j54447K27307M0179J66527j87441o4339j70986
$$ y = [603563, 787921, 585493, 792176, 353825, 613155, 567282, 926347, 591201, 654463, 721060, 726972, 457090, 545825, 610706, 700832, 532200, 341024, 697522, 502853, 362714, 456990, 336361, 232707, 304638, 539541, 339570, 645302, 687752, 380179, 275812, 361113, 456488, 700234, 526588, 324650, 611245, 368317, 529815, 660654, 362133, 125430, 553153, 529978, 688408, 497289, 270633, 491960, 705871, 100322, 224743, 268741, 657791, 724310, 807524, 612574, 740669, 350199, 276696, 353108, 475233, 337050, 622989, 691981, 497965, 422115, 256733, 95296, 485103, 484882, 158917, 360222, 321548, 217996, 322949, 168502, 395809, 435988, 602515, 415074, 350735, 179749]
16390A79749K97648N245B09196Q6646N5773N4632N887A01298K5278M29609B05062
16378D9666L66595j97016I535a078F09084I7043L27569G8578J14363J79379J005
16367C73325o2430N7333J97095A04349J75860N7613P4732l9539P3411q9714C4713
16355D65031j42041g9535B46183J06360j40784C8272K74031j06795L42737j51575
16345C96670A02444J19784K40220G6099J25026H8799L06665R420a83082H7792
16334C10220j18558I449M34713A36591j8256b9250D08937A92472K23297A9602
16323B66635F2475K92718a04799B48350j11045P3724J18452A36469J87612A24928
16312I5452J0427P5746D6513J07347F8914K2493K13940i4866A56095L5039P1257
$$ y = [179749, 477397, 482642, 209196, 295842, 351615, 406247, 412134, 101298, 126576, 556185, 205062, 49666, 416261, 219245, 9535, -1078, 609084, 97043, 424612, 78578, 192941, 372320, 373325, 310895, 368228, 565323, 104349, 280209, 337822, 412554, 373015, 446426, 356712, 34713, 465031, 322990, -79535, 246183, 352543, 211759, 38272, 312303, 205508, 548245, 396670, 102444, 222228, 462448, 76099, 201125, 88799, 395464, 404884, -183082, 87792, 310220, 191662, 9449, 444162, 136591, 118335, -29250, 408937, 192472, 415769, 19602, 266635, 62475, 355193, -104799, 248350, 137305, 211029, 329481, 136469, 324081, 124928, 95452, 105879, 181625, 46513, 153860, 68914, 91407, 305347, -94866, 156095, 191134, 262391]
16301B62391m8941p3165J11005J17553G0658J4965J92504A03695L09769f1233
16290b32201a1400F4538L35782j80186a30889B42165K2474A10605d6439G3824
16279C2114M75761j99418E0494L188J90001J40503n6180k7475A10433P2481l0284
16268A52630J39454H2579K79177j6987J96963A53488J85715a22102A46330R6355
16258B42685J42135A8799K50843B5378K64439B9538J24797a39494A60064G3377
16247A27702c69544A20490J31998C960a25395A64550l514Q8965b16194A51683
16236A39187b09215e3632B5023e3583E5560d6138r0738O7033A06652l4503J0057
16225H2206L72610a60388e3953k4335B0850Q3552h1186c4596I1840J17543Q865
$$ y = [262391, 213450, 140285, 251290, 368843, 70658, 85623, 278127, 103695, 413464, -61233, -232201, -11400, 64538, 400320, 220134, -130889, 242165, 264639, 110605, -46439, 73824, 32114, 507875, 308457, 50494, 53682, 243683, 384186, 328006, 300531, 110433, 182914, 152630, 292084, 82579, 361756, 344769, 541732, 153488, 339203, -122102, 146330, 242685, 384820, 18799, 269642, 25378, 289817, 29538, 154335, -139494, 160064, 73377, 127702, -369544, 120490, 252488, 3960, -125395, 164550, 161036, 250001, -216194, 151683, 139187, -209215, -53632, 25023, -53583, 55560, -46138, -136876, -69843, 106652, 72149, 82206, 454816, -160388, -53953, -78288, 20850, 104402, -81186, -34596, 91840, 209383, 218248]
16214B18248p5297i7614A9706K51184f5467A72478h8694B5840J00014a72068B0592
16202a50735B6816L3914b07487D04a80480A61927L32370a66148A43254a49723
16191B08881c2644A03428a08516F2952a40267b4126A37957J2160f3895j06706
16181a70601O6602a4240B5557J33434k4614A0363L5994J14790h6269G0678E83
16169D6617K41368h0547C8384e2931n5377D12401A65195a38803b7071l0201H6547
16157c22651J16112B24237j04797n5023a79133h127A4179J34578P1435l338A03420
16145c0167l4988E7471b30950A61992B0428M3468l88J83352J58099D8959c0220
16133a8228m5392k04234a16880B94079D9919M8835J53392d0685o2758A21467O0823
$$ y = [218248, 142951, -97614, 19706, 270890, -65467, 172478, -88694, 25840, 125854, -172068, 20592, -150735, 26816, 60730, -207487, 404, -180480, 161927, 494297, -166148, 143254, -149723, 208881, -32644, 103428, -108516, 62952, -140267, -24126, 137957, 150117, -63895, -170601, -103999, -14240, 25557, 158991, 134377, 10363, 46357, 161147, -86269, 70678, 583, 46617, 287985, -80547, 38384, -52931, -108308, 412401, 165195, -138803, -27071, -57272, 86547, -322651, -206539, 224237, 119440, 64417, -179133, -8127, 14179, 148757, 220192, 216854, 103420, -30167, -65155, 57471, -230950, 161992, 20428, 63896, 63508, 246860, 404959, 48959, -30220, -18228, -63620, -267854, -116880, 294079, 49919, 98754, 252146, -40685, -103443, 121467, 182290]
16122A82290d4264F9877B240J88641D0113a26877D768P7438K44460b0753A26183
16110A31882i570A99513h099r1974C54030a56018C31965B1361J4241J45991a87629
16098A05143b27847D57230B9809b42025J04834B97985m1548I1676q746f1811D9738
16086B35690N4984a3885j72334B54377E5166b17612a6433c219A11107I138b02588
16074A55407G5646J09561a58316G8093c22164J5823I0917m2266d48102A24011
16063F5356h3382E8836R125L3479M7319D4323a74505b2694A30210c3384j35605
16052a68989B19251b28725A32357J7383b95420M0319B68639n6932d3471J0462
16042c3009E2935a14957c0738l9074D2054b16870B41002b82388A19569B1352b82857
$$ y = [182290, -44264, 69877, 2240, 190881, 40113, -126877, 4768, 82206, 326666, -20753, 126183, 131882, -9570, 199513, -8099, -100073, 354030, -156018, 331965, 21361, 35602, 181593, -187629, 105143, -227847, 457230, 29809, -242025, -137191, 297985, 256437, 91676, 82930, -61811, 49738, 235690, 290674, -13885, -186219, 254377, 55166, -217612, -16433, -3219, 111107, 9138, -202588, 155407, 75646, 185207, -158316, 78093, -322164, -306341, 90917, 48651, -448102, 124011, 65356, -83382, 58836, 67961, 101440, 148759, 44323, -174505, -22694, 130210, -33384, -168989, 219251, -228725, 132357, 149740, -295420, -255101, 268639, 211707, -43471, -33009, 52935, -114957, -30738, -69812, 42054, -216870, 241002, -282388, 119569, 21352, -282857]
16030b86143h4271B1575K43649d8032m05681E0487a57817A0446a69706c7027l29189
16019c66216g4887a4912j23104a8012A67060C4913a60575k78485J80509a26745
16008e0787k28706J20069l7096B57033d33911L1863m506K00049C0080J8036d68737
15996i5843J6705j46121B38J17054a47672o5637d4972i691p4559j95135G4517
15984b54302A42139A2570J617P525a28889c8402R694F0933M0275a07300k27414
15973c34714h2237F8618a08919E4752L88524l4548h3878D67291A47070i0165A61597
15961B84670A0811b97917A08731L8039l7997d6142J9150o8574A27907h4598A33658
15949a22019n2377A3133M07728A68038J08707a5614l36776A48323B2482E24Q4483
$$ y = [-286143, -84271, 21575, 265224, -48032, -453713, 50487, -157817, 10446, -169706, -37027, -366216, -74887, -14912, -138016, -18012, 167060, 34913, -160575, -439060, -258551, -126745, -50787, -279493, -159424, -196520, 257033, -433911, -402048, -406554, -206505, 30080, 48116, -468737, -95843, -79138, -225259, 238, 117292, -147672, -213309, -44972, -9691, -84250, -279385, 74517, -254302, 142139, 12570, 14187, 21712, -128889, -38402, -28708, 60933, 101208, -107300, -334714, -82237, 68618, -108919, 54752, 443276, 408728, -83878, 467291, 147070, -90165, 161597, 284670, 10811, -297917, 108731, 146770, 108773, -46142, -26992, -95566, 127907, -84598, 133658, -122019, -174396, 13133, 420861, 168038, 276745, -15614, -352390, 148323, 22482, 524, 85007]
15938H5007f7550A39725a74533j27158G4227e4690C5459f5371l58388A61253f5670
15926a27801A31718a22095j86054B25915a61019j2053B57928b08707I7737K8639
15916A26376J00972a45765B5778f5557K9336m24k23228d4710j52403j6016H482
15904a25534r8653N1236e773j08486c4185n9110M2970l50532b7671P941k00733
15893b20463b9600E46d04660K00661L2780k62003A168f2852A40994K636a23415
15881c9942j14437l3323I2843a19442D2962c81874i8416j45902B47810a71697
15870B66306f1264C5390a55202A2753a41895B64518b19438e3929m3612C3101a12430
15858a62704F820J1162k147e4297A73772J85888A62908c20163N5022G271a41952
$$ y = [85007, -67550, 139725, -174533, -301691, 74227, -54690, 35459, -65371, -423759, 161253, -65670, -127801, 131718, -122095, -308149, 225915, -161019, -173072, 257928, -208707, 97737, 126376, 227348, -145765, 25778, -65557, -36221, -36645, -259873, -44710, -197113, -213129, 8482, -125534, -224187, -172951, -5773, -114259, -34185, -93295, -50325, -400857, -27671, -19730, -220463, -29600, 546, -404660, -203999, -171219, -433222, 1168, -62852, 140994, 143630, -123415, -39942, -154379, -187702, 92843, -119442, 42962, -381874, -98416, -244318, 247810, -171697, 266306, -61264, 35390, -155202, 12753, -141895, 264518, -219438, -53929, -97541, 33101, -112430, -162704, 6820, 17982, 15835, -54297, 173772, 359660, 162908, -320163, -265141, 7271, -141952]
15846a58914g6736l52619c1987C37144g4730k2404A05977b27411E219J23735j8727
15835A10227a25745D5946M3215e0737A90924e6791k30050c0325B2739J67885E4277
15823f8002k54161A73228P2032A12906c316H2257c33746B06037I5104a70824r4042
15812b64866a01634j12904K0570h8979o3459b297H1454c18986J37852A65234P7989
15801B43223f3651A4833h4572A81470p9740J51672j07689b01150A15337C1296
15790I6601j9715l8275O8970i1270A82698b81767J21830A07168b33027A8444a99096
15778A23347j9213a2384p2917r9572d4959p7603o1208P8431A5931a22039A66543
15766F5127Q2152M4113C9969J40314m7659a84389H2877K30542d8363j14014G2518
$$ y = [-158914, -76736, -429355, -31987, 337144, -74730, -97134, 105977, -227411, 5219, 128954, 110227, -125745, 45946, 89161, -50737, 190924, -56791, -286841, -30325, 22739, 190624, 54277, -68002, -322163, 173228, 245260, 112906, -3316, 82257, -333746, 206037, 95104, -170824, -264866, -101634, -214538, -193968, -88979, -152438, -2297, 81454, -318986, -181134, 165234, 243223, -63651, 14833, -84572, 181470, 101730, 253402, 145713, -201150, 115337, 31296, 96601, 76886, 38611, 107581, -91270, 182698, -281767, -159937, 107168, -233027, 18444, -199096, 123347, 104134, -12384, -85301, -184873, -44959, -122562, -183770, -105339, 15931, -122039, 166543, 65127, 147279, 191392, 39969, 180283, 132624, -184389, 82877, 313419, -48363, -162377, 72518]
15754g4958E887J2695f6225j88310A59565b31678d881j48069B20555H323K19632
15743B27955a56942H520J46972h2378c6635E1766a63222j07274H2317a18864F4512
15731a05260D36922k14124E4929b0014l66484B51887H3696a31183e0504j67135
15721b17639h9893j13321m5688B60952a89944j65193J06886J12426H3537a13827
15710d5939B88986c5041j45210G6557L8283L03324h2065F8529a28205L8779j43158
15699b32584q6069F3659M01578C3136b83720n7156A07585h2149b74C3509c27275
15687a81752j16806L5701j88109J71711C60087G0793b13994A47023A5903b95082
15676b10394d0743J5437A81187D1975O2448e9838j65232g1738j77386o1559I7112
$$ y = [-74958, 5887, 18582, -66225, -254535, 159565, -231678, -4881, -152950, 220555, 8323, 227955, -156942, 8520, 155492, -82378, -36635, 51766, -163222, -270496, 82317, -118864, 64512, -105260, 436922, 222798, 54929, -20014, -386498, 251887, 83696, -131183, -50504, -217639, -89893, -203214, -248902, 260952, -189944, -355137, -248251, -135825, 83537, -113827, -45939, 288986, -35041, -180251, 76557, 114840, 418164, -82065, 68529, -128205, -89426, -232584, -318653, 63659, 465237, 33136, -283720, -340876, 107585, -82149, -274, 33509, -327275, -181752, -298558, -262857, -450966, -279255, 360087, 70793, -213994, 147023, 15903, -295082, -210394, -40743, -25306, 181187, 41975, 104423, -59838, -225070, -71738, -249124, -310683, 97112]
15664B8349J54066e9413B89792g2025D2702Q1938A6758J43420e3077o9883C60150
15652a14903A87017b27166a2060j59606R19I3524J3489a91652b4388i145l42567
15641c51712a32281c8549j21509A3408J00156L97644g2621j17396h8631C62695
15630A92507G5620a42462i506c026k15027j32540c3773o9480A7183a31156B1540
15618B41351a87952J7375e0020J7500k4418C5100K21331a1645k81328G7896c4803
15606a33470C5253J8724L31885A23756c395l6036A19344K7301b06248O5794j9102
15595a59556L0950r023C2434K4817a91378E5021b8126A9276N0940g6873D04646
15583A92749c97223a70714k8974A97197a87306i614n8752r0910b5988A57989G010
$$ y = [28349, 182415, -59413, 289792, -72025, 42702, 124640, 16758, 160178, -53077, -122960, 360150, -114903, 187017, -227166, -12060, -171666, -170747, 93524, 107013, -191652, -24388, -9145, -351712, -132281, -38549, -160058, 13408, 113564, 511208, -72621, -190017, -88631, 362695, 192507, 75620, -142462, -9506, -3026, -218053, -350593, -33773, -103253, 17183, -131156, 21540, 241351, -187952, -170577, -50020, -32520, -56938, 35100, 256431, -11645, -292973, 77896, -34803, -133470, 35253, 53977, 385862, 123756, -3395, -39431, 119344, 146645, -206248, -140454, -159556, -128606, -137629, 32434, 57251, -191378, 55021, -28126, 19276, 70216, -76873, 404646, 192749, -397223, -170714, -199688, 197197, -187306, -9614, -68366, -159276, -25988, 157989, 7010]
15571f5395G194P7265a11680N1799B9322a48997A3336b36694F3318a9231A73041
15559b54675H7795d41785A5203d6026A2026Q6682a52400B31991b12692c1150G7713
15547a58047D32608k04941G3373J53387f9027D6310b87925E335a75742G4206d62608
15535a31059C40387A45038A9890K33700a46675e0211F9529J59957A1255a8433
15524f7812k05532B88918e5784j24844C2442e9608M122B16824H9829J95329f6660
15512A00377a25262P539j01766B0839K14722o5660a0358q526k53128F8290b36769
15500h7397d2277a3549H9176a46286f5365j5173A43317E5671J10397d46231K17461
15489b28770F7707a18153l4702N8042r8488L8635k0084I0249M2735J50740D4627
$$ y = [-65395, 7194, 84459, -111680, -59881, 29322, -148997, 13336, -236694, 63318, -19231, 173041, -254675, 87795, -441785, 15203, -46026, 12026, 98708, -152400, 231991, -212692, -31150, 77713, -158047, 432608, 227667, 73373, 226760, -69027, 46310, -287925, 5335, -175742, 74206, -462608, -131059, 340387, 145038, 19890, 253590, -146675, -50211, 69529, 229486, 11255, -18433, -67812, -273344, 288918, -55784, -180628, 32442, -59608, -55486, 216824, 89829, 285158, -66660, 100377, -125262, -117723, -219489, 20839, 235561, 169901, -10358, -18884, -272012, 68290, -236769, -87397, -42277, -13549, 89176, -146286, -65365, -80538, 143317, 55671, 166068, -446231, -228770, 67707, -118153, -152855, -94813, -193301, -154666, -174750, 90249, 132984, 283724, 44627]
15477g8534q4432l1443P8413J316G3017b14604f3922j28761D551f5029p2708B3327
15464a10270A06800A4909a04904C0078c53485J08471B32919r8204a5089j58338
15454a73427a6742n4027B5429a57017H6345r469h6071A09340e8012j5819K6470
15443d7361r0535d7456k35830A04635a23882f1142l1130B39975a06049e14j0230
15432a0744C05085A6340a32457j34566h1804j79592A30015q552b03630r1151A67623
15420F5754R0199F4195c37939a20581a9598m8638A47250a91818P7140c8347A22706
15408h8731L3011A69251p3311a64511C05665F0235K13993d8911D7319c41368A44083
15396a6819j162A56057a58450l09241a4898A92991a78472I5411e4698I450K43581
$$ y = [-78534, -162966, -194409, -115996, -114680, 73017, -214604, -63922, -192683, 4551, -65029, -137737, 23327, -110270, 106800, 14909, -104904, 30078, -353485, -245014, 232919, 134715, -15089, -173427, -16742, -70769, 25429, -157017, 86345, 76876, -86071, 109340, -58012, -73831, -47361, -137896, -47456, -283286, 104635, -123882, -61142, -92272, 239975, -106049, -514, -10744, 305085, 16340, -132457, -267023, -81804, -261396, 130015, 121463, -203630, -294781, 167623, 65754, 155953, 64195, -337939, -120581, -19598, -68236, 147250, -191818, -114678, -38347, 122706, -88731, -55720, 169251, 95940, -164511, 305665, 60235, 274228, -48911, 47319, -341368, 144083, -16819, -17981, 156057, -158450, -467691, -14898, 192991, -178472, 95411, -54698, 9450, 253031]
15385B53031g3889k74221a39862B77044D2038a80689f790A40057l3605P5293a99745
15373A58141o9948A3490b3727A30709d7982C7275a04708m236C3533i2513A54522
15361G2924b48970M1100B51627d7616j42274R0664j67794c0680B25106k9172g3564
15349a9764K754A64067l423E9602e7723j6133A57629a07662J1932l2522B58049
15337c25723d679l2979j6628b0439C1541b4717j30453E093b95384O2665N4560
15326a78159c8445p797B74181f5061E0061J04624g1076D10483D3673M0250c0465
15314A23641D6206a90763Q5274k1946A25570c4491a2281k8638m7439b7390A37345
15302D82801E4231g2668B09521a29998C4026b90790R8961P3049A11228m8335a78014
$$ y = [253031, -73889, -348110, -139862, 277044, 42038, -180689, -6790, 140057, 106452, 181745, -199745, 158141, 88193, 13490, -23727, 130709, -47982, 37275, -104708, -108944, 33533, -92513, 154522, 72924, -248970, -207870, 251627, -47616, -189890, -99226, -267020, -30680, 225106, 195934, -73564, -19764, -17010, 164067, 160644, 59602, -57723, -73856, 157629, -107662, -95730, -128252, 258049, -325723, -4679, -37658, -54286, -20439, 31541, -24717, -155170, 5093, -295384, -232719, -178159, -38445, -46242, 274181, -65061, 50061, 154685, -71076, 410483, 43673, 83923, -30465, 123641, 46206, -190763, -105489, -127435, 125570, -34491, -12281, -40919, -88358, -27390, 137345, 482801, 54231, -72668, 209521, -129998, 34026, -290790, -191829, -118780, 111228, 62893, -178014]
15290a37070B03369A722b01512g5846L1311A04682h1232B84687c55228B3714c25747
15278B05774b1282q7611a2400B3331a64055C55628n5032b04839O3063D73882h8110
15266D68649f0363H9400a90419C53702D991i9590A08735E2686M9429C2116J9409
15255E1525K18523J8335f1110l3377A72774G0644a06457L9865D9392n557A3448
15243B12107D9067J47080a46128A34531L4038k7169K20644O3222M12177P9791
15233I17234l40003J48950j03075C07337q397J54128k16519j02894J38623a27934
15222I4561e9354I4015a47429L7632d2522A3637J15497C0975b18560b5459G4370
15210E0390f5532k22567A83037p3981J2152P9681F7083J83057d2673A1382a9855
$$ y = [-137070, 203369, 1722, -201512, -75846, -44535, 104682, -81232, 284687, -355228, 23714, -325747, 205774, -21282, -108893, -12400, 23331, -164055, 355628, 300596, -204839, -141776, 473882, -88110, 468649, -60363, 89400, -190419, 353702, 4991, -99590, 108735, 52686, 102115, 32116, 51525, 270048, 288383, -61110, -94487, 172774, 70644, -106457, -66592, 49392, 43835, 13448, 212107, 49067, 196147, -146128, 134531, 168569, 141400, 362044, 425266, 837443, 917234, 577231, 726181, 623106, 307337, 298940, 453068, 236549, 133655, 272278, -127934, 94561, -59354, 94015, -147429, -109797, -42522, 13637, 129134, 30975, -218560, -25459, 74370, 50390, -65532, -288099, 183037, 109056, 121208, 200889, 67083, 250140, -42673, 11382, -19855]
15198E9787M2671J86966F413d0157B712J38656a84087C10868h5255k39644i7525
15186D44246D4635a05185D22039B778d09556B10135f7585k03802B32397A8037
15175F3133a3162k6897l3577B15502l753K9414i4332d5187k13599A00013R3665
15164A93678a43830B78171A6557L13323C1222J55232a96932e6199r8694F1849
15153A41103a59712q026C6859N4997O0266a73776D11896H1023i2533f873j638
15142h511k10745E0076L172M9499l6865M3592D4264Q602b50941i3030C09747h1348
15129H5281l7032M08475G2026k492K77532i1935j67367C7610R7764K0365k743
15118A52996J3590J95930A21718j7854c1787A72156K08891H034c0821B7136J53244
$$ y = [59787, 102458, 289424, 6413, -40157, 2712, 141368, -184087, 310868, -85255, -324899, -97525, 444246, 44635, -105185, 422039, 2778, -409556, 210135, -67585, -271387, 232397, 18037, 63133, -13162, -40059, -73636, 215502, 211749, 241163, -94332, -45187, -258786, 100013, 193678, -143830, 278171, 16557, 329880, 31222, 186454, -196932, -56199, -154893, 61849, 141103, -159712, -167738, 36859, 91856, 152122, -173776, 411896, 81023, -92533, -6873, -8511, -219256, 50076, 53248, 102747, 65882, 109474, 44264, 52866, -250941, -93030, 309747, -81348, 85281, 48249, 456724, 72026, 69534, 347066, -91935, -259302, 37610, 135374, 155739, 152996, 166586, 362516, 121718, 103864, -31787, 172156, 381047, 8034, -30821, 27136, 180380]
15107A80380M0968H0564K38478d945B91891I0910j0852J05074m3392B6495J56024
15096A82519J80243e73C18430j03437a45984B67598A19459J38276b7563E9750
15085A51369N3635H1958J58626j2550i4992D78130k19644A20916K85092F162J43213
15074A49375R2683o6993a92927A12206N3227O2111N9783l8877K7380F1388O568
15063F7956J53906B44J78686M9509a57953B79894j9624P902g2237c3737C65809
15051A04836I083J02669i0771A53881J57194p0008K04156j92836I8838K51393
15041C50231b7501A234J04198K10409a34748A74476a57977A8140J15180d7807
15030a01153A31037b25224B18013E0150O3149N8938m2737D3171L08854p8611I1924
$$ y = [180380, 221348, 80564, 319042, -4945, 291891, 90910, 80058, 185132, 141740, 26495, 182519, 362762, -573, 318430, 214993, -145984, 267598, 119459, 257735, -27563, 59750, 151369, 205004, 81958, 240584, 228034, -94992, 478130, 258486, 120916, 406008, 6162, 149375, 242058, 175065, -192927, 112206, 165433, 227544, 287327, 248450, 275830, 61388, 67956, 221862, 244, 178930, 228439, -157953, 279894, 260270, 268172, -72237, -33737, 365809, 104836, 9083, 111752, -90771, 153881, 311075, 241067, 445223, 252387, 98838, 350231, -27501, 1234, 105432, 315841, -134748, 174476, -157977, 18140, 133320, -47807, -101153, 131037, -225224, 218013, 50150, 113299, 172237, 129500, 43171, 352025, 273414, 91924]
15018A79633h3663A52545J54784Q6147j83807I463d1067A08685J46781O3230q2055
15007B36641C4336J30874J50321A08381K18854A56683J19907J47255j54943i9146
14996A01336B1957J10656k8032J48433J62881A18774b5944C35680j57752J74171
14986C52099A38719C137M9921K41987A15284K38362E0584M29257j78130k780K43707
14975E42638o5510j53064j57599F8672K65796A54721K34841i3340C55368q0958
14965B74410Q952o2059A9528J36220L71284A91567I1390L318D678J45175J63119
14954C12972m5121D3253j5951J378K58257A36701J44987A24140J96944r8838O7505
14943B89751C7369g8847B09813M84569A87724d8749B5779r852K22240J46777A56908
$$ y = [179633, -83663, 152545, 307329, 393476, 209669, 9463, -41067, 108685, 255466, 318696, 236641, 34336, 165210, 315531, 108381, 327235, 156683, 276590, 423845, 268902, -99146, 101336, 21957, 132613, 104581, 253014, 415895, 118774, -25944, 335680, 177928, 352099, 138719, 3137, 53058, 295045, 115284, 353646, 50584, 479841, 301711, 298931, 542638, 477128, 324064, 166465, 68672, 334468, 154721, 389562, -93340, 355368, 274410, 283362, 221303, 19528, 155748, 527032, 191567, 91390, 94708, 4678, 149853, 312972, 267851, 43253, 27302, 28680, 286937, 136701, 281688, 124140, 321084, 222246, 289751, 37369, -78847, 209813, 694382, 187724, -48749, 25779, 15927, 238167, 384944, 156908]
14931B41253a84870C37415Q4553E9153K75102M4066p074A71211K09683J43357
14921E24251A15743P1539M1353K01407E6063O5080j2563L41987B21625N4225J01581
14910C77431j45430M7708n2778J5003p0218m4256K25888g6014E31197j86437P2179
14899D16939C967L08344J99406j73426K89161j65277A34860a44671B61952o8707
14889A93245J56189j03562L07327r0275J718j27669E4866P4978J48029K18001
14879D95874j31984K5479p6287R8005j12909j7266L4885L4275A70869J97575A81816
14867D90388B26811J46810L4516m3855m7055l5113J41859N4482A49887O8156n090
14856B12953j9969M2623J12062a89729D12178j65937R7884M1273l4753J35482
$$ y = [241253, -184870, 337415, 421968, 59153, 334255, 378321, 371247, 171211, 380894, 524251, 115743, 187282, 228635, 430042, 56063, 121143, 108580, 450567, 221625, 275850, 377431, 232001, 279709, 226931, 241934, 171716, 127460, 353348, -76014, 531197, 344760, 416939, 3967, 312311, 511717, 338291, 627452, 462175, 134860, -144671, 261952, 193245, 349434, 245872, 553199, 462924, 464642, 336973, 54866, 129844, 277873, 495874, 363890, 389369, 313082, 411087, 298178, 280912, 315797, 350072, 170869, 368444, 181816, 490388, 226811, 373621, 408137, 364282, 317227, 282114, 423973, 478455, 149887, 218043, 212953, 192984, 235607, 347669, -189729, 412178, 246241, 344125, 385398, 350645, 486127]
14846D86127j63379p4785M41823A20302M8390L27921B07993k304J00857r3855
14836B12691K50576J20737r0181j05442M2578J66196k54433j59700L99621B70381
14825B33378J51788R1305k5364k20315m5037C3830N46477o7120B05167M87463
14815F92630k66296n4480J1140A77341K74886R799B19158K91372q5685l8170P1072
14804D57747J45635B79593H5577L44973L39998k79484p14B04674L16949A46629
14793B55854J85602L09616l54315Q7569B41726M25037k05901N0794J38785k50706
14783C99735j93339L05462j33261J00294P6693j39422K3240r7028J03976K32927
14773F79277B76962J44718Q9901o7593p5052K33309q2691j66028N66050m13350
$$ y = [486127, 322748, 247963, 689786, 120302, 168692, 496613, 207993, 205689, 306546, 212691, 463267, 584004, 493823, 388381, 430959, 597155, 342722, 183022, 582643, 270381, 233378, 385166, 476471, 451107, 230792, 185755, 33830, 580307, 513187, 205167, 692630, 426334, 371854, 382994, 177341, 452227, 462026, 219158, 510530, 424845, 386675, 457747, 603382, 279593, 85577, 430550, 770548, 491064, 490350, 204674, 521623, 146629, 255854, 441456, 751072, 396757, 484326, 241726, 666763, 460862, 511656, 650441, 399735, 206396, 511858, 378597, 478891, 555584, 416162, 439402, 342374, 446350, 679277, 276962, 421680, 511581, 443988, 368936, 602245, 519554, 353526, 919576, 506226]
14763E06226r1355J61528j89945J43274J88907p1262p7978j83765J81527M6727
14753F13884J81319N500B45037N28959p6710J2285B69785O85151k93525k31003
14743D30408j59777L06590n0726j52749L6969K67661k4192J58331m0796B59672
14732F21719L26779m02719j60427J95033M50218k85984j99534K54879j7897q2404
14722F99663J65055j85275J99904D35170K692A40510R15447k34538M58232n83129
14712F96522N8702J80822k28322J91924r329k68352J94511K2590J1646j71133
14702F79581K69807j30537O242L5393J27342l99393M75467k99022O766l41003
14692D30643P07219l93102j15185N27135E70842L51515k54294L38670q7694k70832
$$ y = [506226, 414871, 576399, 386454, 529728, 718635, 647373, 569395, 385630, 567157, 613884, 795203, 800703, 245037, 773996, 697286, 709571, 269785, 954936, 661411, 430408, 270631, 577221, 526495, 373746, 410715, 678376, 654184, 812515, 771719, 259672, 621719, 948498, 545779, 385352, 580385, 1030603, 744619, 545085, 799964, 782067, 699663, 864718, 679443, 879347, 435170, 437862, 140510, 1055957, 821419, 1279651, 696522, 755224, 936046, 707724, 899648, 890319, 621967, 816478, 839068, 850714, 679581, 949388, 818851, 825093, 860486, 987828, 588435, 1063902, 764880, 771646, 430643, 1137862, 744760, 629575, 1156710, 570842, 922357, 668063, 1006733, 919039, 648207]
14682F48207N2945L50239r4491O571m9001m3212J77473k75089J95728K9419m20186
14671E78603M47757Q5880j90917J14958m1391Q828o1538k7956K99204k38563J36062
14660A110927m77657K91173P9640j22516O2015r3000M17495l35450M08235j07678
14650A233184k78981J25980K242R6993K8411j99516r8448J4362K95888m79911
14640G40204K04898N0955K35327k99605M60051l64812R0419j7755j86016L34143
14630A247809k32075M42624m86091L1902L72572k33439j94972J99798K49004R5918
14620A493050l56585N2067L22875K8200l85706j77410J2977L43567J86826k98655
14610A221206J30064J48314j05034l66289M58556j09900J72523j4372k07183K1135
$$ y = [648207, 701152, 1051391, 956900, 963471, 914470, 871258, 1048731, 773642, 969370, 998789, 578603, 1026360, 1112240, 921323, 1036281, 994890, 1003718, 942180, 914224, 1213428, 974865, 1110927, 633270, 924443, 1004083, 881567, 943582, 850582, 1268077, 932627, 1340862, 1233184, 954203, 1080183, 1082425, 1179418, 1207829, 1008313, 909865, 924227, 1220115, 740204, 945102, 996057, 1231384, 931779, 1391830, 1027018, 1117437, 1099682, 913666, 1247809, 1015734, 1458358, 972267, 1004169, 1376741, 1143302, 948330, 1148128, 1397132, 1493050, 1136465, 1188532, 1511407, 1539607, 1153901, 976491, 989468, 1333035, 1519861, 1221206, 1351270, 1499584, 1394550, 1028261, 1486817, 1376917, 1549440, 1535068, 1327885, 1349020]
14600A349020L7980L17536k83853J65455n0716k8293O49j23886M28533l18712
14590A493713p640P6468k20534J37641K93597J4293R8855r0014j42733O965Q8872
14579A749483j0812j1387K02523o9129j45973j19635J83378J27579k73263M67190
14569B099954m91088M93558j44197J06767j19489N2499K99677p2481j17056l8533
14559B069611K78336m60953L37329p0499M8756L08681j36993o3785k45041P16882
14549B782324m04923K55003P9090K33475J28958L001K72576K40687J63141J84904
14539C938236K16899N92192N58304P96274J794021K623185M098186O905908Q660764
14530C0183969j543229j0489250p138757l791403k472131r33461l87798o28867
$$ y = [1349020, 1387000, 1704536, 1420683, 1586138, 1535422, 1507129, 1507778, 1383892, 1812425, 1493713, 1486073, 1562541, 1342007, 1479648, 1773245, 1787538, 1886393, 1796379, 1653646, 1660611, 1749483, 1738671, 1727284, 1929807, 1860678, 1714705, 1595070, 1778448, 1906027, 1632764, 2099954, 1608866, 2102424, 1958227, 2064994, 1945505, 1998004, 2297681, 2225200, 2108144, 2069611, 2347947, 1886994, 2224323, 2153824, 2202580, 2511261, 2374268, 2310483, 2065442, 2782324, 2377401, 2632404, 2711494, 2944969, 3073927, 3076928, 3349504, 3590191, 3753332, 3938236, 4155135, 4747327, 5305631, 6101905, 7895926, 10519111, 14617297, 21523205, 30183969, 28640740, 18151490, 11012733, 7221330, 4749199, 3815738, 3427940, 2799073]
14522B799073j32832p5679l35687L53993J6299l53820K8700P5048J75253m58704
14512B091644J73962k42229J60149K06570q0660p7716O43279n01685L6726L14937
14502B724977j24246q26K68734k26761k8065O34770l15991L6881k98177J91983
14492B863279L1176P6976J01975K2027k0371j08381J16936j69579O87609m23733
14482C177914L1710M8102K96202j32057J51527k75709K53173j62858j00855N90477
14472C877626l96673J5441P7693K65222m42970O46652j10418Q1085k05969J06228
14462C913917K00977j51723q54J08975l357K44335k19917K9617K30499K31979
14452D584448q9284L12513j64495J51177j79841K6380O2206K57775n3453O0391
$$ y = [2799073, 2666241, 2590562, 2254875, 2608868, 2625167, 2271347, 2300047, 2375095, 2550348, 2091644, 2265606, 2023377, 2183526, 2390096, 2309436, 2231720, 2874999, 2373314, 2410040, 2724977, 2600731, 2599905, 2868639, 2641878, 2613813, 3248583, 2932592, 2969473, 2671296, 2863279, 2894455, 2971431, 3073406, 3095433, 3075062, 2966681, 3083617, 2914038, 3601647, 3177914, 3209624, 3257726, 3553928, 3421871, 3573398, 3297689, 3550862, 3388004, 3287149, 3877626, 3480953, 3496394, 3574087, 3839309, 3396339, 4042991, 3932573, 4013658, 3807689, 3913917, 4114894, 3963171, 3962317, 4071292, 4067935, 4312270, 4092353, 4121970, 4352469, 4584448, 4495164, 4807677, 4643182, 4794359, 4614518, 4640898, 4703104, 4960879, 4907426, 4967817]
14442D967817k5566j72128K01201M67292k80390K19497k03373J23444J06195K03193
14432E607182k57144N33498J87078j56701l4757J19704J88718J29498K9615j31211
14422F215480p5815J98482Q5943L57010j57912K89424J08253K75280k46602L65453
14412G414996k77656M11556J01022j58495K00793J80313j16731O56025l70444
14403H041379K58737L39738L04389l19650n0678M06846r7850M23604L46167p8962
14393I573720K86478j57764N93863k43882J30267L74647m9971p6497L50306M88218
14383A1269385O3726K55710J2690J25282K42439K2417P52968P986k18577K65553
14373A2799579L70990M15858M62210j7472l6L61337P03879J42680K03886j51788
$$ y = [4967817, 4942251, 4770123, 4971324, 5438616, 5158226, 5377723, 5174350, 5297794, 5403989, 5607182, 5350038, 5883536, 6070614, 5913913, 5879156, 5998860, 6187578, 6317076, 6346691, 6215480, 6139665, 6338147, 6424090, 6781100, 6623188, 6912612, 7020865, 7296145, 7049543, 7414996, 7137340, 7548896, 7649918, 7491423, 7692216, 7872529, 7755798, 8411823, 8041379, 8300116, 8639854, 8944243, 8624593, 8573915, 8980761, 8882911, 9306515, 9652682, 9573720, 9860198, 9702434, 10296297, 10052415, 10182682, 10557329, 10507358, 10430861, 10781167, 11269385, 11333111, 11588821, 11601511, 11726793, 11969232, 11991649, 12744617, 12752603, 12534026, 12799579, 13170569, 13586427, 14048637, 14031165, 14031129, 14392466, 15096345, 15239025, 15442911, 15291123]
14363A5291123P37699L03641M81876J13362N25594n75N87725K12395J97503Q58868
14353A9309211r8272O22794K77156N14412K03329O46654M20491R84039K8004M55264
14343B3363082N52672O24335P60042M93459M29248Q95263M00918J017869O66844
14334B9203732O11204O44460J106792Q58724P37481J003195J021000R21949R15211
14325C7023748P60044J580557R12022J065783J152974J761391J273540J437442
14317D6967501J274313J256598J693619J857220J555979J727746J954947K006351
14309F0294274K162924J946233K597578K396891K318280K814865K918178K982963
14301H0432186K743361L532731L449515M183001L599147L825039M747969M469312
$$ y = [15291123, 16028822, 16332463, 16814339, 16927701, 17453295, 17452720, 18040445, 18252840, 18450343, 19309211, 19210939, 19833733, 20110889, 20625301, 20828630, 21475284, 21895775, 22879814, 22907818, 23363082, 23915754, 24540089, 25300131, 25793590, 26222838, 27118101, 27519019, 28536888, 29203732, 29814936, 30459396, 31566188, 32424912, 33162393, 34165588, 35186588, 36108537, 37023748, 37783792, 39364349, 40276371, 41342154, 42495128, 44256519, 45530059, 46967501, 48241814, 49498412, 51192031, 53049251, 54605230, 56332976, 58287923, 60294274, 62457198, 64403431, 67001009, 69397900, 71716180, 74531045, 77449223, 80432186, 83175547, 86708278, 90157793, 94340794, 97939941, 101764980, 106512949, 110982261]
14293A10982261M771496N460788M962222N625594O411460O584461O458558P175317
14285A58432157P846804P613384Q512404Q769875R002052J0182366J0250058J0793552
14277B31402652J1665361J1488906J2133736J3244980J2935613J3260740J3580204
14270C19712192J3693462J2991395J3001447J2875335J1927267J0840892J0246759
14263D05288749R883742R247729P357836O200589L648082J140170o99201p81930
14255D41285766r80717l999270p493507o874005q480747j0707780j1540629j2324017
14247C78885094j2105069j3010344j2935662j2893057j3197229j2663030j2896044
14240B89184659j2828926j2248208j1972045j1925075j1850668j1826210j1133244
$$ y = [110982261, 115753757, 121214545, 126176767, 131802361, 138213821, 144798282, 151256840, 158432157, 166278961, 173892345, 182404749, 191174624, 200176676, 210359042, 220609100, 231402652, 243068013, 254556919, 266690655, 279935635, 292871248, 306131988, 319712192, 333405654, 346397049, 359398496, 372273831, 384201098, 395041990, 405288749, 415172491, 424420220, 431778056, 437978645, 441626727, 442766897, 442067696, 441285766, 440305049, 436305779, 428812272, 421938267, 413457520, 402749740, 391209111, 378885094, 366780025, 353769681, 340834019, 327940962, 314743733, 302080703, 289184659, 276355733, 264107525, 252135480, 240210405, 228359737, 216533527, 205400283]
14233B05400283j0230534r978577q782224q703223p761068p989331o973752o459768
14225A38521806o203002n726512n512575n049589m900640m726897m617659l754865
14217I8030067l979959l990071l290424l163677k980672l276255k820611k804392
14209G1724006k612886k279705k509304k116469j986881j628340k197452j534579
14201E4858390k165897j311891j189016j706904j710310j179514j584672j056625
14193D2953561j421215p52653q11593j201944j466480p23683p78617r77996j086706
14184C3732674j291540k66617j094656m70638q88707n25273q30960p52356m53713
14175B7158214p32092j048364k61651n63777p78378m76831l07483o28864m17056
$$ y = [205400283, 195169749, 185191172, 176408948, 167705725, 159944657, 151955326, 144981574, 138521806, 132318804, 126592292, 121079717, 116030128, 111129488, 106402591, 101784932, 98030067, 94050108, 90060037, 86769613, 83605936, 80625264, 77349009, 74528398, 71724006, 69111120, 66831415, 64322111, 62205642, 60218761, 58590421, 56392969, 54858390, 52692493, 51380602, 50191586, 48484682, 46774372, 45594858, 44010186, 42953561, 41532346, 40779693, 39968100, 38766156, 37299676, 36575993, 35797376, 34819380, 33732674, 32441134, 32174517, 31079861, 30609223, 29720516, 29195243, 28364283, 27611927, 27158214, 26426122, 25377758, 25116107, 24552330, 23773952, 23297121, 22989638, 22360774, 21943718]
14166B1943718o70189l02011l67535l29249n46915o60777k2963o85970R8890l32604
14156A8124395l94463j51209k82096o57892l39461l53265l57594k32419j54373
14147A5201623j70595k30096l22731l75055R7513p71605J0828k52520j91936j44936
14137A2850490m02691o2004l24320r7313k76793k67147j77028q6476K3090m15561
14127A0764247j84985l12434l932j00118k97210L71135r0244l21343n89985J52565
14117I387696j20993J9434j20349n17974K43787l22983k13138m1085L17870l98189
14107H234076K13621k87077m93224J30283k85865j37584J45398k40541Q897J7358
14097G305342l87009L26819l31637j34506j88196L57577k29855k84391j61742
$$ y = [21943718, 21273529, 20971518, 20603983, 20274734, 19727819, 19067042, 19044079, 18358109, 18456999, 18124395, 17729932, 17578723, 17296627, 16638735, 16299274, 15946009, 15588415, 15355996, 15201623, 15031028, 14800932, 14478201, 14103146, 14200659, 13429054, 13439882, 13187362, 12995426, 12850490, 12447799, 12385795, 12061475, 11964162, 11687369, 11420222, 11243194, 11156718, 11179808, 10764247, 10579262, 10266828, 10262896, 10162778, 9865568, 10236703, 10146459, 9825116, 9235131, 9387696, 9266703, 9286137, 9165788, 8647814, 8891601, 8568618, 8355480, 8314395, 8632265, 8234076, 8447697, 8160620, 7667396, 7797679, 7511814, 7374230, 7519628, 7279087, 7287984, 7305342, 6918333, 7245152, 6913515, 6779009, 6590813, 6948390, 6718535, 6434144, 6272402]
14088F272402K65964j23360p1271l16468J22805k25484j80662K10279K5377m35091
14078E544491L33850m67126r1022K8924N03725r56752O04970l91977L1169K73336
14068E413588l37543j10485j09260L0891J68936l79745J96119j52258k28329K45459
14058D737373j39636k8626m13072l8640L51902J9696k35679o9110L70132j26287
14048D428053O7494l24862j02234k30824P7667K03000P5000l05783J82686l27288
14038C742909J7468j75431K00534j89166K45728m92138K38117n34761K09538L47427
14028C610225J55996n34988j64960L90803l18788j35819k0930N07574l67124r0165
14018C031824L20684j47754k06095J47216M6760j49000K25212n19312J72836j28535
$$ y = [6272402, 6538366, 6415006, 6343735, 6027267, 6150072, 5924588, 5743926, 5954205, 5979582, 5544491, 5878341, 5411215, 5320193, 5349117, 5852842, 4896090, 5501060, 5109083, 5140252, 5413588, 5076045, 4965560, 4856300, 4887191, 5056127, 4676382, 4872501, 4720243, 4491914, 4737373, 4597737, 4569111, 4156039, 4117399, 4469301, 4488997, 4253318, 4184208, 4554340, 4428053, 4495547, 4170685, 4068451, 3837627, 3915294, 4118294, 4193294, 3887511, 4070197, 3742909, 3760377, 3584946, 3785480, 3596314, 3842042, 3349904, 3588021, 3053260, 3262798, 3610225, 3766221, 3231233, 3066273, 3457076, 3138288, 3002469, 2981539, 3489113, 3121989, 3031824, 3352508, 3204754, 2998659, 3145875, 3192635, 3043635, 3268847, 2749535, 2922371, 2793836]
14008B793836L04567m85780O3284N1946j6759R0778p5600k76748L20360k69828
13998B500056p6602K2975K2028L91225l09743J268O662l06834K64774l6290J22454
13987B601973k24596j85487M26579o54842P48993Q4330l4553K29285j30765K26262
13977C087179L36632Q76058P71586J728018L600631N429578R379310L589871q459635
13968B0339228o133308m189781k455092j881553p94205n48812m32344j19644n72288
13959C212201Q9855l75294L10721l56555k01350J28216m27051Q6478K16382o0159
13949B623444k81006n0807J53327m23282K48139r8772J03822n11453N00606K81007
13939B545025k47079l56178K57949j89155J13046k56254r823L17752j4347l72524
$$ y = [2793836, 3098403, 2612623, 2675907, 2727853, 2711094, 2801872, 2726272, 2449524, 2769884, 2500056, 2423454, 2446429, 2468457, 2859682, 2549939, 2551207, 2557869, 2251035, 2515809, 2479519, 2601973, 2377377, 2191890, 2618469, 1963627, 2712620, 2796950, 2762397, 2991682, 2860917, 3087179, 3423811, 4299869, 5071455, 6799473, 10400104, 15829682, 25208992, 28798863, 20339228, 14205920, 10016139, 7561047, 5679494, 4885289, 4336477, 3904133, 3784489, 3212201, 3302056, 2926762, 3237483, 2880928, 2679578, 2807794, 2380743, 2467221, 2683603, 2623444, 2342438, 2291631, 2444958, 2021676, 2269815, 2171043, 2274865, 1763412, 2264018, 2545025, 2297946, 1941768, 2199717, 2010562, 2123608, 1867354, 1857531, 2175283, 2160936, 1788412]
13929A788412M10552q79058K16191L10597P7089M1568j18031J44821j91680q8380
13919A712081l2769m3515K46163o7905j10807K47916p9986k20225j72523n5697
13909A422733k374L8433K12194k31270k38468L71097N4260J17927J5008k95335
13899A464205j45638K86492o54705K53634K04402L4105L15606k05097j31511m5167
13889A376326J90327k55104r7654L38043j89160J8227L9915J16705j04263M566
13879A437928l07464J20210J27554l20566Q0413M32265k31830K18548k27428j98907
13869A130723M09516l96272M99244k76026l5025J79469r4382n1629j84339L4605
13859A215884P7922j05038j66621J49983J57893m2212j62665L6659j60032O6900
$$ y = [1788412, 2198964, 1319906, 1536097, 1846694, 1923783, 1965351, 1847320, 1992141, 1800461, 1712081, 1679312, 1635797, 1881960, 1814055, 1703248, 1951164, 1871178, 1650953, 1478430, 1422733, 1420359, 1458792, 1670986, 1439716, 1201248, 1572345, 1626605, 1744532, 1759540, 1464205, 1318567, 1605059, 950354, 1203988, 1408390, 1442495, 1758101, 1553004, 1421493, 1376326, 1566653, 1311549, 1213895, 1551938, 1362778, 1381005, 1420920, 1537625, 1433362, 1437928, 1130464, 1250674, 1378228, 1057662, 1138075, 1570340, 1338510, 1557058, 1329630, 1130723, 1540239, 1143967, 1643211, 1367185, 1332160, 1511629, 1417247, 1365618, 1181279, 1215884, 1293806, 1188768, 1022147, 1172130, 1330023, 1287811, 1125146, 1161805, 1001773, 1068673]
13849A068673R0146j71425o0356K12457m1118j06332n3516J15731K87740m8721
13839A293279m49252J89417L31836k17897k45058M93529J58334m80890l5940J81811
13829A219169L094j82339J02496M9014l85869K52100R4697k13702K42557j12249
13819A068968m44372K61975o6175K65069m1019j26962k00385M27245k07960j72308
13809G64076N36272m81971O4945J05950l9596l88068L34862K20443j79489j65878
13799G71546j33314M37678k94355J33307L65288m39929J90546j21877j58920j78822
13789E71148L68710j96396M43862k77188O9920j07171l93038L64380J77532k17840
13779H03919j20970r9562M09200k72758j55238J0860L05020j07391k10037j78099
$$ y = [1068673, 1158819, 987394, 927038, 1139495, 1098377, 992045, 938529, 1054260, 1342000, 1293279, 844027, 1033444, 1365280, 1147383, 902325, 1395854, 1554188, 1073298, 1037358, 1219169, 1222263, 1039924, 1142420, 1191434, 805565, 1057665, 1152362, 938660, 1181217, 1068968, 624596, 886571, 820396, 1085465, 1044446, 917484, 717099, 1144344, 936384, 764076, 1300348, 818377, 883322, 989272, 949676, 561608, 896470, 1116913, 937424, 771546, 638232, 1075910, 781555, 914862, 1280150, 840221, 1030767, 908890, 749970, 571148, 939858, 743462, 1187324, 910136, 980056, 872885, 479847, 844227, 1021759, 803919, 682949, 583387, 992587, 719829, 564591, 575451, 880471, 773080, 563043, 384944]
13769C84944J94187j0978J05055J38374n1939R2072j01060K0422q1909J92299
13759H81467q6689k17282K77500j90321K96334m02987K37342L2784l19252j6731
13749D92165K99936J42462l09084K25178M3355D09904L09153C59293J43782J78826
13739F81901q7336Q1576K72647k05879R3414j19541K52959j43957l0502J73406
13729I68688k13278j61509j15399A37126N22110o2726K10319l3956r1347L65440
13719A046966l81029k30260R5219L20517l28462j06463L70063p9499j20471j86361
13709D00220K92730j90079J17257q1056L33096l34524J17837B79222M28609N4674
13699G62505P2191j22131j33329k42604L85217J77599l75120L9812j00087K91426
$$ y = [384944, 579131, 568153, 673208, 811582, 759643, 851715, 750655, 771077, 689168, 881467, 794778, 577496, 854996, 664675, 961009, 558022, 795364, 828148, 508896, 492165, 792101, 934563, 625479, 850657, 894012, 409904, 719057, 359293, 503075, 681901, 594565, 676141, 948788, 742909, 836323, 716782, 969741, 825784, 795282, 968688, 755410, 593901, 478502, 137126, 659236, 596510, 806829, 772873, 681526, 1046966, 665937, 435677, 530896, 851413, 522951, 416488, 786551, 707052, 586581, 400220, 692950, 502871, 620128, 539072, 872168, 537644, 655481, 279222, 707831, 762505, 834696, 712565, 579236, 336632, 721849, 899448, 524328, 564140, 464053, 755479]
13689G55479k74815K46468k45819A89391M9507J93536L22827j00105k42496l1318
13679C81342O2203K68441j42008A67536L95080j1686J0233J22192j65191J67082
13669F85246j4284k96066K09309j05914j16801K09636j11049J8873J8924j80837
13659C17037L73829L76882E21388k39713N2113q0483K99683k1826j23738j0984
13649C96440R7848r8184A41696M93513j29511D0531P25432k32979o4384J00912
13639E69512P6092A46756M87726J41454j61988A99870J82426p6586I5299O06109
13629G01408k29613l4191M1504N2730B41076l1885N10890j19807K5806k84470
13619C41610J10561O4215j11341L14789B26948P6631J57491j52059O9593M49956
$$ y = [755479, 480664, 727132, 481313, 189391, 238898, 432434, 755261, 655156, 412660, 381342, 443545, 711986, 569978, 167536, 562616, 550930, 561163, 683355, 518164, 685246, 670962, 374896, 584205, 478291, 361490, 571126, 460077, 478950, 497874, 317037, 690866, 1067748, 521388, 281675, 333788, 253305, 552988, 531162, 407424, 396440, 494288, 396104, 141696, 635209, 505698, 40531, 765963, 532984, 468600, 569512, 645604, 146756, 634482, 775936, 613948, 199870, 382296, 305710, 95299, 701408, 471795, 437604, 479108, 531838, 241076, 209191, 720081, 600274, 626080, 341610, 452171, 516386, 405045, 719834, 226948, 303579, 461070, 309011, 378604, 828560]
13609H28560m06321e7317C83645K14746r1381K3436n8937D1263L17529C2778L51469
13598C84247K30935B66762k2727J47870a5347F44493B26201J42511K38243A76730
13587D15664j55730l5575K55873K58379A59696J10178L97071k75146K693K29310
13577F23802l10659K48442l690B09658K08227A43075K78551q6858A08725M37635
13567E46360A97705N2807J98358B16373M96488l15561J08918k31409R8436j00318
13557B72927Q0190l6847O874A44578L1485K67264o556n3237L2678k0794j16236
13546B79182j22197G5757J54001J83112J16795n47j9281j59175J38209r7936j11383
13535B79552Q5225A57392P0837k4869J42441K21341k75071j12908J1201J55866
$$ y = [828560, 422239, -57317, 383645, 598391, 507010, 530446, 471509, 41263, 358792, 32778, 384247, 615182, 266762, 244035, 391905, -15347, 644493, 226201, 368712, 606955, 176730, 415664, 259934, 224359, 480232, 738611, 159696, 269874, 666945, 391799, 394492, 623802, 313143, 561585, 557895, 209658, 417885, 143075, 421626, 334768, 108725, 546360, 197705, 250512, 448870, 216373, 712861, 397300, 506218, 274809, 373245, 272927, 353117, 316270, 323144, 144578, 176063, 443327, 436771, 383534, 416212, 395418, 279182, 156985, 75757, 229758, 412870, 529665, 529118, 509837, 350662, 488871, 390935, 279552, 364777, 157392, 228229, 203360, 345801, 567142, 292071, 179163, 190364, 346230]
13525C46230L87242l00090K6366A17666K80888A36163L27732f8093D21559K6162
13515D47721A22189L33243k13720J47951L7804n7032j67515o491G6909L75129
13505D52038J01536E1905J99407G2325K45521J1750J39131m4322A3698N62413
13495E76111A63982K55483A41059K66289j0984j1808J64247o5111J38906j86902
13485D35696o889p8982j44590O9423K32401A98049J20799d1648C13733M1664R412
13474C64809k6236C727J2865f5823B10960N49842j70287B46583k5387J23566j64134
13463A80628O0019j10287J64297C8468Q6497J37625J56837k07652J87428r5849
13453C03354J31328A84006J30101c6030A28420J2979F1138K21417Q9858G4693
$$ y = [346230, 733472, 433382, 459748, 117666, 398554, 136163, 463895, -68093, 421559, 447721, 122189, 455432, 241712, 389663, 427467, 370435, 202920, 196429, 76909, 452038, 553574, 51905, 251312, 72325, 317846, 329596, 468727, 424405, 13698, 576111, 163982, 419465, 141059, 407348, 396364, 384556, 548803, 483692, 622598, 435696, 428807, 349825, 205235, 274658, 507059, 198049, 318848, -41648, 313733, 355397, 364809, 338573, 3727, 16592, -65823, 210960, 760802, 590515, 246583, 221196, 344762, 180628, 240647, 130360, 294657, 38468, 124965, 262590, 419427, 211775, 399203, 303354, 434682, 184006, 314107, -36030, 128420, 141399, 61138, 282555, 372413, 74693]
13442B98885b8850j0289D66251C2615K25519j7232i6762F9059L93510A84968P0480
13431B55448f373A44490J68811b30615B96096J56881a18089D40033A08113L47054
13421D55167j46795b187C65921j52475J42356D9750K06145M7535m6376m192K11859
13410D64721l7354j20970A26502O4236c4668A24672F1650a85639B76962J02097
13400C79059A71424K19759H2479M36283A7911Q2018K66667P0321J59954A5919
13389A52162M61010D055L0647K82036A25945A8069L80604r6133I0539A447R5124
13378I6571L92673A4682j116c40593B0711L56058A53804J7003N284K12775M31757
13367H20623B95726j06853k2671q1123M07309A66929L96131E042J01209f0882
$$ y = [298885, -28850, -39139, 466251, 32615, 258134, 240902, -96762, 69059, 462569, 184968, 255448, -6373, 144490, 313301, -230615, 296096, 452977, -118089, 440033, 108113, 455167, 308372, -2187, 365921, 213446, 355802, 49750, 255895, 303430, 257054, 252862, 464721, 427367, 306397, 126502, 190738, -34668, 124672, 61650, -185639, 276962, 379059, 171424, 391183, 82479, 518762, 17911, 99929, 366596, 436917, 596871, 15919, 152162, 613172, 4055, 34702, 316738, 125945, 18069, 398673, 302540, 90539, 1447, 96571, 489244, 14682, 13566, -340593, 20711, 376769, 153804, 170807, 176091, 388866, 820623, 295726, 188873, 166202, 85079, 492388, 166929, 563060, 5042, 106251, -60882]
13356g2613I0996L7593J41591J17463p6632k6870A39983n4953J33429m7331k0676
13345A50452K55708i9959D24200E1992b3248B59091o0865J12831A05783N3665
13335A59448O1354c7613A09079L64205r9884K74052B88929j42585K08536j2968
13325C41912j65052j3712J53329K71343k11940A21732K34966j11859p7522K38958
13315D06275A70904F2532J45027a2718C44294j10290J91280A47750K83155j67548
13305B63357M76989C53209R4355j86735j20903l7425D0936K77320r0115I7502
13294D46460A68560J94128o8354A07966D7235a99365b7253C24365d2092B41222
13283B10928H7104J78312L9476j45140m8527l8413K04650O9149A70517J5858a28802
$$ y = [-72613, 90996, 128589, 270180, 387643, 311011, 284141, 139983, 85030, 218459, 171128, 150452, 406160, -99959, 424200, 51992, -23248, 259091, 198226, 311057, 105783, 159448, 220802, -37613, 109079, 473284, 373400, 647452, 288929, 146344, 354880, 341912, 176860, 163148, 316477, 587820, 375880, 121732, 356698, 244839, 167317, 406275, 170904, 62532, 207559, -12718, 344294, 234004, 425284, 147750, 430905, 263357, 740346, 353209, 447564, 260829, 139926, 102501, 40936, 318256, 228141, 97502, 446460, 168560, 362688, 294334, 107966, 47235, -199365, -27253, 324365, -42092, 241222, 210928, 87104, 265416, 304892, 159752, 111225, 72812, 277462, 346611, 170517, 186375, -128802]
13271A32565J97942j20580D3453Q4803J00296B9854J1461K97228m4795E1617a06572
13259C07877j32725j4868J17738B7410b50069B41560a46423L5494C74379J99201
13249E73580I21J34965j2603m5281a08415J7015A98204H8440B1038J45625O9634
13238B36297g8589r2372I8237a6642B35076L8116H2942a2648A08258m192g5428
13226A36484F5981K84083J06153H956L91716I7851K6639K47064A49664O4590C5518
13214E73331f4432A36849E2057e2385C1164J46654k7862J78385j00442r5959j7681
13203A14259B5303L73493A64337J81108j09558p4400J1234B2994K4955Q3788l1751
13192I9986a48045B65476J5477A05552J52904J561J18235j64766K7868b2278j52519
$$ y = [132565, 330507, 209927, 43453, 128256, 228552, 29854, 41315, 338543, 293748, 51617, -106572, 307877, 175152, 160284, 278022, 27410, -250069, 241560, -146423, -110929, 374379, 573580, 921, 135886, 123283, 78002, -108415, -91400, 198204, 88440, 21038, 166663, 236297, -78589, -170961, 98237, -16642, 235076, 273192, 82942, -12648, 108258, 104066, -75428, 136484, 65981, 350064, 456217, 8956, 400672, 97851, 124490, 371554, 149664, 214254, 35518, 573331, -64432, 136849, 52057, -52385, 31164, 177818, 149956, 328341, 227899, 131940, 114259, 25303, 398796, 164337, 345445, 235887, 161487, 172721, 22994, 47949, 131737, 99986, -148045, 265476, 280953, 105552, 258456, 260017, 378252, 213486, 241354, -22278, -174797]
13181a74797B70463f9502j30277F5585a64004j15758B54810d062I9235n066c059
13169d2553A70316j7689b8492A69996a27188d1226B82409b25137B36089A14602
13158A13520b57416B16218b548j19096C8438K5397M46534H5937M6022A0524P5803
13147H6327i2092l0013C5292c34290a00882d6724I7926b05262j7119B30422I229
13135G6296M3560f2265B13064d7675D8359K59354D8143L44538j26832I4099K40072
13124C34171j00526a07033B06018F7701M2560a18146A22712j8681e0397B76265
13113e3053C9916L3678B8611M3532J727c9587D9316j1774J8905j5619J18671M9856
13101B09355b82468A1481K61196F086a52420B3738O7002A8171K08859N0940m072
$$ y = [-174797, 270463, -69502, -199779, 65585, -164004, -279762, 254810, -4062, 99235, 94169, -3059, -42553, 170316, 152627, -28492, 169996, -127188, -41226, 282409, -225137, 236089, 114602, 113520, -257416, 216218, -2548, -121644, 38438, 63835, 510369, 85937, 131959, 10524, 86327, -92092, -122105, 35292, -334290, -100882, -46724, 97926, -205262, -222381, 230422, 9229, 76296, 119856, -62265, 213064, -47675, 48359, 307713, 48143, 392681, 265849, 94099, 334171, 233645, -107033, 206018, 67701, 110261, -118146, 122712, 104031, -50397, 276265, -53053, 39916, 73594, 28611, 72143, 73870, -39587, 49316, 37542, 56447, 40828, 159499, 209355, -282468, 11481, 272677, 6086, -152420, 23738, 90740, 18171, 227030, 277970, 273898]
13090B73898f9618B5096a37416H5421j1389a47317A93112q8953J30134a00071
13079A05436A8337a11983F9488N06715A74515R1331j06418h6683A26868J1446
13069A38314P5478K976j5553E7877a95851A05809L7451h9180B2850b13881B0799
13057D172J1862M6336N8453D9294a21326I0364a42204A68158J5689J05950H5151
13045a20382D06706A26045P3969D5216K38603j9710K3888H5720e9217O958D21136
13033A26260K25538M692A36304C1912J93031g6049D8505L0908h4450L3401A2591
13021A65828J79361j37248l0590J0902n1844A6718J20191Q4322D7501J76528I5311
13009C1540J42032J29050f1962A49489K71746b72764A11796a07165E9163K07966
$$ y = [273898, -69618, 25096, -137416, 85421, 74032, -147317, 193112, 104159, 234293, -100071, 105436, 18337, -111983, 69488, 576203, 174515, 265846, 159428, -86683, 126868, 138314, 213792, 216768, 201215, 57877, -195851, 105809, 143260, -89180, 22850, -213881, 20799, 4172, 16034, 62370, 120823, 49294, -121326, 90364, -142204, 168158, 183847, 289797, 85151, -120382, 406706, 126045, 200014, 45216, 283819, 264109, 287997, 85720, -59217, -52259, 421136, 126260, 351798, 356490, 136304, 31912, 224943, -76049, 48505, 79413, -84450, -51049, 12591, 165828, 345189, 207941, 177351, 188253, 136409, 16718, 136909, 221231, 47501, 224029, 95311, 31540, 173572, 302622, -61962, 149489, 421235, -272764, 111796, -107165, 59163, 267129]
12999B67129J47531a5505j04521B75186H9781h465A67798j2669J0344N6289b01237
12987E3413N2250B70R7062i691j13367b5537B48749l2906a4011k7590D767K95433
12975C00200j18998b81759A01086J80806b2544A89487e4761C90213a80976H5260
12964C30523r9769g5269B05279a05408A27624a6904I3789a12025J9985j6415c2091
12952B90771A42413b46687C50709K2101j65910b53910B76802a78192I7874a04333
12941f3626C11349A21720O579J21751j23586b0164A1148a75068A87599Q399r6514
12930I9484h8133B26517a2714k5821j04824A64204K22310a22950A63205a8523
12919A8981J35975J03882a8142A56835L7918q3208d01187A90418b34035a04052
$$ y = [267129, 414660, -15505, -120026, 275186, 89781, -8465, 167798, 155129, 165473, 221762, -201237, 53413, 105663, 270, 97332, -9691, -123058, -25537, 248749, 215843, -14011, -41601, 4767, 300200, 181202, -281759, 101086, 281892, -22544, 189487, -54761, 390213, -180976, 85260, 330523, 230754, -75269, 205279, -105408, 127624, -16904, 93789, -112025, -92040, -108455, -32091, 290771, 142413, -246687, 350709, 372810, 206900, -253910, 276802, -178192, 97874, -104333, -63626, 311349, 121720, 128299, 250050, 126464, -20164, 11148, -175068, 187599, 195998, 99484, -88133, 226517, -12714, -38535, -143359, 164204, 386514, -122950, 163205, -18523, 18981, 154956, 258838, -18142, 156835, 194753, 111545, -401187, 190418, -234035, -104052]
12908g5912F5281J91978n2975F5023a7752A82780A5210J10737L3456a46361f0038
12896B00273J3999F6147J8465Q7951h6396I4895b29183E628b23903J6609D2334
12884A39900b31277C02884H5306a88022i217j26991L6589B03208J9511d7847k63218
12873c11065a31346b8306F5039B8643J06082J20202A02139j4348l9507J41271
12863A89555M2934h248l9922n7806A34842D4486J81102m7363m8621a011B08232
12851A09437h7701J1011B24561D2194N4739D7098O0510i2859A29804B906a5591
12839a33655d5653k486b132A3450b08151e671I3010A3138Q5864C0819J6653L1250
12827G8722c6429A45795a23136D7769K341h135A50349A5601P7219a1720o8692
$$ y = [-75912, 65281, 257259, 204284, 65023, -17752, 182780, 15210, 125947, 159403, -146361, -60038, 200273, 214272, 66147, 84612, 172563, -86396, 94895, -229183, 5628, -223903, -207294, 42334, 139900, -231277, 302884, 85306, -188022, -9217, -136208, -99619, 203208, 222719, -47847, -311065, -131346, -28306, 65039, 28643, 134725, 254927, 102139, 87791, 48284, 189555, 232489, -8248, -48170, -105976, 134842, 44486, 225588, 178225, 129604, -1011, 208232, 109437, -87701, -76690, 224561, 42194, 96933, 47098, 107608, -92859, 129804, 2906, -15591, -133655, -45653, -48139, -2132, 13450, -208151, -5671, 93010, 13138, 99002, 30819, 47472, 78722, -36429, 145795, -123136, 47769, 50110, -8135, 150349, 15601, 92820, -11720, -80412]
12816h0412D2518h7475D8734J25934E0338L00919b16096j07010J19968F7698k9524
12805C8174K9971b69585R9897A42065L73386B02799d1672A93915k7033N2853E9941
12793b81302d6877A35996e9901C08931a41875c5396k29194D6956b04344B16034
12782h5902A58885a95264C36716j13219h8662A68567A6700L5444J90165J27060
12772C69369j34854A13580h5757r6504A1951a39185B09369O7498a95870c3300
12761A66387a31038j17985e0099I3626K1079B563K1632J06874J86232f1215k4969
12750h6184A33954b37666A2193a804A3396f9247A84229a25612j24075A90575B8600
12738g40H569K90959J4571A41577a46185O1622j55544P3838j00550j23207B15431
$$ y = [-80412, 42518, -87475, 48734, 174668, 50338, 351257, -216096, -323106, -203138, 67698, 38174, 68145, -269585, -169688, 142065, 515451, 202799, -41672, 193915, 166882, 219735, 59941, -281302, -46877, 135996, -59901, 308931, -141875, -35396, -264590, 46956, -204344, 216034, -85902, 158885, -195264, 336716, 223497, -88662, 168567, 16700, 52144, 242309, 369369, 234515, 113580, -85757, -182261, 11951, -139185, 209369, 276867, -195870, -33300, 166387, -131038, -249023, -50099, 93626, 114705, 2563, 24195, 131069, 317301, -61215, -86184, 133954, -237666, 12193, -1804, 13396, -69247, 184229, -125612, -249687, 190575, 28600, -740, 8569, 299528, 314099, 141577, -146185, -84563, -240107, -166269, -266819, -390026, 215431]
12726d4068B65574F7208K04485e7362K6422E1875N533a67562B02590Q8373p6733
12715B14230Q606j0072J79553e9519H2390A7497c8368j17464e8722m9744D3669
12703A50312D4004c7537A22748b17001J06718D03336D6802f0243A00325P0293
12693A70618f251q6451H5306K75924G6323K35568B1891d4400F4733P7126D8645
12681A84325c75831N1998C13338a92916A31493d0727L725C03581g7909C5828L76598
12670D12426D1926L14130G7863O7294K2102L56433k56620b2479A01654Q6693J93985
12659C82332c2589I0705d4850J9324k5562j961n6170H9640a87496A87488M4818
12648B32306A7277J96973K62353A15842m0228P0805N462K44654j1986H7306L436
$$ y = [-44068, 265574, 67208, 271693, -57362, -30940, 51875, 57408, -167562, 202590, 290963, 214230, 222836, 212764, 392317, -59519, 82390, 17497, -38368, -155832, -58722, -108466, 43669, 150312, 44004, -37537, 122748, -217001, -110283, 403336, 46802, -60243, 100325, 170618, -6251, -92702, 85306, 361230, 76323, 311891, 21891, -44400, 64733, 141859, 48645, 184325, -375831, -323833, 313338, -192916, 131493, -40727, -37002, 303581, -77909, 35828, 412426, 41926, 356056, 77863, 145157, 167259, 523692, 267072, -22479, 101654, 188347, 382332, -32589, 90705, -44850, -25526, -51088, -53049, -109219, 89640, -187496, 187488, 232306, 17277, 214250, 476603, 115842, 75614, 146419, 151881, 396535, 384549, 87306, 90742]
12637I0742C8642N0292J10360j8035K23348c7117I3865g0066a901E12504f2507
12625a20563G6839a4452q6884F6713d9514I4220a03948A17021l8794R0359o550
12614A62036a06176H0726J50771L40503E6477J08074K08648j82727O9551N4782
12604C14805g6146A43094i4758o6277A96512B0467K20308q7801d5764A54883O1857
12593B16740Q2906C1536R5686J67815b3541m9978A04088r034J17182k7939o1505
12582A22792M3760b8504A17350m7902a92183f6149B79236A28114h2129F4300c409
12570A62354b49716C7439c00430C02955D7105d1183j34276A95910a16226j61793
12560b78019N1744H6738a07545j89823D0141K92228D3962J79331J1834n1401q3873
$$ y = [90742, 38642, 88934, 199294, 181259, 404607, -37117, 93865, -70066, -1901, 512504, -62507, -120563, 76839, -14452, -101336, 66713, -49514, 94220, -103948, 117021, 78227, 168586, 162036, -106176, 80726, 231497, 572000, 56477, 164551, 373199, 190472, 260023, 314805, -76146, 143094, -94758, -161035, 196512, 20467, 240775, 152974, -45764, 154883, 216740, 299646, 31536, 127222, 295037, -23541, -73519, 104088, 95054, 212236, 184297, 122792, 166552, -28504, 117350, 69448, -192183, -66149, 279236, 128114, -82129, 64300, -3409, 162354, -249716, 37439, -300430, 302955, 47105, -41183, -175459, 195910, -116226, -278019, -226275, 86738, -107545, -297368, 40141, 332369, 43962, 223293, 235127, 183726, 99853]
12549I9853f2642o1447B4786K91675H3089N5959J11351G099K87865G1203i5135
12537c0028j4093j81235c2466J1103p4294K1608B666h09j12301F9258i0090G9656
12524a89749d123j54261A21739K53429a9134r7132j77570h292a892G705a63392
12512a11725E3627k1023K805R7655K5942g4333B67985a93382A13712h4536d0573
12500A24608K7830a23746A6056f0050A00054h4627d1647A07140c8590j12159A43515
12488A66752E2443N9127e3183A55819F3722K05250E2348j6607I497e6412H1088
12476A4768Q5351J35316a45874G4282j2111M3119c17709C5231L75368b15435D1587
12464A37274L4032M93206C495J30677d3370A03555N7872g4398B67392b04632Q2569
$$ y = [99853, -62642, -124089, 24786, 316461, 83089, 139048, 250399, 7099, 294964, 71203, -95135, -30028, -44121, -225356, -32466, -21363, -95657, -74049, 2666, -809, -113110, 69258, -90090, 79656, -189749, -4123, -158384, 121739, 375168, -19134, -116266, -293836, -8292, -1892, 7705, -163392, -111725, 53627, 32604, 35409, 133064, 159006, -74333, 267985, -193382, 113712, -84536, -40573, 124608, 152438, -123746, 16056, -60050, 100054, -84627, -41647, 107140, -38590, -150749, 143515, 166752, 52443, 111570, -53183, 155819, 63722, 268972, 52348, 35741, 9497, -56412, 81088, 14768, 100119, 235435, -145874, 74282, 62171, 105290, -317709, 35231, 410599, -215435, 41587, 137274, 171306, 664512, 3495, 134172, -43370, 103555, 161427, -74398, 267392, -204632, -122063]
12453a22063C6992K28536a64512e1676b4571B9964K6067J327R7319c683A6940
12441B30518l7782K5742e126j94366h8505I3482a8659I4971l0078a6660p0779
12430h7439p5936b8846j61919E3839K71152a10297C18808I3194b33506B44962
12419b01484P0705j52569B02596e144A8922c10573g8537H5905a44874H3322c5614
12407E9901a39872j34297A67817a27368A37272a24983j42314a0452j85278C9882
12396b3075E1536d5037P39j9655E6688e0321G5478B1218J76704K67540A84901
12384B12242a66686A66444l2099k767g2411A15912g6346H9705b253j67404A07264
12372G3533c98859a8223G8644M5988b3550A17000J38449a33794G4091l4536b68066
$$ y = [-122063, 36992, 265528, -164512, -51676, -24571, 29964, 56031, 57358, 154677, -3683, 16940, 230518, 192736, 218478, -5126, -199492, -88505, 93482, -18659, 94971, 64893, -16660, -87439, -163375, -28846, -190765, 53839, 324991, -110297, 318808, 93194, -233506, 244962, -201484, -130779, -283348, 202596, -5144, 18922, -310573, -78537, 85905, -144874, 83322, -35614, 59901, -139872, -274169, 167817, -127368, 137272, -124983, -267297, -10452, -195730, 39882, -23075, 51536, -45037, -44298, -63953, 56688, -50321, 75478, 21218, 197922, 465462, 184901, 212242, -166686, 166444, 134345, 131578, -72411, 115912, -76346, 89705, -2253, -169657, 107264, 73533, -398859, -18223, 78644, 124632, -23550, 117000, 255449, -133794, 74091, 39555, -268066]
12360B79304I9978a64062J0332B9500K6970m732a83225M9488A36951a12007B99930
12348C71996B9721b9107f342B76952a06215F1058d7719C51932j69715B4831K7479
12337E2310J07621J1154F9755i4798C65907D2963A2282b13428c6949r7838B24461
12325c81246f5029A44682g3051l109C09749I1211K32198a78139I6641p668M0109
12314A29082K02387a13695k11643R4143j30213A66033a74072f4351A01672b17872
12303A38028k8446N2522G036b06377B84550j31146a83009A70524E2361b3613o247
12292b9860E3362a38077f2114B26711E4534j4406Q7679k3719b1893j87645A42112
12280G4466j0785a12624d2546a6408q6939A82742b11722L1724E4018b61929A00252
$$ y = [279304, 99978, -164062, -153730, 29500, 56470, 51738, -183225, -133737, 136951, -112007, 299930, 371996, 29721, -29107, -6342, 276952, -106215, 61058, -47719, 351932, 182217, 24831, 52310, 159931, 171085, 69755, -94798, 365907, 42963, 12282, -213428, -36949, -134787, 224461, -381246, -65029, 144682, -73051, -76160, 309749, 91211, 323409, -178139, 96641, 88973, 129082, 331469, -113695, -325338, -231195, -361408, 166033, -174072, -64351, 101672, -217872, 138028, 109582, 162104, 7036, -206377, 284550, 153404, -183009, 170524, 52361, -23613, -29860, 53362, -138077, -62114, 226711, 54534, 40128, 127807, 104088, -21893, -209538, 142112, 74466, 63681, -112624, -42546, -16408, -103347, 182742, -211722, -179998, 54018, -261929, 100252]
12268a57033J3597M3771F4795b56111d5992j5488B94676j11316J10219j17012
12258A76567G9706a95191a4619B15780A6989b43146B07874J24560j19602q0568
12248A32264k2299B5918P905b70165H0965a20404N5234A4244b0370j01185F2624
12236B0439b3393j54303dA60304a70295A21255k0175a4191j11538N1189m62C08218
12223A15376g6284A59913D1704J9255L11117A80324J84768D4703Q7775J14549
12213B47027C1045O9482d1795k51429A23252J19557H4815K70835k4559g6001C12409
12201B24711J44836a682H1054J13849L07518A80314J40773E8867K24492O2726
12191C46085A29135J06199c9231C58673c2989H4334a03340i650B04918L11632
$$ y = [-157033, -143436, -99665, 64795, -256111, -45992, -61480, 294676, 183360, 293579, 176567, 79706, -195191, -14619, 215780, 16989, -243146, 207874, 332434, 212832, 132264, 109965, 25918, 33823, -270165, 80965, -120404, -65170, 14244, -20370, -121555, 62624, 20439, -23393, -177696, -4, 160304, -170295, 121255, 101080, -14191, -125729, -74540, -75002, 308218, 115376, -76284, 159913, 41704, 60959, 372076, 180324, 365092, 44703, 132478, 247027, 31045, 100527, -41795, -293224, 123252, 242809, 84815, 355650, 331091, -76001, 312409, 224711, 369547, -1682, 81054, 194903, 502421, 180314, 321087, 58867, 283359, 346085, 129135, 235334, -39231, 358673, -32989, 84334, -103340, -9650, 204918, 516550]
12181E16550B20972K0350B1059J81908P0785B9938K79086p4801d11095b4129A47687
12169a8812F365J43465L3539J33103j25989B163K10057b0966C05727A03383l2416
12158G0967K84988D4230i1955A12602R4121q9192J67898R9203b962H9919K08525
12147B98444a49693e165H3308j039J06643a30743A35464J86899H3720i9817A58241
12135A04879J40313a66014e0561A02003a76646A38946D2484a44812I57R6808k2247
12124G5518J86871b21162C24067j48168K9916D6592c1608B27753d52690a32383
12113H9282L366M6548m5264a29492a7933k40692D5368A8451R7850g9332B909d8243
12100d6401B13674a3019q888E1251L8881i4755K3195B76048f6656A40449L7302
$$ y = [516550, 220972, 241322, 21059, 202967, 273752, 29938, 309024, 234223, -411095, -24129, 147687, -18812, 6365, 149830, 183369, 316472, 190483, 2163, 212220, -20966, 305727, 103383, 70967, 355955, 44230, -91955, 112602, 206723, 117531, 285429, 384632, -2962, 89919, 298444, -149693, -5165, 83308, 82269, 188912, -130743, 135464, 322363, 83720, -99817, 158241, 104879, 245192, -166014, -50561, 102003, -176646, 138946, 42484, -144812, 957, 97765, 75518, 262389, -221162, 324067, 175899, 205815, 46592, -31608, 227753, -452690, -132383, 89282, 92648, 139196, 93932, -129492, -17933, -258625, 45368, 18451, 116301, -79332, 2909, -48243, -46401, 213674, -13019, -21907, 51251, 90132, -94755, -71560, 276048, -66656, 140449, 177751]
12089A77751g8318a6740j25549j9681K8253A76221G8105J889e11726A04887e2826
12077B35377F1519a94816i5885k1482a4759B18870G6168J44631p7776J93012F5108
12065F120h1139A85063J17188K1940b19894B24070L68203K29039k67A13529K00859
12054C14388a41933B07048b6954O942A49254i6387d7882B88512a19844n1454A17854
12042i7056l6635o0118h9095j5505m4279A28495b7240j19111F8707K06557j18202
12031A57062b80883A88139e0647A6564f0891B44688A08205b45211B27981h1636
12020i2844M3813A57508e8021G3450R0368m7287b03023A12746c5594k77009E3388
12008a68148f5072D0054e7395k11594B7731K82909a9904C9102f0492A6677d0038
$$ y = [177751, -78318, -16740, -142289, -161970, -133717, 176221, 78105, 79994, -511726, 104887, -52826, 235377, 61519, -194816, -95885, -117367, -14759, 218870, 76168, 220799, 143023, 336035, 65108, 6120, -81139, 185063, 302251, 324191, -219894, 224070, 592273, 821312, 821045, 113529, 314388, -141933, 207048, -26954, -20012, 149254, -96387, -47882, 288512, -119844, -171298, 117854, -97056, -133691, -193809, -89095, -104600, -148879, 128495, -27240, -146351, 68707, 275264, 157062, -280883, 188139, -50647, 16564, -60891, 244688, 108205, -245211, 227981, -81636, -92844, -49031, 157508, -58021, 73450, 163818, 116531, -203023, 112746, -35594, -312603, 53388, -168148, -65072, 40054, -57395, -268989, 27731, 310640, -19904, 39102, -60492, 16677, -40038]
11996b10963c503A95499G6120k1212a5864E0158P1779a3780G9696a14948B1212
11984b46099d8126C3672j1126K21876a39722m2640A37946f0482F2205a165C15614
11972A0878a33399q8758M455k73817a87855I8971a44185B25553a36860e558H1064
11960F8559f3379k30818a6520C8454L4296f3861A22574a67642f2731B2933J65743
11949A88676a73995J9709j33333f0651A0718b5665j66062K070A00382A1933a88188
11937b27778N3071d4282I4292K3352O1576F6850a02599A01371a0342B3090M1256
11926F4346J58785i9730D8335K04485e9815j44289a6334C1660J27323a78241B60619
11914A76070M2130b9177j04292J2397j9448K4252M426B58187H0417a52584F3325
$$ y = [-210963, -3503, 195499, 76120, 54908, -15864, 50158, 121937, -13780, 79696, -114948, 21212, -246099, -48126, 33672, 22546, 244422, -139722, -182362, 137946, -60482, 62205, -1165, 315614, 10878, -133399, -222157, -217702, -491519, -187855, 98971, -144185, 225553, -136860, -5558, 81064, 68559, -63379, -294197, -16520, 38454, 72750, -63861, 122574, -167642, -62731, 22933, 188676, -173995, -154286, -287619, -60651, 10718, -25665, -191727, -189657, 100382, 11933, -188188, -227778, -174707, -44282, 94292, 117644, 179220, 66850, -102599, 101371, -10342, 23090, 64346, 223131, -99730, 48335, 252820, -59815, -204104, -16334, 31660, 158983, -178241, 260619, 176070, 218200, -29177, -133469, -121072, -140520, -116268, -111842, 258187, 80417, -152584, 63325]
11902A61371a13597n2561M2480A92087h7367o0374l5193p3402a17641A16637d4903
11890f7165j78920A97283B3621K60553a08096B96839J17952h9153k42783E9870
11879C5890b54156E6931a95287A75192b91300A30700J4376A621M1220e3550B74604
11867g3578B92139h3682A35810O7567a73158K1344D26832C6051a22846H4084a48250
11855b42223A66442J79462B8164N9942b0951q6043C48230A9671N9398C5449Q934
11844D4383b01928d8459k19576I7984a51699k3634F20d8434C7554O1044c30328
11832I632e4471C3572J25199b14966A62348Q3786l9838b59637A21855h4173L4716
11821d9457j7179m0287d5211D2232A6318B065g1160I7589J37783H2530P263O3713
$$ y = [161371, -113597, -166158, -123678, 192087, -87367, -147741, -182934, -256336, -117641, 116637, -44903, -67165, -246085, 197283, 23621, 284174, -108096, 296839, 414791, -89153, -331936, 59870, 35890, -254156, 56931, -195287, 175192, -291300, 130700, 145076, 1621, 42841, -53550, 274604, -73578, 292139, -83682, 135810, 203377, -173158, -151814, 426832, 36051, -122846, 84084, -148250, -242223, 166442, 345904, 28164, 88106, -20951, -106994, 348230, 19671, 79069, 35449, 44383, -201928, -48459, -268035, 97984, -151699, -175333, 620, -48434, 37554, 98598, -330328, 9632, -54471, 33572, 158771, -214966, 162348, 246134, 206296, -259637, 121855, -84173, -49457, -66636, -106923, -45211, 42232, 16318, 2065, -71160, 97589, 235372, 82530, 89793, 153506]
11809A53506k8042b08657p069A89860J17487j22586e3582a896p1680b1444r2870
11798a14314B42246j8569C2365N0588c6491A43274D8797d4682A14936J49412a40375
11786i9147A384c9398a6975c736k35689J5810I561e0059q6457E1537h3604q4080
11774a67684J777B17101a37183a2355A07257a4895p0272j25432Q5060M7771B28270
11762A53301c5156k8381l8564A74682o7112l3051b61068L0317E4671L4009L2583
11751A21263P9481a29499A15693a92996a3237k33168A42562b5821A10360Q1643
11741A92003d1988A12162b15264A11652D4937b77045a13673C0164a65089g7383
11730I9322L9910e5843A78007g1445L2958k39539B4539d27233J17412g6306C9948
$$ y = [153506, 125464, -208657, -215726, 189860, 307347, 184761, -53582, -1896, -73576, -21444, -114314, 242246, 223677, 32365, 82953, -36491, 143274, 48797, -44682, 114936, 264348, -140375, -99147, 1384, -39398, -16975, -3736, -239425, -223615, 9561, -50059, -136516, 51537, -83604, -167684, -165907, 217101, -137183, -12355, 107257, -14895, -85167, -210599, -125539, -77768, 228270, 153301, -35156, -63537, -102101, 174682, 107570, 74519, -261068, -230751, 54671, 88680, 121263, 200744, -129499, 115693, -192996, -13237, -246405, 142562, -25821, 110360, 192003, -41988, 112162, -215264, 111652, 44937, -277045, -113673, 30164, -165089, -77383, 99322, 139232, -55843, 178007, -71445, -38487, -278026, 24539, -427233, -309821, -76306, 39948]
11718b29658o4758B65793c5798A55085e003B7476O2763b922A29475a1569E2143
11706A14601f5104A63804R7752A13978c10938A65452a52752E6359k1783l046a49813
11694F20a1984j05375I8423c0979q61B46027b06618D6835j3683O4815m6861c0678
11681b70323F4665a37082B84889b43557c552p818j42074f8846A68337R7691A30068
11669A3769P4010L7652k5827h0771B08886b04121C98883B4864K76759b88108J09596
11658a78512G9497O1952l1545R6699b37961A93080J47664G2495J42019C6821P8271
11647A15092J16598r6237J02280J05520A40329K9957a80721N5886G8006b89262
11636B12556a60292c3996A47106a77823A88747a12212B9102J04606b25991A50109
$$ y = [-229658, -294416, 265793, -35798, 155085, -5003, 27476, 90239, -2922, 129475, -11569, 52143, 114601, -65104, 163804, 261556, 113978, -310938, 165452, -152752, 56359, 34576, 31530, -149813, 620, -11984, -117359, 98423, -30979, -31840, 246027, -206618, 46835, 33152, 97967, 51106, -30678, -270323, 64665, -137082, 284889, -243557, -3552, -11370, -153444, -68846, 168337, 266028, 130068, 13769, 87779, 125431, 99604, -80771, 208886, -204121, 398883, 24864, 301623, -288108, -178512, 79497, 141449, 109904, 206603, -237961, 193080, 340744, 72495, 214514, 36821, 115092, 231690, 135453, 237733, 343253, 140329, 170286, -180721, -124835, 78006, -289262, 212556, -160292, -33996, 147106, -177823, 188747, -112212, 29102, 133708, -225991, 150109]
11625A33939i0831A70946a01236B85362B0023c12585O2437A2866K03639a38786
11614I3820g6497A89715L2340l3140a17703c353j89118g3196a5529A54325c32402
11602b06918K6375K7510A45908c1821A48594p1115B4912a08883D5720K75142a49317
11590d30000D2931b62058O1899B52909a16060m981E1917P1745a41288E6060K40259
11579B96319G6398K61653a13876A49331L063O0852I3078b40309E2206R1172N6472
11568A99850h6683A4976K53552F1297j976a35268O4209A21369A497K8764K46238
11557B76499j13970a3022D7594b65590c774l11471I2574g5350C64614H5432j645
11546H3787a23034B09524P6564j32733K61356A78195d3551F925L173J33200J2029
$$ y = [133939, -90831, 170946, -101236, 285362, 20023, -312585, -250148, 12866, 216505, -138786, 93820, -76497, 189715, 222055, 188915, -117703, -3353, -192471, -73196, -15529, 154325, -332402, -206918, -180543, -153033, 145908, -31821, 148594, 77479, 24912, -108883, 45720, 320862, -149317, -430000, 42931, -262058, -200159, 252909, -116060, -121041, 51917, 123662, -141288, 56060, 296319, 76398, 338051, -113876, 149331, 152394, 213246, 93078, -240309, 52206, 143378, 199850, -86683, 14976, 268528, 61297, 59321, -135268, -71059, 121369, 1497, 30261, 276499, 162529, -13022, 47594, -265590, -3774, -315245, 92574, -75350, 364614, 85432, 83787, -123034, 209524, 286088, 153355, 414711, 178195, -43551, 6925, 10098, 143298, 155327]
11535A55327j1293O230a02894A73550c4696j59089P9240K0757j06920H2629J92735
11524B75364G0619k1776L7271a64233E923a50916C88621A84802d42430a6636A5335
11512c2097B13018a76722h2859A11339d4273A25285D2645d1156B45839H5086J81991
11501B67077q2414a64262P1730C11340a76782B37594h7780j12739B8860M8957
11491G7817K8932J21184c5648D36447A84424R3997f905j33223B56203A08849B4261
11479A14979K6033K69159A63991P8130r1115F7990B2845b66446C8648O2233b49864
11467D3721K59562a20827B94296p5668I0072K63422G1934J20298J55002J8821
11457C66055K278j28852j18333J17378r4545a37374A24837M8032e7187o9623B17895
$$ y = [155327, 144034, 150264, -102894, 173550, -34696, -193785, -114545, -93788, -200708, 82629, 275364, 70619, 48843, 86114, -164233, 5923, -150916, 388621, 184802, -442430, -16636, 15335, -32097, 213018, -176722, -82859, 111339, -44273, 125285, 42645, -41156, 245839, 85086, 267077, 184663, -164262, -92532, 311340, -176782, 237594, -87780, -200519, 28860, 77817, 106749, 227933, -35648, 436447, 184424, 278421, -6905, -140128, 256203, 108849, 24261, 114979, 141012, 410171, 163991, 242121, 151006, 67990, 22845, -266446, 38648, 100881, -249864, 43721, 303283, -120827, 294296, 218628, 90072, 353494, 71934, 192232, 347234, 366055, 368333, 239481, 121148, 238526, 143981, -137374, 124837, 172869, -57187, -126810, 217895]
11445A23401e3638A18338O419M6709A2581a43742j24660N2316c6666A07272P5813
11434A83085o4008J70102c03405C8084J15874n0357g0884C6822a60615B69367
11423A48788a10005B31145d5599p5091j36472A0056f961p6933a5565B5416M73625
11412D99041b50825f8537A05107a43271A02199b43289H3377b19436A49462k6989
11402A22473n7110c21478a15826G2352O2233J81388I9770a77293A52788a35840
11391A53955J0019e0920l1643K0418j77148h6729n7998A49960b0492B20808i6010
11379B5901a18773q6876D582K17769f4807B19160F6587a75435C57808a59554e5176
11367A88489d1646j34564a1408k55846A42797M2306H6545J20280a73567A37214
$$ y = [123401, -53638, 118338, 124757, 171466, 12581, -143742, -268402, -216086, -36666, 107272, 183085, 119077, 289179, -303405, 38084, 153958, 103601, -70884, 36822, -160615, 269367, 148788, -110005, 231145, -45599, -120690, -257162, 10056, -6961, -83894, -15565, 25416, 499041, -250825, -68537, 105107, -143271, 102199, -243289, 83377, -219436, 149462, 122473, 65363, -321478, -115826, 72352, 134585, 315973, 99770, -177293, 152788, -135840, 153955, 163974, -50920, -82563, -62145, -239293, -86729, -144727, 149960, -20492, 220808, -96010, 25901, -118773, -205649, 4582, 222351, -64807, 219160, 66587, -175435, 357808, -159554, -55176, 188489, -41646, -176210, -11408, -267254, 142797, 185103, 86545, 206825, -173567, 137214]
11356A11553m8152a77991j38168a37386k77375I6015C3645j2781b52857G0608
11345c33831J58112O2884A79293G3032J87750C1810a10058J8566k534A23676a93994
11333A0394J55728d0756r3727A24476E9244J46403c7558n9429E3166g1938m845
11322g6783B70242j0798c17742E8499b71540J20686A61672c643A4615b86427N9042
11311b27385A018K3635b2897l53465G8937A0626Q156R6662P8142i4787j37241
11300b32028A79330A5455h1516d860C6974a88347A11298a47650C44601d448k2992
11289b7440j03667F5187A6450K16482j08244a837C04411g1964C64722a82522Q5231
11278i7291B5370J97206K2350a53329A8847c7681j84165B1838b78731a29708B794
$$ y = [111553, 63401, -177991, -316159, -137386, -414761, 96015, 33645, 20864, -252857, 70608, -333831, -175719, -112835, 179293, 73032, 260782, 31810, -110058, -91492, -94026, 123676, -193994, 10394, 166122, -40756, -134483, 124476, 59244, 205647, -37558, -96987, 53166, -71938, -76783, 270242, 259444, -317742, 58499, -271540, -150854, 161672, -3643, 14615, -286427, -227385, 1018, 24653, -22897, -376362, 78937, 10626, 18782, 115444, 193586, -94787, -232028, 179330, 15455, -81516, -4860, 36974, -188347, 111298, -147650, 344601, -4448, -27440, -131107, 65187, 16450, 232932, 124688, -1837, 304411, -71964, 364722, -182522, -97291, 25370, 222576, 244926, -153329, 18847, -37681, -221846, 21838, -278731, -129708, 2794]
11266g9746A25905b46342A75116b2213D2395b63078E7822J84519c09793a51616
11255a85466n7280c7689r4960a9432A11489a36261f5922l38387D1808i0450p4846
11244a65296k47661b3449h747o6471k39994r705B6824i6538j84669A5668P6608
11233I2276c93564c5006D6986j339a90701g7567C9155a3095A8097a67446A31118
11221a72056B93383I642J78909D4903d10844E0626b9669D4488a24295a804C04093
11209A13398n5742J70615m2360o5971m9836b50091G7493a21222H2369c48301a4095
11197A24095D016K37431a06303j40383L2379a8455j71606I0971b08630O7360K2611
11186a18659A51700f153B51068f4488a5670A21606b02543a2636j6013r698m7712
$$ y = [-79746, 125905, -246342, 175116, -22213, 42395, -263078, 57822, 242341, -309793, -151616, -185466, -242746, -37689, -132649, -19432, 111489, -136261, -65922, -404309, 41808, -90450, -165296, -412957, -23449, -8747, -75218, -315212, -324917, 26824, -96538, -281207, 15668, 92276, -393564, -35006, 46986, 45647, -190701, -77567, 39155, -13095, 18097, -167446, 131118, -172056, 293383, 9642, 188551, 44903, -410844, 50626, -29669, 44488, -124295, -1804, 304093, 113398, 57656, 228271, 185911, 119940, 70104, -250091, 77493, -121222, 82369, -348301, -14095, 124095, 4016, 241447, -106303, -246686, -214307, -18455, -190061, 90971, -208630, -141270, -118659, 151700, -6153, 251068, -64488, -15670, 121606, -202543, -12636, -28649, -38347, -86059]
11175h6059q4849C56875f9166A18793j0630L6066n2289K0888D5954a85530E4544
11163e7192j75744o6618B47969b07306B60820I4782h5946k01649a22557j9771
11153a42328p0770C26829a31092j09817f8960p0442N7748p8054A40705i4830B62281
11141a04345B81778a71902B1061l885J24671D2545J47048c7611J1475B43479b37254
11129C56607e7691C4642M0026K06414e5036k26136B75287b01251P0960C6320J55963
11118A92283a13182B7599K28433j06008K2827E4154J03129a06350C8473K46112
11108B84585b09214B22939N7453j19099a98301B13786j03090C6291b27110A05835
11097C10047j51836K06368G2757B6229J19673F0029a60298k963B89664h8705C65338
$$ y = [-86059, -170908, 356875, -69166, 118793, 108163, 144229, 91940, 112828, 45954, -185530, 54544, -57192, -232936, -299554, 247969, -207306, 260820, 94782, -85946, -287595, -122557, -142328, -213098, 326829, -131092, -240909, -68960, -139402, -81654, -159708, 140705, -94830, 262281, -104345, 281778, -171902, 21061, 17176, 141847, 42545, 189593, -37611, -26136, 243479, -237254, 356607, -57691, 34642, 74668, 281082, -55036, -281172, 275287, -201251, -130291, 36320, 192283, -113182, 27599, 256032, 150024, 172851, 54154, 157283, -106350, 38473, 284585, -209214, 222939, 280392, 161293, -198301, 213786, 110696, 36291, -227110, 105835, 310047, 158211, 364579, 72757, 26229, 145902, 60029, -160298, -163261, 289664, -88705, 365338]
11085B62749L1351R2196j48838o041D4100J75966J80093a27271A02996j6571C9467
11073I7701A870O8647Q1664k1952M0412G3803K05139I7562K1009a02028C80241
11061B96513j46348K0059P7994m9771p956K82632A41320Q4196H1547R5685K7194
11050B04426J44420r2902O9417J63718j35872J41873j24115l6637M48023l09035
11040D73316Q5430P1430B22617K08683K72263j43282M3069j99565L49267l04854
11030D48198J18999J25822O4555O6004k83552j45292N42353l19544r9919J33075
11020F50699K5385k69346N535l5383N28743A71728L47642J39387K1632k40130
11010D40259L17610j09550k21397K18098j80195M7696J02168N5131m9566P8916
$$ y = [262749, 294100, 386296, 237458, 231417, 44100, 220066, 400159, -127271, 102996, 86425, 39467, 97701, 1870, 70517, 152181, 130229, 170641, 73803, 278942, 97562, 118571, -102028, 380241, 296513, 150165, 170224, 248218, 198447, 190491, 473123, 141320, 225516, 81547, 177232, 204426, 348846, 255944, 325361, 489079, 353207, 495080, 370965, 334328, 782351, 473316, 558746, 630176, 222617, 431300, 703563, 560281, 603350, 403785, 753052, 448198, 567197, 693019, 757574, 823578, 540026, 394734, 937087, 617543, 517624, 650699, 676084, 406738, 412273, 376890, 905633, 171728, 519370, 658757, 680389, 440259, 757869, 648319, 426922, 645020, 464825, 512521, 614689, 669820, 620254, 699170]
11000F99170C07567L93036J43237j95464k32485j79033N45645C34440J15554K46212
10990F96206j33378n0792P328J09771B94258P80135n14076K89388l75098K81295
10980G55902J71111l49875M8969j26168L24413K74557j44324j63846K70976k72646
10970G89069o8862n4580L40127R9597q4612R507J1965M72558J12398K63867J92064
10959B083098r8251Q3403N26865q5426l20858j69428k61220J79505j18244k93366
10949A526078j49184N0846P4366J3170l70666M4070K01729J34615j90600l8455
10939A295969p4653j22606j3673m90884J65214r1193M6561C33042L2957m5642
10929C20357J36745q2535k9039A08633m6566G32f2932b3916j73284A23578P1846
$$ y = [699170, 307567, 700603, 843840, 648376, 415891, 236858, 782503, 334440, 449994, 696206, 562828, 512036, 519364, 629135, 294258, 1074393, 560317, 849705, 474607, 755902, 927013, 577138, 626107, 499939, 824352, 1098909, 954585, 790739, 1061715, 789069, 720207, 665627, 1005754, 1105351, 1020739, 1030246, 1042211, 1514769, 1627167, 1891034, 2083098, 1984847, 2068250, 2595115, 2509689, 2188831, 2019403, 1758183, 1937688, 1819444, 1526078, 1376894, 1427740, 1502106, 1515276, 1144610, 1188680, 1390409, 1525024, 1334424, 1295969, 1221316, 1098710, 1085037, 594153, 759367, 668174, 714735, 333042, 365999, 320357, 457102, 374567, 345528, 108633, 62067, 732, -62932, -23916, -197200, 123578, 195424]
10918A95424H7132c149m2610o6611A7510b7142d793B79127h508A84619L2084b21787
10905E0919j090b8246C54016E9269J87403a73048A25168Q887j482e0060A70841
10893b93152J01730l595A22304a28288G6565J09849N789c13663i666B70989A25565
10881E6365j4326R4395a43599f2686j81457H9536c3373D3702d5252B7663K07304
10870B34967a23655B4191J09207d1615n9814A8058P0595c86612I8922O9874G0474
10858b35481J12139k40484f3180G7536b36577H8911B4319P488P2690i2683n833
10847i8516A36210a8753B1735M516a36918A17003b85822H219J95098F3127d07249
10835a21849P051N1064l32481B73693o8679l0402L7812D6179P0830c58704J0696
$$ y = [195424, 87132, -3149, -45759, -112370, 17510, -27142, -4793, 279127, -8508, 184619, 216703, -221787, 50919, 49829, -28246, 354016, 59269, 246672, -173048, 125168, 134055, 132573, -50060, 170841, -293152, -191422, -195017, 122304, -128288, 76565, 186414, 192203, -313663, -9666, 270989, 125565, 56365, 42039, 136434, -143599, -62686, -244143, 89536, -33373, 43702, -45252, 27663, 234967, -123655, 24191, 133398, -41615, -101429, 18058, 88653, -386612, 98922, 168796, 70474, -235481, -123342, -363826, -63180, 77536, -236577, 88911, 24319, 31807, 104497, -92683, -98516, 136210, -18753, 21735, 26251, -136918, 117003, -285822, 8219, 203317, 63127, -407249, -121849, -114798, -63734, -396215, 273693, 205014, 174612, 212424, 46179, 117009, -358704, -348008]
10824c48008D2494e2134n3111C12356G9491K3424O4069b47179M0164G273J08262
10813A15535a90679A34243f7487I8517O8207F689b15242A74014c05834C78490
10802a79158B9921M26037A43741F5961N3486a2089C6049J2246c25227A14163a74384
10790a92197d8627p2198j92711B58103c810k51615A80486a39646D1915a2632A58458
10778G6762b04368m1034e4603B29635a62340A80379a15072j43699R5267b837A38209
10766E0284e64263a4952A89014q9117i190j39858C2119L2889d47841a03045j03148
10755b06193d233k08218a3062j4255m0716B50379e8359B09735o9381b6927n40640
10744e67567A78450p7077a69613q0834N1984j77083A03446K63190b06748F9156
$$ y = [-348008, 42494, -52134, -105245, 312356, 79491, 102915, 166984, -247179, -207015, 7273, 115535, -190679, 134243, -67487, 98517, 166724, 6689, -215242, 174014, -305834, 378490, -179158, 29921, 455958, 143741, 65961, 119447, -12089, 36049, 48295, -325227, 114163, -174384, -192197, -48627, -120825, -313536, 258103, -3810, -255425, 180486, -139646, 41915, -12632, 158458, 76762, -204368, -245402, -54603, 229635, -162340, 180379, -115072, -258771, -163504, -2837, 138209, 50284, -564263, -14952, 189014, 99897, -9190, -149048, 32119, 65008, -447841, -103045, -206193, -4233, -212451, -13062, -27317, -68033, 250379, -58359, 209735, 140354, -26927, -567567, 178450, 101373, -169613, -250447, -198463, -375546, 103446, 366636, -206748, 69156]
10733a70510g0088j26959A51939c070j37402F8503b47038d7247H5542C1950a15275
10721a11973B66687b06745c2248m3311D2140b71594Q6916L0789q539b5221C4068
10709c809H1308b7700j0650o7534A3781b07201d7886m26881J72253A1194g5146
10697B79205C5765g37B52674a59818p5916B3933a52394A55906a38705i66r8965
10686i9931n1257G6152f8568D2285A2554L37297b99124B82574A20343M4506a22146
10674i2819j4367m6855B08808d2032k49375a6726r4213B8360K1008b38354b9755
10662a19843m4638A25360b16295f8799A10500c1426j1366j7810j78306a16434
10651G8122a54155K4506J9421k36016A2592d29952G7330A1704L41095i189j25123
$$ y = [-170510, -70088, -197047, 151939, -3070, -140472, 68503, -247038, -47247, 85542, 31950, -115275, -111973, 266687, -206745, -32248, -75559, 42140, -271594, -184678, -153889, -162428, -25221, 34068, -3809, 81308, -27700, -38350, -105884, 13781, -207201, -47886, -474767, -302514, 11194, -75146, 279205, 35765, -737, 252674, -159818, -235734, 23933, -152394, 155906, -138705, -966, -99931, -151188, 76152, -68568, 42285, 12554, 349851, -299124, 282574, 120343, 164849, -122146, -92819, -107186, -154041, 208808, -42032, -291407, -16726, -110939, 28360, 49368, -238354, -29755, -119843, -164481, 125360, -216295, -68799, 110500, -31426, -42792, -60602, -238908, -116434, 78122, -154155, -129649, -110228, -346244, 12592, -429952, 77330, 11704, 352799, -9189, -134312]
10640a34312J7523L9111b49o6901E5752J90684H7283c7312B41525q2086N9414
10629B18853a29614b6480p4682j69220A16755D3553O5193a12099F3755J92056
10619B55811a65768j42951B50153n1227b53839B63638A14359k2862j2385b86544
10608a53722C4768b29358K026c7340G3100K51078b7889B06364b07739A88276E9233
10596a09330D6188b22296J8325B736e8031b5124A56285a71171J0055l4461D443
10584e3599A61346c6193l07943e6058H4376A7223L9461o162a35124A93901a81097
10572D9055a41433k62838i2763H646g0931A15695f8898A76222C5992b61749a06965
10560a00633E5892c8068a4578k73602C61688m3132j07992a81646B42309a30862
$$ y = [-134312, -116789, -77678, -249, -67150, 55752, 246436, 87283, -37312, 241525, 159439, 218853, -129614, -26480, -101162, -270382, 116755, 43553, 108746, -112099, 63755, 255811, -165768, -308719, 250153, 198926, -253839, 263638, 114359, 91497, 79112, -286544, -153722, 34768, -229358, -227332, -37340, 73100, 324178, -27889, 206364, -207739, 188276, 59233, -109330, 46188, -222296, -203971, 2736, -58031, -25124, 156285, -171171, -161116, -195577, 4443, -53599, 161346, -36193, -344136, -56058, 84376, 17223, 56684, 50522, -135124, 193901, -181097, 49055, -141433, -404271, -92763, 8646, -70931, 115695, -68898, 176222, 35992, -261749, -106965, -100633, 55892, -38068, -14578, -288180, 361688, 318556, 210564, -181646, 242309, -130862]
10549b5081E2489b12457O7688G1004b65382R3489j9253M7908C9072Q0411A2662
10537a11667N2030q6736q4804J2213e9514A23722a94122L3934L8892a6908j12119
10526a29027C07264H1369a96750H9577J4113a58123A51526A8144b4441j23231
10516a47672N8987b1623E3915J52724A036K48597a89600A40987a95791p3246J13125
10505a55912A7803a25035A8827a07004j34637e3885n001C61530d0262l4021p8095
10494a52378D0999b31529a02458k08923A80675G2631J51119m2309J45472c0517
10483f7722A29948K6513b46198b717C10228b07221i2130A65693m5516D7417c48
10471A920K92367L1591E1020M67270q2040k14217B4954J38773b3629A9784a20555
$$ y = [-25081, 52489, -212457, -144769, 71004, -265382, -171893, -191146, -143238, 39072, 119483, 12662, -111667, -59637, -146373, -231177, -218964, -59514, 123722, -194122, -160188, -121296, -16908, -129027, 307264, 81369, -196750, 89577, 103690, -158123, 151526, 18144, -24441, -147672, -88685, -21623, 53915, 206639, 1036, 249633, -189600, 140987, -195791, -269037, -155912, 17803, -125035, 18827, -107004, -241641, -53885, -58886, 361530, -40262, -74283, -152378, 40999, -231529, -102458, -311381, 180675, 72631, 223750, 181441, 326913, -30517, -67722, 129948, 156461, -246198, -2717, 310228, -207221, -92130, 165693, 120177, 47417, -348, 1920, 294287, 325878, 51020, 518290, 436250, 222033, 24954, 163727, -23629, 19784, -120555]
10459C86845b73607C8855A8254P7841f8060l471A8998d0894p9683c1871k7617
10448e9488O056A23916a10492k91702a78962k41866A64589O0744c23125a38532
10437B20423l5508F9826N572b82309N4946J00322J4182D3653i4195o8186l3685
10426a96066a4146j29202o7200r0039m6695g0327k8201j40334D486K97898e7206
10414a51997D666N6043a59064m9141D9343J8694e5736G7906b4469j82533A79611
10402A78646p7819j9467K62842f8554D8411a59934F8517L60573G964J8067d1536
10390G6433f0391o2173B34952a88784A29172E6840b05642D050J03018a18161A91259
10378d2971G7851A6376a83151D7539K36691p2915E726J07248a09297A13786m894
$$ y = [386845, -273607, 38855, 18254, 96095, -68060, -71531, 18998, -40894, -120577, -31871, -59488, -53432, 123916, -110492, -402194, -178962, -420828, 164589, 225333, -323125, -138532, 220423, 184915, 69826, 75398, -282309, -227363, -127041, -112859, 43653, -94195, -162381, -196066, -14146, -143348, -210548, -300587, -347282, -70327, -98528, -238862, 4486, 302384, -57206, -151997, 4666, 60709, -159064, -208205, 49343, 68037, -55736, 77906, -24469, -207002, 179611, 178646, 100827, 81360, 344202, -68554, 48411, -159934, 68517, 429090, 7964, 26031, -41536, 76433, -60391, -122564, 234952, -188784, 129172, 56840, -205642, 4050, 107068, -118161, 191259, -42971, 77851, 16376, -183151, 47539, 284230, 211315, 5726, 112974, -109297, 113786, 108892]
10367A08892D7945J78374l7980k8629d8139C91718q7082I0122O35050A3548K85150
10356B98698H3273L27149j67401e2620D09929j37897Q7063r0114j30043P338J69825
10345C16101I8368J6674J88768l7755F4040R8082M498J30620a5585C82767M401
10334C87168o9951q1537q9753N5339J2753g2743C71036K6220A31127L5431l0314
10323A36244J04915M5738B8657a67646B37575J00708f8173B09515J00702A29269
10312b01283A71016G4115a69391A86483L9129J97948l7207j48126n1335M6629
10302B33521J45286a54848j59583B72308c5030A17992f8702j28355J404q1339
10292b76992B38676c62709b4003j79468A2361a31658n5748B43381K0854a65106
$$ y = [108892, 47945, 226319, 188339, 159710, -48139, 391718, 304636, 90122, 725172, 13548, 298698, 83273, 410422, 243021, -52620, 409929, 272032, 359095, 268981, 138938, 146276, 316101, 98368, 115042, 303810, 266055, 64040, 162122, 166620, 297240, -15585, 382767, 387168, 317217, 235680, 145927, 201266, 214019, -72743, 371036, 397256, 131127, 166558, 136244, 241159, 286897, 28657, -167646, 237575, 338283, -68173, 209515, 310217, 129269, -201283, 171016, 74115, -169391, 186483, 225612, 423560, 386353, 238227, 186892, 233521, 378807, -154848, -314431, 272308, -35030, 117992, -68702, -197057, -195653, -276992, 238676, -362709, -24003, -203471, 12361, -131658, -187406, 243381, 264235, -165106]
10281e0922B61868J0264E5240i354k54619C7532a75738A1193e6096j49839j30293
10270c36228i7959k21915i9080b9133k45662B08139G6134b2943I9646c93807f0583
10258B64103c3091k9010E861J16612a51046e6139l29752A49692o8825O9515P9568
10247B29950M3142L248q3070N3382q1037K6012e1072j37291H4875C191K8887J45701
10235A77779a52028m1399E0362K1724e175B23866a01339A04392a57105l62721
10225e19826B7197a16550d7524A15100m7951g32m35703a60228D4002b9614J1522
10214a8092D2806a25193o4709A17994a01064C6713b48853A3167K2131a635k11979
10203b13614G8072B6046c02346a22162K0404q8172D60685D4603B0057a88079B01099
$$ y = [-50922, 261868, 272132, 55240, -9354, -263973, 37532, -175738, 11193, -56096, -205935, -336228, -97959, -319874, -99080, -29133, -274795, 208139, 76134, -22943, 99646, -393807, -60583, 264103, -33091, -62101, 5861, 122473, -151046, -56139, -385891, 149692, 80867, 150382, 229950, 273092, 276340, 193270, 246652, 165615, 191627, -51072, -188363, 84875, 3191, 32078, 177779, -152028, -193427, 50362, 72086, -5175, 223866, -101339, 104392, -157105, -519826, 27197, -116550, -47524, 115100, 67149, -732, -436435, -160228, 44002, -29614, -18092, 42806, -125193, -189902, 117994, -101064, 36713, -248853, 13167, 35298, -1635, -213614, 78072, 26046, -302346, -122162, -101758, -189930, 460685, 44603, 20057, -188079, 201099]
10191d7986k98336E5249b62311c4023l28198I5295c59013a09572L7707j8938B13358
10179H5350L2176b10566M5541A29306b43300g7253B29149G1462k9125b88478L0913
10168b57565C7371a7877B93747a23981o7081I1515m1310a20967E1328J34346J61268
10157C46942a03647d2036o470E6954a75176P511E093a92562J3943j5766B37271
10145A07264a13343c1461r137j58632C04538a19646j62987J17927k7862B28203
10134I6984j3606d402C5870c2873n50447a91699p8392A37262a95330e5810D6507
10122a0707l44647J18923O1308b4629E5157b10147A3017a74144N6370I5162J75083
10111B70245i2201l14622C15176k3732A4123d54047C219O58a05613j8290N1230
$$ y = [-47986, -346322, 55249, -262311, -34023, -362221, 95295, -359013, -109572, -71865, -90803, 213358, 85350, 117526, -210566, -165025, 129306, -243300, -77253, 229149, 71462, 42337, -288478, -257565, 37371, -17877, 293747, -123981, -191062, 91515, 50205, -120967, 51328, 185674, 346942, -103647, -42036, -48506, 56954, -175176, -167665, 5093, -192562, -178619, -194385, 237271, 107264, -113343, -31461, -40598, -199230, 304538, -119646, -282633, -164706, -192568, 228203, 96984, 83378, -4402, 35870, -32873, -583320, -191699, -270091, 137262, -195330, -55810, 46507, -10707, -355354, -236431, -175123, -24629, 55157, -210147, 13017, -174144, -117774, 95162, 270245, -92201, -406823, 315176, 291444, 14123, -454047, 3219, 3877, -105613, -123903, -72673]
10100g2673l10214a8433n7596q8453j26887B14412a80158h3602A53519c14911
10089b08782A6137b68093n8270g0705r6070j36961C01133p9058G9895a80120D6540
10077A80163a29397B54312q9900J12339a45515E8011k0551a2328l36934i5127
10066B71736j03840b11084O0480p3440C00165e2168A23677a81579O2098n9161
10056a78642j1402I9105b29007J2678B25067a98335d4456g781j52437j57171B9981
10044A44988C4844O0601c03444F653a07523K400d5653o0339A49204b68465B09940
10032a15818B8693c520k29556H5877b82419o6940J66053D5534b97288k9451e8232
10020a1979F8220j225a49814K8118B32122H1337k5497K16925g4439G2294a94536
$$ y = [-72673, -382887, -18433, -76029, -164482, -291369, 214412, -180158, -83602, 153519, -314911, -208782, 16137, -268093, -326363, -70705, -166775, -303736, 301133, 222075, 79895, -180120, 46540, 180163, -129397, 254312, 164412, 276751, -145515, 58011, 37460, -12328, -349262, -95127, 271736, 167896, -211084, -150604, -224044, 300165, -52168, 123677, -181579, -119481, -178642, -190044, 99105, -229007, -216329, 225067, -198335, -44456, -7781, -160218, -317389, 29981, 144988, 34844, 95445, -303444, 6653, -107523, -105123, -45653, -105992, 149204, -268465, 209940, -115818, 28693, -3520, -233076, 85877, -282419, -349359, -183306, 45534, -297288, -326739, -58232, -11979, 68220, 66995, -149814, -121696, 232122, 81337, 55840, 272765, -74439, 72294, -194536]
10008b6396A26820C5016b36882g748B08712a41174j72731A67457a23364N2045
9998g1319a6283E5800a48938l87276a79983r310j3803c4005A590a97621i5580
9986b89706B24289b55310C26a82492C3969a07287E0670R9005a37890b4064A20710
9974a22306j58624Q0512I7061G098J18295a09786j59153B4193a99518L1303g7628
9962i2021n1512o1987j7350C982b62697p2536B82990i3869D0107d81184A78299
9950b85297i5303A89149b195D9037a86123Q9108F247J46446M0499m4703o0817
9939H7672a52310E1014a26149d4263D8173b77300J01157B63860c2357j83805i5298
9927b6561m40965J92721r5258I7309b48252I6019d1653j09207j00030J21463N2932
$$ y = [-26396, 126820, 35016, -236882, -7748, 208712, -141174, -313905, 167457, -123364, -71319, -16283, 55800, -148938, -536214, -179983, -189293, -203096, -34005, 1590, -197621, -95580, -289706, 224289, -255310, 326, -182492, 33969, -107287, 50670, 149675, -137890, -24064, 120710, -122306, -280930, -200418, 97061, 7098, 125393, -109786, -268939, 24193, -199518, -168215, -77628, -92021, -143533, -205520, -222870, 3982, -262697, -335233, 282990, -93869, 40107, -481184, 178299, -285297, -95303, 189149, -2195, 49037, -186123, -97015, 6247, 152693, 193192, 148489, 87672, -152310, 51014, -126149, -44263, 48173, -277300, -176143, 263860, -32357, -216162, -95298, -26561, -467526, -274805, -370063, 97309, -248252, 96019, -41653, -150860, -250890, -129427, -76495]
9916g6495l9942B9965L4982J8839a18500B3632R1639b39971O6860I0486a2100
9904b93411e7581b6411j48383m1892R5744H883J6547J58998O3518b03660g4232
9892h9213A96288E5699F556b18178B17266L3670d0708k38121A54749K6603B947
9880a34966n5085j40514g3863A28432c7908A46832J2000c3401j99529A81987a46079
9868A57931b40917k14045a40506O3720A8497d55494g186A817J2287h0660B92142
9856b07058L9588N0647j04943L8354h4216k09216J05488g6210B70035A23581D079
9844b03900j40883J47085n0952B5769g5857m6772G8132J41906c3531l29756a75748
9832h435j65688j09528N5678I6168a71854j5560l943K4837c4746A55036F6698
$$ y = [-76495, -116437, 29965, 64947, 83786, -118500, 23632, 115271, -239971, -173111, 90486, -12100, -293411, -57581, -26411, -174794, -216686, -120942, 8883, 25430, 184428, 247946, -203660, -74232, -89213, 196288, 55699, 6556, -218178, 217266, 250936, -40708, -278829, 154749, 181352, 2947, -134966, -190051, -330565, -73863, 128432, -37908, 146832, 158832, -33401, -232930, 181987, -146079, 157931, -240917, -454962, -140506, -76786, 18497, -455494, -7186, 1817, 14104, -80660, 292142, -207058, -167470, -116823, -221766, -183412, -84216, -293432, -187944, -76210, 270035, 123581, 4079, -203900, -344783, -197698, -248650, 25769, -75857, -122629, 78132, 220038, -33531, -363287, -175748, -8435, -174123, -283651, -227973, 96168, -171854, -187414, -191357, -166520, -34746, 155036, 66698]
9820g9090j86056N9391B5678b95873J27456d2244j18966C37209b77664D1347b32281
9808c9912B06103c62336m87A54645M6589J39103A59881g7990A69570b60880B09882
9796d5611j44785J3460D2219K09533E4134J90631q9629a61455P2174B9413a49920
9784B51855c44415H1241O9167i0946A25308m2501b93044b8744j52613j51016c7131
9772I478a05037b2579k6900q4663c8989l27178J82775k14644a39073A20673J56847
9761B77520n8677A445c22167A8642h8903B3788a94164A28530a19932q1480i0695
9749b64423J04663g8583j05142A28984b21732H627a35231k84813D08812b18185
9738c07946F5464b11671G5611c1223l4816j04736p9772I1420K13615a84452A7040
$$ y = [-79090, -265146, -205755, 25678, -295873, -168417, -42244, -161210, 337209, -277664, 41347, -232281, -39912, 206103, -362336, -362823, 154645, 201234, 340337, 159881, -77990, 169570, -260880, 209882, -45611, -190396, -176936, 42219, 251752, 54134, 244765, 155136, -161455, -89281, 29413, -149920, 251855, -344415, 81241, 150408, -90946, 125308, 82807, -293044, -28744, -181357, -332373, -37131, 9478, -105037, -22579, -49479, -134142, -38989, -366167, -183392, -398036, -139073, 120673, 277520, 218843, 1445, -322167, 18642, -88903, 23788, -194164, 128530, -119932, -201412, -90695, -264423, -159760, -78583, -183725, 128984, -221732, 8627, -135231, -420044, 408812, -218185, -307946, 65464, -211671, 75611, -31223, -66039, -170775, -250547, 91420, 305035, -184452, 17040]
9726i6646k79763A5504J43437J49171a53542B27428J47535a5888j59576A9380
9715b52532b5913B7160b34686B22585Q895l0144b91152G6407b49582A97247c4974
9703b57879e1002l43026e1502r0842k38452F3891c5753j62955O7647q6391C8324
9691C33520a08676k96297a04532R635j00665A44399b28302D6101c14387e1135
9680i6145B34493c83224g8454m300A64140L9755I7603b44679d9931n0285J1896
9669h8320B33790c82004D8419J26809O9872a0800j31646B61695A8594b47899I0552
9657a72184A4721g3536B7348L7614b9857l30414B7259b04482i6342C42697a02649
9645I9879a19621H5218j039a93423i2045H6305b51769E6936c61850a8827j99652
$$ y = [-96646, -376409, 15504, 158941, 308112, -153542, 227428, 374963, -15888, -175464, 19380, -252532, -25913, 27160, -234686, 222585, 231480, 201336, -291152, 76407, -249582, 197247, -34974, -257879, -51002, -394028, -51502, -142344, -380796, 63891, -35753, -198708, -131061, -217452, 38324, 333520, -108676, -404973, -104532, -94897, -195562, 144399, -228302, 46101, -314387, -51135, -96145, 234493, -383224, -78454, -82754, 164140, 203895, 97603, -244679, -49931, -100216, -88320, 233790, -382004, 48419, 175228, 245100, -10800, -142446, 261695, 18594, -247899, 90552, -172184, 14721, -73536, 27348, 64962, -29857, -360271, 27259, -204482, -96342, 342697, -102649, 99879, -119621, 85218, 84179, -193423, -92045, 86305, -251769, 56936, -361850, -18827, -218479]
9634b18479B96810a07460d2582n9605r510B53902d0545l0487b964A0570b98252
9622A33199f5583k45952K5208P4672P4454K620p2901l6183A31507a27687K2848
9611a04839A69613K8504A0328b54868g3405k04522b6041k71007k41428K68887
9601b69589B4433b9182B53282a91786r2509H6838a84454C08918A38855a36318
9590b21728B13396D3912c3146j46575K5212A07489i3929j57475A44348a21678
9579a07013k0048E1199b53659a26068A26044f0362K5218k66835A88713c61724
9568h6044k54450A76245a03743c1197m6787j935r8169P4796k4497A59503a45067
9556b5037B1068b2800q6685H6921N1081a47107j48788F7974M7252c2917B5252
$$ y = [-218479, 296810, -107460, -42582, -102187, -111697, 253902, -40545, -71032, -2964, 10570, -298252, 133199, -65583, -311535, -286327, -211655, -137201, -134581, -207482, -243665, 131507, -127687, -104839, 169613, 198117, 10328, -254868, -73405, -277927, -26041, -297048, -538476, -269589, 24433, -29182, 253282, -191786, -284295, 86838, -184454, 308918, 138855, -136318, -221728, 213396, 43912, -33146, -179721, -154509, 107489, -93929, -251404, 144348, -121678, -107013, -127061, 51199, -253659, -126068, 126044, -60362, -35144, -301979, 188713, -361724, -86044, -340494, 176245, -103743, -31197, -77984, -79919, -178088, -103292, -127789, 159503, -145067, -25037, 21068, -22800, -109485, 86921, 138002, -147107, -295895, 67974, 115226, -32917, 25252]
9544d34021G4094e7775a7557k7311A64268o4867b38641I883b14556E3882M8792
9533A02674f6778o2245k4486B9144a60819A31768d38570a33558M5104k6454j21733
9522b36641e8862A96679b99021d8953n9299A05216b66725A34289d53437A59922
9511g3275j64110k59374b2086A5398M8758a05458o810k91862D0812a95029r268
9500b04297C2890a28465k7854j33329L7168R4336N4132L9929H2074J12720n658
9489A89136J18956b30541B2236b3672l27365f966j43128i340k80952j68460B30401
9477D657J95347k6175n9267E6753R6081b6410B10626q5587L6516Q3438N9069A25793
9464h4620j3319A29947j7628K723B1282L3730c3807A8351J00358b2725o8197b0620
$$ y = [-434021, 74094, -57775, -17557, -44868, 164268, 99401, -238641, 9883, -214556, 53882, 102674, -66778, -129023, -153509, 29144, -160819, 131768, -438570, -133558, -88454, -114908, -236641, -58862, 196679, -299021, -48953, -108252, 105216, -266725, 134289, -453437, 159922, -73275, -237385, -496759, -22086, 15398, 64156, -105458, -112268, -404130, 40812, -195029, -204297, 32890, -128465, -156319, -289648, -252480, -158144, -104012, -64083, 82074, 194794, 189136, 308092, -230541, 22236, -23672, -351037, -6966, -150094, -9340, -290292, -458752, 230401, 4657, 200004, 173829, 114562, 56753, 152834, -26410, 210626, 125039, 161555, 244993, 304062, 125793, -84620, -97939, 129947, 112319, 115042, 21282, 55012, -33807, 18351, 118709, -22725, -90922, -20620]
9451b05611q721a961j56468j76157P6178B8742b18915I3556J01852c6291B1154
9439A25366R3419O8610b01265j48101F6534K3258a25827E576J55935b44741d000
9427i4047m7408M5750E9627j0562A7647J43645G0684h7259k10509a07478B6969
9415h1535b3610G3860b6772C0420a79098a6985k07859F289a30026B0965b50032
9403H6483k2469g1901k5492A5154b43116Q8533A12670K04346h1706c6975A93786
9391a86923d571k85585a36380c6092E1175R8371o4249i2661o1947k39125k0424
9380d14157f0900m3789j31772i9853a6629l8150I0092a11038A2505a46675A59520
9368i0749k01959A91339b75474a07811H8830a32875j80972C85096g420l63620
$$ y = [-205611, -214332, -1961, -158429, -334586, -258408, 28742, -218915, 93556, 195408, -36291, 21154, 125366, 218785, 287395, -201265, -349366, 66534, 89792, -125827, 5576, 161511, -244741, -4000, -94047, -141455, -95705, 59627, 49065, 17647, 161292, 70684, -87259, -297768, -107478, 26969, -81535, -23610, 73860, -26772, 30420, -179098, -16985, -224844, 6289, -130026, 20965, -250032, 86483, 64014, -71901, -97393, 15154, -243116, -154583, 112670, 317016, -81706, -36975, 193786, -186923, -4571, -290156, -136380, -36092, 51175, 149546, 85297, -92661, -154608, -393733, -414157, -60900, -104689, -236461, -99853, -16629, -54779, 90092, -111038, 12505, -146675, 159520, -90749, -292708, 191339, -275474, -107811, 88830, -132875, -313847, 385096, -7420, -371040]
9358c71040J01006D9564f4110A2191a97090l535E6395h5390A0608K4075M2072
9347G6755a49526G4858e1943G7485d53427g5352j85610r7428J41623q9909H505
9335d8226A75312b24142R8871j88971J08341h7172A52864E7487b43939F6952a96291
9323B3155a55j29111L2357A46555Q3286A06863D1325P0853b30694g1684l2664
9312a04348M5581j36038O7290n9830I0765L3425R9711b28856i5480E587M48096
9301D53683b6174A35958c42813M4453J34744F4274B9626i4300d3161A09739a34686
9289a37124A39897o9232J60584a39049j3956l7436G9136e0772C2879a13114H2006
9277b0122A37397o4180a8477q1386b2221j63390A54340f4903j38739f5433A08380
$$ y = [-371040, -270034, 49564, -64110, 12191, -197090, -200625, 56395, -85390, 10608, 34683, 76755, -149526, 74858, -51943, 77485, -453427, -75352, -260962, -358390, -216767, -306676, 8505, -48226, 175312, -224142, -125271, -314242, -205901, -87172, 152864, 57487, -243939, 66952, -196291, 23155, -155, -129266, -96909, 146555, 229841, 106863, 41325, 112178, -230694, -71684, -104348, -58767, -194805, -127515, -187345, 90765, 124190, 223901, -228856, -95480, 5587, 453683, -26174, 135958, -342813, -298360, -163616, 64274, 29626, -94300, -43161, 109739, -134686, -137124, 139897, 70665, 231249, -139049, -153005, -190441, 79136, -50772, 32879, -113114, 82006, -20122, 137397, 73217, -18477, -99863, -22221, -185611, 154340, -64903, -203642, -65433, 108380]
9265c21910A86399a40033q605A13276b3653j46924g7326A3678i033j62905B32282
9253a47450j54327j2770F860a63319e2156j60279L2772a0706H8036c0821k41287
9242b72108F0141c5324j55290A709J28909i3310I5274A6729a85133a8081j41581
9231a59662j63423i0857D16282b01167B5061b66374E9748J7386a79432H5416C4370
9219A94262A5112a12262j28021A17358b36980G1793a76166A77193a84865M3914
9209a40951n044B89905G1504N0844m2004h5304b89j67373K4126l0350j12329g814
9196E9186B7399P21a18552D5063b72095J09004A9231a83150j79411a68002B01074
9184a54823A44016a89631C0389i4634A54992b94361J17505L2621B36b00242h4263
$$ y = [-321910, 186399, -140033, -148638, 113276, -23653, -170577, -77326, 13678, -9033, -171938, 232282, -147450, -301777, -314547, 6860, -163319, -52156, -212435, -179663, -10706, 88036, -30821, -272108, 60141, -35324, -190614, 1709, 130618, -93310, 95274, 16729, -185133, -18081, -159662, -323085, -90857, 416282, -201167, 25061, -266374, 59748, 77134, -179432, 85416, 34370, 194262, 15112, -112262, -240283, 117358, -236980, 71793, -176166, 177193, -184865, -140951, -145995, 289905, 71504, 122348, 80344, -85304, -289, -167662, -143536, -173886, -286215, -7814, 59186, 27399, 28120, -118552, 45063, -272095, -163091, 19231, -183150, -362561, -168002, 201074, -154823, 144016, -189631, 30389, -94634, 154992, -294361, -176856, -144235, 236, -200242, -84263]
9172A91815K14833a75950j10521c9079P448j07521e3810k00062J13554c8098j38881
9161a76979N6821k23640B6639b2154A60524b05549h8074j65443H2116a34167A49838
9149a09455j7062C6498f8291l08785c2123l04142g666k53147C4159J19194a58406
9137b12972Q1803f3272j56944h0973r4080l0140c0848f298C1836B626b21648A50428
9124i6757I1379R666B0242L7512a93397d7369n080K0056k06831H8525a42926m5377
9112a88303e0741m4775l30688A1051c46737d9940A04070a79217j20466a10294
9101I2461a31738N768A4823b60999a21992j32106P9135A07101a12608D3476a36799
9089a59256C4910J56390a84437A65590J19317g1004I7605b78732I3641A4722K12853
$$ y = [191815, 406648, -175950, -286471, -39079, -31631, -139152, -53810, -253872, -140318, -38098, -176979, -120158, -343798, 26639, -22154, 160524, -205549, -88074, -253517, 82116, -134167, 149838, -109455, -126517, 36498, -68291, -377076, -32123, -336265, -7666, -260813, 34159, 153353, -158406, -212972, -131169, -63272, -220216, -80973, -175053, -205193, -30848, -6298, 31836, 2626, -221648, 150428, -96757, 91379, 101045, 20242, 57754, -193397, -47369, -52449, -32393, -239224, 88525, -142926, -188303, -50741, -95516, -426204, 11051, -346737, -49940, 104070, -179217, -299683, -110294, 92461, -131738, -125970, 14823, -260999, -121992, -254098, -174963, 107101, -112608, 43476, -136799, -159256, 34910, 191300, -184437, 165590, 284907, -71004, 97605, -278732, 93641, 14722, 227575]
9078B27575a63368I5105K0836L8133Q3030C5106J99443G6922a25030B5629d09803
9066A15665h7358k181A16193c23137H8571a50660m3346A57251b04108B8148i655
9054a90875c6372A23332a38983j66575A66319F4553c03102a11078J918N0242p7573
9043a36491C3078a25262k4230G4552b76001J2565a08975C48813a96565E1088e58911
9031B51306p4419H5785m183j1466b79207L7793g8181K7773I9412f0673A53500
9019d4101n0109D113d21377I4202a77222H7485L3481b2574D16675D3611a1009
9007A30025h3540k38072B55290b09739N0983N6598l4057a6071E9631K53050a76904
8995A97117a69298H1713b36828A8515i6511k29022b9885A78177N6831b7275p8404
$$ y = [227575, -163368, 95105, 115941, 154074, 237104, 35106, 234549, 76922, -125030, 25629, -409803, 115665, -87358, -89539, 116193, -323137, 88571, -150660, -194006, 157251, -204108, 28148, -9655, -190875, -36372, 123332, -138983, -305558, 166319, 64553, -303102, -111078, -109160, -58918, -136491, 33078, -125262, -149492, 74552, -276001, -263436, -108975, 348813, -196565, 51088, -558911, 251306, 176887, 85785, 81602, 70136, -279207, -241414, -78181, -50408, 99412, -60673, 153500, -44101, -94210, 4113, -421377, 94202, -177222, 87485, 120966, -22574, 416675, 43611, -11009, 130025, -83540, -321612, 255290, -209739, -158756, -102158, -136215, -16071, 59631, 312681, -176904, 197117, -169298, 81713, -236828, 18515, -96511, -325533, -29885, 178177, 235008, -27275, -105679]
8984a05679B09396F0956b7196J0659A2765Q3925c09812B1270c5639j34173a4207
8972a51587A68279a99548H71O594M9722i6629H1986J00671B4183b30154O1709
8961a68445m1787A39401f5814G5815J534J14973c43625a22336A40243J18015e9185
8949F2922b8550j63447i908j15419j4036p5120G0160J53283b97459J40323N8060
8938i9076a9673o020n1351A41875b2784l48020A83481A203J2737L1139a12220
8926b35188h3763j16121Cf6352j41656C22073c5954J6969D29072p3740d790F8697
8913A48237a79969A21747M42606L16620j70692N12116J725110K929542r95488
8904D881561k382082j203204n74237k98932j36752k9721I4752A9311L8310i6013
$$ y = [-105679, 209396, 60956, -27196, -16537, 12765, 96690, -309812, 21270, -35639, -169812, -14207, -151587, 168279, -199548, 871, 7465, 57187, -96629, 81986, 182657, 24183, -230154, -168445, -210232, 139401, -65814, 75815, 77349, 192322, -343625, -122336, 140243, 258258, -59185, 62922, -28550, -191997, -9908, -125327, -139363, -214483, 70160, 223443, -297459, -157136, -99076, -19673, -25693, -77044, 141875, -22784, -370804, 183481, 1203, 13940, 45079, -112220, -235188, -83763, -199884, 3, -66352, -208008, 322073, -35954, -18985, 429072, 355332, -4790, 68697, 148237, -179969, 121747, 564353, 880973, 710281, 1222397, 2947507, 5877049, 4881561, 2499479, 1296275, 722038, 423106, 286354, 256633, 94752, 19311, 57621, -96013]
8893A6784J3158f8182j15290b2698j3458B45754a45003o2300C3108b0930k39587
8882b60517e2480F7715i3645E12402c02764k01296B44344a00437L2222j81442
8872b49657O9652q1171J00800q6022R8651D440R0755c07901J09770P7856j99833
8861c20108D126c8339o8813K6715K6306E451a94416g8876j23649c1771k32492
$$ y = [16784, 29942, -68182, -183472, -22698, -36156, 245754, -145003, -207303, 33108, -20930, -260517, -52480, 67715, -93645, 512402, -302764, -504060, 244344, -100437, -68215, -249657, -180005, -261176, -160376, -246398, -147747, 4440, 95195, -307901, -198131, -120275, -320108, 4126, -38339, -107152, -80437, -54131, 5451, -194416, -78876, -202525, -31771, -264263]
$$ [...]
##END NTUPLES=NMR SPECTRUM
##END=
