
##TITLE=AC1114_Huila2_5867679_NIapYYy0eg
##JCAMPDX= 6.0         $$ Bruker NMR JCAMP-DX V2.0
##DATA TYPE= NMR SPECTRUM
##DATA CLASS= NTUPLES
##ORIGIN= BRUKER
##OWNER= Administrator
$$ 1.72 TOPSPIN		Version 2.1
$$ 2012-03-30 21:19:29.875 -0500  Administrator@TOPSPIN
$$ Compression mode = diff/dup
##.OBSERVE FREQUENCY= 400.13188235
##.OBSERVE NUCLEUS= ^1H
##.ACQUISITION MODE= SIMULTANEOUS (DQD)
##.ACQUISITION SCHEME= undefined
##.AVERAGES= 64
##.DIGITISER RES= 22
##SPECTROMETER/DATA SYSTEM= spect
##.PULSE SEQUENCE= noesygpps1d.comp
##.SOLVENT NAME= COFFEE_meoh
##.SHIFT REFERENCE= INTERNAL, COFFEE_meoh, 1, 14.96671
##AUDIT TRAIL= $$ (NUMBER, WHEN, WHO, WHERE, PROCESS, VERSION, WHAT)
$$ ##TITLE= Audit trail, TOPSPIN		Version 2.1
$$ ##JCAMPDX= 5.01
$$ ##ORIGIN= Bruker BioSpin GmbH
$$ ##OWNER= Administrator
$$ $$ C:\Bruker\TOPSPIN/data/COFFEE/nmr/AC1114_Huila2_5867679_NIapYYy0eg/12/pdata/1/auditp.txt
$$ ##AUDIT TRAIL=  $$ (NUMBER, WHEN, WHO, WHERE, PROCESS, VERSION, WHAT)
(   1,<2012-03-30 21:19:24.906 -0500>,<Administrator>,<TOPSPIN>,<go>,<TOPSPIN 2.1>,
      <created by zg
	started at 2012-03-30 21:07:53.265 -0500,
	POWCHK enabled, PULCHK disabled,
       configuration hash MD5:
       1A 1E CE 29 27 FD 77 03 67 4E F0 E3 C4 B2 CB 90
       data hash MD5: 64K
       D4 CD 64 FB DC DA 80 45 45 7D A3 78 9F 64 E2 A7>)
(   2,<2012-03-30 21:19:27.687 -0500>,<Administrator>,<TOPSPIN>,<proc1d>,<TOPSPIN 2.1>,
      <Start of raw data processing
       efp LB = 0.3 FT_mod = 6 PKNL = 1 PHC0 = 0 PHC1 = 0 SI = 128K 
       data hash MD5: 128K
       80 54 FD F2 91 4C BF 34 7F 9D 92 FC 9E 63 AC 11>)
(   3,<2012-03-30 21:19:28.906 -0500>,<Administrator>,<TOPSPIN>,<proc1d>,<TOPSPIN 2.1>,
      <pk PHC0 = 30.84961 PHC1 = 0 
       data hash MD5: 128K
       1C F3 6D 56 55 A4 AE 15 74 C4 F8 E7 E9 8A 09 FD>)
(   4,<2012-03-30 21:19:29.531 -0500>,<Administrator>,<TOPSPIN>,<proc1d>,<TOPSPIN 2.1>,
      <abs ABSG = 1 
       data hash MD5: 128K
       22 0D 7A 33 BC 4E 82 03 09 E3 6F 5D DD 42 43 C2>)
(   5,<2012-03-30 21:19:29.593 -0500>,<Administrator>,<TOPSPIN>,<proc1d>,<TOPSPIN 2.1>,
      <abs ABSG = 2 
       data hash MD5: 128K
       06 A0 15 45 41 3B 46 BE BE 31 8E 07 61 2C 99 79>)
(   6,<2012-03-30 21:19:29.656 -0500>,<Administrator>,<TOPSPIN>,<proc1d>,<TOPSPIN 2.1>,
      <abs ABSG = 3 
       data hash MD5: 128K
       17 BF EB 84 70 D3 12 7F 06 8B 85 B3 35 A3 71 B3>)
(   7,<2012-03-30 21:19:29.718 -0500>,<Administrator>,<TOPSPIN>,<proc1d>,<TOPSPIN 2.1>,
      <abs ABSG = 4 
       data hash MD5: 128K
       86 1E 92 57 6A FE 16 43 C4 5E F8 F6 9B 70 B1 E0>)
(   8,<2012-03-30 21:19:29.781 -0500>,<Administrator>,<TOPSPIN>,<proc1d>,<TOPSPIN 2.1>,
      <abs ABSG = 5 
       data hash MD5: 128K
       D9 92 61 D8 B3 48 15 BD A0 17 10 BA 29 3D E1 BE>)
$$ ##END=
$$ 
$$ $$ hash MD5
$$ $$ 04 43 AE B5 59 DC 14 73 2A 9C 27 C1 FE F3 B3 35
##$RELAX= 
##$RELAX= 
##$RELAX= 
##$RELAX= 
##$RELAX= 
##$RELAX= 
##$RELAX= 
##$RELAX= 
$$ Bruker specific parameters
$$ [...]
##$TP07= 0
##$TPNAME0= <>
##$TPNAME1= <>
##$TPNAME2= <>
##$TPNAME3= <>
##$TPNAME4= <>
##$TPNAME5= <>
##$TPNAME6= <>
##$TPNAME7= <>
##$TPOAL= (0..7)
0.5 0.5 0.5 0.5 0.5 0.5 0.5 0.5
##$TPOFFS= (0..7)
0 0 0 0 0 0 0 0
##$TUNHIN= 0
##$TUNHOUT= 0
##$TUNXOUT= 0
##$USERA1= <user>
##$USERA2= <user>
##$USERA3= <user>
##$USERA4= <user>
##$USERA5= <user>
##$V9= 5
##$VALIST= <valist>
##$VCLIST= <CCCCCCCCCCCCCCC>
##$VD= 0
##$VDLIST= <DDDDDDDDDDDDDDD>
##$VPLIST= <PPPPPPPPPPPPPPP>
##$VTLIST= <TTTTTTTTTTTTTTT>
##$WBST= 2048
##$WBSW= 25
##$XGAIN= (0..3)
0 0 0 0
##$XL= 0
##$YL= 0
##$YMAX_a= 9979626
##$YMIN_a= -5784446
##$ZGOPTNS= <>
##$ZL1= 120
##$ZL2= 120
##$ZL3= 120
##$ZL4= 120
##$ABSF1= 14.96671
##$ABSF2= -5.58582
##$ABSG= 5
##$ABSL= 3
##$ALPHA= 0
##$AQORDER= 0
##$ASSFAC= 0
##$ASSFACI= 0
##$ASSFACX= 0
##$ASSWID= 0
##$AUNMP= <proc_prof1d_extract.lims>
##$AXLEFT= 0
##$AXNAME= <>
##$AXNUC= <1H>
##$AXRIGHT= 0
##$AXTYPE= 0
##$AXUNIT= <>
##$AZFE= 0.1
##$AZFW= 0.1
##$BCFW= 0
##$BC_mod= 0
##$BYTORDP= 0
##$COROFFS= 0
##$CY= 15
##$DATMOD= 1
##$DC= 0
##$DFILT= <>
##$DTYPP= 0
##$F1P= 0
##$F2P= 0
##$FCOR= 0.5
##$FTSIZE= 131072
##$FT_mod= 6
##$GAMMA= 0
##$GB= 0
##$INTBC= 1
##$INTSCL= 1
##$ISEN= 128
##$LB= 0.3
##$LEV0= 0
##$LPBIN= 0
##$MAXI= 10000
##$MC2= 0
##$MEAN= 0
##$ME_mod= 0
##$MI= 0
##$NCOEF= 0
##$NC_proc= -3
##$NLEV= 6
##$NOISF1= 0
##$NOISF2= 0
##$NSP= 0
##$NTH_PI= 0
##$NZP= 0
##$OFFSET= 14.96671
##$PC= 1
##$PHC0= 30.84961
##$PHC1= 0
##$PH_mod= 1
##$PKNL= yes
##$PPARMOD= 0
##$PPDIAG= 0
##$PPIPTYP= 0
##$PPMPNUM= 2147483647
##$PPRESOL= 1
##$PSCAL= 4
##$PSIGN= 0
##$PYNMP= <proc.py>
##$REVERSE= no
##$SF= 400.130005562077
##$SI= 131072
##$SIGF1= 0
##$SIGF2= 0
##$SINO= 400
##$SIOLD= 131072
##$SPECTYP= <>
##$SREGLST= <1H.CDCl3>
##$SSB= 0
##$STSI= 131072
##$STSR= 0
##$SW_p= 8223.68421052632
##$SYMM= 0
##$S_DEV= 0
##$TDeff= 65536
##$TDoff= 0
##$TI= <>
##$TILT= no
##$TM1= 0
##$TM2= 0
##$TOPLEV= 0
##$USERP1= <user>
##$USERP2= <user>
##$USERP3= <user>
##$USERP4= <user>
##$USERP5= <user>
##$WDW= 1
##$XDIM= 131072
##$YMAX_p= 439262821
##$YMIN_p= -212993832
##$CURPLOT= <Network HP LaserJet P1505>
##$CURPRIN= <$Network HP LaserJet P1505>
##$DFORMAT= <normdp>
##$LAYOUT= <+/1D_H.xwp>
##$LFORMAT= <normlp>
##$PFORMAT= <normpl>
##$SURQMSG= 1
$$ End of Bruker specific parameters
$$ ---------------------------------
##NTUPLES= NMR SPECTRUM
##VAR_NAME=  FREQUENCY,     SPECTRUM/REAL,   SPECTRUM/IMAG
##SYMBOL=    X,             R,               I
##VAR_TYPE=  INDEPENDENT,   DEPENDENT,       DEPENDENT
##VAR_FORM=  AFFN,          ASDF,            ASDF
##VAR_DIM=   131072,        131072,          131072
##UNITS=     HZ,            ARBITRARY UNITS, ARBITRARY UNITS
##FACTOR=    0.0627417313425165, 1,          1
##FIRST=     8223.62146879498, -513,         -93563
##LAST=      0,             863,             -93641
##MIN=       0,             -212993832,      0
##MAX=       8223.62146879498, 439262821,    0
$$ Real data points
##PAGE= N=1
##DATA TABLE= (X++(R..R)), XYDATA
$$ [...]
63759D51829r407q251p731p371o841o177n529m839m008l335l348l950m206l391
$$ 451829 442422 434171 426440 419069 412228 406051 400522 395683 391675 388340 384992 381042 376836 373445
63745C73445j988j138j235j569j361o59j25k57r91j844k305k185j757j504j714
$$ 373445 371457 370319 369084 367515 366154 365495 365370 365113 364122 362278 359973 357788 356031 354527 352813
63730C52813k280k851l207l547m305n452o107n287l242j521j429k625l632l413
$$ 352813 350533 347682 344475 340928 336623 331171 325064 319777 316535 315014 313585 310960 307328 303915
63716C03915k087m21Q14J106M92l27o31n22o64j082q07Q19K856L414J763n70j160
$$ 303915 301828 301407 302221 303327 303819 303492 302861 302339 301675 300593 299786 300605 303461 306875 308638 308068 306908
63699C06908P06L052L267J082j141j309J4R09J069J924L864M959L494N74j080
$$ 306908 307614 310666 313933 315015 313874 312565 312579 313488 314557 316481 320345 325304 328798 329372 328292
63684C28292m16J156K016K067K077K419L081M077N161N638N125M198L715L769
$$ 328292 327876 329032 331048 333115 335192 337611 340692 344769 349930 355568 360693 364891 368606 372375
63670C72375L794L543L226K824K095J391J658L035M094L375J500P19K170M479
$$ 372375 376169 379712 382938 385762 387857 389248 390906 393941 398035 401410 402910 403629 405799 410278
63656D10278N586N178M360L517J890n98k524k697j895j781k689l449l207k323
$$ 410278 415864 421042 425402 428919 430809 430211 427687 424990 423095 421314 418625 415176 411969 409646
63642D09646j447p11j66j37o14q81l35O92J432J620J522J359J185J102J167J352
$$ 409646 408199 407488 407322 407185 406571 405690 405355 406047 407479 409099 410621 411980 413165 414267 415434 416786
63626D16786J826K897M243M832M338M039N205O903O834M570K430K416L561L535
$$ 416786 418612 421509 425752 430584 434922 438961 444166 451069 457903 462473 464903 467319 470880 474415
63612D74415K000P47Q10J120M21q51j391q57L2P08J218J604J594J018K9j218k730
$$ 474415 476415 477162 477972 479092 479513 478662 477271 476414 476446 477154 478372 479976 481570 482588 482617 481399 478669
63595D78669m389n662n845m608k452o44l37j448k559k268n62J352K393K456K141
$$ 478669 474280 468618 462773 458165 455713 455069 454732 453284 450725 448457 447895 449247 451640 454096 456237
63580D56237K193L121M837O517P364P551P956Q824R427R409R697J1255J3427J4569
$$ 456237 458430 461551 466388 472905 480269 487820 495776 504600 514027 523436 533133 544388 557815 572384
63566E72384J4300J4074J5142J6908J8118J8995K1031K4713K8616L1236L2826
$$ 572384 586684 600758 615900 632808 650926 669921 690952 715665 744281 775517 808343
63555H08343L4610L6793L8545L9768M1535M4367M7221M9051N0432N2561N5134
$$ 808343 842953 879746 918291 958059 999594 1043961 1091182 1140233 1190665 1243226 1298360
63544A298360N6476N5529N2508M7696M0901L2448K3495J4830O383j592p995j2303
$$ 1298360 1354836 1410365 1462873 1510569 1551470 1583918 1607413 1622243 1628626 1627034 1619039 1606736
63532A606736j5446j8371k0694k1956k3298k6277l0442l3748l5400l6815l9349
$$ 1606736 1591290 1572919 1552225 1530269 1506971 1480694 1450252 1416504 1381104 1344289 1304940
63521A304940m2304m3836m3094m0827l8339l6180l3735l0022k5127k0460j7068
$$ 1304940 1262636 1218800 1175706 1134879 1096540 1060360 1026625 996603 971476 951016 933948
63510I33948j4211j0508o104k441m9J999M352O578Q550J1131J4729J8439K1473
$$ 933948 919737 909229 903125 900684 900635 902634 906986 913564 922114 933245 947974 966413 987886
63497I87886K4310K7431L0123L1762L3325L6075L9445M1879M3432M5790M9625
$$ 987886 1012196 1039627 1069750 1101512 1134837 1170912 1210357 1252236 1295668 1341458 1391083
63486A391083N3508N5998N7367N8329N8042N4607M7294L7331K6436J5358M255
$$ 1391083 1444591 1500589 1557956 1616285 1674327 1728934 1776228 1813559 1839995 1855353 1859608
63475A859608o075j4201j9279k1686k2237k1649k1253k3153k8284l4803l9988
$$ 1859608 1853533 1839332 1820053 1798367 1776130 1754481 1733228 1710075 1681791 1646988 1607000
63464A607000m3619m7729n2820n6640n7612n7289n7579n7420n4620m9869m6164
$$ 1607000 1563381 1515652 1462832 1406192 1348580 1291291 1233712 1176292 1121672 1071803 1025639
63453A025639m4548m3050m0136l6707l3983l1531k8620k5866k4112k2748k0516
$$ 1025639 981091 938041 897905 861198 827215 795684 767064 741198 717086 694338 673822
63442F73822j7320j4190j1927j0590r926r548r024q285p668p244o611n578m445
$$ 673822 656502 642312 630385 619795 609869 600321 591297 583012 575344 568100 561489 555911 551466
63429E51466l321j911l08P87J101J244J712K253K641L213L968M158L589L273L762
$$ 551466 548145 546234 545926 546713 547814 549058 550770 553023 555664 558877 562845 567003 570592 573865 577627
63414E77627L833K231l8p16O96K427K796J696k56k494m153m337l332k433k076
$$ 577627 581460 583691 583653 582937 583633 586060 588856 590552 590296 587802 583649 579312 575980 573547 571471
63399E71471j320K64J476J264O07J243L178M877N671O476P868Q939Q830Q433R475
$$ 571471 570151 570415 571891 573155 573762 575005 578183 583060 588731 595207 603075 612014 620844 629277 638752
63384F38752J2315J5480J7432J8111J8757K0608K3892K7769L1231L4224L7634
$$ 638752 651067 666547 683979 702090 720847 741455 765347 793116 824347 858571 896205
63373H96205M1858M5777M7761M7454M5651M2698L8283L3111K9439K8945L0919
$$ 896205 938063 983840 1031601 1079055 1124706 1167404 1205687 1238798 1268237 1297182 1328101
63362A328101L3505L6044L9140M3123M7671N2566N7579O1842O4521O5917O6526
$$ 1328101 1361606 1397650 1436790 1479913 1527584 1580150 1637729 1699571 1764092 1830009 1896535
63351A896535O5214N9821M9883L7330K4296J1675K59q522j4113j7889k1547k5318
$$ 1896535 1961749 2021570 2071453 2108783 2133079 2144754 2145013 2136491 2122378 2104489 2082942 2057624
63339B057624k8660l1705l4995l8573m2450m7161n2795n8053o1368o2448o1808
$$ 2057624 2028964 1997259 1962264 1923691 1881241 1834080 1781285 1723232 1661864 1599416 1537608
63328A537608n9634n6177n2548m9597m6582m2398l7713l4181l1671k8063k2208
$$ 1537608 1477974 1421797 1369249 1319652 1273070 1230672 1192959 1158778 1127107 1099044 1076836
63317A076836j5582j0324o785l760l57L209O305Q851J1657J5764K1190K6491L0170
$$ 1076836 1061254 1050930 1044145 1040385 1040028 1043237 1049542 1058393 1070050 1085814 1107004 1133495 1163665
63304A163665L2293L4214L6910M0296M3948M7611N1043N4136N7123O0052O2284
$$ 1163665 1195958 1230172 1267082 1307378 1351326 1398937 1449980 1504116 1561239 1621291 1683575
63293A683575O3258O3290O2482N9419N2528M2606L2249K2499J1937j92j1664j9451
$$ 1683575 1746833 1810123 1872605 1932024 1984552 2027158 2059407 2081906 2093843 2093651 2081987 2062536
63281B062536k3170k5097k7433l0671l4200l7425m0288m3329m7123n1429n5272
$$ 2062536 2039366 2014269 1986836 1956165 1921965 1884540 1844252 1800923 1753800 1702371 1647099
63270A647099n8043n9898o0783n9969n7085n2944m8670m4630m0710l6961l3283
$$ 1647099 1589056 1529158 1468375 1408406 1351321 1298377 1249707 1205077 1164367 1127406 1094123
63259A094123k9268k5182k2530k2683k5146k7933k9482k9606k8981k8286k7638
$$ 1094123 1064855 1039673 1017143 994460 969314 941381 911899 882293 853312 825026 797388
63248G97388k6420k3936k0548j7607j5770j4219j2175j0436j0266j1303j1812
$$ 797388 770968 747032 726484 708877 693107 678888 666713 656277 646011 634708 622896
63237F22896j0889r305q128p468o910o367o047n959n800n246m339l597l524l966
$$ 622896 612007 602702 594574 587106 580196 573829 567782 561823 556023 550777 546438 542841 539317 535351
63223E35351m319m379m527m863m924m468l708k577q38O66L49j626k677j079J449
$$ 535351 531032 526653 522126 517263 512339 507871 504163 501586 500748 501414 501763 500137 497460 496381 497830
63208D97830K245J609J826L076L286K120K049M433P042P260N834N495P069Q937
$$ 497830 500075 501684 503510 506586 509872 511992 514041 518474 525516 532776 538610 544105 551174 560111
63194E60111R741R831J0140J0996J2266J3748J5212J6502J7673J8771J9733K0640
$$ 560111 569852 579683 589823 600819 613085 626833 642045 658547 676220 694991 714724 735364
63182G35364K1661K2616K3246K4098K6257K9665L2672L3914L3852L3781L4160
$$ 735364 757025 779641 802887 826985 853242 882907 915579 949493 983345 1017126 1051286
63171A051286L4765L5581L6392L6265L4765L3129L2874L3573L3416L1767K9802
$$ 1051286 1086051 1121632 1158024 1194289 1229054 1262183 1295057 1328630 1362046 1393813 1423615
63160A423615K8573K7921K7438K7066K6202K3504J8417J2062N967N09m794j0194
$$ 1423615 1452188 1480109 1507547 1534613 1560815 1584319 1602736 1614798 1620765 1621274 1616480 1606286
63148A606286j5642k1298k7359l3387l8212m0567l9890l6851l2992k9499k6303
$$ 1606286 1590644 1569346 1541987 1508600 1470388 1429821 1389931 1353080 1320088 1290589 1264286
63137A264286k2801j9120j5854j2815r156m896j127J588L943O622R417J2190J5430
$$ 1264286 1241485 1222365 1206511 1193696 1184540 1179644 1178517 1180105 1184048 1190670 1200087 1212277 1227707
63124A227707J9013K1592K2320K2213K2613K3178K2690K1194J9873J9298J9168
$$ 1227707 1246720 1268312 1290632 1312845 1335458 1358636 1381326 1402520 1422393 1441691 1460859
63113A460859J9182J8769J6577J2032O976L742J681k091q387j4807j9584k3999
$$ 1460859 1480041 1498810 1515387 1527419 1534395 1538137 1539818 1537727 1529340 1514533 1494949 1470950
63101A470950k9565l5065l8419l9904m1292m2883m3530m2908m1650l9690l6532
$$ 1470950 1441385 1406320 1367901 1327997 1286705 1243822 1200292 1157384 1115734 1076044 1039512
63090A039512l2993l0658k9501k7937k5436k3195k1718j9679j6108j2221r925
$$ 1039512 1006519 975861 946360 918423 892987 869792 848074 828395 812287 800066 790141
63079G90141r546j0002j0225r568p739n396m099m456m950l586l58K918M835N347
$$ 790141 780595 770593 760368 750800 743061 737665 733566 729110 724160 720574 720216 723134 727969 733316
63065G33316M816L404J785J316K730N094O754P167P246P856Q482P950O163M329
$$ 733316 738132 741536 743321 744637 747367 752461 759215 766382 773628 781484 789966 797916 804079 808408
63051H08408L327K773K256K553M350O454O907N856N501O790P840O643L962K195
$$ 808408 811735 814508 816764 819317 823667 830121 837028 842884 848385 855175 863015 869658 873620 875815
63037H75815K336L389M146M227L700K907K534K989L859M617N363O121O147M962
$$ 875815 878151 881540 885686 889913 893613 896520 899054 902043 905902 910519 915882 922003 928150 933112
63023I33112L567L392M495N882P207Q775J0388J1701J3409J6306J9304K0329J9509
$$ 933112 936679 940071 944566 950448 957655 966430 976818 988519 1001928 1018234 1037538 1057867 1077376
63010A077376J9434K1637K4683K6733K8156L0265L2966L5441L8100M2047M7020
$$ 1077376 1096810 1118447 1143130 1169863 1198019 1228284 1261250 1296691 1334791 1376838 1423858
62999A423858N1445N4451N6690N9254O2750O7198P1860P5408P7260P8589Q0957
$$ 1423858 1475303 1529754 1586444 1645698 1708448 1775646 1847506 1922914 2000174 2078763 2159720
62988B159720Q4061Q5917Q5335Q3205Q1192Q0113P9890Q0093Q0045P9017P6894
$$ 2159720 2243781 2329698 2415033 2498238 2579430 2659543 2739433 2819526 2899571 2978588 3055482
62977C055482P4216P1274O7618O2738N6769M9998M2024L1936J9366N157r129k2421
$$ 3055482 3129698 3200972 3268590 3331328 3388097 3438095 3480119 3512055 3531421 3536578 3527449 3505028
62965C505028l4938m7598o0416p1796p9913q4576q7066q8110q6962q2817p6347
$$ 3505028 3470090 3422492 3362076 3290280 3210367 3125791 3038725 2950615 2863653 2780836 2704489
62954B704489o9055o1626n3725m5273l7040k9653k2545j4444m845N177J3776K0002
$$ 2704489 2635434 2573808 2520083 2474810 2437770 2408117 2385572 2371128 2366283 2371460 2385236 2405238
62942B405238K4699K9515L4926L9454M1239M0251L8459L7764L8235L8536L7546
$$ 2405238 2429937 2459452 2494378 2533832 2575071 2615322 2653781 2691545 2729780 2768316 2805862
62931B805862L5126L1673K7590K3162J8345J2550N085m005j3829k3535l2999m2540
$$ 2805862 2840988 2872661 2900251 2923413 2941758 2954308 2959393 2955388 2941559 2918024 2885025 2842485
62919B842485n2307o2107p1291p8663q3084q4748q5356q6405q7505q7049q4312
$$ 2842485 2790178 2728071 2656780 2578117 2495033 2410285 2324929 2238524 2151019 2063970 1979658
62908A979658q0056p5213o9882o3990n8159n3321m9710m6634m3103l8696l4041
$$ 1979658 1899602 1824389 1754507 1690517 1632358 1579037 1529327 1482693 1439590 1400894 1366853
62897A366853l0426k8611k7990k7276k6001k4780k4200k4120k4154k4112k3676
$$ 1366853 1336427 1307816 1279826 1252550 1226549 1201769 1177569 1153449 1129295 1105183 1081507
62886A081507k2374k0337j8490j7580j7525j7955j8702j9231j8494j6148j3415
$$ 1081507 1059133 1038796 1020306 1002726 985201 967246 948544 929313 910819 894671 881256
62875H81256j1811j1438j1324j1000j0687j0267r203p592o338o036o334o535o128
$$ 881256 869445 858007 846683 835683 824996 814729 805526 797934 791596 785560 779226 772691 766563
62862G66563m727k464n63m81j953k688q68K552M732L897Q28k405m466n441n920
$$ 766563 761836 759372 758809 758328 756375 753687 752819 755371 760103 764000 764828 762423 757957 752516 746596
62847G46596n971n218l883l213m265o490q193q524q178p873p061n045k655j569
$$ 746596 740625 735407 731524 728311 724046 717556 709363 700839 692661 684788 677727 672682 670027 668458
62833F68458k022k331j086J107K572K643K037J632J656J937K131J671K66j282
$$ 668458 666436 664105 663019 664126 666698 669341 671378 673010 674666 676603 678734 680405 680671 679389
62819F79389j535j43J503J892J110K58k55p83j122n10Q17J306K3k005l104k909
$$ 679389 677854 677711 679214 681106 682216 682474 682219 681436 680314 679804 680621 681927 681950 679945 676841 673932
62803F73932k190j478p89l36l96o24l79L25R26J196J265R68J56n13j81P49R73
$$ 673932 671742 670264 669475 669139 668743 668119 667740 668065 668991 670187 671452 672420 672576 672063 671882 672631 673604
62786F73604L01L0Q25J601J316P16J013J759J541K74p81j143j598k203j496J261
$$ 673604 673905 673935 674760 676361 677677 678393 679406 681165 682706 682980 682199 681056 679458 677255 675759 677020
62770F77020M238M806K761M82L0J241K866M402N980P241P485O817O248O472P237
$$ 677020 681258 686064 688825 689307 689337 690578 693444 697846 703826 711067 718552 725369 731617 738089 745326
62755G45326Q191R548J1376J2774J2679J1388J0485J1074J2668J4120J5136J6379
$$ 745326 753517 763065 774441 787215 799894 811282 821767 832841 845509 859629 874765 891144
62743H91144J8370K0830K3118K4880K6109K6964K7841K9422L2095L5253L7692
$$ 891144 909514 930344 953462 978342 1004451 1031415 1059256 1088678 1120773 1156026 1193718
62732A193718L9124M0923M4676N0301N6305O1893O7754P4459Q1205Q7023R2355
$$ 1193718 1232842 1273765 1318441 1368742 1425047 1486940 1554694 1629153 1710358 1797381 1889736
62721A889736R8319J04870J10810J15385J18693J20701J20930J19126J15096J07897
$$ 1889736 1988055 2092925 2203735 2319120 2437813 2558514 2679444 2798570 2913666 3021563
62711C021563R6616Q2053O6196M9551L0708R366j1949l0675m7272o3629p9385
$$ 3021563 3118179 3200232 3266428 3315979 3346687 3356053 3344104 3313429 3266157 3202528 3123143
62700C123143r2065j00638j06715j11879j15754j17448j17205j15550j12118j06619
$$ 3123143 3031078 2930440 2823725 2711846 2596092 2478644 2361439 2245889 2133771 2027152
62690B027152j00187r4448q9647q4696p8847p2505o6607o1935n8657n5815n1533
$$ 2027152 1926965 1832517 1742870 1658174 1579327 1506822 1440215 1378280 1319623 1263808 1212275
62679A212275m4799l7008l0799k7263k5109k2660j9647j6746j4365j2573j1465
$$ 1212275 1167476 1130468 1099669 1072406 1047297 1024637 1004990 988244 973879 961306 949841
62668I49841j0719r311o563l150k58J993M384O938Q677R238R777J1608J4664J8018
$$ 949841 939122 929811 923248 920098 919840 921833 926217 933155 941832 951070 960847 972455 987119 1005137
62654A005137K1337K4924K8568L1434L3382L5669L9685M5309N0998N5555N9365
$$ 1005137 1026474 1051398 1079966 1111400 1144782 1180451 1220136 1265445 1316443 1371998 1431363
62643A431363O3729O9234P5236Q0744Q5310Q8827R1167R2532R3639R4671R4270
$$ 1431363 1495092 1564326 1639562 1720306 1805616 1894443 1985610 2078142 2171781 2266452 2360722
62632B360722R0583Q3350P3990O3478N1345L7218K1988O576r346k6156m2654n7097
$$ 2360722 2451305 2534655 2608645 2672123 2723468 2760686 2782674 2789250 2779904 2753748 2711094 2653997
62620B653997o9270p9954q8695r4029r6009r6667r7344r7169r5049r1696q8439
$$ 2653997 2584727 2504773 2416078 2322049 2226040 2129373 2032029 1934860 1839811 1748115 1659676
62609A659676q5156q0801p5300o9575o3981n8119n2062m6661m2473l9299l6930
$$ 1659676 1574520 1493719 1418419 1348844 1284863 1226744 1174682 1128021 1085548 1046249 1009319
62598A009319l5392l4146l1858k7692k2526j8395j6703j7068j7727j7029j4776
$$ 1009319 973927 939781 907923 880231 857705 839310 822607 805539 787812 770783 756007
62587G56007j2186j0407r230p703n914n344o837q893r004o782m587m542n759n650
$$ 756007 743821 733414 724184 716481 710567 705223 698386 689493 680489 673707 669120 664578 658819 653169
62573F53169l404p78M88N13J07o29j472j205Q28L136L773L049K822L408L399K651
$$ 653169 649765 648987 649475 649988 650095 649466 647994 646789 647617 650753 654526 657575 660397 663805 667204 669855
62557F69855L133N880R093J0608J0765J1344J2786J4129J5018J6265J8587K1913
$$ 669855 672988 678868 687961 698569 709334 720678 733464 747593 762611 778876 797463 819376
62545H19376K5695K9140L1568L3310L5590L8803M1605M2752M3019M4140M6590
$$ 819376 845071 874211 905779 939089 974679 1013482 1055087 1097839 1140858 1184998 1231588
62534A231588M9711N3180N6682N8644N7212N2579M6713M0678L3801K5619J6930
$$ 1231588 1281299 1334479 1391161 1449805 1507017 1559596 1606309 1646987 1680788 1706407 1723337
62523A723337Q381n11j0125j9708k8235l5479m1665m6907n1336n4925n6872n6309
$$ 1723337 1731718 1731207 1721082 1701374 1673139 1637660 1595995 1549088 1497752 1442827 1385955 1329646
62511A329646n3832n1225m9194m6702m3140l9648l7295l5300l2438k9157k6689
$$ 1329646 1275814 1224589 1175395 1128693 1085553 1045905 1008610 973310 940872 911715 885026
62500H85026k4763k1929j8061j4867j3604j3486j2904j1330r441p880o575n162
$$ 885026 860263 838334 820273 805406 791802 778316 765412 754082 744641 736761 730186 725024
62488G25024l653k523k116k104j733n78J140K979M538N301M854L613K786L083
$$ 725024 721371 718848 716732 714628 712895 712317 713457 716436 720974 726275 731129 734742 737528 740611
62474G40611L922M447M893O187Q430J0621J2074J3331J5363J8273K1328K4051
$$ 740611 744533 748980 753873 760060 768490 779111 791185 804516 819879 838152 859480 883531
62462H83531K6758K9915L3416L6859M0264M3965M7833N1213N3756N5716N7147
$$ 883531 910289 940204 973620 1010479 1050743 1094708 1142541 1193754 1247510 1303226 1360373
62451A360373N7538N6812N5841N5105N3536M9695M3640L6443K8436J9525J0957
$$ 1360373 1417911 1474723 1530564 1585669 1639205 1688900 1732540 1768983 1797419 1816944 1827901
62440A827901M708O74l714j0086j6769k0900k1719k0661j9039j6931j3884r613
$$ 1827901 1832609 1833283 1829569 1819483 1802714 1781814 1760095 1739434 1720395 1703464 1689580 1679967
62428A679967m274J425O799J2222J8776K6414L3589L9434M5026N1403N7476O1428
$$ 1679967 1675693 1677118 1683917 1696139 1714915 1741329 1774918 1814352 1859378 1910781 1968257 2029685
62416B029685O3262O4273O4588O2999N9101N3865M7893M0474L0754J8896N813
$$ 2029685 2092947 2157220 2221808 2284807 2343908 2397773 2445666 2486140 2516894 2535790 2541603
62405B541603p432j9984l1653m2943n3959o3738p1459p7649q3096q7127q8533
$$ 2541603 2534171 2514187 2482534 2439591 2385632 2321894 2250435 2172786 2089690 2002563 1914030
62394A914030q7626q5653q2479p6989o9812o3435n8929n4619m8978m2867l7647
$$ 1914030 1826404 1740751 1658272 1581283 1511471 1448036 1389107 1334488 1285510 1242643 1204996
62383A204996l2743k6977k1126j7294j6078j5915j5031j2895r960p119n398n270
$$ 1204996 1172253 1145276 1124150 1106856 1090778 1074863 1059832 1046937 1036977 1029858 1024460 1019190
62371A019190o160p188q175r370j0564j1315j1836j2813j4344j5806j6779j7401
$$ 1019190 1013030 1005842 997667 988297 977733 966418 954582 941769 927425 911619 894840 877439
62359H77439j7703j7246j5757j3769j2291j1856j1983j1613j0178q200o616n719
$$ 877439 859736 842490 826733 812964 800673 788817 776834 765221 755043 746843 740227 734508
62347G34508n234n277o372q183r089p770m822k148j014j180j660j641q20O13K169
$$ 734508 729274 723997 717625 709442 700353 692583 687761 685613 684599 683419 681759 680118 679298 679911 682080
62332F82080L510M592N310N378M865M421M582N175N790O455P351Q316R205J0385
$$ 682080 685590 690182 695492 700870 705735 710156 714738 719913 725703 732158 739509 747825 757030 767415
62318G67415J2237J4325J5786J6428J6888J7791J9335K1573K4449K7608L0694
$$ 767415 779652 793977 809763 826191 843079 860870 880205 901778 926227 953835 984529
62307I84529L3886L7586M1598M5214M8211N1203N4805N9059O3846O9322P5449
$$ 984529 1018415 1056001 1097599 1142813 1191024 1242227 1297032 1356091 1419937 1489259 1564708
62296A564708Q1519Q6747R1184R5441R9249J00865R8489R2072Q2993P1900N7863
$$ 1564708 1646227 1732974 1824158 1919599 2018848 2119713 2218202 2310274 2393267 2465167 2523030
62285B523030M0490K1959N510p907k0044l2192m3339n2248n9699o7100p3853p7948
$$ 2523030 2563520 2585479 2590989 2583082 2563038 2530846 2487507 2435259 2375560 2308460 2234607 2156659
62273B156659p8812p7934p6638p4718p1500o6982o1516n5408m9335m4272m0555
$$ 2156659 2077847 1999913 1923275 1848557 1777057 1710075 1648559 1593151 1543816 1499544 1458989
62262A458989l7676l5214l3285l1911l0796k9996k9961l0552l0936l0820l0773
$$ 1458989 1421313 1386099 1352814 1320903 1290107 1260111 1230150 1199598 1168662 1137842 1107069
62251A107069l0846k9947k7502k4738k3160k2456k1120j8844j6849j5891j5132
$$ 1107069 1076223 1046276 1018774 994036 970876 948420 927300 908456 891607 875716 860584
62240H60584j3383j0566p488m930l394l142l772m045k952r82K09l26j636j852
$$ 860584 847201 836635 829147 824217 820823 817681 813909 809864 806912 805930 806139 805813 804177 802325
62226H02325j67K613N303P390Q707Q930Q171P577Q369J0317J2044J2927J3804
$$ 802325 802158 804771 810074 817464 826171 835101 843272 850849 859218 869535 881579 894506 908310
62213I08310J5614J8212K0979K3753K6562K9089L1167L3292L6101L9646M3687
$$ 908310 923924 942136 963115 986868 1013430 1042519 1073686 1106978 1143079 1182725 1226412
62202A226412M8199N3001N7531O1796O6966P3951Q1656Q7818R1598R4264R7011
$$ 1226412 1274611 1327612 1385143 1446939 1513905 1587856 1669512 1757330 1848928 1943192 2040203
62191B040203R9141R8885R5269Q8525P9169O7440N3649L8619K3588R608l020j4747
$$ 2040203 2139344 2238229 2333498 2422023 2501192 2568632 2622281 2660900 2684488 2694096 2691076 2676329
62179B676329k6209l7859n0070o2904p5270q4873r0022r1421r1322r0978q9739
$$ 2676329 2650120 2612261 2562191 2499287 2424017 2339144 2249122 2157701 2066379 1975401 1885662
62168A885662q6736q2401p7874p3655o9355o4365n8421n2055m6636m3275m1412
$$ 1885662 1798926 1716525 1638651 1564996 1495641 1431276 1372855 1320800 1274164 1230889 1189477
62157A189477l9254l5840l1865k8101k4227k0057j6727j5336j5139j4462j2953
$$ 1189477 1150223 1114383 1082518 1054417 1030190 1010133 993406 978070 962931 948469 935516
62146I35516j1493j0231q373o005m439m214m154l084j307L69J942L605M832N190
$$ 935516 924023 913792 905419 899414 894975 890761 886607 883523 882216 882585 884527 888132 892964 898154
62132H98154N402O398P867Q945R892J1820J4816J7602J9260K0153K0818K1024
$$ 898154 903556 909954 917821 926766 936658 948478 963294 980896 1000156 1020309 1041127 1062151
62120A062151K0525J9926K0127K1294K2866K4260K5193K5793K6712K8698L1762
$$ 1062151 1082676 1102602 1122729 1144023 1166889 1191149 1216342 1242135 1268847 1297545 1329307
62109A329307L5217L8835M3305M9027N5069O0123O4110O7921P1709P4270P4193
$$ 1329307 1364524 1403359 1446664 1495691 1550760 1610883 1674993 1742914 1814623 1888893 1963086
62098A963086P1022O5116N6947M6763L4627K0843O592o070j5598k2467k8775l6187
$$ 1963086 2034108 2099224 2156171 2202934 2237561 2258404 2264996 2258926 2243328 2220861 2192086 2155899
62086B155899m4548n2346n7968o0631o0817n9861n8581n6367n2355m7198m2509
$$ 2155899 2111351 2059005 2001037 1940406 1879589 1819728 1761147 1704780 1652425 1605227 1562718
62075A562718l8498l3695k7403k0903j5421j0477n492j573O0L28R33J524M49k025
$$ 1562718 1524220 1490525 1463122 1442219 1426798 1416321 1410829 1409256 1409316 1409644 1410577 1412101 1412550 1410525
62061A410525l845m653o447r860j2372j1837r796r208j0306j0993j0490j0312
$$ 1410525 1406680 1402027 1395580 1385720 1373348 1361511 1351715 1342507 1332201 1321208 1310718 1300406
62049A300406j1681j3958j5913j6955j6800j5316j3137j1279r707p295l705k80
$$ 1300406 1288725 1274767 1258854 1241899 1225099 1209783 1196646 1185367 1175660 1168365 1164660 1164380
62037A164380J529J882K063K839L965M919N535O074O956Q227R230R162Q231P804
$$ 1164380 1165909 1167791 1169854 1172693 1176658 1181577 1187112 1193186 1200142 1208369 1217599 1226761 1234992 1242796
62023A242796R144J2103J5270J7252J7986J8909K1666K6244L0745L3461L4754
$$ 1242796 1251940 1264043 1279313 1296565 1314551 1333460 1355126 1381370 1412115 1445576 1480330
62012A480330L6018L7415L8030L8126L9511M3071M7374N0571N2470N3863N4946
$$ 1480330 1516348 1553763 1591793 1629919 1669430 1712501 1759875 1810446 1862916 1916779 1971725
62001A971725N5590N6132N6517N5361N1306M4816L7215K8512J7825N824n185j4032
$$ 1971725 2027315 2083447 2139964 2195325 2246631 2291447 2328662 2357174 2374999 2380823 2375638 2361606
61989B361606k1970l0603l9868m8782n6937o4249p0039p3496p4632p4099p2400
$$ 2361606 2339636 2309033 2269165 2220383 2163446 2099197 2029158 1955662 1881030 1806931 1734531
61978A734531o9907o7185o4698o2477o0463n8530n5803n0883m3775l6875l2752
$$ 1734531 1664624 1597439 1532741 1470264 1409801 1351271 1295468 1244585 1200810 1163935 1131183
61967A131183l1295l0237k8330k6519k5740k5111k3210k0165j7419j5880j5318
$$ 1131183 1099888 1069651 1041321 1014802 989062 963951 940741 920576 903157 887277 871959
61956H71959j5211j5232j4926j3838j2206j0969j0697j0856j0458r130p325n647
$$ 871959 856748 841516 826590 812752 800546 789577 778880 768024 757566 748436 741111 735464
61944G35464m276l049j990j510j880k438j848M16L118M415L863K524J275J2j248
$$ 735464 731188 728139 726149 724639 722759 720321 718473 718889 722007 726422 730285 732809 734084 734096 732848
61929G32848j733j186p46j455k697l411m101n984q460r519q845q445r388r912
$$ 732848 731115 729929 729183 727728 725031 721620 717519 711535 703075 693556 684711 676266 666878 656966
61915F56966q212n526m538n651o852o756n911n157m534m003l806l689l088k443
$$ 656966 648754 643228 638690 633039 626187 619431 613520 608363 603829 599826 596020 592331 589243 586800
61901E86800k908m370n114m098k290r45Q1J321K229K223K261L629N541N761L830
$$ 586800 583892 579522 574408 570310 568020 567075 567156 568477 570706 572929 575190 578819 584360 590121 593951
61886E93951K099K847N593Q138R448J0264J1194J1589J0892J0217J1334J4174
$$ 593951 596050 598897 604490 612628 622076 632340 643534 655123 666015 676232 687566 701740
61874G01740J6344J5814J3283J1153J0587J0743J0665J0511J0533J0092Q590O573
$$ 701740 718084 733898 747181 758334 768921 779664 790329 800840 811373 821465 830055 836628
61862H36628N069M259L582K652J355m62k602m176m477l874l101j997O2K748M920
$$ 836628 841697 845956 849538 852190 853545 853083 850481 846305 841828 837954 834853 832856 832918 835666 840586
61847H40586O127P110Q636J0632J2571J3880J3907J2324R742P187M876K304m37
$$ 840586 846713 853823 862459 873091 885662 899542 913449 925773 935515 942702 947578 949882 949445
61834I49445k471l559m604o266q034r219r966j0589j0848j0728j0962j1730j1702
$$ 949445 946974 943415 938811 932545 924511 915292 905326 894737 883889 873161 862199 850469 838767
61821H38767r801p417p189r565j2083j2482j1281j0512j0926j1358j0461q229
$$ 838767 828966 821549 814360 804795 792712 780230 768949 758437 747511 736153 725692 717463
61809G17463n902m816n239o168o350n567m587l830k730n79K524N991R377J2178
$$ 717463 711561 706745 701506 695338 688988 683421 678834 675004 672274 671695 674219 680210 689587 701765
61795G01765J3689J3810J3684J4599J6455J8076J9030K0146K1984K3692K3905
$$ 701765 715454 729264 742948 757547 774002 792078 811108 831254 853238 876930 900835
61784I00835K2318J9817J7422J5513J3856J2035R898P661N454K948k3k645l842
$$ 900835 923153 942970 960392 975905 989761 1001796 1011694 1019355 1024809 1027757 1027734 1025089 1021247
61771A021247l870m051m571l925j505O92O22n19K93L532O497P293P092P416P327
$$ 1021247 1017377 1013326 1008755 1004830 1003325 1004017 1004639 1004120 1004413 1007945 1014442 1021735 1028827 1036243 1043570
61756A043570N118J274k173m621p291j0955j4862j8044k0270k1507k1551k0467
$$ 1043570 1048688 1049962 1047789 1043168 1035877 1024922 1010060 992016 971746 950239 928688 908221
61744I08221j8631j6242j3608j1804j1864j3219j4043j3489j2592j2508j2843
$$ 908221 889590 873348 859740 847936 836072 822853 808810 795321 782729 770221 757378
61733G57378j2511j1461j0681j0758j1146j0776r109o590m313l033k507k006j342
$$ 757378 744867 733406 722725 711967 700821 690045 680936 674346 670033 667000 664493 662487 661145
61720F61145j018j376k183l026l637l752l302k741k526k288j325L1M94l03j074
$$ 661145 660127 658751 656568 653542 649905 646153 642851 640110 637584 635296 633971 634002 634496 634193 633119
61705F33119n29R75K164K558K655K871K928K285Q93k90J86K502M608M238J842
$$ 633119 632590 633565 635729 638287 640942 643813 646741 649026 649919 649629 649815 652317 656925 661163 663005
61690F63005J7k34o20k128k949j570P8o52k692k614O7K107J359o49j725j876j840
$$ 663005 663022 662788 662168 660040 657091 655521 655599 654947 652255 649641 649708 651815 653174 652525 650800 648924 647084
61673F47084j156N12J917J914J344J560K229K266J938K185K543J744L9q95m61
$$ 647084 645928 646440 648357 650271 651615 653175 655404 657670 659608 661793 664336 666080 666119 665224 664763
61658F64763N7m86j480j338O83L638N348M170J054q50K90K520K522j7k345k755
$$ 664763 664820 664334 662854 661516 662199 665837 671185 675355 676409 675559 675849 678369 680891 680874 678529 675774
61642F75774k545l305m354m230l230k907l761m811n112m668m026l690l860m202
$$ 675774 673229 669924 665570 661340 658110 655203 651442 646631 641519 636851 632825 629135 625275 621073
61628F21073m095l377k565k086j921k262l631n749p114o528m462k245n11P59J421
$$ 621073 616978 613601 611036 608950 607029 604767 601136 595387 588273 581745 577283 575038 574527 575286 576707
61613E76707J430J364J543J131o40k748l344k340j545j951k406j488M74K034K290
$$ 576707 578137 579501 581044 582175 581535 578787 575443 573103 571558 569607 567201 565713 566187 568221 570511
61598E70511J284l99j703j572j14J252J530J405K049L271L787L011J621N23J8
$$ 570511 571795 571396 569693 568121 568007 569259 570789 572194 574243 577514 581301 584312 585933 586456 586474
61583E86474o6k2n5O7Q91K299L065K174L61o20j58P34J164J396J807J873J014
$$ 586474 586408 586386 586331 586398 587289 589588 592653 594827 595188 594568 594410 595144 596308 597704 599511 601384 602398
61566F02398l73j437j974k288k527k905l962n579o247m689k087j125k582m357
$$ 602398 602025 600588 598614 596326 593799 590894 586932 581353 575106 570417 568330 567205 564623 560266
61552E60266m546l899m011m512l902k441k055l373m782m980m658m952n700o231
$$ 560266 555720 551821 547810 543298 539396 536955 534900 531527 526745 521765 517107 512155 506455 500224
61538E00224o554o660n869m174l146m006n640o128n396m649l929k441r16j115
$$ 500224 493670 487010 481141 476967 473821 469815 464175 458047 452651 448002 444073 441632 440716 439601
61524D39601k793l606k707k058l068m189l508j846j258j857k133j547p84o9P74
$$ 439601 436808 433202 430495 428437 425369 421180 417672 415826 414568 412711 410578 409031 408247 408178 408952
61509D08952J048j18j876k210n19J712K810K307O82q24m86K135M838M964K889
$$ 408952 410000 409882 408006 405796 405277 406989 409799 412106 412788 411964 411478 413613 418451 423415 426304
61494D26304J378J422J146n29j745p30J252J957J523J560K009J360m30j526r13
$$ 426304 427682 429104 430250 429721 427976 427246 428498 430455 431978 433538 435547 436907 436477 434951 434038
61479D34038M10J207J318Q00n99k305k601o15K134L215J942j50j151l90J399K739
$$ 434038 434448 435655 436973 437773 437174 434869 432268 431653 433787 437002 438944 438794 437643 437253 438652 441391
61463D41391K346J57k348l420k719j370l17N68J493J703M24j590k614k161j452
$$ 441391 443737 443894 441546 438126 435407 434037 433720 434288 435781 437484 437908 436318 433704 431543 430091
61448D30091j397j287l04Q06R18O52J641L856N338M832L185J597M4j635k475j646
$$ 430091 428694 427407 427103 427909 428827 429479 431120 434976 440314 445146 448331 449928 449972 448337 445862 444216
61432D44216j15L98k36n89J43J211J674J479R50J75n95p09J65J473K355K452J952
$$ 444216 444101 444499 444263 443674 443817 445028 446702 448181 449131 449306 448711 448002 448167 449640 451995 454447 456399
61415D56399J209P05J021K313L840M350L179Q95j154j968j628r30m52j00L92P89
$$ 456399 457608 458313 459334 461647 465487 469837 473016 473911 472757 470789 469161 468231 467779 467679 468071 468860
61399D68860M68p88k352l184k753j458j30P71J350J782K062K344K974L687L422
$$ 468860 469328 468540 466188 463004 460251 458793 458663 459434 460784 462566 464628 466972 469946 473633 477055
61384D77055J765K13P56L118M700L728J345j69k55j6l4K99J300K091J644J38j192
$$ 477055 478820 479033 479789 482907 487607 491335 492680 492511 492256 492240 492206 492505 493805 495896 497540 497678 496486
61367D96486j333n03Q8n16j899k671k019m67J061K256L101L293K765K253K459
$$ 496486 495153 494650 494738 494222 492323 489652 487633 487166 488227 490483 493584 496877 499642 501895 504354
61352E04354K926K654J639Q27O53N93L11K59O89Q85K4j558k562k172r77l77j123
$$ 504354 507280 509934 511573 512400 513053 513646 513957 514216 514905 515790 515814 514256 511694 509522 508545 508168 507045
61335E07045k524l230k707j629q44m51j03L86R81J453J156m05k248k261K50L245
$$ 507045 504521 501291 498584 496955 496111 495660 495557 495943 496924 498377 499533 499128 496880 494619 494869 498114
61319D98114M389L933L632L638K650R94R99L505O007N762L317J423J385K063K062
$$ 498114 502503 506436 510068 513706 516356 517350 518349 521854 527861 533623 536940 538363 539748 541811 543873
61304E43873J512J456K402L725M258L483K287K014K815L540L585L820N041O384
$$ 543873 545385 546841 549243 552968 557226 560709 562996 565010 567825 571365 574950 578770 583811 590195
61290E90195O370N040M010M424N771O697O405N152L795K944K536K375K891M584
$$ 590195 596565 601605 605615 610039 615810 622507 628912 634064 637859 640803 643339 645714 648605 653189
61276F53189O585O985N264L318L043L745L396J682K18j07j49o49j023o85j82j50
$$ 653189 659774 666759 672023 675341 678384 682129 685525 687207 687425 687318 687169 686520 685497 684812 684630 684480
61260F84480j99K96J060J542K010L074M594N966P209Q889J0990J2637J2970J1856
$$ 684480 684281 684577 685637 687179 689189 692263 696857 702823 710032 718921 729911 742548 755518 767374
61246G67374R931Q388Q388R977J1783J2383J1808J1026J0230Q717O381M094K304
$$ 767374 777305 785693 794081 804058 815841 828224 840032 851058 861288 870005 876386 880480 882784
61233H82784L85j950l655l787l218l740n809q186r692j0193r911q840p285o170
$$ 882784 883169 881219 877564 873777 870559 866819 861010 852824 843132 832939 823028 814188 806903 800733
61219H00733o118o566o226m374j595N59Q84k13j011n93j06j040k609k379L02L136
$$ 800733 794615 788049 781823 777449 775854 776413 777297 777084 776073 775480 775374 774334 771725 769346 769648 772784
61203G72784L890L212L151M026M290L081J398O83J315K607L436K904J212j43J09
$$ 772784 776674 779886 783037 787063 791353 794434 795832 796515 797830 800437 803873 806777 807989 807846 807955
61188H07955J393K086J840K064L767O033P166O596N030L298J769O26O6M0J13k37
$$ 807955 809348 811434 813274 815338 819105 825138 832304 838900 843930 847228 848997 849623 849689 849729 849842 849605
61172H49605j066j753j559m64P69J496J784K054K622L846N913Q151R341R267R041
$$ 849605 848539 846786 845227 844763 845532 847028 848812 850866 853488 857334 863247 871398 880739 890006 899047
61157H99047R253R018P958P733R718J2190J2214R867Q092Q326Q926Q467P889Q186
$$ 899047 908300 917318 925276 933009 942727 954917 967131 976998 985090 993416 1002342 1010809 1018698 1026884
61143A026884Q381P469O435O496O997O970P327R290J1684J2125J0380Q375P170
$$ 1026884 1035265 1042734 1049169 1055665 1062662 1069632 1076959 1086249 1097933 1110058 1120438 1128813 1135983
61130A135983O051M631L720L711L816L451K980K517J310r43l291m716n320n744
$$ 1135983 1142034 1146665 1150385 1154096 1157912 1161363 1164343 1166860 1168170 1167227 1163936 1159220 1153900 1148156
61116A148156o190o530o687o465n692n015n667p689r102p906m700k329k869n642
$$ 1148156 1141966 1135436 1128749 1122284 1116592 1111577 1105910 1098221 1089119 1081213 1076513 1074184 1071315 1065673
61102A065673q420r849j0203j0259j0238j0007r657r449r414r415r444r528r530
$$ 1065673 1057253 1047404 1037201 1026942 1016704 1006697 997040 987591 978177 968762 959318 949790 940260
61089I40260r397r386r508r079p508n443m312m714o007p384q340q129o094l040
$$ 940260 930863 921477 911969 902890 895382 889939 885627 880913 874906 867522 859182 851053 844959 841919
61075H41919j011r93j783j803j000j68N54J476K498L558N158P533R987J1993J4104
$$ 841919 840908 839915 838132 836329 835329 835161 835715 837191 839689 843247 848405 855938 865925 877918 892022
61060H92022J6688J8762J9453J9732K1085K3154K4360K4428K4552K5366K6446
$$ 892022 908710 927472 946925 966657 987742 1010896 1035256 1059684 1084236 1109602 1136048
61049A136048K7609K8930K9529K8293K6000K4758K4973K4634K2257J8813J5887
$$ 1136048 1163657 1192587 1222116 1250409 1276409 1301167 1326140 1350774 1373031 1391844 1407731
61038A407731J3514J0832P643M317J162j410l046m511p330j1525j4943j5859j5210
$$ 1407731 1421245 1432077 1439720 1444037 1445199 1443789 1440743 1436232 1428902 1417377 1402434 1386575 1371365
61025A371365j5081j5976j6949j7571j8143j8310j7132j4753j2779j2516j3465
$$ 1371365 1356284 1340308 1323359 1305788 1287645 1269335 1252203 1237450 1224671 1212155 1198690
61014A198690j3880j2476r536o572m915m337l336q59K595N856Q396J0315J1617
$$ 1198690 1184810 1172334 1162798 1156226 1151311 1146974 1143638 1142779 1145374 1151230 1159626 1169941 1181558
61001A181558J2402J3446J5648J8721K1313K2662K3617K5546K8654L1989L4961
$$ 1181558 1193960 1207406 1223054 1241775 1263088 1285750 1309367 1334913 1363567 1395556 1430517
60990A430517L8126M2065M6117M9101N1209N4098N8702O3914O8183P1659P5647
$$ 1430517 1468643 1510708 1556825 1605926 1657135 1711233 1769935 1833849 1902032 1973691 2049338
60979B049338Q0489Q5366R0030R5348J01823J08648J14811J20402J26376J33538
$$ 2049338 2129827 2215193 2305223 2400571 2502394 2611042 2725853 2846255 2972631 3106169
60969C106169J42178J52300J63985J77622J93679K12101K32464K55216K82034
$$ 3106169 3248347 3400647 3564632 3742254 3935933 4148034 4380498 4635714 4917748
60960D917748L14250L51730L94222M42843M98944N62560O33560P13212Q02865
$$ 4917748 5231998 5583728 5977950 6420793 6919737 7482297 8115857 8829069 9631934
60951I631934R03009J016352J149260J305538J481088J670759J874673K078697
$$ 9631934 10534943 11551295 12700555 14006093 15487181 17157940 19032613 21111310
60943B1111310K219585K189501J908571J408107Q32371L46443M0973q0809n3802
$$ 21111310 23330895 25520396 27428967 28837074 29669445 30015888 30056861 29976052 29922250
60934B9922250P6024K28301K76033J01167l18180q79287j419535j813659k021882
$$ 29922250 29998274 30226575 30502608 30603775 30285595 29406308 27986773 26173114 24151232
60925B4151232k070743k009916j885913j735168j581714j435737j297563j165057
$$ 24151232 22080489 20070573 18184660 16449492 14867778 13432041 12134478 10969421
60917A0969421j037625r16120q02511o99705o09792n32446m66248m10725l65514
$$ 10969421 9931796 9015676 8213165 7513460 6903668 6371222 5904974 5494249 5128735
60908E128735l28499k96789k69058k45123k23858k03650j84620j68113j54052
$$ 5128735 4800236 4503447 4234389 3989266 3765408 3561758 3377138 3209025 3054973
60899C054973j41035j29096j19902j13629j08004j01338r4452q8570q3272p7884
$$ 3054973 2913938 2784842 2664940 2551311 2443307 2341969 2247517 2158947 2075675 1997791
60889A997791p3053o9242o5125n9401n3157m8515m5581m2615l8923l5748l4138
$$ 1997791 1924738 1855496 1790371 1730970 1677813 1629298 1583717 1541102 1502179 1466431 1432293
60878A432293l3511l2798l1829l0942l0063k8834k7261k5788k4866k4615k4720
$$ 1432293 1398782 1365984 1334155 1303213 1273150 1244316 1217055 1191267 1166401 1141786 1117066
60867A117066k4610k3934k2967k2266k1910k1265j9677j7263j4955j3668j3435
$$ 1117066 1092456 1068522 1045555 1023289 1001379 980114 960437 943174 928219 914551 901116
60856I01116j3471j3082j2324j1562j0717r387p611n941m669l486k235j488j942
$$ 901116 887645 874563 862239 850677 839960 830573 822962 817021 812352 808866 806631 805143 803201
60843H03201l310m245l544j380Q29J867J966K269L162L813L558K924K511J620
$$ 803201 799891 795646 792102 790722 791551 793418 795384 797653 800815 804628 808186 811110 813621 815241
60829H15241q99m671p940r647j0217j0155r187p381n909n757o396o705o589o741
$$ 815241 814342 809671 801731 792084 781867 771712 762525 755144 749235 743478 737082 730377 723788 717047
60815G17047p135o859n552m141l848m801n932o070n044l728l030k844k325j138
$$ 717047 709912 703053 697501 693360 689512 684711 678779 672709 667665 663937 660907 658063 655738 654600
60801F54600j50m76k030l298k682j47K464K985J028j632l061l203l363m045m275
$$ 654600 654450 653974 651944 648646 645964 645817 648281 651266 652294 650662 647601 644398 641035 636990 632715
60786F32715l203j287N34J952K956L116K165R12N46J037R69o46k941m044l231
$$ 632715 629512 628225 628759 630711 633667 636783 638948 639860 640406 641443 642412 641766 638825 634781 631550
60771F31550j912k140m248o307o183l771q57Q69J008k3j620k930l146k404j740
$$ 631550 629638 627498 623250 616943 610760 606989 606132 607001 608009 607986 606366 603436 600290 597886 596146
60756E96146j712j645q02K33J45j451l524m703m465l377k513k480k879k992k906
$$ 596146 594434 592789 591987 592220 592365 590914 587390 582687 578222 574845 572332 569852 566973 563981 561075
60741E61075l331m189m350l432k825l951o062p029o063m445l567l378l109k541
$$ 561075 557744 553555 549205 545773 542948 538997 532935 525906 519843 515398 511831 508453 505344 502803
60727E02803k013j785j896k239k561k619k491k342j897p11R14K014K225K293K889
$$ 502803 500790 499005 497109 494870 492309 489690 487199 484857 482960 482249 483163 485177 487402 489695 492584
60712D92584L660M031M323N117N911N572M066K689K216J970J297R29J755K940
$$ 492584 496244 500275 504598 509715 515626 521198 525264 527953 530169 532139 533436 534365 536120 539060
60698E39060K677P23j205j870j926k257k244r62Q26J487J003R85K053K804J994
$$ 539060 541737 542460 541255 539385 537459 535202 532958 531996 532822 534309 535312 536297 538350 541154 543148
60683E43148L59o65j041j739k901l610l350k621k061j805j876k501l668m898n704
$$ 543148 543507 542842 541801 540062 537161 533551 530201 527580 525519 523714 521838 519337 515669 510771 505067
60668E05067o020n961n480m430k888j259j85k19j344k750l471l325k955k816k440
$$ 505067 499047 493086 487606 483176 480288 479029 478844 478625 477281 474531 471060 467735 464780 461964 459524
60653D59524j130P86J963J570M59K57J372K460K151P47k19J87J488K615K941K503
$$ 459524 458394 459180 461143 462713 463172 463429 464801 467261 469412 470159 469940 470127 471615 474230 477171 479674
60637D79674J852J716K374L224L480L205L123L385L319K577J706J240J038R75
$$ 479674 481526 483242 485616 488840 492320 495525 498648 502033 505352 507929 509635 510875 511913 512888
60623E12888J529K904M185M179K808J020l42r64o97M53K077L616M704M947L842
$$ 512888 514417 517321 521506 525685 528493 529513 529171 528207 527510 527963 530040 533656 538360 543307 547149
60608E47149J567n81j489j626k349l940n325n627n004l919k604j441r30r07o73
$$ 547149 548716 548135 546646 545020 542671 538731 533406 527779 522775 518856 516252 514811 513881 512974 512301
60593E12301j21J34J15Q12K503L782L337J965J532K313K745J862O07K24L97j24
$$ 512301 512180 512314 512429 513241 515744 519526 522863 524828 526360 528673 531418 533280 533887 534111 534508 534384
60577E34384j657l181l727l464l373m175n577o280m996k001N43O12j308k683k089
$$ 534384 532727 529546 525819 522355 518982 514807 509230 502950 497954 495953 496496 497108 495800 493117 491028
60562D91028p97n57r25j94J670K885K599J950J824J440K56l42J045L233L774K336
$$ 491028 490231 489674 488749 488555 490225 493110 495709 497659 499483 500923 501179 500837 501882 505115 508889 511225
60546E11225R07O57N82l56j486j660r90l03K17R52K003L130L990M002K741R90
$$ 511225 512132 512789 513371 513015 511529 509869 508879 508576 508793 509745 511748 514878 518868 522870 525611 526601
60530E26601M78J691K805J870n82k234j804pJ928L316L748L242K819L705N610
$$ 526601 527079 528770 531575 533445 532863 530629 528825 528818 530746 534062 537810 541052 543871 547576 553186
60515E53186O935P079P204Q206R284R587R976J1712J4145J5390J4935J3948J2976
$$ 553186 560121 567200 574404 582610 591894 601481 611457 623169 637314 652704 667639 681587 694563
60502F94563J1017P412L248K7k074l692m781m727l586k187j164n80l66l44K20
$$ 694563 705580 712992 716240 716267 714193 710501 705720 700993 697407 695220 694056 693476 693110 692766 692986
60487F92986K341O209J0652J3921J4983J4313J3627J4561J7232K0162K1799K1630
$$ 692986 695327 701536 712188 726109 741092 755405 769032 783593 800825 820987 842786 864416
60475H64416J9576J5334R344L665K58j408l457o248p702o686n129n464p302q332
$$ 864416 883992 899326 908670 912335 912593 911185 907728 901480 893778 887092 881963 876499 869197 860865
60461H60865p613o085m359k159J3P73J39K41K611N974Q060Q797J0188J3353J7085
$$ 860865 853252 847167 842808 840649 840662 841435 841574 841815 844426 850400 858460 867257 877445 890798 907883
60446I07883J9646K0915K2284K5082K9619L5262M0802M4939M7077M7827M8390
$$ 907883 927529 948444 970728 995810 1025429 1060691 1101493 1146432 1193509 1241336 1289726
60435A289726M9251M9595M8089M4053L7734K9695K0295R783j406j2689k3613l3934
$$ 1289726 1338977 1388572 1436661 1480714 1518448 1548143 1568438 1578221 1576815 1564126 1540513 1506579
60423A506579m3358n1106n5956n7163n5564n3365n2279n1962n0709m7499m2797
$$ 1506579 1463221 1412115 1356159 1298996 1243432 1190067 1137788 1085826 1035117 987618 944821
60412I44821l7588l2561k8390k5679k4130k2462j9968j7561j6399j6010j4792
$$ 944821 907233 874672 846282 820603 796473 774011 754043 736482 720083 704073 689281
60401F89281j2236r618q310q204q201p592o578n736n466n787o371o684o256n039
$$ 689281 677045 667427 659117 650913 642712 635120 628542 622806 617340 611553 605182 598498 592242 587203
60387E87203l661l154l965n225n551m639l479k743j934p25p1q32j980j682m1Q56
$$ 587203 583542 580388 576423 571198 565647 561008 557529 554786 552852 552127 552056 551224 549244 547562 547521 548377
60371E48377j50j766k217j500p89n21j89M55J022J181J015O99K50k68o77p34k29
$$ 548377 548227 546461 544244 542744 541955 541434 541245 541700 542722 543903 544918 545617 545867 545599 544922 544188 543959
60354E43959P09J287N80j220k475j668Q46L162L865L334K956L464M292M505M026
$$ 543959 544668 545955 546535 545315 542840 541172 542018 545180 549045 552379 555335 558799 563091 567596 571622
60339E71622L707M123M686M438L462K844L107L468L059K325K438L575M516M144
$$ 571622 575329 579452 584138 588576 592038 594882 597989 601457 604516 606841 609279 612854 617370 621514
60325F21514K896K420L701N711O234M283J444K92J528L436M224L973L803M000
$$ 621514 624410 626830 630531 636242 642476 646759 648203 648495 650023 653459 657683 661656 665459 669459
60311F69459M039L848L882M040L634K701K313L085M169M466M221M651O219Q053
$$ 669459 673498 677346 681228 685268 688902 691603 693916 697001 701170 705636 709857 714508 720727 728780
60297G28780R095R218R025R116R751J0784J1568J1298R920Q410P678P284N857
$$ 728780 737875 747093 756118 765234 774985 785769 797337 808635 818555 826965 834643 841927 847784
60284H47784K842q51m130o914r482j1228j1200r723q503q599r101q490o809n594
$$ 847784 850626 849775 845645 838731 829249 818021 806821 797098 788595 779996 770895 762405 755596 750002
60270G50002n765o476o421n590n068n322n402m114j564R49K387K992L740N091
$$ 750002 744237 737761 731340 725750 720682 715360 709958 705844 704280 705229 707616 710608 714348 719439
60256G19439O519P313P576Q279J0205J3056J5886J8256K0489K2689K4160K4107
$$ 719439 725958 733271 740847 749126 759331 772387 788273 806529 827018 849707 873867 897974
60244H97974K2432J9429J5257J0459O193K799j372q098j6308k2632k5343k6023
$$ 897974 920406 939835 955092 965551 971744 974543 973171 965073 948765 926133 900790 874767
60232H74767k6569k6363k3969k0113j7082j5691j4700j2895j0254p244m484k978
$$ 874767 848198 821835 797866 777753 760671 744980 730280 717385 707131 699887 695403 692425
60220F92425l178l877l376j777o90p18q21m13l90j408k659l145l035k993l119
$$ 692425 689247 685370 681994 680217 679527 678809 677988 677575 677185 675777 673118 669973 666938 663945 660826
60205F60826l240l310l034k051r65j042k361l475l476l088k983k428q30P65J114
$$ 660826 657586 654276 651242 649191 648226 647184 644823 641348 637872 634784 631801 629373 628543 629308 630422
60190F30422O86O71Q79K96q44j151l4J771L485M859N565N291M447L827L505K971
$$ 630422 631108 631779 632658 632954 632110 630959 630925 632696 636181 641040 646605 651896 656343 660170 663675 666646
60174F66646K220J758J648J532J509J939K434K066Q30j22jO77R49O19J88O5K19
$$ 666646 668866 670624 672272 673804 675313 677252 679686 681752 682582 682460 682459 683136 684085 684704 684892 684957 685176
60157F85176M81J059K552N082P412P854O398N056N326O310O451O102O773Q416
$$ 685176 685657 686716 689268 694350 701762 709616 716014 721070 726396 732706 739157 745259 752032 760448
60143G60448R385R051Q622Q929R165Q579P947Q265R005Q875P834P142P485P977
$$ 760448 769833 778884 787506 796435 805600 814179 822126 830391 839396 848271 856105 863247 870732 878709
60129H78709P299N339L202J663K22j757l450l349j773j119k769n120n949n442
$$ 878709 886008 891347 894549 896212 896434 894677 891227 887878 886105 884986 882217 877097 871148 865706
60115H65706n149n126m496m148n977r254j0609q527n479m251m368l809k420j603
$$ 865706 860557 855431 850935 846787 840810 831556 820947 812420 806941 802690 798322 794513 792093 790490
60101G90490j768k133k346k652k882k681k375k400k306j425m3J119J985K688K674
$$ 790490 788722 786589 784243 781591 778709 776028 773653 771253 768947 767522 767479 768598 770583 773271 775945
60086G75945J552K14k38j99p85j737j658j79J694L298M837O047O009M784L864
$$ 775945 777497 777711 777473 777274 776489 774752 773094 772915 774609 777907 782744 788791 794800 799584 803448
60071H03448M254N175N367M753M119L951M195M574M541L571K030J276K292M471
$$ 803448 807702 812877 818244 822997 827116 831067 835262 839836 844377 847948 849978 851254 853546 858017
60057H58017O164O208M796L182K673L457M343M052K705J475Q96N11R3P4M05K71
$$ 858017 864181 870389 875185 878367 881040 884497 888840 892892 895597 897072 897968 898479 898572 898646 899051 899322
60041H99322m39n59N47J681J467M01j55l70j601l826n161m440k840k210k828l733
$$ 899322 898883 898324 898871 900552 902019 902420 902265 901895 900294 896468 891307 886867 884027 881817 878989 875256
60025H75256m463n352o363o645n542l620k390k914m602n519m271j639J60j40j744
$$ 875256 870793 865441 859078 852433 846891 843271 840881 837967 833365 827846 823575 821936 822096 821956 820212
60010H20212l260m367n443o338o588o475o708p162p091o744p385r161j0199q921
$$ 820212 816952 812585 807142 800804 794216 787741 781033 773871 766780 760036 752651 743490 733291 724370
59996G24370o402n034n349n634m664l288k791k974k777j933r51L6J295K602L370
$$ 724370 717968 712934 707585 701951 697287 693999 691208 688234 685457 683524 682573 682609 683904 686506 689876
59981F89876L763M656O169P133O624N354M798N214N452M735L808L815M619M928
$$ 689876 693639 698295 704464 711597 718221 723575 728373 733587 739039 743774 747582 751397 756016 760944
59967G60944M015K592J678J073l25k793n147o190o273o722p908q703q228p286
$$ 760944 764959 767551 769229 770302 769977 767184 762037 755847 749574 742852 734944 726241 718013 710727
59953G10727p327q376q977q278p254p259q079q293p308o050n463n306m902m346
$$ 710727 703400 695024 686047 677769 670515 663256 655177 646884 639576 633526 628063 622757 617855 613509
59939F13509m109l884k870j175J09N16R76K277L537L250J554K45M45J359J789
$$ 613509 609400 605516 602646 601471 601580 602096 603072 605349 608886 612136 613690 613935 614380 615739 617528
59924F17528J874K436L268L315K311J212P47M97j84j059j305n07R52K169K184
$$ 617528 619402 621838 625106 628421 630732 631944 632691 633188 633004 631945 630640 630133 631085 633254 635438
59909F35438P91q47j078K10J249O12j000k006k091j891j259M36K410K711P64j667
$$ 635438 636229 635382 634304 634514 635763 636375 635375 633369 631278 629387 628128 628564 630974 633685 634449 632782
59893F32782k638j903k50J661K934K418K66j499j250J67R07P95R29J182J18k361
$$ 632782 630144 628241 627991 629652 632586 635004 635270 633771 632521 632688 633595 634390 635319 636501 636619 634258
59877F34258m058l048j58K148K676K442K828L774M114L336K285J927K083K116
$$ 634258 630200 627152 626994 629142 631818 634260 637088 640862 644976 648312 650597 652524 654607 656723
59863F56723K307L330M555M537L533L748O041Q083P284M172J117r63k509l029
$$ 656723 659030 662360 666915 671452 674985 678733 684774 692857 700141 704313 705430 704467 701958 698929
59849F98929j635N25J238P20J462L970N500M144J763J166K383L553L947M166M385
$$ 698929 697294 697819 699057 699777 701239 705209 710709 714853 716616 717782 720165 723718 727665 731831 736216
59834G36216M285M121M299M446M166M105N047O452P101O705N839M956M537N432
$$ 736216 740501 744622 748921 753367 757533 761638 766685 773137 780238 786943 792782 797738 802275 807707
59820H07707P758R981J0411R187P604O120M285K209N84m13r92r04r7K49j042l131
$$ 807707 815465 825446 835857 845044 852648 858768 863053 865262 865846 865433 864441 863537 863440 863689 862647 859516
59804H59516l985l070j645m78Q21K134K474J918K071L809O049P603Q704R584R054
$$ 859516 855531 852461 850816 850338 851159 853293 855767 857685 859756 863565 869614 877217 885921 895505 904559
59789I04559O030J662j618k710k374j571o50q6q26l300o574q944r364q402p738
$$ 904559 910589 912251 910633 907923 905549 903978 903328 903242 902416 899116 892542 883598 874234 865832 858094
59774H58094q426r667r738q169o219n059m289k905j039Q6m02k234m447o029o386
$$ 858094 849668 840001 830263 822094 815875 810816 806527 803622 802583 802669 802267 800033 795586 789557 783171
59759G83171n694m612l485k155q76o53j961l688m442m469n103o303o227l856q94
$$ 783171 777477 772865 769380 767225 766349 765696 763735 760047 755605 751136 746033 739730 733503 729647 728753
59744G28753Q7j257k859k951j805o93k04j63m22r15j217q84j55K25m5n09o04k27
$$ 728753 728840 727583 724724 721773 719968 719275 719071 718908 718486 717571 716354 715470 715315 715540 715495 714986 714382 714155
59726G14155K83L80l18j385j561j73J658K236J635J596K747L459K205j70j698
$$ 714155 714438 714818 714500 713115 711554 711381 713039 715275 716910 718506 721253 724712 726917 726747 725049
59711G25049j729r37K07J478K062J366L73O65K240L761M736N767O638O106M229
$$ 725049 723320 722383 722590 724068 726130 727496 727869 728534 730774 734535 739271 745038 751676 757782 762011
59696G62011L067M056O029P013O871O859P322P388O764O573P932J0319J1844J1167
$$ 762011 765078 769134 775163 782176 789047 795906 803228 810616 817380 823953 831885 842204 854048 865215
59682H65215Q954P101O492O175N163M125M161M602L734J605K43P26J740J824J292
$$ 865215 874169 881270 887762 893937 899100 903225 907386 911988 915722 917327 917570 918296 920036 921860 923152
59667I23152R15K33j279k547k063k36R15J48j974m122n333n390m936m971n564
$$ 923152 924067 924300 923021 920474 918411 918175 919090 919238 917264 913142 907809 902419 897483 892512 886948
59652H86948n605m357k576j319n84n9k99j719l182l175j965j025p09o7J168K125
$$ 886948 881343 876986 874410 873091 872507 872448 872149 870430 867248 864073 862108 861083 860374 860307 861475 863600
59636H63600K430K737L313L600L436L381L329K269J7k018k568j978j266p78n25
$$ 863600 866030 868767 872080 875680 879116 882497 885826 888095 888112 886094 883526 881548 880282 879504 878979
59621H78979q51j830k662k560j765j063q74j401k924n105o598o308m698l158k473
$$ 878979 878128 876298 873636 871076 869311 868248 867374 865973 863049 857944 851346 845038 840340 837182 834709
59606H34709k632l549m974o000n735m450l135k002n26R98J310J72o87K89K164
$$ 834709 832077 828528 823554 817554 811819 807369 804234 802232 801706 802704 804014 804186 803499 803788 805952
59591H05952K697J587R82K393M526N208M380L653L401K229l23k412k417j545k284
$$ 805952 808649 810236 811218 813611 818137 823345 827725 831378 834779 837008 836685 834273 831856 830311 828027
59576H28027m892p096p261o182n368n010m427l553k996l132l846m798n418n075
$$ 828027 823135 816039 808778 802596 797228 792218 787791 784238 781242 778110 774264 769466 764048 758973
59562G58973l875k862k798l073k569j437j171k821n641p779p947o305m024k275
$$ 758973 755098 752236 749438 746365 743796 742359 741188 738367 732726 724947 717000 710695 706671 704396
59548G04396j497j379j440j505j647j810j695j084k56R3m91j573k086j417k2J265
$$ 704396 702899 701520 700080 698575 696928 695118 693423 692339 692083 692176 691685 690112 688026 686609 686587 687852
59532F87852K181K859L043K352J370J468K989M326L636J165r55j261n81q14k545
$$ 687852 690033 692892 695935 698287 699657 701125 704114 708440 712076 713241 712286 711025 710444 709630 707085
59517G07085m427m866l799k486j823j508r29k49o4m29r31j482k190k500j476P62
$$ 707085 702658 697792 693993 691507 689684 688176 687247 686998 686934 686505 685574 684092 681902 679402 677926 678688
59501F78688K676K941J880O94p6o67j111j037m15K77Q00J464K537L735M661N481
$$ 678688 681364 684305 686185 686879 686803 686136 685025 683988 683573 683850 684650 686114 688651 692386 697047 702528
59485G02528O672Q143R012Q692P948Q298J0289J2962J5265J7194J8749J8627J5288
$$ 702528 709200 717343 726355 735047 742995 751293 761582 774544 789809 807003 825752 844379 859667
59472H59667R264L058j437m326o396p803q625r261r422p930m672j719j086k144
$$ 859667 868931 871989 870552 866226 859830 852027 843402 834141 824719 816789 812117 810398 809312 807168
59458H07168k624j679m38J00J72K22J47k32r40k207m057n671o198o060o253o623
$$ 807168 804544 802865 802427 802527 802699 802921 803068 802836 801896 799689 795632 789961 783763 777703 771450 764827
59442G64827o287n650o060p162o751m146j762j877l472m071l387l045l417l019
$$ 764827 758540 752890 746830 739668 732917 728771 727009 725132 721660 717589 714202 711157 707740 704721
59428G04721j135R17J684J356J096J580K698L856M272L632K790L012M281N105
$$ 704721 703586 704503 706187 707543 708639 710219 712917 716773 721045 724677 727467 730479 734760 739865
59414G39865M389K860K105K719L794L963K653O65l29P36L164N218N923N636M847
$$ 739865 744254 747114 749219 751938 755732 759695 762348 763013 762684 763420 766584 771802 777725 783361 788208
59399G88208L455J679O70J304K857L817L784L770M686O238P421P519O528N048
$$ 788208 791663 793342 794012 795316 798173 801990 805774 809544 814230 820468 827889 835408 841936 846984
59385H46984L940L667L892L872L295K313R47r92l156m441m065k655j777k342l754
$$ 846984 850924 854591 858483 862355 865650 867963 868910 867918 864762 860321 856256 853601 851824 849482 845728
59370H45728m660m309k965j309J56J152J638K142L650O473R441J0958J1018J1418
$$ 845728 841068 836759 833794 832485 832641 833793 835431 837573 841223 847696 857137 868095 879113 890531
59356H90531J3589J6915J9708K1343K2708K4947K8301L1670L2597K8311J8189
$$ 890531 904120 921035 940743 962086 984794 1009741 1038042 1069712 1102309 1130620 1148809
59345A148809N268n653j1770j3578j2830j0431o451r60N584J1655J4017R388j964
$$ 1148809 1154077 1148424 1136654 1123076 1110246 1099815 1093364 1092404 1097988 1109643 1123660 1133048 1131084
59332A131084j5180k4564k8014k7199k4596k1727j9389j7700j5902j3473j1251
$$ 1131084 1115904 1091340 1063326 1036127 1011531 989804 970415 952715 936813 923340 912089
59321I12089j0228r493p085k960N35J627J071O59J170K433M031N092M639L158
$$ 912089 901861 892368 885283 882323 882858 884485 885556 886215 887385 889818 893849 898941 903580 906738
59307I06738K691M317O577P541P377P506Q036P699O053M238L518M122N469O588
$$ 906738 909429 913746 920323 927864 935241 942747 950783 958482 964535 968773 972291 976413 981882 988470
59293I88470O592N677N382O868R284J0840J1030J0565R746Q531P796Q607J0212
$$ 988470 995062 1000739 1006121 1012989 1022273 1033113 1044143 1054708 1064454 1072985 1080781 1089388 1099600
59280A099600J0758J0207J0430J1846J2227J0021O821M942M203K949R49q69k587
$$ 1099600 1110358 1120565 1130995 1142841 1155068 1165089 1171910 1176852 1181055 1184004 1184953 1184084 1181497
59267A181497n027p665q902q435p594p178o653n749n274n703o273o107n278m142
$$ 1181497 1176470 1168805 1159903 1151468 1143874 1136696 1130043 1124294 1119020 1113317 1107044 1100937 1095659 1091517
59253A091517k626p75P69J602K196L185M448N373N559M775K702q17n477j0620
$$ 1091517 1088891 1088116 1088885 1090487 1092683 1095868 1100316 1105689 1111248 1116023 1118725 1117908 1112431 1101811
59239A101811j5300j8372j9291j9006j9167j9999j9808j7232j3285j0332r498
$$ 1101811 1086511 1068139 1048848 1029842 1010675 990676 970868 953636 940351 930019 920521
59228I20521r838r830q859p371o187n693n432m591l113j906j617j667j131pJ144
$$ 920521 910683 900853 891994 884623 878436 872743 867311 862720 859607 857701 856084 854417 853286 853279 854423
59213H54423K430M479P068R018R667R699J0125J1145J2443J3790J4762J4301J1656
$$ 854423 856853 861332 868400 877418 887085 896784 906909 918054 930497 944287 959049 973350 985006
59200I85006P673M391K917K174L30k784n281n439l785k477k949m692o315o988
$$ 985006 992679 997070 999987 1002161 1002491 999707 994426 988987 985202 982725 979776 975084 968769 961781
59186I61781o676n658m374l346k681j925r03l16q27j837j943o11J305K720L273
$$ 961781 955105 949447 945073 941727 939046 937121 936218 935902 935075 933238 931295 930684 931989 934709 937982
59171I37982L057K203J117N01O36J093J402J539J339J79k049m114m469l099j604
$$ 937982 941039 943242 944359 944860 945496 946589 947991 949530 950869 951048 948999 944885 940416 937317 935713
59156I35713j390k326l275l430k864k270k363l306m464m939m446l442k362j275
$$ 935713 934323 931997 928722 925292 922428 920158 917795 914489 910025 905086 900640 897198 894836 893561
59142H93561l86l48j426k750k991j864m33R3n59j778k706k692j647k85M09K63
$$ 893561 893175 892827 891401 888651 885660 883796 883363 883456 882897 881119 878413 875721 874074 873789 874198 874461
59126H74461J33P14J617K108K331L029M200M861M380L375K940L461M457N284N656
$$ 874461 874594 875308 876925 879033 881364 884393 888593 893454 897834 901209 904149 907610 912067 917351 923007
59111I23007N716N809O139O575P044P819Q926R405Q119N481L415L094L552L283
$$ 923007 928723 934532 940671 947246 954290 962109 971035 980440 988559 994040 997455 1000549 1004101 1007384
59097A007384K232J283M73r07k738l983m205m019m005m252m983o406p722p746
$$ 1007384 1009616 1010899 1011372 1010465 1007727 1003744 999539 995520 991515 987263 982280 975874 968152 960406
59083I60406o945p352r638j1715j1502r795q767q696q195p153p029p848p339m219
$$ 960406 953461 946109 936471 924756 913254 903459 894692 885996 877801 870648 863619 855771 848432 844213
59069H44213n64P15l55j349j139j001j928k727j673J126M142O413P965Q656P962
$$ 844213 843649 844364 844009 842660 841521 840520 838592 835865 834192 835318 839460 845873 853838 862494 870456
59054H70456O165M686M649N654O515O728O628O488O327O437P216Q182P951N766
$$ 870456 876621 881307 885956 891610 898125 904853 911481 917969 924296 930733 937949 946131 954082 959848
59040I59848K739Q95J046K104K480J760P85M23O07N76k56j816l602n056n638m860
$$ 959848 962587 963482 964528 966632 969112 970872 971657 972080 972687 973263 973007 971191 967589 962533 956895 952035
59024I52035k705j07J343N54k007m579n563m924m118m623o492q469r300q652o971
$$ 952035 949330 949223 950566 951120 949113 944534 938971 934047 929929 925306 918814 910345 901045 892393 885422
59009H85422n058l972m560o401p683o878m437k108q92m62m88j319k958m363m556
$$ 885422 880364 876392 871832 865431 857748 850870 846433 844325 843433 842971 842483 841164 838206 833843 829287
58994H29287l877l469l932m927n701n470l775j181P03O17r55k251k019m94J200
$$ 829287 825410 821941 818009 813082 807381 801911 798136 796955 797658 798275 797320 795069 793050 792556 793756
58979G93756K007J578M88j7J003L291N608O723O153M298K291J429K278M338O675
$$ 793756 795763 797341 797829 797812 798815 802106 807714 814437 820590 824888 827179 828608 830886 835224 841899
58964H41899Q610R622R338Q288Q024R555J1916J3160J2638J1419J0600J0139R453
$$ 841899 850509 860131 869469 877757 885781 895336 907252 920412 933050 944469 955069 965208 974661
58951I74661Q271O679N044L994L737L385J914j70j134l29R47J341J199J621K717
$$ 974661 982932 989611 994655 998649 1002386 1005771 1007685 1007515 1006381 1006052 1006999 1008340 1009539 1011160 1013877
58936A013877L656L913L558K785J891J473J934K971M014M837N338N321M932M707
$$ 1013877 1017533 1021446 1025004 1027789 1029680 1031153 1033087 1036058 1040072 1044909 1050247 1055568 1060500 1065207
58922A065207M633L916K475J775L038N313O684O935P511R059J0758J2120J3740
$$ 1065207 1069840 1073756 1076231 1078006 1081044 1086357 1093041 1099976 1107487 1116546 1127304 1139424 1153164
58909A153164J5630J6574J6130J5892J7440J9856K0641J8708J5316J2308J0474
$$ 1153164 1168794 1185368 1201498 1217390 1234830 1254686 1275327 1294035 1309351 1321659 1332133
58898A332133R553Q871P759O001M002K174L20j942m457o771q844j0753j1974j1867
$$ 1332133 1341686 1350557 1358316 1364317 1368319 1370493 1370813 1368871 1364414 1357643 1348799 1338046 1326072 1314205
58884A314205j0890j0427j1146j2287j2828j2566j1749j0501r207q695r182r595
$$ 1314205 1303315 1292888 1281742 1269455 1256627 1244061 1232312 1221811 1212604 1203909 1194727 1185132
58872A185132q810p221o183o070n912n046m052l658l620l366l046l041k841j494
$$ 1185132 1176322 1169101 1162918 1156848 1150936 1145890 1141838 1138180 1134560 1131194 1128148 1125107 1122266 1120772
58858A120772P35K175J737L93j1R58K079K433K598L455M604M930M497M763O611
$$ 1120772 1121507 1123682 1125419 1125812 1125801 1126759 1128838 1131271 1133869 1137324 1141928 1146858 1151355 1156118 1162729
58843A162729R007J0374J0688J1315J2899J4429J4740J4112J3725J3908J3801
$$ 1162729 1171736 1182110 1192798 1204113 1217012 1231441 1246181 1260293 1274018 1287926 1301727
58832A301727J2751J1438J1158J2263J3730J4349J4025J3644J3727J3684J2684
$$ 1301727 1314478 1325916 1337074 1349337 1363067 1377416 1391441 1405085 1418812 1432496 1445180
58821A445180J0916R480Q917Q476P046M486J673m83j723k352l046m633p590j1469
$$ 1445180 1456096 1465576 1474493 1482969 1490015 1494501 1496174 1495691 1493968 1491616 1488570 1483937 1476347 1464878
58807A464878j5019j7017j6980j5315j3034j1269j0635j0909j1422j1721j1695
$$ 1464878 1449859 1432842 1415862 1400547 1387513 1376244 1365609 1354700 1343278 1331557 1319862
58796A319862j1338j0832j0802j1871j3740j5185j5302j4434j3613j3404j3626
$$ 1319862 1308524 1297692 1286890 1275019 1261279 1246094 1230792 1216358 1202745 1189341 1175715
58785A175715j3851j3748j3079j1938j0844j0336j0292j0091r398q528p957p845
$$ 1175715 1161864 1148116 1135037 1123099 1112255 1101919 1091627 1081536 1072138 1063610 1055653 1047808
58773A047808q128q667r111q907p861o554n881o079o406n856m155k077q10q32
$$ 1047808 1039680 1031013 1021902 1012995 1005134 998580 992699 986620 980214 974358 970203 968126 967316 966484
58759I66484j315q38J113L465M623M160L163K845L250L581L436L260L523L905
$$ 966484 965169 964331 965444 968909 973532 977692 980855 983700 986950 990531 993967 997227 1000750 1004655
58745A004655L529K003k5j501k114k606l718n087n703n463n531o739q302q884
$$ 1004655 1008184 1010187 1010162 1008661 1006547 1003941 1000223 995136 989433 983970 978439 971700 963398 954514
58731I54514q515q426r102r584r014p811o732n647m194k932k734l192k783q31
$$ 954514 945999 937573 928471 918887 909873 902062 895330 889683 885489 882557 879823 876631 873848 873017
58717H73017J526K797K986L354M516N325M026M63l295m914m247l215l358m383
$$ 873017 874543 877340 880326 883680 888196 893521 897547 898010 894715 889801 885554 882339 878981 874598
58703H74598n339o118o860o945n826m318l689l801l605l155l342l585j950J618
$$ 874598 869259 863141 856281 849336 843510 839192 835503 831702 828097 824942 821600 818015 816065 817683
58689H17683M229L602J198R5R31J902K107K647M216N618N431M001K963L357M736
$$ 817683 821912 825514 826712 826807 827738 829640 831747 834394 838610 844228 849659 853660 856623 859980 864716
58674H64716N739N394M164L570M368N461N429M583M362M976N174M470L983M547
$$ 864716 870455 875849 880013 883583 887951 893412 898841 903424 907786 912762 917936 922406 926389 930936
58660I30936N442N813O023O552O717N808M670M820O413Q229R235R149P870N703
$$ 930936 936378 942191 948214 954766 961483 967291 971961 976781 983194 991423 1000658 1009807 1017677 1023380
58646A023380L732K731J832l94l565n704n958n702o508q351j0446j2500j4302
$$ 1023380 1027112 1029843 1031675 1031281 1027716 1022012 1016054 1010352 1003844 995493 985047 972547 958245
58633I58245j5160j4941j4766j5550j6371j5549j3006j0426r238r391j0034j0472
$$ 958245 943085 928144 913378 897828 881457 865908 852902 842476 833238 823847 813813 803341
58621H03341j0248r173p546n909m576l772l828m528m544k674M17K690L137K663
$$ 803341 793093 783920 776374 770465 765889 762117 758289 753761 749217 746543 746960 749650 752787 755450
58607G55450K463K712L294M449N835O126M763L219L117L719K845Q6k537l366l026
$$ 755450 757913 760625 763919 768368 774203 780329 785092 788311 791428 795147 797992 798078 795541 792175 789149
58592G89149k943l352l729m146m912n411m646k841j363q78o45o5P8j231l409m640
$$ 789149 786206 782854 779125 774979 770067 764656 760010 757169 755806 754928 754283 754218 754296 753065 749656 745016
58576G45016m058k625j593q91K94J919K934K683J659P67M92R42J969K815K331
$$ 745016 740958 738333 736740 735849 736143 738062 740996 743679 745338 746105 746597 747539 749508 752323 754654
58561G54654M01j309r94J047K708K688J841J574J945K184K407L456N072N525L790
$$ 754654 755055 753746 752752 753799 756507 759195 761036 762610 764555 766739 769146 772602 777674 783199 786989
58546G86989J290M92J987L938M533L990L546L349K487Q30l87j95Q68J602J600
$$ 786989 788279 788771 790758 794696 799229 803219 806765 810114 812601 813431 813044 812849 813717 815319 816919
58531H16919J209P17L38N01J408K423K801K829L454M843O208P142Q215R895J1655
$$ 816919 818128 818845 819183 819684 821092 823515 826316 829145 832599 837442 843650 850792 859007 868902 880557
58516H80557J2629J2650J2158J1608J1316J1490J1847J1673J0730R880J0301J2237
$$ 880557 893186 905836 917994 929602 940918 952408 964255 975928 986658 996538 1006839 1019076
58504A019076J4921J7471J9468K0885K1936K2982K4161K5179K5716K5789K5438
$$ 1019076 1033997 1051468 1070936 1091821 1113757 1136739 1160900 1186079 1211795 1237584 1263022
58493A263022K4253K1753J8042J3681R052M428N30j841k938m082o051p973q475
$$ 1263022 1287275 1309028 1327070 1340751 1349803 1354231 1354761 1352920 1349982 1345900 1339849 1331876 1323401
58480A323401p652p109q083j0186j2194j3538j4538j5612j6792j7942j8863j9175
$$ 1323401 1315749 1308640 1300557 1290371 1278177 1264639 1250101 1234489 1217697 1199755 1180892 1161717
58468A161717j8626j7693j7279j7496j7245j5520j2765j0314q753p584o437n748
$$ 1161717 1143091 1125398 1108119 1090623 1073378 1057858 1045093 1034779 1026026 1018442 1012005 1006257
58456A006257n913o454o530n841m702l577k914l086l912m520m124k836j351r7
$$ 1006257 1000344 993890 987360 981519 976817 973240 970326 967240 963328 958808 954684 951848 950497 950400
58442I50400Q04J008J93j088j643j132o67j338k571k757j370L63J192J469K487
$$ 950400 951204 952212 952405 951317 949674 948542 947875 946537 943966 941209 939839 940202 941394 942863 945350
58427I45350M623O921Q341Q724Q389P600O888P261R286J2092J3962J4064J3200
$$ 945350 949973 956894 965235 973959 982348 989948 996836 1004097 1013383 1025475 1039437 1053501 1066701
58414A066701J2849J3711J5212J6058J5227J2773R734P054M692K077p32k921l912
$$ 1066701 1079550 1093261 1108473 1124531 1139758 1152531 1162265 1169319 1174011 1176088 1175356 1172435 1168523
58401A168523l955l495k665j614q07m14K13J853M321O571P880Q510R105R830J0248
$$ 1168523 1164568 1161073 1158408 1156794 1155987 1155573 1155786 1157639 1161960 1168531 1176411 1184921 1194026 1203856 1214104
58386A214104R735P872M710R67k201m080n145o573q773j0647j0670q575n626l255
$$ 1214104 1223839 1231711 1236421 1237388 1235187 1231107 1225962 1219389 1210616 1199969 1189299 1180724 1175098 1171843
58372A171843j878j121o46m25m34m03J92J890M687P677R660J0216R804Q849P379
$$ 1171843 1169965 1168844 1168198 1167773 1167339 1166936 1167128 1169018 1173705 1181382 1191042 1201258 1211062 1219911 1227290
58357A227290N656M259L168J704j50j308j311j391k751m579n189m512l932m060
$$ 1227290 1232946 1237205 1240373 1242077 1241927 1240619 1239308 1237917 1235166 1230587 1225398 1220886 1216954 1212894
58343A212894m215m056m146m724n193n050m124j921J834N755P539O667N058M516
$$ 1212894 1208679 1204623 1200477 1195753 1190560 1185510 1181386 1179465 1181299 1187054 1194593 1201260 1206318 1210834
58329A210834M876N248N693O642P814Q771R706J0765J1318J0789R640Q800Q699
$$ 1210834 1215710 1220958 1226651 1233293 1241107 1249878 1259584 1270349 1281667 1292456 1302096 1310896 1319595
58316A319595R234J0015J0217R181P731P769R799J1904J2178J1182J0863J1796
$$ 1319595 1328829 1338844 1349061 1358242 1365973 1373742 1383541 1395445 1407623 1418805 1429668 1441464
58304A441464J2823J2988J2657J2690J3384J4332J5068J5803J7337J9746K1476
$$ 1441464 1454287 1467275 1479932 1492622 1506006 1520338 1535406 1551209 1568546 1588292 1609768
58293A609768K0856J8441J6388J5393J4011J1552R706J0101J1940J3457J4271
$$ 1609768 1630624 1649065 1665453 1680846 1694857 1706409 1716115 1726216 1738156 1751613 1765884
58282A765884J4801J4688J3662J2940J3931J6137J7881J8523J8648J8804J9506
$$ 1765884 1780685 1795373 1809035 1821975 1835906 1852043 1869924 1888447 1907095 1925899 1945405
58271A945405K1671K5315K8508K9265K8067K7036K7177K7875K8505K8754K7941
$$ 1945405 1967076 1992391 2020899 2050164 2078231 2105267 2132444 2160319 2188824 2217578 2245519
58260B245519K5742K3276K1912K1355K0515J9663J9965K1280K2286K2630K3122
$$ 2245519 2271261 2294537 2316449 2337804 2358319 2377982 2397947 2419227 2441513 2464143 2487265
58249B487265K4056K5090K6621K9346L2577L4801L5933L7164L8655L9402L9448
$$ 2487265 2511321 2536411 2563032 2592378 2624955 2659756 2695689 2732853 2771508 2810910 2850358
58238B850358M0178M1971M3516M3946M3954M4308M5003M6342M9064N2630N4978
$$ 2850358 2890536 2932507 2976023 3019969 3063923 3108231 3153234 3199576 3248640 3301270 3356248
58227C356248N4997N4024N4091N5690N7930O0007O1851O4047O7508P2595P8443
$$ 3356248 3411245 3465269 3519360 3575050 3632980 3692987 3754838 3818885 3886393 3958988 4037431
58216D037431Q3632Q7450R0010R1819R4051R8348J05005J12013J17347J21511
$$ 4037431 4121063 4208513 4298523 4390342 4484393 4582741 4687746 4799759 4917106 5038617
58206E038617J26351J32296J38614J45561J53932J62972J71051J78100J85235
$$ 5038617 5164968 5297264 5435878 5581439 5735371 5898343 6069394 6247494 6432729
58197F432729J92506J99482K07438K17977K29652K39199K46507K55195K67557
$$ 6432729 6625235 6824717 7032155 7250132 7479784 7718983 7965490 8220685 8488242
58188H488242K81885K95803L09431L24051L40101L57791L77515L98568M19509
$$ 8488242 8770127 9065930 9375361 9699412 10039513 10397304 10774819 11173387 11592896
58179A1592896M40800M65051M93725N25639N59587N96102O35541O76432P17068
$$ 11592896 12033696 12498747 12992472 13518111 14077698 14673800 15309341 15985773 16702841
58170A6702841P57247P97651Q38922Q81833R26909R73736J022258J074401J132628
$$ 16702841 17460088 18257739 19096661 19978494 20905403 21879139 22901397 23975798 25108426
58161B5108426J197608J269582J351031J445183J553070J675667J817580J984114
$$ 25108426 26306034 27575616 28926647 30371830 31924900 33600567 35418147 37402261
58153C7402261K175184K386824K618188K872478L152482L462240L813517M223709
$$ 37402261 39577445 41964269 44582457 47454935 50607417 54069657 57883174 62106883
58145F2106883M705582N264208N902966O624538P426479Q307543R282945J0384006
$$ 62106883 66812465 72076673 77979639 84604177 92030656 100338199 109621144 120005150
58137A20005150J1637457J3050438J4612801J6295774J8044463J9802865K1581548
$$ 120005150 131642607 144693045 159305846 175601620 193646083 213448948 235030496
58130B35030496K3490180K5636208K7896425K9706728L0062965K7840682K2347787
$$ 235030496 258520676 284156884 312053309 341760037 371823002 399663684 422011471
58123D22011471J3810429L440921p018911j5997291k2589192k6626684k8447701
$$ 422011471 435821900 439262821 432243910 416246619 393657427 367030743 338583042
58116C38583042k8612644k7698882k6177072k4359785k2422155k0459232j8527961
$$ 338583042 309970398 282271516 256094444 231734659 209312504 188853272 170325311
58109A70325311j6662840j4888100j3230662j1718028j0364591r168138q119492
$$ 170325311 153662471 138774371 125543709 113825681 103461090 94292952 86173460
58102H6173460p208104o419254n734831n139503m621409m167497l764439l404667
$$ 86173460 78965356 72546102 66811271 61671768 57050359 52882862 49118423 45713756
58094D5713756l086083k805607k557808k339433k149399j983556j834588j698208
$$ 45713756 42627673 39822066 37264258 34924825 32775426 30791870 28957282 27259074
58086B7259074j574992j465269j366326j275696j193066j117600j046792r79294
$$ 27259074 25684082 24218813 22852487 21576791 20383725 19266125 18219333 17240039
58078A7240039r16033q57511q02638p50946p03310o59817o19292n81376n46713
$$ 17240039 16324006 15466495 14663857 13912911 13209601 12549784 11930492 11349116 10802403
58069A0802403n14823m84244m55095m29026m06359l85666l66418l49517l34899
$$ 10802403 10287580 9803336 9348241 8919215 8512856 8127190 7760772 7411255 7076356
58060G076356l21090l07571k95021k82844k69073k53584k38943k26906k16096
$$ 7076356 6755266 6447695 6152674 5869830 5600757 5347173 5108230 4881324 4665228
58051D665228k04217j90832j77041j63983j52521j42965j34304j24933j14724
$$ 4665228 4461011 4270179 4093138 3929155 3776634 3633669 3499365 3374432 3259708
58042C259708j05272r7763r1935q7324q3964q1354p8197p3879o9105o4642o0514
$$ 3259708 3154436 3056673 2964738 2877414 2793450 2712096 2633899 2560020 2490915 2426273 2365759
58031B365759n6770n3836n1793n0177m8820m7926m7344m6749m6477m6957m7402
$$ 2365759 2308989 2255153 2203360 2153183 2104363 2056437 2009093 1962344 1915867 1868910 1821508
58020A821508m6404m3989m1778m0776m0161l8567l5615l1944k8632k6734k6546
$$ 1821508 1775104 1731115 1689337 1648561 1608400 1569833 1534218 1502274 1473642 1446908 1420362
58009A420362k7206k7636k7683k7629k7034k5249k2739k0719j9547j8548j7288
$$ 1420362 1393156 1365520 1337837 1310208 1283174 1257925 1235186 1214467 1194920 1176372 1159084
57998A159084j6019j5142j5141j6539j8858k0202j9300j7441j6864j7608j7595
$$ 1159084 1143065 1127923 1112782 1096243 1077385 1057183 1037883 1020442 1003578 985970 968375
57987I68375j5648j2809j0564r304q665q139p237o157o103p819j0172j1380j1203
$$ 968375 952727 939918 929354 920050 911385 903246 896009 889852 883749 875930 865758 854378 843175
57974H43175j0610r967r229r226j0674j2258j1977j0253r431j0224j0945j0555
$$ 843175 832565 822598 813369 804143 793469 781211 769234 758981 749550 739326 728381 717826
57962G17826r989r940r752r336r834j1223j1482r516p040o052o154o008n882o798
$$ 717826 707837 697897 688145 678809 668975 657752 646270 636754 629714 623662 617508 611500 605618 598820
57948E98820q145q165o497m663l890l676k807j261n64k047m780o055m600k431
$$ 598820 590675 582510 576013 571350 567460 563784 560977 559716 559152 557105 552325 546270 541670 539239
57934E39239k171l327l246j363l3p67k289l258m424o452p749o669m436l658m701
$$ 539239 537068 533741 530495 529132 529099 528332 526043 522785 518361 511909 504160 497491 493055 489397 484696
57919D84696n639n352m717m733n145n198m549l170j202Q34K271K873K775J985
$$ 484696 479057 473705 468988 464255 459110 453912 449363 446193 444991 445825 448096 450969 453744 455729
57905D55729M86j249k364k376j627j003j230k176k896k640j640o17K06P29J74
$$ 455729 456215 454966 452602 450226 448599 447596 446366 444190 441294 438654 437014 436397 436603 437332 437506
57890D37506k088m839n656l826j381n36j146j542j005l06k84q22j037j34J730
$$ 437506 435418 430579 424923 421097 419716 419180 418034 416492 415487 415181 414897 414075 413038 412904 414634
57875D14634L291L451K779K851L922M427L258J371K30k17r31j993k717l080l732
$$ 414634 417925 421376 424155 427006 430928 435355 438613 439984 440214 439997 439066 437073 434356 431276 427544
57860D27544m760n495n664n717n854n517m269k690j872k152k812l029k843k728
$$ 427544 422784 417289 411625 405908 400054 394537 390268 387578 385706 383554 380742 377713 374870 372142
57846C72142k664k266j814k086k868k744j070Q60J699K006K994M338M841M497
$$ 372142 369478 367212 365398 363312 360444 357700 356630 357490 359189 361195 364189 368527 373368 377865
57832C77865L920K569p3k101r37K397L850J989rO51K354K095R9j247j305j390
$$ 377865 381785 384354 384281 382180 381243 383640 387490 389479 389470 390121 392475 394570 394669 393422 392117 390727
57816C90727k114k999l995n195n592m262k375k037l388m708n182n543n997n528
$$ 390727 388613 385614 381619 376424 370832 366570 364195 362158 358770 354062 348880 343337 337340 331812
57802C31812l679j401M07J881L229M012M048M008M541N307N444M552K997J561
$$ 331812 328133 326732 327139 329020 332249 336261 340309 344317 348858 354165 359609 364161 367158 368719
57788C68719Q45P37N38k3l21K15J020J020K1j172j869k100k215k374k395j895
$$ 368719 369564 370301 370839 370816 370495 370710 371730 372750 372771 371599 369730 367630 365415 363041 360646 358751
57772C58751q61k06j011k964m428m590m419m737m644l076r84k13q55j350r64n39
$$ 358751 357890 357684 356673 353709 349281 344691 340272 335535 330891 327815 326831 326618 325763 324413 323449 322910
57756C22910p74j234j381j355j462j880k903m617o236o809o565o573o987o788
$$ 322910 322136 320902 319521 318166 316704 314824 311921 307304 301068 294259 287694 281121 274134 267346
57742B67346n464l852k907k554k224j801j559j617j836j866j271KJ343K128K425
$$ 267346 261882 258030 255123 252569 250345 248544 246985 245368 243532 241666 240395 240397 241740 243868 246293
57727B46293K570K402J712J067J203J799J939J637J834K886M198N408O614P239
$$ 246293 248863 251265 252977 254044 255247 257046 258985 260622 262456 265342 269540 274948 281562 288801
57713B88801O157L504J056K1m21j432k392j834J40J702J589M79k19j77l40j568
$$ 288801 294958 298462 299518 299539 299118 297686 295294 293460 293600 295302 296891 297370 297151 296974 296634 295066
57697B95066l597n330n988n722n062m145k845j422n33m91q99j138q92k40M88R34
$$ 295066 291469 286139 280151 274429 269367 265222 262377 260955 260422 259931 259032 257894 257002 256762 257250 258184
57681B58184J159J724K879L771L183J237l99m71L15M19j97O9K025M090M072K087
$$ 258184 259343 261067 263946 267717 270900 272137 271738 271267 271582 272001 271804 271873 273898 277988 282060 284147
57665B84147M91O94J409R02k65k73Q85J521J241J523K679K588m8l122l822k488
$$ 284147 284638 285332 286741 287643 287378 287105 287990 289511 290752 292275 294954 297542 297494 294372 290550 288062
57649B88062j606j912k083j784k325l939m984m691m527n543o203m531j317O60
$$ 288062 286456 284544 282461 280677 278352 274413 269429 264738 260211 254668 248465 243934 242617 243277
57635B43277R1j623k537k286j826j927k455k801k539j609j99J243J922J342K61
$$ 243277 243368 241745 239208 236922 235096 233169 230714 227913 225374 223765 223566 224809 226731 228073 228334
57620B28334L90K473N248P064Q008R391J1631J3876J5579J7154J9077K1550K5068
$$ 228334 228724 231197 236445 243509 251517 260908 272539 286415 301994 319148 338225 359775 384843
57607C84843K9902L4646L6578L3994K7243J7344N142p632j8195k4741k7683k8267
$$ 384843 414745 449391 485969 519963 547206 564550 569692 562060 543865 519124 491441 463174
57595D63174k7217k5548k4951k5779k5873k3217j8874j5425j3293j0818p682n658
$$ 463174 435957 410409 385458 359679 333806 310589 291715 276290 262997 252179 244497 238839
57583B38839n639o106n583m686m482m344l156j619j429k452k586p45J451J747
$$ 238839 233200 227094 221511 216825 212343 207999 204843 203224 201795 199343 196757 196012 197463 199210
57569A99210P4j566j629o12k05j393l500m891m594l297k607l129l683k886j181
$$ 199210 199284 197718 196089 195477 195272 193879 190379 185488 180894 177597 174990 171861 168178 165292 164111
57554A64111m42j561l303l956l308k242j146K27J565J896R37m08j221j482j385
$$ 164111 163669 162108 158805 154849 151541 149299 148153 148380 149945 151841 152778 152370 151149 149667 148282
57539A48282p36L21P31k35j656j987j362j637l804o408p294o157m489l430k727
$$ 148282 147546 147867 148598 148363 146707 144720 143358 141721 137917 131509 124215 118058 113569 110139 107412
57524A07412j782o97M3K39j33j193k808m284m866m379l100j349M22J412J005n51
$$ 107412 105630 104933 104976 105215 105082 103889 101081 96797 91931 87552 84452 83103 83525 84937 85942 85391
57508H5391k277l309l382k719j753q04J35J064J460Q06k76m44K89J54j659l226
$$ 85391 83114 79805 76423 73704 71951 71147 71282 72346 73806 74612 74336 73892 74181 74335 72676 69450
57492F9450k358J24J617J428Q64J35j868m388m601j798Q87P29r68j505q64o78
$$ 69450 67092 67216 68833 70261 71125 71260 69392 65004 60403 58605 59492 60221 59253 57748 56884 56206
57476E6206q37M6J637K100R34n74j537k022j857r23l91j525l407l940k979k302
$$ 56206 55369 55415 57052 59152 60086 59512 57975 55953 54096 53173 52782 51257 47850 43910 40931 38629
57460C8629k464k171j094q84k468m487n323m907l580j136J808L224J952o42k435
$$ 38629 36165 33994 32900 32016 29548 25061 19738 14831 11251 10115 11923 15147 17099 16457 14022
57445A4022k880k445j203N80J515N36j303j949j006L3j5q43j697H43b594m119
$$ 14022 11142 8697 7494 8074 9589 10125 8822 6873 5867 5900 5885 5042 3345 843 -2594 -6713
57429f713l776k307p04j12l77j97R23J719J072J08Q39L100a842B245K904K467
$$ -6713 -10489 -12796 -13500 -13612 -13989 -14186 -13263 -11544 -10472 -10364 -9525 -6425 -1842 2245 5149 7616
57413G616K614K934M042O091P424O371L655J526R86J116P62j85j096j381j062
$$ 7616 10230 13164 17206 23297 30721 37092 40747 42273 43259 44375 45137 44952 43856 42475 41413
57398D1413r64j905l420m009l078j775j257j102l50Q23J499J444J005J93j057
$$ 41413 40449 38544 35124 31115 28037 26262 25005 23903 23553 24376 25875 27319 28324 28517 27460
57383B7460k091k036r47L88J450K070J990J190M15M03P88N81m11j382j641j268
$$ 27460 25369 23333 22386 22774 24224 26294 28284 29474 29889 30292 31080 31661 31250 29868 28227 26959
57367B6959p26l61k57j25N04J698K865L266K529P28j416k502j601K97J091K21
$$ 26959 26233 25872 25615 25490 25994 27692 30557 33823 36352 37080 35664 33162 31561 31858 32949 33170
57351C3170o86m13O0n17j296n53J478K687J822k07j774k092j227M19K315L856
$$ 33170 32484 32071 32131 31614 30318 29765 31243 33930 35752 35545 33771 31679 30452 30871 33186 37042
57335C7042M384L332R77r70p31J054J640j73k118j554R41K886L705M856O667P603
$$ 37042 41426 44758 45735 44765 44034 45088 46728 46555 44437 42883 43824 46710 50415 55271 61938 69541
57319F9541O916N923N960O737P449Q153R189J0382J1422J2227J2454J1537R739
$$ 69541 76457 82380 88340 95077 102526 110679 119868 130250 141672 153899 166353 177890 187629
57306A87629Q274P845P746O896N190L442K531K875M183N518O076O033O155O651
$$ 187629 195903 203748 211494 218390 223580 227022 229553 232428 236611 242129 248205 254238 260393 267044
57292B67044P077P348P965R049R961J0189R936R624R359R130Q933Q510P535O337
$$ 267044 274121 281469 289434 298483 308444 318633 328569 338193 347552 356682 365615 374125 381660 387997
57278C87997N882O768Q486R826R839Q542O968O297O553O577N677M695M664N125
$$ 387997 393879 400647 409133 418959 428798 437340 444308 450605 457158 463735 469412 474107 478771 483896
57264D83896M957M371M704O269P786Q130P428O333N347N054N805O843O957O245
$$ 483896 488853 493224 497928 504197 511983 520113 527541 533874 539221 544275 550080 556923 563880 570125
57250E70125N976O441O491N712N452O563P732P534O928P824R874J0826J0021R475
$$ 570125 576101 582542 589033 594745 600197 606760 614492 622026 628954 636778 646652 657478 667499 676974
57236F76974J0736J2418J2139R959Q317Q854J0710J2246J3120J3875J4491J4621
$$ 676974 687710 700128 712267 722226 730543 739397 750107 762353 775473 789348 803839 818460
57224H18460J4764J5842J7645J9029J9839K1149K3128K4322K4047K3926K5584
$$ 818460 833224 849066 866711 885740 905579 926728 949856 974178 998225 1022151 1047735
57213A047735K8042K9194K8922K8636K8490K7438K5971K6259K8930L1860L3042
$$ 1047735 1075777 1104971 1133893 1162529 1191019 1218457 1244428 1270687 1299617 1331477 1364519
57202A364519L2895L2661L2224L0891K9059K7678K6824K5984K5223K4997K5226
$$ 1364519 1397414 1430075 1462299 1493190 1522249 1549927 1576751 1602735 1627958 1652955 1678181
57191A678181K5301K4770K3686K2734K3230K6001K9933L2698L3471L3743L4850
$$ 1678181 1703482 1728252 1751938 1774672 1797902 1823903 1853836 1886534 1920005 1953748 1988598
57180A988598L6103L6417L6430L7513L9585M1464M2722M3777M4622M4975M5275
$$ 1988598 2024701 2061118 2097548 2135061 2174646 2216110 2258832 2302609 2347231 2392206 2437481
57169B437481M6107M6902M6732M6197M6871M8650M9298M7325M4091M2152M2277
$$ 2437481 2483588 2530490 2577222 2623419 2670290 2718940 2768238 2815563 2859654 2901806 2944083
57158B944083M2940M2415M0766L9626M0228M1842M2632M2124M1954M3456M5416
$$ 2944083 2987023 3029438 3070204 3109830 3150058 3191900 3234532 3276656 3318610 3362066 3407482
57147C407482M5601M3960M2652M2865M3458M3245M2946M3769M5333M6350M6572
$$ 3407482 3453083 3497043 3539695 3582560 3626018 3669263 3712209 3755978 3801311 3847661 3894233
57136C894233M6631M6451M5242M3109M1391M1021M1342M1035L9685L7953L6467
$$ 3894233 3940864 3987315 4032557 4075666 4117057 4158078 4199420 4240455 4280140 4318093 4354560
57125D354560L5074L3299L1255K9680K8815K7689K5266K2245K0647K1196K2111
$$ 4354560 4389634 4422933 4454188 4483868 4512683 4540372 4565638 4587883 4608530 4629726 4651837
57114D651837K1366J9184J7060J5014J1647O752K075j144l769p084j0801j3824
$$ 4651837 4673203 4692387 4709447 4724461 4736108 4742860 4744935 4743791 4740022 4732938 4722137 4708313
57102D708313j5922j7442j8253j8218j8071j8495j8851j8300j7705j8872k1996
$$ 4708313 4692391 4674949 4656696 4638478 4620407 4601912 4583061 4564761 4547056 4528184 4506188
57091D506188k5461k8249l0975l4238l7521m0381m3485m7813n3794o1738p1832
$$ 4506188 4480727 4452478 4421503 4387265 4349744 4309363 4265878 4218065 4164271 4102533 4030701
57080D030701q3081r3479j02133j10302j19501j29533j39381j49145j59960j72406
$$ 4030701 3947620 3854141 3752008 3641706 3522205 3392672 3253291 3104146 2944186 2771780
57070B771780j85993j99864k13533k27353k42622k60570k81008l02896l26403
$$ 2771780 2585787 2385923 2172390 1945037 1702415 1441845 1160837 857941 531538
57061E31538A78571b04351m14922m48529m85653n27896n74344o23851o78003p39830
$$ 531538 178571 -204351 -619273 -1067802 -1553455 -2081351 -2655695 -3279546 -3957549 -4697379
57051d697379q11033q92809r88229j100972j232212j381305j549431j740363j958361
$$ -4697379 -5508412 -6401221 -7389450 -8490422 -9722634 -11103939 -12653370 -14393733 -16352094
57042a6352094k208099k496804k833790l227285l683526m208505m807464n481506
$$ -16352094 -18560193 -21056997 -23890787 -27118072 -30801598 -35010103 -39817567 -45299073
57034d5299073o226003p031712p884505q762979r636565j0462739j1182862j1728232
$$ -45299073 -51525076 -58556788 -66441293 -75204272 -84840837 -95303576 -106486438 -118214670
57026a18214670j2047774j2139857j2047184j1800298j1354088j0581241r337767
$$ -118214670 -130262444 -142402301 -154449485 -166249783 -177603871 -188185112 -197522879
57019a97522879p551355n270187k649411J02553K781338N223967P323352R028852
$$ -197522879 -205074234 -210344421 -212993832 -212891279 -210109941 -204885974 -197562622 -188533770
57011a88533770J0339597J1289788J1926271J2287908J2398635J2274811J1936166
$$ -188533770 -178194173 -166904385 -154978114 -142690206 -130291571 -118016760 -106080594
57004a06080594J1411340J0737741R958673R118548Q257197P406279O589341N823325
$$ -106080594 -94669254 -83931513 -73972840 -64854292 -56597095 -49190816 -42601475 -36778150
56996c6778150N119080M481397L910061L401946K952923K558862K215785J919637
$$ -36778150 -31659070 -27177673 -23267612 -19865666 -16912743 -14353881 -12138096 -10218459
56988a0218459J666194J450892J268250J111787R75588Q56343P52976O64057N86724
$$ -10218459 -8552265 -7101373 -5833123 -4721336 -3745748 -2889405 -2136429 -1472372 -885648
56979h85648c66984I2768M10632L70598L38152L12198K90904K69837K43249K07829
$$ -885648 -366984 92768 503400 873998 1212150 1524348 1815252 2085089 2328338 2536167
56969B536167J64811J18903P6001M0863J4989l583j7534k7606l3549l6791m0276
$$ 2536167 2700978 2819881 2895882 2936745 2951734 2948151 2930617 2903011 2869462 2832671 2792395
56958B792395m5681n2578o0512p0336q3041r8496j15789j33591j49773j61921
$$ 2792395 2746714 2694136 2633624 2563288 2480247 2381751 2265962 2132371 1982598 1820677
56948A820677j68912j71189j69236j62901j52585j40004j26907j13846j00853
$$ 1820677 1651765 1480576 1311340 1148439 995854 855850 728943 615097 514244
56939E14244q8529p7617o7978n8705m9109l9308l0186k2927j8172j5307j2882
$$ 514244 425715 348098 280120 221415 172306 132998 102812 79885 61713 46406 33524
56928C3524r888o370k949k47J234J466J264J626K492K752J688j59j790k828l430
$$ 33524 23636 17266 14317 14070 15304 16770 18034 19660 22152 24904 26592 26433 24643 21815 18385
56913A8385l617l190k178j146r17j744k679F36k41K256M377O800J0158J3268J4517
$$ 18385 14768 11578 9400 8254 7337 5593 2914 636 395 2651 7028 13828 23986 37254 51771
56898E1771J4534J5482J7576J8308J5764J1091O690L449R17r95j885j806j187
$$ 51771 66305 81787 99363 117671 133435 144526 151216 154665 155582 154587 152702 150896 149709
56885A49709k53O73Q63J34l92N05K636M931P070R543J2354J4821J6736J8761K1378
$$ 149709 149456 150129 150992 151126 150734 151239 153875 158806 165876 175419 187773 202594 219330 238091 259469
56870B59469K3871K4521K1643J4901O171j313n590p683r968j3080j5376j5462
$$ 259469 283340 307861 329504 344405 350576 349263 343673 335990 326022 312942 297566 282104
56858B82104j4028j2693j1928j0991r487q108p748q300q581p371m562j285J120
$$ 282104 268076 255383 243455 232464 222977 214869 207121 198821 190240 182869 178307 177022 178142
56845A78142K150K141J674J409K091L899N797O427N916N923P414R354J0303J0501
$$ 178142 180292 182433 184107 185516 187607 191506 197303 203730 209646 215569 222983 232337 242640 253141
56831B53141J1188J2501J3463J3853J4503J5499J5554J3814J1033Q217N346K301
$$ 253141 264329 276830 290293 304146 318649 334148 349702 363516 374549 382766 388112 390413
56819C90413j58j641l224n643p246n782j892J410K803L986O322Q505Q984Q890
$$ 390413 390255 388614 385390 379747 372501 366719 364827 366237 369040 373026 379348 387853 396837 405727
56805D05727J0620J4452J8426K1129K2996K4898K6743K7575K6203K1843J5008
$$ 405727 416347 430799 449225 470354 493350 518248 544991 572566 598769 620612 635620
56794F35620P665J685k809o770j0274j2204j1856r777o868l480L02M265Q270J2419
$$ 635620 643285 644970 642161 635391 625117 612913 601057 591280 584412 580932 581234 585499 593769 606188
56780F06188J6684K0784K4662K8728L3428L8562M2973M4883M2926L7140K8654
$$ 606188 622872 643656 668318 697046 730474 769036 812009 856892 899818 936958 965612
56769I65612J8298O242o634j8010k5882l0537l3603l5441l4811l1158k5947k1218
$$ 965612 983910 990152 983518 965508 939626 909089 875486 840045 805234 774076 748129 726911
56757G26911j7701j4732j1371p119k051L288Q296J2661J6220J8699K0037K0481
$$ 726911 709210 694478 683107 675988 673937 677225 685521 698182 714402 733101 753138 773619
56745G73619J9762J6570R906P11q897j7808k5998l2537l5369l3861l0244k7251
$$ 773619 793381 809951 819857 820568 811671 793863 767865 735328 699959 666098 635854 608603
56733F08603k5315k3134k0160j7030j3939j0265o044k475k73J518M193P367R341
$$ 608603 583288 560154 539994 522964 509025 498760 492716 490241 489968 491486 495679 503046 512387
56720E12387R299Q051O326L418j493p333j1848j4324j6278j8939k1314k1683k0062
$$ 512387 521686 529737 536063 539481 537988 530655 518807 504483 488205 469266 447952 426269 406207
56707D06207j7941j6144j4385j2701j1797j1712j1343j0009q459p702p458o641
$$ 406207 388266 372122 357737 345036 333239 321527 310184 300175 291716 284014 276556 269915
56695B69915m950l198k145j803j928k593l778m729m419k796j080m04n77p13p24
$$ 269915 264965 261767 259622 257819 255891 253298 249520 244791 240372 237576 236496 236092 235515 234802 234078
56680B34078j294k429l156k925k369k076j607m39Q18J117M01m31o31L4J508L222
$$ 234078 232784 230355 227199 224274 221905 219829 218222 217783 218601 219718 220119 219688 219057 219091 220599 223821
56664B23821L966K929Q02p27n97P33J747J139q64k480k457j950k894m523l726
$$ 223821 227787 230716 231518 230791 230194 230927 232674 233813 232949 230469 228012 226062 223168 218645 214919
56649B14919K97M135M562K715J657J736J241K65N57K005K570J764J271J773K084
$$ 214919 215216 219351 223913 226628 228285 230021 231262 231527 232084 234089 236659 238423 239694 241467 243551
56634B43551J903K539M104M683L559K684L567M895M826L720K952K620K120J668
$$ 243551 245454 247993 252097 256780 260339 263023 266590 271485 276311 280031 282983 285603 287723 289391
56620B89391J700J830J677J702K174K404K027J803K122K069J107K12K29L95j11
$$ 289391 291091 292921 294598 296300 298474 300878 302905 304708 306830 308899 310006 310218 310447 310842 310731
56605C10731n44Q3J209J673J387P08o53k655m012l806k926k449j809k15J333J422
$$ 310731 310187 310270 311479 313152 314539 315247 314594 311939 307927 304121 301195 298746 296937 296722 298055 299477
56589B99477N80K31K23m64j328j096m08j136k983l329j021J775K389O87j523k693
$$ 299477 300057 300288 300511 300047 298719 297623 297215 296079 293096 289767 288746 290521 292910 293597 292074 289381
56573B89381k340q82M76M13j190l043l873l449k196o00Q00J578J893K250K613
$$ 289381 287041 286159 286635 287048 285858 282815 278942 275493 273297 272697 273497 275075 276968 279218 281831
56558B81831K397J421L36j28N1K05l06j322j802r97K61L80o64j072l0P95j19j376
$$ 281831 284228 285649 285985 285857 285908 286113 285807 284485 282683 281686 281947 282327 281663 280591 280561 281356 281237 279861
56540B79861n34K115L893L580K634K365K098Q62q42k012k500k509j792l95P29
$$ 279861 279327 281442 285335 288915 291549 293914 296012 296874 296032 294020 291520 289011 287219 286824 287553
56525B87553P63J83R3Q88K125L207L675L251K218J427J450J918K083J797J638
$$ 287553 288316 288499 288592 289480 291605 294812 298487 301738 303956 305383 306833 308751 310834 312631 314269
56510C14269K169L377M757N788O314O382N849M568L096K755M370P249R845J1209
$$ 314269 316438 319815 324572 330360 336674 343056 348905 353473 356569 359324 363694 370943 380788 391997
56496C91997J1305J0244P969M712J193j788l673m288m010l616l563l650l581l533
$$ 391997 403302 413546 421515 426227 427420 425632 421959 417671 413661 410045 406482 402832 399251 395718
56482C95718l752m017m006l824l741l724l711l765l644k885j788j546k562l515
$$ 395718 391966 387949 383943 380119 376378 372654 368943 365178 361534 358649 356861 355315 352753 349238
56468C49238l034j626p90r06j296j739k425k724j646L77J630J351N67L59N63O96
$$ 349238 346204 344578 343788 342882 341586 339847 337422 334698 333052 333429 335059 336410 336977 337336 337899 338595
56452C38595J029J904K649K049k14k932m205k975k2K542L047J486r46l038m007
$$ 338595 339624 341528 344177 346226 346012 343080 338875 335900 335878 338420 341467 342953 342007 338969 334962
56437C34962l448j568P79K702L719L512K103N03P7O59N42r75k326k069j048o97
$$ 334962 331514 329946 330725 333427 337146 340658 342761 343264 343341 344000 344542 343567 341241 339172 338124 337427
56421C37427o24J88J015M99o96p75J34L55j56L08J969K894K143J151J097J185
$$ 337427 336803 336991 338006 338505 337809 337034 337168 337523 337367 337675 339644 342538 344681 345832 346929 348114
56405C48114O71M10J046J475O99k30K25J680K538K311J816J546J143L46m03m17
$$ 348114 348785 349195 350241 351716 352415 352185 352410 354090 356628 358939 360755 362301 363444 363790 363387 362970
56389C62970M84J507J405K9r11K29K532L422K107M89J82M61J08l84J08J203J492
$$ 362970 363454 364961 366366 366395 365484 365713 368245 371667 373774 374263 374445 374906 375014 374630 374738 375941 377433
56372C77433O03m74p96l36L32O05L60J65M81O92j82j676k051p04Q28R81N9p54
$$ 377433 378036 377562 376766 376430 376762 377367 377727 377892 378373 379065 378883 377207 375156 374452 375280 376261 376320 375566
56354C75566j112j238r13J22J345J878J393O6j673k927k668r53R91K297L123L463
$$ 375566 374454 373216 372303 372425 373770 375648 377041 377107 375434 372507 369839 368886 369877 372174 375297 378760
56338C78760K732J295R68K776N167N860M636L165K665K933L153K613J098o20j216
$$ 378760 381492 382787 383755 386531 391698 397558 402194 405359 408024 410957 414110 416723 417821 417201 415985
56323D15985m95J37k57n64O68K756L557K163l04k354l306k977j434P24K528L159
$$ 415985 415490 415627 415370 414806 415474 418230 421787 423950 423646 421292 417986 415009 413575 414299 416827 419986
56307D19986K173k21k549k722k66K706L786K931J781J110M09l48l64L93P35kp91
$$ 419986 422159 421938 419389 416667 416401 419107 422893 425824 427605 428715 429124 428776 428412 428805 429540 429538 428747
56290D28747j41K087M569N792N175L339J576Q10Q74R27N80L73J074K667M172M667
$$ 428747 428606 430693 435262 441054 446229 449568 451144 451954 452828 453755 454335 454708 455782 458449 462621 467288
56274D67288M437M757O163P497P355O106N395N792O156N560M600M337N014O236
$$ 467288 471725 476482 482645 490142 497497 503603 508998 514790 520946 526506 531106 535443 540457 546693
56260E46693P374P337N195J750o12n22Q95J767J653J148N73J37M38J633K841L402
$$ 546693 554067 561404 566599 568349 567737 567215 568110 569877 571530 572678 573251 573388 573826 575459 578300 581702
56244E81702L840M703N351N137M857N718P557R276J0414J1090J1154J0596J0153
$$ 581702 585542 590245 595596 600733 605590 611308 618865 628141 638555 649645 660799 671395 681548
56231F81548J0297J0329R705R336J0191J1454J1775J1608J2438J4135J5107J4851
$$ 681548 691845 702174 711879 721215 731406 742860 754635 766243 778681 792816 807923 822774
56219H22774J4521J4874J5544J6453J8195K0640K2728K4146K5735K7824K9550
$$ 822774 837295 852169 867713 884166 902361 923001 945729 969875 995610 1023434 1052984
56208A052984L0399L1231L3100L5962L9224M2680M6457N0548N4790N8919O2666
$$ 1052984 1083383 1114614 1147714 1183676 1222900 1265580 1312037 1362585 1417375 1476294 1538960
56197A538960O6402P1304P8071Q5704R2748R9564J07996J18680J30099J40702
$$ 1538960 1605362 1676666 1754737 1840441 1933189 2032753 2140749 2259429 2389528 2530230
56187B530230J50583J60441J69934J78015J84096J88105J89840J88949J85260
$$ 2530230 2680813 2841254 3011188 3189203 3373299 3561404 3751244 3940193 4125453
56178D125453J78671J68805J55073J37014J14691Q8953O1212L2590L466k5864
$$ 4125453 4304124 4472929 4628002 4765016 4879707 4968660 5029872 5062462 5065928 5040064
56168E040064n4426q0866j04209j23889j39565j51553j60892j68174j72717j73720
$$ 5040064 4985638 4904772 4800563 4676674 4537109 4385556 4224664 4056490 3883773 3710053
56158C710053j71770j68263j63828j58279j51696j44455j36522j27789j18817
$$ 3710053 3538283 3370020 3206192 3047913 2896217 2751762 2615240 2487451 2368634
56149B368634j10206j01728r3284q6034q0993p6984p1869o5675o0445n6882n3214
$$ 2368634 2258428 2156700 2063416 1977382 1896389 1819405 1747536 1681861 1621416 1564534 1511320
56138A511320m8038m2307l7522l3648k9956k6641k4296k2737k1490k0607k0090
$$ 1511320 1463282 1420975 1383453 1349805 1319849 1293208 1268912 1246175 1224685 1204078 1183988
56127A183988j9189j7313j5020j3236j2008j0728r092p174n157l644l533m779
$$ 1183988 1164799 1147486 1132466 1119230 1107222 1096494 1087402 1080228 1075071 1071427 1067894 1063115
56115A063115n819n129l013j037o6L43Q91J775K882L913M275L659K880L440N841
$$ 1063115 1057296 1052167 1049154 1048117 1048051 1048394 1049285 1051060 1053942 1057855 1062130 1065789 1068669 1072109 1077950
56100A077950Q874J1022J2201J3482J5398J7297J8632J9987K2175K4808K6742
$$ 1077950 1086824 1097846 1110047 1123529 1138927 1156224 1174856 1194843 1217018 1241826 1268568
56089A268568K7886K9525L2693L7102M2089M7724N4308O1379O7902P3050P6271
$$ 1268568 1296454 1325979 1358672 1395774 1437863 1485587 1539895 1601274 1669176 1742226 1818497
56078A818497P7050P5083P0467O3486N4829M6221L9951L7090L6682L6946L6487
$$ 1818497 1895547 1970630 2041097 2104583 2159412 2205633 2245584 2282674 2319356 2356302 2392789
56067B392789L4189K9330K2687J6308J1268O678J732k730o064r765j5862k4378
$$ 2392789 2426978 2456308 2478995 2495303 2506571 2513249 2514981 2512251 2506187 2496422 2480560 2456182
56055B456182l3983m3922n3273n9507o0388n7102n3147n0204m7119m2802l7739
$$ 2456182 2422199 2378277 2325004 2265497 2205109 2148007 2094860 2044656 1997537 1954735 1916996
56044A916996l2462k6776k0989j6072j2196q785o201n376n537m418j354J925M228
$$ 1916996 1884534 1857758 1836769 1820697 1808501 1799716 1793515 1788139 1782602 1778184 1776830 1778755 1782983
56031A782983O475R381J1695J2305J2353J3533J5499J6640J6663J6826J7972J9703
$$ 1782983 1789458 1798839 1810534 1822839 1835192 1848725 1864224 1880864 1897527 1914353 1932325 1952028
56019A952028K1270K2350K2904K2994K2887K3104K4156K6072K8007K8839K8639
$$ 1952028 1973298 1995648 2018552 2041546 2064433 2087537 2111693 2137765 2165772 2194611 2223250
56008B223250K8983L0984L3621L5109L5392L5924L7241L8310L8337L7842L7741
$$ 2223250 2252233 2283217 2316838 2351947 2387339 2423263 2460504 2498814 2537151 2574993 2612734
55997B612734L8479M0206M2665M4869M5910M6085M6378M7203M8566N0736N3412
$$ 2612734 2651213 2691419 2734084 2778953 2824863 2870948 2917326 2964529 3013095 3063831 3117243
55986C117243N5007N4534N3549N4403N7134O0082O2908O6460P0189P2525P3953
$$ 3117243 3172250 3226784 3280333 3334736 3391870 3451952 3514860 3581320 3651509 3724034 3797987
55975C797987P6901Q2079Q7570R2075R6533J01644J06425J10377J14867J21059
$$ 3797987 3874888 3956967 4044537 4136612 4233145 4334789 4441214 4551591 4666458 4787517
55965D787517J28182J34875J40736J45695J49618J53249J58173J65077J73320
$$ 4787517 4915699 5050574 5191310 5337005 5486623 5639872 5798045 5963122 6136442
55956F136442J82309J91884K01448K10485K19794K30344K41444K52166K63891
$$ 6136442 6318751 6510635 6712083 6922568 7142362 7372706 7614150 7866316 8130207
55947H130207K78512K94669L09106L21730L35906L53603L73681L95282M19139
$$ 8130207 8408719 8703388 9012494 9334224 9670130 10023733 10397414 10792696 11211835
55938A1211835M45012M71486M99075N29875N63502N97198O30510O65835P03638
$$ 11211835 11656847 12128333 12627408 13157283 13720785 14317983 14948493 15614328 16317966
55929A6317966P41514P78862Q17944Q59333R01205R44348R92768J047953J107979
$$ 16317966 17059480 17838342 18656286 19515619 20416824 21361172 22353940 23401893 24509872
55920B4509872J173789J250378J339748J439166J549191J676939J827862K000552
$$ 24509872 25683661 26934039 28273787 29712953 31262144 32939083 34766945 36767497
55912C6767497K193231K408984K650753K918108L214146L549902L937764M386761
$$ 36767497 38960728 41369712 44020465 46938573 50152719 53702621 57640385 62027146
55904F2027146M907648N513721O210504O992521P856665Q811764R870511J1042265
$$ 62027146 66934794 72448515 78659019 85651540 93508205 102319969 112190480 123232745
55896A23232745J2340136J3783589J5385649J7147134J9065691K1127158K3270808
$$ 123232745 135572881 149356470 164742119 181889253 200954944 222082102 245352910
55889B45352910K5369522K7220974K8469508K8474029K6350527K1384926J3613488
$$ 245352910 270722432 297943406 326412914 354886943 381237470 402622396 416235884
55882D16235884M055568n678505j4109831k0399501k4398445k6407839k6913275
$$ 416235884 420291452 414612947 400503116 380103615 355705170 329297331 302384056
55875C02384056k6400638k5252326k3721507k1969117k0109724j8228111j6382598
$$ 302384056 275983418 250731092 227009585 205040468 184930744 166702633 150320035
55868A50320035j4617664j2973796j1480413j0147334q970678p942223p049225
$$ 150320035 135702371 122728575 111248162 101100828 92130150 84187927 77138702
55861G7138702o273500n598242n012066m503045m055282l656317l302670k993177
$$ 77138702 70865202 65266960 60254894 55751849 51696567 48040250 44737580 41744403
55853D1744403k721703k481032k268976k085078j924739j781535j652512j536656
$$ 41744403 39022700 36541668 34272692 32187614 30262875 28481340 26828828 25292172
55845B5292172j430757j331294j238522j154644j079257j009808r45064q85099
$$ 25292172 23861415 22530121 21291599 20136955 19057698 18047890 17102826 16217727
55837A6217727q29294p77097p29398o86589o46594o07276n69427n35029n03934
$$ 16217727 15388433 14611336 13881938 13195349 12548755 11941479 11372052 10837023 10333089
55828A0333089m74785m48007m25166m06080l89032l73367l59570l46970l33570
$$ 10333089 9858304 9410297 8985131 8579051 8190019 7816652 7457082 7110112 6776542
55819F776542l18534l03184k89110k76193k62995k48461k32974k17896k04124
$$ 6776542 6458008 6154824 5865714 5589521 5326526 5078065 4845091 4627195 4423071
55810D423071j91426j79404j68480j58979j49850j39740j29044j19363j11060
$$ 4423071 4231645 4052241 3883761 3724782 3574932 3435192 3306148 3186785 3075725
55801C075725j03147r5491q9253q4748q0877p7091p3977p1333o7700o2779n8417
$$ 3075725 2972578 2877087 2787834 2703086 2622209 2545118 2471141 2399808 2332108 2269329 2210912
55790B210912n6154n5381n4843n4226n3325n1447m8898m7369m7412m7101m4561
$$ 2210912 2154758 2099377 2044534 1990308 1936983 1885536 1836638 1789269 1741857 1694756 1650195
55779A650195m0499l6821l4156l2217l1253l1360l1416l0396k8860k7709k6390
$$ 1650195 1609696 1572875 1538719 1506502 1475249 1443889 1412473 1382077 1353217 1325508 1299118
55768A299118k3992k1273j9768j9462j9140j8631j8868j9887k0490k0066j9363
$$ 1299118 1275126 1253853 1234085 1214623 1195483 1176852 1157984 1138097 1117607 1097541 1078178
55757A078178j9139j9192j9055j8713j8342j8018j7792j7470j6390j4115j1265
$$ 1078178 1059039 1039847 1020792 1002079 983737 965719 947927 930457 914067 899952 888687
55746H88687q982p577o412n123m205m143m555m616m107l653l887m549m739m134
$$ 888687 879705 872128 865716 860593 856388 852245 847690 843074 838967 835314 831427 826878 822139 818005
55732H18005l541l804m493m412l141j263R11L709O860Q856Q149M504j030o785
$$ 818005 814464 810660 806167 801755 798614 797351 798262 801971 808831 817687 825836 830340 829310 822525
55718H22525j0972j2593j2411j2268j2961j3533j2998j1717j0440r000o911m674
$$ 822525 811553 798960 786549 774281 761320 747787 734789 723072 712632 703632 696721 692047
55706F92047l515m154o293q964j0961j1560j1268j1301j1907j1984j0757q991
$$ 692047 688532 684378 678085 669121 658160 646600 635332 624031 612124 600140 589383 580392
55694E80392p893p665p819q204q866r358q952p405n286l937m837p851j0231r067
$$ 580392 572499 564834 557015 548811 539945 530587 521635 514230 508944 505007 500170 492319 482088 473021
55680D73021n092k199k483l766l342j884j585k348k479k031k499l767m161l514
$$ 473021 467929 465730 463247 459481 456139 454255 452670 450322 447843 445812 443313 439546 435385 431871
55666D31871l627n247o909p300o743n853m660l716m081n404n700m053j946j075
$$ 431871 428244 422997 416088 408788 402045 396192 391532 387816 383735 378331 372631 368578 366632 365557
55652C65557j247j461j494j296j91J886L453L103J255p90k563m038m540l629k405
$$ 365557 364310 362849 361355 360059 359868 361754 365207 368310 369565 368775 366212 362174 357634 354005 351600
55637C51600k350l213l484k772k330l077m323m716l689j803k66j56j523l272m328
$$ 351600 349250 346037 342553 339781 337451 334374 330051 325335 321646 319843 319577 319421 317898 314626 310298
55622C10298m576m210k816j03K873M480M452L953L631K793Q89j180j901q16J106
$$ 310298 305722 301512 298696 298593 301466 305946 310398 314351 317982 320775 321664 320484 318583 317767 318873
55607C18873K419K315J124j27q75j498k333k682j702j5P29L7q44q38m48n97j054
$$ 318873 321292 323607 324731 324604 323729 322231 319898 317216 315514 315499 316228 316265 315421 314583 314135 313538 312484
55590C12484r13k5R49J532J696J374N15m77r38o42M5N78N16m48k291m454o089
$$ 312484 311571 311546 312495 314027 315723 317097 317612 317135 316197 315555 315600 316178 316694 316246 313955 309501 303412
55573C03412o625o206n691n964o866p036n550l508k982m296n554n206l864k863
$$ 303412 296787 290581 284890 278926 272060 265024 259474 255966 252984 248688 243134 237928 234064 231201
55559B31201k382k054k214l035l331j964Q4O76o44k413l584m297m361l039r54
$$ 231201 228819 226765 224551 221516 218185 216221 216305 216981 216337 213924 210340 206043 201682 198643 197689
55544A97689k77j971m274m942l881k476j527r85q73j117j003m1R78Q87r3m55P18
$$ 197689 197412 195441 191167 186225 182344 179868 178341 177356 176483 175366 174363 174322 175300 176187 176094 175639 176357
55527A76357K583L330J849j123l378l207j309Rk78p90l9J371J842J074Q5l77j81
$$ 176357 178940 182270 184119 182996 179618 176411 175102 175111 174833 174043 174004 175375 177217 178291 178376 177999 177818
55510A77818P50K033K473J535P30J870M157M801K675l27k065k561k870l042k500
$$ 177818 178568 180601 183074 184609 185339 187209 191366 196167 198842 198515 196450 193889 191019 187977 185477
55495A85477j548j140j464j754j506j116j214j739k035j713j191j069j097m50
$$ 185477 183929 182789 181325 179571 178065 176949 175735 173996 171961 170248 169057 167988 166891 166441
55481A66441O93Q39p59k562k438n08J189J576J486J630J381L50m08J16J210J406
$$ 166441 167134 167973 167214 164652 162214 161706 162895 164471 165957 167587 168968 169318 168910 169026 170236 171642
55465A71642M80m98p54n07l88p74j566k220k329k284k806l639l576k253r31p83
$$ 171642 172122 171624 170870 170363 169975 169201 167635 165415 163086 160802 157996 154357 150781 148528 147597 146814
55449A46814j289j314r76j259k213k812k506j819j364j109p98l31L15R82J147
$$ 146814 145525 144211 143235 141976 139763 136951 134445 132626 131262 130153 129355 129024 129339 130321 131468
55434A31468M52o23j274j449j707j994j465J75J906K492J832Q66M89R47J919K733
$$ 131468 131920 131297 130023 128574 126867 124873 123408 123583 125489 127981 129813 130679 131168 132115 134034 136767
55418A36767K633J341n23j851k026j417p95l80K14J060J396N11j110k208k322
$$ 136767 139400 140741 140218 138367 136341 134924 134129 133749 133963 135023 136419 136930 135820 133612 131290
55403A31290k110j954j276J29J092O28k60J10J279R37j461l338k407k2P04o99
$$ 131290 129180 127226 125950 126079 127171 127799 127539 127649 128928 129865 128404 125066 122659 122637 123341 122642
55387A22642j704p88M80K64n92j81J138J235l21j468q52J84m7p61M7K328L730
$$ 122642 120938 120150 120630 120894 120302 120121 121259 122494 122173 120705 119853 120037 119990 119229 119276 121604 125334
55370A25334K631Pj941j949k23K089L460K896R09q67j425j255j279j563j623j355
$$ 125334 127965 127972 126031 124082 123859 125948 129408 132304 133213 132346 130921 129666 128387 126824 125201 123846
55354A23846j091j017j055j108j000m45N48J386J347K72j212k029j313O97K428
$$ 123846 122755 121738 120683 119575 118575 118130 118678 120064 121411 121683 120471 118442 117129 117826 120254
55339A20254K236K17j759k098j031R1L44l71j775l266l904l133j450Q8R24J226
$$ 120254 122490 122707 120948 118850 117819 117910 118254 117883 116108 112842 108938 105805 104355 104443 105367 106593
55323A06593J310J343J435J616J772J795J658J194K43p98j052k23Q94J383J252
$$ 106593 107903 109246 110681 112297 114069 115864 117522 118716 118959 118161 117109 116886 117780 119163 120415
55308A20415J008O96K7q29j342j406j422j678k016k131j813j043j43L64K80l0
$$ 120415 121423 122119 122146 121317 119975 118569 117147 115469 113453 111322 109509 108466 108323 108687 108967 108937
55292A08937q7L27J308K749L923L879K620J232M34j60q11q33P1O54l06j948k372
$$ 108937 108850 109177 110485 113234 117157 121036 123656 124888 125322 125162 124351 123518 123589 124243 123937 121989 119617
55275A19617j419q20j530k386j826Q2J830J998M97j191j138R95L314L844K837
$$ 119617 118198 117378 115848 113462 111636 111718 113548 115546 116043 114852 113714 114709 118023 121867 124704
55260A24704J869J267J00j527k155j286k26q5n15j089k126l171k531J91K577K197
$$ 124704 126573 127840 127940 126413 124258 122972 122746 122661 122146 121057 118931 115760 113229 113420 115997 118194
55244A18194k8j123k4J587K071J518N43q33k437l343k783j051Q91K213K501J865
$$ 118194 118166 117043 117019 118606 120677 122195 122738 121905 119468 116125 113342 112291 113182 115395 117896 119761
55228A19761J042O96N72p1j064j198J43J941K718K246J495J137Q17o8j353k192
$$ 119761 120803 121499 122071 122000 120936 119738 119881 121822 124540 126786 128281 129418 130235 130167 128814 126622
55212A26622j976q85M86J765K795L199K505Q89p24j533j529j057l08L27P2j206
$$ 126622 124646 123761 124247 126012 128807 132006 134511 135400 134676 133143 131614 130557 130249 130576 130648 129442
55196A29442k241j653J36J332J089K91j39m66j140j747j872k047k698k927j689
$$ 129442 127201 125548 125684 127016 128105 128396 128257 127791 126651 124904 123032 120985 118287 115360 113671
55181A13671K91J171N50j31J92R05J162J191J379J184P1j314j950j833j482p53
$$ 113671 113962 115133 115683 115552 115744 116649 117811 119002 120381 121565 121636 120322 118372 116539 115057 114304
55165A14304N80J627J311K50J27J087J466M83n24l56J90j01p91p63l13n53j346
$$ 114304 114884 116511 117822 118072 118199 119286 120752 121235 120711 120355 120545 120444 119653 118890 118577 118024 116678
55148A16678j418l74Q79J639J953J690N54p25o35J115K948L418K849K320J917
$$ 116678 115260 114886 115765 117404 119357 121047 121601 120876 120241 121356 124304 127722 130571 132891 134808
55133A34808R79n33j835k248j733p05K83Q53J123J384J318J27k133l907l555j186
$$ 134808 135787 135254 133419 131171 129438 128733 129016 129869 130992 132376 133694 133821 131688 127781 124226 123040
55117A23040J470K841K704J859J273J468K220K638J939K80j353k153k166j872
$$ 123040 124510 127351 130055 131914 133187 134655 136875 139513 141452 141732 140379 138226 136060 134188
55103A34188j403m77P93J421L84j918l610l154j005J001J648J249P40N83P19R79
$$ 134188 132785 132308 133101 134522 134906 132988 129378 126224 125219 126220 127868 129117 129857 130440 131159 132138
55087A32138J267J502J535J001m16k199k988j990j98P00L75j11j41j71m50m80
$$ 132138 133405 134907 136442 137443 137027 134828 131840 129850 129652 130352 130727 130616 130475 130304 129854 129374
55071A29374j51j66o65n99P20K360K939K191O42j281k788k477RK632K825N63j683
$$ 129374 129223 129057 128392 127793 128513 130873 133812 136003 136645 135364 132576 130099 130108 132740 135565 136128 134445
55054A34445k063j155n46p23r15l52Q09J696J726J430J828K914L363K307O16l15
$$ 134445 132382 131227 130681 129958 129043 128691 129500 131196 132922 134352 136180 139094 142457 144764 145380 145065
55038A45065l58k37M6J080K567L241K372M99j338k288j899n78M10L31P9Q51K083
$$ 145065 144707 144470 144516 145596 148163 151404 153776 154275 152937 150649 148750 148172 148582 148913 148992 149843 151926
55021A51926K174J007J00J55K40j92k83M62R80L43o44o76J07O31N71M84P72J402
$$ 151926 154100 155107 155207 155362 155602 155410 155127 155589 156569 156912 156268 155592 155699 156330 156901 157385 158157 159559
55003A59559K135K301J076j204k832k709j775j430j434p08M58P02r3m75L86J542
$$ 159559 161694 163995 165071 163867 161035 158326 156551 155121 153687 152979 153437 154139 154046 153571 153957 155499
54987A55499J732Q42n12j781k358j672j53P00rj332j668q37j18m18j215j481j051
$$ 155499 157231 158073 157561 155780 153422 151750 151597 152297 152288 150956 149288 148451 148333 147915 146700 145219 144168
54970A44168o37p79j182j082l1J710L269L622K391M04q43o93m2j04q19j252j291
$$ 144168 143531 142752 141570 140488 140457 142167 145436 149058 151449 151853 151010 150317 150275 150171 149352 148100 146809
54953A46809j714k502k403q68Q78J577J699K204K553J658K74L93K104L037J609
$$ 146809 145095 142593 140190 139322 140200 141777 143476 145680 148233 149891 150165 150558 152662 155699 157308
54938A57308p91j862j365p68q89j309j623j886j898j216p7O46O05L39K38k1n84
$$ 157308 156517 154655 153290 152522 151633 150324 148701 146815 144917 143701 143624 144270 144875 145214 145452 145431 144847
54921A44847p39J70J502J860Q68k74k49Q20J754J881J638J586J467P27l60q06
$$ 144847 144108 144278 145780 147640 148508 148234 147985 148805 150559 152440 154078 155664 157131 157858 157498 156692
54905A56692k48M42K46n52n88Q66K849L645K628Q47k31j97K37L42M7m50j175k131
$$ 156692 156444 156886 157132 156580 155992 156858 159707 163352 165980 166827 166596 166399 166636 166978 167025 166575 165400 163269
54887A63269k848k648j370L99J817K446K483K459K576K356J184o58j979j967j072
$$ 163269 160421 157773 156403 156802 158619 161065 163548 166007 168583 170939 172123 171465 169486 167519 166447
54872A66447k09M37J167J742J570Q24M33O89P60l9j197j779j588j034k60R15K408
$$ 166447 166238 166675 167842 169584 171154 171978 172411 173100 173860 173821 172624 170845 169257 168223 167963 168878 171286
54855A71286L824M860N453N619N481N303N192M933M356L665L166K820K299J327
$$ 171286 175110 179970 185423 191042 196523 201826 207018 211951 216307 219972 223138 225958 228257 229584
54841B29584j31j670k539k424k151k825m145m618l825l307m188n241m680l004
$$ 229584 229453 227783 225244 222820 220669 217844 213699 209081 205256 201949 197761 192520 187840 184836
54827A84836k133k211j473N88K087J552P6m93l0M95R31J607J915R09q78j641m48
$$ 184836 182703 180492 179019 179607 181694 183246 183322 182829 182799 183294 184225 185832 187747 188656 187778 186137 185689
54810A85689J849L904N209O060O866P594P461N513K113o87j230l56k62j517k619
$$ 185689 187538 191442 196651 202711 209577 217171 224632 230145 232258 231571 230341 229985 229723 228206 225587
54795B25587k544k123k365k848k880l094m551o708p663o386l929k128j704j822
$$ 225587 223043 220920 218555 215707 212827 209733 205182 198474 190811 184425 180496 178368 176664 174842
54781A74842j313j71K66j070l420m781m158k486j097k36M08O69L99L00J020J794
$$ 174842 173529 173358 173624 172554 169134 164353 160195 157709 156612 156376 156784 157453 157852 158152 159172 160966
54765A60966J256m04j378n86R85J743J395P45L10r6o82j263j565j547j387j232
$$ 160966 162222 161818 160440 159854 160839 162582 163977 164722 165032 164936 164254 162991 161426 159879 158492 157260
54749A57260r43j70J094K107J957N95r66j639j129Q0J121J201K52o61k49J390
$$ 157260 156317 156147 157241 159348 161305 161900 160934 159295 158166 158246 159367 160568 160820 160159 159910 161300
54733A61300K688K518J548J108J317J176L04m16j68N40M25r36k445k585j130N08
$$ 161300 163988 166506 168054 169162 170479 171655 171959 171543 171375 171915 172340 171404 168959 166374 165244 165752
54717A65752Q63J20j82R33K825M209M408L370J383n29o71J631M692N902M546K308
$$ 165752 166615 166735 166553 167486 170311 174520 178928 182298 183681 183152 182481 184112 188804 194706 199252 201560
54701B01560R94Q15J155J872L083M392N203N455N398M914L715J993K78j264k781
$$ 201560 202554 203369 204524 206396 209479 213871 219074 224529 229927 234841 238556 240549 240827 239563 236782
54686B36782m034m271l171j443j92J79P0k41j121k835m523m731l238j727j852
$$ 236782 232748 228477 225306 223863 223671 223850 223920 223679 222558 219723 215200 210469 207231 205504 203652
54671B03652l060l252j540O94J821J914J962K089J620M92n55j094j321j209l27
$$ 203652 200592 197340 195800 196494 198315 200229 202191 204280 205900 206392 205837 204743 203422 202213 201886
54656B01886J220K575L270L861M950O141O544N854M427K653R38q0p6K39k67j735
$$ 201886 203106 205681 208951 212812 217762 223903 230447 236301 240728 243381 244319 244239 244163 244402 244135 242400
54640B42400l177l938m516n403n922n092l434k745l785n077m695k677q77o47j596
$$ 242400 239223 235285 230769 225366 219444 214352 210918 208173 204388 199311 194616 191939 191062 190415 188819
54625A88819k603l106k976k033m77O54M08r16k182k921l560m172l975k528p06
$$ 188819 186216 183110 180134 178101 177624 178278 178686 177770 175588 172667 169107 164935 160960 158432 157726
54610A57726K09m7o36o47K84J982L611L886K218k81j646j089L33J249J434J336
$$ 157726 157935 157888 157252 156605 156889 158871 162482 166368 168586 168305 166659 165570 165903 167152 168586 169922
54594A69922Q71l66j809j868K90L274M414K387j282l657l298j538o42j021j003
$$ 169922 170793 170427 168618 166750 167040 170314 174728 177115 175833 172176 168878 167340 166698 165677 164674
54579A64674M96K063J458j232l505l614k526j941j644k61J978L082K032J24r86
$$ 164674 165170 167233 168691 167459 163954 160340 157814 155873 154229 153968 155946 159028 161060 161184 160198
54564A60198j123p61K80J996L122K522J089N84R31M03j430k868k648j613r44k87
$$ 160198 159075 158314 158594 160590 163712 166234 167323 167907 168838 169241 167811 164943 162295 160682 159738 159451
54548A59451J109K699L462L605L891M028L181J631L68o25k004l235k943j254j6
$$ 159451 160560 163259 166721 170326 174217 178245 181426 183057 183425 182800 180796 177561 174618 173364 173348
54533A73348r3k60L79O15q06k621k428j01J928J769R8j173j100j13R57J640J953
$$ 173348 173255 172995 173374 173989 173183 170562 168134 168033 169961 171730 171828 170655 169555 169442 170399 172039 173992
54516A73992K068J840P73j173k916k989j126J358K941L206K687J789M13j366k697
$$ 173992 176060 177900 178673 177500 174584 171595 170469 171827 174768 177974 180661 182450 182863 181497 178800
54501A78800k517q38Q41R70k64j152n74P55J515J463J246J124Q58N61O59J001
$$ 178800 176283 175445 176286 177256 176992 175840 175266 176021 177536 178999 180245 181369 182227 182788 183447 184448
54485A84448R19L23l1L51J019J229P32k65j334j786j100K56J066P98K39L03Q41
$$ 184448 185367 185690 185659 186010 187029 188258 188990 188725 187391 185605 184505 184761 185827 186625 186864 187167 188008
54468A88008J169J165J169J182J002P69O94M45l13r74n52P07J197n2j991k688
$$ 188008 189177 190342 191511 192693 193695 194464 195158 195603 195290 194316 193764 194471 195668 195616 193625 190937
54452A90937j489M56J592J326K02q00j081q55q41j414k103k111j254j19O90J123
$$ 190937 189448 189904 191496 192822 193024 192224 191143 190288 189447 188033 185930 183819 182565 182446 183136 184259
54436A84259J384J403R48J43m84n51j77K73N96P59P46O20N94P51Q10L93n18j552
$$ 184259 185643 187046 187994 188137 187653 187102 186925 187198 187794 188553 189299 189919 190513 191264 192074 192467 191949 190397
54418A90397k254k222j209N14K024K470J914J048K63m08n66K98J618J867N36q58
$$ 190397 188143 185921 184712 185226 187250 189720 191634 192682 192945 192537 191971 192269 193887 195754 196290 195432
54402A95432n84J123K724L595M323M946M427K347n3j201r10k07K1m58j464k463
$$ 195432 194848 195971 198695 202290 206613 211559 215986 218333 218280 217079 216169 215962 215983 215525 214061 211598
54386B11598k636j562J52J428J766J475R66K60q11k194l453l920l220j776n71
$$ 211598 208962 207400 207552 208980 210746 212221 213187 213447 212636 210442 206989 203069 199849 198073 197502
54371A97502j04J30P60J534J692J100L83k8k97n74o12k55K50P08J288K040K559
$$ 197502 197398 197528 198288 199822 201514 202614 202997 202969 202672 202098 201486 201231 201481 202189 203477 205517 208076
54354B08076K492K021J408M41j035k316k424j462o11n76o93qJ320K265K232J573
$$ 208076 210568 212589 213997 214438 213403 211087 208663 207201 206590 206014 205321 205313 206633 208898 211130 212703
54338B12703J048J188J995K782K584J318L31R71K648L240J703n62j393k80J462
$$ 212703 213751 214939 216934 219716 222300 223618 223949 224920 227568 230808 232511 231949 230556 230276 231738
54323B31738K314J830O90R1O29J435R56q63k116j505m23j016k910l701k478p82
$$ 231738 234052 235882 236572 236663 237292 238727 239683 238820 236704 235199 234776 233760 230850 227149 224671 223889
54307B23889K36J388L276M651M553M400N864P729P228M147J417J282K754L420
$$ 223889 224125 225513 228789 233440 237993 242393 248257 255986 263214 267361 268778 270060 272814 276234
54293B76234K255l3k237l361l068k114j775k345k907k910k995l687m297m046l527
$$ 276234 278489 278456 276219 272858 269790 267676 265901 263556 260649 257739 254744 251057 246760 242714 239187
54278B39187l933n240o092n374l277r85J52m50j825k049m17J369J146q35k164
$$ 239187 235254 230014 223922 218548 215271 214286 214438 213988 212163 210114 209697 211066 212212 211377 209213
54263B09213j340N46J547J158K76k47k19J61M44J02p93j280n78P63J453J165R04
$$ 209213 207873 208419 209966 211124 211400 211153 210934 211095 211539 211641 210848 209568 208990 209753 211206 212371 213275
54246B13275J486K324K206Q48q40j876k010j540q02r7L79P21J178J578J323L21
$$ 213275 214761 217085 219291 220139 219299 217423 215413 213873 213071 212974 213353 214074 215252 216830 218153 218474
54230B18474m28J38J655K620K190R75j43j111k071k468j768o58m44j239j819j500
$$ 218474 218046 218184 219839 222459 224649 225624 225481 224370 222299 219831 218063 217405 216961 215722 213903 212403
54214B12403j095j375j498j15K393L987L492J881N78m51j901l106k498j07J884
$$ 212403 211308 209933 208435 208320 210713 214700 218192 220073 220651 220200 218299 215193 212695 212588 214472
54199B14472J887J003J246K549L109K343J712K277L001K406P83k92j8J102K170
$$ 214472 216359 217362 218608 221157 224266 226609 228321 230598 233599 236005 236788 236496 236478 237580 239750
54184B39750K482J544m83k494l332k884j732k56J198J753P84q93j733j380q38
$$ 239750 242232 243776 243293 240799 237467 234583 232851 232595 233793 235546 236330 235437 233704 232324 231486
54169B31486p84q89r93j603k732l386k967k265k228k522k221j302n75m81q05j248
$$ 231486 230702 229813 228820 227217 224485 221099 218132 215867 213639 211117 208896 207594 207019 206538 205733 204485
54153B04485j503j054L28J957K845K772K271J703J023L88J88L94M47Ko27r67q35
$$ 204485 202982 201928 202256 204213 207058 209830 212101 213804 214827 215215 215403 215797 216244 216246 215619 214652 213817
54136B13817k70O32J540J908J476O49J42K09L89J88m6O36K242L110J644j201k388
$$ 213817 213547 214179 215719 217627 219103 219752 219894 220103 220492 220680 220634 221270 223512 226622 228266 227065 224677
54119B24677m01K773M176L511K785K898K439L23k053k454p27R80Q01r30k388k320
$$ 224677 224276 227049 231225 234736 237521 240419 242858 243181 241128 238674 237947 238927 239728 238798 236410 234090
54103B34090j187m59r35j939k237j457k31P97J454J599R69j86r61o78L77J455
$$ 234090 232903 232444 231509 229570 227333 225876 225645 226442 227896 229495 230464 230278 229317 228639 229016 230471
54087B30471K035J838P13r11k012k030j608j592j730j163l7M21l44j337j309l09
$$ 230471 232506 234344 235057 234146 232134 230104 228496 226904 225174 224011 223974 224395 224051 222714 221405 221096
54071B21096O30R38R96J328J875K151J795R18N2k69L5N28Q33J011J196J140N46
$$ 221096 221726 222664 223660 224988 226863 229014 230809 231727 231779 231510 231545 232073 232906 233917 235113 236253 236799
54054B36799k64n03KM28j10j451k508k351r11J108K694L003J860%j403j539l46
$$ 236799 236535 236032 236034 236462 236352 234901 232393 230042 229131 230239 232933 235936 237796 237796 236393 234854 234508
54037B34508J621L418L992K860P10r73j150j1J499K623L158L269L247L317L399
$$ 234508 236129 239547 243539 246399 247109 246136 244986 244975 246474 249097 252255 255524 258771 262088 265487
54022B65487L236K917L023L919M992N013L440J133l53k37P95J311N11j184k829
$$ 265487 268723 271640 274663 278582 283574 288587 292027 293160 292807 292570 293365 294676 295187 294003 291174
54007B91174l842m094l588k623k042k498l376l228j580L33J138R21P40J093J654
$$ 291174 287332 283238 279650 277027 274985 272487 269111 265883 264303 264636 265774 266695 267435 268528 270182
53992B70182K172K722L225L450L515L679L658K915J818J755L619O609Q921R449
$$ 270182 272354 275076 278301 281751 285266 288945 292603 295518 297336 299091 302710 309319 318240 327689
53978C27689Q534P304O604O610P136Q005Q868Q940P535N122L223K806L273L598
$$ 327689 336223 343527 350131 356741 363877 371882 380750 389690 397225 402347 405570 408376 411649 415247
53964D15247L798M375M822M059K276J048J162J519P53j060k982m647o201p392
$$ 415247 419045 423420 428242 432301 434577 435625 436787 438306 439059 437999 435017 430370 424169 416777
53950D16777p763p448p006o620o211o073o636p559p782o685m719k775j349m53
$$ 416777 409014 401566 394560 387940 381729 375656 369020 361461 353679 346994 342275 339500 338151 337698
53936C37698J20N47P72L50j121l298n111n728n340m756m357l828k908j979j503
$$ 337698 337818 338365 339137 339487 338366 335068 329957 324229 318889 314133 309776 305948 303040 301061 299558
53921B99558j192l89P08R91N4q45k70J373K367K009J338J329J559J264P45Q27
$$ 299558 298366 297977 298685 299676 299730 298885 298615 299988 302355 304364 305702 307031 308590 309854 310599 311426
53905C11426J551K206K337K040J562J179J246J724K009J796J738K595M027N023
$$ 311426 312977 315183 317520 319560 321122 322301 323547 325271 327280 329076 330814 333409 337436 342459
53891C42459N319N594O414P781R552J1361J2185J1073Q523O188M888L840K223
$$ 342459 347778 353372 359786 367567 377119 388480 400665 411738 420261 426449 431337 435177 437400
53878D37400M34q60j917l067l432j839J222L777M640M412L998L373K433K002K904
$$ 437400 437834 436974 435057 431990 428558 426719 427941 431718 436358 440770 444768 448141 450574 452576 455480
53863D55480M520N442N388N402O075O751O838O903P604Q341Q051O914O188O314
$$ 455480 460000 465442 470830 476232 482307 489058 495896 502799 510403 518744 526795 533709 539897 546211
53849E46211O357N528M229L121J989L38j401k165j690j005j354l027n234o896
$$ 546211 552568 558096 562325 565446 567435 567773 566372 564207 562517 561512 560158 557131 551897 545001
53835E45001p484p208o556n793n184n379o930r270j0901j0925r880q732p721o802
$$ 545001 537517 530309 523753 517960 512776 507397 500467 491197 480296 469371 459491 450759 443038 436236
53821D36236o485p283q546q830p505n312l416k530k886m171n348n304m089k926
$$ 436236 429751 422468 413922 405092 397587 392275 388859 386329 383443 379272 373924 368620 364531 361605
53807C61605k671k841k567k005k143l347m725n111m326l301k957l205l153k253
$$ 361605 358934 356093 353526 351521 349378 346031 341306 336195 331869 328568 325611 322406 319253 317000
53793C17000j017m57r73j928k214j221N70J860J695M65n85r08j139j745k024j220
$$ 317000 315983 315526 314553 312625 310411 309190 309760 311620 313315 313780 313195 312287 311148 309403 307379 306159
53777C06159k4J33r46j929j668k39J679L415M117L144J228L05J380L219L859K875
$$ 306159 306135 306268 305322 303393 301725 301486 303165 306580 310697 313841 315069 315374 316754 319973 323832 326707
53761C26707J382L46j20K0J007K437L048K128Q63J401M201O932O746L685Q93J033
$$ 326707 328089 328435 328315 328335 329342 331779 334827 336955 337818 339219 343420 350352 357098 360783 361676 362709
53745C62709L324M988M946M569M972N359M732L719L483L766L486K780K950M349
$$ 362709 366033 371021 375967 380536 385508 390867 395599 399318 402801 406567 410053 412833 415783 420132
53731D20132N582N219L454J634P17O48Q26P80N13K40k17j473l620n507n802m746
$$ 420132 425714 430933 434387 436021 436738 437386 438212 438992 439505 439745 439528 438055 434435 428928 423126 418380
53715D18380l994m535n658o419p116q313r162q075n070k177j010j008p71k90p84
$$ 418380 414386 409851 404193 397774 390658 382345 373183 365108 360038 357861 356851 355843 355072 354782 353998
53700C53998k583m377m733l544j731k63K18m75j677k241j818j221r40j32J831
$$ 353998 351415 347038 342305 338761 337030 336767 336985 336510 334833 332592 330774 329553 328613 328481 330312
53685C30312L537K917K62j794j710o52J2R09K774L956K229j379l105j204J864
$$ 330312 333849 336766 337028 335234 333524 332872 332884 333793 336567 340523 342752 341373 338268 337064 338928
53670C38928K979K216J755K285K537J890J450K117L136L336K854K751L456M459
$$ 338928 341907 344123 345878 348163 350700 352590 354040 356157 359293 362629 365483 368234 371690 376149
53656C76149N174N365M847L621K385K135K896L427K692J253O32J390K561L124
$$ 376149 381323 386688 391535 395156 397541 399676 402572 405999 408691 409944 410576 411966 414527 417651
53642D17651L398M461O398P805P260M997K770K112K883L671L312J984Q45Q27J844
$$ 417651 421049 425510 431908 439713 446973 451970 454740 456852 459735 463406 466718 468702 469547 470374 472218
53627D72218K979L277K410Q37n43r64l52M84M52q22k620l970m673n056m885l396
$$ 472218 475197 478474 480884 481721 481178 480214 479862 480346 480798 479976 477356 473386 468713 463657 458772 455376
53611D55376p81J268J334J66k56O50J512J194L25J37O97J114P83j35j094j346
$$ 455376 454595 455863 457197 457363 457107 457757 459269 460463 460788 460925 461622 462736 463519 463384 462290 460944
53595D60944l06J643L126L200K313J353M81l29m09P06K055K280J625J480K111
$$ 460944 460638 462281 465407 468607 470920 472273 472754 472425 472016 472722 474777 477057 478682 480162 482273
53580D82273K426K137K430L856N124M955L940L427L612L929M481N650O757O612
$$ 482273 484699 486836 489266 493122 498246 503201 507141 510568 514180 518109 522590 528240 534997 541609
53566E41609N421M833N787P273P732O833N359L951K768K137K681M406O240P030
$$ 541609 547030 551863 557650 564923 572655 579488 584847 588798 591566 593703 596384 600790 607030 614060
53552F14060O866O725O813O131M210K396K339L636M338L720L196M072N674O421
$$ 614060 620926 627651 634464 640595 644805 647201 649540 653176 657514 661234 664430 668502 674176 680597
53538F80597N806M407K702Q73o50j387j442j291j168j082j128j349j581j866k507
$$ 680597 686403 690810 693512 694385 693735 692348 690906 689615 688447 687365 686237 684888 683307 681441 678934
53523F78934l337l547k799j948j987k856l853m554m529l131p03P58k79k500l057
$$ 678934 675597 672050 669251 667303 665316 662460 658607 654053 649524 646393 645690 646448 646169 643669 640612
53508F40612j222R27J531R72M21M6l52k72O35J582J726J672K573M093M554L250
$$ 640612 639390 640317 641848 642820 643241 643287 642935 642663 643298 644880 646606 648278 650851 654944 659498 662748
53492F62748J573J455L291N773P305P335O599O367P227Q522R187R181R581J1023
$$ 662748 664321 665776 669067 674840 682145 689480 696079 702446 709673 718195 727382 736563 746144 757167
53478G57167J2591J2978J2415J2547J4230J6440J7886J8825K0303K2166K3184
$$ 757167 769758 782736 795151 807698 821928 838368 856254 875079 895382 917548 940732
53467I40732K3009K2657K2808K2955K2823K3344K5239K7684K9516L1007L3089
$$ 940732 963741 986398 1009206 1032161 1054984 1078328 1103567 1131251 1160767 1191774 1224863
53456A224863L5393L6490L6091L5623L6466L8570M1043M3141M4354M4405M3567
$$ 1224863 1260256 1296746 1332837 1368460 1404926 1443496 1484539 1527680 1572034 1616439 1660006
53445A660006M2519M1640M0865M0225L9835L9334L8119L6295L4679L3677L2878
$$ 1660006 1702525 1744165 1785030 1825255 1865090 1904424 1942543 1978838 2013517 2047194 2080072
53434B080072L2009L1445L1363L1144L0216K9009K8503K8994K9766K9891K9094
$$ 2080072 2112081 2143526 2174889 2206033 2236249 2265258 2293761 2322755 2352521 2382412 2411506
53423B411506K7834K6525K4684K1294J6329J1442Q352O813N073K245q93l551o212
$$ 2411506 2439340 2465865 2490549 2511843 2528172 2539614 2547966 2554779 2559852 2562097 2561204 2557653 2551441
53410B551441r674j3654j7033j9102k0157k1194k3195k6188k8938l0179l0229
$$ 2551441 2541767 2528113 2511080 2491978 2471821 2450627 2427432 2401244 2372306 2342127 2311898
53399B311898l0633l2052l3413l3416l2031l0131k8649k8391k9562l0929l0569
$$ 2311898 2281265 2249213 2215800 2182384 2150353 2120222 2091573 2063182 2033620 2002691 1972122
53388A972122k8244k5929k5071k4481k2189j8317j4559j1580q675n697l450k055
$$ 1972122 1943878 1917949 1892878 1868397 1846208 1827891 1813332 1801752 1793077 1787380 1783930 1781875
53376A781875m96J882M673P511J0535J3288J4612J4472J4861J7674K2387K6753
$$ 1781875 1781379 1783261 1787934 1795445 1805980 1819268 1833880 1848352 1863213 1880887 1903274 1930027
53364A930027K9418L0800L1754L2535L3365L4965L7873M1529M4823M7487N0410
$$ 1930027 1959445 1990245 2021999 2054534 2087899 2122864 2160737 2202266 2247089 2294576 2344986
53353B344986N4226N8042O0202O0362O0086O1251O4271O8323P2719P7288Q1659
$$ 2344986 2399212 2457254 2517456 2577818 2637904 2699155 2763426 2831749 2904468 2981756 3063415
53342C063415Q5088Q7195Q8366Q9219R0138R1377R2993R4312R4024R1472Q7613
$$ 3063415 3148503 3235698 3324064 3413283 3503421 3594798 3687791 3782103 3876127 3967599 4055212
53331D055212Q4292Q2517Q1817Q1095P9598P6968P2927O7425O0917N4034M6887
$$ 4055212 4139504 4222021 4303838 4384933 4464531 4541499 4614426 4681851 4742768 4796802 4843689
53320D843689L9092L0644K2393J5281R231L085m327j3252k2975l2469m1109m9033
$$ 4843689 4882781 4913425 4935818 4951099 4960330 4963415 4959088 4945836 4922861 4890392 4849283 4800250
53308D800250n6821o4645p1843p7564q1626q4472q6535q8105q9578r1095r1960
$$ 4800250 4743429 4678784 4606941 4529377 4447751 4363279 4276744 4188639 4099061 4007966 3916006
53297C916006r1246q9083q6672q4683q2386p8839p4343p0215o7520o6427o6414
$$ 3916006 3824760 3735677 3649005 3564322 3481936 3403097 3328754 3258539 3191019 3124592 3058178
53286C058178o6600o6105o4528o1920n8331n3868m9200m5242m1976l8514l4764
$$ 3058178 2991578 2925473 2860945 2799025 2740694 2686826 2637626 2592384 2550408 2511894 2477130
53275B477130l2011l0974l0247k8017k4669k2273k1681k1699k1174k0443k0131
$$ 2477130 2445119 2414145 2383898 2355881 2331212 2308939 2287258 2265559 2244385 2223942 2203811
53264B203811j9811j8730j7072j5563j4251j2569j0426q490p272o362m816k169
$$ 2203811 2184000 2165270 2148198 2132635 2118384 2105815 2095389 2086899 2079627 2073265 2068449 2066280
53252B066280J140M275O794Q843J0660J2272J3799J5734J8554K2143K5825K8907
$$ 2066280 2067420 2071695 2078489 2087332 2097992 2110264 2124063 2139797 2158351 2180494 2206319 2235226
53240B235226L1097L2593L3948L5668L7743L9758M1422M2583M2663M0925L7704
$$ 2235226 2266323 2298916 2332864 2368532 2406275 2446033 2487455 2530038 2572701 2613626 2651330
53229B651330L4658L3069L2394L1155K8663K5029K0123J3863P326K092j832o229
$$ 2651330 2685988 2719057 2751451 2782606 2811269 2836298 2856421 2870284 2877610 2879702 2877870 2871641
53217B871641j2256j8700k3415k5900k7681l0376l4052l7574m0080m1748m3151
$$ 2871641 2859385 2840685 2817270 2791370 2763689 2733313 2699261 2661687 2621607 2579859 2536708
53206B536708m4340m5007m5370m6121m7341m8314m8806m9525n0676n1133n0218
$$ 2536708 2492368 2447361 2401991 2355870 2308529 2260215 2211409 2161884 2111208 2060075 2009857
53195B009857m9266m9823n0981n0350m7508m4512m2851m1881m0846m0363m0873
$$ 2009857 1960591 1910768 1859787 1809437 1761929 1717417 1674566 1632685 1591839 1551476 1510603
53184A510603m1201m0091l7959l5824l3545l0572k7677k6284k6311k6117k4583
$$ 1510603 1469402 1429311 1391352 1355528 1321983 1291411 1263734 1237450 1211139 1185022 1160439
53173A160439k2286k0494j9802j9727j9152j7252j4517j2640j2895j4923j7428
$$ 1160439 1138153 1117659 1097857 1078130 1058978 1041726 1027209 1014569 1001674 986751 969323
53162I69323j9546k0943k1299k0711k0169k0539k1194k0655j8638j6573j5960
$$ 969323 949777 928834 907535 886824 866655 846116 824922 804267 785629 769056 753096
53151G53096j6866j8170j8658j7805j5983j4070j2643j1577j0665j0205j0496
$$ 753096 736230 718060 699402 681597 665614 651544 638901 627324 616659 606454 595958
53140E95958j1134j1489j1594j1809j1861j1050r405p856p174p302p694p801p236
$$ 595958 584824 573335 561741 549932 538071 527021 517616 509760 502586 495284 487590 479789 472553
53127D72553o119n145m778m612m162l939m689n789n663m010k356j959k324k425
$$ 472553 466434 461289 456511 451899 447737 443798 439109 433320 427657 423647 421291 419332 417008 414583
53113D14583k355k754l359l255k298j348j055j076p38k1L64j18r64j029O5J247
$$ 414583 412228 409474 406115 402860 400562 399214 398159 397083 396345 396324 396688 396570 395606 394577 394642 395889
53097C95889J337O82N41R52N47j220l016l556l376l501l428k038P1R61R8q39l96
$$ 395889 397226 397908 398449 399401 399948 398728 395712 392156 388780 385279 381851 379813 379884 380845 380943 380104 379708
53080C79708Q12J291O50l62j042j090m04P09J426J229O03L29M35M28K56K92N28
$$ 379708 380520 381811 382461 382099 381057 379967 379563 380272 381698 382927 383530 383859 384294 384722 384978 385270 385798
53063C85798N98O25J228K448L372L197K172J093L23j81k66L17J281J862J663J054
$$ 385798 386396 387021 388249 390697 394069 397266 399438 400531 400854 400673 400407 400724 402005 403867 405530 406584
53047D06584N40P8o49j540k104k235k508l329m075l700k252j152j557k930l858
$$ 406584 407124 407202 406553 405013 402909 400674 398166 394837 390762 387062 384810 383658 382101 379171 375313
53032C75313l827l426l030k345j299l38N16J774L181L458K193Q67Q24J207M43
$$ 375313 371486 368060 365030 362685 361386 361048 361564 363338 366519 369977 372170 373037 373861 375068 375511
53017C75511j047j521r63j231k900m149l681k707k687k842j699Q3N24o72j841
$$ 375511 374464 372943 371980 370749 367849 363700 360019 357312 354625 351783 350084 350167 350691 350019 348178
53002C48178j920j443r64k03P73J068L50l89k39M20Q01R74J430K046K366K431
$$ 348178 346258 344815 343851 343648 344421 345489 345839 345450 345211 345631 346432 347406 348836 350882 353248 355679
52986C55679K501K217J015o82j594j209n62q40j662j548o5J376J332K27l56J04
$$ 355679 358180 360397 361412 360730 359136 357927 357365 356525 354863 353315 353250 354626 355958 356185 355829 355933
52970C55933O48O06N32R02J098M72n65j470k529l756l819j755Q53J408j94j595
$$ 355933 356581 357187 357719 358621 359719 360191 359626 358156 355627 351871 348052 346297 347150 348558 348364 346769
52954C46769j516j162j409r55J419M374N509M299K096P3j452k287k373k093j546
$$ 346769 345253 344091 342682 341727 343146 347520 353029 357328 359424 359497 358045 355758 353385 351292 349746
52939C49746o1K421M230L607J103j069j721j447j053q05j042j895k379j255R52
$$ 349746 349685 352106 356336 359943 361046 359977 358256 356809 355756 354951 353909 352014 349635 348380 349332
52924C49332K327K224J954K462L053L119L401M367M863L805K110J362J452J179
$$ 349332 351659 353883 355837 358299 361352 364471 367872 372239 377102 380907 383017 384379 385831 387010
52910C87010N52O95J723K472K469K524K913K549Q01j031j217M8Q72L7j768l083
$$ 387010 387562 388257 389980 392452 394921 397445 400358 402907 403708 402677 401460 401508 402380 402417 400649 397566
52894C97566l317k944k541k109j352l55L10J65o43j554k153k373k312k184k280
$$ 397566 394249 391305 388764 386655 385303 384948 385258 385423 384780 383226 381073 378700 376388 374204 371924
52879C71924k609k601j681k28O30M58K55J104K424K399K75k442l524k336j91J134
$$ 371924 369315 366714 365033 364805 365435 365893 366148 367252 369676 372075 372350 369908 366384 364048 363857 364991
52863C64991P70j028l127l922k444L81K194J580l26j186j12J601K253J504K91
$$ 364991 365761 364733 361606 357684 355240 355621 357815 359395 359069 357883 357771 359372 361625 363129 363420
52848C63420l81l66m81j660l660m820l722j065R35J075K11l34l91m57n93o57q93
$$ 363420 363039 362673 362192 360532 356872 352052 348330 347265 348200 349275 349486 349152 348761 348304 347711 347054 346161
52831C46161j383j357k8K101L575L524K251O25m52k58J189K894L851M037L902
$$ 346161 344778 343421 343393 345494 349069 352593 354844 355469 355017 354759 355948 358842 362693 366730 370632
52816C70632L316J985M84k41k60m59r86j189j011j081j244m84J183K254J864J005
$$ 370632 373948 375933 376417 376176 375916 375457 374471 373282 372271 371190 369946 369462 370645 372899 374763 375768
52800C75768P16N15k62r00n81j90j025k403k467j103j62p11j728j950j449r03
$$ 375768 376484 376999 376737 375837 375256 375066 374041 371638 369171 368068 367906 367195 365467 363517 362068 361165
52784C61165n96q44k180m291n623m887k513j10Q46l27l180n764n760k920K82J379
$$ 361165 360569 359725 357545 353254 347631 342744 340231 340121 340967 340640 337460 331696 325936 323016 323298 324677
52768C24677O62K37R44J575R69m13j316j187m23L21O98Q88J381K262K823K316
$$ 324677 325339 325576 326520 328095 329064 328651 327335 326148 325725 326046 326744 327632 329013 331275 334098 336414
52752C36414J019n2m07m58n12j89P99J860K056J250L19K63J212K162J731n26l411
$$ 336414 337433 337381 336974 336516 336004 335815 336614 338474 340530 341780 342099 342362 343574 345736 347467 346941 343530
52735C43530n000m414k525q76k67m79r09j097q50k21O39J640K639L291L324K891
$$ 343530 338530 334116 331591 330715 330448 329969 329060 327963 327113 326892 327531 329171 331810 335101 338425 341316
52719C41316K297J391j37j880k888k936k724k447j164J467L728L462Q39j738k465
$$ 341316 343613 345004 344867 342987 340099 337163 334439 331992 330828 332295 336023 339485 340324 338586 336121
52704C36121j668m71O78J568J545J75j933l696m491m150k658m86J304K045K152
$$ 336121 334453 333982 334660 336228 337773 337948 336015 332319 327828 323678 321020 320534 321838 323883 326035
52689C26035K299K403K121J781J874K009J449N38M96J618K826L292L575M470N597
$$ 326035 328334 330737 332858 334639 336513 338522 339971 340509 341005 342623 345449 348741 352316 356786 362383
52674C62383N830M831L425K571K452K521K125J177K71M4K73j4j373l208m474m804
$$ 362383 368213 373044 376469 379040 381492 384013 386138 387315 387586 387630 387903 387889 386516 383308 378834 374030
52658C74030m559m010k978j389K58J179J079L28o37j858l397m449l677r41J898
$$ 374030 369471 365461 362483 361094 361352 362531 363610 363938 363301 361443 358046 353597 349920 348979 350877
52643C50877K751J612K77n7K34O42J445K543K575N46k362l857l159j509k15N79
$$ 350877 353628 355240 355517 355460 355694 356336 357781 360324 362899 363445 361083 357226 354067 352558 352343 352922
52627C52922J099J184Q19O31J012J386R92Q0m28k89j69m42o27l73k14n74o51N09
$$ 352922 354021 355205 356024 356655 357667 359053 360045 360125 359697 359408 359239 358797 358170 357797 357583 357009 356358 356867
52609C56867J974J540j035l016k060M68J379O2j068m39O88P62L11M79R78J099
$$ 356867 358841 360381 359346 356330 354270 354738 356117 356179 355111 354672 355360 356122 356433 356912 357890 358989
52593C58989J506L086M876N130M001L305L607L437J653q81k566k805j932m90P55
$$ 358989 360495 363581 368457 373587 377588 380893 384500 387937 389590 388709 386143 383338 381406 380916 381671
52578C81671Q98j95j446j549k96J208J510J83j451j357J015L913N259M873L930
$$ 381671 382569 382374 380928 379379 379083 380291 381801 381984 380533 379176 380191 384104 389363 394236 398166
52563C98166K939J637M11K06P76N82j104l156m101l664k477j221m92o07j110j183
$$ 398166 401105 402742 403153 403359 404135 404717 403613 400457 396356 392692 390215 388994 388502 387895 386785 385602
52547C85602p25k71L3L81L76m85j466j291k81l8o78m95R89J832O90j018j539j471
$$ 385602 384877 384606 384639 385020 385396 384911 383445 382154 381873 381835 381157 380662 381651 383483 384173 383155 381616 380145
52529C80145k132k766j688O98K261K088J188N89M11N75R85J144P91O13J100J424
$$ 380145 378013 375247 373559 374257 376518 378606 379794 380383 380794 381369 382354 383498 384289 384902 386002 387426
52513C87426O91l96o64m52p79j267r18l53r29j895j083J376K588R62j508k130
$$ 387426 388117 387721 387057 386605 385826 384559 383641 383288 382359 380464 379381 380757 383345 384307 382799 380669
52497C80669q24O28J120O87l48j428j818j548j575k223k389j064J124K729L104
$$ 380669 379845 380473 381593 382280 381932 380504 378686 377138 375563 373340 370951 369887 371011 373740 376844
52482C76844K579J640P06J73J15K71N08Q00P60N4p34p30k45m63j410j728q34K24
$$ 376844 379423 381063 381769 381942 382057 382328 382836 383636 384396 384450 383716 382986 382741 382278 380868 379140 378306 378530
52464C78530O12Q96J583J975J435N23j42p62j146j53K252L911L180J567J699L510
$$ 378530 379142 380038 381621 383596 385031 385554 385412 384650 383504 383351 385603 389514 392694 394261 395960 399470
52448C99470M476L289J227j2j34K69O36N78P3l13k15j68p11j313j292j223k032
$$ 399470 403946 407235 408462 408450 408316 408585 409221 409799 409872 409559 409344 409176 408465 407152 405860 404637 402605
52431D02605l208l373k402j406q70m40k74q38j385o67O45L96j666l111k287m99
$$ 402605 399397 396024 393622 392216 391346 390906 390632 389794 388409 387742 388387 388783 387117 384006 381719 381220
52415C81220N13J257K819M282M023K625K158L027L710L524L390L544K633J90j743
$$ 381220 381733 382990 385809 390091 394114 396739 398897 401924 405634 409158 412548 416092 418725 418915 417172
52400D17172r64J803L735L414K123J719K489L353L154J279k010n151o089m499
$$ 417172 416208 418011 421746 425160 427283 429002 431491 434844 437998 439277 437267 432116 426027 421528
52386D21528k622k681l951l928k146q36j343k012j008O24O79p14j583j364j093
$$ 421528 418906 416225 412274 408346 406200 405364 404021 402009 401001 401625 402304 401590 400007 398643 397550
52371C97550p48Q08K862K757J5j993m37K885M134K648J074J013J378J153J146
$$ 397550 396802 397610 400472 403229 403244 401251 400814 403699 407833 410481 411555 412568 413946 415099 416245
52356D16245K094K941K411J106P56J970L869N542O860P846Q232Q002P908Q682
$$ 416245 418339 421280 423691 424797 425553 427523 431392 436934 443794 451640 459872 467874 475782 484464
52342D84464R799R517O667K169j807m036m912m905l661j325L85j35k127l397l329
$$ 484464 494263 503780 510447 512616 510809 506773 501861 496956 493295 491970 492355 492220 490093 486696 483367
52327D83367l416m514n217l873j008J457K789L926N580P015P028N496L531K349
$$ 483367 479951 475437 470220 466347 465339 466796 469585 473511 479091 486106 493134 498630 502161 504510
52313E04510K243K579K679K543K612L017L450L771M289N224O263O782O375N187
$$ 504510 506753 509332 512011 514554 517166 520183 523633 527404 531693 536917 543180 549962 556337 561524
52299E61524M075M214N838P462P218N131L148K666L203L947N123O764P550O551
$$ 561524 565599 569813 575651 583113 590331 595462 598610 601276 604479 608426 613549 620313 627863 634414
52285F34414N245N875Q260J0186J0776J1352J2725J3927J4470J5701J8566K1690
$$ 634414 639659 645534 653794 663980 674756 686108 698833 712760 727230 742931 761497 783187
52273G83187K3371K4174K5694K7645K8274K7354K6856K8331L1115L3510L4626
$$ 783187 806558 830732 856426 884071 912345 939699 966555 994886 1026001 1059511 1094137
52262A094137L4681L4400L4536L5251L5685L4734L2398K9711K7369K5137K2714
$$ 1094137 1128818 1163218 1197754 1233005 1268690 1303424 1335822 1365533 1392902 1418039 1440753
52251A440753K0324J8192J6168J4074J1900R480O737M268K952K652K127O07j252
$$ 1440753 1461077 1479269 1495437 1509511 1521411 1530891 1537628 1541896 1544848 1547500 1549627 1550234 1548982
$$ [...]
##END NTUPLES=NMR SPECTRUM
##END=
