
##TITLE=AC1115_Huila3_5835647_LdjiZo3Vq9
##JCAMPDX= 6.0         $$ Bruker NMR JCAMP-DX V2.0
##DATA TYPE= NMR SPECTRUM
##DATA CLASS= NTUPLES
##ORIGIN= BRUKER
##OWNER= Administrator
$$ 1.72 TOPSPIN		Version 2.1
$$ 2012-03-28 11:06:08.625 -0500  Administrator@TOPSPIN
$$ Compression mode = diff/dup
##.OBSERVE FREQUENCY= 400.13188235
##.OBSERVE NUCLEUS= ^1H
##.ACQUISITION MODE= SIMULTANEOUS (DQD)
##.ACQUISITION SCHEME= undefined
##.AVERAGES= 64
##.DIGITISER RES= 22
##SPECTROMETER/DATA SYSTEM= spect
##.PULSE SEQUENCE= noesygpps1d.comp
##.SOLVENT NAME= COFFEE_meoh
##.SHIFT REFERENCE= INTERNAL, COFFEE_meoh, 1, 14.96821
##AUDIT TRAIL= $$ (NUMBER, WHEN, WHO, WHERE, PROCESS, VERSION, WHAT)
$$ ##TITLE= Audit trail, TOPSPIN		Version 2.1
$$ ##JCAMPDX= 5.01
$$ ##ORIGIN= Bruker BioSpin GmbH
$$ ##OWNER= Administrator
$$ $$ C:\Bruker\TOPSPIN/data/COFFEE/nmr/AC1115_Huila3_5835647_LdjiZo3Vq9/12/pdata/1/auditp.txt
$$ ##AUDIT TRAIL=  $$ (NUMBER, WHEN, WHO, WHERE, PROCESS, VERSION, WHAT)
(   1,<2012-03-27 22:20:25.234 -0500>,<Administrator>,<TOPSPIN>,<go>,<TOPSPIN 2.1>,
      <created by zg
	started at 2012-03-27 22:08:53.312 -0500,
	POWCHK enabled, PULCHK disabled,
       configuration hash MD5:
       1A 1E CE 29 27 FD 77 03 67 4E F0 E3 C4 B2 CB 90
       data hash MD5: 64K
       CF F5 02 B0 17 4C 80 3D EB 6E 0B 00 8C 06 C7 7A>)
(   2,<2012-03-27 22:20:33.781 -0500>,<Administrator>,<TOPSPIN>,<proc1d>,<TOPSPIN 2.1>,
      <Start of raw data processing
       efp LB = 0.3 FT_mod = 6 PKNL = 1 PHC0 = 0 PHC1 = 0 SI = 128K 
       data hash MD5: 128K
       4C A5 DF C0 BD 3F 4C 15 DC D1 3A 02 D9 C1 93 13>)
(   3,<2012-03-27 22:20:35.062 -0500>,<Administrator>,<TOPSPIN>,<proc1d>,<TOPSPIN 2.1>,
      <pk PHC0 = 37.34253 PHC1 = 0 
       data hash MD5: 128K
       89 47 9B A4 A5 A8 D4 A7 B5 34 C2 AA C2 51 80 BB>)
(   4,<2012-03-27 22:20:36.000 -0500>,<Administrator>,<TOPSPIN>,<proc1d>,<TOPSPIN 2.1>,
      <abs ABSG = 1 
       data hash MD5: 128K
       3B 23 80 13 28 0D 0E 26 58 21 49 04 8A 3F 4B C2>)
(   5,<2012-03-27 22:20:36.109 -0500>,<Administrator>,<TOPSPIN>,<proc1d>,<TOPSPIN 2.1>,
      <abs ABSG = 2 
       data hash MD5: 128K
       A4 B7 E2 97 A1 73 D7 F8 E4 34 6E 32 EF 32 D7 EB>)
(   6,<2012-03-27 22:20:36.203 -0500>,<Administrator>,<TOPSPIN>,<proc1d>,<TOPSPIN 2.1>,
      <abs ABSG = 3 
       data hash MD5: 128K
       09 55 DA 13 0F 1F CC 2D B7 B7 A1 C0 A1 52 6C 73>)
(   7,<2012-03-27 22:20:36.328 -0500>,<Administrator>,<TOPSPIN>,<proc1d>,<TOPSPIN 2.1>,
      <abs ABSG = 4 
       data hash MD5: 128K
       17 8F 58 F8 44 6B D2 C9 02 CA EF E0 1A 42 3D DD>)
(   8,<2012-03-27 22:20:36.390 -0500>,<Administrator>,<TOPSPIN>,<proc1d>,<TOPSPIN 2.1>,
      <abs ABSG = 5 
       data hash MD5: 128K
       FC 17 E6 69 D0 C6 B3 4B 2D 65 66 F7 07 8E 0E 8A>)
(   9,<2012-03-27 22:20:38.750 -0500>,<Administrator>,<TOPSPIN>,<audit>,<TOPSPIN 2.1>,
      <user comment:
       ICON-NMR User ID: COFFEE
       data hash MD5: 128K
$$ [...]
##$TP07= 0
##$TPNAME0= <>
##$TPNAME1= <>
##$TPNAME2= <>
##$TPNAME3= <>
##$TPNAME4= <>
##$TPNAME5= <>
##$TPNAME6= <>
##$TPNAME7= <>
##$TPOAL= (0..7)
0.5 0.5 0.5 0.5 0.5 0.5 0.5 0.5
##$TPOFFS= (0..7)
0 0 0 0 0 0 0 0
##$TUNHIN= 0
##$TUNHOUT= 0
##$TUNXOUT= 0
##$USERA1= <user>
##$USERA2= <user>
##$USERA3= <user>
##$USERA4= <user>
##$USERA5= <user>
##$V9= 5
##$VALIST= <valist>
##$VCLIST= <CCCCCCCCCCCCCCC>
##$VD= 0
##$VDLIST= <DDDDDDDDDDDDDDD>
##$VPLIST= <PPPPPPPPPPPPPPP>
##$VTLIST= <TTTTTTTTTTTTTTT>
##$WBST= 2048
##$WBSW= 25
##$XGAIN= (0..3)
0 0 0 0
##$XL= 0
##$YL= 0
##$YMAX_a= 12813199
##$YMIN_a= -5718353
##$ZGOPTNS= <>
##$ZL1= 120
##$ZL2= 120
##$ZL3= 120
##$ZL4= 120
##$ABSF1= 14.96821
##$ABSF2= -5.58432
##$ABSG= 5
##$ABSL= 3
##$ALPHA= 0
##$AQORDER= 0
##$ASSFAC= 0
##$ASSFACI= 0
##$ASSFACX= 0
##$ASSWID= 0
##$AUNMP= <proc_prof1d_extract.lims>
##$AXLEFT= 0
##$AXNAME= <>
##$AXNUC= <1H>
##$AXRIGHT= 0
##$AXTYPE= 0
##$AXUNIT= <>
##$AZFE= 0.1
##$AZFW= 0.1
##$BCFW= 0
##$BC_mod= 0
##$BYTORDP= 0
##$COROFFS= 0
##$CY= 15
##$DATMOD= 1
##$DC= 0
##$DFILT= <>
##$DTYPP= 0
##$F1P= 0
##$F2P= 0
##$FCOR= 0.5
##$FTSIZE= 131072
##$FT_mod= 6
##$GAMMA= 0
##$GB= 0
##$INTBC= 1
##$INTSCL= 1
##$ISEN= 128
##$LB= 0.3
##$LEV0= 0
##$LPBIN= 0
##$MAXI= 10000
##$MC2= 0
##$MEAN= 0
##$ME_mod= 0
##$MI= 0
##$NCOEF= 0
##$NC_proc= -3
##$NLEV= 6
##$NOISF1= 0
##$NOISF2= 0
##$NSP= 0
##$NTH_PI= 0
##$NZP= 0
##$OFFSET= 14.96821
##$PC= 1
##$PHC0= 37.34253
##$PHC1= 0
##$PH_mod= 1
##$PKNL= yes
##$PPARMOD= 0
##$PPDIAG= 0
##$PPIPTYP= 0
##$PPMPNUM= 2147483647
##$PPRESOL= 1
##$PSCAL= 4
##$PSIGN= 0
##$PYNMP= <proc.py>
##$REVERSE= no
##$SF= 400.13000496407
##$SI= 131072
##$SIGF1= 0
##$SIGF2= 0
##$SINO= 400
##$SIOLD= 131072
##$SPECTYP= <>
##$SREGLST= <1H.CDCl3>
##$SSB= 0
##$STSI= 131072
##$STSR= 0
##$SW_p= 8223.68421052632
##$SYMM= 0
##$S_DEV= 0
##$TDeff= 65536
##$TDoff= 0
##$TI= <>
##$TILT= no
##$TM1= 0
##$TM2= 0
##$TOPLEV= 0
##$USERP1= <user>
##$USERP2= <user>
##$USERP3= <user>
##$USERP4= <user>
##$USERP5= <user>
##$WDW= 1
##$XDIM= 131072
##$YMAX_p= 489773926
##$YMIN_p= -343637002
##$CURPLOT= <Network HP LaserJet P1505>
##$CURPRIN= <$Network HP LaserJet P1505>
##$DFORMAT= <normdp>
##$LAYOUT= <+/1D_H.xwp>
##$LFORMAT= <normlp>
##$PFORMAT= <normpl>
##$SURQMSG= 1
$$ End of Bruker specific parameters
$$ ---------------------------------
##NTUPLES= NMR SPECTRUM
##VAR_NAME=  FREQUENCY,     SPECTRUM/REAL,   SPECTRUM/IMAG
##SYMBOL=    X,             R,               I
##VAR_TYPE=  INDEPENDENT,   DEPENDENT,       DEPENDENT
##VAR_FORM=  AFFN,          ASDF,            ASDF
##VAR_DIM=   131072,        131072,          131072
##UNITS=     HZ,            ARBITRARY UNITS, ARBITRARY UNITS
##FACTOR=    0.0627417313425165, 1,          1
##FIRST=     8223.62146879498, -546,         -98401
##LAST=      0,             1547,            -99327
##MIN=       0,             -343637002,      0
##MAX=       8223.62146879498, 489773926,    0
$$ Real data points
##PAGE= N=1
##DATA TABLE= (X++(R..R)), XYDATA
$$ [...]
60735A354472j3833j4420j4709j3791j2452j2469j4093j5381j4380j1362q328
$$ 1354472 1340639 1326219 1311510 1297719 1285267 1272798 1258705 1243324 1228944 1217582 1209254
60724A209254o536n239l129l92J561K244K776L950M850M505M011N325Q257J0611
$$ 1209254 1202718 1197479 1194350 1193958 1195519 1197763 1200539 1204489 1209339 1213844 1217855 1223180 1231437 1242048
60710A242048J1652J3387J7220K1029K1663J9547J8456K0485K3411K4010K2331
$$ 1242048 1253700 1267087 1284307 1305336 1326999 1346546 1365002 1385487 1408898 1432908 1455239
60699A455239K0960K1029K0946J9073J5806J2494R883Q547R307J1666J2882J0714
$$ 1455239 1476199 1497228 1518174 1537247 1553053 1565547 1575430 1583977 1593284 1604950 1617832 1628546
60687A628546O764M962O502Q367P669N270L589K703R04j893l807l993l772m362
$$ 1628546 1635310 1640272 1646774 1655141 1662810 1668080 1671669 1674372 1675276 1673383 1669576 1665583 1661811 1657449
60673A657449n274n655n711n965o317o739p983j0596j3752j5827j5913j4284j1941
$$ 1657449 1652175 1646520 1640809 1634844 1628527 1621788 1613805 1603209 1589457 1573630 1557717 1543433 1531492
60660A531492j0126r763j0612j1221j0254p786n037l068k066j681j562j524j385
$$ 1531492 1521366 1511603 1500991 1489770 1479516 1471730 1466693 1463625 1461559 1459878 1458316 1456792 1455407
60647A455407p47P97K997M607M224J633j831m272m531k952j258j301l311n609
$$ 1455407 1454660 1455457 1458454 1463061 1467285 1468918 1467087 1462815 1458284 1455332 1454074 1452773 1449462 1443853
60633A443853o466n851m787l714k487j565j772k982m232n102n865o328n945n159
$$ 1443853 1437387 1431536 1426749 1423035 1420548 1418983 1417211 1414229 1409997 1404895 1399030 1392702 1386757 1381598
60619A381598n151o076p106q449j1504j6136j9679j9917j7829j6024j5553j5570
$$ 1381598 1376447 1370371 1363265 1354816 1343312 1327176 1307497 1287580 1269751 1253727 1238174 1222604
60607A222604j5224j4367j2901j0807q661p218o636o571o528n720l552p95O94
$$ 1222604 1207380 1193013 1180112 1169305 1160644 1153426 1146790 1140219 1133691 1127971 1124419 1123624 1124318
60594A124318K24q27j107r66r80k98J894M327N004L886K513J568N33o78j594k290
$$ 1124318 1124542 1123715 1122608 1121642 1120662 1120364 1122258 1126585 1131589 1135475 1137988 1139556 1140089 1139411 1137817 1135527
60578A135527k866k297K20L108L769K134P12R82K012K996M713P442R731J0520
$$ 1135527 1132661 1130364 1130584 1133692 1137461 1139595 1140307 1141289 1143301 1146297 1151010 1158452 1168183 1178703
60564A178703J0755J1558J2500J3171J4793J8410K2662K5343K6467K7851L0124
$$ 1178703 1189458 1201016 1213516 1226687 1241480 1259890 1282552 1307895 1334362 1362213 1392337
60553A392337L1964L2351L1902L1677L1927L2332L2510L1886K9765K5895K0548
$$ 1392337 1424301 1456652 1488554 1520231 1552158 1584490 1617000 1648886 1678651 1704546 1725094
60542A725094J4136P251R81l711p035j0154j3717j7205j9902k1936k3945k5979
$$ 1725094 1739230 1746481 1747462 1743751 1736716 1726562 1712845 1695640 1675738 1653802 1629857 1603878
60530A603878k7091k6036k2594j8356j5895j6451j8456j8887j6345j2307r172
$$ 1603878 1576787 1550751 1528157 1509801 1493906 1477455 1458999 1440112 1423767 1411460 1402288
60519A402288p636o539m921l430l342m692n953n733m368l426l726m366l982k419
$$ 1402288 1394652 1388113 1383192 1379762 1376420 1371728 1365775 1360042 1355674 1352248 1348522 1344156 1340174 1337755
60505A337755p27L57J223K721N196Q314J1331J3266J3484J2595J2394J4166J7257
$$ 1337755 1337028 1337385 1338608 1341329 1346525 1354839 1366170 1379436 1392920 1405515 1417909 1432075 1449332
60492A449332K0000K1922K4070K7067K9915L1361L1697L2246L3606L5372L7353
$$ 1449332 1469332 1491254 1515324 1542391 1572306 1603667 1635364 1667610 1701216 1736588 1773941
60481A773941L9906M2926M5442M6710M6963M6592M5070M1169L3993K3626J1153
$$ 1773941 1813847 1856773 1902215 1948925 1995888 2042480 2087550 2128719 2162712 2186338 2197491
60470B197491j703j3378k3264l1377l7165l9326l7272l2230k6326k0850j5853
$$ 2197491 2195788 2182410 2159146 2127769 2090604 2051278 2014006 1981776 1955450 1934600 1918747
60459A918747j0956n867l68N494J1118J5720J9030K1356K3134K4797K6879K9751
$$ 1918747 1907791 1901924 1901556 1907050 1918168 1933888 1952918 1974274 1997408 2022205 2049084 2078835
60447B078835L3237L7026M1595M8262N8009P0256Q3168R5402J07610J21906J39605
$$ 2078835 2112072 2149098 2190693 2238955 2296964 2367220 2450388 2545790 2653400 2775306 2914911
60436B914911J59778J80398K00524K20740K41674K63181K85128L07945L31934
$$ 2914911 3074689 3255087 3455611 3676351 3918025 4181206 4466334 4774279 5106213
60427E106213L56785L82032M06745M27527M37512M28579L95034L35243K50939
$$ 5106213 5462998 5845030 6251775 6679302 7116814 7545393 7940427 8275670 8526609
60418H526609J46260K7693r5909k13800l14858l90622m38555m62307m67986m60206
$$ 8526609 8672869 8700562 8604653 8390853 8075995 7685373 7246818 6784511 6316525 5856319
60408E856319m41767m15725l85931l55417l25304k95537k65978k36978k09630
$$ 5856319 5414552 4998827 4612896 4257479 3932175 3636638 3370660 3133682 2924052
60399B924052j85508j65408j48424j32917j18312j05262r4250q4933p6880p0068
$$ 2924052 2738544 2573136 2424712 2291795 2173483 2068221 1973971 1889038 1812158 1742090
60389A742090o4415n9480n4915n0722m6889m3099l9004l4688l0829k8243k6945
$$ 1742090 1677675 1618195 1563280 1512558 1465669 1422570 1383566 1348878 1318049 1289806 1262861
60378A262861k5811k3840k1621k0473k0022j8271j4732j1828j1772j3436j4059
$$ 1262861 1237050 1213210 1191589 1171116 1151094 1132823 1118091 1106263 1094491 1081055 1066996
60367A066996j2935j1408j0072q351o612o222p216p864p140n888m991m053k553
$$ 1066996 1054061 1042653 1032581 1024230 1017618 1011396 1004180 996316 989176 983288 978297 974244 971691
60354I71691r33K18J019J759K537L732N703P688Q180O879N213M597N161O282P156
$$ 971691 970758 970976 971995 973754 976291 980023 985726 993414 1001594 1008473 1013686 1018283 1023444 1029726 1036882
60339A036882O793M932L221L814O472Q622Q771Q071P940Q117Q003Q017Q297P806
$$ 1036882 1043675 1048607 1051828 1055642 1062114 1070736 1079507 1087578 1095518 1103635 1111638 1119655 1127952 1135758
60325A135758O178M919N181N673M568K307P29K93jn06o15k92k97q98j548j800
$$ 1135758 1141936 1146855 1152036 1157709 1162277 1164584 1165313 1165606 1165605 1165099 1164484 1164192 1163895 1162997 1161449 1159649
60309A159649j688j403j354k008k927k711q32J218J774J245J320K627M486O330
$$ 1159649 1157961 1156558 1155204 1153196 1150269 1147558 1146726 1147944 1149718 1150963 1152283 1154910 1159396 1165726
60295A165726P924Q664Q150P143O757P063P732R370J2536J5844J7035J5892J4288
$$ 1165726 1173650 1182314 1190464 1197607 1204364 1211427 1219159 1228529 1241065 1256909 1273944 1289836 1304124
60282A304124J3115J1046O999K263q46j541r37n08p78j199j055n72p56j660j680
$$ 1304124 1317239 1328285 1335284 1337547 1336701 1335160 1334223 1333715 1332937 1331738 1330683 1330111 1329355 1327695 1326015
60267A326015L78L139M151L242K578L277L793K280j018m504p053q300q263p580
$$ 1326015 1326393 1329532 1333683 1336925 1339503 1342780 1346573 1348853 1347835 1343331 1336278 1327978 1319715 1312135
60253A312135p232p292o749n259l954l755l860l012j425l17n4l1P1Ok39l21j84
$$ 1312135 1304903 1297611 1290862 1285603 1281649 1277894 1274034 1271022 1269597 1269280 1269226 1269195 1269266 1269272 1269033 1268712 1268528
60236A268528J1M49J258J729R77n40j194l25P38M21j018j937j482l53O69J958
$$ 1268528 1268539 1268988 1270246 1271975 1272952 1272412 1271218 1270893 1271631 1272052 1271034 1269097 1267615 1267262 1267931 1269889
60220A269889M270P247R536J0390J0477J0908J2023J3409J4637J5376J5210J3995
$$ 1269889 1274159 1281406 1290942 1301332 1311809 1322717 1334740 1348149 1362786 1378162 1393372 1407367
60208A407367J2390J1488J1944J3693J6249J8842K0533K1104K1628K3382K6121
$$ 1407367 1419757 1431245 1443189 1456882 1473131 1491973 1512506 1533610 1555238 1578620 1604741
60197A604741K8333K9407L0538L3025L6563M0050M3353M7313N2333N7912O3583
$$ 1604741 1633074 1662481 1693019 1726044 1762607 1802657 1846010 1893323 1945656 2003568 2067151
60186B067151O9494P5961Q3021R0525R8357J06405J14722J23553J32833J41694
$$ 2067151 2136645 2212606 2295627 2386152 2484509 2590914 2705636 2829189 2962022 3103716
60176C103716J49066J54877J60078J65249J69552J71281J69232J63493J55230
$$ 3103716 3252782 3407659 3567737 3732986 3902538 4073819 4243051 4406544 4561774
60167D561774J45829J35797J24224J09764R2398P3908N6273L9929K3992P852p860
$$ 4561774 4707603 4843400 4967624 5077388 5169786 5243694 5299967 5339896 5363888 5371740 5363880
60156E363880k1614l1916l8198m1260m2455m2001l8527l0957k0350q903K534J4757
$$ 5363880 5342266 5310350 5272152 5230892 5188437 5146436 5107909 5076952 5056602 5047699 5050233 5064990
60144E064990K8253M2404N6984P2805R0050J07009J21609J33486J43578J52274
$$ 5064990 5093243 5135647 5192631 5265436 5355486 5462495 5584104 5717590 5861168 6013442
60134F013442J58883J62477J62278J57580J48131J34493J17549R8021P6848N5081
$$ 6013442 6172325 6334802 6497080 6654660 6802791 6937284 7054833 7152854 7229702 7284783
60124G284783L2720Q708j6773m0944o0941p6990r1374j04593j14463j18958j18162
$$ 7284783 7317503 7326211 7309438 7268494 7207553 7130563 7039189 6934596 6820133 6701175 6583013
60113F583013j13123j04596r3471q0836o6811n0483l1699j1855P647K6625M5152
$$ 6583013 6469890 6365294 6271823 6190987 6124176 6073693 6041994 6030139 6037786 6064411 6109563
60102F109563O2487P7750R0614J00584J06444J07382J04064R7983R0139Q0803
$$ 6109563 6172050 6249800 6340414 6440998 6547442 6654824 6758888 6856871 6947010 7027813
60092G027813O9910N7318M3309K9133J6430N992k158p474q851n922P99J1174K5292
$$ 7027813 7097723 7155041 7198350 7227483 7243913 7249905 7247747 7240273 7231422 7225500 7226299 7237473 7262765
60079G262765M1931N9099P6847R7689J23060J51037J78960K06746K36027K67160
$$ 7262765 7304696 7363795 7440642 7538331 7661391 7812428 7991388 8198134 8434161 8701321
60069H701321K98924L30364L61271L91309M20016M47256M72454M93906N09717
$$ 8701321 9000245 9330609 9691880 10083189 10503205 10950461 11422915 11916821 12426538
60060A2426538N18983N21195N15453N01133M78486M47606M07928L59849L05487
$$ 12426538 12945521 13466716 13982169 14483302 14961788 15409394 15817322 16177171 16482658
60051A6482658K46443J82094J11861L7991l5923j08281j79076k46742l07674l58838
$$ 16482658 16729101 16911195 17023056 17061047 17025124 16916843 16737767 16491025 16183351 15824513
60041A5824513l98991m27504m43942m48920m43688m28835m04860l73864l38790
$$ 15824513 15425522 14998018 14554076 14105156 13661468 13232633 12827773 12453909 12115119
60032A2115119l00938k60004k16725j73613j32560r3315n5086j8432J4892M3082
$$ 12115119 11814181 11554177 11337452 11163839 11031279 10937964 10882878 10864446 10879338 10922420
60022A0922420O4929Q0258Q9848R4173R2432Q3688O8560M8697K5242p82k7345
$$ 10922420 10987349 11067607 11157455 11251628 11344060 11427748 11496308 11545005 11570247 11569465 11542120
60011A1542120n2526p6456j00317j23807j45597j65852j85731k04274k18504k27262
$$ 11542120 11489594 11413138 11312821 11189014 11043417 10877565 10691834 10487560 10269056 10041794
60001A0041794k32517k35971k36735k33440k26389k16177k02189j84181j63786
$$ 10041794 9809277 9573306 9336571 9103131 8876742 8660565 8458376 8274195 8110409
59992H110409j42710j20701r6962p2379m8608k5610j822K3543M9583P4694R7500
$$ 8110409 7967699 7846998 7750036 7677657 7629049 7603439 7601617 7625160 7674743 7749437 7846937
59981G846937J17149J33591J47280J58002J64425J65331J60660J50799J35629
$$ 7846937 7964086 8097677 8244957 8402959 8567384 8732715 8893375 9044174 9179803
59972I179803J14961Q9389O0124K8577l580l4800o4654r3640j21466j46394j66818
$$ 9179803 9294764 9384153 9444277 9472854 9469274 9434474 9369820 9276180 9154714 9008320 8841502
59961H841502j82510j93640j99554j99457j93631j83169j69126j52560j34614
$$ 8841502 8658992 8465352 8265798 8066341 7872710 7689541 7520415 7367855 7233241
59952G233241j15653r4965p2089m7893k3639N23K5293N0968P7057J02866J27947
$$ 7233241 7117588 7022623 6950534 6902641 6879002 6879525 6904818 6955786 7032843 7135709 7263656
59941G263656J52245J75942J98689K18945K34814K45604K51511K51790K44560
$$ 7263656 7415901 7591843 7790532 8009477 8244291 8489895 8741406 8993196 9237756
59932I237756K29002K06592J79373J48105J12854P4453L4507n365m3745p9670
$$ 9237756 9466758 9673350 9852723 10000828 10113682 10188135 10222642 10217277 10173532 10093862
59922A0093862j13110j44086j70902j90541k01561k05372k03755j96657j83551
$$ 10093862 9980752 9836666 9665764 9475223 9273662 9068290 8864535 8667878 8484327
59913H484327j65561j44602j21371r5857o9043m2449j6440R358L4410N7637P9269
$$ 8484327 8318766 8174164 8052793 7956936 7887893 7845444 7829004 7838362 7872772 7930409 8009678
59902H009678J00634J21767J40523J54589J63520J68398J70252J69279J65265
$$ 8009678 8110312 8232079 8372602 8527191 8690711 8859109 9029361 9198640 9363905
59893I363905J58266J48807J37547J24956J11650R8814Q7674P8582P1296O6258
$$ 9363905 9522171 9670978 9808525 9933481 10045131 10143945 10231619 10310201 10381497 10447755
59883A0447755O4762O7710P5079Q6776J03131J24236J49739J79431K13039K49376
$$ 10447755 10512517 10580227 10655306 10742082 10845213 10969449 11119188 11298619 11511658 11761034
59873A1761034K87057L26084L67006M08106M45434M76409N01257N19519N27199
$$ 11761034 12048091 12374175 12741181 13149287 13594721 14071130 14572387 15091906 15619105
59864A5619105N19366M94147M52174L93534L17837K26933J25553J9252q6817j87659
$$ 15619105 16138471 16632618 17084792 17478326 17796163 18023096 18148649 18167901 18081084 17893425
59854A7893425k78777l57031m20409m67501m98191n13980n16467n06314m84937
$$ 17893425 17614648 17257617 16837208 16369707 15871516 15357536 14841069 14334755 13849818
59845A3849818m55937m22907l86546l45902l01793k56857k12483j67892j22384
$$ 13849818 13393881 12970974 12584428 12238526 11936733 11679876 11467393 11299501 11177117
59836A1177117p6700l2039J0606M9910Q4651J14946J41687J64510J81479J90682
$$ 11177117 11100417 11068378 11078984 11128894 11213545 11328491 11470178 11634688 11816167 12006849
59826A2006849J90858J80594J58568J24942Q1400K9839k7734q8223j47978k04523
$$ 12006849 12197707 12378301 12536869 12661811 12743211 12773050 12745316 12657093 12509115 12304592
59816A2304592k56575l02507l40319l69163l89490m01598m05430m01813l92352
$$ 12304592 12048017 11745510 11405191 11036028 10646538 10244940 9839510 9437697 9045345
59807I045345l78070l59522l38238l16260k94105k70817k46298k21933j98678
$$ 9045345 8667275 8307753 7969515 7653255 7359150 7088333 6842035 6620102 6421424
59798F421424j76242j54372j33374j13217r4044p7635o6127n8752n2345m5784
$$ 6421424 6245182 6090810 5957436 5844219 5750175 5672540 5606413 5547661 5495316 5449532
59788E449532m1456m0949m2027m1671m0020l8827l7815l5288l1483k8633k7987
$$ 5449532 5408076 5367127 5325100 5283429 5243409 5204582 5166767 5131479 5099996 5071363 5043376
59777E043376k8890l0723l3831l8310m3433m8459n2773n5320n5357n3966n3475
$$ 5043376 5014486 4983763 4949932 4911622 4868189 4819730 4766957 4711637 4656280 4602314 4548839
59766D548839n4894n6769n6867n4123m8742m1364l2799k4083j6232r850m930q09
$$ 4548839 4493945 4437176 4380309 4326186 4277444 4236080 4203281 4179198 4162966 4153116 4148186 4147377
59754D147377L426Q186J3214J8473K4807L3007M2425N1357N8912O5782P2882P9809
$$ 4147377 4150803 4158989 4172203 4190676 4215483 4248490 4290915 4342272 4401184 4466966 4539848 4619657
59742D619657Q5142Q7962Q8473Q7111Q3704P7979P0627O3069N5967M8730M1152
$$ 4619657 4704799 4792761 4881234 4968345 5052049 5130028 5200655 5263724 5319691 5368421 5409573
59731E409573L4823L1949L2970L6405M1015M6964N4691O4024P5059Q8872J06215
$$ 5409573 5444396 5476345 5509315 5545720 5586735 5633699 5688390 5752414 5827473 5916345 6022560
59720F022560J26221J47370J69344J92964K18705K46275K75515L06633L39423
$$ 6022560 6148781 6296151 6465495 6658459 6877164 7123439 7398954 7705587 8045010
59711H045010L72985M06348M38446M66992M87755M95267M83877M48213L84182
$$ 8045010 8417995 8824343 9262789 9729781 10217536 10712803 11196680 11644893 12029075
59702A2029075K91565J76743N2403o6638j68679k47737l02561l34402l45844l40703
$$ 12029075 12320640 12497383 12549786 12483148 12314469 12066732 11764171 11429769 11083925 10743222
59692A0743222l23574k98708k69157k36856k03114j68798j34252r9468o4586l0390
$$ 10743222 10419648 10120940 9851783 9614927 9411813 9243015 9108763 9009295 8944709 8914319
59682H914319J962L1954O0552Q9511J19587J49765J78707K06613K35106K65381
$$ 8914319 8916281 8948235 9008787 9098298 9217885 9367650 9546357 9752970 9988076 10253457
59672A0253457K97149L29571L62665L97430M34860M75226N18249N63607O10984
$$ 10253457 10550606 10880177 11242842 11640272 12075132 12550358 13068607 13632214 14243198
59663A4243198O59806P09226P58690Q08371Q58714R09552R59631J006689J047508
$$ 14243198 14903004 15612230 16370920 17179291 18038005 18947557 19907188 20913877 21961385
59654B1961385J078297J096053J099833J090257J068037J034163R91917R47364
$$ 21961385 23039682 24135735 25235568 26325825 27393862 28428025 29419942 30367306
59646C0367306R06714Q73461Q48442Q31448Q21578Q16421Q12100Q04305P88939
$$ 30367306 31274020 32147481 32995923 33827371 34648949 35465370 36277470 37081775 37870714
59637C7870714P62309P21593O65181N92393N03732M02052K92754J81920P4567
$$ 37870714 38633023 39354616 40019797 40612190 41115922 41517974 41810728 41992648 42067215
59628D2067215k4872j11581j81261k31566k61622k70871k59613k29975j84707
$$ 42067215 42042343 41930762 41749501 41517935 41256313 40985442 40725829 40495854 40311147
59619D0311147j25187n1856L3807J29203K32213L41226M53701N66310O76737P83704
$$ 40311147 40185960 40134104 40167911 40297114 40529327 40870553 41324254 41890564 42567301 43351005
59609D3351005Q84790R75332J049516J101332J124293J111724J057850R58041
$$ 43351005 44235795 45211127 46260643 47361975 48486268 49597992 50655842 51613883
59601E1613883Q08797O09836L67080R2499j99353m93695p75261j028798j242066
$$ 51613883 52422680 53032516 53399596 53492095 53292742 52799047 52023786 50994988 49752922
59592D9752922j408199j525194j594544j620733j610336j570269j507315j429172
$$ 49752922 48344723 46819529 45224985 43604252 41993916 40423647 38916332 37487160
59584C7487160j344332j260293j183382j120783j080727j068764j083979j118885
$$ 37487160 36142828 34882535 33699153 32578370 31497643 30428879 29344900 28226015
59576B8226015j161926j200360j223634j226503j209120j174093j124687j065577
$$ 28226015 27064089 25863729 24640095 23413592 22204472 21030379 19905692 18840115
59568A8840115j002280r37897q72030q04431p38036o76512o20248n67098n16170
$$ 18840115 17837835 16899938 16027908 15223477 14485441 13808929 13188681 12621583 12105413
59559A2105413m68706m25638l86430l50233l16584k85085k55832k29953k08348
$$ 12105413 11636707 11211069 10824639 10474406 10157822 9872737 9616905 9386952 9178604
59550I178604j90170j73920j59679j48736j41204j35738j31670j29938j31440
$$ 9178604 8988434 8814514 8654835 8506099 8364895 8229157 8097487 7967549 7836109
59541G836109j35665j41148j46339j49933j51441j51535j50904j48928j44471
$$ 7836109 7700444 7559296 7412957 7263024 7111583 6960048 6809144 6660216 6515745
59532F515745j37800j30280j22288j13030j02717r3144q5162p7077o6798n4613
$$ 6515745 6377945 6247665 6125377 6012347 5909630 5816486 5731324 5654247 5587449 5532836
59522E532836m2599l1851k1712j1472j575P200J4682K1078K6489L1246L6177M1739
$$ 5532836 5490237 5458386 5436674 5425202 5423627 5430827 5445509 5466587 5493076 5524322 5560499 5602238
59510E602238M7193N1517N5202O0024O6575P3025P7371Q0279Q4428R1304J00099
$$ 5602238 5649431 5700948 5756150 5816174 5882749 5955774 6033145 6113424 6197852 6289156 6389255
59499F389255J09719J20382J32560J45686J58933J72522J87418K04270K23218
$$ 6389255 6498974 6619356 6751916 6897602 7056535 7229057 7416475 7620745 7843963
59490G843963K44045K65752K86656L05650L23002L39435L55077L69724L83125
$$ 7843963 8088008 8353760 8640416 8946066 9269068 9608503 9963580 10333304 10716429
59481A0716429L94042M00011L99260L92487L81573L66970L47360L21628K90070
$$ 10716429 11110471 11510482 11909742 12302229 12683802 13050772 13398132 13719760 14009830
59472A4009830K53941K15133J76253J39734J06346P5266M5826J8765m215k1481
$$ 14009830 14263771 14478904 14655157 14794891 14901237 14976503 15022329 15041094 15036879 15015398
59462A5015398l2098l6206l4846k8785j7390P09K5721N5935Q8967J22977J56261
$$ 15015398 14983300 14947094 14912248 14883463 14866073 14866782 14892503 14948438 15037405 15160382 15316643
59451A5316643J86070K08524K19964K18301K03142J74708J33033P8450J2733o0835
$$ 15316643 15502713 15711237 15931201 16149502 16352644 16527352 16660385 16738835 16751568 16690733
59441A6690733j38568k17282k94108l65883m29026m79911n15728n35664n41313
$$ 16690733 16552165 16334883 16040775 15674892 15245866 14765955 14250227 13714563 13173250
59432A3173250n35428n20313m97706m69533m37511m02315l64567l26479k90699
$$ 13173250 12637822 12117509 11619803 11150270 10712759 10310444 9945877 9619398 9328699
59423I328699k57264k23660j88677j54311j22726r3134o3382l3046l224K5622
$$ 9328699 9071435 8847775 8659098 8504787 8382061 8288927 8225545 8192499 8189275 8214897
59413H214897N3690Q0638J06330J32021J58815J85418K09480K30725K50557K68664
$$ 8214897 8268587 8349225 8455555 8587576 8746391 8931809 9141289 9372014 9622571 9891235
59403I891235K82268K89226K89641K83709K69950K46795K14531J74414J26990
$$ 9891235 10173503 10462729 10752370 11036079 11306029 11552824 11767355 11941769 12068759
59394A2068759P2535J2591n0078j12652j72533k26832k72816l09351l37498l59189
$$ 12068759 12141294 12153885 12103807 11991155 11818622 11591790 11318974 11009623 10672125 10312936
59384A0312936l75142l84191l84950l78154l66850l53954l40124l24449l06578
$$ 10312936 9937794 9553603 9168653 8790499 8423649 8069695 7729571 7405122 7098544
59375G098544k87331k67589k47721k28198k09889j93248j77659j61948j45493
$$ 7098544 6811213 6543624 6295903 6067705 5857816 5664568 5486909 5324961 5179468
59366E179468j28760j12855r8525q5566p3345o1624n0563m0119l0271k1589j4542
$$ 5179468 5050708 4937853 4839328 4753762 4680417 4618793 4568230 4528111 4497840 4476251 4461709
59355D461709q240j066P269J5725K4106L3055M1008M3579L8176K8019J9535J6554
$$ 4461709 4453469 4452403 4459672 4475397 4499503 4532558 4573566 4617145 4655321 4683340 4702875 4719429
59343D719429J8668K3999L1238L9613M9240O1268P5643Q8994R6890R8333R6340
$$ 4719429 4738097 4762096 4793334 4832947 4882187 4943455 5019098 5108092 5204982 5303315 5399655
59332E399655R4516R5170J00306J11351J27239J44995J63236J83171K05707K29807
$$ 5399655 5494171 5589341 5689647 5800998 5928237 6073232 6236468 6419639 6625346 6855153
59322F855153K54559K80726L09042L39016L70659M05443M43945M84258N24545
$$ 6855153 7109712 7390438 7699480 8038496 8409155 8814598 9258543 9742801 10267346
59313A0267346N65734O09704O55756P00753P41932P77781Q06630Q26202Q34562
$$ 10267346 10833080 11442784 12098540 12799293 13541225 14319006 15125636 15951838 16786400
59304A6786400Q30234Q11924P79716P36424O86166O31518N73413N13766M56180
$$ 16786400 17616634 18428558 19208274 19944698 20630864 21262382 21835795 22349561 22805741
59295B2805741M03015L53026L03102K51645J98876J44281Q5432J9929n2515j30524
$$ 22805741 23208756 23561782 23864884 24116529 24315405 24459686 24545118 24565047 24512532 24382008
59285B4382008k12655k97380l82030m63337n39121o08261o68832p17978p54406
$$ 24382008 24169353 23871973 23489943 23026606 22487485 21879224 21210392 20492414 19738008
59276A9738008p79585p95374q01797p98503p87023p69456p45816p14969o78000
$$ 19738008 18958423 18163049 17361252 16562749 15775726 15006270 14260454 13545485 12867485
59267A2867485o38296n98252n57980n17619m78590m41659m05753l69955l35169
$$ 12867485 12229189 11630937 11072957 10555338 10076748 9635089 9229336 8859381 8524212
59258H524212l02654k72141k42680k14406j88404j65531j46013j29262j13450
$$ 8524212 8221558 7949417 7706737 7492331 7303927 7138396 6992383 6863121 6749671
59249F749671r6503p8465o1818m8397l6922k4759j1199K283J4400K5412L6399
$$ 6749671 6653168 6574703 6512885 6464488 6427566 6402807 6391608 6393891 6408291 6433703 6470102
59238F470102M8201O0845P3271Q4068R3155J02148J12335J22959J32373J40218
$$ 6470102 6518303 6579148 6652419 6736487 6829642 6931790 7044125 7167084 7299457 7439675
59228G439675J47269J53690J58776J62267J64737J66558J67468J67366J66816
$$ 7439675 7586944 7740634 7899410 8061677 8226414 8392972 8560440 8727806 8894622
59219H894622J66497J66554J66353J64339J58504J47925J34123J20297J08890
$$ 8894622 9061119 9227673 9394026 9558365 9716869 9864794 9998917 10119214 10228104
59210A0228104J00038R2194Q3497P2419N7762L8816J5762j0284l7735o5233r1903
$$ 10228104 10328142 10420336 10503833 10576252 10634014 10672830 10688592 10678308 10640573 10575340 10483437
59199A0483437j16990j39334j57469j70299j77705j80550j80165j77377j71786
$$ 10483437 10366447 10227113 10069644 9899345 9721640 9541090 9360925 9183548 9011762
59190I011762j62249j48437j31566j13259r4277p4909n5950l8162k1183m232J2319
$$ 9011762 8849513 8701076 8569510 8456251 8361974 8287065 8231115 8192953 8171770 8167538 8179857
59179H179857K7222M0212N2231O3664P3772Q2181Q9570R6274J01630J05480J09172
$$ 8179857 8207079 8247291 8299522 8363186 8436958 8519139 8608709 8704983 8806613 8912093 9021265
59168I021265J14113J20306J27381J36136J47939J63128J81036K01164K23547
$$ 9021265 9135378 9255684 9383065 9519201 9667140 9830268 10011304 10212468 10436015
59159A0436015K48330K75743L05951L38001L69159L96004M16047M27798M29749
$$ 10436015 10684345 10960088 11266039 11604040 11973199 12369203 12785250 13213048 13642797
59150A3642797M19896L96083L56481L00319K28815J45082N2714m5191j45335k43426
$$ 13642797 14062693 14458776 14815257 15115576 15344391 15489473 15542187 15496996 15351661 15108235
59140A5108235l34891m16158m84779n38903n77311n99846o07468o02219n87175
$$ 15108235 14773344 14357186 13872407 13333504 12756193 12156347 11548879 10946660 10359485
59131A0359485n65497n39039n08484m75128m41410m08965l77337l45660l14773
$$ 10359485 9793988 9254949 8746465 8271337 7829927 7420962 7043625 6697965 6383192
59122F383192k86411k60983k37554k15722j96173j79418j64957j51743j38671
$$ 6383192 6096781 5835798 5598244 5382522 5186349 5006931 4841974 4690231 4551560
59113D551560j24936j10907r8359q8717q1144p3545o5337n7852n1759m5674l8106
$$ 4551560 4426624 4315717 4217358 4128641 4047497 3973952 3908615 3850763 3799004 3753330 3715224
59102C715224k9647k2048j5865j0123m067J949P314J2110J6892K2191K8318L5124
$$ 3715224 3685577 3663529 3647664 3637541 3633474 3635423 3642737 3654847 3671739 3693930 3722248 3757372
59090C757372M1673M6859N0817N5162O1140O8043P4195P9158Q3904Q9117R4496
$$ 3757372 3799045 3845904 3896721 3951883 4013023 4081066 4155261 4234419 4318323 4407440 4501936
59079D501936R9832J05368J10823J15378J19169J23350J27882J30846J31109J30119
$$ 4501936 4601768 4707136 4817959 4933337 5052506 5175856 5303738 5434584 5565693 5695812
59069E695812J29462J28127J24329J18829J13903J09614J03798R5752Q7224P9479
$$ 5695812 5825274 5953401 6077730 6196559 6310462 6420076 6523874 6619626 6706850 6786329
59059F786329P1982O4800N9782N7988N7916N7806N8276O1236O7238P5050Q3166
$$ 6786329 6858311 6923111 6982893 7040881 7098797 7156603 7214879 7276115 7343353 7418403 7501569
59048G501569R0926R8988J09144J22610J38133J52988J66141J78873J91911K03821
$$ 7501569 7592495 7691483 7800627 7923237 8061370 8214358 8380499 8559372 8751283 8955104
59038H955104K12993K19302K22466K20460K10911J92899J66401J31524Q9675M4089
$$ 8955104 9168097 9387399 9609865 9830325 10041236 10234135 10400536 10532060 10621735 10665824
59028A0665824k206m7890r1766j31232j63721j88595k06386k17596k23313k25507
$$ 10665824 10663618 10615728 10523962 10392730 10229009 10040414 9834028 9616432 9393119 9167612
59018I167612k25226k21952k16118k10377k06632k03574j99324j94994j93170
$$ 9167612 8942386 8720434 8504316 8293939 8087307 7883733 7684409 7489415 7296245
59009G296245j94116j95964j97693j99343k00171j99208j97164j95367j93265
$$ 7296245 7102129 6906165 6708472 6509129 6308958 6109750 5912586 5717219 5523954
59000E523954j89379j84119j79139j74286j67960j60339j53397j47487j40736
$$ 5523954 5334575 5150456 4971317 4797031 4629071 4468732 4315335 4167848 4027112
58991D027112j32419j24320j17758j11640j04691r7688r2137q8137q4657q0887
$$ 4027112 3894693 3770373 3652615 3540975 3436284 3338596 3246459 3158322 3073665 2992778
58981B992778p6524p1672o7004o3153n9751n5969n1959m8420m4943m0430l5266
$$ 2992778 2916254 2844582 2777578 2714425 2654674 2598705 2546746 2498326 2453383 2412953 2377687
58970B377687l1264k9002k6872k3459j9375j6076j4109j3047j2040j0119p079
$$ 2377687 2346423 2317421 2290549 2267090 2247715 2231639 2217530 2204483 2192443 2182324 2175245
58959B175245m265l192l370k997j774j159j667j981j367p66o52L5J668K715K228
$$ 2175245 2170980 2167788 2164418 2161421 2159647 2158488 2156821 2154840 2153473 2152707 2152055 2152090 2153758 2156473 2158701
58944B158701J791L193N637P102P240P068O817O157N830O951Q887R647Q506O656
$$ 2158701 2160492 2163685 2169322 2176424 2183664 2190732 2197549 2203706 2209536 2216487 2225374 2235021 2243527 2250183
58930B250183N281M430M074M771O678R000J1049J3090J5397J7219J7517J6505
$$ 2250183 2255464 2259894 2263968 2268739 2275417 2284417 2295466 2308556 2323953 2341172 2358689 2375194
58918B375194J5722J6451J8516K0749K2305K3247K4148K5495K7413K9597L1455
$$ 2375194 2390916 2407367 2425883 2446632 2468937 2492184 2516332 2541827 2569240 2598837 2630292
58907B630292L2717L3882L5637L7804L9463M0322M1039M1955M2433M2155M2106
$$ 2630292 2663009 2696891 2732528 2770332 2809795 2850117 2891156 2933111 2975544 3017699 3059805
58896C059805M3253M5029M6357M7550M9857N3424N7190O0675O4526O9228P4481
$$ 3059805 3103058 3148087 3194444 3241994 3291851 3345275 3402465 3463140 3527666 3596894 3671375
58885C671375Q0016Q5833R1526R6586J01548J07722J15428J23560J31180J38597
$$ 3671375 3751391 3837224 3928750 4025336 4126884 4234606 4350034 4473594 4604774 4743371
58875D743371J46567J55370J64979J75283J85972J97122K09823K25142K42372
$$ 4743371 4889938 5045308 5210287 5385570 5571542 5768664 5978487 6203629 6446001
58866F446001K59591K76177K93533L13057L34875L58909L85694M15224M46478
$$ 6446001 6705592 6981769 7275302 7588359 7923234 8282143 8667837 9083061 9529539
58857I529539M78887N13201N49890N87915O26202O65351P06680P50168P94442
$$ 9529539 10008426 10521627 11071517 11659432 12285634 12950985 13657665 14407833 15202275
58848A5202275Q37944Q78999R15248R44422R65311R76886R76503R59976R23389
$$ 15202275 16040219 16919218 17834466 18778888 19744199 20721085 21697588 22657564 23580953
58839B3580953Q64148P80748O72990N42842L94310K32181O1558j11266k78563
$$ 23580953 24445101 25225849 25898839 26441681 26835991 27068172 27129730 27018464 26739901
58830B6739901m32906n69297o85436p80348q53464r05012r36425r49758r46956
$$ 26739901 26306995 25737698 25052262 24271914 23418450 22513438 21577013 20627255 19680299
58821A9680299r30169r02452q67349q27658p85153p41440o98046o55395o12801
$$ 19680299 18750130 17847678 16980329 16152671 15367518 14626078 13928032 13272637 12659836
58812A2659836n70348n29937m93548m60987m30483m01095l73490l48455l25788
$$ 12659836 12089488 11559551 11066003 10605016 10174533 9773438 9399948 9051493 8725705
58803H725705l04714k84570k64976k46034k28321k12059j96412j80461j64718
$$ 8725705 8420991 8136421 7871445 7625411 7397090 7185031 6988619 6808158 6643440
58794F643440j50718j38835j27400j14358r9507q4773p2331o2404n3069m2507
$$ 6643440 6492722 6353887 6226487 6112129 6012622 5927849 5855518 5793114 5740045 5697538
58784E697538l1206k0961j1799j537J0912K3593L4239M3530N3683O4987P5964
$$ 5697538 5666332 5645371 5633572 5632035 5642947 5666540 5700779 5744309 5797992 5862979 5938943
58773E938943Q6416R7849J10740J23553J35012J45742J57129J69895J84231K00122
$$ 5938943 6025359 6123208 6233948 6357501 6492513 6638255 6795384 6965279 7149510 7349632
58763G349632K17222K35290K54788K76133K98583L21234L44826L71091M00367
$$ 7349632 7566854 7802144 8056932 8333065 8631648 8952882 9297708 9668799 10069166
58754A0069166M31471M63918M98632N36218N76141O17890O61473P06365P51217
$$ 10069166 10500637 10964555 11463187 11999405 12575546 13193436 13854909 14561274 15312491
58745A5312491P94828Q36094Q72940R02669R23303R33145R29149R07503Q65800
$$ 15312491 16107319 16943413 17816353 18719022 19642325 20575470 21504619 22412122 23277922
58736B3277922Q02870P16708O05216M69805L16315J51673j8469j88308l50643
$$ 23277922 24080792 24797500 25402716 25872521 26188836 26340509 26322040 26133732 25783089
58727B5783089m98745o28345p37045q23319q87085r29900r53632r60073r52132
$$ 25783089 25284344 24655999 23918954 23095635 22208550 21278650 20325018 19364945 18412813
58718A8412813r33654r07246q73807q34800p93102p50785p07957o64865o23379
$$ 18412813 17479159 16571913 15698106 14863306 14070204 13319419 12611462 11946597 11323218
58709A1323218n85037n49245n14711m81326m49477m18937l89808l63208l39698
$$ 11323218 10738181 10188936 9674225 9192899 8743422 8324485 7934677 7571469 7231771
58700G231771l18133k97176k76902k57938k40228k23689k08700j94948j81065
$$ 7231771 6913638 6616462 6339560 6081622 5841394 5617705 5409005 5214057 5032992
58691E032992j66618j53141j42041j32744j23996j15681j08080j00690r3194q6486
$$ 5032992 4866374 4713233 4571192 4438448 4314452 4198771 4090691 3990001 3896807 3810321
58681C810321q1431p7513p3859p0602o8092o5779o3038o0146n7505n4847n2149
$$ 3810321 3728890 3651377 3577518 3506916 3438824 3373045 3310007 3249861 3192356 3137509 3085360
58670C085360n0191m9334m8774m7738m6337m4622m2335m0263m0071m1891m3727
$$ 3085360 3035169 2985835 2937061 2889323 2842986 2798364 2756029 2715766 2675695 2633804 2590077
58659B590077m4273m4490m5358m6121m6067m6030m6563m6556m5299m3934m3225
$$ 2590077 2545804 2501314 2455956 2409835 2363768 2317738 2271175 2224619 2179320 2135386 2092161
58648B092161m1944l9391l7283l6871l6351l3786l0650k9393k9106k7016k3202
$$ 2092161 2050217 2010826 1973543 1936672 1900321 1866535 1835885 1806492 1777386 1750370 1727168
58637A727168k0443j9861k0024k0132k0978k2482k3080k2264k1413k1465k1660
$$ 1727168 1706725 1686864 1666840 1646708 1625730 1603248 1580168 1557904 1536491 1515026 1493366
58626A493366k1166k0228j9187j7752j5780j3675j1775j0078q646p520o470n409
$$ 1493366 1472200 1451972 1432785 1415033 1399253 1385578 1373803 1363725 1355079 1347559 1341089 1335680
58614A335680m437k958J39M570Q220R710J0177J1157J2230J2256J1490J0627R126
$$ 1335680 1331243 1328285 1328424 1332994 1341214 1350924 1361101 1372258 1384488 1396744 1408234 1418861 1427987
58601A427987O477L779J971j71l841p363q236p051o525p238p267n607l253r51
$$ 1427987 1434464 1438243 1440214 1440043 1436202 1428839 1420603 1413552 1407027 1399789 1392522 1386915 1383662 1382711
58587A382711J509L759N104O319Q870J2377J5113J6862J9010K1884K4527K6971
$$ 1382711 1384220 1387979 1393083 1399402 1408272 1420649 1435762 1452624 1471634 1493518 1518045 1545016
58575A545016L0111L3376L5219L6101L8275M2192M5946M8744N2046N6470O0615
$$ 1545016 1575127 1608503 1643722 1679823 1718098 1760290 1806236 1854980 1907026 1963496 2024111
58564B024111O4166O9250P6876Q4579Q9860R4012J00218J09230J19363J29854
$$ 2024111 2088277 2157527 2234403 2318982 2408842 2502854 2603072 2712302 2831665 2961519
58554B961519J41710J55344J69472J83148J97395K13651K31029K46329K57231
$$ 2961519 3103229 3258573 3428045 3611193 3808588 4022239 4253268 4499597 4756828
58545D756828K64732K71219K76337K76227K67300K49181K22912J88114J44019
$$ 4756828 5021560 5292779 5569116 5845343 6112643 6361824 6584736 6772850 6916869
58536F916869R2446L7502j7418p0556j19972j62862j97150k22503k39604k49405
$$ 6916869 7009315 7046817 7029399 6958843 6838871 6676009 6478859 6256356 6016752 5767347
58526E767347k53176k52140k47051k38685k28236k16448k03157j88610j74192
$$ 5767347 5514171 5262031 5014980 4776295 4548059 4331611 4128454 3939844 3765652
58517C765652j60707j47166j32854j19182j07567r6870q5350p4196o6340o2241
$$ 3765652 3604945 3457779 3324925 3205743 3098176 3001306 2915956 2841760 2775420 2713179
58507B713179n9365n5695n1335m6874m2626l9410l7814l6627l4178l1010k9007
$$ 2713179 2653814 2598119 2546784 2499910 2457284 2417874 2380060 2343433 2309255 2278245 2249238
58496B249238k8213k7126k5827k5900k7038k6886k4996k4038k5952k9376l2081
$$ 2249238 2221025 2193899 2168072 2142172 2115134 2088248 2063252 2039214 2013262 1983886 1951805
58485A951805l3767l5136l6063l6046l5180l3743l1876l0128k9026k7945k5960
$$ 1951805 1918038 1882902 1846839 1810793 1775613 1741870 1709994 1679866 1650840 1622895 1596935
58474A596935k3837k3395k4619k5370k4301k2059j9339j5867j2023r446r063j0019
$$ 1596935 1573098 1549703 1525084 1499714 1475413 1453354 1434015 1418148 1406125 1396679 1387616 1377597
58462A377597j1184j2314j3286j3754j3914j4172j3893j2080r305p176n908m444
$$ 1377597 1366413 1354099 1340813 1327059 1313145 1298973 1285080 1273000 1263695 1256519 1250611 1246167
58450A246167k893k515l007k404k82J362J292P59J080J706J870K149K902K916
$$ 1246167 1243274 1240759 1237752 1235348 1235066 1236428 1237720 1238479 1239559 1241265 1243135 1245284 1248186 1251102
58436A251102J063j820l993m900n336o234p836r450j0002r449r252j0336j1266
$$ 1251102 1252165 1250345 1246352 1241452 1236116 1229882 1222046 1212596 1202594 1193145 1183893 1173557 1162291
58423A162291j0128p606o217o856q141q906r169q815p552o143n539n049l563k165
$$ 1162291 1152163 1144557 1138340 1131484 1123343 1114437 1105268 1096453 1088901 1082758 1077219 1072170 1068607 1066442
58409A066442k845m973n916n160m731n424n757n140m858n178m575k780j675k120
$$ 1066442 1063597 1058624 1052708 1047548 1042817 1037393 1031636 1026496 1021638 1016460 1011885 1009105 1007430 1005310
58395A005310k673k518k764l661l290n32L004N369O441O676N922M766M870O775
$$ 1005310 1002637 1000119 997355 993694 990404 989872 992876 998245 1004686 1011362 1017284 1022050 1026920 1033695
58381A033695R099J0706J1834J2541J2258J1459J1582J2639J3040J2214J1103
$$ 1033695 1042794 1053500 1065334 1077875 1090133 1101592 1113174 1125813 1138853 1151067 1162170
58370A162170R844P425M021J122r93l291n443o118n882o603p854p330n169m138
$$ 1162170 1172014 1179439 1183460 1184582 1183589 1180298 1174855 1168737 1162855 1156252 1148398 1141068 1135899 1131761
58356A131761n073n883n707o073p038o292l272k64J740M162O736O835M529L711
$$ 1131761 1126688 1120805 1115098 1109025 1101987 1095695 1092423 1092159 1093899 1098061 1104797 1111632 1116161 1119872
58342A119872O032Q180P548O298P001Q421Q661Q793J0035J0696R212P359P461
$$ 1119872 1125904 1134084 1141632 1147930 1154931 1163352 1172013 1180806 1190841 1201537 1210749 1218108 1225569
58329A225569Q966J0326J1603J2869J2835J1415J0785J1802J2443J1785J2004
$$ 1225569 1234535 1244861 1256464 1269333 1282168 1293583 1304368 1316170 1328613 1340398 1352402
58318A352402J4137J5510J4062J1708J0711J0006P978N613M112K582O63J72J519
$$ 1352402 1366539 1382049 1396111 1407819 1418530 1428536 1436514 1442127 1446239 1448821 1449484 1449656 1451175
58305A451175K098P35O6J804L574L410L266M866O157N482N173P289R551R442Q525
$$ 1451175 1453273 1454008 1454074 1455878 1459452 1462862 1466128 1470994 1477151 1482633 1487806 1495095 1504646 1514088 1522613
58290A522613Q782Q599O512N050O424Q053O993N220N869P624P748P330Q424R096
$$ 1522613 1531395 1539994 1546506 1551556 1557980 1566033 1573026 1578246 1584115 1591739 1599487 1606817 1615241 1624337
58276A624337O595K940K095L883N377O164P544Q825Q962R623J2256J4529J4006
$$ 1624337 1630932 1633872 1635967 1639850 1645227 1651391 1658935 1667760 1676722 1686345 1698601 1713130 1727136
58263A727136J2796J4075J6634J7440J7032J7703J8883J9030J9608K2487K5646
$$ 1727136 1739932 1754007 1770641 1788081 1805113 1822816 1841699 1860729 1880337 1902824 1928470
58252A928470K6085K4750K4298K4468K3828K3420K4329K4557K2541K0735K1473
$$ 1928470 1954555 1979305 2003603 2028071 2051899 2075319 2099648 2124205 2146746 2167481 2188954
58241B188954K2749K2454K2958K6629L0733L1924L1991L3873L5996L6053L6304
$$ 2188954 2211703 2234157 2257115 2283744 2314477 2346401 2378392 2412265 2448261 2484314 2520618
58230B520618L9216M1978M1511M0744M3654M8111N0215N1510N5030N8416N8365
$$ 2520618 2559834 2601812 2643323 2684067 2727721 2775832 2826047 2877557 2932587 2991003 3049368
58219C049368N7855O1323O6439O8441O8913P2242P6955P8850P9398Q2790Q7765
$$ 3049368 3107223 3168546 3234985 3303426 3372339 3444581 3521536 3600386 3679784 3762574 3850339
58208C850339R0579R2923R8634J05617J09401J11625J16840J24202J30424J37140
$$ 3850339 3940918 4033841 4132475 4238092 4347493 4459118 4575958 4700160 4830584 4967724
58198D967724J46992J56593J62200J67975J79234J92310K00911K07663K18754
$$ 4967724 5114716 5271309 5433509 5601484 5780718 5973028 6173939 6381602 6600356
58189F600356K32041K41954K51344K66445K84462K98648L11536L30203L52407
$$ 6600356 6832397 7074351 7325695 7592140 7876602 8175250 8486786 8816989 9169396
58180I169396L70839L87410M09633M36504M62216M90134N28268N73858O17463
$$ 9169396 9540235 9927645 10337278 10773782 11235998 11726132 12254400 12828258 13445721
58171A3445721O59178P05582P54153P97095Q37752Q86530R43244J000096J059064
$$ 13445721 14104899 14810481 15564634 16361729 17199481 18086011 19029255 20029351 21088415
58162B1088415J128704J206852J284609J364298J455057J554632J655327J763728
$$ 21088415 22217119 23423971 24708580 26072878 27527935 29082567 30737894 32501622
58154C2501622J893387K042229K198908K366320K555610K763857K984606L234574
$$ 32501622 34395009 36437238 38636146 41002466 43558076 46321933 49306539 52541113
58146E2541113L541299L910790M338264M843419N459598O194102P036401P998362
$$ 52541113 56082412 59993202 64331466 69174885 74634483 80828585 87864986 95863348
58138I5863348R105901J0360543J1755440J3316054J5068422J6981922J9015351
$$ 95863348 104969249 115329792 127085232 140401286 155469708 172451630 191466981
58131A91466981K1217303K3720205K6663788L0177826L4249875L8212757M0247008
$$ 191466981 212684284 236404489 263068277 293246103 327495978 365708735 405955743
58124D05955743L7853984K9484501J6003931M75767j3612059k4050096l0320111
$$ 405955743 443809727 473294228 489298159 489773926 476161867 452111771 421791660
58117D21791660l3001858l3098474l1652795k9503224k7137100k4749848k2421971
$$ 421791660 388789802 355691328 324038533 294535309 267398209 242648361 220226390
58110B20226390k0200144j8072129j5981906j3899407j1841514r842784p951777
$$ 220226390 200026246 181954117 165972211 152072804 140231290 130388506 122436729
58103A22436729o235954m744384l493540k544492k058285k182026k860268l812877
$$ 122436729 116200775 111456391 107962851 105418359 103360074 101178048 98317780 94504903
58095I4504903m715747n372783n731588n815630n683396n409908n057265m660772
$$ 94504903 89789156 84416373 78684785 72869155 67185759 61775851 56718586 52057814
58087E2057814m247969l849694l482370l140430k818272k523657k262213k027081
$$ 52057814 47809845 43960151 40477781 37337351 34519079 31995422 29733209 27706128
58079B7706128j813055j625423j466987j330531j210603j109233j024753r48654
$$ 27706128 25893073 24267650 22800663 21470132 20259529 19150296 18125543 17176889
58071A7176889q78587q21249p77677p38452o97576o58389o21835n82017n38022
$$ 17176889 16298302 15477053 14699376 13960924 13263348 12604959 11983124 11401107 10863085
58062A0863085m97642m64378m32353l98798l70291l51565l38560l27141l18640
$$ 10863085 10365443 9901065 9468712 9069914 8699623 8348058 8009498 7682357 7363717
58053G363717l12321l02438k87469k73182k62381k50498k35280k21610k12486
$$ 7363717 7051396 6748958 6461489 6188307 5925926 5675428 5440148 5218538 5006052
58044E006052k04008j93674j85265j80860j76003j67382j58062j50626j42239
$$ 5006052 4802044 4608370 4423105 4242245 4066242 3898860 3740798 3590172 3447933
58035C447933j30918j20250j13350j07902j01088r4132q8639q3551p8415p4616
$$ 3447933 3317015 3196765 3083415 2975513 2874425 2780293 2691654 2608103 2529688 2455072
58025B455072p1274o5523n8603n5530n6801n6858n3148m9967n0494n1567m9765
$$ 2455072 2383798 2318275 2259672 2204142 2147341 2090483 2037335 1987368 1936874 1885307 1835542
58014A835542m6668m4403m1510l6849l2823l1256l0377k8709k7566k7235k5309
$$ 1835542 1788874 1744471 1702961 1666112 1633289 1602033 1571656 1542947 1515381 1488146 1462837
58003A462837k1354j8677j8971j9623j8632j7658j7887j7469j5620j4821j6256
$$ 1462837 1441483 1422806 1403835 1384212 1365580 1347922 1330035 1312566 1296946 1282125 1265869
57992A265869j7181j5490j3047j2196j2474j2820j3318j3061j0217n980m510p089
$$ 1265869 1248688 1233198 1220151 1207955 1195481 1182661 1169343 1156282 1146065 1140085 1135575 1128486
57980A128486j0167j0732r644q247o099l664k891l422k479j19Q5k746m889m401
$$ 1128486 1118319 1107587 1097943 1089696 1083597 1079933 1077042 1073620 1071141 1071022 1071107 1068361 1063472 1059071
57966A059071m244o425q074o633m386m219m882m111l058l937o098p696q831j0156
$$ 1059071 1054827 1048402 1040328 1033695 1029309 1025090 1020208 1016097 1013039 1009102 1003004 995308 986477 976321
57952I76321j0715r675q200p599p674q269r793j1075r810o492m631n729p452q012
$$ 976321 965606 955931 947731 940132 932458 924189 914396 903321 893511 887019 882388 876659 869207 861195
57938H61195q448r038p775m496k393k966l336j048K302M660O804R389J0543R455
$$ 861195 852747 843709 835934 831438 829045 826079 822743 821695 823997 828657 835461 844850 855393 864848
57924H64848Q585R295Q901N346J118r30k058m166n348l312m04n94l337m808l882
$$ 864848 873433 882728 891629 896975 898093 897163 895105 890939 885591 882279 881875 881281 877944 873136 869254
57909H69254k906l448m827o248p526q233q253q280q204o747m260l596n957q352
$$ 869254 866348 862900 858073 851825 844299 836066 827813 819533 811329 804582 800322 796726 790769 782417
57895G82417p714n267l996m081l911l591m054m233k472L17J887K126K697M054
$$ 782417 774703 769436 765440 761359 757448 753857 749803 745570 743098 743415 745302 747428 750125 754179
57881G54179N300O060O292N248K711J30j356k681m712o068n347l911m046n631
$$ 754179 759479 765539 771831 777079 779790 779920 778564 775883 771171 765103 759756 755845 751799 746168
57867G46168p047q028r191r999r661q904q659q102o159l655j822j29K119L611
$$ 746168 739121 731093 721902 711903 702242 693338 684679 676577 670418 666763 664941 664812 666931 670542
57853F70542L062K077L128N749P476P660P637P798P225N881M775M202L719L324
$$ 670542 673604 675681 678809 684558 692034 699694 707331 715129 722354 728235 733010 737212 740931 744255
57839G44255L000J948M4j073m06L51o56k264k356j786l049n814p200o349n583
$$ 744255 747255 749203 749247 748174 747768 748119 747463 745199 742843 741057 738008 732194 724994 718645 713062
57824G13062o582q176q622p775o361m940m225m804n984o146m592k101K93J996
$$ 713062 706480 698304 689682 681907 675546 670606 666381 661577 655593 649447 644855 642754 643047 645043
57810F45043K678K587K813M085N623O231N993N830O042O431P114P893P656N829
$$ 645043 647721 650308 653121 657206 662829 669060 675053 680883 686925 693356 700470 708363 716019 721848
57796G21848L678K741K676K129Q97l82j850l905n775o484o775q194j0476j1643
$$ 721848 725526 728267 730943 733072 733969 733587 731737 727832 722057 715573 708798 700604 690128 678485
57782F78485j0680q622o995o443o848p619p930p536p037o747o108m967m418n268
$$ 678485 667805 659183 652188 645745 638897 631278 623348 615812 608775 602028 595920 590953 586535 581267
57768E81267o685p528p971q519q662q064p818q810r892r525q288p752p744o907
$$ 581267 574582 567054 559083 550564 541902 533838 526020 517210 507318 497793 489505 481753 474009 467102
57754D67102n402m851n848p400q579r008q039n222j570J208K570L061L063K998
$$ 467102 461700 456849 451001 443601 435022 426014 417975 412753 411183 412391 414961 418022 421085 424083
57740D24083L984O370Q236P310M139J432N48N16M28P40J929L547M991O020O338
$$ 424083 428067 434437 442673 449983 454122 455554 456102 456618 457046 457786 459715 463262 468253 474273 480611
57725D80611N834N166M991M807L726K108J097P97L06o31j411j973l075m968o817
$$ 480611 486445 491611 496602 501409 505135 507243 508340 509137 509443 508812 507401 505428 502353 497385 490568
57710D90568p657p221n982m824m402m360l807k798k275k110q50J620L003J712
$$ 490568 482911 475690 469708 464884 460482 456122 452315 449517 447242 445132 444282 445902 448905 450617
57696D50617n35j075J13J235J763K459L105K750J779J637K669L910M665M757L968
$$ 450617 450082 449007 449120 450355 452118 454577 457682 460432 462211 463848 466517 470427 475092 479849 483817
57681D83817K856L199N625P811P304N195M465N382N529M250L786N405P203P032
$$ 483817 486673 489872 495497 503308 510612 515807 520272 525654 531183 535433 539219 544624 551827 558859
57667E58859N544N029O472Q833J0454J0512R635R236R939J1077J2023J3068J4270
$$ 558859 564403 569432 575904 584737 595191 605703 615338 624574 634513 645590 657613 670681 684951
57654F84951J4826J4687J5264J7000J8030J7214J6719J8980K2628K4533K4735
$$ 684951 699777 714464 729728 746728 764758 781972 798691 817671 840299 864832 889567
57643H89567K5886K8509L0437L0929L1826L4126L6612L8487M0553M3069M5283
$$ 889567 915453 943962 974399 1005328 1037154 1071280 1107892 1146379 1186932 1230001 1275284
57632A275284M7765N2380N9009O4977O8813P2187P7102Q3556R1123J00433J11639
$$ 1275284 1323049 1375429 1434438 1499415 1568228 1640415 1717517 1801073 1892196 1992629 2104268
57621B104268J23538J35718J49693J66389J84161K00937K17021K34220K53130
$$ 2104268 2227806 2363524 2513217 2679606 2863767 3064704 3281725 3515945 3769075
57612C769075K72571K91138L08213L23420L34990L38016L24920K89462K31019
$$ 3769075 4041646 4332784 4640997 4964417 5299407 5637423 5962343 6251805 6482824
57603F482824J54758O8584j8730r8178j62985k11501k45922k68079k78458k78986
$$ 6482824 6637582 6706166 6687436 6589258 6426273 6214772 5968850 5700771 5422313 5143327
57593E143327k73634k65261k54053k39840k23679k06468j88250j69822j52950
$$ 5143327 4869693 4604432 4350379 4110539 3886860 3680392 3492142 3322320 3169370
57584C169370j38087j23875j09650r6344q4256p2358o0789n1570m5371l9770l2313
$$ 3169370 3031283 2907408 2797758 2701414 2617158 2544800 2484011 2432441 2387070 2347300 2314987
57573B314987k3415j4843p099K08P080J3609K0374K7255L3413L9359M7087N7111
$$ 2314987 2291572 2276729 2269630 2269838 2276918 2290527 2310901 2338156 2371569 2410928 2458015 2515126
57561B515126O7370P6350Q5082R4629J03914J12131J21223J33413J47505J60008
$$ 2515126 2582496 2658846 2743928 2838557 2942471 3054602 3175825 3309238 3456743 3616751
57551C616751J69091J75396J79507J80441J76417J65821J47825J22989R2807N8123
$$ 3616751 3785842 3961238 4140745 4321186 4497603 4663424 4811249 4934238 5027045 5085168
57541E085168J9022k3185o5092j03082j35086j60104j77839j89511j97231k01546
$$ 5085168 5104190 5081005 5015913 4912831 4777745 4617641 4439802 4250291 4053060 3851514
57531C851514k01208j96230j88917j80819j70994j58937j46905j37237j29287
$$ 3851514 3650306 3454076 3265159 3084340 2913346 2754409 2607504 2470267 2340980
57522B340980j21146j12677j04590r6254q6993p8183p1443o5853n9576n3238m8925
$$ 2340980 2219834 2107157 2002567 1906313 1819320 1741137 1669694 1603841 1544265 1491027 1442102
57511A442102m6498m3690l9647l5737l2838l0228k7424k5030k3336k1758k0034
$$ 1442102 1395604 1351914 1312267 1276530 1243692 1213464 1186040 1161010 1137674 1115916 1095882
57500A095882j8462j6771j4131j0502o827l882j927j141j135m17K109N365P348
$$ 1095882 1077420 1060649 1046518 1036016 1029189 1025307 1023380 1022239 1021104 1020687 1022796 1028161 1035509
57487A035509Q003R303J2318J5875J8417J9822K0807K1844K3317K5741K9115L2630
$$ 1035509 1043512 1052815 1065133 1081008 1099425 1119247 1140054 1161898 1185215 1210956 1240071 1272701
57475A272701L5635L8462M1813M5684M9412N2833N6853O2464O9315P5859Q1285
$$ 1272701 1308336 1346798 1388611 1434295 1483707 1536540 1593393 1655857 1725172 1801031 1882316
57464A882316Q6545R2808R9724J06378J13202J21227J29712J36548J41078J44393
$$ 1882316 1968861 2061669 2161393 2267771 2380973 2502200 2631912 2768460 2909538 3053931
57454C053931J46409J44919J38397J27581J12920R2727O5680L3727N66l1558o1876
$$ 3053931 3200340 3345259 3483656 3611237 3724157 3816884 3882564 3916291 3916857 3885299 3823423
57443C823423q9058j11186j27330j37793j43273j44786j43664j40603j35377j28205
$$ 3823423 3734365 3623179 3495849 3358056 3214783 3069997 2926333 2785730 2650353 2522148
57433B522148j20312j12422j04054r5167q6907p9683p2181o3602n5139m7799m0625
$$ 2522148 2401836 2289414 2185360 2090193 2003286 1923603 1851422 1787820 1732681 1684882 1644257
57422A644257l2787k5588k0342j5920j0722n428j378K393P734J4183J9914K4927
$$ 1644257 1611470 1585882 1565540 1549620 1538898 1533470 1532092 1534485 1542219 1556402 1576316 1601243
57410A601243L0495L6161M0387M3834M8997N6446O4062P0288P5860Q1977Q8943
$$ 1601243 1631738 1667899 1708286 1752120 1801117 1857563 1921625 1991913 2067773 2149750 2238693
57399B238693R6795J05317J13175J18924J22920J26390J28641J27184J20595J09171
$$ 2238693 2335488 2440805 2553980 2672904 2795824 2922214 3050855 3178039 3298634 3407805
57389C407805R2802P0465M2437J1026k1353n3133q2422j06958j25902j40185j50618
$$ 3407805 3500607 3571072 3613509 3624535 3603182 3550049 3467627 3360669 3234767 3094582 2943964
57378B943964j57019j59443j58648j55079j48825j40857j32818j25259j17439
$$ 2943964 2786945 2627502 2468854 2313775 2164950 2024093 1891275 1766016 1648577
57369A648577j09040j00742r3029q5790p9137p3249o7476o1055n4602m9407m5445
$$ 1648577 1539537 1438795 1345766 1259976 1180839 1107590 1040114 979059 924457 875050 829605
57358H29605m1673l8022l5264l3068l0214k6768k4212k3181k2933k2972k3380
$$ 829605 787932 749910 714646 681578 651364 624596 600384 577203 554270 531298 507918
57347E07918k3450k2069j9630j7636j6338j4743j2970j2261j2500j2209j1345
$$ 507918 484468 462399 442769 425133 408795 394052 381082 368821 356321 344112 332767
57336C32767j1510j2794j3116j1680j0394j0521j0537q943o992o532o960o471
$$ 332767 321257 308463 295347 283667 273273 262752 252215 243272 236280 229748 222788 216317
57324B16317n007l981l898m038l925l652l170k402j697j398j358j378j503j574
$$ 216317 211310 207329 203431 199393 195468 191816 188646 186244 184547 183149 181791 180413 178910 177336
57310A77336j322j131j675k596k704j873j340j807k594k996l072k646j241M40
$$ 177336 176014 174883 173208 170612 167908 166035 164695 162888 160294 157298 154226 151580 150339 150779
57296A50779O92q06k361k758k728l092l200k323j147o84r88j755k858l605l042
$$ 150779 151471 150665 148304 145546 142818 139726 136526 134203 133056 132372 131384 129629 126771 123166 120124
57281A20124j723j338j815j085J198K211J08k787l274j870j271j718j103R82K408
$$ 120124 118401 117063 115248 114163 115361 117572 117680 114893 111619 109749 108478 106760 105657 106639 109047
57266A09047J893O27j14q08k295m035m725l926k469j491j271r16M85K443L570
$$ 109047 110940 111567 111453 110645 108350 104315 99590 95664 93195 91704 90433 89517 90002 92445 96015
57251I6015L730M376O090P193O072L766K733L826N905P684Q502Q006O787O806
$$ 96015 99745 104121 110211 117404 123476 127242 129975 133801 139706 147390 155892 163898 170685 177491
57237A77491R472J3479J6184J6950J7443J8655J9536J9157J8553J9393K1825K4578
$$ 177491 186963 200442 216626 233576 251019 269674 289210 308367 326920 346313 368138 392716
57225C92716K6597K7684K7932K7409K6557K6309K7247K8697K9134K7825K5652
$$ 392716 419313 446997 474929 502338 528895 555204 582451 611148 640282 668107 693759
57214F93759K3752K1699J8117J2827P278K671j078m239o653q880j2438j7661k2607
$$ 693759 717511 739210 757327 770154 777432 780103 779025 774786 768133 759253 746815 729154 706547
57201G06547k5334k6291k7043k7636k6995k5181k3367k1780j9499j6492j4042
$$ 706547 681213 654922 627879 600243 573248 548067 524700 502920 483421 466929 452887
57190D52887j2711j1377r087o604n179m698m121l331l314m525n971o237m911k584
$$ 452887 440176 428799 419712 413108 407929 403231 399110 395779 392465 387940 381969 375732 370821 368237
57176C68237K5K360L813M124M200N597Q764J2416J5099J6649J7570J8010J8393
$$ 368237 368262 370622 374435 378559 382759 388356 397120 409536 424635 441284 458854 476864 495257
57163D95257K0081K3843K8178L0784L1448L1936L3237L4671L5709L6705L7570
$$ 495257 515338 539181 567359 598143 629591 661527 694764 729435 765144 801849 839419
57152H39419L7557L6945L7068L8156L9009L9499M1263M4836M8204M9745N0658
$$ 839419 876976 913921 950989 989145 1028154 1067653 1108916 1153752 1201956 1251701 1302359
57141A302359N2572N4408N4012N1801N0270N0354N0598M9943M9037M8381M6983
$$ 1302359 1354931 1409339 1463351 1515152 1565422 1615776 1666374 1716317 1765354 1813735 1860718
57130A860718M3999M0375L7836L6790L6127L4971L3818L3624L4243L4497L3856
$$ 1860718 1904717 1945092 1982928 2019718 2055845 2090816 2124634 2158258 2192501 2226998 2260854
57119B260854L3188L3241L3082L1149K7426K3396K0139J7777J6569J6833J7628
$$ 2260854 2294042 2327283 2360365 2391514 2418940 2442336 2462475 2480252 2496821 2513654 2531282
57108B531282J7236J5479J4064J4097J4725J4914J5036J5835J7165J8725K0882
$$ 2531282 2548518 2563997 2578061 2592158 2606883 2621797 2636833 2652668 2669833 2688558 2709440
57097B709440K3844K7026L0100L3711L8379M3403M7343M8865M7099M2393L6854
$$ 2709440 2733284 2760310 2790410 2824121 2862500 2905903 2953246 3002111 3049210 3091603 3128457
57086C128457L2644K9481K5291J9286J2507N238l716j4413k5051l4959m6089o0178
$$ 3128457 3161101 3190582 3215873 3235159 3247666 3252904 3249188 3234775 3209724 3174765 3128676 3068498
57074C068498p6386r3070j09853j26327j40552j50718j57316j62670j69778j82177
$$ 3068498 2992112 2899042 2789189 2662862 2522310 2371592 2214276 2051606 1881828 1699651
57064A699651k02735k31254k65028l02844l46418d5661m53349n13808n78766o48596
$$ 1699651 1496916 1265662 1000634 697790 351372 -45661 -499010 -1012818 -1591584 -2240180
57054b240180p22511q01245q88335r86481j094822j211891j339031j478885j632756
$$ -2240180 -2962691 -3763936 -4652271 -5638752 -6733574 -7945465 -9284496 -10763381 -12396137
57045a2396137j801900j989508k199545k435726k703734l012611l372403l792709
$$ -12396137 -14198037 -16187545 -18387090 -20822816 -23526550 -26539161 -29911564 -33704273
57037c3704273m285219m865544n550327o352386p277268q322657r482647j0750571
$$ -33704273 -37989492 -42855036 -48405363 -54757749 -62035017 -70357674 -79840321 -90590892
57029i0590892j2104362j3482482j4801358j6039082j7299432j8727772k0301128
$$ -90590892 -102695254 -116177736 -130979094 -147018176 -164317608 -183045380 -203346508
57022b03346508k1705745k2467097k2221876k0865065j8474407j5174025j1111687
$$ -203346508 -225052253 -247519350 -269741226 -290606291 -309080698 -324254723 -335366410
57015c35366410o523163j747429K848993O965885J0422783J3174978J5295904
$$ -335366410 -341889573 -343637002 -340788009 -333822124 -323399341 -310224363 -294928459
57008b94928459J6913644J8126934J8964922J9416687J9483817J9199981J8614949
$$ -294928459 -278014815 -259887881 -240922959 -221506272 -202022455 -182822474 -164207525
57001a64207525J7775662J6722630J5496113J4143460J2722948J1299888R935316
$$ -164207525 -146431863 -129709233 -114213120 -100069660 -87346712 -76046824 -66111508
56994f6111508Q674894P544330O550420N685282M933840M281996L719916L239559
$$ -66111508 -57436614 -49892284 -43341864 -37656582 -32722742 -28440746 -24720830 -21481271
56986b1481271K831820K486605K193687J942780J724517J532366J362928J214315
$$ -21481271 -18649451 -16162846 -13969159 -12026379 -10301862 -8769496 -7406568 -6192253
56978f192253J084966R73356Q77241P93266P18367O51177e02714C4678M89508
$$ -6192253 -5107287 -4133931 -3256690 -2463424 -1745057 -1093880 -502714 34678 524186
56969E24186M48711M15877L89174L65330L42505L20166K96989K71222K43085K15079
$$ 524186 972897 1388774 1777948 2143278 2485783 2805949 3102938 3374160 3617245 3832324
56959C832324J89920J69170J53142J40478J28529J15745J03186R2327Q2736P3804
$$ 3832324 4022244 4191414 4344556 4485034 4613563 4729308 4832494 4924821 5007557 5081361
56949E081361O7645O7749P5298Q8439J03345J12672J04292O7229J693p8386j54317
$$ 5081361 5149006 5216755 5292053 5380492 5483837 5596509 5700801 5768030 5769723 5691337 5537020
56938E537020k13595k53291k76772k89306k94919k94725k87929k74731k57547
$$ 5537020 5323425 5070134 4793362 4504056 4209137 3914412 3626483 3351752 3094205
56929C094205k39215k21022k02981j85064j67687j51742j38457j28496j21234
$$ 3094205 2854990 2633968 2430987 2245923 2078236 1926494 1788037 1659541 1538307
56920A538307j15708j12107j11111j11720j11270j08086j02911r7125r0697q2882
$$ 1538307 1422599 1310492 1199381 1087661 976391 868305 765394 668269 577572 494690
56910D94690p4129o6124n9924n4762m8975m1925l4726k8887k4566k0574j6027
$$ 494690 420561 354437 294513 239751 190776 148851 114125 85238 60672 40098 24071
56899B4071j1285E691B020q80J231K410J937j500c059j5897k0310k0185j8292
$$ 24071 12786 5691 2020 1140 2371 4781 6718 5218 -3059 -18956 -39266 -59451 -77743
56886g7743j7615j7651j6284j3631j1790j1429j1010r213o268k786R27M381P251
$$ -77743 -95358 -113009 -129293 -142924 -154714 -166143 -177153 -186366 -192634 -195420 -194493 -190112 -182861
56873a82861J0527J5824K3066K9768L2978L1304a4246A792N982l240e875j4798
$$ -182861 -172334 -156510 -133444 -103676 -70698 -39394 -14246 1792 7774 4534 -5875 -20673
56861b0673j6265j5898j5590j6188j6712j6040j4529j3133j1943j0765j0154j0487
$$ -20673 -36938 -52836 -68426 -84614 -101326 -117366 -131895 -145028 -156971 -167736 -177890 -188377
56849a88377j0760r722p658n743m276k873j730j182n69R27K834M159N184O887
$$ -188377 -199137 -208859 -216517 -222260 -226536 -229409 -231139 -232321 -232890 -231963 -229129 -224970 -219786 -212899
56835b12899R100J0823J2046J3629J5596J7135J8150J9464K1596K4537b2647H952
$$ -212899 -203799 -192976 -180930 -167301 -151705 -134570 -116420 -96956 -75360 -50823 -22647 8952
56822D1592K9810K4398J8968J4292R522M783J460O6j15P14K990O130Q723J0481
$$ 41592 71402 95800 114768 129060 138582 143365 144825 144891 144776 145490 148480 154610 163333 173814
56808A73814J2248J3976J4818J5337J7485K1828K6678L0502L3415L5738L6818
$$ 173814 186062 200038 214856 230193 247678 269506 296184 326686 360101 395839 432657
56797D32657L5813L2164K5039J4142J558r155j6339k0917k3427k2697j8484j3149
$$ 432657 468470 500634 525673 539815 541373 532218 515879 494962 471535 448838 430354 417205
56785D17205r108o139k561K272P879J3706J9077K3282K6848L1527L7967M4622
$$ 417205 408097 401958 399397 401669 409548 423254 442331 465613 492461 523988 561955 606577
56773F06577M9822N3155N3551M8086L5006J6950j158j6632k9382l8635m2390m0633
$$ 606577 656399 709554 763105 811191 846197 863147 861989 845357 815975 777340 734950 694317
56761F94317l6521l2997k9813k5142j8990j3273r131n698j696L028P991J3184
$$ 694317 657796 624799 594986 569844 550854 537581 528450 522752 521056 524084 532075 545259
56749E45259J8867K4858L0714L6063L9737L9030L1427J7662J808j2201k3153l1269
$$ 545259 564126 588984 619698 655761 695498 734528 765955 783617 785425 773224 750071 718802
56737G18802l6085l7184l5814l3860l1591k8170k4109k1316k0329j9136j5419
$$ 718802 682717 645533 609719 575859 544268 516098 491989 470673 450344 431208 415789
56726D15789r055j900M083Q124J0769J3146J5667J7375J6814J3387P483p7q073
$$ 415789 406734 404834 408917 417041 427810 440956 456623 473998 490812 504199 511682 511605 503532
56713E03532j4984j9971k3399k5617k6103k4792k3256k2926k2931k1460j8836
$$ 503532 488548 468577 445178 419561 393458 368666 345410 322484 299553 278093 259257
56702B59257j7052j6482j5233j2206q766o660n839n311m928n343o618p638o806
$$ 259257 242205 225723 210490 198284 189518 182858 177019 171708 166780 161437 154819 147181 140375
56689A40375l654P8J719P54m79j77K73j157l398l702j930m65j63M45J733J955
$$ 140375 136721 136799 138518 139272 138793 138616 138889 137732 134334 130632 128702 128237 128074 128519 130252 132207
56673A32207N49n31o5L82p92k588l148k418j533j036j007j598k404k485j860j582
$$ 132207 132756 132225 132160 132542 131750 129162 126014 123596 122063 121027 120020 118422 116018 113533 111673 110091
56657A10091j759j303k32o9j059j286J52J427J058L48P23R41n20k125j352J095
$$ 110091 108332 107029 106797 106728 105669 104383 104535 105962 107020 107368 108091 109032 108512 106387 105035 106130
56641A06130K089N99j398k295k546k674k011k49J373J493K92r02j045j23J110
$$ 106130 108219 108818 107420 105125 102579 99905 97894 97645 99018 100511 100803 99901 98856 98733 99843
56626I9843J832J756J008m42k553m327m129j546J753L717L882L154K366J656Q19
$$ 99843 101675 103431 104439 103997 101444 97117 92988 91442 93195 96912 100794 103948 106314 107970 108789
56611A08789l12j438j710p23N11O97K85Q78K406K716P23j776k491j397K4R65J450
$$ 108789 108477 107039 105329 104606 105117 105814 106099 106977 109383 112099 112822 111046 108555 107158 107182 108147 109597
56594A09597J424Q92K18o09j976l300k938m40K469M170N002N815O316O338P220
$$ 109597 111021 111913 112131 111522 109546 106246 103308 102868 105337 109507 114509 120324 126640 132978 140198
56579A40198R857J2394J1977Q432M523K737L039L623K900Q81p92n94R08J815J619
$$ 140198 150055 162449 174426 182858 187381 190118 193157 196780 199680 200561 199769 199175 200083 201898 203517
56564B03517J549J869J068j149k411j019J195J503K4j275j890k573k991k211r29
$$ 203517 205066 206935 208003 206854 204443 203424 204619 206122 206146 204871 202981 200408 197417 195206 194277
56549A94277p03j427j632r47k70J31O30P98n8j208j288n09j96m84l60K52N19N70
$$ 194277 193574 192147 190515 189568 189298 189429 190059 190857 190799 189591 188303 187794 187598 187114 186754 187006 187525 188095
56531A88095J310K369K307J008K5K74J035J425J392J055N80O54J637K460J833
$$ 188095 189405 191774 194081 195089 195114 195388 196423 197848 199240 200295 200875 201529 203166 205626 207459
56516B07459L68j93L62O93L55K62P21J051J316K365L856M365L901M165N516N930
$$ 207459 207827 207634 207996 208689 209044 209306 210027 211078 212394 214759 218615 222980 226881 231046 236562 242492
56500B42492M168K075K181M332O332O881O457N882N414N135N239N776O415O452
$$ 242492 246660 248735 250916 255248 261580 268461 274918 280800 286214 291349 296588 302364 308779 315231
56486C15231N202K807N60j89M76J225R79l71k365m220m949m275l257l037l168
$$ 315231 320433 323240 323800 323611 324087 325312 326291 325920 323555 319335 314386 310111 306854 303817 300649
56471C00649k388q32p8q98k370l408l832l555k197q5J450J558P94l1r47k159l073
$$ 300649 298261 297429 297351 296453 294083 290675 286843 283288 281091 281006 282456 284014 284808 284777 283830 281671 278598
56454B78598k958k021j111n91j10N18P27k09k051l390l008j387k10j84l11K69
$$ 278598 275640 273619 272508 271917 271807 272325 273052 272843 270792 267402 264394 263007 262797 262613 262302 262571
56438B62571P55M9j228j425j76J220J652J276P85N88P51R66N58p98k491l598l795
$$ 262571 263326 263375 262147 260722 260546 261766 263418 264694 265479 266067 266818 267784 268342 267544 265053 261455 257660
56421B57660l103j371J062K809K676J282L62O28J250J371J173J422K555M211N292
$$ 257660 254557 253186 254248 257057 259733 261015 261377 262005 263255 264626 265799 267221 269776 273987 279279
56406B79279M864L424K635L288M306M350L553K895K908L800N741P938Q554O850
$$ 279279 284143 287567 290202 293490 297796 302146 305699 308594 311502 315302 321043 328981 337535 344385
56392C44385M387K770J467o71k881l483k502j389p79l60k88p83q79L80J930J827
$$ 344385 348772 351542 353009 352338 349457 345974 343472 342083 341304 340944 340656 339873 338994 339374 341304 343131
56376C43131O5j638k440k916l344l457l670m547n343m885l602k722j976k92J640
$$ 343131 343196 341558 339118 336202 332858 329401 325731 321184 315841 310956 307354 304632 302656 302364 304004
56361C04004J989Q91M03J216J944J860J809J893R16j045j918p14P21K29j857l567
$$ 304004 305993 306884 307287 308503 310447 312307 314116 316009 316925 315880 313962 313248 313969 314198 312341 308774
56345C08774l557j764Q61K560K003k2j299r52k13j75k95K72J260J898J923J490
$$ 308774 305217 303453 304314 306874 308877 308855 307556 306604 306391 306216 305921 306193 307453 309351 311274 312764
56329C12764R14O86Q75O62m98j576j202J86Q88L31o39j452k116k207j383o44j158
$$ 312764 313678 314364 315239 315901 315403 313827 312625 312811 313699 314030 313391 311939 309823 307616 306233 305589 304431
56312C04431k096j598M17K358L508M279M401L275J946K120L387L920L769M608
$$ 304431 302335 300737 301154 303512 307020 311299 315700 318975 320921 323041 326428 330348 334117 338725
56298C38725O331O925O052N616O219O180M815L686L625L510K956L333M822N399
$$ 338725 345056 351981 358033 363649 369868 376048 380863 384549 388174 391684 394640 397973 402795 408194
56284D08194M090K597K311K313J748J575K384K939K539K523L784N057N187N090
$$ 408194 412284 414881 417192 419505 421253 422828 425212 428151 430690 433213 436997 442054 447241 452331
56270D52331N724O256N819N187N263N634N945O771P969Q240P460P306Q427R268
$$ 452331 458055 464311 470130 475317 480580 486214 492159 498930 506899 515139 522599 529905 538332 547600
56256E47600Q916Q568Q961R066Q735R712J2254J3686J2561J1408J2806J5270J5886
$$ 547600 556516 565084 574045 583111 591846 601558 613812 627498 640059 651467 664273 679543 695429
56243F95429J4831J4258J4460J4098J2972J2007J1416J1032J1310J2171J2231
$$ 695429 710260 724518 738978 753076 766048 778055 789471 800503 811813 823984 836215
56232H36215J1001J0336J1708J3726J4372J4107J4546J5577J6139J6626J8207
$$ 836215 847216 857552 869260 882986 897358 911465 926011 941588 957727 974353 992560
56221I92560K0775K3440K6147K9092L1769L4119L7257M1547M5567M8586N2225
$$ 992560 1013335 1036775 1062922 1092014 1123783 1157902 1195159 1236706 1282273 1330859 1383084
56210A383084N7789O3843O8589P2875P8651Q5970R3743J01967J11059J20462J30020
$$ 1383084 1440873 1504716 1573305 1646180 1724831 1810801 1904544 2006511 2117570 2238032 2368052
56199B368052J41228J54810J68734J80811J91777K03470K15535K26329K35460
$$ 2368052 2509280 2664090 2832824 3013635 3205412 3408882 3624417 3850746 4086206
56190D086206K42862K46759K45336K39287K30163K17259J98747J74881J47589
$$ 4086206 4329068 4575827 4821163 5060450 5290613 5507872 5706619 5881500 6029089
56181F029089J17863Q6002N3479K2190p438l5435o0374q0821r7723j13072j26900
$$ 6029089 6146952 6232954 6286433 6308623 6301185 6265750 6205376 6124555 6026832 5913760 5786860
56170E786860j37729j45190j50206j53356j55035j56367j58218j60157j61741
$$ 5786860 5649131 5503941 5353735 5200379 5045344 4888977 4730759 4570602 4408861
56161D408861j63477j65099j64819j62070j58983j57106j54894j50744j46127
$$ 4408861 4245384 4080285 3915466 3753396 3594413 3437307 3282413 3131669 2985542
56152B985542j42791j39158j32814j24709j17316j10321j01905r3007q6328q1789
$$ 2985542 2842751 2703593 2570779 2446070 2328754 2218433 2116528 2023521 1937193 1855404
56142A855404p6720p0230o3974n8770n3644m8210m3199l8715l4417l1165k9977
$$ 1855404 1778684 1708454 1644480 1585710 1532066 1483856 1440657 1401942 1367525 1336360 1306383
56131A306383k9829k8765k6669k4620k2421j9256j5910j3648j1699q530m815k484
$$ 1306383 1276554 1247789 1221120 1196500 1174079 1154823 1138913 1125265 1113566 1105036 1100221 1097737
56119A097737j553n64O43J253J692K804L816L850M408P327J1320J3689J4610J6362
$$ 1097737 1096184 1095620 1096263 1097516 1099208 1102012 1105828 1109678 1114086 1121413 1132733 1146422 1161032 1177394
56105A177394J8978K0264J9803J9608K0715K2112K3080K3928K4499K4507K5007
$$ 1177394 1196372 1216636 1236439 1256047 1276762 1298874 1321954 1345882 1370381 1394888 1419895
56094A419895K7146K9818L1024L0889L0907L1182L1099L1917L5528M1293M6819
$$ 1419895 1447041 1476859 1507883 1538772 1569679 1600861 1631960 1663877 1699405 1740698 1787517
56083A787517N1432N6356O2371O9928Q0480R4606J09723J22594J33086J42462
$$ 1787517 1838949 1895305 1957676 2027604 2108084 2202690 2312413 2435007 2568093 2710555
56073B710555J49184J49958J44303J34770J23239J10239R7215Q6193P7392O9699
$$ 2710555 2859739 3009697 3154000 3288770 3412009 3522248 3619463 3705656 3783048 3852747
56063C852747O2672N5464M5241K9962J1775n250j9539l1524m0860m7793n5511
$$ 3852747 3915419 3970883 4016124 4046086 4057861 4052611 4033072 4001548 3960688 3912895 3857384
56052C857384o7188q1865r6546j10492j23766j33812j38003j37796j35822j30852
$$ 3857384 3790196 3708331 3611785 3501293 3377527 3243715 3105712 2967916 2832094 2701242
56042B701242j20553j07329r5957q6767p6681o5746n6902n0171m2841l4941k8789
$$ 2701242 2580689 2473360 2377403 2290636 2213955 2148209 2091307 2041136 1998295 1963354 1934565
56031A934565k3737j7024r665n573m891l875j563p51k089k927k552l043m274l571
$$ 1934565 1910828 1893804 1884139 1878566 1873675 1869800 1868237 1867486 1865397 1862470 1859918 1856875 1852601 1849030
56017A849030r77L80j38Q1J557J874Q16J285M219P335R473J1631J3504J3696J3436
$$ 1849030 1848053 1848433 1848295 1848376 1849933 1851807 1852623 1853908 1858127 1865462 1874935 1886566 1900070 1913766 1927202
56002A927202J5315J8613K0515K1304K3322K5835K6558K7000L0187L4237L4847
$$ 1927202 1942517 1961130 1981645 2002949 2026271 2052106 2078664 2105664 2135851 2170088 2204935
55991B204935L3104L3724L6547L7312L6274L7949M2435M5229M5967M8944N4275
$$ 2204935 2238039 2271763 2308310 2345622 2381896 2419845 2462280 2507509 2553476 2602420 2656695
55980B656695N7043N6348N6929O0396O3023O3593O5353O8751P0457P0990P5002
$$ 2656695 2713738 2770086 2827015 2887411 2950434 3014027 3079380 3148131 3218588 3289578 3364580
55969C364580Q2450Q7881R0026R3629J00166J05486J08401J12789J19487J25033
$$ 3364580 3447030 3534911 3624937 3718566 3818732 3924218 4032619 4145408 4264895 4389928
55959D389928J29950J38924J51036J59666J63993J70497J81076J90253J96612
$$ 4389928 4519878 4658802 4809838 4969504 5133497 5303994 5485070 5675323 5871935
55950E871935K05984K20151K33235K42729K53423K67113K79298K89356L03001
$$ 5871935 6077919 6298070 6531305 6774034 7027457 7294570 7573868 7863224 8166225
55941H166225L21193L38018L52747L72257L98088M23588M47610M78178N18349
$$ 8166225 8487418 8825436 9178183 9550440 9948528 10372116 10819726 11297904 11816253
55932A1816253N61208O02689O46058O90281P28731P63725Q07013Q61167R16235
$$ 11816253 12377461 12980150 13626208 14316489 15045220 15808945 16615958 17477125 18393360
55923A8393360R69412J030834J104444J181115J257007J340301J433382J528062
$$ 18393360 19362772 20393606 21498050 22679165 23936172 25276473 26709855 28237917
55915B8237917J625828J742105J882187K033802K191576K366524K563731K776258
$$ 28237917 29863745 31605850 33488037 35521839 37713415 40079939 42643670 45419928
55907D5419928L011024L293854L638312M038563M504552N071959N763007O570537
$$ 45419928 48430952 51724806 55363118 59401681 63906233 68978192 74741199 81311736
55899H1311736P494043Q552977R750280J1070014J2532975J4206577J6138762
$$ 81311736 88805779 97358756 107109036 118179050 130712025 144918602 161057364
55892A61057364J8337485K0830600K3662503K6799129L0127389L3533885L6697373
$$ 161057364 179394849 200225449 223887952 250687081 280814470 314348355 351045728
55885C51045728L8553354L7188719L0856742J9497629N233327q787711k0106521
$$ 351045728 389599082 426787801 457644543 477142172 482375499 473587788 453481267
55878D53481267k7765990l1978322l3464120l3066359l1565800k9523727k7236747
$$ 453481267 425715277 393736955 360272835 327206476 295640676 266116949 238880202
55871B38880202k4852645k2480930k0189396j7989292j5890047j3938760j2180946
$$ 238880202 214027557 191546627 171357231 153367939 137477892 123539132 111358186
55864A11358186j0622174r253510q078415p090229o255142n541218m939352m438856
$$ 111358186 100736012 91482502 83404087 76313858 70058716 64517498 59578146 55139290
55856E5139290m009428l625741l286482k992743k729479k483756k260476k064804
$$ 55139290 51129862 47504121 44217639 41224896 38495417 36011661 33751185 31686381
55848C1686381j887482j721252j573913j451571j345119j245588j157443j085096
$$ 31686381 29798899 28077647 26503734 25052163 23707044 22461456 21304013 20218917
55840B0218917j021079r58775r02678q55472q08571p55902p04249o60160o19267
$$ 20218917 19197838 18239063 17336385 16480913 15672342 14916440 14212191 13552031 12932764
55831A2932764n77819n42176n16975m95729m72488m51419m35634m18038l93057
$$ 12932764 12354945 11812769 11295794 10800065 10327577 9876158 9440524 9022486 8629429
55822H629429l66963l46989l29945l10718k92440k78947k66150k50037k34950
$$ 8629429 8262466 7915477 7585532 7274814 6982374 6703427 6437277 6187240 5952290
55813E952290k25176k16289k03257j89488j79624j70848j59575j49488j44732
$$ 5952290 5727114 5510825 5307568 5118080 4938456 4767608 4608033 4458545 4313813
55804D313813j41699j35482j28211j23753j20467j16460j15364j19409j22874
$$ 4313813 4172114 4036632 3908421 3784668 3664201 3547741 3432377 3312968 3190094
55795C190094j20048j14018j10359j07790j02468r6060r1914q7964q0861p2745
$$ 3190094 3070046 2956028 2845669 2737879 2635411 2539351 2447437 2359473 2278612 2205867
55785B205867o7183o2589n6292n0767m9206m8977m5965m1490l8749l6405l2063
$$ 2205867 2138684 2076095 2019803 1969036 1919830 1870853 1824888 1783398 1744649 1708244 1676181
55774A676181k8143k7820k8639k6485k2602k0423j8839j4950j0650j0038j2501
$$ 1676181 1648038 1620218 1591579 1565094 1542492 1522069 1503230 1488280 1477630 1467592 1455091
55763A455091j4284j4870j6348j8525j9924k1680k5376k8883k9082k6840k5087
$$ 1455091 1440807 1425937 1409589 1391064 1371140 1349460 1324084 1295201 1266119 1239279 1214192
55752A214192k3998k2405k1561k2956k4593k3834k1903k1304k0987j8420j4429
$$ 1214192 1190194 1167789 1146228 1123272 1098679 1074845 1052942 1031638 1010651 992231 977802
55741I77802j1758j0542r253q221q393q439o824m915m608m918m113k959k650k156
$$ 977802 966044 955502 946249 938028 929635 921196 914372 909457 904849 899931 895818 892859 890209 888053
55727H88053r91j570n144q354p894n647m964m859k648L26O73j486l817o691j1755
$$ 888053 887062 885492 880348 871994 864100 858453 853489 848630 845982 846308 846981 845495 841678 834987 823232
55712H23232j7201j9526j8894j8167j7672j5537j2208j0068r127p398n106m454
$$ 823232 806031 786505 767611 749444 731772 716235 704027 693959 684832 677434 672328 667874
55700F67874n673p176r026j2507j6604j8746j8777j8720j8847j7413j4096j0584
$$ 667874 662201 655025 645999 633492 616888 598142 579365 560645 541798 524385 510289 499705
55688D99705p793n364l639l377l835l742l684n070p378q876r285r339q601o280
$$ 499705 491912 486548 482909 479532 475697 471955 468271 463201 455823 446947 437662 428323 419722 413442
55674D13442l306j234l2P40P2k637n340n819n116n551o809p098o847p868r680
$$ 413442 410136 408902 408870 409610 409682 407045 401705 395886 390770 385219 378410 371312 364465 356597 346917
55659C46917j0073q656o908n356l621k437k656k982j659L93J009M54P19J963K792
$$ 346917 336844 328188 321280 315924 312303 309866 307210 304228 302569 302962 303971 304425 305144 307107 309899
55644C09899L317M708O250O003M064K265R90q02k783l501l105l087l478l071k058
$$ 309899 313216 317924 324174 330177 334241 336506 337496 336694 333911 330410 327305 324218 320740 317669 315611
55629C15611j766k030j528l74K66P86K636N389P019O967O510O341O058N848O237
$$ 315611 313845 311815 310287 309913 310179 310965 313601 318990 326009 332976 339486 345827 351885 357733 363970
55614C63970O473N350L212J162q78l114m106k741q42p66j454j67K709M128L199
$$ 363970 370443 375793 379005 380167 379289 376175 372069 369328 368486 367720 366266 366099 368808 372936 376135
55599C76135J983J602J041L5j69O74J435J946K985L967L561K503K766L899L425
$$ 376135 378118 379720 380761 380796 380627 381301 382736 384682 387667 391634 395195 397698 400464 404363 407788
55584D07788J017r93j517j849k574k719k576l873o279p109n731m982o831r491
$$ 407788 408805 407812 406295 404446 401872 399153 396577 392704 386425 379316 373585 368603 361772 352281
55570C52281j0569j0344j0220j0200r785r543j0094j0917j1280j1103j0108p842
$$ 352281 341712 331368 321148 310948 301163 291620 281526 270609 259329 248226 238118 230276
55558B30276n161l978m723n730n698n015m206l085k051k231l456m040l273k308
$$ 230276 225115 221137 216414 210684 204986 199971 195765 192680 190629 188398 184942 180902 177629 175321
55544A75321j849j019N14J359N51q50j466j466j652k079k496k985l345k968j967
$$ 175321 173472 172453 172967 174326 174877 174027 172561 171095 169443 167364 164868 161883 158538 155570 153603
55529A53603j210r29n14Jj54q07q09j25k65j864l483l563k251n91P58J463J370
$$ 153603 152393 151464 150950 150951 150797 149990 149181 149056 148791 146927 143444 139881 137630 137039 137797 139260 140630
55512A40630R43Q62R03L96l95n94k22J90J101L135N113N108L448K251J884M99
$$ 140630 141573 142435 143338 143734 143339 142745 142523 142713 143814 146949 152062 157170 160618 162869 164753 165252
55496A65252k438m906n381m715m025l124k124k228l538m191l103j732j789k857
$$ 165252 162814 157908 152527 147812 143787 140663 138539 136311 132773 128582 125479 123747 121958 119101
55482A19101l533l262j961M09K777L256J795P28J409K191J250m47p38O36K354
$$ 119101 115568 112306 110345 110754 113531 116787 118582 119310 120719 122910 124160 123713 122975 123611 125965
55467A25965L640M353M163L270K986M060N360N494M761M104L350K127J339J890
$$ 125965 129605 133958 138121 141391 144377 148437 153797 159291 164052 168156 171506 173633 174972 176862
55453A76862K675J857l83k119k607l114m755o963q550r133q959q118o616m951
$$ 176862 179537 181394 181011 178892 176285 173171 168416 161453 152903 143770 134811 126693 120077 115126
55439A15126m067m531n879p057p450p063n720l131k47P48r42l183l651l083l685
$$ 115126 111059 106528 100649 93592 86142 79079 73359 70228 69981 70729 69787 66604 62953 59870 56185
55424E6185n085m681k017K08K74k35M44J278M80j326k014r33O90J533J028p04
$$ 56185 51100 46419 44402 44610 44884 44649 45093 46371 46851 45525 43511 42578 43268 44801 45829 45125
55408D5125k564k859j107J112J910J077k65j061q37K14J046N92o96j242o85m22
$$ 45125 42561 39702 38595 39707 41617 42694 42429 41368 40531 40745 41791 42383 41687 40445 39760 39338
55392C9338j236j895j057O95J790J576L97j162k321k338j452o91l50J51P01M50
$$ 39338 38102 36207 35150 35845 37635 39211 39608 38446 36125 33787 32335 31644 31294 31445 32146 32596
55376C2596k82O5J679K709K149J417J717K040J296N40J133K289K478J882J364
$$ 32596 32314 32379 34058 36767 38916 40333 42050 44090 45386 45926 47059 49348 51826 53708 55072
55361E5072M32j523l043k151M17J848R18q47j606j094j36L42j94j200j142O78
$$ 55072 55504 53981 50938 48787 49204 51052 51970 51123 49517 48423 48287 48629 48435 47235 46093 46771
55345D6771K812L305K135Q19J15m80j348k143k465k089r20M72P89n02k141k549
$$ 46771 49583 52888 55023 55842 55957 55477 54129 51986 49521 47432 46512 46984 47773 47271 45130 42581
55329D2581j737p73j48K06L1p71j398j213r13j342j808j131J88M70p34k149k605
$$ 42581 40844 40071 39923 40129 40160 39389 37991 36778 35865 34523 32715 31584 31772 32242 31508 29359 26754
55312B6754j950m30J550K981K878J468q5j056j483j485j177r81j110j176j018
$$ 26754 24804 24374 25924 28905 31783 33251 33166 32110 30627 29142 27965 26984 25874 24698 23680
55297B3680j294k246k745j772j53O12N60Q52J613J841J206L00o38j741k401j787
$$ 23680 22386 20140 17395 15623 15470 16082 16642 17494 19107 20948 22154 22454 21816 20075 17674 15887
55281A5887m61P2m14n58M53J837K630K730K234R12j021k562k880k023m82J147
$$ 15887 15426 15498 15084 14526 14979 16816 19446 22176 24410 25322 24301 21739 18859 16836 16354 17501
55265A7501K037J557J57r35j003l01P03J689K133J514J14j101j540j341o93M17
$$ 17501 19538 21095 21252 20317 19314 19013 19716 21405 23538 25052 25166 24065 22525 21184 20491 20908
55249B0908J735K567K400J395K98j08K50L55p70k398k636j147q3j156l024k988
$$ 20908 22643 25210 27610 29005 29303 29195 29445 29800 29030 26632 23996 22849 22766 21610 18586 15598
55233A5598m70K717M824N215L735R51j335j653q25o53j022l36J366K131J210K20
$$ 15598 15128 17845 22669 27884 31619 32570 31235 29582 28757 28104 27082 26746 28112 30243 31453 31673
55217C1673M84J347J901K366K667J680o34k163j419o9o25k640l331j542R10K032
$$ 31673 32157 33504 35405 37771 40438 42118 41484 39321 37902 37833 37208 34568 31237 29695 30605 32637
55201C2637J917J691J590J163N22L55P61R31K93n58n78K25O75L9j007j539j841
$$ 32637 34554 36245 37835 38998 39520 39875 40636 41567 41860 41302 40724 40949 41624 41663 40656 39117 37276
55184C7276k685l570l037r53P72M41j282k292j563R5J423J999J978J369J47j026
$$ 37276 34591 31021 27984 27031 27803 28244 26962 24670 23107 23202 24625 26624 28602 29971 30118 29092
55168B9092q86J046L354L727J499j427k727k274j765k074k120o91J603K870K111
$$ 29092 28206 29252 32606 36333 37832 36405 33678 31404 29639 27565 25445 24754 26357 29227 31338
55153C1338J90j248j417p33J23J059K196K998K583J071j02K20J416J937J268L07
$$ 31338 31528 30280 28863 28130 28253 29312 31508 34506 37089 38160 38058 38278 39694 41631 42899 43206
55137D3206j14k37o55j174r48K92J512J224p96k994l636k628j127J96J474K294
$$ 43206 43092 42855 42200 41026 40078 40370 41882 43106 42310 39316 35680 33052 31925 32121 33595 35889
55121C5889J652k46j480p03J172K430K643K201R59j034k368j698l1J62j751l793
$$ 35889 37541 37295 35815 35112 36284 38714 41357 43558 44517 43483 41115 39417 39386 39548 37797 34004
55105C4004m109k986j733p53M08J857K962K986J899O53M56J369K042J289m29j729
$$ 34004 29895 26909 25176 24423 24831 26688 29650 32636 34535 35188 35644 37013 39055 40344 39915 38186
55089C8186j983j651j403j684k605l457k964r06J157J842J837K529L546L314J606
$$ 38186 36203 34552 33149 31465 28860 25403 22439 21533 22690 24532 26369 28898 32444 35758 37364
55074C7364k56j491k355k693j888l65O23R45J576K447K264Q29l25l91m01j026
$$ 37364 37108 35617 33262 30569 28681 28316 28939 29884 31460 33907 36171 37000 36675 36284 35883 34857
55058C4857j102L17K061K459J693J115J113J099R76J298K330L774N164N805N032
$$ 34857 33755 34072 36133 38592 40285 41400 42513 43612 44588 45886 48216 51990 57154 62959 67991
55043F7991L178J618J158J127P13K25J52L2n96r21kJ436J841J156P11R17O85m32
$$ 67991 71169 72787 73945 75072 75785 76010 76162 76194 75598 74677 74675 76111 77952 79108 79819 80736 81421 80989
55025H0989j024J92K227K827J372l92o57L00Q20J81p63j071r72j100j374j332
$$ 80989 79965 80157 82384 85211 86583 86191 85534 85834 86654 86835 86072 85001 84029 82929 81555 80223
55009H0223j099j047r31k27P11J035Q58J210K239K582J171j240k996l411l030
$$ 80223 79124 78077 77146 76919 77630 78665 79523 80733 82972 85554 86725 85485 82489 79078 76048
54994G6048k450j657m76P23J025j60k083l029k189q48q28j994k349p24J745L111
$$ 76048 73598 71941 71465 72188 73213 73053 70970 67941 65752 64904 64076 62082 59733 59009 60754 63865
54978F3865K671J145l58j046p63j31J06mJ70P59J273J549J850J978J411N99Q06
$$ 63865 66536 67681 67323 66277 65514 65383 65489 65485 65655 66414 67687 69236 71086 73064 74475 75074 75880
54961G5880K265L580L619K808J905Q07m94r24K05J616J340o99k634k938j759j17
$$ 75880 78145 81725 85344 88152 90057 90864 90370 89446 89651 91267 92607 91908 89274 86336 84577 84460
54945H4460J150J604J377J254J908K827K707J166n01p47L51J141L97j232k158
$$ 84460 85610 87214 88591 89845 91753 94580 97287 98453 97952 97205 97556 98697 99094 97862 95704
54930I5704j907j477j549j396k96R25Q96k05q40k06J090K238K843K451J010k04
$$ 95704 93797 92320 90771 89375 89079 90004 90900 90695 89855 89649 90739 92977 95820 98271 99281 99077
54914I9077K42J610J558m44k112j566K04J277J433J451J240M70rP44J880J745
$$ 99077 99319 100929 102487 102043 99931 98365 98569 99846 101279 102730 103970 104440 104431 105175 107055 108800
54898A08800M11m03J32R96J046M94M16J546L786O350Q381R613J0299J0430R878
$$ 108800 109211 108808 108940 109936 110982 111476 111892 113438 117224 123574 131955 141568 151867 162297 172175
54883A72175R443J0455J2660J3863J2808J1277J1807J4323J6571J7100J5945J3033
$$ 172175 181618 192073 204733 218596 231404 242681 254488 268811 285382 302482 318427 331460
54871C31460Q102K171k835o326r343j2346j4409j5016j5101j5493j5569j4308
$$ 331460 339562 341733 338898 332572 323229 310883 296474 281458 266357 250864 235295 220987
54859B20987j1854r328p760p593q481r178q407o312m371l412k585p74J704L528
$$ 220987 209133 199805 192045 184452 175971 166793 158386 152074 147703 144291 141706 140932 142636 146164
54845A46164L996L545L045L164M235O143Q327J0131J1269J1957J2719J3917J5274
$$ 146164 150160 153705 156750 159914 164149 170292 178619 188750 200019 211976 224695 238612 253886
54832B53886J5982J5630J4730J3743J1873P713J269n521j0655j3751j5591j6649
$$ 253886 269868 285498 300228 313971 325844 333557 334826 329305 318650 304899 289308 272659
54820B72659j6823j6210j5356j4674j4040j3116j1793j0256q802p709p114o869
$$ 272659 255836 239626 224270 209596 195556 182440 170647 160391 151589 143880 136766 129897
54808A29897o473n428l862k615k398k895l132k667j928j325p30j69k32j159j986
$$ 129897 123424 117996 114134 111519 109121 106226 103094 100427 98499 97174 96444 96275 96043 94884 92898
54793I2898j484K68J893K322J697P72k0o51j070j074n96l1Jo48j405j788k233
$$ 92898 91414 91682 93575 95897 97594 98366 98346 97695 96625 95551 94955 94924 94925 94277 92872 91084 88851
54776H8851l273m120l198n00J871K192J095J25n84j783l046l000j480L6M08J18
$$ 88851 85578 81458 78260 77760 79631 81823 82918 83043 82459 80676 77630 74630 73150 73186 73594 73712
54760G3712J61O68R77N75k76n84N31K590L801L036J275J89q4m93r25k06J697L298
$$ 73712 73873 74541 75518 76093 75817 75233 75764 78354 82155 85191 86466 86655 86571 86078 85153 84947 86644 89942
54742H9942L721L706L867L604K636K267L743O272P940Q074P658P799Q737J0132
$$ 89942 93663 97369 101236 104840 107476 109743 113486 119758 127698 135772 143430 151229 159966 170098
54728A70098J1380J1906J1876J2392J4238J6657J8114J8065J7130J5704J3406
$$ 170098 181478 193384 205260 217652 231890 248547 266661 284726 301856 317560 330966
54717C30966J0054O259K527j503o202j0675j3150j2800j0736q928q382q636q780
$$ 330966 341020 347279 349806 348303 342101 331426 318276 305476 294740 285812 277430 268794 260014
54704B60014q383p376n716l755k478k598l447l515k197l88Q85J677K571L617M468
$$ 260014 251631 244255 238539 234784 232306 229708 226261 222746 220549 220161 221046 222723 225294 228911 233379
54689B33379N208O250P610Q903J0100J1620J3561J5423J6756J7638J8268J8612
$$ 233379 238587 244837 252447 261350 271450 283070 296631 312054 328810 346448 364716 383328
54677C83328J8774J9141J9539J8635J5067R203K998k111o536j1448j6899k1529
$$ 383328 402102 421243 440782 459417 474484 483687 486685 484574 478038 466590 449691 428162
54665D28162k3817k3326k1116j9218j8989j9542j8522j5183j1821j1013j2155
$$ 428162 404345 381019 359903 340685 321696 302154 283632 268449 256628 245615 233460
54654B33460j2449j0909r372r243r363q110n860m040l015k349k127k431k331r67
$$ 233460 221011 210102 200730 191487 182124 174014 168154 164114 161099 158750 156623 154192 151861 150894
54640A50894Q25J529J082N25m2j429l284m017l119j945j494r82M46J905J967R16
$$ 150894 151719 153248 154330 154855 154813 153384 150100 146083 142964 141019 139525 138543 138989 140894 142861 143777
54624A43777M45J252K114J556j79j391r84J92L24j154k846l012j258J624M683
$$ 143777 144222 145474 147588 149144 148965 147574 146590 146782 147106 145952 143106 140094 138836 140460 145143
54609A45143O922P221N410L070K028K216K282K090K881M722N692M588K952K968
$$ 145143 152065 159286 164696 167766 169794 172010 174292 176382 179263 183985 189677 194265 197217 200185
54595B00185M359M945L797K294J891K206J894O62l30J8J392K510K746K818L611
$$ 200185 204544 209489 213286 215580 217471 219677 221571 222233 221903 221921 223313 225823 228569 231387 234998
54580B34998M808N351N054M812N200N856O592Q119J0994J4523J7447J9204J9900
$$ 234998 239806 245157 250211 255023 260223 266079 272671 280790 291784 306307 323754 342958 362858
54567C62858J9695J8974J8572J8768J8350J5741J1010N774J140l251p915j2296
$$ 362858 382553 401527 420099 438867 457217 472958 483968 489742 490882 487631 479716 467420
54555D67420j5408j6929j7109j6285j5101j4576j5042j5455j4610j2774j1174
$$ 467420 452012 435083 417974 401689 386588 372012 356970 341515 326905 314131 302957
54544C02957j0132q931p594p222p987q209o666m833n124p420r077q422o533n137
$$ 302957 292825 283894 276300 269078 261091 252882 246216 241383 236259 228839 219762 211340 204807 199670
54530A99670m335l372k358k032k592l740n276o689o766m862k299j287k434m223
$$ 199670 195335 191963 189605 187573 184981 181241 175965 169276 162510 157648 155349 154062 151628 147405
54516A47405m962m450l555k998k806k499j615l42M62J90p66j684k511l539m345
$$ 147405 142443 137993 134438 131440 128634 126135 124520 124178 124640 124830 124064 122380 119869 116330 111985
54501A11985m022k530j002l57l59l18p0J57M70J171K058K423J950J276J232J644
$$ 111985 107963 105433 104431 104074 103715 103397 103327 103484 103954 105125 107183 109606 111556 112832 114064 115708
54485A15708J488M81k56J72P99K5j768k399r06J168K124K279K729L348L374L123
$$ 115708 117196 117677 117421 117593 118392 118417 116649 114250 113344 114512 116636 118915 121644 124992 128366 131489
54469A31489L631N039O501P251O959N775M853N810Q460J0251R431P615P429Q632
$$ 131489 135120 140159 146660 153911 160870 166645 171498 177308 185768 196019 205450 213065 220494 229126
54455B29126Q812P203N278L777J798q28k712l208l663n402p987j0128j1004j0295
$$ 229126 237938 245141 250419 254196 255994 255166 252454 249246 245583 240181 232194 222066 211062 200767
54441B00767q352o680o700p679p389n185k813j854k150l075m478n646n267l323
$$ 200767 192415 185735 179035 171356 163967 158782 155969 154115 151965 148890 144412 138766 133499 130176
54427A30176j439o62m97n95j286j941j085Q13J248m22j457J16K411K864K100J989
$$ 130176 128737 128075 127578 126983 125697 123756 122671 123484 124732 124310 122853 122969 125380 128244 130344 132333
54411A32333J951L70j731j818Q1J557J691J778K225J727J5j176p05M11P44J73
$$ 132333 134284 134654 132923 131105 131186 132743 134434 136212 138437 140164 140179 139003 138298 138709 139453 139626
54395A39626q02j889k592k363j620j379j666j590j162j394k269k277o32J439K471
$$ 139626 138824 136935 134343 131980 130360 128981 127315 125725 124563 123169 120900 118623 117991 119430 121901
54380A21901K483K133J402Q9j224j699j268m71K15M32j3p18r22o56r27k138l010
$$ 121901 124384 126517 127919 128008 126784 125085 123817 123346 123561 123993 123980 123262 122340 121684 120757 118619 115609
54363A15609j980O47K729K492K49k052k685j491L09J407J450J008Q48J340K189
$$ 115609 113629 114276 117005 119497 119746 117694 115009 113518 113827 115234 116684 117692 118540 119880 122069
54348A22069K590K025J154J347K965M699N150M515M061M388N097N676N810N119
$$ 122069 124659 126684 127838 129185 132150 136849 141999 146514 150575 154963 160060 165736 171546 176665
54334A76665L653K535L048M976O662O807N497L476J268p90k408l416l596k618
$$ 176665 180318 182853 185901 190877 197539 204346 209843 213319 214587 213797 211389 207973 204377 201759
54320B01759q02L78m13k516l823l356k301k115k656k942k916l382m434m927l836
$$ 201759 200957 201335 200922 198406 194583 191227 188926 186811 184155 181213 178297 174915 170481 165554 161718
54305A61718j715k71n23j700k279j773r51l77K75J136J372L08j409k604k968k659
$$ 161718 160003 159732 159209 157509 155230 153457 152506 152129 152404 153540 154912 155220 153811 151207 148239 145580
54289A45580j269J485M289M945K884o1j656j247L49J994K925L030K852K979L356
$$ 145580 144311 145796 150085 155030 157914 157853 156197 154950 155299 157293 160218 163248 166100 169079 172435
54274A72435L586L645L638L176J865K62o54r63j726l239m427m396l613l023k729
$$ 172435 176021 179666 183304 186480 188345 188607 187953 186990 185264 182025 177598 173202 169589 166566 163837
54259A63837k164j128j25Q3r67l012n020n922n532m549l725l385l507l803l804
$$ 163837 161673 160545 160420 160503 159536 156524 151504 145582 140050 135501 131776 128391 124884 121081 117277
54244A17277l356k904k755k415j303Q0N35l66j860k898k831j562J28P78j49j112
$$ 117277 113921 111017 108262 105847 104544 104624 105159 104793 102933 100035 97204 95642 95770 96548 96399 95287
54228I5287k71J711K113k08l103l722j769O14J434N09r39j610j172k52N02J138
$$ 95287 95016 96727 98840 98632 95529 91807 90038 90652 92086 92595 91656 90046 88874 88622 89124 90262
54212I0262J758J816R35%K02J104R89o44k271k393j213K38J475K485L172L582
$$ 90262 92020 93836 94771 94771 94973 96077 97066 96422 94151 91758 90545 90783 92258 94743 97915 101497
54196A01497L889L767K520L14j625k358k108j495q47n20p39q40J05J491J349q79
$$ 101497 105386 109153 111673 111987 110362 108004 105896 104401 103554 103034 102295 101455 101560 103051 104400 103521
54180A03521l166l392j905m06M76J171J598J177R2p11p24j49P39J654J978J290
$$ 103521 100355 96963 95058 94652 95128 96299 97897 99074 99166 98455 97731 97582 98321 99975 101953 103243
54164A03243P7o58m51L21R03O01o18j680j240N21J742J180k29p92k26N77J123
$$ 103243 103320 102662 102211 102532 103435 104036 103418 101738 100498 101019 102761 103941 103712 102920 102694 103271 104394
54147A04394J508J591J119L05n59j544k350j982k89R84K27j470j589K17J639J104
$$ 104394 105902 107493 108612 108917 108358 106814 104464 102482 102193 103177 103404 101934 100345 100562 102201 103305
54131A03305k22n15R1J16q55j629j117J39L84j498m460n913m317j028J058O07
$$ 103305 103083 102568 102659 102775 101920 100291 99174 99313 99697 98199 93739 87826 83509 82481 83539 84146
54115H4146j086k013j501j00J531K803K943J483q47k382j930J32K333L552L768
$$ 84146 83060 81047 79546 79446 80977 83780 86723 88206 87359 84977 83047 83179 85512 89064 92832
54100I2832L431K496O06j870l666l830k694j213O5R64J066Pj680k771k617j701
$$ 92832 96263 98759 99365 97495 93829 89999 87305 86092 86157 87121 88187 88194 86514 83743 81126 79425
54084G9425p80O0J086J936J577l76k589l032j401J70l64k212k697q11J620K609
$$ 79425 78645 78705 79791 81727 83304 82928 80339 77307 75906 76076 75712 73500 70803 69992 71612 74221
54068G4221K310J824J186r8j446j847j532j476j389N9K784M621L846J344n76q07
$$ 74221 76531 78355 79541 79443 77997 76150 74618 73142 71753 71812 74596 79217 83063 84407 83831 83024
54052H3024j48J71k15q51j191r67k10P68J408J194J77q27r48j33R10J589J792
$$ 83024 82876 83047 82832 81981 80790 79823 79613 80381 81789 82983 83160 82333 81385 81252 82162 83751 85543
54035H5543J556J037P67J144J494O79j017j711k83J963K843J777o0j245r52R08
$$ 85543 87099 88136 88903 90047 91541 92220 91203 89492 89209 91172 94015 95792 95732 94487 93535 94443
54019I4443L250M232L217J652J032Q15k25j535j576n38k24j118j580m17J506K766
$$ 94443 97693 101925 105142 106794 107826 108641 108416 106881 105305 104767 104543 103425 101845 101428 102934 105700
54003A05700L023K517J333j05r06p86l52Q0Q03J531J270M8n26O48K641L943M357
$$ 105700 108723 111240 112573 112468 111562 110776 110424 110504 111307 112838 114108 114156 113630 114278 116919 120862 125219
53986A25219M532M578M324M119M326M656M947N753P161P887O844N035M401N223
$$ 125219 129751 134329 138653 142772 147098 151754 156701 162454 169615 177502 184346 189381 193782 199005
53972A99005O045N951N562N664O160O675P245Q045R009R878J0131R133P087N476
$$ 199005 205050 211001 216563 222227 228387 235062 242307 250352 259361 269239 279370 288503 295590 301066
53958C01066N602O793P164O077M608L507K179K24j439j975k120l076m603n382
$$ 301066 306668 313461 320625 326702 331310 334817 336996 337220 335781 333806 331686 328610 324007 318625
53944C18625m931m030l385l068l304m634o863q703r133q529p865p336o548n706
$$ 318625 313694 309664 306279 303211 299907 295273 288410 279707 270574 262045 254180 246844 240296 234590
53930B34590n561o122o310n372l932k989k386j154P95K186J768l67l063n023n236
$$ 234590 229029 222907 216597 211225 207293 204304 201918 200764 201559 203745 205513 205146 202083 197060 191824
53915A91824l351l72J578J150n54j020Q20L393M358L040N93j492k409j833J13
$$ 191824 188473 188101 189679 190829 190275 189255 190075 193468 197826 200866 201459 199967 197558 195725 195838
53900A95838K423L469K459N08m57Q2P10Q7j117j107M89J931J536k54j549j216
$$ 195838 198261 201730 204189 204697 204240 204322 205032 205119 204002 202895 203384 205315 206851 206597 205048 203832
53884B03832L42K127L357L597L022K728L801N728O648N691M257M269N856P578
$$ 203832 204174 206301 209658 213255 216277 219005 222806 228534 235182 240873 245130 249399 255255 262833
53870B62833Q383Q279P466O061M724M351M830N060M608M386N186O385O826O373
$$ 262833 271216 279495 286961 293022 297746 302097 306927 311987 316595 320981 326167 332552 339378 345751
53856C45751N871N972O594P194P061N836M320M191O121Q686R988R906R685R684
$$ 345751 351622 357594 364188 371382 378443 384279 388599 392790 398911 407597 417585 427491 437176 446860
53842D46860Q949P118N282M397L841K432J16k127l695m903o192p357p725p011
$$ 446860 455809 462927 468209 472606 476447 478879 478995 476868 473173 468270 462078 454721 446996 439985
53828D39985n933n837p330r409j0413r835q710q229q586r296r941j0218r873r008
$$ 439985 434052 428215 420885 411476 401063 391228 382518 374289 365703 356407 346466 336248 326375 317367
53814C17367q110p434o737n764m626l511k633k622m150o683q376p975o369n357
$$ 317367 309257 301823 295086 289322 284696 281185 278552 275930 271780 265097 256721 248746 242377 237020
53800B37020n291m891l488k265k726m543n808n384m172l677m021m233m098m412
$$ 237020 231729 226838 223350 221085 218359 213816 208008 202624 198452 194775 190754 186521 182423 178011
53786A78011n119m731k641p30j108l026l820k626j139p00o49j89J08k85n21K61
$$ 178011 172892 168161 165520 164790 163682 160656 156836 154210 153071 152371 151722 151533 151641 151356 150835 151096
53770A51096J452J942J622R45j6j034j338p65k77l05J98J813L078K516J176J242
$$ 151096 152548 154490 156112 157057 157041 156007 154669 153904 153627 153322 153520 155333 158411 160927 162103 163345
53754A63345K724L610K904J637R01O88Q75J687K877L714M054M398M762M770M730
$$ 163345 166069 169679 172583 174220 175121 175809 176684 178371 181248 184962 189016 193414 198176 202946 207676
53739B07676N388O470O768O057N645O618Q410R474Q771O534M246L704N228P000
$$ 207676 213064 219534 226302 232359 238004 244622 253032 262506 271277 277811 282057 285761 290989 297989
53725B97989P076N605M048K812J264l26q68n06p36k030l085l024k742l304m408
$$ 297989 305065 310670 314718 317530 318794 318468 317600 317094 316358 314328 311243 308219 305477 302173 297765
53710B97765n157n217m518l046j554j246k160k955k922k998m088n615o478o367
$$ 297765 292608 287391 282873 279827 278273 277027 274867 271912 268990 265992 261904 256289 249811 243444
53696B43444n405l628j716j034j927k831k131j70J351J356K17q27n77J040K603
$$ 243444 238039 234411 232695 231661 229734 226903 224772 224602 225953 227309 227526 226699 226122 227162 229765
53681B29765K775K223K642L886L909K015J6p31j291k744l978l723l066l633m619
$$ 229765 232540 234763 237405 241291 245200 247215 247231 246500 245209 242465 238487 234764 231698 228065 223446
53666B23446m077k315j526k344l079k395q39N37J377J575J017R8n37q37j143j290
$$ 223446 219369 217054 215528 213184 210105 207710 206871 207408 208785 210360 211377 211475 210938 210101 208958 207668
53650B07668q43J06J283K888M853O005N286L338J702R22P05J176K437L495L470
$$ 207668 206825 206931 208214 211102 215955 221960 227246 230584 232286 233208 233913 235089 237526 241021 244491
53635B44491L287M285N664N621M627M928O588O958M927K938L286M760M836L399
$$ 244491 247778 252063 257727 263348 267975 272903 279491 286449 291376 294314 297600 302360 307196 310595
53621C10595K151J571O60q65k040k201j711j137o88m10j96K06P49J037J117J580
$$ 310595 312746 314317 314977 314112 312072 309871 308160 307023 306335 305925 305729 305935 306684 307721 308838 310418
53605C10418K284J984J23j851k198j334j141k266l411l309k090o13N26J042R31
$$ 310418 312702 314686 314809 312958 310760 309426 308285 306019 302608 299299 297209 296596 297122 298164 299095
53590B99095P01Q23Q46o2j536j975o04J276J820Q63k40n37l25o5N26J829L279
$$ 299095 299796 300619 301465 301403 299867 297892 297288 298564 300384 301247 301007 300470 300145 300080 300606 302435 305714
53573C05714L753K987K074K164L019L386K755K059K238K682K006K38q04J58K057
$$ 305714 309467 312454 314528 316692 319711 323097 325852 327911 330149 332831 334837 335075 334271 334429 336486
53558C36486K898K548K879M971P402Q045O784N389N059N245M999M436M311M830
$$ 336486 339384 341932 344811 349782 357184 365229 372013 377402 382461 387706 392705 397141 401452 406282
53544D06282N510N914N970N739N354N103N226N558N578M936L916L380M107N948
$$ 406282 411792 417706 423676 429415 434769 439872 445098 450656 456234 461170 465086 468466 472573 478521
53530D78521P735Q241P185N145K897J197P17J297J609O86l92L70K828M422L570
$$ 478521 486256 494497 501682 506827 509724 510921 511638 512935 514544 515230 514838 515208 518036 522458 526028
53515E26028J785J311K023K225J471P96O40L89j76n51o54q46q29L7J182J221K54
$$ 526028 527813 529124 531147 533372 534843 535639 536279 536668 536492 535941 535287 534441 533612 533649 534831 536052 536306
53498E36306J63J973M371N555N331M463L235J794R55J292K148K653L193M542N976
$$ 536306 536469 538442 542813 548368 553699 558162 561397 563191 564146 565438 567586 570239 573432 577974 583950
53483E83950N818L892K073J969L145M198M688N186N862O138N798N706O857Q975
$$ 583950 589768 593660 595733 597702 600847 605045 609733 614919 620781 626919 632717 638423 645280 654255
53469F54255J0678J1168J1219J2033J3480J4232J3679J2901J3358J5137J7109
$$ 654255 664933 676101 687320 699353 712833 727065 740744 753645 767003 782140 799249
53458G99249J8432J9164J9543J9580J9574K0380K2397K4675K5766K5595K5780
$$ 799249 817681 836845 856388 875968 895542 915922 938319 962994 988760 1014355 1040135
53447A040135K7632L0378L2130L2299L2117L2649L3403L3530L3567L4817L7330
$$ 1040135 1067767 1098145 1130275 1162574 1194691 1227340 1260743 1294273 1327840 1362657 1399987
53436A399987L9586M0386M0165M0088M0475M0649M0009L8819L7835L7417L7068
$$ 1399987 1439573 1479959 1520124 1560212 1600687 1641336 1681345 1720164 1757999 1795416 1832484
53425A832484L6078L4563L3580L3883L4993L5866L6149L6259L6422L6323L5767
$$ 1832484 1868562 1903125 1936705 1970588 2005581 2041447 2077596 2113855 2150277 2186600 2222367
53414B222367L5041L4487L4113L3628L2573L0574K7886K5458K3880K2378J9663
$$ 2222367 2257408 2291895 2326008 2359636 2392209 2422783 2450669 2476127 2500007 2522385 2542048
53403B542048J5722J1973R488P836N924L288J13l370o977j0289j2833j4512j5820
$$ 2542048 2557770 2569743 2579231 2587067 2592991 2596279 2596392 2593022 2586045 2575756 2562923 2548411 2532591
53390B532591j7526k0054k2961k5257k6502k7196k7840k8199k8113k8296k9330
$$ 2532591 2515065 2495011 2472050 2446793 2420291 2393095 2365255 2337056 2308943 2280647 2251317
53379B251317l0433l0490k9927l0044l0707l0420k8911k7693k7435k6603k3807
$$ 2251317 2220884 2190394 2160467 2130423 2099716 2069296 2040385 2012692 1985257 1958654 1934847
53368A934847k0050j7241j5666j4272j2533j0655q629o426m562l328j961J53K196
$$ 1934847 1914797 1897556 1881890 1867618 1855085 1844430 1835801 1829375 1824813 1821485 1819524 1819677 1821873
53355A821873L153L705N329P962J0348J2439J5433J9251K2137K3445K4953K8142
$$ 1821873 1825026 1828731 1834060 1842022 1852370 1864809 1880242 1899493 1921630 1945075 1970028 1998170
53343A998170L1726L3506L3728L4819L8064M2162M5321M7416M9415N1617N3503
$$ 1998170 2029896 2063402 2097130 2131949 2170013 2212175 2257496 2304912 2354327 2405944 2459447
53332B459447N5082N7363O1077O5470O9036P1183P2433P3130P3037P2545P3113
$$ 2459447 2514529 2571892 2632969 2698439 2767475 2838658 2911091 2984221 3057258 3129803 3202916
53321C202916P5412P7852P8369P7262P6640P6984P6112P2371O7310O3814O2491
$$ 3202916 3278328 3356180 3434549 3511811 3588451 3665435 3741547 3813918 3881228 3945042 4007533
53310D007533O1364N8642N4303M8973M2781L5910K9210K3328J7633J0811K542
$$ 4007533 4068897 4127539 4181842 4230815 4273596 4309506 4338716 4362044 4379677 4390488 4393030
53299D393030n893j2838j7954k2579k8359l5600m3045m9199n3536n6362n8140
$$ 4393030 4387137 4374299 4356345 4333766 4305407 4269807 4226762 4177563 4124027 4067665 4009525
53288D009525n9485o1299o3972o6523o7425o6533o5341o5058o5339o5454o5603
$$ 4009525 3950040 3888741 3824769 3758246 3690821 3624288 3558947 3493889 3428550 3363096 3297493
53277C297493o6052o5721o3344n9882n8096n9071o0467n9294n5586n2088n0586
$$ 3297493 3231441 3165720 3102376 3042494 2984398 2925327 2864860 2805566 2749980 2697892 2647306
53266B647306m9905m7850m4159m0658l8782l7845l6162l3332l0684k9358k8814
$$ 2647306 2597401 2549551 2505392 2464734 2425952 2388107 2351945 2318613 2287929 2258571 2229757
53255B229757k7822k6293k5122k4479k3451k1553j9524j8085j6909j5479j4171
$$ 2229757 2201935 2175642 2150520 2126041 2102590 2081037 2061513 2043428 2026519 2011040 1996869
53244A996869j3554j3182j2001r707o870l897o83K759N989Q575J0463J1946J3482
$$ 1996869 1983315 1970133 1958132 1948425 1941555 1937658 1936975 1939734 1945723 1954298 1964761 1976707 1990189
53231A990189J5222J6675J7338J7976K0321K4740K9132L1143L0945L0630L1368
$$ 1990189 2005411 2022086 2039424 2057400 2077721 2102461 2131593 2162736 2193681 2224311 2255679
53220B255679L2530L3304L3741L3966L3655L2636L1178K9471K7490K5338K2944
$$ 2255679 2288209 2321513 2355254 2389220 2422875 2455511 2486689 2516160 2543650 2568988 2591932
53209B591932J9712J5471J1507R290Q297O490K991j062m533p604j0775j4022j7459
$$ 2591932 2611644 2627115 2638622 2647912 2656209 2662699 2665690 2664628 2660095 2652491 2641716 2627694 2610235
53196B610235k1390k5074k6969k6931k6829k8024k9617l0188l0090l0755l2591
$$ 2610235 2588845 2563771 2536802 2509871 2483042 2455018 2425401 2395213 2365123 2334368 2301777
53185B301777l4805l6583l7529l7597l7337l7490l7654l6466l3894l1970l2082
$$ 2301777 2266972 2230389 2192860 2155263 2117926 2080436 2042782 2006316 1972422 1940452 1908370
53174A908370l2781l1810k9355k7482k7124k7353k7332k7145k6758k5643k3778
$$ 1908370 1875589 1843779 1814424 1786942 1759818 1732465 1705133 1677988 1651230 1625587 1601809
53163A601809k1871k0420j9351j8521j7786j6769j5412j4503j4781j5789j6460
$$ 1601809 1579938 1559518 1540167 1521646 1503860 1487091 1471679 1457176 1442395 1426606 1410146
53152A410146j6549j6569j6630j6290j5428j4528j4303j5453j8126k0928k1552
$$ 1410146 1393597 1377028 1360398 1344108 1328680 1314152 1299849 1284396 1266270 1245342 1223790
53141A223790j9439j6881j6115j6347j5354j3160j1966j2828j4531j5763j6367
$$ 1223790 1204351 1187470 1171355 1155008 1139654 1126494 1114528 1101700 1087169 1071406 1055039
53130A055039j6340j5483j4468j4448j5255j5563j5117j5107j6030j6918j7215
$$ 1055039 1038699 1023216 1008748 994300 979045 963482 948365 933258 917228 900310 883095
53119H83095j7450j7458j6018j3250j1461j2165j3840j4201j3332j2971j3639
$$ 883095 865645 848187 832169 818919 807458 795293 781453 767252 753920 740949 727310
53108G27310j4212j3786j2538j1041r834r435r804j0129r749q916q172p622p386
$$ 727310 713098 699312 686774 675733 665899 656464 646660 636531 626782 617866 609694 602072 594686
53095E94686p872q908r481r130q687q792q681p580o259n871o068n769n152n206
$$ 594686 586814 577906 568425 559295 550608 541816 533135 525555 519296 513425 507357 501588 496436 491230
53081D91230n835n975n546n446n638m961l312k358l302n161o158n895n208m658
$$ 491230 485395 479420 473874 468428 462790 457829 454517 452159 448857 443696 437538 431643 426435 421777
53067D21777m140l549k907j964n37O42J50k567o101q005p046m422k543k570l511
$$ 421777 417637 414088 411181 409217 408680 409322 409472 406905 400804 392799 385753 381331 378788 376218 372707
53052C72707l729k913k168k444l533m561m961m682l884k783j704j066j190k111
$$ 372707 368978 366065 363897 361453 357920 353359 348398 343716 339832 337049 335345 334279 333089 330978
53038C30978l406m223l763k054k78J22j033k324k324j324o95o68J2J813L091K301
$$ 330978 327572 323349 319586 317532 317254 317376 316343 314019 311695 310371 309676 309008 309020 310833 313924 316225
53022C16225N68L81K114L679L725L337L881M791M539K803O08q49q13P47K510K490
$$ 316225 316793 317174 319288 322967 326692 330029 333910 338701 343240 346043 346651 345802 344989 345736 348246 350736
53006C50736L84j620j554m39q86l414n841o280n260m479m629n072n012m356l745
$$ 350736 351120 349500 347946 347507 346621 343207 337366 331086 325826 321347 316718 311646 306634 302278 298533
52991B98533l918m962o188o882o819n910m099k044j172k076l510l897l252k561
$$ 298533 294615 289653 283465 276583 269764 263854 259755 257711 256539 254463 250953 247056 243804 241243
52977B41243j965j049m92j494l490m348l334k159k303k952k779k245k566l362
$$ 241243 239278 238229 237737 236243 232753 228405 225071 222912 220609 217657 214878 212633 210067 206705
52963B06705l077j363N19J524J719J352K42j497l149m182m637m445l219j149N54
$$ 206705 203628 202265 202784 204308 206027 207379 207621 206124 202975 198793 194156 189711 186492 185343 185897
52948A85897Q08j38j130j432j050j36J213K532L086K697J983J555J275O99p6m98
$$ 185897 186705 186567 185437 184005 182955 182819 184032 186564 189650 192347 194330 195885 197160 197859 197783 197285
52932A97285l46j8R6J25M58J166J898K160J690O68l86j088j512j826j648k57K307
$$ 197285 196939 196921 197017 197142 197600 198766 200664 202824 204514 205182 204796 203708 202196 200370 198722 198465 200772
52915B00772M661N051L013j2j850j513m2P23L12O0J107K532K533J070NM18J222
$$ 200772 205433 210484 213497 213485 211635 210122 210080 210803 211115 211175 212282 214814 217347 218417 218422 218840 220062
52898B20062J151P38J112J844J605M46k02K59R01J039J270K160L069L191K859
$$ 220062 221213 221951 223063 224907 226512 226958 226756 227015 227916 228955 230225 232385 235454 238645 241504
52883B41504L013L777M380M383M274M771N882O744O358M585K426J161J265K329
$$ 241504 244517 248294 252674 257057 261331 266102 271984 278728 285086 289671 292097 293258 294523 296852
52869B96852L722M900N335M932M490M998O228O810N926M257K955K338J869Q90
$$ 296852 300574 305474 310809 315741 320231 325229 331457 338267 344193 348450 351405 353743 355612 356502
52855C56502r49l328n021m877l368k258k346k573k111j964l181m541l897j318
$$ 356502 355553 352225 347204 342327 338959 336701 334355 331782 329671 327707 324526 319985 316088 314770
52841C14770R12J341O59r6q08j292q48K31K60j522l472l620k238r77l80K63J082
$$ 314770 315682 317023 317682 317586 316778 315486 314638 314869 315129 313607 310135 306515 304277 303300 302920 303183 304265
52824C04265J348Q27J4q61j760j940p15Q93J009j97k83J915M172L662O85j953
$$ 304265 305613 306440 306454 305593 303833 301893 301178 302071 303080 302883 302600 304515 308687 312349 313034 311081
52808C11081k489j519l15N87R73O20j38l96K50J134J273L45j209k632l356l425
$$ 311081 308592 307073 306758 307345 308318 308938 308800 308404 308654 309788 311061 311406 310197 307565 304209 300784
52792C00784l381l474l226k121m25J154K252K721K137L56j618k243r63J399L648
$$ 300784 297403 293929 290703 288582 288157 289311 291563 294284 296421 296777 295159 292916 291953 293352 297000
52777B97000M888M689L490K642K919L187J765r87k902k859j865j038j33J134J967
$$ 297000 301888 306577 310067 312709 315628 318815 320580 319593 316691 313832 311967 310929 310796 311930 313897
52762C13897J740J092P08J45r68j695j098J54Q43J065J585K091J751R89J035J831
$$ 313897 315637 316729 317437 317582 316614 314919 313821 313975 314818 315883 317468 319559 321310 322299 323334 325165
52746C25165K135J594J228J577J877J412M38o30j785k703k668j819j445k393l964
$$ 325165 327300 328894 330122 331699 333576 334988 335426 334796 333011 330308 327640 325821 324376 321983 318019
52731C18019n051n578o062o434o192n468m991n035m989m254l214k927l780m832
$$ 318019 312968 307390 301328 294894 288702 283234 278243 273208 268219 263965 260751 257824 254044 249212
52717B49212m868m002l490l879m217l660k871k859l237k990k551l387n455o584
$$ 249212 244344 240342 236852 232973 228756 225096 222225 219366 216129 213139 210588 207201 201746 195162
52703A95162n055j760P92R72p70k559k687j170J81j89j641k375k001j729k111
$$ 195162 190107 188347 189139 190111 189341 186782 184095 182925 183106 182917 181276 178901 176900 175171 173060
52688A73060k341k093k285l245l788l187k556k995l698l413k629k595l036k718
$$ 173060 170719 168626 166341 163096 159308 156121 153565 150570 146872 143459 140830 138235 135199 132481
52674A32481j741j352j645j380k44M67m1p62n45J88K75l83q10m38K07K59n30j592
$$ 132481 130740 129388 127743 126363 126119 126586 126545 125783 125238 125426 125701 125318 124508 124070 124277 124536 124006 122414
52656A22414k155j955j283m38N22J312J242Q9j311j963j944j984k063j401P2J236
$$ 122414 120259 118304 117021 116583 117105 118417 119659 119748 118437 116474 114530 112546 110483 109082 109154 110390
52640A10390J089qq20n02Q15K234K740J983O31l76q58j277j597j029Q61L261M674
$$ 110390 111479 111471 110651 110149 110964 113198 115938 117921 118552 118176 117318 116041 114444 113415 114276 117537 122211
52623A22211M203K321N63L39J482K283J546K99M59K022K977K192Q97N43O97K13
$$ 122211 126414 128735 129298 129637 131119 133402 134948 135247 135706 137728 140705 142897 143794 144337 145034 145247
52607A45247o36p29n1N89J343L051N129N585L771J601J159K254L312L684L745
$$ 145247 144611 143882 143831 144420 145763 148814 153943 159528 163299 164900 166059 168313 171625 175309 179054
52592A79054L440K250O11r3O33J517J128l78j784k611l460m618n166m035j545
$$ 179054 182494 184744 185355 185262 185895 187412 188540 188162 186378 183767 180307 175689 170523 166488 164943
52577A64943O57J316P73J84p2o85k114l609m013l202k221j974k195j962r50J14
$$ 164943 165600 166916 167689 167873 167801 167116 165002 161393 157380 154178 151957 149983 147788 145826 144876 144990
52561A44990K55n99j506j621j217j302k175k963k768j818r04k56K84L21p58k378
$$ 144990 145245 144646 143140 141519 140302 139000 136825 133862 131094 129276 128372 128116 128400 128721 127963 125585
52545A25585k819j226J142K342J879P71J7j79R8Q24J703K203K188K046J937J355
$$ 125585 122766 121540 122682 125024 126903 127674 127691 127512 127610 128434 130137 132340 134528 136574 138511 139866
52529A39866j08j836k445j236R22K478K852K798K997L027K333J569J813K635K404
$$ 139866 139758 137922 135477 134241 135163 137641 140493 143291 146288 149315 151648 153217 155030 157665 160069
52514A60069Q21k94M70K073K611J882R90K63o44j034M16L316N268M528J854p30
$$ 160069 160890 160596 161066 163139 165750 167632 168622 168885 168241 167207 167623 170939 176207 180735 182589 181859
52498A81859j924j556j22J434K342K796L427L828K798M42j324j117K70J430K323
$$ 181859 179935 178379 178257 179691 182033 184829 188256 192084 194882 195324 194000 192883 193153 194583 196906
52483A96906L517M539M406L240K006J121M63K84P56J056L33n98j39J516K339J460
$$ 196906 200423 204962 209368 212608 214614 215735 216198 216482 217238 218294 218627 218029 217890 219406 221745 223205
52467B23205N24J276L072M024L675L160L148K962J896L89o00p51m78j38L49J085
$$ 223205 223729 225005 228077 232101 235776 238936 242084 245046 246942 247331 246731 245980 245502 245364 245713 246798
52451B46798J773J953J523Q51L47J19J18L50P20P98M7j603l472m479l854j826
$$ 246798 248571 250524 252047 252898 253245 253364 253482 253832 254552 255350 255397 253794 250322 245843 241989 240163
52435B40163L91J459J075J84o5O36J715K456K425J561J99r52j211m71P51J776
$$ 240163 240554 242013 243088 243272 243207 243843 245558 248014 250439 252000 252199 251247 250036 249565 250316 252092
52419B52092K337K659K934K791J522q06k912l472k613j515p62RP90P84j11n60
$$ 252092 254429 257088 260022 262813 264335 263529 260617 257145 254532 253017 252255 252264 253054 253838 253727 253167
52403B53167M88K148K821K443K314K995L650L600L202K900K321R68p95j959j786
$$ 253167 253655 255803 258624 261067 263381 266376 270026 273626 276828 279728 282049 283017 282222 280263 278477
52388B78477l02J703L055K914J506q3r02p53o3M67K32o90j298o64P68J472O91
$$ 278477 278175 279878 282933 285847 287353 287270 286368 285615 285552 286019 286251 285561 284263 283599 284367 285839 286530
52371B86530n96q50L32K054L274L554K947J681J61j003j292p73k31n66j881l254
$$ 286530 285934 285084 285416 287470 290744 294298 297245 298926 299087 298084 296792 296019 295788 295222 293341 290087
52355B90087l552k438n81Q85J077m3j467j830o47J225K553K875K453J567M26m83
$$ 290087 286535 284097 283516 284401 285478 285435 283968 282138 281491 282716 285269 288144 290597 292164 292590 292107
52339B92107n64K58J458K314K243J086n16j362p90N93J660J893J447N96k87o38
$$ 292107 291543 291801 293259 295573 297816 298902 298386 297024 296234 296827 298487 300380 301827 302423 302136 301498
52323C01498l21J4q2P9J364L257M317M087L560L656M200M511M284L715L277L289
$$ 301498 301177 301191 301109 301188 302552 305809 310126 314213 317773 321429 325629 330140 334424 338139 341416 344705
52307C44705L236K054j84j570o72J177J569O17O68K401L685L029J902K134L125
$$ 344705 347941 349995 349811 348241 347569 348746 350315 350932 351600 354001 357686 360715 362617 364751 367876
52292C67876L394L295M050N139N069M134M165N443N996M481K150J077J650K692
$$ 367876 371270 374565 378615 383754 388823 392957 397122 402565 408561 413042 415192 416269 417919 420611
52278D20611L290L593M127M941N533N404M778M598N570P277Q592Q898Q547Q174
$$ 420611 423901 427494 431621 436562 442095 447499 452277 456875 462445 469722 478314 487212 495759 503933
52264E03933P953P650P202P107Q062R982J1568J1526J0269R683J0817J2639J3635
$$ 503933 511886 519536 526738 533845 541907 551889 563457 574983 585252 594935 605752 618391 632026
52251F32026J3882J4662J6546J8840K0581K1240K0815K0141K0772K3353K6314
$$ 632026 645908 660570 677116 695956 716537 737777 758592 778733 799505 822858 849172
52240H49172K7381K6502K5984K7426K9685L0617K9804K8668K8512K9360L0405
$$ 849172 876553 903055 929039 956465 986150 1016767 1046571 1075239 1103751 1133111 1163516
52229A163516L0712K9635K7297K4788K3226K2479K1330J9133J6766J5514J5372
$$ 1163516 1194228 1223863 1251160 1275948 1299174 1321653 1342983 1362116 1378882 1394396 1409768
52218A409768J5100J3827J1923J0082Q335O449M749L817L561L318K802K201J517
$$ 1409768 1424868 1438695 1450618 1460700 1469035 1475484 1480233 1484050 1487611 1490929 1493731 1495932 1497449
52205A497449N56l43m79J60Q25J209J793K672L095K773K756M187O799R300J0729
$$ 1497449 1498005 1497662 1497183 1497343 1498168 1499377 1501170 1503842 1506937 1509710 1512466 1516653 1523452 1532752 1543481
52190A543481J0906J0358J0357J2155J5337J7796J8285J8049J8832K0294K0909
$$ 1543481 1554387 1564745 1575102 1587257 1602594 1620390 1638675 1656724 1675556 1695850 1716759
52179A716759K0537K0233K0025J8927J7119J6079J6237J6252J5277J4173J3774
$$ 1716759 1737296 1757529 1777554 1796481 1813600 1829679 1845916 1862168 1877445 1891618 1905392
52168A905392J3362J1855R327O421L381N72j148j624k143l829n991p208p463p996
$$ 1905392 1918754 1930609 1939936 1946357 1949738 1950310 1949162 1947538 1945395 1941566 1935575 1928367 1920904 1912908
52154A912908r392j1017j2258j3163j3740j3645j2973j2569j3050j3874j3852
$$ 1912908 1903516 1892499 1880241 1867078 1853338 1839693 1826720 1814151 1801101 1787227 1773375
52143A773375j2461j0358q551p400o580n933n839o493p176o858n364l528k231
$$ 1773375 1760914 1750556 1742005 1734605 1728025 1722092 1716253 1709760 1702584 1695726 1690362 1686834 1684603
52130A684603j777k045k673l069k844k256j717j042K7P85J36j725l298l772l934
$$ 1684603 1682826 1680781 1678108 1675039 1672195 1669939 1668222 1667180 1667207 1667992 1668128 1666403 1663105 1659333 1655399
52115A655399m627n456n677n397n180n255n797p059q474q753p680o846p384q122
$$ 1655399 1650772 1645316 1639639 1634242 1629062 1623807 1618010 1610951 1602477 1593724 1586044 1579198 1571814 1563692
52101A563692p399n819n392o429p258o918o271o151o186o049o291p028p142n839
$$ 1563692 1556293 1550474 1545082 1538653 1531395 1524477 1518206 1512055 1505869 1499820 1493529 1486501 1479359 1473520
52087A473520m146l718m654n443m762k708n75R8j300l701n140m792l770l458l735
$$ 1473520 1469374 1465656 1461002 1455559 1450797 1448089 1447514 1447612 1446312 1442611 1437471 1432679 1428909 1425451 1421716
52072A421716l648l244l494m544n311n149m780m908m883l666j584K4P21J403K657
$$ 1421716 1418068 1414824 1411330 1406786 1401475 1396326 1391546 1386638 1381755 1378089 1376505 1376529 1377250 1378653 1381310
52057A381310L791M066L968M388N306O309P808J0376J3113J4330J4154J4968J8414
$$ 1381310 1385101 1389167 1393135 1397523 1402829 1409138 1416946 1427322 1440435 1454765 1468919 1483887 1502301
52044A502301K3158K6622K7908K7954K7763K7892K9069L1632L4513L6131L6297
$$ 1502301 1525459 1552081 1579989 1607943 1635706 1663598 1692667 1724299 1758812 1794943 1831240
52033A831240L6105L6012L5368L3949L2471L1245K9675K7531K5404K3279K0071
$$ 1831240 1867345 1903357 1938725 1972674 2005145 2036390 2066065 2093596 2119000 2142279 2162350
52022B162350J5570J1521R502Q587O595L081l65k487l646m682n766o737p680q746
$$ 2162350 2177920 2189441 2198943 2207530 2214125 2217206 2216841 2214354 2210708 2206026 2200260 2193523 2185843 2177097
52008B177097r994j1476j2943j3478j2237r775p855p605q387q795q131o582m544
$$ 2177097 2167103 2155627 2142684 2129206 2116969 2107194 2099339 2091734 2083347 2074552 2066421 2059839 2055295
51995B055295k488j028m45m3J293L766O226P441P496P607Q531R657R876R064Q189
$$ 2055295 2052807 2051779 2051334 2051291 2052584 2056350 2062576 2070017 2077513 2085120 2093651 2103308 2113184 2122248 2130437
51980B130437Q051Q463Q661Q088O558M300K101Q27L84l46k135m545o983r754j3077
$$ 2130437 2138488 2146951 2155612 2163700 2170258 2174558 2176659 2177486 2177870 2177524 2175389 2170844 2163861 2154107 2141030
51965B141030j5836j6679j6177j6326j7824j9375k0104k1051k3258k5735k6693
$$ 2141030 2125194 2108515 2092338 2076012 2058188 2038813 2018709 1997658 1974400 1948665 1921972
51954A921972k6013k5149k5011k5284k5689k6644k8445l0694l2713l3912l3814
$$ 1921972 1895959 1870810 1845799 1820515 1794826 1768182 1739737 1709043 1676330 1642418 1608604
51943A608604l2528l1122l0726l1204l1561l1611l2181l3450l4213l3446l1662
$$ 1608604 1576076 1544954 1514228 1483024 1451463 1419852 1387671 1354221 1320008 1286562 1254900
51932A254900l0104k9440k9938l1992l5245l7765l7525l4782l1967l0867l0833
$$ 1254900 1224796 1195356 1165418 1133426 1098181 1060416 1022891 988109 956142 925275 894442
51921H94442l0023k7752k5061k3415k3321k4051k4378k3644k2176k0553j8758
$$ 894442 864419 836667 811606 788191 764870 740819 716441 692797 670621 650068 631310
51910F31310j6477j4153j2990j3443j4327j3986j2140j0032q847q671q923r223
$$ 631310 614833 600680 587690 574247 559920 545934 533794 523762 514915 506244 497321 488098
51898D88098r389r005p655n668m212m305n746p246p597o571m714k695j110n30
$$ 488098 478709 469704 462049 456381 452169 447864 442118 434872 427275 420704 415990 413295 412185 411655
51884D11655j153k298k822k290j451j223j585j757j277m41J58Q3q86k502l822
$$ 411655 410502 408204 405382 403092 401641 400418 398833 397076 395799 395358 395516 395599 394713 392211 388389
51869C88389l853k760j879k111k717k484j571j333k351l727m647n582p125q391
$$ 388389 384536 381776 379897 377786 375069 372585 371014 369681 367330 363603 358956 353374 346249 337858
51855C37858p842n402k713j154o52o41j107k003k546k078j170r97j791k816l648
$$ 337858 330016 324614 321901 320747 320095 319454 318347 316344 313798 311720 310550 309553 307762 304946 301298
51840C01298m530n347n249l813j920r26j283k300l007k856j901p33j00l51j167
$$ 301298 296768 291421 286172 282359 280439 279513 278230 275930 272923 270067 268166 267433 267333 266982 265815
51825B65815j935k174j662n74K49k55k221m364n081l880j614M20J320J021M37
$$ 265815 263880 261706 260044 259470 259719 259464 257243 252879 247798 243918 242304 242724 244044 245065 245502
51810B45502P84K142K996J953k96j649j165O1P18R07J393K127K460K290K144K226
$$ 245502 246286 248428 251424 253377 253081 251432 250267 250328 251046 251953 253346 255473 257933 260223 262367 264593
51794B64593K197J775J089M84M66J571L679N577O013N116M140L710L222K157J026
$$ 264593 266790 268565 269654 270138 270604 272175 275854 281431 287444 292560 296700 300410 303632 305789 306815
51779C06815M22j14j351k888l408k368o56N56J010J131J183J084Q17O22O61P65
$$ 306815 307237 307123 305772 302884 299476 297108 296452 297008 298018 299149 300332 301416 302233 302855 303516 304281
51763C04281N65j16j050j787k027j684q02L78J259J358J024J093J529J173n35
$$ 304281 304846 304730 303680 301893 299866 298182 297380 297758 299017 300375 301399 302492 304021 305194 304659
51748C04659k227k058j34J669K147J742R88m07k206k926j769k44m27k074l020
$$ 304659 302432 300374 300240 301909 304056 305798 306786 306379 304173 301247 299478 299234 298807 296733 293713
51733B93713k179n81O03J510K431K642J398o08j809j527n27L0l12j146j648j265
$$ 293713 291534 290953 291556 293066 295497 298139 299537 298929 297120 295593 295066 295096 294784 293638 291990 290725
51717B90725j79Q89J366J182N36k32m94K62J625K365J841Q56O58J410K191K215
$$ 290725 290546 291435 292801 293983 294519 294287 293793 294055 295680 298045 299886 300742 301400 302810 305001 307216
51701C07216J615J063J127J845K678K932K495J964J835J825J443Q36O82J368K672
$$ 307216 308831 309894 311021 312866 315544 318476 320971 322935 324770 326595 328038 328874 329556 330924 333596
51686C33596M085N076N290M973M962N783P020Q068R103J0490J1592J1286R660
$$ 333596 337681 342757 348047 353020 357982 363765 370785 378853 387956 398446 410038 421324 430984
51673D30984Q202Q005Q726R590J0392J1126J1457J1264J0812R775P120K937o46
$$ 430984 439186 447191 455917 465507 475899 487025 498482 509746 520558 530333 537453 540390 539744
51660E39744j766j428k151m209n166l506r57j61j445l185m333m996n081m031k185
$$ 539744 537978 536550 534399 530190 525024 521518 520561 520400 518955 515770 511437 506441 501360 497329 495144
51645D95144r64j179k034k290j721q77rJ074K372L415L553K414M12j120q69R74
$$ 495144 494180 493001 490967 488677 486956 486079 486070 487144 489516 492931 496484 498898 499310 498190 497321 498295
51629D98295K694K915K135J861K752M210N456O240O658O934P299P455O447L854
$$ 498295 500989 503904 506039 507900 510652 514862 520318 526558 533216 540150 547449 554904 561351 565205
51615E65205R50l39L41J519K014K206K794L481L694L667L853L881L144K037J582
$$ 565205 566155 565816 566157 567676 569690 571896 574690 578171 581865 585532 589385 593266 596410 598447 600029
51600F00029K068K874L469L600K724L55k730m717m708l810l749m944o480p512
$$ 600029 602097 604971 608440 612040 614764 615119 612389 607672 602964 599154 595405 590461 583981 576469
51586E76469p995q130p821p025o281o384p405q347q175p148o496o747o987o298
$$ 576469 568474 560344 552523 545498 539217 532833 525428 517081 508906 501758 495262 488515 481528 475230
51572D75230n234n046n743n971m898l353k631k904l290l141k715k667l230l923
$$ 475230 469996 464950 459207 453236 448338 444985 442354 439450 436160 433019 430304 427637 424407 420484
51558D20484m070l593l126l119l138k427j016L00R63J025O64o2q53j330j595k000
$$ 420484 416414 412821 409695 406576 403438 401011 399995 400295 401258 402283 402947 402885 402032 400702 399107 397107
51542C97107k366k150j437q26k54R25K367K661J566R58K405M793N852N170M204
$$ 397107 394741 392591 391154 390328 390074 390999 393366 396027 397593 398551 400956 405749 411601 416771 420975
51527D20975L834L719L878M955O606P276O327M994M529M632M571M620N135N235
$$ 420975 424809 428528 432406 437361 443967 451243 457570 462564 467093 471725 476296 480916 486051 491286
51513D91286L729J038j138j893j856j918k254k733l353l953m168l999l891m008
$$ 491286 495015 496053 494915 493022 491166 489248 486994 484261 480908 476955 472787 468788 464897 460889
51499D60889l929l310k381j472m47R99K680M005M604M595M249L658K828J994J628
$$ 460889 456960 453650 451269 449797 449350 450349 453029 457034 461638 466233 470482 474140 476968 478962 480590
51484D80590K042L046M189N289O331O839N886L289L36j341j469j071q67o85n59
$$ 480590 482632 485678 489867 495156 501487 508326 514212 517501 517837 516496 515027 513956 513089 512404 511845
51469E11845j169k591l498k669p39N70O39L10K06o4o91q51J74J739K578K400K033
$$ 511845 510676 508085 504587 501918 501179 501749 502388 502698 502904 502840 502149 501298 501472 503211 505789 508189 510222
51452E10222K130K481K701K858L150L320K868J767O29k2m44j308k603l398l030
$$ 510222 512352 514833 517534 520392 523542 526862 529730 531497 532126 532104 531660 530352 527749 524351 521321
51437E21321k219k344l711n289o173o518o640o233n096l980l626l495k580j185
$$ 521321 519102 516758 513047 507758 501585 495067 488427 482194 477098 473118 469492 465997 463417 462232
51423D62232o68j326j884j504j070j595k318j565R65L843N701O438O584O443O195
$$ 462232 461564 460238 458354 456850 455780 454185 451867 450302 451267 455110 460811 467249 473833 480276 486471
51408D86471O158O461O657O173N111M357M898O893R388J0976J0934R663Q028O518
$$ 486471 492629 499090 505747 511920 517031 521388 526286 533179 542567 553543 564477 574140 582168 588686
51394E88686N289M592M603M860M561L497K202J053j45j398k022j494m54j86j097
$$ 588686 593975 598567 603170 608030 612591 616088 618290 619343 619198 617800 615778 614284 613830 613644 612547
51379F12547k231k294q70J320L004L259K320J495J961L508M812M930M142L287
$$ 612547 610316 608022 607152 608472 611476 614735 617055 618550 620511 624019 628831 633761 637903 641190
51365F41190K766K448K175J963J739J122m01k897n454o626n922m595m200m646
$$ 641190 643956 646404 648579 650542 652281 653403 653002 650105 644651 638025 632103 627508 623308 618662
51351F18662m781m662n583p372p614n011j923j501l223l822k235q11j225j992
$$ 618662 613881 609219 603636 596264 588650 583639 581716 580215 576992 573170 570935 570124 568899 566907
51337E66907j361k72m06j055l31J534K503J977J523K243L252L311K443J470R29
$$ 566907 565546 565274 564868 563813 563482 565016 567519 569496 571019 573262 576514 579825 582268 583738 584667
51322E84667Q98J047O96l78j313j371j502l286o388q714r372r681j0653j1296
$$ 584667 585565 586612 587308 586930 585617 584246 582744 579458 573070 564356 554984 545303 534650 523354
51308E23354j0531r202q782r299r883j0401j0977j0910r682q419q572r573r599
$$ 523354 512823 503621 494839 485540 475657 465256 454279 443369 433687 425268 416696 407123 397524
51295C97524q497q010q837r328p847m972k499j373j426k243l217l496k764j911
$$ 397524 389027 381017 372180 362852 355005 350033 347534 346161 344735 342492 339275 335779 333015 331104
51281C31104k018k986l685l331k179j016l89l24m54m92o15j176j944k127j407
$$ 331104 329086 326100 322415 319084 316905 315889 315500 315176 314722 314230 313615 312439 310495 308368 306961
51266C06961n43m16q06o56O26K592M309M980M185K223K71l37N68J837K436K603
$$ 306961 306418 306002 305196 304540 305166 307758 312067 317047 321232 323455 323726 323389 323957 325794 328230 330833
51250C30833L189M221M837M634M304M620N256N245M377L557L666M520N181M966
$$ 330833 334022 338243 343080 347714 352018 356638 361894 367139 371516 375073 378739 383259 388440 393406
51236C93406L881K320O23j059k659m049n008n437n596n996o895p984q610q335
$$ 393406 397287 399607 400230 399171 396512 392463 387455 382018 376422 370426 363531 355547 346937 338602
51222C38602p367o519o515p104p163n950m097k804k318j979j633j975l145m107
$$ 338602 331235 324716 318201 311097 303934 297984 293887 291083 288765 286786 285153 283178 280033 275926
51208B75926m113l909m450n102m434k540j215j547k483k339r30M19O03k04j009
$$ 275926 271813 267904 263454 258352 253918 251378 250163 248616 246133 243794 242864 243283 243886 243682 242673
51193B42673j048m33O0k04r77j299m87J123K370K161L47k037l398k829q57J091
$$ 242673 241625 241192 241252 241048 240071 238772 238285 239408 241778 243939 244286 242249 238851 236022 235165 236256
51177B36256J991J835J085K3j153j884j520k38O16j75k010k752j193J224K071
$$ 236256 238247 240082 241167 241190 240037 238153 236633 236395 237011 236836 234826 232074 230881 232105 234176
51162B34176R42k86j80O31R40P18N11K22l42n81M1Q19P29N0j32L39P91J082J543
$$ 234176 235118 234832 234652 235283 236223 236941 237452 237674 237332 236751 236792 237611 238340 238390 238258 238597 239388 240470 242013
51143B42013J791J183K87K65P64K28j369k004n07J625K360J626N80l52j429k480
$$ 242013 243804 244987 245274 245539 246303 246531 245162 243158 242651 244276 246636 248262 248842 248490 247061 244581
51127B44581l082l213k832j558L17J385P92m38q91p98j265k118k155j310r36j801
$$ 244581 241499 238286 235454 233896 234213 235598 236390 235952 235061 234263 232998 230880 228725 227415 226479 224678
51111B24678l033l410k768j808j170r04m06J000K906L740K662J043Q90K098K701
$$ 224678 221645 218235 215467 213659 212489 211585 211179 212179 215085 218825 221487 222530 223420 225518 228219
51096B28219J781O21M17M38o03k394l457l180k442k409l396m749n282m040j284
$$ 228219 230000 230621 231038 231476 230873 228479 225022 221842 219400 216991 213595 208846 203564 199524 198240
51081A98240J326K081R01o70j207p69m15o83j015o48K89R25P54J33l77o87q25
$$ 198240 199566 201647 202548 201878 200671 199902 199487 198804 197789 197141 197430 198355 199109 199242 198865 198178 197353
51064A97353l40J262L575N286N415M276L024K499K626K818K727K540K615K967
$$ 197353 197013 198275 201850 207136 212551 216827 219851 222350 224976 227794 230521 233061 235676 238643
51050B38643L257L191K758K095J344O31o0r94k211l055k658j115L57P09J06n75
$$ 238643 241900 245091 247849 249944 251288 251919 251859 250865 248654 245599 242941 241826 242183 242892 242998 242423
51034B42423q48q42q71j048j139o36N39J434R47m35q50N62K335K651J669Q97R52
$$ 242423 241575 240733 239862 238814 237675 237039 237578 239012 239959 239524 238674 239236 241571 244222 245891 246788 247740
51017B47740J175J058Q25P51Q35J066J239Q13k55j023p94k62k88k55Q23K096J751
$$ 247740 248915 249973 250798 251549 252384 253450 254689 255502 255247 254224 253430 253168 252880 252625 253448 255544 257295
51000B57295N9n59R82K801K790J373L71L23K40o62k077l012k498m32J851K541
$$ 257295 257354 256795 257777 260578 263368 264741 265112 265435 265675 265013 262936 259924 257426 256994 258845 261386
50984B61386J430K65M72J529K183K286K497K941L232L255K980K078O79J2J149
$$ 261386 262816 263081 263553 265082 267265 269551 272048 274989 278221 281476 284456 286534 287213 287225 288374
50969B88374L305M526M031K948K518K559K029O20p57j082m39J85L67R53K699M685
$$ 288374 291679 296205 300236 303184 305702 308261 310290 310910 310153 309071 308632 308817 309184 310137 312836 317521
50953C17521N221M231L396L639L889L054J841J491J755J600J229J836L610N271
$$ 317521 322742 326973 330369 334008 337897 340951 342792 344283 346038 347638 348867 350703 354313 359584
50939C59584N708N109M539N084P197J0072J1987J2051J1333J1459J2562J3649
$$ 359584 365292 370401 374940 380024 387221 397293 409280 421331 432664 444123 456685 470334
50927D70334J4527J5888J7694J8846J8789J8259J8084J8359J9200K1171K4296
$$ 470334 484861 500749 518443 537289 556078 574337 592421 610780 629980 651151 675447
50916F75447K7534K9927L1817L4362L8191M2896M7432N0898N3301N5820N9728
$$ 675447 702981 732908 764725 799087 837278 880174 927606 978504 1031805 1087625 1147353
50905A147353O4860O9822P3869P7767Q2289Q6643Q9395R0539R1635R3676R5673
$$ 1147353 1212213 1282035 1355904 1433671 1515960 1602603 1691998 1782537 1874172 1967848 2063521
50894B063521R5760R3206Q8722Q3023P6056O7958N9874N2828M6132L8172K9005
$$ 2063521 2159281 2252487 2341209 2424232 2500288 2568246 2628120 2680948 2727080 2765252 2794257
50883B794257K0904J5601J2114Q315L865L19j340j849k318l003l791n043p447
$$ 2794257 2815161 2830762 2842876 2851191 2855056 2855375 2854035 2852186 2849868 2846865 2843074 2838031 2830584
50870B830584j1377j6626k2449k8119l3779m0452m8607n7099o4373p0416p6407
$$ 2830584 2819207 2802581 2780132 2752013 2718234 2677782 2629175 2572076 2507703 2437287 2360880
50859B360880q2621q7892r1224r2809r3090r1929q9191q5293q0674p5418o9752
$$ 2360880 2278259 2190367 2099143 2006334 1913244 1821315 1732124 1646831 1566157 1490739 1420987
50848A420987o4276n9253n4324m9279m4487m0308l6650l3275k9957k6302k2206
$$ 1420987 1356711 1297458 1243134 1193855 1149368 1109060 1072410 1039135 1009178 982876 960670
50837I60670j8533j6300j5043j3181j0306p769o448n395l614j798r63m39J056
$$ 960670 942137 925837 910794 897613 887307 879538 873090 867695 864081 862283 861320 860881 861937
50824H61937L110M135M011M399O218Q407R837J1072J3161J5577J6755J6560J6876
$$ 861937 865047 869182 873193 877592 883810 892217 902054 913126 926287 941864 958619 975179 992055
50811I92055J9189K2435K4310K4426K4934K7684L1886L5416L7580L9423M1896
$$ 992055 1011244 1033679 1057989 1082415 1107349 1135033 1166919 1202335 1239915 1279338 1321234
50800A321234M5195M9630N5607O2426O8578P3720P9204Q6239R4663J03910J13947
$$ 1321234 1366429 1416059 1471666 1534092 1602670 1676390 1755594 1841833 1936496 2040406 2154353
50789B154353J24721J35871J47439J59558J70987J79701J85791J91885J99386
$$ 2154353 2279074 2414945 2562384 2721942 2892929 3072630 3258421 3450306 3649692
50780C649692K06078K09107K08618K06278K01664J92762J79280J62826J44232
$$ 3649692 3855770 4064877 4273495 4479773 4681437 4874199 5053479 5216305 5360537
50771E360537J23375J01486Q0974O2448M4418K6698J1756J589m829r577j2835
$$ 5360537 5483912 5585398 5666372 5728820 5773238 5799936 5811692 5813281 5808452 5798875 5786040
50760E786040j3292j0433n202O58M813M695r80j1302k4420l9399n6341p5264r5520
$$ 5786040 5772748 5762315 5757113 5757771 5762584 5767279 5766299 5754997 5730577 5691178 5634837 5559573 5464053
50747E464053j16066j35968j54822j72576j88486k00614k07483k10035k10559
$$ 5464053 5347987 5212019 5057197 4884621 4696135 4495521 4288038 4078003 3867444
50738C867444k09548k05292j97041j86744j76608j66423j54654j41134j27281
$$ 3867444 3657896 3452604 3255563 3068819 2892211 2725788 2571134 2430000 2302719
50729B302719j14371j02805r2462q2738p2744o2570n3697m7223m2291l7417l2688
$$ 2302719 2188348 2085543 1993081 1910343 1837599 1775029 1721332 1674109 1631818 1594401 1561713
50718A561713k9338k7509k5785k3019j9678j7215j6701j7798j8631j7228j3765
$$ 1561713 1532375 1504866 1479081 1456062 1436384 1419169 1402468 1384670 1366039 1348811 1335046
50707A335046j0759j0211j1236j1517j0330q814p895p504p523p810p283m601j90
$$ 1335046 1324287 1314076 1302840 1291323 1280993 1272179 1264284 1256780 1249257 1241447 1234164 1229563 1229373
50694A229373L799N939O916Q117J0043J2592J5790J9448K2972K6179K9797L4460
$$ 1229373 1233172 1239111 1246027 1254144 1264187 1276779 1292569 1312017 1334989 1361168 1390965 1425425
50682A425425L9690M4327M7751N0412N3387N7589O3104O9219P5289Q1420Q7998
$$ 1425425 1465115 1509442 1557193 1607605 1660992 1718581 1781685 1850904 1926193 2007613 2095611
50671B095611R4931J01883J08868J15808J21960J26583J29883J32263J32918J30448
$$ 2095611 2190542 2292425 2401293 2517101 2639061 2765644 2895527 3027790 3160708 3291156
50661C291156J24722J16835J07334R5870Q2730O9094N5311M0396K3849O815r069
$$ 3291156 3415878 3532713 3640047 3735917 3818647 3887741 3943052 3983448 4007297 4014112 4005043
50650D005043k2718l3154l9568m2551m3776m3606m0659l4696k8233k3778k0923
$$ 4005043 3982325 3949171 3909603 3867052 3823276 3779670 3739011 3704315 3676082 3652304 3631381
50639C631381j7912j4853j3419j4389j7708k4274l5340n0020o5454p9671r2566
$$ 3631381 3613469 3598616 3585197 3570808 3553100 3528826 3493486 3443466 3378012 3298341 3205775
50628C205775j03935j12541j17760j20555j21913j21474j18447j12952j05856
$$ 3205775 3101840 2989299 2871539 2750984 2629071 2507597 2389150 2276198 2170342
50619B170342r7967q9936q2274p5023o7973o1199n4758m7925l9816l0862k2549
$$ 2170342 2072375 1982439 1900165 1825142 1757169 1695970 1641212 1593287 1553471 1522609 1500060
50608A500060j5599r566m428j091K77J101K764N256Q212J1922J6197J9309J9751
$$ 1500060 1484461 1474895 1470467 1469376 1469653 1470754 1473518 1478774 1486986 1498908 1515105 1534414 1554165
50595A554165J8585J8582K1156K5235K9100L2192L4992L7991M1277M4692M8093
$$ 1554165 1572750 1591332 1612488 1637723 1666823 1699015 1734007 1771998 1813275 1857967 1906060
50584A906060N1484N4883N8052O0805O3740O7942P3489P8771Q1945Q2815Q2716
$$ 1906060 1957544 2012427 2070479 2131284 2195024 2262966 2336455 2415226 2497171 2579986 2662702
50573B662702Q2946Q3735Q4381Q3726Q0843P5782O9506O2685N5155M6866L8582
$$ 2662702 2745648 2829383 2913764 2997490 3078333 3154115 3223621 3286306 3341461 3388327 3426909
50562C426909L0886K3421J6157J0557P877O862M977J939J18J033L247M725N630
$$ 3426909 3457795 3481216 3497373 3507930 3515807 3522669 3527646 3529585 3529703 3530736 3533983 3538708 3544338
50549C544338P302R514J0561R727Q100O632M653Q95m828j1687j9320k8446l9820
$$ 3544338 3551640 3561154 3571715 3581442 3589542 3596174 3600827 3601722 3596894 3585207 3565887 3537441 3497621
50536C497621n2874o5771p6808q5547r2511r8130j02284j04711j05410j04669
$$ 3497621 3444747 3378976 3302168 3216621 3124110 3025980 2923696 2818985 2713575 2608906
50526B608906j02812r9978r5915r0357q3807p7618p2683o8360o3374n7547n1847
$$ 2608906 2506094 2406116 2310201 2219844 2136037 2058419 1985736 1917376 1854002 1796455 1744608
50515A744608m6748m1653l6065l0362k5021k0003j5332j1383p924l830J303O055
$$ 1744608 1697860 1656207 1620142 1589780 1564759 1544756 1529424 1518041 1510117 1506287 1507590 1513645
50503A513645Q823J0136J2075J5600J9688K3106K5804K8131K9863L0797L1539
$$ 1513645 1522468 1532604 1544679 1560279 1579967 1603073 1628877 1657008 1686871 1717668 1749207
50492A749207L2871L4724L6530L8366M0907M4141M6845M7785M7170M6449M6719
$$ 1749207 1782078 1816802 1853332 1891698 1932605 1976746 2023591 2071376 2118546 2164995 2211714
50481B211714M7723M8540M8925M9557N1131N3662N6899O0901O5876P1677P7826
$$ 2211714 2259437 2307977 2356902 2406459 2457590 2511252 2568151 2629052 2694928 2766605 2844431
50470B844431Q4159R1094R9235J08693J18758J28188J36120J42808J49269J55986
$$ 2844431 2928590 3019684 3118919 3227612 3346370 3474558 3610678 3753486 3902755 4058741
50460D058741J62211J66641J68505J67645J64055J57911J49742J39763J27096
$$ 4058741 4220952 4387593 4556098 4723743 4887798 5045709 5195451 5335214 5462310
50451E462310J10492R0056O7622M5102K3039J086k0788m2195o2970q2931j00958
$$ 5462310 5572802 5662858 5730480 5775582 5798621 5799707 5778919 5736724 5673754 5590823 5489865
50440E489865j14961j23172j25344j22653j16621j08219r7660q4824o9862n3524
$$ 5489865 5374904 5251732 5126388 5003735 4887114 4778895 4681235 4596411 4526549 4473025
50430D473025l6971k1328p310M817J4846K1947K4444K0675J0430m768k2968m3058
$$ 4473025 4436054 4414726 4407416 4412233 4427079 4449026 4473470 4494145 4504575 4499807 4476839 4433781
50418D433781o4433q5888j05574j22108j35207j45164j52172j56233j57144j54522
$$ 4433781 4369348 4283460 4177886 4055778 3920571 3775407 3623235 3467002 3309858 3155336
50408C155336j48499j40553j32907j26509j20161j12207j02515r2102q1501p0741
$$ 3155336 3006837 2866284 2733377 2606868 2486707 2374500 2271985 2179883 2098382 2027641
50398B027641o0664n2751m7222m2446l6937l0940k5313j9800j3645p294k074J812
$$ 2027641 1966977 1914226 1867004 1824558 1787621 1756681 1731368 1711568 1697923 1690629 1688555 1690367
50386A690367N664J0254J4595J7531J9715K2839K7161L0907L2575L3008L4369
$$ 1690367 1696031 1706285 1720880 1738411 1758126 1780965 1808126 1839033 1871608 1904616 1938985
50375A938985L7269L9900M0408L9390L9178M0703M2152M1204L7873L4410L2713
$$ 1938985 1976254 2016154 2056562 2095952 2135130 2175833 2217985 2259189 2297062 2331472 2364185
50364B364185L2599L2509L1179K8467K5142K2293K0669K0322K0899K2215K4439
$$ 2364185 2396784 2429293 2460472 2488939 2514081 2536374 2557043 2577365 2598264 2620479 2644918
50353B644918K7741L1865L6108L9623M2161M4572M8129N2914N7378O0041O1185
$$ 2644918 2672659 2704524 2740632 2780255 2822416 2866988 2915117 2968031 3025409 3085450 3146635
50342C146635O2004O2486O1269N7638N2481M6828M0409L2293K2258J0898j149
$$ 3146635 3208639 3271125 3332394 3390032 3442513 3489341 3529750 3562043 3584301 3595199 3594050
50331C594050j3519k6071l8944n2372o5984p8591q8939r6393j00647j01441r9028
$$ 3594050 3580531 3554460 3515516 3463144 3397160 3318569 3229630 3133237 3032590 2931149 2832121
50320B832121r4458q8762q1956p3334o2606n0503l8467k7879j9288j2116n445
$$ 2832121 2737663 2648901 2566945 2493611 2431005 2380502 2342035 2314156 2294868 2282752 2277307
50309B277307Q47N990R271J0347Q759M081l084j1223j9516k8361l7741m6155n2104
$$ 2277307 2278154 2284144 2293415 2303762 2312521 2316602 2313518 2302295 2282779 2254418 2216677 2170522 2118418
50296B118418n5735n8065n9408n9637n9192n8527n7054n3969m9659m5229m1068
$$ 2118418 2062683 2004618 1945210 1885573 1826381 1767854 1710800 1656831 1607172 1561943 1520875
50285A520875l7106l3812l1421k8695k4317j9279j5895j4393j2640r675p306p009
$$ 1520875 1483769 1449957 1418536 1389841 1365524 1346245 1330350 1315957 1303317 1293642 1286336 1279327
50273A279327p264n630k216P89K395L871O632J0381J3717J5723J6621J7199J7984
$$ 1279327 1272063 1266433 1264217 1265006 1267401 1271272 1277904 1288285 1302002 1317725 1334346 1351545 1369529
50260A369529J9041K0422K2359K4592K6119K6303K5861K5792K5725K4678K3179
$$ 1369529 1388570 1408992 1431351 1455943 1482062 1508365 1534226 1560018 1585743 1610421 1633600
50249A633600K2862K3669K3443K1053J8192J6897J6817J6367J5247J4112J2675
$$ 1633600 1656462 1680131 1703574 1724627 1742819 1759716 1776533 1792900 1808147 1822259 1834934
50238A834934J0068O721M174L053K390R96j523m939q589j1478j3093j3990j5016
$$ 1834934 1845002 1851723 1855897 1858950 1861340 1862336 1860813 1855874 1847285 1835807 1822714 1808724 1793708
50225A793708j6363j7959j9939k1865k2388k1010j9437j9612k1050k1846k1727
$$ 1793708 1777345 1759386 1739447 1717582 1695194 1674184 1654747 1635135 1614085 1592239 1570512
50214A570512k2012k2721k2008j9104j5867j4404j4634j5064j4716j3469j1561
$$ 1570512 1548500 1525779 1503771 1484667 1468800 1454396 1439762 1424698 1409982 1396513 1384952
50203A384952r650q526q049p172n459l648k354j313m61m11j122j466j137j686
$$ 1384952 1375302 1366776 1358727 1351555 1346096 1342448 1340094 1338781 1338320 1337909 1336787 1335321 1334184 1332498
50189A332498m261p376q564p583o443o509p154p292o949o951p867r510j0981j1399
$$ 1332498 1328237 1320861 1312297 1304714 1298271 1291762 1284608 1277316 1270367 1263416 1255549 1246039 1235058 1223659
50175A223659j1021j1185j2392j3063j1346p737m650l411l086k377j327n70o6
$$ 1223659 1212638 1201453 1189061 1175998 1164652 1156915 1152265 1148854 1145768 1143391 1142064 1141494 1141428
50162A141428O26J600K790M318O003P046O864N929N210N027M913M352L189J543
$$ 1141428 1142054 1143654 1146444 1150762 1156765 1163811 1170675 1176604 1181814 1186841 1191754 1196106 1199295 1200838
50148A200838k07j551k453l743o324r889j2916j4178j4033j3926j4751j6035j6727
$$ 1200838 1200631 1199080 1196627 1192884 1186560 1176671 1163755 1149577 1135544 1121618 1106867 1090832 1074105
50135A074105j6395j5452j4427j3499j2752j2469j2851j3691j4465j4571j3464
$$ 1074105 1057710 1042258 1027831 1014332 1001580 989111 976260 962569 948104 933533 920069
50124I20069j1021q099o191o026o787p239p150o934o372m874l006k390l538m833
$$ 920069 909048 900949 894758 888732 881945 874706 867556 860622 854250 849376 846370 843980 840442 835609
50110H35609m500k872j828k353l643m499m680m711n041n703o438p004p480q292
$$ 835609 831109 828237 826409 824056 820413 815914 811234 806523 801482 795779 789341 782337 774857 766565
50096G66565r656j1023j1430j0509q921p756p602q143q463p872o565n483n286
$$ 766565 756909 745886 734456 723947 715026 707270 699668 691525 683062 675190 668625 663142 657856
50083F57856n683n873n308l791j327J443L127K813J339N25J089K258L370M588
$$ 657856 652173 646300 640992 637201 635874 637317 640444 643257 644596 645121 646210 648468 651838 656426
50069F56426N663N429L567J787K021L922N483N704N398N631O737Q866J1981J4931
$$ 656426 662089 667518 671085 672872 674893 678815 684298 690002 695400 701031 707768 716634 728615 743546
50055G43546J5978J5025J4183J5122J6856J7187J5741J4266J4142J4875J5273
$$ 743546 759524 774549 788732 803854 820710 837897 853638 867904 882046 896921 912194
50044I12194J5086J4954J5245J5524J5089J3796J2322J1618J2107J3417J4733
$$ 912194 927280 942234 957479 973003 988092 1001888 1014210 1025828 1037935 1051352 1066085
50033A066085J5131J3756J0382O146K972J812J881K137K783M351N888N582L382
$$ 1066085 1081216 1094972 1105354 1111500 1114472 1116284 1118165 1120302 1123085 1127436 1133324 1138906 1142288
50020A142288J613K223M379N734N497N139O153Q332J0578J2522J4459J6109J6622
$$ 1142288 1143901 1146124 1150503 1156237 1161734 1166873 1173026 1181358 1191936 1204458 1218917 1235026 1251648
50007A251648J6112J6208J8303K1669K4229K5075K5199K5664K6217K6196K5823
$$ 1251648 1267760 1283968 1302271 1323940 1348169 1373244 1398443 1424107 1450324 1476520 1502343
49996A502343K5581K5046K3435K1071J9254J8595J8283J7026J4166R927N269J435
$$ 1502343 1527924 1552970 1576405 1597476 1616730 1635325 1653608 1670634 1684800 1694727 1699996 1701431
49984A701431j006k785n103q243j1550j4510j7094j9129k0102j9779j8436j6566
$$ 1701431 1700425 1697640 1692537 1684294 1672744 1658234 1641140 1622011 1601909 1582130 1563694 1547128
49972A547128j4909j4391j5191j6098j5841j4761j3942j3069j0761p165m334l528
$$ 1547128 1532219 1517828 1502637 1486539 1470698 1455937 1441995 1428926 1418165 1411000 1406666 1403138
49960A403138l758l809l917m362m077k155L50J638J306Q1j635l488m476m169l943
$$ 1403138 1399380 1395571 1391654 1387292 1383215 1381060 1381410 1383048 1384354 1384435 1382800 1379312 1374836 1370667 1366724
49945A366724n341p808r672j0819j2435j4563j5959j6317j6492j6451j5134j2900
$$ 1366724 1361383 1353575 1343903 1333084 1320649 1306086 1290127 1273810 1257318 1240867 1225733 1212833
49933A212833j1843j2748j3674j2822j1116j0402j0379r127n986k205R79L395
$$ 1212833 1200990 1188242 1174568 1161746 1150630 1140228 1129849 1120722 1114736 1112531 1113510 1116905
49921A116905N191O301P032Q222J0304J2621J3969J3757J2412J0730Q960O770
$$ 1116905 1122096 1128397 1135429 1143651 1153955 1166576 1180545 1194302 1206714 1217444 1226404 1233174
49909A233174M194K083J115Q01K70l24k88j12j367m564q464j1866j4872j7808
$$ 1233174 1237368 1239451 1240566 1241367 1241637 1241313 1241025 1240913 1239546 1234982 1226518 1214652 1199780 1181972
49895A181972k0251k2074k4217k7261l0225l2024l3163l4542l5377l3970l0269
$$ 1181972 1161721 1139647 1115430 1088169 1057944 1025920 992757 958215 922838 888868 858599
49884H58599k6090k2858k0539j8801j7735j7123j6272j5105j4359j4277j3953
$$ 858599 832509 809651 789112 770311 752576 735453 719181 704076 689717 675440 661487
49873F61487j2534j0333q234o686n681n092m507l348j803j135k301m467n548m305
$$ 661487 648953 638620 630386 623700 618019 612927 608420 605072 603269 602134 599833 595366 589818 585513
49859E85513j419J462L222L669K986J488j02p70k45M25K0j154j493j70J793K894
$$ 585513 584094 585556 588778 592447 595433 596921 596819 596049 595804 596229 596249 595095 593602 593432 595225 598119
$$ [...]
##END NTUPLES=NMR SPECTRUM
##END=
