
##TITLE=AC1115_Huila3_5835647_LdjiZo3Vq9
##JCAMPDX= 6.0         $$ Bruker NMR JCAMP-DX V2.0
##DATA TYPE= NMR SPECTRUM
##DATA CLASS= NTUPLES
##ORIGIN= BRUKER
##OWNER= Administrator
$$ 1.72 TOPSPIN		Version 2.1
$$ 2012-03-28 11:06:01.687 -0500  Administrator@TOPSPIN
$$ Compression mode = diff/dup
##.OBSERVE FREQUENCY= 400.13188235
##.OBSERVE NUCLEUS= ^1H
##.ACQUISITION MODE= SIMULTANEOUS (DQD)
##.ACQUISITION SCHEME= undefined
##.AVERAGES= 8
##.DIGITISER RES= 22
##SPECTROMETER/DATA SYSTEM= spect
##.PULSE SEQUENCE= zg30
##.SOLVENT NAME= COFFEE_meoh
##.SHIFT REFERENCE= INTERNAL, COFFEE_meoh, 1, 14.98061
##AUDIT TRAIL= $$ (NUMBER, WHEN, WHO, WHERE, PROCESS, VERSION, WHAT)
$$ ##TITLE= Audit trail, TOPSPIN		Version 2.1
$$ ##JCAMPDX= 5.01
$$ ##ORIGIN= Bruker BioSpin GmbH
$$ ##OWNER= Administrator
$$ $$ C:\Bruker\TOPSPIN/data/COFFEE/nmr/AC1115_Huila3_5835647_LdjiZo3Vq9/10/pdata/1/auditp.txt
$$ ##AUDIT TRAIL=  $$ (NUMBER, WHEN, WHO, WHERE, PROCESS, VERSION, WHAT)
(   1,<2012-03-27 22:06:44.562 -0500>,<Administrator>,<TOPSPIN>,<go>,<TOPSPIN 2.1>,
      <created by zg
	started at 2012-03-27 22:05:37.312 -0500,
	POWCHK enabled, PULCHK disabled,
       configuration hash MD5:
       1A 1E CE 29 27 FD 77 03 67 4E F0 E3 C4 B2 CB 90
       data hash MD5: 64K
       31 3A E6 A3 AC CF 0C F1 A6 4C 0F 8F EA 9A E3 2D>)
(   2,<2012-03-27 22:06:47.703 -0500>,<Administrator>,<TOPSPIN>,<proc1d>,<TOPSPIN 2.1>,
      <Start of raw data processing
       efp LB = 0 FT_mod = 6 PKNL = 1 PHC0 = 0 PHC1 = 0 SI = 32K 
       data hash MD5: 32K
       67 9C F3 45 BD D0 BE 03 09 BD AF AA 5B 93 3A 64>)
(   3,<2012-03-27 22:06:48.218 -0500>,<Administrator>,<TOPSPIN>,<proc1d>,<TOPSPIN 2.1>,
      <pk PHC0 = 215.387 PHC1 = 0 
       data hash MD5: 32K
       F8 D9 05 43 3F 9B 26 8F 19 95 08 43 9F AD E8 9E>)
(   4,<2012-03-27 22:06:48.328 -0500>,<Administrator>,<TOPSPIN>,<proc1d>,<TOPSPIN 2.1>,
      <abs ABSG = 1 
       data hash MD5: 32K
       14 86 CF 3D B3 3B 1D 6A 77 CB F5 30 C5 CD 6A D4>)
(   5,<2012-03-27 22:06:48.359 -0500>,<Administrator>,<TOPSPIN>,<proc1d>,<TOPSPIN 2.1>,
      <abs ABSG = 2 
       data hash MD5: 32K
       97 1B 83 D4 E4 9F 4C 8C 72 F8 57 1A B1 68 7D F6>)
(   6,<2012-03-27 22:06:48.390 -0500>,<Administrator>,<TOPSPIN>,<proc1d>,<TOPSPIN 2.1>,
      <abs ABSG = 3 
       data hash MD5: 32K
       97 73 4B EB C0 8B 11 3F FB BE C1 6A 24 2A 56 8D>)
(   7,<2012-03-27 22:06:48.453 -0500>,<Administrator>,<TOPSPIN>,<proc1d>,<TOPSPIN 2.1>,
      <abs ABSG = 4 
       data hash MD5: 32K
       9C 73 5E 6E 54 DB 6A 57 FB DA 46 0C F3 7F E9 5E>)
(   8,<2012-03-27 22:06:48.515 -0500>,<Administrator>,<TOPSPIN>,<proc1d>,<TOPSPIN 2.1>,
      <abs ABSG = 5 
       data hash MD5: 32K
       FE BF 50 0C 45 1C AF 10 9A 09 A4 DD BF 3C 1A BE>)
(   9,<2012-03-27 22:06:53.765 -0500>,<Administrator>,<TOPSPIN>,<audit>,<TOPSPIN 2.1>,
      <user comment:
       ICON-NMR User ID: COFFEE
       data hash MD5: 32K
       FE BF 50 0C 45 1C AF 10 9A 09 A4 DD BF 3C 1A BE>)
$$ [...]
##$TP= (0..7)
150 150 150 150 150 150 150 150
##$TP07= 0
##$TPNAME0= <>
##$TPNAME1= <>
##$TPNAME2= <>
##$TPNAME3= <>
##$TPNAME4= <>
##$TPNAME5= <>
##$TPNAME6= <>
##$TPNAME7= <>
##$TPOAL= (0..7)
0.5 0.5 0.5 0.5 0.5 0.5 0.5 0.5
##$TPOFFS= (0..7)
0 0 0 0 0 0 0 0
##$TUNHIN= 0
##$TUNHOUT= 0
##$TUNXOUT= 0
##$USERA1= <user>
##$USERA2= <user>
##$USERA3= <user>
##$USERA4= <user>
##$USERA5= <user>
##$V9= 5
##$VALIST= <valist>
##$VCLIST= <CCCCCCCCCCCCCCC>
##$VD= 0
##$VDLIST= <DDDDDDDDDDDDDDD>
##$VPLIST= <PPPPPPPPPPPPPPP>
##$VTLIST= <TTTTTTTTTTTTTTT>
##$WBST= 2048
##$WBSW= 25
##$XGAIN= (0..3)
0 0 0 0
##$XL= 0
##$YL= 0
##$YMAX_a= 535826
##$YMIN_a= -640834
##$ZGOPTNS= <>
##$ZL1= 120
##$ZL2= 120
##$ZL3= 120
##$ZL4= 120
##$ABSF1= 14.98061
##$ABSF2= -5.57192
##$ABSG= 5
##$ABSL= 3
##$ALPHA= 0
##$AQORDER= 0
##$ASSFAC= 0
##$ASSFACI= 0
##$ASSFACX= 0
##$ASSWID= 0
##$AUNMP= <proc_prof1d_extract_pilot.lims>
##$AXLEFT= 0
##$AXNAME= <>
##$AXNUC= <1H>
##$AXRIGHT= 0
##$AXTYPE= 0
##$AXUNIT= <>
##$AZFE= 0.1
##$AZFW= 0.1
##$BCFW= 0
##$BC_mod= 0
##$BYTORDP= 0
##$COROFFS= 0
##$CY= 15
##$DATMOD= 1
##$DC= 0
##$DFILT= <>
##$DTYPP= 0
##$F1P= 0
##$F2P= 0
##$FCOR= 0.5
##$FTSIZE= 32768
##$FT_mod= 6
##$GAMMA= 0
##$GB= 0
##$INTBC= 1
##$INTSCL= 1
##$ISEN= 128
##$LB= 0
##$LEV0= 0
##$LPBIN= 0
##$MAXI= 10000
##$MC2= 0
##$MEAN= 0
##$ME_mod= 0
##$MI= 0
##$NCOEF= 0
##$NC_proc= -8
##$NLEV= 6
##$NOISF1= 0
##$NOISF2= 0
##$NSP= 0
##$NTH_PI= 0
##$NZP= 0
##$OFFSET= 14.98061
##$PC= 1
##$PHC0= 215.387
##$PHC1= 0
##$PH_mod= 1
##$PKNL= yes
##$PPARMOD= 0
##$PPDIAG= 0
##$PPIPTYP= 0
##$PPMPNUM= 2147483647
##$PPRESOL= 1
##$PSCAL= 4
##$PSIGN= 0
##$PYNMP= <proc.py>
##$REVERSE= no
##$SF= 400.13
##$SI= 32768
##$SIGF1= 0
##$SIGF2= 0
##$SINO= 400
##$SIOLD= 32768
##$SPECTYP= <>
##$SREGLST= <1H.CDCl3>
##$SSB= 0
##$STSI= 32768
##$STSR= 0
##$SW_p= 8223.68421052632
##$SYMM= 0
##$S_DEV= 0
##$TDeff= 65536
##$TDoff= 0
##$TI= <>
##$TILT= no
##$TM1= 0
##$TM2= 0
##$TOPLEV= 0
##$USERP1= <user>
##$USERP2= <user>
##$USERP3= <user>
##$USERP4= <user>
##$USERP5= <user>
##$WDW= 1
##$XDIM= 32768
##$YMAX_p= 469716922
##$YMIN_p= -742714
##$CURPLOT= <Network HP LaserJet P1505>
##$CURPRIN= <$Network HP LaserJet P1505>
##$DFORMAT= <normdp>
##$LAYOUT= <+/1D_H.xwp>
##$LFORMAT= <normlp>
##$PFORMAT= <normpl>
##$SURQMSG= 1
$$ End of Bruker specific parameters
$$ ---------------------------------
##NTUPLES= NMR SPECTRUM
##VAR_NAME=  FREQUENCY,     SPECTRUM/REAL,   SPECTRUM/IMAG
##SYMBOL=    X,             R,               I
##VAR_TYPE=  INDEPENDENT,   DEPENDENT,       DEPENDENT
##VAR_FORM=  AFFN,          ASDF,            ASDF
##VAR_DIM=   32768,         32768,           32768
##UNITS=     HZ,            ARBITRARY UNITS, ARBITRARY UNITS
##FACTOR=    0.250966925370066, 1,           1
##FIRST=     8223.43324360095, -275447,      -67446
##LAST=      0,             -3743,           -176468
##MIN=       0,             -742714,         0
##MAX=       8223.43324360095, 469716922,    0
$$ Real data points
##PAGE= N=1
##DATA TABLE= (X++(R..R)), XYDATA
$$ [...]
19475b22122R5429C75804a38347P737C55005A75229b15589f9016k27347A0166
19464A56645a47009K6531J4721d563j5859E396c33529J42037A22603a50238j52413
19453c02651A09115a46521l7600g7258k36789h1303j41016C09080b307E8722a8399
19441g2211L0547D506N3707a73281d6911j33009p5169j19559J86576O6860n5070
19430a76282o3041a960p1697o7587l05239a36979C2170c49348k7455G7398e51
19418B6573a81646p8598D6840a76244e8945n0895c3018k24593m6903a0416j40999
19407a51415k07663B8175c56338J53029l8493B6603i9083d5567K1623E7558c24109
19395b62640a20008k80064A00479K2625a64910e8156j36226i479j18669E0086
$$ y = [-222122, -126693, 375804, -138347, -130610, 355005, 175229, -215589, -69016, -296363, 10166, 156645, -147009, -120478, -105757, -4563, -20422, 5396, -333529, -191492, 122603, -150238, -302651, 109115, -146521, -184121, -77258, -314047, -81303, -222319, 309080, -2307, 58722, -18399, -72211, -41664, 4506, 58213, -173281, -46911, -179920, -255089, -374648, -188072, -121212, -176282, -239323, -1960, -73657, -141244, -446483, -136979, 32170, -349348, -376803, 77398, -551, 26573, -181646, -260244, 46840, -176244, -58945, -109840, -33018, -257611, -304514, -10416, -151415, -359078, 28175, -356338, -203309, -241802, 26603, -99083, -45567, -23944, 57558, -324109, -262640, -120008, -400072, 100479, 123104, -164910, -58156, -194382, -9479, -128148, 50086]
19384a66404B8115d9560m1605H083a60951D7801J71306a26255B81592c04828d9557
19372I1460b14019C7902g7812H872J42943b62332A41842f3981B05128f596l889
19361a0485o71M894n39146g9817j63823a04274A44446J17864A29385d0631j66693
19350b07324A0935O8194f8692j23030i5417L2956B2281R5447b61217j8975c7802
19338A21991M3332b63189B045N2798i3659b3447q1701A25339L5199G6863b8515
19326B83788b03292A67575f6472j32050O4107A60268A2815a05877j13492B06552
19315h1640L3611j01134C9714J95512a02660L6780F0358O7443I522b70848g4022
19303C08056e0339J3879a3214F0248J88714E0039e9131j44572r0603A89408a00625
$$ y = [-166404, 28115, -49560, -91165, 8083, -160951, 47801, 219107, -126255, 281592, -304828, -49557, 91460, -214019, 37902, -77812, 8872, 151815, -262332, 141842, -63981, 205128, -6596, -10485, -11156, -6262, -545408, -79817, -243640, -104274, 144446, 262310, 129385, -40631, -207324, 10935, 79129, -68692, -191722, -95417, -62461, 22281, 117728, -261217, -280192, -37802, 121991, 165323, -263189, 2045, 54843, -93659, -23447, -105148, 125339, 160538, 76863, -28515, 283788, -203292, 167575, -66472, -198522, -134415, 160268, 12815, -105877, -219369, 206552, -81640, -48029, -149163, 39714, 235226, -102660, -65880, 60358, 127801, 9522, -270848, -74022, 308056, -50339, -36460, -13214, 60248, 248962, 50039, -59131, -203703, -294306, 189408, -100625]
19291A74604c34251J47329C3764P4406c00215A60037a72601E9371a75170C2990
19280b15848L5037m4810M4854b3384j61484I5881b80387P449g2155j6772k36744
19269c25671p9284E3186d29012m2157A4987G193b76242K6937N6522f9846p0894
19258a40740O9195k34334J49112q1057D0270c64922a52184m72970f5379D7694
19247a23220E354a13421N1105k8173m675A60413p4879l0715b28175A7452c85167
19235B51803h1344b4735I1255J09283I5978a77935M5641n0097k38542a00946j99274
19224c00220a31672e5889K2740k63760g8872j10081M2779j68017J34663B72578
19213F3758a5695j57909B19418C6508j5883b6221A45542G0519b24677B46542I1176
$$ y = [174604, -334251, -186922, 33764, 108170, -300215, 160037, -172601, 59371, -175170, 32990, -215848, -180811, -225621, -180767, -23384, -184868, 95881, -280387, -272938, -72155, -88927, -325671, -404955, 53186, -429012, -471169, 14987, 7193, -276242, -249305, -192783, -69846, -140740, -71545, -305879, -156767, -237824, 40270, -364922, -152184, -625154, -65379, 47694, -123220, 5354, -113421, -62316, -90489, -95164, 160413, 85534, 54819, -228175, 17452, -385167, 251803, -81344, -24735, 91255, 200538, 95978, -177935, -132294, -182391, -420933, -100946, -300220, -131672, -55889, -33149, -296909, -78872, -188953, -146174, -314191, -179528, 272578, 63758, -15695, -173604, 219418, 36508, 20625, -26221, 145542, 70519, -224677, 246542, 91176]
19201d4193A37945b09886k35340A35007a00109m1969j39501g7324C0031a70532
19190a18410J4839R349A08824R4978F1361h5700A16620a99116o5200H195a353
19178B30713a52504o5473F2469M5443N8777a31070J5621C2132J69484g5752j89894
19167b65646A61247a20180B9325P8138c34457a56962A2589b36494B4017L52344
19157C76361c51781A13133a11353G1084d481m1916A14941p764N9229b3305j86980
19146b10285b3513j10891b1073A07934b7447r4606C8853A1326c6729j11184D1510
19134a77117r8677A58297E6490E3K07890a31305A93508e8755i580n3965j20715
19123a84260l27345I5722e3050k05322K6634N7554j51475C34991a88428N236j52311
$$ y = [-44193, 137945, -209886, -445226, 135007, -100109, -142078, -281579, -77324, 30031, -170532, -118410, -103571, -94222, 108824, 203802, 61361, -85700, 116620, -199116, -264316, 8195, -1353, 230713, -152504, -217977, 62469, 107912, 166689, -131070, -115449, 32132, 201616, -75752, -265646, 161247, -120180, 29325, 107463, -334457, -156962, 12589, -236494, 24017, 376361, -351781, 113133, -111353, 71084, -4481, -46397, 114941, 107177, 166406, -23305, -210285, -23513, -134404, -21073, 107934, -27447, -122053, 38853, 11326, -36729, -147913, 41510, -177117, -275794, 158297, 56490, 53, 207943, -131305, 193508, -58755, -9580, -63545, -184260, -511605, 95722, -53050, -258372, -231738, -174184, -325659, 334991, -188428, -183192, -335503]
19112c35503J66169B3738e1346a0310F085O9954J4202a60180k83303M6022A22016
19100a21764B59561j10852a10588C89006h44j24539H2111l2650j7072a12642A30615
19088B07526a19127j84118a09135B0503a55034F8258J4569b26549K3335k5305
19078b28519B03475c32093P9024A1210d8195A36287F106a33213c8702j43528A86483
19066b54057A43141a36598A77618q3995j5555J43726g9692A64322F4723h235m2805
19055e1040j45838Q2298k17956j7475C35315b2561j94901Q772B18140D5501h0077
19043a77418A87897a82634b683k3655C69176A61764A5443c00486a1531j24570
19033a36101D8955a07986A06803I197J49053o0640m4910a20483k9406f451j31418
$$ y = [-335503, -169334, 23738, -51346, -10310, 6085, 76039, 90241, -160180, -443483, -397461, 122016, -121764, 259561, 148709, -110588, 389006, -844, -125383, 82111, 49461, 32389, -112642, 130615, 207526, -119127, -303245, -109135, 20503, -155034, 68258, 82827, -226549, -203214, -228519, 203475, -332093, -253069, 11210, -48195, 136287, 6106, -133213, -38702, -182230, 186483, -254057, 143141, -136598, 177618, 93623, 78068, 221794, -79692, 164322, 64723, -8235, -51040, -196878, -114580, -332536, -350011, 335315, -22561, -217462, -208690, 218140, 45501, -80077, -177418, 187897, -182634, -2683, -26338, 369176, 161764, 15443, -300486, -11531, -136101, 48955, -107986, 106803, 9197, 158250, 97610, 52700, -120483, -149889, -6451, -137869]
19022a37869e466k07802j2158B13819m9416O4846A08431L8652A6847J6001c06955
19010i056H8888d517A62990h4495j21021B47714l570H286g7201l97691b31098
18998a83410b1456k31098a8233j98608C6043c29824D6901b65851b7998B50457
18987B7211a66592F1250J33959c750j67297A23303e0795o6323A52036c0476j03870
18976a34346H5861i3911D2484i5584A72516e8776j25869a6339D6403J56420F7722
18964A3771N5546k6499c35412A57430l5255R9355b2519D13479r6353L97343E2618
18952A64268P7200H0203a08604A39310B1012K2077h4985A62431a24812A77814
18941b44418Q008M8386B9553d3426A66410d716j21727j20288N7955d2079j87453
$$ y = [-137869, -5466, -213268, -225426, 213819, 164403, 229249, 108431, 147083, 16847, 32848, -306955, -9056, 88888, -4517, 162990, -84495, -205516, 247714, 244144, 8286, -77201, -474892, -231098, -183410, -21456, -252554, -18233, -216841, 36043, -329824, 46901, -265851, -27998, 250457, 27211, -166592, 61250, 195209, -3750, -171047, 123303, -50795, -117118, 152036, -30476, -134346, 85861, -93911, 42484, -95584, 172516, -58776, -184645, -16339, 46403, 202823, 67722, 13771, 69317, 42818, -335412, 157430, 122175, 221530, -22519, 413479, 317126, 714469, 52618, 164268, 241468, 80203, -108604, 139310, 21012, 43089, -84985, 162431, -124812, 177814, -244418, -236410, -188024, 29553, -43426, 166410, -4716, -126443, -246731, -188776, -42079, -229532]
18930b29532d7632r2376d4934A87733b50595f5404r6463a4650m16369P1785B01900
18918f6104j6418L7751E2301b9851o8997b6941q8561B1421h1893F7436b71191
18906i403H5363h3150B11844a27112B49795d3908j09945j57129C8005Q5584M3089
18895A66678g1959A95909Q7228n8994J53466b29196l5358a10174k74651A12372
18884b02495C23433D853g389j7343j2269D00685a66130G5540N3665h3004G4936
18872c77850a41271B3149L0736b69660K7315g9327j45314j456A1438a12016C591
18860A71122b8269e355B233a83752B31682a5095m40r3745B38970d0937A1058b71532
18847E88J29667d6434J8554F7530K82352f8848j56755A18476i0004B49821p1309
$$ y = [-229532, -47632, -140008, -44934, 187733, -250595, -65404, -161867, -14650, -431019, -359234, 201900, -66104, -82522, -44771, 52301, -29851, -98848, -26941, -115502, 21421, -81893, 67436, -271191, -9403, 85363, -83150, 211844, -127112, 249795, -43908, -153853, -310982, 38005, 123589, 166678, -71959, 195909, 283137, 224143, 377609, -229196, -264554, -110174, -384825, 112372, -202495, 323433, 4853, -7389, -24732, -37001, 400685, -166130, 75540, 129205, -83004, 74936, -377850, -141271, 23149, 53885, -269660, -242345, -79327, -224641, -226097, 11438, -112016, 3591, 171122, -28269, -5355, 2233, -183752, 231682, -15095, -15535, -109280, 238970, -40937, 11058, -271532, 588, 130255, -46434, -27880, 67530, 349882, -68848, -225603, 118476, -90004, 249821, 178512]
18836A78512M4845K43659D0714a06940B6370O9673J4518R7463j5522f3071B66035
18824E7268e2475J6578j68377h2580M987m3537A12198b79850B16547J84317E1852
18812A09826a75924N730K7195G9638c46307a1916o6590A28006K05990E7620O5621
18801A23241K9876i8461F9676L39408A93624I1190L37811I7599j3396a40016N816
18790a34200G8103i5300J2575j33342F4300c07904d8365l24893J04506B39353
18779e8156L15r0039A09307c27563J56868b0919j42843b0847o3256H78g9343j14809
18767a94152M4844q0905c1842p148j45162Q0187M1032b5145j55060B97848b96963
18755C3560d38451J57854K8063A92516d3579B05999f33264i3681a0057q7673A98034
$$ y = [178512, 223357, 467016, 40714, -106940, 26370, 96043, 110561, 208024, 192502, -63071, 266035, 57268, -52475, -35897, -204274, -82580, -77593, -121130, 112198, -279850, 216547, 400864, 51852, 109826, -175924, -170194, -142999, 79638, -346307, -11916, -78506, 128006, 333996, 57620, 123241, 153117, -98461, 69676, 409084, 193624, 91190, 429001, 97599, 84203, -140016, -134200, 78103, -95300, -82725, -216067, 64300, -307904, -48365, -373258, -268752, 239353, -58156, -57841, -147880, 109307, -327563, -170695, -20919, -163762, -20847, -84103, 878, -79343, -194152, -149308, -230213, -31842, -38990, -184152, -103965, -62933, -25145, -180205, 297848, -296963, 33560, -438451, -280597, -252534, 192516, -43579, 205999, -633264, -93681, -10057, -97730, 198034]
18743i484l0688n7866B43200H0740a07802r7166i3986r9905i4271A97092c98827
18731b74162r1646e4346m2792B5424J49534p4569b24310B49344a84745c2366A21705
18719c301q6455m49671i033A3513b69501G0196b37217A1625b1892P942A31773
18707i943k28232A82280a90310c7689C9983J76930e6252A01334d5105p9748A68806
18695D9550a70225A87022J08707a43262A76461H3910c62210A71133i6585A27663
18684A65124a24567o050A31879c08849j12709A43518M1965a65632B74028C4163
18673b60401f1921k39071d6818D4001b97019J04179A33796b70150d8613G6390
18662b26405J020L2989P7485I1019a26740B43165a56743o4124B41524o1830c045
$$ y = [-9484, -40172, -98038, 243200, 80740, -107802, -204968, -93986, -193891, -94271, 197092, -398827, -274162, -365808, -54346, -97138, 25424, 174958, 100389, -224310, 249344, -184745, -32366, 121705, -3301, -89756, -539427, -9033, 13513, -269501, 70196, -237217, 11625, -21892, -13950, 131773, -9943, -238175, 182280, -190310, -37689, 39983, 216913, -56252, 101334, -45105, -124853, 168806, 49550, -170225, 187022, 295729, -143262, 176461, 83910, -362210, 171133, -96585, 127663, 165124, -124567, -130617, 131879, -308849, -421558, 143518, 185483, -165632, 274028, 34163, -260401, -61921, -300992, -46818, 44001, -297019, -192840, 133796, -270150, -48613, 76390, -226405, -225385, -192396, -114911, 91019, -126740, 243165, -156743, -220867, 241524, 179694, -3045]
18650E1244M6964K43338f8343k1531D389d1615A0328g3864r598m9799q6690k07598
18638d27549a66622A58062a88694B27258c50961a12235C7877b76277a20913k92737
18628d13650a22164A81997B5694e52222b26454F827b57907A7233a72788F7239
18617b8647A78140d51492a523o1019m7135A3731c59534c7620j41140k0072B14578
18605a31970B3428g6893j2635A28569j2746K40514d5283F6261J69866d2524l31855
18594c74379f718C9491l06I295b11625E3682b73252a25968F4964b08882j87266
18583c96148g024k75924F7660q575M7877R986K3995a14287I1538A6643J93837
18572B10480G9648c25818c6015j7602F8153e6770m5068P640d287j71741A00511
$$ y = [51244, 98208, 341546, -68343, -89874, 4389, -41615, 10328, -73864, -83462, -133261, -219951, -427549, -166622, 158062, -188694, 227258, -350961, -112235, 37877, -276277, -120913, -413650, -122164, 181997, 25694, -552222, -226454, 6827, -257907, 17233, -172788, 67239, -28647, 178140, -451492, -1523, -62542, -109677, 13731, -359534, -37620, -178760, -198832, 214578, -131970, 23428, -76893, -89528, 128569, 115823, 356337, -45283, 66261, 236127, -42524, -374379, -6718, 39491, 39185, 9295, -211625, 53682, -273252, -125968, 64964, -208882, -396148, -7024, -282948, 67660, 59085, 106962, 116948, 140943, -114287, 91538, 16643, 210480, 79648, -325818, -36015, -53617, 68153, -56770, -101838, -94198, -4287, -176028, 100511]
18560b04126j45675a74843A03604R0057f9394A37239n5103g4106b0779k8916A39997
18548A06749a25002E1758b31918h7319r9943H4949a56976M9903A06442a52550
18537d26871a50907n1017C76795c2969k10094e0745a2694r7779o1311B07378c4780
18525F7425J0268J94919a362E829f8046l07882g2130m6066R865j03914E3395e3473
18512a51377n6394l5708L3998e1565a7955m0797b1798j79074c9563j7183A38919
18500A81508D5947K5419i2303j2811a4084l25284a11383e4746r854q8382d2883
18488b33922I9448J13758I4219h7184A68406O3826F7576P5326j9482J73414C1035
18476D03K2718J32251a16731A24161a28972A82332h776l58539J28791B60898H0487
$$ y = [-204126, -349801, -174843, 103604, 193661, -69394, 137239, 82136, -74106, -20779, -49695, 139997, 106749, -125002, 51758, -231918, -87319, -187262, 84949, -156976, -107073, 106442, -152550, -426871, -150907, -201924, 376795, -32969, -243063, -50745, -12694, -110473, -171784, 207378, -34780, 67425, 77693, 272612, -1362, 5829, -68046, -375928, -72130, -118196, -108331, -212245, 53395, -53473, -151377, -207771, -243479, -209481, -51565, -17955, -58752, -21798, -200872, -39563, -56746, 138919, 181508, 45947, 71366, -92303, -105114, -14084, -339368, -111383, -54746, -64600, -152982, -42883, -233922, 99448, 213206, 94219, -87184, 168406, 232232, 67576, 142902, 123420, 296834, 31035, 403, 23121, 155372, -116731, 124161, -128972, 182332, -8776, -367315, -238524, 260898, 80487]
18464A4994N1425j2009a09115n2002q2335B0912N4018a6838B73565A23008Q5113
18453B08121B5038a8353B11227B4518b84116C6042A4609N8353k1523L39182a59006
18441a01038j8881m3881B32247D9427a65622A25991L15610c421C44659f8415B40732
18429a76239p8337c8766I7617d63825d8064p4959A41739c46035i0987A34790A5239
18417a01787A1977R9363e3828n6879B42774D3289b07363q5316b4452B2769r338
18406A3431i308j30362e0208j87035a11619d8618j89703B24852G3012g9805C9380
18394a05807c5744B0810L07674j17781a19866C34334L3882l8975j18972b49525
18383b53935G004a10404A79024G6631a53180K1493p7598n7113A02760E036J17556
$$ y = [14994, 66419, 54410, -109115, -161117, -243452, 20912, 74930, -16838, 273565, 123008, 208121, 25038, -18353, 211227, 24518, -284116, 36042, 14609, 72962, 51439, 390621, -159006, -101038, -119919, -163800, 232247, 49427, -165622, 125991, 441601, -3421, 344659, -68415, 240732, -176239, -254576, -38766, 97617, -463825, -48064, -123023, 141739, -346035, -90987, 134790, 15239, -101787, 11977, 111340, -53828, -110707, 242774, 43289, -207363, -292679, -24452, 22769, 13431, -9308, -139670, -50208, -237243, -111619, -48618, -238321, 224852, 73012, -79805, 39380, -105807, -35744, 20810, 328484, 210703, -119866, 334334, 368216, 329241, 210269, -249525, -253935, 7004, -110404, 179024, 76631, -153180, -131687, -209285, -266398, 102760, 5036, 122592]
18372A22592a88050M8617N0249k41543J48850a8266j43957j17428J00298g6305
18361a59479H6680a24594I4779c27216I6077R0406b6764j42950B4810b90515A38445
18349A32877M2387a21186j93118F6294K43905b6208j2497B73932I926c8070B07339
18337B4874J9677b72034n3607A1605a16139c0684k30895A24076n8068J38126c01745
18325a4207j9214A02196h8924a1763A29958a42206A07441J4747A8098J13517I679
18313c23303E2068O3521g0084A62629d1861A06775A622b91794C06044f1687C2420
18301F3022d5772G6811c95141E3119b41971f2368A09825a76424d037j1748j15280
18290a31065A32193a81178H4458a65801A85556F953c3793l27216h9528B04677
$$ y = [122592, -188050, -139433, -89184, -330727, -181877, -18266, -162223, -279651, -179353, -76305, -159479, 86680, -124594, 94779, -327216, 96077, 186483, -26764, -169714, 24810, -290515, 138445, 132877, 175264, -121186, -314304, 66294, 310199, -26208, -38705, 273932, 9926, -38070, 207339, 24874, 44551, -272034, -325641, 11605, -116139, -30684, -261579, 124076, 66008, 204134, -301745, -14207, -33421, 102196, -88924, -11763, 129958, -142206, 107441, 122188, 18098, 131615, 9679, -323303, 52068, 115589, -70084, 162629, -41861, 106775, 1622, -291794, 306044, -61687, 32420, 63022, -45772, 76811, -395141, 53119, -241971, -62368, 109825, -176424, -4037, -15785, -131065, 132193, -181178, 84458, -165801, 185556, 6953, -33793, -361009, -89528, 204677]
18279B59215c09810b7816j44947F6537M1945b59631O3146A52707J38914g473m4166
18268e1639k0750C077a08795A11199b9600j94691J899h1890I5295a55202A3412
18256a37773E6338Q0847H944K55007k8226g4859G2036J11281J96131I576b59068
18244A62421b89084b1823A99382l9505G1150j879J32350A4574P8010o533M5857
18233A31908e4009B47098A6590a13956A11612a0465A03252a46771A13962b6779
18222e0602C73936H1416b09400K4373m2598A1178L7901i6194C44038g4060j08974
18211a83034O2889n6441G9557J3294a57014k67033a156j38047c562j440l4082
18200c9084A13755a36125C9739K85474a67191A58598K25244h4644A39631J2442
$$ y = [259215, -309810, -27816, -172763, 66537, 108482, -259631, -196485, 152707, 291621, -7473, -51639, -72389, 3077, -108795, 111199, -29600, -224291, -222392, -81890, 95295, -155202, 13412, -137773, 56338, 137185, 8944, 263951, 235725, -74859, 72036, 183317, 379448, 9576, -259068, 162421, -289084, -21823, 199382, 159877, 71150, 69271, 201621, 14574, 92584, 86051, 131908, -54009, 247098, 16590, -113956, 111612, -10465, 103252, -146771, 113962, -26779, -50602, 373936, 81416, -209400, -185027, -227625, 11178, 49079, -96194, 344038, -74060, -183034, -120145, -176586, 79557, 92851, -157014, -424047, -1156, -139203, -3562, -5002, -39084, 113755, -136125, 39739, 325213, -167191, 158598, 383842, -84644, 139631, 152073]
18190A52073b79869C6434l585a3686l1553A16463J74585a73793D7313b64479A6768
18178b42948G1400f3126j38640C7162b742E8181a84043F7355a70091k07107A11897
18166A15009g2043r210j31963n9786R4051L7788j19170J07087j3133e6620j06331
18155a62951k09101A45160a99274A94280a66564H5830R3467b4595k7586a7174
18144b68526A49389c6291G1575g4169q2636e3008I9314N9021d444B56254a91553
18132b70605J24837m3879j48232J27084I9853b55427c2346B16546c35276g346
18121e2878a7550D05213b75740B9289a0336o9837N811k08237b6005a051k9233
18110c0284A87994d6091j06423K6418F6495K71150a39706A48414l9093b08835
$$ y = [152073, -279869, 36434, 32849, -13686, -45239, 116463, 291048, -173793, 47313, -264479, 16768, -242948, 71400, -63126, -201766, 37162, -2742, 58181, -184043, 67355, -170091, -377198, 111897, 115009, -72043, -81253, -213216, -273002, -178951, -141163, -260333, -153246, -166379, -56620, -162951, -372052, 145160, -199274, 194280, -166564, 85830, 179297, -24595, -52181, -17174, -268526, 149389, -36291, 71575, -74169, -156805, -53008, 99314, 158335, -4444, 256254, -191553, -270605, -145768, -189647, -337879, -210795, 99853, -255427, -32346, 216546, -335276, -7346, -52878, -17550, 405213, -275740, 29289, -10336, -80173, -74362, -282599, -26005, -1051, -30284, 187994, -46091, -152514, -126096, 66495, 337645, -139706, 148414, 109321, -208835]
18099c36742d6084n5736C06342N4222c7046A37266L33861B1073P4575J1943e8805
18087b37216E7639A1530a51292l85606E8954N9282O1510C9490K48475I7395b7731
18075e7997J7396q766o3403a4495k43475N2003G9810C3472M8107M9263a59020
18063a01557k1594A01889C3098c64246J23003B41376C2595i4950k0953A81461
18052a67845D7984b00046C7827a10996K5505n5346j9897F2168f883p706A64342
18040G2845g1104I6010D5634c02867A92106a44993H4007B5766m311d04299E6641
18028g4928j09923C07915a64852C01796A11924j4286h5460D2096J2137J15160
18018A69393J32440A05598K1228a74048P1298B45945a47965i179C1936J88732
$$ y = [-336742, -46084, -101820, 306342, 360564, -37046, 137266, 471127, 21073, 95648, 107591, -58805, -237216, 57639, 11530, -151292, -536898, 58954, 118236, 179746, 39490, 287965, 97395, -27731, -57997, -40601, -49367, -112770, -14495, -257970, -205967, 79810, 33472, 81579, 130842, -159020, -101557, -123151, 101889, 33098, -364246, -241243, 241376, 32595, -94950, -115903, 181461, -167845, 47984, -200046, 37827, -110996, -85491, -140837, -160734, 62168, -6883, -14589, 164342, 72845, -71104, 96010, 45634, -302867, 192106, -144993, 84007, 25766, 21455, -404299, 56641, -74928, -184851, 307915, -164852, 301796, 111924, 97638, -85460, 42096, 54233, 169393, 301833, 105598, 126826, -174048, -102750, 245945, -147965, -9179, 31936, 220668]
18008B20668a19539d5057A3430N7830C5364e3459p0767n981A72936g4229F4138
17996a11510C00489A8534J1598f7362A02290D8031a2941k46362a0465C79353a63264
17984a56989a5024B35941b21983H049P2003a63945A66046K1395F8023J63509f3491
17972D4992d4922q2281A9201p733N634Q761a92367K1907D37616F9527a37085j57792
17960b94877e3289I8202C3709O8051b73163b8967A81512B135a18605a4806k30543
17949b45349a7020A55350c6887A3051d7918j19629F2679L0268J03773M0726a33785
17937B33570C9507J51752B9351J72815b13932i740j85626B53789B7791J53270
17927A81061H1900a12075I3717a73645B48197p3560q3484g6424H7088P7614K8156
$$ y = [220668, -119539, -45057, 13430, 71260, 35364, -53459, -124226, -130207, 172936, -74229, 64138, -111510, 300489, 18534, 30132, -67362, 102290, 48031, -12941, -259303, -10465, 379353, -163264, -156989, -15024, 235941, -221983, 8049, 80052, -163945, 166046, 187441, 68023, 231532, -63491, 44992, -44922, -127203, 19201, 11468, 17102, 25863, -192367, -170460, 437616, 69527, -137085, -294877, -53289, 98202, 33709, 101760, -273163, -28967, 181512, 2135, -118605, -14806, -245349, -17020, 155350, -36887, 13051, -47918, -167547, 62679, 92947, 196720, 237446, -133785, 233570, 39507, 191259, 29351, 202166, -213932, -9740, -195366, 253789, 27791, 181061, 81900, -112075, 93717, -173645, 248197, 174637, 91153, -76424, 87088, 164702, 192858]
17916A92858k6199a12946j2382C34601B574g965p1694l8733I750K53943j19701
17905A43992H152Q0079M5013K15974j72391c29259B31467A11621D7735K13230
17895B60965d4944l89j80057D5362j7196a20168o5950b9950b571j35875B72214
17883E7570e6284q6449q3152P3510n202c7478D7537J94514H31K38073C208J60444
17871A63652m8725N033K0269b59597a19492H760K5198c11103D08503d3925r9747
17860a43672L9332A71568a23765B76677G3529b65640p1226F5825c25765D19207
17849I9387J19376c32532h826A54118j9672F617J07391M7282L7766l9535b85192
17837a47334B9280j4408K5837c23418e3062k07064b5644A70056h995C00199a3327
$$ y = [192858, 166659, -112946, -125328, 334601, 2574, -7965, -79659, -118392, 9750, 263693, 143992, 8152, 88231, 133244, 349218, 176827, -329259, 231467, 111621, 47735, 260965, -44944, -45333, -225390, 45362, 28166, -120168, -186118, -29950, -2571, -138446, 272214, 57570, -56284, -142733, -225885, -152375, -157577, -37478, 47537, 242051, 831, 238904, 3208, 163652, 114927, 119960, 140229, -259597, -119492, 8760, 33958, -311103, 408503, -43925, -143672, -104340, 171568, -123765, 276677, 73529, -265640, -336866, 65825, -325765, 419207, 99387, 218763, -332532, -8826, 154118, 134446, 6617, 114008, 161290, 199056, 159521, -285192, -147334, 29280, 14872, 40709, -323418, -53062, -260126, -25644, 170056, -8995, 300199, -13327]
17825H1394h0515i258B61056B4968J77753a93692k5482D64332e5850k75886J25635
17814b06101R6449H0133a59758C9029K47582r9747J24630a79141K7124A67688
17803b5542A0892K69618A18437a43321B02165N2753J52342F0i5776k02298B67747
17791B73148A9480M4077a51623A80024d394J874A0905a4411j68955A18210g3670
17779C34262C3070J97391M3562e6736A40546d6807A0002a49931A34098K40829
17769C74927D9814Q2933N4912B4124Q6667J0663l5718L25567c5984n0199c1503
17757B79254E8604i0075F3276h4557A59142a94959A83830D1335a77610C6009a46363
17745B45981N6451c2426j25327A97387E0771J27907B9339e2369C39610C8705b00944
$$ y = [81394, -80515, -9258, 261056, 24968, 202721, -193692, -219174, 464332, -55850, -331736, -206101, -109652, 80133, -159758, 39029, 286611, 186864, 311494, -179141, -152017, 167688, -25542, 10892, 280510, 118437, -143321, 202165, 254918, 407260, 60, -95776, -298074, 267747, 273148, 19480, 63557, -151623, 180024, -4394, -2520, 10905, -14411, -183366, 118210, -73670, 334262, 33070, 230461, 274023, -56736, 140546, -46807, 10002, -149931, 134098, 374927, 49814, 132747, 187659, 24124, 110791, 121454, 85736, 411303, -35984, -86183, -31503, 279254, 58604, -90075, 63276, -84557, 159142, -194959, 183830, 41335, -177610, 36009, -146363, 245981, 302432, -32426, -157753, 197387, 50771, 178678, 29339, -52369, 339610, 38705, -200944]
17733b21259a9362A53078a0774A48865K6964L5000P839F4547J14113J12833r2142
17722A99351m9856D9004d5837k17295a16875A52090n4332K24750e6237C06043
17711B950b4082A2086a61851g8582B4156a4388G4421M3380o082g0724B18451E1715
17698A32334o1114O5909j1740J0809i5213F2130J86141I519a65816A2306h9205
17686a15438B45662b56836b9646k01121a03866k08506D54981a45974B20720n1578
17676A69142j3968j1296f6731F0934a32601L6001j18953C4582M331l536N413K20474
17664B61264F9811k8339a67661F3286J9314N4309o1777L25769h3706r0214H0469
17652e6421A76930f0391A29231N4005a4323A10798M1381L9435l3944K98573a6823
$$ y = [-221259, -19362, 153078, -10774, 148865, 175829, 210829, 218668, 64547, 178660, 291493, 199351, 149495, 49004, -45837, -263132, -116875, 152090, 97758, 322508, -56237, 306043, 2950, -24082, 12086, -161851, -78582, 24156, -14388, 74421, 117801, 111719, -70724, 218451, 51715, 132334, 71220, 137129, 125389, 136198, -95213, 62130, 248271, 9519, -165816, 12306, -89205, -115438, 245662, -256836, -29646, -230767, -103866, -312372, 454981, -145974, 220720, 169142, 155174, 143878, -66731, 60934, -132601, -96600, -215553, 34582, 38913, 35377, 40790, 261264, 69811, 41472, -167661, 63286, 82600, 136909, 75132, 400901, -83706, -173920, 80469, -56421, 176930, -60391, 129231, 183236, -14323, 110798, 152179, 191614, 157670, 456243, -16823]
17640A9850m159i2399H0425g437r6123A95747C7318a26483N2165B91854L5631
17629C27485L0897a43079B84294n0735A6820N42779a32435C11510a72409A6835
17618D30333n2241p6912e6229j80089A13315l3161K25697a194k57626f6300p0239
17607a36539B27352b10271B45298n3491a1536r11A07890b5837r444A89448h2320
17595A56954l2869O9846L1753J29686G7334L548a5975B27157n3200l697a08888
17583H356Q6052J64795J9766l9163O8489j09676G2647M3659P8857P9512A14980
17571A26863a02745a2740B09832J1371f5513A14509j3175K39209m9679Q1353j42728
17560B29489J77245b34719B27116a17579a4973D57160a90146A33070c8021E38124
$$ y = [19850, 15691, -92399, 80425, -7437, -103560, 195747, 37318, -126483, -74318, 291854, 327485, 358382, -143079, 284294, 233559, 16820, 559599, -132435, 311510, -172409, 16835, 430333, 378092, 301180, -56229, -236318, 113315, 80154, 305851, -1194, -258820, -66300, -136539, 227352, -210271, 245298, 191807, -11536, -12447, 107890, -25837, -35281, 189448, -82320, 156954, 124085, 193931, 225684, 355370, 77334, 80882, -15975, 227157, 173957, 170260, -108888, 8356, 94408, 259203, 278969, 239806, 308295, 198619, 72647, 116306, 195163, 274675, 114980, 126863, -102745, -12740, 209832, 221203, -65513, 114509, 101334, 340543, 290864, 372217, 229489, 406734, -234719, 227116, -117579, -14973, 457160, -190146, 133070, -38021, 538124]
17549a27267E1902J02481J8902A8340K30581I0244J04011A5982O5827P2882E936
17537A84693j3852O9147q1818K0883j5376l2947q87A3389K61004J23840j224k0958
17525C76051a20133G7241p027J93357G750e3701B33920a5839A5759J60133J95127
17514C71019J81681j42762K6965I8036O81541K25471j44215k26475K10898k35050
17504F10206j20115B18355J38225Q624J01510A26354L94650N3853m509m1666J48816
17493F77498L5439j69737K55264q678k66260O2550j54338k07794M428b2803F55184
17481D11939I8308J63815H7452O02831A87627J79003D611M25382j72010j24158
17471A33825K78424j4276j98661l6155J29172A11228J32627J362r6664P188K90970
$$ y = [-127267, 51902, 154383, 173285, 18340, 248921, 90244, 194255, 15982, 81809, 154691, 5936, 184693, 170841, 239988, 158170, 179053, 163677, 130730, 129843, 13389, 274393, 398233, 397009, 376051, -120133, 77241, 70214, 263571, 7750, -53701, 233920, -15839, 15759, 175892, 371019, 552700, 409938, 436903, 98036, 779577, 1005048, 860833, 634358, 845256, 610206, 490091, 218355, 356580, 365204, 466714, 126354, 521004, 574857, 570348, 528682, 677498, 712937, 543200, 798464, 789786, 523526, 586076, 431738, 223944, 228372, -22803, 655184, 411939, 98308, 262123, 87452, 690283, 187627, 366630, 4611, 429993, 257983, 133825, 412249, 397973, 199312, 163157, 292329, 111228, 243855, 245217, 148553, 155741, 446711]
17460D46711j92449l8462b8773A52856C3137K7895J7060L31047p1551p3271P3270
17449C37587K159p251O4312A38450g4567A33217J17286C6146K16695J86427j33704
17438C05564F2779K93173K99485G6281J1715J01693Q4243J16245p9419J44701
17428D55459K44420A95896O4597K4034J83545L9566k03875a71609B02987p3914
17418A29073L79419j64475j02999n0884K20295L4396A61309K62619a11313H8242
17407B62718I1368J74615Q6540A15891L76383K35137A48159k5597M08728B52414
17396D06247p8747j3261A12163a64263G4471J52728J98938P2968k39115K08852
17386D68842j43100r7149A01704b6144B75461m5705J46750b07771D14465A82717
$$ y = [446711, 254262, 215800, -28773, 152856, 33137, 61032, 78092, 409139, 337588, 264317, 337587, 339746, 332495, 396807, 138450, -74567, 133217, 250503, 36146, 252841, 439268, 305564, 62779, 355952, 655437, 76281, 87996, 189689, 273932, 390177, 310758, 455459, 699879, 195896, 260493, 284527, 468072, 507638, 303763, -171609, 202987, 129073, 508492, 344017, 241018, 190134, 410429, 444825, 161309, 423928, -111313, 88242, 262718, 91368, 265983, 352523, 115891, 492274, 727411, 148159, 122562, 531290, 252414, 406247, 327500, 314239, 112163, -164263, 74471, 227199, 426137, 499105, 259990, 468842, 325742, 228593, 101704, -26144, 275461, 229756, 376506, -207771, 414465, 182717]
17375D04519K38528B04429L06371j00929B762a03993E0421K06871A00605J10958
17365B11563p2944C8878Q6854L38354e9030j79468C77896j39355J6264K40852
17355D95657H881O5895L20945A95097l2553K3024M59218A17523c1186D32770K11240
17344F44010B78913Q6633R4970B28376r2496L15266A4109M70512A42252d5529
17333C68589J33512r4426L6581J09787H4801K8999N1135a4840E9110K60755j25682
17322A94183J59719E7463a4326E74760k60935L1599p4008a46336C52811k3609
17312C29202k5223I860J32899M13513k67387q4671N5064L00075A89995J44029
17302C34024D8976M93499A33064K79757D8498R0190J68657j20592n1717g1522
$$ y = [404519, 643047, 204429, 510800, 409871, 2762, -103993, 50421, 257292, 100605, 211563, 138619, 38878, 125732, 464086, -59030, -238498, 377896, 238541, 254805, 495657, 8881, 74776, 395721, 195097, 162544, 185568, 644786, 117523, -31186, 432770, 644010, 278913, 365546, 460516, 228376, 135880, 451146, 14109, 484621, 142252, -45529, 368589, 502101, 407675, 444256, 554043, 84801, 113800, 164935, -14840, 59110, 319865, 194183, 353902, 57463, -14326, 574760, 313825, 345424, 271416, -146336, 352811, 329202, 303979, 9860, 142759, 556272, 288885, 204214, 259278, 559353, 189995, 334024, 48976, 542475, 133064, 412821, 48498, 138688, 307345, 186753, 135036, -71522]
17291A04363C5398K02117i810C76483j04358n9292n4427o7400J75151J01343k7995
17280C39505m5957K06427A28018J16123J00700A19612L65348l6220m8458j59210
17270B41072m2543K54565o9630A89325O2218A05980N10432j26508J19030B67548
17259B72191m3291A01825O4210L27427A88840J57158j1956n1919L89569i3066
17248B46058j08878J30186P5100G8672L26135I5416J68414L00692j10471K1606
17238D75657j99573J48940j80693e3562C02412r8829N3864b65543D03479j23334
17228B80145L73270b8017B93930E554M20391j46024j6954K53285G7713L56509
17218D34222N8188r7112j23001J23982j84455L13749k07897K12772j91384B9915
$$ y = [104363, 35398, 237515, -9810, 376483, 272125, 212833, 158406, 91006, 266157, 367500, 339505, 293548, 499975, 128018, 244141, 344841, 119612, 484960, 448740, 400282, 241072, 198529, 453094, 383464, 189325, 251543, 105980, 616412, 489904, 608934, 267548, 272191, 228900, 101825, 166035, 493462, 188840, 345998, 334042, 282123, 671692, -93066, 246058, 137180, 267366, 342466, 78672, 404807, 95416, 263830, 564522, 454051, 475657, 276084, 425024, 244331, -53562, 302412, 203583, 257447, -265543, 403479, 280145, 653415, -28017, 293930, 5554, 425945, 279921, 262967, 516252, 77713, 434222, 492410, 395298, 272297, 396279, 211824, 525573, 317676, 530448, 339064, 29915]
17207C93325K56133l19868J56200A71755O8012K80755p2247q1491j8242k0287
17197C28255L7300J94894q2381o0158K05382B34979K217e4267D28859o914J0294
17186D32239j1134j44805M0668K42561B07717N2656K20185A52363L156K36313
17176C91832L44333k27008j56097j678N2860k00109L12521j26437O90j01676E4603
17164C09379k7076J00426R2031j99026r5398J77050K03434j94212m9402l6435
17154B80771J36779j88590m8682K23910j7461q3171M5859r5631M11163B45030
17143C82467J54426k41560K53573O1405k22518N4151M3085K3107j39597L31173
17133F99712r3658p0509r5053Q5827Q6123A73086J63242P9036R4096j24409J69246
$$ y = [393325, 649458, 329590, 485790, 171755, 239767, 520522, 448275, 366784, 348542, 328255, 365555, 560449, 478068, 417910, 623292, 234979, 237196, -54267, 428859, 421945, 432239, 421105, 276300, 316968, 559529, 207717, 260373, 480558, 152363, 155519, 391832, 736165, 509157, 353060, 351382, 404242, 204133, 516654, 390217, 390907, 289231, 54603, 309379, 282303, 382729, 474760, 275734, 180336, 357386, 560820, 366608, 317206, 280771, 417550, 228960, 180278, 404188, 386727, 303556, 349415, 253784, 664947, 245030, 382467, 536893, 295333, 548906, 610311, 387793, 441944, 485029, 508136, 368539, 699712, 606054, 535545, 440492, 526319, 612442, 173086, 336328, 415364, 509460, 385051, 554297]
17122E54297j25998M4294J2484J70506k34655R9014j57679l1654q413M9362J17816
17111D89374l7771M4887J15951j68468l7017K07240k35330K56142j82160K29107
17101F81955q4207L2758r9614J47492k21112L83155J1931C27428R8518K63024
17091F88970k79227K88957l29906A11634K50365K62079j78089K73104L299N985
17081G28377k12295R0130P9280Q1088N0614j30756q6977j24638L19262K18037
17071A012122D52834O14888l91074L9452A65977M05575j61544L55538O5207m01185
17061D29568L69344j60533M3101k48487r121L11570j21781K00550k00491P7121
17051F90841l7056j52675K50883k49630K66964J43409k88711j66940L75219j13817
$$ y = [554297, 428299, 472593, 485077, 655583, 420928, 519942, 362263, 330609, 322196, 371558, 489374, 451603, 496490, 612441, 443973, 406956, 614196, 378866, 635008, 452848, 681955, 597748, 630506, 530892, 678384, 457272, 840427, 852358, 327428, 425946, 688970, 409743, 698700, 368794, 111634, 361999, 624078, 445989, 719093, 722392, 728377, 516082, 606212, 685492, 766580, 817194, 686438, 599461, 474823, 794085, 1012122, 452834, 1067722, 676648, 716100, 165977, 571552, 410008, 765546, 830753, 429568, 798912, 638379, 681480, 432993, 423872, 735442, 613661, 814211, 613720, 690841, 653785, 501110, 751993, 502363, 769327, 912736, 624025, 457085, 832304, 718487]
17041G18487J26161j60550L28003l96537K47984K88264m43463K66017k68670j79043
17031E26653K59351L7248k87464K14544M0163J51026k7788k78620R4451N6570
17021G86134M58153k24214l58150L29600O9213m38832M786L62452k22876K95336
17011A061602J47520r5339m79726J63512k34770L12982q5892K9942J88399o2087
17001I46143q1057K43277j70610m7074j66013k5020K85262K36484k16068l28743
16991F76581J65632K72006j81819o9584l2223J94859K01761l69742K78279J20936
16981A256686j9790l89080n7427L90375J13945l54949K07939j55969L56076J28654
16971A476460n63125K16377L18065l26166l2064r2274L06041j6753K542o0915
$$ y = [718487, 844648, 684098, 1012101, 615564, 863548, 1151812, 708349, 974366, 705696, 526653, 786004, 823252, 535788, 750332, 790495, 941521, 913733, 635113, 729564, 786134, 1244287, 1020073, 661923, 991523, 1060736, 621904, 626690, 989142, 766266, 1061602, 1209122, 1113783, 634057, 797569, 562799, 875781, 789889, 819831, 1008230, 946143, 865086, 1108363, 937753, 890679, 724666, 699646, 984908, 1221392, 1005324, 676581, 842213, 1114219, 932400, 862816, 830593, 1025452, 1227213, 857471, 1135750, 1256686, 1236896, 847816, 790389, 1180764, 1294709, 939760, 1147699, 991730, 1347806, 1476460, 913335, 1129712, 1447777, 1121611, 1089547, 997273, 1303314, 1286561, 1289103, 1228188]
16961A228188j48946L84111k09902j62216l6180P4814L27676l97474K74794K45257
16951A580122l20940j25187K50399J75362l48691L96853j76878J32251l75334
16942A187957J62127J20871K9344L1286j19741K5462k7471J27467j07372N64267
16932A994197k54510l52391K18321J1038k21420L95375l46222K03483j84372L83340
16922A846839j48337Q3463m3677l6896R809R4913m013J52205j1245J1810k78645
16911A676226K27353j00440Q2388J71317j20645J36083j11161J17339N0883j37889
16901A991454m0805L11107m11312J10841K08134K62572j75377j78547R0450L14885
16891B483402O6645l78074N6419K20881K7363L5630J73223q3199q6066k08281
$$ y = [1228188, 1079242, 1463353, 1253451, 1091235, 1055055, 1129869, 1457545, 1060071, 1334865, 1580122, 1259182, 1133995, 1384394, 1559756, 1211065, 1607918, 1431040, 1563291, 1187957, 1350084, 1470955, 1500299, 1531585, 1411844, 1437306, 1409835, 1537302, 1429930, 1994197, 1739687, 1387296, 1605617, 1616655, 1395235, 1790610, 1444388, 1647871, 1463499, 1846839, 1698502, 1781965, 1738288, 1701392, 1711201, 1806114, 1802101, 1954306, 1943061, 1954871, 1676226, 1903579, 1803139, 1885527, 2056844, 1936199, 2072282, 1961121, 2078460, 2129343, 1991454, 1950649, 2261756, 1850444, 1961285, 2169419, 2431991, 2256614, 2078067, 2168517, 2483402, 2550047, 2171973, 2228392, 2449273, 2476636, 2512266, 2685489, 2602290, 2516224, 2307943]
16881B307943N8602J92301L37646j56158J37638o3987j42779L38883j34219J36496
16871C012366m21185O96927m26911J0749n1554K3488M21463l06713N6132K58067
16861C272829J027l15389Q20427n81903O04000l98021K70349k07442L98281m68711
16851C395447M75783l9192J06315r7339m9673m1055j32808L92998J57775K71001
16841D439252j15766k38533N44288K826j52047J20991J64806k8684L94658m39931
16831D691860K97646j48055L40347R1623j74175L69749J47620K5699l99238L31356
16821E574432J50133J25120k66479Q68332l33342M309L17877N7295r0565Q3533
16811F490645M70689K98127j65946L72501j43483j50205K43340L90016Q1279K36812
$$ y = [2307943, 2366545, 2558846, 2896492, 2740334, 2877972, 2813985, 2671206, 3010089, 2875870, 3012366, 2591181, 3288108, 2861197, 2871946, 2820392, 2843880, 3265343, 2958630, 3014762, 3272829, 3273856, 2958467, 3778894, 3196991, 3800991, 3402970, 3673319, 3465877, 3864158, 3395447, 3871230, 3832038, 3938353, 3841014, 3791341, 3750286, 3617478, 4010476, 4168251, 4439252, 4323486, 4084953, 4629241, 4632067, 4480020, 4601011, 4765817, 4737133, 5131791, 4691860, 4989506, 4841451, 5181798, 5273421, 5099246, 5468995, 5616615, 5642314, 5243076, 5574432, 5724565, 5849685, 5583206, 6451538, 6118196, 6122505, 6440382, 6497677, 6407112, 6490645, 6961334, 7259461, 7093515, 7466016, 7322533, 7172328, 7415668, 7805684, 7886963, 8123775]
16801H123775O834L59368l01813N60970J56408J67819J66600L41136K8334M31080
16791A0040511L78005r2222K63323M20053k12569P14541j25249O15030K28430
16782A2229853J39000J67274K42141M45325N62962J62507N60836L51551N04975
16773A5366424N2000P88767n2799P91554N61855L99460K86727Q27893M84848O76500
16763B0183229L14404R46676N28584N59147O83863L79585R14348R48386J135263
16754B6593485J084004O36868J278509R73960J090630J025400J100308J149991
16746C4933155J318880J428048J489135J593676J762785J587031K103914J306767
16738D7523391K241084K135509K015237K136691K716545K488402K660087K841365
$$ y = [8123775, 8130609, 8489977, 8188164, 8749134, 8905542, 9073361, 9239961, 9581097, 9609431, 10040511, 10418516, 10326294, 10589617, 11009670, 10797101, 11511642, 11386393, 12001423, 12229853, 12368853, 12536127, 12778268, 13223593, 13786555, 13949062, 14509898, 14861449, 15366424, 15418424, 16207191, 16154392, 16945946, 17507801, 17907261, 18193988, 19021881, 19506729, 20183229, 20497633, 21444309, 21972893, 22532040, 23215903, 23595488, 24509836, 25458222, 26593485, 27677489, 28314357, 29592866, 30566826, 31657456, 32682856, 33783164, 34933155, 36252035, 37680083, 39169218, 40762894, 42525679, 44112710, 46216624, 47523391, 49764475, 51899984, 53915221, 56051912, 58768457, 61256859, 63916946, 66758311]
16730F6758311K787138K953829L560319L250869L469683L410932L655660L989810
16722I3836551L883346L968882L630624M345113L899210L832068L928713L734038
16714A25058545L843658L476239L189890K697716K373582J871651J990136R43664
16706A45445081O55496P7162j90434r01380j232343j797561k182957k718526l010248
16697A34144290l147595l661278l454808l906105m003976m334756l709315l988239
16689A03938218m164407m143994l373691m283675l535046l560870l317353l276682
16681G4282500l488544k917652k633271l005716k380679k537801k876962j938916
16673E2502959k367880k042238j878391j608564k020814j742436j549619j303207
$$ y = [66758311, 69545449, 72499278, 76059597, 79310466, 82780149, 86191081, 89846741, 93836551, 97719897, 101688779, 105319403, 109664516, 113563726, 117395794, 121324507, 125058545, 128902203, 132378442, 135568332, 138266048, 140639630, 142511281, 144501417, 145445081, 146100577, 146177739, 145987305, 145085925, 143853582, 142056021, 139873064, 137154538, 134144290, 130996695, 127335417, 123880609, 119974504, 115970528, 111635772, 107926457, 103938218, 99773811, 95629817, 92256126, 87972451, 84437405, 80876535, 77559182, 74282500, 70793956, 67876304, 65243033, 62237317, 59856638, 57318837, 54441875, 52502959, 50135079, 48092841, 46214450, 44605886, 42585072, 40842636, 39293017, 37989810]
16665C7989810j509917j523190j410438j014608j245050r78220j051133j001700
16657B8255554j262550p69253l79163j285100r09751n86599l93057j184637o90035
16648B0795409k87209q17331p04603p38876J28277j152395l05860j83513p21148
16639A6012751l47727p27341J50535n54106k25350p02202l10527l77925J1124
16630A2929232n22582m88949k78274m34537q8735r5394l24555m05616n109l97599
16620I887882k42282j06417l88736m9458k59669j41038o7796l09037J2003j95826
16610H139626O4221k99395m67145J02045l9078m01883l4672l13921K37215o32586
16600F354427j47321K56071o5978N7190n23118J71448j85450j97127K13754l93336
$$ y = [37989810, 36479893, 34956703, 33546265, 32531657, 31286607, 30308387, 29257254, 28255554, 26993004, 26223751, 25844588, 24559488, 23649737, 23063138, 22670081, 21485444, 20795409, 20508200, 19690869, 18986266, 18247390, 18375667, 17223272, 16917412, 16733899, 16012751, 15665024, 14937683, 15088218, 14534112, 14308762, 13606560, 13296033, 12918108, 12929232, 12406650, 11917701, 11639427, 11204890, 11116155, 11020761, 10696206, 10290590, 10285481, 9887882, 9645600, 9539183, 9150447, 9100989, 8841320, 8700282, 8632486, 8323449, 8335452, 8139626, 8203847, 7904452, 7437307, 7539352, 7500274, 7098391, 7063719, 6749798, 6987013, 6354427, 6207106, 6463177, 6397199, 6454389, 5931271, 6102719, 5917269, 5720142, 5933896, 5540560]
16590E540560k92947k53941N35995j64975k08601n9166j77906j36157j29993L2502
16580D685371m0698m1284m808j67807k93822J08832q2442R099o5209J47455k32427
16569D022260j4599m75383K74577q6622k0282K0535j7649m99450L9062K28128
16559C470577j44828M9895p9981J33034l6975k43683K609j01474J4977l6294J05016
16548C132873l39073J47390m1032k92242K22035L7522P0826m27082K4098m072
16538B531243J76234l7084k0898m3585l79305L67477K41439n18906J63705j87862
16528B292458M08844n87505P0139O8143J94996m76576J59988j33856J91395j67815
16518B020211Q6538j21985j6970J25554j299l81097N0884N01145k70342n9965
$$ y = [5540560, 5247613, 4993672, 5529667, 5364692, 5156091, 5096925, 4919019, 4782862, 4652869, 4685371, 4644673, 4603389, 4598581, 4430774, 4136952, 4245784, 4163342, 4172441, 4107232, 4254687, 4022260, 4007661, 3532278, 3806855, 3720233, 3699951, 3720486, 3702837, 3203387, 3242449, 3470577, 3325749, 3375644, 3295663, 3428697, 3391722, 3148039, 3150648, 3049174, 3064151, 3027857, 3132873, 2793800, 2941190, 2900158, 2607916, 2829951, 2867473, 2938299, 2511217, 2535315, 2531243, 2707477, 2670393, 2649495, 2605910, 2226605, 2594082, 2835521, 2316615, 2480320, 2292458, 2701302, 2113797, 2183936, 2252079, 2447075, 1970499, 2130487, 1996631, 2188026, 2020211, 2106749, 1984764, 1967794, 2093348, 2092049, 1710952, 1761836, 2262981, 1992639, 1932674]
16508A932674p5547j42779o3129R4502r5336l4504K56978j37001k3882l3000p5728
16497A603248j80472P40134m19611l02613L67023l55753J40866n0280k93909J31005
16487A379638J77699M3701J7832K94761n52164k74710K93035K00557l26124J92443
16477A446668l340j6405j7811l0864J00542j27873k91432N52129l21792J76200
16467A466022m29921M55450k07118j45981L90958l71823K85352m71806L20702
16458A291835k79254J80607J50502j49937k98569N32771j01866m84544M68540
16449A310085j34712L28961k06829n37801J22456L05820j73247J26140q6636K01292
16439A255529j69523r4758J03985l79617L18097J10387j21706k96307L15746k28039
$$ y = [1932674, 1857127, 1714348, 1651219, 1745721, 1650385, 1615881, 1872859, 1735858, 1711976, 1678976, 1603248, 1422776, 2162910, 1743299, 1440686, 1807709, 1451956, 1592822, 1542542, 1248633, 1379638, 1557337, 1601038, 1618870, 1913631, 1361467, 1086757, 1379792, 1580349, 1254225, 1446668, 1443328, 1426923, 1409112, 1378248, 1478790, 1350917, 1059485, 1611614, 1289822, 1466022, 1036101, 1491551, 1284433, 1138452, 1529410, 1157587, 1442939, 971133, 1291835, 1012581, 1193188, 1343690, 1193753, 895184, 1427955, 1326089, 841545, 1310085, 1175373, 1504334, 1297505, 759704, 882160, 1187980, 1014733, 1140873, 1054237, 1255529, 1086006, 991248, 1095233, 715616, 1033713, 1144100, 1022394, 726087, 1041833, 813794]
16429H13794J12183M1538L5911K76634l70017l1851J01236k24523R1271J88405
16419A034581l24074K72252j46653m7461k2362J40608j56627J83234q5334q0063
16409G68101o0483K95415l77952J84494M319J62287k17308M64428m98150M4988
16399G70139L78187l85531L30546m36751O866K12014n9821m0657L34037E50173
16388I62801k3910o079j09650j04546k27705O06290j91281l1639j50141J06614
16378H30754J97565j93717J81323j71488j01256j25494L05739n8216l1827l12547
16368E20836L14789k21968N9209P9709m1045r7533J67112q8148M01120j15875
16358I78206k38821l47467K89206k85406J70389j72872M46340l31931O8223K47163
$$ y = [813794, 925977, 967515, 1003426, 1280060, 910043, 878192, 979428, 754905, 846176, 1034581, 710507, 982759, 836106, 788645, 766283, 906891, 750264, 933498, 848164, 768101, 707618, 1003033, 625081, 809575, 813894, 976181, 758873, 1223301, 725151, 770139, 1148326, 762795, 1093341, 656590, 663456, 875470, 815649, 774992, 1109029, 550173, 962801, 938891, 932812, 823162, 718616, 490911, 1097201, 905920, 874281, 724140, 830754, 1028319, 834602, 1015925, 844437, 743181, 617687, 923426, 865210, 833383, 520836, 835625, 613657, 672866, 752575, 711530, 613997, 781109, 692961, 1094081, 978206, 739385, 391918, 681124, 395718, 566107, 393235, 839575, 507644, 575867, 823030]
16348H23030J2970l83504J13479m8656q9206K83834l6261k44724K13504R3263
16338G37729l33784J13272J39677K6007r8537J14443r4905J3103q2093J76186
16328G11098k77948L09086j39575k5689k18727K03711j80444J15443n5275L12039
16318G53719C01503M04668l25413Q6675J16828k4008k37882A24062L49271B15619
16307B81218L05901R7572r7535j78306K25899j90136N08682l68575j78342R7860
16297E04238r8163A71116N41947k45702M5600m0793l7309J03127k27393m3035
16287B67558R6959L8140p8718k787L15569k48116K03434j61416b8273C85804M3070
16276D28874J5472n4398j05383K7540L38809k17584L1515J99032r1765k10618
$$ y = [823030, 836000, 452496, 565975, 517319, 428113, 711947, 675686, 430962, 644466, 737729, 403945, 517217, 656894, 682901, 584364, 698807, 603902, 617005, 534912, 711098, 433150, 742236, 602661, 576972, 358245, 561956, 381512, 496955, 441680, 753719, 301503, 706171, 380758, 467433, 584261, 560253, 322371, 124062, 473333, 215619, 281218, 587119, 684691, 587156, 408850, 634749, 444613, 953295, 584720, 406378, 504238, 406075, 171116, 713063, 467361, 512961, 472168, 434859, 537986, 310593, 267558, 364517, 402657, 323939, 321152, 636721, 388605, 592039, 430623, -28273, 385804, 428874, 444346, 389948, 284565, 312105, 650914, 433330, 464845, 663877, 572112, 361494]
16266C61494A61403K67190J65860k71385J04596J812r1345J66508P4058Q9774
16256F68471B32506K77484j16274K11358q6393j85052L51319l09448A67819O5165
16246B32984J20923j34388L85379j95959J30960J06331R0603j64075j56111l6750
16236C79897N2891D8731L05339r4168N3380N0839o4199r7987L11673A61573L17850
16225D79423n6093j77814K13047B21351F269L21250J00435l2061c1762C01200
16214D12456j77056L0864O4966O93b86496A50587m9209K64446K8575O1328j98729
16203B56998M3605J33371L1945A49805M81065B12660q3852C7916J74225L4861
16193B47002h738D38256j11348b6034H248J0783J38216n4536l2602K80548J63324
$$ y = [361494, 161403, 428593, 594453, 323068, 427664, 429476, 338131, 504639, 578697, 668471, 232506, 509990, 393716, 605074, 518681, 333629, 684948, 375500, 167819, 232984, 353907, 219519, 604898, 408939, 539899, 646230, 736833, 572758, 416647, 379897, 432788, 48731, 354070, 259902, 313282, 364121, 299922, 201935, 513608, 161573, 479423, 423330, 245516, 458563, 221351, 6269, 327519, 427954, 395893, -31762, 301200, 412456, 235400, 266264, 331230, 331923, -286496, 150587, 101378, 365824, 394399, 455727, 256998, 300603, 433974, 465919, 149805, 630870, 212660, 128808, 37916, 212141, 247002, -8738, 438256, 326908, -26034, 8248, 19031, 157247, 102711, 70109, 350657, 513981]
16182E13981A75532q7029j0136b27702C51680j60831M5146J90529j48966G7037
16171D96485A40551h8713C4972J84590k7445P2630P6518n0714l0100G7231J20831
16160A98062m1070K46135D961e65H7740K40397A40850b9030H5757J11553A7521
16148C28023A60053J84293k7753B3511K94416h552C63245J41049i7010F71867
16137B01239k7415k4967P0746I9177L4547E9721R8215O4004e5902J800A31878
16125A65554J88355p7828j04892K11210A23522J03254h8209A0292L26435h2537
16114F7519J58827K34461a64058B64664L758b33667b8531k3951h484A93209j1524
16103A81685k163l9536b2739C07629h7442B40200h1310K5574j26265C36192M4619
$$ y = [513981, 175532, 88503, 78367, -227702, 351680, 190849, 235995, 426524, 277558, 77037, 496485, 140551, -88713, 34972, 219562, 192117, 264747, 341265, 290551, 260451, 77231, 198062, 156992, 403127, 4961, -565, 87740, 328137, 140850, -29030, 85757, 197310, 17521, 328023, 160053, 344346, 316593, 23511, 317927, -8552, 363245, 504294, -97010, 671867, 201239, 173824, 148857, 219603, 99177, 133724, 59721, 157936, 221940, -55902, -54102, 131878, 165554, 353909, 276081, 171189, 382399, 123522, 226776, -88209, 10292, 336727, -82537, 67519, 226346, 460807, -164058, 264664, 268422, -233667, -28531, -52482, -8484, 193209, 181685, 179522, 139986, -22739, 307629, -87442, 240200, -81310, -55736, -182001, 336192, 380811]
16092C80811M6244A00907J95948N2633a54293h842C13431f435j13281A71214J58817
16081C30031A40272N3933b8883A97848K8192P316J0619J11723l1266p0651p9461
16070A74320N0636h2076A14817Q8814G3963K39341A48254a69937A72088a82800
16059a28487A58001l7280o0117J71827a65882C34185j01110q1291K8005E1903
16048G8499P8914D844J73055m3371f7723A29840Q9160A02393a184C39651b93915
16036a58383N0266A7605J98875G1893Q4166b8067k0807G2453f2479I2867Q7037
16025A79904N7105H5613f8800j89825C52769B2289J56359Q2270J35542R3289a64367
16013A6948e7664j13874j55590i6754B24052c2945O684C03848j23675k6316b61761
$$ y = [380811, 427055, 100907, 296855, 349488, -154293, -8842, 313431, -6435, -119716, 171214, 330031, 140272, 194205, -28883, 197848, 226040, 233356, 243975, 355698, 324432, 253781, 174320, 224956, -82076, 114817, 203631, 73963, 313304, 148254, -169937, 172088, -182800, -128487, 158001, 120721, 60604, 232431, -165882, 334185, 233075, 151784, 179789, 51903, 78499, 157413, 4844, 177899, 134528, -67723, 129840, 219000, 102393, -1184, 339651, -293915, -158383, -108117, 17605, 216480, 71893, 156059, -28067, -48874, 72453, -62479, 92867, 179904, 237009, 85613, -68800, -258625, 352769, 22289, 178648, 260918, 396460, 489749, -164367, 16948, -57664, -171538, -327128, -96754, 224052, -32945, -26261, 303848, 180173, 153857, -261761]
16001A41028M051N4771H1168e3110l1537C8048f1942m6809j0763B52364K1921
15990B74285p3360q3438L5527n614N1868d74299i7935B8496f3980j6363C05879
15978C45011j01674m5544r0841P4490L0783L1434L75092j35237R7113L08332K05727
15967A094686k82734B85266L7391A38653e5438C68250j10845c344D31806e6295
15956A65810m4761C3730P932J2785c25492c9093k3684A04054i7322k9422A6531
15944A26771C1735h0123B64074i4047I4134b30122C11547J9605a66812A01915
15933i5310l7688k9730D14049j12505a50358D4548H62f6553C83219A949P1156
15922G3105k7163K3032F878a98298A36911b92415B2110L95143a05609m2147L1930
$$ y = [141028, 145079, 199850, 81168, -53110, -84647, 38048, -61942, -108751, -119514, 252364, 274285, 200925, 117487, 153014, 147400, 199268, -474299, -97935, 28496, -63980, -80343, 305879, 345011, 243337, 197793, 106952, 181442, 212225, 243659, 618751, 483514, 580627, 888959, 1094686, 811952, 285266, 322657, 138653, -55438, 368250, 257405, -3344, 431806, -56295, 165810, 121049, 33730, 41662, 54447, -325492, -39093, -62777, 104054, -97322, -126744, 16531, 126771, 31735, -80123, 264074, -94047, 94134, -230122, 311547, 331152, -166812, 101915, -95310, -132998, -162728, 414049, 301544, -150358, 44548, 862, -66553, 383219, 1949, 73105, 45942, 68974, 6878, -198298, 136911, -292415, 22110, 417253, -105609, -147756, -115826]
15911a15826j02463J5775F9096d3098C3124a27434E7225f2980A95635R548a2011
15899a65112j19905a35729o9984M1381D8018b37270J16297j94540A40555E9821
15888b26119a9960D7900Q5747D9720j247a58614M1467f136D2721o488d4408B34043
15875c06199D7002O1985a92793B47014j00506a98062J5180P3082A0419a75802
15864C11268a60909f7552a4772k48192G2739K53154e7708C00758o6938B418K54364
15853B56782i005j80498B5401a50617B17272r5720L0713a56047A36368b10570
15842i5763C20997A2092a63475B32455F218a6181q5602E9728k0702b29497B0663
15830A11935e3346H6800a20323C44616j64355a80154A88038F1599J17029B4866
$$ y = [-115826, -218289, -202514, 69096, -43098, 33124, -127434, 57225, -62980, 195635, 205183, -12011, -165112, -285017, -135729, -205713, -164332, 48018, -237270, -120973, -315513, 140555, 59821, -226119, -19960, 47900, 133647, 49720, 48473, -158614, -117147, -6136, 42721, 36233, -44408, 234043, -306199, 47002, 108987, -192793, 247014, 146508, -198062, -182882, -109800, 10419, -175802, 311268, -160909, -67552, -14772, -262964, 72739, 325893, -57708, 300758, 233820, 2418, 256782, -9005, -189503, 25401, -150617, 217272, 121552, 152265, -156047, 136368, -210570, -95763, 320997, 12092, -163475, 232455, 6218, -16181, -101783, 59728, 39026, -229497, 20663, 111935, -53346, 86800, -120323, 344616, 180261, -180154, 188038, 61599, 178628, 24866]
15819e0787j24567o2201p0342e5196k10572a17088L1031j07416m6282J3514A55836
15807c04042A67988K73433c77872J39271E412f7636l0866q9725B56420o191E0171
15795b23684j07393a45674q6913B7711g9471J2876o8123L1960A02581J41108d6145
15783h028r8188H3645g6702D6978Q1706m3799b76628A53652M5862J38044c9394
15771b48718J7014g8533m3909N5935A29237R7210E3300K03293E0164a55419j33590
15760b89009f0065C3495J50263p0761m8303b0545A56429b47353d5493D7159a04755
15748f6802b6660q5968A96727g3600A56791K8344A4341a00259I9366B1722a6631
15736A13999b99392a31674A2456K03295o4088J45677r7173b24158O1346G0201
$$ y = [-50787, -175354, -237555, -307897, -55196, -265768, -117088, -86057, -193473, -239755, -226241, 155836, -304042, 167988, 441421, -377872, -238601, 5412, -67636, -98502, -188227, 256420, 250229, 50171, -223684, -331077, -145674, -232587, 27711, -79471, -66595, -134718, -102758, 102581, 243689, -46145, -8028, -106216, 83645, -76702, 46978, 128684, 84885, -276628, 153652, 199514, 337558, -39394, -248718, -231704, -78533, -122442, -66507, 129237, 226447, 53300, 256593, 50164, -155419, -289009, -60065, 33495, 183758, 112997, 64694, -20545, 156429, -247353, -45493, 47159, -104755, -66802, -26660, -112628, 196727, -73600, 156791, 185135, 14341, -100259, 99366, 21722, -16631, 113999, -299392, -131674, 12456, 215751, 151663, 297340, 200167, -224158, -162812, 70201]
15725b60267i4328A04884c5292j08544I137N6416b29173I3391J08844a65701k1739
15714a87440M4223j54587J10694A50739b55800d1019H6871g1558a2634n3692q0595
15703a46921C6584b25775A39020P8271D0903J46491c29960i4776n984A08348a8537
15691C03937q7167e4033A38341b06355k06275B11875E2459h2366o4485C2054J68906
15680B00960a43616E5568a05354M0302j01222A71320G883f2445J4912j18035P6261
15669h9307D5160L4828J80800f8342a354I3347b8526j87176K4223A63666l1483
15658A32183k0847n902q205N8953k9965M9659c64893F7225a8978l04077A88754
15646a70392R562B75370G7902a78656r743E1615a26055j8206M6093H7067b86493
$$ y = [-260267, -94328, 104884, -35292, -143836, 9137, 65553, -229173, 93391, 202235, -165701, -187440, -143217, -297804, -187110, 150739, -255800, -41019, 86871, -71558, -12634, -66326, -146921, 36584, -225775, 139020, 217291, 40903, 187394, -329960, -94776, -100760, 108348, -18537, 303937, 216770, -54033, 138341, -206355, -412630, 211875, 52459, -82366, -146851, 32054, 200960, -143616, 55568, -105354, -65052, -166274, 171320, 7883, -62445, -47533, -165568, -89307, 45160, 79988, 260788, -68342, -1354, 93347, -28526, -215702, -191479, 163666, 132183, 111336, 105434, 97229, 156182, 126217, 175876, -364893, 67225, -18978, -323055, 188754, -170392, -160830, 275370, 77902, -178656, -188399, 51615, -126055, -144261, -98168, 87067, -286493]
15634a3492H2523e68615R6340A47572a15947A25793a99831h4830A97318a7902
15623a46998f9132o2646d7134f781j47874A56273i6004a8443H0247A2274L8052
15612E0326c9480l178A15658L5373h6576A2367L61516c3713q1226B74937m5878
15601B29059a05079B00500C3640K06058h6879B60824A01549a09809A6750L28634
15591C45384A46193J81856K5599a64421N9841q2275F6775L8469a50995k28461
15581c79456A56098c49982R2397a20122k32442P2526A50539J12253J793A3188
15570a31780i848C12996h6812k12544a9820A25613J23954g5111l553C69342a8761
15558A8328a61270M5031A65191K4941a53123j04920f0064k16150D9343d798k18266
$$ y = [-13492, 82523, -568615, -472275, 147572, -115947, 125793, -199831, -84830, 197318, -17902, -146998, -69132, -131778, -47134, -6781, -154655, 156273, -96004, -18443, 80247, 12274, 50326, -39480, -42658, 115658, 151031, -86576, 12367, 373883, -33713, -114939, 274937, 229059, -105079, 200500, 33640, 239698, -86879, 260824, 101549, -109809, 16750, 345384, 146193, 328049, 353648, -164421, -104580, -186855, 66775, 105244, -150995, -379456, 156098, -349982, -257585, -120122, -352564, -280038, 150539, 262792, 264585, 13188, -131780, -9848, 312996, -86812, -299356, -19820, 125613, 249567, -75111, -78664, 369342, -18761, 18328, -161270, -116239, 165191, 190132, -153123, -258043, -60064, -276214, 49343, -4798, -223064]
15547b23064j39960I3225b04339e2757L237j44811D2087A9167i0424J4492j8501
15536i4433F1057K51227r8112A05113b90229E690L9119a03967j36661j8454R0366
15525a68716D4719j8447K29994c15658i7558E1149a47534A18969Q562b26723F9243
15513G4492g6001k02692C35137A1340b50085A81088a11197m6404b0301k14218
15503b34519D7805k2718L53422H0010J18054D7819M5634K68811a18957A94574
15492a9633A24314L4098F9338k7848K8271k5218L56600J75792j69284A64429P7781
15481B42210D6342d95k24760B27834a49386A66802j083J6227b17777B49262J0012
15470B59274a13000c4101C9564c5466k78069A65282j7208g1563A1427i6867B25025
$$ y = [-223064, -363024, 93225, -204339, -52757, -49520, -194331, 42087, 19167, -90424, -75932, -94433, 61057, 312284, 214172, 105113, -290229, 5690, 44809, -103967, -240628, -259082, -168716, 44719, 26272, 256266, -315658, -97558, 51149, -147534, 118969, 127531, -226723, 69243, 74492, -76001, -278693, 335137, 11340, -250085, 181088, -111197, -157601, -20301, -234519, 47805, 25087, 378509, 80010, 198064, 47819, 93453, 362264, -118957, 194574, -19633, 124314, 158412, 69338, 41490, 69761, 44543, 401143, 576935, 407651, 164429, 242210, 46342, -495, -225255, 227834, -149386, 166802, 165719, 181946, -217777, 249262, 259274, -113000, -34101, 39564, -35466, -313535, 165282, 148074, -71563, 11427, -96867, 225025]
15458D41279j32318o7378F4183J18498K2206a32906B7891Q955a83614H7486a14090
15446A70522e8188A16086K6526c0155l67116M1720F83534B4111c7104o4577E6656
15434b20058j042A43824J9287N9574G0805M60444B30684P5332Q6548L76351j7505
15423G51410L79347n33521k05941A71647L0732B6553R8374M05458B34581B8165
15412B88532a23505j20046b0779B39200a77883A46493c2194A68300a34300A49700
15401A21463h9188I3934a8995j21294A60976c7087A1715Q6439b8345j14103C80983
15389E00391A29502J82441a6470j67754F2100a74605A6389J13875C3848c4781
15378C27829c9212A9687L86761b86754A27316a53705B02802G8849a82877B98638
$$ y = [441279, 308961, 241583, 64183, 182681, 204887, -132906, 27891, 36846, -183614, 87486, -114090, 170522, -58188, 116086, 142612, -30155, -397271, -355551, 683534, 24111, -37104, -101681, 56656, -220058, -221100, 143824, 163111, 222685, 70805, 531249, 230684, 306016, 392564, 768915, 751410, 1130757, 597236, 391295, 171647, 202379, 26553, 124927, 530385, 234581, 28165, 288532, -123505, -243551, -20779, 239200, -177883, 146493, -32194, 168300, -134300, 149700, 121463, -89188, 93934, -18995, -140289, 160976, -37087, 11715, 98154, -28345, -142448, 380983, 500391, 129502, 311943, -16470, -184224, 62100, -174605, 16389, 130264, 33848, -34781, 327829, -39212, 19687, 406448, -286754, 127316, -153705, 202802, 78849, -182877, 298638]
15367B66431A10087Q7670b6263A01837h539k67618B39616j09319K01742d4667
15356D02047C3370L78031e3133a0105j27679A98880i5869A33295M1219a56953
15345C02032j5187j1144j2282q0658i3148a5239H7652K33240C9238J92165I1800
15333h5515B38839C7622J47022f4926m9189B33648N2898L69632B86487N2184j16450
15322B22221c1707G3768A2256f8333E39158d6640B22663a74260B63163A6085a12159
15310A36230a99105C36210a07973B41469K22805j78396d02593c10E2045A8006
15299C34444A7928c1366R587D7028K87168A16110J31485l4182P7238D8642O090
15288E4732B0301O3495M39381i8886C04213r6949a10409A22446O129d2621l3281
$$ y = [266431, 110087, 197757, -26263, 101837, -8539, -276157, 239616, 130297, 332039, -44667, 402047, 33370, 411401, -53133, -10105, -137784, 198880, -95869, 133295, 174514, -156953, 302032, 286845, 275701, 263419, 182761, -93148, -15239, 87652, 320892, 39238, 231403, 91800, -85515, 238839, 37622, 184644, -64926, -114115, 233648, 286546, 656178, 286487, 338671, 222221, -31707, 73768, 12256, -68333, 539158, -46640, 222663, -174260, 263163, 16085, -112159, 136230, -199105, 336210, -107973, 241469, 464274, 285878, -402593, -310, 52045, 18006, 334444, 17928, -31366, -21779, 47028, 334196, 116110, 247595, 213413, 290651, 48642, 54732, 20301, 83796, 523177, -98886, 304213, 207264, -110409, 122446, 128575, -42621, -75902]
15277g5902E740M072a4564A67509a999F0558B3080K72452c4892E6748c0167C90516
15264A06091J83953a11842q291A57287a25905C60705j08893a77698b8973j88263
15254b17236p7651f7324B05397K163a32349A06415E23a35278B62460g8263D47651
15242A74865K0824i5197L0688k91219B19150h638B22292f3029H6997L70233A12118
15230C93453N02221L21972M31563k47347M90522q64002B47532J72879K1103b16870
15219f1065F78828l33146a7753l5530B50853c19173C94818E7615K52213a80064
15208a8546l17483A28034K3283G4088a28024j25906g8565B40846P9430j10039
15198B10237I5809J52396n7002b31993C32253g2349A34087o2013a14322A50531
$$ y = [-75902, 5740, 9812, -14564, 167509, -1999, 60558, 23080, 295532, -34892, 56748, -30167, 390516, 106091, 290044, -111842, -120133, 157287, -125905, 360705, 251812, -177698, -28973, -217236, -294887, -67324, 205397, 207560, -132349, 106415, 523, -135278, 262460, -78263, 447651, 174865, 195689, -95197, -64509, -355728, 219150, -8638, 222292, -63029, 86997, 457230, 112118, 393453, 895674, 1217646, 1649209, 1401862, 1892384, 1028382, 247532, 420411, 441514, -216870, -61065, 678828, 345682, -17753, -53283, 250853, -319173, 394818, 57615, 309828, -180064, -18546, -336029, 128034, 151317, 74088, -128024, -253930, -78565, 240846, 320276, 210237, 95809, 248205, 191203, -231993, 332253, -72349, 134087, 72074, -114322, 150531]
15187C82243a14339B04687D819K18805f1592D7893h263B11492n8750F7143a63445
15175A0518h6335b57B7664J43353c3401A64561l9587K37566H0060Q6736n0856
15164A15940J57582P5582b02395a5204A78720K0556h7729A62542K06537B9843
15153h4307r6349B82331a5904D3389J70573C1204a22919C05976a63852g0316j5378
15142h5694B88510A21524L1392L5293d3045F1480K08152F3633M91647c255A67847
15130b079j04085B22743a45019b8409q1319A03768K08111A1177J49220K28309
15120C88706A73025D7545J35118n9198J49493D5870J34671D3514L46047j27100
15110B62461b3082C20660O949Q633J39266m1855Q4037A9090L26666R7566o365
$$ y = [382243, -114339, 204687, 4819, 223624, -61592, 47893, -8263, 211492, 152742, 67143, -163445, 10518, -86335, -257, 27664, 171017, -33401, 164561, 124974, 362540, 80060, 166796, 115940, 273522, 349104, -202395, -15204, 178720, 199276, -87729, 162542, 369079, 29843, -84307, -180656, 282331, -15904, 43389, 213962, 31204, -122919, 305976, -163852, -70316, -85694, 288510, 121524, 152916, 188209, -43045, 61480, 269632, 63633, 555280, -3255, 167847, -2079, -106164, 222743, -145019, -28409, -109728, 103768, 311879, 11177, 160397, 388706, 173025, 47545, 182663, 123465, 272958, 45870, 180541, 43514, 389561, 262461, -23082, 320660, 327609, 336242, 475508, 433653, 517690, 19090, 345756, 443322, 436957]
15099D36957a38675B28880p6767K21469j19166K1163A20411g4597q5850D8474
15088G7681j606d631H3795K9636d4104B57206j21458K9365l6457k3441k5839P6472
15076A55848g6955C8425K77350J71363j81259p6896r5811G153M02668I5301b5191
15064A94188k6087C1968J82303Q0380C6617M36063c885m209n7576A12965J44392
15053B57357p1800p5861L1299M37370k58257l5630L3208c1688m6085A01026B170
15041A75704K2988J20048a5870B31625P8271n2475f0756C32404j38236r1764L07709
15030D10113P0791I7786L87314R9520A26219O0851K74103j2609k17332P191Q453
15019B46876l9914J70576p1977p2313M07509j81611L77656m15593J81030M2219
$$ y = [436957, -138675, 228880, 152113, 373582, 254416, 275579, 120411, -74597, -160447, 48474, 77681, 76075, -4631, 83795, 113431, -44104, 257206, 135748, 165113, 128656, 105215, 79376, 155848, -76955, 38425, 315775, 487138, 305879, 228983, 133172, 7153, 409821, 95301, -25191, 194188, 168101, 31968, 214271, 294651, 36617, 472680, -3885, -8094, -65670, 112965, 257357, 185557, 109696, 140995, 578365, 320108, 284478, 317686, -31688, -77773, 101026, 2170, 175704, 198692, 318740, -15870, 231625, 309896, 257421, -60756, 332404, 194168, 102404, 410113, 480904, 97786, 485100, 584620, 126219, 187070, 461173, 448564, 231232, 238423, 246876, 206962, 377538, 305561, 233248, 640757, 459146, 836802, 421209, 602239, 644458]
15009F44458q5665P9033B80930J22887L22615k49960m6057N9189P4895n4962j35734
14998C73803j8743K14230j16555j67577K33408B30426J12100J71538j90149K69983
14988E93898m7681k52013J06402A21671M18890q2721k2530J10926m4699k45399
14978B56138m3128K84447r2934J63889o5696J1747J32761j90818j62318L07357
14968F01445K00522C67681K51397O4186j40094j3736n0407J94791r8608j45143
14958D30067A93839L52992K87220C15916R7914K87535B22776K90082m3607N9494
14948E28745k3887A24838L78236J49363B33560M8880N436J00276A62949R8895
14938B61844K09727j89431j35927L56865k9247j17239K63557M6945A36690m0640
$$ y = [644458, 558793, 637826, 280930, 403817, 726432, 476472, 430415, 489604, 564499, 509537, 373803, 355060, 569290, 452735, 285158, 518566, 230426, 342526, 514064, 323915, 593898, 546217, 294204, 400606, 121671, 540561, 457840, 435310, 546236, 501537, 256138, 213010, 497457, 404523, 568412, 502716, 514463, 647224, 456406, 294088, 601445, 801967, 367681, 619078, 683264, 543170, 529434, 479027, 673818, 575210, 430067, 193839, 546831, 834051, 315916, 413830, 701365, 222776, 512858, 469251, 528745, 504858, 124838, 503074, 652437, 233560, 282440, 287876, 388152, 162949, 261844, 471571, 282140, 146213, 503078, 473831, 356592, 620149, 667094, 136690, 96050]
14928I6050M14934O6568K7837J90376k70422j2516K56716B46204L81675p1257
14918E56622j98799J58887R4784K03893K50659K42497m69968R7934K66242K22243
14908A424994k67922M93541j03474j63972J03741q7627N10872l71052J00460K58539
14898A898100o41476J71492l01907M5409M1153D94612L89717n748l42178j93742
14888C42661r241P2028l2066j02239M50956k98555q0576k7691I4684K93100N2956
14877D40740J82074j75227j83890K76515M9843J19046k54708L58917C67552M28187
14867G95739M4764o5944j21898J13368K7363k59947L76800j82160j45744j97438
14857C84903M38664l60296K88446A85726K78046J46722B80793K10327L63094j09368
$$ y = [96050, 510984, 577552, 605389, 795765, 525343, 512827, 769543, 246204, 627879, 556622, 357823, 516710, 611494, 815387, 1066046, 1308543, 838575, 936509, 1202751, 1424994, 1157072, 1650613, 1547139, 1383167, 1486908, 1399281, 1910153, 1539101, 1639561, 1898100, 1256624, 1428116, 1126209, 1171618, 1212771, 494612, 884329, 878581, 536403, 342661, 333420, 405448, 373382, 271143, 722099, 423544, 342968, 315277, 94684, 387784, 440740, 622814, 447587, 263697, 540212, 590055, 709101, 454393, 813310, 367552, 795739, 840503, 774559, 652661, 766029, 793392, 533445, 910245, 728085, 582341, 384903, 823567, 463271, 751717, 185726, 463772, 610494, 280793, 491120, 854214, 744846]
14847G44846k67266N44349m55208L54999l51445k6534B62302K2058J36907N2403
14837D73670J40107j24679k12574L21933j47815L13943j28988B18990N435O96704
14827I21129j18060C81696K54491K72167J74476j150j42074k51093L41150l169
14817A026494j51296k45791J76481j87010R7258k33967j1264j42222K72878q3504
14807E18057J9690K48901o2677k62506J19396K8590N8004K72089n8540k70783
14797F10221K21808l26109q5750M57795k91190L45557m01701M33512l85845J97607
14787G75905O9747N4582j73348r300j59945j75681O4442K46578A67316K72138
14777D39454j1216L15400J97827k97943J22687J11377k20705Q0450l25726J39548
$$ y = [744846, 477580, 1021929, 566721, 921720, 570275, 543741, 262302, 284360, 421267, 473670, 613777, 489098, 276524, 598457, 450642, 764585, 635597, 218990, 224425, 921129, 803069, 381696, 636187, 908354, 1082830, 1081680, 939606, 688513, 1029663, 1026494, 875198, 629407, 805888, 618878, 716136, 482169, 470905, 328683, 601561, 518057, 537747, 786648, 723971, 461465, 580861, 609451, 667455, 939544, 881004, 610221, 832029, 505920, 420170, 877965, 586775, 932332, 530631, 964143, 578298, 775905, 845652, 900234, 726886, 717586, 557641, 381960, 446402, 692980, 167316, 439454, 428238, 743638, 941465, 643522, 766209, 877586, 656881, 737331, 411605, 551153]
14767E51153K56965C88036J48106K83175J72885j58427j4241J72782j88203k22248
14757E81865J51688J20766J3146j09624k09359K32932j20832N9785j32469J25643
14747G13541k77569L07379l3085l47r3604K5826r4542K08922j84796L12405l53626
14736E30504K18707l31460L63698l3459k5176R905k76124K37833M7745j57157
14726E85016J90368j91695K85207k71668l1575J54622J14596j26443J73644J23788
14716A005860l85769O5242K05389N81388k58081k80840O08556j68913K12673n1767
14706A533738l4525n13145m882L07557m82207K18019q0188J25368o2147j48451
14696H59137O7776n333k2975j96321K43413J18688J39475k29497K43309k32287
$$ y = [551153, 808118, 388036, 536142, 819317, 992202, 833775, 819534, 992316, 804113, 581865, 733553, 854319, 867465, 757841, 548482, 781414, 660582, 720367, 587898, 713541, 435972, 743351, 710266, 709919, 616315, 642141, 547599, 756521, 571725, 884130, 530504, 749211, 417751, 781449, 747990, 722814, 732719, 456595, 694428, 742173, 585016, 775384, 583689, 868896, 597228, 565653, 720275, 834871, 708428, 882072, 1005860, 620091, 685333, 890722, 1472110, 1214029, 933189, 1541745, 1372832, 1585505, 1533738, 1499213, 986068, 981186, 1288743, 806536, 1024555, 944367, 1069735, 1007588, 859137, 926913, 921580, 898605, 702284, 945697, 1064385, 1203860, 974363, 1217672, 985385]
14686I85385K57495K09258m591K40834l37620J34909k99478k7246J18348K08102
14676A485396l24834J48242l88603J67305j32548r813k40855K47894K13749k79263
14666H86670N3023L39895l17781k67613J64438k6642j81191K35924l9912J01405
14656I48216o6351k387J14741j63120L16990j0010k70537J3106L28005l1928r9371
14645A077354J65788l0663l83829K30389j88116M06033j270P5117j90579L16403
14635A476627j49965O9479j51246k09364J16284L25791j15888l3394k00200J1506
14625A139630M38813k58715M3364J62421k49319j26108K23601k74470L70322q5458
14615A384081Q5469k60123K05089j38577K30730j11692K01673j98318k3215l40121
$$ y = [985385, 1242880, 1452138, 1447547, 1688381, 1350761, 1485670, 1186192, 1158946, 1277294, 1485396, 1160562, 1308804, 920201, 1087506, 954958, 945145, 704290, 952184, 1165933, 886670, 939693, 1279588, 961807, 694194, 858632, 831990, 650799, 886723, 846811, 948216, 881865, 879478, 994219, 831099, 1148089, 1138079, 867542, 880648, 1208653, 1176725, 1077354, 1243142, 1212479, 828650, 1059039, 870923, 1276956, 1275686, 1350803, 1160224, 1476627, 1326662, 1396141, 1244895, 1035531, 1151815, 1477606, 1361718, 1328324, 1128124, 1139630, 1578443, 1319728, 1363092, 1525513, 1276194, 1150086, 1373687, 1099217, 1469539, 1384081, 1469550, 1209427, 1414516, 1275939, 1506669, 1394977, 1596650, 1398332, 1375117, 1034996]
14605A034996L63430J9638L22318J65356p25019K90554Q4181Q9300q2903J970
14595A563821m60216L70774k6767L65508k43231j97589J33223M47291l78877J58771
14585A732708o9640p447j16521K16872k51558J93532k15751J92641K07354j58388
14575A723802M1122J20179j65516L61959m02982K48982k9866j45745r510K61074
14565B003499O0177j3075r7095L9253R160j08152M17011j68302K41006k11143
14555B172339K01394J21332j06649p5648l2221K87370J44832p3427j9486L51389
14545B971225K24067m6777k66477L72842J60474M49343N37177J11467O70404Q51643
14535F035388J507108K448377L703043O108535J0411798L389714j3412052q166267
$$ y = [1034996, 1398426, 1418064, 1740382, 1905738, 1180719, 1471273, 1555454, 1644754, 1561851, 1563821, 1103605, 1474379, 1447612, 1813120, 1569889, 1372300, 1505523, 1952814, 1573937, 1732708, 1663068, 1655621, 1539100, 1755972, 1504414, 1697946, 1482195, 1674836, 1882190, 1723802, 1764924, 1885103, 1719587, 2081546, 1678564, 1927546, 1897680, 1751935, 1742425, 2003499, 2063676, 2050601, 1953506, 1992759, 2001919, 1893767, 2310778, 2142476, 2383482, 2172339, 2373733, 2495065, 2388416, 2312768, 2280547, 2567917, 2712749, 2639322, 2619836, 2971225, 3195292, 3148515, 2882038, 3254880, 3415354, 3864697, 4401874, 4513341, 5183745, 6035388, 7542496, 9990873, 13693916, 19802451, 30214249, 33603963, 20191911, 12025644]
14527A2025644m294901j903360n43174L11342j226004q45585m76221l58381l14021
14518B375339K15495k78268K19405k65032L0121l64559J08452R9469L75130Q3655
14508B599207J28215k16585j33827p1036k8036J96962J66422j9514l60644K84927
14498B546091j29679K98457r3407J25511L63357j72576J4319q1596K57141j0704
14488C116914K30471j39354k77305L01081j9373n7079K21390K5681m07140K30589
14478C225875M8247K23226L29736j18348K2341k69166j221N08626l33527M9141
14468C684930m3978O7592K84296Q9038l91889N00916J93824o9416j86514J97588
14458D326387n3309L23695j17626l17532N16342j98701J05848L2904K5607L67895
$$ y = [12025644, 7730743, 5827383, 5284209, 5595551, 4369547, 3523962, 3047741, 2689360, 2375339, 2590834, 2312566, 2531971, 2266939, 2297060, 1932501, 2040953, 2140422, 2515552, 2599207, 2727422, 2510837, 2377010, 2305974, 2277938, 2474900, 2641322, 2621808, 2261164, 2546091, 2416412, 2714869, 2621462, 2746973, 3110330, 2937754, 2952073, 2870477, 3127618, 3116914, 3347385, 3208031, 2930726, 3231807, 3212434, 3155355, 3376745, 3402426, 2995286, 3225875, 3274122, 3497348, 3827084, 3708736, 3731077, 3461911, 3460690, 3969316, 3635789, 3684930, 3640952, 3708544, 3992840, 4081878, 3689989, 4190905, 4384729, 4315313, 4128799, 4326387, 4273078, 4596773, 4479147, 4161615, 4677957, 4479256, 4585104, 4618008, 4643615, 5011510]
14448E011510j99445P2767J05185k12184J94406M8400J72009l37920M31044m33466
14438D852306M62688Q1524m8073j17527N08788j76178R9716Q8247K75626J71180
14428F198297j15555J84862Q9160l72479o1613M16152J19287L60944r662m5270
14418F764123o0355q16J47320j0790N82549q0472l7194J62253L35637k6281M04423
14407H180397l15067L88499m5484L98895j93737L51901L41622L68061m62236j8117
14397H994734M53704J16998j71146L0656K78702L72714k23830Q01570r8317L8668
14387A0594453K01981M1044L01079M01976k45482J29795J95788K32226j1978L58364
14377A2199246K91955L84007J07936K58315j2940J04183O02735j17155N78571
$$ y = [5011510, 4812065, 4884832, 4990017, 4777833, 4972239, 5020639, 5192648, 4854728, 5285772, 4852306, 5314994, 5396518, 5348445, 5230918, 5739706, 5563528, 5663244, 5751491, 6027117, 6198297, 6082742, 6267604, 6356764, 5984285, 5922672, 6338824, 6458111, 6819055, 6809393, 6764123, 6703768, 6702952, 6850272, 6839482, 7422031, 7341559, 7304365, 7466618, 7802255, 7775974, 8180397, 7865330, 8253829, 8208345, 8607240, 8413503, 8765404, 9107026, 9475087, 9012851, 8994734, 9448438, 9565436, 9394290, 9424946, 9703648, 10076362, 9852532, 10654102, 10555785, 10594453, 10796434, 10837478, 11138557, 11540533, 11295051, 11424846, 11620634, 11852860, 11840882, 12199246, 12491201, 12875208, 12983144, 13241459, 13228519, 13332702, 13935437, 13818282, 14396853]
14368A4396853R1352J59836K02537O60639J30227K64606L71014N78841N3243L05964
14358A7215112K88350K93810K31374K05455L46294N99101N53630j08617J142273
14349B0766782p3768R75460q1743O15154M45870N40039N22178P03003L63949M43823
14339B5220747M27680P45956O58941L55150P37361R92634O50338O86377P62044
14330C1237228M93630J180564J018405Q47049J019830O78882J072932P14074J558041
14321C9820635J165528J219662J179686J654681Q90717J480161J948856J130407
14313E0490333J445427J805837K067666J664751J709087K427427J987821K592230
14305F6190579K365107K287117K732255L052792K661707K849664L371020L336664
$$ y = [14396853, 14488205, 14648041, 14850578, 15511217, 15641444, 15906050, 16277064, 16855905, 16909148, 17215112, 17503462, 17797272, 18028646, 18234101, 18580395, 19179496, 19733126, 19624509, 20766782, 20693014, 21668474, 21586731, 22201885, 22647755, 23187794, 23709972, 24412975, 24776924, 25220747, 25648427, 26394383, 27053324, 27408474, 28145835, 29138469, 29788807, 30475184, 31237228, 31730858, 32911422, 33929827, 34776876, 35796706, 36475588, 37548520, 38262594, 39820635, 40986163, 42205825, 43385511, 45040192, 45930909, 47411070, 49359926, 50490333, 51935760, 53741597, 55809263, 57474014, 59183101, 61610528, 63598349, 66190579, 68555686, 70842803, 73575058, 76627850, 79289557, 82139221, 85510241, 88846905]
14297H8846905L360001M268727L881990M218232M384525N285215N177739N597172
14289A25020506N660104N868146O599025O690760P434321P864472Q266044Q497531
14281A81900909R323712R726343J0222148J0886795J1468998J1707919J2879552
14274B58116376J3286374J3755923J3839990J4395502J4626399J4610180J4682332
14267C57313076J4623942J3820560J2779443J1966512J1366517J0532254R753033
14260D42155337Q891021Q149116M618119K136861J582547K183921j137993o173953
14252D62404976n303990n383781q742687j1601321j2648101j2317221j3435036
14245C92972839j4631233j4018053j4155070j4084804j4804024j2894007j3807995
$$ y = [88846905, 92206906, 96475633, 100357623, 104575855, 108960380, 114245595, 119423334, 125020506, 130680610, 136548756, 143147781, 149838541, 157272862, 165137334, 173403378, 181900909, 191224621, 200950964, 211173112, 222059907, 233528905, 245236824, 258116376, 271402750, 285158673, 298998663, 313394165, 328020564, 342630744, 357313076, 371937018, 385757578, 398537021, 410503533, 421870050, 432402304, 442155337, 451046358, 459195474, 463813593, 465950454, 467533001, 469716922, 468578929, 462404976, 457100986, 451717205, 442974518, 431373197, 418725096, 406407875, 392972839, 378341606, 364323553, 350168483, 336083679, 321279655, 308385648, 294577653]
14238B94577653j3124744j2746088j2430535j1418822j0785896j1817963j1583181
14231B10670424j0482758j0112264r552818q434128q284532p744129p572307o771476
14223A41716012o078193o244433n494150n809492m865429m983840m335486l979488
14215I9925501m202282l673291l968510l318700l169212l038559k740054k841638
14207G2973255k747124k337368k237632k705793j568036k096041j756837k102392
14199E5422032j455397j435100j892730j695402j329052j515570j001019j130535
14191D3967227j182568j423525j210198j178934r19350q94413j068200p34616
14183C5355423j102894r11687o86440p70079p94648m88203j194350o16540m11083
$$ y = [294577653, 281452909, 268706821, 256276286, 244857464, 234071568, 222253605, 210670424, 200187666, 190075402, 180522584, 172088456, 163803924, 156059795, 148487488, 141716012, 135637819, 129393386, 123899236, 118089744, 113224315, 108240475, 103904989, 99925501, 95723219, 92049928, 88081418, 84762718, 81593506, 78554947, 75814893, 72973255, 70226131, 67888763, 65651131, 62945338, 61377302, 59281261, 57524424, 55422032, 53966635, 52531535, 50638805, 48943403, 47614351, 46098781, 45097762, 43967227, 42784659, 41361134, 40150936, 38972002, 38052652, 37158239, 36090039, 35355423, 34252529, 33340842, 32654402, 31884323, 31089675, 30601472, 29407122, 28790582, 28379499]
14174B8379499j284521n87512m66970l43502j012003k64184m63161l52874o64296
14165B2940476m29207p56883l31044p26535m32152k93598k46588q91901P2050
14156A8904618k17743m71071j98307l25636o80314k7955p55764J16933m87742
14147A5857019J2575m45852k81452l71548k664k72510k66613n56779K16179j000998
14137A2887357L58227j12692l21305m16390J67339m42201m03693j3697k71274
14128A1431671L02309o77518j88738M8855p484k01115l63037K2229N265l39445
14118A0032992K4693m51546j38549l188j78393J513j0644m16663J18299m26387
14108H552127m3699R0470n42610p5620K22196m86876L47406q7101n36489J50517
$$ y = [28379499, 27094978, 26507466, 26040496, 25696994, 24684991, 24420807, 23957646, 23604772, 22940476, 22511269, 21754386, 21423342, 20696807, 20264655, 19971057, 19724469, 18832568, 18904618, 18686875, 18215804, 18017497, 17691861, 17011547, 16983592, 16227828, 16344761, 15857019, 15869594, 15423742, 15142290, 14770742, 14768078, 14495568, 14228955, 13672176, 13888355, 12887357, 13245584, 13132892, 12811587, 12395197, 12562536, 12120335, 11716642, 11702945, 11431671, 11733980, 11056462, 10867724, 10916579, 10909095, 10707980, 10344943, 10367172, 10372437, 10032992, 10057685, 9606139, 9467590, 9464402, 9286009, 9287522, 9276878, 8860215, 8978514, 8552127, 8508428, 8598898, 8056288, 7980668, 8202864, 7715988, 8063394, 7976293, 7439804, 7590321]
14098G590321k91498K62865m04622j23596J78852k51190J2165O084k59623J28771
14088F848529j32126q4286K65648r1101o43827O252o2053k6202K19365k11638
14078F088561j20968k66690J92540m39340J86591j29781k22193L75608k44537
14069E419791j54583N4428P9411k90468k5868q2477J05661j00784m3129j6818
14059D945164k86176j97582K65849j65773K52105l11400J79405j20828J17854
14050D678618k39484j75151L1310N6981k23889J69968r7786R1449k6023j717j30933
14039D133343j6739l1700J26556n30159K89633k81712J84725j04557m88306k313
14029C278771L41233m25501M87635l63384j7342K95771j96544j67586k92956L68733
$$ y = [7590321, 7298823, 7561688, 7157066, 7033470, 7212322, 6961132, 6973297, 6979381, 6719758, 6848529, 6716403, 6632117, 6897765, 6806664, 6162837, 6169089, 6107036, 6080834, 6300199, 6088561, 5967593, 5700903, 5893443, 5454103, 5640694, 5510913, 5288720, 5664328, 5419791, 5265208, 5319636, 5399047, 5108579, 5082711, 5000234, 5105895, 5005111, 4961982, 4945164, 4658988, 4461406, 4727255, 4561482, 4813587, 4502187, 4681592, 4560764, 4678618, 4439134, 4263983, 4295293, 4352274, 4128385, 4298353, 4200567, 4292016, 4265993, 4264276, 4133343, 4116604, 4084904, 4211460, 3681301, 3970934, 3689222, 3873947, 3769390, 3281084, 3278771, 3620004, 3194503, 3682138, 3318754, 3301412, 3597183, 3400639, 3233053, 2940097, 3308830]
14019C308830J16507m01388j09324L21317q497J87172m01233K47302p67692N43115
14009C036109k29822Q2382o6617K13054j03990J01332l95267N9886L57607l17542
13999B737132k72647o9929J81077P2127j0679j46598J13225j59162K379p763J04170
13988B543332k73401M28601k97629k87521M09457j61781P8552K46560L79046n24264
13978B540952L03695N27994N98891M50034J626803L315902N599740J0497836R195511
13969C4657358j0466629q240912n320699l147469j153858j044514m49344o00128
13961D233805l41308k17135l56115l9101m17512J28344k09895m945L9983k86322
13951B529799R4181q6979Q1667l90988j1120J47994k38542J4227Q2113q4697L42228
$$ y = [3308830, 3425337, 3023949, 2914625, 3235942, 3227445, 3414617, 3013384, 3260686, 2492994, 3036109, 2806287, 2888669, 2822052, 3035106, 2931116, 3032448, 2637181, 2697067, 3054674, 2737132, 2464485, 2394556, 2575633, 2647760, 2637081, 2490483, 2603708, 2444546, 2446925, 2439162, 2543332, 2269931, 2698532, 2400903, 2113382, 2522839, 2361058, 2439610, 2686170, 3065216, 2540952, 2844647, 3372641, 3971532, 4421566, 6048369, 9364271, 14964011, 25461847, 34657358, 24190729, 15949817, 10629118, 7481649, 6327791, 5283277, 4833933, 4233805, 3892497, 3675362, 3319247, 3280146, 2862634, 2990978, 2781083, 2776138, 2816121, 2529799, 2623980, 2537001, 2618668, 2227680, 2216560, 2364554, 2126012, 2140239, 2222352, 2137655, 2479883]
13940B479883k02263j41972k16921L93572m65999J20739l48612M58759K55570
13931B332756k48205n0634j17046k8232k03063K10023Q8839K1934k46526j02251
13921A657595k58285O71022n25583M85360j77423l98316K32747p9338Q1426J77198
13911A866403j32498l1348n8773j24202M5247l9514K0665M23947l18331j4195
13901A637401o1961q7195K80913k71587J76171L7322k53241M7375J37464m11847
13891A230815R0680K26126N5921l86382K97765l8395O6468p6166m6944P6513k18982
13880A277419k11955M47493j39350k13858M8403K03888n8986R3444P979k21279
13870A233198o8116J8216K88449j68510O2817j44539r2166N4703K66227o4556
$$ y = [2479883, 2277620, 2135648, 1918727, 2312299, 1846300, 1967039, 1618427, 2077186, 2332756, 2084551, 2033917, 1916871, 1888639, 1685576, 1895599, 1984438, 2006372, 1759846, 1657595, 1399310, 2070332, 1544749, 2030109, 1852686, 1454370, 1687117, 1607779, 1689205, 1866403, 1733905, 1702557, 1643784, 1519582, 1564829, 1525315, 1545980, 1969927, 1651596, 1637401, 1575440, 1488245, 1769158, 1497571, 1673742, 1711064, 1457823, 1505198, 1642662, 1230815, 1321495, 1547621, 1603542, 1217160, 1514925, 1476530, 1542998, 1466832, 1419888, 1496401, 1277419, 1065464, 1512957, 1373607, 1159749, 1208152, 1412040, 1353054, 1446498, 1454477, 1233198, 1165082, 1183298, 1471747, 1303237, 1366054, 1221515, 1129349, 1184052, 1450279, 1385723]
13860A385723l07725Q1300L1488p8772J69222j33108K32193m73998M65507q2907
13850A288923m59969K22322J46925M60564p07429j3663N52663j84744k94076o7912
13840I43604r9809L33872n6173n0132m98553M53158K61952k39786Q1382J57000
13830A286515o7733j73192L27428k54071k68395n2180M82860j33939k5475m31742
13820F90076M02153l53808L09752J11352k82924J57778j51731N3174N2571j24115
13810H64278J95607D91248N00250j11242K40145k14101J16660o6651L1418r0695
13800H97032q0164P9038P7244j46588o1605L67911j12536K56148m62775m4937
13790G68768L19534j97080n8279N8909n9794J45459k16084j33173J41217j4739
$$ y = [1385723, 1077998, 1159298, 1190786, 1112014, 1281236, 1148128, 1380321, 906323, 1371830, 1288923, 828954, 1051276, 1198201, 1658765, 951336, 937673, 1490336, 1305592, 1011516, 943604, 843795, 1177667, 1121494, 1071362, 572809, 1025967, 1287919, 1048133, 1129515, 1286515, 1218782, 1045590, 1373018, 1118947, 850552, 798372, 1281232, 1147293, 1121818, 690076, 1092229, 738421, 1048173, 1159525, 876601, 1034379, 882648, 935822, 988393, 864278, 1059885, 491248, 991498, 880256, 1120401, 906300, 1022960, 956309, 987727, 897032, 816868, 895906, 973150, 826562, 764957, 1132868, 1020332, 1276480, 813705, 768768, 1088302, 891222, 832943, 891852, 832058, 977517, 761433, 628260, 769477, 754738]
13780G54738k5333n4896J54196k92811J38860O0499K21748j02067k4045j79600
13770F51289O0077K68492j47840O0493P785k9509k30523j52531N00664k30050
13760G58347J22378m20345K54368r6145O1104R9798j07837J91115C93200L57794
13750G50994r4959m4058R9553B94006M85263k42704N9575L8239O7490L0390j39398
13739E92861q1157K46389L357L8526O825r7583q5455N50300E78395K23570k91146
13728E10819K15300j87505j9500K27133k16447K68991C46555N24297m28329K40946
13718F83469j43560L14541j78562R7035N4975j28438l529j7925o8309J29842n0061
13707F89478l5040N59997m82556j45602r4224J66108j38106M65349D34553p079
$$ y = [754738, 729405, 674509, 828705, 535894, 674754, 735253, 957001, 854934, 830889, 651289, 711366, 979858, 832018, 892511, 900296, 870787, 640264, 487733, 988397, 758347, 880725, 460380, 714748, 618603, 679707, 779505, 671668, 862783, 393200, 750994, 656035, 611977, 711530, 294006, 779269, 536565, 596140, 634379, 701869, 732259, 592861, 511704, 758093, 761450, 799976, 806801, 709218, 623763, 1174063, 578395, 801965, 510819, 726119, 538614, 519114, 746247, 529800, 798791, 346555, 870852, 442523, 683469, 539909, 854450, 675888, 772923, 827898, 699460, 695931, 678006, 609697, 739539, 689478, 654438, 1214435, 731879, 586277, 492053, 658161, 520055, 985404, 434553, 427474]
13697D27474K69838j64636J33099K87840l32321k58425N19762l43989j5162K9876
13687E53356j51450M78288k17496j08887J46505J16134j64969O7544j39642j0379
13677E69004j48091k0705L2333L09054l61528J80990L56719m11770K867L22021
13667H30894k63676P5646C14298M33499k51020j14741K16673o7404j18917M45822
13657H58210k27481C04473J81830J67959j35415k32088J65178K8524J98748j54258
13647E24951j43491j57982L87248l00002J05372r605j77343L54387k79276M24851
13637G29110p1230l07727J35058j97091K54117j08757I2059K90262n7074j12007
13627B13240K74015k2464B25975K02262o4640M4279A34045J24905J72156B08185
$$ y = [427474, 697312, 532676, 665775, 953615, 621294, 362869, 882631, 538642, 523480, 553356, 401906, 880194, 662698, 553811, 700316, 816450, 651481, 719025, 579383, 569004, 420913, 400208, 432541, 741595, 380067, 561057, 917776, 506006, 508873, 830894, 567218, 642864, 314298, 747797, 496777, 382036, 598709, 531305, 412388, 858210, 630729, 304473, 486303, 654262, 518847, 286759, 451937, 480461, 679209, 524951, 381460, 223478, 610726, 310724, 416096, 406491, 229148, 583535, 304259, 729110, 657880, 350153, 485211, 288120, 542237, 433480, 92059, 382321, 325247, 213240, 487255, 464791, 225975, 428237, 363597, 407876, 134045, 258950, 431106, 208185]
13616C24939K79041k50176K5231M6508j0101N0007M6523A7613K49937L13109m2099
13605E38560j48475o7295K07660H5599L07997k7314k5410j34575M18491j30542
13595D94246j64664j7557P7795p7922l9451J08054J52472k29697J14765O2875
13585D80916A23552K75976o870K4974j68765J46580q1488K94862j23857R2412
13575E77376a85544E00695j52119M3422Q0970A99163K92813l6623k5812j23419
13565C06122L1381r8740K14041P0780B03806L0169J6501O2321j15496K72941k1444
13554D48798j61521J29972k00578H7720O50858C07719A38021M21663A71500O1342
13544B32842q2227j452J05744J36833j1267r5322j9648M2713K51019F7079J48849
$$ y = [324939, 603980, 353804, 379035, 425543, 415442, 465449, 511972, 17613, 267550, 580659, 538560, 390085, 322790, 530450, 85599, 393596, 366282, 340872, 206297, 624788, 494246, 329582, 312025, 389820, 311898, 272447, 380501, 532973, 303276, 418041, 480916, 123552, 399528, 392658, 417632, 248867, 395447, 313959, 608821, 484964, 577376, -185544, 500695, 348576, 391998, 472968, 199163, 491976, 455353, 429541, 306122, 337503, 238763, 452804, 523584, 203806, 233975, 250476, 312797, 197301, 470242, 448798, 287277, 417249, 216671, 87720, 738578, 307719, 138021, 559684, 171500, 232842, 150615, 149163, 254907, 391740, 380473, 285151, 265503, 308216, 559235, 67079, 215928]
13533B15928R1138O3433A28257K44293a66808A47289O3779K27578j78871m5381
13523B14394M65394A79560K77412j6935J6967A10447e1255I2713L0427M24364
13513E47504B65891J46706A77413K50198m4222A16137L13170J2574j94926J57386
13503D04341b1253D90369j61116B0754J06887J05694Q2317J40112A99024J06564
13493C05588r2229J85393N1782B05614j7928J9031H7195Q4169k1778K64396j20322
13482B93660j26949K33976A17375j3807N4003K48648J9844l8180j29681p9948
13472A78254L86758B26716O6354L42050c0448B7235K41677K24667B19237F0095
13461H4562J18748n4211M54189r2690B5214K32984L4157D9918J36871J1383E8318
$$ y = [215928, 307066, 370499, 128257, 372550, -166808, 147289, 211068, 438646, 259775, 214394, 679788, 179560, 456972, 440037, 457004, 110447, -51255, 92713, 123140, 547504, 265891, 412597, 177413, 427611, 383389, 116137, 429307, 441881, 246955, 404341, -21253, 490369, 329253, 20754, 127641, 233335, 315652, 455764, 199024, 305588, 213359, 398752, 450534, 205614, 187686, 206717, 87195, 171364, 149586, 413982, 293660, 166711, 400687, 117375, 103568, 157571, 406219, 426063, 387883, 258202, 178254, 565012, 226716, 293070, 635120, -30448, 27235, 268912, 493579, 219237, 60095, 84562, 203310, 149099, 603288, 510598, 25214, 258198, 292355, 49918, 186789, 198172, 58318]
13449C25552a4699D25330a3129A06047J54473M599l2703J96764I369a9371o9732
13438h9103A41139l2535J72902Q4118A5238L31116A72096J59814A44261M2363
13428A86624J51674j10478O5840n8090m486f0664E4798B1633o914L12601A09766
13416B98363A2253J71969B2333a6985B82783j20613e6199A89745R2184J10918
13406C92847j72367I3039M88140A37072R8446q7921i1690A24129J83014q3486
13396B23657K98948k0950j70501j61739m3315J63198o9256a6051j06221A47869
13385C91594m6148j34180K40015j51277L15142p4698A72193K26117J2429I4704
13374H4144R7269J32338A6153L74744j4275r7945N0196j06747J32719A55061J47519
$$ y = [325552, -14699, 425330, -13129, 106047, 260520, 265119, 232416, 429180, 9369, -19371, -89103, 141139, 108604, 281506, 365624, 15238, 346354, 172096, 331910, 144261, 186624, 338298, 227820, 293660, 235570, 231084, -60664, 54798, 21633, 14719, 327320, 109766, 298363, 12253, 184222, 22333, -16985, 282783, 162170, -56199, 189745, 281929, 392847, 220480, 93039, 581179, 137072, 235518, 147597, -91690, 124129, 307143, 223657, 522605, 501655, 331154, 169415, 126100, 289298, 220042, -16051, -122272, 147869, 391594, 345446, 211266, 451281, 300004, 615146, 540448, 172193, 398310, 410739, 94704, 84144, 181413, 313751, 16153, 390897, 376622, 278677, 328873, 222126, 354845, 155061, 302580]
13363C02580e5864k8740C8459K11792P699A06748L2094R4323J16458I8900e2130
13351A74828G5200f9763A27091J88356L7607Q0727j51428l5677O765e2381C37806
13339A19034J70545J40645N2717O834j82570M0606J56924B04934P6349K8587J27090
13328D36960J0947N7128j24970H9550J33810J62600j18606F0212J9482N50935
13318F30629B54718A19309b68081I9927K88895o7290j13283J07117m9400J37R4965
13307C61068a15132A28728A3746J09387a52882A77646J50904F5673L66885J36945
13297E69503A61589N378D9548J79912l8548j3531J8502K48699A01746J87279o7114
13286B21911M8012N2847a60951E4684D12J43987k7327J18843O2091L02123A37354
$$ y = [302580, -55864, -84604, 38459, 250251, 257950, 106748, 138842, 233165, 349623, 98900, -52130, 174828, 75200, -69763, 127091, 315447, 353054, 433781, 282353, 246676, 253441, -52381, 337806, 119034, 289579, 430224, 482941, 489775, 307205, 347811, 504735, 204934, 281283, 309870, 436960, 447907, 505035, 380065, 89550, 223360, 385960, 267354, 60212, 79694, 630629, 254718, 119309, -268081, 99927, 388822, 321532, 208249, 315366, 265966, 266103, 361068, -115132, 128728, 13746, 123133, -152882, 177646, 328550, 65673, 432558, 569503, 161589, 166967, 49548, 229460, 190912, 177381, 195883, 444582, 101746, 289025, 221911, 269923, 322770, -160951, 54684, 412, 144399, 117072, 235915, 298006, 600129, 137354]
13274e3015B16517a92304A34889a52206G8693a01793b4531j61585A47444o3458
13264H3986J50763o8804f1294B33263D131Q9898J50304A09773N0237F6762K27354
13253B94116A27452a31712A63489K02400A56721O1290f0060k1381B6316Q0332
13243A06648J47970P1421A62168D7451K31694a77839B35898D3620K419g5181G7821
13231I5692K99547A35036F4338a64399e5197B09039i51j68896E868L82159F1335
13219B50356h2969k47804G6500b66813F9016K76620A04641N8962J02878C8379
13208a9663A49961b665G1427k4799J15562K79949A43028J65081g2524B28373D3724
13196A00620F564a13820A62702J25680q3018G6804J85050R8163p1231R0561I1601
$$ y = [-53015, 216517, -192304, 134889, -152206, 78693, -101793, -24531, -186116, 147444, 83986, 234749, 165945, -61294, 233263, 4131, 94029, 244333, 109773, 160010, 66762, 294116, 127452, -131712, 163489, 365889, 156721, 218011, -60060, -81441, 26316, 106648, 254618, 326039, 162168, 47451, 279145, -177839, 235898, 43620, 46039, -75181, 77821, 95692, 395239, 135036, 64338, -164399, -55197, 209039, -951, -169847, 5868, 388027, 61335, 250356, -82969, -330773, 76500, -266813, 69016, 345636, 104641, 163603, 266481, 38379, -19663, 149961, -2665, 71427, 46628, 162190, 442139, 143028, 308109, -72524, 228373, 43724, 100620, 6564, -113820, 162702, 288382, 205364, 76804, 261854, 360017, 288786, 379347, 91601]
13184B2433b66688C89526i7015i994D08709g80A51278a46344H9856K38944n7391
13173B71409c38551B9339L3734K97496A65187b81995F593J06335R0435J91581
13163C94944A17725J92296j11703G4357K68990e8192a897A57551K2438a0477H6334
13151B2744N5906E830b7395F8843M05406k02214n8884o4557M5983g0877A93875
13139b10435C81104a47377D29957b9391m9760k51884A3215b28182D6448g7764
13128h6131c4724A24796D3344b55324g295A70654G6339L0116J16467K64351A20883
13116A05790l5130J87308L2353j26973K79443D70J59117A9179a12808E77944A2352
13104c5168B05620a018C50828b7845m1499B26419G474J64665l5899b70522G0279
$$ y = [22433, -266688, 389526, -97015, -9994, 408709, -780, 151278, -146344, 89856, 328800, 271409, -338551, 29339, 63073, 360569, 165187, -281995, 6593, 112928, 203363, 394944, 117725, 310021, 198318, 74357, 343347, -58192, -1897, 157551, 179989, -10477, 86334, 22744, 78650, 5830, -27395, 68843, 474249, 272035, 213151, 148594, 194577, -70877, 193875, -210435, 381104, -147377, 429957, -29391, -79151, -331035, 13215, -228182, 46448, -77764, -86131, -34724, 124796, 43344, -255324, -7295, 170654, 76339, 106455, 222922, 487273, 120883, 105790, 70660, 257968, 290321, 163348, 442791, 470, 159587, 19179, -112808, 577944, 12352, -35168, 205620, -1018, 350828, -27845, -69344, 226419, 7474, 172139, 136240, -270522, 70279]
13092e6767A26513c7462A37270J76928a36988O6409B62030m9492C0205k815g441
13080I683A973a0708A01475j5757k4932b56078Q5065A07545k9756k5369O4495
13069A16915b34240K9064B68892n3537P6649A29638J79572j8974i5222A73039
13058A54408P2129C0300J14627M1017b151I4660J42394a24791c5432I8631d5109
13046b66525E8069N1695a11597A94813H9094P0982P501J70123a95256C56999A23030
13034f0731C22616E9758J68810b25795B14230j04903K9659A6518K86539B2107
13023c7261A30220g9192n1748B2580J81870A3668J53515Q3221J28061C4435K7991
13012F2426f5103r9427H6823K21237J3373A16277M6890c0955A38222J50228I8530
$$ y = [-56767, 126513, -37462, 137270, 314198, -136988, -70579, 262030, 212538, 30205, 27390, -7441, 9683, 1973, -10708, 101475, 85718, 60786, -256078, -171013, 107545, 77789, 52420, 116915, -234240, -205176, 268892, 215355, 292004, 129638, 309210, 290236, -95222, 173039, 154408, 226537, 30300, 144927, 185944, -2151, 94660, 237054, -124791, -35432, 98631, -45109, -266525, 58069, 109764, -111597, 194813, 89094, 160076, 167577, 337700, -195256, 356999, 123030, -60731, 322616, 59758, 228568, -225795, 214230, 109327, 138986, 16518, 303057, 22107, -37261, 130220, -79192, -130940, 22580, 204450, 13668, 167183, 250404, 378465, 34435, 62426, -65103, -164530, 86823, 308060, 321433, 116277, 163167, -30955, 138222, 288450, 98530]
13000A7025J02693J87345I5380D2846M37224h2191c8070j64115h8117C4994a92476
12988a85953Q3681D8188K0764a2373B50200J2854q6343N6288a59490a2348o6813
12977g9161A08645O2287a6070D1146P9240j2031L6665c8628A09972l6082A0955
12965F2210g4100p3322J6128b5434m4113k41187B34494a50599M8001A40852d7925
12953D30638I0588A0105J68060K8175b10695A35629b84582A42849b24220B242
12942B6912e1960B24037d7704j2041A12804L03181a48693F8745a49836A38158
12931c0382r1458j61145A16220J19874d3648A82722a35910B82599D854J12787
12921A17641h9827C13749a78617O1628A92891l5362n068G5397g7139B40107C4238
$$ y = [17025, 119718, 307063, 95380, 42846, 480070, -82191, -38070, -202185, -88117, 34994, -192476, -185953, -102272, 48188, 68952, -12373, 250200, 263054, 176711, 232999, -159490, -12348, -79161, 108645, 170932, -16070, 41146, 120386, 108355, 145020, -38628, 109972, 73890, 10955, 62210, -74100, -147422, -131294, -25434, -69547, -310734, 234494, -150599, -102598, 140852, -47925, 430638, 90588, 10105, 178165, 206340, -210695, 135629, -284582, 142849, -224220, 2242, 26912, -51960, 224037, -47704, -59745, 112804, 415985, -148693, 68745, -149836, 138158, -30382, -121840, -282985, 116220, 236094, -43648, 182722, -135910, 282599, 4854, 117641, -89827, 313749, -178617, -116989, 192891, 157529, 152461, 75397, -77139, 240107, 34238]
12909c122k46392B6J03497k1658b46913D69931h2159q9225A83995p5150R9352
12898B08197d9784D2535K34353j03649i4408r7270A51348J6140J2469h8436B4026
12886b2248k98501a0938m6427D16221I7209J14490a15956A397a46168O4756A45364
12874h5278B12480j9732F9426F253Q6331P7978F4991h5382k450o1526B19785J04463
12862C24248g2306D0943J17033b25073q2580J21812o751A94079J77986a54422
12851a84050b0247E6798h8723N931j5541D1751e0179A27177a96104G7641b4418
12839A08831h4180j7862j84959B5672M5798i0823m7452A41325b51022C3507J49907
12828A83414J55085f3965j58103K4266A43675n9687a91589B83106e2111j33412
$$ y = [-3122, -249514, 26, 103523, 81865, -246913, 469931, -82159, -171384, 183995, 108845, 208197, -49784, 42535, 276888, 173239, -94408, -191678, 151348, 167488, 179957, -88436, 24026, -22248, -320749, -10938, -57365, 416221, 97209, 211699, -115956, 1397, -146168, -81412, 145364, -85278, 212480, 192748, 69426, 6253, 92584, 170562, 64991, -85382, -87832, -149358, 219785, 324248, -72306, 40943, 157976, -225073, -307653, -185841, -192592, 194079, 372065, -154422, -184050, -20247, 56798, -88723, -82792, -98333, 41751, -50179, 127177, -196104, 77641, -24418, 108831, -84180, -102042, -287001, 25672, 71470, -90823, -138275, 141325, -251022, 33507, 183414, 338499, -63965, -222068, -197802, 143675, 83988, -191589, 283106, -52111, -185523]
12818a85523C49396A0517J16199b34770A76150B3625J2171P9039a80016D8453
12807a71055A68833K9147J9895C5335L27291a46526N8138H3486c06037M0642B04771
12795a67998C1512J27310J89591b55906g0489c0715D2716M0418g4633C25275A20748
12783g5078j71613C5506a65847A36316l1312g1277R463J6320B73683F6841b92663
12771b23442a11597A60857a95196A47938C27a33674j96056M9028B24586c1079
12760C16176h0308j47662g0862j87563B01147M5253P80b54720h4047I039c13439
12748c8996l59825H244K0189b53617A91170i1792j52895d8572A10381Q4508M9017
12737B43906H1379a39153A80207c78493C6308K85045j30624a04036C3836c38069
$$ y = [-185523, 349396, 10517, 126716, -234770, 176150, 23625, 35796, 114835, -180016, 48453, -171055, 168833, 197980, 217875, 35335, 362626, -146526, -88388, 83486, -306037, -265395, 204771, -167998, 31512, 158822, 348413, -255906, -70489, -30715, 42716, 83134, -74633, 325275, 120748, -75078, -246691, 35506, -165847, 136316, 105004, -71277, -61814, -45494, 273683, 66841, -292663, -223442, -111597, 160857, -195196, 147938, 327, -133674, -329730, -280702, 224586, -31079, 316176, -80308, -227970, -70862, -258425, 201147, 246400, 247180, -254720, -84047, 9039, -313439, -38996, -398821, 8244, 28433, -253617, 191170, -91792, -244687, -48572, 110381, 194889, 243906, 81379, -139153, 180207, -378493, 36308, 321353, 190729, -104036, 33836, -338069]
12726D3723M7092d3917E5342h8644A27995d7947C58843q3995A15724i3992C84331
12714e2930B02652n8591m545c0212B7674a14396a9311j56558A60212B5780K65650
12703B91430k9859a90031C51971a95241q8213A78535D3969N4875b2116C46824
12692B46233R6064J05029b7597C06719J24652B14265L0174k4108a22707k8840
12682a51547P0712L2992A46079I073N0071J82797f9167J1633C92128j23881h8140
12670i7378B71514A5472b02774A61683a89706F6274a42390N7816a0690H671a65867
12658D8073d7726k7826A17222a80066r6323O9721E5608a29299D51960B04492c13005
12646e5346j21115B6783a47999B9644K7201Q5635b05984c3507D6562k3181a80180
$$ y = [43723, 90815, -43917, 55342, -88644, 127995, -47947, 358843, 274848, 115724, -93992, 384331, -52930, 202652, 144061, 139516, -30212, 27674, -114396, -19311, -175869, 160212, 25780, 291430, 261571, -190031, 351971, -195241, -283454, 178535, 43969, 98844, -22116, 346824, 246233, 342297, 447326, -27597, 306719, 431371, 214265, 244439, 220331, -122707, -151547, -80835, -47843, 146079, 9073, 59144, 241941, -69167, -57534, 392128, 268247, -88140, -97378, 271514, 15472, -202774, 161683, -189706, 66274, -142390, -84574, -10690, 8671, -165867, 48073, -47726, -75552, 117222, -180066, -276389, -206668, 55608, -129299, 451960, 204492, -313005, -55346, -176461, 26783, -147999, 29644, 56845, 142480, -205984, -33507, 46562, 23381, -180180]
12634A64260K8011K05491J19937H289R8960J9331b9031k6380E6858j9374Q380
12623D5864a8513H3610d6322A70167b9680A53379f9195C08963f6066A00206K35438
12612C35644E5208J29975p1917E4911G174d2208E608M3355c5063G5733J21815
12601A97548E9963K53271b11621B6912a33878B34179A01298d1948G7a31799G5263
12589D09690c9041k44835A39629O0670A9311K11164a72030A2023J17587i1601
12578E1619A5113K8741a3796A29858e0321C4942J51747C8470a38742n0994B21801
12566f2971m9309A11141a00908j3106j14372f6228o0443C5547c3769n5184q916
12555i7869A25079a05806q7517K8025q3839G5642L0495J65840G1596a09633A77222
$$ y = [164260, 192271, 397762, 517699, 8289, 107249, 126580, -29031, -55411, 56858, 37484, 45864, -18513, 83610, -46322, 170167, -29680, 153379, -69195, 308963, -66066, 100206, 335644, 55208, 185183, 113266, 54911, 7174, -42208, 5608, 48963, -35063, 75733, 197548, 59963, 313234, -211621, 26912, -133878, 234179, 101298, -41948, 77, -131799, 75263, 409690, -39041, -283876, 139629, 200299, 19311, 230475, -172030, 12023, 129610, -91601, 51619, 15113, 43854, -13796, 129858, -50321, 34942, 186689, 38470, -138742, -189736, 221801, -62971, -112280, 111141, -100908, -114014, -228386, -66228, -126671, 35547, -33769, -88953, -97869, 125079, -105806, -193323, -165298, -249137, 75642, 106137, 271977, 71596, -109633, 177222]
12543c73796E264K07865a97966R5705a3826K360j05268B73745b30089j07463a56567
12531a41863O1432A04014D2098J78851a22893j48107A17120b09628M8289b835
12520H8311A5601a60049B8285i8923k3674B47197b7147D1373I524K6445c2382
12508b66581A40917B9836b950j37597b9105k67223A20707J7243J8535J04179c15274
12496E4043J9777O3075a10788m4716F1263a74837D8639a21912H3175f0474D9036
12484E0114L20387C3084b3997B76261A04381J01073n9275d6284A22698c66255
12473c11207G2458e7123H4578a20664F3361Q2692b27236I5422J25637A01127D8769
12461b185A15537a06309H9508o976C8460j8441L9925c9127J4146H9090b78656
$$ y = [-373796, 5264, 213129, -197966, -102261, -13826, -11466, -116734, 273745, -230089, -337552, -156567, -141863, -80431, 104014, 42098, 220949, -122893, -271000, 117120, -209628, -161339, -2835, 88311, 15601, -160049, 28285, -98923, -122597, 247197, -27147, 41373, 9524, 35969, -32382, -266581, 140917, 29836, -2950, -140547, -29105, -296328, 120707, 137950, 156485, 260664, -315274, 54043, 73820, 136895, -110788, -155504, 61263, -174837, 48639, -121912, 83175, -60474, 49036, 50114, 370501, 33084, -23997, 276261, 104381, 205454, 146179, -46284, 122698, -366255, -311207, 72458, -57123, 84578, -120664, 63361, 146053, -227236, 95422, 221059, 101127, 48769, -2185, 115537, -106309, 89508, 82532, 38460, 20019, 59944, -39127, -24981, 89090, -278656]
12449i5110B0007N1356K4009c9216j30759j7640q243Q5598p5483A9801M4666c01763
12436g3259A43789o0205i3424p490c896H4531c4228k24524C96521F6158K20604
12425B86762a40072B1851c36508R8730a00061d4380A22170C965O2604J53347B6630
12413a55890C09575a04990B38891I2262J70666b43622P0543j45966A64691c19009
12402h187p2584A14749a0806k37851O7404n3878A46695Q0982a0430k9460H308
12390c29533h3199A87738m6053d2389j5578A1303K9474b42918i3698l7632C8372
12378a02391B13794f9447A20951f076j45995A535O3946K10796a9596B79893A20852
12366a62301A12242b62430G506c4331G3023J44911l869j5016n581M7507a05689
$$ y = [-95110, 20007, 71363, 95372, -39216, -169975, -187615, -195858, -110260, -185743, 19801, 64467, -301763, -73259, 143789, 83584, -93424, -100914, -3896, 84531, -34228, -258752, 396521, 66158, 286762, -140072, 21851, -336508, -237778, -100061, -44380, 122170, 3965, 66569, 219916, 26630, -155890, 309575, -104990, 238891, 92262, 262928, -243622, -173079, -319045, 164691, -319009, -8187, -80771, 114749, -10806, -248657, -181253, -235131, 146695, 227677, -10430, -39890, 8308, -329533, -83199, 187738, 141685, -42389, -57967, 11303, 40777, -242918, -93698, -131330, 38372, -102391, 213794, -69447, 120951, -6076, -152071, 1535, 65481, 276277, -19596, 279893, 120852, -162301, 112242, -262430, 7506, -34331, 73023, 217934, 214065, 199049, 193468, 240975, -105689]
12354a60462A65127b70154F0656J6078K50497c643B6594I666a16552o3554G7930
12342A36907K00072a64187j36135O6958C9292b0135r492p7886m4424B63508e4068
12330b49875a8380j30697A74557a7896A71419D4867r948J05141m8978M6060q060
12319A29082d7808C05664a37526B00244n6523F2310K02376p2845l48b0393C15620
12307A67298a18724B02445A4638R9056K42765D634K45711j06324J07771J1176
12297B62968H1264H823b20A36881m4944A2722J88609c67065A87332p3135i9303
12285i8315b9514B17072l9326k0286a56250A61955g615C75830A06237K89459B827
12273B78599O0162j09297c42569A1468g5744k4748D41103E0721E572K83679K84899
$$ y = [-160462, 165127, -270154, 60656, 76734, 327231, -3643, 26594, 9666, -116552, -180106, 77930, 136907, 336979, -164187, -300322, -233364, 39292, -20135, -29627, -107513, -151937, 263508, -54068, -249875, -18380, -149077, 174557, -17896, 171419, 44867, 34919, 140060, 91082, 137142, 129082, -47808, 305664, -137526, 200244, 143721, 62310, 264686, 191841, 191493, -20393, 315620, 167298, -118724, 202445, 14638, 113694, 356459, 4634, 250345, 144021, 251792, 262968, 81264, 8823, -220, 136881, 91937, 12722, 201331, -367065, 187332, 114197, -99303, -98315, -29514, 217072, 177746, 157460, -156250, 161955, -7615, 375830, 106237, 395696, 2827, 278599, 338761, 229464, -342569, 11468, -75744, -100492, 441103, 50721, 5572, 289251, 574150]
12262E74150k32372a96975c9448C23048j50251O221Q1958E5530K73477J66960
12252D95967B08987b14436M9507l91815i5887B95059j17380a08220C50461A50359
12241D4932J08314J49143B5936c08497B41315q8806J46487A09082b86309J20503
12231a65806B9456L08107p0356G4478C2525L30865L3841A44016J78785A43083
12220A80032o9278j9023a07301C59048a51029A6096K41692a18297r5807B32505
12209A12911J54790d825C25223a49873A52328J3890J73007a30352C06770A9458
12198B13122O31m8027a579F6671J76290B9738J90424o8898K53354A76215J46062
12187C22277p8020K16498F1399J83037P4351b3439A8295L59713A73072k6644a41463
$$ y = [574150, 341778, -196975, -39448, 323048, 172797, 179018, 260976, 55530, 329007, 495967, 208987, -214436, -164929, -556744, -95887, 295059, 177679, -108220, 350461, 150359, 44932, 153246, 302389, 25936, -308497, 241315, 152509, 298996, 109082, -286309, -165806, 29456, 337563, 267207, 74478, 32525, 363390, 397231, 144016, 322801, 143083, 180032, 110754, 91731, -107301, 359048, -151029, 16096, 257788, -118297, -214104, 232505, 112911, 267701, -4825, 325223, -149873, 152328, 166218, 339225, -130352, 306770, 19458, 213122, 213753, 165726, -1579, 66671, 242961, 29738, 220162, 151264, 404618, 176215, 322277, 244257, 460755, 61399, 244436, 318787, -23439, 18295, 378008, 173072, 146428, -141463]
12175a72755B98738D4584R0825J01529N6329o6373I8322K9932A2181a20122c3820
12163G0485J64580B8524a91532E38069j62084A20524b9904A59144a40203f0156
12152G2197J90657J7040K3381j25179J74291e8068j2011E26147B20260N132E97
12140H5908J38024O6859J31885k07499j8724E8902A5178J6684Q4275b41763f0226
12128B49359a18478A92117L3356r18J60692a6538K585r9396A85902i3933A7074
12116b998H1336J19550a49502A05423B1939R328q907J92142e2476E2671J6888
12105F9559L16180j8888A78583F369L41324a20589G2376F747b18660A93874p3466
12094A20408a90961F3075K4711a19378B01181k6491B5653b01151h2323K7764A4354
$$ y = [-172755, 298738, 44584, 135409, 236938, 293267, 226894, 98322, 128254, 12181, -120122, -33820, 70485, 235065, 28524, -191532, 538069, 375985, 120524, -29904, 159144, -140203, -60156, 72197, 262854, 279894, 303275, 178096, 352387, -58068, -70079, 526147, 220260, 225392, 597, 85908, 223932, 290791, 422676, 215177, 196453, 58902, 15178, 31862, 116137, -241763, -60226, 249359, -118478, 192117, 225473, 224555, 385247, -16538, -13953, -113349, 185902, -93933, 17074, -2998, 81336, 200886, -149502, 105423, 21939, 31267, 22360, 214502, -52476, 52671, 69559, 385739, 366851, 178583, 6369, 347693, -120589, 72376, 6747, -218660, 193874, 120408, -190961, 63075, 87786, -119378, 201181, 174690, 25653, -201151, -82323, -54559, 14354]
12082E4516a240B18581r3528a21425E53934C4699L8885j757g2403C7047A4945
12070B84783c00642B30588h3536A77289J69053A41420C3192i0386j44451B18165
12059A64286e131o0472D05522j70612H0753A687J78230L94238A12488E2512J88897
12048B41409a04080A32523J71689A25176K22369a21042n3869h2036D822J69841
12038A74663b02373O4182a5259p0289j642A81752a33822A37263F5277I456a92466
12026b03787D9707b18055A37039F7071f400j49284A45194b93948i764N10A41305
12014e4080B73462b3406F8852b07928D16980A10819B9457N1089Q3156G4138l3958
12003D0180a31725A26106i3907L2275A28129J26510o2591c6813q5182A04907E2244
$$ y = [54516, -1240, 218581, 125053, -121425, 553934, 34699, 73584, 71827, -72403, 37047, 14945, 284783, -300642, 230588, -83536, 177289, 346342, 141420, 33192, -90386, -234837, 218165, 164286, -5131, -65603, 405522, 234910, 80753, 1687, 179917, 574155, 112488, 52512, 241409, -104080, 132523, 304212, 125176, 347545, -121042, -174911, -82036, 4822, 174663, -202373, -138191, -15259, -85548, -87190, 181752, -133822, 137263, 65277, 9456, -192466, -203787, 49707, -218055, 137039, 67071, -6400, -155684, 145194, -293948, -9764, -9254, 141305, -54080, 273462, -23406, 68852, -207928, 416980, 110819, 29457, 80546, 163702, 74138, 40180, -131725, 126106, -93907, -61632, 128129, 254639, 192048, -36813, -121995, 104907, 52244]
11991a05528B11328m9253B8236L0252a49218O4831P740C3111B733J78660b84616
11979a27123B09005c8129j94172D3458J42101h2612j85721A33956f0774j80317
11969b41091b6687M02B38395A15369b12124I0078c7597A50813a39771j04573b1070
11957F0851J40334a17860A71792b24004i1906H8982B0347J63933o6925l6389j3535
11946F7431i5278C23605a81795A02849K24599a88527g7049C92381A5425M789a66520
11934C3813K00231B2331a39451A2267h7007B79689B3025a72209J5560e2147p100
11923e9247j33435K1477P4226A57558K61895E8631d32693C18856F6659b17848
11912i8982A83892J89733A49268a49380A35938C3607a66690n0443C930J2564a43679
$$ y = [-105528, 211328, 162075, 28236, 58488, -149218, -84387, -76647, 33111, 2733, 181393, -284616, -127123, 209005, -38129, -232301, 43458, 185559, -82612, -268333, 133956, -60774, -241091, -26687, -26285, 238395, 115369, -212124, 90078, -37597, 150813, -139771, -244344, -21070, 60851, 201185, -117860, 171792, -224004, -91906, 88982, 20347, 184280, 117355, 80966, 67431, -95278, 323605, -181795, 102849, 327448, -188527, -77049, 392381, 15425, 20214, -166520, 33813, 234044, 22331, -139451, 12267, -87007, 279689, 23025, -172209, -156649, -52147, -59247, -192682, -171205, -96979, 157558, 419453, 58631, -432693, 318856, 66659, -217848, -98982, 183892, 373625, 149268, -149380, 135938, 33607, -166690, -217133, 3930, 16494, -143679]
11900a14807c2040H7706E136b6014k50202A21599H9a6769e430C723g3638j56631
11888b30269C04377O3762b07600C94091a80056F3087B1513d59478A40932J3477
11878A54409F7257N8900f19257b70086f4311A24492c4605k26927c8845k05758
11868b44603F1316a91403j13458j7998A88816a44033B12965p4949b40703J7214
11858b23489i8487q6031a7416j24011r8185j7104n6600c2350B81111A01845a10155
11846I8801K24505F4317J13032a52275j0491A5382a76805K7141H9588R2611B1352
11834a82408r9446A90351F013N5527a45983J1897m8478D4220a99444D33851d4628
11822F0606a68791q3182D0312d03633a99581B1531O3243J6730Q5567C3520a48539
$$ y = [-114807, -32040, 87706, 5136, -26014, -276216, 121599, 89, -16769, -5430, 3723, -73638, -230269, 304377, 368139, -207600, 394091, -180056, 63087, 21513, -459478, 140932, 154409, 67257, 126157, -619257, -270086, -64311, 124492, -34605, -261532, -38845, -244603, 61316, -191403, -304861, -322859, 188816, -144033, 212965, 138016, -240703, -223489, -98487, -184518, -17416, -141427, -239612, -256716, -313316, -32350, 281111, 101845, -110155, 98801, 323306, 64317, 177349, -152275, -162766, 15382, -176805, -149664, 89588, 182199, 21352, -182408, -281854, 190351, 6013, 61540, -145983, -134086, -182564, 44220, -199444, 433851, -44628, 60606, -168791, -251973, 40312, -403633, -199581, 21531, 84774, 101504, 187071, 33520, -148539]
11810d4856A22910J23420C1476h554A17813D2787b2461m5228A9285g3938A93744
11798B1919c82288A53713d4963n5809A82799i9549j70849j10335P0702A00645
11787f53277a9719A20192a10450j92592h5979a5602D459J1586K17539c27678A32119
11775a66827D8713e482r9628n716h983j48327j7168E2912j8890a98992B25910
11763b07126C9467c50146D5281N2915a5143A905e2742q098B08094R5330d9288
11751D5787c21957a00546l4629m4617b0935A66031m2110g3244f361l84j08438
11740a15183k6937j80501F3584A4172e9514N138k88671B00111n6846a00484k35608
11729c36092a57846d6815A25497l5347j6819B7293d89193a19555B46291c94544
$$ y = [-44856, 122910, 246330, 31476, -8554, 117813, 42787, -22461, -67689, 19285, -73938, 193744, 21919, -382288, 153713, -44963, -100772, 182799, -99549, -270398, -380733, -310031, 100645, -653277, -19719, 120192, -110450, -303042, -85979, -15602, 4459, 16045, 233584, -327678, 132119, -166827, 48713, -5482, -105110, -110826, -8983, -157310, -174478, 52912, 34022, -198992, 225910, -207126, 39467, -350146, 45281, 98196, -15143, 1905, -52742, -60840, 208094, 303424, -49288, 45787, -321957, -100546, -135175, -179792, -20935, 166031, 123921, -73244, -6361, -6745, -115183, -142120, -322621, 63584, 14172, -59514, -54376, -343047, 200111, 143265, -100484, -336092, -157846, -46815, 125497, 90150, 73331, 27293, -489193, -119555, 246291, -394544]
11718A24299K0463a16042A39221a37273e3961k24224P8411k0631C07598D3943
11707d26839a82324g5730J627C8568a00730J0019n156b163A34117a53593A19978
11695A91642i4554A46978K5370K3160a73619c6434I681J96216a60362N7191C92728
11683A41772c99750e3271c385C87565r9209a06147k5018A35481a34756n6408A28107
11671C40047D1850j9793K29934a8185B74081a01108j26673E1018K20946c27628
11660B17646G8421a18783G9510J44473G7358k5998J40386a12026j59555B66556
11649A17129a24893L1062l4949a4813A53919K52606E7343a2506A82066M3435c9935
11637d96538A4111J56912J94427G0006b41429C1826K6203K3276c0847G3482h5943
$$ y = [124299, 144762, -116042, 139221, -137273, -53961, -278185, -199774, -220405, 307598, 43943, -426839, -182324, -75730, -74103, 38568, -100730, -90711, -95867, -2163, 134117, -153593, 119978, 191642, -94554, 146978, 172348, 195508, -173619, -36434, 9681, 205897, -160362, -103171, 392728, 141772, -399750, -53271, -3385, 387565, 288356, -106147, -131165, 135481, -134756, -191164, 128107, 340047, 41850, 22057, 251991, -18185, 274081, -101108, -227781, 51018, 271964, -327628, 217646, 78421, -118783, 79510, 223983, 77358, 51360, 191746, -112026, -271581, 266556, 117129, -124893, -93831, -128780, -14813, 153919, 406525, 57343, -12506, 182066, 225501, -39935, -496538, 14111, 171023, 365450, 70006, -241429, 31826, 58029, 81305, -30847, 73482, -85943]
11625I8501B9013g8664j12239H6361N188J06842b1358D5994K4085b34949A08434
11613A58082K22149b66586O2350j31654i5054H7323a97081B22816h2126D20087
11602A50260a34173A20831K74736A46868a39002q3367i6831B4657J65326o0006
11592A29977k1836C2855A10a17373D2065P0370c1170E6423d787m3677G9219d8760
11579g8655B25001a09551A8435K47152j28832e7187j12847j32932n3168a4813
11568A94861c6671n822A90432l2069d0072B15003l7638K24612a04574C47717b05368
11556D73501D2299P6338c800B84749a88185I6215a0899j48434a6813I5585M45619
11545E41204G5119J6456a96745I4722R007g1679l54167a41690B13388o4537b18250
$$ y = [98501, 29013, -78664, -190903, 86361, 91549, 198391, -21358, 45994, 70079, -234949, 108434, 158082, 380231, -266586, -204236, -335890, -95054, 87323, -197081, 222816, -82126, 420087, 150260, -134173, 120831, 395567, 146868, -139002, -222369, -96831, 24657, 189983, 129977, 108141, 32855, 110, -117373, 42065, 112435, -31170, 56423, -4787, -48464, 79219, -48760, -78655, 225001, -109551, 18435, 265587, 136755, -57187, -170034, -302966, -356134, -14813, 194861, -36671, -42493, 190432, 158363, -40072, 215003, 177365, 401977, -104574, 347717, -205368, 473501, 42299, 118637, -3800, 284749, -188185, 96215, -10899, -159333, -16813, 95585, 541204, 75119, 91575, -196745, 94722, 103729, -71679, -425846, -141690, 213388, 148851, -218250]
11533B09572b66081c0857q2690l8095A00080a77624B78558A23958L1074a75266
11522b864B37724N4536E344d2061m0444C1091M31347F3377K27039D3725a0968
11510h0956A53542D6844b88635A43327K6020D6540a36926A31744a76976O4270
11500a12706A90855E5639a65972M3773A7555c01168A62556N198A9350M54611k35883
11489B38078r2864F8169J72370B4652J09780N1602n6785K12855C6488J8711K96873
11478C52072A51844n66j9656M0462D6952J40522K6526i915B00424a67547I5356
11466A88263b74309R3493A5253J4299J68458Q1938O8957H1776Q953a28254A30693
11454A0870i966B05439a41478F2561B4923L20288A0678M12549b3773A52879J17345
$$ y = [209572, -266081, -30857, -113547, -151642, 100080, -177624, 278558, 123958, 155032, -175266, -2864, 237724, 292260, 5344, -42061, -82505, 31091, 462438, 63377, 290416, 43725, -10968, -80956, 153542, 46844, -288635, 143327, 169347, 46540, -136926, 131744, -176976, -112706, 190855, 55639, -165972, -122199, 17555, -301168, 162556, 167754, 19350, 473961, 238078, 145214, 68169, 240539, 24652, 134432, 186034, 129249, 342104, 36488, 55199, 352072, 151844, 151278, 131622, 172084, 46952, 187474, 214000, -9915, 200424, -167547, 95356, 188263, -274309, -180816, 15253, 29552, 198010, 279948, 348905, 81776, 90729, -128254, 130693, 10870, -9966, 205439, -141478, 62561, 24923, 345211, 10678, 423227, -23773, 152879, 270224]
11443B70224b0362I7864c5435j49628F4472M5361d4936A14444L451f8799j6808
11432h5607B26558b85265D9794M8589C12d8728E8603a6606A56452a93765F8177
11420a66109d7350n9426m4100e4676F4299A1163c8520B80699j33222J96236e4642
11408A58941N9519a77266C2249e7146k0624e15B67380G0758c5440D6362J35823
11397A82185b32180h6943G95b9059A99711a53315G7373a78116A60650a52498B9985
11385d5379j10623O5217A67554f4530E8487O3107a24474A08101b6500C08357c7140
11373f2183j57163d8409f648j5935k58720C3760K7884B0608J24895c4260B25200
11361A05997K03670e2128b2531C06143i7380d6062D3707O5521a47612d3172q2181
$$ y = [270224, -20362, 97864, -35435, -185063, 64472, 109833, -44936, 114444, 117895, -68799, -85607, 226558, -285265, 49794, 98383, 312, -48728, 58603, -16606, 156452, -193765, 68177, -166109, -47350, -106776, -150876, -54676, 64299, 11163, -38520, 280699, 147477, 343713, -54642, 158941, 218460, -177266, 32249, -57146, -77770, -515, 267380, 70758, -35440, 46362, 182185, -232180, -86943, 795, -29059, 199711, -153315, 77373, -178116, 160650, -152498, 29985, -45379, -156002, -90785, 167554, -64530, 58487, 121594, -124474, 108101, -26500, 308357, -37140, -62183, -219346, -48409, -6648, -22583, -281303, 33760, 61644, 20608, 145503, -34260, 225200, 105997, 309667, -52128, -22531, 306143, -97380, -46062, 43707, 109228, -147612, -43172, -125353]
11350a25353A20543d87707a42270d9488l4255K7408G5638O3918h0702A2389a54395
11338B8038a54646j86631F252Q0820a53431A35221a14355q094A64534p1472Q6867
11327A79929a54798F2169B281P519b0632k0937B5020J65248b9888m763D5880a80877
11314a84234O1461j77696C1950g7108B42708h1852B21567i1454j91148f5417n7479
11303a22896N0210a7822C03719b3898H9886j7894c81964b9609A78631a87690E292
11291B18922a01401j98094h7827p8897q990A08916c35904D6784h6681l6246A56192
11279B3433L1628a44240j05257p6804N1942j79232A2437a80525N7841A03081O450
11268A09531b33213D20321D2202a40803A96840E809a14337K0308m1957N7175j22062
$$ y = [-125353, 120543, -487707, -142270, -49488, -83743, -56335, 75638, 139556, -80702, 12389, -154395, 28038, -154646, -341277, 6252, 87072, -153431, 135221, -114355, -122449, 164534, 93062, 179929, -154798, 62169, 2281, 9800, -20632, -41569, 25020, 190268, -29888, -34651, 45880, -180877, -184234, -122773, -300469, 31950, -77108, 242708, -81852, 221567, -91454, -282602, -65417, -122896, -72686, -17822, 303719, -23898, 89886, 71992, -381964, -29609, 178631, -187690, 5292, 218922, -101401, -299495, -87827, -166724, -175714, 108916, -335904, 46784, -86681, -122927, 156192, 23433, 55061, -144240, -249497, -326301, -274359, -453591, 12437, -180525, -122684, 103081, 109531, -233213, 420321, 42202, -140803, 196840, 5809, -114337, -94029, -135986, -78811, -200873]
11257b00873A5818b737A11835N0950N4671g4365A90183r1606m6458L71961b38848
11245a76316B7398O7068P7917g5517B93248b13680B36377a87617j76653i0962
11234B2316J75844I5112a47891J7310A68615d9382j3089A35017f0457A7813Q5310
11223A03123b12419B6619a59105B04182a05377k47311a14820F0876a88488Q5966
11213a02522m1342j27744A22240b40906A33025b07113C38397A06231b37332A83099
11202d5610l9103j46344C4327g8358D8067j8875a43021c9172k0175q7593B05210
11190C63145j44968a55769o8089A1281e80182a55310J570I4467e4080j80486A85074
11178A96657h4993B03004H4492G153a19816A26266a8802Q578A29152A8050K01214
$$ y = [-200873, 15818, -2737, 111835, 162785, 217456, -74365, 190183, 98577, 52119, 424080, -238848, -176316, 27398, 94466, 172383, -75517, 293248, -213680, 236377, -187617, -364270, -90962, 22316, 198160, 95112, -147891, -130581, 168615, -49382, -62471, 135017, -60457, 17813, 103123, -212419, 26619, -159105, 204182, -105377, -352688, -114820, 60876, -188488, -102522, -143864, -271608, 122240, -240906, 133025, -207113, 338397, 106231, -237332, 183099, -45610, -84713, -231057, 34327, -78358, 48067, 29192, -143021, -39172, -59347, -146940, 205210, 363145, 218177, -155769, -223858, 11281, -580182, -155310, -153740, 94467, -54080, -234566, 185074, 196657, -84993, 203004, 84492, 7153, -119816, 126266, -18802, -10224, 129152, 18050, 219264]
11167B19264a24629j83266a16795B6682Q0674b42469a05536q1794a1987j2916
11157b4903B67254a10419O90p3554N8679M7825A25641F685Q7027B8273e7215j5290
11145g2505j69730A4705b04164I451J33023c0531j39730e6027B11784a14996m7726
11134a62722d1747j74400G7511h1570k42014J00251A79573F208a88864h6173k8005
11123a14178j69613B8336j2577d9495A30315a61692K0058E8213c986j83728C37506
11111H6968K59054A29054l6449B7667N9446C5747a47816o9783B8521f4085g560
11099a7506k424A76848b65312B46036j17538e1658B38676I2826i7129E1498M9499
11088A00997K4723L6599K7246K62749j79145A31158R3659a67927a6871C977K30581
$$ y = [219264, -124629, -307895, -116795, 26682, 107356, -242469, -105536, -187330, -11987, -24903, 267254, -110419, -109729, -183283, -124604, -76779, 125641, 6685, 93712, 28273, -57215, -72505, -242235, 14705, -204164, 9451, 142474, -30531, -170261, -56027, 211784, -114996, -162722, -41747, -216147, 77511, -81570, -323584, -223333, 179573, 6208, -188864, -86173, -114178, -283791, 28336, 15759, -49495, 130315, -161692, -141634, 58213, -3986, -187714, 337506, 86968, 346022, 129054, 92605, 27667, 87113, 35747, -147816, -217599, 28521, -64085, -7560, -17506, -19930, 176848, -265312, 246036, 128498, -51658, 238676, 92826, -97129, 51498, 100997, 125720, 162319, 189565, 452314, 273169, 131158, 224817, -167927, -16871, 3977, 234558]
11077B34558G3535Q734P8776L3924l813B927J58557e7086d468D36221E4288J30540
11065A84828h591C34061p5479a26781E2441b21465D57879k20847J05910A4431
11054B03599M01570B19089J38211K08804E0594J52481K12376L1853k13970K30813
11044D64147B02282J82015N3901n6435Q4891j08336K68147j87543k08596L59350
11034E89676k1022p0530K14696j94075J13325B61066J42838j52919Q07890p2857
11024I86018l77678k98397N74233C97881J60433M0856J96432j01473o4004j11736
11014E18389J43345N3819k48396k09992L21783j26686l2531L11550l25016K20051
11004F26316k76981K49493j07042K33275j35307N5890k90630N0283K45698k82317
$$ y = [234558, 73535, 82269, 161045, 194969, 191156, 2927, 161484, -57086, -4468, 436221, 54288, 184828, -8591, 334061, 258582, -126781, 52441, -221465, 457879, 237032, 342942, 14431, 203599, 605169, 219089, 357300, 566104, 50594, 203075, 415451, 447304, 233334, 464147, 202282, 384297, 438198, 381763, 466654, 358318, 626465, 438922, 230326, 589676, 568654, 498124, 712820, 518745, 632070, 261066, 403904, 250985, 1058875, 986018, 608340, 309943, 884176, 397881, 558314, 599170, 795602, 694129, 630125, 518389, 661734, 715553, 467157, 257165, 578948, 452262, 419731, 731281, 406265, 626316, 349335, 598828, 491786, 725061, 589754, 645644, 355014, 405297, 650995, 368678]
10994C68678j3677K8620q7276L28533m2787L1992A61963J76608K07224j60864
10984C84931J20344j71947N30395j64271o0472j91675L21446k48180K30592C50920
10973G54166j4530r4621r0502K43460k27975L54947J50645j29877l61637K54144
10963H38220m5345J91686p2092K26740k06896O00544P8164p1063M38670K23846
10953B202474l07427L02445l5688l15551O5097n23251J45637m17654L51450l8894
10943A428638m88985N52469k48972J46872J54459k50415Q3467j38075m3501o1558
10933A134399k36438K7721k49725k09631l377j7396L4487C101J90024L9466J6599
10922B49190E0537K62485q9041l8131a91849b5201a2413B73859J193G0975J19211
$$ y = [368678, 355001, 383621, 296345, 624878, 582091, 614083, 161963, 338571, 545795, 384931, 505275, 333328, 863723, 699452, 638980, 447305, 768751, 520571, 751163, 350920, 754166, 739636, 645015, 554513, 797973, 569998, 924945, 1075590, 945713, 584076, 838220, 792875, 984561, 912469, 1139209, 932313, 1532857, 1611021, 1539958, 1978628, 2202474, 1895047, 2197492, 2161804, 1846253, 1911350, 1388099, 1533736, 1116082, 1467532, 1428638, 939653, 1492122, 1243150, 1390022, 1544481, 1294066, 1377533, 1239458, 1195957, 1134399, 897961, 925682, 675957, 466326, 462949, 445553, 480040, 3101, 193125, 232591, 249190, 50537, 313022, 223981, 185850, -191849, -25201, -12413, 273859, 275052, 70975, 190186]
10911A90186o6657A4019b14579r8448H0665b74266A1927a31115C57041H9737c71681
10899a38001j4572g011q7063b1683k32260I3798J48417b76024B90728c20769d8248
10887A96641N7879F630h0406b5535m79980C16225d7734H0866B6347J81160b8782
10875C69956c95855e4565A41261C0153g2823B0792c95738a95369C5285a02014
10864A61746c80931a12388j78725A12448K44182D746K03741q8734e3871l34366
10854c88237C8079Q3479n4031C2243b0865j42227I2067a15567D55141j79669b24269
10842i6774q1797d4427l1757n409l6453G0581a7019B666a97400A77920A8431L6700
10830E5131F998e0020j77268O260E27045a05734q8656m1121B16058H2561a96656
$$ y = [190186, 123529, 14019, -214579, -313027, 80665, -274266, 11927, -131115, 357041, 89737, -371681, -138001, -152573, -7011, -94074, -21683, -253943, 93798, 242215, -276024, 290728, -320769, -48248, 196641, 254520, 6630, -80406, -25535, -505515, 316225, -47734, 80866, 26347, 207507, -28782, 369956, -395855, -54565, 141261, 30153, -72823, 20792, -395738, -195369, 35285, -102014, 161746, -380931, -112388, -291113, 112448, 356630, 4746, 208487, 119753, -53871, -388237, 38079, 121558, 67527, 32243, -20865, -163092, 92067, -115567, 455141, 275472, -224269, -96774, -178571, -44427, -76184, -81593, -118046, 70581, -17019, 2666, -197400, 177920, 18431, 55131, 6998, -50020, -227288, -221028, 527045, -105734, -194390, -235511, 216058, 82561, -196656]
10818f7603B2981K84623b29311A03223J13230M6677o5337a48966m6336E47019
10807c32073C97592H6552C0016c60174i9721A15477b18627B51136e2750F4386
10796b87481R9337E63211h0102l20192g826k6143k1743A194a50146e3854a7011
10784D6301m403a17672l399I7030P720K355a08798l7765m9890h0328B11811g4668
10771d72531C9486b63712P9723J7231H8551a31935A67020a7022l9286k65057B27348
10759I4663J0742a16356A20609a5576A44328a94228F8558J49421L01138A80082
10748a52287B34792r7380k6033a24350F9205i6279A99113a9147k81060a37829
10737B14148D7598c90136a12445j32049L8080N8756A36246B7704e3554j35480
$$ y = [-67603, 22981, 307604, -229311, 103223, 216453, 263130, 197793, -148966, -195302, 547019, -332073, 397592, 86552, 30016, -360174, -99721, 115477, -218627, 251136, -52750, 64386, -287481, -188144, 563211, -80102, -400294, -7826, -33969, -55712, 1194, -150146, -53854, -17011, 46301, 41898, -117672, -121071, 97030, 104750, 107105, -108798, -146563, -196453, -80328, 211811, -74668, -472531, 39486, -263712, -183989, -166758, 88551, -131935, 167020, -17022, -56308, -321365, 227348, 94663, 105405, -116356, 120609, -15576, 144328, -194228, 68558, 217979, 519117, 180082, -152287, 234792, 137412, 111379, -124350, 69205, -96279, 199113, -19147, -300207, -137829, 214148, 47598, -390136, -112445, -244494, -206414, -147658, 136246, 27704, -53554, -189034]
10727a89034n4536i1473q5623r6299a22490d1I7397J17446r647b7177A7601D789
10714A37154B0687b18303B2426c27038A18749B9334r873J378g6800j31986J5241
10703a93545Q2418l983A29043a39521k12761Q5838A3726b04233a9259A72743c96782
10691i7413j27452b6131k5799j56697G0438d62765J5257c8543F1186b52021F4793
10679a05688k85557B14842b28625Q0753n4496b4768B8308i8758k40624f0141k26056
10668b86197E0205K3934b34816R1104m5177j25898E3652P2522b81532A70697i108
10656a14652b4606F463a04569K9744a7348q3999a1055A04068d9740J4002j4601
10645e0339l80654A70677G1302i7070C0311K5501f6317j0525j32545I9073C5253
$$ y = [-189034, -243570, -91473, -177096, -273395, -122490, -41, 97397, 214843, 205196, -27177, 17601, 4789, 137154, 20687, -218303, 22426, -327038, 118749, 29334, 19461, 20839, -76800, -208786, -193545, -111127, -115110, 129043, -139521, -352282, -266444, 13726, -204233, -19259, 172743, -396782, -97413, -224865, -26131, -51930, -208627, 70438, -462765, -447508, -38543, 61186, -252021, 64793, -105688, -391245, 214842, -228625, -147872, -202368, -24768, 28308, -98758, -339382, -60141, -286197, 50205, 74139, -234816, -143712, -188889, -314787, 53652, 126174, -281532, 170697, -9108, -114652, -24606, 6463, -104569, -74825, -17348, -101347, -11055, 104068, -49740, -35738, -50339, -430993, 170677, 71302, -97070, 30311, 55812, -66317, -76842, -209387, 99073, 35253]
10633E5035a87276G4199a32423f1741p0697H0953M3524a83829A96959A8083J35966
10622A54049J21620i2943k92095A2084J43144a01690E958c72411E8311a86907
10611a9462A27687a47192k88550B2318k614J80946j9949d1568p5777K9507k23797
10600c11635a1947j22285A0887J9418c04618e7926j046j34241A15611b69676n5399
10589c25075J40984A70246q0284B1794d9811A08679f7156F2920i0041p9174l1527
10578b00742f8958A16023I198M0513a60639r8692Q9368B87465R107a9754j35422
10567a55176f3957F0585a68022A6909J01971b28897n3119d3136C6308i2376G5998
10555A41782d29446G7908C7023b97386b7872B22815D0054c35138a5629p8871k65379
$$ y = [55035, -187276, 74199, -132423, -61741, -132438, 80953, 124477, -183829, 196959, 18083, 154049, 275669, -92943, -385038, 12084, 155228, -101690, 5958, -372411, 58311, -186907, -19462, 127687, -147192, -435742, 22318, 19704, 200650, 180701, -41568, -117345, -87838, -311635, -11947, -134232, 10887, 30305, -304618, -57926, -58972, -193213, 115611, -269676, -325075, -184091, 170246, 89962, 21794, -49811, 108679, -67156, 62920, -90041, -169215, -200742, -68958, 116023, 9198, 49711, -160639, -259331, -169963, 287465, 296572, -19754, -155176, -63957, 60585, -168022, 16909, 118880, -228897, -282016, -43136, 36308, -92376, 75998, 141782, -429446, 77908, 37023, -297386, -27872, 222815, 40054, -335138, -15629, -94500, -359879]
10544c59879a10287C9615B581K1583a45159L6838n0044K8334n2487d6184C2214
10532g137r7268A01403i72m33975A23416d7706A7116L26211a05254l89702B94937
10520a63072j19641E3409A205a11849o3527P0348j198j09578b5020n29696a3834
10508a0477l10500h2277A6344K6406b60358I3456c32037H1763J0491h9190a9871
10496a55359A06644D6742e9385D72123b24959M2466j3336e9387j05152j76716
10486c41255I5790A2072a15498a9030A06639h9689c0161k6254j80121a05514j56697
10475b62211J06334M1854M6001A50254L7282m2995h4278E8497K98389e5883l9145
10464i5028C12335F26P3823J63099K13744K23671k70356a51102C62820F8008a5518
$$ y = [-359879, -110287, 39615, 2581, 24164, -145159, -108321, -158365, -130031, -182518, -46184, 32214, -7137, -104405, 101403, -972, -434947, 123416, -47706, 17116, 343327, -105254, -494956, 294937, -163072, -282713, 53409, 1205, -111849, -175376, -105028, -106226, -215804, -25020, -554716, -13834, -10477, -320977, -82277, 16344, 42750, -260358, 93456, -332037, 81763, 92254, -89190, -19871, -155359, 106644, 46742, -59385, 472123, -224959, -182493, -195829, -59387, -164539, -341255, 95790, 12072, -115498, -19030, 106639, -89689, -30161, -56415, -236536, -105514, -262211, -155877, -114023, -68022, 150254, 187536, 144541, -84278, 58497, 356886, -55883, -95028, 312335, 626, 74449, 237548, 451292, 674963, 404607, -151102, 362820, 68008, -15518]
10452B3621L6684L68129B02087r8985B1631J28195a69838f6678K4610D5644b43385
10440G5498g9862B1257b1250o6024k77559j66833a01775j57266q8597H8670c92772
10428c25820E9016a29746q1892G1281a74638j53888g1760H2499h5276j0528d446
10416B74687e74550a1119m1309A75923G8405b25957l8062A27L74530j59495r5280
10405A19882J07594a34983k25372f6381p9306M6486l70094Q9351C12099A4999
10394B80093j3640n954c2811B35653a83370A1724b77563A6426J78125N0002a11405
10382A59904a0219A13674a64625j66072A8175a03829B08211a34875A1781b5096
10371d7297C16932A36330K54675A21128h6230C75188l5411A63414c2397C873g4425
$$ y = [23621, 60305, 428434, 202087, 103102, 21631, 149826, -169838, -66678, -42068, 45644, -243385, 75498, -79862, 21257, -21250, -87274, -364833, -531666, -101775, -259041, -347638, 88670, -392772, -325820, 59016, -129746, -211638, 71281, -174638, -328526, -71760, 82499, -85276, -95804, -4446, 274687, -574550, -11119, -52428, 175923, 78405, -225957, -264019, 127, 374657, 215162, 119882, 227476, -134983, -360355, -66381, -145687, -99201, -469295, -379944, 312099, 14999, 280093, 266453, 260499, -32811, 235653, -183370, 11724, -277563, 16426, 194551, 244553, -111405, 159904, -10219, 113674, -164625, -330697, 18175, -103829, 208211, -134875, 11781, -25096, -47297, 316932, 136330, 391005, 121128, -86230, 375188, 339777, 163414, -32397, 3873, -74425]
10359D12314j96292K87795n7408A29843Q3190q1J00769O0827K0962A82343A5628
10347C18392J63137A17300b281F41R728J96729P4952j08623Q4938f1475D33221
10335E20036B00150J42010J14053R0542F6628g9725B27085o5371P3814L36388
10325E71916r3674j78838o8240K70717D3885b6947q6533B74594N5653j07423d5780
10313h4009A60515C6310K38701a31650e0950B25735D1914J38264c1252B48330
10302c2393B01771m2534l1342D3853p497f4258B75328D8594J39580i7561H1614
10290a14696j28743J882f96C2126d3958m358G8956b16627A82980a07901A31968
10278a72088k0326C170b38826A14474b90845J38617K7375F7556c05603q862a30695
$$ y = [412314, 216022, 503817, 446409, 129843, 213033, 212952, 313721, 374548, 395510, 182343, 15628, 318392, 481529, 117300, -2281, 641, 10369, 207098, 282050, 173427, 258365, -61475, 433221, 520036, 200150, 342160, 456213, 546755, 66628, -79725, 227085, 161714, 235528, 571916, 478242, 299404, 231164, 501881, 43885, -26947, -113480, 274594, 330247, 222824, -45780, -84009, 160515, 36310, 275011, -131650, -50950, 225735, 41914, 180178, -31252, 248330, -32393, 201771, 159237, 127895, 43853, 36356, -64258, 275328, 48594, 188174, -97561, 81614, -114696, -243439, -241557, -696, 32126, -43958, -48316, 78956, -216627, 182980, -107901, 131968, -172088, -192414, 3170, -238826, 114474, -290845, -152228, -124853, 67556, -305603, -314465, -130695]
10266a44146A33455a63935B18183b54597A11195O009e4440j14725A27309c28649
10255C31942a4045n0793l1585A10884g2101j3397c518j17079C027K01168L86176
10244E90371a63396O2971A10669l0658L2295K27723N4247M6457B8397K3064O2488
10233A13949c8348A0095J52520A3406O3847b09934i4232j18940d0473A46346d8262
10221a93059j53951a36291A3934a91581j92139D7719g2605A05539R638i1188B0657
10209a79173j03561E8549b20981c5645l42547J7477a06753n26541A86233A9574
10198A20141b02476d8987l01117a2178j10459F6541d6317B0246b86907A89863
10187a91611A07827b5576A33214f4499A8622b18641J6155K8005j43662I5451c18122
$$ y = [-144146, 133455, -163935, 218183, -254597, 111195, 117204, -54440, -169165, 127309, -328649, 331942, -14045, -64838, -96423, 110884, -72101, -85498, -3518, -120597, 3027, 204195, 590371, -163396, -100425, 110669, 80011, 112306, 340029, 394276, 440733, 28397, 51461, 113949, -38348, 10095, 162615, 13406, 77253, -209934, -94232, -213172, -40473, 146346, -48262, -193059, -347010, -136291, 13934, -191581, -383720, 47719, -72605, 105539, 115177, -91188, 20657, -179173, -282734, 58549, -220981, -35645, -378192, -360715, -106753, -633294, 186233, 19574, 120141, -202476, -48987, -350104, -12178, -122637, 66541, -46317, 20246, -286907, 189863, -191611, 107827, -25576, 133214, -64499, 18622, -218641, -202486, -174481, -318143, 95451, -318122]
10175H7489a46528I1768a87457g8868k03435A04158k557c21989G0839K57728a53847
10163c68805k0800a09686N2696J7554J0838B0593e3211j93233k4388J10586A90649
10151b30291h7337k79612e5094K5054B12079h9718A55533c10933a50526r4294
10141b44820j25238H0472a02536A93339b53806b5794D6380a29448A4734b92101
10130d27963a09058D5395a41383P075A5798a88666B9253c64509K6304G4137c25040
10118B8921e2132J9491j68082j44516h2688j83662i3163j44791b0921j17344j25031
10107b63296N9194I1597c41645A934J22612f8313G6250P9345a02290E1078d1020
10095a84086A52394d0734j8478j38794A6893b71199A30368b60911F7772J03356
$$ y = [87489, -146528, 91768, -187457, -78868, -282303, 104158, 101601, -321989, 70839, 328567, -153847, -368805, -389605, -109686, -56990, -39436, -28598, 20593, -53211, -246444, -270832, -160246, 190649, -230291, -87337, -366949, -55094, -30040, 212079, -89718, 155533, -310933, -150526, -244820, -370058, 80472, -102536, 193339, -253806, -25794, 46380, -129448, 14734, -292101, -427963, -109058, 45395, -141383, -134308, 15798, -188666, 29253, -364509, -338205, 74137, -325040, 28921, -52132, -32641, -200723, -345239, -82688, -266350, -93163, -237954, -20921, -138265, -263296, -204102, 91597, -341645, 1934, 124546, -68313, 76250, 155595, -102290, 51078, -41020, -184086, 152394, -40734, -59212, -198006, 16893, -271199, 130368, -260911, 67772, 171128]
10085A71128E1745b52065n7353B19519b57261m4138N7125J13722M1389j99435
10075b88598h5960r2517d8613J3622j29489O0904B23660F4139k3483i8631j78466
10064b77097J37243k46721a02566m5979k2712A81314a31119j37947d0372j12408
10054a52780p9729n0900A06612d9633l3621r9803g1466k66852g451j9976k34983
10043b62410A4693f1312k19146A91373H7387a99381g4829D825J09948c7783k34658
10032b72441a11252G3029O4117b04053B10883a29540A32995H505a96558A67635
10021B02287b9427j6862E2676b20208k5817C8536a47860b6337j15888O6A6934
10009b24201J09863A91072l4837a72393E3307b97085a12478B113a46359A00841
$$ y = [171128, 51745, -252065, -309418, 219519, -257261, -301399, -244274, -130552, -89163, -288598, -85960, -178477, -48613, -34991, -164480, -103576, 223660, 64139, 40656, -98631, -277097, -139854, -386575, -102566, -148545, -171257, 181314, -131119, -269066, -40372, -152780, -232509, -283409, 106612, -49633, -83254, -183057, -71466, -338318, -7451, -27427, -262410, 14693, -61312, -280458, 191373, 87387, -199381, -74829, 4825, 114773, -37783, -272441, -111252, 73029, 137146, -204053, 210883, -129540, 132995, 8505, -196558, 167635, 202287, -29427, -46289, 52676, -220208, -246025, 38536, -147860, -26337, -142225, -142159, 16934, -224201, -114338, 191072, 156235, -172393, 53307, -297085, -112478, 2113, -146359, 100841]
9998H4267m0682c5273q7765B25105e4596E514J1782J7654J2009a41433m7928A80199
9985C4792a61343a8694F0981e6669l24850G0146a38010k40234i490E2076d3598
9973G0014j0276Q1520c3427l81406l7530B03309E3047e2887A92172a28176j62363
9962b90539E0507i0495k8434j41059G0877k4620h297E1221O060g6188m0532K1537
9950i5183G2779J66591i8434n5029O3585J1469E2547J083Q6202b60625J01188
9939a59437C41367o2994A19757b83402A236a01876j8568K7493l9486q8558c3801
9927a0662j84147a1025A5045b2151I6354K28608c31254f6940n5317j66653c8314
9915B04262B0360c87784a39941j57195q456K6084A93467r4632c13468A43709e05278
$$ y = [84267, 43585, -35273, -123038, 225105, -54596, 5514, 17296, 34950, 46959, -141433, -189361, 180199, 34792, -161343, -18694, 60981, -56669, -381519, 70146, -138010, -378244, -9490, 52076, -43598, 70014, 59738, 141258, -33427, -414833, -452363, 203309, 53047, -52887, 192172, -128176, -290539, 50507, -90495, -118929, -259988, 70877, 46257, -8297, 51221, 57281, -76188, -116720, -95183, 72779, 239370, -98434, -153463, -89878, -78409, 52547, 53630, 139832, -260625, -159437, 341367, 278373, 119757, -283402, 1236, -101876, -120444, -92951, -132437, -220995, -33801, -10662, -194809, -11025, 15045, -22151, 96354, 324962, -331254, -66940, -122257, -288910, -38314, 204262, 20360, -387784, -139941, -297136, -305592, -279508, 193467, 98835, -313468, 143709, -505278]
9903e4501k26781J32213k74741G2492a23839A31539a35088r0736A02594d6542
9892a83696j45144A15836b4545E7434B2924b9097M694B0493g6336j15535c2616
9880b20116Q7491M2658A38640k9713I970b92349C31468b34141A3081c48356J38290
9869b10066A98374b47723A4777a57954A34563f1584E914a15319n9038n0528J2667
9858b12218k31816K01315J14687I5532c11907M1781J15331j45084a961j2530l06217
9847c20708d6893j12631G6898c01610I7521b41868c0277i162A93478a12830l7042
9836a49872D1500o520c54553a73817H8424L1909C523c4913o9862J8381A00500
9824D6705G998h865k37472H4546b39515J04404a5311j43861j82100c8308n2590
$$ y = [-54501, -281282, -149069, -423810, 72492, -123839, 131539, -135088, -225824, 102594, -46542, -183696, -328840, 115836, -24545, 57434, 22924, -29097, -24403, 20493, -76336, -191871, -32616, -220116, -132625, -89967, 138640, 108927, 9970, -292349, 331468, -234141, 13081, -348356, -210066, 198374, -247723, 14777, -157954, 134563, -61584, 5914, -115319, -174357, -224885, -212218, -444034, -242719, -128032, 95532, -311907, -270126, -154795, -299879, -1961, -14491, -320708, -46893, -159524, 76898, -301610, 97521, -241868, -30277, -9162, 193478, -112830, -149872, 41500, 34980, -354553, -173817, 88424, 120333, 3523, -34913, -104775, -86394, 100500, 46705, 7998, -8865, -246337, 84546, -239515, -135111, -15311, -159172, -341272, -38308, -90898]
9813i0898r8460A86362e4356j61802J6375R4992B2762g6547k24524A40296O1601
9802B01897a27537o825O5651B6183O7282D3112r227i4522j99441B1774K18722
9791B40496d12291A75214a01623D2788N5453L6447a62679O8166D06222A96659
9780C57488A00545j6344a47339j76521i2883k47621b0779j02503a9271F8230e7153
9768c39297j18851a14230B89310H0070F374L56753c61032D6587a07631m2194m4514
9757a94339j71297a00125l5056j69938C8381a788B26228d3484j46067B89081m0985
9746B48096d2000A44079c7692j7707k75098g1035K1152j06454j81058J21944B13032
9734h3555k3234L4995o637j89500f7912j26916Q6614A8866c07566A04321a24337
$$ y = [-90898, -189358, 186362, -54356, -216158, -199783, -104791, 22762, -76547, -301071, 140296, 201897, -127537, -134362, -68711, 26183, 93465, 43112, 33885, -94522, -293963, 21774, 240496, -412291, 175214, -101623, 42788, 98241, 134688, -162679, -94513, 406222, 196659, 357488, 100545, 84201, -147339, -323860, -92883, -340504, -20779, -123282, -19271, 68230, -57153, -339297, -458148, -114230, 289310, 80070, 6374, 363127, -361032, 46587, -107631, -149825, -194339, -365636, -100125, -135181, -305119, 38381, -1788, 226228, -43484, -189551, 289081, 248096, -42000, 144079, -37692, -55399, -330497, -71035, -49883, -156337, -337395, -215451, 213032, -83555, -106789, -71794, -78431, -267931, -67912, -194828, -108214, 18866, -307566, 104321, -124337]
9722C5648J6672R1648M4822d6191j0854j47521R8292A3990h6226k36136c9022
9710a52203O9606k63201J33525j5552E2424a88257a5456j25703B30268E0423M7320
9699I7743R65b54570E4303a33635A18710n2100Q2473a81541A63643c32636B9428
9687A18084a27966B56719a05761E083a36390j20468e9379o6788A088f7717o9909
9676a37626a8581m5314E1832b49068d449o7194R142a7230E6407P279g3948k6831
9664a00779H1176q155c2178B061b68895b786l44804D1338K06624G9590d618r545
9652a4163j8571m0450a8570j20290L0562G5653i5051k73703a08608D2751a21074
9640A00200l1449a2307A554b55857a4132j6178A13556b6179A63877G5267a7566
$$ y = [35648, 52320, 143968, 188790, -46191, -57045, -204566, -106274, 13990, -86226, -322362, -39022, -152203, -82597, -345798, -212273, -227825, 52424, -188257, -15456, -141159, 230268, 50423, 97743, 98708, -254570, 54303, -133635, 118710, 66610, 149083, -181541, 163643, -332636, 29428, 118084, -127966, 256719, -105761, 5083, -136390, -256858, -59379, -126167, 1088, -67717, -137626, -18581, -63895, 51832, -249068, -4449, -71643, -62501, -17230, 56407, 63686, -73948, -100779, 81176, 73021, -32178, 2061, -268895, -2786, -347590, 41338, 247962, 79590, -4618, -14163, -32734, -73184, -18570, -138860, -108298, 75653, -95051, -368754, -108608, 42751, -121074, 100200, 68751, -12307, 1554, -255857, -14132, -30310, 113556, -26179, 163877, 75267, -17566]
9628f9948b6912B24406h910A78689m3277B616d39584A14696b19523q2631a2937
9616G2193k4326a91038j20360f1924j70378B54667c32055I5117b78934o8342h4749
9604A68473b86353a01829b8896l8669o7763A46203a2841F5192J61413a4590m3615
9593e8205A51635c29943a3388E3517b56721G5787c07421e4009C0598e5632D3212
9581d69103a79672m8195a7185j40842e9351N174a9016k01735B0976a18657n5197
9570a73854A31443h4263k19778H9673c15810J12931A8782b20085j35296G9890
9559c5210C25311D333j359Q4066a01132r9783N408k3024j07663c7038m22259b13632
9546A30291b89814E00268b75707A63828p2603j7605b68457E5220e6922A23967
$$ y = [-69948, -26912, 224406, -8910, 178689, 135412, 2616, -439584, 114696, -219523, -302154, -12937, 72193, 47867, -191038, -311398, -61924, -232302, 254667, -332055, 95117, -278934, -347276, -84749, 168473, -286353, -101829, -28896, -67565, -135328, 146203, -12841, 65192, 226605, -14590, -58205, 151635, -329943, -13388, 53517, -256721, 75787, -307421, -54009, 30598, -55632, 43212, -469103, -179672, -227867, -17185, -158027, -59351, -54177, -19016, -220751, 20976, -118657, -173854, 131443, -84263, -304041, 89673, -315810, -202879, 18782, -220085, -355381, 79890, -35210, 325311, 4333, 2974, 87040, -101132, -200915, -195507, -218531, -326194, -37038, -459297, -213632, 130291, -289814, 500268, -275707, 163828, 91225, 73620, -268457, 55220, -56922, 123967]
9535b8706k36230j44426J67857d6001p8357D0189R1384b55772a04639j41666B74386
9523a81828q914d5905k16333B0756J23442a13106Q957A24656a58310g2398J109
9512g1289J2653m7477A57962e881j37987N1399p2115A22047b56007b6375l7540
9501f3915A36536a4310A44463a02711I4582L00469a63806k9436g4837e055q3249
9490h8304B62319d9755I2408d1413k62988a13924K5004J2237q4598H8044B5817
9478a18506d9447k7316A21770c6551F3588L5920L4450m7424K35371c45139G1467
9466f308A00203c33311R0382A22861a56983j62587A04816M2895b02277b1060j62261
9455a83321B27154b82213A49633a72731H4574K0531A8879b07030a740l3074G2865
$$ y = [-28706, -264936, -409362, -241505, -46001, -124358, 40189, 131573, -255772, -104639, -246305, 274386, -181828, -190742, -45905, -262238, 20756, 144198, -113106, -104149, 124656, -158310, -72398, -71289, -58636, -106113, 157962, -5881, -143868, -92469, -164584, 122047, -256007, -26375, -63915, 136536, -14310, 144463, -102711, 94582, 395051, -163806, -193242, -74837, -5055, -88304, 262319, -49755, 92408, -41413, -304401, -113924, -88920, -76683, -161281, 88044, 25817, -118506, -49447, -76763, 121770, -36551, 63588, 99508, 133958, 86534, 321905, -345139, 71467, -6308, 100203, -333311, -242929, 122861, -156983, -319570, 104816, 147711, -202277, -21060, -183321, 227154, -282213, 149633, -172731, 84574, 105105, 18879, -207030, -1740, -34814, 72865]
9443C09474d9145C2567c61800h3353l11424e6565F7585b3621j61522e6114M212
9432e1902a8330p6308M3975A26572d23486a08444C326g0907K6146l18144D2942
9420D8973L6286a78417J718A95535b7139j7225o1622A52601B6999N200c29978
9408B2007N8560b44770a17545K2631d2879l8361A22946a48703r7569c316j28583
9397a31899I3587c56818a35784R71a2654A44274a10676B7299J37883n4918a00925
9385C34601f0237A08867a88128m2637e0027j55719I5023K22824b55718f2081p5404
9374a37485d7933m9176k55951J42132C6154b73048f51k37439C9232Q2307D0140
9362E8481a64840H9013e8965A58323a42725A07757c4860j81440j0439l9603B1980
$$ y = [309474, -49145, 32567, -361800, -83353, -394777, -56565, 67585, -23621, -185143, -56114, -51902, -18330, -94638, -50663, 126572, -423486, -108444, 3326, -70907, -44761, -362905, 42942, 48973, 85259, -178417, -176699, 195535, -27139, -44364, -105986, 152601, 26999, 32199, -329978, 22007, 80567, -244770, -117545, -94914, -42879, -81240, 122946, -148703, -246272, -3316, -131899, 93587, -356818, -135784, -134813, -12654, 144274, -110676, 27299, 165182, 110264, -100925, 334601, -60237, 108867, -188128, -230765, -50027, -205746, 95023, 317847, -255718, -62081, -137485, -47933, -97109, -353060, -210928, 36154, -273048, -651, -238090, 39232, 121539, 40140, 58481, -164840, 89013, -58965, 158323, -142725, 107757, -34860, -216300, -226739, -266342, 21980]
9350a29644m8178A24629Q4179a22758K7695a7990p0078L3077H9725c77242a53033
9338b35789e5395j77802A34106h4044A64920O2972i1152k16406J02497j49534
9328c54595B1574d3683A884a1288q2546K3460m4090j25850C19012A01030a28041
9316b29876H0866g6600A09724a42309j1726j2641o4355B9447c68480E9575a84868
9304a33852a4652j11932G7332H613c4306G1025b17870b5668j25232j8534a4010
9292a3151E0032b17864i4260K5109K3930j41939A999h9558K182a4034j86500q490
9280b09024k6304G1796M592a62983J2032e2105n6176j59694J03507A88850e304
9268b09660g9749j73408B32436a60284l00180a22259C2935a21655N7123j90307
$$ y = [-129644, -177822, 124629, 208808, -122758, -95063, -17990, -88068, -54991, 89725, -377242, -153033, -235789, -55395, -233197, 134106, -84044, 164920, 227892, -91152, -307558, -205061, -354595, 21574, -43683, 1884, -11288, -93834, -70374, -114464, -240314, 319012, 101030, -128041, -229876, 80866, -76600, 109724, -142309, -154035, -166676, -231031, 29447, -368480, 59575, -184868, -133852, -14652, -126584, 77332, 8613, -34306, 71025, -217870, -25668, -150900, -169434, -14010, -13151, 50032, -217864, -94260, -69151, -45221, -187160, 1999, -89558, -87376, -14034, -200534, -209024, -235328, 71796, 76388, -162983, -150951, -52105, -108281, -267975, -164468, 188850, -5304, -209660, -79749, -253157, 232436, -160284, -460464, -122259, 32935, -121655, -64532, -254839]
9258b54839A46857N977F4871d9375F7118i7081B0512N6507a3570j7336j63407
9247a94313B70221f9329L1954h697l9529c452B48363B8759H072b00871M8150g1255
9234A89379d3687j98766E7073J24531J8139g6974B8338J7797a7648j67286j19319
9223c04253h6457j54061A21567b5681j74513K6419d2102j75989J4592A38385J79611
9212C17996a41746E9286b14048m3483O1198m8492C72828a01315E348b55989I4440
9200G911d77093a82481j08677a13255k4786k688L1979j23533c4r0026L9417r3521
9188a44164b1352A1648K4605b0850j18351R297A03959f9494J8742J3633p688B03286
9175E5526b76381e4464e438C39256b54233E5363J46512I1864e7834C62637F5440
$$ y = [-254839, 146857, 152834, 64871, -49375, 67118, -97081, 20512, 77019, -13570, -30906, -194313, 270221, -69329, -37375, -8697, -48226, -3452, 248363, 28759, 8072, -200871, -152721, -71255, 189379, -43687, -242453, 57073, 181604, 199743, -76974, 28338, 46135, -17648, -184934, -304253, -86457, -240518, 121567, -25681, -200194, -173775, -42102, -218091, -203499, 138385, 317996, -141746, 59286, -214048, -257531, -196333, -244825, 372828, -101315, 5348, -255989, 94440, 7911, -477093, -182481, -291158, -113255, -138041, -140729, -108750, -232283, -34, -90060, -50643, -144164, -21352, 11648, 36253, -20850, -139201, -129904, 103959, -69494, -50752, -37119, -44807, 203286, 55526, -276381, -54464, -5438, 339256, -254233, 55363, 201875, 91864, -57834, 362637, 65440]
9163b1189j75591I0527a56491A43384d6479r3869N6014F1717c00849B65410g2116
9151B15472d13590d1941j02639D26936h1674c0567B11019g4648o4715M4683E3533
9139a79487r0579O9080l01897A08313Q875Q2617f52036c286j86594B502c46340
9127b69473G5032c3040k10141D1929Q314b70092H3839d3380j07369b4632q9958
9116a14590J4953n0283B07307c19416G2836C4001J32594c3875j26257K6079E4356
9104C33745C8287a26141j36199D52744a25137A64143b45188A92997a9117A1979
9093b66399B34979e7341A38761a09260j08067f9972j28038g0522b8476J986B10701
9081c71459a23230K9919r267A63705f6606A72080l8974A3747B232R6038j7758
$$ y = [-21189, -196780, 90527, -156491, 143384, -46479, -140348, -84334, 61717, -300849, 265410, -72116, 215472, -413590, -41941, -144580, 426936, -81674, -30567, 211019, -74648, -139363, -94680, 53533, -179487, -270066, -200986, -502883, 108313, 117188, 199805, -652036, -3286, -189880, 2502, -346340, -269473, 75032, -33040, -243181, 41929, 50243, -270092, 83839, -43380, -150749, -24632, -114590, -99637, -149920, 207307, -319416, 72836, 34001, 166595, -33875, -160132, -134053, 54356, 333745, 38287, -126141, -262340, 452744, -125137, 164143, -245188, 192997, -19117, 11979, -266399, 234979, -57341, 138761, -109260, -217327, -69972, -198010, -70522, -28476, -26490, 210701, -371459, -123230, -93311, -102578, 163705, -66606, 172080, 133106, 13747, 2232, 98270, 80512]
9070H0512b51756a0023A47574i3072g411n3892k58108G5685a18819o5961D7746
9058a1076j30154L2596N2439j43225E7223b26407B0650a12836l19422f0846q6361
9047a47207D8303c33920d1057l23227R5737k1103A34496h418A13226g6347j20569
9036a96916A34969h2727A04967j2602Q5612b322I6712b27179c7050A83872J445
9025A85317d21209h8605A30823K2260c20586A57412a22900A86094a71587G2443
9014B44880j06177A7849L79093b63101J26606J6154j46246A58581a66681A4003
9003B00666a89101g4541l4679k28203b0103j2052n02092d2387B12350r0972b21417
8991c9341j95907J12661r8163a02473H7225a55774B06565D9013g42714C9368n617
$$ y = [80512, -251756, -10023, 147574, -93072, -7411, -61303, -319411, 75685, -118819, -184780, 47746, -11076, -141230, -108634, -56195, -199420, 57223, -226407, 20650, -112836, -432258, -60846, -147207, 48303, -333920, -41057, -364284, -268547, -289650, 134496, -8418, 113226, -76347, -196916, 134969, -82727, 104967, 92365, 177977, -2322, 96712, -227179, -37050, 183872, 185317, -421209, -88605, 130823, 153083, -320586, 157412, -122900, 186094, -171587, 72443, 244880, 138703, 17849, 396942, -263101, -136495, -120341, -266587, 158581, -166681, 14003, 200666, -189101, -74541, -109220, -337423, -20103, -32155, -534247, -42387, 212350, 121378, -221417, -39341, -235248, -122587, -220750, -102473, 87225, -155774, 206565, 49013, -742714, 39368, 33751]
8980C3751j903b80645f0970K2500A05206B6624a04661j02311A74820a02563l2693
8969a35256H2496k6034b67671B53922H1921d33474D5060e598B0804b16615e6076
8957b50662J16028K182j22148C660b1880j25105O4803b6251k66959B0847b3056
8945a03201p7314j94778A06868C616a133G8758K0337c6896A33737a76976e0014
8933a78378d5158n3310j86724N4691J5915l5296A34944K10566k3217d3198i207
8921B6134d40467A35858N3000J50747g7251B00389P0924a4413E77295A541K28038
8910B29579j03755M65884k59989P18264L28834J346289K735118L155627C741142
8900B127900r88761n33956j37916k14608m7085J77546D0011L38481i72G4378K47561
$$ y = [33751, 31848, -280645, -60970, -38470, 105206, 26624, -104661, -206972, 174820, -102563, -135256, 82496, 56462, -267671, 253922, 81921, -433474, 45060, -5598, 20804, -216615, -56076, -250662, -134634, -132452, -254600, 3660, -21880, -146985, -82182, -26251, -293210, 20847, -23056, -103201, -180515, -375293, 106868, 3616, -1133, 78758, 99095, -36896, 133737, -176976, -50014, -178378, -45158, -98468, -285192, -230501, -214586, -249882, 134944, 345510, 322293, -43198, -9207, 26134, -440467, 135858, 188858, 339605, -77251, 200389, 271313, -14413, 577295, 1541, 229579, 125824, 591708, 331719, 1049983, 1378817, 2725106, 5460224, 8615851, 3741142, 2127900, 1139139, 605183, 467267, 252659, 205574, 383120, 40011, 378492, -972, 74378, 321939]
8889C21939a10070N2638B86428b05873Q5323a4357A14984K9467a34450M4293A42623
8877g9593k62651A50058h2950l84115B8485P4788a21567D9131R0805k4354c33144
8865a1213A67138b4368m9480J9274k01713j7553A92058m0342n3433l9783a4087
8853a10333L0999j23834b1616L314k47845J18881G8369P018b37833h1381g506
8841A19133e07766d6629k64447F8083b33569Q1167A61254J85154r6877h934l59926
8830c68860E78L9701j5152J87343p6438a60410N8640C04361d63838A29628a7852
$$ y = [321939, -110070, -57432, 286428, -205873, -120550, -14357, 114984, 144451, -134450, -90157, 142623, -79593, -342244, 150058, -82950, -467065, 28485, 103273, -121567, 49131, 139936, 115582, -333144, -11213, 167138, -24368, -73848, -54574, -256287, -273840, 192058, 151716, 98283, 58500, -14087, -110333, -79334, -203168, -21616, -18302, -266147, -147266, 78369, 85387, -237833, -81381, -7506, 119133, -507766, -46629, -311076, 68083, -233569, -152402, 161254, 346408, 249531, -8934, -368860, 578, 40279, 25127, 212470, 136032, -160410, -101770, 304361, -463838, 129628, -17852]
$$ [...]
##END NTUPLES=NMR SPECTRUM
##END=
