
##TITLE=AC1115_Huila3_5835647_LdjiZo3Vq9
##JCAMPDX= 6.0         $$ Bruker NMR JCAMP-DX V2.0
##DATA TYPE= NMR SPECTRUM
##DATA CLASS= NTUPLES
##ORIGIN= BRUKER
##OWNER= Administrator
$$ 1.72 TOPSPIN		Version 2.1
$$ 2012-04-16 19:07:16.640 -0500  Administrator@TOPSPIN
$$ Compression mode = diff/dup
##.OBSERVE FREQUENCY= 400.13188235
##.OBSERVE NUCLEUS= ^1H
##.ACQUISITION MODE= SIMULTANEOUS (DQD)
##.ACQUISITION SCHEME= undefined
##.AVERAGES= 8
##.DIGITISER RES= 22
##SPECTROMETER/DATA SYSTEM= spect
##.PULSE SEQUENCE= zg30
##.SOLVENT NAME= COFFEE_meoh
##.SHIFT REFERENCE= INTERNAL, COFFEE_meoh, 1, 14.98061
##AUDIT TRAIL= $$ (NUMBER, WHEN, WHO, WHERE, PROCESS, VERSION, WHAT)
$$ ##TITLE= Audit trail, TOPSPIN		Version 2.1
$$ ##JCAMPDX= 5.01
$$ ##ORIGIN= Bruker BioSpin GmbH
$$ ##OWNER= Administrator
$$ $$ C:\Bruker\TOPSPIN/data/COFFEE/nmr/AC1115_Huila3_5835647_LdjiZo3Vq9/20/pdata/1/auditp.txt
$$ ##AUDIT TRAIL=  $$ (NUMBER, WHEN, WHO, WHERE, PROCESS, VERSION, WHAT)
(   1,<2012-04-15 17:17:10.093 -0500>,<Administrator>,<TOPSPIN>,<go>,<TOPSPIN 2.1>,
      <created by zg
	started at 2012-04-15 17:16:03.171 -0500,
	POWCHK enabled, PULCHK disabled,
       configuration hash MD5:
       1A 1E CE 29 27 FD 77 03 67 4E F0 E3 C4 B2 CB 90
       data hash MD5: 64K
       8B 11 E2 CC 89 F5 17 4F 9D D5 24 24 98 A1 96 77>)
(   2,<2012-04-15 17:17:12.796 -0500>,<Administrator>,<TOPSPIN>,<proc1d>,<TOPSPIN 2.1>,
      <Start of raw data processing
       efp LB = 0 FT_mod = 6 PKNL = 1 PHC0 = 0 PHC1 = 0 SI = 32K 
       data hash MD5: 32K
       B8 8C 68 0A 0A A6 9B 40 BF F7 69 02 AC 0F 54 D1>)
(   3,<2012-04-15 17:17:13.203 -0500>,<Administrator>,<TOPSPIN>,<proc1d>,<TOPSPIN 2.1>,
      <pk PHC0 = 216.7438 PHC1 = 0 
       data hash MD5: 32K
       38 27 70 FC C0 6F F5 82 1E F5 7F 1C 8C 33 0D 63>)
(   4,<2012-04-15 17:17:13.281 -0500>,<Administrator>,<TOPSPIN>,<proc1d>,<TOPSPIN 2.1>,
      <abs ABSG = 1 
       data hash MD5: 32K
       0B C5 96 6E 81 44 F4 72 59 30 EB 05 FE 9C 8F 3E>)
(   5,<2012-04-15 17:17:13.312 -0500>,<Administrator>,<TOPSPIN>,<proc1d>,<TOPSPIN 2.1>,
      <abs ABSG = 2 
       data hash MD5: 32K
       DE 91 B5 45 B7 D4 22 9B 40 14 24 28 82 6C 12 70>)
(   6,<2012-04-15 17:17:13.343 -0500>,<Administrator>,<TOPSPIN>,<proc1d>,<TOPSPIN 2.1>,
      <abs ABSG = 3 
       data hash MD5: 32K
       4D 91 71 E2 BE 50 9E 46 ED 07 14 2F 2D 75 14 E3>)
(   7,<2012-04-15 17:17:13.375 -0500>,<Administrator>,<TOPSPIN>,<proc1d>,<TOPSPIN 2.1>,
      <abs ABSG = 4 
       data hash MD5: 32K
       33 55 77 7D 68 4E EE DA 7F F1 5F CB EE FC 88 8D>)
(   8,<2012-04-15 17:17:13.390 -0500>,<Administrator>,<TOPSPIN>,<proc1d>,<TOPSPIN 2.1>,
      <abs ABSG = 5 
       data hash MD5: 32K
       17 FD C1 98 B3 8E B0 68 F6 6E 10 56 D6 4B D4 6D>)
(   9,<2012-04-15 17:17:17.140 -0500>,<Administrator>,<TOPSPIN>,<audit>,<TOPSPIN 2.1>,
      <user comment:
       ICON-NMR User ID: COFFEE
       data hash MD5: 32K
       17 FD C1 98 B3 8E B0 68 F6 6E 10 56 D6 4B D4 6D>)
$$ ##END=
$$ 
$$ [...]
150 150 150 150 150 150 150 150
##$TP07= 0
##$TPNAME0= <>
##$TPNAME1= <>
##$TPNAME2= <>
##$TPNAME3= <>
##$TPNAME4= <>
##$TPNAME5= <>
##$TPNAME6= <>
##$TPNAME7= <>
##$TPOAL= (0..7)
0.5 0.5 0.5 0.5 0.5 0.5 0.5 0.5
##$TPOFFS= (0..7)
0 0 0 0 0 0 0 0
##$TUNHIN= 0
##$TUNHOUT= 0
##$TUNXOUT= 0
##$USERA1= <user>
##$USERA2= <user>
##$USERA3= <user>
##$USERA4= <user>
##$USERA5= <user>
##$V9= 5
##$VALIST= <valist>
##$VCLIST= <CCCCCCCCCCCCCCC>
##$VD= 0
##$VDLIST= <DDDDDDDDDDDDDDD>
##$VPLIST= <PPPPPPPPPPPPPPP>
##$VTLIST= <TTTTTTTTTTTTTTT>
##$WBST= 2048
##$WBSW= 25
##$XGAIN= (0..3)
0 0 0 0
##$XL= 0
##$YL= 0
##$YMAX_a= 494786
##$YMIN_a= -581303
##$ZGOPTNS= <>
##$ZL1= 120
##$ZL2= 120
##$ZL3= 120
##$ZL4= 120
##$ABSF1= 14.98061
##$ABSF2= -5.57192
##$ABSG= 5
##$ABSL= 3
##$ALPHA= 0
##$AQORDER= 0
##$ASSFAC= 0
##$ASSFACI= 0
##$ASSFACX= 0
##$ASSWID= 0
##$AUNMP= <proc_prof1d_extract_pilot.lims>
##$AXLEFT= 0
##$AXNAME= <>
##$AXNUC= <1H>
##$AXRIGHT= 0
##$AXTYPE= 0
##$AXUNIT= <>
##$AZFE= 0.1
##$AZFW= 0.1
##$BCFW= 0
##$BC_mod= 0
##$BYTORDP= 0
##$COROFFS= 0
##$CY= 15
##$DATMOD= 1
##$DC= 0
##$DFILT= <>
##$DTYPP= 0
##$F1P= 0
##$F2P= 0
##$FCOR= 0.5
##$FTSIZE= 32768
##$FT_mod= 6
##$GAMMA= 0
##$GB= 0
##$INTBC= 1
##$INTSCL= 1
##$ISEN= 128
##$LB= 0
##$LEV0= 0
##$LPBIN= 0
##$MAXI= 10000
##$MC2= 0
##$MEAN= 0
##$ME_mod= 0
##$MI= 0
##$NCOEF= 0
##$NC_proc= -8
##$NLEV= 6
##$NOISF1= 0
##$NOISF2= 0
##$NSP= 0
##$NTH_PI= 0
##$NZP= 0
##$OFFSET= 14.98061
##$PC= 1
##$PHC0= 216.7438
##$PHC1= 0
##$PH_mod= 1
##$PKNL= yes
##$PPARMOD= 0
##$PPDIAG= 0
##$PPIPTYP= 0
##$PPMPNUM= 2147483647
##$PPRESOL= 1
##$PSCAL= 4
##$PSIGN= 0
##$PYNMP= <proc.py>
##$REVERSE= no
##$SF= 400.13
##$SI= 32768
##$SIGF1= 0
##$SIGF2= 0
##$SINO= 400
##$SIOLD= 32768
##$SPECTYP= <>
##$SREGLST= <1H.CDCl3>
##$SSB= 0
##$STSI= 32768
##$STSR= 0
##$SW_p= 8223.68421052632
##$SYMM= 0
##$S_DEV= 0
##$TDeff= 65536
##$TDoff= 0
##$TI= <>
##$TILT= no
##$TM1= 0
##$TM2= 0
##$TOPLEV= 0
##$USERP1= <user>
##$USERP2= <user>
##$USERP3= <user>
##$USERP4= <user>
##$USERP5= <user>
##$WDW= 1
##$XDIM= 32768
##$YMAX_p= 458090572
##$YMIN_p= -701776
##$CURPLOT= <Network HP LaserJet P1505>
##$CURPRIN= <$Network HP LaserJet P1505>
##$DFORMAT= <normdp>
##$LAYOUT= <+/1D_H.xwp>
##$LFORMAT= <normlp>
##$PFORMAT= <normpl>
##$SURQMSG= 1
$$ End of Bruker specific parameters
$$ ---------------------------------
##NTUPLES= NMR SPECTRUM
##VAR_NAME=  FREQUENCY,     SPECTRUM/REAL,   SPECTRUM/IMAG
##SYMBOL=    X,             R,               I
##VAR_TYPE=  INDEPENDENT,   DEPENDENT,       DEPENDENT
##VAR_FORM=  AFFN,          ASDF,            ASDF
##VAR_DIM=   32768,         32768,           32768
##UNITS=     HZ,            ARBITRARY UNITS, ARBITRARY UNITS
##FACTOR=    0.250966925370066, 1,           1
##FIRST=     8223.43324360095, 49650,        -210605
##LAST=      0,             8600,            -67446
##MIN=       0,             -701776,         0
##MAX=       8223.43324360095, 458090572,    0
$$ Real data points
##PAGE= N=1
##DATA TABLE= (X++(R..R)), XYDATA
$$ [...]
19486h881j59575o5295M371A7706b38948N0071N7886m526r9031J01916H8507a74744
19473b6930n3711k08983i9438m6220A06518C5944i7052q7902A41915a15719B88915
19461c21802c5111e891E6594f4714H2877a73809K7004d3311A65804a91008P7314
19450a13694k79214a89967C02768J4764k6729D8607a01941A20196J65479C4990
19439h4080c1688k69499j56644I4061c10992a21399k12937F8784Q9379b36812
19428c3245j66490A520a93310j56060B5931a05544d8664j03603m9342o3562A17775
19416a57661A03840c95582e6530o2287B827R3449a50689A12072d6556A09470c5326
19404E5622c3981l05152a10348A99555a92512b5968B08939b27919P3088E4942
$$ y = [-8881, -168456, -233751, -229380, 17706, -238948, -188877, -130991, -135517, -234548, -132632, 88507, -174744, -26930, -80641, -289624, -99438, -145658, 106518, 35944, -97052, -184954, 141915, -115719, 288915, -321802, -35111, -5891, 56594, -64714, 82877, -173809, -146805, -43311, 165804, -191008, -113694, -392908, -189967, 302768, 317532, 290803, 48607, -101941, 120196, 285675, 34990, -84080, -31688, -301187, -457831, 94061, -310992, -121399, -334336, 68784, 158163, -236812, -33245, -199735, 1520, -193310, -349370, 25931, -105544, -48664, -152267, -201609, -265171, 117775, -157661, 103840, -395582, -56530, -118817, 2827, 96276, -150689, 112072, -46556, 109470, -35326, 55622, -33981, -339133, -110348, 199555, -192512, -25968, 208939, -227919, -154831, 54942]
19393A24084b11122A23431a31350C18114F0412c1547C4758h5557K7013m7455p9957
19382a85956B03751r2851i5707F2342c74731H0239B7582a51003E9625b07212o2001
19371b69213h6849a5495k6928n9718F9682b30076B05294b16953J06620N1961j13318
19360a71690n1046a8549k6100l60813B3335b5185B48965c28179E2613a4075j8155
19349c2230k50442a07722J2077A85897b21003a05304p4441f9272j33779f8540
19338a46231l0981B24859c90104I9695P0430G3190a09091k069B12396H8239c4952
19326a87117K4663A67118C6891e093m67707A61683d0063k91275R669a9624D13443
19314a62511G880a46248j63602J17826B07790a55800M8978k309r0683j03072j9425
$$ y = [124084, -211122, 123431, -131350, 318114, 60412, -31547, 34758, -85557, -58544, -105999, -185956, 203751, 110900, -95707, 62342, -374731, 80239, 27582, -151003, 59625, -207212, -269213, -86849, -15495, -42423, -102141, 69682, -230076, 205294, -216953, -110333, -58372, -171690, -222736, -18549, -44649, -405462, 23335, -25185, 248965, -328179, 52613, -14075, -32230, -282672, -107722, -95645, 185897, -221003, -105304, -179745, -69272, -203051, -68540, -146231, -177212, 224859, -390104, 99695, 170125, 73190, -109091, -111160, 212396, 88239, -34952, -187117, -162454, 167118, 36891, -5093, -472800, 161683, -40063, -331338, -321669, -19624, 413443, -162511, 7880, -146248, -309850, -192024, 207790, -155800, -106822, -109131, -199814, -302886, -322311]
19303c22311C3311b5334A92140c23290K5067P8181i1672A65298a05824A3121J21119
19292A34240a04099m7444r585k01192A12241g7876E9788f8044I8912J39415e6610
19280d2193G9173b59500A7173P3134c21691a16807b8666j68488I0986a48533k06863
19269c55396C88687b42643a03377k70502E0373J25661o3490j4870K31558i4445
19258c6885k7305E3418P8206n7858b99010H8637a04478q2801d9319q9433b8206
19246B5796a5264C804e0305j83026D2066b51629C0145b63876f0547l1055k63540
19235c55142K8119J39887h3920A8886e84299g5541A69951a8867o5718M1630H5173
19223a46150j6206p4461J09894a9174G5924a38728I6744b0246A40033i0680k18521
$$ y = [-322311, 33311, -25334, 192140, -323290, -298223, -220042, -91672, 165298, -105824, 13121, 134240, -104099, -151543, -161128, -362320, 112241, -77876, 59788, -68044, 98912, 238327, -56610, -42193, 79173, -259500, 17173, 90307, -321691, -116807, -28666, -197154, 90986, -148533, -355396, 388687, -242643, -103377, -373879, 50373, 176034, 112544, 97674, 329232, -94445, -36885, -64190, 53418, 131624, 73766, -299010, 88637, -104478, -187279, -49319, -138752, -28206, 25796, -15264, 3804, -50305, -233331, 42066, -251629, 30145, -263876, -60547, -91602, -355142, -327023, -187136, -83920, 18886, -584299, -75541, 169951, -18867, -84585, -42955, 85173, -146150, -162356, -236817, -126923, -19174, 75924, -138728, 96744, -20246, 140033, -90680, -309201]
19212c09201A65436b86989J11989o9512j8718a26668B31646q6137c25753D0425
19201c18043C5255a07146j2292c5695C7592B915a50548K5403j6581f8886b0630
19189A33186J43308a20343A24151c5601r8965k9886n5823n0478R8605a2853A43702
19177b73938A73024a97680h1077k2167C752b1435A29821b78606D6119a53563A44790
19165B9435K22246I003a0047A09528a25183N7038j23547F7311K57253f5009n7495
19154a22504j98827A00835b37083A97287K7284e7259R486A52134E4153h4325a5400
19142I1618a66078k5656i2499j96545J10886f6946I736K93618i6408B99916B7976
19130a43252c8257A8922a32817j07696B47797d7011k14127N1834H544c02038E8469
$$ y = [-309201, 165436, -286989, -175000, -244512, -263230, -126668, 231646, 145509, -325753, 40425, -318043, 35255, -107146, -119438, -35695, 37592, 2915, -150548, -125145, -141726, -68886, -20630, 133186, 276494, -120343, 124151, -35601, -134566, -164452, -220275, -270753, -172148, -12853, 143702, -273938, 173024, -197680, -81077, -103244, 3752, -21435, 129821, -278606, 46119, -153563, 144790, 29435, 251681, 9003, -10047, 109528, -125183, -68145, -191692, 67311, 324564, -65009, -122504, -321331, 100835, -237083, 197287, 224571, -57259, -47773, 152134, 54153, -84325, -15400, 91618, -166078, -191734, -92499, -289044, -178158, -66946, 9736, 303354, -96408, 299916, 27976, -143252, -38257, 18922, -132817, -240513, 247797, -47011, -261138, -209304, 8544, -302038, 58469]
19118a92264A11772p56D3406e0380b4414l07131J14256C5556M5622c35145B91055
19106b06957p6945n5170j75099A57378J42638b32755A47438m443a24083n4924
19096a79007A09018a73323A37985c61757a23515D37186a92301A60282m0835B2867
19085c60142d7996l6677b6078E7162J3210a92381l5172G7211a44570E5207B1400
19073B88601b79j81355N6590M9675q3987d1742A56615c22477D2310a72937D0994
19061h8132f233A3913c94589i1779B7439c4643D2481a58985f3119j38432B70540
19049g0724m44081g5603a0381k1340o2768I1894K1779E2566j3415c37232r95B88329
19036b18279c2353j51337k4194A24064c2240k31162A4820J15235a38802e7227
$$ y = [-192264, 111772, 111016, 43406, -50380, -24414, -331545, -217289, 35556, 81178, -335145, 291055, -206957, -283902, -339072, -514171, 157378, 300016, -232755, 147438, 142995, -124083, -179007, 109018, -173323, 137985, -361757, -123515, 437186, -192301, 160282, 119447, 22867, -360142, -47996, -84673, -26078, 57162, 70372, -192381, -227553, 77211, -144570, 55207, 21400, 288601, -279, -181634, -125044, -75369, -159356, -41742, 156615, -322477, 42310, -172937, 40994, -88132, -6233, 13913, -394589, -91779, 27439, -34643, 42481, -158985, -63119, -201551, 270540, -70724, -514805, -75603, -10381, -31721, -94489, 91894, 113673, 52566, 39151, -337232, -338227, 288329, -218279, -32353, -183690, -207884, 124064, -32240, -263402, 14820, 130055, -138802, -57227]
19025b41891Q3979i485A48793r09g3898E3540a04384j39419P7265l784j40898
19014c11220a37569M4542l0823a9885A54822b26511A87404C6288c15861A79883
19003h2873C2774a3508l20377i2365o8271g9105j24213C09018D245b56674d1157
18991C9227c7669n3739C4983g1251E8616a60757L9522l179F9926q430L89217g0413
18978a9240I0152K03417i1261F150J08467a18461B20322G9361B988d527j65944
18967a70471I378J65761b6778j60262B43119b21034E6078c8957B4753a2109D86095
18955B75426a99282B38851O0186f6579D7852i4813n32625b4108j71223d7419n7723
18944a05142J8749a1665l51083D5057a64499A26870a01808G2057e9192j19082
$$ y = [-241891, -157912, -9485, 148793, 147884, -73898, 53540, -104384, -243803, -166538, -170322, -311220, -137569, -93027, -123850, -19885, 154822, -226511, 187404, 36288, -315861, 179883, -82873, 32774, -13508, -333885, -92365, -160636, -79105, -203318, 309018, 4245, -256674, -41157, 39227, -37669, -91408, 34983, -71251, 58616, -160757, -121235, -124414, 69926, 61496, 450713, -70413, -19240, 90152, 293569, -91261, 6150, 114617, -118461, 220322, 79361, 2988, -4527, -170471, 9378, 175139, -26778, -187040, 243119, -221034, 56078, -38957, 24753, -12109, 486095, 275426, -199282, 238851, 299037, -66579, 47852, -94813, -627438, -24108, -195331, -47419, -105142, -86393, -11665, -362748, 45057, -164499, 126870, -101808, 72057, -59192, -178274]
18934a78274k1217A67298n0711C6607b67135g4020k04463a01145a711j56679A7590
18922b64004R8464B63685A15251n4231P859A3288J68117J05590a41947e4919m7100
18911a02019J0959A8856Q0520a96468h067j87795j01605C3366a57575p3119O9373
18900a61321O2431D7013J05858b94566a05066E4604K72452F9525O9985l7720m256
18889I7534N1067h8858A1154M3831B1149d8561G777J93499f8493A56051C991i5457
18876I8124a22114B13886d02006J32916c8953B35776d7986l25337e1834j31114
18866a82948M9360l7083k4950K6566f7804l35500a91229B65554f8742j4093j87909
18855b70744i4799r8855b29k65830o3306f5152A59881A9528a05709q3391f7002
$$ y = [-178274, -199491, 167298, 116587, 36607, -267135, -74020, -278483, -101145, -1711, -158390, 17590, -264004, -165540, 263685, 115251, 61020, 68879, 13288, 181405, 286995, -141947, -54919, -102019, -91060, 18856, 99376, -196468, -8067, -195862, -297467, 33366, -157575, -230694, -161321, -98890, 47013, 152871, -294566, -105066, 54604, 327056, 69525, 139510, 101790, 97534, 148601, -88858, 11154, 54985, 21149, -48561, 7777, 201276, -68493, 156051, 3991, -95457, 98124, -122114, 213886, -402006, -269090, -38953, 235776, -47986, -373323, -51834, -182948, -133588, -170671, -195621, -169055, -67804, -403304, -191229, 265554, -68742, -82835, -270744, -94799, -193654, -229, -266059, -329365, -65152, 159881, 19528, -105709, -189100, -67002]
18843a56846B26882E114K28837a41872M9788j41789c5881j49608h7517B29521
18832b44386d6964A80023J12923I0642a42059G7105a49789C57134C253Q130a55535
18820a72199D7047a43726r4920B35523f6527k5121E7660e8872B82172a66441a8065
18808a30173A23825K7302a58211A54764a48318F6297C2658h602j72672G3715P7001
18797A50716F3261b1649l1646F5554J63135a84504N9886d678k44880N9684A55827
18785D984N0835A682a72358j27893I4298M0093b66420A05233h0665N770j53774
18774b28669O8819r7399C08164d1647A14095D4216D131f0752A032K9348a81068
18762c11546J33275q0869K3304i9315L8169B37042a38495A70096q4846g8953m10421
$$ y = [-156846, 226882, 5114, 233951, -141872, -92084, -233873, -35881, -185489, -87517, 229521, -244386, -46964, 180023, 292946, 90642, -142059, 77105, -149789, 357134, 3253, 11383, -155535, -172199, 47047, -143726, -238646, 235523, -66527, -91648, 57660, -58872, 282172, -166441, -18065, -130173, 123825, 151127, -158211, 154764, -148318, 66297, 32658, -8602, -181274, 73715, 150716, 63261, -21649, -53295, 65554, 228689, -184504, -124618, -4678, -249558, -189874, 155827, 4984, 55819, 1682, -172358, -300251, 94298, 134391, -266420, 105233, -80665, -74895, -228669, -159850, -257249, 308164, -41647, 114095, 44216, 4131, -60752, 1032, 30380, -181068, -311546, -178271, -259140, -235836, -99315, -61146, 237042, -138495, 170096, 85250, -78953, -489374]
18751d89374D2487J56549d1567C6948h6111h881C5141c25571F3478a71196p2878
18740b44074a3412j19729B2704P8125b99727c677n7749B409a95658d5543e133
18728a54533l221B5529a49276l30778a15164j999C35291f10329A3968K07868i2522
18716A7154b81499A14145a65122f415j97451B52503b03525E44540e0273l36468
18706c86741J80210n8140c3064C3638K78915b36456a15911C1984h5938a327l1598
18695c2925F3617a74572K1330A19440K0603a55448B5742i2145d1191D4049N0296
18684I4345h2961l32126a02107G38a00112l55207C9081a33655K7850C7348Q6687
18673A24035o0917n815a23777A04830R4953c22220H7948A9671J80967E3689J5382
$$ y = [-489374, 42487, 199036, -41567, 36948, -86111, -8881, 35141, -325571, 63478, -171196, -244074, -13412, -133141, 22704, 100829, -299727, -3677, -61426, 2409, -195658, -45543, -5133, -154533, -157754, 25529, -149276, -480054, -115164, -117163, 335291, -610329, 13968, 221836, -92522, 17154, -281499, 114145, -165122, -6415, -203866, 252503, -203525, 544540, -50273, -386741, -206531, -264671, -33064, 33638, 312553, -236456, -115911, 31984, -85938, -1327, -32925, 63617, -174572, -153242, 119440, 140043, -155448, 25742, -92145, -41191, 44049, 94345, -82961, -415087, -102107, 738, -100112, -455319, 39081, -133655, -105805, 37348, 124035, 63118, 57303, -123777, 104830, 199783, -322220, 87948, 19671, 200638, 53689, 69071]
18662F9071b39344P8621A49556J76694c26958H0792c54688i0741j90542j44592
18652d25875e6688A11222a95877D1533a73791G2012K2482d266A5772e7664A28733
18640A83159g2132n8128j99050i5113j98112e708k55262I5690a35091c611E3181
18628c86053J8850E5649k0612b55899j79987a33362N3598n3787A1352a41210c7072
18616a82088N8571m8614C8825J3711a74948e6269l7204K439A17910a80837A06187
18604C5657a03814B92179b32573A1724J00484g4869l9468j72446A00970J5354
18594A16324f3931m79705a40988j26243k77249a58257l2474D00281B8337a89892
18583A48469a29332K9188D8968c5721A08429b0983B10247B7535c14995A06905
$$ y = [69071, -239344, -160723, 149556, 326250, -326958, 80792, -354688, -90741, -281283, -425875, -56688, 111222, -195877, 41533, -173791, 72012, 94494, -4266, 15772, -57664, 128733, 183159, -72132, -130260, -329310, -95113, -293225, -5708, -260970, 95690, -135091, -3611, 53181, -386053, -367203, 55649, 35037, -255899, -435886, -133362, -79764, -133551, 11352, -141210, -37072, -182088, -123517, -172131, 38825, 52536, -174948, -56269, -93473, -91034, 117910, -180837, 106187, 35657, -103814, 292179, -232573, 11724, 112208, -74869, -114337, -286783, 100970, 116324, -63931, -543636, -140988, -267231, -544480, -158257, -190731, 400281, 28337, -189892, 148469, -129332, -100144, 48968, -35721, 108429, -20983, 210247, 27535, -314995, 106905]
18572c03334I2949a11898E3199b78705N9389j12560J65455A68971p3295g8217
18561F6303a93980P6413M6291j08246c0263j06406L8577C03181a71334p7558C24013
18549A12711a40558B2157f2450n9962l14865a41777E8168b85769f0699D5405a70482
18537a95921a1737j12067m0601M5053a2485j04725a4571j44617P51j44429J11668
18526a91198k54904h6521j16803C9624c67088a10673j37389f3391k0751k6615
18516a10757C9075h2922A12368b27676I4107f4484k0455A2312b24286D2228c13166
18504a06322q6352P1436A61747h2556B54716a15490k03166o0900P8889A44544
18493E6081M1266b1226A17497J2707L1172a49998j79502h0778c1514A30677c622
$$ y = [-303334, 92949, -111898, 53199, -278705, -219316, -331876, -166421, 168971, 95676, -78217, 66303, -193980, -117567, -71276, -179522, -30263, -136669, -98092, 303181, -171334, -248892, 324013, 112711, -140558, 22157, -62450, -122412, -437277, -141777, 58168, -285769, -60699, 45405, -170482, -195921, -11737, -123804, -164405, -119352, -12485, -117210, -14571, -159188, -158437, -302866, -191198, -446102, -86521, -203324, 39624, -367088, -110673, -248062, -63391, -84142, -110757, 39075, -82922, 112368, -227676, 94107, -64484, -84939, 12312, -224286, 42228, -313166, -106322, -192674, -121238, 161747, -82556, 254716, -115490, -318656, -379556, -300667, 144544, 56081, 97347, -21226, 117497, 130204, 161376, -149998, -329500, -80778, -31514, 130677, -3622]
18481a1658A26703g5821k15011A17158g5699E510J77571J73590j21598H148K7046
18470C5194J86836i7460p3321B14918c7832A08404b34853J13042d5939H2791a39305
18458c0955A67132q3455b8829F9331c9055E1315J25007C369K91255e8145j99253
18447b57398g9157K2858j19322G4269J79623F5530a49140A80936C9128d31698
18436a19786G1244e9843G9170a99192A37556g3635j11336C9129F97a80060F0539
18424D3624Q3408h9379m55b8409n8187k14660R0466k34759B67184b44334F8056
18412C27803c43471b9918j16702O991j46665J04611A28071c98116J43667a03150
18401A19819g02j189C4131j58J77975o2484a42652A18715D8726A9058b18588h2555
$$ y = [-11658, 126703, -75821, -290832, 117158, -75699, 5510, 183081, 356671, 235073, 8148, 35194, 222030, -97460, -170781, 214918, -37832, 108404, -234853, -121811, -45939, 82791, -139305, -30955, 167132, 83677, -28829, 69331, -39055, 51315, 176322, 3369, 294624, -58145, -257398, -79157, -56299, -175621, 74269, 253892, 65530, -149140, 180936, 39128, -431698, -119786, 71244, -59843, 79170, -199192, 137556, -73635, -184971, 39129, 697, -180060, 60539, 43624, 127032, -89379, -89834, -28409, -86596, -301256, -210790, -445549, 267184, -244334, 68056, 327803, -343471, -29918, -146620, -139629, -286294, -181683, 128071, -398116, -254449, -103150, 119819, -702, -1891, 34131, 33973, 211948, 149464, -142652, 118715, 48726, 19058, -218588, -82555]
18388E5591K0512L72155A02541a80348A05065J6188b4776A18238a70711D04829
18377b85383j60307B5357d0896B46627B2367K67779b85866k9290D47a59719A28837
18365E3721d0608o0118k5412b6689k24398O6850A749h422p075B8537k581a82647
18352a2807A3808O8897j9897J97538D0035O1644J86035a82608A83297a50304d6731
18340a00187k33644A28182a17258B62303a56724j27051F8828m232h3002H0161
18329a83244L3738A18065f578D2235j0848N6137K3436a67018C1884Q2696a34113
18317c07938C07443b1425B29824a4910A5402J64983J01528C6447J35677a80698
18306a51630A05963d47373K01916H675a7671B0945a18778I3240c48606J15523
$$ y = [55591, 76103, 448258, 102541, -180348, 105065, 121253, -24776, 118238, -170711, 404829, -285383, -445690, 25357, -40896, 246627, 22367, 290146, -285866, -315156, 447, -159719, 128837, 53721, -40608, -100726, -126138, -26689, -251087, -184237, 1749, -8422, -15497, 28537, 25956, -182647, -12807, 13808, 82705, 62808, 260346, 40035, 101679, 287714, -182608, 183297, -150304, -46731, -100187, -333831, 128182, -117258, 262303, -156724, -283775, 68828, 64596, -83002, 80161, -183244, -149506, 118065, -6578, 42235, 31387, 87524, 110960, -167018, 31884, 114580, -134113, -307938, 307443, -21425, 229824, -14910, 15402, 180385, 281913, 36447, 172124, -180698, -151630, 105963, -447373, -245457, 8675, -17671, 20945, -118778, 93240, -348606, -233083]
18296b33083A39150c7552j66497k08353C4239N1501c2080k57028A45159b06920
18285A13767a28865I1591K77169F6651e7627p7451M2215j09636a5590p0748j23257
18274b09595e005r1447c3558j956j54099P4382A5540a57955L3346r5535B39629
18262G657N5680J04655M9592M4013g4680j35370R5311G297K82508a79782A63988
18250A51578m582b66144f3009B14234a69561k3242E3059b35829k8786A37498F8011
18238a84239A13227b20860B474L10656q8530A5962a27357a9595m1587p6566l09906
18227d47654f5944o6855B1070J99849a91885I5182b1666F8553O0958Q63b32913
18215b85359B22687c421C693b52125a21551K061j74743A38262C7304c5845l9980
$$ y = [-233083, 139150, -37552, -204049, -412402, 34239, 85740, -32080, -289108, 145159, -206920, 113767, -128865, 91591, 368760, 66651, -57627, -135078, -92863, -202499, -15590, -86338, -209595, -5005, -96452, -33558, -35514, -189613, -115231, 15540, -157955, -124609, -220144, 239629, 7657, 63337, 167992, 217584, 261597, -74680, -210050, -114739, 7297, 289805, -179782, 163988, 151578, 146996, -266144, -63009, 214234, -169561, -192803, 53059, -235829, -264615, 137498, 68011, -184239, 113227, -220860, 2474, 313130, 224600, 15962, -127357, -19595, -61182, -137748, -447654, -65944, -132799, 21070, 220919, -191885, 95182, -21666, 68553, 129511, 130374, -232913, -285359, 222687, -3421, 3693, -252125, -121551, -119490, -294233, 138262, 37304, -35845, -75825]
18204g5825j60430a02044B58189E3225O7904l1641d4989K680F8140a64203F7512
18192b6071C0090R0880L7843O0605a98046c7413k1384B60808q6684m2587C1820
18180C4641d608I2675Q8601b75595l0727h9741M2026A26379C5426J04494a97781
18168d31092i1166B86169a59934F2938a32264k106l24510A3562J01013c55777
18157b4832E658i9322r123k75106G722b16293A5290K47942F7462J43082a98767
18145c16706h968j33172l40740K16313B73784c33138B605h546j16535I4782c12504
18133B61551c10431f2015K9467I2838b64014c7365I0131a84003R728M6423l91457
18122e19309C45017G426d31304g7642o8762G6595J00516i4730B7785O7648b641
$$ y = [-75825, -236255, -102044, 258189, 53225, 121129, 89488, -44989, -42309, 68140, -164203, 67512, -26071, 30090, 120970, 158813, 219418, -198046, -37413, -58797, 260808, 174124, 131537, 31820, 34641, -4608, 92675, 181276, -275595, -306322, -89741, -47715, 126379, 35426, 139920, -197781, -431092, -91166, 286169, -159934, 62938, -132264, -134370, -458880, 13562, 114575, -355777, -24832, 5658, -99322, -108445, -383551, 7722, -216293, 15290, 263232, 67462, 210544, -198767, -316706, -8968, -142140, -482880, -266567, 273784, -333138, 2605, -8546, -125081, 94782, -312504, 261551, -310431, -62015, -32548, 92838, -264014, -37365, 90131, -184003, -174275, -127852, -519309, 345017, 7426, -431304, -77642, -146404, 76595, 177111, -94730, 27785, 95433, -2641]
18110a61283g8931A57477a07168A13670h8949j0158B8223O3839B2384a36879j98136
18099c35015g0499A15680D05a51518A4248J82067B1024L0627a33214A41660k9636
18088A12024b10559J3130B96108h1511r8514C09646b04575B2829K5624a78042
18077a92571B74640a01304M9342j17646F6979a73134a4677j12638B18676a22863
18066b118D6331b04271J7809A42894a97555E5025a15144A91052a16283I2714C8625
18054d0124H2081e0647j19054d4827B33654a58050F6161a03752A12367O6456J0100
18043A88923K4696F2927c4650l04245C33695I6275b4778H5254c8462I350O3010
18032G2360k9551j7612d3757G3635c30026C8836K03991F5458J49404b1659k72302
$$ y = [-161283, -78931, 157477, -107168, 113670, -88949, -99107, 28223, 92062, 22384, -136879, -335015, -70499, 115680, 405, -151518, 14248, 196315, 21024, 51651, -133214, 141660, 112024, -210559, -197429, 296108, -81511, -180025, 309646, -204575, 22829, 48453, -178042, -192571, 274640, -101304, -51962, -169608, 66979, -173134, -14677, -127315, 218676, -122863, -2118, 46331, -204271, -186462, 142894, -197555, 55025, -115144, 191052, -116283, 92714, 38625, -40124, 82081, -50647, -169701, -44827, 233654, -158050, 66161, -103752, 112367, 178823, 188923, 213619, 62927, -34650, -338895, 333695, 96275, -24778, 85254, -38462, 9350, 72360, 42809, 25197, -43757, 73635, -330026, 38836, 242827, 65458, 214862, -21659, -293961]
18021b93961B23286q1309I035a14300m7420j12017j71004I4337b79921J30719
18011a49202B43337H514a99453g0971E1949j9478a46833I9818M8712K20605I4623
17999B17269j3203b79114f8325k3111j58589d0615A84060C2842j4672P0d3089
17987B67643a21743J8625n7685C38405g0265k35598l5508B88963j31854Q8370
17977B45479a4604m5984B31693p4333I336J7359a09591A94846J02142A2786M33692
17966D46478H0549A9909b5600j2883A23076C6717K52039a14742C34105b45513
17955i2203c411B58674i0718l49739E4014L87729b25801I2381c6411k64487A3225
17943B75340E7249d1386G0946F793M9701K6100b46440j62529B66429C2191j1686
$$ y = [-293961, 223286, 141977, 9035, -114300, -161720, -273737, -444741, 94337, -279921, -149202, 243337, 8514, -199453, -70971, 51949, 32471, -146833, 99818, 148530, 369135, 94623, 217269, 204066, -279114, -68325, -91436, -250025, -40615, 184060, 32842, 18170, 18240, -43089, 267643, -121743, -103118, -160803, 338405, -70265, -305863, -341371, 288963, 157109, 245479, -14604, -60588, 231693, 157360, 9336, 26695, -109591, 194846, 296988, 12786, 446478, 80549, 19909, -25600, -38483, 123076, 36717, 288756, -114742, 334105, -245513, -92203, -3411, 258674, -90718, -440457, 54014, 441743, -225801, 92381, -36411, -300898, 13225, 275340, 57249, -41386, 70946, 6793, 56494, 82594, -246440, -408969, 266429, 32191, 20505]
17932B0505b69915A17309g8227a4909j61382A40663b09740A61380a56510A84995
17921a12573j1699G3905b70901A29444I949a55817A02327C3095b27103e8486A33410
17909B56044H1709a2070C0920a89600Q5890N0979A49989B8154a60662A05675d05793
17897d48714f7946B21661f2295H1041g9685L6552B591L7557g1342j59257e9750
17885B80192n9339b49030K0821J8189G1695Q1178J31481n2808b59766B034f3090
17873a1556k140n4204B1478P0909L0013A0146J17923d3753A3478J4251a59249
17861f4696p4372A52968c33235J06993d3060B31835D6658J06440i8753C13939
17850d4184A6683c16349B70693K0823J1181A08648P0379a65203N8914c7885B01595
$$ y = [20505, -269915, 117309, -78227, -14909, -176291, 140663, -209740, 161380, -156510, 184995, -112573, -124272, 73905, -270901, 129444, 9949, -155817, 102327, 33095, -227103, -58486, 133410, 256044, 81709, -12070, 30920, -189600, -103710, -52731, 149989, 28154, -160662, 105675, -405793, -448714, -67946, 221661, -62295, 81041, -79685, -43133, 2591, 40148, -71342, -230599, -59750, 280192, 220853, -249030, -228209, -210020, 71695, 152873, 284354, 231546, -259766, 2034, -63090, -11556, -13696, -67900, 21478, 92387, 122400, 10146, 128069, -43753, 13478, 27729, -159249, -64696, -139068, 152968, -333235, -226242, -43060, 231835, 46658, 153098, -98753, 313939, -44184, 16683, -316349, 270693, 291516, 302697, 108648, 179027, -165203, -106289, -37885, 201595]
17838C7707a30339O1210G0705a67075I9763b54635B27236a02654A52167P5258
17828B27425q5265a72507A91658C6547N8898K9545a21667c6334C02648B2848f29529
17816B99295k3299D9782c79753a79032A83561p1754m2265a4325B15128b32044
17805d0814B90803n3399m4371E557d00688B9141g9735G6075A2914J3010b18744
17793C0500J01465b53129A0253J63138a59874A84280b28316I5567C075P7375b33218
17781e7503b3579p8732G62J76125b67645L4731E2577a76332A34960a60106I8882
17769a53295I1054a42591O4783B7758J36197a91065C6286b8368A18450d0142A39396
17757g50I6485B548a13111c6481A4413A127J08353a90847A88503o2321a32961
$$ y = [37707, -130339, -69129, 70705, -167075, 99763, -254635, 227236, -102654, 152167, 227425, 142160, -172507, 191658, 36547, 95445, 124990, -121667, -36334, 302648, 22848, -629529, 299295, 275996, 49782, -379753, -179032, 183561, 111807, 69542, -14325, 215128, -232044, -40814, 290803, 237404, 193033, 5557, -400688, 29141, -79735, 76075, 12914, 25924, -218744, 30500, 131965, -253129, 10253, 173391, -159874, 184280, -228316, 95567, 3075, 80450, -233218, -57503, -23579, -102311, 762, 176887, -267645, -232914, 52577, -176332, 134960, -160106, 98882, -153295, 91054, -142591, -77808, 27758, 163955, -191065, 36286, -28368, 118450, -40142, 139396, -750, 96485, 2548, -113111, -36481, 14413, 1127, 109480, -190847, 188503, 126182, -132961]
17745c908k04414C2858J04750k9427M233e9751G0905c44106P2399A7770c94311
17733b42421D1942P5015e6080k339b0027k06553h615A93100J23063b13299A28112
17721C93610e7436m3410E4871e6998k8627A70943a34132C23785a30868M4797K2496
17710f3575j52366b7125J973m4014k01A11380n2295h4444E48199a40991n9488
17699b00479A03274J09726f8407C50993E8555h5699B1722b9303B27684B6673K89831
17688C16504A06616j0840g7832A30510J13887i6331c2070J1506D3253A3513P9393
17677I2906J99089A23371a57612B60537P8819a46166P3024A09376K9563a08098
17666A2933J98841h9190A49074k4482K4347J6419B6741J01144b1277A63746J67436
$$ y = [-3908, -208322, 32858, 137608, 108181, 112414, -59751, 70905, -344106, -271707, 17770, -394311, -242421, 41942, 116957, -56080, -58419, -20027, -226580, -8615, 193100, 316163, -213299, 128112, 393610, -57436, -100846, 54871, -56998, -85625, 170943, -134132, 323785, -130868, -86071, -63575, -215941, -27125, -25152, -69166, -69367, 111380, 59085, -84444, 548199, -140991, -200479, 103274, 213000, -68407, 350993, 58555, -85699, 21722, -29303, 227684, 26673, 316504, 106616, 95776, -77832, 130510, 244397, -96331, -32070, -20564, 43253, 13513, 92906, 291995, 123371, -157612, 260537, 339356, -146166, -73142, 109376, 138939, -108098, 12933, 211774, -89190, 149074, 124592, 148939, 165358, 26741, 127885, -21277, 163746, 331182]
17655C31182A35420Q0709b5230n5529B5317b38937D68946i7498B95225d9797a7023
17643B0090g7467l3698A0416M8422M8143J31915O9616a19046B68529a20583K4618
17632i5965c0177B1881K99452J19493e6799B70268h0643r7806A63819J626a99850
17620f1330j88034B1909J80616c9533D7653b2072F8583e1272E14301b2729j0042
17609c2771C30104A49058a1284E3979J10137a55486M4893C62820h3559A29049
17598a29828B8082c02868b1924B05290b22621F8945l0353P1110l4450j9455J10094
17587A65891J14601E9103O688J06232c9075n4697G6393J27902c835A05510d8181
17575a16784A42742a736r1089p2320A56441L1369P9083A15158B5288a19997o6311
$$ y = [331182, 135420, 216129, -25230, -80759, 25317, -238937, 468946, -97498, 295225, -49797, -17023, 20090, -77467, -111165, 10416, 58838, 106981, 238896, 308512, -119046, 268529, -120583, -95965, -30177, 21881, 321333, 440826, -56799, 270268, -80643, -178449, 163819, 165445, -199850, -61330, -249364, 21909, 202525, -39533, 47653, -22072, 68583, -51272, 514301, -22729, -32771, 330104, 149058, -11284, 53979, 164116, -155486, -110593, 362820, -83559, 129049, -129828, 28082, -302868, -21924, 205290, -222621, 68945, 38592, 109702, 75252, 55797, 165891, 280492, 59103, 65791, 172023, -39075, -93772, 76393, 204295, -3835, 105510, -48181, -116784, 142742, -1736, -92825, -165145, 156441, 187810, 266893, 115158, 25288, -119997, -186308]
17564a86308f5270F6447B2740O0280d8880C15545j51918a55546B7009i8461A00050
17552A51011e6143k90271A02629c1179H6469M2071J10620e5232j06063A27178
17541A74899B4418e011C89039j83259i2688B75763K376O3324E0991M78969d546
17529F613h0134F5479i9367A71957K37180G7143L2942L51157k10074K72840B56798
17517B11181N437J6773a60368B74137J85179A38222J48533K38885K69038J05639
17507I00317Q7871k57874P1445B56072P9233n4628m9249b1383E00759j43783L03593
17496F60569B08054M05186l7085L52978m58250k8624K37686B58987a35091C74282
17485D48252A87236R1708j1470K39043k7508A96595J68075j66051J353C9424K53274
$$ y = [-186308, -65270, 66447, 22740, 83020, -48880, 315545, 163627, -155546, 27009, -98461, 100050, 151011, -56143, -346414, 102629, -31179, 86469, 128540, 239160, -55232, -161295, 127178, 174899, 24418, -5011, 389039, 205780, -92688, 275763, 278139, 341463, 50991, 529960, -4546, 6613, -80134, 65479, -99367, 171957, 409137, 77143, 110085, 461242, 251168, 524008, 256798, 211181, 216618, 233391, -160368, 274137, 459316, 138222, 286755, 525640, 794678, 900317, 988188, 730314, 801759, 256072, 335305, 280677, 231428, -21383, 500759, 356976, 660569, 208054, 613240, 576155, 929133, 470883, 442259, 679945, 258987, -135091, 374282, 448252, 187236, 278944, 267474, 506517, 479009, 196595, 364670, 198619, 199972, 39424, 292698]
17474B92698j16426j9783L26185b0875C4953K15282P2844o5653j14465J72654
17464C15615B8449K39209j21999C5322J75091f3472A35173P4142A03005N3855
17454A56860L1942N7965G3134J27774R9366j35917J67662A56086E045K09619J08859
17443C23523A51404N0934L36635o1481j66331p5209J34700C2882K32815i642I9480
17431E53186A78246Q1370A20866L35165B18227j07946N5654b04755C28469J9289
17421C47758H6862L48164B6906J94988p0976M87693a03841C1849A2786L45432
17411C58218H0937K71951J24507j86745P8646A34263K82284j36485R6246j26895
17401B49413q1909K6784K43137J29786L0886k77203f0590A37325L58248k20322
$$ y = [292698, 176272, 156489, 482674, -20875, 34953, 250235, 323079, 257426, 142961, 315615, 28449, 267658, 145659, 35322, 210413, -63472, 135173, 209315, 103005, 156860, 188802, 246767, 73134, 200908, 300274, 164357, 332019, 156086, 5045, 214664, 323523, 151404, 202338, 538973, 477492, 311161, 235952, 370652, 32882, 265697, -9642, 99480, 553186, 178246, 259616, 120866, 456031, 218227, 110281, 165935, -204755, 328469, 347758, 86862, 435026, 26906, 221894, 150918, 638611, -103841, 31849, 12786, 358218, 80937, 352888, 477395, 290650, 369296, 134263, 416547, 280062, 376308, 249413, 167504, 194288, 437425, 567211, 598097, 320894, -60590, 137325, 495573, 275251]
17391B75251n0065A05684M39845B13958J68006n4811B7107M16677j83475K45097
17381E05406k05103p5181p3537c11948B37764K83287k37480L9525j33083K94391
17371D84404G8577B386N15485D377L33177j23828a26144H5120J91044A31174K31995
17360C63169A47079J00967o0078p3576L25181A58273f7468A69465K69898A99492
17349C49132A23905K4450J34514j9734o6076J07798E2044a71562B16923E7922
17338B03057O4036a57454B34471C8519J32845K7413K11675A17041K94J09605O5758
17327B92698q6269h0141C5682M2979K28560E1556K3852i5863E3172J99473K32280
17316D84925A87301F7318R3862J46931B9303K19763E9168K83357A52457k2396
$$ y = [275251, 225186, 105684, 545529, 213958, 381964, 327153, 27107, 443784, 260309, 505406, 300303, 225122, 151585, -311948, 237764, 521051, 283571, 323096, 190013, 484404, 78577, 2386, 517871, 4377, 337554, 213726, -126144, 85120, 276164, 131174, 363169, 147079, 248046, 187968, 114392, 439573, 158273, -67468, 169465, 439363, 199492, 349132, 123905, 148355, 282869, 263135, 197059, 304857, 52044, -171562, 216923, 57922, 203057, 267093, -157454, 234471, 38519, 171364, 198777, 410452, 117041, 117335, 226940, 292698, 206429, -80141, 35682, 78661, 307221, 51556, 75408, -95863, 53172, 252645, 484925, 187301, 67318, 161180, 308111, 29303, 249066, 59168, 342525, 152457, 130061]
17306A30061P7833K3995J36954A11101J24563C6260J97765C7785a9791I5060J57219
17295B52279C0850M79232A70354i108C94077A32345j3146j1407J24123H7083M1532
17284A28615a30193B38288R9979J66477A02536K71286j78271J44660j23651C9051
17273D27430k03437L1749o0237F9321O6425a0560j24761A14240J08254J34088
17263C56582h278B16029B409K94846a9988G1340L91837B23439K01823B01729a77966
17251C02696A37381c9946B77592J31771M4634A49341M9336J65215F2771K74730
17241C37501q340J5349J49260A41635n329M34457j62160A63285h2019r5815B13111
17229C96631J71140j26082D5618L10349j38656J66509E7521J75777a58073A08347
$$ y = [130061, 207894, 231889, 368843, 111101, 235664, 36260, 234025, 37785, -19791, 95060, 252279, 30850, 510082, 170354, -9108, 394077, 132345, 119199, 107792, 231915, 87083, 128615, -130193, 238288, 338267, 504744, 102536, 373822, 195551, 340211, 216560, 39051, 427430, 223993, 255742, 195505, 69321, 135746, -10560, -135321, 114240, 222494, 356582, -8278, 216029, 2409, 297255, -19988, 71340, 463177, 223439, 425262, 201729, -177966, 302696, 137381, -39946, 277592, 409363, 453997, 149341, 198677, 363892, 62771, 337501, 329161, 344510, 493770, 141635, 136306, 570763, 408603, 163285, -82019, -177834, 213111, 396631, 567771, 441689, 45618, 355967, 217311, 383820, 57521, 233298, -158073, 108347]
17218B02025O6553J8606J09318D0243K17112n3206c8963C51572p3714A13888K51550
17207C65438K31423k23656K23314k66067n7069O5460G649L25885L4510j05421
17197B62623A10288L6183K90519k07905O4852l7177j02054K09227o4807N0210
17187C49336A68515L55543A67367G9505K74435K6263J8114p3102l4868j27035
17177A63312J04209f7214E87831G2968O12052A57593L07070A31498L15870J49444
17167E96812j07121A06943L00826c1581D90036n7447j15478K49655j68057K02652
17157F01361p4581o8318A27089J57242N3273Q9453k10110K79264j44705J8738
17147C70244j2030K528K8540A37040L29021j70044j08053K20159A74396O5322
$$ y = [202025, 268578, 287184, 396502, 40243, 257355, 204149, -38963, 351572, 277858, 113888, 365438, 596861, 373205, 596519, 330452, 273383, 338843, 7649, 333534, 368044, 262623, 110288, 146471, 436990, 229085, 293937, 256760, 154706, 363933, 299126, 349336, 168515, 524058, 167367, 79505, 353940, 380203, 398317, 325215, 290347, 163312, 267521, -67214, 587831, 72968, 685020, 157593, 464663, 131498, 447368, 596812, 489691, 106943, 407769, -31581, 490036, 432589, 317111, 566766, 398709, 601361, 526780, 458462, 127089, 284331, 337604, 427057, 216947, 496211, 351506, 370244, 358214, 360742, 389282, 137040, 466061, 296017, 187964, 408123, 174396, 239718]
17137B39718K94645k18395o591J9221r5841R6415n5755n0713L10422j62251O69286
17126A040161E06382k20321H1984M41686J12888k49231j25875L19344j57335q033
17116D15428M2103k28687L85565j45630j58568K29559A99220L41178k61015Q7537
17106C66920q396o6093K18908K2418r7809L18777k72790j04100J57019A28214
17095C06715e0563F32563C11606K19257j15478N5627P9590j16970j31509L94506
17085F96629k2165o5143B99631K25184L72877l29609K9694B98703L18739k94741
17075C22701L86615B59873N12411O47j32105R6750J61255l47565k32107K25933
17065E45092Q7320L88552D58021R5359k012k72130M06902k33610K58117j40348
$$ y = [239718, 534363, 315968, 309377, 328598, 232757, 329172, 273417, 222704, 533126, 370875, 1040161, 506382, 286061, 81984, 523670, 636558, 387327, 261452, 580796, 423461, 415428, 457531, 228844, 614409, 468779, 310211, 539770, 199220, 540398, 279383, 366920, 358524, 292431, 511339, 533757, 435948, 754725, 481935, 377835, 534854, 128214, 306715, -50563, 632563, 311606, 530863, 415385, 471012, 550602, 433632, 302123, 696629, 674464, 609321, 299631, 524815, 897692, 568083, 597777, 298703, 617442, 322701, 709316, 259873, 772284, 772931, 640826, 737576, 898831, 551266, 319159, 545092, 632412, 1020964, 458021, 553380, 551368, 279238, 686140, 452530, 710647, 570299]
17055E70299J30741j54615K39260B58421K63648P5716k87910N414M29037B10789
17044F19249j32399L02628C92124J82036M69546D12672K33476K651J28937k52903
17034E24833B43146N46143j49268K923K63348l03357P0849j02188K33060r9293
17024G05363j60045J83458K6172k63165J5330K0420J64631k58418N43516j39649
17014H37613k57913L86467l07698K00014K669j91608J08550N0722J40529m21460
17004E47885J30799J82613r0055K40109k24678j78443K7717K85032P3209j17435
16994H76753L82867n67705J70842K9102N4941R0531k7284j58740j82974K15190
16984H83523O7381j02757R7265K24258q0808l05394M55913m79891K37094p1441
$$ y = [570299, 701040, 546425, 785685, 258421, 522069, 597785, 309875, 315289, 744326, 210789, 619249, 486850, 789478, 392124, 574160, 1043706, 412672, 646148, 648799, 777736, 524833, 243146, 789289, 640021, 642944, 906292, 602935, 673784, 571596, 804656, 705363, 545318, 728776, 754948, 491783, 507113, 527533, 692164, 433746, 977262, 837613, 579700, 966167, 658469, 858483, 861152, 669544, 778094, 828816, 969345, 547885, 678684, 861297, 771242, 1011351, 786673, 608230, 635947, 920979, 994188, 876753, 1259620, 691915, 862757, 891859, 946800, 1037331, 1010047, 851307, 668333, 883523, 950904, 848147, 945412, 1169670, 1088862, 783468, 1239381, 759490, 996584, 925143]
16974I25143j15149M54673J30633k65975l11715J24090J93467o8165J4734R452
16964A091188P4074l5051k6687k47204K86307m2277o7516M7393J83354p0097k07162
16953I86322L04442K3426j45997l8581P4726k79098K93158n5927K48895l9361
16943A372005R0605M277j39972M8105J6223j05826J90933P3523m9702k80900J88710
16932A407981J91603q1480M3985k12066l82758N16938p8052o153L02141j18409
16922A583730k58886J45437K15940k54372j70145N4056M67068l96314K78585K35756
16912A900855l74292K23785j36279K7855j78719L72494j05822L68327j42310j08583
16902A847311j96120O6945j86255M86518L8206n2057K1615j22773j84217L64809
$$ y = [925143, 809994, 1264667, 1395300, 1129325, 817610, 941700, 1135167, 1067002, 1081736, 1091188, 1165262, 1130211, 1103524, 856320, 1142627, 1100350, 1032834, 1080227, 1263581, 1193484, 986322, 1290764, 1314190, 1168193, 1129612, 1204338, 925240, 1218398, 1162471, 1411366, 1372005, 1462610, 1466887, 1326915, 1375020, 1391243, 1285417, 1476350, 1549873, 1500171, 1219271, 1407981, 1599584, 1518104, 1562089, 1350023, 967265, 1484203, 1406151, 1399998, 1702139, 1583730, 1324844, 1470281, 1686221, 1431849, 1261704, 1315760, 1782828, 1386514, 1665099, 1900855, 1526563, 1750348, 1614069, 1641924, 1463205, 1835699, 1729877, 2098204, 1955894, 1847311, 1651191, 1718136, 1531881, 2018399, 2056605, 2004548, 2026163, 1903390, 1719173, 2083982]
16892B083982J7329j0769K97731l11882J12604J84733J50168m61289J88783n0956
16882B200434J68058k69250K96828N5758j18861K57259j10643p3274M01613o49668
16872B158254N72221m4761J9297J34156n268l53588J96563J97122J96886l74025
16862B696857L28003k80632N5718J6189J76054p2336L67028l41148J63845K17454
16852C327032j18035r2402L76621k07440J24974k8667L09007j47036J41615L00423
16842C986092k93015K7594L44833j88399j4085M10839l04513J77839p8583J26078
16832D194680K35205K5123k93565L50426L74254J51852j03485J0133R1201l7279
16822D998545N8508M2217K02630L891l2594L04639j39149L48604J21738O3155
$$ y = [2083982, 2101311, 2090542, 2388273, 2076391, 2188995, 2373728, 2523896, 2062607, 2251390, 2200434, 2368492, 2099242, 2396070, 2451828, 2332967, 2590226, 2479583, 2406309, 2807922, 2158254, 2730475, 2685714, 2705011, 2839167, 2833899, 2480311, 2676874, 2873996, 3070882, 2696857, 3024860, 2744228, 2799946, 2816135, 2992189, 2919853, 3286881, 2945733, 3109578, 3327032, 3208997, 3116595, 3493216, 3285776, 3410750, 3382083, 3691090, 3544054, 3685669, 3986092, 3693077, 3720671, 4065504, 3877105, 3863020, 4273859, 3969346, 4147185, 4068602, 4194680, 4429885, 4455008, 4161443, 4511869, 4886123, 5037975, 4934490, 4944623, 5035824, 4998545, 5057053, 5099270, 5301900, 5305791, 5273197, 5577836, 5438687, 5787291, 5909029, 5972184]
16812E972184m1704L68632K17519n125p1040K24165J21850K17726M0452L26563
16802G371222N0955K64741k73428M47692J91836Q65J93247J51986M90906r6236
16792H793786J55164L85290N13430J35949J87016n0470K08849M29943J63973N0634
16782A0973564Q20184J49872K26262R8258K19690P2777Q21534K15136N86894N05007
16772A4689178R318O55945L20140K07240K52913J223705J40680O36179K38372
16763A8373670P85223O38633L08433P36477R65166L92774J014606P43181M65031
16754B4423194J019465J010237R29340J199580N43407J380251J137439J013249
16746C2656162J588362J099124J022135J852089J273566J924711J389079K073354
$$ y = [5972184, 5930480, 6299112, 6516631, 6511506, 6440466, 6664631, 6786481, 7004207, 7044659, 7371222, 7422177, 7686918, 7413490, 7861182, 8053018, 8053883, 8247130, 8399116, 8890022, 8793786, 8948950, 9334240, 9847670, 9983619, 10170635, 10120165, 10329014, 10758957, 10922930, 10973564, 11793748, 11943620, 12169882, 12268140, 12487830, 12560607, 13382141, 13597277, 14184171, 14689178, 14698496, 15354441, 15674581, 15881821, 16134734, 17358439, 17499119, 18135298, 18373670, 19158893, 19797526, 20105959, 20842436, 21807602, 22200376, 23214982, 23958163, 24423194, 25442659, 26452896, 27382236, 28581816, 29125223, 30505474, 31642913, 32656162, 34244524, 35343648, 36365783, 38217872, 39491438, 41416149, 42805228, 44878582]
16738D4878582J811039K156067J820221J936784K531668K019565K836419K581685
16730F2572030L123406K443978L228188K770053L092363L571837L273975L780062
16722H7855892L457075L486900L769003L813847L374570L649117L690435L609347
16714A16706186L071595K852459K884319K439995K075894J755645J259912O62614
16706A33708619P11102l30589n22962r25872j402692k111243k116533k656545
16698A24353285k827453l022089l089027l265263m153789l594654l738240l568398
16690I7094372l847547l745218l502349l580784l204097l525932l079399l448423
16682F9160623k825738k944097k320646k943434k377465k334723k359638j689476
$$ y = [44878582, 46689621, 48845688, 50665909, 52602693, 55134361, 57153926, 59990345, 62572030, 65695436, 68139414, 71367602, 74137655, 77230018, 80801855, 84075830, 87855892, 91312967, 94799867, 98568870, 102382717, 105757287, 109406404, 113096839, 116706186, 119777781, 122630240, 125514559, 127954554, 130030448, 131786093, 133046005, 133708619, 134419721, 134089132, 133566170, 132640298, 131237606, 129126363, 127009830, 124353285, 121525832, 118503743, 115414716, 112149453, 107995664, 104401010, 100662770, 97094372, 93246825, 89501607, 85999258, 82418474, 79214377, 75688445, 72609046, 69160623, 66334885, 63390788, 61070142, 58126708, 55749243, 53414520, 51054882, 49365406]
16674D9365406k515087j642127j644689k233496j389341j535271j297719j557146
16666C5550530j525890j128225j090618j374902j365925q85558q23691q32320
16658B6523401j372370l11690j038735o41831n37816j384532o24138m63340o71009
16649A9477940q29831k38178n31042n39387n39328n17720k42357o46658m67582
16640A4925857m94245l49653j19763p69790k76746k5492m33212m31236l70307
16631A1655413l13906j80070k00275j60425o19908k95345m15480M56525m73964
16622I452565J04180j37309m65480l58599o16033M95291l11763j23192m56251
16613G583409M12761n98260K42101n19697N75046r86448L4510m22317J53885R4088
$$ y = [49365406, 46850319, 45208192, 43563503, 41330007, 39940666, 38405395, 37107676, 35550530, 34024640, 32896415, 31805797, 30430895, 29064970, 28179412, 27355721, 26523401, 25151031, 24839341, 23800606, 23158775, 22620959, 21236427, 20612289, 20148949, 19477940, 18648109, 18409931, 17878889, 17339502, 16800174, 16282454, 16040097, 15393439, 14925857, 14431612, 14081959, 13962196, 13192406, 12915660, 12890168, 12456956, 12025720, 11655413, 11341507, 11161437, 10961162, 10800737, 10180829, 9885484, 9470004, 9926529, 9452565, 9556745, 9419436, 8953956, 8595357, 7979324, 8474615, 8162852, 8039660, 7583409, 7996170, 7397910, 7640011, 7120314, 7695360, 6708912, 6743422, 6321105, 6474990, 6569078]
16603F569078m83848l8387M9773L5710p3469l825j83949k82635n4159j41586l03353
16592E089350k06147M20517r3151m229m01807j7876p5314J1442k17008j88495
16582D317282L74580k64629j53138P2778k65024J15312j60018j6933j06167K06230
16572D120273n37242J90805p7376l05936L44027j33451k64774O7950J36333m55248
16562C085361M2736J13075M1379m03444K30498j69626N7273J0244j96170q7733
16552B723593J22702J80890r7283j94092J98753k27729k61508j53610K18057N8971
16542B568744m37356M37975p8923j29955J62681l07115L31773j60302n8435j988
16532B327099M05213k59269n22980K39954o3431J83149m54320M38719j3986l97042
$$ y = [6569078, 6085230, 6046843, 6096616, 6132326, 6058857, 6055032, 5871083, 5588448, 5534289, 5392703, 5089350, 4883203, 5303720, 5210569, 5206340, 4804533, 4786657, 4711343, 4722785, 4505777, 4317282, 4691862, 4427233, 4274095, 4346873, 4081849, 4197161, 4037143, 4020210, 3914043, 4120273, 3583031, 3773836, 3696460, 3390524, 3734551, 3601100, 3336326, 3404276, 3540609, 3085361, 3128097, 3241172, 3282551, 2879107, 3109605, 2939979, 2997252, 3007496, 2811326, 2723593, 2846295, 3027185, 2929902, 2735810, 2934563, 2706834, 2445326, 2291716, 2509773, 2568744, 2131388, 2569363, 2490440, 2360485, 2523166, 2216051, 2547824, 2387522, 2329087, 2327099, 2732312, 2473043, 1950063, 2190017, 2126586, 2309735, 1855415, 2294134, 2280148, 1883106]
16522A883106r1868J27787j58911J99757l15126L67213M8101n05334J98700M593
16512A758018K34182L44826o88077M72922k83359j72561l46806N19886m02199
16503A436832J04230R2382J99315j06188j80154J92170k85534L03569k29147J73302
16493A700777J28972k22079J57200J21910l67917j13078k7619J61850J25677l82731
16483A282962J48384k19730J29643J20081k02671p1565L62530k28968J91279j38754
16473A373191j09327q1217J69031k39848O9683K54074p1336N7289n66430J75781
16463A030891Q438J94222K8177j41408N6300l60691K61586n4073J10677J00958
16453A235077k79150q7086L22040k18737j00722K69848L8564l42762K36019j05076
$$ y = [1883106, 1791238, 1919025, 1760114, 1959871, 1644745, 2011958, 2060059, 1554725, 1753425, 1758018, 1992200, 2337026, 1648949, 2121871, 1838512, 1665951, 1319145, 1839031, 1436832, 1541062, 1633444, 1832759, 1726571, 1546417, 1738587, 1453053, 1756622, 1527475, 1700777, 1829749, 1607670, 1764870, 1886780, 1518863, 1405785, 1378166, 1540016, 1665693, 1282962, 1431346, 1211616, 1341259, 1461340, 1258669, 1187104, 1549634, 1320666, 1511945, 1373191, 1263864, 1182647, 1351678, 1111830, 1181513, 1435587, 1364251, 1421540, 855110, 1030891, 1039329, 1233551, 1261728, 1120320, 1176620, 815929, 1077515, 1023442, 1134119, 1235077, 955927, 868841, 1190881, 972144, 871422, 1141270, 1179834, 837072, 1073091, 968015]
16443I68015k19605K12605J14456k75690J56735K9455p9420K55502K0028p8048
16433A104033k07789J34467r0032j05711O958K43433m0692m03122L30565L12403
16423A284513k91383r7949k02563K12507k59055L31528j25600K71932l12855P7470
16413H88545o8528R1312j40524J49371j01282L18010l92389j28637L90340j37248
16403H68970Q0002m2958J97362m75828K0399J11747K30007l28337J29779K1350
16393H12493k50808J418P1557l4643K20253l28628L04733K3108k59871L00871
16383H60483k2412N1671j47076Q7241j63827l3503j44540J80442K28955l49883
16373E47551P9431J07328q8387o5597J10793r7777J91231l35762j12061N70902
$$ y = [968015, 748410, 961015, 1075471, 799781, 956516, 985971, 906551, 1162053, 1182081, 1104033, 896244, 1030711, 940679, 834968, 841926, 1085359, 1044667, 641545, 972110, 1284513, 993130, 895181, 692618, 905125, 646070, 977598, 851998, 1123930, 811075, 888545, 820017, 911329, 770805, 920176, 818894, 1136904, 744515, 615878, 1006218, 868970, 948972, 906014, 1103376, 627548, 647947, 759694, 989701, 661364, 791143, 812493, 561685, 563103, 634660, 600017, 820270, 491642, 796375, 819483, 559612, 860483, 838071, 889742, 742666, 829907, 666080, 632577, 488037, 668479, 897434, 547551, 626982, 734310, 645923, 580326, 691119, 593342, 784573, 448811, 336750, 907652]
16363I07652C76311J63480L69452k32351B63201P92784C34815K03067J04946k05429
16353D37399l2570K97674q9957j47144L98265j11498C45428K02474K80570l85385
16343D43087R7833k13962K65564L03793j87597M6128j44464k16149K71859j62328
16333E03764J60365j80828K01278J9401o4193j72276K84508j39266k43329K1883
16323C91307J00539r1097A47274J61579K85182j8104r1624P2881k17746L96074
16313G35516C31313M97423l80190o7677K65402B69936J04341Q9369J86475o5909
16303E84212P153j02456O9251J62617B09438O39234k62987j63420j8714Q4533
16293D88084J54824j9193j60925k24384j630J18916P1383J3381n6222J78126B13771
$$ y = [907652, 376311, 539791, 909243, 676892, 263201, 1055985, 334815, 537882, 642828, 437399, 404829, 702503, 612546, 465402, 863667, 752169, 345428, 547902, 828472, 443087, 540920, 326958, 592522, 896315, 708718, 754846, 610382, 394233, 666092, 503764, 664129, 483301, 684579, 703980, 639787, 467511, 752019, 612753, 369424, 391307, 491846, 400749, 147274, 308853, 594035, 575931, 484307, 557188, 339442, 735516, 331313, 828736, 448546, 380869, 646271, 269936, 374277, 463646, 650121, 584212, 591365, 488909, 558160, 720777, 209438, 848672, 585685, 422265, 403551, 488084, 642908, 623715, 462790, 238406, 236776, 355692, 427075, 440456, 384234, 562360, 213771]
16281A62888M11868q1125j30020A28606K25097M55595J45732l98173B06369J22052
16271C28421K4719J70818m7262A89982E1383K56972j22043L48569r4537k19330
16261B21014m664J63397A11713J76507M19205B16642N5364N06465l28672q6437
16251C63362r3541L663A24322K32227L1828j82894O608J25212i1672F08120k05248
16240D02872j50686R8161r694K6142Q8840J61517k82985B708M36080j47312Q110
16229B99586I5540J85795L92979k78728K9039j23562n7813L61830A32855Q3772
16219B16627J00616A15849J63911J03153M3279B01579L4367E7177f966H3099K34638
16208C17737M1948a6967A05010M89722j71104J15487K04445B10575L05873j87815
$$ y = [162888, 574756, 493631, 363611, 128606, 353703, 809298, 955030, 556857, 206369, 328421, 353140, 523958, 476696, 189982, 51383, 308355, 186312, 534881, 440344, 221014, 216350, 379747, 111713, 288220, 707425, 216642, 272006, 778471, 449799, 363362, 269821, 273484, 124322, 356549, 388377, 205483, 212091, 337303, -91672, 608120, 402872, 252186, 350347, 340653, 366795, 455635, 617152, 334167, 2708, 438788, 291476, 299586, 95540, 281335, 674314, 395586, 424625, 301063, 243250, 605080, 132855, 216627, 317243, 115849, 279760, 382913, 426192, 201579, 235946, 57177, -6966, 83099, 317737, 359685, -16967, 105010, 594732, 423628, 539115, 743560, 210575, 516448, 328633]
16198C28633J0270j58699J38604F1194J92135g8566A55853J62557a8548B48820
16187B48679m650L02598E6125J21604a49622E22830F6262K35061Q725j02491Q5943
16176B93500G2257J14332R1072N0362R682j45809Q140J18535n7380b65311B31719
16164D60768A49390a75496A63493L4809K45344j92611r7357R5085p3096P5346
16154B51013b73573E71855A29593a03471B30126b7407k0104o5957A32656H233
16143A16689M201J35474J01927E4054M40623E3997J16166J576K16483A9206a0745
16131A69021K8930C7082K18220q6170f8894C55766a40761B19503O9638G0418J6088
16120H6506d5974C63698I1822J05027a9863B31347l9581A4700K90702j03543g7459
$$ y = [328633, 338903, 180204, 318808, 61194, 253329, -78566, 155853, 318410, -18548, 248820, 248679, 244029, 546627, 56125, 177729, -149622, 522830, 66262, 301323, 310048, 207557, 293500, 72257, 186589, 277661, 328023, 337705, 191896, 200036, 318571, 261191, -265311, 231719, 460768, 149390, -175496, 163493, 198302, 443646, 251035, 153678, 248763, 175667, 251013, -273573, 571855, 129593, -103471, 230126, -27407, -47511, -113468, 132656, 8233, 116689, 120890, 256364, 358291, 54054, 494677, 53997, 170163, 171739, 388222, 19206, -10745, 169021, 197951, 37082, 255302, 169132, -68894, 355766, -140761, 219503, 289141, 70418, 86506, -45974, 363698, 91822, 196849, -19863, 231347, 191766, 14700, 305402, 201859, -77459]
16108b28314B22333a68303j5573C90753b6610B237M06689I4530L3841Q5860n9836
16097A54395K4838C1994a01989B50158c28146I3129L0760k7866L8891L74132G5632
16085A4467e5522B9917M1131a3439C46945N6271A47316N2287a8989j34436A93774
16073G5855O7410q633L60806b6194j18823B99986A45517c75573C21549c3707A20800
16061A58159b05689B38860e0833j69462I5218A2186J50493a9704E16340G1364
16050e9217C4434d9635A39399K53564A30685J21565o4079K13j2350J2152a02334
16038e3631a5775m0686I3579a7980E654a32600e8688G8267R8075J48810f4543
16026B97347l2506H4940B5837b05808n7761A19385J66692f2155A56940a01700
$$ y = [-228314, 222333, -168303, -183876, 390753, -26610, 2237, 408926, 94530, 128371, 214231, 154395, 179233, 31994, -101989, 250158, -328146, 93129, 123889, 96023, 134914, 509046, 75632, 14467, -55522, 29917, 71048, -13439, 346945, 403216, 147316, 199603, -18989, -153425, 193774, 75855, 143265, 134632, 495438, -26194, -145017, 299986, 145517, -375573, 321549, -33707, 120800, 158159, -205689, 238860, -50833, -220295, 95218, 12186, 162679, -19704, 516340, 71364, -59217, 34434, -49635, 139399, 392963, 130685, 252250, 188171, 188384, 176034, 188186, -102334, -53631, -15775, -56461, 93579, -17980, 5654, -132600, -58688, 78267, 176342, 325152, -64543, 297347, 264841, 84940, 25837, -205808, -263569, 119385, 286077, -62155, 156940, -101700]
16015A66687J83379F2637k6947L107K08480a63162i632k33706J06577b7871J0178
16004a7693q490k76446J46603b0079A94847c3533A68956b7576k07049B08442c5691
15992C57072K1389j78633O6310A05903N3773a42286E0562L9524f0621A63440A4836
15980D44941b49278B07975R0344i5993A29074l8670c0149I1209L14065N64330
15970I69604C78682L96123r9843M0267l43510j03232J94035j27160G7925J6476
15960I4401J40173k5363f2477E5193O7251a78214j69525E4860R6613B3931f0672
15948a12179l7682C32389f3203p9375e8590A45005c87300a66006o1565B03470
15937g463q8650H5754O9867a76262o86B74729a86845b0730F2925O5820o554b2069
$$ y = [166687, 350066, 62637, 35690, 38797, 247277, -163162, -9632, -243338, -136761, -27871, -17693, -26183, -302629, -156026, -20079, 194847, -33533, 168956, -27576, -234625, 208442, -35691, 357072, 378461, 199828, 266138, 105903, 159676, -142286, 50562, 90086, -60621, 163440, 14836, 444941, -249278, 207975, 298319, -95993, 129074, 90404, -30149, 91209, 405274, 969604, 378682, 774805, 674962, 715229, 371719, 268487, 462522, 335362, 77925, 94401, 234574, 209211, -62477, 55193, 122444, -178214, -347739, 54860, 151473, 23931, -60672, -112179, -149861, 332389, -63203, -142578, -58590, 145005, -387300, -166006, -227571, 203470, -7463, -96113, 85754, 155621, -176262, -176948, 274729, -186845, -20730, 62925, 128745, 122191, -22069]
15924i9736B5979b13607b5657k15888g6227j12122k35472b1291p4429C9275c59144
15912F5639a11644k70110B49501q9801j9029G677Q5672a07706A88627b7512E969
15900A33169c4559C09722a25777G2907R4984i0362J4530j25856A5867b50171R7251
15889a52920N8168E2436f1705q2229a6373k52560i3222C3966a47349j88139i8701
15877c34844e633E1358J76157d5676j32127K0533j27300i3937d4637k30597b288
15865a91517j60691a43367k06110a14911B4718a61225B71364D1210b4989C01268
15854A1386i4255l7316A29193b04955D9984a1678I8826a90238R0960r1063P4114
15843a16227E7361O0774b62476A57687c5914j14266A09071R6193e312j96462c29
$$ y = [-99736, 25979, -213607, -25657, -241545, -76227, -188349, -423821, -21291, -95720, 39275, -359144, 65639, -111644, -381754, 249501, 159700, 140671, 7677, 93349, -107706, 188627, -27512, 5969, 133169, -34559, 309722, -125777, 72907, 167891, -90362, -75832, -201688, 15867, -250171, -152920, -94752, 52436, -61705, -143934, -16373, -268933, -93222, 33966, -147349, -335488, -98701, -334844, -5633, 51358, 227515, -45676, -177803, -157270, -284570, -93937, -44637, -275234, -2288, -191517, -352208, -143367, -349477, -114911, 24718, -161225, 271364, 41210, -24989, 301268, 11386, -94255, -131571, 129193, -204955, 49984, -11678, 98826, -190238, -99278, -190341, -116227, 57361, 118135, -262476, 157687, -35914, -150180, 109071, 205264, -5312, -201774, -329]
15831I7162a39922A1152A454g2281B35743g7747k8664D8036d5483j23246j4556
15820a83285A51122a4952A992J12823P5218n2012n0249c13164G7912b4218D9259
15808A25659a54980A1421c35254i897A22748i4281l41527J50042C18664b08631
15797H544a16692I8472Q0790o2928l2817L05633f8189r5717A74564i7557n5256
15786a52813d6351j93450A69158c77120A12400b01943i2236A82168N3153a13018
15775B70936i4205j79475g0468L751k53966B7574m849i7163m6608A86708i1681
15763A2049a19692L3132b3450j61746A43181b28247m1036A27619a35193N0167
15753h5026k77324H8113K6117a86681m8796P0006E4360K12699B0086O0996J80836
$$ y = [97162, -139922, 11152, 1454, -72281, 235743, -77747, -106411, 48036, -45483, -168729, -183285, 151122, -14952, 1992, 114815, 190033, 138021, 87772, -313164, 77912, -24218, 49259, 125659, -154980, 11421, -335254, -9897, 122748, -94281, -435808, -285766, 318664, -208631, 8544, -116692, 98472, 179262, 116334, 83517, 389150, -68189, -163906, 174564, -97557, -152813, -46351, -239801, 169158, -377120, 112400, -201943, -92236, 182168, 235321, -113018, 270936, -94205, -273680, -70468, -66717, -320683, 27574, 22725, -97163, -143771, 186708, -91681, 12049, -119692, -86560, -23450, -185196, 143181, -228247, -269283, 127619, -135193, -85026, -362350, 88113, 114230, -186681, -235477, -165471, 54360, 267059, 20086, 81082, 261918]
15742B61918p0028a62991A43827a89375Q179A38037b18316L0066b7932o5367G6390
15730B71717G7005B3261a81840c6864A13971a6953l29463a08572C3198c14817
15719b00339j13744a14709N3323o6763q7415Q5632B01395b54543e9202A66480
15708a5832E6271b46454C60751A8338J13548b96402D3214a74860b0694j6109k00381
15697b37184E2362M0334B1614J33110b6734j43275A80483q5473L452b35516A21178
15685f7674C3784O3426L0006J20230G5774Q6413g3949M734l71574d6212E88733
15673h6362j09606K4988I1161a85795C05594F7233C2482j5182c05976A03566J62749
15662B66315j21900a40869e4215A3339a23793N4589H2228b37527A65322J6697
$$ y = [261918, 191890, -162991, 143827, -189375, -181196, 138037, -218316, -188250, -27932, -93299, 76390, 271717, 77005, 23261, -181840, -36864, 113971, -16953, -346416, -108572, 33198, -314817, -200339, -314083, -114709, -61386, -128149, -215564, -129932, 201395, -254543, -59202, 166480, -15832, 56271, -246454, 360751, 18338, 131886, -296402, 43214, -174860, -20694, -36803, -237184, 52362, 92696, 21614, 154724, -26734, -170009, 180483, 95010, 98462, -235516, 121178, -67674, 33784, 97210, 127216, 247446, 75774, 162187, -73949, -69215, -440789, -46212, 588733, -86362, -195968, -170980, 91161, -185795, 305594, 67233, 32482, 17300, -305976, 103566, 266315, 144415, -140869, -54215, 13339, -123793, -69204, 82228, -237527, 165322, 182019]
15652A82019e7504b6327k09553E2051J51415F4714J15139C5168J9939A4091b0785
15640A10655g7561I4894b92885j6500A8514J36653b07854E6634a04033C52349
15629a55912k26221a73071L3028a171j10906c5783k2153j05727D9782a19926A94500
15617A13738c79017a03002A6355b16H9267a5325k83326G678P6748J60077d3981
15605B04875b92598R6339g339l0176m409o4594q4271E7112b64948D9500K95737
15594C45237H4363J30446a28418o2736j656A89113N5215C562J74596c4343B11658
15582b17204e8087j33974G0420e1279A45058b74364A82303o5970a60951A41895
15571a15813D6441a93521d3885o5300k0534A4919a26558e3855l63065a64832E0163
$$ y = [182019, -57504, -26327, -235880, 52051, 203466, 64714, 179853, 35168, 55107, 14091, -20785, 110655, -77561, 94894, -292885, -309385, 18514, 155167, -207854, 56634, -104033, 352349, -155912, -382133, -173071, -140043, -1171, -112077, -35783, -57936, -163663, 49782, -119926, 194500, 113738, -379017, -103002, 16355, -216, 89267, -15325, -298651, 7678, 84426, 244503, -43981, 204875, -292598, -196259, -7339, -37515, -41924, -106518, -190789, 57112, -264948, 49500, 345237, 84363, 214809, -128418, -191154, -192810, 189113, 244328, 3562, 178158, -34343, 211658, -217204, -58087, -192061, 70420, -51279, 145058, -274364, 182303, 116333, -160951, 141895, -115813, 46441, -193521, -43885, -109185, -129719, 14919, -126558, -53855, -416920, -164832, 50163]
15559I141a2649l63416B24926n8195i8930j65890P6088M7940f1288C97476g1699
15547c0070A52581m4572d08882A91875d37785a09891A21212b11829A86556c8296
15536a8596l72805J74655A29916d6477j135j09945c0434k44225E2475h1235o4012
15525a45247A40719m5680B0195O8034A4478J879J41760c33782C36926c14210B66364
15513C479J02505a60541A57544N9435H1232K65547e8662B96393a58670q7768A58224
15501A13713b91531J42394B3635K44893i9043p5436b4839A35486J69579F3874
15490B09324a7250B42724H6351J60970d1690A49483J06144b14261D4969A0287
15479b14876A73063M6602E9722a70575B80174j38825J48527G3984C4230e5287
$$ y = [9141, -12649, -376065, 224926, 166731, -98930, -264820, -188732, -140792, -61288, 397476, -71699, -30070, 152581, 108009, -408882, 191875, -437785, -109891, 121212, -211829, 186556, -38296, -18596, -391401, -216746, 129916, -46477, -47612, -157557, -30434, -274659, 52475, -81235, -145247, 140719, 95039, 20195, 88229, 14478, 16357, 158117, -333782, 336926, -314210, 266364, 3479, 105984, -160541, 157544, 216979, 81232, 346779, -58662, 296393, -158670, -246438, 158224, 113713, -291531, -149137, 23635, 268528, -99043, -174479, -24839, 135486, 305065, 63874, 209324, -17250, 242724, 86351, 247321, -41690, 149483, 255627, -214261, 44969, 10287, -214876, 173063, 219665, 59722, -170575, 280174, 141349, 289876, 73984, 34230, -55287]
15468B13029a74301A1L1408h7863b7507C56621j18262a82039I9073J89157O2460
15457C50690n1190P4389J204j21013I4039O7826n9232J26970J0475D0516K74246
15446C14762l3986a36646B0249f8402B31355g3778q2731b030k57061h409j38470
15435a46879L4189A18436a86384E5802L26930I5560K13424j2683q0682J96124
15425D11743K5341J7186R9290k48834A14519M683l6829b03604B65191G3832A5547
15413B36142e5819a8341j6796k36463J05289A87159b727j17620c76j51944C50257
15401B718c2601r8221A11189b33181C8026M2956c02131b2104j19155B50440E3105
15389c45668B17036F7746b12351D6161r845a02613j42479G659K36701h16B00619
$$ y = [213029, -174301, 11, 31419, -87863, -27507, 356621, 238359, -182039, 99073, 288230, 350690, 299500, 373889, 375093, 254080, 94039, 161865, 102633, 229603, 240078, 40516, 314762, 280776, -136646, 20249, -68402, 231355, -73778, -156509, -2030, -259091, -8409, -146879, -112690, 118436, -186384, 55802, 382732, 95560, 308984, 296301, 215619, 411743, 437084, 454270, 553560, 304726, 114519, 119202, 82373, -203604, 265191, 73832, 15547, 236142, -55819, -18341, -35137, -271600, -166311, 187159, -2727, -120347, -376, -152320, 350257, 2718, -32601, -130822, 111189, -233181, 38026, 80982, -302131, -22104, -141259, 250440, 53105, -345668, 217036, 67746, -212351, 46161, 36316, -102613, -245092, 7659, 244360, -816, 200619]
15377i1288I3052a14801N1288b2825D13338b59424B83841b34145A05093K56131
15367C61224i2115B08721G4851I570J90599B1989a26123A77572a93190C82530
15356b3569F4993K42863i111I2869O6097D5285J52297H9572K4836R4015A0841
15344a99369A51885A1182b32261C1869K0852J91340j08295e8934C46154j20564
15334B25590M3524j02415a11467B23890F7860L6769K82147o27b3570A76232J12646
15323B88878K17594p6150c7965J5295B83565a08974G9702C6331L16326j01168
15313B51489C9448K5507J36430b4714B7240M7310I057b32168H1564O188K3248
15302A11000a45459M1462b1280A42357b03162I0958q978C2633c4483H2713j1228
$$ y = [-91288, 93052, -114801, -63513, -22825, 413338, -259424, 283841, -234145, 105093, 361224, -92115, 208721, 74851, 9570, 200169, 21989, -126123, 177572, -193190, 382530, -23569, 64993, 307856, -9111, 92869, 158966, 45285, 197582, 89572, 114408, 208423, 10841, -199369, 151885, 11182, -232261, 31869, 52721, 244061, 135766, -58934, 346154, 225590, 269114, 166699, -111467, 223890, 67860, 104629, 386776, 386149, -23570, 176232, 288878, 506472, 430322, -37965, -22670, 283565, -108974, 79702, 36331, 352657, 251489, 39448, 64955, 201385, -24714, 27240, 74550, 9057, -232168, 81564, 87752, 111000, -145459, -103997, -21280, 142357, -203162, 90958, 81980, 32633, -34483, 82713, 71485]
15291G1485C863i0237b5874A82644l3910b67868J6021Q9967B65950f5865A21541
15279b2472k37245B9819b3698A61860D3490J36443a85066G5282J54181a23895
15268B70262b9514J4735k15278c2646C0961b64881i0738C06219a14521A84065
15257A81682F5010d090B58848J24678j26817a07772k7134A2022K52255b28034
15246A21656c35474C12692i2058E6573c3401k62981B62007h1609C1618b77423
15235D18003A21001n8531d3795D41909j01826L41178M46799J10191m6460J65431
15225A357222m53807m12426j85644O2658b16632g2314D1843b6453m8242C6169
15214a3383B28061q6013a9392l05648a1486d805n2359k62043B06810B9892c320
$$ y = [71485, 3863, -90237, -25874, 182644, 148734, -267868, -251847, -161880, 265950, -65865, 121541, -22472, -259717, 29819, -23698, 161860, 43490, 179933, -185066, 75282, 229463, -123895, 270262, -29514, -14779, -230057, -32646, 30961, -264881, -90738, 306219, -114521, 184065, 181682, 65010, -4090, 258848, 383526, 256709, -107772, -134906, 12022, 264277, -228034, 121656, -335474, 312692, -92058, 56573, -33401, -296382, 262007, -81609, 31618, -277423, 418003, 121001, 62470, -43795, 441909, 340083, 681261, 1128060, 1238251, 1191791, 1357222, 903415, 490989, 305345, 368003, -216632, -72314, 41843, -26453, -74695, 36169, -13383, 228061, 142048, -19392, -325040, -11486, -4805, -57164, -319207, 206810, 29892, -3320]
15202A4034d2035G4854H020h8419M2701H1654a01746A91262h129l16600g6947
15190B11414L3707J5835A21011d6167D8708L42937A83521B5702L41862A37026
15179G4571P9757o9141h5546H1779P8364n5734m0916a26187M9524C1965c89337
15167b752A42006O8027Q4830C7221b6949B86490L4062A0612J06981a05073B33578
15155h1787G9986b93848D7762O0530m9026J23137a14272B01496c3836l87776A0984
15143a13249b6957G8463K37081h9190G2732a73102B95934h5836C68166i3403A92085
15131A10850d7937H9476K15041a00763A99712r1100J07786E8149J24947a26531
15120F8974h6253F5706b0413H2009J1648f4036A92612f798D58379F6241Q549Q9754
$$ y = [14034, -42035, 74854, 8020, -88419, -45718, 81654, -101746, 191262, -8129, -324729, -76947, 211414, 245121, 260956, 121011, -46167, 48708, 391645, 183521, 25702, 367564, 137026, 74571, 154328, 85187, -85546, 81779, 160143, 104409, 63493, -126187, -76663, 31965, -389337, -2752, 142006, 210033, 294863, 37221, -26949, 286490, 320552, 10612, 117593, -105073, 233578, -81787, 79986, -293848, 47762, 108292, 59266, 182403, -114272, 201496, -33836, -421612, 10984, -113249, -26957, 78463, 315544, -89190, 72732, -173102, 295934, -85836, 368166, -93403, 192085, 110850, -47937, 89476, 304517, -100763, 199712, 108612, 216398, 58149, 183096, -126531, 68974, -86253, 65706, -20413, 82009, 93657, -64036, 192612, -6798, 458379, 66241, 74790, 164544]
15108A64544m4925K04832L886e511C70620o0338j08892K13835A47454c81519D9430
15096A47515K8621N2868Q1498A35429a51608D27127b85162A7729g7861A82298
15085F21926a4965E3177J40337H0130c16709h0F3113a85385o3534J13950C82709
15073C38976j08700J8434d7037C37882A41493b31218Q5766B267L07965j082J10149
15062D19299o6314C6081a771p8245A04256M508J05164P4329a19404c1800r3058
15051a24858A61786P2542r8104Q4122g2059B87558E1051Q8754Q7443L3261J77545
15040D38054j68364I2922J47377d5108D34955A68367D6321J68192K2573J03673
15030C40759J24604o5360A40066K13565h5610D63577A20167K31043b7397B22584
$$ y = [164544, 119619, 324451, 328337, -5511, 370620, 310282, 201390, 415225, 147454, -381519, 49430, 147515, 176136, 229004, 310502, 135429, -151608, 427127, -285162, 17729, -77861, 182298, 621926, -14965, 53177, 193514, 80130, -316709, -80, 63113, -185385, -248919, -134969, 382709, 338976, 230276, 248710, -47037, 337882, 141493, -231218, -145452, 2267, 310232, 309150, 419299, 352985, 36081, -1771, -80016, 104256, 108764, 213928, 288257, -119404, -31800, -124858, 161786, 234328, 136224, 220346, -72059, 287558, 51051, 139805, 227248, 260509, 438054, 269690, 92922, 240299, -45108, 434955, 168367, 46321, 214513, 237086, 340759, 465363, 400003, 140066, 353631, -85610, 463577, 120167, 351210, -27397, 222584]
15019B27956K86848B56937K74830j59489K11827k6796J705J33485j01133j8371
15009E72995Q0190k13039j51917L1470j54724J48587K80664F1717K59781A17036
14998E54723B75676M5520C0614K54814N100L2196K9333J11231A38497L57935A95568
14986C71863p9904K2515j42436O4337K57882B6351J67137J85364Q0650c45948
14975E07994j69792K27420j39161J63146B22514P0768K4731A39924M71481R1001
14965G02406j22908k45914L17284k57835E0195K94163Q4823J3842M32124l81274
14955D93873k23834K36641R7034B74559K70548B50929n2952m2609J19145j29843
14945A44670M8055o9959O8161B2349L91891h8221B26012a22742A5254L20089A60104
$$ y = [227956, 514804, 256937, 531767, 372278, 584105, 557309, 559014, 692499, 591366, 572995, 653185, 440146, 288229, 319699, 164975, 313562, 594226, 61717, 321498, 117036, 554723, 275676, 321196, 30614, 285428, 290528, 322724, 352057, 463288, 138497, 496432, 195568, 371863, 291959, 314474, 172038, 236375, 494257, 26351, 193488, 378852, 459502, -345948, 507994, 338202, 565622, 426461, 589607, 222514, 293282, 318013, 139924, 611405, 702406, 579498, 333584, 650868, 393033, 50195, 344358, 429181, 443023, 875147, 493873, 270039, 506680, 603714, 274559, 545107, 250929, 197977, 155368, 274513, 144670, 192725, 122766, 190927, 22349, 414240, -88221, 226012, -122742, 15254, 335343, 160104]
14933E76429A13296D4227L26161L69478B80198H0961M82894j12669K3794m0376
14923D34604J49147B40059K01462J47536j08186m9243L1041M2817n5130J47895
14913E98251J83241J94811r0944J97761q608N1905l2386K81052k02167J3228J36469
14902A322613J10427J83159n2035L51107o80802J18219m65943L42748n68109J0933
14892F72317C15188L54585k42783A94592O09756l86819A69058K00040J97534B81159
14881B58169Q5905p3015L01809l1141j8315B07145J47582A53001M14210n5631
14871E11580B49622L41574n6392q6043K11707J93321j27173j98791K67142J52870
14861I47837k14030k4606k01323Q0628Q9099C31450O23426C06838n2136O7953
$$ y = [576429, 113296, 44227, 370388, 739866, 280198, 80961, 563855, 451186, 474980, 434604, 583751, 240059, 441521, 589057, 480871, 431628, 462669, 505486, 450356, 598251, 781492, 976303, 885359, 1083120, 1074512, 1126417, 1094031, 1375083, 1172916, 1186144, 1322613, 1433040, 1616199, 1564164, 1915271, 1234469, 1352688, 886745, 1229493, 661384, 672317, 315188, 669773, 426990, 194592, 804348, 417529, 169058, 369098, 566632, 281159, 258169, 344074, 271059, 572868, 541727, 523412, 207145, 354727, 153001, 567211, 511580, 249622, 591196, 534804, 448761, 660468, 853789, 726616, 527825, 794967, 947837, 733807, 709201, 507878, 588506, 677605, 331450, 954876, 306838, 254702, 322655]
14851C22655K87361J1937J56773l08736J94341j09841K6987j44760j68068K33287
14841E01936R0397r9334B32350M21877j24758j07464f1888D41620l1032j03677
14831C06911L66690j01640j54880j88275M24431j07674K65540o2399l1739J02298
14821H19263r0421L05751m19222J98546C87652J91804j19904K44493B34088L78071
14811F12159N9509k67348M59619k79982j94078J22374L7394j2347J37435j93744
14801D80991j87153K57758K4889A30300N43483P4779k54853J83312C08778K33819
14791E42597J65261p4163J1851j463p9916p7852p7113L83046k37163J54611k4243
14780F85453k29133K47677k93793j49181L17525m1846j08027J70902j85465o8406
$$ y = [322655, 610016, 621953, 778726, 469990, 664331, 554490, 581477, 436717, 268649, 501936, 592333, 492999, 232350, 654227, 529469, 422005, -61888, 441620, 410588, 306911, 673601, 571961, 417081, 228806, 653237, 545563, 811103, 748704, 716965, 819263, 728842, 1034593, 615371, 813917, 387652, 579456, 459552, 704045, 234088, 612159, 671668, 404320, 863939, 583957, 389879, 512253, 549647, 537300, 674735, 480991, 293838, 551596, 576485, 130300, 673783, 748562, 493709, 677021, 308778, 542597, 707858, 633695, 645546, 644083, 564167, 486315, 409202, 792248, 555085, 709696, 685453, 456320, 703997, 410204, 261023, 578548, 536702, 428675, 599577, 414112, 345706]
14770C45706J15711P5605M2288j94897K82021j67772K55403j09040R6774j08503
14760F33296j99046K61563m18J61899j8485k26632j01985J57003m5301q7013J31126
14749F66007j60349j07387j93789K63802M9811J46673j5989J81444C41179K35256
14739E76435P2246B57087J97375K75203R4395B60720K53688J31775l02698N25698
14729H69183C02916K9554J61231M7851Q5111j01192J07380K18145k9218j00914
14719G20864J39905j15839n9260m5163O3883J01826R0659L89727l7257n903L36123
14708A579565k76028k44979J55237L2857j88055j11529j78327J08627j73730m6071
14698F57567J01664K90729E01355R9556R8364m7899l0847J40696O7687R4447J41717
$$ y = [345706, 461417, 537022, 579310, 384413, 666434, 498662, 754065, 645025, 741799, 633296, 434250, 695813, 695395, 857294, 838809, 612177, 510192, 667195, 621894, 534881, 666007, 505658, 398271, 204482, 468284, 518095, 664768, 648779, 830223, 341179, 576435, 648681, 257087, 454462, 729665, 824060, 260720, 514408, 646183, 343485, 869183, 302916, 332470, 493701, 541552, 626663, 525471, 632851, 850996, 821778, 720864, 860769, 744930, 685670, 640507, 704390, 806216, 896875, 1286602, 1249345, 1243442, 1579565, 1303537, 1058558, 1213795, 1246652, 1058597, 947068, 768741, 877368, 703638, 657567, 759231, 1049960, 501355, 600911, 699275, 651376, 620529, 761225, 828912, 923359, 1065076]
14687A065076L2515k08671N96986n41473J024420m16074J72336m37913n56380
14678G30822J97774K72432j98760k88825L47755l13128J77726R9128l13083K40571
14668I52412l36391L75855k4002j84690j42032J71793O6823l74523L57455J163
14658H63863j91n0561m3476j7892J76279J4115k56604L20753l7119m7680j74807
14647G46680j28998L75746j21208K26683E45215L12976L00184k59425k8779J16130
14637I86301p5574L2625L2508J63043p9773J51828j96630K0688J566r2656J2931
14626I56857J85839j54915r1147l0779K9952R1405o5686J55052o0053M4181j27248
14615I33458k2748q6723K25571O5379q4393P5026L552K01831k39967J26541k02047
$$ y = [1065076, 1097591, 888920, 1485906, 944433, 1968853, 1552779, 1725115, 1287202, 730822, 928596, 1201028, 1002268, 713443, 1061198, 748070, 925796, 1024924, 711841, 952412, 616021, 991876, 967874, 783184, 641152, 812945, 879768, 505245, 862700, 863863, 863672, 813111, 769635, 751743, 928022, 942137, 685533, 1006286, 969167, 921487, 746680, 617682, 993428, 872220, 1098903, 545215, 858191, 1158375, 898950, 870171, 986301, 910727, 943352, 975860, 1138903, 1059130, 1210958, 1014328, 1035016, 1036582, 943926, 956857, 1142696, 987781, 896634, 865855, 895807, 987212, 921526, 1076578, 1016525, 1060706, 933458, 910710, 823987, 1049558, 1114937, 1030544, 1105570, 1109122, 1310953, 1070986, 1197527, 995480]
14604I95480j23763M35243j44664M7500j06004L06488j04895l68705J35690R3988
14594A166358J92852j01524k10300L61031J3742j95019J35084r4836m8435M3822
14584A262775k19918J44274L33450O6174o8268Q7705j35927R0593Q7753k12991
14574A435620k47239M61645k62374j0827M05538l94105j7246K3752K54478j68061
14564A481181J07680O4360o6275J74434P4904l71393K80753P3855k8231K82268
14554B073536j17437l45133L32945J08612l2613R2445k38289O34749k86472n1595
14544B170748M78822J00589k30511L68009M63554k03369P19291P19261K63311
14535D849705J048514K115929L462945N694673P746280N000128r660251p416428
$$ y = [995480, 871717, 1306960, 1162296, 1209796, 1103792, 1410280, 1305385, 936680, 1072370, 1166358, 1359210, 1257686, 1047386, 1408417, 1422159, 1227140, 1362224, 1267388, 1218953, 1262775, 1042857, 1187131, 1520581, 1586755, 1518487, 1606192, 1470265, 1560858, 1648611, 1435620, 1188381, 1650026, 1387652, 1376825, 1782363, 1388258, 1371012, 1394764, 1649242, 1481181, 1588861, 1653221, 1586946, 1761380, 1836284, 1464891, 1745644, 1819499, 1791268, 2073536, 1956099, 1610966, 1943911, 2052523, 2019910, 2112355, 1874066, 2508815, 2222343, 2170748, 2649570, 2750159, 2519648, 2887657, 3351211, 3147842, 3867133, 4586394, 4849705, 5898219, 8014148, 11477093, 17171766, 24918046, 29918174, 20257923, 12841495]
14527A2841495m805977j907248j515774K23674n84450j306877k18763n34019Q4237
14518B276298l22115R9568J65694l27374J75773P3383k1620j85820R0311J48281
14508B172379n2021k96365L74271l23435L06583n6942k12326L64539k9946J09997
14498B356734j82930q6603M8918L1043J90131P532J43756p4767J3784K69280k68416
14487B448462J81438K09974l22377J72675K34859l1188m3246j6708Q9180j15005
14477B808064J27878k627K89125k26131J7503L50859m69507K69170r2176K70188
14467C342346K42785j68545k61493L38137k69741J22481N4181l3980k80235O66795
14457C752731k58995L16447m39116M67168m9746R2139K22740m64955K47015Q1250
$$ y = [12841495, 8035518, 6128270, 4612496, 4836170, 4251720, 2944843, 2726080, 2192061, 2276298, 1954183, 2053751, 2219445, 1892071, 2067844, 2141227, 2119607, 1933787, 2024098, 2172379, 2120358, 1823993, 2198264, 1874829, 2181412, 2124470, 1912144, 2276683, 2246737, 2356734, 2173804, 2087201, 2136119, 2167162, 2357293, 2364825, 2508581, 2433814, 2447598, 2716878, 2448462, 2629900, 2839874, 2517497, 2690172, 2925031, 2893843, 2850597, 2833889, 2923069, 2808064, 2935942, 2933315, 3222440, 2996309, 3013812, 3364671, 2895164, 3164334, 3072158, 3342346, 3585131, 3416586, 3155093, 3493230, 3223489, 3345970, 3400151, 3366171, 3085936, 3752731, 3493736, 3810183, 3371067, 3838235, 3788489, 3880628, 4103368, 3638413, 3885428, 3966678]
14447C966678l09906L05271P4671Q0341P6325K51581o8479j34922L87022k48100
14437D380482K905J84162K6903n3435J92629L31433l85743p2404L90420N8574
14427E055926L30717k12219n0749K84207J42781m12304K19826L2455J24463P9473
14417E594576l6237M70832j97540O2926M76563k61438j17627K71292K01496J9260
14407F484103J6222M22584q6253J75641K43950J88296N3779l9921M68520l2027
14397G894894j10024j8567l2651N35862k07876J12107R7824K85713M04512l24729
14387H637065L65351K95814M7074K8183J15416K39700j78896J91655J19271J54165
14377A0014798J88167J27709N63199k46093K46955L48715K75572K39348L21364
$$ y = [3966678, 3656772, 3962043, 4036714, 4117055, 4193380, 4444961, 4376482, 4241560, 4628582, 4380482, 4383387, 4567549, 4594452, 4541017, 4733646, 5065079, 4679336, 4606932, 4997352, 5055926, 5386643, 5174424, 5123675, 5407882, 5550663, 5138359, 5358185, 5390640, 5515103, 5594576, 5558339, 6029171, 5831631, 5894557, 6371120, 6109682, 5992055, 6263347, 6464843, 6484103, 6500325, 6922909, 6836656, 7012297, 7256247, 7444543, 7498322, 7458401, 7926921, 7894894, 7784870, 7766303, 7733652, 8269514, 8061638, 8173745, 8271569, 8557282, 8961794, 8637065, 9002416, 9298230, 9345304, 9373487, 9488903, 9728603, 9549707, 9741362, 9860633, 10014798, 10202965, 10330674, 10893873, 10647780, 10894735, 11243450, 11519022, 11758370, 12079734]
14368A2079734j51815M84101L00097M38168k10022N32616K20038L61845J13883
14359A4168645J56029K93562K62048L09409M58934N0757L57589K42625M51618
14350A6751216J70540N78113M60779M94673M85950L26324L98879Q4636O30302
14341B0381412L69861O36992L51130K73943N34332Q67651M41877R05879L09841
14332B5072918O88300N78834R79750M20704Q43810O57759O86656J105027O52981
14323C1686739J168819O23928J218294R83030N70032J511745J233739R92785J361940
14314D1351051J243560J579422J181231J532656J803159J687656J347137J999169
14306E3725041K224468J856871K077323K501303K352399K506044K881228K447604
$$ y = [12079734, 11927919, 12412020, 12712117, 13150285, 12940263, 13472879, 13692917, 14054762, 14168645, 14324674, 14618236, 14880284, 15189693, 15648627, 15699384, 16056973, 16299598, 16751216, 16921756, 17499869, 17960648, 18455321, 18941271, 19267595, 19666474, 19751110, 20381412, 20751273, 21388265, 21739395, 22013338, 22547670, 23415321, 23857198, 24763077, 25072918, 25761218, 26340052, 27319802, 27740506, 28584316, 29242075, 29928731, 31033758, 31686739, 32855558, 33479486, 34697780, 35680810, 36250842, 37762587, 38996326, 39989111, 41351051, 42594611, 44174033, 45355264, 46887920, 48691079, 50378735, 51725872, 53725041, 55949509, 57806380, 59883703, 62385006, 64737405, 67243449, 70124677, 72572281]
14298G2572281K665952L226750L734037L265609L583696M134774M089999M223310
14290A01496408M669158N676299N435467N411055O415532O338099O860954P615823
14282A49918795Q047258Q296913Q822695R506263R941509J0960201J1451340J1678781
14274B28623755J2833819J3154314J3677228J3981047J4689546J5091734J4838914
14267C26890357J5088702J4881588J4450387J3924599J3669550J3150020J2675450
14260D24730653J1719658J0753404P240006K681620Q51134O991J07106l955178
14252D54135394n814292n107684n129427q976766j3086774j3979228j4537970
14245C87503253j4687853j4894859j4871646j5449535j4615646j4581862j4408159
$$ y = [72572281, 75238233, 78464983, 82199020, 85464629, 89048325, 93183099, 97273098, 101496408, 106165566, 111841865, 117277332, 122688387, 129103919, 135442018, 142302972, 149918795, 157966053, 166262966, 175085661, 184591924, 194533433, 205493634, 216944974, 228623755, 241457574, 254611888, 268289116, 282270163, 296959709, 312051443, 326890357, 341979059, 356860647, 371311034, 385235633, 398905183, 412055203, 424730653, 436450311, 447203715, 454443721, 457125341, 457976475, 457983466, 458090572, 454135394, 448321102, 443213418, 438083991, 429107225, 416020451, 402041223, 387503253, 372815400, 357920541, 343048895, 327599360, 312983714, 298401852, 283993693]
14238B83993693j3882448j2879824j2743903j2249970j2319676j2060309j1484794
14231A96372769j0810645r409970r223395q582659q085529p512435o842269o597004
14223A29308863o171037n634982n356216n265141m775468m649526m116466l628518
14215H9711509l491525l791863l175118l424883k877615k984787k462902k494898
14207F5007918j982042k737735k026358k237393j766535j986442j711451j402889
14199D9157073j685710j373690j520397j605177q87411j446776j417969n71693
14191C8648250j162308j230076j421199p24213r23221o27332o44030r94725j245840
14182B9675306n01882p05394j021104l30871p84495m52916o86637j073609m82332
$$ y = [283993693, 270111245, 257231421, 244487518, 232237548, 219917872, 207857563, 196372769, 185562124, 176152154, 166928759, 158346100, 150260571, 142748136, 135905867, 129308863, 123137826, 117502844, 112146628, 106881487, 102106019, 97456493, 93340027, 89711509, 86219984, 82428121, 79253003, 75828120, 72950505, 69965718, 67502816, 65007918, 63025876, 60288141, 58261783, 56024390, 54257855, 52271413, 50559962, 49157073, 47471363, 46097673, 44577276, 42972099, 42084688, 40637912, 39219943, 38648250, 37485942, 36255866, 34834667, 34110454, 33187233, 32559901, 31915871, 30921146, 29675306, 29173424, 28468030, 27446926, 27116055, 26331560, 25878644, 25192007, 24118398, 23636066]
14173B3636066m02860n97065o80888k96915n37457m78815l67536m97081l62847
14164A9414602o04709N3814o35355m47003k92246j58285o70990j08737m34346
14155A6116745n79298J25272o21940l46420l64898j38540l44707J53563m41069
14146A3558708j09735k19411m81273p6372J8714m04579l31640r1570l30312k89022
14136A1243508k73215J24676l67307L894J372n53665N0858k60887M856l93352
14126I580738m06335K70449j1223k62536k95173k88767Q8544r2311K68358m26598
14116H425146J56335n48855K12041k63725o26282L21014j4399M8896l90153p773
14106G312245N2986l59953r4307j28358j41371P5327M9742J08794j21569k82658
$$ y = [23636066, 23233206, 22636141, 21955253, 21658338, 21120881, 20642066, 20274530, 19777449, 19414602, 18809893, 18863707, 18228352, 17781349, 17489103, 17330818, 16659828, 16551091, 16116745, 15537447, 15662719, 15040779, 14694359, 14329461, 14190921, 13846214, 13999777, 13558708, 13448973, 13229562, 12748289, 12671917, 12690631, 12286052, 11954412, 11862842, 11532530, 11243508, 10970293, 11094969, 10727662, 10731556, 10732928, 10179263, 10230121, 9969234, 9974090, 9580738, 9174403, 9444852, 9433629, 9171093, 8875920, 8587153, 8675697, 8583386, 8851744, 8425146, 8581481, 8032626, 8244667, 7980942, 7354660, 7675674, 7661275, 7710171, 7320018, 7312245, 7365231, 7005278, 6910971, 6782613, 6641242, 6716569, 6766311, 6875105, 6753536, 6470878]
14096F470878j79011J7978o3662P5120m37774J11219j28390P3022l18706r8663
14086E522011P0772j14813k59084L19767K92803k25520n27328P7087j79720j2512
14076D963463L29954O4044o08769J74720k56920Q8577J14189j51117j48520j2164
14066D557457k08176K26997l86410M45926j63697n09324K36835Q9827l46955J3009
14056C955489K61222l32480J62126j66790j66300J98212O4326m6453q1863j82683
14046C664806n5645L50694k41220O5553P675k87768J43592k37526R0328j04415
14036C396074j94615L8969K17918K4827m21112J49504q1504q7221j18263k17388
14026B707189N18309k3479j65661R430j35092k54183J11787j97j47801R0023K51049
$$ y = [6470878, 6291867, 6309845, 6246183, 6321303, 5883529, 5994748, 5866358, 5939380, 5620674, 5522011, 5592783, 5477970, 5218886, 5538653, 5831456, 5605936, 5078608, 5155695, 4975975, 4963463, 5293417, 5357461, 4748692, 4923412, 4666492, 4755069, 4869258, 4718141, 4569621, 4557457, 4349281, 4576278, 4189868, 4635794, 4472097, 3962773, 4199608, 4289435, 3942480, 3955489, 4216711, 3884231, 4046357, 3879567, 3713267, 3911479, 3975805, 3929352, 3847489, 3664806, 3609161, 3959855, 3718635, 3784188, 3791863, 3504095, 3647687, 3410161, 3500489, 3396074, 3201459, 3240428, 3458346, 3483173, 3062061, 3211565, 3130061, 3042840, 2924577, 2707189, 3225498, 3202019, 3036358, 3045788, 2910696, 2656513, 2768300, 2768103, 2620302, 2710325, 2961374]
14015B961374p4681l02259J04987O8372J61069m57143j1555M13453k71035j97710
14005B394872j70955M786J8326J28934j92807J10797J55671j26847J3544K2488
13995B358809k73513J18656l14015L97936j40163K1635J11971l2652r8074n8765
13985B091825n3194J53110k18881J77070J89256l45885K39950K20592J76143P16828
13975C346814J02337J366488K887326N426052Q348907Q247544o178436p855935
13967A5691097m488542k973915j929235j294458o88815o13728k52496n06938K26103
13958C169073j07318m47999J57395k93198j23661K65950l46807l60372K44645
13949B157708k14048L08934l03544j29070L50086j40262M0066j05187j03900j25743
$$ y = [2961374, 2886693, 2584434, 2689421, 2757793, 2918862, 2461719, 2450164, 2863617, 2592582, 2394872, 2223917, 2228703, 2247029, 2375963, 2183156, 2293953, 2449624, 2322777, 2336321, 2358809, 2085296, 2203952, 1889937, 2287873, 2147710, 2169345, 2281316, 2248664, 2150590, 2091825, 2038631, 2191741, 1972860, 2149930, 2339186, 1993301, 2233251, 2453843, 2629986, 3346814, 3449151, 4815639, 7702965, 13129017, 21477924, 29725468, 23547032, 15691097, 11202555, 8228640, 6299405, 5004947, 4316132, 3702404, 3449908, 2942970, 3169073, 3061755, 2613756, 2771151, 2477953, 2354292, 2620242, 2273435, 1913063, 2157708, 1943660, 2252594, 1949050, 1819980, 2170066, 2029804, 2069870, 1964683, 1860783, 1735040]
13939A735040n6791j83267M14924l30923O16563m12377Q7901l9840m6480o7143
13929A717607O4303r5675l950k31775J16284K76060k17130Q5396l8113k82167
13919A390840J80538p2981J51453l41155R4388J30597l4310l13449L32334K06305
13909A724560j14952m0075k32213J13977M96091o27346J2657J01212O8182q4382
13899A417711L16452p86032L95612k92772K71748k38037Q1467K40942m7810j29233
13889A230048J26832m1380k7350J0144K0583k05240J89705o6801J91787k26570
13879A201758q9841J29334J56909j96116l4644m3816l7190J44427j38986j30022
13869I61813K42313L15097k75661q3929J13532j0599j28537k82319J62488N5987
$$ y = [1735040, 1678249, 1494982, 1909906, 1578983, 2195546, 1783169, 1871070, 1831230, 1784750, 1717607, 1781910, 1686235, 1682285, 1450510, 1566794, 1842854, 1625724, 1711120, 1673007, 1390840, 1571378, 1498397, 1649850, 1308695, 1403083, 1533680, 1499370, 1185921, 1518255, 1724560, 1609608, 1569533, 1337320, 1451297, 1947388, 1320042, 1332699, 1433911, 1502093, 1417711, 1734163, 948131, 1343743, 1050971, 1322719, 1084682, 1166149, 1407091, 1359281, 1230048, 1356880, 1315500, 1288150, 1298294, 1318877, 1113637, 1303342, 1236541, 1428328, 1201758, 1111917, 1241251, 1398160, 1202044, 1167400, 1123584, 1086394, 1230821, 1091835, 961813, 1204126, 1519223, 1243562, 1159633, 1273165, 1262566, 1134029, 851710, 1014198, 1070185]
13859A070185j03213Q8864m5170J09591k70433L91575k02623j9383J02766l8022
13849A084137k15254K94450j26534n7845K03368j81872M0140m72181P29249l88745
13839I08913R6013K76115j64497l30740O450Q4360K26023j05180j79577p6877
13829G41003K07126J34n0087N2101j85532o4677K45896k63655N34623m33537M6130
13818H29525L09042m53482l4023L05996k22956j3133o2943L57865k08807J55716
13808I62800m5992k70093K20327k06669K18719J7018j43718q8065j2497L83556
13798A035386l00659N9875k50551J97807K04896k16841R6401o267j94155J55026
13788G80918J35370l42370M94384k41661p686k77729K03342J46577j64163K395
$$ y = [1070185, 966972, 1055836, 1010666, 1120257, 849824, 1241399, 1038776, 1019393, 1122159, 1084137, 868883, 1163333, 1036799, 978954, 1182322, 1000450, 1040590, 568409, 1297658, 908913, 1004926, 1281041, 1116544, 785804, 792254, 876614, 1102637, 997457, 817880, 741003, 948129, 948263, 898176, 950277, 764745, 700068, 945964, 682309, 1216932, 783395, 829525, 1138567, 685085, 651062, 957058, 734102, 720969, 658026, 1015891, 807084, 962800, 916808, 646715, 867042, 660373, 879092, 896110, 752392, 664327, 651830, 1035386, 734727, 794602, 544051, 741858, 946754, 729913, 826314, 820047, 625892, 780918, 916288, 573918, 1068302, 826641, 818955, 541226, 744568, 891145, 726982, 729377]
13778G29377l2068j5923N1524J237r2692k14768j28248L21221R5001o7903O9754
13767G16512j09201K5607j80148K25003k27157K81211Q8940l69541q0961J47967
13757E18232K77946k92918K84256J41700k95370J45378N9301k60863j38521L7446
13747D76587J13940k56013K52016k48894O58214D39025Q325J50365K6313j45838
13737D78190J99824j04314R838l3021j06446P5165J76142J77823j32089K29270
13727I70382k77841j75821Q608N5958n3507m325k09222J18491J76475m4243l035
13716E61920B14874M58265j98976J41764B90151O04919A14159J52642J59405L61135
13706G87341J49049l54774K37312j22923B56257M26741l28853p4113A04488L98913
$$ y = [729377, 697309, 681386, 732910, 734147, 641455, 426687, 298439, 619660, 714661, 646758, 716512, 607311, 632918, 452770, 677773, 450616, 731827, 820767, 451226, 370265, 518232, 796178, 503260, 787516, 929216, 633846, 779224, 838525, 577662, 439141, 476587, 590527, 334514, 586530, 337636, 995850, 439025, 447350, 597715, 624028, 478190, 678014, 573700, 583538, 550517, 444071, 519236, 695378, 873201, 741112, 970382, 692541, 516720, 525328, 581286, 527779, 523454, 314232, 432723, 609198, 564955, 561920, 214874, 673139, 474163, 615927, 290151, 895070, 114159, 266801, 426206, 787341, 936390, 581616, 818928, 696005, 256257, 682998, 354145, 280032, 104488, 503401]
13696E03401K6504q2051k2247L05661l14506Q0035L3165r7727J05533J32705B09431
13684D49793j6672K08175j58996L83698l46597B44247K52967A97000N7569J56344
13674D10913J41923K89859l69744L97708k80860B93505K41853m9017K09495k72151
13664D23685l8485K58617p823k05571Q1884K96617k46130k7338k62855L29276
13654F01877B45664L80516B94935j2683r3334K82851K39087A63080J8705L73129
13644E54914j06132K26246j67679L1208J578B01984L19381j33414k8739L7935
13634C97147j54980Q5606K9794J60136A79347K89074P0397r8392A11289N95211
13624G06500k80424K49540j63262r0957j48971K5092P474J70938O07j04019p3390
$$ y = [503401, 529905, 447854, 425607, 731268, 416762, 496797, 529962, 432235, 537768, 670473, 209431, 449793, 433121, 641296, 482300, 865998, 519401, 244247, 497214, 197000, 254569, 410913, 552836, 842695, 472951, 870659, 589799, 293505, 535358, 486341, 695836, 423685, 385200, 643817, 635994, 430423, 512307, 808924, 562794, 535456, 272601, 601877, 245664, 626180, 294935, 282252, 188918, 471769, 710856, 163080, 181785, 554914, 448782, 675028, 507349, 538557, 540135, 201984, 521365, 387951, 359212, 397147, 242167, 327773, 357567, 517703, 179347, 468421, 538818, 440426, 111289, 706500, 426076, 675616, 512354, 421397, 272426, 297518, 304992, 475930, 476537, 372518, 299128]
13613B99128J37039k14711K29146J6690j71718D0373M56126j92921J49896B21485
13602C36638o3003Q3465j59415K37917m330B01109M8008J56936A71343O0174H3359
13590B62876A26053J31937K16489p4885M80097C02983K07089A34138M27824A94492
13579A2474M21993j6168A85005J56022j70405J48543L08030b01697E15384A24789
13568D74843j69958A48566Q4088k0322J43498m3291J90984k40856j12112n7079
13558I3476N05598k42128J80732j00724q9221j33229K14572A19256J64553K30028
13548E13837B53088j22727E6989j6724K09193L4127J24343A8787K8722O74159
13538G21668l45898j07767M9028J17065j18527P5597e8970A79107G3023K51571
$$ y = [299128, 436167, 221456, 450602, 467292, 295574, 40373, 496499, 303578, 453474, 221485, 336638, 273635, 357100, 197685, 435602, 431272, 201109, 249117, 406053, 171343, 231517, 83359, 262876, 126053, 257990, 474479, 399594, 879691, 302983, 510072, 134138, 561962, 194492, 12474, 434467, 418299, 185005, 341027, 170622, 319165, 627195, -201697, 515384, 124789, 474843, 304885, 148566, 232654, 212332, 355830, 312539, 503523, 262667, 150555, 93476, 599074, 356946, 537678, 436954, 347733, 214504, 429076, 119256, 283809, 513837, 253088, 130361, 56989, 40265, 249458, 283585, 407928, 18787, 47509, 721668, 375770, 268003, 317031, 434096, 315569, 391166, -58970, 179107, 73023, 324594]
13528C24594A14784L32369o5145B5854J20756J54103L3504A39492l7728K13797
13518C15561J2424A57617K2215K43178m8070j07073J34368r5133A22770L53698
13508D76468j99185J6229I8607J95695K46749j44273C4259N9373J42763P8990
13498C15385j4981j13836J7397H1829C7375L10038m808L0047K12693I0830M91715
13487E82545k08509F0007K52913a7397k07982C61650j2481L035A15168E4440L5805
13476I0245K17272I9098Q2698J13233K4392A12594J00942J04078A54436J76069
13466C30505n5974I8618M9234P1440J49574j76271J32700j28333l4060K75880
13456D38782m5533j58272A8094J00330B0152J01313E6601F571K33702B5277K6758
$$ y = [324594, 114784, 447153, 382008, 25854, 146610, 300713, 334217, 139492, 101764, 315561, 327985, 157617, 179832, 423010, 374940, 267867, 402235, 307102, 122770, 476468, 277283, 293512, 98607, 294302, 541051, 396778, 34259, 93632, 236395, 315385, 300404, 186568, 203965, 81829, 37375, 347413, 342605, 372652, 585345, 90830, 582545, 374036, 60007, 312920, -17397, -225379, 361650, 349169, 352204, 115168, 54440, 90245, 307517, 99098, 181796, 295029, 319421, 112594, 213536, 317614, 154436, 330505, 274531, 98618, 147852, 219292, 368866, 192595, 325295, 196962, 162902, 438782, 393249, 234977, 18094, 118424, 20152, 121465, 56601, 6571, 240273, 25277, 52035]
13445E2035J84629n7100a48432B47400M0315r2076N4222k4652n5374Q1120p725
13434B43230Q4239j6624J37598P3832j06671m0184l8065k1100j03943J26919A42261
13422E18593B22538J68431j12550j34884A8818N7971P0574C7208J5J96242E2911
13410B99892F6601B6922d159G06867l13066p5940b08896D2989L87584j28815q7988
13399B13770C2896L42579D5953N4606g1549C16205M1779F8433O0543D4976K77574
13388C22550q1005i377E2313J50629J87148A71189A6454R4064J12482e4188B58806
13376B92293A28342a88964j32070a8878D45728j02291F4614L36470n7691q5119
13366B58274j12526a27668C24163j55355L64695A49881b2346G4134J02192K17810
$$ y = [52035, 236664, 179564, -148432, 247400, 287715, 195639, 249861, 225209, 169835, 250955, 243230, 327469, 310845, 448443, 522275, 415604, 375420, 337355, 316255, 212312, 339231, 142261, 518593, 222538, 390969, 278419, 143535, 18818, 76789, 147363, 37208, 37223, 233465, 52911, 299892, 66601, 26922, -4159, 706867, 393801, 317861, -208896, 42989, 430573, 301758, 213770, 32896, 375475, 45953, 100559, -71549, 316205, 357984, 68433, 128976, 44976, 322550, 241545, -9377, 52313, 202942, 390090, 171189, 16454, 110518, 223000, -54188, 258806, 292293, 128342, -188964, -321034, -18878, 445728, 343437, 64614, 401084, 343393, 258274, 145748, -127668, 324163, 168808, 533503, 149881, -22346, 74134, 176326, 394136]
13356C94136a4510B05459H3557K14122m6959K392b838A58638O5446O4340o2548
13345B25876q1708N0772o8518J8915a47D84607j54476B7897J05961J07428A02632
13333A15254J60097j28333J40233O2634A14780m6607M3496K03880A24403K87610
13323D12013G6634P0544P7599L05665A03461L23343A79345L33335B26435k1201
13313B05234B9421J86670A0425D582a61049B35297J73335A45569O1280K58398
13303D65247C7793f642j3564I4835J65424K12734B01040M9499K5928A36711R1558
13292B28269Q8663g4138A55612K44741j28710C3641f6554Q23G238c0347A5510
13280D90028A87241b5374l3167E5901N0378L06235c7567D39760P7476C4270a18378
$$ y = [394136, -14510, 205459, 83557, 297679, 250720, 253112, -2838, 158638, 224084, 288424, 225876, 144168, 194940, 126422, 145337, -147, 484607, 330131, 27897, 133858, 241286, 102632, 115254, 275351, 147018, 287251, 349885, 114780, 68173, 111669, 315549, 124403, 412013, 76634, 147178, 224777, 530442, 103461, 426804, 179345, 512680, 226435, 205234, 29421, 216091, 10425, 4582, -161049, 235297, 408632, 145569, 206849, 465247, 37793, -6642, -20206, 94835, 260259, 472993, 201040, 250539, 276467, 136711, 228269, 316932, -74138, 155612, 400353, 271643, 33641, -66554, -65731, 7238, -30347, 15510, 490028, 187241, -25374, -58541, 55901, 106279, 412514, -37567, 439760, 517236, 34270, -118378]
13268B65817A28357L01531r1288B60M520L75661A27220J33061F8374b8605m4524
13257g3129A91123p4575E1210a88037A43772B3180L07713H0054J8082j8402O2832
13246A42566J43529m5676H6643J82531E5798J56660q4702e7098B1520J46481f987
13234C10198b5959A53912n8356J38239L1250A7842K60234n9628J37463A0874M6379
13223E7253O6465K81926e0156o7062C16396A31987c4002l4136C7084c1699B75951
13211b49762a7079l2360B47610j17384a57952A03191K1290j6997a37359D00820
13200g9238B24992j4311a40964k1557e4134n3526j23308B22838j03655O093B5967
13188D6988a99835B09734a6998B06364i507I4056J6501c04262B02556a55830B81053
$$ y = [265817, 128357, 429888, 338600, 260, 4780, 380441, 127220, 260281, 68374, -28605, -73129, 191123, 116548, 51210, -188037, 143772, 23180, 330893, 80054, 98136, 79734, 142566, 286095, 240419, 86643, 269174, 55798, 212458, 127756, -57098, 21520, 168001, -6987, 310198, -25959, 153912, 95556, 233795, 265045, 17842, 278076, 218448, 355911, 10874, 57253, 123718, 405644, -50156, -117218, 316396, 131987, -34002, -68138, 37084, -31699, 275951, -249762, -17079, -49439, 247610, 130226, -157952, 103191, 124481, 107484, -137359, 400820, -79238, 224992, 210681, -140964, -162521, -54134, -107660, -230968, 222838, 119183, 125276, 25967, 46988, -199835, 209734, -16998, 206364, -9507, 94056, 110557, -304262, 202556, -155830, 281053]
13176B40718e0580h807A34673L10343j79365q0076K85243A57928c633I5967a2678
13164b06229H3177Q9756C7204J22764C784K87782A22063N8904g3174j42223C2366
13152e0344j61960B28507E7461R7398C4496a1267B64981a06309K1552q8227B43002
13140a38776B87691d1926A50034a766A5486a90123C79758j33137j12357a56058
13129D97206G1096q131K07054A1624c7360D50594j43721a73984O7556B2090R4331
13118A16421f9261l6503b2662B92142n2827G9151O6262e7984n2489D9716K7227
13107G6943A5438J01334J80347a04390k34289I5464b28640B2691M0632d4640C80954
13095d5496C46972o1760k538a04568j01542E5449P9144c03797i7222A99249F9851
$$ y = [240718, -50580, -8807, 134673, 445016, 265651, 185575, 470818, 157928, -3633, 95967, -12678, -206229, 83177, 172933, 37204, 159968, 3784, 291566, 122063, 180967, -73174, -215397, 32366, -50344, -212304, 228507, 57461, 154859, 34496, -11267, 264981, -106309, -84757, -172984, 243002, -138776, 287691, -41926, 150034, -1766, 15486, -190123, 379758, 246621, 134264, -156058, 497206, 71096, 62965, 270019, 11624, -37360, 450594, 306873, -173984, -106428, 22090, 116421, -69261, -105764, -22662, 292142, 239315, 79151, 145413, -57984, -110473, 49716, 76943, 15438, 116772, 297119, -104390, -338679, 95464, -228640, 22691, 63323, -44640, 380954, -45496, 346972, 285212, 282674, -104568, -206110, 55449, 134593, -303797, -97222, 199249, 69851]
13083e1133A22753a05252A38308B9807J69910H4586a10283A34628F3472g0045
13072F5575K67880N330g1101A81586L2010R0434a21703L7410j16274a6668E3049
13060G5711B1435c49134c241C9361H45M83499k576H4793b4783j92825J01537A17745
13047B42432c83070C68510d6028I2242i0294A54604M5787b14579A25912K36170
13037C62082j70175j9182b1192L111e68D8255N844K40758j38417G7269K44786
13026C22055j19978d9596j90410G9087M4533l6215a51831A39024h5881C57541
13015F4959J2254J95152a4292A28696K63166r7730r2804O2465C2335h156C15675
13003f116j59967D2840g8038F5040K70840m7088C1695L7821J52749q5899J08363
$$ y = [-51133, 122753, -105252, 138308, 29807, 199717, 84586, -110283, 134628, 63472, -70045, 65575, 333455, 338785, -71101, 181586, 213596, 304030, -121703, -84293, -200567, -16668, 53049, 75711, 21435, -349134, -3241, 39361, 845, 484344, 481768, 84793, -24783, -217608, -116071, 117745, 242432, -383070, 368510, -46028, 92242, -90294, 154604, 200391, -214579, 125912, 362082, 191907, 172725, -21192, -18081, -568, 48255, 54099, 294857, 156440, 77269, 322055, 202077, -49596, -240006, 79087, 123620, 87405, -151831, 139024, -85881, 357541, 64959, 77213, 272365, -14292, 128696, 391862, 294132, 201328, 263793, 32335, -8156, 315675, -6116, -166083, 42840, -78038, 65040, 335880, 288792, 31695, 69516, 222265, 136366, 244729]
12992B44729o5943M0781a151B16061h7900q1507J6978D8017J01900Q1902C9395
12980A42907k4752p740K627a19259M80A81304c84674h2981A42474d5388D8963
12968B26820B6688J55308G6973L2511a05786q079C3874b3495A2529b1811C014
12956a8812j06983j52864A2621J49611K6558g5521D9969b67876A05826i4121C22545
12944D8343e8570C5218J88256a81025B05419c6149k46519e948B18743E3610c4277
12932a16186c8637c410A91383m7246a55034M1806D6673K8694a05389A6151O0290
12921G6441J09738c8172A1998d08469a88558i0468B712c73441A98613q3855b06351
12909F6342A4774R6819E1306F273Q6809K01463E0780N2566b91204A62209a8471
$$ y = [244729, 178786, 219567, -1151, 216061, -87900, -169407, -152429, 48017, 149917, 231819, 39395, 142907, 118155, 110415, 113042, -119259, -118779, 181304, -384674, -82981, 142474, -45388, 48963, 226820, 26688, 181996, 76973, 109484, -105786, -113865, 33874, -23495, 12529, -21811, 3014, -18812, -125795, -278659, 12621, 162232, 188790, -75521, 49969, -267876, 105826, -94121, 322545, 48343, -58570, 35218, 223474, -181025, 205419, -36149, -282668, -5948, 218743, 53610, -34277, -116186, -38637, -3410, 191383, 144137, -155034, -113228, 46673, 75367, -105389, 16151, 76441, 186179, -38172, 11998, -408469, -188558, -90468, 2712, -373441, 198613, 114758, -206351, 66342, 14774, 111593, 51306, 6273, 93082, 294545, 50780, 103346, -291204, 162209, -18471]
12897d16r354k26779A34958m9644j1589Q0196D6387K34246o8890R7008p4854a99673
12884a08947A48956a9776D8375N3074b0980C38568e70675A00421J39976b07102
12873a40505C03311P188A41602b0498A23483E742Q1306e6779A49186a10124m5260
12862a55384A09218b44325B75252a1904C77141a72758B40092b57614A94371h1548
12851i0336m299k7786K2523C46701A40548e2257I3210F509J08074m3535M8315
12840A19363c2212j60732k36297B4808e9716C08P4304a19630E3379K29409J004
12829B83792g7415k7553A70634a6403A7810b8477F312L4692c8414k97045J36410
12818a99049A95475d5405n0988A66236a06137k50939a45703D86501c91203J30240
$$ y = [-416, -9770, -236549, 134958, 85314, 73725, 153921, 46387, 280633, 211743, 308751, 233897, -199673, -108947, 148956, -19776, 48375, 101449, -20980, 338568, -570675, 100421, 240397, -207102, -140505, 303311, 310499, 141602, -20498, 123483, 5742, 87048, -56779, 149186, -110124, -155384, 109218, -244325, 275252, -11904, 377141, -172758, 240092, -257614, 194371, -81548, -90336, -94635, -122421, -99898, 346701, 140548, -52257, 93210, 6509, 114583, 71048, 119363, -32212, -192944, -429241, 24808, -59716, 308, 74612, -119630, 53379, 282788, 283792, -77415, -104968, 170634, -16403, 17810, -28477, 6312, 41004, -38414, -335459, -199049, 195475, -45405, -96393, 166236, -106137, -357076, -145703, 486501, -391203, -260963]
12808b60963C6032J30986h2646D4938O0452h8138O014B13220a07392h618B0838
12796B38692D5847b79769A45945M4208E5695b023j36462A22443J07489d1572A0063
12784b18911R0656B03717c1189C0018K30192C0033J46856a27916N2087k1316e686
12772b26255A15921a41419A5707J77719c24659A07914b58650a24302K0699a0531
12761f732j81443m9266B27578n5143n0411g5934j52402B54737J10412b78335I4936
12749B36726H3441Q9004C8499J30546b090l0396B0536b63214A65000b4171A03593
12737A08047g3972A04603J88170c15708A29031e8555k09755A86368a17501a902
12726b90904e2221B40407L1868C5383R0109Q6803A1969K810L4991J6536i9042
$$ y = [-260963, 36032, 167018, -82646, 44938, 105390, -88138, -82124, 213220, -107392, -8618, 20838, 238692, 45847, -279769, 145945, 190153, 55695, -2023, -138485, 122443, 229932, -41572, 10063, -218911, -128255, 203717, -31189, 30018, 260210, 30033, 176889, -127916, -75829, -97145, -5686, -226255, 115921, -141419, 15707, 193426, -324659, 107914, -258650, -124302, -103603, -10531, -6732, -188175, -237441, 227578, 172435, 122024, -75934, -228336, 254737, 365149, -278335, 94936, 236726, 83441, 172445, 38499, 169045, -2090, -32486, 20536, -263214, 165000, -24171, 103593, 108047, -73972, 104603, 292773, -315708, 129031, -58555, -268310, 186368, -117501, -1902, -290904, -52221, 240407, 272275, 35383, 125492, 212295, 11969, 14779, 49770, 66306, -99042]
12714A11209O0282n1501e830k5092j60749P4635B17183f3526A90780o4020b03759
12702d3631o9273A72672a0186C6293b18199j066F9557a67252F9879P0596J36362
12691B76837o7084D6209L83959b01168A69363l4174L8541K14501K14464a50891
12680B74900o8402b52288N6808f3697m0584j24819H870J46885b93164l1361A02164
12668C75330h9437L1070j61402A45447O2555g4991G8196d6835m8015I4435a95599
12656A32043J34300j06986O3841a04894a3311e215j33880B4577J90067b5863Q986
12645a6877m7998A72206L35576j10a02022B89296b972k5360A4777O3704R0862
12634A69343f2126n2173D7841c2298A25918D0460O5801L44501a5783j13206B05976
$$ y = [111209, 171491, 119990, -5830, -30922, -191671, -117036, 217183, -63526, 190780, 126760, -203759, -43631, -112904, 172672, -10186, 36293, -218199, -219265, 69557, -167252, 69879, 140475, 276837, 209753, 46209, 430168, -201168, 169363, 135189, 173730, 388231, 602695, -150891, 274900, 206498, -252288, -195480, -63697, -104281, -229100, 8870, 155755, -293164, -324525, 102164, 375330, -89437, -58367, -219769, 145447, 208002, -74991, 78196, -46835, -94850, 94435, -195599, 132043, 266343, 159357, 223198, -104894, -13311, -5215, -139095, 24577, 214644, -25863, -16877, -64875, 172206, 507782, 507672, -102022, 289296, -2972, -28332, 14777, 78481, 169343, -62126, -114299, 47841, -32298, 125918, 40460, 106261, 450762, -15783, -128989, 205976]
12622b35138j13683B29665a12574j5501B8408O2327k0958l0390R3049J4300P30
12611A47466C5004e7954B48160l9893a96454A33465a13990A15428C7414J54014
12601A91428i4097c7298E742J83523a23564c7034B3220b20771B71449a98433A89560
12589A6444b62224c6736k09129C03857c9483I066b0179A38589C2297c0907E2200
12577E9054j1040O175k6568f2823j64580b9119j22611A3526L4433a16888k07878
12566c24766g2578e678B32629A11292e3216A24171N3707F4260O1262b21901F7892
12554a74843F1333N0619g3028b7923A58763a40405O7309l8046d3242k1619A40032
12542A82781B7082b2166k11352A9881a19490j3834H10e2916j88132L0475A50793
$$ y = [-235138, -348821, 229665, -112574, -128075, 28408, 90735, 69777, 39387, 132436, 146736, 147466, 35004, -57954, 248160, 208267, -196454, 133465, -113990, 115428, 37414, 191428, -94097, -37298, 5742, 189265, -123564, -37034, 23220, -220771, 271449, -198433, 189560, 16444, -262224, -36736, -245865, 303857, -39483, 9066, -20179, 138589, 32297, -30907, 52200, 59054, 48014, 54189, 27621, -62823, -227403, -29119, -151730, 13526, 47959, -116888, -324766, -72578, -5678, 232629, 111292, -53216, 124171, 177878, 64260, 125522, -221901, 67892, -174843, 61333, 111952, -73028, -27923, 158763, -140405, -73096, -111142, -43242, -64861, 140032, 182781, 27082, -22166, -233518, 19881, -119490, -133324, 810, -52916, -241048, -210573, 150793]
12530i8911A34101a44341A30242b14226j15352a15250r4883C9830d14337B22709
12519A61533b46589k2219a06455A93732b20770G472J0356a05352B68739f964m7551
12508e4515B28802F3987j1723A3514K19619i2385M1092m9467B43743e1459B20406
12496B9101L9198a32836B60485a9384j49273G2783P69h0079A18192i7522H8308
12484D35158A91569p9518B7986R4043a03240n5241k39926A3502a47809K1596I9844
12472a79991K5349M8753c228j27790b4783j62400r6418a25532A11299a30429I2288
12460C1937c9344j83800C1992K5863k3818O2892A035K38028E1329J06184b04214
12448e3424o0050K8205K2775e720r7483c2167J1364G106d62477e4598B12268b55945
$$ y = [-98911, 134101, -144341, 130242, -214226, -329578, -115250, -210133, 39830, -414337, 222709, 161533, -246589, -268808, -106455, 193732, -220770, 7472, 17828, -105352, 268739, -6964, -54515, 228802, 63987, 52264, 13514, 233133, -92385, -51293, -100760, 243743, -51459, 220406, 29101, 68299, -132836, 260485, -19384, -168657, 72783, 73552, -80079, 118192, -97522, 88308, 435158, 191569, 112051, 27986, 122029, -103240, -158481, -398407, 13502, -147809, -126213, 99844, -179991, -154642, -105889, -3228, -131018, -24783, -187183, -283601, -125532, 111299, -130429, 92288, 31937, -39344, -223144, 31992, 57855, 34037, 96929, 1035, 239063, 51329, 157513, -204214, -53424, -113474, -85269, -62494, -5720, -103203, -32167, -20803, 7106, -462477, -54598, 212268, -255945]
12435B51672d4652a6285n988E1954b74971d6145k32641a3906k40494C9268g3116
12423h5364k69751a29934A32274J49342b35843d7579B69932a5687l59874F6303
12412A07945P3187a94528O6811A8409K17072a72418A76759b03328B63058i7487
12401a34237j15008G6414K6145O0356h340D5630K687K25428H2518q502a14180
12389b07282b3498k56152J11871a1997A23018C8517J8272b07418A60421a11828
12378c6055A58308a9827A04133a57860C48664a374k48646B49161c16397G7613
12367A04717a13659a1950r3161i541m991A57433a91846A25123i2008B92802H9296
12355E63888A13073c9754k6788p5307a417B80254e3068q7470A38558a21475J3927
$$ y = [251672, -44652, -16285, -22273, 51954, -274971, -46145, -278786, -13906, -254400, 39268, -73116, -85364, -355115, -129934, 132274, 281616, -235843, -47579, 269932, -15687, -375561, 66303, 107945, 181132, -194528, -127717, 18409, 235481, -172418, 176759, -203328, 263058, -97487, -134237, -249245, 76414, 102559, 162915, -8340, 45630, 48317, 273745, 82518, 74016, -114180, -207282, -23498, -279650, -167779, -11997, 123018, 38517, 56789, -207418, 160421, -111828, -36055, 158308, -19827, 104133, -157860, 348664, -1374, -250020, 249161, -316397, 77613, 104717, -113659, -11950, -105111, -9541, -14532, 157433, -191846, 125123, -92008, 292802, 89296, 563888, 113073, -39754, -66542, -141849, -1417, 280254, -53068, -140538, 138558, -121475, -107548]
12344a07548C28562j01417B9863K82387A16359J03413N4134A01372a23772r0660
12334b14432g1376B24589o4476a57008G5271j623K86762i4951A28650c07985a22330
12322a01867L6209C41954e8443b4577p4720C31606i2138m457B24699K01849j45955
12311B80593j19421a62948B4288N7936R5194e9821B30533a73993p4967f4787H7617
12299a477C2875K06415j08036J24082a93011A79997J00629c3264B30557r9176
12289A31381j4998a61153A04168J02609F2357h4665o180o1068b6892F057g8314
12277A90516E5330J50722R2639n7138a5181A64766a05259A17180o636a16724A25005
12265C20383a17860q6176n3276a00308A5600J13142K23218J35289B11610a8221
$$ y = [-107548, 328562, 227145, 29863, 312250, 116359, 219772, 273906, 101372, -123772, -214432, -71376, 224589, 160113, -157008, 75271, 73648, 360410, -94951, 128650, -307985, -122330, -101867, -65658, 341954, -58443, -24577, -99297, 331606, -92138, -96595, 224699, 426548, 280593, 161172, -162948, 24288, 82224, 177418, -59821, 230533, -173993, -248960, -64787, 87617, -1477, 32875, 239290, 131254, 255336, -193011, 179997, 280626, -33264, 230557, 131381, 116383, -161153, 104168, 206777, 62357, -84665, -90845, -151913, -26892, 6057, -78314, 190516, 55330, 206052, 298691, 241553, -15181, 164766, -105259, 117180, 110544, -116724, 125005, 320383, -117860, -204036, -257312, -100308, 15600, 128742, 351960, 487249, 211610, -18221]
12254a9820A77483K3945l4255Q0211c69044D02182a39615C41304q1656r8941L0946
12243A91653E8697N0238m906k3912j5371J34286f0561A94218k0184e1470J7275
12232c4195A38296b2520A16379j3423J8746O7134f5589A87150F9872O4290L2919
12221A67081n4100k2577c6411G6446J86771c4366A58443m8740f0598B5195M56031
12210D81226j61384K7367d090B58634m0615n8314J89128j69833d1874D3517K67701
12199C11218m7146j21354J51473F6533a3035A76575j0727L34701b7692A51466
12188B35413D8735J30401G7257c4777G5647J42757r921K6046O8984M7879a0375
12176D55297B25377q5426a75838n6036B78045H7392j2668i4580P336B00544C3507
$$ y = [-19820, 177483, 201428, 167173, 247384, -369044, 402182, -139615, 341304, 259648, 160707, 191653, 58697, 108935, 104029, 80117, 64746, 199032, -60561, 194218, 174034, -51470, -34195, 138296, -22520, 116379, 102956, 121702, 188836, -65589, 187150, 69872, 134162, 167081, 112981, 90404, -36411, 76446, 263217, -34366, 158443, 109703, -60598, 25195, 481226, 319842, 347209, -4090, 258634, 218019, 159705, 348833, 179000, -41874, 43517, 311218, 264072, 142718, 294191, 66533, -13035, 176575, 165848, 500549, -27692, 151466, 235413, 48735, 179136, 77257, -34777, 75647, 218404, 208483, 234529, 303513, 351392, -10375, 455297, 225377, 139951, -175838, -231874, 278045, 87392, 74724, -94580, -87244, 200544, 33507]
12164B05714C9739R7053K15035f7492A50902G2091J98180b09864B94835j16650
12154A78185N1570P6491F2396N089J24947J8021J75901a24644C7478N9661J8248
12143A15387J97979G0268J49060d202C92229b70101B7354J36121k7845o671M4013
12132A72972k9984b6972j82267C03368H6491O8118f5064F5917K3020K49907R545
12121C48389a97122e2103R303C54345f6971L776K5475E14841j75315A22966c53561
12109B30309c28128J32145B35884O5972a43092a5558l6805D8259J81142p5348
12099A54053F1545A5836Q888h4989E4487J24609a15048A71622k9189f040B38297
12087b13870h6002B40174a14203G6248h7667C13609A03203J9197a15220A28180
$$ y = [205714, 39739, 136792, 351827, -67492, 150902, 72091, 270271, -209864, 294835, 178185, 229755, 306246, 62396, 67485, 192432, 210453, 386354, -124644, 37478, 97139, 115387, 313366, 70268, 219328, -4202, 392229, -270101, 27354, 163475, 135630, 128959, 172972, 142988, -26972, -209239, 303368, 86491, 154609, -65064, 65917, 88937, 338844, 348389, -197122, -52103, -42800, 354345, -66971, -63195, -37720, 514841, 339526, 122966, -353561, 230309, -328128, -195983, 235884, 301856, -143092, -15558, -52363, 48259, 229401, 154053, 61545, 15836, 24724, -84989, 54487, 179096, -115048, 171622, 142433, -6040, 238297, -213870, -86002, 240174, -114203, 76248, -87667, 313609, 103203, 122400, -115220, 128180]
12076C76360b2380A7068J13107g2260A37252B4722a72036H9551a93630E6244j4976
12065D1268j954g8649B96882j48341H348J25039L08294n7292K20364A74666R6143
12054B70809j21185O9875D6199J39342r2240Q2157p5289b24601A62056A1809e9771
12042B39570J882B8302g570C6976c11022B62506G2088b35647f294D32734B667
12030d53558A64854f2660D25168a7926l48494J18526F8360h074j98317A06599
12019b83122B08404D4142c195H8414a28323k33329e6768B19485A8772d6861F5357
12007A6430J12538d0375A3740D933d7473A16465n1077B0356P0770N7018o6290
11996H1854b83350A47741K3857L7727C3957K94750b597B5378M5831b25895A84285
$$ y = [376360, -22380, 17068, 130175, -72260, 137252, 24722, -172036, 89551, -193630, 56244, 41268, 39314, -78649, 296882, 148541, 8348, 133387, 441681, 384389, 604753, 174666, 270809, 149624, 219499, 46199, 185541, 93301, 175458, 100169, -224601, 162056, 11809, -59771, 239570, 241452, 28302, -7570, 36976, -311022, 262506, 72088, -235647, -6294, 432734, 2667, -453558, 164854, -62660, 425168, -17926, -366420, -247894, 68360, -8074, -206391, 106599, -283122, 208404, 44142, -3195, 88414, -128323, -361652, -56768, 219485, 18772, -46861, 65357, 16430, 128968, -40375, 13740, 4933, -47473, 116465, 65388, 20356, 91126, 148144, 81854, -283350, 147741, 171598, 209325, 33957, 328707, -2597, 25378, 71209, -225895, 184285]
11984A29658K8495a91076A2418d00772B17281q1263a63120A12292J67258j35343
11974A44207a65932D72265I2874q382f8230A61541c5368j96277g9259j15026A39679
11962A23351b45307G5349a3260A45282a11700d7498k44388R7319d5781n5510C95201
11950b18316c6846k31247J19937A35775o2817c4263A10906c78895I9245L39530
11940D38775A33495a25680j48454J17659e3469A70461a13486G1082L39124A8918
11929A22675b8629C4189b7396B20662b49305K8965C962J848b49904n0662b5404
11917A5289a10062A49393d6973B52601F2158O2093D1838g8017A40638a2375j7991
11906c0366l87806i881B37336a40767B53625b1118k21563j33793A78945j2146
$$ y = [129658, 158153, -191076, 12418, -400772, 217281, 136018, -163120, 112292, 279550, 144207, -165932, 472265, 92874, 84492, -68230, 161541, -35368, -231645, -79259, -194285, 139679, 123351, -245307, 75349, -13260, 145282, -111700, -47498, -291886, -194567, -45781, -101291, 395201, -218316, -36846, -268093, -148156, 135775, 72958, -34263, 110906, -378895, 99245, 438775, 133495, -125680, -274134, -156475, -53469, 170461, -113486, 71082, 410206, 18918, 122675, -28629, 34189, -27396, 220662, -249305, -220340, 3962, 5810, -249904, -300566, -25404, 15289, -110062, 149393, -46973, 252601, 62158, 124251, 41838, -78017, 140638, -12375, -30366, -418172, -9881, 237336, -140767, 253625, -21118, -242681, -376474, 178945, 166799]
11896A66799j5847G0148a17435A69547c9495j10374A86789b69415i9351A48303
11885c7703l9315A14743J57114a00312b355D5644b78873J34550O6183p7139k4075
11874a79354c3822j34057P1513c7170B06746r0387d4791j62160B4380a58790l53136
11863e11926B6677c52068R0914L5905k03492A20194g6383J5539A67351b46272
11852c31905B03857b38590g5939B68220G4921Q297a04926a5316d292j26925a8106
11840E7999J95884d71417K9292D01873A02407D3685O2023a48044g0784H5102J11572
11829A96674l0610a53823j74356J31845C52876i6941A98280C7260a014k30975
11819b31989j5173c1584j64218k0740j27951a47730i24j39657j03310o6019C142
$$ y = [166799, 150952, 70148, -117435, 169547, -39495, -149869, 186789, -269415, -99351, 148303, -37703, -77018, 114743, 271857, -100312, -2355, 45644, -278873, -144323, -78140, -155279, -179354, -33822, -167879, -96366, -37170, 206746, 116359, -44791, -206951, 24380, -158790, -511926, 26677, -352068, -261154, -225249, -428741, 120194, -76383, -60844, 167351, -246272, -331905, 203857, -238590, -75939, 268220, 74921, 83218, -104926, -15316, -4292, -131217, -18106, 57999, 253883, -471417, -442125, 401873, 102407, 43685, 105708, -148044, -70784, 85102, 196674, 166064, -153823, -328179, -196334, 352876, -96941, 198280, 37260, -1014, -231989, -247162, -31584, -195802, -216542, -344493, -147730, -924, -140581, -243891, -309910, 3142]
11807A50196B4784g9351A22606f1950b3652r3551n7825A75492G6092a62866f1321
11795b30944b8626B20970J9629E8258a5593k21745B3263g454m31994A51423a8819
11783A1806K57667d6272j8144D2295d10879a50059K5284e3153C31098B4831M80713
11772E05544b7393l456l41867E7096a25338F6665O385J75659a97478B72859a6361
11760e4846p9151G5011b47896C8812d6710j27344b555A91480A3202J06602k6780
11749I3024D681a01534r0406A21894a83212k2283g8964A43972a89322I7544j3018
11738H4526C4858J4650h6467A29580e5333k6112k9648J637C2536a48824P2413
11727g6411A09073b43472a00994K8055j90011A12565a31417A35203m9703e0771
$$ y = [150196, 24784, -79351, 122606, -61950, -23652, -117203, -175028, 175492, 76092, -162866, -61321, -230944, -28626, 220970, 240599, 58258, -15593, -237338, 23263, -7454, -439448, 151423, -18819, 11806, 269473, -46272, -64416, 42295, -410879, -150059, -124775, -53153, 331098, 24831, 505544, -27393, -30849, -372716, 57096, -125338, 66665, 73050, 248709, -197478, 272859, -16361, -54846, -133997, 75011, -247896, 38812, -46710, -174054, -2555, 191480, 13202, 119804, 93024, 4681, -101534, -191940, 121894, -183212, -205495, -78964, 143972, -189322, 97544, 84526, 34858, 49508, -86467, 129580, -55333, -81445, -111093, -109456, 32536, -148824, -76411, 109073, -243472, -100994, -72939, -262950, 112565, -131417, 135203, 85500, -50771]
11716a56834H312a39039B42482a77865A21910b44575D8138K18773J21783A32853
11705d2268C72498d0069k57350J36228K0155d6522l0786C5247J01580J77145j20544
11694A93428P4908D9745c5535D5226a51290A05910a19852H8612b4235D23374a5676
11682a24072D9088j3331i119C97636a68382B20859c1587p6019B05727M091j8980
11671A90838B6285J36829B5076K85102A35193c67691D4570a70345A36252R5139
11661B31391a68384c5035H6962a14017B09895J00142a05011k1475d723n6537G5923
11649e475A35463k2555e5913A06316i511j92032b8549j17980p753c2590j48183
11638a80773A71836b52789a16467b5939j46006P9803B20170a09404B92064C2032
$$ y = [-156834, 8312, -139039, 242482, -177865, 121910, -244575, 48138, 266911, 388694, 132853, -42268, 372498, -40069, -297419, -161191, -141036, -46522, -77308, 35247, 136827, 313972, 193428, 268336, 49745, -35535, 45226, -151290, 105910, -119852, 88612, -24235, 423374, -15676, -124072, 49088, 35757, -9119, 397636, -168382, 220859, -31587, -107606, 205727, 209818, 190838, 26285, 163114, 25076, 310178, 135193, -367691, 44570, -170345, 136252, 231391, -168384, -35035, 86962, -114017, 209895, 310037, -105011, -126486, -4723, -61260, 75923, -5475, 135463, 112908, -55913, 106316, -9511, -201543, -28549, -146529, -154282, -32590, -180773, 171836, -252789, -116467, -25939, -171945, -92142, 220170, -109404, 292064, 32032]
11627c0428A99275a07123a1076n7848k12308h3381p3129C1243i1916L6334l7017
11616i2599B17755C2567a2195j826k06843A967P1123Q7849K203B1146M2383b6072
11603a12449M1194F0067B6955J17966a16522c3005l3347H3033c5100a3390C1866
11591h1067B52487a73518A59855a34074H6930b28528j53847c2461A17510a95318
11580b61592j08928i1615B03006a5026A87523a9340p9793F6445a27640H0605a78670
11568C66631q5684j16571a04424A93590d3172B79638e1670C12076a79708A14539
11557C53089a52133C2590J09452N0662G6641p87c08066a15028a2700A16534J56918
11546B73452k0607i9509P5j49839H0784c18844a29995o7387A72555k3145B9747
$$ y = [-30428, 199275, -107123, -11076, -68924, -281232, -83381, -156510, 31243, -91916, -55582, -92599, 217755, 32567, -12195, -14021, -220864, 1967, 73090, 160939, 163142, 21146, 63529, -26072, -112449, -71255, 60067, 26955, 144921, -116522, -33005, -66352, 83033, -35100, -13390, 31866, -81067, 252487, -173518, 159855, -134074, 86930, -228528, -382375, -32461, 117510, -195318, -261592, -370520, -91615, 203006, -15026, 187523, -19340, -99133, 66445, -127640, 80605, -178670, 366631, 280947, 164376, -104424, 193590, -43172, 279638, -51670, 312076, -179708, 114539, 353089, -152133, 32590, 142042, 192704, 76641, 75854, -308066, -115028, -12700, 116534, 273452, 252845, -99509, -99434, -249273, 80784, -318844, -129995, -197382, 172555, 149410, 29747]
11534c0887B013M33145F4026h628k39195g3497A54153k8438O5249c0034I482b8596
11521E4898f9668A35462J15507p1458d4422J312D90088a22495B03515J30702A47561
11509A65921l923F3361Q7134M84144B7745c4766A29704a89959L470A89704f5938
11497g5285B56898g9067O8j7521B10818a0818p1444C69233E3025J81879Q2080
11486C16984a0912A25516l805N3893e920k51690I0668f6592B69972o4398a10420
11474a32682B57030a67266I5962m2999d9297D02507E2025A3199f0256B3131K21716
11463B44847R672q6624n279P4899g6996A90280a85499A05269J42936e2711B40245
11451d9973A54827m7457L5943P0468d1554A72576k7921J92666B3158c409m4537
$$ y = [-30887, 2013, 435158, 64026, -8628, -247823, -73497, 154153, 125715, 190964, -30034, 9482, -28596, 54898, -69668, 135462, 250969, 179511, -44422, -43110, 490088, -122495, 203515, 334217, 147561, 165921, 161998, 63361, 150495, 634639, 27745, -34766, 129704, -189959, -186489, 189704, -65938, -75285, 256898, -79067, -78999, -96520, 210818, -10818, -82262, 369233, 53025, 234904, 316984, -10912, 125516, 121711, 175604, -5920, -257610, 90668, -66592, 269972, 205574, -110420, -132682, 257030, -167266, 95962, 52963, -49297, 402507, 52025, 13199, -60256, 23131, 244847, 254519, 167895, 162616, 237515, -76996, 190280, -185499, 105269, 248205, -52711, 240245, -49973, 154827, 107370, 143313, 213781, -41554, 172576, 144655, 337321, 23158, -3409, -47946]
11440d7946C0810J47633d1609r902G4836K759M6359N3787E4925R2855a43177A82505
11427a87953B33590J29150H4592L3386a32728B69243o3544C6460K1179P2407N1144
11416A81190b6419p5161A16751a99796A96757f9938B20560b46482b6563F3772
11405a72249O1752B71419P9473m2933a91869C59674f4780F7209b51094a9683j01420
11394a21103C09551A15993O9750a69793c8188I0429A713e2034r1611b1731j41616
11383a63347c396p8465C3121a52982A27677a94538i6570j49230J20390I7751a33636
11371b06205B28721C857J83845a32197A92355a3861j73251M7586O0034D21718
11360e5296B53773a6890q0297A05213f6404q2508c1623k24776B39099I8145c21446
$$ y = [-47946, 30810, 178443, -41609, -51511, 74836, 77595, 123954, 177741, 54925, 147780, -143177, 182505, -187953, 233590, 362740, 84592, 117978, -132728, 269243, 205699, 36460, 57639, 130046, 181190, -26419, -101580, 116751, -199796, 196757, -69938, 220560, -246482, -26563, 63772, -172249, -110497, 271419, 350892, 307959, -191869, 359674, -64780, 67209, -251094, -19683, -121103, 309551, 115993, 185743, -169793, -38188, 90429, 1713, -52034, -143645, -21731, -163347, -3396, -81861, 33121, -152982, 127677, -194538, -96570, -245800, -125410, 97751, -133636, -206205, 228721, 3857, 187702, -132197, 192355, -13861, -187112, -139526, -79492, 421718, -55296, 253773, -16890, -97187, 105213, -66404, -148912, -31623, -256399, 239099, 98145, -321446]
11348F6039K4397b3023B02448a35442L1104r6987C8619r394b40120D9687a64910
11336a74196G4606e76797C4327J72635H9939h8789k5481K6638c8032j28899A54877
11324b30420r9245a41044n1858N9384M258A9646n587a90922F1998b20018k9031
11313b49049J6501E0114A1457J2336a03561d4325H59h0809K3716J6820H1431j6332
11301F5099g2061j1821K8082J9985A19034D5924l266e9317B0222o435a81937n050
11289a86987I4231k7727J7974i6020c731j51475K3567B24930a79564j22033l745
11278c05342A73692A396J9994K9771b80786B2400O6541J91747A09956c6996E3002
11266B09557a02313L6319K7946j6097J0334A5626a42276o3356P7644C5980b96521
$$ y = [66039, 90436, -23023, 202448, -135442, -104338, -201325, 38619, 29225, -240120, 49687, -164910, -174196, 74606, -576797, 34327, 206962, 89939, -88789, -114270, -87632, -38032, -166931, 154877, -230420, -329665, -141044, -192902, -133518, -129260, 19646, 14059, -190922, 61998, -220018, -249049, -232548, 50114, 11457, 23793, -103561, -44325, 859, -80809, -57093, -40273, 81431, 65099, -72061, -83882, -55800, -35815, 119034, 45924, 42658, -59317, 20222, 13787, -181937, -186987, 94231, 66504, 84478, -96020, -3731, -155206, -131639, 224930, -179564, -301597, -305342, 173692, 1396, 21390, 51161, -280786, 22400, 88941, 280688, 109956, -36996, 53002, 209557, -102313, -65994, -38048, -54145, -43811, 15626, -142276, -205632, -127988, 35980, -296521]
11254i3546r5003P3774B15877C9160Q6308l0908c4655C9860J35001b13982A60851
11242C84520m6840b04601B01463a88432m9436P541L9392l0834d5132j8886C9067
11230b37651A17375P7718r4270m5477J95771e1146A55260b2212H8792d1844k84022
11219c25866C2733b86364B87604O1922C0384P460g2566C85507f5356G6762b24980
11207a65695d5925p0231k11768q5069P2025a09350k53968J21416R6815A03567
11196b88334f1723o4142L6806B7907e2356k3836R631A14204a40348k34672j15047
11185d90067a56537d9956j12361k21522B86990I1353c17586b2207F5936a99850
11174e4629o36417A35613d18699d0117j83937e3451H8536a04221g777B40312b39869
$$ y = [-93546, -188549, -114775, 215877, 39160, 125468, 94560, -34655, 39860, 174861, -213982, 160851, 384520, 337680, -204601, 201463, -188432, -237868, -230327, -190935, -221769, -45132, -64018, 39067, -237651, 117375, 195093, 100823, 55346, 251117, -51146, 155260, -22212, 88792, -41844, -325866, 32733, -286364, 287604, 349526, 30384, 37844, -72566, 385507, -65356, 76762, -224980, -165695, -45925, -116156, -327924, -412993, -340968, -109350, -363318, -241902, -145087, 103567, -288334, -61723, -125865, -89059, 27907, -52356, -76192, -66561, 114204, -140348, -375020, -490067, -156537, -49956, -162317, -383839, 286990, 91353, -317586, -22207, 65936, -199850, -54629, -691046, 135613, -418699, -40117, -224054, -53451, 88536, -104221, -7777, 240312, -239869]
11162A71964c894j56810d4135B60551a11164K5399m0303j09510c6861r5985o0640
11151a93486j05925g1020E7301b93942c6881j35251A1335f6679j59829B06377
11140I3522c20626B0422b43099A96826g9936j63287B33104a37158C72127A47560
11129a23753A64814h5018B35186q3137J07891d14473b00807B9726K17812a52754
11118f9789K3956G3441K5535b78898A14556J29106a88990A59542J02720d1921
11107A13004i4185E4474O047a50526G8400K28938a38433H391K479K26224a0721
11095b387F9325e3405D00955E9666J92154K2025Q5699f6049I0217N1625a5781
11083B01470K7396H8016i8513A75995q6881J0943Q1591D0838h7086c9655C38383
$$ y = [171964, -3894, -160704, -44135, 260551, -111164, -85765, -126068, -235578, -36861, -132846, -193486, -299411, -71020, 57301, -293942, -36881, -172132, 11335, -66679, -226508, 206377, 93522, -320626, 20422, -243099, 196826, -79936, -243223, 233104, -137158, 372127, 147560, -123753, 164814, -85018, 235186, 152049, 259940, -414473, -200807, 29726, 247538, -152754, -69789, -45833, 73441, 98976, -278898, 114556, 243662, -188990, 159542, 262262, -41921, 113004, -94185, 54474, 60521, -150526, 78400, 307338, -138433, 8391, 10870, 237094, -10721, -2387, 69325, -53405, 400955, 59666, 251820, 273845, 359544, -66049, 90217, 141842, -15781, 201470, 228866, 88016, -98513, 175995, 89114, 100057, 181648, 40838, -87086, -39655, 338383]
11071A39215K3095D5064J77487J23013A13726K41865q6201O8247q1156b20616
11060F6200g8794A30868j3164J48318M523C0487j2520p27K11582o5589n9135M18234
11048E22332h3542C72634A09393L11292j07321J98259B15202K58880N4067n8315
11038D69834O2931j24998O7851K04022J8660C40044J85250o3141L5027j89864
11028C07316n1568K90018J58281J70618l86518j51293J78006P4732Q7102N9908
11018G36602j45791k02088L25329j57115l5991L04319l17407J71983j26779M53971
11008A007033l68873A65347K88972n1678j02981J53774K9603F8766M12834I7904
10997H46732B68430J44421k371o922q2960K71016A84984P37999k63009l28686
$$ y = [139215, 162310, 45064, 222551, 345564, 113726, 355591, 269390, 337637, 256481, -220616, 66200, -78794, 130868, 117704, 266022, 270545, 30487, 17967, 17240, 228822, 163233, 104098, 522332, -83542, 372634, 109393, 420685, 313364, 511623, 215202, 474082, 528149, 469834, 532765, 407767, 475618, 679640, 698300, 340044, 525294, 462153, 497180, 307316, 255748, 545766, 704047, 874665, 488147, 336854, 514860, 589592, 676694, 736602, 590811, 388723, 714052, 556937, 520946, 825265, 507858, 679841, 553062, 1007033, 638160, 165347, 454319, 402641, 299660, 453434, 483037, 68766, 481600, 97904, 846732, 268430, 412851, 410480, 403558, 320598, 591614, 184984, 922983, 659974, 331288]
10987C31288J03563M21145B56550J93420r8156Q9147J5700M96528m34695q6002
10977D32492J6622O6541L13116O775D05009l8165L97062k60808K05553j842J25253
10966H32062J9074j90474J72732r067P2391K45890j75763J9762L60449p8652O28851
10955A897255m79293M52028J23612k17085M91768l52383l30258j46621J58596
10946A597619l21493J48969k89004J85853l7355M57966k22940k51541K09844l39876
10936A138042k2633K69311o17942K30365j07297l33544K88702m14677K00864A58299
10925B58031K26366J8350B36873c6712A05486m0414a28938C79603A78405d42702
10914C02683H4351K34487A5913a73669j20100L6930g2800D8988K06869H598c3446
$$ y = [331288, 434851, 855996, 256550, 449970, 351814, 440961, 456661, 953189, 518494, 432492, 449114, 515655, 828771, 835546, 405009, 366844, 763906, 503098, 708651, 706809, 832062, 851136, 660662, 833394, 824327, 896718, 1142608, 966845, 986607, 1347056, 1268404, 1897255, 1417962, 1869990, 1993602, 1776517, 2268285, 1915902, 1585644, 1439023, 1597619, 1276126, 1425095, 1136091, 1321944, 1284589, 1742555, 1519615, 1268074, 1477918, 1138042, 1115409, 1384720, 766778, 997143, 889846, 556302, 845004, 430327, 631191, 158299, 258031, 484397, 502747, 236873, -36712, 105486, 65072, -128938, 379603, 178405, -442702, 302683, 84351, 318838, 15913, -173669, -293769, -256839, -72800, 48988, 255857, 8598, -33446]
10902A20317b00396p6996A8739N2136L4469e1475B8768K7076L231R3148l3366
10891A18857h4906A51477c8653H1342c1492E2710i9842M0573A05295b92875N8947
10880b33928i3284B64772b05923A71499m6006a6249C27546a19296e9287C32773
10869C62188i806I1894J20312a34271r5070a7434k0731k61432J15223Q0992M4561
10858e8821j61234A05638b07280k4684b158I7304L653b74152H0904l8423a61866
10846D4613K93255H6503a33623M7122I477J99571a40802H0770c4560j06191j01288
10835b42039J18497A01017c21808h3818m0026b5263G7014i2815A7314a8096k94223
10824c12319a19157A86322c13773a0506l2452o2538A67433b36119A25101c13100
$$ y = [120317, -200396, -277392, 18739, 70875, 105344, -51475, 28768, 55844, 59075, 152223, 118857, -84906, 151477, -38653, 81342, -31492, 52710, -99842, -59269, 105295, -292875, -233928, -93284, 264772, -205923, 171499, 125493, -16249, 327546, -119296, -59287, 332773, 362188, -9806, 91894, 212206, -134271, -229341, -17434, -38165, -299597, -184374, -103382, -58821, -220055, 105638, -207280, -231964, -2158, 97304, 100957, -274152, 80904, 42481, -161866, 44613, 337868, 86503, -133623, -86501, 9477, 209048, -140802, 80770, -34560, -140751, -242039, -123542, 101017, -321808, -83818, -123844, -25263, 77014, -92815, 17314, -18096, -312319, -119157, 186322, -313773, -10506, -42958, -105496, 167433, -236119, 125101, -313100]
10813b04513c4443j24773M011N2687B52256b04097M1344m2635D0502F784b77452
10801a52024A50594d7582A93498b32060e2921D0685r346a67306A00950k9734a67444
10789b15916P461b9450A560b92299A38260k6532c3144j52929H5989b8056q6009
10778a14065a3316F8063A7796C836K250f2581A4671f4922B7055a73064j1320H4464
10765C0299e3997j1710B55248j27009G979a07764E9108O956b3590A73040F0741
10753a76960A15510J3411a44947A00848d2082A95215r6037K5275g1490A4789g2750
10741c4080p3427C23776p080A490N7408J68528e98904a77710b2245j65608n7581
10730b45434a17699j56183A10347b1323B7905M3629d61796J51596G9372a49359
$$ y = [-204513, -34443, -159216, -155205, -102518, 252256, -204097, -162753, -205388, 40502, 6784, -277452, -152024, 150594, -47582, 193498, -232060, -52921, 40685, 31339, -167306, 100950, 71216, -167444, -215916, -208455, -29450, 1560, -292299, 138260, 111728, -33144, -186073, 85989, -28056, -114065, -13316, 68063, 17796, 3836, 6086, -62581, 14671, -64922, 27055, -173064, -184384, 84464, 30299, -53997, -65707, 255248, 128239, 7979, -107764, 59108, 66064, -23590, 173040, 60741, -176960, 115510, 128921, -144947, 100848, -42082, 195215, 99178, 124453, -71490, 14789, -72750, -34080, -107507, 323776, 316696, 1490, 58898, 227426, -598904, -177710, -22245, -187853, -245434, -117699, -273882, 110347, -21323, 27905, 71534, -461796, -310200, 79372, -149359]
10719b59391A53053a34940f2259B6032d01533A52635i5343L3638j51196N3939
10709a58962a2723A84067b79470K2642e1144j40400j43586F5790J98795I023M96699
10698E05722b48589a22364c4855j88824A39965o0518A9697o800b53649A32851
10687A08784a44936j13267A74879d41061d5266k50332g0294o080A03091m0526
10677F2565b42096a03646J6552J00A8121C19J37093a60200E0493K69853a97595
10665a90205O2665A6454b01210A43603b26910j84167a41220a6550k15954C50016
10654i4521j98559l1574B69515r3014M0752q2219b29667B42996A21198a51179
10643F7750i0282k51494a10730C1129a78279C16129f777a691C23354c4053A54336
$$ y = [-259391, 153053, -134940, -62259, 26032, -401533, 152635, -95343, -61705, -212901, -158962, -12723, 184067, -279470, -256828, -51144, -191544, -335130, 65790, 264585, 9023, 505722, -248589, -122364, -34855, -223679, 139965, 79447, 19697, 12897, -253649, 132851, 108784, -144936, -258203, 174879, -441061, -45266, -295598, -70294, -76374, 103091, 62565, -242096, -103646, -87094, -86994, 18121, 319, 137412, -160200, 50493, 320346, -197595, -190205, -127540, 16454, -201210, 143603, -226910, -411077, -141220, -16550, -232504, 350016, -94521, -293080, -324654, 269515, 176501, 217253, 135034, -229667, 242996, 121198, -151179, 67750, -90282, -341776, -110730, 31129, -178279, 316129, -6777, -1691, 323354, -34053, 154336]
10631A88686E6925k4359N8294d7946A5331O7812c93127a52503f139k38016J13794
10620a30361p8187j97106B5003i0577G6733a85544k4546O6822B76724b56024l58827
10609f14851C62293A2982h5700A11951a21846D2281K03920f9371p5415q3449G993
10597b65015C9697O2417a51063A97019r6752a63073J4336D5216c2305A91509a45932
10585c13313J52701p8138K3188I7229J2766b27541B20488H5184f2200k3003G7099
10573c22760a57927a5436n7498A39824a6623F5619g6717I3147d283C9283J48191
10562A87474b44565J06725B9485a44794E945h2855M1147D6051J73348c6228A7374
10550d3686j41614C5202a35714p8704h633j05986n0790B9979e5208k19403C8829
$$ y = [188686, 56925, 32566, 90860, -47946, 15331, 83143, -393127, -152503, -6139, -244155, -130361, -208548, -405654, 25003, -90577, 76733, -185544, -210090, -143268, 276724, -256024, -614851, 362293, 12982, -85700, 111951, -121846, 42281, 246201, -69371, -144786, -228235, 7993, -265015, 39697, 102114, -151063, 197019, 100267, -163073, -148737, 45216, -32305, 191509, -145932, -313313, -160612, -238750, -215562, 97229, 109995, -227541, 220488, 85184, -62200, -85203, 77099, -322760, -157927, -15436, -72934, 139824, -16623, 65619, -76717, 93147, -4283, 39283, 187474, -244565, -137840, 29485, -144794, 5945, -82855, -41708, 46051, 219399, -36228, 17374, -43686, -185300, 35202, -135714, -214418, -8633, -114619, -165409, 29979, -55208, -274611, 38829]
10538b46209G4355a84443e1359l6213A09072a97685E1083K80276H1359a54497
10527A3974d3709j92028A20657a34947l4842A40189K27600f238A14752a06945
10516D7306a52515l2416H3083b37076k56019A72220N176e65687d5743j46403c403
10504c6477j947A84511M4951c7147k17152O2797r571p14N234e6885N039p2854
10492a24700n4631H571J14694a30580L3506A66380a69320G1602J02989G7774J086
10481G8860H731a17176B99856b37422A50333b63055c9639j99548F8902R170e9691
10469a44803k33059C7334J08152P5376a06477m8456C22468r364j41432E2217M95920
10458E48137B43556I1720k4056Q7052m0932h9265E3735a28165A8525d8760p9983
$$ y = [-246209, 74355, -184443, -51359, -87572, 109072, -197685, 51083, 331359, 81359, -154497, 13974, -43709, -235737, 120657, -134947, -169789, 140189, 367789, -6238, 114752, -106945, 47306, -152515, -184931, 83083, -237076, -493095, 172220, 177396, -565687, -45743, -192146, -3403, -36477, -38424, 184511, 229462, -37147, -254299, -191502, -201073, -201787, -196553, -56885, -51846, -124700, -179331, 8571, 123265, -130580, -97074, 166380, -169320, 71602, 174591, 77774, 78860, 8731, -117176, 299856, -237422, 150333, -263055, -39639, -239187, 68902, 78072, -59691, -144803, -377862, 37334, 145486, 220862, -106477, -154933, 322468, 313104, 171672, 52217, 548137, 243556, 91720, 67664, 154716, 113784, -89265, 53735, -128165, 18525, -48760, -128743]
10447a28743C7871b41748d1288E2180e3508A98218n840i4980o6099O7944M0555
10436e2580j78323g5381j59484a01946k27324a19467a4474k93543L7592H611K11321
10425B19932c69903a40531k68523B50563b99513a10271B58839a86001k60167b9470
10414a66438a0550A8835c36056A89f3149K5811o5249m7350L3596L3678j74298
10403b56961a2292B7282a77814q0738c5649r1700A71345a27825m5983O1992I3575
10391c03366J1080I0816N4654J50295A23945N402a83022h8555G5555C584K31597
10380B35181E9953b5664B7374J2265M03786A51591J18742A23506a6775B19319
10369A29036Q7751b35277a6396j66982q5039B51198c3172D1883F423L64245j57257
$$ y = [-128743, 37871, -241748, -41288, 52180, -53508, 198218, 192378, -94980, -161079, -93135, -52580, -230903, -75381, -234865, -101946, -329270, -119467, -14474, -308017, -270425, 8611, 219932, -369903, -140531, -409054, 250563, -299513, -110271, 258839, -186001, -446168, -29470, -166438, -10550, 18835, -336056, 189, -63149, -37338, -102587, -149937, -116341, -82663, -256961, -12292, 27282, -177814, -258552, -35649, -127349, 171345, -127825, -173808, -111816, 93575, -303366, -292286, 90816, 145470, 295765, 123945, 129347, -183022, -88555, 75555, 3584, 235181, 59953, -25664, 27374, 39639, 443425, 151591, 270333, 123506, -16775, 219319, 129036, 216787, -235277, -16396, -183378, -268417, 251198, -33172, 41883, 6423, 370668, 213411]
10358B13411b07008B41463I6056J91684I8015O8399M0273H3325a51141C35479
10347a52102D23777P9888L0135G5920J0508K88788d3931A1160L58765j61860c38865
10335D81270B14819k5107K24392b8775A06556L08614r9984L8267j01965L37785
10325E89273k36919A24158J66971A38446J52443j42600a13721A47387b22021A07571
10314D41755A3315M6470I886d1375A04658J01231g3287E4751J82163h6987j57496
10303b44483I9024J5618K0941l4571J28534i9956C8254g8196K7299m004A23243
10291A29772a2400j58093Q132A65091c19151d4597A15611i3950C8914c13166J56357
10280a56809K7400k36227A91419I5455a92910d8607A75859a43690k85074g0054
$$ y = [213411, -207008, 241463, 96056, 287740, 98015, 166414, 206687, 83325, -151141, 335479, -152102, 423777, 503665, 533800, 75920, 86428, 375216, -43931, 11160, 369925, 208065, -338865, 481270, 214819, 189712, 414104, -28775, 106556, 415170, 315186, 353453, 251488, 589273, 352354, 124158, 291129, 138446, 290889, 148289, -113721, 147387, -222021, 107571, 441755, 13315, 59785, 9886, -41375, 104658, 205889, -73287, 54751, 236914, -86987, -244483, 99024, 114642, 135583, 101012, 229546, -99956, 38254, -78196, -50897, -54901, 123243, 129772, -12400, -170493, -162361, 165091, -319151, -44597, 115611, -93950, 38914, -313166, -156809, -129409, -365636, 191419, 95455, -192910, -48607, 175859, -143690, -428764, -70054]
10269b1927n38080a04776J8870B5777D427e3837b0775l12839h7870k81198J34993
10258b34075B57860d88498b0098j13739A44509c17738J40916A8789J65282c98189
10247a30062A34629a0974j91151a01030m5947A91688k7111J88354o4313G4755
10236A97900I8826l6974K551J71253H3820j7191j0404B6177M3641k1695M4784
10225I2907K643J04020D2203r12b07288j93506G543J6386b96526n9969C4504a04515
10212b18556A82423a83158F1623f8323J9034j26225j23114A58693b8018A5131
10201A0664K28337a00298K5558j6835B2226J95763c21337B09790b9575k58331
10191b87906C18884A55942b61A19833d9918o3857J7958D4054B1888Q9047I428
$$ y = [-21927, -560007, -104776, -85906, 25777, 4427, -53837, -20775, -333614, -87870, -369068, -234075, 257860, -488498, -20098, -133837, 144509, -317738, -176822, 18789, 184071, -398189, -130062, 134629, -10974, -202125, -101030, -146977, 191688, 164577, 352931, 288618, 74755, 197900, 98826, 61852, 64403, 235656, 83820, 66629, 56225, 26177, 69818, 48123, 92907, 95550, 199570, 42203, 41291, -207288, -400794, 7543, 23929, -296526, -356495, 34504, -104515, -218556, 182423, -183158, 61623, -68323, -49289, -175514, -298628, 158693, -28018, 15131, 10664, 239001, -100298, -74740, -91575, 22226, 217989, -321337, 209790, -29575, -287906, 318884, 155942, -261, 119833, -49918, -113775, -95817, 44054, 21888, 110935, 9428]
10179D1361J86620a77499J5975B58387h0286j22504f9486E976c02092a09241M5449
10168f3792A9665B756P8403f473G7113g7106n8523p9450B35299J3233a6979o5255
10156h2234j77187O5461d5460A70069c03554J39323d3684D9618b24593K2709A67995
10144i4885K9009A28760C907a63440e3465k70587h8711C3768b77936c5534l5616
10133g1150c4672r303k46349i8124A8364J52392a00778a7728k70631b4273H0227
10121a21283K326L7831j54204C8017b06263n740A96638c17167l7221a27708j44745
10110b72453M9040A52380a84557N3277A09915c70209a9556n5625m65871B15937
10099D3313b51404A44742a5775A4477Q9426h6713J3853p4940O0288B46768a04972
$$ y = [41361, 227981, -177499, -161524, 258387, -80286, -202790, -69486, 5976, -302092, -109241, -63792, 19665, 2756, 81159, -6473, 77113, -77106, -135629, -215079, 235299, 248532, -16979, -82234, -259421, -193960, -45460, 170069, -303554, -164231, -43684, 49618, -224593, -201884, 167995, -94885, -65876, 128760, 3907, -163440, -53465, -324052, -88711, 33768, -277936, -35534, -71150, -34672, -43975, -290324, -98124, 18364, 170756, -100778, -17728, -288359, -24273, 80227, -121283, -118957, -81126, -235330, 38017, -206263, -212003, 196638, -317167, -354388, -127708, -272453, -223413, 152380, -184557, -131280, 109915, -370209, -19556, -75181, -541052, 215937, 43313, -251404, 144742, -15775, 14477, 103903, -86713, -72860, -147800, -87512, 246768, -104972]
10087g9591q4462j6882A02890f1926A83510M660H0740a46041M3857L7397l78541
10076d43328g4130j81983L3945E0593K9285L2939R893D3566j7973a52965j8927
10065a71892d9248l5867A1172c02441A92205b51248g9401L8747r6240A07567L3326
10054A40893n7968c3470j94453j65792A4382h4846j23082M929O9057C19803c27873
10042B58629c8677j24361k3366Q9006j3098B188e539j14965N2829l76859K20674
10031b23860J00454j49539a01352p0112C12453a86540H190J5788b05349A46235
10020A42940m1291d2745A13168c68851e7666C69669C1055I754O7849h3020m2486
10009a25506a0490m85689J9597a70194j6762k05869b5693A31370b03382A10839
$$ y = [-79591, -164053, -180935, 102890, -61926, 183510, 188170, 80740, -146041, -102184, -64787, -443328, -74130, -256113, -222168, 50593, 79878, 112817, 122710, 43566, 25593, -152965, -171892, -49248, -85115, 11172, -302441, 192205, -251248, -79401, -40654, -136894, 107567, 140893, 82925, -33470, -227923, -393715, 14382, -84846, -207928, -202999, -133942, 319803, -327873, 258629, -38677, -163038, -186404, -97398, -110496, 2188, -5539, -120504, -67675, -444534, -223860, -123406, -272945, -101352, -171464, 312453, -186540, 8190, 23978, -205349, 146235, 142940, 101649, -42745, 113168, -368851, -57666, 369669, 31055, 9754, 77603, -83020, -125506, -10490, -496179, -476582, -170194, -186956, -392825, -25693, 131370, -203382, 110839]
9998d5618j64422O2459C941h1985F4283f9649C0886b43825O3871C05388g096j90570
9986a97666A5556b57146h1411j52646c7861j8650r6297E7690a46948C4564b93209
9974c3519l28982a13848j24056M6987J775g4919k2585k17705G237J54943C9265
9962A27538n4351q727h8808A94483I4171A5988J86363m7875a1739p5497j55133
9951b42369k8503i6640j2641A6143a91873q3419a9834q7675C4944c32226J62161
9940a70065c4726j69523O5764o4728A2490M141a03651j2834k81408a9894k5847
9929d5741B6254R2713a36670C9403a08264o3282A01131J93433i1239B28125a58456
9917a29558B96307O4444a35599k0720j97206F6676c83044A78701g84F9124a84962
$$ y = [-45618, -210040, -147581, 3941, -81985, 64283, -69649, 30886, -243825, -179954, 305388, -7096, -197666, 15556, -257146, -81411, -234057, -37861, -56511, -152808, 57690, -146948, 34564, -293209, -33519, -362501, -113848, -237904, -190917, -189142, -74919, -97504, -315209, 7237, 162180, 39265, 127538, 73187, 64460, -88808, 194483, 94171, 15988, 202351, 154476, -11739, -87236, -242369, -270872, -96640, -109281, 16143, -191873, -275292, -19834, -107509, 34944, -332226, -170065, -34726, -204249, -138485, -203213, 12490, 16631, -103651, -116485, -397893, -19894, -45741, 26254, 118967, -136670, 39403, -108264, -171546, 101131, 294564, -91239, 228125, -158456, -129558, 296307, 360751, -135599, -156319, -353525, 66676, -383044, 178701, -784, 69124, -184962]
9905a88575P9776L0560j2722k8090b9276r6182E1636K16622f0102B4858J58213
9894A83071l0731A2143J5644b10677A64356c52974J18879A43567c83178D5141
9883c57159a19100B20282d25089a19598B71208I3418f7776A73159b0056A48247
9872a38526j33039A43071f2235c0641G3480K55025b14679q0070a19321d2095C32596
9860a91392A4929O0963c27222C55124A34405A9523b4665j22499b2563k34554A44998
9848a4686k41625f3356j91512J18047B74868b29892g7864D4480A0012b15088k21985
9837d37073A8986e54236a63286k60471a78629M4789b1844r1149K1439F8723b92342
9825a00607j73599A43802B1413a26647j45780i7790A0377a68789A26532d27756
$$ y = [-188575, -108799, -78239, -90961, -119051, -29276, -125458, 51636, 268258, -60102, 24858, 183071, 152340, 12143, 27787, -210677, 164356, -352974, -234095, 143567, -383178, 45141, -357159, -119100, 220282, -425089, -119598, 271208, 93418, -67776, 173159, -20056, 148247, -138526, -271565, 143071, -62235, -30641, 73480, 328505, -214679, -294749, -119321, -42095, 332596, -191392, 14929, 75892, -327222, 355124, 134405, 19523, -24665, -147164, -22563, -257117, 144998, -14686, -256311, -63356, -254868, -136821, 274868, -229892, -77864, 44480, 10012, -215088, -437073, 18986, -554236, -163286, -423757, -178629, -133840, -21844, -112993, -91554, 68723, -292342, -100607, -274206, 143802, 21413, -126647, -272427, -97790, 10377, -168789, 126532, -427756]
9814a98532N7891j82203J49467O4951C3987b7223j43652r252h7276k2872k46161
9803c56309h9286g997l71411a72354f8874a4681j09796j12996j31717f26j19100
9792a19726H8199C5295e4571m0508j13168A49087J0646b88500g7043B13266F2917
9780F6366N981a74155o9366a07391k80959B0747d3691B20238n7400c50335H7178
9768A31269a46325O6083B73470a29990c2412j28943j67777C59230b03435L8200
9758a65235A07344b05836C4866M708a82053g5948G1523a1507k01298i9041A05882
9746A19728N116a46391q6228j05351B7705i8675e419B10380q3493a82425N9071
9735a23354D3880c22966f7324A25278B6624K40239e9645j17527f2645L181n1947
$$ y = [-198532, -140641, -322844, -173377, -108426, 33987, -27223, -170875, -180127, -87276, -110148, -356309, -89286, -7997, -379408, -172354, -68874, -14681, -124477, -237473, -369190, -626, -119726, 88199, 35295, -54571, -95079, -208247, 149087, 159733, -288500, -77043, 213266, 62917, 66366, 72347, -174155, -243521, -107391, -388350, 20747, -43691, 220238, 162838, -350335, 87178, 131269, -146325, -80242, 273470, -129990, -32412, -161355, -329132, 359230, -203435, -165235, 107344, -205836, 34866, 39574, -182053, -75948, 71523, -11507, -212805, -99041, 105882, 119728, 124844, -146391, -232619, -337970, 27705, -98675, -5419, 210380, 126887, -182425, -123354, 43880, -322966, -67324, 125278, 26624, 266863, -59645, -177172, -62645, -59464, -111411]
9724a11411B02090b68630k9701J37152A13404a53138P1678A60873J24826a10826
9713C37043a41642E7946a44763A79584J14824N5541A13791l2917i2178B56211
9702a05343j26977J05258A5120g3209k2389A90014b48898J20799A0939O4946M404
9691H0289a96788E5730q158h8998L5767I9893m6107e5575E4219J5932c68131d4804
9678b44294h606k60452f1091j67847J05150I2754a76348q023R1097j49961i7944
9666d1978k74895a54314H2247d5860A77309o8035B6052J21966b10304c5401m34990
9655d70391a70154j30599B1086a60635o3506b1635A54804d51177a15796p2694
9645a88490C98659c87009a08125m228b8968B36785E3436c7194j03283p0164j19250
$$ y = [-111411, 202090, -268630, -298331, -161179, 113404, -153138, -81460, 160873, 285699, -110826, 337043, -141642, 57946, -144763, 179584, 294408, 349949, 113791, 80874, -92178, 256211, -105343, -232320, -127062, 15120, -73209, -95598, 190014, -248898, -128099, 10939, 75885, 80289, -196788, 55730, 47572, -88998, -53231, 99893, 53786, -55575, 54219, 70151, -368131, -44804, -244294, -8606, -269058, -61091, -228938, -123788, 92754, -176348, -184371, -93274, -243235, -97944, -41978, -316873, -154314, 82247, -45860, 177309, 109274, 26052, 148018, -210304, -35401, -470391, -170154, -300753, 21086, -160635, -224141, -21635, 154804, -451177, -115796, -188490, 398659, -387009, -108125, -112353, -28968, 236785, 53436, -37194, -140477, -210641, -329891]
9634c29891a54367k24850H0022a49777c4711D5200Q7570c34935g7490n3831F9797
9622A8279a83857A40892d23874a26526D9615J1561N822c45469J29887J03114j72187
9611b84655a07726A8420K82861i0079n1884a4409G5792J43485a85835K2135A46112
9599c00514B51991a27752e0494j10062O3698j64796A19712c70862a66900j42034
9589c08934d7938j91162E3707h1799j61740H2005m0479a00699p357n4615q5714
9578b48385J01671l51813a14251Q072C8940b24765G3639L59761b38590R8396H541
9566a31258a1240A03792b20233G4585b86452J22159P3016J3011A86932b09043
9555g9537j7672G6015R6200a99053n3300R2057B4467J20117c68403a50607j89876
$$ y = [-329891, -154367, -379217, 80022, -149777, -34711, 45200, 132770, -334935, -77490, -131321, 69797, 18279, -183857, 140892, -423874, -126526, 49615, 61176, 66998, -345469, -215582, -112468, -284655, -107726, 18420, 301281, -90079, -141963, -14409, 75792, 219277, -185835, -163700, 146112, -300514, 251991, -127752, -50494, -160556, -96858, -261654, 119712, -370862, -166900, -308934, -47938, -239100, 53707, -81799, -243539, 82005, 41526, -100699, -108056, -162671, -248385, -146714, -498527, -114251, -106179, 38940, -224765, 73639, 433400, -238590, -140194, 8541, -131258, -11240, 103792, -220233, 74585, -286452, -164293, -91277, -78266, 186932, -209043, -79537, -97209, 76015, 172215, -199053, -252353, -160296, 24467, 144584, -368403, -150607, -340483]
9544c40483F4432b87990a1460E8195a42976d107l32204I838c5274B55484b54499
9532a43412A53476i6473a9325G0782d7680j41753G823i4473l07505a58010A55983
9520I4366d9024r9012A61429e7251G4766J56899J69101c1559k9603c450A44498
9508a58816F0039M8300g9490j0842k34394A63682f4439c128l4271j30513n0799
9497b18711A63990b11425E696b12526b0903j85455D0153d0574k70771R3042a04836
9485I1919K14832o1605E9947a72385G4498c19171A36961C4377P9939M6979b8893
9473G9432b11835O2381K0321O956B43754g1768m5866C1030a18633N4403j69466
9462b33696p4684J00743L2451I6341j5593A0508M5844J04969C0457n437L47478
$$ y = [-340483, 64432, -287990, -11460, 58195, -142976, -4107, -336311, 9838, -35274, 255484, -254499, -143412, 153476, -96473, -19325, 70782, -47680, -189433, 7823, -94473, -401978, -158010, 155983, 94366, -49024, -148036, 161429, -57251, 74766, 231665, 400766, -31559, -61162, -3450, 144498, -158816, 60039, 108339, -79490, -90332, -324726, 163682, -64439, -3128, -37399, -167912, -218711, 163990, -211425, 5696, -212526, -20903, -206358, 40153, -40574, -311345, -218303, -104836, 91919, 306751, 245146, 59947, -172385, 74498, -319171, 136961, 34377, 114316, 161295, -28893, 79432, -211835, -149454, -129133, -122177, 243754, -71768, -117634, 31030, -118633, -64230, -233696, -308380, -207637, -175186, 96341, 80748, 10508, 56352, 161321, 30457, 25020, 372498]
9451C72498i2313j330C372b14140R6572a1556q2811A48884h0151j16644g6310
9439h8983a306A55902i3948o0180n8257r0835F5061a32225h418l9866B13872b55864
9426a2603l04072B048b07437D6016c7298B15103a81439k02886A39052c09548g0943
9414b1718B66695f1352A11076a42393B59721o9765B8866e8393j05736A00500l1979
9403F8521a05509m534e3724I0082a32425A03357a49011A9170P3859a49158q5433
9392b34591R8061O28n5356A35940b93351A3214J269c82123C8903g2214n1960A71005
9379a04251k2292k0671A11330K6460E3732K28471A2327a18298L8185j30158B52910
9367b68684A20776R6173j2452b45780R7544a441A34182b3462j84384j11644a55585
$$ y = [372498, -92313, -93643, 3372, -214140, -117568, -11556, -94367, 148884, -80151, -196795, -76310, -88983, -1306, 155902, -93948, -154128, -212385, -303220, 65061, -132225, -8418, -48284, 213872, -255864, -12603, -316675, 2048, -207437, 46016, -37298, 215103, -181439, -384325, 139052, -309548, -70943, -21718, 266695, -61352, 111076, -142393, 259721, 189956, 28866, -58393, -164129, 100500, 68521, -105509, -110043, -53724, 90082, -132425, 103357, -149011, 19170, 93029, -149158, -234591, -136530, -135902, -191258, 135940, -293351, 13214, 14483, -382123, 38903, -72214, -124174, 171005, -104251, -126543, -147214, 111330, 137790, 53732, 282203, 12327, -118298, -80113, -210271, 252910, -268684, 120776, 216949, 204497, -245780, -148236, -1441, 134182, -23462, -207846, -319490, -155585]
9355b9092n4837p5718I832h3401m3591B3943c9176k70016B51323b12765O170A79778
9342a19082C1914a1247C65085c02428g5847k24978a44307N6616l319J2396l8379
9331a16993K8798j07868A08216b12879e8008G2011a97434f4807A85877k5259a20548
9319A3809a30460A69449a16062J0063m7327a3514A7256k696R9659n1885O5421
9308A27755a19388A18002c8555k81933B44145B8030J02824g9022k76854a0280
9297C05547j42095f818n8043j18703r114B21785a87125d2944B03800a14356L6978
9286g7378A26482b14610p9955D6380K67347a52529A03598b5961k17296A65506
9275F1525b56389J04756B0177b82559B10840e8190f665l68141i2167A99343i3927
$$ y = [-29092, -83929, -159647, 9832, -83401, -126992, 23943, -39176, -309192, 251323, -212765, -206595, 179778, -119082, 31914, -11247, 365085, -302428, -75847, -300825, -144307, -87691, -91010, -78614, -116993, -88195, -196063, 108216, -212879, -58008, 72011, -197434, -64807, 185877, 160618, -120548, 13809, -130460, 169449, -116062, -105999, -153326, -13514, 17256, 14560, 114219, 62334, 127755, -119388, 118002, -38555, -320488, 244145, 28030, 130854, -79022, -355876, -10280, 305547, 163452, -6818, -64861, -183564, -192678, 221785, -187125, -42944, 203800, -114356, -77378, 126482, -214610, -294565, 46380, 313727, -152529, 103598, -25961, -243257, 165506, 61525, -256389, -151633, 20177, -282559, 210840, -58190, -6665, -374806, -92167, 199343, -93927]
9263a75653f3728j88855A94c13095G9309a0019A60159o2194a90322P0820k9522
9252a49024A78207J14855f4173j31388P9411j1414e7524J2435m71337A47737a31967
9240B88274a26828C88858b98420k3933G9946c75811e7779k14597J09948j34751
9230b97179Q5182B55611a04692l62527H5301a94751A22754g8639j00265l3263
9220b12167b7135j17901M9488A73035c41790B54480c80345J63450j23342a42024
9209A43797B7494c32643C16311d0016A25188a16054m02541A17378a53068e1985
9198a17333A13631D2146b06082A58898a41842N2132A96267j7975b75271i8736
9187a403G3676M7084D3880J56980H0920a32576E921f0526K2441B618L2025b12233
$$ y = [-175653, -63728, -252583, 194, -313095, 79309, -10019, 160159, 97965, -190322, -119502, -149024, 178207, 293062, -64173, -195561, -116150, -127564, -57524, -45089, -516426, 147737, -131967, 288274, -126828, 388858, -298420, -322353, 79946, -375811, -57779, -272376, -162428, -297179, -211997, 255611, -104692, -467219, 85301, -194751, 122754, -78639, -178904, -212167, -27135, -145036, -95548, 173035, -341790, 254480, -380345, -216895, -340237, -142024, 143797, 27494, -332643, 316311, -40016, 125188, -116054, -518595, 117378, -153068, -51985, -117333, 113631, 42146, -206082, 158898, -141842, -89710, 196267, 178292, -275271, -98736, -1403, 73676, 120760, 43880, 200860, 80920, -132576, 5921, -60526, -38085, 2618, 34643, -212233]
9174b48513e0338j17321O6608B34005A09047b1643D1706a0753A1373K66832p7093
9163B01112K1040a51302K7650C19953b73755g7984B02013P110b83381J4839e1682
9151a58936I1904d4409A68978c2792A93208b5680j08844J0416b4037n957j53934
9140a83928Q7149j87635j0507a3383l03512J53651c8092a1110I3290O1028b37380
9128b32295j61111a47791B0693f6102D0334a03965j29457d8579m1734I1831a158
9116b0105B40177b48120A50285K39602a32642e1828k7258K210r4327I9351i5545
9104A09802c34718B28058a22693N6225A66520P189a61104A33355b05658C1519
9093A87722c43554a7755j05908d7077B00993D7395c0646n81301b77902g9903G9969
$$ y = [-248513, -50338, -167659, -101051, 234005, 109047, -21643, 41706, -10753, 11373, 278205, 201112, 222152, -151302, -123652, 319953, -273755, -77984, 202013, 209123, -283381, -268542, -51682, -158936, 91904, -44409, 168978, -32792, 193208, -25680, -134524, -124108, -24037, -29994, -183928, -96779, -284414, -294921, -13383, -316895, -163244, -38092, -11110, 93290, 154318, -237380, -232295, -393406, -147791, 20693, -66102, 40334, -103965, -233422, -48579, -90313, 91831, -1158, -20105, 240177, -248120, 150285, 389887, -132642, -51828, -79086, -76876, -171203, 99351, -95545, 109802, -334718, 228058, -122693, -66468, 166520, 173709, -161104, 133355, -205658, 31519, 187722, -343554, -17755, -123663, -47077, 200993, 47395, -30646, -611947, -277902, -79903, 79969]
9081I4713K39900b40798h5252k2799c1638F1732b10071A48519J03200a4188n0290
9070f4478A71879a47126k5687O8654j88471C61259a46666a8018j70746r2989D2365
9058d911A12664b5123h74j1331A21723C3984R4813B1670a18029A41854b98797
9046A88948c48843J42711i9469d983o0556A00137b85472A54694h5147A86353c27932
9034a62096a81A34337C8950a82454I5900b0697k41263A6604K9575a03116j03498
9023b06614j9167A78528h7706d0367q2653k26415L6064J40500j51427J61901F937
9011a71011H5881K1222b11638M9239I3441k8333k5135e7891k05329b2435I6713
8999g7003l2066j85448A64542c1929I5101i253I3962N4724b5763F7851a21068
$$ y = [94713, 334613, -240798, -85252, -108051, -31638, 61732, -210071, 148519, 251719, -14188, -64478, 171879, -147126, -172813, -104159, -292630, 361259, -146666, -18018, -188764, -281753, 42365, -4911, 112664, -25123, -874, -12205, 121723, 33984, 128797, 21670, -118029, 141854, -298797, 188948, -348843, -206132, -99469, -4983, -65539, 100137, -285472, 154694, -85147, 186353, -327932, -162096, -181, 134337, 38950, -182454, 95900, -20697, -261960, 16604, 46179, -103116, -206614, -225781, 178528, -87706, -40367, -123020, -349435, -313371, -172871, -324298, -162397, 6937, -171011, 85881, 107103, -211638, -162399, 93441, 65108, 39973, -57891, -263220, -22435, 96713, -77003, -109069, -294517, 164542, -31929, 95101, -9253, 93962, 148686, -25763, 67851, -121068]
8987a17176H9073b73482G3665N4951h0443L8553j07404c1662r5261p4625P6311
8976a25237a694j17518j34144m3666A5431g3369j93364a3583k06329L7179A85508
8964G1699h6654k75773f9497j81565A60560D3103a05137L2900G1120b13152a02262
8952A07636b2018l3986A89713c7543a0290k28368g3590a9609p4227C3197c29912
8940G058h761H8407g6463n4583d4391q6497A48725N8474n3059b37806f9252j26921
8928a96173k6877m4548n8709B1655b59256B67413a10208B487J4646A152M0808
8917D1960J89995B0654L30406j54019r5446m8722O9768h0894B57675j02542J34169
8906B89302R00109N68915J201040L020773B818147A269089k39225l88140k80660
$$ y = [-117176, 89073, -273482, 73665, 128616, -80443, -41890, -149294, -31662, -126923, -201548, -125237, -1694, -119212, -253356, -297022, 15431, -73369, -266733, -13583, -219912, -182733, 185508, 71699, -86654, -362427, -69497, -251062, 160560, 43103, -105137, -72237, 71120, -213152, -102262, 107636, -22018, -56004, 189713, -37543, -10290, -238658, -73590, -19609, -93836, 33197, -329912, 7058, -8761, 88407, -76463, -131046, -44391, -130888, 148725, 207199, 154140, -237806, -69252, -196173, -223050, -267598, -326307, 21655, -259256, 267413, -110208, 2487, 17133, 1152, 41960, 231955, 20654, 351060, 197041, 101595, 52873, 122641, -80894, 257675, 155133, 289302, 1189411, 1758326, 2959366, 5980139, 2818147, 1269089, 1029864, 641724, 361064]
8897C61064H3158M39879B8130g8030L5037A01198J9183A0108d0576r7488c1855
8885b62492P6154R2076b9124A72523c58431A91323E891P9020b49704b7462o8692
8874i6154h598l06749a55843L432C89024b55252D917L5053a26449E0233f9411
8862a89476A60757a9023A08143C6030c48812B84106h8632c4591a5783E0606J45122
8851A95728n230F7464a98529B5349K5072O9458e8407K7919A98753k5164d6172
8839a84356m3083E0981K38816g3687J4526E4700h2344q1444A04139e463A82985
$$ y = [361064, 83158, 523037, 28130, -78030, -42993, 101198, 120381, 10108, -40576, -138064, -31855, -262492, -186338, -94262, -29124, 172523, -358431, 191323, 5891, 84911, -249704, -27462, -96154, -8598, -315347, -155843, -152411, 389024, -255252, 4917, 39970, -126449, 50233, -69411, -189476, 160757, -19023, 108143, 36030, -348812, 284106, -88632, -34591, -15783, 50606, 195728, 190498, 67464, -198529, 25349, 50421, 119879, -58407, -30488, 198753, 173589, -46172, -184356, -227439, 50981, 289797, -73687, -59161, 54700, -82344, -163788, 104139, -5463, 182985]
$$ [...]
##END NTUPLES=NMR SPECTRUM
##END=
