
##TITLE=AC1115_Huila3_5835647_LdjiZo3Vq9
##JCAMPDX= 6.0         $$ Bruker NMR JCAMP-DX V2.0
##DATA TYPE= NMR SPECTRUM
##DATA CLASS= NTUPLES
##ORIGIN= BRUKER
##OWNER= Administrator
$$ 1.72 TOPSPIN		Version 2.1
$$ 2012-04-16 19:07:25.859 -0500  Administrator@TOPSPIN
$$ Compression mode = diff/dup
##.OBSERVE FREQUENCY= 400.13188235
##.OBSERVE NUCLEUS= ^1H
##.ACQUISITION MODE= SIMULTANEOUS (DQD)
##.ACQUISITION SCHEME= undefined
##.AVERAGES= 64
##.DIGITISER RES= 22
##SPECTROMETER/DATA SYSTEM= spect
##.PULSE SEQUENCE= noesygpps1d.comp
##.SOLVENT NAME= COFFEE_meoh
##.SHIFT REFERENCE= INTERNAL, COFFEE_meoh, 1, 14.96837
##AUDIT TRAIL= $$ (NUMBER, WHEN, WHO, WHERE, PROCESS, VERSION, WHAT)
$$ ##TITLE= Audit trail, TOPSPIN		Version 2.1
$$ ##JCAMPDX= 5.01
$$ ##ORIGIN= Bruker BioSpin GmbH
$$ ##OWNER= Administrator
$$ $$ C:\Bruker\TOPSPIN/data/COFFEE/nmr/AC1115_Huila3_5835647_LdjiZo3Vq9/22/pdata/1/auditp.txt
$$ ##AUDIT TRAIL=  $$ (NUMBER, WHEN, WHO, WHERE, PROCESS, VERSION, WHAT)
(   1,<2012-04-15 17:30:47.609 -0500>,<Administrator>,<TOPSPIN>,<go>,<TOPSPIN 2.1>,
      <created by zg
	started at 2012-04-15 17:19:15.953 -0500,
	POWCHK enabled, PULCHK disabled,
       configuration hash MD5:
       1A 1E CE 29 27 FD 77 03 67 4E F0 E3 C4 B2 CB 90
       data hash MD5: 64K
       5C D3 DD 16 AA E8 06 3E 55 CE B3 B1 FA FC CF 8B>)
(   2,<2012-04-15 17:30:50.421 -0500>,<Administrator>,<TOPSPIN>,<proc1d>,<TOPSPIN 2.1>,
      <Start of raw data processing
       efp LB = 0.3 FT_mod = 6 PKNL = 1 PHC0 = 0 PHC1 = 0 SI = 128K 
       data hash MD5: 128K
       8E FD 87 AA 15 C8 7E 9A 10 8D 40 29 59 46 01 75>)
(   3,<2012-04-15 17:30:51.625 -0500>,<Administrator>,<TOPSPIN>,<proc1d>,<TOPSPIN 2.1>,
      <pk PHC0 = 39.02893 PHC1 = 0 
       data hash MD5: 128K
       E7 54 E2 84 77 38 93 93 78 02 9A 0B A8 5E 78 C2>)
(   4,<2012-04-15 17:30:51.843 -0500>,<Administrator>,<TOPSPIN>,<proc1d>,<TOPSPIN 2.1>,
      <abs ABSG = 1 
       data hash MD5: 128K
       64 5B 72 5F A4 1E 4C CF 69 DC AE 74 B6 65 88 F3>)
(   5,<2012-04-15 17:30:51.921 -0500>,<Administrator>,<TOPSPIN>,<proc1d>,<TOPSPIN 2.1>,
      <abs ABSG = 2 
       data hash MD5: 128K
       AD 20 40 E5 64 27 03 D9 AF 85 EE 21 05 50 28 12>)
(   6,<2012-04-15 17:30:52.062 -0500>,<Administrator>,<TOPSPIN>,<proc1d>,<TOPSPIN 2.1>,
      <abs ABSG = 3 
       data hash MD5: 128K
       1F 0B C9 F5 C9 DD F4 0D 36 1C FF CD F9 9B E0 4A>)
(   7,<2012-04-15 17:30:52.218 -0500>,<Administrator>,<TOPSPIN>,<proc1d>,<TOPSPIN 2.1>,
      <abs ABSG = 4 
       data hash MD5: 128K
       EB AE D2 43 E1 45 79 3E AF 56 AE CB B5 FE 42 8C>)
(   8,<2012-04-15 17:30:52.265 -0500>,<Administrator>,<TOPSPIN>,<proc1d>,<TOPSPIN 2.1>,
      <abs ABSG = 5 
       data hash MD5: 128K
       CC 13 2B A1 37 A2 DA 5B 55 72 87 58 6E AD EB CA>)
(   9,<2012-04-15 17:30:52.515 -0500>,<Administrator>,<TOPSPIN>,<audit>,<TOPSPIN 2.1>,
      <user comment:
       ICON-NMR User ID: COFFEE
       data hash MD5: 128K
$$ [...]
##$TP07= 0
##$TPNAME0= <>
##$TPNAME1= <>
##$TPNAME2= <>
##$TPNAME3= <>
##$TPNAME4= <>
##$TPNAME5= <>
##$TPNAME6= <>
##$TPNAME7= <>
##$TPOAL= (0..7)
0.5 0.5 0.5 0.5 0.5 0.5 0.5 0.5
##$TPOFFS= (0..7)
0 0 0 0 0 0 0 0
##$TUNHIN= 0
##$TUNHOUT= 0
##$TUNXOUT= 0
##$USERA1= <user>
##$USERA2= <user>
##$USERA3= <user>
##$USERA4= <user>
##$USERA5= <user>
##$V9= 5
##$VALIST= <valist>
##$VCLIST= <CCCCCCCCCCCCCCC>
##$VD= 0
##$VDLIST= <DDDDDDDDDDDDDDD>
##$VPLIST= <PPPPPPPPPPPPPPP>
##$VTLIST= <TTTTTTTTTTTTTTT>
##$WBST= 2048
##$WBSW= 25
##$XGAIN= (0..3)
0 0 0 0
##$XL= 0
##$YL= 0
##$YMAX_a= 10653497
##$YMIN_a= -6451298
##$ZGOPTNS= <>
##$ZL1= 120
##$ZL2= 120
##$ZL3= 120
##$ZL4= 120
##$ABSF1= 14.96837
##$ABSF2= -5.58416
##$ABSG= 5
##$ABSL= 3
##$ALPHA= 0
##$AQORDER= 0
##$ASSFAC= 0
##$ASSFACI= 0
##$ASSFACX= 0
##$ASSWID= 0
##$AUNMP= <proc_prof1d_extract.lims>
##$AXLEFT= 0
##$AXNAME= <>
##$AXNUC= <1H>
##$AXRIGHT= 0
##$AXTYPE= 0
##$AXUNIT= <>
##$AZFE= 0.1
##$AZFW= 0.1
##$BCFW= 0
##$BC_mod= 0
##$BYTORDP= 0
##$COROFFS= 0
##$CY= 15
##$DATMOD= 1
##$DC= 0
##$DFILT= <>
##$DTYPP= 0
##$F1P= 0
##$F2P= 0
##$FCOR= 0.5
##$FTSIZE= 131072
##$FT_mod= 6
##$GAMMA= 0
##$GB= 0
##$INTBC= 1
##$INTSCL= 1
##$ISEN= 128
##$LB= 0.3
##$LEV0= 0
##$LPBIN= 0
##$MAXI= 10000
##$MC2= 0
##$MEAN= 0
##$ME_mod= 0
##$MI= 0
##$NCOEF= 0
##$NC_proc= -2
##$NLEV= 6
##$NOISF1= 0
##$NOISF2= 0
##$NSP= 0
##$NTH_PI= 0
##$NZP= 0
##$OFFSET= 14.96837
##$PC= 1
##$PHC0= 39.02893
##$PHC1= 0
##$PH_mod= 1
##$PKNL= yes
##$PPARMOD= 0
##$PPDIAG= 0
##$PPIPTYP= 0
##$PPMPNUM= 2147483647
##$PPRESOL= 1
##$PSCAL= 4
##$PSIGN= 0
##$PYNMP= <proc.py>
##$REVERSE= no
##$SF= 400.130004897897
##$SI= 131072
##$SIGF1= 0
##$SIGF2= 0
##$SINO= 400
##$SIOLD= 131072
##$SPECTYP= <>
##$SREGLST= <1H.CDCl3>
##$SSB= 0
##$STSI= 131072
##$STSR= 0
##$SW_p= 8223.68421052632
##$SYMM= 0
##$S_DEV= 0
##$TDeff= 65536
##$TDoff= 0
##$TI= <>
##$TILT= no
##$TM1= 0
##$TM2= 0
##$TOPLEV= 0
##$USERP1= <user>
##$USERP2= <user>
##$USERP3= <user>
##$USERP4= <user>
##$USERP5= <user>
##$WDW= 1
##$XDIM= 131072
##$YMAX_p= 226801464
##$YMIN_p= -301699093
##$CURPLOT= <Network HP LaserJet P1505>
##$CURPRIN= <$Network HP LaserJet P1505>
##$DFORMAT= <normdp>
##$LAYOUT= <+/1D_H.xwp>
##$LFORMAT= <normlp>
##$PFORMAT= <normpl>
##$SURQMSG= 1
$$ End of Bruker specific parameters
$$ ---------------------------------
##NTUPLES= NMR SPECTRUM
##VAR_NAME=  FREQUENCY,     SPECTRUM/REAL,   SPECTRUM/IMAG
##SYMBOL=    X,             R,               I
##VAR_TYPE=  INDEPENDENT,   DEPENDENT,       DEPENDENT
##VAR_FORM=  AFFN,          ASDF,            ASDF
##VAR_DIM=   131072,        131072,          131072
##UNITS=     HZ,            ARBITRARY UNITS, ARBITRARY UNITS
##FACTOR=    0.0627417313425165, 1,          1
##FIRST=     8223.62146879498, -2544,        -42375
##LAST=      0,             -313,            -42452
##MIN=       0,             -301699093,      0
##MAX=       8223.62146879498, 226801464,    0
$$ Real data points
##PAGE= N=1
##DATA TABLE= (X++(R..R)), XYDATA
$$ [...]
62087A090580r925j1328j1766j2098j2987j3931j3883j2716j1357j0448r598q342
62075I52201p116o601o546o068m977m000l605l425l076k810k801k481j335R8Q94
62060H98352J231K207M124N913O661O828P384Q398R275R942J0930J2414J3884
62047I97543J4914J5665J6463J7281J7875J8204J8655J9791K1789K3992K5320
62036A207492K5374K4814K4394K4032K3346K2650K2700K3622K4817K5772K6283
62025A475296K6003K4681K2958K2028K2312K3118K3906K4954K6486K7997K9019
62014A748758K9864L0896L1678L1604L1018L0914L1715L2979L4118L4886L5246
62003B103676L5331L5456L5692L5463L4065L1532K8630K6034K3860K1890J9831
$$ y = [1090580, 1080655, 1069327, 1057561, 1045463, 1032476, 1018545, 1004662, 991946, 980589, 970141, 960543, 952201, 945085, 938484, 931938, 925870, 920893, 916893, 913288, 909863, 906787, 903977, 901176, 898695, 897360, 897458, 898352, 899583, 901790, 905914, 911827, 918488, 925316, 932700, 941098, 950373, 960315, 971245, 983659, 997543, 1012457, 1028122, 1044585, 1061866, 1079741, 1097945, 1116600, 1136391, 1158180, 1182172, 1207492, 1232866, 1257680, 1282074, 1306106, 1329452, 1352102, 1374802, 1398424, 1423241, 1449013, 1475296, 1501299, 1525980, 1548938, 1570966, 1593278, 1616396, 1640302, 1665256, 1691742, 1719739, 1748758, 1778622, 1809518, 1841196, 1872800, 1903818, 1934732, 1966447, 1999426, 2033544, 2068430, 2103676, 2139007, 2174463, 2210155, 2245618, 2279683, 2311215, 2339845, 2365879, 2389739, 2411629, 2431460]
61992B431460J7440J4799J2467J0930R928Q686O887M979L564K805K611K912L547
61979B533015M191M648N076N717O488P032P172P100P075P096O997O886P132P760
61965B623385Q122P565O343N360M980M573L508K066J004N64L68K0o40j618k603
61950B662997k918k158r03k76o51j247j093j19R07J300J138J040J453K160K586
61935B664216K550K451K638K799K283Q55j102l033m584n655o357o909p443p893
61921B634816q242q643r178r656r904r992j0012r896r828j0428j2010j3881j4928
61908B498218j4842j4241j3677j3185j2867j3149j4126j5174j5670j5785j6118
61897B339384j6778j7248j7124j6644j6309j6186j5798j4771j3391j2346j1891
$$ y = [2431460, 2448900, 2463699, 2476166, 2487096, 2497024, 2505710, 2512597, 2517576, 2521140, 2523945, 2526556, 2529468, 2533015, 2537206, 2541854, 2546930, 2552647, 2559135, 2566167, 2573339, 2580439, 2587514, 2594610, 2601607, 2608493, 2615625, 2623385, 2631507, 2639072, 2645415, 2650775, 2655755, 2660328, 2663836, 2665902, 2666906, 2667470, 2667838, 2667858, 2667218, 2665600, 2662997, 2660079, 2657921, 2657018, 2656742, 2656091, 2654844, 2653751, 2653632, 2654539, 2655839, 2656977, 2658017, 2659470, 2661630, 2664216, 2666766, 2669217, 2671855, 2674654, 2676937, 2677792, 2676690, 2673657, 2669073, 2663418, 2657061, 2650152, 2642709, 2634816, 2626574, 2617931, 2608753, 2599097, 2589193, 2579201, 2569189, 2559293, 2549465, 2539037, 2527027, 2513146, 2498218, 2483376, 2469135, 2455458, 2442273, 2429406, 2416257, 2402131, 2386957, 2371287, 2355502, 2339384, 2322606, 2305358, 2288234, 2271590, 2255281, 2239095, 2223297, 2208526, 2195135, 2182789, 2170898]
61886B170898j1578j0932j0050r251q442p246n637m012k633j424k97O98J597K565
61872B104256L691N010O665Q640J0473J1681J2531J3893J6173J8914K1607K4350
61860B257884K7477L0984L4770L9109M4337N0245N6232O2121O8555P6455Q6179
61849B834348R7253J08995J21432J35447J51765J70014J89187K08877K29483K51062
61839D497863K72724K93434L12781L30312L44465L52842L53366L44543L24740
61830G427070K91986K44972J84209J12314L3615m6513j22588j90057k45956k88957
61820G400095l19172l37853l46798l47711l42078l31585l18168l03321k87533
61811D465876k70768k53431k36474k20509k05251j90091j74953j60327j46665
$$ y = [2170898, 2159320, 2148388, 2138338, 2129087, 2120645, 2113399, 2107762, 2103750, 2101117, 2099693, 2099396, 2100094, 2101691, 2104256, 2107947, 2112957, 2119622, 2128262, 2138735, 2150416, 2162947, 2176840, 2193013, 2211927, 2233534, 2257884, 2285361, 2316345, 2351115, 2390224, 2434561, 2484806, 2541038, 2603159, 2671714, 2748169, 2834348, 2931601, 3040596, 3162028, 3297475, 3449240, 3619254, 3808441, 4017318, 4246801, 4497863, 4770587, 5064021, 5376802, 5707114, 6051579, 6404421, 6757787, 7102330, 7427070, 7719056, 7964028, 8148237, 8260551, 8294166, 8247653, 8125065, 7935008, 7689052, 7400095, 7080923, 6743070, 6396272, 6048561, 5706483, 5374898, 5056730, 4753409, 4465876, 4195108, 3941677, 3705203, 3484694, 3279443, 3089352, 2914399, 2754072, 2607407]
61802B607407j34110j22682j12250j02385r2648q3222p4782o7666o1546n6091
61792A700025n1379m7367m3520l9465l5585l2371k9572k6661k3784k1526j9849
61781A328946j8179j6455j5220j4550j3806j2649j1504j0654r629p972n936l994
61769A188398k248p70J61O79J464K700L538L365K947L313M143M394M238N020P162
61754A228504R402J0524J0935J1887J3792J6009J7823J9174K0598K2752K5828
61743A407228K9226L2128L4549L7357M1025M4913M8175N0984N4297N8653O3784
61732A902319O9250P4874Q0557Q6193R2004R8561J06205J14701J23714J33518
61722B881896J44930J58559J74333J91863K11069K32306K55927K81953L10242
$$ y = [2607407, 2473297, 2350615, 2238365, 2135980, 2043332, 1960110, 1885328, 1817662, 1756116, 1700025, 1648646, 1601279, 1557759, 1518294, 1482709, 1450338, 1420766, 1394105, 1370321, 1348795, 1328946, 1310767, 1294312, 1279092, 1264542, 1250736, 1238087, 1226583, 1215929, 1206300, 1198328, 1192392, 1188398, 1186150, 1185380, 1185541, 1186220, 1187684, 1190384, 1193922, 1197287, 1200234, 1203547, 1207690, 1212084, 1216322, 1221342, 1228504, 1237906, 1248430, 1259365, 1271252, 1285044, 1301053, 1318876, 1338050, 1358648, 1381400, 1407228, 1436454, 1468582, 1503131, 1540488, 1581513, 1626426, 1674601, 1725585, 1779882, 1838535, 1902319, 1971569, 2046443, 2127000, 2213193, 2305197, 2403758, 2509963, 2624664, 2748378, 2881896, 3026826, 3185385, 3359718, 3551581, 3762650, 3994956, 4250883, 4532836, 4843078]
61713D843078L40822L73856M09270M46448M84300N21570N57147N90054O18865
61704I185410O41054O53037O51004O31617N91838N28750M40622L28759J98335
61695A3850426N7352q5157k20343l40366m39449n14917n67228n98904o13314o13963
61685I914137o04192n86867n64153n37584n08368m77632m46433m15615l85678
61676E387615l56787l28935l02216k76993k53711k32445k12722j93989j76257
61667C053560j60094j45865j33295j21882j11488j02215r3845q5878p8205p1384
61657A949409o6032o2070n8777n5496n2094m8773m5608m2479l9425l6845l5076
61646A406734l3762l2031k9439k6556k4291k2877k1814k0714j9741j9194j9019
$$ y = [4843078, 5183900, 5557756, 5967026, 6413474, 6897774, 7419344, 7976491, 8566545, 9185410, 9826464, 10479501, 11130505, 11762122, 12353960, 12882710, 13323332, 13652091, 13850426, 13907778, 13822621, 13602278, 13261912, 12822463, 12307546, 11740318, 11141414, 10528100, 9914137, 9309945, 8723078, 8158925, 7621341, 7112973, 6635341, 6188908, 5773293, 5387615, 5030828, 4701893, 4399677, 4122684, 3868973, 3636528, 3423806, 3229817, 3053560, 2893466, 2747601, 2614306, 2492424, 2380936, 2278721, 2184876, 2098998, 2020793, 1949409, 1883377, 1821307, 1762530, 1707034, 1654940, 1606167, 1560559, 1518080, 1478655, 1441810, 1406734, 1372972, 1340941, 1311502, 1284946, 1260655, 1237778, 1215964, 1195250, 1175509, 1156315, 1137296]
61635A137296j8933j8769j8500j8141j7743j7394j7081j6670j6077j5310j4410
61624I48268j3474j2778j2546j2571j2361j1737j1012j0416r718q665p509o734
61612H18747o368n978n298m573m210m269m426m343m068l972m297m785n045n102
61598G52013n302n587n374m377l173k521k516k777l140l594l771l206k117j255
61584G03303r29p11l10j14n24j197j396q30J27Q94J118Q42N05N66J000J364J489
61567G05197J733K370L096L444L387L140K688J935J103N14J12l52q03j004j138
61552G25422j668k597l363l655l779m109m550m848n021n205n334n202m733m044
61538F67314l450l418m167n162n403m466k941j658q08k04L9l25r88j149l35J178
$$ y = [1137296, 1118363, 1099594, 1081094, 1062953, 1045210, 1027816, 1010735, 994065, 977988, 962678, 948268, 934794, 922016, 909470, 896899, 884538, 872801, 861789, 851373, 841655, 832990, 825481, 818747, 812379, 806401, 801103, 796530, 792320, 788051, 783625, 779282, 775214, 771242, 766945, 762160, 757115, 752013, 746711, 741124, 735750, 731373, 728200, 725679, 723163, 720386, 717246, 713652, 709881, 706675, 704558, 703303, 702374, 701663, 701353, 701239, 700715, 699518, 698122, 697292, 697419, 698313, 699431, 700273, 700778, 701344, 702344, 703708, 705197, 706930, 709300, 712396, 715840, 719227, 722367, 725055, 726990, 728093, 728607, 728719, 728367, 727564, 726560, 725422, 723754, 721157, 717794, 714139, 710360, 706251, 701701, 696853, 691832, 686627, 681293, 676091, 671358, 667314, 663864, 660446, 656279, 651117, 645714, 641248, 638307, 636649, 635841, 635637, 635676, 635351, 634363, 633214, 632879, 634057]
61522F34057K795M107M979N548O219P339Q701R700J0126J0529J1579J3234J4881
61509G43794J6203J7486J9012K0407K0974K0658K0300K0669K1443K1557K0558
61498I63061J9192J8466J8437J8303J7522J6427J5679J5415J5096J4134J2504
61487A144236J0774R436Q340O975N249L668K528J372m20k738m905o526p641q191
61473A162157p950p145o480o217n773m607l110k055j396k10K124N175Q073J0514
61459A143100J2943J5857J9257K2712K5890K8937L2372L6604M1542M6820N2346
61448A478380N8441O5282P2492P9501Q6342R3630J01709J10150J18274J25753
61438B389954J32296J37136J39405J38902J35820J29769J19785J05503Q7700O7437
$$ y = [634057, 636852, 640959, 645938, 651486, 657705, 665044, 673745, 683445, 693571, 704100, 715679, 728913, 743794, 759997, 777483, 796495, 816902, 837876, 858534, 878834, 899503, 920946, 942503, 963061, 982253, 1000719, 1019156, 1037459, 1054981, 1071408, 1087087, 1102502, 1117598, 1131732, 1144236, 1155010, 1164446, 1172786, 1179761, 1185010, 1188678, 1191206, 1192578, 1192158, 1189420, 1184515, 1177989, 1170348, 1162157, 1154207, 1147062, 1140582, 1134365, 1128592, 1123985, 1120875, 1118820, 1117424, 1117214, 1119338, 1124513, 1132586, 1143100, 1156043, 1171900, 1191157, 1213869, 1239759, 1268696, 1301068, 1337672, 1379214, 1426034, 1478380, 1536821, 1602103, 1674595, 1754096, 1840438, 1934068, 2035777, 2145927, 2264201, 2389954, 2522250, 2659386, 2798791, 2937693, 3073513, 3203282, 3323067, 3428570, 3516270, 3583707]
61428C583707M5400K2446K7k0577l9013n5195o8434p8026q4312q8325r0527r0711
61416C036460q9012q6079q2273p7475p1795o5625n8973n1580m3814l6591l0076
61405B343167k3410j6096q849k524L055Q553J4018J8980K3181K6703K9726L2560
61393B449064L5434L7900L9015L8649L7887L7641L7487L6655L5380L4356L3446
61382B852914L2130L0800L0346L0486K9851K7807K5181K2824K0534J7862J5116
61371C135851J2912J1261R655P757N577L268Q98j684m796q327j1308j2723j2800
61358C135541j2857j3634j4581j4917j4657j4131j3323j2237j1332j0856j0336
61347B992680r410q667q852r641j0095j0129j0516j1494j2342j2548j2450j2338
$$ y = [3583707, 3629107, 3651553, 3651580, 3631003, 3591990, 3536795, 3468361, 3390335, 3306023, 3217698, 3127171, 3036460, 2947448, 2861369, 2779096, 2701621, 2629826, 2564201, 2505228, 2453648, 2409834, 2373243, 2343167, 2319757, 2303661, 2294812, 2292288, 2295343, 2303896, 2317914, 2336894, 2360075, 2386778, 2416504, 2449064, 2484498, 2522398, 2561413, 2600062, 2637949, 2675590, 2713077, 2749732, 2785112, 2819468, 2852914, 2885044, 2915844, 2946190, 2976676, 3006527, 3034334, 3059515, 3082339, 3102873, 3120735, 3135851, 3148763, 3160024, 3169679, 3177436, 3183013, 3186281, 3187179, 3185495, 3180699, 3172372, 3161064, 3148341, 3135541, 3122684, 3109050, 3094469, 3079552, 3064895, 3050764, 3037441, 3025204, 3013872, 3003016, 2992680, 2983270, 2974603, 2965751, 2956110, 2946015, 2935886, 2925370, 2913876, 2901534, 2888986, 2876536, 2864198]
61335B864198j1745j0101p448l966O51O636J3427K0247K7198L5103M4308N4365
61323C032873O4854P5749Q6886R7774J08247J18619J28760J37662J44384J48950
61313D144758J51571J51420J47025J37761J24227J07187Q6930O3856L9058J3998
61303E167791j0049l2177n2075p0191q7094j02481j15322j25208j32854j38992
61293D301348j43399j45550j45550j43897j40822j36503j31458j26024j19798
61284C068347j12309j03997r5805q8009q0144p1972o3743n5592m7405l9341l1912
61273B278118k5354j9426j3816q307k647L216Q813J3579J7562K1207K4551K7205
61261B324701K9024L0158L0556L0131K9310K8681K8013K6509K4117K1738J9999
$$ y = [2864198, 2852453, 2842352, 2834904, 2830938, 2831589, 2838225, 2851652, 2871899, 2899097, 2934200, 2978508, 3032873, 3097727, 3173476, 3260362, 3358136, 3466383, 3585002, 3713762, 3851424, 3995808, 4144758, 4296329, 4447749, 4594774, 4732535, 4856762, 4963949, 5050879, 5114735, 5153793, 5167791, 5157742, 5125565, 5073490, 5003299, 4916205, 4813724, 4698402, 4573194, 4440340, 4301348, 4157949, 4012399, 3866849, 3722952, 3582130, 3445627, 3314169, 3188145, 3068347, 2956038, 2852041, 2756236, 2668227, 2588083, 2516111, 2452368, 2396776, 2349371, 2310030, 2278118, 2252764, 2233338, 2219522, 2211215, 2208568, 2211784, 2220597, 2234176, 2251738, 2272945, 2297496, 2324701, 2353725, 2383883, 2414439, 2444570, 2473880, 2502561, 2530574, 2557083, 2581200, 2602938, 2622937]
61250B622937J8550J6819J4680J2043Q693M866J246k024n563r581j3286j5969
61238B653411j7939j9836k1725k3451k5207k7016k8379k9136l0054l1652l3099
61227B365917l3187l1985l0516k9227k7774k6093k4565k3168k1457j9476j7768
61216B080701j6480j5242j4134j3761j4216j4763j4932j5120j5645j5889j4974
61205A915545j2946j0738r126q062o817m600j199K788O532R867J3384J7607K2421
61192A934656K7409L2372L7368M2504M7849N3238N8035O1441O3229O3812O3395
61181B485308O1361N6892M9761M0140K7950J3071l717k0575l5735m8621n9665
61170B566170o9156p6559q1059q2588q2070q0691p8997p6768p3576o9364o4558
$$ y = [2622937, 2641487, 2658306, 2672986, 2685029, 2693722, 2698588, 2699834, 2697810, 2692247, 2682666, 2669380, 2653411, 2635472, 2615636, 2593911, 2570460, 2545253, 2518237, 2489858, 2460722, 2430668, 2399016, 2365917, 2332730, 2300745, 2270229, 2241002, 2213228, 2187135, 2162570, 2139402, 2117945, 2098469, 2080701, 2064221, 2048979, 2034845, 2021084, 2006868, 1992105, 1977173, 1962053, 1946408, 1930519, 1915545, 1902599, 1891861, 1882735, 1874673, 1867856, 1863256, 1862057, 1864845, 1871377, 1881244, 1894628, 1912235, 1934656, 1962065, 1994437, 2031805, 2074309, 2122158, 2175396, 2233431, 2294872, 2358101, 2421913, 2485308, 2546669, 2603561, 2653322, 2693462, 2721412, 2734483, 2730766, 2710191, 2674456, 2625835, 2566170, 2497014, 2420455, 2339396, 2256808, 2174738, 2094047, 2015050, 1938282, 1864706, 1795342, 1730784]
61159A730784n9834n5680n2069m8564m4826m1013l7487l4294l1096k7623k3972
61148A274326k0374j6945j3782j1069q873o868m565j883O28K372L386M184M990
61135A205527N410N072M244L497K980K395J599P53j42j366k986m639n993p130
61121A209221q288r503j0610j1351j1473j1038j0678j1030j1888j2441j2432j2461
61109A076028j2918j3407j3624j4034j5068j6238j6820j6959j7307j7958j8453
61098I03242j8540j8237j7438j6205j5107j4548j4138j3488j3212j4059j5395
61087G32875j5829j5257j4959j5485j5840j5181j4060j3293j2635j1489j0069
61076E78778q951q031o831n489m559m105l679l090k588k276j780o17J312L451
$$ y = [1730784, 1670950, 1615270, 1563201, 1514637, 1469811, 1428798, 1391311, 1357017, 1325921, 1298298, 1274326, 1253952, 1237007, 1223225, 1212156, 1203283, 1196415, 1191850, 1189967, 1190595, 1192967, 1196353, 1200537, 1205527, 1210937, 1216009, 1220253, 1223750, 1226730, 1229125, 1230724, 1231477, 1231335, 1229969, 1226983, 1222344, 1216351, 1209221, 1200933, 1191430, 1180820, 1169469, 1157996, 1146958, 1136280, 1125250, 1113362, 1100921, 1088489, 1076028, 1063110, 1049703, 1036079, 1022045, 1006977, 990739, 973919, 956960, 939653, 921695, 903242, 884702, 866465, 849027, 832822, 817715, 803167, 789029, 775541, 762329, 748270, 732875, 717046, 701789, 686830, 671345, 655505, 640324, 626264, 612971, 600336, 588847, 578778, 569827, 561796, 554965, 549476, 544917, 540812, 537133, 534043, 531455, 529179, 527399, 526782, 528094, 531545]
61062E31545M882N146M884N184O175O842O489N683N297N298N180N000N174N533
61048F08312N544N298N461O105O347N393L475J454j17j295k314l120l385k965
61034F34193k262j877j872j684r82k62k68j056j971k439k429k240k151k227k324
61019F08149k327k403k728k959k444j251l61m90j135j345r88o13m96n47q34j386
61003E85842j675j160l20j96q88j397j157q19j042j410j165l74L38Q46J546K555
60987E79524L546M310M952N566O076O564P348Q613J0103J1233J1466J0709R565
60974F79575R066R912J1878J4085J5778J6786J7429J8310J9999K2563K5267K7173
60962H87821K8171K9103L0694L2680L4376L5814L7701M0338M3246M6098M9352
$$ y = [531545, 536427, 541573, 546457, 551641, 557816, 564658, 571147, 576830, 582127, 587425, 592605, 597605, 602779, 608312, 613856, 619154, 624615, 630720, 637067, 642460, 645935, 647389, 647272, 645977, 643663, 640543, 637158, 634193, 631931, 630054, 628182, 626498, 625516, 625254, 624986, 623930, 621959, 619520, 617091, 614851, 612700, 610473, 608149, 605822, 603419, 600691, 597732, 595288, 594037, 593676, 593186, 592051, 590706, 589718, 589105, 588609, 588062, 587228, 585842, 584167, 583007, 582687, 582491, 581603, 580206, 579049, 578230, 577188, 575778, 574613, 574239, 574577, 575423, 576969, 579524, 583070, 587380, 592332, 597898, 603974, 610538, 617886, 626499, 636602, 647835, 659301, 670010, 679575, 688641, 698553, 710431, 724516, 740294, 757080, 774509, 792819, 812818, 835381, 860648, 887821, 915992, 945095, 975789, 1008469, 1042845, 1078659, 1116360, 1156698, 1199944, 1246042, 1295394]
60951A295394N3508N8215O2711O6807P0764P4501P7830Q1406Q6505R3586J01954
60940B123181J11216J22118J35367J50460J66634J84559K06248K33580K67541
60931C700904L08486L56230M10128M69748N35231O06669O84251P70127Q68449
60922H710223R81172J104852J234437J367212J492979J574763J549069J364914
60914A9379621J034972O45613L07585R1448N188J9387R4430J78355J97540P9368
60904B2033507j98188n79412r59766j247383j404772j445954j407790j325712
60896A3464530j224653j118915j014705r14139q18995p31632o53623n85171n25842
60887E876855m74752m30064l89460l51575l16304k83660k53216k24916j99571
$$ y = [1295394, 1348902, 1407117, 1469828, 1536635, 1607399, 1681900, 1759730, 1841136, 1927641, 2021227, 2123181, 2234397, 2356515, 2491882, 2642342, 2808976, 2993535, 3199783, 3433363, 3700904, 4009390, 4365620, 4775748, 5245496, 5780727, 6387396, 7071647, 7841774, 8710223, 9691395, 10796247, 12030684, 13397896, 14890875, 16465638, 18014707, 19379621, 20414593, 21060206, 21367791, 21459239, 21464427, 21483814, 21578244, 21756599, 21954139, 22033507, 21835319, 21255907, 20296141, 19048758, 17643986, 16198032, 14790242, 13464530, 12239877, 11120962, 10106257, 9192118, 8373123, 7641491, 6987868, 6402697, 5876855, 5402103, 4972039, 4582579, 4231004, 3914700, 3631040, 3377824, 3152908, 2953337]
60878B953337j77947j59787j44186j30460j18284j07492r8201r0868q5670q1939
60868A758503p8611p5113p1503o7960o4495o1139n7968n4932n1895m8865m5972
60857A080050m3246m0653l8273l6179l4208l2166l0241k8774k7580k5962k3659
60846G19109k1335j9751j8712j7413j5693j4362j4085j4378j4174j3118j1894
60835E44194j1207j0889j0203q838p253o042n330m886m606m506m410l949k982
60822D59093j699k68J273K642L270L018K591K779L446L813L541K954K242J277
60808D89972L74L99J524K599K457J456Q96J170J396Q85O3l00j11K33N20P58Q90
60791E05181R18J051J435J903K292K724L292L732L735L439L178K985K765K799
$$ y = [2953337, 2775390, 2615603, 2471417, 2340957, 2222673, 2115181, 2016980, 1926112, 1840442, 1758503, 1679892, 1604779, 1533276, 1465316, 1400821, 1339682, 1281714, 1226782, 1174887, 1126022, 1080050, 1036804, 996151, 957878, 921699, 887491, 855325, 825084, 796310, 768730, 742768, 719109, 697774, 678023, 659311, 641898, 626205, 611843, 597758, 583380, 569206, 556088, 544194, 532987, 522098, 511895, 503057, 495804, 489762, 484432, 479546, 474940, 470434, 466024, 462075, 459093, 457394, 457126, 458399, 461041, 464311, 467329, 469920, 472699, 476145, 479958, 483499, 486453, 488695, 489972, 490346, 490745, 492269, 494868, 497325, 498781, 499677, 500847, 502243, 503128, 503191, 502891, 502780, 503013, 503533, 504291, 505181, 506099, 507150, 508585, 510488, 512780, 515504, 518796, 522528, 526263, 529702, 532880, 535865, 538630, 541429]
60777E41429L453M392M667L897K811K294K258J969J271R04J500K723L683L929
60763E81180L784L795M135M575M872M996N076N178N162M755L810K559J553J261
60749F36691J617J996J783J019L59K68L55j84j476k710l185l309m028n457o640
60734F17099o791o249n849n835n818n535n160m889m672m359l845l076k192j574
60720E51255j440j418q91K52J548K648L624M529N134N452O048P406R108J0116
60706F03371R846Q779P936Q010Q944J0117J0843J0762R988Q901P889P112O453
60693G18951N673M748M000L819M223M874N356N316M485K991J595J075J250J112
60679G69468Q5j261k112k486k913l342l109k032r37q82k107l931n411n988n697
$$ y = [541429, 544882, 549274, 553941, 557838, 560649, 562943, 565201, 567170, 568441, 569345, 570845, 573568, 577251, 581180, 584964, 588759, 592894, 597469, 602341, 607337, 612413, 617591, 622753, 627508, 631318, 633877, 635430, 636691, 638308, 640304, 642087, 643106, 643465, 643733, 644088, 643904, 642428, 639718, 636533, 633224, 629196, 623739, 617099, 610308, 604059, 598210, 592375, 586557, 581022, 575862, 570973, 566301, 561942, 558097, 555021, 552829, 551255, 549815, 548397, 547506, 547758, 549306, 551954, 555578, 560107, 565241, 570693, 576741, 584147, 593255, 603371, 613217, 621996, 629932, 637942, 646886, 657003, 667846, 678608, 688596, 697497, 705386, 712498, 718951, 724624, 729372, 733372, 737191, 741414, 746288, 751644, 756960, 761445, 764436, 766031, 767106, 768356, 769468, 769553, 768292, 766180, 763694, 760781, 757439, 754330, 752298, 751361, 750479, 748372, 744441, 739030, 733042, 727345]
60664G27345n008m487m461m861n256n115m320l406l068l336l565l272k631j922
60650F72637j047K0Q37J062J051J231J186K21j311k167j841j181j136j643k104
60635F65815k309k307j996j404j020j273j878k214k101j818j609j596j957k653
60621F39680l183l118k830l140m326n878p231q155q481q017o953n987n695o042
60607E60644o573o838o537n611m424l615l535l891m018l461k298j091m51m22l45
60592E07534L99J538K127J756J080R67J466J864J588P54p2l85j11L69O01M87K55
60575E22217N1j57k77n2N38J173J734K501L596M547M902M951N367O272P206P917
60559E72486Q698R788J0980J1893J2382J2505J2441J2539J3122J4087J4937J5333
$$ y = [727345, 722337, 717850, 713389, 708528, 703272, 698157, 693837, 690431, 687363, 684027, 680462, 677190, 674559, 672637, 671590, 671610, 672447, 673509, 674560, 675791, 676977, 677198, 675887, 673720, 671879, 670698, 669562, 667919, 665815, 663506, 661199, 659203, 657799, 656779, 655506, 653628, 651414, 649313, 647495, 645886, 644290, 642333, 639680, 636497, 633379, 630549, 627409, 623083, 617205, 609974, 601819, 593338, 585321, 578368, 572381, 566686, 560644, 554071, 547233, 540696, 535085, 530661, 527046, 523511, 519620, 515602, 512141, 509843, 508752, 508301, 507879, 507534, 507933, 509471, 511598, 513354, 514434, 515401, 516867, 518731, 520319, 521073, 521001, 520616, 520505, 520874, 521475, 521962, 522217, 522268, 522111, 521834, 521782, 522320, 523493, 525227, 527728, 531324, 535871, 540773, 545724, 551091, 557363, 564569, 572486, 581184, 590972, 601952, 613845, 626227, 638732, 651173, 663712, 676834, 690921, 705858, 721191]
60547G21191J5359J5110J4335J2724J0312P409M291J131j868m520o737q420r459
60534G70858r950j0313j0898j1558j1825j1439j0512r278p925o755o133o099o147
60521F52026n654m546l420k890k939l012k664j957j223o70l73m03p04r32p60l04
60505F19575K3J43M70J238K082K517K676L161M261N633O811P686Q368Q853R097
60490F82594R308R835J0718J1605J2238J2830J3697J4746J5675J6613J7985J9662
60478H47506K0783K0805K0270J9985J9706J8289J5050J0324M792j027o443j0555
60466I79485j3018j4350j5073j4999j3743j1514q893o172l449j069O06J792L037
60453H82640M459N669O444P076P984R374J1244J3493J5981J8723K1973K5930L0512
$$ y = [721191, 736550, 751660, 765995, 778719, 789031, 796440, 800731, 801862, 799994, 795474, 788737, 780317, 770858, 760908, 750595, 739697, 728139, 716314, 704875, 694363, 685085, 677160, 670405, 664272, 658173, 652026, 646372, 641826, 638406, 635516, 632577, 629565, 626901, 624944, 623721, 623051, 622678, 622275, 621571, 620639, 619879, 619575, 619598, 619741, 620211, 621449, 623531, 626048, 628724, 631885, 636146, 641779, 648590, 656276, 664644, 673497, 682594, 691902, 701737, 712455, 724060, 736298, 749128, 762825, 777571, 793246, 809859, 827844, 847506, 868289, 889094, 909364, 929349, 949055, 967344, 982394, 992718, 997510, 996483, 990040, 979485, 966467, 952117, 937044, 922045, 908302, 896788, 887895, 881723, 878274, 877205, 877811, 879603, 882640, 887099, 892768, 899212, 906288, 914272, 923646, 934890, 948383, 964364, 983087, 1005060, 1030990, 1061502]
60440A061502L5703M1872M9304N7653O6320P5231Q4678R4520J04176J13519J23111
60429A907589J33417J44251J55184J65925J76008J84565J90557J92638J88494
60420C438628J74961J49739J13098O7840J7844l3058q1300j23625j57391j81000
60410C385736j94275j98548j96104j89175j79419j68208j56850j46086j35669
60401A821402j24972j14032j03651r4450q6211p8298p0529o3385n7343n2185m7205
60390I29141m2106l7429l3796l0995k8331k5698k3652k2331k1093j9464j7780
60379F26466j6379j4875j2918j1099j0249j0083r471q009o552n994o258o624o590
60366E01365o153n670n567n834n819m970l668k766k350j739q09l86q72j408j058
$$ y = [1061502, 1097205, 1139077, 1188381, 1246034, 1312354, 1387585, 1472263, 1566783, 1670959, 1784478, 1907589, 2041006, 2185257, 2340441, 2506366, 2682374, 2866939, 3057496, 3250134, 3438628, 3613589, 3763328, 3876426, 3944266, 3962110, 3929052, 3847752, 3724127, 3566736, 3385736, 3191461, 2992913, 2796809, 2607634, 2428215, 2260007, 2103157, 1957071, 1821402, 1696430, 1582398, 1478747, 1384297, 1298086, 1219788, 1149259, 1085874, 1028531, 976346, 929141, 887035, 849606, 815810, 784815, 756484, 730786, 707134, 684803, 663710, 644246, 626466, 610087, 595212, 582294, 571195, 560946, 550863, 541392, 533383, 526831, 520837, 514579, 507955, 501365, 495212, 489542, 483975, 478141, 472322, 467352, 463684, 460918, 458568, 456829, 456020, 455634, 454762, 453354, 452296]
60351D52296j55M19O90J314K175K394J832J525K226L356L913L779L527L397L183
60336D85871K895K845L095L347L496L764M171M282L821L168K936L155L273K950
60322E33069K498K409K630K603J896O87m57j056r83m55N8N1n95j366j532r95m70
60305E37992o17j154j211m71M66R12R08R28J127J346J613K196L097L882M196M167
60289E59377M172M398M775N207N629N954O056N855N345M566L613K676K007J806
60275F21436K006K197J892J001k8o31o25j91M60J215J961K544K788K429J226n67
60259F39113k118k799k923l236l808m029l697l377l451l509l106k540k341k373
60245E95806k048j217l27J96K50p3m72m74M8N19K88n02j069r62m24J22M11K38
$$ y = [452296, 452141, 452560, 453250, 454564, 456739, 459133, 460965, 462490, 464716, 468072, 471985, 475764, 479291, 482688, 485871, 488766, 491611, 494706, 498053, 501549, 505313, 509484, 513766, 517587, 520755, 523691, 526846, 530119, 533069, 535567, 537976, 540606, 543209, 545105, 545792, 545335, 544279, 543296, 542841, 542899, 542950, 542355, 540989, 539457, 538462, 537992, 537375, 536221, 535010, 534539, 535005, 535917, 536825, 537753, 538880, 540226, 541839, 544035, 547132, 551014, 555210, 559377, 563549, 567947, 572722, 577929, 583558, 589512, 595568, 601423, 606768, 611334, 614947, 617623, 619630, 621436, 623442, 625639, 627531, 628532, 628504, 627873, 627248, 627057, 627517, 628732, 630693, 633237, 636025, 638454, 639680, 639113, 636995, 634196, 631273, 628037, 624229, 620200, 616503, 613126, 609675, 606166, 603060, 600520, 598179, 595806, 593758, 592541, 592214, 592410, 592660, 592587, 592115, 591641, 591689, 592208, 592496, 591994, 590925, 589963, 589539, 589661, 590072, 590310]
60227E90310m74j365j851j685r96J37J635K969L542L545L852M756N562N701N569
60212F21207N686N757N288M646M617N165N525N488N703O594P738Q612R270R880
60198G11176J0289J0524J1251J3043J5487J7617J9096K0346K1680K3011K4482
60187H98002K6651K9666L2917L5911L9057M3012M7538N1645N4858N7708O0934
60176A377899O4626O8354P1790P4863P7444P9097P9221P7540P4522P1085O7605
60165B184046O3368N7413M9802M1625L3772K6247J8686J1042L527l546r592j3963
60153B462427j6595j8047j8530j7504j4644j0644o401j925L286R144J5131K1304
60141B407002K8247L5915M3363M9781N5230O0163O4740O8806P1929P3329P2350
$$ y = [590310, 589836, 588471, 586620, 584935, 583939, 584076, 585711, 588680, 592222, 595767, 599619, 604375, 609937, 615638, 621207, 626893, 632650, 637938, 642584, 647201, 652366, 657891, 663379, 669082, 675676, 683414, 692026, 701296, 711176, 721465, 731989, 743240, 756283, 771770, 789387, 808483, 828829, 850509, 873520, 898002, 924653, 954319, 987236, 1023147, 1062204, 1105216, 1152754, 1204399, 1259257, 1316965, 1377899, 1442525, 1510879, 1582669, 1657532, 1734976, 1814073, 1893294, 1970834, 2045356, 2116441, 2184046, 2247414, 2304827, 2354629, 2396254, 2430026, 2456273, 2474959, 2486001, 2489528, 2485982, 2476390, 2462427, 2445832, 2427785, 2409255, 2391751, 2377107, 2366463, 2360062, 2358137, 2361423, 2370567, 2385698, 2407002, 2435249, 2471164, 2514527, 2564308, 2619538, 2679701, 2744441, 2813247, 2885176, 2958505, 3030855]
60130C030855O9172O4605N9017N2021M3405L3760K3789J3551K889p833j7928k7044
60118C340259l5108m1791m6547m9162m9947m9326m7468m4288l9646l3584k6480
60107B876912j8905j1252l540M397J2635K0997K8957L5775M0949M4464M6396M6440
60095C124225M4362M0754L6733L2717K8185K2772J6958J1380O124J242k677m976
60083C357799n509m214o65N246J2582K0243K8308L7725M8700O0339P1962Q3927
60071C716443R6865J10744J25075J39550J54053J68401J82362J95698K07996K18705
60061E315892K27529K34422K38963K40081K36815K29147K17786K03197J85220
60052G329052J63597J38496J10482Q0213M8390J5874j6450m7909p8055j06346
$$ y = [3030855, 3100027, 3164632, 3223649, 3275670, 3319075, 3352835, 3376624, 3390175, 3393064, 3385231, 3367303, 3340259, 3305151, 3263360, 3216813, 3167651, 3117704, 3068378, 3020910, 2976622, 2936976, 2903392, 2876912, 2858007, 2846755, 2843215, 2847612, 2860247, 2881244, 2910201, 2945976, 2986925, 3031389, 3077785, 3124225, 3168587, 3209341, 3246074, 3278791, 3306976, 3329748, 3346706, 3358086, 3364210, 3365452, 3362775, 3357799, 3352290, 3348076, 3347411, 3352657, 3365239, 3385482, 3413790, 3451515, 3500215, 3560554, 3632516, 3716443, 3813308, 3924052, 4049127, 4188677, 4342730, 4511131, 4693493, 4889191, 5097187, 5315892, 5543421, 5777843, 6016806, 6256887, 6493702, 6722849, 6940635, 7143832, 7329052, 7492649, 7631145, 7741627, 7821840, 7870230, 7886104, 7869654, 7821745, 7743690, 7637344]
60042G637344j31960j53991j71720j84620j92308j94799j92734j87031j78246
60033F049935j66493j52026j35549j17887r9677q1457o3673m6394k9467j3263
60023E144049J102J2762K1900K9153L4497L7315L7236L4332K8631K0235R900j185
60011E409927j2349k3631l4928m5680n5635o5261p4953q4308r2623r9589j05003
60000D715967j08262j08898j07445j05094j02361r8635r3090q5697p7072o7752
59990C761661n7852m7269l5973k4146j2172m19J0997K2171L3022M3029N1555N8439
59978C803043O4062O8646P1592P1852O9050O3912N7315M9088L8389K5225J1007
59967D393181k782j6042k9592m3456n6367o7059p5376q1753q6142q8078q7504
$$ y = [7637344, 7505384, 7351393, 7179673, 6995053, 6802745, 6607946, 6415212, 6228181, 6049935, 5883442, 5731416, 5595867, 5477980, 5378303, 5296846, 5233173, 5186779, 5157312, 5144049, 5145151, 5157913, 5179813, 5208966, 5243463, 5280778, 5318014, 5352346, 5380977, 5401212, 5411112, 5409927, 5397578, 5373947, 5339019, 5293339, 5237704, 5172443, 5097490, 5013182, 4920559, 4820970, 4715967, 4607705, 4498807, 4391362, 4286268, 4183907, 4085272, 3992182, 3906485, 3829413, 3761661, 3703809, 3656540, 3620567, 3596421, 3584249, 3583830, 3594827, 3616998, 3650020, 3693049, 3744604, 3803043, 3867105, 3935751, 4007343, 4079195, 4148245, 4212157, 4269472, 4318560, 4356949, 4382174, 4393181, 4390399, 4374357, 4344765, 4301309, 4244942, 4177883, 4102507, 4020754, 3934612, 3846534, 3759030]
59956C759030q4911q0669p4830o7610n9531n0847m1403l1240k0815j0255R82J3121
59944C251022K5303L6582M7344N8700P0579Q1479R0356R7706J04288J09577J12270
59933D085206J11704J08073J01559R2058P9630O4747M8119L0624J3162l822k0393
59922D710667l6393n1002o3475p3813q2135q7808r0048q9041q5628q0106p2247
59911C898971o2498n2046m1530l0565j8909p191L982J4842K5791L6458M6030N4140
59899C867475O0916O6392P0389P2723P3273P2038O9399O5952O1923N7042N1334
59888D588856M5578M0717L7072L4437L2584L1435L1109L2229L5709M1923N0411
59877E002060O0778P3317Q8272J04962J22354J40082J58149J75934J92319K06758
$$ y = [3759030, 3674119, 3593450, 3518620, 3451010, 3391479, 3340632, 3299229, 3267989, 3247174, 3236919, 3237901, 3251022, 3276325, 3312907, 3360251, 3418951, 3489530, 3571009, 3661365, 3759071, 3863359, 3972936, 4085206, 4196910, 4304983, 4406542, 4498600, 4578230, 4642977, 4691096, 4721720, 4734882, 4731060, 4710667, 4674274, 4623272, 4559797, 4485984, 4403849, 4316041, 4225993, 4136952, 4051324, 3971218, 3898971, 3836473, 3784427, 3742897, 3712332, 3693423, 3686232, 3690214, 3705056, 3730847, 3767305, 3813335, 3867475, 3928391, 3994783, 4065172, 4137895, 4211168, 4283206, 4352605, 4418557, 4480480, 4537522, 4588856, 4634434, 4675151, 4712223, 4746660, 4779244, 4810679, 4841788, 4874017, 4909726, 4951649, 5002060, 5062838, 5136155, 5224427, 5329389, 5451743, 5591825, 5749974, 5925908, 6118227, 6324985]
59867F324985K19271K29341K35456K36040K30218K17591J97878J71185J38216
59858H200181R9961N7503J2392l3109p6462j15532j48957j76224j97421k12611
59848G409721k21415k23592k20018k12513k02418j89874j74671j57320j38799
59839E669101j19701j00191q0561o1169m1842k2030j814J7540L4384M7980N8806
59828E400503O7632P4407P8110P7588P2416O2821M9076L1337J0113j3482l8243
59817E872278o3375q8144j11309j31454j47891j60822j70443j76359j78203j76501
59807D467777j72560j67459j61522j54573j46399j36941j26478j15720j05377
59798C180748r5506q5588p5494o5953n7744n0741m4285l8296l3345k9760k7230
$$ y = [6324985, 6544256, 6773597, 7009053, 7245093, 7475311, 7692902, 7890780, 8061965, 8200181, 8300142, 8357645, 8370037, 8336928, 8260466, 8144934, 7995977, 7819753, 7622332, 7409721, 7188306, 6964714, 6744696, 6532183, 6329765, 6139891, 5965220, 5807900, 5669101, 5549400, 5449209, 5368648, 5307479, 5265637, 5243607, 5241793, 5259333, 5293717, 5341697, 5400503, 5468135, 5542542, 5620652, 5698240, 5770656, 5833477, 5882553, 5913890, 5924003, 5910521, 5872278, 5808903, 5720759, 5609450, 5477996, 5330105, 5169283, 4998840, 4822481, 4644278, 4467777, 4295217, 4127758, 3966236, 3811663, 3665264, 3528323, 3401845, 3286125, 3180748, 3085242, 2999654, 2924160, 2858207, 2800463, 2749722, 2705437, 2667141, 2633796, 2604036, 2576806]
59787B576806k5458k4497k4140k3581k2237k0503j9119j8075j6773j5170j4104
59776B353149j4379j5940j8136k0297k2002k3136k3963k4810k5549k5592k4700
59765B114645k3493k2874k2991k3041k2044j9637j6167j2257q392m795j556J235
59753A938633L533N507P576J0220J3706J7896K2238K5984K8724L0786L2991L5726
59741B173520L8339L9646L9098L7238L4935L2420K9378K5826K2432J9802J7866
59730B510500J6328J5455J5901J7830K0739K4270K8702L4398M1242M8938N7557
59719B831860O7283P7924Q9161J01110J14199J28402J43169J57986J72596J86513
59709D070203J98826K08593K15009K16768K11623J97041J71417J34836Q9252L8475
$$ y = [2576806, 2551348, 2526851, 2502711, 2479130, 2456893, 2436390, 2417271, 2399196, 2382423, 2367253, 2353149, 2338770, 2322830, 2304694, 2284397, 2262395, 2239259, 2215296, 2190486, 2164937, 2139345, 2114645, 2091152, 2068278, 2045287, 2022246, 2000202, 1980565, 1964398, 1952141, 1943749, 1938954, 1937398, 1938633, 1942166, 1947673, 1955249, 1965469, 1979175, 1997071, 2019309, 2045293, 2074017, 2104803, 2137794, 2173520, 2211859, 2251505, 2290603, 2327841, 2362776, 2395196, 2424574, 2450400, 2472832, 2492634, 2510500, 2526828, 2542283, 2558184, 2576014, 2596753, 2621023, 2649725, 2684123, 2725365, 2774303, 2831860, 2899143, 2977067, 3066228, 3167338, 3281537, 3409939, 3553108, 3711094, 3883690, 4070203, 4269029, 4477622, 4692631, 4909399, 5121022, 5318063, 5489480, 5624316, 5713568, 5752043]
59699E752043j2291n7744r4108j19887j35481j42342j42369j37513j29381j19035
59689D661892j07171r4390q1249o8021n4682m1183k7689j4375j150J2262K5975
59678D210219L9923N4120O8682Q3469R7984J11903J25554J39658J54790J71211
59668E257513J89001K08069K28153K49062K70857K93524L16729L40144L63786
59659G716838L87581M10830M32551M52183M69424M83395M92749M96686M95342
59650A1837579M89077M78192M63721M47757M32390M18673M07097L98377L92935
59641A5765798L89798L86804L81994L74199L62431L45401L22012K91877K55209
59632A8875523K12661J65671J16658O8484K3649j6036m9290p5151r2857j01825
$$ y = [5752043, 5739752, 5682008, 5587900, 5468013, 5332532, 5190190, 5047821, 4910308, 4780927, 4661892, 4554721, 4460331, 4379082, 4311061, 4256379, 4215196, 4187507, 4173132, 4171982, 4184244, 4210219, 4250142, 4304262, 4372944, 4456413, 4554397, 4666300, 4791854, 4931512, 5086302, 5257513, 5446514, 5654583, 5882736, 6131798, 6402655, 6696179, 7012908, 7353052, 7716838, 8104419, 8515249, 8947800, 9399983, 9869407, 10352802, 10845551, 11342237, 11837579, 12326656, 12804848, 13268569, 13716326, 14148716, 14567389, 14974486, 15372863, 15765798, 16155596, 16542400, 16924394, 17298593, 17661024, 18006425, 18328437, 18620314, 18875523, 19088184, 19253855, 19370513, 19438997, 19462646, 19446610, 19397320, 19322169, 19229312, 19127487]
59622A9127487j01754r2780p5561n1091k0505J5159N5125R8882J45866J95149
59612A9295977K45540K95863L44957L91293M32761M66935M91403N03805N01659
59603B2970193M82417M43911L84963L05782K08098R5268k7625j54077k77146l90630
59593B4041154m89594n70378o30887o71111o93054o99601o93517o77396o54097
59584A8261519o26731n98391n72142n50995n37334n32319n35814n46486n61405
59575A3199902n76002n85463n86704n79066n63365n40965n13706m83856m53372
59566H317403m23196l93492l64409l36476l10335k86216k63681k42057k21257
59557E476284k01883j84206j67475j50954j35346j22200j11742j02395r2914q4062
$$ y = [19127487, 19025733, 18932953, 18857392, 18806301, 18785796, 18800955, 18856080, 18954962, 19100828, 19295977, 19541517, 19837380, 20182337, 20573630, 21006391, 21473326, 21964729, 22468534, 22970193, 23452610, 23896521, 24281484, 24587266, 24795364, 24890632, 24863007, 24708930, 24431784, 24041154, 23551560, 22981182, 22350295, 21679184, 20986130, 20286529, 19593012, 18915616, 18261519, 17634788, 17036397, 16464255, 15913260, 15375926, 14843607, 14307793, 13761307, 13199902, 12623900, 12038437, 11451733, 10872667, 10309302, 9768337, 9254631, 8770775, 8317403, 7894207, 7500715, 7136306, 6799830, 6489495, 6203279, 5939598, 5697541, 5476284, 5274401, 5090195, 4922720, 4771766, 4636420, 4514220, 4402478, 4300083, 4207169, 4123107]
59547D123107p7356p2906o9536o6704o5125o5357o6720o7959o8492o8611o8835
59536C365506o9335o9809o9656o8388o5948o2604n8664n4460n0427m6828m3393
59525B705994l9536l5016l0154k5387k0866j6498j2141p653l009J525N578R038
59513B531875J2105J4914J7321J9156K0542K1920K3776K6296K9121L1629L3650
59502B782305L5864L9149M3626M8636N3629N8713O4205P0113P6335Q3069R0665
59491C446309R9115J07951J16697J25277J33988J43072J52304J60995J68478J74521
59481D828707J79223J82569J84221J83700J80635J74940J66858J56681J44339
59472F381873J29514J12472R4525P7264O1484M7241L4648K3885J4586O103j212
$$ y = [4123107, 4045751, 3972845, 3903309, 3836605, 3771480, 3706123, 3639403, 3571444, 3502952, 3434341, 3365506, 3296171, 3226362, 3156706, 3088318, 3022370, 2959766, 2901102, 2846642, 2796215, 2749387, 2705994, 2666458, 2631442, 2601288, 2575901, 2555035, 2538537, 2526396, 2518743, 2515734, 2517259, 2522837, 2531875, 2543980, 2558894, 2576215, 2595371, 2615913, 2637833, 2661609, 2687905, 2717026, 2748655, 2782305, 2818169, 2857318, 2900944, 2949580, 3003209, 3061922, 3126127, 3196240, 3272575, 3355644, 3446309, 3545424, 3653375, 3770072, 3895349, 4029337, 4172409, 4324713, 4485708, 4654186, 4828707, 5007930, 5190499, 5374720, 5558420, 5739055, 5913995, 6080853, 6237534, 6381873, 6511387, 6623859, 6718384, 6795648, 6857132, 6904373, 6939021, 6962906, 6977492, 6983595, 6982383]
59461F982383n833o622m015Q47P615J6722K8193M1217N4705O7646P8914Q7359
59449G349131R2215R3011Q9069P9446O3587M1765J4864j5939m9198q3301j16751
59438G557899j48304j76724k00683k19120k31677k38675k40700k38279k31926
59429E631811k22411k10718j97636j83422j68123j52138j36165j20581j05273
59420D135344r0154p5410o1025m6530l1649j6800k531J1268K5092L8989N2545
59409C939139O5516P7925Q9575J00068J09321J17492J24288J28873J30649J29605
59399E012451J25727J18429J06912R0873P0761M7584K2540l456k9945n6391q1543
59388E423942j03858j22602j38055j50514j59689j65429j68376j69299j68277
$$ y = [6982383, 6976550, 6969928, 6965913, 6966760, 6974375, 6991097, 7019290, 7060507, 7115212, 7182858, 7261772, 7349131, 7441346, 7534357, 7623426, 7702872, 7766459, 7808224, 7823088, 7807149, 7757951, 7674650, 7557899, 7409595, 7232871, 7032188, 6813068, 6581391, 6342716, 6102016, 5863737, 5631811, 5409400, 5198682, 5001046, 4817624, 4649501, 4497363, 4361198, 4240617, 4135344, 4045190, 3969780, 3908755, 3862225, 3830576, 3813776, 3811245, 3822513, 3847605, 3886594, 3939139, 4004655, 4082580, 4172155, 4272223, 4381544, 4499036, 4623324, 4752197, 4882846, 5012451, 5138178, 5256607, 5363519, 5454392, 5525153, 5572737, 5595277, 5591821, 5561876, 5505485, 5423942, 5320084, 5197482, 5059427, 4908913, 4749224, 4583795, 4415419, 4246120, 4077843]
59379D077843j65111j60225j54377j47699j39817j31025j22453j14761j07318
59370B835057r9187r0471q2036p4207o6537n8944n2187m6795m2025l6637l0502
59359B155529k4778k0366j6873j3300r255n009p62L524P733J1448J4235J5705
59347B117831J5430J3305J0176P652P117Q922J2467J6779K1049K5015K8940L3036
59335B317719L6867L9559M0700M0870M1329M3343M7591N3808O1083O8805P7283
59324B868957Q7118R8178J09788J21877J35170J50026J65790J81727J98058K15595
59314D332284K34635K54688K75075K95398L15446L34829L52622L67319L77475
59305G139771L82573L83035L79173L70534L56570L37686L15296K91053K66166
$$ y = [4077843, 3912732, 3752507, 3598130, 3450431, 3310614, 3179589, 3057136, 2942375, 2835057, 2735870, 2645399, 2563363, 2489156, 2422619, 2363675, 2311488, 2264693, 2222668, 2186031, 2155529, 2130751, 2110385, 2093512, 2080212, 2070957, 2065948, 2065186, 2068710, 2076443, 2087891, 2102126, 2117831, 2133261, 2146566, 2156742, 2164394, 2171511, 2180433, 2192900, 2209679, 2230728, 2255743, 2284683, 2317719, 2354586, 2394145, 2434845, 2475715, 2517044, 2560387, 2607978, 2661786, 2722869, 2791674, 2868957, 2956075, 3054253, 3164041, 3285918, 3421088, 3571114, 3736904, 3918631, 4116689, 4332284, 4566919, 4821607, 5096682, 5392080, 5707526, 6042355, 6394977, 6762296, 7139771, 7522344, 7905379, 8284552, 8655086, 9011656, 9349342, 9664638, 9955691, 10221857]
59296A0221857K41265K16524J91913J67383J42756J17505R0992O2874L2922N84
59286A1486575l4633p2187j10509j48291j85151k20799k54148k83752l08662l28476
59276I539967l43180l53326l59799l62863l61936l56801l48399l37751l24837
59267F391075l09468k92661k75986k59762k43009k25187k06971j89236j72284
59258D216511j56287j41646j28432j16156j04383r3075q2250p1805o1920n3019
59248C207538m5128l7748l0523k3518j6726r892l063L265Q862J4141J9513K4897
59236C111618L0133L5365M0628M5469M9412N2569N5413N8193O0843O3215O5140
59225C667998O6451O7194O7634O7872O7725O7184O6710O6760O7232O7558O7148
$$ y = [10221857, 10463122, 10679646, 10871559, 11038942, 11181698, 11299203, 11390195, 11453069, 11485991, 11486575, 11451942, 11379755, 11269246, 11120955, 10935804, 10715005, 10460857, 10177105, 9868443, 9539967, 9196787, 8843461, 8483662, 8120799, 7758863, 7402062, 7053663, 6715912, 6391075, 6081607, 5788946, 5512960, 5253198, 5010189, 4785002, 4578031, 4388795, 4216511, 4060224, 3918578, 3790146, 3673990, 3569607, 3476532, 3394282, 3322477, 3260557, 3207538, 3162410, 3124662, 3094139, 3070621, 3053895, 3044003, 3040940, 3044205, 3053067, 3067208, 3086721, 3111618, 3141751, 3177116, 3217744, 3263213, 3312625, 3365194, 3420607, 3478800, 3539643, 3602858, 3667998, 3734449, 3801643, 3869277, 3937149, 4004874, 4072058, 4138768, 4205528, 4272760, 4340318, 4407466]
59214D407466O5588O2686N8640N4093M9803M6150M2866L9039L3493K5606J5901
59203D901331N554m743j5225k6229l7410m7937n7167o4869p0904p4934p6510p5525
59191D355432p2601o8820o4705n9712n3141m5425l7858l1089k4560j7596j0363
59180C869562l455K857Q563J3606J8017K1987K5438K7963K9609L1301L3947L7446
59168D116841M1064M4637M8810N4250O1070O9113P8320Q8763J00474J13339J27050
59157D943731J41155J55242J68952J81649J92210J99231K01460J98033J88511
59148F570174J72759J50736J22479Q8442M9791Q155l4919p7971j19373j57500
59138F772773j91120k19296k41039k55674k63553k65860k63680k57738k48921
$$ y = [4407466, 4473054, 4535740, 4594380, 4648473, 4698276, 4744426, 4787292, 4826331, 4859824, 4885430, 4901331, 4906885, 4902142, 4886917, 4860688, 4823278, 4775341, 4718174, 4653305, 4582401, 4507467, 4430957, 4355432, 4282831, 4214011, 4149306, 4089594, 4036453, 3991028, 3953170, 3922081, 3897521, 3879925, 3869562, 3866107, 3868964, 3877527, 3891133, 3909150, 3931137, 3956575, 3984538, 4014147, 4045448, 4079395, 4116841, 4157905, 4202542, 4251352, 4305602, 4366672, 4435785, 4514105, 4602868, 4703342, 4816681, 4943731, 5084886, 5240128, 5409080, 5590729, 5782939, 5982170, 6183630, 6381663, 6570174, 6742933, 6893669, 7016148, 7104590, 7154381, 7162536, 7127617, 7049646, 6930273, 6772773, 6581653, 6362357, 6121318, 5865644, 5602091, 5336231, 5072551, 4814813, 4565892]
59129D565892k38249k26231k13012j99263j86060j73634j61212j48506j36401
59120B883324j25582j15398j04925r4463q5070p7136p0300o4258n8788n3356m7627
59109A986421m2109l7450l3386k9206k4975k1361j8385j5366j2104r156o803m564
59097A731556j969Q83L753O675R676J2613J5475J8431K1436K4185K6599K8999
59085A898312L1663L4515L7316L9921M2358M4820M7440M9918N1716N2911N4358
59074B385248N6467N8315N8655N7471N5744N4022N2139N0081M8061M5660M2081
59063B963944L7452L3005K9685K7357K5588K4345K3593K3101K3078K4229K6695
59052C262072K9680L2617L5938M0155M4888M9601N4722O1069O8450P5656Q1838
$$ y = [4565892, 4327643, 4101412, 3888400, 3689137, 3503077, 3329443, 3168231, 3019725, 2883324, 2757742, 2642344, 2537419, 2442956, 2357886, 2280750, 2210450, 2146192, 2087404, 2034048, 1986421, 1944312, 1906862, 1873476, 1844270, 1819295, 1797934, 1779549, 1764183, 1752079, 1742923, 1736120, 1731556, 1729587, 1730470, 1734223, 1740898, 1750574, 1763187, 1778662, 1797093, 1818529, 1842714, 1869313, 1898312, 1929975, 1964490, 2001806, 2041727, 2084085, 2128905, 2176345, 2226263, 2277979, 2330890, 2385248, 2441715, 2500030, 2558685, 2616156, 2671900, 2725922, 2778061, 2828142, 2876203, 2921863, 2963944, 3001396, 3034401, 3064086, 3091443, 3117031, 3141376, 3164969, 3188070, 3211148, 3235377, 3262072, 3291752, 3324369, 3360307, 3400462, 3445350, 3494951, 3549673, 3610742, 3679192, 3754848, 3836686]
59041C836686Q7272R2672R8134J02903J05962J06786J05486J02163R6266Q6994
59031D821324P4301N8994M1764K2686K007j9121l9067n6565p0958q2108r0505
59020D662752r7006j02038j05353j06884j07304j07406j07342j06994j06660j06700
59010C609065j06832j06487j05678j04932j04375j03507j01921r9748r7236r4399
59000B583950r1255q8115q5356q2921q0224p6667p2321o8050o4654o1963n9089
58989A753335n5641n2195m9414m7142m4705m1774l8607l5774l3861l2955l2151
58978A289116l0162k6945k4083k2824k2289k0645j7686j5052j3815j3134j1766
58967A070715r825q225p079n598l477j468m67n01q64j018j055j362j998k538k564
$$ y = [3836686, 3923958, 4016630, 4114764, 4217667, 4323629, 4430415, 4535901, 4638064, 4734330, 4821324, 4895625, 4954619, 4996383, 5019069, 5021076, 5001955, 4962888, 4906323, 4835365, 4753257, 4662752, 4565746, 4463708, 4358355, 4251471, 4144167, 4036761, 3929419, 3822425, 3715765, 3609065, 3502233, 3395746, 3290068, 3185136, 3080761, 2977254, 2875333, 2775585, 2678349, 2583950, 2492695, 2404580, 2319224, 2236303, 2156079, 2079412, 2007091, 1939041, 1874387, 1812424, 1753335, 1697694, 1645499, 1596085, 1548943, 1504238, 1462464, 1423857, 1388083, 1354222, 1321267, 1289116, 1258954, 1232009, 1207926, 1185102, 1162813, 1142168, 1124482, 1109430, 1095615, 1082481, 1070715, 1060890, 1052665, 1045586, 1039988, 1036511, 1035043, 1034576, 1034075, 1033211, 1032193, 1031138, 1029776, 1027778, 1025240, 1022676]
58952A022676k130j597j105n04K49Q86J228J442J757K098K300K485K907L390L360
58937A039442K575J584J195J564K089K198J911J623J540J608J737J909K129K559
58923A065663L506M987O434P185P276P304P564P776P848Q222R242J0521J1489
58910A165017J2198J3086J4148J4937J5297J5592J6075J6572J6953J7499J8438
58899A335812J9400J9748J9453J9233J9759K0949K2282K3528K4827K6170K7269
58888A578430K8163K9455L1572L4049L6091L7732L9786M2617M5579M8006N0227
58877B001707N3140N7113O1750O6575P1365P5973Q0335Q4844R0266R6938J04281
58866B844287J11422J18383J26265J36027J47273J58698J69763J81406J94784
$$ y = [1022676, 1020546, 1018949, 1017844, 1017340, 1017589, 1018475, 1019703, 1021145, 1022902, 1025000, 1027300, 1029785, 1032692, 1036082, 1039442, 1042017, 1043601, 1044796, 1046360, 1048449, 1050647, 1052558, 1054181, 1055721, 1057329, 1059066, 1060975, 1063104, 1065663, 1069169, 1074156, 1080590, 1087775, 1095051, 1102355, 1109919, 1117695, 1125543, 1133765, 1143007, 1153528, 1165017, 1177215, 1190301, 1204449, 1219386, 1234683, 1250275, 1266350, 1282922, 1299875, 1317374, 1335812, 1355212, 1374960, 1394413, 1413646, 1433405, 1454354, 1476636, 1500164, 1524991, 1551161, 1578430, 1606593, 1636048, 1667620, 1701669, 1737760, 1775492, 1815278, 1857895, 1903474, 1951480, 2001707, 2054847, 2111960, 2173710, 2240285, 2311650, 2387623, 2467958, 2552802, 2643068, 2740006, 2844287, 2955709, 3074092, 3200357, 3336384, 3483657, 3642355, 3812118, 3993524, 4188308]
58857D188308K09829K25632K41935K59398K78389K98406L18816L39436L60030
58848F720179L79880L98421M15623M31174M43636M51064M52133M46198M32614
58839A0570922M10655L79868L39979K90574K31671J64699R2565J8633n4176j23671
58829A2321719j88339k46960k97998l39642l70985l92890m07086m14625m15809
58820I247385m11409m02896l91372l77136l60636l43058l25487l08007k90197
58811F037187k72137k54474k37790k22278k07942j94667j82251j70536j59461
58802D135651j48867j38450j28123j18215j09122j00934r3509q6710q0390p4292
58792C057039o8128o1727n5102m8578m2734l7805l3080k7447k0824j4527r754
$$ y = [4188308, 4398137, 4623769, 4865704, 5125102, 5403491, 5701897, 6020713, 6360149, 6720179, 7100059, 7498480, 7914103, 8345277, 8788913, 9239977, 9692110, 10138308, 10570922, 10981577, 11361445, 11701424, 11991998, 12223669, 12388368, 12480933, 12499566, 12445390, 12321719, 12133380, 11886420, 11588422, 11248780, 10877795, 10484905, 10077819, 9663194, 9247385, 8835976, 8433080, 8041708, 7664572, 7303936, 6960878, 6635391, 6327384, 6037187, 5765050, 5510576, 5272786, 5050508, 4842566, 4647899, 4465648, 4295112, 4135651, 3986784, 3848334, 3720211, 3601996, 3492874, 3391940, 3298431, 3211721, 3131331, 3057039, 2988911, 2927184, 2872082, 2823504, 2780770, 2742965, 2709885, 2682438, 2661614, 2647087, 2637333]
58781B637333o045j852L511R166J4020J8216K2772K8137L3635L8444M2778M7703
58769B887818N3840O0581O6852P2462P8272Q5106R2978J01500J10564J20150J29897
58758C860020J39508J49564J61242J75069J90395K06386K23066K40937K59925
58749E606112K79373K99035L19427L40827L62313L82194L99193M12887M23011
58740H824372M28762M28783M21663M06269L81831L47875L04236K51274J90118
58731A1985183J22654N1157k1891r3717j61464k23016k77455l24277l62416l90678
58721A0304080m09145m19446m23452m22298m16786m07861l96135l81624l64697
58712F662636l46786l29327l12348k95014k77377k60655k45570k31394k17072
$$ y = [2637333, 2631288, 2629436, 2632947, 2642113, 2656133, 2674349, 2697121, 2725258, 2758893, 2797337, 2840115, 2887818, 2941658, 3002239, 3069091, 3141553, 3219825, 3304931, 3397909, 3499409, 3609973, 3730123, 3860020, 3999528, 4149092, 4310334, 4485403, 4675798, 4882184, 5105250, 5346187, 5606112, 5885485, 6184520, 6503947, 6844774, 7207087, 7589281, 7988474, 8401361, 8824372, 9253134, 9681917, 10103580, 10509849, 10891680, 11239555, 11543791, 11795065, 11985183, 12107837, 12158994, 12137103, 12043386, 11881922, 11658906, 11381451, 11057174, 10694758, 10304080, 9894935, 9475489, 9052037, 8629739, 8212953, 7805092, 7408957, 7027333, 6662636, 6315850, 5986523, 5674175, 5379161, 5101784, 4841129, 4595559, 4364165, 4147093]
58703D147093k02567j88619j75634j63459j52024j41584j32233j23563j15003
58694B752407j06473r8532r1814q6243q0983p5334o9480o4099n9405n5001n0654
58683A914389m6761m3782m1602l9656l7519l5140l2755l0771k9570k9126k8939
58672A518768k8481k7660k6680k5544k4030k2146k0448j9655j9961k0783k1303
58661A262077k1205k0827k0645k0794k1107k1421k1662k1782k1786k1690k1387
58650A027771k0684j9668j8784j8258j7692j6630j5344j4612j4643j4720j4068
58639H42668j2754j1496j0848j0824j1086j1300j1302j1095j0787j0527j0433
58628G20216j0408j0093r297q538q699r784j0493r607p554n861n196m764l708
$$ y = [4147093, 3944526, 3755907, 3580273, 3416814, 3264790, 3123206, 2990973, 2867410, 2752407, 2645934, 2547402, 2455588, 2369345, 2288362, 2213028, 2143548, 2079449, 2020044, 1965043, 1914389, 1867628, 1823846, 1782244, 1742588, 1705069, 1669929, 1637174, 1606403, 1576833, 1547707, 1518768, 1490287, 1462627, 1435947, 1410403, 1386373, 1364227, 1343779, 1324124, 1304163, 1283380, 1262077, 1240872, 1220045, 1199400, 1178606, 1157499, 1136078, 1114416, 1092634, 1070848, 1049158, 1027771, 1007087, 987419, 968635, 950377, 932685, 916055, 900711, 886099, 871456, 856736, 842668, 829914, 818418, 807570, 796746, 785660, 774360, 763058, 751963, 741176, 730649, 720216, 709808, 699715, 690418, 681880, 673181, 663397, 652904, 643297, 635743, 629882, 624686, 619922, 616214]
58615F16214k208q31L28J363K046K329K813L964N182N487M900M373M312M037K924
58600F57233J336M9p14j217j640k037k579l337l916l793k973j994j254o44P8R09
58584F33507J639K110K378K818M015O158Q622J0477J1545J2499J3781J4966J5591
58571G40106J6067J7231J9195K1258K2856K4056K5244K6803K9130L2357L6088
58560A010391L9805M3593M7881N2602N7225O1730O6737P2521P8625Q4807R1518
58549A707435R8966J06335J12640J17739J21879J24684J25444J24055J20826J15397
58539B875400J06605R3588P6531N6381L4244J1101j2193l4721n5235p2414q5706
58528B993581r5573j02692j07226j09258j09362j08204j05862j02225r7662r2685
$$ y = [616214, 614006, 613175, 613503, 614866, 616912, 619241, 622054, 626018, 631200, 636687, 641587, 645960, 650272, 654309, 657233, 658569, 658618, 657904, 656687, 655047, 653010, 650431, 647094, 643178, 639385, 636412, 634418, 633164, 632520, 632598, 633507, 635146, 637256, 639634, 642452, 646467, 652625, 661247, 671724, 683269, 695768, 709549, 724515, 740106, 756173, 773404, 792599, 813857, 836713, 860769, 886013, 912816, 941946, 974303, 1010391, 1050196, 1093789, 1141670, 1194272, 1251497, 1313227, 1379964, 1452485, 1531110, 1615917, 1707435, 1806401, 1912736, 2025376, 2143115, 2264994, 2389678, 2515122, 2639177, 2760003, 2875400, 2982005, 3075593, 3152124, 3208505, 3242749, 3253850, 3241657, 3206936, 3151701, 3079287, 2993581, 2898008, 2795316, 2688090, 2578832, 2469470, 2361266, 2255404, 2153179, 2055517, 1962832]
58518A962832q7217q0944p4203o7826o2207n7173n2552m8188m3622l8577l3700
58507A316623l0025k7662k5775k3807k1995k0589j9392j8263j7385j6819j6319
58496A078592j5789j5382j5079j4714j4438j4609j5162j5637j5827j5907j5928
58485I10120j5859j5979j6529j7078j6964j6284j5670j5203j4437j3426j2643
58474G40048j1954j0765r366q839r335r645q999q119p855p861p442o749o348o232
58460F20539o095n967n919n720n331n142n228n036m320l595l156k533j527q59
58446E60111r72j063l78M28L58k19j77M36M31p02k158l013l110k768k361k346
58430E42497k925l754m343m642m696m180l013k027k133k986l404l009k589k792
$$ y = [1962832, 1875615, 1794671, 1720468, 1652642, 1590435, 1533262, 1480710, 1432522, 1388900, 1350323, 1316623, 1286598, 1258936, 1233161, 1209354, 1187359, 1166770, 1147378, 1129115, 1111730, 1094911, 1078592, 1062803, 1047421, 1032342, 1017628, 1003190, 988581, 973419, 957782, 941955, 926048, 910120, 894261, 878282, 861753, 844675, 827711, 811427, 795757, 780554, 766117, 752691, 740048, 728094, 717329, 707963, 699124, 689789, 680144, 671145, 663026, 655171, 647310, 639868, 633119, 626771, 620539, 614444, 608477, 602558, 596838, 591507, 586365, 581137, 576101, 571781, 568186, 565030, 562497, 560970, 560111, 559139, 558076, 557698, 558126, 558484, 558265, 558088, 558524, 558955, 558253, 556095, 553082, 549972, 547204, 544843, 542497, 539572, 535818, 531475, 526833, 522137, 517957, 514944, 512917, 510784, 507798, 504394, 501385, 498796, 496004]
58416D96004l340l633l372k488j176j55k31j327k464k860k592k152j816j682j778
58401D64938j916j740j144m47KJ59K70N81J107J556J636J476J504J838K154K319
58385D74293K709L569M521N097N388N713O080O349O560O561N864M361K852K080
58371E41997J717R72j23q69j122j424j972k404k644l164m052m593m198l315k966
58356E11840l513m238m142l022j653r00p40m13N64J884K968L542L609L305K949
58341E12040K863K958K990L237M231N750O857P170P185P098O392N130M522N261
58327E83684O334O440N775N290N100M833M862N669O452N856M012K467K028J954
58313F50756J361L53n50j144j421j395j254j135q22k04K05k5l02L42J791K984
$$ y = [496004, 492664, 489031, 485659, 483171, 481995, 481840, 481609, 480282, 477818, 474958, 472366, 470214, 468398, 466716, 464938, 463022, 461282, 460138, 459691, 459693, 459852, 460122, 460703, 461810, 463366, 465002, 466478, 467982, 469820, 471974, 474293, 477002, 480571, 485092, 490189, 495577, 501290, 507370, 513719, 520279, 526840, 532704, 537065, 539917, 541997, 543714, 544686, 544563, 543694, 542572, 541148, 539176, 536772, 534128, 530964, 526912, 522319, 518121, 514806, 511840, 508327, 504089, 499947, 496925, 495272, 494372, 493632, 493219, 493783, 495667, 498635, 502177, 505786, 509091, 512040, 514903, 517861, 520851, 524088, 528319, 534069, 540926, 548096, 555281, 562379, 568771, 573901, 578423, 583684, 590018, 596458, 602233, 607523, 612623, 617456, 622318, 627987, 634439, 640295, 644307, 646774, 648802, 650756, 652117, 652470, 651920, 650776, 649355, 647960, 646706, 645571, 644749, 644545, 644750, 644725, 644423, 644765, 646556, 649540]
58297F49540L439L719M277M743M644M177L962M304M845M796L735K304J669K034
58283G02188K393K086J695J766J735J075N50J101K269L075L671M648N362M753
58269G38367L476L390M931O599P229P270P561Q186Q903R611J0093J0202J0415
58256H36233J1244J2288J2694J2456J2199J2035J1718J1565J1967J2332J1901
58245I68632J1225J1372J1999J1877J1125J1142J2347J3720J4599J5240J5541
58234A108819J5050J4424J5028J6793J8167J8527J8869J9802K0740K1551K3048
58223A310818K5215K6703K6887K6828K7472K8414K9201L0296L1926L3369L4202
58212A631331L5098L6701L8806M1088M3431M5338M6328M7102M8898N1535N3804
$$ y = [649540, 652979, 656698, 660975, 665718, 670362, 674539, 678501, 682805, 687650, 692446, 696181, 698485, 700154, 702188, 704581, 706667, 708362, 710128, 711863, 712938, 713488, 714589, 716858, 719933, 723604, 728252, 733614, 738367, 741843, 745233, 750164, 756763, 763992, 771262, 778823, 787009, 795912, 805523, 815616, 825818, 836233, 847477, 859765, 872459, 884915, 897114, 909149, 920867, 932432, 944399, 956731, 968632, 979857, 991229, 1003228, 1015105, 1026230, 1037372, 1049719, 1063439, 1078038, 1093278, 1108819, 1123869, 1138293, 1153321, 1170114, 1188281, 1206808, 1225677, 1245479, 1266219, 1287770, 1310818, 1336033, 1362736, 1389623, 1416451, 1443923, 1472337, 1501538, 1531834, 1563760, 1597129, 1631331, 1666429, 1703130, 1741936, 1783024, 1826455, 1871793, 1918121, 1965223, 2014121, 2065656, 2119460]
58201B119460N5832N9124O3936O8699P2527P6293Q0585Q4678Q8223R2020R6404
58190B957781J00841J05680J12165J19914J26740J31875J37178J44067J51633
58181D087874J58997J67110J76730J86750J96263K06455K18832K33170K48574
58172E880755K64919K81954K98740L15192L32548L51316L70589L90339M12264
58163H898616M37191M63904M91615N21447N54285N89533O27295O69424P17198
58154A3970508P70257Q29046Q95735R71553J056057J150257J257742J381700J524188
58145B3807043J689694J886130K121174K401395K735726L134620L603795M144292
58137D5523869M761421N467236O268044P151894Q092957R068710J0075497J1134030
$$ y = [2119460, 2175292, 2234416, 2298352, 2367051, 2439578, 2515871, 2596456, 2681134, 2769357, 2861377, 2957781, 3058622, 3164302, 3276467, 3396381, 3523121, 3654996, 3792174, 3936241, 4087874, 4246871, 4413981, 4590711, 4777461, 4973724, 5180179, 5399011, 5632181, 5880755, 6145674, 6427628, 6726368, 7041560, 7374108, 7725424, 8096013, 8486352, 8898616, 9335807, 9799711, 10291326, 10812773, 11367058, 11956591, 12583886, 13253310, 13970508, 14740765, 15569811, 16465546, 17437099, 18493156, 19643413, 20901155, 22282855, 23807043, 25496737, 27382867, 29504041, 31905436, 34641162, 37775782, 41379577, 45523869, 50285290, 55752526, 62020570, 69172464, 77265421, 86334131, 96409628, 107543658]
58129A07543658J2278133J3519792J4796931J5921951J6546116J6169271J4261940
58122B11037792J0534499N229173q20099o494246j0879182j3587477j4736445
58115A80284015j4712886j3953364j2833466j1625960j0486882r471502q575016
58108I8624939p769571p022089o302375n591456m887585m203249l551119k930332
58100E6367163k338239j812600j455531j380567j608044k017570k420500k681583
58092D0652529k772226k732352k613142k454989k286860k122461j960302j796279
58084B1913918j633741j479465j337319j210293j102485j013822r37054q64238
58076A2335501p93336p26070o63352o05677n54519n10344m71564m37103m07234
$$ y = [107543658, 119821791, 133341583, 148138514, 164060465, 180606581, 196775852, 211037792, 221572291, 226801464, 225981365, 219487119, 208607937, 195020460, 180284015, 165571129, 151617765, 138784299, 127158339, 116671457, 107199955, 98624939, 90855368, 83833279, 77530904, 71939448, 67051863, 62848614, 59297495, 56367163, 54028924, 52216324, 50760793, 49380226, 47772182, 45754612, 43334112, 40652529, 37880303, 35147951, 32534809, 30079820, 27792960, 25670499, 23710197, 21913918, 20280177, 18800712, 17463393, 16253100, 15150615, 14136793, 13199739, 12335501, 11542165, 10816095, 10152743, 9547066, 8992547, 8482203, 8010639, 7573536, 7166302]
58067G166302l80682l54323l27372l02573k81634k62749k44176k26907k11884
58058D574002j97922j84489j73632j66777j62136j57397j52656j48601j44157
58049C086235j38167j31609j25995j21066j15821j10354j05090r9519r3197q6733
58039A958684q0679p4740o8947o4142o0369n6464n2063m8292m5553m2610l9012
58028A325813l6348l5651l5426l3866l1451k9681k8664k7692k7002k7203k7739
58017I85090k7489k6408k5365k4804k4415k3663k2009j9358j6643j5097j4607
58006G45232j3847j2382j1256j1035j0844j0035r297r182q960q018p056o833o848
57993F19639o393n854n860o040n718n074m690m606m575m574m465l919l143k890
$$ y = [7166302, 6785620, 6431297, 6103925, 5801352, 5519718, 5256969, 5012793, 4785886, 4574002, 4376080, 4191591, 4017959, 3851182, 3689046, 3531649, 3378993, 3230392, 3086235, 2948068, 2816459, 2690464, 2569398, 2453577, 2343223, 2238133, 2138614, 2045417, 1958684, 1878005, 1803265, 1734318, 1670176, 1609807, 1553343, 1501280, 1452988, 1407435, 1364825, 1325813, 1289465, 1253814, 1218388, 1184522, 1153071, 1123390, 1094726, 1067034, 1040032, 1012829, 985090, 957601, 931193, 905828, 881024, 856609, 832946, 810937, 791579, 774936, 759839, 745232, 731385, 719003, 707747, 696712, 685868, 675833, 666536, 657354, 648394, 640376, 633320, 626487, 619639, 613246, 607392, 601532, 595492, 589774, 584700, 580010, 575404, 570829, 566255, 561790, 557871, 554728, 551838]
57979E51838l243l413l117k963l061k510j028K73M43j06p48j678k911l569l225
57964E20982k888l580m832n559n555n290m995m752m660m338l224j925j997l705
57950D63682n322n494m981m995n234m841m108l820l888l878m066m689n027m453
57936C98886l594l313l344l032k606k546k588k495k868l873m146k531j09J098
57922C62939Q70O61J171J673J531R02Or75j370n99P35J346Q44mm62n03m92r01
57904C67372k013l341l864l378k867k886k626j559p71j358k475k624k018j962
57890C33630k515k658k319k252k201j220K14M78n01p93O94K634L350K879K177
57875C31597J532Q10J96k56j040k343l429l622l342l421l900m160l848l182k484
$$ y = [551838, 548595, 545182, 542065, 539102, 536041, 533531, 532503, 532776, 533219, 533113, 532365, 530687, 527776, 524207, 520982, 518094, 514514, 509682, 504123, 498568, 493278, 488283, 483531, 478871, 474533, 471309, 469384, 467387, 463682, 458360, 452866, 447885, 442890, 437656, 432815, 428707, 424887, 420999, 417121, 413055, 408366, 403339, 398886, 395292, 391979, 388635, 385603, 382997, 380451, 377863, 375368, 372500, 368627, 364481, 361950, 361841, 362939, 363809, 364470, 365641, 367314, 368845, 369747, 369753, 368778, 367408, 366809, 367544, 368890, 369734, 369730, 369268, 368765, 368273, 367372, 365359, 362018, 358154, 354776, 351909, 349023, 346397, 344838, 344067, 342709, 340234, 337610, 335592, 333630, 331115, 328457, 326138, 323886, 321685, 320465, 320679, 321157, 320656, 319863, 320557, 323191, 326541, 329420, 331597, 333129, 333939, 334135, 333879, 332839, 330496, 327067, 323445, 320103, 316682, 312782, 308622, 304774, 301592, 299108]
57860B99108j967j796j999k333k352j671l07J108J765J594J438J906K512K543
57846B99549K304K627L458L889L545K983K646K304J731J187R37R23J013J092Q59
57831C31047J10q00j339j612k109k785l131l132l260l496l264k570k264k782l424
57816B95189l359k747k310k338k503k377j735o01P07J782K505L012L327L320L086
57801B94958K942L022L156L194L096K697J823N93o17j491j854j638j114q59j153
57786C06755j705k334l346m684n370m710l592l439m226m694m355l970l999l962
57772B52369l566l223l088k735k303k718m106n134m748l685l316l778m225m324
57758B01420m419m565m444m079l896l969l901l388k536j579p43k69j75j19K16
$$ y = [299108, 297141, 295345, 293346, 291013, 288661, 286990, 286683, 287791, 289556, 291150, 292588, 294494, 297006, 299549, 301853, 304480, 307938, 311827, 315372, 318355, 321001, 323305, 325036, 326223, 327160, 328083, 329096, 330188, 331047, 331157, 330357, 329018, 327406, 325297, 322512, 319381, 316249, 312989, 309493, 306229, 303659, 301395, 298613, 295189, 291830, 289083, 286773, 284435, 281932, 279555, 277820, 277219, 277926, 279708, 282213, 285225, 288552, 291872, 294958, 297900, 300922, 304078, 307272, 310368, 313065, 314888, 315481, 314864, 313373, 311519, 309881, 308767, 307908, 306755, 305050, 302716, 299370, 294686, 289316, 284606, 281014, 277575, 273349, 268655, 264300, 260330, 256331, 252369, 248803, 245580, 242492, 239757, 237454, 234736, 230630, 225496, 220748, 217063, 213747, 209969, 205744, 201420, 197001, 192436, 187992, 183913, 180017, 176048, 172147, 168759, 166223, 164644, 163901, 163632, 163457, 163338, 163554]
57743A63554O95R90J125J436K134L060L850M065L391J993N54k40k28K49P33R07
57727A88268P36M98N22Q07J059J166J298J456J338Q25K67J8l8k42p23j394k201
57710A93660l006l496l500l313l387l731l911l610k942k128j119K48J731K666
57696A64162K650K132J899K088K156J864J695J981K288K176K030K431L072L147
57682A95771K591K087J932J761J447J421J854K301K470K714L378M194M595M240
57668B32756L129J749J086J853L456M477M422M227M728N500N747N526N318N085
57654B89059M664M626N687P398Q425Q253P811Q189R395J0696J1639J2243J2560
57641D00645J2613J2767J3619J5348J7356J8907J9932K0956K2233K3436K4346
$$ y = [163554, 164249, 165239, 166364, 167800, 169934, 172994, 176844, 180909, 184300, 186293, 186847, 186607, 186379, 186628, 187361, 188268, 189004, 189502, 190024, 190831, 191890, 193056, 194354, 195810, 197148, 197973, 198240, 198258, 198220, 197978, 197255, 195861, 193660, 190654, 187158, 183658, 180345, 176958, 173227, 169316, 165706, 162764, 160636, 159517, 159765, 161496, 164162, 166812, 168944, 170843, 172931, 175087, 176951, 178646, 180627, 182915, 185091, 187121, 189552, 192624, 195771, 198362, 200449, 202381, 204142, 205589, 207010, 208864, 211165, 213635, 216349, 219727, 223921, 228516, 232756, 235885, 237634, 238720, 240573, 244029, 248506, 252928, 257155, 261883, 267383, 273130, 278656, 283974, 289059, 293723, 298349, 304036, 311434, 319859, 328112, 335923, 344112, 353507, 364203, 375842, 388085, 400645, 413258, 426025, 439644, 454992, 472348, 491255, 511187, 532143, 554376, 577812, 602158]
57630F02158K5372K7054K9363L1961L4882L8410M2415M6454N0594N5617O2180
57619A046460P0124P8728Q7339R5674J03810J12017J20407J28679J36337J42923
57609B122498J47863J50305J49338J43954J32449J12616Q3629M7793R703k6333
57599C073815n7593q2494j00306j11660j18191j21184j21152j18727j14996j10593
57589B016919j05370r9286r2867q6409p9680p2782o6415o0795n5194m9105m2971
57578A206045l7216l1532k5869k1158j7992j5369j1820p331l140M5K632N289Q419
57565A051003J2281J6861K1608K6005L0208L4665L9392M4198M9297N4962O0889
57554A441369O6490P1557P6030P9519Q1678Q2693Q2550Q0363P5186O7185N7020
$$ y = [602158, 627530, 654584, 683947, 715908, 750790, 789200, 831615, 878069, 928663, 984280, 1046460, 1116584, 1195312, 1282651, 1378325, 1482135, 1594152, 1714559, 1843238, 1979575, 2122498, 2270361, 2420666, 2570004, 2713958, 2846407, 2959023, 3042652, 3090445, 3100148, 3073815, 3016222, 2933728, 2833422, 2721762, 2603571, 2482387, 2361235, 2242508, 2127512, 2016919, 1911549, 1812263, 1719396, 1632987, 1553307, 1480525, 1414110, 1353315, 1298121, 1249016, 1206045, 1168829, 1137297, 1111428, 1090270, 1072278, 1056909, 1045089, 1037758, 1034618, 1034663, 1037295, 1042584, 1051003, 1063284, 1080145, 1101753, 1127758, 1157966, 1192631, 1232023, 1276221, 1325518, 1380480, 1441369, 1507859, 1579416, 1655446, 1734965, 1816643, 1899336, 1981886, 2062249, 2137435, 2204620, 2261640]
57543B261640M4546K9284J1951n683k2461l8239n2615o4595p3782q0806q6069
57532A923171q9111q9687q8565q6550q3564p9427p4915p1076o7921o4467o0114
57521A067774n5338n1040m7628m4778m1835l8391l4623l1062k8088k5738k3900
57510F45353k2402k0908j9080j6982j5045j3538j2323j1184j0116r233q524p828
57498D78190o938n796m716m178m159l950l007j709q09l44K46J075J716K113K771
57483D50505L904N159O394P905R552J0495J0454J0550J2100J5029J8145K0625
57471E80817K2496K3976K5168K6473K8547L1629L5269L8920M2452M6061M9906
57460I51714N3880N7580O0562O2814O4792O6638O7570O6464O2966N7571N0641
$$ y = [2261640, 2306186, 2335470, 2347421, 2341738, 2319277, 2281038, 2228423, 2163828, 2090046, 2009240, 1923171, 1834060, 1744373, 1655808, 1569258, 1485694, 1406267, 1331352, 1260276, 1192355, 1127888, 1067774, 1012436, 961396, 913768, 868990, 827155, 788764, 754141, 723079, 694991, 669253, 645353, 622951, 602043, 582963, 565981, 550936, 537398, 525075, 513891, 503775, 494542, 486018, 478190, 471252, 465456, 460740, 456562, 452403, 448453, 445446, 443737, 442928, 442584, 442830, 443905, 445621, 447734, 450505, 454409, 459568, 465962, 473867, 483419, 493914, 504368, 514918, 527018, 542047, 560192, 580817, 603313, 627289, 652457, 678930, 707477, 739106, 774375, 813295, 855747, 901808, 951714, 1005594, 1063174, 1123736, 1186550, 1251342, 1317980, 1385550, 1452014, 1514980, 1572551, 1623192]
57449A623192M1910L1123J8673N358q121k1085l2706m2356n0005n5944o0208o2587
57437A387244o3130o2348o0835n8879n6428n3286m9423m5218m1328l8102l5224
57426H23043l2192k8999k6003k3252k0431j7538j5055j3196j1422r140o438l753
57414F15624j149J557M193O478Q704J1583J5274J9117K2560K5844K9500L3569
57402G92854L7631M1379M4856M8289N1867N5566N8985O1501O2634O2170N9973
57391A377705N5899M9980M2358L3040K1971R413m030j7754l1134m3174n2763n9580
57379A381931o4313o7716o9841p0470o9828o8426o6416o3667o0289n6672n3115
57368F71178m9716m6612m3927m1518l9024l6166l2957k9675k6723k4354k2395
$$ y = [1623192, 1665102, 1696225, 1714898, 1720256, 1712135, 1691050, 1658344, 1615988, 1565983, 1510039, 1449831, 1387244, 1324114, 1261766, 1200931, 1142052, 1085624, 1032338, 982915, 937697, 896369, 858267, 823043, 790851, 761852, 735849, 712597, 692166, 674628, 659573, 646377, 634955, 625815, 619377, 615624, 614475, 616032, 620225, 626703, 635407, 646990, 662264, 681381, 703941, 729785, 759285, 792854, 830485, 871864, 916720, 965009, 1016876, 1072442, 1131427, 1192928, 1255562, 1317732, 1377705, 1433604, 1483584, 1525942, 1558982, 1580953, 1590366, 1586336, 1568582, 1537448, 1494274, 1441511, 1381931, 1317618, 1249902, 1180061, 1109591, 1039763, 971337, 904921, 841254, 780965, 724293, 671178, 621462, 574850, 530923, 489405, 450381, 414215, 381258, 351583, 324860, 300506, 278111]
57357B78111k0447j8431j6722j5663j5160j4811j4194j2963j1149r377q390q176
57345A12628q030p591p172o913o397n561n168n676o277n946m891m109l818l400
57331C1679k680k232k336k578k692k911l246l135k275j245r05j454A607a466l267
57316d733l144l147l518m017m194l954l590l381l454l893m545m912m628m039l759
57301f2908l805l656l184k850k929l111l115l135l418l775l872l711l512l384
57287a10365l251l037k760k570k696l165l647l768l478k903k073j142o19q56j399
57272a47729j428p92q3L12N16N51J37o13j010o35P0M92N95O55O52M00k1m00p33
57253a49064j061j154p60nO80J019R82O26Q8l01j70N28J397J910J887J631J628
$$ y = [278111, 257664, 239233, 222511, 206848, 191688, 176877, 162683, 149720, 138571, 129194, 120804, 112628, 104598, 97007, 89835, 82922, 76525, 70964, 65796, 60120, 53843, 47897, 43006, 38897, 35079, 31679, 28999, 26767, 24431, 21853, 19161, 16250, 13004, 9869, 7594, 6349, 5444, 3990, 1607, -1466, -4733, -7877, -11024, -14542, -18559, -22753, -26707, -30297, -33678, -37132, -41025, -45570, -50482, -55110, -59149, -62908, -66713, -70369, -73553, -76403, -79332, -82443, -85558, -88693, -92111, -95886, -99758, -103469, -106981, -110365, -113616, -116653, -119413, -121983, -124679, -127844, -131491, -135259, -138737, -141640, -143713, -144855, -145474, -146330, -147729, -149157, -149949, -150032, -149720, -149204, -148653, -148516, -149129, -150139, -150774, -150704, -150212, -149617, -148962, -148310, -147910, -147931, -148331, -149064, -150125, -151279, -152039, -152044, -151364, -150345, -149363, -148737, -148649, -148950, -149120, -148592, -147195, -145285, -143398, -141767, -140139]
57236a40139J973K271K191J892J735J784J906K169K661L039K807K099J679J965
57222a09968K535K770K674K728L243M116N094O068P133Q355R499J0131J0163J0002
57208b5457R888f197A749N934M026K230p8k938E358b094q959j0330j1013j0479
57194d2875r168q012p387p128p168p520p829p586o747n767n049m727m757m900
57180a36620m687l880k874k289k155j904j277p69j032j977k755k583j528m87l85
57165a67202j338k502k846k063p91J18M81Q89J907L387M764N875P028Q323R404
57150a34566J0134J0993J2379J3910J5008J5811J6893J8196b293A6453J8053J7532
57138E2038J7338J7188J6859J6404J6110J6237J6659J6872J6623J6308J6378J6614
$$ y = [-140139, -138166, -135895, -133704, -131812, -130077, -128293, -126387, -124218, -121557, -118518, -115711, -113612, -111933, -109968, -107433, -104663, -101989, -99261, -96018, -91902, -86808, -80740, -73607, -65252, -55753, -45622, -35459, -25457, -15569, -6197, 1749, 7683, 11709, 13939, 13861, 10923, 5358, -2094, -11053, -21383, -32396, -42875, -52043, -60055, -67442, -74570, -81738, -89258, -97087, -104673, -111420, -117187, -122236, -126963, -131720, -136620, -141307, -145187, -148061, -150350, -152505, -154409, -155686, -156455, -157487, -159464, -162219, -164802, -166330, -166817, -167202, -168540, -171042, -173888, -175951, -176742, -176624, -176143, -175254, -173347, -169960, -165196, -159321, -152293, -143970, -134566, -124432, -113439, -101060, -87150, -72142, -56331, -39438, -21242, -2293, 16453, 34506, 52038, 69376, 86564, 103423, 119827, 135937, 152174, 168833, 185705, 202328, 218636, 235014, 251628]
57126B51628J6466J5935J5434J4987J4214J3106J2065J1109R745P837N940M546
57114C93012L578K837K420K359K381K254K024J664R53n5r17j365j651k120k860
57099D04514l831n003o168p030p669q566j0043j2010j4283j6743j9272k1975k5368
57086B46553k9806l4729l9214m3267m7916b263o0947o8603p6699q5127r3739j02868
57074d90246j13164j24609j36344j47902j59941j73328j88188k04279k21812k41264
57064b201077k62813k86405l12209l40536l71507m05050m41265m80754n24597
57055e626213n73711o28171o87651p52886q26085r09441j004015j110845j232316
57046a3351334j371403j530619j713344j925537k174692k467990k813492l222343
$$ y = [251628, 268094, 284029, 299463, 314450, 328664, 341770, 353835, 364944, 374689, 382526, 388466, 393012, 396590, 399427, 401847, 404206, 406587, 408841, 410865, 412529, 413482, 413427, 412510, 411145, 409494, 407374, 404514, 400683, 395680, 389512, 382482, 374813, 366247, 356204, 344194, 329911, 313168, 293896, 271921, 246553, 216747, 182018, 142804, 99537, 51621, -2263, -63210, -131813, -208512, -293639, -387378, -490246, -603410, -728019, -864363, -1012265, -1172206, -1345534, -1533722, -1738001, -1959813, -2201077, -2463890, -2750295, -3062504, -3403040, -3774547, -4179597, -4620862, -5101616, -5626213, -6199924, -6828095, -7515746, -8268632, -9094717, -10004158, -11008173, -12119018, -13351334, -14722737, -16253356, -17966700, -19892237, -22066929, -24534919, -27348411, -30570754]
57038c0570754l707312m279383m947744n721036o603072p586355q655502r800256
57030h1871414j1018250j2294195j3573605j4765556j5783681j6590501j7196345
57023a83093547j7602540j7738154j7457740j6612427j5128742j3020826j0341689
57016b90995665p151609l551819K62780M010909P403255J0227716J2384814J3875519
57008b53534100J4771846J5184449J5229215J5004101J4588330J4056107J3482533
57001a51217519J2930695J2430002J1964696J1484158J0931467J0272799R509400
56994g1694302Q669086P790613O913506O073314N297242M600739L988349L457393
56986b4904060L000792K609081K273123J985785J740843J531441J351000J194890
$$ y = [-30570754, -34278066, -38557449, -43505193, -49226229, -55829301, -63415656, -72071158, -81871414, -92889664, -105183859, -118757464, -133523020, -149306701, -165897202, -183093547, -200696087, -218434241, -235891981, -252504408, -267633150, -280653976, -290995665, -298147274, -301699093, -301436313, -297425404, -290022149, -279794433, -267409619, -253534100, -238762254, -223577805, -208348590, -193344489, -178756159, -164700052, -151217519, -138286824, -125856822, -113892126, -102407968, -91476501, -81203702, -71694302, -63025216, -55234603, -48321097, -42247783, -36950541, -32349802, -28361453, -24904060, -21903268, -19294187, -17021064, -15035279, -13294436, -11762995, -10411995, -9217105]
56978i217105J059961R43010Q40873P51422O73261O04735N44080M90174M42274
56969b867315L99494L61133L26987K96674K69226K44050K21527K01985J84777
56960c61462J69130c7161A06058J32725J22695J12848J03488R4740Q6488P8572
56950H37614P0542O1896N3029M5181L8828L2897K5985J7351O025r581k9767n1884
56938A098116p1790q6628r5452r8083r4865q7246p7402o7094n7407m9127m2549
56927B70473l7267l2840k9346k6810k4654k2432k0425j8834j7153j5187A1576
56915b801j5795j6668j6533j5990j5294j4156j2741j1626j0807r646p844n681
56903a55582l425j069J411M042O757Q950R822R659R858J0883J1228R523O640M355
$$ y = [-9217105, -8157144, -7214134, -6373261, -5621839, -4948578, -4343843, -3799763, -3309589, -2867315, -2467821, -2106688, -1779701, -1483027, -1213801, -969751, -748224, -546239, -361462, -192332, -37161, 106058, 238783, 361478, 474326, 577814, 672554, 759042, 837614, 908156, 970052, 1023081, 1068262, 1107090, 1139987, 1165972, 1183323, 1189348, 1179767, 1150000, 1098116, 1026326, 939698, 844246, 746163, 651298, 564052, 486650, 419556, 362149, 313022, 270473, 233206, 200366, 171020, 144210, 119556, 97124, 76699, 57865, 40712, 25525, 11576, -2801, -18596, -35264, -51797, -67787, -83081, -97237, -109978, -121604, -132411, -142057, -149901, -155582, -159007, -160076, -158665, -154623, -147866, -138916, -129094, -119435, -109577, -98694, -87466, -77943, -71303, -66948]
56889f6948K894J492N52J154K649K994J701N63R85K340L597M912O679Q329R101
56874a7006g787A604R891J0639J1592J2347J2055J0266P359L872O5l617o451q229
56860F1393r439j0242j0099q921p647p093A138d790m547l611l624m113m290l788
56846b8763k903k359k611l275l527l120k620k518k657k726k691k487j850q11J21
56831f4797O50J113J867K713L280L584L842M163M657N456O216O184N197M218M331
56816g326a867D764P252P606Q228R199J0088J0427J0286J0496J1953J4499J6852
56803A21650J7939J7948J7791J7912J8095J8069J7635J6369J3833J0183O188K475
56791B96087q85m027o781q607q884p342m453j350R91K582M143O014P732Q896J0073
$$ y = [-66948, -64054, -62562, -62010, -60856, -58207, -55213, -53512, -52949, -51964, -49624, -46027, -41115, -34436, -26107, -17006, -7787, 1604, 11495, 22134, 33726, 46073, 58128, 68394, 75753, 79625, 79690, 76073, 69622, 61393, 51954, 41712, 31613, 22692, 15045, 7952, 1138, -4790, -9337, -12948, -16572, -20685, -24975, -28763, -31666, -34025, -36636, -39911, -43438, -46558, -49178, -51696, -54353, -57079, -59770, -62257, -64107, -64918, -64797, -64147, -63034, -61167, -58454, -55174, -51590, -47748, -43585, -38928, -33472, -27256, -21072, -15875, -11657, -7326, -1867, 4764, 12016, 19622, 27850, 37049, 47137, 57564, 67850, 78346, 90299, 104798, 121650, 139589, 157537, 175328, 193240, 211335, 229404, 247039, 263408, 277241, 287424, 293612, 296087, 295202, 291175, 284394, 275787, 266903, 259561, 255108, 253758, 254749, 257331, 261474, 267488, 275220, 284116, 294189]
56776B94189J2298J5756J9483K2422K4271K4894K3474J9130J2299M698k360q900
56764D61654j5059j9736k1405k0055j7430j5258j3875j2681j1133q971o076k675
56752B97300N90L139M966O482Q077R969J2131J4062J4753J3201R074K956l924
56739C92776j0150j4700j7350j8541j8782j8289j7207j5857j4525j3178j1549
56728B22648r527p298n156l284j675j42J599L692N857P434P818O912M995K219
56714B36092j493n825r662j1825j2242j1962j1979j2341j2458j1836j0371q363
56702A15735o490n372m940m645m303m197m185l552k195j163j298j985k056j407
56688F7947q20n62k78jj61n96n38K09R45J174J211J499J966K302K308J797P22
$$ y = [294189, 306487, 322243, 341726, 364148, 388419, 413313, 436787, 455917, 468216, 472914, 470554, 461654, 446595, 426859, 405454, 385399, 367969, 352711, 338836, 326155, 315022, 306051, 299975, 297300, 297890, 301029, 305995, 312477, 320554, 330523, 342654, 356716, 371469, 384670, 393744, 396700, 392776, 382626, 367926, 350576, 332035, 313253, 294964, 277757, 261900, 247375, 234197, 222648, 213121, 205823, 200667, 197383, 195708, 195566, 197165, 200857, 206714, 214148, 221966, 228878, 233873, 236092, 234599, 228774, 219112, 207287, 195045, 183083, 171104, 158763, 146305, 134469, 124098, 115735, 109245, 103873, 98933, 94288, 89985, 85788, 81603, 78051, 75856, 74693, 73395, 71410, 69354, 67947, 67127, 66565, 66287, 66286, 66125, 65529, 64991, 65200, 66145, 67319, 68530, 70029, 71995, 74297, 76605, 78402, 79124]
56671G9124l81p93n70m85q30r94m81K87N72K12m47j035j267r77l84L7Q2n7k32
56652G1381m19l81J57Q98J218J082J022J066O18l44q98n97k84p81j550j546q33
56635F9809k97k01m1L32L93j21p61j018q53m37J48P66J192J467J890K528K945
56618G7741K662J783R54P26R10P81m2j001j200n26K04L73L33P78J672K299K201
56601I0648J673J273J144R90N96K19L66J133J950K182J911J752J962K089J620
56586A11508O61j73l85M7O16O50n4q96j077n52n0j25n97r64r91p77o09p94j365
56567A04073j867j885j670j745j947j538m00N99O96O7o35j069j157r20o60p95
56551H9147j158j035k02O69J009J169J675K304K463K032J328O31K75O88J777K632
$$ y = [79124, 78743, 77950, 77380, 76895, 76065, 75071, 74590, 74877, 75449, 75661, 75214, 74179, 72912, 71935, 71551, 71588, 71670, 71613, 71381, 70962, 70581, 70738, 71636, 72854, 73936, 74958, 76024, 76642, 76298, 75400, 74803, 74519, 73738, 72188, 70642, 69809, 69512, 69311, 69270, 69602, 69995, 69874, 69113, 68095, 67242, 66805, 66953, 67719, 68911, 70378, 72268, 74796, 77741, 80403, 82186, 83140, 83866, 84776, 85557, 85515, 84514, 83314, 82788, 82992, 83365, 83698, 84476, 86148, 88447, 90648, 92321, 93594, 94738, 95728, 96324, 96543, 96909, 98042, 99992, 102174, 104085, 105837, 107799, 109888, 111508, 112169, 111996, 111611, 111658, 112274, 112924, 112870, 111974, 110897, 110345, 110295, 110170, 109573, 108609, 107618, 106841, 106232, 105438, 104073, 102206, 100321, 98651, 96906, 94959, 93421, 93021, 93620, 94316, 94383, 93748, 92679, 91522, 90602, 89942, 89147, 87989, 86954, 86752, 87421, 88430, 89599, 91274, 93578, 96041, 98073, 99401, 100032, 100307, 100995, 102772, 105404]
56535A05404K440J427L85k89o39o63m31l54o58r03n61K00Q37J218J452J376Q38
56518A11079K50J00J77%k46%O07Q41N16K55M72Q71J153J508K058K386K030J230
56500A25287P84J248K368L251L191K433J970K437L378L797L233K093J170J050
56486A57690J699K308J961O62n77r91q49p24n95l15k89q52j446j305o82m67p81
56469A54447r52p28n75p01p42n38m59p02r88j114j237j420j467j320j132q86m98
56452A38988k31l73n84k93L06M44j9m68o80j049j484j142J16J041M75j132k407
56435A31508k683k233j426m76K60N16M86M46J80o10j530j780j173l60O3J78L15
56418A21681M36J98m78j142j156l52P85J630K063K366K649K712K544K518K825
$$ y = [105404, 107844, 109271, 109656, 109367, 108728, 108065, 107634, 107280, 106622, 105719, 105158, 105358, 106195, 107413, 108865, 110241, 111079, 111329, 111429, 111606, 111606, 111360, 111360, 111967, 112808, 113324, 113579, 114051, 114922, 116075, 117583, 119641, 122027, 124057, 125287, 126071, 127319, 129687, 132938, 136129, 138562, 140532, 142969, 146347, 150144, 153377, 155470, 156640, 157690, 159389, 161697, 163658, 164320, 163743, 162752, 161903, 161179, 160584, 160269, 159980, 159128, 157682, 156377, 155695, 155228, 154447, 153495, 152767, 152192, 151491, 150749, 150211, 149752, 149050, 148062, 146948, 145711, 144291, 142824, 141504, 140372, 139486, 138988, 138757, 138384, 137800, 137507, 137813, 138257, 138238, 137770, 137090, 136041, 134557, 133415, 133531, 134572, 135047, 133915, 131508, 128825, 126592, 125166, 124690, 124950, 125466, 125952, 126398, 126578, 125968, 124438, 122658, 121485, 121125, 121188, 121366, 121681, 122117, 122315, 121837, 120695, 119539, 119187, 119972, 121602, 123665, 126031, 128680, 131392, 133936, 136454, 139279]
56403A39279L121K922K204J362P74O40J002J662K176K267K179K417L088L704L689
56388A72486L007K093J289N04l97j066r86l12J20j75p32r73j101j563k078j973
56372A68143j332q54o93k94L67M48m91j636k017j752j614j769j773j471j134q02
56356A51326j87P01J362J485J331J279J262R69L97j69o42j307k299l130l107k202
56340A47069j155n33r8N90J329J535J205R47J060J169R58O59O00P23Q48J020J212
56323A59138J110N74O6J13M96N00q0n53j79R73K105K508K144J491J006P93O45
56306A72850L16k28o74n43L44J492K045J659Q51M00N77J154J860K471K696K436
56290A89706K115K326L034L446K874J507K77RP34J723K265K323K296K284J958
$$ y = [139279, 142400, 145322, 147526, 148888, 149662, 150302, 151304, 152966, 155142, 157409, 159588, 162005, 165093, 168797, 172486, 175493, 177586, 178875, 179379, 178982, 177916, 176930, 176618, 176738, 176563, 175831, 174858, 173757, 172194, 170116, 168143, 166811, 165957, 165264, 164970, 165337, 165785, 165294, 163658, 161641, 159889, 158275, 156506, 154733, 153262, 152128, 151326, 151139, 151840, 153202, 154687, 156018, 157297, 158559, 159528, 159925, 159756, 159114, 157807, 155508, 152378, 149271, 147069, 145914, 145381, 145283, 145873, 147202, 148737, 149942, 150889, 151949, 153118, 154076, 154735, 155335, 156058, 156906, 157926, 159138, 160248, 160822, 160888, 161001, 161497, 161997, 161917, 161364, 161185, 162158, 164263, 166771, 168915, 170406, 171412, 172205, 172850, 173166, 172938, 172264, 171721, 172065, 173557, 175602, 177261, 178112, 178512, 179089, 180243, 182103, 184574, 187270, 189706, 191821, 194147, 197181, 200627, 203501, 205008, 205285, 205294, 206028, 207751, 210016, 212339, 214635, 216919, 218877]
56275B18877J299Q92J122J560J604J384J452J871K216K281K254K318K627L399
56261B45156M532N315N133M319L736L715M005M504N241N830N812N463N463N797
56247C14021N894N784O158P089P690P367O622O193O149O133N939N550N100M920
56233D00609N037M796L683K478K493L729M960N721O791Q328R117Q527P785Q242
56219D82296R506J0505J1409J3082J5334J7195J8477J9771K1192K2425K3880K6454
56207F91526L0078L3589L6337L8986M2415M6634N1085N5471N9971O5071P1258
56196A222421P8444Q5668R1767R6442J00316J03970J07303J09806J10953J10281
56186B217371J07495J02597R5779Q7149P6802O4999N2049L8229K4038J0272k486
$$ y = [218877, 220176, 221068, 222190, 223750, 225354, 226738, 228190, 230061, 232277, 234558, 236812, 239130, 241757, 245156, 249688, 255003, 260136, 264455, 268191, 271906, 275911, 280415, 285656, 291486, 297298, 302761, 308224, 314021, 319915, 325699, 331857, 338946, 346636, 354003, 360625, 366818, 372967, 379100, 385039, 390589, 395689, 400609, 405646, 410442, 414125, 416603, 419096, 422825, 427785, 433506, 440297, 448625, 457742, 466269, 474054, 482296, 491802, 502307, 513716, 526798, 542132, 559327, 577804, 597575, 618767, 641192, 665072, 691526, 721604, 755193, 791530, 830516, 872931, 919565, 970650, 1026121, 1086092, 1151163, 1222421, 1300865, 1386533, 1478300, 1574742, 1675058, 1779028, 1886331, 1996137, 2107090, 2217371, 2324866, 2427463, 2523242, 2610391, 2687193, 2752192, 2804241, 2842470, 2866508, 2876780, 2874294]
56175B874294j4237k5095l4701m2544m8677n3663n7873o1248o3705o5483o7028
56164B340040o8689p0440p1904p2854p3625p4644p5505p5158p3303p0919o9110
56153A543889o7922o6714o5049o2677n9345n5335n1710m9239m7403m5151m2185
56142I31159l8894l5488l2086k9288k7606k6485k4823k2432k0171j8599j7364
56131F37923j6025j4650j3381j2081j0680r392q345p450o649n959n249m389l579
56118E20094l051k601j855r49k92K48J269K865M384N307N771O090O313O477O864
56103E56934P669Q751R863J0859J1570J1820J1748J1789J2175J2675J2983J3156
56091F91992J3485J4076J4698J5063J5298J6020J7746K0259K2803K5001K7239
$$ y = [2874294, 2860057, 2834962, 2800261, 2757717, 2709040, 2655377, 2597504, 2536256, 2472551, 2407068, 2340040, 2271351, 2200911, 2129007, 2056153, 1982528, 1907884, 1832379, 1757221, 1683918, 1612999, 1543889, 1475967, 1409253, 1344204, 1281527, 1222182, 1166847, 1115137, 1065898, 1018495, 973344, 931159, 892265, 856777, 824691, 795403, 767797, 741312, 716489, 694057, 673886, 655287, 637923, 621898, 607248, 593867, 581786, 571106, 561714, 553369, 545919, 539270, 533311, 528062, 523673, 520094, 517043, 514442, 512587, 511638, 511346, 511594, 512863, 515728, 520112, 525419, 531190, 537280, 543593, 550070, 556934, 564603, 573354, 583217, 594076, 605646, 617466, 629214, 641003, 653178, 665853, 678836, 691992, 705477, 719553, 734251, 749314, 764612, 780632, 798378, 818637, 841440, 866441, 893680]
56080H93680L0015L3331L6994M1113M5893N1122N6156O0180O2417O2441O0532
56069A433874N7369N3246M8126M2613L8064L5246L3491L1607K8940K5067J9381
56058A847024J1891L825l443r704j5449k0742k5549l0557l6615m3576n0587n7033
56046A569485o2287o5044o4383o1225n7455n3719m9345m4289l9612l5781l1960
56035A004385k7610k3526k0531j8074j5023j1296p921n744m660l937k976j780
56023H61307q25n13p60j251j717j833j314m76j65n35n38O37K206K820K544K624
56007H62211L598M746N389N685O032O595P472Q565R358R588R908J1034J2488J3219
55993I75888J3234J3510J4391J5247J5701J6075J6548J6983J7613J8805K0138
$$ y = [893680, 923695, 957026, 994020, 1035133, 1081026, 1132148, 1188304, 1248484, 1310901, 1373342, 1433874, 1491243, 1544489, 1592615, 1635228, 1673292, 1708538, 1742029, 1773636, 1802576, 1827643, 1847024, 1858915, 1862740, 1859297, 1849593, 1834144, 1813402, 1787853, 1757296, 1720681, 1677105, 1626518, 1569485, 1507198, 1442154, 1377771, 1316546, 1259091, 1205372, 1156027, 1111738, 1072126, 1036345, 1004385, 976775, 953249, 932718, 914644, 899621, 888325, 880404, 874660, 870000, 866063, 863087, 861307, 860482, 859969, 859209, 857958, 856241, 854408, 853094, 852618, 852453, 851918, 851380, 852017, 854223, 857043, 859587, 862211, 865809, 870555, 875944, 881629, 887661, 894256, 901728, 910293, 919651, 929239, 939147, 950181, 962669, 975888, 989122, 1002632, 1017023, 1032270, 1047971, 1064046, 1080594, 1097577, 1115190, 1133995, 1154133]
55982A154133K0831K1103K1961K3625K5331K6708K8087K9393L0090L0443L1486
55971A443191L3393L5107L5943L6490L7570L9333M1630M4260M6678M8544N0658
55960A892797N4173N8784O3004O6316O9695P3771P7954Q1699Q5265Q8879R2360
55949B704697R6000J00501J05798J11157J16541J22545J28962J34978J40894J47905
55939C909978J55968J63764J71131J79625J90234K02370K15611K30379K46268
55930E665328K61742K76339K91382L07739L24777L42232L61157L82138M04478
55921H617312M27993M53710M82049N12334N44831N81234O22413O67978P18748
55912A3628602P77129Q44133R18658J000820J093530J199946J322308J464500
$$ y = [1154133, 1174964, 1196067, 1218028, 1241653, 1266984, 1293692, 1321779, 1351172, 1381262, 1411705, 1443191, 1476584, 1511691, 1547634, 1584124, 1621694, 1661027, 1702657, 1746917, 1793595, 1842139, 1892797, 1946970, 2005754, 2068758, 2135074, 2204769, 2278540, 2356494, 2438193, 2523458, 2612337, 2704697, 2800697, 2901198, 3006996, 3118153, 3234694, 3357239, 3486201, 3621179, 3762073, 3909978, 4065946, 4229710, 4400841, 4580466, 4770700, 4973070, 5188681, 5419060, 5665328, 5927070, 6203409, 6494791, 6802530, 7127307, 7469539, 7830696, 8212834, 8617312, 9045305, 9499015, 9981064, 10493398, 11038229, 11619463, 12241876, 12909854, 13628602, 14405731, 15249864, 16168522, 17169342, 18262872, 19462818, 20785126, 22249626]
55904B2249626J633033J834496K075317K365047K715800L136202L628831M195084
55896D3833436M838936N564277O372508P264410Q238886R284254J0369876J1446103
55888A07212686J2453404J3335890J4036926J4438052J4253368J3006744J0237642
55881A98974712N877636M88208m911798r338590j2267751j3706143j3979065j3487753
55873A37649456j2581834j1518688j0452509r449376q528648p699054o966856
55866G0452491o330280n778524n293306m849287m421028l996218l580241l186216
55858C3017391k823967k498657k213052j966295j753367j568926j409932j273328
55850A7509867j154290j048889r56062q75295q04398p41051o84396o33693n87309
$$ y = [22249626, 23882659, 25717155, 27792472, 30157519, 32873319, 36009521, 39638352, 43833436, 48672372, 54236649, 60609157, 67873567, 76112453, 85396707, 95766583, 107212686, 119666090, 133001980, 147038906, 161476958, 175730326, 188737070, 198974712, 204852348, 205340556, 200428758, 191090168, 178822417, 165116274, 151137209, 137649456, 125067622, 113548934, 103096425, 93647049, 85118401, 77419347, 70452491, 64122211, 58343687, 53050381, 48201094, 43780066, 39783848, 36203607, 33017391, 30193424, 27694767, 25481715, 23515420, 21762053, 20193127, 18783195, 17509867, 16355577, 15306688, 14350626, 13475331, 12670933, 11929882, 11245486, 10611793, 10024484]
55841A0024484n44360n05583m71432m40811m12600l86741l63014l40382l18504
55832F241057k98417k80830k65124k50599k37334k25161k13267k01351j89909
55823D079065j78962j67949j57221j48001j40386j33020j25357j18532j13274
55814B796363j08658j03837r9427r6047r2986q9464q5936q2965p9855p5811p1489
55803A809888o8077o5349o1918n7211n2210m8338m6309m5942m6449m6806m6129
55792A225150m3979m0508l6630l3604l1920l0721k8992k6970k5619k4960k4038
55781H77209k2418k0686j9357j8318j7452j6824j6127j4877j3307j2133j1352
55770F94358j0257q743p455o556n490m249l669m108m968n837p001q455r555j0109
$$ y = [10024484, 9480124, 8974541, 8503109, 8062298, 7649698, 7262957, 6899943, 6559561, 6241057, 5942640, 5661810, 5396686, 5146087, 4908753, 4683592, 4470325, 4268974, 4079065, 3900103, 3732154, 3574933, 3426932, 3286546, 3153526, 3028169, 2909637, 2796363, 2687705, 2583868, 2484441, 2388394, 2295408, 2205944, 2120008, 2037043, 1957188, 1881377, 1809888, 1741811, 1676462, 1614544, 1557333, 1505123, 1456785, 1410476, 1364534, 1318085, 1271279, 1225150, 1181171, 1140663, 1104033, 1070429, 1038509, 1007788, 978796, 951826, 926207, 901247, 877209, 854791, 834105, 814748, 796430, 778978, 762154, 746027, 731150, 717843, 705710, 694358, 684101, 675358, 667903, 661347, 655857, 651608, 647939, 643831, 638863, 633026, 626025, 617570, 608015, 597906]
55756E97906j0673j1287j1116r952q884q846r484j0125j0743j1188j0648q847
55744D76113o863n786n372m884m433m441m489l869k796k076j914j891j746j484
55730D24069j092p92j092j919k333j851j429k150l556m315m167m021m309m445
55716C86598m030l629m027n287o803p799p830p137o528o553o931p075o953o872
55702B99144o756o241n367m582m183m222m818n971p117p493p011o358o068o025
55688B16932n918n782n799n851n514m604l550l116l563m210m132l312k607k546
55674A56428k621k108j137m32k94l19k8N71J032Q79O1q72j295j212j204j585k036
55657A43828k199k164k154k186k266k437k439j836p68nJ76M17J151J700J283L88
$$ y = [597906, 587233, 575946, 564830, 554878, 545994, 537148, 527664, 517539, 506796, 495608, 484960, 476113, 469250, 463464, 458092, 453208, 448775, 444334, 439845, 435976, 433180, 431104, 429190, 427299, 425553, 424069, 422977, 422185, 421093, 419174, 416841, 414990, 413561, 411411, 407855, 403540, 399373, 395352, 391043, 386598, 382568, 378939, 374912, 369625, 362822, 355023, 347193, 340056, 333528, 326975, 320044, 312969, 306016, 299144, 292388, 286147, 280780, 276198, 272015, 267793, 262975, 257004, 249887, 242394, 235383, 229025, 222957, 216932, 211014, 205232, 199433, 193582, 188068, 183464, 179914, 176798, 173235, 169025, 164893, 161581, 158974, 156428, 153807, 151699, 150562, 150130, 149836, 149517, 149489, 150060, 151092, 151971, 152032, 151160, 149865, 148653, 147449, 145864, 143828, 141629, 139465, 137311, 135125, 132859, 130422, 127983, 126147, 125379, 125374, 125550, 125967, 127118, 128818, 130101, 130489]
55641A30489J70P95J228P10m14j328j653j538j355j368j480j262m91N58J523K297
55625A26881K745K554J895J714K622L850M131L414K848L076L486L312K639J991
55611A67158J493R74M72K16K73M76N97M71P3m09o67n11K5O89J100J005O51N96
55593A74682J048J611J918K151K577K920K718K040J339P94K61k96q08j396k137
55578A89422k673k571j992j496j302j284j557k430l752m883n417n432n075m449
55564A45109l914l858m089m048l716l686m164m547m242l441k763k553k726k933
55550I4429k773k174j644j688j965j653p57k59o71j220j025m23m18j221k089k362
55534G2087k027j353n85l1N2k17l89k00K24N56N34R3m76o51k57J60j33j094j891
$$ y = [130489, 130659, 131454, 132682, 133392, 132978, 131650, 129997, 128459, 127104, 125736, 124256, 122994, 122503, 123061, 124584, 126881, 129626, 132180, 134075, 135789, 138411, 142261, 146392, 149806, 152654, 155730, 159216, 162528, 165167, 167158, 168651, 169625, 170097, 170313, 170586, 171062, 171659, 172130, 172203, 171794, 171127, 170616, 170641, 171330, 172430, 173435, 174086, 174682, 175730, 177341, 179259, 181410, 183987, 186907, 189625, 191665, 193004, 193798, 194059, 193763, 192955, 191559, 189422, 186749, 184178, 182186, 180690, 179388, 178104, 176547, 174117, 170365, 165482, 160065, 154633, 149558, 145109, 141195, 137337, 133248, 129200, 125484, 121798, 117634, 113087, 108845, 105404, 102641, 100088, 97362, 94429, 91656, 89482, 87838, 86150, 84185, 82532, 81775, 81516, 80845, 79625, 78600, 78177, 77759, 76538, 74449, 72087, 70060, 68707, 68122, 68091, 68143, 67926, 67537, 67337, 67561, 68117, 68651, 68744, 68268, 67617, 67360, 67520, 67387, 66293, 64402]
55515F4402j858j202n41q4L97R59J285J272J392K099K989L075K009N73k71m47
55499G6049m78n31l39L5N2n08j171j391j254j246j539j801j629j023l98j71l17
55482F2340m41l50l13n38p11m75j03j49n33o05j59L06M65O88J305J973K177J937
55464F6814J565J095M15l01o85o22k57K70Q55J316J522J508J326R91O74O30P25
55447G7841L98n76j578j794j228p20j010k033l056l360k898k356k394k851k966
55432D9419k465j831j473j202q46p15r99j206r04n13o77j177j286r72r02j311
55416C0940j667j537j137q09o17n02m22j82K76M27l34j617k165j404k27J86j85
55399A9024n19l96j67k07m04m34j88J45L04K45J90K80K65j84p64p03K47J378J851
$$ y = [64402, 62544, 61342, 60801, 60717, 61114, 62073, 63358, 64630, 66022, 68121, 71110, 74185, 76194, 76767, 76496, 76049, 75571, 75040, 74701, 74736, 74788, 74280, 73109, 71718, 70464, 69218, 67679, 65878, 64249, 63226, 62828, 62657, 62340, 61899, 61549, 61236, 60698, 59987, 59512, 59409, 59260, 58727, 58122, 57963, 58269, 58734, 59422, 60727, 62700, 64877, 66814, 68379, 69474, 69889, 69588, 68903, 68281, 68024, 68294, 69149, 70465, 71987, 73495, 74821, 75812, 76486, 77116, 77841, 78239, 77663, 76085, 74291, 73063, 72343, 71333, 69300, 66244, 62884, 59986, 57630, 55236, 52385, 49419, 46954, 45123, 43650, 42448, 41602, 40887, 39888, 38682, 37778, 37265, 36588, 35411, 34125, 33153, 32251, 30940, 29273, 27736, 26599, 25790, 25173, 24671, 24249, 24067, 24343, 24770, 24436, 22819, 20654, 19250, 19023, 19209, 19024, 18505, 18109, 17942, 17735, 17331, 16897, 16709, 16854, 17158, 17403, 17593, 17873, 18138, 17954, 17190, 16487, 16734, 18112, 19963]
55380A9963J589J035M51j33n73p34p49p44m70K67J006J053M85J00L10O50N74J83
55362B4263j21k51k75p6L60N99K10m79o48p1N33L92m18j201j474j276q28k57L37
55343A9319Q10J066J119R96P11K79l04j072j909k420k183j236r4P34J125J169
55327A8110Q84L72L1K37Q51J289J147N75k8m60p80j084j355j490j401j137r02
55310A4859q55q76p00l30j47m55r64r96k60O86J040P72P45J566K576K516J219
55293B0396mJ1Q01J034K96n81r13r25r71p83q1O78Q22L86p5l32n81p82n86K3N50
55272A8383O32M42K97J72n2k55k23m8r9n51j148j433j193o66k95k88m52n15m32
55253A2276k63Q3O50J108J003L74k22m11l55k91r5L68P78O33m4o82q52p04o17
$$ y = [19963, 21552, 22587, 23038, 22905, 22332, 21598, 20849, 20105, 19635, 19902, 20908, 21961, 22446, 22546, 22856, 23506, 24080, 24263, 24142, 23891, 23616, 23540, 23900, 24499, 24709, 24230, 23582, 23511, 24044, 24436, 24018, 22817, 21343, 20067, 19239, 18982, 19319, 20129, 21195, 22314, 23310, 24021, 24300, 23996, 22924, 21015, 18595, 16412, 15176, 15082, 15816, 16941, 18110, 18994, 19366, 19397, 19634, 20485, 21774, 22921, 23496, 23468, 23008, 22228, 21144, 19789, 18299, 16898, 15761, 14859, 14004, 13128, 12428, 12098, 11951, 11496, 10532, 9536, 9276, 9962, 11002, 11774, 12519, 14085, 16661, 19177, 20396, 20392, 20403, 21204, 22238, 22534, 21953, 21040, 20115, 19144, 18361, 18280, 18958, 19780, 20166, 20091, 19759, 19178, 18396, 17810, 17833, 18383, 19015, 19457, 19754, 19926, 19874, 19619, 19396, 19348, 19249, 18698, 17550, 16117, 14924, 14258, 13963, 13675, 13223, 12708, 12276, 12013, 12096, 12746, 13854, 14857, 15231, 15009, 14598, 14243, 13952, 13857, 14225, 15003, 15636, 15592, 14910, 14058, 13354, 12737]
55234A2737o60n33J2P65J146P14l34j241j361p12R2M30J70k87l76J05P94J138
55216A2599J055R26J004J076R14P54R32J281J282P55J9o05j094j463j586j409
55200A6440j141r80q60n80p3N26J005J187J043O84J98l75q00o59J09Q48Q69L97
55182A7838K65P09J058P69J29l97q91j533j961j686q47j2N30Q21Q51O87P17J095
55164A8142J205L43j107j949j662r05m25k17L2L03M37N07O32P87R65J175J175
55147A9438O89O1J1N37P41J51m92l46K98O01M61L47L09L9k62r8L29K42n04j201
55127B1351j382j289j052k94R96K000K033J427R01N46jp24j211j235q79k95K26
55110B1118K07n08j298j359o88j4J64P6J55M37N88K61n88j573k079j805j039k62
$$ y = [12737, 12077, 11544, 11556, 12321, 13467, 14181, 13847, 12606, 11245, 10533, 10625, 11055, 11225, 10938, 10562, 10667, 11461, 12599, 13654, 14580, 15584, 16660, 17574, 18328, 19260, 20541, 21823, 22578, 22597, 21992, 20898, 19435, 17849, 16440, 15299, 14319, 13459, 12879, 12806, 13332, 14337, 15524, 16567, 17251, 17449, 17074, 16274, 15615, 15724, 16572, 17441, 17838, 18103, 18812, 19870, 20639, 20768, 20371, 19480, 17947, 15986, 14300, 13453, 13441, 13971, 14792, 15643, 16330, 17047, 18142, 19347, 19690, 18583, 16634, 14972, 14067, 13642, 13425, 13457, 13760, 14197, 14704, 15336, 16123, 17088, 18263, 19438, 20127, 20188, 20199, 20736, 21477, 21628, 21136, 20790, 21088, 21689, 22150, 22497, 22806, 22845, 22583, 22485, 22814, 23056, 22552, 21351, 19969, 18680, 17628, 17334, 18330, 20330, 22363, 23790, 24691, 25237, 25236, 24512, 23301, 22066, 21187, 20892, 21118, 21325, 20817, 19519, 18160, 17472, 17458, 17622, 17698, 17853, 18290, 18878, 19139, 18551, 16978, 14899, 13094, 12055, 11793]
55092A1793L54P94Q78N17J02J30M72O13N37P39J261J414P76q0l58o2K14J76Lj37
55072B0136j90K2N99J147J141O91M40N64M32m44j526j812j056nN29M71K38J27
55054B1504J18J06M8j34m17m69J64J444K620K964K596K191J958J408K98p25q81
55037C4793l29J26K18M81J208J800J501M66m27o26m29m06o83r15q18m71j51j3
55019C5325k0q7j26J6L82O55L63m75j124r47k26K68L89P16J427J751R97l80j266
55000C7638j180n83o7K09K77J16j77l53k89r7J14L04K91j54q74j336j264r50p00
54981C0925l83J55N29K80k49j81O66J320Q55l90j227j091n64l98n34l36M25J239
54963C1041J490J150P19O04P03O10J96j51L0O69J227J359J246J142Q91K57m74
$$ y = [11793, 12147, 12941, 13819, 14336, 14438, 14568, 15040, 15653, 16190, 16929, 18190, 19604, 20380, 20300, 19942, 19880, 20094, 20270, 20273, 20136, 19946, 19968, 20567, 21714, 22855, 23546, 23986, 24550, 24982, 24538, 23012, 21200, 20144, 20139, 20668, 21139, 21377, 21504, 21622, 21728, 21776, 21642, 21225, 20756, 20920, 22364, 24984, 27948, 30544, 32735, 34693, 36101, 36399, 35674, 34793, 34464, 34590, 34808, 35289, 36497, 38297, 39798, 40264, 39837, 39211, 38782, 38376, 37693, 36778, 35960, 35489, 35338, 35325, 35305, 35218, 35092, 35108, 35490, 36145, 36508, 36033, 34909, 33962, 33736, 34004, 34393, 35109, 36536, 38287, 39284, 38904, 37638, 36458, 35875, 35808, 36017, 36294, 36410, 36233, 35880, 35591, 35494, 35608, 35912, 36203, 36049, 35175, 33839, 32575, 31625, 30925, 30542, 30697, 31226, 31506, 31257, 31076, 31742, 33062, 33917, 33527, 32300, 31209, 30645, 30247, 29713, 29377, 29802, 31041, 32531, 33681, 34400, 35004, 35707, 36317, 36513, 36362, 36392, 37061, 38288, 39647, 40893, 42035, 42926, 43183, 42709]
54946D2709o47j32M15K99m24j060r60J4J389K303K098R73j45n18j91L61Q15R47
54928D8246N32k80p48l43M48O38L9o20p69o18n09l41M5L65K77r9l55l60k78j85
54908D5085K6K97K96j84p54o05O11K097K490J427J33N7J135K031J918J280R11
54891E8251J006J436K192L054L474L343L326L987M978N692O156O686P196P508
54877A18285P942Q663Q830P425M835K621J554Q91k35j660k935m297o123p945q774
54862A29077q281p109o066n470n173m892m488m071l782l446k709j674j014j113
54848F9789j375q68M58J681K097K032K280K990L564L565L378L785N017O500P517
54833A12410P822P521O705N467M089K787J422k72k155l781m961n881o622o956
$$ y = [42709, 42062, 41930, 42345, 42644, 42220, 41160, 40200, 40214, 41603, 43906, 46004, 46977, 46832, 46314, 46123, 46484, 47299, 48246, 48778, 48498, 47750, 47407, 47855, 48493, 48532, 47912, 47143, 46525, 46016, 45675, 45720, 46085, 46362, 46263, 45908, 45548, 45270, 45085, 45111, 45408, 45704, 45520, 44766, 44161, 44772, 46869, 49359, 50786, 50919, 50976, 52111, 54142, 56060, 57340, 58251, 59257, 60693, 62885, 65939, 69413, 72756, 76082, 80069, 85047, 90739, 96895, 103581, 110777, 118285, 126227, 134890, 143720, 151145, 155980, 158601, 160155, 161046, 160811, 159151, 156216, 151919, 145796, 137851, 129077, 120796, 113687, 107621, 102151, 96978, 92086, 87598, 83527, 79745, 76299, 73590, 71916, 70902, 69789, 68414, 67546, 68004, 69685, 71782, 73814, 76094, 79084, 82648, 86213, 89591, 93376, 98393, 104893, 112410, 120232, 127753, 134458, 139925, 144014, 146801, 148223, 147951, 145796, 142015, 137054, 131173, 124551, 117595]
54819A17595o708o045n212m362l760l770m363m910m858m420m297m690m913m038
54805E1249j982K26J309R66J01k65m4J50l2m17p94j076r78k33P69J151N97k71
54787E0426p62r07j063j314j583j784j622p71M05R13M09k45k98k38q13j566j487
54770C7700p19m23r34j286p67J33O81Q77R44O85j4n82l82M14J086J274J128Q46
54752D0661M80J55M0J82N41J060J523J560J103O09N59Q77J145J209J268J475J797
54735E6244K237K845L467L804L821L857M197M683M965N053N321N944O603O918
54721A19959O960P046P060O513N306L985K899J577n54l086m882n290m645l661
54707A39187k878k676l097l560l402k886k943l728m146l358k002j222r93l57R79
$$ y = [117595, 110887, 104842, 99630, 95268, 91508, 87738, 83375, 78465, 73607, 69187, 64890, 60200, 55287, 51249, 49267, 49493, 50802, 51768, 51869, 51604, 51560, 51710, 51678, 51261, 50467, 49391, 48413, 48180, 48949, 50100, 50697, 50426, 49664, 48757, 47694, 46380, 44797, 43013, 41391, 40620, 41025, 41938, 42347, 42102, 41804, 41566, 40753, 39187, 37700, 36981, 36558, 35624, 34338, 33571, 33704, 34385, 35262, 36206, 36891, 36877, 36295, 35913, 36327, 37413, 38687, 39815, 40661, 41141, 41296, 41336, 41518, 42059, 43119, 44642, 46202, 47305, 47914, 48473, 49350, 50495, 51704, 52972, 54447, 56244, 58481, 61326, 64793, 68597, 72418, 76275, 80472, 85155, 90120, 95173, 100494, 106438, 113041, 119959, 126919, 133965, 141025, 147538, 152844, 156829, 159728, 161305, 160751, 157665, 152783, 147493, 142848, 139187, 136309, 133633, 130536, 126976, 123574, 120688, 117745, 114017, 109871, 106513, 104511, 103289, 102296, 101939, 102918]
54692A02918K191K563K379K349K760L471M328N201N840O076O131O513P537Q916
54678A69173R857R694Q553P264O407N666M224J784j161l873n866o980p359p456
54664A89927p696q043q122p845p569p530p475p121o681o586o747o452n152l205
54650I3703j695j494k456l556l810l105k103j437j164r85p42n23m14l52k84k86
54634F9297l98m74l69k09k56m76m76o3L81L65m4l66m12l87l07J33R04J365J055
54615F9263L57m9r8j83k76R1J010J902K304K415K623K855K784K394J991J722J445
54598I2550J058P21O57Q86J253J611J869J938J694J122M45l3j41J08O54J367J961
54581A09720K154K043K062K393K735K836L056L981N558P034P767P823P746P956
$$ y = [102918, 105109, 107672, 110051, 112400, 115160, 118631, 122959, 128160, 134000, 140076, 146207, 152720, 160257, 169173, 179030, 188724, 197277, 204541, 210948, 216614, 220838, 222622, 221461, 217588, 211722, 204742, 197383, 189927, 182231, 174188, 166066, 158221, 150652, 143122, 135647, 128526, 121845, 115259, 108512, 102060, 96908, 93703, 92008, 90514, 88058, 84502, 80692, 77587, 75484, 74047, 72883, 71898, 71156, 70633, 70219, 69867, 69583, 69297, 68899, 68425, 68056, 67847, 67591, 67115, 66639, 66576, 66957, 67322, 67278, 66912, 66500, 66113, 65806, 65939, 66843, 68208, 69263, 69620, 69571, 69473, 69290, 69014, 69105, 70115, 72017, 74321, 76736, 79359, 82214, 84998, 87392, 89383, 91105, 92550, 93608, 94329, 94986, 95872, 97125, 98736, 100605, 102543, 104237, 105359, 105804, 105771, 105630, 105738, 106392, 107759, 109720, 111874, 113917, 115979, 118372, 121107, 123943, 126999, 130980, 136538, 143572, 151339, 159162, 166908, 174864]
54567A74864Q412Q783Q742Q192P190N659L466Q74j382k797l692m757o107p206
54553B00241p628p482p052o515o102o068o310o309n701m723l908l584l668l832
54539A21359l732l305k870k737k790k682k402k242k286k325k285k257k102j577
54525H5767r57q92j478k030k103k119k539k987k802k045j347j071j129j402j785
54510E9081k000j867j566j232n46O81J799J883R24k41j040j535j727j332m37L16
54494E1161N04L86L33L35L33N30R75J258J042N34J43p0k76m96o20o15m49n7M14
54475E5365O33N85P04J205J681J731J597J678J818J713J717K444L628M235L894
54460H4628L396L443L605L155K346K076K553L042K944K428J825J039j47j545k777
$$ y = [174864, 183276, 192059, 200801, 208993, 216183, 221842, 225308, 226182, 224800, 222003, 218311, 213554, 207447, 200241, 192613, 185131, 178079, 171564, 165462, 159394, 153084, 146775, 141074, 136351, 132443, 128859, 125191, 121359, 117627, 114322, 111452, 108715, 105925, 103243, 100841, 98599, 96313, 93988, 91703, 89446, 87344, 85767, 84810, 83918, 82440, 80410, 78307, 76188, 73649, 70662, 67860, 65815, 64468, 63397, 62268, 60866, 59081, 57081, 55214, 53648, 52416, 51870, 52551, 54350, 56233, 57157, 56916, 55876, 54341, 52614, 51282, 50845, 51161, 51665, 52051, 52384, 52719, 53052, 53582, 54557, 55815, 56857, 57391, 57534, 57464, 57188, 56692, 56072, 55457, 55008, 54951, 55365, 55998, 56583, 57287, 58492, 60173, 61904, 63501, 65179, 66997, 68710, 70427, 72871, 76499, 80734, 84628, 88024, 91467, 95072, 98227, 100573, 102649, 105202, 108244, 111188, 113616, 115441, 116480, 116333, 114788, 112011]
54445A12011l698m307m437l924k989k136j741j878k383k834k711j977j332j423
54431G4241j917j958j398r17q61q29o70r70j911k493j784m11K31m0j20N89J410
54414F0192J626J468J396J300R09M36J94Q4n7l4K34L06j49o60n16J98P55Q20O80
54395F9182N90M78K98K00J64l0m04p16q27q51q49p75p19q90j232j411j233q34
54377F0141l72J03L97K08m41j086j315j119o85j95K7l74j224j762j498q27l82
54360D9596l9Q20K173L146L108K443J928J696J275M85k05k83J39N04M68J87J5
54343F7456Q1K20K19Q6J23O78J710K639K879K569K496L068L624L165J682K73j85
54326I2783RN1k04k02L06Q32Q14K53m84j171j703j889j626j205j071j260j405
$$ y = [112011, 108313, 104006, 99569, 95645, 92656, 90520, 88779, 86901, 84518, 81684, 78973, 76996, 75664, 74241, 72324, 70366, 68968, 68051, 67190, 66361, 65691, 64721, 62810, 60317, 58533, 58122, 58353, 58313, 58193, 58782, 60192, 61818, 63286, 64682, 65982, 66891, 67327, 67521, 67605, 67548, 67514, 67748, 68054, 67905, 67245, 66729, 66927, 67682, 68502, 69182, 69772, 70250, 70548, 70748, 70912, 70882, 70478, 69762, 68935, 68084, 67235, 66460, 65741, 64851, 63619, 62208, 60975, 60141, 59769, 59872, 60269, 60477, 60036, 58950, 57635, 56516, 55831, 55636, 55663, 55289, 54065, 52303, 50805, 49978, 49596, 49557, 50377, 52550, 55696, 58804, 61247, 63175, 64871, 66146, 66631, 66426, 66143, 66282, 66786, 67254, 67441, 67456, 67537, 67757, 67976, 68062, 68185, 68863, 70573, 73212, 76091, 78660, 81156, 84224, 87848, 91013, 92695, 92968, 92783, 92792, 92843, 92639, 92437, 92743, 93575, 94389, 94642, 94158, 92987, 91284, 89395, 87769, 86564, 85493, 84233, 82828]
54309H2828j336j340j659k045k044j575r39m18j26j41m29o95n86j16L82O57P22
54292G1140O21L99K96O11J181J422J111P50Q79J332J532J314J016R12R73J128
54276H6617J359J530J417R65K64n84j298j364o18K20J80p15j497j591j501j826
54260H1558k284k244j770j486j631j902k076k188k110j535n95P6O6l14o26r41
54244E9998j516k039j861r86l46o71j455j532o34J92p2j156j945j872j264n61
54228D2280J08N36L70k70o53l41J68J69k95o94q93j130j318j042k62N67J156J591
54210D0047J791J414N24j72j88M0j89q00j035m57N24J178J141O25J53J32N00P49
54192D5977N21R4N2N05Q69N99j10n62l92K0O9l51p41o05jO08Q71Q00N60K66J8
$$ y = [82828, 81492, 80152, 78493, 76448, 74404, 72829, 71890, 71472, 71346, 71205, 70776, 70081, 69495, 69379, 69761, 70418, 71140, 71761, 72160, 72456, 73067, 74248, 75670, 76781, 77531, 78410, 79742, 81274, 82588, 83604, 84516, 85489, 86617, 87976, 89506, 90923, 91888, 92152, 91568, 90270, 88906, 88288, 88508, 88688, 87973, 86476, 84885, 83384, 81558, 79274, 77030, 75260, 73774, 72143, 70241, 68165, 65977, 63867, 62332, 61737, 61813, 61879, 61565, 60939, 59998, 58482, 56443, 54582, 53596, 53250, 52579, 51124, 49592, 48958, 49150, 49078, 47922, 45977, 44105, 42841, 42280, 42388, 42924, 43294, 43024, 42371, 42030, 42198, 42367, 42072, 41378, 40485, 39355, 38037, 36995, 36733, 37300, 38456, 40047, 41838, 43252, 43776, 43604, 43416, 43456, 43267, 42467, 41432, 40975, 41499, 42677, 43818, 44443, 44596, 44728, 45228, 45977, 46498, 46592, 46644, 47149, 48018, 48617, 48507, 47945, 47553, 47573, 47642, 47291, 46550, 45945, 45944, 46552, 47423, 48223, 48783, 49049, 49067]
54171D9067n5P8K78L86M03M06M27M67N63O88O97M64L5l82n24j47P24J539J473
54152E6587K71j210j697q57K85M20o53j863k036j117r6J57j55j81L78Q54N79j55
54134D9511n18k73L6L4J2K45L72r2r19j377j140n05J89Q49J282J098K85m71m93
54115D8125J05O09N52J6o97j326j557j200n73l25o64j010p38nM78L98J81L12O36
54096D3317N27k83j290j685j274p22p50j239j449j108p41p61p45j20Q03J154P10
54079C4344J33j11l43r37j538j470o62K90P77O38O6n65q96p48j54P28J575J864
54061C2991J346N22K05L70J18r16j744j262K12J363J503R55J34p94j346q54M96
54044C3299J533J459P45K99L17L86K42o6m18o13l73K24O02M01ln2K03L18J64k1
$$ y = [49067, 49012, 49090, 49368, 49754, 50157, 50563, 50990, 51457, 52020, 52708, 53405, 53869, 53904, 53522, 52998, 52851, 53575, 55114, 56587, 56858, 55648, 53951, 53094, 53379, 53799, 53146, 51283, 49247, 48130, 48034, 48191, 48036, 47855, 48233, 49087, 49666, 49511, 48993, 48720, 48756, 48790, 48802, 49047, 49419, 49327, 48408, 47031, 45891, 45386, 45575, 46424, 47706, 48804, 49089, 48618, 48125, 48230, 48839, 49391, 49407, 48710, 47384, 45827, 44627, 44054, 43729, 43065, 42055, 41317, 41312, 41790, 42188, 42369, 42681, 43317, 43844, 43561, 42271, 40586, 39312, 38590, 37840, 36601, 35152, 34044, 33303, 32542, 31797, 31677, 32480, 33634, 34344, 34477, 34366, 34023, 33086, 31548, 30078, 29416, 29706, 30483, 31121, 31187, 30622, 29726, 28978, 28824, 29552, 31127, 32991, 34337, 34859, 35064, 35434, 35552, 34636, 32892, 31630, 31842, 33205, 34708, 35663, 35797, 35003, 33657, 32803, 33299, 34832, 36291, 37036, 37335, 37652, 38038, 38280, 38214, 37796, 37183, 36810, 37034, 37636, 38037, 38034, 37982, 38185, 38503, 38667, 38646]
54024C8646r0j3L78J099J658J544J046R44J378J608J096K60j44M0M08O10N20K2
54006E1010q86j779j931j008N15J731K084J747J257R16O35L10R1J72M63O81O73
53989E6681N53N18O64R38J192J334J468J795K299K704K822K788K814K887K880
53974H4337K695K274J717J596K596M491N879N625M222L222L401M200M781M856
53960A35892M430L558K597K054J865J372L24o45q88n43r1L17O22M79l09j299j931
53943A47804k243k554k744k488j997j864k190k470k406k259k315k443k431k372
53929A15028k475k704k807k562j996j417j208j429j696j585j065m23Q0K56l6o59
53913I3302j143j174j002r81r57n38J80O86Q36R18J014Q66M84K61L16K87L9NM77
$$ y = [38646, 38556, 38543, 38921, 40020, 41678, 43222, 44268, 45212, 46590, 48198, 49294, 49554, 49410, 49450, 49858, 50468, 50988, 51010, 50124, 48345, 46414, 45406, 45921, 47652, 49736, 51483, 52740, 53656, 54291, 54601, 54692, 54864, 55327, 56008, 56681, 57234, 57752, 58416, 59354, 60546, 61880, 63348, 65143, 67442, 70146, 72968, 75756, 78570, 81457, 84337, 87032, 89306, 91023, 92619, 95215, 99706, 105585, 111210, 115432, 118654, 122055, 126255, 131036, 135892, 140322, 143880, 146477, 148531, 150396, 151768, 152092, 151447, 150559, 150016, 149925, 150242, 150864, 151343, 151034, 149735, 147804, 145561, 143007, 140263, 137775, 135778, 133914, 131724, 129254, 126848, 124589, 122274, 119831, 117400, 115028, 112553, 109849, 107042, 104480, 102484, 101067, 99859, 98430, 96734, 95149, 94084, 93661, 93741, 93997, 93961, 93302, 92159, 90985, 89983, 89002, 88045, 87507, 87687, 88373, 89209, 90127, 91141, 92007, 92491, 92752, 93068, 93355, 93394, 93399, 93876]
53894I3876J032J105P75N42O26Q66J045R84N38p6k71K18Q82J098R71J006J185
53877A06402J101Q89J239K279L206L405L308L663M365M659M246L526K853K149
53863A47290J420J042J214J574J734J931K579L393L575K963K411K663L317L467
53849A80573L034K836L320L903L857L311K942K988L063K847K483K212K001J663
53835B21033J105L35n71j417j929k045j972j908j837j813k159l139m493n561n868
53820A87761n483m787m264m274m758n075m606l631l129l519m029l728k794k191
53806A31493k388l054l745m206m041k996j649j067j418j756j503j311j828k424
53792I8107k125j225r50j706k634k891k447j583m91M25O10N9o36j111j559k019
$$ y = [93876, 94908, 96013, 96788, 97330, 97956, 98822, 99867, 100851, 101389, 101313, 101042, 101260, 102142, 103240, 104211, 105217, 106402, 107503, 108392, 109631, 111910, 115116, 118521, 121829, 125492, 129857, 134516, 138762, 142288, 145141, 147290, 148710, 149752, 150966, 152540, 154274, 156205, 158784, 162177, 165752, 168715, 171126, 173789, 177106, 180573, 183607, 186443, 189763, 193666, 197523, 200834, 203776, 206764, 209827, 212674, 215157, 217369, 219370, 221033, 222138, 222473, 221902, 220485, 218556, 216511, 214539, 212631, 210794, 208981, 206822, 203683, 199190, 193629, 187761, 182278, 177491, 173227, 168953, 164195, 159120, 154514, 150883, 147754, 144235, 140206, 136478, 133684, 131493, 129105, 126051, 122306, 118100, 114059, 111063, 109414, 108347, 106929, 105173, 103670, 102359, 100531, 98107, 95982, 94757, 93807, 92101, 89467, 86576, 84129, 82546, 82055, 82480, 83090, 83149, 82513, 81402, 79843, 77824]
53776G7824k110j724j390j484j660j433q71k90K53P38R33P50M82L08P7j10K90
53759G0583J309J984J539N41P5K29L15K48N83J266J481R90O07R86J690J979J808
53742H8213J545J270R74J005J702K764L505L706L757M007M254M041L276K466K255
53727A28740K676L020K671J940J661K053K381J946R16l2m66l88O8O22Q33L94n76
53710A48459j678k534k882k689k314k250k466k363j693j075j217j953k561k746
53696A18038k705k433j718q14l89o12q57o06j45L4K7K80Q42J306J385J167Q53
53679A13653N24J64k85q74j495j821j584q65j1O41Q09L08o86j534j682j309j063
53662A02890j228j457j437j309j230r17j02Q30J160P95M69Q04J515J827J516J133
$$ y = [77824, 75714, 73990, 72600, 71116, 69456, 68023, 67152, 66862, 67115, 67853, 68786, 69536, 70018, 70326, 70403, 70293, 70583, 71892, 73876, 75415, 75956, 76031, 76260, 76575, 76823, 77406, 78672, 80153, 81143, 81750, 82736, 84426, 86405, 88213, 89758, 91028, 92002, 93007, 94709, 97473, 100978, 104684, 108441, 112448, 116702, 120743, 124019, 126485, 128740, 131416, 134436, 137107, 139047, 140708, 142761, 145142, 147088, 148004, 147972, 147506, 147118, 147186, 147808, 148641, 149035, 148459, 146781, 144247, 141365, 138676, 136362, 134112, 131646, 129283, 127590, 126515, 125298, 123345, 120784, 118038, 115333, 112900, 111182, 110368, 109979, 109367, 108510, 107904, 107759, 107793, 107820, 108100, 108942, 110248, 111633, 112800, 113653, 114177, 114341, 114056, 113182, 111687, 109866, 108282, 107417, 107406, 108047, 108856, 109164, 108478, 106944, 105262, 103953, 102890, 101662, 100205, 98768, 97459, 96229, 95312, 95210, 96040, 97200, 97995, 98464, 99268, 100783, 102610, 104126, 105259]
53646A05259J224J634J858J834K004K487K668J943O71j26jM91P15Q32J378K292
53630A27163K924K867K378J940J762J783J871J898J859J920K152K258J848J086
53616A55709O22P99J114P78l39j500j848j264n34n77j428k104j747o71K4k14r07
53599A45913j410j622j630j252m28L08L19l21q96r09n09r3J83L87N25M13n3n47
53581A38378m38M39J315J267M62K9N16J206J268R38R34J277J385J093P72O46O78
53564A52165R61J562K065J953J402J038R80Q33O12Q26J464J751J310Q59J259K308
53548A73348L043K873K060J321J313K258L643M536M422L659K986K789K932L046
53534B14229K860K498K469L093L842L760K621J259N36M42M61M03M84Q53J345J582
$$ y = [105259, 106483, 108117, 109975, 111809, 113813, 116300, 118968, 120911, 121582, 121456, 121455, 121946, 122661, 123493, 124871, 127163, 130087, 132954, 135332, 137272, 139034, 140817, 142688, 144586, 146445, 148365, 150517, 152775, 154623, 155709, 156331, 157130, 158244, 159022, 158683, 157183, 155335, 154071, 153537, 152960, 151532, 149428, 147681, 147010, 147034, 146820, 145913, 144503, 142881, 141251, 139999, 139571, 139879, 140198, 139877, 138981, 138072, 137563, 137470, 137653, 138040, 138565, 138978, 138925, 138378, 137940, 138379, 139694, 140961, 141423, 141452, 141968, 143174, 144442, 145380, 146314, 147591, 148976, 150069, 150841, 151487, 152165, 153126, 154688, 156753, 158706, 160108, 161146, 162126, 162959, 163571, 164397, 165861, 167612, 168922, 169781, 171040, 173348, 176391, 179264, 181324, 182645, 183958, 186216, 189859, 194395, 198817, 202476, 205462, 208251, 211183, 214229, 217089, 219587, 222056, 225149, 228991, 232751, 235372, 236631, 237167, 237609, 238070, 238473, 238957, 239810, 241155, 242737]
53518B42737J248M87L5M03J071J063M17J59O56R49K93o07p80m98n51o42J34J517
53500B48091K159J581Q19P68R51N61j69l33L54J372K227K878L362L482L059K280
53484B73442J621J458J704J977K075K096K087J898J593J600K081K507K355K024
53470C00518K365L499M670N290N494N572N528N381N395N674O022O357O829P397
53456C75991P768Q064Q847J0170J1157J1116J0636J0841J1841J2688J2816J2776
53444E04711J3299J4239J4921J5213J5665J6610J7622J8078J8010J7991J8337
53433F84696J8791J9055J9171J9162J8770J7946J7277J7385J8027J8328J7874
53422H86482J7095J6609J6652J7156J7862J8200J7689J6643J5996J6178J6610
$$ y = [242737, 243985, 244472, 244507, 244910, 245981, 247044, 247461, 247620, 248276, 249225, 249518, 248911, 248131, 247633, 247082, 246440, 246574, 248091, 250250, 251831, 252650, 253418, 254369, 254930, 254761, 254428, 254782, 256154, 258381, 261259, 264621, 268103, 271162, 273442, 275063, 276521, 278225, 280202, 282277, 284373, 286460, 288358, 289951, 291551, 293632, 296139, 298494, 300518, 302883, 306382, 311052, 316342, 321836, 327408, 332936, 338317, 343712, 349386, 355408, 361765, 368594, 375991, 383759, 391823, 400670, 410840, 421997, 433113, 443749, 454590, 466431, 479119, 491935, 504711, 518010, 532249, 547170, 562383, 578048, 594658, 612280, 630358, 648368, 666359, 684696, 703487, 722542, 741713, 760875, 779645, 797591, 814868, 832253, 850280, 868608, 886482, 903577, 920186, 936838, 953994, 971856, 990056, 1007745, 1024388, 1040384, 1056562, 1073172]
53411A073172J6550J5934J5089J4131J3052J2003J0993R716Q116O783O223O013
53399A207775N248L720K033O26o85k193l816n339o713p942q927r590j0004j0337
53385A153856j0790j1575j2711j3915j4849j5392j5514j5098j4191j3317j3035
53374A003469j3246j3371j3171j2927j2722j2128j0865r322q053p115o264n480
53362H78805m916m471l874l139k549k187j773j000J88J722L463N062O074O394
53348H77799O518P134Q472J0174J1710J2782J3431J3952J4762J6208J8349K0906
53336A032197K3379K5235K6069K5925K5457K5558K6605K8208K9831L1416L3120
53325A333000L4637L5394L5403L5404L5896L6477L6570L6384L6621L7336L7718
$$ y = [1073172, 1089722, 1105656, 1120745, 1134876, 1147928, 1159931, 1170924, 1180640, 1188756, 1195539, 1201762, 1207775, 1213023, 1216743, 1218776, 1219402, 1218717, 1216524, 1212708, 1207369, 1200656, 1192714, 1183787, 1174197, 1164193, 1153856, 1143066, 1131491, 1118780, 1104865, 1090016, 1074624, 1059110, 1044012, 1029821, 1016504, 1003469, 990223, 976852, 963681, 950754, 938032, 925904, 915039, 905717, 897664, 890549, 884285, 878805, 873889, 869418, 865544, 862405, 859856, 857669, 855896, 854896, 855084, 856806, 860269, 865331, 871405, 877799, 884317, 891451, 899923, 910097, 921807, 934589, 948020, 961972, 976734, 992942, 1011291, 1032197, 1055576, 1080811, 1106880, 1132805, 1158262, 1183820, 1210425, 1238633, 1268464, 1299880, 1333000, 1367637, 1403031, 1438434, 1473838, 1509734, 1546211, 1582781, 1619165, 1655786, 1693122, 1730840]
53314A730840L7062L5539L3814L2272L0866K9380K7571K5181K2162J8887J5945
53303B039519J3606J1566R283O524L506M86k611n919r090j1503j3232j5414j8970
53290B007751k3224k6422k7736k8083k8715k9730l0462l0796l1251l2015l2648
53279A686669l2790l2547l2084l1399l0684l0347l0413l0333k9693k8784k8111
53268A349484k7621k6841k5511k3779k1938k0317j9267j8843j8521j7666j6298
53257A112882j5069j4390j4021j3587j3225j3353j3911j4163j3375j1656r941
53246I66191r013q667q078o960n843n102m226k615o01R38J839K706L773M554M828
53231I33724N177O094P198P922Q500R610J1313J2944J3945J4335J4444J4601J5049
$$ y = [1730840, 1767902, 1803441, 1837255, 1869527, 1900393, 1929773, 1957344, 1982525, 2004687, 2023574, 2039519, 2053125, 2064691, 2073974, 2080498, 2084004, 2084490, 2081879, 2075960, 2066870, 2055367, 2042135, 2026721, 2007751, 1984527, 1958105, 1930369, 1902286, 1873571, 1843841, 1813379, 1782583, 1751332, 1719317, 1686669, 1653879, 1621332, 1589248, 1557849, 1527165, 1496818, 1466405, 1436072, 1406379, 1377595, 1349484, 1321863, 1295022, 1269511, 1245732, 1223794, 1203477, 1184210, 1165367, 1146846, 1129180, 1112882, 1097813, 1083423, 1069402, 1055815, 1042590, 1029237, 1015326, 1001163, 987788, 976132, 966191, 957178, 948511, 940433, 933473, 927630, 922528, 918302, 915687, 915086, 916024, 917863, 920569, 924342, 928896, 933724, 938901, 944995, 952193, 960115, 968615, 978225, 989538, 1002482, 1016427, 1030762, 1045206, 1059807, 1074856]
53218A074856J5742J6276J6335J6098J5901J5651J5010J4035J3105J2195J0760
53207A235964Q564O158M248K847J372n02k363l487l686l647m375o203q483j0278
53193A216129j1279j1891j2690j3910j5327j6421j6820j6771j6972j7712j8443
53182A047893j8486j7846j7016j6240j5541j5164j5386j5939j6192j5927j5402
53171H68754j4733j3861j3073j2904j3314j3629j3410j2869j2264j1488j0557
53160G26652r854r546r269q779q348q179p901p159o325o058o529p399q309q948
53146F14049r009q489p869p540p378p178p131p371p511p174o729o824p394p781
53132E08671p693p414p135o728o236o011o199o641p302q245r058q942p703o267
$$ y = [1074856, 1090598, 1106874, 1123209, 1139307, 1155208, 1170859, 1185869, 1199904, 1213009, 1225204, 1235964, 1244528, 1250686, 1254934, 1257781, 1259153, 1258651, 1256288, 1252801, 1249115, 1245468, 1241093, 1234890, 1226407, 1216129, 1204850, 1192959, 1180269, 1166359, 1151032, 1134611, 1117791, 1101020, 1084048, 1066336, 1047893, 1029407, 1011561, 994545, 978305, 962764, 947600, 932214, 916275, 900083, 884156, 868754, 854021, 840160, 827087, 814183, 800869, 787240, 773830, 760961, 748697, 737209, 726652, 716798, 707252, 697983, 689204, 680856, 672677, 664776, 657617, 651292, 645234, 638705, 631306, 622997, 614049, 605040, 596551, 588682, 581142, 573764, 566586, 559455, 552084, 544573, 537399, 530670, 523846, 516452, 508671, 500978, 493564, 486429, 479701, 473465, 467454, 461255, 454614, 447312, 439067, 430009, 421067, 413364, 407097]
53118D07097n740o195o777o854o649o669o816o489n520m652m696n447n942n864
53104C22787n907o455o676n679m089l453m211n206n322m718m118l727l323k946
53090B56957k816k950l234l672m121m088l264k158j669k046k676k889k669k413
53076B16292k348k394k417k405k391k353k249k041j762j551j596j912k212k134
53062A86527j712j386j433j530j216o59n36j078j722j884j679j510j392j148j002
53047A66640j409k251k827k697k153j681j370j060p41n28m29m06n21q13j070j015
53031A45669o63l25j61N1N28J025J082O60K76L47O40P32O78Q66J364J863K238
53014A56870K588K744K299J309L80j31m62p47o57j19J80l82j501k406k776k700
$$ y = [407097, 401357, 395162, 388385, 381531, 374882, 368213, 361397, 354908, 349388, 344736, 340040, 334593, 328651, 322787, 316880, 310425, 303749, 298070, 293981, 290528, 286317, 281111, 275789, 271071, 266953, 263226, 259903, 256957, 254141, 251191, 247957, 244285, 240164, 236076, 232812, 230654, 228985, 226939, 224263, 221374, 218705, 216292, 213944, 211550, 209133, 206728, 204337, 201984, 199735, 197694, 195932, 194381, 192785, 190873, 188661, 186527, 184815, 183429, 181996, 180466, 179250, 178591, 178055, 176977, 175255, 173371, 171692, 170182, 168790, 167642, 166640, 165231, 162980, 160153, 157456, 155303, 153622, 152252, 151192, 150451, 149923, 149494, 149088, 148567, 147754, 146684, 145669, 145006, 144681, 144520, 144571, 145099, 146124, 147206, 147866, 148142, 148489, 149129, 149861, 150539, 151405, 152769, 154632, 156870, 159458, 162202, 164501, 165810, 166190, 166059, 165597, 164850, 164193, 164074, 164254, 163872, 162371, 159965, 157189, 154489]
52998A54489k286j895k202l241l910l328k181j757k013j903j359j469k464l002
52984A21479k150q41n04j031j194n59k0m65j677k670k704j917j111q97j064r96
52968A01679n66k30k52l62l79n59j062j548j631j351r05l37J91K50k93r29j078
52951I0638p80m85l88k93L2N88J068R80J10r78j259l31J083J835J434L62m72n35
52933I2609j99l20j034j369o36L07J31q43r92J09R90O17n7K29J020J033J93m98
52915I1290n56k99L1L41K74k79o01j11M95K48l51M0J385K132J523O30O61J370
52897I8223J778J559J000L11m11q98r37n49K19J272K100K092J457J205J854K739
52881A13014L005K741K575K720K901K941K825K417J648R03P38J283K203L142L889
$$ y = [154489, 152203, 150308, 148106, 144865, 140955, 137627, 135446, 133689, 131676, 129773, 128414, 126945, 124481, 121479, 119329, 118488, 117984, 116953, 115759, 115200, 115180, 114715, 113038, 110368, 107664, 105747, 104636, 103739, 102675, 101679, 101113, 100883, 100631, 100269, 99890, 99331, 98269, 96721, 95090, 93739, 92834, 92497, 92688, 92938, 92645, 91716, 90638, 89858, 89373, 88985, 88692, 88724, 89312, 90380, 91360, 91470, 90492, 89233, 88902, 89985, 91820, 93254, 93616, 93144, 92609, 92410, 92090, 91056, 89687, 89051, 89358, 89489, 88646, 87654, 87763, 88753, 89370, 89313, 89542, 90562, 91595, 91788, 91290, 90734, 90435, 90466, 90807, 91081, 90802, 90201, 90090, 90585, 90833, 90482, 90522, 91907, 94039, 95562, 96192, 96853, 98223, 100001, 101560, 102560, 102871, 102460, 101562, 100625, 100076, 100295, 101567, 103667, 105759, 107216, 108421, 110275, 113014, 116019, 118760, 121335, 124055, 126956, 129897, 132722, 135139, 136787, 137690, 138428, 139711, 141914, 145056, 148945]
52866A48945M196L816K863J866J295J072P04r3r85j342r57k97J7k11p26j176j302
52849A57685j041o74o91j257k013k521k659k386j562l77M50M61P0j02j20l32n02
52832A42429k10J63j72j060j496j115o19n27m95k46j72m65n38M5P42P97L55O0
52814A37476R3K09L57N35M35m2k67L57J281J291J12j206j616j141m29J57O04Q13
52796A39019N88l0p16j144j226j085q97p86p67p29n05j5O75J441K242K945L092
52779A42102K169L91j121j331l51P82J249R90L23l79p31n56j38J42M00R15J302
52762A46158Q33l16r48l85N55O76j00q40q30r0R70J820J957J292L34l27n65n08
52744A49686o1Q70J890K283J690M40p32j168p71j88k40j023j823k064j948j933
$$ y = [148945, 153141, 156957, 159820, 161686, 162981, 164053, 164757, 164664, 163679, 162337, 161380, 161083, 161100, 160889, 160163, 158987, 157685, 156644, 155970, 155279, 154022, 152009, 149488, 146829, 144443, 142881, 142504, 142954, 143415, 143485, 143383, 143263, 142931, 142429, 142219, 142382, 142210, 141150, 139654, 138539, 137920, 137393, 136898, 136652, 136480, 136015, 135477, 135522, 136264, 137061, 137416, 137476, 137569, 137778, 138135, 138670, 139105, 139063, 138796, 139153, 140434, 141725, 141837, 140631, 139015, 137874, 137445, 137602, 138206, 139019, 139607, 139577, 138861, 137717, 136491, 135406, 134509, 133723, 132956, 132227, 131722, 131707, 132382, 133823, 136065, 139010, 142102, 144271, 144662, 143541, 142210, 141859, 142641, 143890, 144880, 145203, 144824, 144093, 143537, 143399, 143541, 143941, 144856, 146158, 146991, 146675, 145727, 145342, 145897, 146573, 146473, 145633, 144803, 144713, 145683, 147503, 149460, 150752, 151086, 150759, 150194, 149686, 149625, 150495, 152385, 154668, 156358, 156798, 156066, 154898, 154127, 153939, 153699, 152676, 150853, 148789, 146841, 144908]
52728A44908k090k316k742l416l895l634k656j501p51q21j770k944l285k482j554
52713A09051j693k804l708l514k333q57K04M28k1n58r52j607k656l246k473p39
52697H2522O62J126J123J104R09L28m92j342k063k304j817j086r94j645k203k048
52681G1780j478j051q37p45r32j460j920j824j184l91K13M22J94k36m46l12j19
52664E9674r9j33p4p8l39p60j061j100r17o06k29K25P28J001N88n15j519j582
52646E3204q04j4K83K74J66j61p04j105j100p86k92K92O35L88j14n7P17J385J295
52627E3502P64L63O2l23l93L02J364J874J560J002P45P30O19L01j1M1O76J601
52609F4779K130J887J229P86P27P59O69N32N66R48J663K332K392J658N48l65q16
$$ y = [144908, 142818, 140502, 137760, 134344, 130449, 126815, 124159, 122658, 121907, 121086, 119316, 116372, 113087, 110605, 109051, 107358, 104554, 100846, 97332, 94999, 94142, 94346, 94774, 94753, 94195, 93243, 91636, 88980, 85734, 83261, 82522, 83184, 84310, 85433, 86537, 87446, 87774, 87282, 85940, 83877, 81573, 79756, 78670, 77676, 76031, 73828, 71780, 70302, 69251, 68414, 67669, 66737, 65277, 63357, 61533, 60349, 59958, 60171, 60593, 60787, 60551, 60105, 59793, 59674, 59575, 59442, 59368, 59290, 58951, 58191, 57130, 56030, 55113, 54507, 54278, 54503, 55231, 56232, 56820, 56305, 54786, 53204, 52400, 52386, 52669, 52943, 53109, 52948, 52244, 51139, 50039, 49253, 48961, 49253, 49888, 50276, 50162, 50105, 50822, 52207, 53502, 54266, 54629, 54691, 54368, 53975, 54277, 55641, 57515, 59075, 60077, 60822, 61552, 62171, 62472, 62461, 62502, 63178, 64779, 66909, 68796, 70025, 70811, 71538, 72297, 72966, 73498, 74064, 75012, 76675, 79007, 81399, 83057, 83605, 83240, 82424]
52592H2424p24r0P43J153R58O40N00R7r24j920j986j280q23j067j447j372r75
52575G3907o97p10r30j180j210q94n00l67l86k67j62m67j028j195p85l30k24k47
52557F2328j40j2Q7L27N03l0j328k353k101p96N73J399J631J231L37l89l61Q5
52539F0991J97MJ94Q21J125P96N01P10Q79M19k00q7O79J193J031O26L53O3k62
52520G0033j16P91J856K199J739J158R21Q48P01O85J007J289R22l2p29n29K34
52503H2977P81R21J118J607J930J591P59j4n13q82j093q81k58L10M58L92N59J094
52485I0856J769K293K482K213J481M92l85q16o62l9P29J295J508J403J034M92
52469A06145P3J02N33R10R06O80N10L97K20Q0J42L27M67O30R55J267J211P71K93
$$ y = [82424, 81700, 81610, 82353, 83506, 84464, 85104, 85604, 85701, 84777, 82857, 80871, 79591, 78768, 77701, 76254, 74882, 73907, 73210, 72500, 71570, 70390, 69180, 68286, 67786, 67419, 67033, 66766, 66604, 66137, 65109, 63914, 63129, 62799, 62575, 62328, 62188, 62176, 62263, 62590, 63093, 63063, 61735, 59382, 57281, 56485, 57058, 58457, 60088, 61319, 61656, 61267, 60906, 60991, 61188, 61192, 61386, 62207, 63332, 64128, 64629, 65339, 66218, 66637, 66437, 66350, 67029, 68222, 69253, 69879, 70232, 70295, 70033, 69917, 70708, 72564, 74763, 76502, 77660, 78581, 79429, 80130, 80815, 81822, 83111, 84033, 84001, 83272, 82743, 82977, 83758, 84679, 85797, 87404, 89334, 90925, 91684, 91670, 91157, 90275, 89182, 88301, 88043, 88353, 88811, 89203, 89762, 90856, 92625, 94918, 97400, 99613, 101094, 101586, 101201, 100385, 99723, 99684, 100413, 101708, 103216, 104619, 105653, 106145, 106218, 106320, 106853, 107763, 108669, 109349, 109859, 110256, 110476, 110556, 110698, 111025, 111492, 112122, 113077, 114344, 115555, 116326, 116619]
52450A16619N7M2R6Q9o4j83J85J125J845J403L9r36p45k4K59J53K43L96j38j371
52430A19090k198j724l94O13Q12P19Q53J016P52J34k65j44J75K23p7m48o42n38
52412A17957q6N83J113J256J135R99Q53O09L91L47K95J9k19J7N04N36j0l99o5
52393A25835O55J187J502J789J805J213K69l88n29l93j60J74M77N06K99J44J53
52376A34538K23L22M96N78L48m4j38K21O91Q75O59J06o55j343j556j143l46M10
52358A34242P37L86n43j448j615r16N9O60P06L25l43j024j211o50K20O37M11J20
52340A30753K68N83M45j88o95o13j60K36M90O85O73L76K45P73J661K027J577R45
52322A40081O90O58O01P83J412K006J935J286O73M13M32O67J010J073O36J11M2
$$ y = [116619, 116676, 116718, 116814, 116903, 116839, 116656, 116841, 117966, 119811, 121214, 121253, 120317, 119572, 119548, 119807, 119960, 120203, 120599, 120461, 119090, 116892, 115168, 114774, 115387, 116199, 116918, 117771, 118787, 119539, 119673, 119408, 119264, 119439, 119662, 119585, 119137, 118495, 117957, 117871, 118454, 119567, 120823, 121958, 122957, 123810, 124419, 124810, 125157, 125452, 125471, 125252, 125269, 125773, 126309, 126299, 125900, 125835, 126490, 127677, 129179, 130968, 132773, 133986, 134255, 133867, 133338, 132945, 132785, 132959, 133436, 133942, 134241, 134385, 134538, 134761, 135083, 135579, 136157, 136505, 136461, 136323, 136544, 137235, 138110, 138769, 138875, 138220, 136877, 135321, 134178, 133832, 134242, 134979, 135365, 134822, 133374, 131759, 130843, 130902, 131562, 132268, 132593, 132250, 131226, 130015, 129365, 129585, 130222, 130633, 130753, 131021, 131604, 132049, 131861, 131166, 130553, 130393, 130629, 131119, 131804, 132477, 132853, 133098, 133871, 135532, 137559, 139136, 140081, 140771, 141429, 142030, 142813, 144225, 146231, 148166, 149452, 150125, 150538, 150970, 151637, 152647, 153720, 154356, 154467, 154509]
52305A54509L03L62J38mO7K74Q01J741K445K114J124P87J573K513K626K085J497
52288A74955R50M00K45P80J519J892K149K865L818M110L367K137J153P06P75J267
52272B03088J970K576K849K702K268J979K334L251L979L946L532L547M187M914
52258B47122N255N212M941M547M249M362M976N899O952P980Q666Q695Q315Q298
52244C35469R101J0329J1234J1632J1977J2567J3022J2743J1771J0892J0838J1593
52232D73168J2639J3590J4287J4465J3874J2740J1645J0849J0179R610R437R615
52220F16098R513Q806Q047P852P914P407O152M673L346K185J369J302J894K389
52206F88947K135J220K39k64o6O45J312J466J265J295J784K316K381J985J637
$$ y = [154509, 154812, 155174, 155312, 155308, 155375, 155649, 156450, 158191, 160636, 162750, 163874, 164661, 166234, 168747, 171373, 173458, 174955, 175905, 176305, 176550, 177330, 178849, 180741, 182890, 185755, 189573, 193683, 197050, 199187, 200340, 201046, 201821, 203088, 205058, 207634, 210483, 213185, 215453, 217432, 219766, 223017, 226996, 230942, 234474, 238021, 242208, 247122, 252377, 257589, 262530, 267077, 271326, 275688, 280664, 286563, 293515, 301495, 310161, 318856, 327171, 335469, 344570, 354899, 366133, 377765, 389742, 402309, 415331, 428074, 439845, 450737, 461575, 473168, 485807, 499397, 513684, 528149, 542023, 554763, 566408, 577257, 587436, 597046, 606483, 616098, 625611, 634417, 642464, 650316, 658230, 665637, 671789, 676462, 679808, 681993, 683362, 684664, 686558, 688947, 691082, 692302, 692541, 692277, 692211, 692856, 694168, 695634, 696899, 698194, 699978, 702294, 704675, 706660, 708297]
52191G08297J900K949M367N444N925O260O890P508P573P325P595Q592R567R914
52177H00106R856R791R567Q909Q059P442P004O424N740N262M982M544L784K949
52163H94419K343J980J615R74J4j002j740k207k766l631m551n169n427n486n476
52148H63890n523n759o086o157n881n669n869o214o159n587m718l624k311j198
52134G93135r04j466k200k483k315j962j478q19j61J85J10k51o93j042j194j233
52118G75229j416j865k300k235j579q87r02j732k694l043k755k445k590l130l784
52103G41872m372m739m666m110l336k679k355k508l066l489l125k162j648k186
52089F97431l042l129k471j914j811j778j648j732k040k161k074k282k856l130
$$ y = [708297, 710197, 713146, 717513, 722957, 728882, 735142, 742032, 749540, 757113, 764438, 772033, 780625, 790192, 800106, 809962, 819753, 829320, 838229, 846288, 853730, 860734, 867158, 872898, 878160, 883142, 887686, 891470, 894419, 896762, 898742, 900357, 901331, 901345, 900343, 898603, 896396, 893630, 889999, 885448, 880279, 874852, 869366, 863890, 858367, 852608, 846522, 840365, 834484, 828815, 822946, 816732, 810573, 804986, 800268, 796644, 794333, 793135, 792231, 790765, 788565, 786082, 783767, 781805, 780327, 779508, 779347, 779532, 779642, 779391, 778698, 777656, 776462, 775229, 773813, 771948, 769648, 767413, 765834, 764947, 764045, 762313, 759619, 756576, 753821, 751376, 748786, 745656, 741872, 737500, 732761, 728095, 723985, 720649, 717970, 715615, 713107, 710041, 706552, 703427, 701265, 699617, 697431, 694389, 691260, 688789, 686875, 685064, 683286, 681638, 679906, 677866, 675705, 673631, 671349, 668493, 665363]
52075F65363k720k137j965k037k023k069k334k391j853j136r26j200j451j592
52061F39529j829j884j225KJ069J665K151K723L124L304L676M437N232N809O441
52046F74224P356Q227Q654Q801R186J0097J1452J2938J4114J4677J4811J4987
52034H09524J5231J5113J4619J4528J5366J6476J6604J5267J3114J1212J0316
52023I67370J0523J1061J0613Q481N451L114K318K535K598J653l48k554l686l229
52009A015900k191k175l644n546o640o644n980n068m239l791l725l631l148k342
51995I57136j534r64p22o64l19O82J935K555K379K310L035L987M198L671L185
51980I80870L020K739K183J820J930K149K040J635J090K86q27j924k611k926l222
$$ y = [665363, 662643, 660506, 658541, 656504, 654481, 652412, 650078, 647687, 645834, 644698, 643772, 642572, 641121, 639529, 637700, 635816, 634591, 634593, 635662, 637327, 639478, 642201, 645325, 648629, 652305, 656742, 661974, 667783, 674224, 681580, 689807, 698461, 707262, 716448, 726545, 737997, 750935, 765049, 779726, 794537, 809524, 824755, 839868, 854487, 869015, 884381, 900857, 917461, 932728, 945842, 957054, 967370, 977893, 988954, 999567, 1008048, 1013499, 1016613, 1018931, 1021466, 1024064, 1025717, 1025369, 1022815, 1019129, 1015900, 1013709, 1011534, 1007890, 1002344, 995704, 989060, 983080, 978012, 973773, 969982, 966257, 962626, 959478, 957136, 955602, 954638, 953916, 953252, 952933, 953615, 955550, 958105, 960484, 962794, 965829, 969816, 974014, 977685, 980870, 983890, 986629, 988812, 990632, 992562, 994711, 996751, 998386, 999476, 999762, 998935, 997011, 994400, 991474, 988252]
51965I88252l745m501n334n980o277o453o946p827q670r206r668j0251j0705j0856
51951H81833j1153j2069j3215j3690j3309j2834j2931j3485j4078j4549j4861
51940G35659j4920j4894j5174j5726j5956j5663j5570j6300j7245j7313j6516
51929E60382j5941j6154j6553j6506j6219j5987j5463j4298j2983j2232j1993
51918C96053j1777j1600j1737j1692j0545q496p117p468q662q967p913o601o096
51905B77382o251o276n855n373n200n200n003m573m246m187m114l707l151k862
51891B11384k797k485j809j296j379j730j713j227p91q70j417k008k195j848j350
51876A86469j278j731k105j871j285j002j174j382j365j290j285j209j023j030
$$ y = [988252, 984507, 980006, 974672, 968692, 962415, 955962, 949016, 941189, 932519, 923313, 913645, 903394, 892689, 881833, 870680, 858611, 845396, 831706, 818397, 805563, 792632, 779147, 765069, 750520, 735659, 720739, 705845, 690671, 674945, 658989, 643326, 627756, 611456, 594211, 576898, 560382, 544441, 528287, 511734, 495228, 479009, 463022, 447559, 433261, 420278, 408046, 396053, 384276, 372676, 360939, 349247, 338702, 330206, 323089, 315621, 306959, 297992, 290079, 283478, 277382, 271131, 264855, 259000, 253627, 248427, 243227, 238224, 233651, 229405, 225218, 221104, 217397, 214246, 211384, 208587, 206102, 204293, 202997, 201618, 199888, 198175, 196948, 196157, 195287, 193870, 191862, 189667, 187819, 186469, 185191, 183460, 181355, 179484, 178199, 177197, 176023, 174641, 173276, 171986, 170701, 169492, 168469, 167439]
51862A67439j452k083k443k160j225j23L21l04j349j713j273j104j990l235l585
51847A43721k827j859j339j145j086j338j840j988j420o86n99j121j449j109m77
51832A23438j31j21o8K29N59N26p0j005j699j625q44LK59j74q46j170q36J6Q08
51813A17249R53M62MP5L26O6o46r83n21J39K00k33l64K01J024J451J286Q40N11
51794A22040M32M30L30K99P13J599K446K805K724K425J858J025L48K35L53P4m52
51777A39684m11L86J019O29n26j551k016k045j773j272p95n45l41J18P17J079
51761A32357J116J007P10M4p28r21l24L54K89m36r45n99L45J127J275Q59K06l91
51743A35345o98n36j3M48N66N47O80P44K73n25q07k49L56R4q34j459j338r53q61
$$ y = [167439, 165987, 163904, 161461, 159301, 158076, 157953, 158274, 157970, 156621, 154908, 153635, 152531, 150541, 147306, 143721, 140894, 139035, 137696, 136551, 135465, 134127, 132287, 130299, 128879, 128193, 127594, 126473, 125024, 123915, 123438, 123307, 123186, 123118, 123347, 123906, 124432, 124362, 123357, 121658, 120033, 119189, 119192, 119451, 119277, 118431, 117261, 116425, 116441, 117249, 118202, 118664, 118668, 118743, 119069, 119135, 118489, 117506, 116985, 117124, 117324, 117091, 116727, 116928, 117952, 119403, 120689, 121529, 122040, 122472, 122902, 123232, 123531, 124244, 125843, 128289, 131094, 133818, 136243, 138101, 139126, 139474, 139709, 140062, 140136, 139684, 139273, 139659, 140678, 141307, 140781, 139230, 137214, 135169, 133396, 132124, 131329, 130784, 130443, 130561, 131278, 132357, 133473, 134480, 135190, 135234, 134506, 133585, 133261, 133615, 133904, 133468, 132523, 131924, 132269, 133396, 134671, 135530, 135736, 135345, 134647, 134111, 134098, 134546, 135112, 135659, 136339, 137083, 137356, 136831, 136024, 135775, 136131, 136225, 135391, 133932, 132594, 131641, 130780]
51724A30780j078j292j236p25K01J134J643J846K269K947L167K400J136M02N42
51709A44136Q31L87p45j589j318k52N02M23J61M79J051R82L49K80J298K397K334
51692A51706J285N10O84J330J788J997K117K013J534J089J402K689M261N121M887
51677A84413M085L555L622L909L889L532L301L601M252M604M155L044J829R03
51663B32694L22J69O01J328J544P80m47j355j872k300k338j445j08M19j02m42
51647B27448K24R88O55m01q82m93j38l36o82q05q81r41o37R7P32Q59O59M94N28
51628B26488Q35J344J642J377R37J081J834K471K714L053L599L578K537J219N99
51613B55308O81R17J165J453J358N93j80l4Q82J549J516J252J146J028Q44R22
$$ y = [130780, 129702, 128410, 127174, 126449, 126650, 127784, 129427, 131273, 133542, 136489, 139656, 142056, 143192, 143594, 144136, 144967, 145354, 144609, 143020, 141702, 141450, 141952, 142375, 142536, 143015, 144066, 145048, 145397, 145677, 146975, 149372, 151706, 152991, 153501, 154185, 155515, 157303, 159300, 161417, 163430, 164964, 166053, 167455, 170144, 174405, 179526, 184413, 188498, 192053, 195675, 199584, 203473, 207005, 210306, 213907, 218159, 222763, 226918, 229962, 231791, 232694, 233016, 233185, 233786, 235114, 236658, 237438, 236991, 235636, 233764, 231464, 229126, 227681, 227573, 227992, 227890, 227448, 227672, 228660, 229315, 228914, 228032, 227539, 227401, 227065, 226383, 225578, 224697, 223756, 223119, 223216, 223948, 224807, 225466, 225960, 226488, 227323, 228667, 230309, 231686, 232623, 233704, 235538, 238009, 240723, 243776, 247375, 250953, 253490, 254709, 255308, 255989, 256906, 258071, 259524, 260882, 261475, 261295, 261261, 262143, 263692, 265208, 266460, 267606, 268634, 269478, 270400]
51597B70400J283J348P20k69j080j657k186k609k775k796k968l309l526l384l011
51582B44181k803k991l355l447l194k988l029k936k380j808j958k764l312k927
51568B04289j876r08n94j069j929k304j598l62J28o59j888k414k016j310r20j008
51552A83562j298j254n77K66M03l41j135j251r18p36p27n73l63l85m53m3Q34J593
51534A76604J878J936K097K286K231J869J403J127J238J651K032K139K052J986
51520B02529K039K213K512K790K762K370J893J444O59o43j815j963j103j97N6
51505B15546o2N1M33N92J64o88j486j872j806j433q25m5O16P64L91nK8N07J320
51486B12190K429L433L491K325J001R00K010K931K566J252L9m68l54L8M02N92
$$ y = [270400, 271683, 273031, 273751, 273482, 272402, 270745, 268559, 265950, 263175, 260379, 257411, 254102, 250576, 247192, 244181, 241378, 238387, 235032, 231585, 228391, 225403, 222374, 219438, 217058, 215250, 213292, 210528, 207216, 204289, 202413, 201505, 200911, 199842, 197913, 195609, 194011, 193649, 193777, 193118, 191230, 188816, 186800, 185490, 184570, 183562, 182264, 181010, 180433, 180699, 181102, 180761, 179626, 178375, 177457, 176721, 175994, 175421, 175058, 174673, 174220, 174177, 175011, 176604, 178482, 180418, 182515, 184801, 187032, 188901, 190304, 191431, 192669, 194320, 196352, 198491, 200543, 202529, 204568, 206781, 209293, 212083, 214845, 217215, 219108, 220552, 221211, 220568, 218753, 216790, 215687, 215490, 215546, 215484, 215535, 215968, 216560, 216724, 216036, 214550, 212678, 210872, 209439, 208614, 208569, 209185, 209949, 210340, 210335, 210363, 210870, 212190, 214619, 218052, 221543, 223868, 224869, 225769, 227779, 230710, 233276, 234528, 234567, 234099, 233745, 233783, 234185, 234777]
51470B34777O29M86n6r88j793j949j662j519j543j241m73L99J280K371L320L250
51454B35288K098J076J215K077K536K227J517O41l29r77r25n87p75j474j800j274
51438B40534n38n86j628k997l815l652k801k020j845k082k158j906j712j829j917
51423B09048j467n19L48O83O18N74O83P60P83J073J795K550K758K376J900J747
51407B25710J997K639L542M211M130L494L093L290L613L556L247L037K916K718
51393B71193K448K132J689J325J466J932J745L89j286k008j583p99k77j39m40
51378B77787j044j276n28P85J707K065K506L208L482K865J843J134Q28O12K83
51363B96257k01p73j127r29l79j09l97q76j177j333j451j497j661k333l378l974
$$ y = [234777, 235406, 235892, 235836, 234848, 233055, 231106, 229444, 227925, 226382, 225141, 224668, 225067, 226347, 228718, 232038, 235288, 237386, 238462, 239677, 241754, 244290, 246517, 248034, 248675, 248346, 247369, 246444, 245857, 245082, 243608, 241808, 240534, 239996, 239410, 237782, 234785, 230970, 227318, 224517, 222497, 220652, 218570, 216412, 214506, 212794, 210965, 209048, 207581, 207062, 207410, 208093, 208711, 209285, 209968, 210728, 211511, 212584, 214379, 216929, 219687, 222063, 223963, 225710, 227707, 230346, 233888, 238099, 242229, 245723, 248816, 252106, 255719, 259275, 262522, 265559, 268475, 271193, 273641, 275773, 277462, 278787, 280253, 282185, 283930, 284319, 283033, 281025, 279442, 278643, 278366, 278227, 277787, 276743, 275467, 274939, 275724, 277431, 279496, 282002, 285210, 288692, 291557, 293400, 294534, 295362, 295974, 296257, 296056, 295283, 294156, 293227, 292848, 292739, 292342, 291466, 290289, 288956, 287505, 286008, 284347, 282014, 278636, 274662]
51347B74662l626k844k405k295j933j167m93m09r47j789k427k312j224L73J622
51332B52786J994J674J235J038R97Q66P14R29J643K289K066Q51n93j394j369j035
51316B64691j056j727k789l747m385m870n251n244m806m520m859n409n507n377
51302B05144n689o147n608l847k145j635k002k374k626l016l255k918k305k035
51288A59542k038j797j363j274j620j899j870j783j771j591j168q16p79q91q57
51273A38025n71j28K23J83k59o59n79r6M03P13Q08O10J97pK43N43M69L89R86K123
51253A43616K955L151L168L273L104K499J893J581J311J019J234K143K929K759
51239A76635K008J669J879J761P45p38j899k379k263j876j691k046k704l116l208
$$ y = [274662, 271036, 268192, 265787, 263492, 261559, 260392, 259899, 259490, 258543, 256754, 254327, 252015, 250791, 251164, 252786, 254780, 256454, 257689, 258727, 259724, 260590, 261304, 262233, 263876, 266165, 268231, 269082, 268489, 267095, 265726, 264691, 263635, 261908, 259119, 255372, 250987, 246117, 240866, 235622, 230816, 226296, 221437, 216028, 210521, 205144, 199455, 193308, 187700, 183853, 181708, 180073, 178071, 175697, 173071, 170055, 166800, 163882, 161577, 159542, 157504, 155707, 154344, 153070, 151450, 149551, 147681, 145898, 144127, 142536, 141368, 140552, 139773, 138882, 138025, 137454, 137326, 137549, 137732, 137473, 136814, 136235, 136139, 136542, 137255, 138063, 138673, 138870, 138863, 139106, 139649, 140118, 140507, 141493, 143616, 146571, 149722, 152890, 156163, 159267, 161766, 163659, 165240, 166551, 167570, 168804, 170947, 173876, 176635, 178643, 180312, 182191, 183952, 184697, 183959, 182060, 179681, 177418, 175542, 173851, 171805, 169101, 165985, 162777]
51224A62777l549m418n136m745l189j418l89k91p58j399j969k303k366k267k081
51209A26499j778j406j204j303j460j336r39n73m06l63m40p26j041r23k38M71
51193A12834M97k40j109j372q13P1M27j80j172j398l73J131J967J827J299R86
51177A14382R45R45P72K73n50j384j799j672j261q17l79QJ27k40j019j796k044
51160A04491j474l27P75J292J125N35l3m7P44J831K187J420M03K44Q31R96R9j136
51142A13956j580r57M3O33O26L95L97O64P91M73o9m02m73n23n96m72j35J84L92
51123A13347O01P20M48k27q64j102j010p86n23l80o05j128j463j212n45M9J90
51106A05510k02q39j067m08P40J327Q23j83p82p24k93K59O75M72n81j858k370
$$ y = [162777, 159228, 154810, 149674, 144929, 141740, 140322, 139933, 139642, 138884, 137485, 135516, 133213, 130847, 128580, 126499, 124721, 123315, 122111, 120808, 119348, 118012, 117073, 116500, 116094, 115731, 115291, 114565, 113524, 112601, 112363, 112834, 113331, 113091, 111982, 110610, 109797, 109868, 110295, 110115, 108943, 107545, 107172, 108303, 110270, 112097, 113396, 114382, 115327, 116272, 117044, 117317, 116767, 115383, 113584, 111912, 110651, 109834, 109455, 109463, 109590, 109350, 108331, 106535, 104491, 103017, 102690, 103465, 104757, 105882, 106417, 106384, 106337, 107081, 108912, 111099, 112519, 112922, 113166, 113997, 114993, 115092, 113956, 112376, 111419, 111462, 112095, 112721, 113116, 113513, 114177, 114968, 115441, 115372, 114970, 114497, 113974, 113378, 112906, 112771, 112955, 113347, 113948, 114668, 115116, 114889, 114025, 112923, 111913, 111127, 110604, 110224, 109619, 108491, 107028, 105816, 105271, 105320, 105510, 105308, 104469, 103402, 102994, 103734, 105061, 105884, 105701, 104919, 104195, 103902, 104161, 104836, 105308, 104727, 102869, 100499]
51089A00499j817p81L5L53J32n13j101j016k68L08Pp89j005k24P31P65j70j033
51071I4113r36j06N32M98J68J48O14J246J582J313N28k42l65L22J409K277K477
51054A05578J845O63l15m01K39P28N18j4k38j50j97n03o76l56L30R10R58M77q4
51035A09312k92k95o39j385j836j397m31K35L81M84Q48J173J115P82M72K47O6
51018A08840R7N63J280J659J323N79J20K84P73J075R16L09n19j032o22O28J688
51001A17961J625P18P1J62N18O50N37J16p81j705j698p27r3o87j565j218K58J359
50983A15501J266O55M21O23R66J467K196K850L018K584J695O40j80m43k37O7L13
50966A33402O06R01R28N65rn17p09l68M31J122J180P74N25O56R21J195J569J836
$$ y = [100499, 98682, 97901, 97936, 98289, 98421, 97908, 96807, 95791, 95523, 95831, 95838, 95049, 94044, 93820, 94551, 95316, 95146, 94113, 93177, 93071, 93603, 94101, 94269, 94417, 95031, 96277, 97859, 99172, 99700, 99458, 99093, 99415, 100824, 103101, 105578, 107423, 108086, 107771, 107370, 107609, 108337, 108855, 108841, 108603, 108453, 108256, 107753, 107077, 106721, 107051, 107961, 108919, 109396, 109312, 109020, 108725, 108086, 106701, 104865, 103468, 103037, 103272, 103653, 104137, 104985, 106158, 107273, 108055, 108527, 108774, 108840, 108937, 109500, 110780, 112439, 113762, 114341, 114461, 114745, 115518, 116593, 117509, 117818, 117299, 116267, 115645, 116273, 117961, 119586, 120304, 120375, 120537, 121055, 121705, 122242, 122358, 121577, 119872, 118174, 117447, 117354, 116667, 115102, 113884, 114142, 115501, 116767, 117422, 117843, 118466, 119432, 120899, 123095, 125945, 128963, 131547, 133242, 133882, 133702, 133259, 133022, 133089, 133402, 134008, 134909, 135837, 136402, 136393, 135876, 135167, 134799, 135230, 136352, 137532, 138306, 138831, 139487, 140408, 141603, 143172, 145008]
50948A45008J564Q80N05Q22J438J904K282K753L163L426L774M294M635M586M490
50933A85524M631M688M307L824L841M370N018N773O842P870Q101P544P248Q074
50919B67655R669J1007J1609J1829J2196J2961J4263J6231J8677K0926K2369K3180
50907D52572K4262K6371K9421L2679L5380L7101L7834L8069L8645M0066M1959
50896H34359M3482M4148M3994M3036M1124L8431L5538L2813L0006K6770K3206
50885A236907J9720J6562J3792J1374R127O847M687L147K444K158J803J342Q32
50872A330742p5j753l965o189q527j1597j5495j9374k2420k4831k7558l1128l5033
50859A122797l8215m0022m0658m0816m0965m1000m0504l9208l7175l4730l2343
$$ y = [145008, 146572, 147452, 147957, 148779, 150217, 152121, 154403, 157156, 160319, 163745, 167519, 171813, 176448, 181034, 185524, 190155, 194843, 199150, 202974, 206815, 211185, 216203, 221976, 228818, 236688, 244789, 252333, 259581, 267655, 277324, 288331, 299940, 311769, 323965, 336926, 351189, 367420, 386097, 407023, 429392, 452572, 476834, 503205, 532626, 565305, 600685, 637786, 675620, 713689, 752334, 792400, 834359, 877841, 921989, 965983, 1009019, 1050143, 1088574, 1124112, 1156925, 1186931, 1213701, 1236907, 1256627, 1273189, 1286981, 1298355, 1307482, 1314329, 1319016, 1322163, 1324607, 1326765, 1328568, 1329910, 1330742, 1330667, 1328914, 1324949, 1318760, 1310233, 1298636, 1283141, 1263767, 1241347, 1216516, 1188958, 1157830, 1122797, 1084582, 1044560, 1003902, 963086, 922121, 881121, 840617, 801409, 764234, 729504, 697161]
50848F97161l0338k8607k6716k4441k2074k0050j8414j6926j5454j4055j2673
50837D67413j1120r410p838o655n842n222m708m243l639k618j106N30J647J943
50823D09132J812J951K553L132L263L161L402M203N278O236O929P407P809Q307
50809D74575R037J0082J1416J2815J3839J4173J4158J4654J6204J8526K1046K3570
50797F54095K6205K8894L1567L4526L8155M2283M6344N0254N4590N9746O5347
50786A132006P0712P5579Q0028Q4063Q7617R0801R3700R5882R6507R5132R2187
50775B094214Q8463Q4157P8668P1385O2520N3033M3842L5307K7398K0148J3790
50764B672925Q618M806K227M76p42j232o19Q37K041J880J2l390q294j4809k2665
$$ y = [697161, 666823, 638216, 611500, 587059, 564985, 544935, 526521, 509595, 494141, 480086, 467413, 456293, 446883, 439045, 432390, 426548, 421326, 416618, 412375, 408736, 406118, 405012, 405542, 407189, 409132, 410944, 412895, 415448, 418580, 421843, 425004, 428406, 432609, 437887, 444123, 451052, 458459, 466268, 474575, 483612, 493694, 505110, 517925, 531764, 545937, 560095, 574749, 590953, 609479, 630525, 654095, 680300, 709194, 740761, 775287, 813442, 855725, 902069, 952323, 1006913, 1066659, 1132006, 1202718, 1278297, 1358325, 1442388, 1530005, 1620806, 1714506, 1810388, 1906895, 2002027, 2094214, 2182677, 2266834, 2345502, 2416887, 2479407, 2532440, 2576282, 2611589, 2638987, 2659135, 2672925, 2681543, 2686349, 2688576, 2689052, 2688310, 2687078, 2686459, 2687296, 2689337, 2691217, 2691229, 2687839, 2679545, 2664736, 2642071]
50749B642071l1239m0107m9189n8360o7163p5054q1691q6907r0654r2968r3917
50738A874822r3477r1639q8613q4746q0390p5932p1749o7849o3668n8673n3117
50727A044969m7845m3358l9451l5692l1854k7793k3483j9450j6602j5215j4416
50716G29810j3125j1329r920r405r299q851p929o953o250n779n390n100n007n104
50702F20369n246n275n094m658l970l113k217j360n78J37Q86J866L199M769O358
50687F06073P943R605J1234J2637J3987J5746J7986K0211K2101K3998K6288K8729
50675H16538L1011L3536L6916M0825M4234M6840M9465N2736N6117N8643O0050
50664A326911O0646O0467N9213N6861N3779N0189M5849M0389L3841K6732J9707
$$ y = [2642071, 2610832, 2570725, 2521536, 2463176, 2396013, 2320959, 2239268, 2152361, 2061707, 1968739, 1874822, 1781345, 1689706, 1601093, 1516347, 1435957, 1360025, 1288276, 1220427, 1156759, 1098086, 1044969, 997124, 953766, 914315, 878623, 846769, 818976, 795493, 776043, 759441, 744226, 729810, 716685, 705356, 695436, 686031, 676732, 667881, 659952, 652999, 646749, 640970, 635580, 630480, 625473, 620369, 615123, 609848, 604754, 600096, 596126, 593013, 590796, 589436, 588858, 588995, 589881, 591747, 594946, 599715, 606073, 614016, 623621, 634855, 647492, 661479, 677225, 695211, 715422, 737523, 761521, 787809, 816538, 847549, 881085, 918001, 958826, 1003060, 1049900, 1099365, 1152101, 1208218, 1266861, 1326911, 1387557, 1448024, 1507237, 1564098, 1617877, 1668066, 1713915, 1754304, 1788145, 1814877, 1834584]
50653A834584J3024O482j5n957j0552j3520j5217j6035j6094j5574j4774j3679
50641A732673j1989r868q130p335p197p422q584j1505j6070k1415k7074l3117
50629A562967l9200m4339m7937n0370n2323n3907n4658n4056n1849m8339m4550
50618A021439m1589l9500l7155l3677k9635k6280k3942k1757j8940j5618j2340
50607G21006r273o312l554j250O50K487M316N717O358O591P159Q319R548J0329
50593G62091J0913J1899J3225J4096J4204J4440J5855J8248K0391K1651K2707
50582I39720K4457K6865K9292L1446L3467L5379L7097L8750M0382M1444M1270
$$ y = [1834584, 1847608, 1854090, 1854075, 1848118, 1837566, 1824046, 1808829, 1792794, 1776700, 1761126, 1746352, 1732673, 1720684, 1710816, 1702686, 1695351, 1688154, 1680732, 1672148, 1660643, 1644573, 1623158, 1596084, 1562967, 1523767, 1479428, 1431491, 1381121, 1328798, 1274891, 1220233, 1166177, 1114328, 1065989, 1021439, 979850, 940350, 903195, 869518, 839883, 813603, 789661, 767904, 748964, 733346, 721006, 711733, 705421, 701867, 700617, 701267, 703754, 708070, 713787, 720145, 726736, 733895, 742214, 751762, 762091, 773004, 784903, 798128, 812224, 826428, 840868, 856723, 874971, 895362, 917013, 939720, 964177, 991042, 1020334, 1051780, 1085247, 1120626, 1157723, 1196473, 1236855, 1278299, 1319569]
$$ [...]
##END NTUPLES=NMR SPECTRUM
##END=
