
##TITLE=AC1116_Cauca1_5835603_bxzCjDc94Z
##JCAMPDX= 6.0         $$ Bruker NMR JCAMP-DX V2.0
##DATA TYPE= NMR SPECTRUM
##DATA CLASS= NTUPLES
##ORIGIN= BRUKER
##OWNER= Administrator
$$ 1.72 TOPSPIN		Version 2.1
$$ 2012-03-28 11:06:13.656 -0500  Administrator@TOPSPIN
$$ Compression mode = diff/dup
##.OBSERVE FREQUENCY= 400.13188235
##.OBSERVE NUCLEUS= ^1H
##.ACQUISITION MODE= SIMULTANEOUS (DQD)
##.ACQUISITION SCHEME= undefined
##.AVERAGES= 8
##.DIGITISER RES= 22
##SPECTROMETER/DATA SYSTEM= spect
##.PULSE SEQUENCE= zg30
##.SOLVENT NAME= COFFEE_meoh
##.SHIFT REFERENCE= INTERNAL, COFFEE_meoh, 1, 14.98061
##AUDIT TRAIL= $$ (NUMBER, WHEN, WHO, WHERE, PROCESS, VERSION, WHAT)
$$ ##TITLE= Audit trail, TOPSPIN		Version 2.1
$$ ##JCAMPDX= 5.01
$$ ##ORIGIN= Bruker BioSpin GmbH
$$ ##OWNER= Administrator
$$ $$ C:\Bruker\TOPSPIN/data/COFFEE/nmr/AC1116_Cauca1_5835603_bxzCjDc94Z/10/pdata/1/auditp.txt
$$ ##AUDIT TRAIL=  $$ (NUMBER, WHEN, WHO, WHERE, PROCESS, VERSION, WHAT)
(   1,<2012-03-27 22:46:27.578 -0500>,<Administrator>,<TOPSPIN>,<go>,<TOPSPIN 2.1>,
      <created by zg
	started at 2012-03-27 22:45:21.062 -0500,
	POWCHK enabled, PULCHK disabled,
       configuration hash MD5:
       1A 1E CE 29 27 FD 77 03 67 4E F0 E3 C4 B2 CB 90
       data hash MD5: 64K
       BF CB 9F 0F 83 80 49 84 4D A0 65 D6 4D 09 F9 19>)
(   2,<2012-03-27 22:46:32.046 -0500>,<Administrator>,<TOPSPIN>,<proc1d>,<TOPSPIN 2.1>,
      <Start of raw data processing
       efp LB = 0 FT_mod = 6 PKNL = 1 PHC0 = 0 PHC1 = 0 SI = 32K 
       data hash MD5: 32K
       07 64 99 9D 22 FF 20 3C D5 33 84 0D E5 C8 91 A1>)
(   3,<2012-03-27 22:46:32.406 -0500>,<Administrator>,<TOPSPIN>,<proc1d>,<TOPSPIN 2.1>,
      <pk PHC0 = 215.8154 PHC1 = 0 
       data hash MD5: 32K
       83 AE 9D 07 CE B6 C2 42 48 9D A9 6F 3D FC 08 CA>)
(   4,<2012-03-27 22:46:32.640 -0500>,<Administrator>,<TOPSPIN>,<proc1d>,<TOPSPIN 2.1>,
      <abs ABSG = 1 
       data hash MD5: 32K
       06 B6 97 6D 14 13 E4 31 E4 E4 F8 74 AF FB 43 4E>)
(   5,<2012-03-27 22:46:32.718 -0500>,<Administrator>,<TOPSPIN>,<proc1d>,<TOPSPIN 2.1>,
      <abs ABSG = 2 
       data hash MD5: 32K
       0C 38 AA 45 54 42 44 6E E7 AA 97 77 08 24 B4 B3>)
(   6,<2012-03-27 22:46:32.750 -0500>,<Administrator>,<TOPSPIN>,<proc1d>,<TOPSPIN 2.1>,
      <abs ABSG = 3 
       data hash MD5: 32K
       90 01 55 80 C7 D0 53 87 46 4C 17 7B A6 D0 73 BE>)
(   7,<2012-03-27 22:46:32.796 -0500>,<Administrator>,<TOPSPIN>,<proc1d>,<TOPSPIN 2.1>,
      <abs ABSG = 4 
       data hash MD5: 32K
       0E 30 57 24 41 22 36 FE 39 85 DC 5D 79 0A 90 60>)
(   8,<2012-03-27 22:46:32.828 -0500>,<Administrator>,<TOPSPIN>,<proc1d>,<TOPSPIN 2.1>,
      <abs ABSG = 5 
       data hash MD5: 32K
       DE 33 A0 32 D6 E2 91 B8 90 04 73 F3 42 34 94 5F>)
(   9,<2012-03-27 22:46:37.312 -0500>,<Administrator>,<TOPSPIN>,<audit>,<TOPSPIN 2.1>,
      <user comment:
       ICON-NMR User ID: COFFEE
       data hash MD5: 32K
       DE 33 A0 32 D6 E2 91 B8 90 04 73 F3 42 34 94 5F>)
$$ [...]
150 150 150 150 150 150 150 150
##$TP07= 0
##$TPNAME0= <>
##$TPNAME1= <>
##$TPNAME2= <>
##$TPNAME3= <>
##$TPNAME4= <>
##$TPNAME5= <>
##$TPNAME6= <>
##$TPNAME7= <>
##$TPOAL= (0..7)
0.5 0.5 0.5 0.5 0.5 0.5 0.5 0.5
##$TPOFFS= (0..7)
0 0 0 0 0 0 0 0
##$TUNHIN= 0
##$TUNHOUT= 0
##$TUNXOUT= 0
##$USERA1= <user>
##$USERA2= <user>
##$USERA3= <user>
##$USERA4= <user>
##$USERA5= <user>
##$V9= 5
##$VALIST= <valist>
##$VCLIST= <CCCCCCCCCCCCCCC>
##$VD= 0
##$VDLIST= <DDDDDDDDDDDDDDD>
##$VPLIST= <PPPPPPPPPPPPPPP>
##$VTLIST= <TTTTTTTTTTTTTTT>
##$WBST= 2048
##$WBSW= 25
##$XGAIN= (0..3)
0 0 0 0
##$XL= 0
##$YL= 0
##$YMAX_a= 528143
##$YMIN_a= -627264
##$ZGOPTNS= <>
##$ZL1= 120
##$ZL2= 120
##$ZL3= 120
##$ZL4= 120
##$ABSF1= 14.98061
##$ABSF2= -5.57192
##$ABSG= 5
##$ABSL= 3
##$ALPHA= 0
##$AQORDER= 0
##$ASSFAC= 0
##$ASSFACI= 0
##$ASSFACX= 0
##$ASSWID= 0
##$AUNMP= <proc_prof1d_extract_pilot.lims>
##$AXLEFT= 0
##$AXNAME= <>
##$AXNUC= <1H>
##$AXRIGHT= 0
##$AXTYPE= 0
##$AXUNIT= <>
##$AZFE= 0.1
##$AZFW= 0.1
##$BCFW= 0
##$BC_mod= 0
##$BYTORDP= 0
##$COROFFS= 0
##$CY= 15
##$DATMOD= 1
##$DC= 0
##$DFILT= <>
##$DTYPP= 0
##$F1P= 0
##$F2P= 0
##$FCOR= 0.5
##$FTSIZE= 32768
##$FT_mod= 6
##$GAMMA= 0
##$GB= 0
##$INTBC= 1
##$INTSCL= 1
##$ISEN= 128
##$LB= 0
##$LEV0= 0
##$LPBIN= 0
##$MAXI= 10000
##$MC2= 0
##$MEAN= 0
##$ME_mod= 0
##$MI= 0
##$NCOEF= 0
##$NC_proc= -8
##$NLEV= 6
##$NOISF1= 0
##$NOISF2= 0
##$NSP= 0
##$NTH_PI= 0
##$NZP= 0
##$OFFSET= 14.98061
##$PC= 1
##$PHC0= 215.8154
##$PHC1= 0
##$PH_mod= 1
##$PKNL= yes
##$PPARMOD= 0
##$PPDIAG= 0
##$PPIPTYP= 0
##$PPMPNUM= 2147483647
##$PPRESOL= 1
##$PSCAL= 4
##$PSIGN= 0
##$PYNMP= <proc.py>
##$REVERSE= no
##$SF= 400.13
##$SI= 32768
##$SIGF1= 0
##$SIGF2= 0
##$SINO= 400
##$SIOLD= 32768
##$SPECTYP= <>
##$SREGLST= <1H.CDCl3>
##$SSB= 0
##$STSI= 32768
##$STSR= 0
##$SW_p= 8223.68421052632
##$SYMM= 0
##$S_DEV= 0
##$TDeff= 65536
##$TDoff= 0
##$TI= <>
##$TILT= no
##$TM1= 0
##$TM2= 0
##$TOPLEV= 0
##$USERP1= <user>
##$USERP2= <user>
##$USERP3= <user>
##$USERP4= <user>
##$USERP5= <user>
##$WDW= 1
##$XDIM= 32768
##$YMAX_p= 461879307
##$YMIN_p= -651970
##$CURPLOT= <Network HP LaserJet P1505>
##$CURPRIN= <$Network HP LaserJet P1505>
##$DFORMAT= <normdp>
##$LAYOUT= <+/1D_H.xwp>
##$LFORMAT= <normlp>
##$PFORMAT= <normpl>
##$SURQMSG= 1
$$ End of Bruker specific parameters
$$ ---------------------------------
##NTUPLES= NMR SPECTRUM
##VAR_NAME=  FREQUENCY,     SPECTRUM/REAL,   SPECTRUM/IMAG
##SYMBOL=    X,             R,               I
##VAR_TYPE=  INDEPENDENT,   DEPENDENT,       DEPENDENT
##VAR_FORM=  AFFN,          ASDF,            ASDF
##VAR_DIM=   32768,         32768,           32768
##UNITS=     HZ,            ARBITRARY UNITS, ARBITRARY UNITS
##FACTOR=    0.250966925370066, 1,           1
##FIRST=     8223.43324360095, 717,          -48194
##LAST=      0,             -168537,         -155934
##MIN=       0,             -651970,         0
##MAX=       8223.43324360095, 461879307,    0
$$ Real data points
##PAGE= N=1
##DATA TABLE= (X++(R..R)), XYDATA
$$ [...]
19475b32288B9900Q5526a33638b619j57944p4889a05827C8075d01701a27866A72696
19463g2661A6829a40172G913b51014e6930a8807E7599J49611b54844A19063a33924
19451C67907I589b2748m1578k8366P187n3674n3290Q0387d5352A41989c18531
19439b09630A40866L4351f1123A92442a48012E3491c32598i3196b0194b734A34464
19427I1205d0221j36603Q1545r7503F3227O8557a95209R0671j19351j3018B7166
19415i0352r0088j05259F1191J14495c1582J0102l6516l02280h7000j17734M1261
19404a63473L2664B50341I726h3670q8076l6814p8304A17293J13948b34024q5636
19393c19660a21793b999G6918C5702d28055a82221J8001I5556a68020D22142A47035
$$ plain form
19475 -232288 29900 115426 -133638 -2619 -160563 -235452 -105827 38075 -401701 -127866 172696
19463 -72661 16829 -140172 7913 -251014 -56930 -18807 57599 207210 -254844 119063 -133924
19451 367907 9589 -22748 -64326 -92692 -85505 -139179 -192469 -112082 -45352 141989 -318531
19439 -209630 140866 175217 -61123 192442 -148012 53491 -332598 -93196 -20194 -2734 134464
19427 91205 -40221 -176824 -95279 -192782 63227 131784 -195209 -104538 -223889 -236907 27166
19415 -90352 -180440 -285699 61191 175686 -31582 -21480 -57996 -360276 -87000 -204734 -163473
19404 -163473 -130809 250341 9726 -83670 -171746 -208560 -286864 117293 231241 -234024 -319660
19393 -319660 -121793 -2999 76918 35702 -428055 -182221 -164220 95556 -168020 422142 147035
19381c9090o7735E2293a86340A55194L6075L9025j8871f0708a4552A33365M9623
19370A82988g9303A49630m1896i3104L7329m4068A36923a08628k86293J71526
19360b23395b7026P220A67029o1165d19403J90803C9655g1050B96681b01822f6268
19348A23447k333j2554i4068r1142A06078g3413L0904k84348B34009J66079a0058
19336A65345J09438G7172N1428a06998C2444b40922d5904k24592j5738B0354O3222
19325H3576e30983a02890j99839J42815l5252A55101e3999D6412b81453F4775
19314A05601k7619d34993f2308D3229b1691j43533A42991A5367a59174a3119k1428
19303c4547H114M3282a56252j95786b0099l30444K9891J55247r5272B95644b13268
$$ plain form
19381 -39090 -106825 52293 -186340 155194 191269 230294 211423 -60708 -14552 133365 182988
19370 182988 -79303 149630 107734 -93104 -55775 -99843 136923 -108628 -394921 -223395
19360 -223395 -27026 -19806 167029 105864 -419403 -228600 39655 -71050 296681 -201822 -66268
19348 123447 121114 108560 -94068 -185210 106078 -73413 -42509 -326857 234009 400088 -10058
19336 165345 274783 77172 128600 -106998 32444 -240922 -45904 -270496 -286234 20354 83576
19325 83576 -530983 -102890 -302729 -159914 -195166 155101 -53999 46412 -281453 64775
19314 105601 77982 -434993 -62308 43229 -21691 -165224 142991 15367 -159174 -13119 -34547
19303 -34547 8114 51396 -156252 -352038 -20099 -350543 -320652 -165405 -260677 295644 -213268
19291a50866L0846l80987J26828B79583a05180A54601E4247C726d1376A0906c5730
19279e6802A984J71322b30874Q9695j51976A0265a28380K3019j66635a05279j25426
19268b30705j53102g0590b8571C8126e7338D28303c05618c2016A75481h5380B7790
19256C6425J30566a28436j55690f3607n8489D0813j4546J094a50860k09887J44070
19245b16677h8468c1456k65781A29371O7810b01672D9756a53244L9648m29564
19235e43160e8602p9839A33135l3473i3136j47560J08994B84235b24683c8314
19224a53999N2696C3943a1129m14001M2052B8969c89125i7567p9973B08013K3233
19213B31246j10170c49217a68640A90373G0791L3217b19930b3509C4528a5405
$$ plain form
19291 -150866 -120020 -501007 -374179 279583 -105180 154601 54247 3726 -41376 10906 -35730
19279 -56802 1984 173306 -230874 -141179 -293155 10265 -128380 -105361 -271996 -105279 -230705
19268 -230705 -383807 -70590 -28571 38126 -57338 428303 -305618 -32016 175481 -85380 27790
19256 36425 166991 -128436 -284126 -63607 -122096 40813 26267 27361 -150860 -360747 -216677
19245 -216677 -88468 -31456 -297237 129371 197181 -201672 49756 -153244 -113596 -543160
19235 -543160 -58602 -138441 133135 99662 -93136 -240696 -131702 284235 -224683 -38314
19224 -153999 -101303 33943 -11129 -425130 -383078 28969 -389125 -97567 -177540 208013 231246
19213 231246 121076 -349217 -168640 190373 70791 104008 -219930 -23509 34528 -15405
19202b84088M462a9591k12717K7442e6938o8818N5230C08976c08002c656j14003
19191a17659A43790J38983A1998N6088a26941a467l09639A80516b14669G739b11691
19179b42246e1888l5183j19835d3493J6710D5767I787i7377j49039f7197B29260
19167a31740q4187A64934a64892B66820q2942p9714a86193k6233B92879a13960
19156c50644A00091f145j39119A8335a26899A96158n3032a97667P8999B9703b53516
19144b02365I0665b2748j0195j09579j3560A15872i7893p8770h6001B40069a01346
19132b34166C5518a12729k17971B44162c6934k84195G321a65858g5408A44018
19121A38538a2875j12859a1123l6046H2674K17413A17165j9513b51895j75322
$$ plain form
19202 -284088 -279626 -19591 -232308 -204866 -56938 -125756 -70526 308976 -308002 -3656 -117659
19191 -117659 143790 282773 11998 68086 -126941 -1467 -311106 180516 -214669 7739 -211691
19179 -242246 -51888 -87071 -206906 -43493 -26783 45767 9787 -97377 -246416 -67197 229260
19167 -131740 -215927 164934 -164892 266820 183878 104164 -186193 -212426 292879 -113960
19156 -350644 100091 -6145 -145264 18335 -126899 196158 143126 -197667 -118668 29703 -253516
19144 -202365 90665 -22748 -32943 -142522 -156082 115872 -97893 -176663 -86001 240069 -101346
19132 -234166 35518 -112729 -330700 244162 -36934 -321129 7321 -165858 -75408 144018
19121 138538 -12875 -125734 -11123 -47169 82674 300087 117165 97652 -251895 -427217
19111d27217I7517J07213b93522A49875A0025K9053a37682q2963I1502a21484
19100b26778b3266A7589e6067k38110M266g6540H0961a44283g1912A49549a15445
19088b34208P9760H7773a23341j66629Q446b1061B19527f9061A12981g1922B88488
19076A01062D9156c9608D1568a38875D3836p135b72514J11023j6650M5344N3423
19065g9374m9483M367j00507e6364j14798k05386I3745b3767G0014c2290j57085
19054a89375D0092J08647c3253j97554M3781C8952b95069a34887r238E9933j9961
19043C9972J61401b63354a07894j78914B868K9244a61476G648d49684b15482N8459
19032a57023J8424O1675J6985A3720i4487j20251e5897l10738C6179P4442D4841
$$ plain form
19111 -427217 97517 204730 -293522 149875 10025 39078 -137682 -220645 91502 -121484
19100 -226778 -23266 17589 -56067 -294177 -289911 -76540 80961 -144283 -71912 149549 -115445
19088 -234208 -154448 87773 -123341 -289970 -281524 -21061 219527 -69061 112981 -71922 288488
19076 101062 49156 -39608 41568 -138875 43836 36701 -272514 -161491 -178141 -132797 -79374
19065 -79374 -128857 -124490 -224997 -56364 -171162 -376548 93745 -23767 70014 -32290 -189375
19054 -189375 40092 148739 -33253 -230807 -187026 38952 -295069 -134887 -144125 59933 39972
19043 39972 201373 -263354 -107894 -286808 2868 32112 -161476 7648 -449684 -215482 -157023
19032 -157023 -138599 -76924 -59939 13720 -94487 -214738 -55897 -366635 36179 110621 44841
19020B3479J57465p2663E0395b98563A96402J2629J16191b7258C29271p0257a52970
19008a35747A11562g6288C67776b71025D34508f3507k40809J7292J28814k14898
18998c73108a30170K4177j77308j16323A0389c3452I8168H493g8332A76812b32494
18986A07359b17405a00637D7631b689j11110I5897L694a93753K4534h4193j27736
18975b11929H6817c8185B27487j08307R7850H8919e6337A43919i639k05305C46897
18963c4043B8140R8831a43742B1035a01681B82747A07579R3584F6610b91480B37407
18951b51532a24716l9387C39950c9292j12664j15730E8403b91680A76651i996
18940c47448P9796E4146c71624j04117a10700C5583o762a6231j53897k9847R7453
$$ plain form
19020 23479 180944 108281 50395 -298563 196402 209031 325222 -27258 329271 259014 -152970
19008 -135747 111562 -76288 367776 -271025 434508 -63507 -304316 -287024 -158210 -373108
18998 -373108 -130170 -105993 -283301 -399624 10389 -33452 98168 8493 -78332 176812 -232494
18986 107359 -217405 -100637 47631 -2689 -113799 95897 99591 -193753 -169219 -84193 -211929
18975 -211929 86817 -38185 227487 119180 217030 88919 -56337 143919 -9639 -214944 346897
18963 -34043 28140 126971 -143742 21035 -101681 282747 107579 201163 66610 -291480 237407
18951 -251532 -124716 -164103 339950 -39292 -151956 -267686 58403 -291680 176651 -9996
18940 -347448 -267652 54146 -371624 -475741 -110700 35583 28821 -16231 -170128 -199975 -102522
18929a02522A72049a92764A89667a8597l26404O8224K6304N410g0715j84995E7391
18917D1379B963c54175a12589k64680b3007b650k29683N7189l11554b35416B4847
18905f1739E1930b1805p8546r7312i2710E0504c37438b1824h890C94989G3454
18893C86321L9328F8926K1510a05p0979A36854h5506L4363A27555J27585F1078
18881A67362a4284l10282a48102A2473b82084b4436j46008A24426d263A87391
18870a75957M0559j52131j37494J84538n2072a28260D739i0299A13688c4989n4465
18859h9454q2378F3549a8471k071k07532M5493I285b512B504O0812O3522a56704
18846G5822a49504N3020n3180E4231b12386J9096J6737D7562d3846k74360A73967
$$ plain form
18929 -102522 172049 -192764 189667 -18597 -345001 -276777 -250473 -245063 -70715 -255710 57391
18917 41379 2963 -354175 -112589 -377269 -23007 -2650 -232333 -175144 -486698 -235416 24847
18905 -61739 51930 -21805 -100351 -197663 -92710 50504 -337438 -21824 -8890 394989 73454
18893 386321 425649 68926 90436 -105 -71084 136854 -85506 -51143 127555 255140 61078
18881 167362 -14284 -324566 -148102 12473 -282084 -24436 -170444 124426 -4263 187391
18870 -175957 -135398 -287529 -425023 -240485 -292557 -128260 4739 -90299 113688 -34989 -89454
18859 -89454 -171832 63549 -18471 -20542 -228074 -182581 9285 -2512 2504 63316 126838 -156704
18846 75822 -149504 -96484 -149664 54231 -212386 -193290 -176553 47562 -43846 -318206 173967
18834b10447f2594k52133K1798O2739g0286H3091d24932B27477a9233A68998m9351
18823A19647i5387m8249k09294A1637b2825j9564B91711b58394e3559A76230a32059
18811a27217b9515B45655A03297m6040f3066Q316B15167H6409c08537g0495A94608
18799a17189A08302J75639G5340J9694a0015B86526a82862B14180G1785a79673
18788a54994f2231k6370q6206k6357d861m7801j47090A51973f3249B27583m4036
18777A83547A6873a21971A95957D6397i9948K6325j68757g7303A81313b49834
18766a04413j20412f2855j29908r9392j16307B36183b15186l7205A753D69a30149
18754a37975B56427p0485K72516G7574c6262A37108C4196L34738a29782b2364
$$ plain form
18834 -210447 -62594 -314727 -292929 -230190 -70286 83091 -424932 227477 -19233 168998 119647
18823 119647 -95387 -143636 -352930 11637 -22825 -42389 291711 -258394 -53559 176230 -132059
18811 -127217 -29515 245655 103297 57257 -63066 -54750 215167 86409 -308537 -70495 194608
18799 -117189 108302 283941 75340 95034 -10015 286526 -182862 214180 71785 -179673
18788 -154994 -62231 -88601 -174807 -201164 -4861 -52662 -199752 151973 -63249 227583 183547
18777 183547 16873 -121971 195957 46397 -99948 -73623 -242380 -77303 181313 -249834
18766 -104413 -224825 -62855 -192763 -292155 -408462 236183 -215186 -252391 1753 469 -130149
18754 -137975 256427 185942 458458 77574 -36262 137108 34196 368934 -129782 -22364
18743e50589f4139r6360N0439c3417a0162o6548B37272a38981q1074B23571A8522
18731G2991L8695m5446P571J01628c54233B6717a62682K6745N9872h164C6833
18719d23737B7845L72271a67932A20505h550I5869D2410a95906b8179j03188B50667
18707f2490f449l57654a19788A02958b08937G7229O2009J42184a05683k81630
18697c87313g4900j58855m63j70612O8290E5608d7870k06613H716b41935D6552
18685b02125P3827l2025M3196j99196g7493J5532j3238a0704B755e44911c4356
18673B08817e5292A23421e4386p6123a2179k65704g5714H694J06095b92359n7363
18662c49722a01806D2244L4725a13042d6232l90164G8061c72856B62030A22825
$$ plain form
18743 -550589 -64139 -160499 -110060 -33417 -10162 -76710 237272 -138981 -220055 223571 18522
18731 72991 111686 66240 73811 175439 -354233 26717 -162682 -135937 -76065 -8164 36833
18719 -423737 27845 400116 -167932 120505 -8550 95869 42410 -195906 -28179 -131367 250667
18707 -62490 -6449 -364103 -119788 102958 -208937 77229 139238 281422 -105683 -387313
18697 -387313 -74900 -233755 -234218 -404830 -336540 55608 -47870 -254483 8716 -241935 46552
18685 -202125 -128298 -160323 -117127 -316323 -77493 -61961 -75199 -10704 2755 -544911 -34356
18673 208817 -55292 123421 -54386 -130509 -12179 -277883 -75714 8694 114789 -292359 -349722
18662 -349722 -101806 42244 76969 -113042 -46232 -436396 78061 -372856 262030 122825
18651C0228c06260E7839a95095B28584D5063c06563a17215c2269a0839B74552
18640a71681B30790J00859A28948e0651j85965J17535A53312b13612f8144B35190
18629A14034h2267p7952R748A99851q4945b85242d9314j18547A69224L7541c9577
18617h8880A16425J94897h6574a5761n3427D5982Q8437E359g7346k40432J25166
18606a92612B18481F893i7449E611K00835D0245d7535H607b1509n4342k78465
18595c54316j31704A50723a14389C7341J55184a4917A383a87519k2697i0617j18215
18584b08832A30580e0135j1655j56192A48553b03461C86821D3409Q2161a65533
18573b28856A9699g5800j53373j03961A50821a71281Q3602j38299R2683q6484
$$ plain form
18651 30228 -306260 57839 -195095 228584 45063 -306563 -117215 -32269 -10839 274552
18640 -171681 230790 331649 128948 -50651 -236616 -119081 153312 -213612 -68144 235190
18629 114034 -82267 -160219 -150471 199851 114906 -285242 -49314 -167861 169224 206765 -39577
18617 -88880 116425 311322 -86574 -15761 -69188 45982 134419 5359 -77346 -317778 -192612
18606 -192612 218481 6893 -97449 5611 206446 40245 -47535 8607 -21509 -75851 -354316
18595 -354316 -486020 150723 -114389 37341 192525 -14917 1383 -187519 -210216 -90617 -208832
18584 -208832 130580 -50135 -61790 -217982 148553 -203461 386821 43409 125570 -165533
18573 -228856 19699 -75800 -229173 -333134 150821 -171281 -87679 -225978 -133295 -219779
18563b19779e6803j46066l72073A03902a12959j4339l35121J56838L5973j08305
18553c77913a30465a6660G9358L753O4371a75343h2359o4103P1021A46987K5889
18542A72876d2690H6708a97055A24861f5578m3269j7012H222M8749J26562K50477
18531D34010a8168o1622a7278A01679e3876A35186K4324F7142a288m5704k80386
18520c27378E4479J21356a66007A44038c22760J13680a1815A43583a9675n0891
18510g0566A98835a38366A51870a37873L6776l9784f7633j25948J926I0562c37959
18498b37808d751m28328h4583j19339K0392Q1704o5900j08999c0173B3652N7541
18487H1193a85501h8714B2624d7588A66429D4830K38916B3553J92205b16539C8691
$$ plain form
18563 -219779 -56803 -202869 -574942 103902 -112959 -127298 -462419 -305581 -269608 -377913
18553 -377913 -130465 -16660 79358 83111 147482 -175343 -82359 -146462 -75441 146987 172876
18542 172876 -42690 86708 -197055 124861 -65578 -108847 -125859 8222 56971 183533 434010
18531 434010 -18168 -79790 -17278 101679 -53876 135186 159510 67142 -1288 -46992 -327378
18520 -327378 54479 175835 -166007 144038 -322760 -209080 -11815 143583 -19675 -70566
18510 -70566 198835 -138366 151870 -137873 -101097 -140881 -67633 -193581 -191655 90562 -337959
18498 -237808 -4751 -433079 -84583 -203922 -183530 -101826 -167726 -276725 -30173 23652 81193
18487 81193 -185501 -88714 22624 -47588 166429 44830 283746 23553 215758 -216539 38691
18475h1720m320l097o481m7154K0657n5893j6194A13441J22661b41460K0499A13510
18462f6580D4364a1704B00727c85559g1862n3368C62622h5056B01632c5070j36776
18451a71846j04918H3234L6124C3979a1104m5936D7937d8711j15321N5022d3506
18439h4279J2449k02958M5442C3494M8005K0053c22958L3239a20362P353d2853
18427b37354g7745k6215H6957b47316e2317F2632b46278a19023B28584I8710K1456
18416A20166J2708B0276P3381a88223P4064A45016a69169O4606B24725a47679
18405b64360h8492P460l1015e2017k3175B77018c05257J2287B0035d36593J96148
18394b40445k7731K5116g1745A50963a90205R753h0452A15526b33141C74336a87394
$$ plain form
18475 -81720 -86040 -89137 -95618 -142772 -122115 -178008 -194202 113441 236102 -241460 -220961 113510
18462 -66580 44364 -11704 200727 -385559 -71862 -125230 362622 -85056 201632 -35070 -171846
18451 -171846 -276764 83234 119358 33979 -11104 -57040 47937 -48711 -164032 -109010 -43506
18439 -84279 -71830 -274788 -229346 33494 81499 101552 -322958 -289719 -120362 -113009 -42853
18427 -237354 -77745 -103960 86957 -247316 -52317 62632 -246278 -119023 228584 98710 120166
18416 120166 132874 20276 93657 -188223 -114159 145016 -169169 -104563 224725 -147679
18405 -264360 -88492 -81032 -112047 -52017 -75192 277018 -305257 -292970 20035 -436593 -240445
18394 -240445 -268176 -243060 -71745 150963 -190205 -180452 -80452 115526 -233141 374336 -187394
18382A04507K61115A14523n1502a37448P21j8672A34401E5224e876k90820a33652
18370C69173D2704a79525M3897A25455R2769e6608k82834B0739b43156Q3177B56944
18358g1171m9118j8013C15419b3155A86672g4701j67966A02736h2484J6870A64130
18346D406J07528l6341a35556d1735j43624D41165A42736b26305D0723J71850
18336B12573b12967j21621i2964n8836K7984A30302f0642l8192j32877i549j03428
18325a12977B91c8726J8148j0448d53o8852p206k32592r0329C592L11663q5924
18313B29331F3242M6408b06249Q8363a4453G562J45996a23094E5526P6433a29628
18301a49486A78159a35711l09418b01531c4545H4037d9784k6171l25559B4663
$$ plain form
18382 104507 365622 114523 63021 -137448 -136727 -155399 134401 55224 -5876 -296696 -133652
18370 369173 42704 -179525 -135628 125455 218224 -56608 -339442 20739 -243156 -159979 256944
18358 -71171 -120289 -138302 315419 -23155 186672 -74701 -242667 102736 -82484 -65614 164130
18346 4406 111934 75593 -135556 -41735 -185359 441165 142736 -226305 40723 212573
18336 212573 -212967 -334588 -92964 -151800 -123816 130302 -60642 -98834 -231711 -9549 -112977
18325 -112977 291 -38726 -20578 -31026 -453 -69305 -76511 -309103 -399432 3592 315255 229331
18313 229331 63242 109650 -206249 -117886 -14453 7562 153558 -123094 55526 131959 -129628
18301 -149486 178159 -135711 -445129 -201531 -34545 84037 -49784 -75955 -401514 24663
18290g1246J2717B00784b57085J13126b2741H604Q7879b98777F7182a93182j36049
18279c29231i0051A65309l7690E1254L01481a26401L3473M0657B6231Q470l105
18268C1596b88868K1925B7889b11100A02920J07685A01784g9672k64034D5176
18257A4101N6057b58561A57665c27472g1456r5014j86470B22907g4545E4160K24297
18246B78457a38220j44525e8402D2622K0467b32693R8247j59794f2419n8134B63025
18234a44875b6730j97822C2383a7752j72117R3793B11829b30413L5153R1560A30753
18222D158J11044K1466a11956l1770A84213Q0714l3829c17723H8113b66224N7054
18211b09170B24284b8285A30616K1192n1833d23642A18282a0182j72173Q825A14091
$$ plain form
18290 -71246 -58529 200784 -257085 -143959 -22741 8604 96483 -298777 67182 -193182 -329231
18279 -329231 -90051 165309 127619 51254 352735 -126401 -92928 -52271 26231 34701 31596
18268 31596 -288868 -266943 27889 -211100 102920 210605 101784 -79672 -343706 45176
18257 14101 70158 -258561 157665 -327472 -71456 -166470 -352940 222907 -74545 54160 278457
18246 278457 -138220 -282745 -58402 42622 63089 -232693 -134446 -294240 -62419 -120553 263025
18234 -144875 -26730 -224552 32383 -17752 -189869 -96076 211829 -230413 -195260 -103700 130753
18222 4158 115202 136668 -111956 -143726 184213 264927 231098 -317723 88113 -266224 -209170
18211 -209170 224284 -28285 130616 151808 99975 -423642 118282 -10182 -182355 -173530 114091
18199b39308B52478a73364f2838A51788e0207E4868J1541E196J73269a90803H6759
18187c00611a44991I2550J7553a12067O923d4698j24131e2367l30308B07094H2873
18175a85561j5146F159b36409R3069B8218a30078e415j45105f6564H5249L9502
18164A24751K02577a7947j49077D1452J09159m581a86929b3067F2702N7719b10236
18152i4666j99027a16119B72475a57905B35262b05013n3973a03884A6669a56890
18141h5502l4170n5540O8907j5125j39458B0124i1861K3887P521A29553a53673
18129C11940g747k31114A02134e3394B07417d25116B9288K3354d6534o7668A0994
18117B30713o8467c18440B29622a6440m9596B05373a76515A70616b5645m58111
$$ plain form
18199 -239308 252478 -173364 -62838 151788 -50207 54868 66409 5196 178465 -190803 86759
18187 -300611 -144991 92550 110103 -112067 -105144 -44698 -168829 -52367 -382675 207094 82873
18175 -185561 -200707 6159 -236409 -143340 28218 -130078 -5415 -150520 -66564 85249 124751
18164 124751 327328 -17947 -167024 41452 150611 146030 -186929 -23067 62702 120421 -210236
18152 -94666 -293693 -116119 272475 -157905 235262 -205013 -258986 -103884 16669 -156890
18141 -85502 -119672 -175212 -106305 -121430 -260888 20124 -91861 -67974 -60453 129553 -153673
18129 311940 -7747 -238861 102134 -53394 207417 -425116 29288 52642 -46534 -114202 10994
18117 230713 162246 -318440 229622 -16440 -66036 205373 -176515 170616 -25645 -483756
18107d83756L5959a31902e2463A92671b3047C9353b9736A05223g9904j49166f8218
18095A33491a1962q6122D6941L06459A36167L1856b12021f7616F5515B8203b9567
18083A51247h4235H5728c540j66517H9572K3690a50800j8784j0627p8374B458
18071E8188a9405B2851P6771b46734P8623i613H5199J3775b63071d615B82684
18059B55197g5261D29191B12807e4830A97990G7288l585a69137c979C34b2643
18047A9732b0131A00833C4553j0025b62117i2290A34832a95357G6464a56649b7302
18035H6969c30778J17000m991b8572n1015A39090b4765k08756Q5907A23290a70628
18023I3815b66641a16358C32887c16269J57837N7369j70087G7186a14522g15A14535
$$ plain form
18107 -483756 -447797 -131902 -52463 192671 -23047 39353 -29736 105223 -79904 -229070 -68218
18095 133491 -11962 -98084 46941 353400 136167 168023 -212021 -67616 65515 28203 -29567
18083 151247 -84235 85728 -3540 -170057 89572 113262 -150800 -169584 -180211 -258585 2458
18071 58188 -19405 22851 99622 -246734 -168111 -9613 85199 98974 -263071 -4615 282684
18059 255197 -75261 429191 212807 -54830 197990 77288 73703 -169137 -3979 334 -22643
18047 19732 -20131 100833 34553 24528 -262117 -92290 134832 -195357 76464 -156649 -27302
18035 86969 -330778 -213778 -218769 -28572 -79587 139090 -24765 -233521 -147614 123290 -170628
18023 93815 -266641 -116358 332887 -316269 -158432 -101063 -271150 77186 -114522 -715 114535
18011f9484I1208C3695R6233d2467A79106a2041A94388A0750K91742j7510j4923
18000B70059c57973a32382H2097h188m37726B64276A13763b93836A18664K209
17990A20873i5166o5016D0260M2211A208M5007a74892B6408K71812c8245m2094
17979h0339j59155B61690q7254f0315q281b4516C92546j80918n5556h9356B53847
17967A29070o1024d5949G9874a80643g7705l01731a23805G0147K69659D9981a02976
17955a46317P0034A15936A0474J5110a26033H7078e3400r7626D7086a32558j1102
17944a43660e6185E2026e8411B15165l0532b54267f9074k4561j33835A36562a08798
17932b7364C3239A5781h0941D14313A62482h5396B19761n3403N2451G9576a64219
$$ plain form
18011 -69484 91208 33695 129928 -42467 179106 -12041 194388 10750 302492 284982 270059
18000 270059 -357973 -132382 82097 -8188 -445914 264276 113763 -293836 118664 120873
17990 120873 -95166 -160182 40260 82471 1208 46215 -174892 26408 298220 -38245 -80339
17979 -80339 -239494 261690 174436 -60315 -68596 -24516 392546 211628 156072 -89356 253847
17967 129070 68046 -45949 79874 -180643 -77705 -379436 -123805 70147 339806 49981 -102976
17955 -146317 -76283 115936 10474 25584 -126033 87078 -53400 -151026 47086 -132558 -143660
17944 -143660 -56185 52026 -58411 215165 184633 -254267 -69074 -93635 -227470 136562 -108798
17932 -27364 33239 15781 -80941 414313 162482 -85396 219761 166358 218809 79576 -164219
17920C50465d1235C14173B3716q227b1868j41108D9216J73146d4035A39089K8087
17909A67176E8768d3917k5677K040j15961A13000a32050A36217h8494B5910h8345
17897B07990J71889c0765B95182a9592h816B37439b95877I3903C7667K26970j12469
17886A52168b45303B98359B3527b97088h8033G6876b5118D7314J18314a18657
17875a09288A56078b71342a20334E3298K98476j23253K73709b17269h0109B13618
17864C00533b02829Q5340I4588J00504p9538l7300a56221I4797b2419A38347P8605
17853B16952a48008d2634a9377m86953J63153a09691H008a49253D16964j30586
17843B86378D7752J16101F4773O3425h4359e925k0083A54710i4265A27058l0809
$$ plain form
17920 350465 -41235 314173 23716 15489 -21868 -162976 49216 222362 -44035 139089 167176
17909 167176 58768 -43917 -69594 -67554 -183515 113000 -132050 136217 -88494 25910 -88345
17897 207990 379879 -30765 295182 -19592 -8816 237439 -295877 93903 37667 264637 152168
17886 152168 -245303 298359 23527 -297088 -88033 76876 -25118 47314 165628 -118657
17875 -109288 156078 -271342 -120334 53298 351774 228521 502230 -217269 -80109 213618
17864 300533 -202829 -117489 94588 195092 115554 78254 -156221 94797 -22419 138347 216952
17853 216952 -148008 -42634 -19377 -506330 -343177 -109691 8008 -149253 416964 286378
17843 286378 47752 163853 64773 128198 -84359 -5925 -26008 154710 -94265 127058 96249
17832I6249A4402P9718h3190G5269M0527a55761F7097N5871P2838m9318J21421
17821B67909a4419k93248D6054j8000r088c27634G2933a7900j43222B18086G8835
17809E9876R2059a51671c6624G4656J55268j4892a07508k14154d7681k1690D63363
17797d99953c0070J1185j16358C90194a21962b1539A39840o4837a18445B03188
17786I3930f0726j49445D13717B02509A3653b93054c4860B50844b21412h8002
17775A33398j9426j6158Q4497C8263J97269a22436A32450a08640N1519A15234
17764B1735d2885m8058m4255b8987C7171J95968E5158L42543a48181a8656j25399
17753a44055K4316k83728B26197A10008N1974a66326d6890C8113b35987b3751
$$ plain form
17832 96249 14402 94120 -83190 75269 115796 -155761 67097 122968 195806 146488 267909
17821 267909 -14419 -307667 46054 28054 18966 -327634 72933 -17900 -161122 218086 78835
17809 59876 151935 -151671 -36624 74656 229924 215032 -107508 -321662 -47681 -69371 463363
17797 -499953 -30070 -18885 -135243 390194 -121962 -21539 139840 75003 -118445 203188
17786 93930 -60726 -210171 413717 202509 13653 -293054 -34860 250844 -221412 -88002
17775 133398 113972 97814 182311 38263 235532 -122436 132450 -108640 -57121 115234
17764 21735 -42885 -90943 -135198 -28987 37171 233139 55158 397701 -148181 -18656 -144055
17753 -144055 -119739 -403467 226197 110008 161982 -166326 -46890 38113 -235987 -23751
17742A79268C6917J95076a39168j26744A48157b48262B67649A14924C2969a93083
17731A61043J09987A33020F3639J15152J30043A00483l8277J49527b01519E0334
17720d6526j20398B40350C7764K05604j14111O7561P4005B7914a3632B23732L7363
17709B61095K86548B21784A08897a78296P8492A08876k6007l5002J17792R9922
17699B65581j08005J1246A5082K98485j31663o6149k158k4953J89499C4949J17335
17688A52284J5611C4310c7940J8557G92L61767A40291a0656r210i05j07812K7328
17676h1389D06965a28448c3868I2432h9416C5777d436A78908a10293B70168n7227
17665B12941n1597i658j14101A53524a16700D53971j40176a57285I7228J94408
$$ plain form
17742 179268 36917 231993 -139168 -265912 148157 -248262 267649 114924 32969 -193083
17731 161043 271030 133020 63639 178791 308834 100483 62206 211733 -201519 50334
17720 -46526 -166924 240350 37764 243368 129257 196818 270823 27914 -13632 223732 261095
17709 261095 547643 221784 108897 -178296 -99804 108876 82869 47867 165659 265581
17699 265581 157576 168822 15082 313567 181904 115755 113597 88644 278143 34949 152284
17688 152284 167895 34310 -37940 -19383 792 362559 140291 -10656 -19866 -905 -108717 -81389
17676 -81389 406965 -128448 -33868 92432 -89416 35777 -4436 178908 -110293 270168 212941
17665 212941 161344 -9658 -123759 153524 -116700 453971 313795 -157285 97228 291636
17655B91636j27428K45254a78504D45803r5449j39559J52402j76417f4343B48509
17644c84355A31451c0383e056A44966m1731J76234r8695h2599o4662B87831A05785
17632a4186I5741g8508E6695J93044a57276q7341d5059n3495A55175B8382M57188
17621D85570b04179H9403K13489J50201G4922J66219a01407M0761B42451a30761
17610B59426j21886O7189a04388C23418j9681A31512l7225a3985p9813o5641D00934
17598a28091B14753Q563A4625o769L2147J92094o6529b8659e48k07861A17933
17586A6389a43003j11684B13897F5350M8729a11512D1346b42040I1474L45527
17576D37001j83293A00561J74801A10406e1729o2819B68290P0243A39974n0293
$$ plain form
17655 291636 164208 409462 -178504 445803 350354 210795 363197 186780 -64343 248509
17644 -384355 131451 -30383 -5056 144966 103235 279469 180774 -82599 -147261 287831 105785
17632 -14186 95741 -78508 56695 249739 -157276 -244617 -45059 -98554 155175 28382 485570
17621 485570 -204179 89403 302892 453093 74922 241141 -101407 -60646 242451 -130761
17610 259426 137540 204729 -104388 323418 303737 131512 94287 -13985 -93798 -159439 400934
17598 -128091 214753 223316 14625 7856 40003 232097 165568 -28659 -548 -208409 117933
17586 16389 -143003 -254687 213897 65350 114079 -111512 41346 -242040 91474 437001
17576 437001 253708 100561 275362 110406 -51729 -114548 268290 338533 139974 89681
17566H9681J64554l0781j10668E0671J58026f912m4170A50135n2149l7774J73702
17555B33914a39442A83756E4443l324a14701D8400K07620G6911J44994J14366
17545C36271A12517e7001A42909K19795C3668K13422q2061D6318I688J59309n7987
17534A11010J22344K7082A08883a8209F52960B38769F9313K30718O7482j26722
17524B40791b0843j24572C6499b36554G9759m785K21541g3621E6665J58898J05928
17513C21491M8293K10411j37324J73558j8259o0945M31008k25541j99810K10851
17503G53733C43355j06658J14983K883R6987j11470M51003o2861C38937L70033
17493G08970J67j31365K21730C74628K05804N1307k08335A54161K1116J47678
$$ plain form
17566 89681 254235 223454 112786 50671 208697 -6912 -51082 150135 97986 60212 233914
17555 233914 -139442 183756 54443 51119 -114701 48400 256020 76911 221905 336271
17545 336271 112517 -57001 142909 362704 33668 247090 165029 46318 9688 168997 111010
17534 111010 233354 260436 108883 -18209 652960 238769 69313 300031 367513 240791
17524 240791 -20843 -145415 36499 -236554 79759 74974 296515 -73621 56665 215563 321491
17513 321491 369784 580195 442871 616429 598170 537225 968233 742692 542882 753733
17503 753733 343355 236697 351680 354563 451550 340080 791083 728222 338937 708970
17493 708970 709137 577772 799502 374628 580432 631739 423404 154161 175277 322955
17483C22955j913J67398B31182O8824q8759n4721i8826B02357M5635k2730J32089
17472C57351j33510c4076G0279P20J98613K81856b0825A23166L43006A01840A1998
17460H3847C4056K37507R7500p5642f7911A17781L6530F7708L16604q5485E4320
17448C49683J97919A68836M2944O7044k1823D8621K31704a2273A71680J9616B7617
17436D15673j26913Q7816K31863H3950M31323k3142m4667D7502K93055J11193
17426D51750k11830k8658J84587j57165L3714P9279a14029B10941J45132M785
17416C60858j15189J47237A42041K10346q8461j0358L023A19765O2597a76387
17405E7143N21104B51043N6109j43966M22741A78195J50033m3613l5469D2268
$$ plain form
17483 322955 321042 488440 231182 300006 211247 156526 -98826 202357 247992 225262 357351
17472 357351 223841 -34076 70279 70999 269612 551468 -20825 123166 466172 101840 11998
17460 83847 34056 271563 369063 293421 -67911 117781 154311 67708 384312 298827 54320
17448 349683 547602 168836 211780 278824 257001 48621 280325 -12273 171680 191296 27617
17436 415673 288760 376576 608439 83950 515273 492131 447464 47502 340557 451750
17426 451750 239920 211262 395849 238684 272398 351677 -114029 210941 356073 360858
17416 360858 245669 392906 142041 352387 263926 253568 256591 119765 182362 -176387
17405 57143 578247 251043 307152 163186 585927 178195 328228 284615 249146 42268
17394B63318K4263L132N2054E0704J40478J82447B7052J1557M9236m3829N4150
17383I8166j767J27764j3222p123n7032N7389l5649n8976K85549l227A2456L79727
17371C92183p2626a48840C39763m9603m1755J53454j00831I9520J27692O4415
17361B91627J94852I0351J79701J96016A83531c8450A02083M06080F2436a00725
17350C11497l7246K19542I5874J63046j13205J60148A24161C4048K12067q0296
17340A65819J34836p6756I3686J10091l9256K03546j54755J45898q2186j09213
17330A67811O2724A02616N3431K88829A90180Q9657m1740j3287g8440k5352B01598
17318A91242a16787H8816A0413L62094K0015A15266c4708B97146k9944a2770A58477
$$ plain form
17394 263318 287581 290713 342767 50704 191182 373629 27052 38609 87845 44016 98166
17383 98166 96399 224163 210941 203818 146786 204175 168526 109550 395099 391872 12456 392183
17371 392183 319557 -148840 339763 290160 248405 401859 301028 99520 227212 291627
17361 291627 486479 90351 270052 466068 183531 -38450 102083 508163 62436 -100725
17350 311497 274251 493793 95874 258920 145715 305863 124161 34048 246115 165819
17340 165819 300655 223899 93686 203777 164521 368067 213312 359210 277024 167811
17330 167811 230535 102616 156047 444876 190180 279837 238097 224810 -78440 -103792 201598
17318 191242 -116787 88816 10413 372507 392522 115266 -34708 297146 267202 -12770 158477
17306A78385P6947J01719p7448A30331K22408j32067D7585M0696K53527j05247
17296B36561j02063L47158P262A45830J80823j37859N3265K01332A83586q5372
17286I8214j8141J12265J03567F7793J42874N69908C38822A34194l846L09626
17276D39974f0590D65115M2042k44430j0510P4863K01721j40616G3639K64523
17266C38162A19227J50467A1103M69982j00380q2803I8047N0397B6640r540e7806
17254A05588E2349P0345J30036I6803P4440J80923A59046p4840K16706C3016J74124
17243B07140J21928A45653L40267o8549B07442M13013A18721J31256H7188L97520
17233D84708d5848A82242J45119r9448m2442J28182N1573f0437E86656k65210
$$ plain form
17306 178385 255332 357051 279603 130331 352739 220672 47585 88281 341808 236561
17296 236561 134498 481656 488918 145830 326653 188794 242059 443391 183586 98214
17286 98214 80073 192338 295905 67793 210667 780575 338822 134194 130348 439974
17276 439974 -60590 465115 507157 262727 252217 327080 528801 388185 73639 338162
17266 338162 119227 269694 11103 481085 380705 297902 98047 148444 26640 17100 -57806
17254 105588 52349 122694 252730 96803 171243 352166 159046 84206 300912 33016 207140
17243 207140 329068 145653 485920 417371 207442 620455 118721 249977 87188 484708
17233 484708 -45848 182242 327361 227913 185471 313653 365226 -60437 586656 321446
17223C21446g5481H6212Q7657P4735j9851E297L85312M2592A74020m7924J13294
17212B39390k1194J0415L63617j68952D4049L18966r0625J20271p2327K66894
17202E87228R1689A22800L50203l5799J39258k50074j5569j15474K40469A00436
17191C47057j01768F4080J72815l9565K05803j58541J01799j21026L7919D4828
17180C66459J8989o5319n0870N6750J3073J46044F8757K13474m9351R347b5777
17168D32774j64421J4512J58236J3074n2713R5036r5093j98330K51399q798o1776
17157C83900I2277J99416P762C463N23910p4877A55616K82315J86591p4113j68705
17146C81704o6007M50783j84429L9911l09589L8370J12730J53247A09465M76755
$$ plain form
17223 321446 -75481 86212 173869 248604 228753 5297 390609 433201 174020 126096 239390
17212 239390 218196 228611 592228 423276 44049 363015 272390 392661 320334 587228
17202 587228 678917 122800 473003 437204 576462 326388 310819 195345 435814 100436
17191 347057 245289 64080 236895 197330 403133 244592 346391 225365 263284 44828
17180 366459 385448 320129 269259 326009 339082 485126 68757 282231 232880 242227 -25777
17168 432774 268353 282865 441101 454175 401462 496498 401405 203075 454474 445676 383900
17157 383900 92277 291693 299455 3463 527373 452496 155616 437931 624522 550409 381704
17146 381704 315697 766480 582051 621962 312373 350743 463473 616720 109465 586220
17136E86220o8345A94708R2360Q7569O8411K27007o6555m0278r6282m2954M29763
17125H53749k78371J95096b0752E34037j24524J21466j70959o100J9298l5400
17115C37818J95020j44304m927r4121K40407n7743q7085p0807k6221O4753J26498
17104D79288m7094j26608J55944J56281o3380B30421J46911Q4136J77360k37620
17094D01208l4562O8921K46324Q5736l41459m9414L14796B36679J9962K83187
17084E39828k67068K00902L27613j62651B72528J49841N01452B88724J06371J60337
17074E55432J12736k05417n4323J23828J51083j42269l1845B06346P9384L08383
17064E94113j07201p5784k8455M02034l67663L47277O4482j53493k07946K05295
$$ plain form
17136 586220 517875 194708 287068 374637 443048 670055 603500 563222 466940 423986 853749
17125 853749 575378 770474 -20752 534037 409513 530979 360020 353920 373218 337818
17115 337818 532838 388534 383607 289486 529893 472150 385065 314258 288037 352790 479288
17104 479288 432194 305586 461530 617811 554431 230421 377332 461468 638828 401208
17094 401208 366646 435567 681891 767627 426168 376754 691550 236679 256641 539828
17084 539828 272760 473662 801275 638624 272528 422369 923821 288724 395095 555432
17074 555432 668168 462751 408428 532256 683339 541070 509225 206346 285730 594113
17064 594113 486912 411128 382673 784707 417044 764321 828803 675310 467364 672659
17054F72659K72222l72474j05723J73843j0680q5794L19715p8568C61204M61789
17044H22993k74762O1391M0227j60712M39608C13368Q44719l94939k74979M27659
17034I15828k86305J91510k4826k47532K74897P9458m38662M36056j32623k9204
17024G38597J26093k56901j47813K38135k6485J71180q233j11634J73772L2104
17014I28815l53024L19675j52263q992P4888l5008n194r2249K25306L19923m18267
17003H03610o7270J3503J62176R6133l29145O5246J0045q5449L68872j31668J14696
16992A020749J33048n8083k19776j55735J14208J73578j93152k04598J7173P14765
16982A342177l66345O0054o1507j56299J28354L04333l32900o0958M86903o57435
$$ plain form
17054 672659 944881 572407 466684 640527 629847 544053 863768 785200 361204 822993
17044 822993 548231 609622 649849 489137 928745 313368 1158087 763148 488169 915828
17034 915828 629523 821033 796207 548675 823572 903030 464368 900424 767801 738597
17024 738597 864690 607789 459976 698111 671626 842806 834573 722939 896711 928815
17014 928815 575791 895466 743203 734211 809099 774091 768897 676648 901954 1221877 803610
17003 803610 736340 749843 912019 1008152 679007 744253 754298 668849 1037721 906053 1020749
16992 1020749 1153797 1095714 875938 720203 834411 1007989 814837 610239 627412 1342177
16982 1342177 975832 1035886 974379 818080 946434 1250767 917867 856909 1343812 686377
16972F86377K42955J43636J06704k97134m0535k552l1840L12291j27677j7267
16962I74958L84622j73743J1183M3816M949j4976j95468N35620k79278j29346
16952A162337J0017J84663k37682k4631p3693l6590j06123K35885J40733J48261
16942A403177l76782J31421j35897L77062p0989J65612j36727k9434k67906J48072
16932A207609L63111j02752j87118L67838k67336r609j7453M2045M3723J20999
16922A561057L89113n43133K05535j34613K61987j05207L36395k48544k68939
16913A453651K01762k42506K49204j03109J65968j41589M00781k25682N1046J85692
16903A995218k20530Q1244j95611q8990J99712K78101M2794k62159k11616K75654
$$ plain form
16972 686377 929332 1072968 1179672 882538 842003 839451 807611 1119902 992225 974958
16962 974958 1359580 1185837 1197020 1240836 1245785 1230809 1035341 1570961 1291683 1162337
16952 1162337 1172354 1357017 1119335 1094704 1021011 984421 878298 1114183 1254916 1403177
16942 1403177 1026395 1157816 1021919 1398981 1327992 1493604 1356877 1327443 1059537 1207609
16932 1207609 1570720 1467968 1280850 1648688 1381352 1371743 1354290 1396335 1440058 1561057
16922 1561057 1950170 1407037 1612572 1477959 1739946 1634739 1971134 1722590 1453651
16913 1453651 1655413 1412907 1662111 1559002 1724970 1583381 1984162 1758480 1809526 1995218
16903 1995218 1774688 1855932 1660321 1571331 1771043 2049144 2091938 1829779 1618163 1893817
16893A893817k4529L30060L6631k73172L47116l88695L35237k00928J14641j54742
16883B015436n8479N68619n82272M43247l0349Q6385L32790n65111K14573L81022
16873B805861n21139K47330l63564M54170k07685L55353N612R9747j41994P1188
16863B804879P0540l56464M76070j11769J06997J16148j00479K55007K6902k13642
16853C074189J79246j61273K29729O9337k0805J22182J89057L4056j54369J19279
16843C680628R6766l70464N96125m47362J57742K93077j0974L91353k73751K20193
16833D333333k51459q913Q2759K21460J0602N28889r3210J15865K61230l10558
16823D889998J13892n3456J71800K09712l249K15234M2945p3000J41083J31620
$$ plain form
16893 1893817 1869288 2199348 2235979 1962807 2309923 1921228 2256465 2055537 2170178 2015436
16883 2015436 1956957 2525576 1943304 2386551 2356202 2442587 2775377 2210266 2424839 2805861
16873 2805861 2284722 2532052 2168488 2622658 2414973 2770326 2775938 2875685 2733691 2804879
16863 2804879 2875419 2518955 2995025 2883256 2990253 3106401 3005922 3260929 3287831 3074189
16853 3074189 3253435 3092162 3321891 3391228 3370423 3492605 3681662 3715718 3561349 3680628
16843 3680628 3777394 3406930 4003055 3555693 3713435 4006512 3995538 4386891 4113140 4333333
16833 4333333 4081874 4072961 4155720 4377180 4387782 4916671 4823461 4939326 5200556 4889998
16823 4889998 5003890 4950434 5122234 5331946 5328697 5543931 5586876 5513876 5654959 5786579
16813E786579K07778k82190K64808K24545P6993j4137M78602O0491M26545n95073
16803F634941O32339M3011R4073K73023M7726J22289K25105J36729N50072l14350
16793H444958K78182N03144M961r7039N50742J63728J95060K90922R6285M53550
16783A0884493m7939M69243K28025K2577L91277P14267q6888K36391R17003o3984
16773A3664465O59445K54338L5986N46247N04084O14329J53934P12018P84622
16764A7929468K60581N97656O14346N83361P73286M16901N14116J131722P81021
16755B3602458M84539R58401P90405J069835Q28619P30163J158126J200027J074162
16746C1896735J399186J160064J560566R51333J584568K215622J608503J671975
$$ plain form
16813 5786579 5994357 5712167 5976975 6201520 6278513 6264376 6742978 6803469 7230014 6634941
16803 6634941 7267280 7310291 7404364 7677387 7725113 7847402 8072507 8209236 8759308 8444958
16793 8444958 8723140 9226284 9231245 9134206 9684948 9848676 10043736 10334658 10430943 10884493
16783 10884493 10836554 11305797 11533822 11556399 11947676 12661943 12575055 12811446 13728449 13664465
16773 13664465 14323910 14578248 14614234 15160481 15664565 16278894 16432828 17144846 17929468
16764 17929468 18190049 18787705 19402051 19985412 20758698 21175599 21689715 22821437 23602458
16755 23602458 24086997 25045398 25835803 26905638 27734257 28464420 29622546 30822573 31896735
16746 31896735 33295921 34455985 36016551 36967884 38552452 40768074 42376577 44048552
16738D4048552K001396J933859K146428K138692K263739K211154K887207K603116
16730F2234143L129469K686862L268740L300497L345858L746382M141613L945701
16722H9799265L767950M125727M285847M541391M587472M340551M500979M521071
16714A24470253M373393M376665L575260L805367L365443K799777K407472J873359
16706A51046989J354639P42912M01884o47671r02599j570403k138018k316236
16698A45971497l233754l416161l844701m284751m052895m607861m593311m485952
16690A13452111m368350m823674m304330m389589m145955m207333l896570l720132
16682G9596178l951029k985494l373894l621729k755533k819842k695816k335275
$$ plain form
16738 44048552 46049948 47983807 50130235 52268927 54532666 56743820 59631027 62234143
16730 62234143 65363612 68050474 71319214 74619711 77965569 81711951 85853564 89799265
16722 89799265 93567215 97692942 101978789 106520180 111107652 115448203 119949182 124470253
16714 124470253 128843646 133220311 136795571 140600938 143966381 146766158 149173630 151046989
16706 151046989 152401628 153144540 153546424 152898753 151996154 150425751 148287733 145971497
16698 145971497 142737743 139321582 135476881 131192130 127139235 122531374 117938063 113452111
16690 113452111 109083761 104260087 99955757 95566168 91420213 87212880 83316310 79596178
16682 79596178 75645149 72659655 69285761 65664032 62908499 60088657 57392841 55057566
16674E5057566k628701k254137j990604k385444k107370j680996j488782j600975
16666C8920557j993962j599336r76569j567475j000682j328489j274032j275347
16658B7904665l85856j116541j051316q25358j070032m83323p50276j008464r79064
16649B0234435l57980o09364n30110n46958o72819m90005m82089l42215q20921
16640A5381974k96608o61004k5786m33576n62090m38796k72534j95314j2784n76158
16630A1907324k28873k09567n15698k77126r4266l32541l50714j75996k92005
16621I430538l57534J11115j202o55689j74340K15820n04217k93610n6575q5882
16611G628424k01081j03564m09766j93692j81187J21126j4656j10792l01747Q2061
$$ plain form
16674 55057566 52428865 50174728 48184124 45798680 43691310 42010314 40521532 38920557
16666 38920557 36926595 35327259 34350690 32783215 31782533 30454044 29180012 27904665
16658 27904665 27518809 26402268 25350952 24525594 23455562 22972239 22221963 21213499 20234435
16649 20234435 19876455 19267091 18736981 18190023 17517204 17027199 16545110 16202895 15381974
16640 15381974 15085366 14424362 14398576 13965000 13402910 12964114 12691580 12496266 12483482 11907324
16630 11907324 11678451 11468884 10953186 10676060 10581794 10249253 9898539 9722543 9430538
16621 9430538 9073004 9184119 9182917 8527228 8352888 8568708 8064491 7770881 7714306 7628424
16611 7628424 7427343 7323779 6914013 6720321 6539134 6660260 6645604 6534812 6233065 6315126
16601F315126j90843K0045l66273J74076o8122n30791K07119j2173P959N747k71446
16590E290424l422n53505J99636l9247l90715j6715J61403l09419K22205n1675
16580D508970l11867P8967j14623K597j13103p3492m29599M73842k00748K46166
16570D067110k53265P3030o49748M20693k54752L3210j36424J38656m10608J45501
16560C173403j94666j73861J31473r083P1846j82251P5679P1175M0205l53200
16550B650720K33569l43522j58742N90189k31304n21303M18184k77010M44508
16541B805289k34610k41369M16432n14278J2670J85617j73754j43199m0436p7781
16531A994581N13487k34941M921R5250l29902m3445R2445j80588k4942N05219
$$ plain form
16601 6315126 6124283 6144328 5778055 5952131 5884009 5353218 5560337 5548164 5556123 5561870 5290424
16590 5290424 5287002 4733497 4933133 4893886 4503171 4486456 4647859 4338440 4560645 4508970
16580 4508970 4197103 4276070 4161447 4164044 4050941 3977449 3547850 4021692 3820944 4067110
16570 4067110 3813845 3886875 3237127 3657820 3403068 3436278 3299854 3438510 3027902 3173403
16560 3173403 2978737 2804876 2936349 2927266 2999112 2816861 2892540 2963715 3003920 2650720
16550 2650720 2884289 2540767 2382025 2972214 2740910 2219607 2637791 2360781 2805289
16541 2805289 2570679 2329310 2745742 2231464 2244134 2429751 2255997 2112798 2072362 1994581
16531 1994581 2508068 2273127 2278048 2373298 2043396 1999951 2092396 1911808 1886866 2392085
16521B392085O3267p93550J39605m0859J34781Q8778l59568N09769j69583q6025
16511A878700J22403l53989K9016L78630k704l47305N1358q0731l6781k61952
16501A376645k6152P7027P4306j56288K20361O8272n4806J39388k49583J39508
16491A608678N101j96265K3178J19316l42598M2728M15557l14606K01418o8022
16481A494485j43056m20520L28489j60727J18370J98851M9355l34344P52J57707
16471A289362n3192Q7407l91962L3238J12904K44417j13851J18748J5973J23072
16461A466116k79834j28688k0388J54969j20044k2412N2953k59947L9390O222
16451H88337R2772p024K4126L49K79772l76358K20814j89751L46958m15162J06406
$$ plain form
16521 2392085 2455352 1661802 1801407 1760548 1895329 1984107 1624539 2134308 1964725 1878700
16511 1878700 2001103 1647114 1676130 2054760 2052056 1704751 1756109 1675378 1638597 1376645
16501 1376645 1350493 1427520 1501826 1345538 1565899 1634171 1579365 1718753 1469170 1608678
16491 1608678 1613779 1417514 1440692 1560008 1217410 1260138 1675695 1361089 1562507 1494485
16481 1494485 1351429 930909 1259398 1098671 1217041 1415892 1465247 1130903 1131655 1289362
16471 1289362 1236170 1323577 931615 964853 1077757 1322174 1208323 1327071 1343044 1466116
16461 1466116 1186282 1057594 1037206 1192175 1072131 1049719 1102672 842725 882115 888337
16451 888337 981109 974085 998211 998560 1278332 901974 1122788 933037 1279995 864833 971239
16440I71239Q0148j41786j40361K22883J39530m06326K25269r3558j07805m8002
16430G01231J82760L35954k68254j75660J74008N7461L24657n84669M0009P728
16420G95225J36254r3534K33561k75606J99799j81628J36977m23236O11511l40744
16410G98579n6913O9909N1431r2981L92431n04503L57013D25845J16796K17768
16400G60409C69135L90308k0685o2198K35245j83115J23028k55424J4473j29769
16390D80998J32907J34969j95705J45977k26676k8801J50046K36158L82333D41817
16379D42262M72954C52621N88373l92436J63049n8458K51068j27997P3636j77914
16369F71942K65644k62741q330k75937N7328o142L91952l9895k12574l4503l3811
$$ plain form
16440 971239 1051387 909601 769240 992123 1131653 725327 950596 857038 749233 701231
16430 701231 883991 1219945 951691 776031 950039 1007500 1332157 747488 787497 795225
16420 795225 931479 837945 1071506 795900 995699 814071 951048 527812 1139323 798579
16410 798579 741666 811575 863006 770025 1162456 657953 1014966 425845 542641 760409
16400 760409 369135 759443 738758 676560 911805 728690 851718 596294 610767 480998
16390 480998 613905 748874 553169 699146 472470 443669 593715 829873 1212206 441817
16379 442262 915216 352621 940994 548558 711607 653149 904217 776220 849856 671942
16369 671942 937586 674845 666515 390578 447906 441764 833716 793821 581247 546744 512933
16358E12933R2733K54808k94055J22492k17288N8414K06449J15477k50583q6715
16348E14665K65470j39660k9493j60345K67319j93804K56002k34889J79138J4172
16338G38575k81237R7160j97638J56704J13172r2724j04991j59540N85155l71627
16328D83009N05778D69593j04862n4262L87094j89555l6285m5513L19667j85997
16318E59880j28285J63628K05343q4371l47273J39380O5291M563o3499O2835j10897
16307D66595j05080q0903p0467L73736k00294p7819b7316E10079O8579n6698B20507
16295C34705M52629C77740j9272Q1881J33355K18281C36654n818r5410J93184
16285D28610J44220j9384Q0612B44771N0997J83286k22189P337q3931K45425L13318
$$ plain form
16358 512933 605666 860474 566419 688911 471623 530037 736486 851963 601380 514665
16348 514665 780135 640475 610982 450637 717956 524152 780154 545265 724403 738575
16338 738575 457338 554498 356860 513564 626736 534012 429021 269481 854636 483009
16328 483009 988787 469593 364731 310469 697563 508008 471723 426210 745877 559880
16318 559880 431595 595223 800566 716195 368922 508302 573593 578156 514657 577492 466595
16307 466595 361515 280612 210145 583881 383587 305768 -27316 510079 578658 521960 220507
16295 334705 787334 377740 358468 440349 573704 791985 336654 330836 235426 428610
16285 428610 572830 553446 634058 244771 295768 479054 256865 264202 180271 425696 739014
16274G39014A80868M2742K83571J6963j06188N8062K20873C44629K111j23884
16264B22856L16380j32304J36295j66142K79661H3942K19184l9663j19684M69822
16254F13601j55458m9178r1738k1254M18665l34774O8857j06235J52668j62276
16244C32878L07033A40974L39805n8348j98896O22007B97755L06110k63273q8717
16234B51875K28152l2431k05932N8358K29608r6514C1297J19295N4824m638J00618
16223C01396Q4563q2978J274i8478E087L20496j42334C2156J51767L71852B30583
16211B95810J09903j43902K33893B31858K7369J67634r0541J27754A87067J57041
16201C44108A30112J72628j51176K1738O4630m2629L85452A80348J11303L34823
$$ plain form
16274 739014 180868 223610 507181 524144 417956 476018 696891 344629 346740 222856
16264 222856 539236 406932 543227 377085 656746 83942 303126 263463 143779 613601
16254 613601 458143 408965 317227 295973 714638 379864 448721 342486 495154 332878
16244 332878 639911 140974 480779 422431 223535 845542 297755 603865 340592 251875
16234 251875 480027 447596 241664 300022 529630 433116 31297 150592 205416 200778 301396
16223 301396 385959 302981 304255 -98478 5087 325583 183249 32156 183923 555775 230583
16211 295810 405713 261811 495704 231858 259227 426861 336320 464074 187067 344108
16201 344108 130112 302740 151564 173302 237932 195303 580755 180348 291651 626474
16191F26474B52223J07898A60519h7065A45650K15054j9197A01454N2161P7859
16181B31474m9778J65463I5786K0109L64353j48956n7379q1992P0660K05203B03865
16169A62437M05096A84021o5233B1074K27066A02517l6360L51913p1701f8276
16158C7265K8831P11853a08003A76545K72336j87088M3401L928a15856D30234
16147D7725J34667H4661J4656l9591K32192C9652N6347Q2470J36190H9808L41026
16136D30834j05967A06517R5954J52646I2865j9182d978C49974A09032B13K54558
16125B54771E2159K89554l4322b08444I727O89c260m3664B52179l9433Q8164J57327
16113D58237b4858D79267j56834j03760d6335F3339O3036f8952l6256B77745E4617
$$ plain form
16191 626474 252223 360121 160519 -87065 145650 360704 341507 101454 153615 231474
16181 231474 181696 347159 95786 115895 480248 331292 273913 191921 262581 467784 203865
16169 162437 567533 184021 118788 21074 248140 102517 66157 418070 346369 -68276
16158 37265 66096 777949 -108003 176545 448881 261793 305194 309122 -115856 430234
16147 47725 182392 84661 99317 59726 291918 39652 95999 178469 314659 89808 430834
16136 430834 324867 106517 202471 355117 92865 73683 -4978 349974 109032 213 254771
16125 254771 52159 341713 307391 -208444 9727 10416 -3260 -46924 252179 212746 300910 458237
16113 458237 -24858 479267 322433 218673 -46335 63339 126375 -68952 -105208 277745 54617
16101E111J39629C251N58015A55350j144M0624E8012N3809i8859F1793a50661
16089a4227k49037h3400A32287d5516E7996m58a15215e5663j6310R581A749i13
16076C30226A53449j4126m0847J75095P3094g4623B48279C651L3966J24053C8703
16064B86795a37176d48A78976J15257E5195B2014b4768A18972J8668a39160D2853
16052B03071a24783B7751O4082J07793k8873p3923e6640B8066J89414j02510B5304
16040H9695a33938E7940i1269A08500e275E7034a86941k90483a16066B33814o57
16029B33157a4262C73912D4984K45959f9354L3571F5621a20851B47683J4621a26120
16017C11961A4530a16339A95569b8425b255A73123g1878A31699i5134k10858B7292
$$ plain form
16101 5111 144740 3251 561266 155350 154206 194830 58012 111821 -98859 61793 -150661
16089 -14227 -263264 -83400 132287 -45516 57996 57538 -115215 -55663 -71973 -62392 1749 -913
16076 330226 153449 139323 98476 273571 346665 -74623 248279 3651 37617 161670 38703
16064 286795 -137176 -448 178976 294233 55195 22014 -24768 118972 137640 -139160 42853
16052 203071 -124783 27751 91833 199626 170753 96830 -56640 28066 217480 114970 25304
16040 89695 -133938 57940 -91269 108500 -5275 57034 -186941 -477424 -116066 233814 233157
16029 233157 -14262 373912 44984 290943 -69354 -35783 65621 -120851 247683 262304 -126120
16017 311961 14530 -116339 195569 -28425 -2255 173123 -71878 131699 -95134 -305992 27292
16005b02580F5318j7012M9154K55718b44501h5430k09697c4438B95765a91365
15994A73823a70543B44770G027L8539J7571k2547f1292j408C28518E001b13049
15982a14711A9367b40729A10179b34009A1103d04663b2228B69040A27769J71295
15972B99064J33563K85110k4743j14181k33082K94526j70532a8964D6734L994
15962E0728J37237a8412k5817C15276a10148b4094j9700A42296c28763d7126o4909
15951a12035C2532i982C9557J73985m6534a00575E7195a40383B8684K71144F4661
15939A47674c03455P9971q7939A5204a66552r2470B77239A4162J31287l9890J44837
15928B50396d59A077J35616a49152K7205c9406m3431q198F4871O057c35022g8358
$$ plain form
16005 -202580 65318 48306 97460 353178 -244501 -85430 -295127 -34438 295765 -191365
15994 173823 -170543 244770 7027 45566 63137 40590 -61292 -62700 328518 5001 -213049
15982 -114711 19367 -240729 110179 -234009 11103 -404663 -22228 269040 127769 299064
15972 299064 432627 717737 692994 578813 345731 640257 469725 -18964 46734 50728
15962 50728 187965 -18412 -44229 315276 -110148 -24094 -43794 142296 -328763 -47126 -112035
15951 -112035 32532 -9982 39557 213542 167008 -100575 57195 -140383 28684 299828 64661
15939 147674 -303455 -223484 -311423 15204 -166552 -259022 277239 14162 145449 105559 250396
15928 250396 -459 1077 136693 -149152 -121947 -39406 -82837 -91035 64871 70928 -335022 -78358
15915e38494E1298j4632i630r3846B06154a12788N2342A24987A8145f7646B06734
15903a52025L5443e0609p6845B91300E9760j3338d5319k48674a18312B66677e0937
15891f6119A60550e7611K6137B03073f6721j03735B67852g8421J9528A63393b14490
15879B1783a08055M336q9114d6868l72177a64799B25993l5093b53706q395A96352
15867a20840j51077A14980a90182N5503G7703J41999B0654K52185e7577D2066
15856c40804a31217j54397b1082L088B64971b4258q5978L505M6001j31607g5398
15844c5781E3724a56451o8536g5089k350F2315e5467j116j67799d1306A7536J53019
15832A70555c96539b3498A82024a61872B7569b14983c6668A88410D1824n565R0972
$$ plain form
15915 -538494 51298 36666 -9630 -103476 206154 -112788 -60446 124987 18145 -67646 206734
15903 -152025 -116582 -50609 -127454 291300 59760 46422 -45319 -293993 -118312 266677 -50937
15891 -66119 160550 -57611 -31474 203073 -66721 -170456 267852 -78421 -58893 163393 -214490
15879 21783 -108055 -103719 -192833 -46868 -419045 -164799 225993 190900 -253706 -262101 196352
15867 -120840 -271917 114980 -190182 -134679 77703 219702 20654 272839 -57577 42066
15856 -340804 -131217 -285614 -21082 -17994 264971 -24258 -110236 -106731 -60730 -192337 -75398
15844 -35781 53724 -156451 -224987 -75089 -77439 62315 -55467 -56583 -224382 -41306 17536 170555
15832 170555 -396539 -23498 182024 -161872 27569 -214983 -36668 188410 41824 36259 127231
15821A27231G517N8693b17542A66758e2026j9508l71450f0449j9451k24608K9511
15810b74997a23998c7225r1622n3114D90282a54328A94588b04973L7184A36428
15799B46542j01854j0313k8320K25138c61373O483I7419j9648J07138J9888a58836
15787A77915b16481j14086A67247a39894F0126J37146N1147k7048a53099A16539
15776C23443a10555G6199J34603a70198j38637a7340j05002A00004c88684B61739
15765d9881J7830r2353N7799j4087j14633A93696j5404A2604M4787b7984C88140
15753a81475F5899k8677i6216B04841A0909K81159a93976A16892g2127A30629
15742A12691m8285c9583A22723J85954a38572e2275l10374b0501I8336d4012F1910
$$ plain form
15821 127231 7517 66210 -217542 166758 -52026 -71534 -442984 -60449 -79900 -304508 -274997
15810 -274997 -123998 -37225 -128847 -181961 490282 -154328 194588 -204973 -167789 136428
15799 246542 144688 134375 106055 331193 -361373 -354890 97419 77771 184909 204797 -158836
15787 177915 -216481 -330567 167247 -139894 60126 197272 248419 221371 -153099 116539
15776 323443 -110555 76199 210802 -170198 -308835 -17340 -122342 100004 -388684 261739
15765 -49881 -32051 -124404 -66605 -80692 -195325 193696 178292 12604 57391 -27984 388140
15753 -181475 65899 37222 -96216 204841 10909 292068 -193976 116892 -72127 130629
15742 112691 64406 -39583 122723 308677 -138572 -52275 -362649 -20501 98336 -44012 61910
15730a12255N2332k46115A93231b72959J7755N9261D6052J09935B3240h348J851
15719f497A10657E2389b49734C1182p66c95937A16193a95398O5726e9410f176
15707f784j26825O4630B548b5537O120k71115J36925C1913Q3528c82653J49196
15696b33457J00979A31732i6207b6815p2766k58900J05728h1075l67718A2329
15685C4507b56071n1562C5474K50553C4272n980f7311k313A57213c18131C84346
15673F8318A4247f6593A01019C7160c2651j15354j32643a07252p9239c4209A27980
15661B17344a42100f7833F0263d50358e7559k5656j3940m795D4419M8753b09106
15649f2693B90643a18100C35405g2024m1452a2226m3470H3583c6638k9246K7035
$$ plain form
15730 -112255 -59923 -306038 193231 -272959 -255204 -195943 46052 155987 23240 -8348 -6497
15719 -6497 110657 52389 -249734 31182 30416 -395937 116193 -195398 -129672 -59410 -6176
15707 -6784 -133609 -68979 2548 -25537 -19417 -290532 -153607 31913 115441 -382653 -233457
15696 -233457 -132478 131732 -96207 -26815 -99581 -358481 -252753 -81075 -448793 12329
15685 34507 -256071 -307633 35474 286027 34272 28292 -67311 -69624 157213 -318131 384346
15673 68318 14247 -66593 101019 37160 -32651 -148005 -280648 -107252 -186491 -34209 127980
15661 217344 -142100 -67833 60263 -450358 -57559 -83215 -97155 -101950 44419 93172 -209106
15649 -62693 290643 -118100 335405 -72024 -113476 -12226 -55696 83583 -36638 -65884 -38849
15638c8849A90885a68851A11860D09a03010B08750D8900b16198Q146R1569j28391
15627b44874B27067b51171j64521c5919j31062H0068a94392a3264B84492j20228
15617A64264L3559h7149L876k98790a8530k73142D34057c4276r203o3302K5042
15606h1739l81051e7717j50840A25248A9344a67307j80184J11789g6372j37661
15596b14033b9509B82903f1387n8563c3864i843C383N569K51009E8543a63647
15584G7964b02297A5002K20235b11832G3027c1206j77151j37088f2778j3993B81590
15572a13960J851e1513D5025N558L58780b39744b9925D7831a9328p0070j75030
15561b64428g4670n8284A46048A398b16168k6816K0372e2054A9743J79807b63500
$$ plain form
15638 -38849 190885 -168851 111860 409 -103010 208750 48900 -216198 -208052 -116483 -244874
15627 -244874 227067 -251171 -415692 -35919 -166981 80068 -194392 -13264 284492 164264
15617 164264 197823 -87149 -83273 -382063 -18530 -291672 434057 -34276 -43479 -106781 -81739
15606 -81739 -462790 -57717 -208557 125248 19344 -167307 -347491 -235702 -76372 -214033
15596 -214033 -29509 282903 -61387 -119950 -33864 -9843 3383 8952 259961 58543 -163647
15584 77964 -202297 15002 235237 -211832 73027 -31206 -208357 -345445 -62778 -76771 281590
15572 -113960 -112109 -51513 45025 50583 409363 -239744 -29925 47831 -19328 -89398 -264428
15561 -264428 -74670 -132954 146048 1398 -216168 -242984 -222612 -52054 19743 199550 -263500
15549B00138c08720d7647A10650C292J60782P0889a9636k60737A18544j4307i7830
15537a23939L2565C2563f4280n5569j31812O3052c7991j25163B10712n9408l8812
15526A12492K24089H6429r652J70313p092a50058a7668H1603Q4719J7139N3789
15515B37250I2393D1950a31007f304D1159j3813a22750m3882E3717a42852A81065
15503A2320K75503i2034G5903b77615A06026P8304a87855A83345E5423J31798
15493A87221L658J22091j03932E5452P0905h0641G6998M9245m3508J36444p4345
15482A44834k2738A3139K3126d7041A87382H8725a73598B23533a0782H8795a67464
15470I3420J1987f4342H8397b56075A70423n8465n675R3818p8276a21637j33888
$$ plain form
15549 200138 -308720 -47647 110650 3292 164074 234963 -19636 -280373 118544 104237 -97830
15537 -123939 -91374 32563 -64280 -119849 -251661 -188609 -37991 -163154 210712 151304 112492
15526 112492 336581 86429 76777 247090 239998 -150058 -17668 81603 166322 183461 237250
15515 237250 92393 41950 -131007 -6304 41159 27346 -122750 -166632 53717 -142852 181065
15503 12320 287823 -92034 75903 -277615 106026 184330 -187855 183345 55423 187221
15493 187221 190879 312970 209038 55452 126357 -80641 76998 126243 82735 219179 144834
15482 144834 122096 13139 36265 -47041 187382 88725 -173598 223533 -10782 88795 -167464
15470 93420 105407 -64342 88397 -256075 170423 111958 106283 200101 121825 -121637 -255525
15459b55525C54631J04181a87979F61669B55078r0308N8995a27438J0334A01200
15448f1571m124j6192E9528N1063a37296f2318C23662D0802g1799l5638F5347
15436D0299h00k1999F8772a03496d4305B35613g1061C02796J57620j80903M70045
15425G49558k87434L76728j89581j45709A89238f0315B90391m6681A1534a47423
15414a49423C7231h9663A5217K9186a08750C9403g2491B34764h0276A88597b61341
15402b20697A84000a76807J2131C77294K1123j92084M3641k4357A09915k4873
15392H5042J21840a18887J8784d5464A27714b0269F2060c2747B4372c21974f1173
15380a54234d9461A41809j0896R6017b86462A18373M9666d96k0422E9011d1365
$$ plain form
15459 -255525 354631 458812 -187979 661669 255078 164770 223765 -127438 -117104 101200
15448 -61571 -65695 -81887 59528 110591 -137296 -62318 323662 40802 -71799 -107437 65347
15436 40299 -800 -22799 68772 -103496 -44305 235613 -71061 302796 460416 279513 749558
15425 749558 462124 838852 649271 503562 189238 -60315 290391 243710 11534 -147423
15414 -149423 37231 -89663 15217 44403 -108750 39403 -72491 234764 -80276 188597 -261341
15402 -220697 184000 -176807 -164676 377294 398417 206333 249974 225617 109915 85042
15392 85042 206882 -118887 -100103 -45464 127714 -20269 62060 -32747 24372 -321974 -61173
15380 -154234 -49461 141809 130913 226930 -286462 118373 168039 -496 -20918 59011 -41365
15368B18688a23174B22364a544l21146A48559L3401g2409A55698p2193J39651
15358B23156j11027K28209j43982a53530L6347B18365a1429j0323G1318L07044
15348C78362j25981a8042j57285C45246j13562A11171L3297L3432F3787b5615
15337A56018j1900F0091K09491N4560r8550b92917D9217d378C17527j28644J33771
15326C22654B2786L34411A71319J94853e4300C39387D9395c4399A08461l8900
15316F9561j8675J75070L1303c4200C50399i2176B9264J23011J77929D4298a93128
15304E03456E638c9383B57111C1314O1681K38761j58215l834d272B76022b54921
15292A02440d6651B4822J84511D0681e3139B73761C1143H815a23397B02916Q1190
$$ plain form
15368 218688 -123174 222364 -1544 -322690 148559 181960 -72409 155698 83505 223156
15358 223156 112129 340338 196356 -153530 -117183 218365 -11429 -21752 71318 378362
15348 378362 252381 -18042 -175327 345246 231684 111171 144468 177900 63787 -25615
15337 156018 144118 60091 269582 324142 225592 -292917 49217 -4378 317527 188883 322654
15326 322654 22786 357197 171319 366172 -54300 339387 49395 -34399 108461 69561
15316 69561 50886 225956 257259 -34200 350399 -92176 29264 152275 330204 44298 -193128
15304 503456 5638 -39383 257111 31314 92995 331756 173541 169707 -4272 276022 -254921
15292 102440 -46651 24822 209333 40681 -53139 273761 31143 8815 -123397 202916 284106
15281B84106a84904f9314B43607K10102C8486N1625A0775M34413A09891D4976
15270g0563A17275E0518a90549A10379L58674G8718b66243a07962B55140i4924
15259f8194A30514b03255d4399k00594A7072c5059p951o6493D7107a40976D4190
15247I5093l821c3464j85468g6494B61263A02304J65398j4614a3581B23385M8643
15236B72028j06567D9141J06311J70267L92195j38757M80335j74960K76069J95700
15226A356301C58807J2164e0464a9188A28715a47182c8741F5863b47179O9970
15216a77209c5351D1330d6595B58681J29390b46799C05404a01846j7728A59888
15205a99625b0952n6279C3361P8225d4568p5298G3495j2061K46257a64002A21584
$$ plain form
15281 284106 -184904 -69314 243607 453709 38486 90111 10775 445188 109891 44976
15270 -70563 117275 50518 -190549 110379 469053 78718 -266243 -107962 255140 -94924
15259 -68194 130514 -203255 -44399 -244993 17072 -35059 -43010 -109503 47107 -140976 44190
15247 95093 91272 -33464 -218932 -76494 261263 102304 267702 253088 -13581 223385 272028
15236 272028 165461 49141 155452 325719 717914 579157 1059492 884532 1160601 1356301
15226 1356301 358807 370971 -50464 -19188 128715 -147182 -38741 65863 -247179 -177209
15216 -177209 -35351 41330 -46595 258681 388071 -246799 305404 -101846 -119574 159888
15205 -199625 -20952 -77231 33361 111586 -44568 -119866 73495 61434 307691 -164002 121584
15193F4491K4682j0886c1422D97678k45887H3262g3475H3815J48455H5593R7904
15182A83497B3979f4339j97279A28247n6873a17025c9938C00721A44855K36562
15172C81417a25439A70349D7573K1550a25228f1268B25728a26703B65906a44037
15161D8653J20156j8900a12152q6459D8334c17669A76816a09616A74372a15819
15150H8247C4310b36445i1919a9644B5954O1061N3743B9673f8799j43736D4815
15138b00780C31707i9003o1217e4563C23824A18739C318R1937D0950a59850c5784
15126c9172E2192L24334j18796a34205B06785D1877K52813g5215b435k1132A22961
15114f8504H6229R6875n3649J18383F1757Q3901A4702O8000B1542J68973N1012
$$ plain form
15193 64491 89173 78287 -31422 497678 251791 83262 -73475 83815 232270 85593 183497
15182 183497 23979 -64339 -261618 128247 71374 -117025 -39938 300721 144855 381417
15172 381417 -125439 170349 47573 69123 -125228 -61268 225728 -126703 265906 -144037
15161 48653 168809 149909 -112152 -198611 48334 -317669 176816 -109616 174372 -115819
15150 88247 34310 -236445 -91919 -19644 25954 87015 140758 29673 -68799 -212535 44815
15138 -200780 331707 -99003 -160220 -54563 323824 118739 3318 95255 40950 -159850 -35784
15126 -39172 52192 376526 257730 -134205 206785 41877 294690 -75215 -2435 -23567 122961
15114 -68504 86229 183104 129455 247838 61757 145658 14702 82702 21542 190515 241527
15103B41527O5783M4004A10032P905J90917j3526j09046R57b49466B29522L9846
15092B69368a20100D3352b59369H8840a27221c6120G2524l3856K30293K28549
15082D97510d39795B25600a05707B39131b8966C6985A4799J4849O915L48583B2545
15070A62816n9366a71349d0069H3306L28459A42693J68561H7418c2881I8961b40806
15058B23686B4890M0216M7625b342p3723B8349h5500B27211A01095J48682B1482
15046b8377C49870r9782J04791j76044N3665m251J21126M9832A87338p3910J37729
15035B51157r9577K00470J49833B30090O5415N9581A72097P9918O1919J5224J47295
15024D76453A64294j8022N38694j6538B41226H5283J64511R2926A28752K09620
$$ plain form
15103 241527 307310 351314 110032 117937 308854 295328 186282 187239 -249466 229522 269368
15092 269368 -120100 43352 -259369 88840 -127221 -36120 72524 38668 268961 497510
15082 497510 -439795 225600 -105707 239131 -28966 36985 14799 29648 36563 385146 22545
15070 162816 103450 -171349 -40069 83306 411765 142693 311254 87418 -32881 98961 -240806
15058 223686 24890 65106 112731 -2342 -76065 28349 -85500 227211 101095 249777 21482
15046 -28377 349870 250088 354879 178835 232500 228249 349375 399207 187338 113428 251157
15035 251157 151580 352050 501883 230090 295505 355086 172097 252015 313934 329158 476453
15024 476453 164294 146272 684966 668428 241226 85283 249794 342720 128752 338372
15014C38372n7916M45374L0783j76508n8671k13646N66910C90858m446P7753B131
15002A85160J80493l6247J97536j76566J97804j89922j54633K33172D9921M50438
14992E00359A06177K68125L74197k50877J39657k56590j11590j04570p5732K11120
14982B99917M07977A48721K29048K86055k23034m8872j126L88942l67196M3338
14972D55876M0798j54112N6852o4732L77323o3933j13476J16749m4963K45713
14962H52095j49094q9391l1545J34002C56505H3486K96471r5454L76412o9149
14952E91766k7997B77934r9092J17222L01924j95370j75969K2074R4401J28351
14942D71475j292A80744N74516l76507j27770J99984j77743d702D08976J56993
$$ plain form
15014 338372 280456 725830 756613 580105 521434 307788 874698 390858 386412 464165 2131
15002 185160 365653 329406 526942 350376 548180 358258 203625 436797 49921 500359
14992 500359 106177 374302 748499 497622 637279 380689 269099 164529 88797 299917
14982 299917 707894 148721 377769 663824 440790 391918 390792 779734 412538 455876
14972 455876 496674 342562 399414 334682 712005 648072 534596 651345 606382 852095
14962 852095 703001 613610 582065 716067 356505 83486 379957 284503 660915 591766
14952 591766 563769 277934 178842 296064 597988 402618 226649 248723 343124 471475
14942 471475 470183 180744 755260 378753 250983 450967 273224 -4702 408976 565969
14932E65969j04462J76204k19404j44628p1181L77040j49893K78235j12134n6313
14922E39433k4062j48097L1568K0625j92205J93811J45165K5246J65306J77453
14912I34243J68982J039J56477q5271J43061J23268o85560N50797P1420k48425
14902A130031J82997K91049p3492J81135j92656n5245k4060j53998m05144J93033
14892A073650j97920k85665J99913k62482J27005o390j35279L4699L2805B83374
14881D51684P236j19230A3898L05029J94324p0530A95707J82629m3601K46812
14871E81547l3582m2052P2505J72171O8497q0756j67325L30118j15294C61532
14860I50097N4834k27532k33369J29621J9379C26742N2739M6778J52954A30864
$$ plain form
14932 565969 461507 637711 418307 273679 202498 579538 429645 707880 595746 539433
14922 539433 515371 367274 398842 419467 227262 421073 566238 591484 756790 934243
14912 934243 1103225 1104264 1260741 1175470 1318531 1441799 756239 1307036 1378456 1130031
14902 1130031 1313028 1604077 1530585 1711720 1519064 1463819 1439759 1285761 880617 1073650
14892 1073650 875730 590065 789978 527496 654501 648111 512832 547531 580336 283374
14881 451684 458920 339690 13898 318927 513251 442721 195707 378336 334735 581547
14871 581547 547965 505913 578418 750589 819086 738330 571005 901123 785829 361532
14860 950097 1004931 777399 544030 673651 693030 326742 379481 426259 579213 130864
14849C68777N8550Q3070j18776M21261l61128j0063j0989N7903j75036J18417
14839D31986j30266K80057o6284k1205j85985p5752K86317j73769K28895B66627
14828H64687j67522M2421J0334J37068l01609M87422k04537L50348j03423j53380
14818I61809k61066J05386j32250J79413k97228K8557J686m1595j46003J55302
14808E54011M1190K8605B73220M01587k91846J53079J44649j7244j74175K15919
14798G05189l35799M91652C04750L12167k31296q94K01035q7903B28323L24044
14788E52367M9769j1560K05693J5101l34870q1724J80601J9566m4753M528j04664
14777D50054R7022J01256o3735r9471M6405J82099C47470J63248K17173p4843
$$ plain form
14849 368777 427327 510397 391621 812882 451754 441691 430702 488605 313569 431986
14839 431986 301720 581777 515493 494288 308303 232551 518868 345099 573994 266627
14828 864687 697165 739586 749920 886988 585379 1072801 868264 1218612 1115189 961809
14818 961809 700743 806129 673879 853292 556064 584621 586307 544712 398709 554011
14808 554011 595201 623806 273220 674807 382961 536040 680689 663445 489270 705189
14798 705189 369390 861042 304750 616917 385621 384727 585762 497859 228323 552367
14788 552367 602136 590576 796269 811370 476500 394776 575377 594943 550190 554718 450054
14777 450054 547076 648332 584597 485126 531531 713630 347470 510718 727891 653048
14767F53048k87971J10560j38370N51631j88691K78665l51044L39920k17932J50081
14757H99897K76106n12364j40534K09885p8540n2120P5513Q0882j31526J58753
14747G85952J0473C92484K45329J50875k59903J95767j66187M56187m58846L27721
14737H83427l63042j8286L67149D33349k04825M87773k7853M9464k05747j67245
14727C64916L64662K01396k91891J05122k50988k6588K82973k24103p900J20784
14717F38383k0365R4447M5308n5993k03838Q81390k08996N4357J49466K10063
14707A584222k375k64217j43265l20857J19072o1604j5635p230K15211k46090
14697H57232L8992P7736j30362J58955k50197K34853l81962L55191q0836n2113
$$ plain form
14767 653048 365077 475637 337267 888898 700207 978872 627828 967748 749816 899897
14757 899897 1176003 663639 523105 732990 654450 602330 677843 758725 627199 785952
14747 785952 796425 392484 637813 788688 528785 724552 558365 1014552 555706 883427
14737 883427 520385 502099 869248 433349 228524 716297 688444 737908 532161 364916
14727 364916 729578 930974 639083 744205 493217 466629 749602 525499 517599 638383
14717 638383 618018 712465 757773 701780 497942 1379332 1170336 1224693 1374159 1584222
14707 1584222 1581847 1317630 1174365 853508 972580 910976 895341 888111 1103322 857232
14697 857232 896224 973960 843598 1002553 752356 987209 605247 960438 879602 827489
14687H27489j33955M73834j48241N67362l67404L34333q9888K4376k16677N2891
14677A324120m0829n9912O6880j28588o8507n33051N72701k18157p0387K15257
14667A059527l20674J36572J5993j03553K57528j24557J06644J01427m36812j54651
14657E37444L51808m400J07728J22169p9110L2771j04984L23183k31998J15857
14647A170468P9504l04536L0801k93569N07494j22078n4293L61857l44771J3829
14637A044706K71901k31080j348K78720P3435l70242L55407o05398L05708K66585
14627A388394j29159j55305j15128J74681L19403l21126L60181l38124l32608
14618H51209M82589r3420q3082J20665K3736L7390K9463J6526k4027m0125o4339
$$ plain form
14687 827489 693534 1167368 1019127 1586489 1219085 1553418 1463530 1487906 1271229 1324120
14677 1324120 1283291 1223379 1290259 1161671 1093164 560113 1132814 914657 844270 1059527
14667 1059527 738853 875425 891418 787865 1045393 920836 1027480 1128907 692095 537444
14657 537444 889252 884852 992580 1114749 1035639 1068410 963426 1286609 1054611 1170468
14647 1170468 1249972 945436 976237 682668 1190162 1068084 1013791 1375648 1030877 1044706
14637 1044706 1316607 1085527 1084179 1362899 1436334 1066092 1421499 816101 1121809 1388394
14627 1388394 1259235 1103930 988802 1163483 1482886 1161760 1521941 1183817 851209
14618 851209 1333798 1240378 1157296 1277961 1301697 1339087 1368550 1385076 1361049 1320924 1256585
14607A256585j46351L47736R3910j48587j68050L75733l75183N05005r6620k09179
14597A434999j15580L72404j50310J31974N7271l27352j63282M16541k89897L87885
14587A754653K8314k68781K53773r1350j76373K19634j10581j3866k58528N06600
14577A843495k20693J24793J11470l32461L67232n8117k02210r2417k6023M51787
14567A966856J75319m34399N57463q8712k54357j16189J75814L18430l99757L41710
14557B242178k24587K94101p1944J75505j63677M43526l59826L02301k13378J35487
14547B559686L36415p3498M7152Q4363J86482J84294K94632M6077N88116L40888
14537D594607N21250R98371J516393K044747L768595N880436R825010R28309j0900235
$$ plain form
14607 1256585 1110234 1457970 1551880 1403293 1235243 1610976 1235793 1740798 1644178 1434999
14597 1434999 1319419 1691823 1541513 1673487 1730758 1403406 1240124 1656665 1366768 1754653
14587 1754653 1782967 1514186 1767959 1676609 1500236 1719870 1609289 1595423 1336895 1843495
14577 1843495 1622802 1747595 1859065 1526604 1893836 1835719 1633509 1541092 1515069 1966856
14567 1966856 2142175 1707776 2265239 2176527 1922170 1805981 1981795 2300225 1900468 2242178
14557 2242178 2017591 2311692 2239748 2415253 2251576 2695102 2335276 2637577 2424199 2559686
14547 2559686 2896101 2822603 2869755 2954118 3140600 3324894 3619526 3665603 4253719 4594607
14537 4594607 5115857 6114228 7630621 9675368 13443963 19324399 29149409 30077718 19177483
14528A9177483p204463l116869j597866k523514p20439p14735l18222l23217N7611
14519B715769j62815m1754r758l53688l42949M03125L08021R3397k07698l40647
14509B061003K15896L2939k09057K21993J91367J6760R9955m02137L20249J10439
14499B659407J97100j64187q2096K86961l32925J47455l54527Q32467p3183l9525
14489C076947j60608r7683L89620k65480L12671k03763j00975L21532J3919m2257
14479C243923J99460J09702n6171j97771M57307k07253m10486N09179k35648L36735
14469C748977k14647m070M52301n07922N69601j48431j15606J60608N414K59250
14459D205475j73084J9743k57437N92615k43203l29493O70971q0188l8378R9907
$$ plain form
14528 19177483 11973020 8856151 7258285 4734771 4014332 3299597 2981375 2658158 2715769
14519 2715769 2552954 2511200 2501442 2147754 1804805 2207930 2515951 2609348 2401650 2061003
14509 2061003 2276899 2309838 2100781 2322774 2514141 2530901 2630856 2228719 2548968 2659407
14499 2659407 2856507 2692320 2610224 2897185 2564260 2711715 2357188 3189655 3116472 3076947
14489 3076947 2916339 2818656 3208276 2942796 3255467 3051704 2950729 3272261 3286180 3243923
14479 3243923 3443383 3553085 3496914 3299143 3756450 3549197 3138711 3647890 3412242 3748977
14469 3748977 3534330 3530260 3982561 3474639 4044240 3895809 3780203 3940811 3946225 4205475
14459 4205475 4032391 4052134 3794697 4387312 4144109 3814616 4485587 4405399 4367021 4466928
14449D466928j28558n3616J89189J03850J21083J33869n7294K57285K3000P3268
14439E129004K32842j95489k92667M0799L53839J08540J93404P9505M477j12498
14429E541756K74835k50764N85630n81105Q19525j21444j45855K70016J72578
14420F565172k6018J57207L1802q4562J55898k26826O34387o23413K63740M95694
14410G343081L2461K34008R4478N8805J21739J19813L40043L9224o0150L65217
14400H688719Q0633m6289J83368K46567l79672L41711M16123n2081K14917p8759
14390I615237M20587m0446Q6081J11456M98928J89212Q712J88069M39416r1226
14380A1426026o4302K31194L51293j2987K22618M91167L6664L36171j45423R2038
$$ plain form
14449 4466928 4338370 4284754 4473943 4577793 4698876 4832745 4775451 5032736 5055736 5129004
14439 5129004 5361846 5166357 4873690 4914489 5268328 5376868 5570272 5649777 5654254 5541756
14429 5541756 5816591 5565827 6151457 5570352 6389877 6268433 6122578 6392594 6565172
14420 6565172 6539154 6696361 6728163 6643601 6799499 6572673 7207060 6583647 6847387 7343081
14410 7343081 7375542 7609550 7704028 7762833 7884572 8004385 8344428 8383652 8323502 8688719
14400 8688719 8769352 8723063 8906431 9152998 8773326 9115037 9531160 9479079 9693996 9615237
14390 9615237 10035824 9995378 10081459 10192915 10691843 10881055 10889767 11077836 11517252 11426026
14380 11426026 11361724 11592918 11944211 11931224 12153842 12645009 12681673 13017844 12872421 12964459
14370A2964459R42890r272n5546N89764J96335L52023K40217M11205K83474J87445
14360A6102994L29586M72097R8082O20619Q3490M46344K17217N17619L03772P15287
14350A9907107L71987J70366N30634N51800M67620p6657J160653L57716P75034
14341B4216260J78648P83362L30777L71284O67568P05452Q23651P38443R76409
14332B9791854L77119R35435J168895K69254J206582N04031J134411J199587N94077
14323C7181245J085614J464766R21951J266384J150128J253574J772627J289620
14315D7385909J307989J289896J871983J749982J770186J768899J942774K217075
14307F1304693K314110K095922K264872K626066K289135K893814K785313L090369
$$ plain form
14370 12964459 13907349 13898077 13842531 14432295 14628630 14980653 15220870 15632075 15915549 16102994
14360 16102994 16432580 16904677 17002759 17623378 17706868 18153212 18370429 18888048 19191820 19907107
14350 19907107 20279094 20449460 20980094 21531894 21999514 21922857 23083510 23441226 24216260
14341 24216260 24394908 25178270 25509047 25880331 26547899 27253351 28077002 28815445 29791854
14332 29791854 30168973 31104408 32273303 32542557 33749139 34253170 35387581 36587168 37181245
14323 37181245 38266859 39731625 40653576 41919960 43070088 44323662 46096289 47385909
14315 47385909 48693898 49983794 51855777 53605759 55375945 57144844 59087618 61304693
14307 61304693 63618803 65714725 67979597 70605663 72894798 75788612 78573925 81664294
14299H1664294L347078K774909L944361M033440L784126L974066M457230M986324
14291A12965828N220672M865482N841507O086043O293928O479802P553810P496960
14283A62804032P910151Q453913Q880472R620384R757362J0450508J1218220J2044681
14275B41139723J2185438J2750630J3394088J3801947J3963355J4629433J3914104
14268C35778718J3956492J3711938J3029930J2518889J2107017J1074805J0168676
14261D22346465R518507Q854222P215821N286047L513004K344190K801051j450055
14253D60429252n764517n229787p208373n750400r187711j1991592j3758146j3450244
14245C88088482j4094194j4038553j3759910j4459924j4085221j3009070j3677875
$$ plain form
14299 81664294 85011372 87786281 91730642 95764082 99548208 103522274 107979504 112965828
14291 112965828 118186500 123051982 128893489 134979532 141273460 147753262 155307072 162804032
14283 162804032 170714183 179168096 188048568 197668952 207426314 217876822 229095042 241139723
14275 241139723 253325161 266075791 279469879 293271826 307235181 321864614 335778718
14268 335778718 349735210 363447148 376477078 388995967 401102984 412177789 422346465
14261 422346465 431864972 440719194 447935015 453221062 456734066 459078256 461879307 460429252
14253 460429252 454664735 449434948 442226575 436476175 427288464 415296872 401538726 388088482
14245 388088482 373994288 359955735 346195825 331735901 317650680 304641610 290963735
14238B90963735j3639482j2969802j2191963j2172617j1182469j1191823j0679882
14231B06935697j0463796r563140q936591q509404q428522p817014o821662p084411
14223A39311157n905561o094368n501674n602746m871404n428227l909139l998877
14215I7999161l694038l660142m139718l320380l026426l042937k867730k699119
14207G1548671k199950k811999j886247k477458k357104j820163j992774j755668
14199E4247308j046085j820344j408806k023719j084733j642764r89606r15550
14191D3315701j221954j479493j405488j044594q21498q85214j137584o46931
14183C4672945r34754j170990m94305j153963m55405q28834r07213n11249p45744
$$ plain form
14238 290963735 277324253 264354451 252162488 239989871 228807402 217615579 206935697
14231 206935697 196471901 186908761 177972170 169462766 161034244 153217230 146395568 139311157
14223 139311157 133405596 127311228 121809554 116206808 111335404 105907177 101998038 97999161
14215 97999161 94305123 90644981 86505263 83184883 80158457 77115520 74247790 71548671
14207 71548671 69348721 66536722 64650475 62173017 59815913 57995750 56002976 54247308
14199 54247308 53201223 51380879 49972073 47948354 46863621 45220857 44231251 43315701
14191 43315701 42093747 40614254 39208766 38164172 37342674 36457460 35319876 34672945
14183 34672945 33738191 32567201 32072896 30918933 30463528 29634694 28727481 28216232 27470488
14174B7470488n67800p95238q49493o35547m77322k80226m09478q42014k07039
14165B2406331o64011k89449n57054m16343q25003R3137q0482m21607p09200m10988
14155A8125331n81933k38281K48649m55486m69051P6699j106773J29690l68014
14146A5360831l23240j96799l07714j00531O737p51380j6417j41055j48775j58593
14136A3223064l88485j09788l65317k67366J95078l81434j84389q1794m51634
14127A1187935r7531l64393K7092o2761j90468O3101k71520k65448k61719j44039
14117I620249k3130J06416m85094J64101m6245m77949k58058N2306k33300J38711
14107H558007n39371K14218k09132J57502j65577q1029n5315k16720k77794L44344
$$ plain form
14174 27470488 26902688 26107450 25257957 24622410 24145088 23864862 23455384 22613370 22406331
14165 22406331 21742320 21452871 20895817 20479474 19654471 19747608 19667126 19245519 18536319 18125331
14155 18125331 17543398 17305117 17553766 17098280 16629229 16705928 15599155 15728845 15360831
14146 15360831 15037591 14840792 14533078 14432547 14439284 13687904 13671487 13530432 13381657 13223064
14136 13223064 12834579 12724791 12359474 12092108 12287186 11905752 11721363 11639569 11187935
14127 11187935 11090404 10726011 10753103 10690342 10499874 10562975 10291455 10026007 9764288 9620249
14117 9620249 9597119 9703535 9218441 9382542 9336297 8858348 8600290 8652596 8419296 8558007
14107 8558007 8018636 8232854 8023722 8181224 8015647 7934618 7879303 7662583 7384789 7729133
14097G729133m99499J1858j81575j50354Q5287k73386P6259j08494J6161m91733
14087F213657p6535K01757K64943j11010m76393L35837l53284L65341p33946P168
14077E637535K83764k52739J48620j99881k78466j10753r2151M9513M02475j96306
14067E391611l09504M4196j17932Q2866l36419J11034R1291j09619j41509J20442
14057D826457m7176j76314n0095O0880m30124J28840j06812L36113j15919k97203
14047D128647K12940J77510l19793l73877M41011L5760j82166J6364l27974k4769
14037C783653k4204N8582q625k01083k36499J46479j29060L05014j25335j38359
14027C430563r1040J55244m8407l45717N46439l84197j10405J65828m1104J77495
$$ plain form
14097 7729133 7229634 7241492 7059917 6909563 6994850 6721464 6797723 6689229 6705390 6213657
14087 6213657 6137122 6338879 6603822 6492812 6016419 6352256 5998972 6364313 5630367 5637535
14077 5637535 5921299 5668560 5817180 5617299 5338833 5228080 5135929 5185442 5587917 5391611
14067 5391611 5082107 5126303 5008371 5091237 4754818 4865852 4957143 4847524 4706015 4826457
14057 4826457 4779281 4602967 4552872 4613752 4183628 4312468 4205656 4541769 4425850 4128647
14047 4128647 4341587 4519097 4199304 3825427 4266438 4302198 4120032 4136396 3808422 3783653
14037 3783653 3759449 3818031 3809406 3608323 3371824 3518303 3389243 3694257 3568922 3430563
14027 3430563 3339523 3494767 3446360 3100643 3647082 3262885 3152480 3318308 3277204 3454699
14017C454699l45838K21485J17132j00507r7141j52364k42452K74253m64995J98887
14007B863159K7407J66566k17654k40789P4770J12515Q9549j59716m09243K80061
13997B586625j79297J46388j87780K07125m20204K18694K52158n41984J87328
13988B269053l996J297L50539l59394r420L97430P1001M0552l6374J17076N49283
13977C387047K93257J38562R98682J727969K971657N490407R742928O993061q975585
13968B2767985p300286m461807k851438k081506j164639o02342k53256k84758
13960C767953k31994J41841o09860l2619j38754k56518r6443J47289l69188K36485
13950B558192k18932M16234n43736K96840Q1275l71213N6240j60760M46830j72823
$$ plain form
14017 3454699 3108861 3330346 3447478 3346971 3249830 3097466 2855014 3129267 2664272 2863159
14007 2863159 2890566 3057132 2839478 2598689 2673459 2785974 2875523 2715807 2306564 2586625
13997 2586625 2407328 2553716 2365936 2573061 2152857 2371551 2623709 2081725 2269053
13988 2269053 2265057 2266354 2616893 2257499 2248079 2645509 2716510 2757062 2720688 2837764 3387047
13977 3387047 3680304 3818866 4817548 6545517 9517174 15007581 24750509 31743570 22767985
13968 22767985 15467699 11005892 8154454 6072948 4908309 4305967 4052711 3767953
13960 3767953 3535959 3677800 3067940 3035321 2896567 2640049 2543606 2690895 2321707 2558192
13950 2558192 2339260 2755494 2211758 2508598 2589873 2218660 2274900 2114140 2560970 2388147
13940B388147k57341O8551j43456J41610k07352J0350m1875M22248n43089L15237
13930B153030k90281J99414l35106J76780N2489k35449J67983j99705K03454r5754
13920A796855P5710K6358J66466n4536j96890l01915J54188M5958j62187L59831
13910A909838m46939J27916N41046o77608L64891k85052j38605L13685K8233N5126
13900A792531l70933K64069l6325k21842M1020j4185L58792m20688J11092j6449
13890A487082k00932L65864k62513K16049j36595m05115M68973N2720Q7958n68699
13880A104792L37746q7168J51434l71749L36536l18563O9784J35437k90862O811
13870A074198J94114N1181J77359l28043K17352l37717K59623j94520K92968j87925
$$ plain form
13940 2388147 2130806 2199357 2055901 2197511 1990159 2000509 1958634 2380882 1837793 2153030
13930 2153030 1862749 2062163 1727057 1903837 1956326 1720877 1888860 1689155 1892609 1796855
13920 1796855 1872565 1898923 2065389 2010853 1813963 1512048 1666236 1712194 1550007 1909838
13910 1909838 1462899 1590815 2131861 1454253 1819144 1534092 1395487 1709172 1737405 1792531
13900 1792531 1421598 1685667 1649342 1427500 1468520 1454335 1813127 1392439 1503531 1487082
13890 1487082 1286150 1652014 1389501 1605550 1468955 1063840 1532813 1585533 1673491 1104792
13880 1104792 1442538 1355370 1506804 1135055 1471591 1153028 1222812 1358249 1067387 1074198
13870 1074198 1268312 1319493 1496852 1168809 1386161 1048444 1308067 1113547 1406515 1218590
13860A218590j21424j84204K61720r67j80920M75166l22875l90296M50327k96514
13850I08603M57215j26916R8629o10736O54432j64075l20031r404O9429J40508
13840A097654K18901n18966J71290Q7319j02377L49845o5345q7241l3928k29440
13830H87712K35671L0524j7519J06433l41504l1341O5516J24246l921j10454j22833
13819H22530N0570J62997k82728Q3965J76153o780K64280k46811m8493m25391
13809E50292N75354k11226p035L04567k85755J98597j30247k67016M5352J9360
13799G92243N76066n62757j13145j5771P8285K47604k03256K69300E04168K61970
13789G66138K17150j66407Q5511l46179L92336l15747J01291J85907P6753k11201
$$ plain form
13860 1218590 1097166 912962 1174682 1173715 992795 1467961 1145086 754790 1205117 908603
13850 908603 1365818 1238902 1337531 726795 1381227 1217152 897121 887717 957146 1097654
13840 1097654 1316555 797589 968879 1056198 953821 1303666 1238321 1151080 1117152 887712
13830 887712 1123383 1153907 1136388 1242821 901317 869976 935492 1059738 1055817 945363 822530
13819 822530 873100 1036097 753369 837334 1013487 1006707 1270987 1024176 975683 550292
13809 550292 1125646 914420 907385 1211952 926197 1124794 994547 727531 772883 792243
13799 792243 1368309 805552 692407 676636 754921 1002525 799269 1068569 504168 766138
13789 766138 983288 816881 902392 556213 948549 632802 734093 920000 996753 785552
13779G85552Q9989j39116K72050n1280k20919m5557M03549l03747J47873q4299
13769H54095l19755n7450L14104n3891P6452O311j39900J46006J41914n3084k38149
13758F76653L17029D44083K76198k11062R1759L63944q9576j16757K48426j24142
13748H82873l92931J68847j64217K40523K2315C56709L4295M59409K5641j71752
13738G04302J9057q6350K44701k45923j14271L18897J10621l31604J87168k88840
13728E17758J6307J41252j16789L69727j75778k01674o6336m5640j0134J69239
13718E97932j68703M74472j07008J79537o1917q0628k86969B16396J49473L23420
13708F89289r4160K43663j08338j18092R8481R4720k28150J49707j85486k50055
$$ plain form
13779 785552 875541 736425 1008475 957195 736276 690719 1094268 790521 938394 854095
13769 854095 534340 476890 790994 737103 813555 819866 679966 825972 967886 914802 676653
13758 676653 993682 444083 720281 509219 600978 964922 875346 758589 1007015 882873
13748 882873 489942 658789 494572 735095 757410 356709 391004 850413 876054 704302
13738 704302 723359 637009 881710 635787 521516 840413 951034 619430 806598 517758
13728 517758 534065 675317 558528 928255 752477 550803 484467 438827 428693 597932
13718 597932 429229 903701 796693 976230 914313 833685 546716 216396 365869 689289
13708 689289 595129 838792 730454 612362 710843 805563 577413 727120 541634 291579
13698B91579M06084o8521J34321I6277L47979j65989J43953M2365N5182J77414
13688F97181M05178m96745J6363j11079j44978K41272K3231j75690K0885p7594
13678C98024J78413J30100j24365J35539j12673l1746k67946K59816j42654J71190
13668E93698m9958j15652J17308N2341j18261A97630N5865J19109J57715j67712
13658C62607o5865M11099J0968B22167L53333R3671k75712J87179Q3094l24448
13648C39284J84094O3436j15357L06008H9792M70203J12377l1650N8155C25786
13637E96370B42281L4687N92718B88721L44702j45373O1780B71816N4495J87826
13627E14137M1886j44757r4941d4582C92090P6189p3273J39883k28411Q8585N1172
$$ plain form
13698 291579 697663 629142 763463 96277 444256 278267 422220 464585 519767 697181
13688 697181 1102359 605614 621977 510898 365920 607192 630423 454733 475618 398024
13678 398024 576437 706537 582172 717711 605038 573292 305346 565162 422508 593698
13668 593698 543740 428088 545396 597737 479476 197630 253495 372604 530319 362607
13658 362607 296742 707841 718809 222167 575500 669171 393459 580638 663732 339284
13648 339284 523378 586814 471457 777465 89792 559995 672372 640722 698877 325786
13637 596370 242281 276968 869686 288721 633423 488050 549830 271816 326311 514137
13627 514137 556023 411266 316325 -44582 392090 468279 395006 534889 306478 395063 446235
13616D46235L94514l60963J9373B24069R8055K19929j78563M74807j67012k41188
13606D30097K38491B56541O7196L38018q2258B87846J94808m9190q3314J27035
13596D77185j35672N0914M630o7275R7822K7103k8546A33840K27151A44213M48803
13585E93016B52334n6439I1018K72219j27045K41795R5152j71496K33947j68904
13575D66686O112j82066k0945L20432A44409F0541K72823A52614K84778E9149
13564A80812K71082j54640J23321n6822j69738R1861A9764J55740L26071N9313
13554E60888m9623B21466M48854A29700M6142K63527A86168L4923I7339J33259
13544B30598M20720C04373j09616r2963K68800J5842J3736q296J09359Q9892j35761
$$ plain form
13616 446235 840749 479786 499159 224069 322124 542053 363490 838297 671285 430097
13606 430097 668588 256541 323737 661755 579497 287846 482654 433464 350150 477185
13596 477185 341513 392427 397057 329782 427604 454707 426161 133840 360991 144213 593016
13585 593016 252334 195895 91018 363237 236192 477987 573139 401643 635590 466686
13575 466686 472798 290732 269787 590219 144409 60541 333364 152614 437392 59149
13564 180812 451894 297254 420575 363753 194015 285876 19764 175504 501575 560888
13554 560888 511265 221466 670320 129700 175842 439369 186168 221091 97339 230598
13544 230598 651318 304373 194757 101794 370594 386436 400172 391876 501235 591127 455366
13533D55366B10566J86145q7329M7312p3363A8026L32438r1078K97936l4722Q74
13522E23474j91405J01737A75745K24509j30995k4891K5780m1171m7050J52302
13512C34229l9763K20393p9922P0917L9287j69824C0785G115Q1064J22711L9447
13501B50337H6315K41524J24557g0018A71916j2518Q8818J79828j78837J13104
13491C62311A11360J62272j4433j28992L4560K03432j74005q9439K09423m0701
13481B73477J66341r0737A47541L9273J03783O1251K40994k07348p8215L100j2062
13470B98317E6928M37696A4978L6748J16127B7149N8505J53471J80114j81959
13460B37280K62665K6355I5693J49144Q8235j9167r0248J36226O0168D4744M7008
$$ plain form
13533 455366 210566 396711 309382 356694 283331 18026 350464 259386 557322 522600 523474
13522 523474 332069 433806 175745 400254 269259 244368 270148 228977 181927 334229
13512 334229 294466 514859 434937 505854 545141 375317 30785 7115 88179 210890 250337
13501 250337 86315 327839 452396 -70018 171916 159398 248216 428044 249207 362311
13491 362311 111360 273632 259199 130207 164767 368199 194194 104755 314178 273477
13481 273477 439818 349081 147541 186814 290597 351848 592842 385494 307279 310379 298317
13470 298317 56928 494624 14978 51726 167853 27149 85654 239125 419239 237280
13460 237280 499945 526300 95693 244837 333072 313905 223657 359883 420051 44744 91752
13449I1752L13998j24176o505J24147A89401K20911e0297A15447M55630A58053
13438A84095J03272J16025m0318r0541J01749A07260J28054i6219M1213A83075
13427B7129h1499B54857M7777C2444K61914d0409o6345D78154r3049l3083n4621
13416B97401H6208l2870J09694J48953P8272j93017J3724Q8776i216D57752o6256
13405C91496j65264c0711B73708I5213M4482O9680j6495K4281A07539N15574A93043
13393E55929A88697H1112a47191C52088i1322a4269B37234L08F8144j2464K40591
13382B96271K99089A82036J71098b19313A21592J893L45093A81333o8857J0320
13372A22796p650N5877a8753C02478l8166Q0063j21800J14831p4072B2751M49791
$$ plain form
13449 91752 405750 281574 275069 399216 189401 410312 -50297 115447 571077 158053
13438 184095 287367 403392 363074 272533 374282 107260 235314 -96219 -55006 183075
13427 27129 -81499 254857 302634 32444 294358 -40409 -106754 478154 385105 352022 297401
13416 297401 86208 53338 163032 311985 390257 197240 210964 299740 -9216 457752 391496
13405 391496 226232 -30711 273708 95213 139695 209375 192880 217161 107539 623113 193043
13393 555929 188697 81112 -147191 352088 -91322 -14269 237234 237542 68144 55680 296271
13382 296271 595360 182036 353134 -219313 121592 123485 468578 181333 112476 122796
13372 122796 115146 171023 -18753 302478 264312 344375 222575 337406 263334 22751 472542
13361D72542k5291j67063j16255L88123i2770C89182J490j45774q979E7720K43894
13350C01614q6977m8008F5482a51414C08551A1076L64295j52602d3702N859B64174
13338E42038A70251G2331L46741a53786D04880j17128A04968P0274J93880j28542
13328B40580J39389A75141J20566E1739J28645J19941n8154H8344J03933H096
13317C71375n3949j43671o988K17021A45067o2562L01240j72674P724C7369J99036
13306B36405J91514J59565k28188J00895j08915K9316A74835f9263a6504A99085
13295B252N56419J0668k68105A41887M0244K68309k14694q6679J40689l8682F4600
13283C836J98801m9625N8999m1016A3176h195F1019Q8955M2350A3059o373M8009
$$ plain form
13361 472542 447251 280188 163933 552056 -92770 389182 390672 244898 235919 57720 301614
13350 301614 214637 166629 65482 -151414 308551 11076 375371 222769 -43702 -37843 264174
13338 542038 170251 72331 419072 -153786 404880 287752 104968 175242 369122 240580
13328 240580 379969 175141 295707 51739 180384 300325 242171 88344 192277 8096
13317 371375 317426 173755 166767 383788 145067 82505 383745 211071 218795 37369 236405
13306 236405 427919 587484 359296 460191 351276 380592 174835 -69263 -16504 199085
13295 2252 558671 569339 301234 141887 182131 450440 235746 149067 289756 251074 64600
13283 3836 202637 153012 212011 170995 13176 -8195 61019 149974 192324 13059 6686 54695
13271E4695P7803B3257J49116J50738D5752K62892a02835A99548I6883J52617
13261B49500c7808a6704B84355A25937A4236K01325K3531G5639M4994O3892o9736
13250A14789J65758A04437a20010D7453M087k1845J15745L8969G0655K23164j18476
13239A75343a56371A26575L06171A28282K37036m9332c4962B0032J90962k7469
13229A83525o0584K91526n81G2371f4252B08405c8815B47923a9615D04216A05321
13217B79086j29824A6545J16252K80069A50879L06624B03307b66442g7907B00234
13206A00739J69211J49845e08539B78777b57688e4448A81707a39837B93563A32147
13195c4591B51222q462a79306D9368K74155A10153J95181r47b81535h5061j21534
$$ plain form
13271 54695 132498 23257 172373 323111 45752 308644 -102835 199548 96883 249500
13261 249500 -37808 -16704 284355 125937 14236 215561 239092 75639 120633 184525 114789
13250 114789 280547 104437 -120010 47453 51540 29695 145440 184409 70655 293819 175343
13239 175343 -156371 126575 432746 128282 365318 315986 -34962 20032 210994 183525
13229 183525 122941 414467 413886 72371 -64252 208405 -38815 247923 -19615 404216 105321
13217 279086 149262 16545 132797 412866 150879 457503 203307 -266442 -77907 200234
13206 100739 269950 419795 -508539 278777 -257688 -54448 181707 -139837 293563 132147
13195 -34591 251222 242760 -179306 49368 323523 110153 305334 304387 -281535 -85061 -206595
13184b06595I2959O7017D6948K2315B4497f1793C76300m0692a53815A12734L3169
13173A45903O5018B9814c3006q0151I2831a9996D37641A26121c9157l3744B90362
13161A3449L14582j56020H3737J06369b921A00002J53356b12671b904p3610j1900
13150h8414A9921M39001a38706G7003b06638A64174j4329b19864A90556E0982
13139a7863j50004D39507E8252a9257A64969b48214b9150B3055J4239K70593f1418
13127A29241O8388b35233a8948A05503d6815A25125K30459o9749q5179H3716b8770
13115D32783B01153a69123A57468d2798q972B19852j09729L18610B7991a26106
13104G2362J19078J35977A6831L54596c24052B00086A2269a26178f0494a1016
$$ plain form
13184 -206595 92959 159976 46948 69263 24497 -61793 376300 335608 -153815 112734 145903
13173 145903 210921 29814 -33006 -113157 92831 -19996 437641 126121 -39157 -72901 290362
13161 13449 328031 172011 83737 190106 -2921 100002 253358 -212671 -2904 -76514 -88414
13150 -88414 19921 458922 -138706 77003 -206638 164174 149845 -219864 190556 50982
13139 -17863 -167867 439507 58252 -19257 164969 -248214 -29150 23055 37294 307887 -61418
13127 129241 197629 -235233 -18948 105503 -46815 125125 355584 285835 200656 83716 -28770
13115 432783 201153 -169123 157468 -42798 -51770 219852 110123 428733 27991 -126106
13104 72362 191440 327417 16831 371427 -324052 200086 12269 -126178 -60494 -11016
13093A813J07979M2730B6226Q1193a33354B26655D7109b57032A64494P4433a1771
13081a84820C72080j26361F1618a16280c4038H2703e7524K0796A43161g347D63040
13069F3665a40895H5497j6214a64180n9490B76596h5799o2272f2587j27687B02152
13057A36257D9022A9358L44995m3502B9736J37424a06642M4508j37895H8134a7771
13045A51221d6305F6977h8218l1762A53452a76702A04799K14796C1779K3729k6228
13034B9280Q4850g2766A09752N5353E6912a13563B92909a09331H3260J43161Q8595
13023C15016j1543A26816J82796J95799F9378Q0924D1575a02243o6928f064G4650
13011b31769B78676K2444i5935A60663B7885R9069k641O9037a68205B72956e4007
$$ plain form
13093 1813 109792 152522 26226 107419 -133354 226655 47109 -257032 164494 238927 -11771
13081 -184820 372080 245719 61618 -116280 -34038 82703 -57524 -36728 143161 -7347 463040
13069 63665 -140895 85497 69283 -164180 -223670 276596 -85799 -148071 -62587 -190274 202152
13057 136257 49022 19358 364353 320851 29736 167160 -106642 -62134 -200029 88134 -17771
13045 151221 -46305 66977 -88218 -119980 153452 -176702 104799 319595 31779 55508 29280
13034 29280 114130 -72766 109752 165105 56912 -113563 292909 -109331 83260 226421 315016
13023 315016 303473 126816 309612 505411 69378 150302 41575 -102243 -169171 -6064 74650
13011 -231769 278676 301120 -95935 160663 27885 126954 124313 193350 -168205 272956 -54007
12999A61610K93307A1833R5760a71688E53035A64226L1126j4796m8841K16105
12989C47820j34945n5672J89197a17299K3198A574K46191j06068D622L42556b20825
12977a12682C8256b67842A269c46429C09868p6142E3940R746K84752j11257c74575
12965c92937C13815B9687a60283D37048A34626E2559k2198J62342a22394A82164
12954B66933b3049B10493p8992m9729K6033J02897b49171P0554Q3309A8414b45332
12942B3674c5565A68140b81400d3665A30203a08819C3167O8431h8746C17907e3950
12930c3671A24768d5247F7764h759k61101F6707K3814J59796A13108c9146C7395
12918A47881b17243a3167o0772c4303j674G0472R8870P4854I1235A7908J01396
$$ plain form
12999 161610 454917 11833 107593 -171688 553035 164226 195352 180556 131715 347820
12989 347820 212875 157203 346400 -117299 -94101 1574 247765 141697 4622 347178 -220825
12977 -112682 38256 -267842 1269 -346429 309868 233726 53940 63686 348438 237181 -374575
12965 -392937 313815 29687 -160283 437048 134626 52559 30361 192703 -122394 182164
12954 266933 -23049 210493 131501 81772 107805 210702 -249171 -178617 -95308 18414 -245332
12942 23674 -35565 168140 -281400 -43665 130203 -108819 33167 101598 -88746 317907 -53950
12930 -33671 124768 -45247 67764 -8759 -269860 66707 90521 250317 113108 -39146 37395
12918 147881 -217243 -13167 -73939 -34303 -35977 70472 169342 244196 91235 17908 119304
12907A19304M6m9743O5985b22815a07095A3453J23521b25446A85360d1734k23399
12896b65133b5691I4273a80239b7578L18q9305A33964d66231C07659K18060b23695
12884a97783h7391C33894H1475f0212k87053e21A27151b02781C8360e4973G3716
12872A63964H1820B8033K37772L846d8411j18434I1922O0496C2097J83640a76976
12860I2883a86268b603j09552A22350D2872L06240h0994m9481j85286A21453m1735
12849G9718i8229I7471L7940O4199b87170a08070B47206k840A17159k3358L8309
12838A32110J99939H6544j7775b33864A21746J43319b07606B53377b2960C14476
12827b4046A80156a31352a9853r2866A40545Q3693e1041o6197J7875A52833b6340
$$ plain form
12907 119304 119350 69607 135592 -222815 -107095 13453 136974 -225446 185360 -41734 -265133
12896 -265133 -25691 94273 -180239 -27578 -27260 -116565 133964 -466231 307659 525719 -223695
12884 -197783 -87391 333894 81475 -60212 -347265 -521 127151 -202781 38360 -54973 73716
12872 163964 81820 28033 265805 269651 -48411 -166845 91922 152418 32097 215737 -176976
12860 92883 -186268 -2603 -112155 122350 42872 349112 -80994 -130475 -315761 121453 79718
12849 79718 -98229 97471 135411 199610 -287170 -108070 247206 244366 117159 93801 132110
12838 132110 332049 86544 68769 -233864 121746 265065 -207606 253377 -22960 314476
12827 -24046 180156 -131352 -19853 -112719 140545 224238 -51041 -117238 -99363 152833 -26340
12815b76490A92997b8942o02C02491j5543b9307j92171A09859g2232l2742j15482
12804b20456D7790K7407J89670H5803A4484L71358a36609M1024B78529A37027
12793A68820l2413C2705R1019Q6033i1318C95804a16072d9966B3847b34893Q2135
12782a52758A65285a5911C28462j08216A08353C0178b67014P1083c3542J1091
12772b2451C3180J71541D126J48865a77219j0768O8211E76010F9360b4096l29827
12761c53923B16119b47202k56832a66013a5152j31486R155P743A2980a53064A51737
12749A96408m8387N245N6961q1235M2871F9112a08377d1286A0423K01950h7711
12737e7843j40289f2842A85770j8354a44486D497d2209A0855h4945p3940A16047
$$ plain form
12815 -276490 192997 -28942 -29544 302491 286948 -29307 -221478 109859 -72232 -104974 -220456
12804 -220456 47790 75197 264867 85803 14484 385842 -136609 -95585 278529 137027
12793 168820 136407 32705 123724 209757 -91318 395804 -116072 -49966 23847 -234893 -152758
12782 -152758 165285 -15911 328462 220246 108353 30178 -267014 -195931 -33542 -22451
12772 -22451 33180 204721 4126 152991 -177219 -187987 -119776 576010 69360 -24096 -353923
12761 -353923 216119 -247202 -504034 -166013 -15152 -146638 -137483 -129740 12980 -153064 151737
12749 196408 148021 153266 210227 128992 171863 69112 -108377 -41286 10423 212373 -87711
12737 -57843 -198132 -62842 185770 167416 -144486 4497 -42209 10855 -84945 -158885 116047
12725b79107i839H8537R8049a16763o708B2372a02174B10134b53311l1315f0153
12713a8115B40780l5406c6156E1700k5766g6840m4440b0129l6509r389G0373e2427
12700a81836j44992J57998A33695g8314q821j21774H7686P3273f8450D2837K80300
12689C23137j17847l2035D124a63970F1816a61970A37814L66942d65796K05668
12679b60128a0534C25574a17826A11151c4845A32934a698j35687C5156J14938
12669A50094I952a62853C8799a43566I233J21731a9756A14942a36030L2405C61127
12657b01686B49520j00263E4312J74893D9622K5866e2420p319B80334j38895b03622
12645F4110J5681P1173A8883M05854A13290m5826J97553H5465B0514J23693a42222
$$ plain form
12725 -279107 -9839 88537 186586 -116763 -123471 22372 -102174 210134 -253311 -284626 -60153
12713 -18115 240780 205374 -36156 51700 25934 -76840 -121280 -20129 -56638 -66027 70373 -52427
12700 -181836 -326828 -168830 133695 -78314 -87135 -208909 87686 160959 -68450 42837 323137
12689 323137 205290 173255 4124 -163970 61816 -161970 137814 504756 -465796 -260128
12679 -260128 -10534 325574 -117826 111151 -34845 132934 -1698 -137385 35156 150094
12669 150094 9952 -162853 38799 -143566 9233 130964 -19756 114942 -136030 -103625 361127
12657 -201686 249520 149257 54312 229205 49622 75488 -52420 -59739 280334 141439 -203622
12645 64110 79791 150964 18883 424737 113290 67464 265017 85465 20514 144207 -142222
12633C53415D1924J06473A5034d1646B45455o6698c19757A28645N6422C5021a42694
12621E27206b40266D0382M6529j754J82423H9214b419C1296J56171b11462A93971
12609A50394D9901J09885o0207J28752b4478E21921a492F7020i6021B02845b4253
12597g1618A86743M7608B7367L56727D7386b13471D1899K98226A24574E1112a06719
12585A36994B5559J18751E7726b75685h9469B61414D4772J56857F7261a23240
12574D11474j42837E8438J40667C9257K38866E807g150j69303E5113P4011a09996
12562A8687i3547E8723J97082a74506A51166d9048A19195O6445A2836Q7547b49477
12550B0326b36123R6963p6086A09743a6279I0694L0216d0233F5932c40886a46719
$$ plain form
12633 353415 41924 148397 15034 -41646 245455 178757 -319757 128645 185067 35021 -142694
12621 527206 -240266 40382 86911 85157 267580 89214 -2419 31296 187467 -211462 193971
12609 150394 49901 159786 99579 228331 -24478 521921 -1492 67020 -96021 202845 -24253
12597 -71618 186743 234351 27367 384094 47386 -213471 41899 340125 124574 51112 -106719
12585 136994 25559 144310 57726 -275685 -89469 261414 44772 201629 67261 -123240
12574 411474 268637 58438 199105 39257 278123 5807 -7150 -176453 55113 129124 -109996
12562 18687 -93547 58723 255805 -174506 151166 -49048 119195 185640 12836 100383 -249477
12550 20326 -236123 -139160 -215246 109743 -16279 90694 120910 -40233 65932 -340886 -146719
12538H8687d7661C0873R7384I880K3140N8985l2071K4082h9932L5158J6557k20232
12526b58449B9784K3673g5482k8139j56951a5113D328b2482B78514R8863j43658
12515B33719B1859f2037o9624c7784J3455j79581B99180g3230D7995a13506A32150
12503a23058E3060c1313B51943A17809K07275C1990J38326b28331A09371B5880
12492d8352D83576a79432M6210j96319A19247D7969K00269a4246B44671I3129
12481e2389E2336G264d48707a29210G3522P8296m4071c4077r7945H4034f5396
12469B44187h8470L3842C7227a2051p5174k7032A66993b10848B7043b60666H7210
12457a62335B4444g8449A82463n4022C0599e5493C02589c3145A48681a10395J6945
$$ plain form
12538 88687 -47661 30873 128257 9880 33020 92005 59934 84016 -89932 -54774 -38217 -258449
12526 -258449 29784 53457 -75482 -103621 -260572 -15113 4328 -22482 278514 377377 233719
12515 233719 21859 -62037 -131661 -37784 -24329 -203910 299180 -73230 47995 -113506 132150
12503 -123058 53060 -31313 251943 117809 325084 31990 170316 -228331 109371 25880
12492 -48352 483576 -179432 -133222 -329541 119247 47969 248238 -14246 244671 93129
12481 -52389 52336 7264 -448707 -129210 73522 151818 107747 -34077 -132022 84034 -65396
12469 244187 -88470 -54628 37227 -12051 -87225 -114257 166993 -210848 27043 -260666 87210
12457 -162335 24444 -78449 182463 128441 30599 -55493 302589 -33145 148681 -110395 -93450
12446i3450A38096C3440f131k49498N7854A24890K73139a35545A35529N094g2135
12434B08791a99626A14375P2365b59944g3855q415l6954D3175h8646H4087B5568
12422d4776J8605B40407J01822q5954a21923C4590J39793E136K7985a21205m7309
12411a68514j5771I1321a24063N8194j31580A21171c32092L6448A9579a72071
12400b0787I3640k6804N9836J48378h260b806C23270k0479c0885A45573F4691
12388H031P333b32377J2845C639a11328d1692m8613F3734a73602P4791j76194
12377b75005E1378c32003G5337O8528c4562B12053b5639C47872b98947A31501
12366C1944b18932R3861B01417E848b67981H3882Q6634N482J50378f2608k00522
$$ plain form
12446 -93450 138096 33440 -6131 -255629 -197775 124890 398029 -135545 135529 140623 -72135
12434 208791 -199626 114375 186740 -259944 -73855 -82270 -119224 43175 -88646 84087 25568
12422 -44776 -26171 240407 342229 256275 -121923 34590 174383 5136 33121 -121205 -168514
12411 -168514 -184285 91321 -124063 -65869 -197449 121171 -332092 -295644 19579 -172071
12400 -20787 93640 66836 126672 275050 -8260 -2806 323270 302791 -30885 145573 64691
12388 8031 15364 -232377 -219532 3639 -111328 -41692 -90305 63734 -173602 -98811 -275005
12377 -275005 51378 -332003 75337 143865 -34562 212053 -25639 347872 -298947 131501
12366 31944 -218932 -125071 201417 5848 -267981 83882 170516 175998 326376 -62608 -263130
12355b63130D11075H9070i6219q1198c408H689a62400C90146h048j24552C644
12343A08923j0864b93019P8516A22482g5714j24365A0372K52203H1942a97044
12332b96603c7017k6451A02733Q2290G5425a3356n4566C71842A33579a86867A01435
12320C23909E6729B2623K21458m0127J74824A12925J74887E856K86710j43531
12310A49035J00845a04909C5922b37599F5420K6240Q5978M1541g4002H0257L76608
12299D56865B08137n7149J35378I9642l3439L0748K0996J52626C4445a62240A57801
12287C0244L5284B4618a34307j23002A08873c70609h1568A06899A766O0739c3474
12275c750A84707G9778b3333p2441Q974B38761m8369L64672f1223A26660J9641
$$ plain form
12355 -263130 411075 89070 -96219 -177417 -3408 8689 -162400 390146 -8048 -132600 3644
12343 108923 98059 -293019 -214503 122482 -75714 -200079 10372 262575 81942 -197044
12332 -296603 -37017 -63468 102733 185023 75425 -13356 -67922 371842 133579 -186867 101435
12320 323909 56729 22623 244081 203954 378778 112925 287812 5856 292566 149035
12310 149035 249880 -104909 35922 -237599 65420 91660 177638 219179 -74002 80257 456865
12299 456865 208137 150988 286366 99642 66203 96951 117947 270573 34445 -162240 157801
12287 30244 65528 24618 -134307 -257309 108873 -370609 -81568 106899 1766 62505 -33474
12275 -3750 184707 79778 -23333 -95774 -86800 238761 190392 555064 -61223 126660 146301
12264A46301a30988D30488F9583c62285e1611m6866C50192G3950A4570N01950
12254E16520i628l15021A2062a06433B63230j27086o1979R1571n129i6302B11681
12242c55756C25093c1696F1430c6847A57065K7005R4421e4579B73607a93384H0183
12230g7059C8342M3814b7359A33400D7276a27698K0600L7893D22549I1482A9566
12218A78202K7041j01697J0182a91114F4023k0861K3170L5962b3308B19817K4654
12207B44471F8620K84289A35164M2615J94517m458E8517K98745j68594Q3513K29433
12196E01614B00521B2255O8715G44i1380p5741A80621c3095l6521D3728L63741
12185D07469I6357k558g2066D83197j64443H0500Q6463L01923r4387A79583f0222
$$ plain form
12264 146301 -130988 430488 69583 -362285 -51611 -98477 350192 73950 14570 516520
12254 516520 -9628 -324649 12062 -106433 263230 136144 74165 165736 160607 -96302 211681
12242 -355756 325093 -31696 61430 -36847 157065 184070 278491 -54579 273607 -193384 80183
12230 -77059 38342 82156 -27359 133400 47276 -127698 -107098 -69205 422549 91482 19566
12218 178202 205243 103546 113728 -191114 64023 43162 66332 102294 -23308 219817 244471
12207 244471 68620 352909 135164 177779 372296 367838 58517 357262 188668 272181 501614
12196 501614 200521 22255 90970 744 -91380 -167121 180621 -33095 -69616 43728 407469
12185 407469 96357 93799 -72066 483197 318754 80500 166963 468886 374499 179583 -60222
12173A3041K91516A48505O1012c48256i7574D96502A31365J60235A31856N5845
12163A87701r2635J26265r1170D9804Q5459a69195B73312G0627B5805L23808D9811
12151A17949J33611M3302j07340O0600C8641b8349B44956A3876a88522K5839i064
12139B10626J50495j16882i6297B69079a47368A53656D9504N3882J54485p7291
12129A80580J07588a51411m2588B02748F4784d54874A63294D679M09N81118F8800
12117a31846B49369L3808J7012E9481J68688b6706G8160N2454J10533F3772J51522
12106B15294c0020F1879J91418e8120C40525Q4317a6614q1066o1980O3036C79571
12094D01057E2236c3623A86378b57970b4344F5230i020q0774C42898B4416h0796
$$ plain form
12173 13041 304557 148505 209517 -348256 -97574 496502 131365 291600 131856 187701
12163 187701 95066 221331 130161 49804 135263 -169195 273312 70627 25805 349613 49811
12151 117949 251560 294862 187522 248122 38641 -28349 244956 13876 -188522 -162683 -9064
12139 210626 361121 244239 -96297 269079 -147368 153656 49504 103386 257871 180580
12129 180580 288168 -151411 -193999 202748 64784 -454874 163294 4679 5088 586206 68800
12117 -131846 249369 283177 300189 59481 228169 -26706 78160 130614 241147 63772 215294
12106 215294 -30020 61879 253297 -58120 340525 424842 -16614 -97680 -159660 -96624 379571
12094 401057 52236 -33623 186378 -257970 -24344 65230 -9020 -89794 342898 24416 -80796
12082B75204m5792H8232N28283a0583G5037b63914A47155a07174B41134A00200
12071A7400O2491N1042o5377a20811j64495D9391b83763A63020J01216o8457i3489
12059f6217n4347B28489G9598d4276B22714O8561a02982B82421C0105a15741k1453
12048a37194k144B87286R023A7274Q9065a02035L3659A28396O8382D9244a66111
12036B00819C2418M7714R4116a7570A9750a02246A44820R733B3627i6207F505
12024H8314j2167P5441a93384E738K87407c7454A10590a11395A87874a63089b2418
12012A66099P268b24948L7232C7669K68395q0742b56542C4159L1831K63477A15768
12000I1114a15593B08663b91730a36238M5041b372B65950r6403a64819B22294
$$ plain form
12082 275204 229412 88232 616515 -10583 75037 -263914 147155 -107174 241134 100200
12071 17400 79891 130933 65556 -120811 -285306 49391 -283763 163020 264236 195779 -93489
12059 -66217 -120564 228489 79598 -44276 222714 291275 -102982 282421 30105 -115741 -137194
12048 -137194 -139338 287286 296309 17274 106339 -102035 -68376 128396 196778 49244 -166111
12036 200819 32418 80132 174248 -17570 19750 -102246 144820 154553 23627 -96207 6505
12024 88314 76147 151588 -193384 5738 293145 -37454 110590 -111395 187874 -163089 -22418
12012 166099 173367 -224948 -187716 37669 306064 225322 -256542 34159 65990 329467 115768
12000 91114 -115593 208663 -291730 -136238 -91197 -2372 265950 169547 -164819 222294
11989H8920d2336A0813Q9406b65777K2133E8089e0478C4747c62928D21259c172
11977b9583F8161O8799c13684J51755P4662G2363N7790J20809a11693q0751A66234
11965a8745A38826F2625b03052g5861B51231d8722k01975M4456B63046b48036
11954b1035j74383m350A96596a778k16842i2345k66108J0645B7379M0302f8640
11942g819k61324B87779j18506A960M26516A00844a43478M7067d3490k05478A71299
11930e6685j9962j85645F1228a21039n8821B24133J87534G1360j9168M2581J36240
11919B31013r6431a90559l6560a1377A63056a48817c6426C43861A8123a4192j6226
11908c0418A3026J24669J31897b19575A84609q6030b26548k0109P0314E3533i5905
$$ plain form
11989 88920 -42336 10813 100219 -265777 -243644 58089 -50478 34747 -362928 421259 -3172
11977 -29583 68161 136960 -313684 -161929 -87267 72363 130153 250962 -111693 -192444 166234
11965 -18745 138826 62625 -203052 -75861 251231 -48722 -250697 -206241 263046 -248036
11954 -21035 -195418 -199768 196596 -1778 -218620 -92345 -358453 -347808 27379 67681 -68640
11942 -7819 -269143 287779 169273 1960 428476 100844 -143478 -96411 -43490 -248968 171299
11930 -56685 -76647 -262292 61228 -121039 -179860 224133 411667 71360 52192 94773 231013
11919 231013 134582 -190559 -227119 -11377 163056 -148817 -36426 343861 18123 -14192 -30418
11908 -30418 13026 137695 269592 -219575 184609 98579 -226548 -246657 -176343 53533 -95905
11896G4983b16949C8113J04943e1991A04107b14259B8892J4700L61204A05284
11885C49371E9883a11898c4391A50851a30344H6346A8295c4487k69653B04970
11874c19481D8459f2538k3013d0805j84105A68465k5273m0740i1179b6855B1175
11862A80367b09312j98912g3064C7937c5069R37k12382b6377j73308q3436C2070
11850a23264B2890c1305j74747A08253b74897A94052E8681a42891N1347A67343
11839e6960l27746A32578J14126m064a9357k32353A85243q5065J79984a33742
11828b93742J27896B55937a23404F1132K70853a35659K1546L9924E0627a22155
11817C4159a88325p8073b3205B77238D711L75455b9471k6171A6554L1764a92282
$$ plain form
11896 74983 -216949 38113 143056 -51991 104107 -214259 28892 43592 404796 105284
11885 349371 59883 -111898 -34391 150851 -130344 86346 18295 -34487 -304140 204970
11874 -319481 48459 -62538 -85551 -40805 -224910 168465 143192 102452 -91179 -26855 21175
11862 180367 -209312 -408224 -73064 37937 -35069 -34132 -246514 -26377 -199685 -283121 32070
11850 -123264 22890 -31305 -206052 108253 -274897 194052 58681 -142891 -91544 167343
11839 -56960 -384706 132578 246704 242640 -19357 -251710 185243 100178 280162 -133742
11828 -293742 -165846 255937 -123404 61132 331985 -135659 -114113 -74189 50627 -122155
11817 34159 -188325 -266398 -23205 277238 4711 380166 -29471 -55642 16554 48318 -192282
11805a04713B35419h8565L6166j3398j97823e1208K2285H2601b36550A24564O7177
11794A91741J67618B6428b08166H3765h2206k89039A295b29133L4977A18502K62762
11783C81264b08466E8106a51037B29826a09313l04773A02015m8294j5633a69274
11772b9239j84418I4450Q6420c03368A54305a12833A80194h1933k4688l55962
11762d62583g1075j591a3035q6646j20770d7750j18839M8570g334j60899A2807
11750A21009a29448A26896k9119a17610h699A3070b84119k1039A79617d16742
11739a26529N3912l88397a16305A61046B5443h4793B55812d5309M676B91175a26044
11727h861j31306q921M9403I588e5315i541D6429K86066C2539a84465k02058C01127
$$ plain form
11805 -104713 235419 -88565 -52399 -65797 -263620 -51208 -28923 82601 -236550 124564 191741
11794 191741 359359 26428 -208166 83765 -82206 -371245 1295 -229133 -194156 118502 381264
11783 381264 -208466 58106 -151037 229826 -109313 -414086 102015 53721 38088 -169274
11772 -29239 -213657 94450 180870 -303368 154305 -112833 180194 -81933 -106621 -462583
11762 -462583 -71075 -72666 -13035 -99681 -220451 -47750 -166589 -118019 -7334 -168233 12807
11750 121009 -129448 126896 97777 -117610 -8699 13070 -284119 -305158 179617 -416742
11739 -126529 -72617 -461014 -116305 161046 25443 -84793 255812 -45309 -40633 291175 -126044
11727 -8861 -140167 -149088 -99685 9588 -55315 -9541 46429 332495 32539 -184465 -386523 301127
11714C1546d3714j94564B20312o7648e0323j20922d2296B97127C0272a5397j68173
11703a83570P3914L1205L2153j61135A55476Q427F9018R4299e8538H0232B4871
11691F9310c21443d2243B01129l127J3528k0580J2393j119I7473J01062I5630
11679a55365c5424q9346b1869I6807J00709a54850A45113D5149B0969P5424c9663
11667b43973R7535E3211a46502k0982d8562k75966A27071a39603A7654F916K82703
11656B89619e1484B33079g6373j09566a9776A71171a16449r9586A60318I694R750
11645A9444J38581c2359C6335L1942i5038k37318A16418a91664c4467A87888A2408
11633h1364E4014c29751M2495b6082F0644a00081H9718A0483b18315h1587j30674
$$ plain form
11714 31546 -43714 -238278 220312 152664 -50323 -171245 -42296 297127 30272 -15397 -183570
11703 -183570 -109656 -78451 -46298 -207433 155476 163903 69018 163317 -58538 80232 24871
11691 69310 -321443 -42243 201129 198002 211530 190950 203343 202224 97473 198535 95630
11679 -155365 -35424 -124770 -21869 96807 197516 -154850 145113 45149 20969 96393 -39663
11667 -243973 -146438 53211 -146502 -167484 -48562 -324528 127071 -139603 17654 6916 289619
11656 289619 -51484 233079 -76373 -185939 -19776 171171 -116449 -216035 160318 9694 19444
11645 19444 158025 -32359 36335 68277 -95038 -332356 116418 -191664 -34467 187888 12408
11633 -81364 54014 -329751 -287256 -26082 60644 -100081 89718 10483 -218315 -81587 -212261
11622b12261j31688a8436m5143A89736b06952A03004b05683D1439f5680j22825
11612a88505M2441j208e0788E9622L2748N7817B8775J04492d9759m6977G6420
11600B02140G718d2541j39223n2494a03909j3270G7505J62925D7830b91452C53183
11588B28594B3425b29778E0383a27721k2698a8062A17727J40874a23131N3181
11578f9950H0236l4106a233B46051a52284J5954A78857o7032A4517J4459a93589
11566D2386L08783F9387a2678r0165k58266J34727A56182L3139D7132a23705I333
11554A14426m840H730K82110j07589b85098C16039J69710B6718L4182r967n037
11543D5896a83932O7892B0290O4434i8671E3441k4373M5484K16657J05053c05014
$$ plain form
11622 -212261 -343949 -18436 -63579 189736 -206952 103004 -205683 41439 -65680 -188505
11612 -188505 -146064 -147272 -50788 59622 92370 150187 28775 133267 -49759 -96736 76420
11600 202140 7718 -42541 -181764 -234258 -103909 -117179 77505 240430 47830 -291452 353183
11588 228594 23425 -229778 50383 -127721 -150419 -18062 117727 258601 -123131 -69950
11578 -69950 80236 46130 -1233 246051 -152284 -136330 178857 111825 14517 28976 -193589
11566 42386 351169 69387 -12678 -102843 -361109 -226382 156182 189321 47132 -123705 9333
11554 114426 109586 8730 290840 183251 -285098 316039 485749 26718 60900 50933 45896
11543 45896 -183932 -116040 20290 84724 -98671 53441 29068 74552 291209 396262 -305014
11531C36479j38383l0995c83538a45937F8779L7424L17444h1250D2967c2225B39798
11519B07934B8460J58639E1175b1482E1821Q5649b25317g3380p4807A69495b092
11507B26894n0821l950l7788J40174a18263B13493a19398g000E6a09705D4826
11495C23120A27996a2484F6206k9998M491L24838I0923K8072E0496L0502a94882
11483a21701C19113e824A70842J57690l9541E4931N9651a87647i0116E9114P6794
11472A35908B9520a33615C492c7341A11616n2058a77596f7474K9192B54351F6407
11460C7442J79112J44178i3773C8159J49626p9985O3513b3572l9638D48112i7023
11448B23743K07888A24437c89009J85922O7370B19052r2923c9534A27059e5403
$$ plain form
11531 336479 198096 167101 -383538 -145937 68779 106203 423647 -81250 42967 -32225 239798
11519 207934 28460 187099 51175 -21482 51821 137470 -225317 -73380 -148187 169495 -2092
11507 226894 176073 172123 134335 274509 -118263 213493 -119398 -7000 56 -109705 44826
11495 323120 127996 -12484 66206 36208 40699 365537 90923 118995 50496 80998 -194882
11483 -121701 319113 -5824 170842 328532 288991 54931 114582 -187647 -90116 59114 135908
11472 135908 29520 -133615 3492 -37341 111616 59558 -177596 -67474 -38282 254351 66407
11460 37442 216554 360732 -93773 38159 187785 107800 171313 -23572 -63210 448112 -97023
11448 223743 431631 124437 -389009 -203087 -135717 219052 126129 -39534 127059 -55403
11437A62934H0102L4154b37492I0769c59473A61296l3745a45905H8037g6204E0872
11425g3062B92121a82987j978n3256b5264l12685N9932A34546M4812l1947b15714
11413A03645c26542J03918k8865J16227I063J45070L9858a30544I3639J02540
11403A96179d9704F0118h2503I543J49730c3356q5451j5600b6984k08773A53257
11391e1308A94048A0612R3779C8417Q5088f6668B2812a5078q9793A39342E6709
11379a37515A24877a54197C1744L1012J42107o0072e4030j63390D3280L873d62819
11367D6847a78563K4243B05056a83167h5941m9596D3999b13453B05074D9554A6825
11355A62709n1857c54276A18306J23486a43570B17902e0237A02970J15650h7155
$$ plain form
11437 162934 80102 114256 -237492 90769 -359473 161296 127551 -145905 88037 -76204 50872
11425 -73062 292121 -182987 -184965 -238221 -25264 -337949 -278017 134546 179358 147411 -215714
11413 103645 -326542 -222624 -251489 -135262 9063 154133 193991 -130544 93639 196179
11403 196179 -49704 60118 -82503 9543 159273 -33356 -118807 -134407 -26984 -235757 153257
11391 -51308 194048 10612 104391 38417 123505 -66668 22812 -15078 -104871 139342 56709
11379 -137515 124877 -154197 31744 62756 204863 144791 -54030 -217420 43280 47153 -462819
11367 46847 -178563 -154320 205056 -183167 -85941 -135537 43999 -213453 205074 49554 16825
11355 162709 110852 -354276 118306 241792 -143570 217902 -50237 102970 218620 -87155
11344b48140G0225e9004j8744b4546A16848E0033p966e486j00160B41904a41791
11332a36802E6321D280J21722m057e6901j60239A52514E7451f6146J8671j02970
11321a50445c5426B01037n618q3753J203C5573a15326k3112A77633g0801j2968
11310h3769L6383K0958A46613c74499J32298J08103m0165K2481I5475b9813A70821
11298A48198f276H0504e9803G2644D196Q8645P6984b21749C9200j1376b09499
11286g595j13472E6768B6113K9092L55831a69968j37495A54768d4017m52256F8878
11274A99468c1652A20006M2254c4186B47347H5656c08837A03831b78052A66074
11263b13173k0450E2244j4508c5218A56720K65438A1355R7562e4785j12901b3361
$$ plain form
11344 -248140 70225 -59004 -77748 -24546 116848 50033 42067 -5486 -105646 241904 -141791
11332 -136802 56321 4280 126002 121945 -56901 -217140 152514 57451 -66146 -47475 -150445
11321 -150445 -35426 201037 195419 111666 112869 35573 -115326 -138438 177633 -70801 -83769
11310 -83769 -47386 -26428 146613 -374499 -242201 -134098 -174263 -151782 95475 -29813 170821
11298 148198 -6276 80504 -59803 72644 4196 92841 169825 -221749 39200 27824 -209499
11286 -7595 -121067 56768 26113 55205 411036 -169968 -307463 154768 -44017 -496273 68878
11274 199468 -31652 120006 162260 -34186 247347 85656 -308837 103831 -278052 166074
11263 -213173 -233623 52244 37736 -35218 156720 422158 11355 108917 -54785 -167686 -23361
11251b1654j86970d4399n4371L9056B45316b18439A42839j6232d6273m7789F5510
11239a71498e1069A49410D9142a08307j11624A9553a91319c9666q7202E3111d20
11227h7720j55098c898q1726B1504J68212c35322r5879C6761b99759J08401j52834
11216c44192F1495a8165G5568c9443k21945m8156g1839B5256h0263e52j62223
11205a62775f92q8993L6382q0741A47142Q6501c45748a15716d9287F7714c47803
11193b77057B32170c3197J6029A86964i6187A21031A5518d5748A3060J80744b6575
11181f2985J3226F6541J01732i6755c2748l16978F3532a54391N1574B58675B9382
11169B40118i0872I1128e8463k44875b7512r3346k45450a7986C7324P8481J19596
$$ plain form
11251 -21654 -208624 -44399 -98770 -59714 245316 -218439 142839 126607 -46273 -94062 65510
11239 -171498 -51069 149410 49142 -108307 -219931 19553 -191319 -39666 -126868 53111 -420
11227 -87720 -242818 -3898 -85624 21504 189716 -335322 -431201 36761 -299759 -191358 -344192
11216 -344192 61495 -18165 75568 -39443 -261388 -309544 -71839 25256 -80263 -552 -162775
11205 -162775 -692 -89685 -53303 -134044 147142 233643 -345748 -115716 -49287 67714 -347803
11193 -277057 232170 -33197 -17168 186964 -96187 121031 15518 -45748 13060 193804 -26575
11181 -62985 -49759 66541 168273 -96755 -32748 -349726 63532 -154391 -102817 258675 29382
11169 240118 -90872 91128 -58463 -303338 -27512 -120858 -366308 -17986 37324 115805 235401
11158B35401B7063b73239B33385a86382d8405p4638G142b11136A3891K11994b15233
11146a09479J5574J5569A11543h376k60722B1166A774K52527q9594E8122J41899
11135B00021a83995B07331c47014C1703N6760b07982B16817p9170m639m165a3436
11123A48475d2195R315b148m440p1115j99321a33138E1946h6079E3848c44311
11111i9367d0323j26592r324l0726a02416j29386H1261a17827e0629A40650L34504
11100D75154b46789H6205c36890g7839F3802k4473a30351A25257K3870J7768j124
11089A65771K2845H5671Q0839n9572b290B41282j03637R3008J0560l2325a0491
11077D1090L95400a23954F6206K32440b6129n2143A55501L211J82283f8914A84434
$$ plain form
11158 235401 27063 -273239 233385 -186382 -48405 -123043 7142 -211136 13891 225885 -215233
11146 -109479 -93905 -78336 111543 -8376 -269098 21166 1774 254301 164707 58122 200021
11135 200021 -183995 207331 -347014 31703 88463 -207982 216817 137647 133008 128843 -13436
11123 148475 -42195 -32880 -2148 -6588 -77703 -277024 -133138 51946 -86079 53848 -344311
11111 -99367 -40323 -166915 -176239 -206965 -102416 -231802 81261 -117827 -50629 140650 475154
11100 475154 -246789 86205 -336890 -77839 63802 39329 -130351 125257 149127 166895 165771
11089 165771 188616 85671 166510 106938 -2290 241282 137645 230653 241213 208888 -10491
11077 41090 436490 -123954 66206 298646 -26129 -78272 155501 158712 340995 -68914 184434
11065A19166P2073m7990M0612i6957A05044K5610L5906K78998J74040A33530l0421
11054A03109L38968j98824J99189k15870k4661G1652L72115q0007j70702J53101
11044C46159F1349L19893R2411K78143C26590m3413J01119j14960L44774j73742
11034D40368R6314J39771m9056k59563K3369K255q8209R8517J02839B16597K90286
11023E06883j77601K23064k16641p2276N3263K95079j2840J82137B80519J31593
11013D12112M6362j03821K78605J75162B48053R3562K10415K69250l12535J58585
11003F67330r6550K18271j89166m2282j09032r6172J33153J30931k04267j88588
10993B23628M57980C9211J79703J48615L2203o3619O2329n9008K40306k39170
$$ plain form
11065 119166 191239 143249 183861 -96957 105044 130654 166560 445558 619598 133530 103109
11054 103109 442077 243253 442442 226572 201911 71652 443767 363760 193058 346159
11044 346159 61349 381242 473653 751796 326590 283177 384296 269336 614110 440368
11034 440368 536682 676453 627397 367834 391203 393458 305249 403766 506605 216597 506883
11023 506883 329282 552346 335705 263429 316692 611771 598931 781068 280519 412112
11013 412112 458474 354653 633258 808420 248053 341615 552030 821280 508745 667330
11003 667330 570780 789051 599885 557603 448571 352399 485552 616483 412216 223628
10993 223628 681608 39211 218914 367529 399732 336113 398442 339434 579740 340570
10983C40570L41550j41452j63330J0417J29248O8904j81144J24053N8411Q1054
10973F68281R1666q3803j60539J70288R9037k24287K45112k06837J13622j72546
10963E39994J85362N0042M06047J50254R3336K10258L48642k10768M70700o14476
10953A629391M47630l67879K96947l67005J38138n05883P787J1982P2072k88162
10943A075018K08258k02961P5576L24450J20010P5832m92605m5366k07842Q7940
10933A018310q1403j35594k32004p0547P6756k78773A9283J43946K26114j48548
10923B40795c6691r233A12191Q1875N4893o8335J62337l9957l94o5902a75814
10911D7941K2974J3551l6138M2367J93760M2393c20474a29312m9027D2860K3768
$$ plain form
10983 340570 682120 540668 377338 387755 517003 585907 404763 528816 587227 668281
10973 668281 759947 676144 515605 685893 784930 560643 805755 598918 712540 539994
10963 539994 725356 775398 1181445 1331699 1425035 1635293 1983935 1773167 2243867 1629391
10953 1629391 2077021 1709142 2006089 1639084 1777222 1271339 1279126 1291108 1363180 1075018
10943 1075018 1283276 1080315 1155891 1480341 1600351 1676183 1183578 1138212 930370 1018310
10933 1018310 936907 801313 569309 498762 575518 296745 19283 163229 389343 240795
10923 240795 -36691 -45924 112191 194066 248959 180624 342961 303004 302610 236708 -175814
10911 47941 70915 84466 48328 90695 284455 326848 -320474 -129312 -178339 42860 66628
10900F6628J61143b05903h731E9920K97613A6094a66625c8743J1400C54328f1903
10888a02953A72917F3566a71986A2048c522A20393i3703k47846p116E3298b29358
10876a63500e7475j18980P5592j04786B14179a48696a9271j36775G486a07394
10865a64307O3296A80937e6152n5837q3218A74475F1935J82971Q986c10623c9077
10853a45334e5704p9951o2610j18600A72493a02682K4199H1557K85537a26499
10842c8806m90784a63670j32860C04392a03706b5851j77472D3382a26028j6982
10832a43010J676O1960A25354Q8907J37193I8931C7709K86963G1939J40653K3145
10821B35737E1865b13062c0679G5139c4487j47220B34256B8088R969a35155A44054
$$ plain form
10900 66628 227771 -205903 -8731 59920 357533 16094 -166625 -38743 -27343 354328 -61903
10888 -102953 172917 63566 -171986 12048 -3522 120393 -93703 -341549 -348665 53298 -229358
10876 -163500 -57475 -176455 -100863 -205649 214179 -148696 -19271 -156046 7486 -107394
10865 -164307 -101011 180937 -56152 -111989 -195207 174475 61935 244906 253892 -310623 -39077
10853 -145334 -55704 -135655 -198265 -316865 172493 -102682 -78483 81557 367094 -126499
10842 -38806 -529590 -163670 -296530 304392 -103706 -25851 -203323 43382 -126028 -143010
10832 -143010 -141334 -79374 125354 214261 351454 98931 37709 324672 71939 212592 235737
10821 235737 51865 -213062 -30679 75139 -34487 -181707 234256 28088 38057 -135155 144054
10809B44584b66466Q4584A60664a17412A77033b25715j6136d1932j39540P6772
10799a04700j24837A23664E1018a28172H8659M1447l7599a80990e8495k05068
10789b63563Q2037a9637n549k50067b5137j16165B10955a23009H8959K8727e7626
10777C77524d96987b22455M8312b901j64042J1837a9461l16592a52820A59201
10766a01406A073a03699F108j287Q7123A6699b72345J26673f3867a6702A74588
10754a29929A27067E7693b34919A84216J50701d51054h2485b8451E2471a02110
10743d2959a2130k03429B4256a18904M2820l5954j80252A7584J80806b126o5968
10732f8094A75140a11222r9758i7199H5881B0886a96230A24629a89929k21650
$$ plain form
10809 244584 -266466 -181882 160664 -117412 177033 -225715 -241851 -41932 -181472 -104700
10799 -104700 -229537 123664 51018 -128172 88659 130106 92507 -180990 -58495 -263563
10789 -263563 -181526 -19637 -25186 -275253 -25137 -141302 210955 -123009 88959 117686 -57626
10777 377524 -496987 -222455 -174143 -2901 -166943 -155106 -19461 -336053 -152820 159201
10766 -101406 1073 -103699 6108 4821 91944 16699 -272345 -145672 -63867 -16702 174588
10754 -129929 127067 57693 -234919 184216 334917 -451054 -82485 -28451 52471 -102110
10743 -42959 -12130 -215559 24256 -118904 -76084 -112038 -292290 17584 198390 -2126 -68094
10732 -68094 175140 -111222 -210980 -97199 85881 20886 -196230 124629 -189929 -411579
10722d11579A17651M4978b68608J5662j18528a51579A98069d6675G8785c06001
10711a77564A47553G27h60l03005L4012C09313a20694N9444k1529C75586h7885
10699b60071E2492c84157D66377b87340D3969M5954h2777D0245a02700b749j12629
10688a15378n7637J5817e3211n5451D2597a18603A30169b5963l06815a49035F7979
10676e1997k2383A54398J60887e9835A36708a89728N9595j69650a07231E2871
10665b56912I0990b75475a13573j6307j60829A47065c8099B50990e6696B50227
10654A13070H540b7755J1279j32206A15218n1626J80925f055k66004D0342g2429
10642a0006k23177g7084F1538b29211I6898b53613g8048j54175M1477k52697K00452
$$ plain form
10722 -411579 117651 162629 -268608 -252946 -371474 -151579 198069 -46675 78785 -306001
10711 -177564 147553 727 -860 -303865 -269853 309313 -120694 -61250 -82779 375586 -87885
10699 -260071 52492 -384157 466377 -287340 43969 89923 -82777 40245 -102700 -2749 -115378
10688 -115378 -173015 -157198 -53211 -108662 42597 -118603 130169 -25963 -332778 -149035 67979
10676 -51997 -74380 154398 315285 -59835 136708 -189728 -130133 -299783 -107231 52871
10665 -256912 90990 -275475 -113573 -129880 -290709 147065 -38099 250990 -56696 250227
10654 113070 8540 -27755 -16476 -148682 115218 63592 244517 -6055 -272059 40342 -72429
10642 -10006 -233183 -77084 61538 -229211 96898 -253613 -78048 -232223 -190746 -443443 -242991
10631b42991d0947G2870Q9720C7218a09172K3864A0770m060M6562i9679d3231
10619a70352j56365I347M9614j5704a37341p4938D0703a98494I5090N6471c31642
10607b33173A46207P4298J02909j38792Q0883B3008N7880a60907n1796Q7016A19800
10595F4232a20077H9496P0979c3491l13880a49230N4872H3635i6425B7097a70353
10583g2197q2495A52436B0126a42544H4010a60630a9393A55816b64576A22606
10572b4183j00334H7156b73583A52952e4067B08527a7486a121j22511f0509A4777
10560g2430A38942b32913E6327J72560f3925i910A48379J49411a04872B1152b57645
10548b33016A96438Q9620a2917j25906A71252a08984A35042m939K43202B5200
$$ plain form
10631 -242991 -40947 72870 162590 37218 -109172 -85308 10770 6710 53272 -99679 -43231
10619 -170352 -326717 9347 58961 43257 -137341 -212279 40703 -198494 95090 151561 -331642
10607 -233173 146207 220505 323414 184622 265505 23008 80888 -160907 -212703 -125687 119800
10595 64232 -120077 89496 160475 -33491 -347371 -149230 -94358 83635 -96425 27097 -170353
10583 -72197 -154692 152436 20126 -142544 84010 -160630 -19393 155816 -264576 122606
10572 -24183 -124517 87156 -273583 152952 -54067 208527 -17486 -1121 -123632 -60509 14777
10560 -72430 138942 -232913 56327 228887 -63925 -9910 148379 297790 -104872 21152 -257645
10548 -233016 196438 286058 -12917 -138823 171252 -108984 135042 130103 373305 25200
10537F2968i91k10407j51626A18418J8325d6188k91992a47872N311p521L15F174
10524a55600J6625B20234i8011B15099M6090a15584B15612a268k38969d3928j25611
10513a69539J0928L8832a5033B52528a17705A84063d411A74805j2077d5010j21338
10502a66348p8828l278A39139b50860F0183J02181e0977r6481k35645J21695A94305
10490g9809K3455k25539J20022c3917A65620b28246R4476r1191Q7456l72516a11834
10478a25242A56675b42869B9720K03a47472j17316B14765A3461e48362b15734
10467A4419J02569E5870J73876A05253L65139A50289A9191M7586J64868j3008
10457B18637F4204g908B44772d5340k20402k4515A06734b97598Q5642A37484n0448
$$ plain form
10537 62968 -991 -211398 -363024 118418 136743 -46188 -338180 -147872 -142561 -150082 -149767 6174
10524 -155600 -138975 220234 -98011 215099 261189 -115584 215612 -1268 -240237 -43928 -169539
10513 -169539 -158611 -119779 -15033 252528 -117705 184063 -4411 174805 162728 -45010 -166348
10502 -166348 -245176 -248454 139139 -250860 60183 162364 -50977 -147458 -383103 -261408 194305
10490 -79809 -56354 -281893 -161871 -33917 165620 -228246 -133770 -224961 -137505 -510021 -111834
10478 -125242 156675 -242869 29720 29923 -147472 -264788 214765 13461 -548362 -215734
10467 14419 116988 55870 229746 105253 470392 150289 19191 66777 231645 218637
10457 218637 64204 -7908 244772 -45340 -265742 -290257 106734 -297598 -211956 137484 87036
10446H7036a78987B2360K60156a39538N1492A6945K30588I0121J5025a56047L730
10435a52317P704a1659B76260c5299j40000B32909b36091n243M0755I7488J16727
10424B14215b42154j4898K1204d4388p6868e231C2024g3188A32301L4942o4140
10413A03103a69733E5075a80294h8433K0960E8342g4390j68922h7373j12689J9216
10402a80846F1257O902L83988A60621b78921R9896F9833a01886H6851b27619L8757
10391a88862A64045l5895m5256h8745A9297e4455k95384F7336K2660h2601j21015
10380b03616L8290O1980D1345K70050d3739C47892A24961l9168K81670A62634
10369A23151D8286b32166D4741J96779a21094A28568K0121J3455F8095k2842a9477
$$ plain form
10446 87036 -178987 22360 282516 -139538 -88046 16945 247533 90121 105146 -156047 -152317
10435 -152317 -144613 -11659 276260 -35299 -175299 232909 -236091 -241334 -200579 97488 214215
10424 214215 -242154 -257052 -235848 -44388 -121256 -5231 32024 -73188 132301 167243 103103
10413 103103 -169733 55075 -180294 -88433 -67473 58342 -74390 -243312 -87373 -200062 -180846
10402 -180846 61257 68159 452147 160621 -278921 -179025 69833 -101886 86851 -227619 -188862
10391 -188862 164045 128150 82894 -88745 19297 -54455 -349839 67336 89996 -82601 -203616
10380 -203616 -165326 -103346 41345 311395 -43739 347892 124961 85793 367463 162634
10369 123151 48286 -232166 44741 241520 -121094 128568 148689 162144 68095 45253 -19477
10357B10946m053a39174H7088K28145F3335K01663B2822J68703J29359A35934
10346A86984b3055j0122A71497l3558Q0729B6717J64883L7493F1031L07303J35268
10335E03602p1581p6082J20865q2283P4509d1418A51988L5350k4468A4846J41128
10324A55974D003L17847j028d0573j25907F5656a51225A67555K0966L3387a29950
10312G2915K32329j16993a67155B8283J8699J05831L16677B22496i2029b2519
10301A5630a21025A61378J49466A44419c361l348k01912O3362J5714A58846l3591
10290A25255C8794a32246B95787b45160d4101j47549E2950J79253a40525B18638
10279C943Q6852J23150a63556C7820a49684l92219A77504l1764e6371B2896a36997
$$ plain form
10357 210946 206893 -139174 87088 315233 63335 264998 22822 191525 320884 135934
10346 186984 -23055 -33177 171497 137939 218668 26717 191600 229093 61031 368334 503602
10335 503602 432021 355939 476804 394521 469030 -41418 151988 187338 162870 14846 155974
10324 155974 4003 321850 320822 -40573 -166480 65656 -151225 167555 188521 221908 -129950
10312 72915 305244 188251 -167155 28283 46982 152813 469490 222496 -92029 -22519
10301 15630 -121025 161378 310844 144419 -3361 -6709 -208621 -145259 -129545 158846 125255
10290 125255 38794 -132246 295787 -245160 -44101 -191650 52950 232203 -140525 218638
10279 3943 90795 213945 -163556 37820 -149684 -541903 177504 145740 -56371 22896 -136997
10267A58889a11332K7303j54447C4543b28101e8990n5364q8351p6618G4267a40717
10255d7474J8948B24625p6635K71587a0015C181P8989b32029R1485C1087L9200
10244G0287g1497j8884B06298P6238H9228k0779J01067M3630k0023p7045J4959
10233A31037E9635a59823c015n7166D2789M9749i8283B51947E320J00354b48401
10221F0537c0500l54438f1252j4781o9372k20022c0247j4546l21418H8448c36659
10209d4353B67378H2789b90142B7436a46221m2540g4744j30452q9803l790J34961
10198a63828e0339D3946g7763r662B16620i7596j31167i6687c6375A65890b30386
10186d07727a77135r3535C3034c87474H1849a6910q7597b3550I5912b38115A07733
$$ plain form
10267 158889 -111332 -84029 -238476 34543 -228101 -58990 -114354 -202705 -279323 74267 -140717
10255 -47474 -28526 224625 147990 419577 -10015 3181 82170 -232029 -140544 31087 70287
10244 70287 -71497 -90381 206298 282536 89228 68449 169516 213146 193123 116078 131037
10233 131037 59635 -159823 -3015 -60181 42789 92538 -98283 251947 5320 105674 -248401
10221 60537 -30500 -384938 -61252 -76033 -145405 -365427 -30247 -44793 -366211 88448 -336659
10209 -44353 267378 82789 -290142 27436 -146221 -188761 -74744 -205196 -294999 -298789 -163828
10198 -163828 -50339 43946 -77763 -87425 216620 -97596 -228763 -96687 -36375 165890 -230386
10186 -407727 -177135 -270670 33034 -387474 81849 -16910 -104507 -23550 95912 -238115 107733
10174d7070o194j71544A53312C9934a23486I6502O2666c91465i1941P745B34540
10162i8140j50070C5906a52238E241L3533b10923L4091j45124G860M3638P0252
10151A21750b2026m03881G5520b69244a1847k25622c1110l22223e8995A27206
10140b55198e1660A79613a30553b0065j8187m7351D50105a39098j66381c6268
10129g8827l5013k3601H9903i7153B24774g4815b2183C8612g866q1665D7118e2522
10116d1463H9828O6885K6848a52542l03119a87821O7811r6815H1502i2513k79453
10105c71966e267A11816N1429A0808a28873F8467e0073B8986b03184A78220j5431
10094A62789G5851F749J56375d5668A43945g1105H3410a06124o3463P1288k54314
$$ plain form
10174 -47070 -53264 -224808 153312 39934 -123486 96502 159168 -391465 -91941 -84196 234540
10162 -98140 -248210 35906 -152238 5241 38774 -210923 -176832 -321956 7860 51498 121750
10151 121750 -22026 -425907 75520 -269244 -11847 -237469 -31110 -353333 -58995 127206
10140 -255198 -51660 179613 -130553 -20065 -38252 -85603 450105 -139098 -305479 -36268
10129 -78827 -113840 -137441 89903 -97153 224774 -74815 -22183 38612 -7866 -89531 47118 -52522
10116 -41463 89828 156713 183561 -152542 -455661 -187821 -120010 -216825 81502 -92513 -371966
10105 -371966 -5267 111816 163245 10808 -128873 68467 -50073 28986 -203184 178220 162789
10094 162789 75851 6749 163124 -45668 143945 -71105 83410 -106124 -169587 -98299 -352613
10083c52613E1070b36309H5669d3580B1779K9846a09025H0711a61697j18388I624
10071F2533a3043H5775a01923k26232A06475a60269h0010B110i0366I9904a69631
10059A09166B9129K35974a70424F0115l859a41818k85293C8936n208b39874J8737
10048b21137a06641M0718j08482A92086H7264K71182e2276j08471j31035A481
10037a00870C6693c95281B12443b8703j80004b6654a952k4064l68A5423r71h6220
10024a21577m02615a7320Q138B51549a62116k32852D0078b74684n1369B49058
10013e6963A56771a55243B49127a82522l4757Q5446A62014J33123e9262j12092
10003a71354j61223A06182a87991h4637L8786n7877F0826c65445J59803R8283
$$ plain form
10083 -352613 51070 -236309 85669 -43580 21779 51625 -109025 80711 -161697 -280085 9624
10071 62533 -13043 85775 -101923 -328155 106475 -160269 -80010 2110 -90366 99904 -169631
10059 109166 29129 265103 -170424 60115 56256 -141818 -427111 38936 33728 -239874 -221137
10048 -221137 -106641 -65923 -174405 192086 87264 358446 -52276 -160747 -291782 1481
10037 -100870 36693 -395281 212443 -28703 -208707 -26654 -1952 -26016 -26384 15423 14452 -86220
10024 -121577 -524192 -17320 -9182 251549 -162116 -394968 40078 -274684 -326053 249058
10013 -56963 156771 -155243 249127 -182522 -217279 -131833 162014 295137 -59262 -171354
10003 -171354 -332577 106182 -187991 -84637 -45851 -103728 60826 -365445 -205642 -107359
9993a07359l59058B61236b61160C4427h3684A42936L6391d6145c696o3530B77470
9981C8140R4572c7451D5006g9287k1379A17449b998l27992L7094B0907a51432
9969D9690i3076j17969J7219h1673j08490a9472j97019h0802D1845b78959B9760
9957B5803R1323d6235k9494j10359g519A3177O6817c43575a55305q7063G1034
9945c2299B6444g9430B3587a28545m7359c5417q1032A52461C8297a07551B3792
9933a00709J9275n460J8262A36529a51670O6217j09457P6900o1128Q4766l3395
9922a27767k06812b1701j17416j98351A64644A4908c92823A46761B8483K0365
9912D8848J48361D3401a29076q2427P9901A45449b06786R0498A30638D4470j0275
$$ plain form
9993 -107359 -466417 261236 -261160 34427 -83684 142936 179327 -46145 -3696 -67226 277470
9981 38140 132712 -37451 45006 -79287 -100666 117449 -2998 -330990 -293896 20907 -151432
9969 49690 -93076 -211045 -193826 -81673 -190163 -19472 -216491 -80802 41845 -278959 29760
9957 25803 117126 -46235 -75729 -186088 -7519 13177 79994 -343575 -155305 -242368 71034
9945 -32299 26444 -79430 23587 -128545 -175904 -35417 -116449 152461 38297 -107551 23792
9933 -100709 -81434 -86894 -68632 136529 -151670 -85453 -194910 -118010 -179138 -94372 -127767
9922 -127767 -334579 -21701 -139117 -337468 164644 14908 -392823 146761 28483 48848
9912 48848 197209 43401 -129076 -211503 -131602 145449 -206786 -116288 130638 44470 34195
9901C4195J8944J8331h1030l6564a9804A00559a20925k98506R8115J17776L2481
9890a71059g5785m5558N2636J3555k72815b8318A10766q628K3426b74999f9714
9878A5213a07267M0148B34191E8060a33646L8176D555J64656a12979M3945A9516
9866i4682k589B0168b07133h1742N799A07539q526J94403c9756m7738L5359D1556
9853c00766J39066O6189j80061F17663b91505h106k56008F4514c87311N1690G3586
9841a43252J2091C1130B885b10673J03706k73745a78999P1647H8074a60705A58818
9829a4596j77707I8214h2435G8323R9369k2261c94262e0145j53977k7415c1784
9817d7837P390j30508l3896k8655p7690J37811C8172L5064e24534a06045r5151
$$ plain form
9901 34195 53139 71470 -81030 -117594 -19804 100559 -120925 -419431 -321316 -203540 -171059
9890 -171059 -75785 -121343 -68707 -55152 -327967 -28318 110766 102138 125564 -274999 -69714
9878 15213 -107267 -67119 234191 58060 -133646 -95470 4555 169211 -112979 -69034 19516
9866 -94682 -97271 20168 -207133 -81742 -75943 107539 99013 293416 -39756 -87494 -52135 41556
9853 -300766 -161700 -95511 -275572 617663 -291505 -8106 -264114 64514 -387311 -335621 73586
9841 -143252 -131161 31130 2885 -210673 -106967 -380712 -178999 -107352 88074 -160705 158818
9829 -14596 -192303 98214 -82435 78323 177692 155431 -394262 -50145 -204122 -231537 -31784
9817 -47837 -40447 -170955 -204851 -233506 -311196 -173385 38172 73236 -524534 -106045 -201196
9806b01196n1699B4488i6425B65359b12942Q8184M7009q8033A4597d0390q4639
9795a25029l80533a668B01188i9956m4779A03772l2291a63504m8074B03742a66867
9783c7799B76298a66993d1299d701j08854D2694c6473C7357b87779J37954p8571
9772b28396j07107A79642c04089M3227A46244i5384C042O5941l2506A3324K0849
9761C4173b707C180g7845B03511h3888j6172d6435b2744l06529A265a83138B27706
9748B3593d3922h344n9701l18373a14840r1294C01232a40376B93933G0481i1551
9736B54723f9792D3246K60819a97220k42270b01795B89192a01014A39229g755
9725b0750q9988C7715a08382L356k27941A9573a22232j2939A33170a03454J1419
$$ plain form
9806 -201196 -252895 24488 -96425 265359 -212942 -124758 -77749 -165782 14597 -40390 -125029
9795 -125029 -505562 -1668 201188 -99956 -144735 103772 71481 -163504 -211578 203742 -166867
9783 -37799 276298 -166993 -41299 -4701 -113555 42694 -36473 37357 -287779 -149825 -228396
9772 -228396 -335503 179642 -304089 -260862 146244 -95384 3042 68983 36477 13324 34173
9761 34173 -2707 3180 -77845 203511 -83888 -100060 -46435 -22744 -329273 1265 -183138 227706
9748 23593 -43922 -8344 -68045 -386418 -114840 -206134 301232 -140376 293933 70481 -91551
9736 254723 -69792 43246 304065 -197220 -439490 -201795 289192 -101014 139229 -7755
9725 -20750 -110738 37715 -108382 -105026 -332967 19573 -122232 -135171 133170 -103454 -92035
9714i2035K3453C82566e5551n4063A0817b37723e2458j09342l26785b195j86320
9703a88515P9980B88337b04611A4609a03515A36954g8243j95529h1879j1910j51236
9692b45025e4511j52183j89315a18324A25711c81278a62629O0287A50421p3065
9682G7356c60526A1253a69692O5582c8973a0229A32426K06112a26356j86204a03705
9670d5469l21326f5467j42871c0850j9958J9698j13679j98170J62114G9468f0047
9658b25074A27127c33230J28522L5864d3785k14162B03477b600G8985c61726a57798
9646d95751A04706J39022A04234a47129b4717j3554A17930m9678b6387k88289
9636c14676B9939a00257I4775d85819a57554F6515j1013M5781a33473A70675D5159
$$ plain form
9714 -92035 -68582 382566 -55551 -109614 10817 -237723 -52458 -161800 -488585 -2195 -188515
9703 -188515 -108535 288337 -204611 14609 -103515 136954 -78243 -273772 -81879 -93789 -245025
9692 -245025 -54511 -206694 -396009 -118324 125711 -381278 -162629 -102342 150421 77356
9682 77356 -360526 11253 -169692 -104110 -38973 -10229 132426 338538 -126356 -312560 -103705
9670 -45469 -366795 -65467 -208338 -30850 -50808 -31110 -144789 -342959 -180845 79468 -60047
9658 -225074 127127 -333230 -204708 -168844 -43785 -257947 203477 -2600 78985 -361726 -157798
9646 -495751 104706 243728 104234 -147129 -24717 -38271 117930 68252 -26387 -314676
9636 -314676 29939 -100257 94775 -485819 -157554 66515 55502 101283 -133473 170675 45159
9624a57986B64671E9393a6618p8651c6903k97596H0440l1687J24996A1083L5932
9613D7015J39263o6698b28049d0588j87840Q6422B87062f2992G2150a20689I637
9601a6257D37417a72214i833A9249b68005h9880L8969A63908H0962f8381k3417
9590i1798M0110k19183B77371i3919A61668c20143E0667a21882m35B34845b90884
9578A24455h593B70567b0014q6225A38102a38861A96915b07171i5766A57314J04804
9567B62118a85461E8809L5229l3532a52600J2526M4899A40576k4587C3678D969
9555B1766a23294m6204o6833g2782E9298a26387j14478B60458a23B23709a76491
9543a18293n3380A47519A6493J81478E4014a51815G4554a36857H1987a77794E666
$$ plain form
9624 -157986 264671 59393 -16618 -95269 -36903 -334499 80440 48753 173749 11083 47015
9613 47015 186278 119580 -228049 -40588 -228428 -142006 287062 -62992 72150 -120689 9637
9601 -16257 437417 -172214 -9833 19249 -268005 -89880 -50911 163908 80962 -68381 -91798
9590 -91798 -51688 -270871 277371 -93919 161668 -320143 50667 -121882 -122317 234845 -290884
9578 124455 -8593 270567 -20014 -106239 138102 -138861 196915 -207171 -95766 157314 262118
9567 262118 -185461 58809 94038 60506 -152600 -140074 -95175 140576 115989 33678 4969
9555 21766 -123294 -169498 -236331 -72782 59298 -126387 -240865 260458 -123 223709 -176491
9543 -118293 -171673 147519 16493 197971 54014 -151815 74554 -136857 81987 -177794 5666
9531b47697D9314K72889D9116a65796o5996A42096a77255d0985j81317c8987F4389
9519c39650A20812q413j3911a29146A75388a0214k25215G5300g5594G1486K114
9508G3600a87920e4178A17054g9976r0450k19685a36118E4373d6563l5115q1499
9497a63177M9937H8890c11238K6298A92066h7760A15202d21526d3850j09270f5088
9485b20862A33091K0124a63600O7232j71670J18968P3170l79415A44472I308R7677
9474A06985a45488k02024c369k98177a14876e3710A02505a27630e5382B7290e4695
9462a3772l3752b2836k04074i5407E9033b18421g97E7833B360J46797f5068B30836
9449a64634g8640a2070j36119A01832b5802k90117J22633A65317o7298m3814f062
$$ plain form
9531 -247697 49314 322203 49116 -165796 -231792 142096 -177255 -40985 -222302 -38987 64389
9519 -339650 120812 112399 98488 -129146 175388 -10214 -235429 75300 -75594 71486 73600
9508 73600 -187920 -54178 117054 -79976 -170426 -390111 -136118 54373 -46563 -81678 -163177
9497 -163177 -113240 88890 -311238 -284940 192066 -87760 115202 -421526 -43850 -153120 -65088
9485 -220862 133091 153215 -163600 -96368 -268038 -149070 -75900 -455315 144472 9308 106985
9474 106985 -145488 -347512 -3369 -301546 -114876 -53710 102505 -127630 -55382 27290 -54695
9462 -13772 -47524 -22836 -226910 -95407 59033 -218421 -797 57833 2360 149157 -65068 230836
9449 -164634 -78640 -12070 -148189 101832 -25802 -315919 -193286 165317 98019 54205 -6062
9437c54043A53888a54086M3975m2838B156J32086a24623e2231l61953i9519D2514
9425i7273M7208k56965B55948f8830A32509c41A68166b4358A23377a9648r9115
9414a18763l7173m1877i1908C3060a58589J4402a9771a321j62341N0694N2728
9403f0240E7231b82529h6978J1551E0632b14694a6483j1751k98260A3336J20519
9392A33855h4967j46692j23431J33851D5042c4899B30101a2925A60421h8903B96826
9380c7974k28429C9590J31960d17532B8606b35280l9026l5388J20507A14935K11516
9369C26451C6885J8471h2255j9674l18229C62662A20513e6125j28267M8930A32093
9357a29160b0986j62883C45480A7816a79837A39718a02830k57661B5939J46560
$$ plain form
9437 -354043 153888 -154086 -110111 -152949 2156 134242 -124623 -52231 -414184 -99519 42514
9425 -97273 -50065 -307030 255948 -68830 132509 -341 168166 -24358 123377 -19648 -118763
9414 -118763 -155936 -197813 -91908 33060 -158589 -144187 -19771 -1321 -163662 -112968 -60240
9403 -60240 57231 -282529 -86978 -75427 50632 -214694 -16483 -28234 -326494 13336 133855
9392 133855 -84967 -231659 -355090 -221239 45042 -34899 230101 -12925 160421 -88903 296826
9380 -37974 -266403 39590 171550 -417532 28606 -235280 -274306 -309694 -189187 114935 326451
9369 326451 36885 55356 -82255 -101929 -420158 362662 120513 -56125 -184392 -135462 132093
9357 -129160 -20986 -183869 345480 17816 -179837 139718 -102830 -360491 25939 172499
9347A72499m5610b8317B54737e2985G3645a90975c0960j08532n9795D9948d70490
9335b40834P9732f2513m4967n6467A4546K6825h0276j01536p1973d3163H8769
9323a67950B37442a99629G8980P9621c00449I1497b46279g1492H855h0625k57735
9312c38360a27390I6346J3384a1398F6470d7772C68920c26572B0542b36550G763
9300B04242c56508A94277b62425c6518E0141b43241h1073j26345d3448j82451
9290b25899A25113b35030A52687M0661Q9822D4535a64335A50227p1037c34457
9279d07530N7200C16822j8441G175P1782d06m24918J09389A05209a32918k9991
9268a62909j78473A30982b45944O4536c6897A08904D5337b26329Q3625f5354m0948
$$ plain form
9347 172499 126889 -28317 254737 -52985 73645 -190975 -30960 -139492 -199287 49948 -470490
9335 -240834 -161102 -62513 -107480 -163947 14546 41371 -80276 -181812 -253785 -43163 88769
9323 -167950 237442 -199629 78980 158601 -300449 91497 -246279 -71492 8855 -80625 -338360
9312 -338360 -127390 96346 109730 -11398 66470 -47772 368920 -326572 20542 -236550 7763
9300 204242 -356508 194277 -262425 -36518 50141 -243241 -81073 -207418 -43448 -225899
9290 -225899 125113 -235030 152687 193348 283170 44535 -164335 150227 79190 -334457
9279 -407530 -350330 316822 298381 7175 78957 -406 -425324 -315935 105209 -132918 -162909
9268 -162909 -341382 130982 -245944 -181408 -36897 108904 45337 -226329 -142704 -65354 -106302
9257a06302J8614j25547j52695C03586d7045r8009A20117a57346f4206D1923b4994
9245b37245A60919j9802c5811j43903h3740G3476J32956a72069f7863j46382N3360
9234a60885D02388A55848o3676C8270e15241P8597b8679k10830f1739j58601C13608
9222d74757J76120j5831J13103G9741J61116b21933p5650d2648j0755b2915d100
9210d9145k0859D8066f0982l25205H5528f3317K2855A10038j5223b00273Q0372
9199a19901j18058I5634g2997q383A25911c5431j8822p8224A05692e6428r3300
9188a49728k62739f7361B7469f7081l24945i1638p669B75402g9503j56634f9977
9176A27607c52932J00508A44833M3899b076l7370j72907e8708l0867H7873b41227
$$ plain form
9257 -106302 -87688 -213235 -365930 303586 -47045 -145054 120117 -157346 -64206 41923 -24994
9245 -237245 160919 141117 -35811 -179714 -83740 73476 206432 -172069 -67863 -214245 -160885
9234 -160885 402388 155848 92172 38270 -515241 -436644 -28679 -239509 -61739 -220340 313608
9222 -474757 -298637 -314468 -201365 79741 240857 -221933 -297583 -42648 -53403 -22915 -4100
9210 -49145 -70004 48066 -60982 -386187 85528 -63317 -40462 110038 94815 -200273 -119901
9199 -119901 -237959 95634 -72997 -81380 125911 -35431 -54253 -132477 105692 -56428 -149728
9188 -149728 -412467 -67361 27469 -67081 -392026 -91638 -99307 275402 -79503 -236137 -69977
9176 127607 -352932 -252424 144833 188732 -2076 -39446 -212353 -58708 -89575 87873 -241227
9164a0705k3407m7909A37689e1535r8258O3465B3242P1759a41563O4857c2851
9152B27349E3994a58141A13873b15668L1300B00140h533j16962k5488D0669K82838
9141C23507c02159e3958k08751a22452j35941B74066f9264k76498I2951a81613
9130B41815a05243n747N3861p2549p5078o6759j63493e4075D1886N1165J44176
9119B37227B9789b98066j83788A47961o5749b23539N1158K1521c1254B1802b94159
9107C3511d7843F3608O9147d8781o5425B01437a54081L9966L118C9150a96374
9095a56299k09561g3615D3085a87836n8242N4976O4569b2202A9157a16456j6569
9084a33025A27868f6019A30198b58149B10410D1944b49983d5201B36738b74336
$$ plain form
9164 -10705 -34112 -82021 137689 -51535 -149793 -86328 23242 95001 -141563 -76706 -32851
9152 227349 53994 -158141 113873 -215668 -184368 200140 -8533 -125495 -150983 40669 323507
9141 323507 -302159 -53958 -262709 -122452 -258393 274066 -69264 -345762 92951 -181613
9130 241815 -105243 -110990 -57129 -129678 -204756 -271515 -435008 -54075 41886 93051 237227
9119 237227 29789 -298066 -481854 147961 82212 -223539 -172381 -150860 -31254 21802 -294159
9107 33511 -47843 63608 132755 -48781 -114206 201437 -154081 -114115 -110997 39150 -196374
9095 -156299 -365860 -73615 43085 -187836 -246078 -191102 -126533 -22202 19157 -116456 -133025
9084 -133025 127868 -66019 130198 -258149 210410 41944 -249983 -45201 236738 -274336
9073A18858J15881B5501i9593a2740p9864a2851F320J62459c10590C10091H4185
9061b05375f2590B72166a87571N6366j95671F5566c2387A6923L6814R2286b13845
9049a21377A69203J3620H7783K5387D4383J49374M3097c46233J05609k8023k305
9038b70952I0965b78546J37153A66308a30791D0471c69623b0094m32349h9361
9027I791K12162f9580E7588n771b20282Q2669D5740a30792f336j26115N1610B23137
9014B4584b0840H330L53842g4687j4753A00710a15004d1545A23184k002a042m5046
9002d6088A27037r505Q6438c01857o557E5143a52274k00023L6916H1538c18174
8990C8123b15054N7788N7533L7804A381b13643A64253B0699b12896K902G9300
$$ plain form
9073 118858 234739 25501 -99593 -12740 -92604 -12851 6320 168779 -310590 310091 84185
9061 -205375 -62590 272166 -187571 -131205 -326876 65566 -32387 16923 53737 146023 -213845
9049 -121377 169203 182823 87783 113170 44383 193757 236854 -346233 -240624 -268647 -270952
9038 -270952 90965 -278546 -141393 166308 -130791 40471 -369623 -20094 -452443 -89361
9027 9791 221953 -69580 57588 51817 -220282 -137613 45740 -130792 -6336 -132451 -80841 223137
9014 24584 -20840 8330 362172 -74687 -89440 100710 -115004 -41545 123184 121182 -1042 -46088
9002 -46088 127037 117532 203970 -301857 -308414 55143 -152274 -352297 -315381 81538 -318174
8990 38123 -215054 -157266 -99733 -61929 1381 -213643 164253 20699 -212896 -209994 79300
8978g4828A07187a79977M744G3822Q7795E5043a24565A91600I3345C7233c3386
8966c51991b2868j18217A25735e806m5898A6023K05322d2407I5135D1897a26384
8954a35310m7414C57303F4886c5290A1610K96340a9385l91931N5619i7241B6618
8942a19095k65163M4207a67180F6930d5100A98617a26776d8163j15401C1129e6919
8930a69179a2856M460n67585a18658L8775k1012A64306p443b79009a7309B6049
8918e5592C23435R6687E1699K8820J33619E6331f1439C39893J63105k00180O44517
8907I47335P09646M60189J585052N122051l021353B877495j323047o99790B27720
8897B81395A23711J16338j02607L5027a69022B11634e2545C08357j41058a81758
$$ plain form
8978 -74828 107187 -179977 -175233 73822 161617 55043 -124565 191600 93345 37233 -33386
8966 -351991 -22868 -141085 125735 -5806 -51704 16023 221345 -42407 95135 41897 -126384
8954 -135310 -182724 357303 64886 -35290 11610 307950 -19385 -411316 -355697 -97241 26618
8942 -119095 -384258 -340051 -167180 66930 -45100 198617 -126776 -48163 -163564 31129 -56919
8930 -169179 -12856 -8396 -575981 -118658 -79883 -100895 164306 156863 -279009 -17309 26049
8918 -55592 323435 420122 51699 80519 214138 56331 -61439 339893 502998 302818 947335
8907 947335 1656981 2117170 3702222 8824273 5802920 2877495 1554448 854658 227720
8897 281395 123711 240049 137442 172469 -169022 211634 -52545 308357 167299 -181758
8886b0777C6296N9916a87250A18830J03923a83561j31007a02903c0742A67527
8875a63337b0845l07G6405l124j7462L8745b08854B59958h5520j18883K9213F3472
8862A0699L2737O0123b55713D4454a65468n154q2483i5974A45178F6732i432j45312
8850a54744q8535J00435B33791a75918K5896k72814J97166g2708m76513i0762
8839h3455I4601a63506e1665a1961n71595B73362b06790g7841J3208A36192a85001
$$ plain form
8886 -20777 36296 96212 -187250 118830 222753 -183561 -314568 -102903 -30742 167527
8875 -163337 -20845 -21152 76405 73281 55819 94564 -208854 259958 -85520 -204403 -175190 63472
8862 10699 43436 103559 -255713 44454 -165468 -170622 -253105 -95974 145178 66732 -9432 -154744
8850 -154744 -243279 -142844 233791 -175918 -150022 -422836 -225670 -72708 -549221 -90762
8839 -83455 94601 -163506 -51665 -11961 -583556 273362 -206790 -77841 -64633 136192 -185001
$$ [...]
##END NTUPLES=NMR SPECTRUM
##END=
