
##TITLE=AC1116_Cauca1_5835603_bxzCjDc94Z
##JCAMPDX= 6.0         $$ Bruker NMR JCAMP-DX V2.0
##DATA TYPE= NMR SPECTRUM
##DATA CLASS= NTUPLES
##ORIGIN= BRUKER
##OWNER= Administrator
$$ 1.72 TOPSPIN		Version 2.1
$$ 2012-03-28 11:06:20.218 -0500  Administrator@TOPSPIN
$$ Compression mode = diff/dup
##.OBSERVE FREQUENCY= 400.13188235
##.OBSERVE NUCLEUS= ^1H
##.ACQUISITION MODE= SIMULTANEOUS (DQD)
##.ACQUISITION SCHEME= undefined
##.AVERAGES= 64
##.DIGITISER RES= 22
##SPECTROMETER/DATA SYSTEM= spect
##.PULSE SEQUENCE= noesygpps1d.comp
##.SOLVENT NAME= COFFEE_meoh
##.SHIFT REFERENCE= INTERNAL, COFFEE_meoh, 1, 14.96791
##AUDIT TRAIL= $$ (NUMBER, WHEN, WHO, WHERE, PROCESS, VERSION, WHAT)
$$ ##TITLE= Audit trail, TOPSPIN		Version 2.1
$$ ##JCAMPDX= 5.01
$$ ##ORIGIN= Bruker BioSpin GmbH
$$ ##OWNER= Administrator
$$ $$ C:\Bruker\TOPSPIN/data/COFFEE/nmr/AC1116_Cauca1_5835603_bxzCjDc94Z/12/pdata/1/auditp.txt
$$ ##AUDIT TRAIL=  $$ (NUMBER, WHEN, WHO, WHERE, PROCESS, VERSION, WHAT)
(   1,<2012-03-27 23:00:06.375 -0500>,<Administrator>,<TOPSPIN>,<go>,<TOPSPIN 2.1>,
      <created by zg
	started at 2012-03-27 22:48:34.640 -0500,
	POWCHK enabled, PULCHK disabled,
       configuration hash MD5:
       1A 1E CE 29 27 FD 77 03 67 4E F0 E3 C4 B2 CB 90
       data hash MD5: 64K
       16 D8 34 79 BD E2 DF 48 98 59 D8 FF D0 50 8D 1D>)
(   2,<2012-03-27 23:00:11.437 -0500>,<Administrator>,<TOPSPIN>,<proc1d>,<TOPSPIN 2.1>,
      <Start of raw data processing
       efp LB = 0.3 FT_mod = 6 PKNL = 1 PHC0 = 0 PHC1 = 0 SI = 128K 
       data hash MD5: 128K
       B0 37 FA 70 36 37 7F 24 FE 57 0E 00 F5 D8 19 69>)
(   3,<2012-03-27 23:00:12.765 -0500>,<Administrator>,<TOPSPIN>,<proc1d>,<TOPSPIN 2.1>,
      <pk PHC0 = 37.86438 PHC1 = 0 
       data hash MD5: 128K
       3F 46 13 EF 17 F0 C4 CA D8 24 12 96 8F C3 D1 36>)
(   4,<2012-03-27 23:00:13.593 -0500>,<Administrator>,<TOPSPIN>,<proc1d>,<TOPSPIN 2.1>,
      <abs ABSG = 1 
       data hash MD5: 128K
       22 7B 68 9F F0 BF DA 35 D8 48 70 97 14 58 D3 35>)
(   5,<2012-03-27 23:00:13.671 -0500>,<Administrator>,<TOPSPIN>,<proc1d>,<TOPSPIN 2.1>,
      <abs ABSG = 2 
       data hash MD5: 128K
       40 1F 14 09 AE 59 DF 80 4C 0E 63 8D 61 EF AC F9>)
(   6,<2012-03-27 23:00:13.734 -0500>,<Administrator>,<TOPSPIN>,<proc1d>,<TOPSPIN 2.1>,
      <abs ABSG = 3 
       data hash MD5: 128K
       49 9B 5F 8A 62 CC BD 18 B4 C8 D9 EF BD 1B 74 E9>)
(   7,<2012-03-27 23:00:13.796 -0500>,<Administrator>,<TOPSPIN>,<proc1d>,<TOPSPIN 2.1>,
      <abs ABSG = 4 
       data hash MD5: 128K
       A3 E5 16 39 9E 03 0E 23 5C 53 34 26 BF DF 1C B9>)
(   8,<2012-03-27 23:00:13.843 -0500>,<Administrator>,<TOPSPIN>,<proc1d>,<TOPSPIN 2.1>,
      <abs ABSG = 5 
       data hash MD5: 128K
       0B 9A EC 49 09 A2 F6 58 1F 3C A3 D0 FC 3D 15 2F>)
(   9,<2012-03-27 23:00:14.500 -0500>,<Administrator>,<TOPSPIN>,<audit>,<TOPSPIN 2.1>,
      <user comment:
       ICON-NMR User ID: COFFEE
       data hash MD5: 128K
$$ [...]
##$TP07= 0
##$TPNAME0= <>
##$TPNAME1= <>
##$TPNAME2= <>
##$TPNAME3= <>
##$TPNAME4= <>
##$TPNAME5= <>
##$TPNAME6= <>
##$TPNAME7= <>
##$TPOAL= (0..7)
0.5 0.5 0.5 0.5 0.5 0.5 0.5 0.5
##$TPOFFS= (0..7)
0 0 0 0 0 0 0 0
##$TUNHIN= 0
##$TUNHOUT= 0
##$TUNXOUT= 0
##$USERA1= <user>
##$USERA2= <user>
##$USERA3= <user>
##$USERA4= <user>
##$USERA5= <user>
##$V9= 5
##$VALIST= <valist>
##$VCLIST= <CCCCCCCCCCCCCCC>
##$VD= 0
##$VDLIST= <DDDDDDDDDDDDDDD>
##$VPLIST= <PPPPPPPPPPPPPPP>
##$VTLIST= <TTTTTTTTTTTTTTT>
##$WBST= 2048
##$WBSW= 25
##$XGAIN= (0..3)
0 0 0 0
##$XL= 0
##$YL= 0
##$YMAX_a= 12493828
##$YMIN_a= -5333137
##$ZGOPTNS= <>
##$ZL1= 120
##$ZL2= 120
##$ZL3= 120
##$ZL4= 120
##$ABSF1= 14.96791
##$ABSF2= -5.58462
##$ABSG= 5
##$ABSL= 3
##$ALPHA= 0
##$AQORDER= 0
##$ASSFAC= 0
##$ASSFACI= 0
##$ASSFACX= 0
##$ASSWID= 0
##$AUNMP= <proc_prof1d_extract.lims>
##$AXLEFT= 0
##$AXNAME= <>
##$AXNUC= <1H>
##$AXRIGHT= 0
##$AXTYPE= 0
##$AXUNIT= <>
##$AZFE= 0.1
##$AZFW= 0.1
##$BCFW= 0
##$BC_mod= 0
##$BYTORDP= 0
##$COROFFS= 0
##$CY= 15
##$DATMOD= 1
##$DC= 0
##$DFILT= <>
##$DTYPP= 0
##$F1P= 0
##$F2P= 0
##$FCOR= 0.5
##$FTSIZE= 131072
##$FT_mod= 6
##$GAMMA= 0
##$GB= 0
##$INTBC= 1
##$INTSCL= 1
##$ISEN= 128
##$LB= 0.3
##$LEV0= 0
##$LPBIN= 0
##$MAXI= 10000
##$MC2= 0
##$MEAN= 0
##$ME_mod= 0
##$MI= 0
##$NCOEF= 0
##$NC_proc= -3
##$NLEV= 6
##$NOISF1= 0
##$NOISF2= 0
##$NSP= 0
##$NTH_PI= 0
##$NZP= 0
##$OFFSET= 14.96791
##$PC= 1
##$PHC0= 37.86438
##$PHC1= 0
##$PH_mod= 1
##$PKNL= yes
##$PPARMOD= 0
##$PPDIAG= 0
##$PPIPTYP= 0
##$PPMPNUM= 2147483647
##$PPRESOL= 1
##$PSCAL= 4
##$PSIGN= 0
##$PYNMP= <proc.py>
##$REVERSE= no
##$SF= 400.130005083181
##$SI= 131072
##$SIGF1= 0
##$SIGF2= 0
##$SINO= 400
##$SIOLD= 131072
##$SPECTYP= <>
##$SREGLST= <1H.CDCl3>
##$SSB= 0
##$STSI= 131072
##$STSR= 0
##$SW_p= 8223.68421052632
##$SYMM= 0
##$S_DEV= 0
##$TDeff= 65536
##$TDoff= 0
##$TI= <>
##$TILT= no
##$TM1= 0
##$TM2= 0
##$TOPLEV= 0
##$USERP1= <user>
##$USERP2= <user>
##$USERP3= <user>
##$USERP4= <user>
##$USERP5= <user>
##$WDW= 1
##$XDIM= 131072
##$YMAX_p= 463348768
##$YMIN_p= -246235956
##$CURPLOT= <Network HP LaserJet P1505>
##$CURPRIN= <$Network HP LaserJet P1505>
##$DFORMAT= <normdp>
##$LAYOUT= <+/1D_H.xwp>
##$LFORMAT= <normlp>
##$PFORMAT= <normpl>
##$SURQMSG= 1
$$ End of Bruker specific parameters
$$ ---------------------------------
##NTUPLES= NMR SPECTRUM
##VAR_NAME=  FREQUENCY,     SPECTRUM/REAL,   SPECTRUM/IMAG
##SYMBOL=    X,             R,               I
##VAR_TYPE=  INDEPENDENT,   DEPENDENT,       DEPENDENT
##VAR_FORM=  AFFN,          ASDF,            ASDF
##VAR_DIM=   131072,        131072,          131072
##UNITS=     HZ,            ARBITRARY UNITS, ARBITRARY UNITS
##FACTOR=    0.0627417313425165, 1,          1
##FIRST=     8223.62146879498, -418,         -85788
##LAST=      0,             1068,            -87468
##MIN=       0,             -246235956,      0
##MAX=       8223.62146879498, 463348768,    0
$$ Real data points
##PAGE= N=1
##DATA TABLE= (X++(R..R)), XYDATA
$$ [...]
64028 514718 526381 537752 548506 558198 565599 569280 568953 565557 560046 552885 544781 536947 530249 524561
64014 524561 519205 513441 506478 497874 488373 479707 473042 468027 463689 459711 456363 453698 451539 450071
64000 450071 449831 451027 453279 456122 459572 464089 469975 476827 483712 490106 496669 504829 515525 528463
63986 528463 542453 556227 569102 581395 594243 608635 624511 641143 658187 675646 692747
63975 692747 707806 719813 729599 738811 748132 757022 764823 771295 776222 779410 781468 784119 789191 797271
63961 797271 807512 818751 830706 843975 858963 875100 891457 907959 925376 943937 962550
63950 962550 979962 996349 1013079 1030894 1048899 1065585 1080480 1094561 1109309 1125654 1143752
63939 1143752 1163458 1184840 1208246 1233940 1261823 1291637 1323527 1358411 1397758 1442795 1493698
63928 1493698 1549444 1608657 1670729 1736126 1805682 1879902 1959034 2043558 2134273 2232013 2337332
63917 2337332 2450201 2569896 2695700 2828245 2969896 3123164 3288930 3466930 3657933
63908 3657933 3864584 4089967 4336350 4605884 4901568 5226612 5583648 5975941 6409065
63899 6409065 6889980 7424223 8015192 8666383 9382570 10167317 11019723 11934453 12904328
63890 12904328 13921831 14978552 16064558 17168414 18276422 19370999 20430167 21429193
63882 21429193 22343082 23148780 23827234 24364915 24753340 24986778 25060686 24972339 24722031 24313018
63872 24313018 23751302 23047038 22216485 21281698 20267418 19197450 18092693 16970933 15847703
63863 15847703 14737515 13654603 12612227 11621077 10688349 9818324 9013493 8274916 7601785
63854 7601785 6991290 6439436 5942214 5495940 5096555 4739105 4418418 4130244 3871321
63845 3871321 3638463 3428182 3237274 3063171 2903553 2756324 2620330 2495309 2380461
63836 2380461 2273585 2172275 2075467 1983103 1894863 1810309 1729852 1654292 1583287 1515358 1449610
63825 1449610 1386452 1326370 1269122 1214664 1163780 1116912 1073108 1031092 990851 953225 918329
63814 918329 885393 854060 824791 797806 772538 748495 725981 705395 686262 667608 649280
63803 649280 632397 618320 607282 598186 589728 581640 574643 569182 564512 559422 553729 548632 545416
63790 545416 544211 544164 544392 544325 543438 541281 537830 533304 527622 520617 512892 505675 499235 492011 482159 469745
63774 469745 456647 444363 432804 421215 409235 396703 383433 369930 357539 347034 337600 328079
63762 328079 318720 310617 303728 296760 289103 281672 275432 270167 265309 261030 257575 254088 249246 243016
63748 243016 236974 232657 230143 228423 226702 225002 223722 222949 222209 220694 217755 213404 208554 204608 202504
63733 202504 202009 202199 202659 203799 205728 207348 207334 205894 204722 204981 206052 206747 207066 207872 209029 208920 206348
63716 206348 202333 199245 198255 198281 197637 195926 193751 191211 187865 184103 181382 180603 181157 182081 183225 184487
63700 184487 184905 183825 182422 182570 184271 185626 185526 185060 185815 187909 190293 192000 192452 191505 190036 189814
63684 189814 191882 195441 198927 201604 203440 204128 203453 202478 203348 207549 214774 223410 231687 238474 243641
63669 243641 247889 251951 255881 259344 262507 266221 271249 277463 283866 289259 292931 294792 294982 293586
63655 293586 290953 287974 285492 283500 281541 279801 278943 278686 277578 274765 271249 268760 268019 268733 270510
63640 270510 272839 274721 275334 274842 273685 271485 267705 263177 259713 257964 256664 254364 251146 248198 246283
63625 246283 245209 244554 244442 245457 247779 250592 252833 254661 257576 262609 269051 275624 282248 289541 297007
63610 297007 303142 307451 311094 315170 319390 322945 325738 327986 329215 328401 324936 319202 312470 306356
63596 306356 301815 298396 294918 291080 287801 285783 284570 283537 283049 283776 285256 286122 285772 285098 285319 286690
63580 286690 288822 291913 297020 304798 314318 323684 331881 339535 347702 356589 365946 376034 387338 399702
63566 399702 412788 427187 443973 463050 483082 503364 524741 548305 574228 602407 633077
63555 633077 665815 698876 730838 762520 795994 831664 867262 899791 927579 950192 967176
63544 967176 977741 981717 980488 976626 972425 968726 965222 961581 957647 952633 945071 934128 920397
63531 920397 904860 887556 867951 846144 822836 798369 772794 746953 722588 700935 681802
63520 681802 664450 648924 635950 625683 617229 609617 602904 597860 594668 592495 590596 589399 590085
63507 590085 593437 599550 608220 618755 629792 640409 651474 664748 680582 697780 716080 737182
63495 737182 762360 790473 819648 849840 882110 916217 950610 984306 1016810 1046358 1070281
63484 1070281 1087553 1099411 1107010 1110176 1109219 1106346 1103979 1102607 1101286 1099280 1096049 1090471 1081490 1069121
63470 1069121 1053634 1034075 1009029 978908 946223 913136 879587 844270 806811 768488 731267
63459 731267 696635 665043 635932 608309 581685 556616 534260 515293 499190 484495 469861
63448 469861 454978 440572 427551 416217 406328 397722 390609 385163 380989 377201 373184 369209 366167
63435 366167 364662 364568 365511 367436 370408 374255 378908 384901 392798 401980 410708 417773 423703 429990 437549
63420 437549 446320 455892 465784 475240 483444 490088 495277 498713 499488 497054 492159 486294 480198 473314
63406 473314 464985 455805 447279 440232 434239 428955 425270 424349 425784 427668 428679 429301 430737 433387 437018
63391 437018 441810 448398 456952 466798 476942 486657 495707 504487 513843 524386 535997 548257 561239
63378 561239 575489 591368 608856 627930 648748 671389 695788 722019 750429 781502 815702
63367 815702 853249 893713 936093 979787 1025384 1073922 1125305 1177897 1229634 1278889 1324101
63356 1324101 1363324 1394792 1417794 1432775 1440772 1442950 1440380 1433930 1424403 1412743 1399799 1385789
63344 1385789 1370309 1352956 1333594 1311852 1286884 1257964 1224974 1188117 1147764 1105145 1062646
63333 1062646 1022499 985077 949101 913661 879624 848950 822986 801635 783921 769097 757180
63322 757180 748427 742533 738725 736709 736988 739897 744917 751569 760564 773125 789232 807497 826943
63309 826943 848094 872001 898972 928816 961720 998154 1038056 1080541 1124283 1168029 1211054
63298 1211054 1253378 1295090 1335108 1370999 1400418 1422384 1436880 1443938 1443902 1438088 1428212 1415251
63286 1415251 1399580 1382005 1363669 1344835 1324673 1302461 1278148 1251482 1221543 1187822 1151182
63275 1151182 1113107 1074425 1035330 996364 958710 923551 891408 861881 833807 806149 779159
63264 779159 754403 733159 715025 698370 681744 664479 646551 628688 612276 598273 586285
63253 586285 575392 565621 557690 551450 545799 540377 536233 534183 533455 532742 531980 532214 533986 536544 538477
63238 538477 538624 536609 533014 528915 524871 520584 515882 511470 508124 505593 503155 500956 499756 499326 498203
63223 498203 495463 492083 490065 490710 493999 498945 503976 507474 508708 508344 507800 508256 510319 514054 518845
63208 518845 523654 528032 532809 539259 547629 556837 565546 573138 579809 586232 593093 600481 607631 613704
63194 613704 618988 625011 633319 644294 657142 670724 684453 698737 714610 732605 752004 771679
63182 771679 791678 813286 837317 863060 889483 916892 946578 979096 1013734 1049624 1086477
63171 1086477 1123970 1161201 1197422 1232885 1268384 1304071 1339286 1373514 1407075 1440685 1474630
63160 1474630 1508543 1541784 1573875 1604682 1634306 1662636 1688841 1711322 1728338 1738750 1742148
63149 1742148 1738450 1727639 1709897 1685687 1655561 1620086 1580206 1537535 1494083 1451651 1411516
63138 1411516 1374408 1340376 1308695 1278499 1249968 1224776 1204938 1191073 1181985 1176078 1172921 1173189
63126 1173189 1177269 1184502 1194055 1206008 1220895 1238225 1256254 1273614 1290602 1308341 1327049 1345848
63114 1345848 1364062 1381808 1399165 1415582 1430602 1444609 1458118 1470524 1480119 1485425 1486147 1482757
63102 1482757 1475568 1464473 1449319 1430080 1406597 1378590 1346447 1311876 1277155 1243435 1210268
63091 1210268 1177173 1145099 1115664 1089393 1065664 1044192 1025367 1008980 993822 979149 965647
63080 965647 954227 944664 936241 929080 923824 920387 917905 915774 913942 912407 911148 910411 910340 910597 910975
63065 910975 912071 914449 917444 919789 921291 922824 924783 926714 928562 931014 934244 937488 940333 943358
63051 943358 946934 950380 953033 955234 957475 959449 960863 962496 965447 969734 974524 979320 984161 989145
63037 989145 994599 1001287 1009473 1018173 1026371 1034647 1044431 1055780 1067179 1077701 1088105 1099307 1110788
63024 1110788 1121281 1130444 1139220 1148963 1160683 1174748 1190736 1207698 1224913 1242385 1260568 1279916
63012 1279916 1300871 1323856 1348906 1375449 1402734 1430430 1458775 1488436 1520349 1555335 1593477
63001 1593477 1634030 1676299 1720584 1767998 1819252 1873891 1930890 1989952 2051927 2117765 2187132
62990 2187132 2258378 2329942 2401594 2474177 2548393 2624011 2699947 2774796 2847515 2918065 2987295
62979 2987295 3055900 3123610 3189770 3254512 3318712 3382649 3445133 3504046 3557371 3603566 3641384
62968 3641384 3669569 3686493 3690019 3678094 3649767 3605612 3547398 3477861 3400649 3319444 3236317
62957 3236317 3151278 3064135 2976694 2892530 2814610 2743603 2678613 2619033 2565312 2518307 2478434
62946 2478434 2445671 2420114 2402209 2392244 2389667 2393108 2401222 2413330 2429062 2447556 2467551 2488461
62934 2488461 2510849 2535287 2560857 2585402 2607369 2626902 2644922 2661680 2676640 2689104 2698090
62923 2698090 2701808 2698197 2686287 2666501 2639488 2605206 2563170 2512934 2454125 2386958 2313283 2236518
62911 2236518 2159806 2084429 2010267 1937200 1865535 1795672 1728230 1664246 1604546 1549027 1497162
62900 1497162 1448948 1404703 1364167 1326511 1291192 1258207 1227616 1199327 1173112 1148183 1123132
62889 1123132 1097219 1071710 1049089 1030809 1016390 1004517 994110 984309 974444 964380 954288 944036
62877 944036 933539 923587 915206 907997 900296 891369 882307 874088 865876 856277 845534 835448 827452
62864 827452 821565 816936 812598 807896 802789 797637 792370 786276 779116 772012 766634 763745 762959 763425 764172
62849 764172 764269 763477 762558 762347 762839 763767 765479 768256 771190 773052 774274 776719 781050 785591 788626 790855
62833 790855 794365 799506 804075 805899 805304 804397 804384 804369 802760 799174 794569 789971 785579 780976 775696 769542
62817 769542 762772 756140 750540 746449 743786 742080 740509 738085 734449 730350 726665 722951 717795 710832
62803 710832 703584 697880 694082 691291 688665 685903 682985 680061 677325 674541 671076 666794 662522 659190
62789 659190 656971 655613 654976 654650 653764 651987 650233 649617 650212 651686 654536 659365 665146 669607 671584
62774 671584 672021 672415 673301 674642 676725 679898 683910 688225 692765 697913 703866 710281 716531 722234 727565
62759 727565 733053 739019 745383 752055 759155 766584 773783 780454 787255 795229 804685 815085 825812 836565
62745 836565 847308 858581 871740 888021 907141 927383 947413 967717 990192 1016518 1046819
62734 1046819 1079632 1113291 1147670 1184378 1225067 1270081 1319198 1373068 1432945 1499158 1570610
62723 1570610 1645751 1723568 1804094 1888733 1979693 2078047 2182479 2290742 2402050 2516981
62713 2516981 2635338 2755351 2874879 2991968 3104009 3207614 3299632 3377164 3436661 3474719
62703 3474719 3490446 3485689 3462223 3420084 3359507 3282980 3194039 3094961 2987026 2872285 2753655
62692 2753655 2633550 2513598 2395447 2280684 2169944 2063054 1960282 1862867 1772210 1688857
62682 1688857 1612200 1540984 1474320 1412398 1355861 1304447 1256958 1212742 1172247 1135586 1101691
62671 1101691 1069824 1041023 1016785 996789 979171 962873 948518 936955 927990 920846 915120 911014
62659 911014 909096 910018 914063 920790 929227 938450 948082 958648 971447 987428 1006035 1025961 1047312
62646 1047312 1071955 1101087 1133625 1168002 1204498 1244358 1287521 1333058 1381551 1435106 1494749
62635 1494749 1559278 1626998 1697226 1769603 1843173 1916786 1989432 2059486 2124287 2181040 2227673
62624 2227673 2262786 2285681 2296800 2297156 2286713 2264021 2228036 2179747 2121600 2056023 1985158 1911345
62612 1911345 1836827 1762903 1689734 1616944 1544391 1472735 1403465 1337938 1276290 1217748 1162146
62601 1162146 1110466 1063622 1021349 982704 947048 914099 883563 855227 828952 804195 780104
62590 780104 756663 735107 716509 700400 685560 671719 659604 649492 640619 632046 623396 614745
62578 614745 606480 599258 593386 588125 582348 576020 570231 565555 561336 557158 554013 552904 552865 551754 549094
62563 549094 546894 547241 550048 553764 557366 560767 563993 567156 570981 576167 582314 588642 595948 606549
62549 606549 621798 640642 661162 682496 704558 726970 749514 773005 798612 826671 857045
62538 857045 890138 926582 966515 1010177 1058482 1111509 1167002 1222340 1277972 1336978 1400767
62527 1400767 1466788 1530833 1589796 1641532 1684151 1717112 1741761 1759130 1767932 1766015 1752998 1730173
62515 1730173 1698589 1658924 1612802 1562558 1509549 1454011 1396711 1339570 1284364 1231753 1181756
62504 1181756 1134295 1089012 1045519 1004334 966961 934522 906549 881260 856821 832439 808784
62493 808784 787409 769336 754127 740568 728005 716468 705738 695066 683884 672177 660159
62482 660159 648236 637350 628652 622542 618445 615576 613406 611405 609077 606574 604752 604324 605336 607565
62468 607565 610985 615738 622158 630955 642735 657096 672726 688603 704703 721526 739655 759983
62456 759983 783431 809819 837576 865306 893316 923108 955738 991205 1029032 1068616 1108939
62445 1108939 1148440 1185380 1218315 1246423 1269522 1287558 1299946 1305771 1304680 1297089 1283360 1263524
62433 1263524 1238242 1209241 1178062 1145001 1110119 1074610 1040022 1006530 973401 941135 911677
62422 911677 886062 863165 841496 821187 803265 787834 774217 762421 753184 746490 741127 736029
62410 736029 731262 727197 723319 718525 712444 706045 700952 698337 698397 700556 703972 707843 711423 714105 715866
62395 715866 717519 720112 723989 728829 734711 742494 752516 763275 772305 778641 783850 790333 799062 809301
62381 809301 819904 830041 838772 844784 846987 845087 839453 830727 819678 807003 793112 778389 763705
62368 763705 750035 737233 723937 709402 694934 682537 672360 662590 652101 642046 634126 628180
62356 628180 622608 616889 612481 610913 611784 613255 614134 614840 616344 618833 621901 625840 631965 641167 652401
62341 652401 663255 672216 680006 688526 698862 710567 722469 733732 744310 754800 765832 777331
62329 777331 788475 798500 807283 814876 821028 825821 830361 835882 842177 847824 852188 856408 862066 869588
62315 869588 878330 887530 896780 906342 917693 933093 953744 978721 1006450 1036854 1071186 1110173
62303 1110173 1153463 1200933 1253411 1311745 1375897 1445199 1518646 1594423 1669860 1742595 1811530
62292 1811530 1876283 1935955 1988832 2033034 2067102 2090292 2102826 2105889 2100979 2089010 2069903 2042920
62280 2042920 2007582 1964597 1915827 1862942 1806292 1745811 1683107 1621646 1564205 1510701 1459252
62269 1459252 1409026 1361239 1317437 1277449 1239245 1200558 1160728 1121267 1084481 1051341 1020894
62258 1020894 991964 964879 940946 920635 903081 887288 873048 860615 850244 842270 837092 834744
62246 834744 834839 836967 840615 844578 847261 848180 848749 850953 855386 860949 866244 870646 874024 876165 877028
62231 877028 877446 879008 882884 888745 894999 900101 903564 905886 907998 911032 916145 923941 934047 945592
62217 945592 958100 971567 985867 1000657 1015951 1032266 1050045 1069432 1090839 1115140 1142864
62206 1142864 1173549 1206427 1241476 1279407 1320817 1365992 1415512 1470390 1531172 1597102 1666434
62195 1666434 1737424 1808775 1879159 1946724 2009353 2065306 2113251 2151656 2178640 2192911 2194820
62184 2194820 2186115 2168557 2142862 2108818 2066071 2014893 1956709 1893980 1829188 1763767 1698317
62173 1698317 1633840 1572122 1514588 1461344 1411903 1366406 1325474 1289086 1256458 1227088 1201206
62162 1201206 1178938 1159781 1143518 1131123 1123710 1120459 1118513 1115624 1112379 1111026 1112350 1114776 1116688
62149 1116688 1118468 1121501 1126205 1132202 1139838 1149959 1162083 1174176 1184672 1193819 1202653 1211710 1221266
62136 1221266 1231833 1243589 1256069 1269145 1283610 1300004 1317666 1335829 1354893 1375437 1396656
62125 1396656 1417288 1437868 1460482 1486012 1512784 1538351 1561761 1583849 1606244 1630377 1656665
62114 1656665 1684290 1712366 1741553 1774005 1811799 1856025 1906895 1963323 2022323 2080504 2136831
62103 2136831 2192777 2249084 2303598 2353043 2395726 2431491 2460201 2481644 2496195 2504281 2505672 2500375
62091 2500375 2489557 2474361 2454390 2428813 2398597 2366230 2333439 2300606 2268304 2237900 2210468
62080 2210468 2186479 2166685 2151831 2141132 2132481 2124749 2118634 2114722 2112082 2109704 2108023 2107973 2109502
62067 2109502 2112190 2116524 2123323 2132410 2143033 2155254 2169849 2187109 2206676 2228303 2251743 2276132
62055 2276132 2300591 2325541 2352529 2382681 2416087 2452626 2492329 2534658 2578412 2622847 2668266
62044 2668266 2714995 2762156 2807799 2849995 2887915 2922591 2956925 2994150 3035472 3079345 3123246
62033 3123246 3165779 3206772 3246048 3283109 3318053 3352070 3386642 3422588 3460189 3499995 3543001
62022 3543001 3589754 3639570 3691166 3744211 3799871 3859442 3922704 3988007 4053758 4119301 4184503
62011 4184503 4249316 4314080 4379750 4447425 4517794 4591038 4666677 4743257 4818707 4891544 4961403
62000 4961403 5027951 5089628 5144149 5190151 5227827 5258061 5281691 5299807 5313938 5325030 5332283
61989 5332283 5333605 5327597 5314946 5297723 5277690 5255780 5232984 5210796 5190157 5170468 5150548 5130505
61977 5130505 5111829 5095479 5080707 5066215 5051818 5038352 5026411 5015901 5006515 4997874 4989213 4979652
61965 4979652 4969007 4957923 4947125 4936863 4927042 4917463 4907833 4897973 4888116 4878679 4869752 4861205 4853245
61952 4853245 4846237 4839825 4832892 4824839 4816434 4808902 4802511 4796556 4790500 4784558 4779188 4774449 4769891 4764933
61938 4764933 4759387 4753738 4748512 4743111 4735747 4725073 4711577 4696542 4679936 4660312 4636901 4610556
61926 4610556 4582056 4550556 4514914 4476025 4436542 4398243 4360781 4323369 4286611 4251802 4218925
61915 4218925 4186359 4152600 4117652 4082581 4048280 4015118 3983492 3954029 3927021 3901886 3877487
61904 3877487 3852973 3828261 3803875 3780586 3759039 3739200 3720007 3700045 3679007 3658246 3639396
61893 3639396 3622660 3606977 3591820 3578089 3566965 3558458 3551579 3545689 3541184 3538981 3539703 3543420 3549856
61880 3549856 3558653 3569449 3581810 3595332 3610120 3627185 3647992 3673396 3703126 3736302 3772229
61869 3772229 3810706 3852055 3897148 3947122 4002797 4064518 4132550 4207217 4288612 4376841 4472858
61858 4472858 4578419 4694772 4822201 4961461 5114801 5284355 5470100 5670908 5887732
61849 5887732 6124462 6385457 6673503 6990637 7339585 7723184 8143026 8599802 9094827
61840 9094827 9630366 10208118 10827471 11484932 12174618 12888693 13616401 14341586 15040946
61831 15040946 15685447 16244190 16687717 16990011 17131534 17103701 16911173 16569426 16100117
61822 16100117 15528028 14879373 14179439 13450355 12711057 11978268 11265725 10582313 9932337
61813 9932337 9318092 8741491 8203495 7703639 7240940 6814475 6422669 6063035 5733240
61804 5733240 5431644 5156326 4904616 4674438 4465281 4276775 4106855 3952479 3811828
61795 3811828 3684588 3570027 3465984 3370328 3282702 3204173 3135325 3075020 3020908 2970967 2924530
61784 2924530 2881871 2842888 2806631 2772453 2741199 2714393 2692089 2672228 2652592 2633054 2615464
61773 2615464 2601611 2591880 2585803 2583183 2584210 2588755 2596022 2605037 2615317 2627013 2640459 2655668 2672266
61760 2672266 2689976 2709022 2729826 2752222 2775400 2799130 2824858 2854956 2890682 2931347 2975712
61749 2975712 3023597 3075718 3132629 3194658 3262619 3337558 3419699 3508370 3603178 3704504 3812582
61738 3812582 3927055 4048159 4177708 4317982 4469876 4633041 4807683 4995162 5196501
61729 5196501 5411254 5638730 5880017 6138122 6416163 6716062 7039115 7387199 7763024
61720 7763024 8169618 8610252 9088917 9610306 10178957 10798553 11472277 12203618 12996546
61711 12996546 13855024 14782593 15782069 16854570 17997866 19205318 20466072 21765193
61703 21765193 23081856 24385902 25635636 26779642 27762502 28531802 29044043 29269201 29194589
61694 29194589 28827380 28193787 27334053 26295194 25124795 23867524 22563526 21247199
61686 21247199 19945941 18679706 17461987 16301801 15205411 14176925 13218078 12328249
61678 12328249 11505164 10745806 10046937 9405206 8817169 8279241 7787594 7338181 6927020
61669 6927020 6550520 6205689 5890169 5601969 5338780 5097568 4875198 4669586 4479806
61660 4479806 4304888 4142960 3991939 3850562 3718268 3594355 3477890 3368372 3265890
61651 3265890 3170509 3081764 2998798 2920894 2847959 2780480 2718575 2660945 2605439 2551078 2498825
61640 2498825 2449740 2403141 2357651 2313396 2271708 2232889 2195731 2159450 2124497 2091005 2057833
61629 2057833 2024071 1990449 1958265 1927724 1898118 1868933 1839903 1810761 1781975 1755077 1731023
61618 1731023 1708633 1685957 1663094 1642398 1625664 1612123 1599577 1586603 1573082 1559202 1544771
61607 1544771 1529506 1513624 1497870 1482807 1468113 1452895 1436921 1421106 1406394 1392662 1379442
61596 1379442 1367388 1358038 1351965 1347943 1344279 1340425 1336954 1334411 1332685 1331366 1330429 1330442 1331960 1334628
61582 1334628 1337180 1338772 1340028 1342066 1344590 1345827 1344701 1342305 1340718 1340906 1342392 1344410 1346434 1347712
61568 1347712 1347314 1345149 1342300 1339798 1337463 1334519 1331080 1328124 1325791 1322629 1317239 1310193 1303415 1297803
61554 1297803 1292455 1286345 1279689 1273059 1266119 1258267 1249947 1242202 1235068 1227718 1220365 1214833 1212517 1212550
61540 1212550 1212866 1212544 1212178 1212133 1211605 1209830 1207430 1205780 1205387 1205707 1206669 1209537 1215746 1225166 1236051 1246608
61524 1246608 1256241 1265536 1275684 1287995 1303334 1321572 1341820 1363360 1386272 1411167 1438630 1468766
61512 1468766 1500815 1533346 1565649 1599003 1635679 1676255 1718741 1760710 1801438 1841493 1881479
61501 1881479 1922273 1965366 2011229 2057681 2101474 2141584 2179598 2216859 2252839 2286754 2319208
61490 2319208 2351086 2381724 2409279 2432485 2451342 2466452 2478373 2487310 2492848 2494265 2491685 2486625
61478 2486625 2480795 2474488 2466752 2457155 2446858 2437795 2431039 2426234 2422487 2419776 2419442 2423385 2432822 2447763
61464 2447763 2467329 2490418 2516510 2546454 2582263 2625543 2676178 2733176 2796734 2868690 2950790
61453 2950790 3043395 3146240 3259668 3384406 3520637 3668143 3827333 3999697 4187149 4391083
61443 4391083 4611781 4848442 5099812 5364734 5641772 5928185 6219503 6509950 6792576
61434 6792576 7058818 7298839 7503259 7664845 7778891 7842985 7857145 7823797 7747026 7631973
61424 7631973 7485154 7314609 7128616 6933911 6735270 6536514 6341456 6153924 5977164
61415 5977164 5813103 5662056 5523536 5397778 5286254 5190435 5110463 5045533 4995261 4960004
61405 4960004 4939826 4933587 4939236 4954983 4980353 5016104 5062740 5119116 5183068 5253375 5330044 5412226
61393 5412226 5497142 5582232 5667423 5753679 5839828 5922739 6000883 6075917 6149961 6222702 6292297
61382 6292297 6358095 6421046 6481795 6539668 6593628 6643246 6688437 6728881 6764088 6793768 6817924
61371 6817924 6836886 6851330 6861982 6869049 6872119 6870721 6864819 6854619 6840217 6821716 6799567 6774432
61359 6774432 6746897 6717716 6688203 6659686 6632371 6605470 6578854 6553936 6532160 6513092 6494874
61348 6494874 6476212 6456892 6436582 6414477 6390317 6364534 6336996 6306949 6274956 6243725 6216009
61337 6216009 6192690 6174006 6161632 6157925 6163715 6178678 6203890 6242468 6297370 6369817 6460210 6569366
61325 6569366 6698279 6847618 7018041 7210215 7424043 7658572 7913100 8187485 8480539
61316 8480539 8788361 9104568 9421639 9731625 10026156 10296478 10533609 10728826 10874992
61307 10874992 10968184 11007854 10995457 10933551 10826171 10678654 10496019 10281829 10039148 9772030
61297 9772030 9485549 9185132 8876471 8565229 8255672 7950018 7650004 7358620 7079247
61288 7079247 6813601 6561893 6324878 6104322 5901310 5715509 5546564 5394953 5260662
61279 5260662 5142181 5038087 4949051 4877038 4822486 4783249 4756470 4740699 4735797 4741549 4757257
61268 4757257 4782542 4817497 4861410 4911798 4965625 5021588 5080472 5142982 5207903 5272814 5335843
61257 5335843 5395872 5451725 5502463 5548342 5590244 5627920 5659853 5685158 5704539 5718818 5727567
61246 5727567 5729951 5726074 5716481 5700921 5678669 5649761 5614895 5574268 5527487 5474804 5417713 5358121
61234 5358121 5297297 5235508 5172154 5106458 5038808 4971513 4907583 4848473 4793295 4740081 4687379
61223 4687379 4634961 4583900 4536037 4492572 4452876 4415202 4378525 4343109 4309443 4277587 4247476
61212 4247476 4218639 4189434 4157947 4124378 4091433 4061655 4035518 4013005 3995649 3985391 3982126
61201 3982126 3984098 3990477 4002175 4020293 4045292 4077956 4119853 4172197 4234983 4307568 4389566 4481057
61189 4481057 4582473 4694249 4815847 4945013 5078401 5212598 5343835 5467183 5577169
61180 5577169 5668934 5737615 5777039 5781088 5747210 5677593 5576785 5449543 5301196 5137921 4965090
61169 4965090 4786312 4604983 4425448 4251244 4083238 3921116 3766122 3620901 3487055
61160 3487055 3364247 3251452 3147771 3052153 2963708 2882542 2809347 2744017 2685359 2632146 2583790
61149 2583790 2540297 2502473 2471918 2449623 2434451 2423959 2416807 2413545 2415031 2421205 2431593 2445766
61137 2445766 2462604 2479919 2495583 2508689 2519245 2527181 2532113 2533698 2531830 2526682 2518779 2508737
61125 2508737 2496694 2482152 2464514 2443648 2419995 2394390 2367672 2340162 2311672 2282311 2252947
61114 2252947 2224379 2196410 2168456 2140763 2114021 2087834 2060737 2032019 2002555 1973414 1944500
61103 1944500 1915115 1885061 1854434 1823003 1790681 1758301 1727074 1697360 1668685 1640977 1614992
61092 1614992 1591145 1568348 1544500 1518118 1489241 1458774 1427483 1395929 1364982 1335569 1307713
61081 1307713 1280510 1253483 1227408 1203318 1181280 1160854 1142315 1126434 1113278 1102227 1093210
61070 1093210 1086962 1083779 1082850 1083191 1084587 1087240 1091095 1095995 1102081 1109520 1118070 1127253 1136941 1147529
61056 1147529 1159490 1172653 1185859 1197705 1207918 1217700 1228327 1239737 1250997 1261645 1271806
61045 1271806 1281316 1289690 1296771 1302420 1305707 1305560 1302363 1297909 1293544 1289364 1285415 1282432 1280747 1279417
61031 1279417 1277190 1273765 1269548 1264727 1259111 1252503 1245018 1237484 1231372 1227450 1224468 1220331 1214857 1210078
61017 1210078 1207339 1205543 1203212 1200975 1200651 1202734 1206173 1210118 1214438 1218784 1222461 1225460 1228652 1232811
61003 1232811 1238030 1244054 1250457 1256529 1261733 1266447 1271717 1278106 1285200 1292346 1299558 1307394 1316111 1325202
60989 1325202 1334017 1342837 1352979 1365551 1380447 1396998 1415159 1435310 1457256 1480524 1505580 1533538
60977 1533538 1564524 1597531 1632287 1670136 1712514 1759529 1810553 1865248 1923508 1985372 2051581
60966 2051581 2123234 2200433 2282380 2369503 2464225 2568663 2682561 2804407 2933579 3070395
60956 3070395 3214959 3367042 3526502 3693112 3866886 4049372 4243860 4453717 4681419
60947 4681419 4929396 5200212 5495357 5815661 6163680 6543821 6959673 7414368 7915147
60938 7915147 8474468 9104714 9815557 10619510 11535958 12585363 13783585 15147498 16701823
60929 16701823 18473579 20486844 22774794 25381158 28300249 31374918 34267046 36586353
60921 36586353 38102052 38854151 39076231 39034746 38944354 38978099 39256532 39755174 40230859 40300245
60911 40300245 39647639 38190497 36075111 33547355 30833840 28102346 25469370 23007876
60903 23007876 20752130 18711553 16884872 15262061 13822058 12539514 11395315 10377758
60895 10377758 9475908 8676650 7967462 7338055 6779164 6282407 5841094 5449078 5099430
60886 5099430 4786163 4506152 4257031 4034235 3832469 3649139 3483659 3333923 3196027
60877 3196027 3067055 2945593 2829730 2717325 2608600 2506110 2411476 2323784 2241434 2163753
60867 2163753 2090497 2021569 1957647 1899464 1845988 1794739 1744301 1695214 1648227 1603188 1559975
60856 1559975 1518931 1479842 1441821 1404739 1369438 1335965 1302874 1269025 1235013 1202121 1170859
60845 1170859 1141245 1113689 1088805 1066769 1047308 1029822 1013352 997138 981491 967407 955111
60834 955111 943760 932809 922785 914299 907120 900751 895336 891529 889830 890263 892326 895154 898139 901359
60820 901359 905009 908729 912247 916253 921464 927002 930993 932932 934222 936116 938303 939832 940185 938990
60806 938990 935975 931846 928047 924989 921722 918100 915809 916079 917574 918068 917444 917489 919280 922375 926327
60791 926327 931289 936811 941555 945000 948583 954435 963348 974380 986134 998076 1010710 1024596 1039190
60778 1039190 1052762 1063680 1071601 1077218 1081288 1084431 1087512 1091304 1095661 1099692 1102965 1106028 1109537
60765 1109537 1113486 1117667 1122396 1128261 1135285 1142731 1149672 1155602 1160733 1165906 1171873 1178283 1183615 1186595
60751 1186595 1187528 1187691 1187587 1186511 1183843 1179864 1174928 1168726 1161071 1152699 1144335 1135425 1124906 1113050
60737 1113050 1101409 1090895 1081093 1071659 1063191 1056124 1049832 1043578 1037573 1032398 1028129 1024797 1022932
60724 1022932 1022756 1023530 1024726 1027214 1032016 1038288 1043918 1048110 1052219 1057925 1065610 1074765 1085017 1096392
60710 1096392 1109237 1124108 1141199 1159893 1179463 1200079 1222302 1245629 1268484 1289735 1309322
60699 1309322 1327332 1343527 1358065 1371684 1384724 1396794 1407769 1418146 1427949 1436214 1442237 1446574
60687 1446574 1450064 1452614 1453730 1453638 1452944 1451537 1448714 1444260 1438629 1432040 1424054 1414242 1402937 1391206
60673 1391206 1380211 1370462 1361427 1351889 1340838 1328186 1314874 1302458 1292251 1284293 1277223 1269657
60661 1269657 1261660 1254355 1248292 1243054 1238467 1235267 1234171 1234995 1236993 1239381 1241356 1242450 1243266 1244989
60647 1244989 1247737 1250212 1251515 1252424 1254145 1256666 1259217 1261601 1264059 1266340 1267979 1269108 1270045 1270415 1269695
60632 1269695 1268281 1266844 1264769 1260541 1253851 1246111 1238431 1230125 1219942 1207993 1195556 1183271 1170454
60619 1170454 1156360 1141510 1127256 1114237 1101826 1089369 1077439 1067040 1057689 1047329 1034764
60608 1034764 1021435 1009983 1001444 994849 989336 985429 983809 983713 983375 981879 979999 979179 980033 982019 984391
60593 984391 987123 990751 995538 1001135 1007066 1013252 1019954 1027476 1035948 1045091 1054130 1062227 1069106 1074932
60579 1074932 1079695 1083292 1086259 1089744 1094442 1100046 1105877 1111363 1115824 1118873 1121632 1126499 1134829 1145567
60565 1145567 1157072 1169500 1184113 1200920 1218520 1236078 1253884 1271916 1289438 1306513 1324535
60554 1324535 1344491 1365779 1387538 1410044 1433577 1456565 1476184 1490717 1500367 1505772 1506835 1503277
60542 1503277 1495483 1484307 1470676 1455914 1441755 1429016 1416431 1401819 1384676 1366779 1349887
60531 1349887 1333772 1317347 1300934 1286092 1273472 1262265 1252125 1244272 1239908 1238359 1237693 1236692
60519 1236692 1235516 1234775 1234669 1234833 1234500 1233037 1230742 1228856 1228436 1229465 1231374 1233824 1236558 1239170 1241741
60504 1241741 1245208 1250263 1256290 1262215 1268150 1275360 1284832 1296644 1310456 1325689 1341340 1356663 1372221
60491 1372221 1389590 1409819 1432672 1457303 1483124 1510056 1538496 1568976 1601488 1635460 1670946
60480 1670946 1709255 1751404 1796150 1840385 1881235 1916957 1946284 1968286 1982840 1989918 1988337 1976534
60468 1976534 1954937 1926541 1894995 1863167 1833473 1807864 1786749 1769289 1755544 1747135 1744941 1747354
60456 1747354 1751911 1757828 1765835 1776231 1788267 1801224 1815368 1832118 1853656 1881772 1916622 1957260
60444 1957260 2003744 2057689 2120273 2191045 2269704 2357771 2457046 2567364 2687417 2817038 2956982
60433 2956982 3107045 3266364 3435430 3616094 3809858 4018252 4245109 4496096 4774782
60424 4774782 5080319 5409116 5755973 6111256 6458006 6773985 7036685 7226182 7325903 7325154
60414 7325154 7223161 7029836 6761768 6437595 6076257 5696531 5315196 4944792 4593198
60405 4593198 4264685 3960562 3679650 3420039 3181210 2963996 2768332 2591997 2432122
60396 2432122 2287255 2157240 2041536 1938534 1846356 1763561 1689062 1622058 1562218 1509260
60386 1509260 1462050 1418556 1377035 1337056 1299313 1264862 1234588 1208721 1186498 1166716 1148974
60375 1148974 1133759 1120945 1108867 1095774 1081909 1069301 1059465 1051946 1045133 1037774 1029485 1020581
60363 1020581 1011953 1004705 999205 994451 988885 982061 975299 970404 967787 966090 963799 960970 959053 959197
60349 959197 961266 964582 968918 974218 979831 984890 989427 994279 999620 1004273 1007148 1008973 1011875 1017147
60335 1017147 1024007 1030801 1036958 1043337 1050821 1059073 1066750 1072651 1076685 1080002 1084224 1090093 1096674 1102172
60321 1102172 1105719 1107959 1109732 1110781 1110365 1108693 1106909 1105683 1104546 1102735 1100162 1097399 1095139 1093746
60307 1093746 1092909 1091732 1089608 1087004 1084843 1083211 1081457 1079751 1079613 1082404 1087877 1094802 1102502 1111124
60293 1111124 1120682 1130488 1139611 1147699 1155456 1164334 1175367 1188155 1201280 1213773 1225590 1236543
60281 1236543 1245548 1251442 1254037 1253974 1252111 1249433 1246898 1244734 1242394 1239775 1237900 1237723 1238847 1240210 1241520
60266 1241520 1243052 1244496 1245069 1244667 1243841 1242630 1240366 1236772 1232414 1227841 1222955 1217477 1211438 1205037 1198607
60251 1198607 1192925 1189015 1187303 1187243 1187935 1188936 1190423 1192679 1195432 1197718 1198844 1199606 1201820 1206131 1210905
60236 1210905 1213975 1214831 1214346 1213184 1211676 1210550 1210102 1208929 1205322 1200104 1196439 1196373 1199072 1202901 1207517
60221 1207517 1213076 1218962 1224726 1231268 1239872 1250816 1263907 1279345 1296853 1314843 1331980 1348983
60209 1348983 1367375 1386932 1406046 1424382 1443355 1463707 1484235 1503548 1521812 1540013 1558621
60198 1558621 1577910 1598754 1622045 1647797 1675711 1706355 1740891 1779728 1822279 1868108 1917559
60187 1917559 1970931 2027779 2087749 2151930 2222567 2301159 2387302 2479819 2578654 2684982 2799605
60176 2799605 2922157 3052248 3190630 3338364 3495048 3658500 3826104 3995839 4165962
60167 4165962 4334405 4498765 4656420 4804361 4939398 5059205 5163175 5251792 5324971 5381321
60157 5381321 5419327 5439114 5442606 5431931 5408363 5373469 5330848 5285645 5242034 5201933 5166397
60146 5166397 5137248 5116548 5105454 5105031 5117810 5146964 5193601 5256154 5333036 5424791 5532784
60135 5532784 5656648 5794141 5942838 6100545 6264036 6428663 6589737 6743585 6886931
60126 6886931 7016139 7127820 7219789 7290796 7339703 7365635 7368802 7350343 7311229 7251945 7173553
60115 7173553 7078601 6970775 6854228 6733641 6614271 6500960 6396903 6303837 6223384 6157798
60105 6157798 6109428 6080010 6070536 6081143 6110755 6157386 6219305 6295548 6384737 6483541 6586949
60094 6586949 6690163 6789958 6884320 6971468 7049646 7117674 7175211 7222342 7259007 7285135 7301698
60083 7301698 7311864 7320766 7333489 7352957 7380018 7415794 7463603 7528208 7613306 7720249 7849113
60072 7849113 8000296 8174562 8372191 8593050 8837739 9108002 9405736 9732089 10087769
60063 10087769 10473356 10888310 11329802 11793305 12274304 12768672 13271212 13774563 14269799
60054 14269799 14747527 15198215 15612472 15982030 16300401 16562173 16762106 16895557 16959577
60045 16959577 16952990 16875618 16728296 16513941 16238302 15909623 15537913 15134333 14710443 14277421
60035 14277421 13845745 13425068 13023636 12647677 12301898 11990664 11717985 11486011 11294144
60026 11294144 11140301 11022878 10941201 10894482 10880970 10897782 10940539 11002859 11076950 11155508 11233170
60015 11233170 11305971 11369752 11419561 11450611 11459450 11444278 11404658 11341054 11254069 11143681 11009623
60004 11009623 10853005 10677187 10486333 10283252 10069455 9847121 9619844 9391188 9163834
59995 9163834 8940937 8727094 8526571 8341227 8171675 8020088 7890048 7783419 7699157 7636030
59985 7636030 7595057 7578130 7585431 7615719 7668462 7743920 7841124 7957279 8089485 8235681 8393066
59974 8393066 8556492 8719416 8876057 9021832 9152057 9261418 9345199 9400569 9426263 9421455
59964 9421455 9385555 9319105 9224209 9103696 8960174 8796476 8616936 8427567 8234606 8043140
59954 8043140 7857211 7680641 7517059 7369343 7239665 7130161 7043022 6979718 6940512 6925013
59944 6925013 6933068 6965096 7021972 7104888 7215057 7353025 7517959 7707538 7918517 8147418
59934 8147418 8390659 8643826 8900673 9153071 9392445 9611537 9804811 9967567 10095499
59925 10095499 10185543 10236938 10251000 10229786 10174828 10086863 9966816 9817599 9645320 9458308
59915 9458308 9264518 9069934 8879465 8698630 8533453 8388805 8267408 8170430 8098499 8052159
59905 8052159 8031920 8038035 8069827 8125260 8201680 8297190 8410774 8541088 8685691 8841622 9005979
59894 9005979 9175492 9346220 9514387 9677218 9832541 9978080 10111947 10233593 10343456
59885 10343456 10441748 10528423 10604545 10673061 10738019 10803567 10873810 10952927 11044868 11153289 11282121
59874 11282121 11435828 11618714 11834230 12085227 12374300 12702977 13070535 13474055 13909427
59865 13909427 14371388 14852253 15341364 15826434 16294948 16733530 17126461 17456511 17708517
59856 17708517 17872233 17941926 17914650 17790717 17576018 17282371 16924452 16516488 16071867 15604392
59846 15604392 15127924 14654368 14192672 13749935 13332671 12946757 12596774 12285844 12015716
59837 12015716 11786812 11598740 11451302 11344862 11279586 11254632 11268107 11317276 11398581 11507893
59827 11507893 11640952 11792909 11957027 12124537 12286287 12433785 12557961 12647994 12693258 12686747
59817 12686747 12625797 12509761 12338718 12115037 11844754 11536164 11197492 10836450 10460911
59808 10460911 10078366 9694728 9314683 8943194 8585628 8246244 7927349 7630062 7354938
59799 7354938 7101539 6868651 6656018 6465434 6299077 6156767 6035537 5931721 5842593 5765996
59789 5765996 5699626 5641601 5591184 5547955 5510273 5475239 5440460 5405407 5370889 5337650 5305819
59778 5305819 5275350 5246327 5218583 5191121 5161935 5128344 5087742 5038531 4980656 4915344 4844447
59767 4844447 4770225 4695545 4623514 4556233 4493834 4435117 4379250 4326697 4278567 4235536 4197731
59756 4197731 4165517 4139946 4122304 4113329 4113019 4121159 4137953 4164011 4199674 4244455 4297399 4357995
59744 4357995 4426479 4503047 4586975 4676701 4770565 4867189 4965187 5062825 5157905 5247835 5330072
59733 5330072 5403093 5467127 5523743 5574742 5621682 5666245 5710433 5756234 5805544 5860450 5923044
59722 5923044 5994908 6077525 6173522 6286655 6419880 6573949 6748608 6944841 7165295 7412943
59712 7412943 7690165 7998826 8340136 8714159 9120015 9556577 10021872 10510579 11010929
59703 11010929 11502743 11957937 12344724 12634846 12810243 12865513 12806635 12648864 12414335 12127944
59693 12127944 11812523 11486680 11165548 10861046 10580611 10327540 10104149 9913796 9758906
59684 9758906 9638538 9549857 9491603 9464550 9468980 9503637 9567427 9660595 9783595 9935966 10117151
59673 10117151 10327697 10568888 10841536 11145729 11481691 11850702 12255250 12698290 13182124
59664 13182124 13708121 14277699 14893185 15557138 16271137 17035869 17852078 18720379 19639925
59655 19639925 20607912 21620240 22671443 23753334 24854292 25960318 27056672 28129167
59647 28129167 29165945 30159714 31108464 32013839 32879357 33710220 34513301 35295302 36060063
59638 36060063 36807413 37533767 38232831 38895881 39512322 40070555 40558812 40966368 41285540
59629 41285540 41513115 41649840 41699178 41667717 41566780 41412248 41221785 41012339 40800254 40602480
59619 40602480 40435993 40315761 40253863 40260525 40344986 40514790 40774909 41128400 41577771 42125013
59609 42125013 42770156 43510002 44337650 45241754 46205296 47205222 48213495 49197938 50121692
59600 50121692 50942869 51616748 52100252 52356521 52358493 52091896 51557366 50770418 49758978
59591 49758978 48559746 47214508 45766681 44258323 42727868 41208383 39726201 38300720
59583 38300720 36945366 35667801 34468082 33336877 32256679 31205177 30157876 29090513
59575 29090513 27984419 26833470 25646177 24440158 23234698 22047726 20896123 19794569
59567 19794569 18752820 17775275 16863290 16016765 15233799 14510984 13845299 13235042 12678226
59558 12678226 12170911 11707955 11285123 10899904 10550486 10234408 9948208 9688345 9452587
59549 9452587 9240184 9049989 8878341 8719593 8568952 8424220 8284580 8148725 8014905
59540 8014905 7882013 7749447 7616053 7480164 7340898 7198896 7055783 6913511 6774194
59531 6774194 6639805 6511577 6390126 6276452 6172247 6078632 5994947 5919653 5852591 5795621
59521 5795621 5750617 5717323 5693760 5678463 5671518 5673284 5682973 5699156 5721358 5750408 5787060 5830669
59509 5830669 5879462 5932022 5988333 6049402 6115927 6187548 6263682 6344962 6433283 6530105 6635177
59498 6635177 6747425 6866855 6995111 7134436 7286709 7453297 7635022 7832169 8045187
59489 8045187 8275520 8524978 8793963 9080896 9383610 9700620 10030742 10372399 10723992
59480 10723992 11084134 11450492 11818749 12183420 12539001 12879123 13195272 13478531 13723625
59471 13723625 13930469 14101417 14238094 14341419 14413230 14456227 14472601 14463834 14431737 14378933
59461 14378933 14308736 14225771 14136741 14049467 13970806 13906117 13860623 13840067 13849540 13892665 13972426
59450 13972426 14091598 14251053 14447952 14676315 14928803 15196846 15469311 15732323 15970727
59441 15970727 16169311 16313277 16389684 16389873 16310449 16151707 15915971 15608161 15237277 14815924
59431 14815924 14357768 13875513 13380988 12886189 12403137 11942009 11509133 11106945 10736135
59422 10736135 10397890 10094142 9826396 9595221 9400709 9242509 9119203 9028578 8969029 8940098
59412 8940098 8941405 8971970 9031076 9118674 9233995 9374692 9538482 9724664 9932282 10157264
59402 10157264 10393317 10635470 10880402 11122512 11351854 11557481 11731345 11867460 11958958
59393 11958958 11998825 11983531 11913819 11791655 11618439 11397066 11133946 10837398 10514736 10171983
59383 10171983 9815561 9452508 9088757 8728239 8374001 8029504 7698429 7383815 7087691
59374 7087691 6811073 6553792 6314673 6092649 5887865 5701258 5532831 5380762 5242691
59365 5242691 5117748 5006605 4909432 4824552 4749837 4685034 4631696 4590777 4561120 4540597 4527938
59354 4527938 4523018 4526281 4538682 4561145 4592326 4626837 4657145 4678254 4690456 4697806 4704937 4715316
59342 4715316 4731007 4752888 4781628 4819054 4867561 4926927 4992291 5056885 5117169 5174737 5233624
59331 5233624 5297154 5367611 5447377 5538968 5644183 5763894 5898583 6048791 6215307 6399324
59321 6399324 6602381 6826100 7072140 7342278 7637997 7960025 8309000 8686787 9096534
59312 9096534 9541124 10022342 10541956 11102715 11707337 12356870 13050714 13787562 14564882
59303 14564882 15376976 16214070 17063584 17912086 18746491 19554696 20326153 21052403 21727459
59294 21727459 22348024 22913143 23423140 23878703 24280694 24629854 24925523 25164534 25341673
59285 25341673 25450836 25484926 25435077 25291673 25047174 24698063 24244688 23690962 23045126 22319908
59275 22319908 21530754 20693764 19825090 18940795 18055678 17182113 16330508 15510140 14728308
59266 14728308 13988915 13293188 12642073 12037091 11478999 10966959 10499502 10075070 9690949
59257 9690949 9342906 9027249 8742751 8489429 8265886 8069050 7896300 7746385 7618035
59248 7618035 7508952 7416750 7339948 7277486 7228154 7191193 7166682 7154368 7152611 7159396 7174106
59237 7174106 7197550 7230394 7272183 7321474 7376053 7433352 7491749 7551526 7613717 7678098 7743297
59226 7743297 7808815 7875603 7944118 8012809 8079140 8141446 8199461 8254200 8308271 8365741 8430637
59215 8430637 8505448 8591018 8687067 8792360 8905132 9023934 9147233 9271510 9390825 9499585
59205 9499585 9595191 9676749 9741682 9785190 9803112 9794067 9758775 9698775 9616489 9515476 9399710
59194 9399710 9272876 9138589 9000674 8862813 8728214 8599670 8479319 8368065 8265780
59185 8265780 8172396 8088375 8013937 7948253 7889693 7836698 7788397 7744716 7705876 7671467 7640274
59174 7640274 7611440 7585521 7563739 7546606 7534355 7528495 7531494 7544537 7566982 7598971 7643722 7706273
59162 7706273 7790280 7896653 8025028 8176087 8352572 8558164 8795101 9063058 9361130 9690742
59152 9690742 10055179 10455549 10888053 11345444 11819562 12301062 12777667 13234397 13655538
59143 13655538 14025688 14329861 14554646 14690060 14729968 14671140 14513175 14259814 13919658 13505334
59133 13505334 13031982 12515728 11971974 11414145 10853708 10300755 9763824 9249277 8761475
59124 8761475 8303358 7876363 7480297 7114329 6778054 6470775 6190174 5933117 5698003
59115 5698003 5485218 5294878 5125087 4972961 4836434 4714431 4605926 4509654 4424474 4349556
59105 4349556 4284415 4228937 4183004 4145870 4116378 4093976 4078995 4071612 4071115 4076495 4087269 4103368
59093 4103368 4124705 4151216 4182825 4219077 4259426 4304248 4354730 4411071 4471551 4534270 4599205
59082 4599205 4667392 4738533 4810764 4882835 4955074 5027690 5099281 5167772 5231994 5291486 5345427
59071 5345427 5392902 5433923 5469101 5498229 5520246 5535014 5544397 5551045 5556639 5561903 5567777 5575692
59059 5575692 5586762 5601589 5621005 5646286 5678202 5716376 5760113 5809644 5866181 5930915 6004346
59048 6004346 6086483 6177455 6278007 6389487 6512966 6648123 6793423 6947991 7113021 7290737
59038 7290737 7481982 7685326 7898468 8119826 8348628 8583912 8823593 9063989 9299838
59029 9299838 9524726 9731319 9911036 10054318 10152704 10201406 10199547 10147898 10047229 9899244
59019 9899244 9708276 9481155 9225596 8948961 8657718 8356825 8049540 7738572 7427641
59010 7427641 7121478 6824062 6537220 6261106 5995761 5742066 5501379 5274544 5061314
59001 5061314 4860692 4671684 4493663 4326296 4169563 4023696 3888521 3762728 3644486
58992 3644486 3533116 3429520 3334437 3246862 3164946 3087989 3016634 2951276 2891224 2835459 2783322
58981 2783322 2734254 2687695 2643704 2603062 2566211 2532425 2500295 2468788 2437635 2407098 2377583
58970 2377583 2349122 2321126 2293199 2266335 2242512 2222582 2205213 2188561 2172471 2158164 2146238
58959 2146238 2136034 2126810 2118380 2110506 2102694 2095069 2088437 2082938 2077493 2071451 2066097 2063396 2063570 2065058
58945 2065058 2066832 2069484 2073669 2078729 2083845 2089653 2097367 2106449 2114552 2120200 2124496 2129477 2135529 2141400
58931 2141400 2146343 2151033 2156258 2161750 2166990 2172456 2179279 2187876 2197630 2207894 2218739 2230604 2243664
58918 2243664 2257765 2272685 2288388 2305242 2324008 2345196 2368347 2392383 2416818 2442159 2468800
58907 2468800 2496048 2522822 2549097 2576085 2605134 2636851 2671076 2706957 2743116 2778553 2813752
58896 2813752 2850365 2889557 2931185 2974831 3020869 3069911 3121861 3176488 3234614 3297630 3365760
58885 3365760 3437709 3512406 3590306 3672495 3759132 3849423 3942799 4039507 4140260 4245963 4357686
58874 4357686 4476301 4601986 4734465 4873828 5020911 5176909 5342929 5519833 5708081
58865 5708081 5907770 6119378 6344604 6585984 6845395 7123242 7419229 7733516 8067037
58856 8067037 8421457 8799243 9203060 9634341 10092974 10579286 11095929 11646606 12232936
58847 12232936 12853774 13508025 14196956 14922829 15685863 16483260 17310542 18162548 19032836
58838 19032836 19912673 20790697 21653015 22483454 23264115 23976141 24600345 25117918 25511777
58829 25511777 25768397 25879330 25841951 25659412 25339844 24895158 24340260 23692822 22972437
58820 22972437 22198500 21388243 20556624 19717397 18883091 18063577 17265320 16492649 15749631
58811 15749631 15040388 14367729 13731928 13131164 12563329 12027469 11523508 11050954 10608375
58802 10608375 10194128 9806829 9444680 9105031 8785418 8484801 8203135 7940038 7694633
58793 7694633 7466429 7255511 7062019 6886221 6728683 6589009 6464404 6350944 6246903
58784 6246903 6153890 6074429 6009487 5958590 5920699 5894036 5876525 5867873 5870373 5886271 5915022 5954324
58772 5954324 6002975 6061153 6128734 6205510 6292974 6393693 6508325 6634942 6771989 6920452
58762 6920452 7082264 7258004 7447389 7651136 7871115 8109165 8366739 8645185 8945476
58753 8945476 9268098 9614190 9986473 10388051 10820461 11283815 11778895 12308130 12874187
58744 12874187 13478238 14119884 14798192 15512328 16261340 17043385 17854779 18689247 19537805
58735 19537805 20389018 21229066 22041732 22808932 23511626 24130348 24645522 25038717 25295010
58726 25295010 25404909 25364531 25174871 24841847 24377136 23798026 23125065 22378636 21576739
58717 21576739 20735132 19868752 18992436 18119897 17261773 16424520 15611322 14824418 14066974
58708 14066974 13343021 12655840 12006465 11393670 10815332 10269976 9757291 9277215 8828548
58699 8828548 8408720 8015266 7647328 7305178 6988258 6694345 6420866 6166321 5929931
58690 5929931 5710515 5506502 5316653 5139875 4974548 4819052 4673012 4537132 4411415
58681 4411415 4294357 4184212 4080216 3982060 3888962 3800137 3715731 3636359 3561858 3491269 3424049
58670 3424049 3360639 3301779 3247787 3198447 3152956 3109791 3067281 3024637 2982082 2939840 2897525
58659 2897525 2854799 2811972 2769365 2726326 2681360 2633155 2581293 2526393 2470102 2414556 2361005
58648 2361005 2308919 2257030 2205244 2154819 2106629 2060187 2014833 1971040 1929796 1891167 1854356
58637 1854356 1818943 1785321 1753980 1725078 1698644 1674457 1651531 1628452 1604564 1580436 1556966
58626 1556966 1534440 1512637 1491342 1470512 1450387 1431727 1415460 1401736 1389680 1378441 1368117
58615 1368117 1359350 1352342 1346733 1342178 1338695 1336625 1336536 1338860 1343269 1348701 1354389 1360542 1367653 1375492
58601 1375492 1383391 1391198 1399258 1407400 1414516 1419204 1420492 1418100 1412689 1406029 1400228 1396261 1393340 1390029
58587 1390029 1385943 1382204 1380356 1381129 1384353 1389814 1397620 1407606 1419017 1431522 1446319 1465298 1488824
58574 1488824 1514978 1541410 1567464 1594279 1623472 1656184 1692789 1732872 1775757 1821507 1871170
58563 1871170 1925839 1985884 2051269 2121838 2196883 2275371 2357316 2444248 2537597 2637400 2743407
58552 2743407 2856550 2978232 3108994 3249156 3400025 3562955 3737751 3923638 4121370
58543 4121370 4332397 4555996 4789128 5029160 5274477 5521647 5764042 5994453 6207420
58534 6207420 6397569 6557096 6676977 6750605 6775579 6752806 6685147 6576592 6431680 6255656
58524 6255656 6055321 5838722 5612976 5382897 5152467 4926746 4710915 4507712 4317015
58515 4317015 4137998 3970721 3815679 3672881 3541799 3421662 3311519 3210413 3117661 3032714
58505 3032714 2954657 2882101 2813534 2747708 2683919 2622176 2562914 2506395 2452674 2402127 2355331
58494 2355331 2311911 2270041 2227735 2184420 2140907 2098251 2057177 2018169 1981354 1946394 1912918
58483 1912918 1880789 1849505 1817919 1785412 1753055 1722652 1694660 1667813 1640902 1614019 1587833
58472 1587833 1562453 1537490 1512801 1488754 1466064 1445581 1427731 1411747 1395823 1378646 1360701
58461 1360701 1343606 1328237 1313975 1299846 1285777 1272379 1259929 1248176 1236994 1226616 1217142
58450 1217142 1208344 1200151 1192870 1186711 1181630 1177937 1176424 1177287 1179336 1180914 1181357 1180944 1179822 1177814 1175199
58435 1175199 1172770 1170925 1169251 1167071 1163919 1159442 1153471 1146369 1138973 1132128 1126434 1122061 1118358 1114065
58421 1114065 1108624 1102916 1097972 1093415 1088117 1082030 1076194 1071134 1066461 1061974 1057740 1053003 1046474 1038176
58407 1038176 1029855 1023051 1017846 1013836 1011113 1009604 1008395 1006395 1003086 998411 992867 987939 985319 985206
58393 985206 986272 987586 989509 992454 995976 999432 1002421 1004393 1005317 1006983 1011821 1019777 1028163 1035372
58379 1035372 1042783 1051866 1061464 1069623 1076467 1083313 1090225 1096377 1101795 1106895 1111135 1113995 1116423 1119392
58365 1119392 1121701 1121172 1117662 1113056 1108603 1104049 1099196 1094520 1090207 1086209 1083262 1082404 1083404 1085028
58351 1085028 1086845 1089410 1092614 1095303 1096829 1097809 1099130 1101337 1105134 1111367 1119956 1129587 1138773 1146830
58337 1146830 1153861 1160343 1166619 1172405 1177097 1181071 1186070 1193554 1203077 1212874 1221444 1228025 1232640 1236836
58323 1236836 1243551 1254763 1269541 1285316 1300507 1314944 1328630 1341521 1353932 1365807 1376064
58312 1376064 1383905 1390179 1396161 1401722 1406231 1410528 1416085 1422609 1428410 1433114 1438268 1445008 1452645 1459988
58298 1459988 1466930 1474497 1484015 1496128 1509931 1523491 1535958 1548559 1562732 1578255 1594271 1610872
58286 1610872 1628159 1644956 1660362 1675585 1692082 1708664 1722745 1733956 1744145 1754163 1763111
58275 1763111 1770805 1778596 1787363 1796690 1806323 1816606 1827263 1837632 1848438 1861567 1877717 1895710
58263 1895710 1914335 1933393 1952946 1973135 1994802 2018786 2044721 2071901 2100861 2132191 2164274
58252 2164274 2194385 2222083 2249424 2277814 2306815 2336274 2367359 2400766 2435532 2470224 2504129
58241 2504129 2537300 2570767 2606432 2645228 2685757 2726344 2767760 2811839 2858019 2903707 2947889
58230 2947889 2992051 3037580 3084552 3133136 3183928 3236682 3290631 3346101 3404002 3463950 3524720
58219 3524720 3586188 3649064 3713520 3780129 3851213 3928854 4012425 4100419 4193553 4293433 4399592
58208 4399592 4510949 4628794 4754794 4887444 5024394 5167073 5318634 5478249 5642048
58199 5642048 5809251 5982886 6164978 6355829 6557560 6772991 7000699 7236341 7479533
58190 7479533 7734773 8005324 8291122 8593070 8914023 9254709 9613768 9992717 10395929
58181 10395929 10824968 11277911 11754959 12259759 12794806 13360963 13961846 14602959 15285877
58172 15285877 16008704 16772156 17579060 18428267 19316387 20246012 21225235 22259158 23349843
58163 23349843 24504838 25737016 27055193 28463595 29970942 31590110 33327689 35184195
58155 35184195 37166072 39287115 41557209 43982202 46578002 49373838 52400253 55686792
58147 55686792 59273385 63210072 67543453 72318479 77595809 83451618 89959986 97196391
58139 97196391 105263582 114297408 124450085 135893380 148835239 163496262 180060640
58132 180060640 198678834 219520039 242800292 268797223 297873550 330275076 365390356
58125 365390356 400773662 431987323 453990293 463348768 459596910 444854855 422394647
58118 422394647 395410923 366499639 337557582 309811221 283958344 260370366 239206317
58111 239206317 220458226 204067255 190030249 178259272 168266510 159107846 149798939
58104 149798939 139842380 129365103 118825673 108660894 99143659 90406674 82489163
58097 82489163 75368166 68991717 63300606 58226221 53687551 49604775 45913621 42566140
58089 42566140 39526447 36768650 34271704 32012394 29965237 28106910 26415556 24867960
58081 24867960 23443397 22128920 20915667 19791749 18743853 17763857 16848658 15995002
58073 15995002 15198992 14458633 13771742 13132316 12532689 11967702 11433497 10924811 10437676
58064 10437676 9972800 9532163 9113807 8713428 8329177 7961407 7609715 7273908 6956191
58055 6956191 6658773 6380566 6119126 5874065 5645498 5430994 5227289 5033508 4849837
58046 4849837 4674730 4506434 4345616 4193374 4048144 3907579 3772167 3643949 3522763
58037 3522763 3406549 3294379 3186478 3082205 2980603 2882313 2788667 2699429 2613299 2529784
58027 2529784 2448846 2369735 2292040 2216951 2145766 2078015 2012554 1949431 1889253 1831862 1777047
58016 1777047 1725371 1676996 1631010 1587104 1546342 1509081 1473942 1440310 1409929 1384272 1362005
58005 1362005 1340826 1320195 1300435 1280898 1261072 1242090 1225145 1209652 1194732 1180968 1168676
57994 1168676 1155896 1140469 1123183 1106781 1092579 1079933 1068223 1057453 1047420 1037887 1029131 1021130
57982 1021130 1012991 1004281 995900 988479 981043 972610 963912 956110 948960 941748 934920 929207 924120 918894
57968 918894 914073 910532 907625 903724 898059 890915 882812 874713 868264 864490 862587 860780 857799 853023
57954 853023 846280 838290 830373 823010 815562 807701 799800 791632 782412 772620 763944 756730 749514 741775
57940 741775 734934 729654 724591 719085 714705 712586 711634 711053 712037 714869 716888 715993 714084 714257 716422
57925 716422 718485 720188 722619 725185 726310 726348 726848 727489 726533 723944 721342 719131 716225 712600 709764
57910 709764 708571 708444 708570 708056 705363 699749 692998 687621 683504 678460 671905 665707 661110 656955 651593
57895 651593 644987 638324 632767 628977 626843 625356 623500 621350 619770 619384 620362 622515 625037 627119 629537
57880 629537 634293 641623 648852 653566 656344 658643 659761 658264 655104 652479 650241 646033 638799 629882
57866 629882 620835 612193 604168 596483 587802 577300 566581 558114 552189 547518 544238 543791 545895 548143
57852 548143 548933 548706 548149 547386 547192 548783 551905 555036 557781 561089 564850 567467 568434 569277 571252 573892
57836 573892 576453 578978 581258 582491 582759 583157 583689 582724 579475 575434 572305 569854 566830 562790 557923
57821 557923 552142 545534 538999 533481 529024 525132 521500 517891 513917 509519 505384 502664 502503 505487
57807 505487 510833 516412 520520 523468 526613 530212 533451 536239 539432 543323 547446 551973 557666 563936
57793 563936 568440 569398 567287 563619 559000 553188 546438 540009 535323 532680 530736 527775 523806 520611
57779 520611 518996 517139 512980 507307 502643 499533 495921 490093 482401 473920 465219 456864 449563 443232
57765 443232 437034 430568 423977 416893 408601 399324 390073 381230 372561 364492 357789 352015 345868 339217
57751 339217 333335 329032 326113 324637 324976 326451 327599 328021 328396 328600 327668 325747 324084 322824 320931
57736 320931 318642 317705 318461 319027 318497 318824 322158 328140 335274 343341 352759 362642 371090 376865 380001
57721 380001 381560 383328 386599 390644 393425 394140 393558 391598 386744 378884 370661 364442 359471 353604 346494
57706 346494 339473 333448 328610 325261 323219 320941 316836 311301 306475 304119 304331 305806 306824 306637 306352
57691 306352 307766 311140 315212 319529 325180 332629 340566 347910 355334 363697 372491 381199 390633 401328
57677 401328 411761 419869 425529 430152 434730 439643 445436 452196 458862 464610 470331 477421 485864 494897
57663 494897 504779 516222 528385 539081 547020 552906 558489 565372 574359 585048 596395 608153 621062
57650 621062 635078 648622 660676 672600 686610 703370 722205 742609 764035 785217 805589
57639 805589 826814 851185 878821 908106 938580 971726 1008927 1050125 1094594 1141785 1191404
57628 1191404 1243703 1299708 1360258 1425077 1493738 1567129 1646875 1733762 1828044 1930903 2044295
57617 2044295 2169501 2307142 2458479 2625259 2808261 3007305 3223034 3457567 3712694
57608 3712694 3987220 4274946 4563903 4838164 5082598 5287400 5448650 5565643 5638721 5668779
57598 5668779 5656941 5604433 5513778 5390084 5240108 5070067 4885147 4690497 4491088 4290641
57588 4290641 4091991 3898438 3713302 3538083 3372568 3217113 3073461 2942938 2825138
57579 2825138 2718979 2623943 2539724 2465581 2400723 2344589 2296354 2254943 2219967 2192000 2171506
57568 2171506 2158118 2151196 2150346 2155062 2164696 2179308 2199916 2227452 2262019 2303613 2353031 2411418
57556 2411418 2479168 2555684 2640057 2731825 2831409 2940130 3059569 3190466 3332051 3482261
57546 3482261 3638449 3797917 3957862 4114776 4263873 4399405 4515674 4607622 4670603 4700430
57536 4700430 4694208 4651092 4572409 4461910 4325971 4172209 4006781 3833385 3655131 3476088
57526 3476088 3299895 3127912 2960352 2798736 2645668 2502353 2367849 2240942 2121598
57517 2121598 2010446 1907948 1814371 1729589 1652576 1581819 1516449 1456400 1401508 1351211 1305097
57506 1305097 1262910 1224010 1187656 1153912 1123495 1096671 1073053 1052488 1035233 1021059 1009059
57495 1009059 998638 990086 983825 979530 976138 972468 968065 963933 962147 964003 968732 974640 981169 989003
57481 989003 998549 1009541 1022087 1036914 1054303 1073780 1095031 1118262 1143573 1170991 1201336 1235926
57469 1235926 1274995 1317335 1361921 1409088 1459694 1514035 1572134 1634264 1700552 1770826 1845632
57458 1845632 1926806 2016065 2113236 2216632 2325068 2438718 2557777 2680800 2804822 2926879
57448 2926879 3044746 3155850 3255908 3339516 3402229 3441529 3455780 3443539 3404857 3342468 3260454
57437 3260454 3162032 3049910 2928603 2804665 2683597 2567118 2454031 2343362 2236120 2134417
57427 2134417 2039735 1952365 1872260 1799830 1735489 1678590 1627445 1580693 1538325 1501220 1470134
57416 1470134 1445243 1425996 1411155 1399706 1392074 1389634 1392634 1399672 1409986 1425114 1447154 1476179
57404 1476179 1510662 1549814 1594173 1644350 1700588 1763317 1832775 1908186 1988497 2073863 2165290
57393 2165290 2262933 2365867 2473311 2584588 2697607 2808516 2913207 3008282 3090399 3155616
57383 3155616 3199779 3219204 3211350 3175766 3114433 3030666 2928005 2810647 2683911 2552622 2419231
57372 2419231 2284636 2150443 2019085 1892164 1770328 1654637 1546374 1445451 1350671 1261756
57362 1261756 1179561 1104099 1034052 968609 908204 852850 801315 752742 707831 667645 632236
57351 632236 600984 573181 547796 523747 501100 481028 464079 449423 436221 424692 415296 407779
57339 407779 401581 396464 392363 389246 387197 385832 383938 380822 377669 375980 374803 371545 365880 360851
57325 360851 359376 361477 365607 370641 375449 378542 379875 381567 385195 389551 392615 394669 397754 402842
57311 402842 409153 415675 421819 427044 431471 436688 444458 454443 464256 471901 477327 481565 485215 488113
57297 488113 490083 491634 493851 497459 502151 507206 512688 519363 527410 535903 543641 549874 554327 557474
57283 557474 560729 565330 570907 576219 581206 586998 593835 600645 607085 614328 623116 632493 641252 649239
57269 649239 656536 662984 669443 677894 688902 700327 709967 718360 727685 738872 751271 764290 777883
57256 777883 791929 806328 821331 836875 852253 867214 882580 898884 915328 931039 946473
57245 946473 962595 979633 997619 1017146 1038408 1060464 1082593 1105501 1129938 1155117 1179808
57234 1179808 1204123 1228851 1253891 1278746 1303907 1330384 1358499 1388363 1420733 1456071 1493582
57223 1493582 1532666 1574558 1620968 1671672 1724912 1779526 1835151 1890961 1945824 1999284 2050797
57212 2050797 2098517 2140526 2176809 2208287 2234205 2252367 2261877 2263798 2259045 2247479 2229591 2207638
57200 2207638 2184399 2161558 2139475 2117658 2095482 2073263 2052464 2034049 2017147 2000513 1984920
57189 1984920 1972680 1964988 1961042 1959692 1960578 1963583 1968439 1975149 1983854 1994199 2005615 2018033 2031394
57176 2031394 2044724 2056758 2067296 2077051 2086567 2096388 2107818 2122128 2139230 2158327 2179568 2203604
57164 2203604 2229759 2256280 2282570 2309870 2339548 2371895 2406755 2444061 2483391 2523875 2564861
57153 2564861 2606175 2647932 2690698 2735382 2782137 2829943 2878135 2927452 2978263 3028631 3075901
57142 3075901 3119730 3161773 3202793 3242038 3279281 3315421 3350857 3385194 3418992 3454036 3491311
57131 3491311 3530065 3569270 3608674 3648174 3687725 3728286 3771315 3816671 3862329 3906736 3950130
57120 3950130 3992870 4033746 4070952 4103943 4133538 4160659 4185638 4208445 4229272 4248919 4268372
57109 4268372 4287602 4305195 4319776 4331467 4341418 4350740 4360756 4373359 4389555 4407960 4425986 4442097
57097 4442097 4455834 4466279 4472064 4472689 4468771 4461566 4453349 4447177 4444455 4443389 4441273 4437336 4431544 4422018
57083 4422018 4406344 4384719 4359079 4329477 4293958 4251498 4202071 4143959 4074343 3993101 3903193
57072 3903193 3806636 3702682 3590298 3469321 3338034 3192187 3027514 2840942 2628600 2385402
57062 2385402 2108109 1796771 1451961 1072456 656454 202866 -289992 -825665 -1409031
57053 -1409031 -2046496 -2747351 -3523401 -4386975 -5350776 -6429285 -7638421 -8994842 -10518540
57044 -10518540 -12235541 -14175270 -16366735 -18841719 -21641439 -24816149 -28419344 -32507550
57036 -32507550 -37145140 -42403766 -48357812 -55086352 -62676815 -71215112 -80766367 -91363426
57028 -91363426 -102997358 -115594758 -129011617 -143095988 -157783701 -173084573 -188877172
57021 -188877172 -204644366 -219395702 -231877709 -240933504 -245799013 -246235956 -242518565 -235312785
57013 -235312785 -225482586 -213886432 -201239472 -188070400 -174743817 -161505973 -148529697
57006 -148529697 -135945060 -123848943 -112303095 -101339554 -90977675 -81239029 -72149961
56999 -72149961 -63736613 -56020022 -49011710 -42708839 -37091660 -32125060 -27761974 -23946920
56991 -23946920 -20620197 -17722321 -15197035 -12992997 -11065161 -9374957 -7888615 -6576078
56983 -6576078 -5412263 -4377777 -3456386 -2632168 -1890447 -1220629 -616228 -72330 415843
56973 852956 1244343 1596864 1917278 2209922 2477355 2722979 2951284 3165390 3365617 3550279
56963 3550279 3716527 3861024 3982225 4082787 4168262 4242761 4307145 4362042 4411437 4462349
56953 4462349 4521168 4589577 4661860 4725339 4765533 4773753 4751002 4704962 4643910 4573393 4496661
56942 4496661 4415906 4332594 4247606 4161562 4074708 3986390 3894995 3798570 3695604 3585679 3469999
56931 3469999 3351112 3231573 3112770 2995402 2880825 2771039 2667048 2567984 2472382 2379725
56921 2379725 2289919 2201647 2112292 2019610 1922846 1822362 1719308 1615941 1515093 1418283
56911 1418283 1324917 1234125 1146854 1065230 990291 921410 857867 799898 748097 702666 663617
56900 663617 630976 604394 583111 566632 554958 547681 543076 538392 531072 519897 505322 488799
56888 488799 471597 454297 437363 421498 406964 393217 380166 369289 362255 358602 356161 353983
56876 353983 353566 356741 363636 373476 386065 401311 417913 433700 446849 455929 459310 455836 446093
56863 446093 432049 415337 396595 376313 355324 334216 313227 293116 275262 260221 246751
56852 246751 233118 219130 206189 195454 186712 179177 172666 167579 164173 162320 161646 161500 161124 160412
56838 160412 160293 161747 164571 167714 170756 174349 179161 185263 192800 202422 214589 229041 245314 263031
56824 263031 281142 297717 311361 322296 331170 337323 339429 337800 335039 334090 336144 340545 346158
56811 346158 352688 360937 371781 384811 398413 411671 425800 443199 465433 492571 523830 557820
56799 557820 592488 625826 656578 683481 704041 715203 715633 706906 692594 676591 661695 648638
56787 648638 636550 625181 616370 612312 612823 615906 621036 630211 645394 666525 692847 724751 763053
56774 763053 807218 855297 904768 952252 992855 1021239 1033973 1030860 1014403 988373 956355 920862
56762 920862 883599 846485 811934 781855 756821 736541 720702 709108 701616 698516 700656 708706
56750 708706 722496 741382 764925 792710 823538 854894 882988 903397 912452 908754 893395 868787
56738 868787 837621 802834 767477 733728 702213 672822 645919 622280 602091 584750 569824
56727 569824 557761 549512 545717 546500 551826 561577 575062 590698 606486 620616 631250 636085 633178
56714 633178 622588 606531 587484 566772 545226 523989 503636 483453 462851 442934 425338
56703 425338 409989 395416 381054 367674 355712 344781 334950 326790 319728 311988 302933 294209 287752
56690 287752 283764 281211 279119 276651 273105 268819 265187 262934 261171 258880 256418 254703 253780 253008 251874
56675 251874 249863 246426 242038 238467 236995 237089 237557 238054 238373 237466 234841 232175 231748 233465 235091 235405
56659 235405 235449 236356 237541 237804 237067 236024 234718 232450 228949 225029 221890 220041 219013 218167 217642 218176
56643 218176 219929 221835 222397 220878 217653 213843 210873 209820 210644 212277 213704 214584 214726 213758 211855
56628 211855 210084 209209 208636 207359 205542 204243 203768 203309 202313 201406 201645 203310 205693 207759 208827 208844
56612 208844 208265 207808 208275 210270 213725 217859 222077 226655 231840 236536 239153 239905 240963 243662 246743
56597 246743 248209 247777 246427 244599 242362 240674 240682 241751 241581 238490 232629 224942 216184 207261 199486
56582 199486 193816 190258 188254 187227 186593 185856 184947 184175 183681 183149 182094 180374 178665 178477 181104 186043
56566 186043 191005 194120 195610 196649 197258 196497 194341 191954 190150 188837 188197 189066 191517 194091 195285
56551 195285 195275 195499 196935 199369 202020 204315 206143 207821 209868 212604 215856 219047 221491 222756 223041
56536 223041 223229 224255 226269 228542 230202 231007 231449 232298 233990 236359 239085 242356 246633 251532 255510
56521 255510 257392 258041 259784 264044 269918 275165 278181 278948 278542 278023 277656 276961 275567 274031 273764 275987
56505 275987 280597 285968 290101 292362 294095 297136 301758 306543 310355 313749 318061 323603 329316 334004
56491 334004 337484 340614 344419 349053 353481 356341 357206 356676 355406 353629 351665 350075 348895 347379 344964
56476 344964 342042 339408 337443 336176 335588 335415 335090 334241 332874 330972 328614 326548 325641 325429 324361 322056
56460 322056 320124 319906 320580 320713 320603 321564 323443 324498 323624 321481 319469 318590 319132 320288 320145 317175
56444 317175 312049 307223 304647 304350 305103 305710 305741 305572 305669 305580 304186 301441 299029 298392 298905 299212 299643 301713
56426 301713 305482 309065 310958 311498 311690 311796 311619 311314 311395 312397 314630 317770 320744 322631 323683 324944
56410 324944 327102 330304 334646 340033 345920 352057 358951 366559 373164 377161 379788 384268 391937 400676
56396 400676 407729 412765 417382 422687 428255 432942 435959 437391 438083 438907 440032 441030 441498 441264 440335 439076
56380 439076 438030 437017 434953 431220 426560 421866 416898 411190 405270 399620 393356 385720 378177 372887
56366 372887 369416 365207 359304 353358 348636 344355 339741 335563 332590 330343 328466 327625 327917 327985 327049
56351 327049 326371 327260 328907 329737 329955 331029 333326 335838 337997 340391 343675 347648 351372 353677 353880
56336 353880 352523 350950 349695 347982 345402 343243 343167 345068 347272 348685 350053 353190 359413 368398 378162
56321 378162 386480 392629 397325 400859 402207 400579 397008 393538 391279 389933 388766 387339 385620 384072
56307 384072 383471 384163 385675 387298 388683 389650 390055 390348 391708 395008 399998 405845 412002 418009 422962
56292 422962 425968 427035 427068 427074 427654 429051 431340 434469 438222 442169 445972 449986 455141 461617 468001 472657
56276 472657 475748 478992 483525 489013 494841 500922 507105 512947 518496 524210 529717 533893 536811 540409
56262 540409 546208 553243 559339 563887 568302 573987 580896 588221 595792 604224 613744 623302 631476 638414
56248 638414 646142 656363 668630 681513 694766 708960 723575 737173 749471 761709 774876 789001
56236 789001 804176 820550 837093 852113 865460 878606 892184 905290 917779 931201 946403
56225 946403 962212 977738 994203 1012863 1032657 1051801 1070659 1091219 1114456 1139878 1167194
56214 1167194 1196924 1229585 1265531 1305476 1350246 1400102 1454800 1513929 1576975 1643978 1716594
56203 1716594 1797333 1886932 1983661 2086269 2196410 2316864 2448264 2589072 2738146 2895789
56193 2895789 3062458 3237586 3419656 3606555 3795880 3985360 4172603 4354171 4525581
56184 4525581 4682662 4822257 4941385 5037088 5107952 5154743 5178601 5179520 5157624 5115090 5055735
56173 5055735 4983079 4899449 4806288 4704608 4595683 4481637 4364554 4244927 4122222 3997162
56163 3997162 3871683 3746110 3618384 3487246 3354333 3221867 3090164 2959120 2830360
56154 2830360 2705753 2585022 2466988 2352351 2243300 2141063 2045614 1957083 1875590 1800212
56144 1800212 1729793 1664285 1603799 1547154 1493139 1442594 1397321 1357310 1320793 1286747 1255557
56133 1255557 1227373 1201618 1178236 1157944 1140979 1126705 1114568 1104457 1096189 1089414 1083883 1079157
56121 1079157 1074507 1069818 1066000 1063836 1063084 1063362 1064939 1067905 1071835 1077328 1086455 1100157 1116311 1131973
56107 1131973 1146641 1161841 1178519 1196597 1216252 1237713 1260246 1282926 1306130 1331010 1357957
56096 1357957 1386688 1417059 1448653 1480535 1512710 1546868 1584382 1624638 1666725 1711497 1760462
56085 1760462 1813939 1872112 1936565 2008754 2088184 2174324 2269393 2376961 2498333 2632008 2775530
56074 2775530 2925510 3076515 3222285 3358028 3480492 3587356 3678897 3759083 3832338 3899451
56064 3899451 3958323 4007353 4045614 4070832 4080449 4074744 4056675 4028905 3992768 3949136 3897472 3834347
56052 3834347 3755377 3658887 3546386 3420581 3285203 3145727 3007586 2873916 2746726 2628880
56042 2628880 2522391 2426036 2337608 2257668 2188282 2129134 2077972 2033926 1997076 1965616 1937140
56031 1937140 1912408 1894297 1883124 1876319 1872536 1872621 1876395 1881854 1887967 1895329 1903989 1913511 1925068
56018 1925068 1940224 1957449 1972870 1984727 1994353 2002901 2010253 2017135 2025074 2034029 2042922 2052566 2065120
56005 2065120 2080773 2097901 2116314 2137343 2161046 2186431 2213988 2244805 2277774 2311123 2346104
55994 2346104 2385445 2428708 2472877 2516933 2561897 2607126 2650963 2694528 2740366 2787813 2834311
55983 2834311 2880755 2930510 2983370 3035806 3087267 3140938 3198030 3256697 3317098 3382171 3452856
55972 3452856 3527752 3607822 3695890 3791105 3889778 3992261 4103028 4223230 4349466 4480625
55962 4480625 4619268 4765116 4914227 5066472 5227092 5398920 5579713 5769034 5970522
55953 5970522 6184872 6407712 6637445 6878491 7133811 7401016 7679072 7972188 8283734
55944 8283734 8612638 8958880 9326120 9715974 10126286 10557724 11015052 11499471 12007670
55935 12007670 12541552 13110500 13720178 14367127 15048139 15766420 16524375 17319314 18151308
55926 18151308 19026950 19950925 20922942 21947966 23040201 24211577 25465378 26805852
55918 26805852 28243805 29787193 31437006 33198547 35086242 37111958 39281063 41606928
55910 41606928 44117239 46840027 49797993 53024578 56570967 60489046 64823274 69628275
55902 69628275 74977695 80947309 87610038 95059741 103421104 112828862 123426623 135402209
55894 135402209 148997158 164468633 182076450 202116879 224910545 250718385 279686413
55887 279686413 311765827 346309042 381324799 413101795 437029814 449422286 449034618
55880 449034618 437177631 416631914 390430060 361207412 331030028 301376191 273185061
55873 273185061 246989882 223050215 201408974 181934340 164412306 148638426 134441969
55866 134441969 121672810 110205204 99943398 90800128 82675177 75464556 69075339
55859 69075339 63417507 58394534 53917122 49917587 46340258 43127857 40227800 37602108
55851 37602108 35220112 33048920 31059723 29235267 27561827 26020236 24591932 23266522
55843 23266522 22035991 20888294 19813609 18809982 17875551 17001090 16176675 15399892 14671320
55834 14671320 13987611 13344960 12743737 12183361 11657104 11157167 10680420 10224939 9786496
55825 9786496 9363475 8960002 8579195 8218051 7873302 7546796 7240252 6950158 6673201
55816 6673201 6411767 6168766 5941758 5727543 5527938 5345368 5176978 5018616 4870469
55807 4870469 4732807 4599859 4464335 4325697 4188488 4054735 3923271 3794413 3670106
55798 3670106 3550713 3435813 3326508 3223162 3122767 3022301 2922807 2826793 2734000 2643273
55788 2643273 2555992 2473607 2394111 2315053 2237991 2166002 2098842 2034670 1974570 1920918 1872658
55777 1872658 1826410 1781291 1738854 1699403 1662174 1628283 1599789 1576294 1555586 1537063 1521654
55766 1521654 1509213 1498815 1490667 1484929 1479565 1472230 1463345 1454493 1444774 1431683 1414911 1396446 1377420
55753 1377420 1357325 1335774 1312749 1287786 1261063 1234438 1209386 1185048 1160375 1136687 1115556
55742 1115556 1095687 1074872 1053900 1035369 1019325 1003161 985486 967199 949015 930753 913179
55731 913179 898052 886069 876634 869568 865126 862580 860743 859687 860295 862424 865251 868850 873540 878044
55717 878044 880101 878585 873497 864596 851824 836449 819989 802728 785094 769518 758584 751778
55705 751778 746311 740731 735467 730123 722707 711964 698643 684221 669870 656523 644254 631541
55693 631541 616714 600256 584479 571107 560410 552246 546386 542060 538532 535813 533648 530490 525017
55680 525017 517951 510694 502995 493948 484548 476882 471087 465568 460220 456873 456035 455517 453228 449459 445366
55665 445366 440768 434697 427090 418885 411042 404125 398218 392769 387096 381449 377033 374521 372899 370158
55651 370158 365145 358760 353360 350687 350341 350740 351465 353741 358382 364341 369780 373378 374047 370820 364232
55636 364232 356706 350331 345080 340140 335746 332360 329259 325592 321982 319518 317989 316756 316574 318697
55622 318697 322720 327082 331362 336438 342674 349607 357110 365295 373387 380139 385178 388695 390336 389903
55608 389903 388726 388611 389581 390191 389797 388865 387307 384282 379786 374873 370151 365439 360844 356846 353370
55593 353370 350221 348252 348541 350309 351276 350305 348387 346941 346490 347113 348689 350396 351201 351098 350779 350096
55577 350096 348144 344950 341747 339349 337326 334820 331035 325174 317384 309780 304793 302123 298838 292984
55563 292984 285689 279123 273710 268231 261680 254203 246758 240376 235346 230908 226206 221414 217291 213702
55549 213702 209499 203850 197003 189900 183789 179924 178603 178576 178280 177502 177061 177297 177920 178897 180215 181117
55533 181117 180917 180287 180286 180235 178086 173031 166516 160585 156342 153846 152273 150242 147266 144618 143511 142857
55517 142857 140500 136416 132810 131086 130590 130347 130008 128925 126478 123880 123480 125430 126980 126107 124033
55502 124033 123055 123591 124743 126262 128267 130023 130598 130246 129858 129417 127987 125074 121319 117984 116093 115733
55486 115733 115994 115858 115037 113455 110462 105744 100672 97250 95715 94670 93655 93817 95604 97720 99081
55471 99081 100142 101330 101850 101318 101082 102342 104031 104211 102910 102047 102865 104832 106990 109158 111526 113846
55455 113846 115547 116459 117161 118397 120163 121774 123120 125112 128183 131157 132875 134340 137542 142396 146553
55440 146553 148412 148513 147665 145574 142023 137763 133334 128417 123109 118458 114929 111636 107927 104401 101604
55425 101604 99078 96532 94521 93067 91088 88176 85513 83900 82419 80373 78974 79516 81145 82223
55411 82223 82791 83829 84925 84672 82909 80822 79053 77270 75368 73659 71993 69974 67974 66798 66537
55396 66537 66788 67697 69555 71468 71650 69282 65389 61806 59809 59530 60096 60527 60794 61611 62954 63663 63033
55379 63033 61771 60678 59488 58010 57302 58347 60423 62236 63864 66044 68086 68323 66542 64439 63539
55364 63539 63845 64538 64843 64226 62776 61385 60663 59854 57819 54842 52410 51392 51528 52487 54250 56524
55348 56524 58835 61145 63378 64623 64061 62513 61709 62021 62257 61710 60885 59909 57881 54577 51520 50342
55332 50342 50934 52140 53570 55682 58329 60177 59869 57456 54464 52450 51465 50212 47844 45192 43760
55317 43760 43985 45102 46364 47544 48402 48596 48208 47731 47466 47442 47677 47848 46942 44233 40595 37929 37082
55300 37082 37182 37214 37362 38453 40778 43917 47164 49699 50807 50478 49690 49831 51787 55395 59450 62328
55284 62328 63051 61852 59559 56676 53378 50092 47404 45427 43717 41848 39777 37752 36244 35727 36150
55269 36150 36869 37509 38502 40231 42024 42686 41850 40161 38397 37081 36694 37432 38783 39973 40676 40701 39430
55252 39430 36560 33308 31815 33116 36288 39635 41999 43050 43164 43232 43954 45102 45790 45275 43111 39179
55236 39179 34494 31391 31482 33556 34829 34328 33610 34050 35120 36005 37278 39739 42668 44599 45257 45596
55220 45596 46244 46943 47330 47433 47381 47304 47533 48379 49655 50725 51059 50621 49896 49631 50287 51531 52610 53320
55202 53320 54237 55718 57214 57888 57524 56396 54810 53416 53429 55399 57807 57999 55128 51347 49356 49394
55186 49394 49708 49591 50360 52758 54867 54064 50449 46817 45257 45306 45706 46422 47930 49670 50515 50204 49249
55169 49249 47777 45534 42891 40925 40413 41260 42722 43635 42870 40385 37737 36859 38451 41943 46437 50825
55153 50825 53543 53562 51687 49911 49450 50230 52110 55360 59676 63714 66081 66287 64683 62262 60492 60388
55137 60388 61344 61679 60602 58972 57925 57559 57386 57336 57720 58510 59130 58888 57570 55714 54123 52900 51462
55120 51462 49872 49465 51185 53909 55636 56034 56441 57451 57964 56949 54857 52848 51704 51851 53296 55048
55104 55048 55698 55079 54423 54340 53746 51468 48059 45334 44755 46606 49824 52220 51980 49717 48033 48414 49506
55087 49506 49197 47230 44734 42265 39800 37946 37614 38601 39745 40516 41493 43250 45595 48047 50381 52537
55071 52537 54385 55741 56524 57044 58053 59998 62069 62712 61424 59417 58220 58361 59741 62154 64738
55056 64738 65968 65305 64136 64037 64842 65517 66175 67867 70838 74405 78223 82244 85681 87633 88845 91215
55040 91215 95109 98599 99990 99894 100051 101181 102835 104489 105770 106126 105203 103260 100606 97160 93264 90332
55024 90332 89603 90506 91390 91859 93157 95807 98070 97782 95121 92426 91475 91954 92690 93264 93894 94590 95223
55007 95223 95886 96340 95526 92675 88773 85917 84992 84917 84469 83990 84652 86628 88762 89824 89559 88579 87622
54990 87622 86914 86082 84691 82848 81144 80103 79919 80496 81231 81063 79577 78122 78748 81624 84408 84788
54974 84788 82951 80896 80058 80502 81905 84187 87106 90091 92635 94446 95216 94769 93521 92423 92291 93256
54958 93256 94757 95951 96400 96597 97616 100036 103386 106709 109305 110883 111577 112079 113100 114304 114463 113236
54942 113236 112097 112579 114114 114730 113747 112739 113549 116215 119217 121109 121433 120458 118730 116831 115145 113577
54926 113577 111690 109419 107536 106952 107327 107000 104943 102434 101780 103409 105300 105632 104949 104959 106045 106981
54910 106981 106775 105794 105059 105040 105378 105496 105392 105773 107111 108722 109386 108910 108298 108188 108128 107907 108501 110691
54892 110691 113479 115075 115211 115512 117742 122430 129006 136442 143702 150137 155601 160082 163671 167166 172092
54877 172092 179623 189897 202574 217102 231961 244947 255493 265588 276876 287578 294064 295070
54865 295070 292446 287845 280709 270090 256621 241784 226517 211523 197981 186863 178101 171126
54853 171126 165678 161500 157890 154319 151153 149070 147942 146795 144856 142400 140632 140774 143003 146195
54839 146195 149076 151669 155259 160762 167572 174258 180280 186847 195962 208299 221955 233788 242348
54826 242348 248955 255394 261267 264474 263742 259461 252379 242851 231517 219427 207076 194293 181341
54813 181341 169132 157990 147263 136715 127381 120400 115676 112352 109952 108405 107446 106727 106257 106147
54799 106147 106061 105319 103556 101192 99285 98730 99254 99422 98161 96017 94268 93114 91723 89933 88714 88735
54783 88735 89548 90475 91217 91247 89746 86748 83411 80556 77791 74660 71684 69613 68529 68337 69306 71395
54767 71395 73881 76323 78918 81201 81629 79631 77037 75993 76226 75923 74781 74436 75939 78461 80747
54752 80747 82521 84028 85343 86692 88622 91314 94189 96528 98146 99335 100489 101774 102879 103330 103369
54737 103369 103989 105476 106754 107226 108661 113601 121957 130713 137258 141540 144728 147603 151225 157543 167710
54722 167710 180519 193880 207329 221876 237770 253701 268089 279999 288783 293959 295770 295079
54710 295079 292416 287784 281541 274718 268133 261795 255482 249313 243428 237685 232143 227395 223932 221569
54696 221569 219832 218524 217458 216189 214719 214087 215371 218171 220918 222816 224752 228167 233766 241602
54682 241602 251658 263736 277174 291296 305935 321218 337066 353294 369789 386123 401158
54671 401158 413485 422171 426779 426854 421852 411570 396385 377230 355707 334070 314618 298695 286041
54658 286041 274863 262759 248401 232781 218423 206921 197680 189409 182076 176605 173083 170303 166969
54645 166969 162664 157811 153495 151052 150801 151057 149340 144816 139003 134064 131144 130318 131062 132387 133302
54630 133302 133559 133535 133408 133186 133463 135022 137432 139165 139619 140010 141611 144039 146114 147643 149440 152004
54614 152004 155033 157965 160428 162429 164553 167619 171826 176637 181696 187133 192657 197263 200470 203022
54600 203022 205641 207903 209280 210564 213115 217063 221164 224127 225294 224566 222649 221048 220777 221281 221438
54585 221438 221160 221085 221274 221565 222922 226875 233366 240442 246382 251169 255739 261029 268121 278035 290608
54570 290608 304407 318376 332910 348788 365786 382929 399406 414552 427489 437555 444817 449520
54558 449520 451226 448968 442192 431372 418018 404217 391594 380208 368764 356339 343591 331849
54546 331849 321355 310900 299176 286102 272864 260959 251131 243037 235901 229393 223566 218010 211697
54533 211697 204107 196206 189721 185443 182487 179208 174662 169213 163900 159352 155360 151565 148220 145895
54519 145895 144501 143145 141058 138186 134838 131362 128482 127235 127842 128944 128608 126113 122327 118556 115539
54504 115539 113393 111832 110208 107970 105503 104146 104913 107277 109551 110387 109666 108039 106099 104193 102646
54489 102646 101641 101001 100492 100404 101420 103716 106497 108716 110024 110782 111363 111821 112051 111926 111368 110662 110672
54472 110672 112337 115906 120844 126383 131870 136807 141096 145334 150469 157023 164853 173536 182547 191239
54458 191239 199333 207477 216607 226542 235785 242951 247731 250203 250068 247224 242477 236932 231035 224819
54444 224819 218563 212330 205225 196284 186127 176820 169771 164525 159894 155446 151353 147377 142878 137788
54430 137788 133055 129872 128464 127662 125884 122817 119963 119008 119677 119861 118023 114895 112429 111693 112351 113724
54414 113724 115620 118192 121449 124861 127274 127703 126705 126438 128459 131701 133575 133124 132082 132622 135053
54399 135053 138248 141403 144430 147015 148315 147743 145593 142816 140450 139104 138607 138093 136708 134334 131605
54384 131605 129308 127812 126850 125802 124402 123176 122765 122836 122291 120803 119399 118981 118948 118174 116903 116658 118286
54367 118286 120915 123010 123773 123384 122545 122139 122799 124369 125937 126728 126966 127827 130408 134502 138436 140500
54351 140500 140658 140297 140271 140189 140044 141195 144549 148777 151915 154122 157091 161131 164882 168028 172057 177646
54335 177646 183286 187578 191199 195111 198251 198725 196530 193537 191240 189817 189049 188851 189022 189327 189665 189480
54319 189480 187623 183732 179225 175805 173368 170476 166533 162371 158902 156384 154838 153987 152770 150063
54305 150063 146106 142337 139763 138305 137621 137534 137591 137288 136974 137580 139210 140903 142076 143310 145334 147959
54289 147959 150447 152311 153468 154231 155441 158049 162164 166820 170752 173077 173468 172496 171790 172938 175831
54274 175831 178702 179965 179464 177837 175501 172569 169120 165186 160923 156874 153509 150496 147169 143804
54260 143804 141601 141218 142114 143460 144768 145345 144136 140709 135735 130134 124461 119346 115475 112587 109475
54245 109475 105678 102379 100921 101186 102159 103232 104051 103858 102219 100048 98738 98372 97761 96290 94883 94848
54229 94848 96324 98188 99296 99596 99822 100104 99400 96937 93803 91982 91855 91918 91222 90538 90466 90083 88770
54212 88770 87954 89287 91967 93725 93987 94218 95362 96776 97808 98703 99575 99912 99659 99574 100129 101103 102558
54195 102558 104950 107965 110532 112447 114638 117190 118606 117937 116293 115120 114263 113105 112436 113332 114917
54180 114917 115156 113678 112056 111326 111035 111019 112284 115208 118185 119111 117477 114275 110676 107586 105750 105340
54164 105340 105772 106629 108270 110880 113533 115099 115683 116251 117102 117680 117746 117755 117999 118215 118075 117370 115806 113500
54146 113500 111696 111820 113490 114406 112837 109581 107007 106690 108266 109951 109832 107395 104293 102923 103835
54131 103835 105224 105393 104670 104168 103707 102256 99894 98018 97672 98590 99852 100733 101061 101338 102260 103610 104089
54114 104089 102949 101153 100037 99512 98669 97483 96415 94834 91664 87539 84553 83513 83055 81968 80806
54099 80806 80466 80619 80560 80452 80704 80905 80324 78919 77142 75394 74210 74247 75458 77040 78677 80942 83718
54082 83718 85314 84192 80905 77264 74262 71922 70582 70887 72549 74290 75241 75625 75903 76015 75731 75291
54066 75291 75309 76170 77693 79477 81492 83975 86488 87671 86802 85173 84760 85593 85878 84863 83905 84021 84172
54049 84172 83222 82184 82851 85100 87184 88112 88275 88152 87978 88385 89844 91449 91547 89687 86993 84699 83324
54032 83324 83115 84143 85956 88128 91039 95098 99455 102749 105044 107665 110943 113438 113846 112572 110941
54017 110941 109748 109044 108668 108553 108907 110147 112133 113816 114494 115116 117122 120134 122164 122263 121543 121212 121048
54000 121048 120514 120067 120414 121397 122541 123992 126049 128392 130526 132495 134587 136939 140094 145198 152659
53985 152659 160960 167721 171884 174388 176846 180124 184052 188071 192087 196811 203041 210598 218409 225728
53971 225728 232659 239315 245281 250446 255732 262165 269520 276442 281781 285397 287871 289869 291716 293316
53957 293316 294552 295728 297173 298337 297907 295255 291343 287723 284931 282210 278531 273555 267857 262505
53943 262505 258236 254855 251692 248504 245431 242164 238124 233746 230484 228845 227258 223924 219238 215315
53929 215315 213393 212673 211674 209778 207282 204640 202077 199648 197438 195619 194074 191977 188489 184327 181800
53914 181800 182294 184170 184387 182135 179580 178853 179700 180763 181802 183188 183947 182168 177819 173762 172933 175077
53898 175077 177347 177825 177334 177426 177835 177053 175013 173818 175343 179046 182922 186034 189164 193061 197148 200434
53882 200434 203001 205776 209172 212776 216411 220595 225515 230335 234314 238151 243284 249995 257184 264059
53868 264059 270864 277643 283464 287749 291476 296023 301363 306458 310920 315138 319134 322646 326392 331943
53854 331943 339847 348702 356518 362468 367202 372129 378415 385923 393021 398210 401968 406059 410924 414882
53840 414882 416288 415336 413134 410047 405917 401220 397016 393920 391662 389386 386017 380770 373734 365712
53826 365712 357335 348792 340415 332722 325698 318949 312850 308378 305224 301257 294854 286868 279273 272668
53812 272668 266228 259480 252762 246319 240206 234938 230993 227594 222980 216198 208089 200435 194577 190627
53798 190627 187514 184022 180248 177519 176331 175114 172044 167489 163400 160716 158772 157130 156333 156489 156535
53783 156535 155617 154238 153412 153430 154024 155043 156302 157289 157602 157421 157219 157267 157537 157654 156893 154826 152185 150511
53765 150511 150660 152123 153918 155547 156884 157903 158919 160539 162894 165377 167498 169488 171717 174106
53751 174106 176589 179564 183232 186893 189585 191199 192413 193814 195729 198705 203329 209495 216418 223536
53737 223536 230941 238796 246721 254001 260183 265327 269844 274087 277928 280801 282491 283767 285702 288217
53723 288217 289866 289478 287632 286017 285588 286004 286621 287201 287453 286776 285053 283095 281654 280355 278247 274996
53707 274996 270831 265781 260037 254905 252107 251809 252376 252418 252032 251579 250507 248334 245829 243968 242316 239587
53691 239587 235394 230345 224846 219193 214601 212549 212703 212682 210487 206324 201720 197759 194709 192461 190632
53676 190632 188819 187374 187361 189168 191608 193101 193421 193635 194557 195930 197068 197733 198223 198930 199932 200926
53660 200926 201544 201763 201924 202320 202995 204014 205703 208503 212703 218233 224402 229968 234032 236993 240062
53645 240062 243609 246654 248343 249223 250369 251858 253032 254003 255733 258423 260803 261613 261268 261368 262857
53630 262857 265270 267711 269990 272557 275652 278819 281265 282597 283254 284141 285750 287642 288985 289682 290724
53615 290724 293243 297150 300797 302031 299872 295512 291618 290149 290636 290983 289990 288450 287497 286875 285732
53600 285732 284332 283609 283422 282787 281852 281929 283179 283997 283500 282951 283395 283441 281267 277876 276236 277492 279972
53583 279972 281996 283821 286337 289380 292029 293514 293370 291791 290248 290696 293619 297772 302132 306833 311625
53568 311625 314900 315490 314539 314346 315910 318649 321959 325768 329786 333470 336971 341294 347193 354298 361379
53553 361379 367156 371026 373460 375632 378400 381840 385909 391011 397301 403901 409610 414296 418912 424196
53539 424196 429962 435704 441279 446857 452567 458332 463770 468312 471736 474503 477260 480090 482542 484263
53525 484263 485192 485373 485042 484831 485312 486383 487541 488698 490128 491637 492504 492556 492711 493928 495908 497335
53509 497335 497286 496015 494353 492772 491343 490438 490972 493441 496867 499326 499932 499794 500508 502053 503069 503160
53493 503160 503826 506576 510902 515000 518141 521322 525510 530242 534503 538290 542446 547154 551584 555265
53479 555265 559062 564216 570841 577982 584890 591543 598057 604397 610933 618524 627576 637529 647884 659318
53465 659318 672970 688601 704300 718393 731169 744277 758778 774408 790761 808407 828276
53454 828276 850317 873595 897813 923977 952941 983798 1014493 1043934 1072796 1102281 1132885
53443 1132885 1164591 1197466 1231481 1266210 1301296 1336951 1373557 1410975 1448648 1486124 1522988
53432 1522988 1558562 1592372 1624954 1657647 1691303 1725453 1758841 1790570 1820705 1850104 1879839
53421 1879839 1910611 1942506 1975195 2008201 2040989 2073114 2104486 2135254 2165152 2193246 2218773
53410 2218773 2242016 2263793 2284191 2302365 2317623 2330060 2339886 2346859 2350833 2352302 2351717 2348570 2341885
53397 2341885 2331606 2318886 2304974 2290352 2275041 2259006 2241840 2222667 2201024 2177655 2153875
53386 2153875 2130328 2106849 2083313 2059800 2035913 2010783 1984159 1956957 1930362 1904857 1880523
53375 1880523 1857729 1836992 1818552 1802534 1789021 1777305 1765709 1753150 1740728 1730783 1724425 1720932
53363 1720932 1719454 1720047 1722661 1726343 1730254 1734804 1741148 1750144 1762304 1777880 1796188 1815574 1835059
53350 1835059 1855587 1878668 1904206 1930879 1958497 1988528 2021896 2057452 2093482 2130076 2169147
53339 2169147 2212375 2259726 2309865 2361473 2414115 2468267 2524658 2583543 2644615 2707621 2772816
53328 2772816 2840569 2910607 2981992 3053927 3126393 3199841 3274304 3348974 3422585 3494034 3562605
53317 3562605 3627924 3689964 3748977 3805083 3857904 3906849 3951670 3992236 4027713 4056573 4077973
53306 4077973 4092774 4102594 4107924 4107710 4100818 4087331 4068140 4043719 4013770 3977936 3936490 3890269
53294 3890269 3840175 3786759 3730014 3669508 3604997 3537174 3467642 3397855 3328158 3258294 3188764
53283 3188764 3121067 3056313 2994175 2933747 2874872 2817795 2761795 2705376 2648217 2592102 2539308
53272 2539308 2490524 2444713 2400624 2357882 2316983 2278811 2243944 2211960 2181555 2151822 2123330
53261 2123330 2097556 2075267 2055757 2037422 2018712 1998736 1977553 1956070 1935355 1915906 1897791
53250 1897791 1881228 1866605 1853939 1842901 1833474 1826124 1821079 1817855 1815873 1815269 1816739 1820727 1827055
53237 1827055 1835187 1844445 1854060 1863587 1873568 1885494 1900701 1919300 1940352 1962936 1986859 2012566
53225 2012566 2040700 2071580 2104558 2137906 2170001 2200804 2231531 2262475 2291920 2317839 2340152
53214 2340152 2360434 2379808 2398058 2414537 2428727 2439692 2446148 2447696 2445257 2439832 2431405 2419485
53202 2419485 2404075 2385582 2364381 2341114 2316973 2292895 2268649 2243191 2215816 2186551 2155665
53191 2155665 2123302 2089391 2053530 2015146 1974193 1931646 1888991 1847397 1807529 1769763 1734034
53180 1734034 1699725 1666243 1633739 1602850 1573693 1545395 1516787 1487527 1458679 1432077 1408800
53169 1408800 1388075 1367938 1347041 1325517 1304197 1283740 1264833 1248416 1234801 1222801 1210524
53158 1210524 1197169 1183683 1171541 1161099 1151241 1140581 1128982 1117582 1107119 1096565 1084038
53147 1084038 1068871 1052073 1034961 1018334 1003000 989770 978376 967437 956076 944686 933570
53136 933570 922014 909513 896874 884993 873412 861159 848275 835424 822741 810205 798347
53125 798347 787372 776371 764785 753759 744366 735303 724472 712435 701918 693833 686255 677871
53113 677871 670009 663989 658490 651305 642378 633353 624929 616375 607353 598702 591294 585080 579408 573675
53099 573675 567567 561195 555100 549796 545194 540612 535396 529570 523900 519070 514568 508825 501005 492328
53085 492328 484806 478932 473589 468166 463555 460688 459038 457167 454107 449925 445524 442157 440362 439114
53071 439114 436714 432761 428487 424944 421775 418123 413694 408488 402497 396425 391746 389166 387668 385892
53057 385892 383813 382183 380843 378532 374160 367729 360321 353697 349363 347276 345722 342954 338731 333999
53043 333999 329661 326109 323229 320249 316194 311108 306252 302540 299554 296756 294597 293317 291613 288131
53029 288131 283888 281468 281746 282855 282679 281042 278978 277011 274996 272942 271229 270260 270229 270853 271235 270566
53013 270566 269284 268905 270225 272122 272656 271143 268728 267115 267111 268329 269915 271533 273759 277534 283038
52998 283038 289096 293791 295909 295979 295924 297418 300258 302346 301499 297481 292278 288436 287102 287494 287949 287332
52982 287332 285555 283087 280342 277495 274529 271185 267097 262244 257082 251941 246599 240888 235433 231080
52968 231080 227669 224179 220189 216570 214402 213699 213393 212084 208713 203268 197262 192933 191318 191293 190800
52953 190800 188768 185657 182544 180056 177954 175602 172988 171223 171472 173353 175036 175089 173667 171827 170459
52938 170459 170078 170731 171630 171722 171153 171397 173364 176140 178254 179373 179986 180269 180293 180766 182325 184297 185129
52921 185129 184112 182044 180340 179930 180689 181395 180609 178246 175987 175648 177548 180868 184751 188234 189999
52906 189999 189538 188163 187556 187522 186447 183966 181880 182106 184755 188631 192735 196685 200164 202599 203495 203028
52890 203028 202241 202317 203536 205324 207324 209599 211582 212119 211409 211599 214056 216982 217465 215381 213457 213729
52874 213729 215775 218485 221641 225189 228506 231086 232817 233308 232380 231532 233146 237414 241691 244084 246176
52859 246176 250623 257247 263416 267723 271208 274889 278030 279800 281289 284561 290108 296407 302068 307412
52845 307412 313403 319788 325333 329681 333723 337793 340694 341388 340715 340207 339812 338255 335469 333098 332229
52830 332229 331853 330160 326541 321831 317214 313294 309812 306116 302194 299050 297361 296154 293921 290861
52816 290861 288684 288058 287700 286478 285031 284527 284917 285342 285473 285597 285922 286459 287070 287232 286373 284867 283937
52799 283937 284144 284701 284661 283906 282569 280583 278499 277698 278872 281076 282947 284053 284354 283502 281696 280267
52783 280267 280249 281071 281781 282746 284917 288034 290866 292764 293856 294204 293928 293561 293075 291270 287572 283739
52767 283739 281969 281732 280495 277499 274647 273366 272726 271556 270423 270204 270137 268858 266492 264322 262906
52752 262906 261671 260022 257923 255714 254121 254039 255421 256744 256444 254627 252587 250992 249625 248704 249103
52737 249103 250859 252555 252871 252064 251316 251294 252083 253950 256989 260063 261323 260273 258563 258207 259536 261447
52721 261447 263002 263902 263735 261941 258837 255800 253908 252778 251207 248684 245850 243536 241617 238990 234725
52706 234725 229171 223599 218690 213915 208790 203954 200150 196763 192704 188500 185934 185394 185082 183404 180722
52691 180722 178002 175211 172181 169815 168945 168800 167983 166353 164656 162909 160608 158104 156304 155222 154141
52676 154141 152915 151693 149665 145845 141140 137808 136412 134970 131850 128021 125534 124990 125555 126565 127996
52661 127996 129812 131708 133291 134124 133963 133175 132343 131368 129791 128141 127708 128542 129053 128468 128340 130224 132849
52644 132849 133352 130923 127592 125399 124297 123232 122026 121364 121590 122220 122554 122469 122659 123958 126197 128000
52628 128000 128220 127328 126756 127045 127397 126993 125850 124187 121962 119662 118845 120857 125102 129357 131985 133337
52612 133337 134696 136321 137173 136557 135308 134825 135267 135456 134624 133548 133601 135290 138124 141304 143840 144519
52596 144519 142954 140623 139856 141448 144019 145971 147155 148176 149077 149750 151033 154067 158593 162955 166087
52581 166087 168621 171638 175201 178747 182236 185976 189616 192369 194325 196588 199729 202726 204100 203751
52567 203751 202966 202619 201896 199240 194527 189909 188018 189033 190022 187927 183083 178815 177353 177316 176002 173061
52551 173061 170410 169028 167734 165459 163092 162154 162799 164122 165623 167152 168042 167540 166025 164754 164456
52536 164456 165042 166465 168678 170678 170991 169717 168918 170029 171710 171389 168508 165136 163428 163596 164561 165697
52520 165697 167313 169903 173378 176883 179211 179713 178962 178145 177740 177252 176405 175853 176223 177133 177975 179160 181431
52503 181431 184087 185166 183894 181967 181781 184122 188235 193243 198308 201898 202455 200298 197907 197714 200043
52488 200043 203367 206013 207306 207720 208460 210431 213183 215247 215998 216601 218448 221113 222851 222958 222631 223267
52472 223267 224861 226490 227681 228724 230085 232071 234803 238041 241257 244228 247280 250547 253348 254916
52458 254916 255484 255900 256238 255582 253416 250562 248308 247143 246798 247095 248064 249266 249627 248245 245227 241700
52442 241700 239069 238185 238917 240345 241448 241810 241835 242344 243815 245822 247225 247125 245660 243787 242345 241655
52426 241655 241912 243382 245945 248844 251315 253197 254670 255675 256073 256152 256456 257090 257571 257386 256424 254897
52410 254897 253212 251987 251907 253377 256304 260029 263369 265062 264614 262752 260862 260137 261257 264293 268324
52395 268324 271574 272791 272485 272192 272602 273093 273040 272741 272858 273624 274848 276077 276593 275864 274265 272800 272022
52378 272022 271921 272950 276018 280848 285202 286660 284821 281275 277938 275879 275132 274817 273864 272265 271219
52363 271219 271555 272588 273353 274250 276348 279423 281903 282651 281793 279843 277240 274880 273923 274524 275568 276106
52347 276106 276349 276827 277339 277392 277117 277111 277685 278818 280641 283328 286453 288829 289236 287462 284665 282556 281927
52330 281927 282079 281948 281562 281848 283169 284891 286553 288614 291591 295014 297819 299427 299989 299905 299641 299810
52314 299810 300918 303060 306181 310380 315495 320554 324276 326366 327894 330064 332823 334994 335821 336050 337256
52299 337256 340210 344299 348559 352811 357412 362298 366992 371439 376009 380467 383669 384916 385234 386662
52285 386662 390276 395297 400034 403394 405534 407448 410002 413174 416217 418665 420922 423623 426730 429910
52271 429910 433719 439578 448141 458300 468431 478222 488500 499513 510377 520512 530728 542261
52259 542261 555291 569086 583246 598159 614457 632671 653184 675686 698780 720983 742283
52248 742283 763961 786812 810424 834312 858750 884034 909892 936287 963852 992751 1021874
52237 1021874 1050097 1077732 1105649 1133488 1159829 1183823 1205608 1225388 1243327 1260218 1276989
52226 1276989 1293323 1307804 1319724 1329808 1338874 1346694 1352615 1356501 1358542 1358814 1357563 1355488 1353250
52213 1353250 1350909 1348028 1344092 1338884 1332871 1327112 1322289 1318011 1313832 1310687 1310312 1313136 1317859 1323302
52199 1323302 1329571 1337063 1345603 1355189 1366429 1379333 1392629 1405329 1418302 1433181 1450207 1468201
52187 1468201 1486364 1505061 1524857 1545492 1565826 1584408 1600359 1614204 1627373 1640297 1651473
52176 1651473 1659117 1663264 1665315 1665972 1664796 1661582 1656848 1650619 1641927 1630169 1616251 1601710 1587084
52163 1587084 1571674 1554696 1536199 1516904 1497463 1477981 1458190 1438117 1418478 1400299 1384192
52152 1384192 1370146 1357803 1346620 1335852 1324824 1313538 1302870 1294004 1287549 1283111 1279603 1275951
52140 1275951 1271590 1266468 1260871 1255399 1250807 1247449 1245002 1243015 1241527 1240587 1239469 1237219 1233976 1230903
52126 1230903 1228613 1226585 1224400 1222484 1220996 1219033 1215878 1212206 1208934 1205505 1200566 1194043 1187261 1181108
52112 1181108 1175316 1169627 1164434 1159784 1154835 1149046 1143269 1138896 1136179 1133958 1130999 1127167 1123215 1119668
52098 1119668 1116192 1112217 1107917 1104123 1101242 1098799 1096249 1093580 1090704 1087026 1082357 1077689 1074161 1071617
52084 1071617 1069097 1066411 1064170 1062488 1060801 1059004 1057587 1056504 1055134 1053699 1053459 1054778 1056100 1055806
52070 1055806 1054414 1054023 1056025 1060231 1065797 1072026 1078410 1084825 1091895 1100484 1110678 1121702 1132909
52057 1132909 1144401 1156572 1169592 1183641 1199265 1217145 1237681 1261127 1287815 1317639 1349312
52046 1349312 1380759 1410671 1439290 1467452 1495380 1523158 1551843 1582866 1616071 1649362 1680730
52035 1680730 1709747 1736640 1761007 1782377 1801226 1818170 1832605 1843296 1850147 1854342 1856938 1858309
52023 1858309 1858623 1857565 1853602 1845035 1832259 1817881 1804156 1791207 1777992 1763848 1748580 1732295
52011 1732295 1715992 1701409 1689376 1678943 1668831 1659036 1650392 1643418 1638505 1636424 1637494 1640673 1644539
51998 1644539 1648913 1654652 1662149 1670979 1680696 1691009 1701360 1711371 1721716 1733626 1747377 1762007
51986 1762007 1776534 1790615 1803929 1815742 1825352 1832396 1836688 1838403 1838413 1837545 1835265 1829946 1820826 1809025
51972 1809025 1796228 1783085 1769266 1754257 1737358 1717559 1694418 1668853 1642336 1615364 1587377
51961 1587377 1558078 1528163 1498656 1470070 1442308 1414879 1387077 1358440 1329278 1300384 1272066
51950 1272066 1243859 1215418 1187247 1160135 1134103 1108253 1081492 1053149 1023316 993211 964889
51939 964889 939715 916978 894641 871638 848737 826879 805564 783603 760841 738226 716434
51928 716434 695338 674666 654254 633602 612166 590471 570180 552543 537248 523134 509477
51917 509477 496173 483184 470472 458266 446972 436927 428386 421327 415038 408401 401057 393864 387762
51904 387762 382564 377333 371469 364832 357385 349573 342734 338090 335361 333173 330770 328437 326316 323870
51890 323870 320853 317833 315395 313551 312316 311936 312044 311464 309680 307825 307259 307660 307483 306027 303977 301939
51874 301939 299552 296343 292615 288981 285606 282455 279832 278063 276792 275178 272949 270872 269903 269906 269542
51859 269542 267597 264299 260997 258514 256250 253170 249259 245495 242551 240144 237669 234950 232121 229231
51845 229231 226282 223484 221240 219884 219457 219618 219760 219356 218167 216052 212869 208995 205602 203717 202968
51830 202968 201952 200022 197949 196545 195478 194060 192526 191638 191443 191366 191366 192153 194126 196777 199215 200756
51814 200756 201042 200332 199837 200989 203886 206918 208341 208070 207710 209084 212760 217542 221106 221570 218985 215339
51798 215339 212957 212911 214860 217905 221251 224306 226617 227895 228053 227259 225940 224683 224010 224197 225064 225927
51782 225927 226094 225668 225511 226140 227115 228086 229838 233368 238081 241924 243414 242719 240736 238128 235605 234053
51766 234053 233783 234343 235467 237488 240426 243527 246198 248501 250159 250091 247871 244792 242491 241121 239873
51751 239873 238659 238158 238651 239921 241902 244327 246110 246346 245665 245325 245156 243768 240799 237560 235224 233696
51735 233696 232654 232391 233011 233878 234572 235569 237276 239153 240404 240875 240622 239407 237424 235906 236056 237609
51719 237609 239315 240613 241952 243505 244511 244368 243774 244093 245657 247354 248104 248255 248943 250382 251602 251999
51703 251999 252258 253272 254929 256559 257932 259090 259957 261088 264089 269936 277229 283467 287977 292302 297795
51688 297795 304230 310873 317437 323603 329046 334471 341350 349954 358757 366352 372784 378381 382631 385101
51674 385101 386281 386500 385148 382097 378832 376838 375657 373902 371424 369072 366827 363867 360352 357657
51660 357657 356582 356482 356394 356088 355832 355834 356139 356480 356296 355479 354964 355853 358095 360716 363201 365830 368802 371983
51642 371983 375569 379955 384607 387980 389163 389148 389975 392833 397331 402382 407421 412689 418564 424952 431609
51627 431609 438833 447267 456959 467202 477506 487997 498490 507879 515041 519877 523034 525335 527878
51614 527878 531627 535938 538431 537607 534916 532905 531908 530202 526972 523183 519452 515105 510040 505786 503523
51599 503523 502246 500111 496860 493678 491124 488375 484592 480159 476181 473046 469895 465681 460701 456580
51585 456580 454348 453074 451147 448574 446875 446619 446279 444083 440101 435797 432114 428778 425171 421233 417508
51570 417508 414681 413011 412033 410879 408986 406412 403590 401076 399390 398661 398355 397640 395969 393177 389449
51555 389449 385653 383098 382105 381201 378823 375582 373571 373504 373953 373669 373066 372813 372435 371401 370546 371165 373392
51538 373392 376494 380173 384533 389180 393386 396989 400398 404028 408331 413838 420207 425607 428133 427799
51524 427799 426366 425350 424959 424790 424504 423667 421768 418765 415164 411427 407704 404139 400877 397724 394365
51509 394365 390989 388204 386181 384336 382064 379480 377334 376439 377192 379320 382025 384599 386910 389114 391172
51494 391172 393100 395482 398999 403302 406865 408356 407948 407024 406686 406705 405931 403650 400312 396714 392789 387989
51478 387989 382902 379425 378597 379135 379200 378986 380072 382584 384789 385947 387784 391959 397320 401176 402688
51463 402688 403472 405037 407165 409130 411092 413320 414898 414363 411469 407454 403513 399819 396270 393384 391725
51448 391725 390797 389255 386257 382089 377509 373042 368995 365531 362427 359353 356647 355148 354849 354444 352914
51433 352914 350829 349202 347758 345618 343248 342092 342294 342537 342578 344106 348086 352764 355805 357385 359604
51418 359604 363539 368450 373430 378083 381786 384116 386301 390564 397439 404995 411358 416726 422242 428187
51404 428187 434282 440594 446887 451861 454377 454990 455177 455469 455459 455218 455387 455944 456068 455298 453869 451975 449775
51387 449775 448137 448207 450020 452543 455346 459111 464064 468985 472448 474206 474784 474552 473891 473512 473761 474084
51371 474084 473847 473171 472319 470801 467989 464330 461135 459248 458457 457991 457051 455072 452103 448905 446369 444980
51355 444980 444964 446357 448501 450104 450527 450597 451538 453568 456274 459726 464165 468925 472914 476160 479731 483918
51339 483918 487577 489777 491345 494077 498710 504052 507972 509080 507613 504733 501049 496320 490763 485855
51325 485855 482821 480695 476941 470093 460958 451253 442031 433609 425982 418764 411409 403917 396871 390510
51311 390510 384362 378127 372294 367424 363193 358667 353347 347778 343182 340392 338793 336529 332269 326667
51297 326667 321495 317571 314495 312232 311599 312671 313875 313563 311830 309963 308535 306880 304272 300962 297961
51282 297961 296105 295351 294985 294683 295054 296578 298221 298070 295515 291956 289059 287225 286253 286395 287831 289753
51266 289753 290978 291236 291167 291388 292231 294052 296968 300421 303663 306648 309894 313519 316967 319791 322275
51251 322275 325086 328407 331545 333461 333763 332942 331443 328859 324570 318788 312115 304380 295146 285439 277497
51236 277497 272248 268307 264233 260488 258121 256666 254815 252418 250269 248339 245748 242463 239662 238154
51222 238154 237500 236979 236562 236600 237064 237291 236232 233166 228616 224291 221566 220363 220024 220528 221777 222331 220439
51205 220439 216386 212470 210345 209542 208909 208348 208452 209283 210179 210354 209330 207351 205590 205285 206369 207672
51189 207672 208733 210508 213782 217641 220278 220726 219218 216440 213217 210518 208798 207472 205749 203834
51175 203834 202631 202446 202915 204249 207415 212458 217461 220131 220153 219082 218043 216585 214144 211671 210837
51160 210837 212130 214546 216936 218657 219051 217672 215511 214920 217260 221176 224034 224752 224416 224458 225216 226253
51144 226253 227244 228198 229329 230877 232653 233760 233301 231568 230075 230109 231445 232661 232481 230672 227851 224802
51128 224802 222145 220487 220362 221595 222983 223255 222413 221503 220928 219819 217490 214787 213255 213374 214179 214276
51112 214276 212741 209569 205831 202965 201350 200102 198825 198766 201209 205355 208942 210631 210659 209549 207510
51097 207510 205084 202997 201128 198630 195212 191428 187867 185144 184452 186561 190025 192048 191686 190796 191158
51082 191158 192195 192661 193156 195294 198997 202177 203071 201878 200110 199148 199466 200539 201367 201384 200867 200410 200355
51065 200355 200894 202056 203262 203621 203299 203824 206093 208600 208882 206649 204276 203938 205250 206378 206626 206877
51049 206877 207683 208130 207148 205270 204106 204230 204652 204680 205150 206867 208721 208828 207347 206654 208459 212061 215930
51032 215930 219665 223457 226637 228095 227824 227003 226645 226870 227449 228328 229487 230720 231806 232793 234028 235784
51016 235784 237648 238584 238134 237477 238469 241447 244696 246240 245475 243009 240064 238391 239416 242484 244901
51001 244901 244762 242974 241617 241282 241268 241431 242148 242965 243136 243427 245588 249696 253573 255368 255468 255405 256057
50984 256057 257433 259031 259723 258466 255908 254108 253798 253082 250168 246362 244693 246047 248374 249748 250544
50969 250544 252175 255150 259117 263738 268467 272084 273543 273155 272351 272384 273677 276097 279205 282325 285068
50954 285068 287881 291654 296707 302478 308110 312945 316649 319493 322564 327032 333053 339926 347345 355667
50940 355667 364672 373074 379970 386161 393176 401450 410329 419417 428978 439257 450513 463612 479411
50927 479411 497256 515161 531975 548492 565899 584067 602370 621603 643845 670290 699959
50916 699959 730850 762033 794467 830146 870639 916267 966290 1019814 1076574 1137010 1201684
50905 1201684 1270706 1343832 1421099 1502978 1589419 1678923 1769351 1859842 1951012 2042725 2132633
50894 2132633 2217977 2298080 2373615 2443677 2505283 2556170 2596686 2628273 2651244 2664919 2669023
50883 2669023 2663949 2650161 2628345 2599996 2567274 2532400 2497449 2464128 2433021 2403233 2373189
50872 2373189 2341721 2308308 2272867 2235698 2197092 2156570 2113039 2066136 2016733 1965488 1911563
50861 1911563 1853639 1791799 1727521 1662150 1596280 1530518 1465805 1402748 1341365 1281860 1225239
50850 1225239 1172863 1125481 1082720 1043433 1006686 972574 941914 915063 891391 870018 850568
50839 850568 832989 817314 804117 794508 788892 786107 784548 783854 784699 787189 790431 793782 797721 803159
50825 803159 810299 818427 826622 834598 842972 852557 863427 875040 887340 901048 916492 933000 950157
50812 950157 968940 990645 1015254 1041948 1070734 1102230 1136036 1170930 1207006 1246253 1290385
50801 1290385 1339174 1391701 1448283 1510190 1578000 1651322 1730060 1815215 1908284 2010323 2121718
50790 2121718 2242613 2373436 2515036 2668161 2832668 3007292 3190270 3380187 3576213
50781 3576213 3777629 3983025 4189788 4394303 4592653 4780966 4955135 5110707 5243726
50772 5243726 5351793 5434031 5490171 5520076 5524266 5504649 5464618 5408368 5339849 5262096 5177757
50761 5177757 5090484 5005260 4926461 4855343 4789816 4726801 4664443 4602045 4538478 4471267 4397229
50750 4397229 4313765 4219513 4114100 3997727 3871209 3736017 3593718 3445407 3292153 3136056
50740 3136056 2980207 2827377 2679362 2537817 2404696 2281039 2165911 2057623 1956025
50731 1956025 1862867 1779929 1707374 1643942 1588139 1539008 1496050 1458668 1425814 1396490 1370526
50720 1370526 1348340 1329763 1313753 1299505 1286997 1275871 1264686 1252247 1239226 1227517 1218246
50709 1218246 1210997 1204485 1197246 1188388 1178737 1170723 1165878 1162796 1158765 1153159 1147937 1145037 1144766 1146806
50695 1146806 1151198 1157766 1165780 1174910 1185818 1199474 1216517 1237307 1261714 1288849 1318132 1350772
50683 1350772 1388979 1433340 1482098 1533554 1588115 1647390 1712256 1782584 1858112 1938874 2025178
50672 2025178 2117432 2215407 2317614 2422396 2529864 2641556 2757663 2875688 2992444 3106213
50662 3106213 3216227 3321214 3419592 3510071 3590729 3658123 3708664 3740744 3754695 3751058 3730015
50651 3730015 3692517 3641204 3579943 3512608 3441989 3369625 3297052 3227167 3163299 3106560 3055224
50640 3055224 3007437 2963286 2923107 2884903 2845227 2802123 2755626 2705531 2650256 2588121 2518543
50629 2518543 2441822 2358973 2272038 2183606 2095687 2009761 1927735 1851542 1781483 1716195 1654845
50618 1654845 1598378 1547991 1503527 1464355 1431009 1404685 1385410 1371851 1362937 1358662 1359053 1363244
50606 1363244 1370071 1379012 1389975 1402556 1416244 1431375 1449149 1470413 1494733 1520976 1548581 1577914
50594 1577914 1609435 1642816 1677028 1711363 1746512 1784533 1827309 1874881 1925754 1979091 2035979
50583 2035979 2098038 2165461 2237315 2313142 2392995 2476026 2560437 2645202 2730672 2816940 2902564
50572 2902564 2985529 3064589 3138927 3207114 3267292 3318117 3359167 3390912 3414607 3431483 3441501
50561 3441501 3443557 3437582 3425739 3410853 3394340 3376486 3358111 3340841 3326206 3315523 3310219 3310873
50549 3310873 3315867 3322153 3327734 3332637 3337254 3340572 3340410 3334731 3322283 3302246 3273640 3235023 3184984
50536 3184984 3123344 3051726 2972434 2886802 2795226 2698754 2599888 2501485 2405295 2311863 2221479
50525 2221479 2134842 2052896 1976225 1904596 1837231 1773702 1714567 1660907 1613391 1571937 1536084
50514 1536084 1505237 1478660 1455806 1436875 1422671 1413526 1408460 1405676 1404086 1404238 1407628 1415242 1427132
50501 1427132 1443390 1464624 1490678 1519517 1548661 1577763 1608639 1642555 1678807 1716471 1756142
50490 1756142 1798841 1844178 1890862 1938469 1987571 2038549 2091352 2145913 2201677 2257187 2311553
50479 2311553 2366228 2424087 2486732 2553878 2625286 2701814 2784204 2872329 2966486 3068450 3180266
50468 3180266 3302349 3433378 3571771 3716921 3869325 4029672 4197346 4369648 4542865
50459 4542865 4714150 4881860 5044122 5197983 5340211 5468098 5579021 5670050 5738783 5784296
50449 5784296 5806796 5806585 5783785 5738916 5673443 5589811 5490920 5379361 5257382 5128040 4996184
50438 4996184 4867457 4746228 4635183 4536889 4454395 4389580 4341832 4309373 4291359 4287716 4297104
50427 4297104 4315832 4338789 4360768 4376958 4382846 4374045 4346317 4296215 4222368 4126281 4011591
50416 4011591 3882502 3742999 3596959 3448056 3299045 3151456 3006288 2864895 2729042
50407 2729042 2600278 2479473 2366932 2262703 2166714 2078866 1999210 1927827 1864312 1807589
50397 1807589 1756786 1712232 1674847 1644374 1619104 1597968 1582105 1573313 1571396 1574201 1580094 1589085
50385 1589085 1601381 1616184 1632536 1650284 1669520 1690055 1712279 1737701 1767488 1800941 1836424
50374 1836424 1873299 1911737 1950984 1989354 2026165 2062288 2098213 2132853 2165255 2196581 2229030
50363 2229030 2263123 2297293 2330183 2362154 2394193 2426391 2458298 2490221 2523388 2559103 2598341
50352 2598341 2641894 2690216 2743153 2800363 2861837 2927501 2996580 3068164 3142144 3218289 3294081
50341 3294081 3364887 3427306 3481617 3529891 3572295 3606345 3629331 3639969 3637501 3620634 3588333
50330 3588333 3541044 3480317 3407500 3323583 3230382 3131105 3029216 2926840 2824968 2725398 2631815
50319 2631815 2548098 2475750 2413914 2361996 2321117 2292395 2274849 2266022 2264037 2267864 2275846 2285181
50307 2285181 2293013 2297159 2295654 2286420 2267775 2239006 2200507 2153693 2100515 2042476 1980374 1915477
50295 1915477 1850407 1787810 1728368 1671115 1615524 1562172 1511508 1463433 1418458 1377935 1342472
50284 1342472 1311100 1282648 1257115 1234985 1215991 1199296 1184396 1171197 1159622 1149698 1141565 1134983
50272 1134983 1129325 1124593 1122008 1123071 1128365 1137539 1149860 1164229 1179277 1194276 1209825 1227075
50260 1227075 1246295 1266558 1286697 1306348 1326215 1347496 1370808 1395532 1420359 1444432 1467593
50249 1467593 1489645 1510081 1528680 1545819 1562031 1577601 1592395 1605432 1615010 1620508 1623953 1628318
50237 1628318 1633911 1637913 1638044 1635033 1630575 1624629 1616355 1606295 1595612 1583882 1569788 1553718 1537602
50224 1537602 1521936 1504826 1484726 1462737 1441413 1422193 1404729 1388045 1371585 1355482 1340298
50213 1340298 1326392 1313424 1300719 1288026 1275458 1262849 1249848 1236738 1224414 1213361 1203157
50202 1203157 1193233 1183609 1174542 1165809 1156723 1146707 1135773 1124589 1114088 1104825 1096663 1089134 1081832
50189 1081832 1074236 1065513 1055081 1043269 1031026 1019054 1007626 996980 987406 978974 971623 965357
50177 965357 960018 955161 950706 947438 946209 946734 947803 948531 948874 949207 950175 952666 956870 961274 963628
50162 963628 963287 961891 961477 962561 964264 965423 965196 963234 959858 955682 950807 944851 937908 930769 923884
50147 923884 916725 908581 899377 889357 878606 867455 856789 847350 839136 831906 825662 820061 813920
50134 813920 806275 797684 789669 782963 777110 771800 767744 765840 765927 766757 767052 766409 765306 764371 763717 763087
50118 763087 762486 762283 762521 762679 762483 762435 762833 762539 759500 752687 743007 732341 722300 713899 707578 702909
50102 702909 698722 693972 688273 681422 672998 663017 652508 642692 633692 624861 616314 609160 603881 599339
50088 599339 594178 588760 584930 583948 585309 587493 589225 589974 589985 590167 591451 593841 596337 598023 598915 599718
50072 599718 601272 604402 609552 615954 621816 626211 630451 636687 645227 654157 661739 668287 675381 684012
50058 684012 694063 705019 716473 728057 739509 750854 762300 774024 786222 799227 813259
50047 813259 828080 842972 857026 869465 880032 889246 898072 907047 915849 923776 930487 936142 941152
50034 941152 946007 951060 956155 960668 964208 967075 969768 972342 974760 977628 981894 987709 994218 1000665
50020 1000665 1007310 1015073 1024720 1036640 1050831 1066655 1082962 1099074 1115550 1133518 1153371 1174562
50008 1174562 1196482 1218868 1241346 1263311 1284629 1305914 1327530 1348600 1367486 1383115 1395465
49997 1395465 1404922 1411649 1415729 1417534 1417703 1416838 1415291 1413143 1410251 1406296 1400841 1393627 1385013 1375944
49983 1375944 1366968 1357281 1345472 1331541 1317582 1305816 1296364 1287619 1278532 1269671 1262122 1256307 1252049
49970 1252049 1249036 1246796 1244877 1243481 1243546 1245755 1249810 1254974 1260986 1268105 1276506 1285887 1295464 1304240
49956 1304240 1311716 1318597 1326436 1336282 1347881 1360276 1372600 1383988 1393360 1399879 1403375 1403933 1401497
49943 1401497 1396402 1389879 1383205 1376464 1368734 1359594 1349956 1341311 1334389 1328485 1321820 1312581 1299913 1283923
49929 1283923 1264811 1242490 1217323 1190709 1164193 1138071 1111346 1083018 1053092 1022482 992412
49918 992412 963949 937776 914230 893434 875008 857758 840455 823350 808130 795630 784217
49907 784217 771426 756821 742131 728784 716497 704427 692536 681368 671356 662802 655880 650112
49895 650112 644306 637414 629267 620511 612319 606000 601959 598862 594743 589291 584078 580192 576749 572573
49881 572573 568233 565176 563515 562143 560803 560605 562265 565006 567738 570448 573860 578283 583358 588591
49867 588591 593778 599155 605458 613413 622896 632810 642023 650061 656819 662278 667133 673112 681735 692698
49853 692698 704050 714018 722391 730426 740067 752944 769076 786364 802265 816359 830562 846733
49841 846733 865245 886271 910860 939304 969577 999256 1028567 1059618 1092648 1125089 1154878
49830 1154878 1182869 1210808 1238378 1263746 1286221 1306835 1326595 1345419 1362807 1378545 1392605
49819 1392605 1404998 1415840 1425058 1431993 1435568 1434762 1428722 1416859 1399370 1377396 1352159 1324205
49807 1324205 1293833 1261788 1228937 1195603 1161904 1128423 1095778 1063740 1031585 999407 968442
49796 968442 939918 913982 889740 866101 842778 820748 801424 785113 770668 757002 744344
49785 744344 733389 723838 714628 705109 695177 684695 673838 663673 655238 648067 640590 631963 622700
49772 622700 613724 605830 599882 596235 593865 591220 588144 585811 584559 583042 580138 576625 574246 573835
49758 573835 574886 576292 576951 576256 574598 573074 572464 572858 574230 576635 579674 582643 585462 588629 592016
49743 592016 594695 596427 598349 601517 605645 610009 614832 620757 627408 633504 638326 642452 647046 652834
49729 652834 659654 666692 673214 679239 685368 691988 699014 706395 714398 723409 733946 746858 762764
49716 762764 781209 801043 821781 843857 867411 891592 915246 937577 958016 976273 992702
49705 992702 1007776 1021157 1032204 1041444 1050275 1059102 1067221 1074797 1083192 1092509 1100545 1105399 1107534
49692 1107534 1107782 1104675 1095698 1080434 1060703 1038105 1013141 986421 959079 931920 905510 880975
49680 880975 859371 840240 822194 805083 790405 779192 770538 762628 754553 746799 740476 736259 733718
49667 733718 731741 729772 728088 726453 723440 718185 712158 707800 705735 704652 703628 702875 702188 700488 697690
49652 697690 695566 695764 697815 699881 700729 700162 698236 695140 691758 689560 689639 691846 694848 697077 698013 698550
49636 698550 699852 701963 703923 705067 705597 705957 706388 707273 709154 712033 715123 717646 719592 721511 723804
49621 723804 726387 728805 730634 732023 733810 736774 740854 745402 750007 754584 758822 762198 764626 766613
49607 766613 768679 770961 773284 775191 776003 775499 774522 774315 775086 775706 774957 772740 769930 767447 765588 763978
49591 763978 762031 759449 756225 752262 747582 743077 740409 740580 742995 746322 749637 752243 753253 752401 750682
49576 750682 749182 747796 746144 745061 745646 747121 747288 745199 742058 739447 738068 738267 740156 742826 744953
49561 744953 746734 749859 755026 760956 766501 772175 778599 784999 790711 797076 806117 817693 829177 837817
49547 837817 842626 844552 845875 849141 855702 865092 876148 888251 901149 914349 927549 941134 955471
49534 955471 970200 984919 999955 1015656 1031566 1047305 1063738 1082159 1102647 1124246 1146453
49523 1146453 1169382 1192697 1215647 1238228 1261307 1285592 1311450 1339755 1371630 1406967 1444125
49512 1444125 1481551 1518905 1556331 1593561 1630429 1667590 1706009 1746036 1787353 1829436 1871698
49501 1871698 1913719 1955954 1999869 2046762 2096384 2147095 2197337 2246720 2295803 2345241 2395195
49490 2395195 2445393 2495533 2545450 2594795 2642693 2688037 2730195 2769109 2804754 2836980 2866007
49479 2866007 2892530 2916815 2938014 2954947 2967417 2976276 2982292 2985641 2986598 2985997 2984562 2982273 2978880
49466 2978880 2974634 2969982 2964978 2959814 2955748 2954467 2956311 2959909 2963901 2968251 2973566 2980091 2988115 2998530
49452 2998530 3011905 3027449 3043853 3060726 3078162 3095324 3110967 3125371 3140258 3156291 3171972
49441 3171972 3185613 3197172 3207256 3215487 3221059 3224093 3225007 3222938 3216298 3204950 3190555 3174326 3155435
49428 3155435 3132176 3104039 3072023 3037364 3000572 2961540 2919984 2875670 2828518 2778715 2726740
49417 2726740 2673309 2619275 2565473 2512445 2460205 2408312 2356381 2304647 2254030 2205452 2159079
49406 2159079 2114346 2070786 2028722 1989006 1952070 1917338 1883761 1850993 1819711 1790443 1762328
49395 1762328 1733869 1705145 1678402 1655739 1636732 1619189 1601830 1585247 1570503 1557989 1547785
49384 1547785 1539890 1533577 1527431 1520671 1513880 1507954 1502919 1498228 1493736 1489955 1487803 1488273 1491618 1496463
49370 1496463 1500639 1503513 1506835 1512484 1520066 1527649 1534378 1541323 1549974 1560936 1574200 1589933 1608615
49357 1608615 1630449 1654444 1677999 1698004 1713022 1724134 1733409 1742172 1751196 1761477 1773573 1786798
49345 1786798 1800350 1814913 1831786 1850658 1869763 1888466 1908190 1930292 1954189 1978260 2001577
49334 2001577 2024105 2046107 2068143 2090853 2113944 2135983 2155908 2174156 2191645 2208416 2224226
49323 2224226 2239787 2256113 2272807 2288276 2301783 2314266 2326906 2339915 2353150 2367086 2382379
49312 2382379 2398896 2415834 2432633 2449356 2466292 2483531 2500895 2518145 2535352 2553136 2572259
49301 2572259 2592874 2614499 2636850 2660245 2684904 2710366 2736149 2762674 2791006 2821848 2855146
49290 2855146 2890312 2926333 2962123 2997598 3034157 3073214 3114462 3156546 3199291 3244032 3291723
49279 3291723 3342074 3394799 3450118 3507458 3565286 3623351 3683538 3747183 3812896 3878688 3944947
49268 3944947 4013216 4083064 4152750 4222552 4294587 4369091 4443538 4516244 4588378 4661274 4734030
49257 4734030 4805444 4876345 4947906 5018828 5086270 5148935 5207535 5262738 5314291 5361899 5405498
49246 5405498 5444754 5479334 5509426 5534982 5555043 5568960 5577790 5583115 5584942 5582328 5575736 5567043
49234 5567043 5557117 5545125 5530606 5514712 5498778 5483122 5467989 5454382 5442871 5432527 5422284
49223 5422284 5412890 5406411 5403943 5404580 5406739 5409947 5415243 5424082 5436842 5452188 5468004 5483035 5497569
49210 5497569 5512490 5527958 5543044 5556396 5567044 5574668 5579223 5580305 5577058 5568811 5555565 5537626
49198 5537626 5515019 5487668 5455985 5420740 5382384 5340869 5295967 5247356 5194636 5137971 5078695
49187 5078695 5018494 4957805 4895700 4831734 4767292 4704557 4644451 4586243 4529016 4472858 4418292
49176 4418292 4365007 4311805 4257978 4204255 4152002 4101877 4053870 4008414 3966388 3927665 3890569
49165 3890569 3853574 3817120 3783087 3752783 3725979 3701513 3678180 3655371 3633679 3614715 3599591
49154 3599591 3587535 3576540 3565300 3554008 3543508 3534461 3527350 3522539 3520005 3519332 3520074 3521902 3524563
49141 3524563 3528031 3532620 3538596 3545845 3554132 3563385 3573416 3583747 3594095 3604706 3615976 3628346
49129 3628346 3642741 3660078 3679769 3699802 3719281 3739658 3762238 3785737 3808131 3829923 3853232
49118 3853232 3878094 3902321 3925249 3949090 3975756 4004544 4034046 4064401 4096168 4128545 4160369
49107 4160369 4191926 4224374 4258133 4292971 4328863 4365504 4401699 4436533 4470780 4506018 4542724
49096 4542724 4580193 4618015 4656532 4695953 4735876 4775705 4815016 4853639 4891873 4930239 4968503
49085 4968503 5005213 5038696 5068288 5094333 5117585 5139036 5159672 5179770 5198932 5217354 5236386
49074 5236386 5257129 5279094 5301018 5322471 5343733 5364576 5384231 5402478 5419890 5436903 5453299
49063 5453299 5468685 5483114 5497180 5511500 5525775 5538489 5548313 5556082 5564440 5575066 5587192 5599313
49051 5599313 5611090 5622599 5633026 5641676 5649513 5658007 5666787 5674054 5679144 5683079 5686501 5688595 5688545 5686942
49037 5686942 5685182 5684197 5684047 5684102 5683583 5682545 5682164 5683268 5684851 5685175 5684176 5683515 5684297 5686208 5689109 5693824
49021 5693824 5700555 5707846 5714139 5719475 5724833 5730637 5736808 5743516 5750833 5758111 5764518 5769783 5773685 5775379
49007 5775379 5774164 5770522 5765456 5759021 5750397 5739283 5726327 5712164 5696812 5680051 5661750 5641747
48995 5641747 5620046 5597220 5573894 5549686 5523378 5494486 5464080 5433617 5403480 5373249 5343020
48984 5343020 5313679 5285837 5259045 5232297 5205035 5177505 5150307 5123830 5098169 5073536 5050575
48973 5050575 5029955 5011547 4994371 4977747 4962269 4949005 4937654 4926246 4913188 4899315 4887337
48962 4887337 4879260 4874712 4871732 4868799 4865888 4863874 4863297 4863931 4865417 4867857 4871356 4875279 4878677 4881576
48948 4881576 4885075 4889897 4895532 4901254 4907157 4913471 4919614 4924781 4928857 4931741 4932566 4930943 4928412 4926908
48934 4926908 4925976 4923305 4918036 4911547 4904550 4895545 4883212 4868513 4852994 4836342 4817113 4794767 4769653
48921 4769653 4742023 4712487 4682458 4652599 4621659 4588464 4554188 4520827 4488058 4453746 4417441
48910 4417441 4381284 4347223 4315157 4284307 4254742 4226851 4200670 4176555 4155543 4138361 4124723
48899 4124723 4113995 4105872 4100201 4096889 4096178 4098326 4103030 4110007 4119951 4133837 4151342 4171136 4192720
48886 4192720 4216535 4242205 4268318 4294432 4321753 4351176 4382106 4413911 4447079 4481951 4517712
48875 4517712 4553833 4591295 4631050 4672249 4713463 4755062 4799010 4846709 4898130 4952571 5009054
48864 5009054 5066293 5123523 5181343 5240939 5302726 5366561 5432822 5502149 5574274 5648195 5723433
48853 5723433 5800154 5878067 5956259 6034391 6113179 6193236 6274025 6354389 6433838 6512874 6592005
48842 6592005 6670622 6747179 6820757 6892058 6962098 7030057 7093622 7151762 7205955 7257975 7307661
48831 7307661 7353897 7396581 7436075 7471463 7501177 7525114 7544489 7559622 7569569 7574178 7574848 7572635
48819 7572635 7566963 7556967 7542856 7524958 7502436 7474197 7440587 7403102 7362521 7318215 7269360 7216125
48807 7216125 7159372 7099600 7036509 6969610 6899083 6825940 6751467 6676776 6602825 6530201 6458427
48796 6458427 6386098 6312502 6238843 6167072 6097740 6029969 5963404 5898933 5837171 5777509 5719465
48785 5719465 5664104 5613081 5566755 5524168 5484726 5449086 5418312 5392814 5372257 5356086 5343825
48774 5343825 5335111 5329739 5327759 5329331 5334329 5342150 5352229 5364801 5380672 5399957 5421550 5444421
48762 5444421 5469036 5496649 5527389 5559900 5592820 5625706 5658423 5690676 5722516 5754413 5786376
48751 5786376 5817809 5848714 5880174 5913029 5946835 5980891 6015561 6051644 6088924 6126345 6163371
48740 6163371 6200302 6237427 6274712 6312263 6350325 6388769 6427114 6465051 6502494 6539309 6575624
48729 6575624 6612071 6649045 6685872 6721595 6756487 6791852 6828110 6863978 6897839 6929184 6958343
48718 6958343 6985509 7010557 7033284 7053304 7070062 7083362 7093505 7100512 7103524 7101434 7093829 7080932
48706 7080932 7062900 7039645 7011131 6977233 6937359 6890835 6837986 6780529 6720571 6659209 6596208
48695 6596208 6530911 6463281 6394084 6324319 6254694 6185567 6117100 6049408 5982750 5917676 5854781
48684 5854781 5794339 5736544 5682111 5632018 5586323 5543953 5504412 5469138 5440085 5417220 5398638
48673 5398638 5383345 5372683 5368423 5370417 5376889 5386276 5397833 5411009 5425380 5441118 5458667 5477809
48661 5477809 5497727 5518031 5539249 5562203 5587334 5614555 5643232 5672227 5700473 5727662 5754013
48650 5754013 5779441 5803465 5826042 5847837 5869252 5889575 5907546 5922765 5936366 5950421 5966709
48639 5966709 5985719 6006536 6027718 6048449 6068967 6090056 6112382 6136294 6161892 6189136 6218118
48628 6218118 6249343 6283461 6320524 6359786 6400563 6443208 6488922 6538477 6591401 6646591 6703590
48617 6703590 6762977 6825358 6890192 6955956 7021546 7087260 7154211 7222889 7292313 7360311 7424353
48606 7424353 7482472 7533953 7579299 7619244 7653673 7681566 7701830 7713907 7717673 7713147 7700339 7679071
48594 7679071 7648951 7609816 7562142 7506607 7443356 7372426 7295061 7213788 7130605 7045564 6957753
48583 6957753 6867129 6774569 6680490 6584623 6487320 6389992 6293710 6198181 6102866 6008469 5916335
48572 5916335 5826648 5738298 5650608 5564228 5479986 5397892 5317886 5240794 5167587 5098078 5031250
48561 5031250 4966581 4904162 4843773 4785061 4728705 4676055 4627110 4579920 4532803 4486325 4442264
48550 4442264 4401385 4363272 4327690 4294735 4263657 4232750 4200773 4167845 4134800 4102281 4070510
48539 4070510 4039348 4008529 3978310 3949747 3923702 3899750 3876812 3854668 3833869 3814275 3794941
48528 3794941 3775669 3757445 3740848 3725158 3709807 3695633 3683809 3674318 3666515 3660519 3656910 3655410
48516 3655410 3654949 3654896 3655334 3656234 3657312 3658797 3661519 3665961 3671768 3678373 3685675 3693924 3703234 3713322 3723655
48501 3723655 3733960 3744693 3756510 3768962 3780216 3788786 3795262 3801660 3809210 3817515 3825663 3833335 3840782
48488 3840782 3848533 3857346 3867707 3878994 3889753 3899098 3907368 3915180 3922468 3928874 3934476 3939519 3943818
48475 3943818 3947138 3950000 3953524 3958392 3964407 3971033 3977884 3984652 3991041 3997120 4003413 4010374 4018010 4026228
48461 4026228 4035273 4045414 4056470 4068167 4080819 4095035 4110799 4127634 4145946 4167218 4192198
48450 4192198 4219594 4247568 4276098 4306842 4340923 4377978 4417331 4458714 4501446 4544134 4586030
48439 4586030 4628008 4671545 4717229 4764724 4813476 4862849 4912173 4961336 5010971 5061553 5112875
48428 5112875 5164909 5218332 5273321 5328380 5381512 5432413 5482546 5532948 5582672 5629539 5671952
48417 5671952 5709721 5743345 5772639 5796393 5813805 5825895 5834571 5840187 5841255 5836956 5828685 5818343
48405 5818343 5806262 5791866 5775218 5756598 5735607 5712112 5687216 5661568 5633498 5600770 5563812
48394 5563812 5525224 5486245 5445759 5402921 5358649 5313993 5268886 5223230 5177521 5131632 5084489
48383 5084489 5035894 4987332 4940107 4893866 4847797 4802063 4757150 4713011 4669936 4629242 4592012
48372 4592012 4557940 4526324 4497319 4471203 4447366 4425218 4405434 4389056 4375848 4364595 4354598
48361 4354598 4345795 4337820 4330072 4322574 4315850 4310028 4304804 4300167 4296525 4294287 4293844 4295578 4299223 4303453
48347 4303453 4306749 4308594 4309537 4310498 4312444 4316143 4321591 4327914 4334246 4340302 4345930 4350942 4355825 4361659
48333 4361659 4368586 4375356 4381388 4388321 4398183 4410574 4422987 4433547 4442193 4449483 4455731 4461359 4466760
48320 4466760 4471513 4474610 4475632 4474842 4472052 4466529 4458341 4448952 4439958 4431771 4423898 4416078 4408760 4402669
48306 4402669 4398031 4394186 4390147 4385722 4381713 4378760 4376372 4373577 4370089 4366484 4363792 4363358 4366284 4372071
48292 4372071 4378464 4383687 4388349 4394136 4401088 4407431 4411840 4414593 4416642 4418748 4421557 4425332 4429430 4432941
48278 4432941 4435743 4438059 4439349 4438956 4437654 4437038 4437277 4436832 4434539 4430512 4424860 4417307 4408644 4400808 4394538
48263 4394538 4388340 4380757 4372369 4364444 4356804 4348333 4338612 4327727 4315236 4300829 4285559 4271183 4258462
48250 4258462 4246992 4236208 4225476 4213713 4200308 4186437 4174357 4165240 4158452 4152787 4147574 4142709
48238 4142709 4138587 4136105 4135908 4137581 4140352 4144476 4150914 4159613 4169258 4179281 4191068 4206326 4224752
48225 4224752 4244086 4262264 4278912 4294948 4311386 4328599 4346209 4363254 4378656 4391832 4403085
48214 4403085 4413287 4422870 4430920 4435382 4434565 4428594 4419157 4407659 4393849 4376440 4354821 4329605 4301558
48201 4301558 4270677 4236867 4200995 4164295 4126705 4086781 4043745 3998757 3953439 3907969 3861820
48190 3861820 3815821 3771738 3729548 3686760 3641353 3594262 3547956 3503565 3460772 3419807 3381745
48179 3381745 3346682 3313206 3280354 3248904 3219838 3192381 3164754 3136514 3108918 3082836 3057417
48168 3057417 3031428 3005075 2979458 2954539 2928785 2901086 2872136 2843349 2815122 2786939 2758650
48157 2758650 2730561 2702330 2672965 2642356 2612010 2583678 2557764 2533522 2510199 2487276 2464053
48146 2464053 2439998 2415576 2391891 2369219 2346433 2322378 2297517 2273651 2251939 2231628 2211230
48135 2211230 2190818 2172449 2157888 2146341 2135227 2123073 2110773 2099800 2090166 2080890 2071774 2063646
48123 2063646 2057044 2051663 2047382 2045020 2045538 2048767 2053214 2056983 2058840 2058841 2058342 2059206 2062540 2068054 2074675
48108 2074675 2081742 2089340 2097506 2105486 2112263 2117846 2123613 2130927 2139569 2148023 2155257 2161674 2168108 2174582
48094 2174582 2180618 2186293 2192089 2197856 2202805 2206841 2211152 2216956 2224112 2231468 2238273 2244665 2250910 2256742
48080 2256742 2261579 2265126 2267676 2270078 2273341 2277942 2283424 2288871 2293682 2297752 2301260 2304851 2309760 2316758
48066 2316758 2324889 2332211 2338221 2344482 2352186 2360183 2366683 2372140 2378830 2387886 2398431 2409714 2422151
48053 2422151 2435532 2447912 2457619 2465276 2472539 2479698 2485976 2491618 2498022 2505777 2513960 2521637 2529029
48040 2529029 2536969 2546164 2557351 2571242 2587711 2605567 2623606 2641718 2660776 2681680 2704514 2728355
48028 2728355 2751951 2774928 2798077 2822053 2846239 2869640 2892715 2917195 2943956 2971880 2999114
48017 2999114 3024704 3048810 3072149 3095643 3119936 3144762 3169239 3193077 3216951 3241455 3266338
48006 3266338 3291106 3315722 3340283 3364572 3388439 3412174 3436122 3460410 3485501 3512503 3542391
47995 3542391 3574945 3608274 3638543 3659998 3666729 3655985 3630014 3594172 3553383 3510448 3466711
47984 3466711 3423060 3380249 3339060 3300219 3263569 3227447 3189596 3149058 3106942 3065283 3025328
47973 3025328 2986722 2947962 2907567 2865085 2821098 2776330 2731029 2685318 2639737 2595099 2552005
47962 2552005 2510581 2470320 2430026 2388515 2345760 2302931 2260914 2219376 2177799 2136735 2097130
47951 2097130 2058737 2020308 1981478 1943546 1908095 1875416 1844643 1814995 1786551 1760106 1736561
47940 1736561 1716218 1698352 1681464 1664250 1646543 1629366 1613953 1600563 1588351 1576485 1565061
47929 1565061 1554562 1544822 1535386 1526752 1520180 1515833 1512144 1507673 1502748 1498375 1494253 1489047 1482276 1474803
47915 1474803 1467567 1460931 1455293 1451221 1448562 1446277 1443612 1440837 1438457 1436275 1433756 1430879 1428046 1425298
47901 1425298 1422144 1418245 1413968 1410074 1406914 1404089 1400980 1397482 1393946 1390431 1386481 1381884 1377237 1373437
47887 1373437 1370927 1369828 1370291 1372010 1373596 1373322 1370740 1367068 1363863 1361751 1360574 1360273 1361216 1363883 1368452
47872 1368452 1374651 1381841 1389298 1396509 1403316 1409981 1417092 1425143 1433983 1442880 1451277 1459284 1467261 1475202
47858 1475202 1482691 1489117 1493736 1495928 1495753 1493840 1490458 1485238 1478194 1470350 1462590 1454442 1444916 1434227
47844 1434227 1423636 1413775 1404065 1393714 1382350 1369703 1355783 1341550 1328443 1316925 1306348 1296392
47832 1296392 1287548 1279798 1272012 1263526 1255436 1249411 1245834 1243899 1242846 1242144 1241103 1239726 1239699 1243108 1249858
47817 1249858 1257485 1263946 1269576 1275709 1282456 1288971 1295370 1302889 1311941 1321144 1329015 1335940 1343540 1352251
47803 1352251 1360449 1366251 1369616 1372015 1374334 1375724 1374706 1370937 1365482 1359535 1353343 1346448 1338442 1329067
47789 1329067 1317895 1304673 1290078 1275472 1261522 1247570 1232845 1217884 1204188 1192850 1184140
47778 1184140 1178003 1173847 1169914 1164156 1156343 1148526 1142883 1139650 1137644 1136117 1135361 1135944 1138100 1141789
47764 1141789 1146800 1152748 1159163 1165442 1170819 1174853 1178033 1181241 1184520 1187198 1189451 1192670 1197622 1203231
47750 1203231 1208017 1211854 1215260 1217804 1218567 1217720 1216327 1214874 1213164 1211440 1210240 1209196 1207349 1204891
47736 1204891 1203395 1203991 1206289 1209448 1213299 1218010 1223545 1229981 1237711 1246875 1257131 1268168 1279840
47723 1279840 1291608 1302676 1313051 1323873 1336306 1350556 1366143 1382522 1399196 1415818 1432499
47712 1432499 1449534 1466663 1483213 1499079 1514825 1530567 1545487 1558858 1570822 1581668 1590957
47701 1590957 1597955 1602579 1605331 1606522 1605935 1603201 1598393 1592384 1586453 1581110 1575397 1567884 1558316 1547742
47687 1547742 1537118 1526600 1516220 1506465 1497876 1490720 1485191 1481255 1478189 1475125 1472368 1471453 1473509
47674 1473509 1478064 1483676 1489155 1494262 1500046 1508602 1521398 1537430 1553850 1568795 1582860 1597656
47662 1597656 1614096 1632399 1652449 1673325 1693544 1712669 1731802 1751667 1771097 1788290 1802707
47651 1802707 1814710 1824162 1830514 1833857 1834879 1834141 1832069 1829044 1824676 1817668 1807374 1794909 1781758
47638 1781758 1767921 1752579 1736002 1719457 1703508 1687793 1672454 1658634 1647342 1638630 1631805 1625727
47626 1625727 1619210 1612163 1606140 1602726 1601470 1600530 1599253 1598928 1600882 1605035 1610683 1617548 1625528 1634248
47612 1634248 1643537 1653840 1665709 1679279 1694339 1710351 1726202 1740633 1753334 1765148 1776897
47601 1776897 1788349 1798505 1806438 1811684 1814238 1814476 1812871 1809727 1805351 1800212 1794483 1787629 1779046 1768866
47587 1768866 1757397 1744032 1727814 1709229 1690458 1673429 1658387 1644760 1632440 1621465 1611134
47576 1611134 1600538 1589944 1580829 1574286 1569753 1565603 1560847 1556026 1552222 1549284 1545537 1539576 1531973
47563 1531973 1524556 1518193 1512011 1504819 1496506 1487659 1478398 1468100 1456091 1442201 1426573 1409017 1388774
47550 1388774 1365511 1340862 1318212 1299800 1284076 1266956 1245968 1222362 1199040 1177544 1157641
47539 1157641 1138755 1120631 1103037 1085933 1069941 1055959 1044277 1034549 1026538 1020232 1015238 1010644
47527 1010644 1005722 1000412 995042 989922 985357 981683 979024 977111 975503 973838 971753 968790 964684 959779
47513 959779 954958 951099 948668 947668 947597 947354 945713 942423 938687 935994 934433 932629 929374 924748 919475
47498 919475 913969 908524 903846 900591 898572 897002 895392 893764 892366 891718 892612 895151 897840 898428 895836
47483 895836 890730 884222 876769 868542 860148 852488 846078 840611 834970 827906 819262 810415 802855 796436
47469 796436 789883 782922 776618 771281 765378 757455 748173 739328 731582 724393 717720 712356 708462 704915
47455 704915 700535 695233 689666 684507 680309 677362 675179 672707 669516 666358 664120 662721 661573 660591
47441 660591 659989 659456 658525 657688 658080 659782 661352 661652 661376 662084 664304 667402 670747 673908 675999 676171
47425 676171 675038 674612 676376 680107 684756 689528 693789 697152 700418 705403 712655 720144 725358 728237
47411 728237 730822 734516 739108 744182 749743 755072 758548 759412 758751 758008 757411 756607 756007 756567 758610 761616
47395 761616 764854 767623 769275 769730 769740 769997 770180 769583 768494 768081 768707 769201 768358 766773 766536 769164 774332
47378 774332 780646 787027 792920 797776 801425 805084 810970 820154 831365 842589 853340 864561 876740
47365 876740 889334 901992 915156 929176 943862 959325 976289 994943 1014300 1033379 1052374
47354 1052374 1071807 1091040 1108577 1123691 1136954 1149187 1160510 1170517 1178871 1185464 1190132 1192322
47342 1192322 1191183 1186332 1178650 1169870 1161071 1151933 1141746 1130728 1119820 1109441 1098984 1087466
47330 1087466 1074325 1059778 1044887 1031307 1020591 1013431 1009363 1007020 1004870 1002256 999820 998434 997741
47317 997741 996574 994945 994459 996091 998719 1001014 1003889 1009420 1017699 1026448 1033912 1040561 1047428 1054266
47303 1054266 1060353 1065948 1071681 1076986 1080355 1081007 1079426 1076301 1071743 1065634 1058066 1049188 1039055 1027784
47289 1027784 1015429 1001660 986044 969002 952043 936580 922520 908423 893056 876591 860246
47278 860246 845144 831750 820088 809909 800489 790751 780101 769075 758794 749718 741335 733223
47266 733223 726039 720989 718301 716650 714324 710910 707606 705856 705899 706774 707514 707962 708483 709366 710852 713316
47250 713316 716810 720477 723057 724162 724621 725290 725915 725635 724365 723194 723403 725372 728393 731224 732926
47235 732926 733589 734257 735805 737865 739298 739767 740343 742327 745970 750615 755537 760148 763854 766511 768892
47220 768892 772120 776754 782908 790938 801116 812702 824325 835583 847392 860338 873470 885311
47208 885311 895526 905002 914798 925622 937759 950675 962975 973634 983174 992885 1002951 1012068
47196 1012068 1018999 1023740 1027031 1029445 1031346 1033206 1035290 1037069 1037354 1035266 1031143 1026377 1022090 1017902
47182 1017902 1012377 1004803 996030 987281 978727 969903 960986 952831 945971 940499 936688 934668 933436 931342
47168 931342 927941 924456 922057 920562 919351 918659 919181 921086 924244 929059 936169 945413 955681 965736
47154 965736 974872 983063 990961 999576 1009463 1020320 1031649 1043395 1055402 1066633 1075787 1082690 1088364
47141 1088364 1093554 1097792 1100215 1100831 1100564 1100196 1099607 1097999 1094799 1090344 1085688 1081627 1077968 1073934 1069233
47126 1069233 1064508 1060751 1058604 1058234 1059386 1061294 1063042 1064663 1067681 1073799 1082897 1093019 1102703 1112685
47112 1112685 1124748 1139523 1156419 1175230 1196365 1219280 1242084 1263566 1284674 1307060 1330850
47101 1330850 1354896 1378614 1402257 1425582 1447550 1467633 1486355 1504126 1520366 1534336 1546180
47090 1546180 1556447 1564805 1569843 1570389 1567033 1562213 1558416 1556074 1553552 1549385 1543957 1538513 1533283 1527554
47076 1527554 1521131 1514578 1508089 1501242 1494036 1487244 1481610 1477427 1474853 1473730 1473140 1472112 1470794 1469953
47062 1469953 1469579 1469370 1470420 1474638 1481989 1490064 1497076 1503720 1511142 1518660 1524779 1529122 1531905 1532503 1530140
47047 1530140 1525417 1519786 1513898 1507355 1499428 1489060 1475102 1457819 1439414 1421763 1404389 1385973
47035 1385973 1366859 1348269 1329873 1310360 1290178 1271483 1255128 1239756 1224366 1209853 1197157
47024 1197157 1185500 1173556 1161266 1149545 1139208 1130953 1125436 1122357 1120284 1118356 1117616 1119692 1124497
47011 1124497 1130120 1134849 1138697 1143004 1148930 1156325 1163781 1169916 1174721 1179466 1185301 1192381 1200405 1209384
46997 1209384 1219463 1230315 1240998 1250267 1257006 1260856 1262734 1264418 1267341 1271830 1277395 1283375 1289329
46984 1289329 1295243 1301560 1308723 1316658 1324998 1333685 1342970 1352885 1363138 1373373 1383148 1391964 1400096
46971 1400096 1409213 1421145 1435884 1451486 1466059 1479083 1490774 1501343 1511322 1521666 1532772 1544059
46959 1544059 1555044 1566307 1578758 1592441 1606616 1620612 1634195 1647558 1661420 1676576 1692732
46948 1692732 1708190 1721253 1731620 1739912 1746400 1750946 1753773 1755301 1755292 1753024 1748404 1742226 1735260 1727828
46934 1727828 1720570 1714827 1711513 1709816 1707702 1703908 1699094 1694937 1692416 1691398 1691624 1693340 1696563 1700359
46920 1700359 1703674 1706931 1712037 1720459 1731768 1744381 1757375 1771032 1785804 1801319 1816596 1831026
46908 1831026 1844925 1859228 1874735 1891604 1909350 1927294 1945220 1963760 1983824 2005162 2025799
46897 2025799 2043726 2059316 2075044 2092290 2109289 2123125 2133020 2140563 2147370 2153952 2160585 2167527
46885 2167527 2173991 2178428 2180559 2182054 2184525 2187851 2191131 2194158 2196943 2198840 2199582 2200699 2204384 2210954
46871 2210954 2218519 2225261 2230975 2236227 2241094 2245402 2249593 2254669 2261457 2270225 2280711 2292179 2303681
46858 2303681 2314773 2326003 2338348 2351948 2365648 2378025 2388794 2398864 2409049 2419078 2428035
46847 2428035 2435206 2439912 2440831 2436437 2426576 2413226 2399329 2386770 2375304 2363139 2348689 2332194
46835 2332194 2315657 2300901 2287820 2275076 2262359 2251147 2243156 2238904 2238151 2240910 2247347 2257227 2270159
46822 2270159 2286038 2304658 2325289 2347365 2371327 2398027 2427160 2456840 2484967 2510839 2535334
46811 2535334 2559538 2583235 2604838 2623153 2638971 2654334 2670145 2685407 2699085 2711639 2723856
46800 2723856 2735129 2744344 2752098 2760509 2770619 2781331 2791381 2801248 2812382 2825548 2840889 2858796
46788 2858796 2879346 2901056 2921516 2939634 2956317 2972537 2987644 3000329 3010514 3019221 3026835 3032599
46776 3032599 3036037 3037777 3038477 3037698 3034635 3029471 3023163 3016094 3007818 2998156 2987828 2977813 2968657 2960624
46762 2960624 2953953 2948642 2944405 2941203 2939593 2940255 2943416 2948958 2956864 2967203 2979742 2993914 3009342
46749 3009342 3026309 3045543 3067339 3090836 3114358 3136464 3156507 3174194 3189189 3201486 3211600
46738 3211600 3219677 3224716 3225388 3221555 3214322 3204610 3192403 3177569 3160785 3143364 3126467 3110468 3094709
46725 3094709 3077904 3059363 3039857 3020905 3003334 2987059 2971950 2958008 2944740 2931426 2918241
46714 2918241 2906243 2895992 2887009 2878856 2871764 2865706 2859790 2853236 2846286 2839496 2832827 2826126 2819909
46701 2819909 2814931 2811362 2809026 2808055 2808761 2811193 2815286 2820992 2827857 2835037 2842273 2850290 2859574 2869327
46687 2869327 2878460 2887205 2896955 2908675 2922181 2936692 2951370 2965500 2979003 2992722 3007527 3023026
46675 3023026 3037674 3050275 3061009 3070935 3080717 3089882 3097207 3102082 3105575 3109695 3115366 3121575 3126858
46662 3126858 3130998 3134760 3138564 3142354 3146573 3152216 3159609 3167630 3174478 3179246 3182723 3186790 3192949 3201348
46648 3201348 3211070 3220876 3229334 3234940 3237154 3237090 3235936 3232769 3225421 3213712 3200013 3185727 3168970
46635 3168970 3147223 3121019 3093272 3065756 3037986 3009027 2978663 2946820 2913405 2878935 2844270
46624 2844270 2809678 2775067 2740934 2708101 2676736 2646663 2618203 2591464 2565120 2537413 2508461
46613 2508461 2480332 2454759 2432004 2411796 2393823 2377180 2360947 2345853 2333911 2325817 2319961 2314631
46601 2314631 2309940 2306823 2305367 2305113 2306118 2308740 2313039 2319210 2327976 2339774 2354095 2370291 2388388
46588 2388388 2408444 2429670 2451017 2472166 2493222 2513812 2533247 2551193 2567465 2581499 2592779
46577 2592779 2601625 2608728 2614004 2616663 2616633 2615376 2614929 2616347 2619258 2622838 2626954 2632305 2639639 2649229 2661209
46562 2661209 2675941 2693647 2714038 2736785 2762007 2789636 2818536 2847085 2874503 2900759 2925323
46551 2925323 2947122 2965856 2982101 2995477 3003705 3004380 2997253 2984232 2967579 2948442 2926520 2900600
46539 2900600 2869986 2835942 2801200 2767488 2734036 2699163 2662740 2626253 2590887 2556649 2523372
46528 2523372 2491606 2462045 2434596 2408516 2383353 2359412 2337040 2315624 2293782 2270906 2248150
46517 2248150 2227180 2208038 2189065 2169124 2148995 2130053 2112369 2094926 2077258 2060052 2044259
46506 2044259 2030285 2018003 2006992 1996699 1986813 1977638 1969883 1964068 1960227 1958006 1956825 1956089 1955558
46493 1955558 1955554 1956636 1959037 1962412 1966078 1969646 1973620 1979195 1986962 1995916 2004313 2011631 2019033 2027746 2037662
46478 2037662 2047979 2058502 2069564 2081056 2092468 2103979 2116832 2132254 2150205 2169511 2189213
46467 2189213 2209541 2231341 2254691 2278694 2302928 2328370 2356075 2385300 2414010 2441290 2468322
46456 2468322 2496786 2527328 2559832 2594034 2629137 2663705 2696851 2729096 2761394 2793831 2825789
46445 2825789 2856577 2885028 2909231 2927972 2942155 2953716 2963278 2969975 2973561 2975388 2976846 2977718 2976678
46432 2976678 2972831 2966278 2957735 2948251 2938948 2930356 2921876 2912274 2900827 2887877 2874209 2860007 2844500
46419 2844500 2826714 2806524 2784886 2762839 2740291 2715938 2688509 2658052 2625834 2592920 2559022
46408 2559022 2523006 2484458 2444360 2404087 2364250 2324958 2286745 2250399 2215862 2182036 2148015
46397 2148015 2114220 2082125 2053231 2028362 2007569 1990421 1976511 1965705 1957835 1952506 1949669 1950073
46385 1950073 1954470 1962497 1973038 1985492 1999746 2015049 2030257 2045476 2062077 2080342 2098300 2113987
46373 2113987 2127967 2142426 2158300 2174545 2189836 2203643 2215494 2224551 2230592 2234892 2239572 2246042
$$ [...]
##END NTUPLES=NMR SPECTRUM
##END=
