
##TITLE=AC1116_Cauca1_5835603_bxzCjDc94Z
##JCAMPDX= 6.0         $$ Bruker NMR JCAMP-DX V2.0
##DATA TYPE= NMR SPECTRUM
##DATA CLASS= NTUPLES
##ORIGIN= BRUKER
##OWNER= Administrator
$$ 1.72 TOPSPIN		Version 2.1
$$ 2012-04-16 19:07:33.312 -0500  Administrator@TOPSPIN
$$ Compression mode = diff/dup
##.OBSERVE FREQUENCY= 400.13188235
##.OBSERVE NUCLEUS= ^1H
##.ACQUISITION MODE= SIMULTANEOUS (DQD)
##.ACQUISITION SCHEME= undefined
##.AVERAGES= 8
##.DIGITISER RES= 22
##SPECTROMETER/DATA SYSTEM= spect
##.PULSE SEQUENCE= zg30
##.SOLVENT NAME= COFFEE_meoh
##.SHIFT REFERENCE= INTERNAL, COFFEE_meoh, 1, 14.98061
##AUDIT TRAIL= $$ (NUMBER, WHEN, WHO, WHERE, PROCESS, VERSION, WHAT)
$$ ##TITLE= Audit trail, TOPSPIN		Version 2.1
$$ ##JCAMPDX= 5.01
$$ ##ORIGIN= Bruker BioSpin GmbH
$$ ##OWNER= Administrator
$$ $$ C:\Bruker\TOPSPIN/data/COFFEE/nmr/AC1116_Cauca1_5835603_bxzCjDc94Z/20/pdata/1/auditp.txt
$$ ##AUDIT TRAIL=  $$ (NUMBER, WHEN, WHO, WHERE, PROCESS, VERSION, WHAT)
(   1,<2012-04-15 16:38:26.828 -0500>,<Administrator>,<TOPSPIN>,<go>,<TOPSPIN 2.1>,
      <created by zg
	started at 2012-04-15 16:37:20.218 -0500,
	POWCHK enabled, PULCHK disabled,
       configuration hash MD5:
       1A 1E CE 29 27 FD 77 03 67 4E F0 E3 C4 B2 CB 90
       data hash MD5: 64K
       04 9A 48 85 E7 14 2D DA C8 34 DE 7A E3 54 F1 AC>)
(   2,<2012-04-15 16:38:29.531 -0500>,<Administrator>,<TOPSPIN>,<proc1d>,<TOPSPIN 2.1>,
      <Start of raw data processing
       efp LB = 0 FT_mod = 6 PKNL = 1 PHC0 = 0 PHC1 = 0 SI = 32K 
       data hash MD5: 32K
       3C EA 67 37 8C 89 43 58 A3 DE 61 CA 47 EA 0C 1F>)
(   3,<2012-04-15 16:38:29.937 -0500>,<Administrator>,<TOPSPIN>,<proc1d>,<TOPSPIN 2.1>,
      <pk PHC0 = 214.964 PHC1 = 0 
       data hash MD5: 32K
       06 C2 40 15 EB 19 0A 29 2C 11 05 F5 6B 12 D0 55>)
(   4,<2012-04-15 16:38:30.031 -0500>,<Administrator>,<TOPSPIN>,<proc1d>,<TOPSPIN 2.1>,
      <abs ABSG = 1 
       data hash MD5: 32K
       C4 B1 0D AF 51 1B EC 1A 7C 96 BB 41 BC BC 4D 11>)
(   5,<2012-04-15 16:38:30.062 -0500>,<Administrator>,<TOPSPIN>,<proc1d>,<TOPSPIN 2.1>,
      <abs ABSG = 2 
       data hash MD5: 32K
       54 36 35 63 12 4B EF DF 35 91 E4 7B 62 9E 74 DC>)
(   6,<2012-04-15 16:38:30.093 -0500>,<Administrator>,<TOPSPIN>,<proc1d>,<TOPSPIN 2.1>,
      <abs ABSG = 3 
       data hash MD5: 32K
       03 6E A4 C1 04 4A 58 EE CF 12 F6 1A 50 9E D0 35>)
(   7,<2012-04-15 16:38:30.125 -0500>,<Administrator>,<TOPSPIN>,<proc1d>,<TOPSPIN 2.1>,
      <abs ABSG = 4 
       data hash MD5: 32K
       ED E9 E2 7A 70 69 4E F5 DF B9 58 88 32 A7 4A 6E>)
(   8,<2012-04-15 16:38:30.156 -0500>,<Administrator>,<TOPSPIN>,<proc1d>,<TOPSPIN 2.1>,
      <abs ABSG = 5 
       data hash MD5: 32K
       27 E3 42 70 63 E8 73 E6 24 F5 90 28 2C BE 91 DA>)
(   9,<2012-04-15 16:38:34.125 -0500>,<Administrator>,<TOPSPIN>,<audit>,<TOPSPIN 2.1>,
      <user comment:
       ICON-NMR User ID: COFFEE
       data hash MD5: 32K
       27 E3 42 70 63 E8 73 E6 24 F5 90 28 2C BE 91 DA>)
$$ ##END=
$$ 
$$ [...]
##$TP= (0..7)
150 150 150 150 150 150 150 150
##$TP07= 0
##$TPNAME0= <>
##$TPNAME1= <>
##$TPNAME2= <>
##$TPNAME3= <>
##$TPNAME4= <>
##$TPNAME5= <>
##$TPNAME6= <>
##$TPNAME7= <>
##$TPOAL= (0..7)
0.5 0.5 0.5 0.5 0.5 0.5 0.5 0.5
##$TPOFFS= (0..7)
0 0 0 0 0 0 0 0
##$TUNHIN= 0
##$TUNHOUT= 0
##$TUNXOUT= 0
##$USERA1= <user>
##$USERA2= <user>
##$USERA3= <user>
##$USERA4= <user>
##$USERA5= <user>
##$V9= 5
##$VALIST= <valist>
##$VCLIST= <CCCCCCCCCCCCCCC>
##$VD= 0
##$VDLIST= <DDDDDDDDDDDDDDD>
##$VPLIST= <PPPPPPPPPPPPPPP>
##$VTLIST= <TTTTTTTTTTTTTTT>
##$WBST= 2048
##$WBSW= 25
##$XGAIN= (0..3)
0 0 0 0
##$XL= 0
##$YL= 0
##$YMAX_a= 503371
##$YMIN_a= -596742
##$ZGOPTNS= <>
##$ZL1= 120
##$ZL2= 120
##$ZL3= 120
##$ZL4= 120
##$ABSF1= 14.98061
##$ABSF2= -5.57192
##$ABSG= 5
##$ABSL= 3
##$ALPHA= 0
##$AQORDER= 0
##$ASSFAC= 0
##$ASSFACI= 0
##$ASSFACX= 0
##$ASSWID= 0
##$AUNMP= <proc_prof1d_extract_pilot.lims>
##$AXLEFT= 0
##$AXNAME= <>
##$AXNUC= <1H>
##$AXRIGHT= 0
##$AXTYPE= 0
##$AXUNIT= <>
##$AZFE= 0.1
##$AZFW= 0.1
##$BCFW= 0
##$BC_mod= 0
##$BYTORDP= 0
##$COROFFS= 0
##$CY= 15
##$DATMOD= 1
##$DC= 0
##$DFILT= <>
##$DTYPP= 0
##$F1P= 0
##$F2P= 0
##$FCOR= 0.5
##$FTSIZE= 32768
##$FT_mod= 6
##$GAMMA= 0
##$GB= 0
##$INTBC= 1
##$INTSCL= 1
##$ISEN= 128
##$LB= 0
##$LEV0= 0
##$LPBIN= 0
##$MAXI= 10000
##$MC2= 0
##$MEAN= 0
##$ME_mod= 0
##$MI= 0
##$NCOEF= 0
##$NC_proc= -8
##$NLEV= 6
##$NOISF1= 0
##$NOISF2= 0
##$NSP= 0
##$NTH_PI= 0
##$NZP= 0
##$OFFSET= 14.98061
##$PC= 1
##$PHC0= 214.964
##$PHC1= 0
##$PH_mod= 1
##$PKNL= yes
##$PPARMOD= 0
##$PPDIAG= 0
##$PPIPTYP= 0
##$PPMPNUM= 2147483647
##$PPRESOL= 1
##$PSCAL= 4
##$PSIGN= 0
##$PYNMP= <proc.py>
##$REVERSE= no
##$SF= 400.13
##$SI= 32768
##$SIGF1= 0
##$SIGF2= 0
##$SINO= 400
##$SIOLD= 32768
##$SPECTYP= <>
##$SREGLST= <1H.CDCl3>
##$SSB= 0
##$STSI= 32768
##$STSR= 0
##$SW_p= 8223.68421052632
##$SYMM= 0
##$S_DEV= 0
##$TDeff= 65536
##$TDoff= 0
##$TI= <>
##$TILT= no
##$TM1= 0
##$TM2= 0
##$TOPLEV= 0
##$USERP1= <user>
##$USERP2= <user>
##$USERP3= <user>
##$USERP4= <user>
##$USERP5= <user>
##$WDW= 1
##$XDIM= 32768
##$YMAX_p= 460183970
##$YMIN_p= -635291
##$CURPLOT= <Network HP LaserJet P1505>
##$CURPRIN= <$Network HP LaserJet P1505>
##$DFORMAT= <normdp>
##$LAYOUT= <+/1D_H.xwp>
##$LFORMAT= <normlp>
##$PFORMAT= <normpl>
##$SURQMSG= 1
$$ End of Bruker specific parameters
$$ ---------------------------------
##NTUPLES= NMR SPECTRUM
##VAR_NAME=  FREQUENCY,     SPECTRUM/REAL,   SPECTRUM/IMAG
##SYMBOL=    X,             R,               I
##VAR_TYPE=  INDEPENDENT,   DEPENDENT,       DEPENDENT
##VAR_FORM=  AFFN,          ASDF,            ASDF
##VAR_DIM=   32768,         32768,           32768
##UNITS=     HZ,            ARBITRARY UNITS, ARBITRARY UNITS
##FACTOR=    0.250966925370066, 1,           1
##FIRST=     8223.43324360095, 50143,        -107155
##LAST=      0,             -145475,         65876
##MIN=       0,             -635291,         0
##MAX=       8223.43324360095, 460183970,    0
$$ Real data points
##PAGE= N=1
##DATA TABLE= (X++(R..R)), XYDATA
$$ [...]
$$ plain form
19504 -73032 -33164 112586 -122376 -195185 -263750 -248534 -43797 197482 -79739 112549 -224750
19492 -118760 -251156 201267 33461 -186880 293813 -31856 48547 -1034 145775 140498 81861
19481 81861 104882 -171328 627 69491 -23815 29185 -264068 -252035 -213422 -163107 86224 67349
19469 67349 180461 -219453 -20137 -7707 38027 -79549 4669 -212017 -303194 118779 -207678
19457 -308530 -173760 -258846 154550 -164157 -172394 -139241 -48871 318716 -80415 -110788 -49963
19445 11485 26713 178653 -81204 26285 -121859 -226464 -115305 -86840 108739 -160996
19434 -14000 38968 -82337 -153777 -58528 76020 139745 -124107 -32299 335732 160418 -109293
19422 280448 -247519 -223653 -82194 64664 -76110 126047 232699 -159934 5176 42232 -83932
$$ packed form
19504g3032c3164A12586a22376p2809o8565J5216d3797A97482g9739A12549b24750
19492a18760j32396B01267C3461a86880B93813c1856D8547a034A45775n277n8637
19481H1861K3021a71328F27O8864b3815B9185b64068J2033L8613N0315H6224j8875
19469F7349J13112b19453b0137g707C8027g9549D669b12017r1177A18779b07678
19457c08530J34770q5086A54550a64157q237L3153d8871C18716h0415l0373d9963
19445A1485J5228J51940h1204B6285a21859j04605J11159K8465A08739a60996
19434a4000C8968h2337p1440e8528G6020O3725a24107c2299C35732A60418a09293
19422B80448b47519K3866h2194F4664g6110A26047J06652a59934E176L7056h3932
$$ plain form
19410 -119187 -184540 -99187 -155959 276951 -56838 84941 154115 -131263 -23457 -235521 44760
19398 221317 -331857 -26776 -84256 179624 -480249 -203193 91532 -84602 -259802 161253
19387 -20580 114576 -244111 -73015 3587 -87753 -291882 -337891 2047 102266 -53819 -65730
19376 -65730 24211 168970 -13149 43921 -31659 28862 -251973 -292384 -108118 -308234 -89706
19364 -40060 185358 -165063 -233995 86499 -161804 -335319 99558 -342393 -127796 -359874
19354 -359874 -1036 -264044 12342 -41783 -159857 -3856 -139760 129150 -191627 -107994 -33801
19342 -157388 -295135 304499 -29435 -66778 -55937 -225482 -14815 -158622 9672 30562 -428606
19330 -103877 147634 -129563 29722 104312 -77588 -73090 -97924 -318057 64261 -73684 -301649
$$ packed form
19410a19187o5353Q5353n6772B76951e6838H4941O9174a31263b3457k12064D4760
19398B21317c31857b6776n7480A79624d80249b03193I1532h4602j75200A61253
19387b0580A14576b44111g3015C587h7753k04129m6009B047J00219e3819j1911
19376f5730B4211J44759a3149D3921c1659B8862b51973m0411a08118k00116h9706
19364d0060A85358a65063o8932H6499a61804j73515I9558c42393a27796k32078
19354c59874a036k63008A2342d1783j18074c856j35904A29150a91627Q3633c3801
19342a57388j37747C04499b9435l7343J0841j69545a4815j43807I672K0890d28606
19330a03877A47634a29563B9722P4590g7588M498k4834k20133F4261g3684k27965
$$ plain form
19319 -301649 50500 -231734 -30641 -312073 154045 50168 17506 -40899 34759 -283659 -193858
19308 -193858 -67545 -100064 127050 35077 25688 -56155 -51463 165691 124247 -201683 -160599
19297 -160599 -105504 72111 122564 48644 -620189 -13730 -241102 -457714 -151096 -107030 29487
19285 -219928 47177 -246550 -199473 -83791 -93695 74102 97013 -116804 127673 8283 -303576
19273 -13318 93239 -7143 -13590 -124600 -21467 40279 248032 205457 -409806 -98370 62367
19261 -19521 -23629 140995 -189173 -202366 78995 -227489 46423 26254 -247601 -160088 44425
19249 157178 -114153 2856 -247939 -61324 -40772 17106 33297 -97504 96971 126073 -21332
19237 212187 175352 72093 -89634 -80 -28860 8705 -42277 156439 -143414 -100957 -249442 -412999
$$ packed form
19319c01649E0500b31734c0641k81432A54045E0168A7506d0899C4759b83659Q9801
19308a93858f7545l2519A27050C5077r389e6155M692A65691m1444b01683M1084
19297a60599N5095G2111N0453D8644f20189a3730k27372k16612a51096M4066B9487
19285b19928D7177b46550M7077h3791r904G4102K2911a16804A27673H283c03576
19273a3318I3239g143o447j11010b1467D0279K07753m2575d09806i8370F2367
19261a9521m108A40995a89173j3193G8995b27489D6423k0169b47601Q7513D4425
19249A57178a14153B856b47939f1324K0552A7106J6191i7504I6971K9102b1332
19237B12187l6835G2093h9634h0k8780H705d2277A56439a43414M2457j48485j63557
$$ plain form
19225 -412999 189877 -373146 -140211 -74487 -138186 -94952 -134404 195999 -16293 -52132 -105816
19214 -105816 -298304 -270775 -19009 -148057 -53709 -295291 -84976 -58509 4498 -84585 -197836
19203 -197836 -126523 18261 -286245 -143453 -465773 150599 -178029 69874 157736 -125121
19192 18573 -303794 10914 147671 15583 -209898 -256077 81133 -190664 -227106 157414 119235
19181 119235 -47676 277456 81043 -319133 60741 -463497 153396 -295386 -384192 68179
19170 14493 -70450 -263718 155226 -212720 32810 -486466 -347711 70214 -36363 -36634 48509
19158 299917 -118755 95518 159 -6961 223962 70954 -455228 -84274 99365 122483 -275255
19146 -121952 -105151 84347 -261368 -39619 55915 14095 193661 96675 -148546 -20774 -187799
$$ packed form
19225d12999A89877c73146a40211O5724o3699M3234l9452A95999a6293l5839n3684
19214a05816j92488K7529a9009j29048e3709k41582h4976K6467D498h4585j13251
19203a97836P1313A8261b86245J42792l22320A50599a78029F9874Q7862a25121
19192A8573c03794A0914J36757A5583b09898m6179H1133a90664l6442A57414l8179
19181A19235d7676B77456H1043c19133F0741d63497A53396b95386q8806F8179
19170A4493g0450j93268A55226b12720C2810d86466J38755G0214c6363k71D8509
19158B99917a18755I5518A59f961B23962G0954d55228h4274I9365K3118b75255
19146a21952J6801H4347b61368c9619E5915A4095J79566I6675a48546b0774j67025
$$ plain form
19135 -187799 -171828 -259838 -834 -144075 158286 -159704 -18597 112415 -227323 94640 -151929
19123 -240318 51620 310537 17957 -341378 -85878 117916 -88619 -118288 78217 -29096 -10557
19111 8601 -74400 -48579 -13638 62374 -202678 -35509 -164260 -44760 49239 -81981 15397
19099 173204 179004 7713 19650 244777 -229368 -35215 -393032 -120134 -71585 -556722 20235
19087 -135858 -354464 -83300 -135948 -82958 -220492 -97638 -126155 -223880 81778 -197124 -261721
19076 -261721 -134915 -242865 -86553 150619 108741 89163 290354 19074 278132 -102112
19065 -289770 -181112 -33881 -42191 -279560 26484 -196050 -59204 197847 -219553 66249 -223243
19053 -86604 -350412 135418 -285132 -118041 -24810 92058 -94489 93958 7622 -204436 124638
$$ packed form
19135a87799J5971q8010h34j43241A58286a59704a8597A12415b27323I4640a51929
19123b40318E1620K58917A7957c41378h5878A17916h8619k9669G8217b9096a0557
19111H601g4400K5821a3638F2374b02678c5509j28751d4760D9239h1981A5397
19099A73204N800G713J1937K25127b29368c5215l57817a20134M8549m85137B0235
19087a35858k18606h3300n2648N2990j37534i7638k8517r7725H1778a97124o4597
19076b61721J26806j07950h6553A50619m1878j9578K01191A9074K59058a02112
19065b89770J08658c3881q310k37369B6484a96050e9204A97847b19553F6249b23243
19053h6604k63808A35418b85132a18041b4810I2058i4489I3958G622b04436A24638
$$ plain form
19041 -264949 -66737 -127286 -153664 181902 100843 102687 137934 -222472 199142 -262623 -68365
19029 -493650 136942 213184 -21055 -476610 49641 -93568 79672 67427 -121872 128288 -59335
19017 -256676 -52368 -27001 243746 -112826 -183331 119414 174883 -220456 89889 133558 193637
19006 193637 -113844 -205069 68929 158193 6873 -264871 -301968 -8268 -137950 -56607 240827
18994 69464 50145 178040 259902 126695 159959 -522182 212670 128957 102742 246201 -237462
18982 286000 88683 -31427 -26077 -153054 -57199 -66891 -140325 -60250 -250009 -92195 -6881 -309832
18970 -309832 -322821 18795 -76478 -150298 -166560 -3514 78333 165669 218453 73653 120904 -120808
18957 113264 330464 188646 67613 37112 -104457 -40035 117582 161005 -65378 -121145 59890
$$ packed form
19041b64949f6737o0549k6378A81902q1059J844L5247b22472A99142b62623f8365
19029d93650A36942P6242b1055m55555D9641i3568G9672j2245a21872A28288e9335
19017b56676e2368K5367B43746a12826p0505A19414N5469b20456H9889M3669O0079
19006A93637a13844r1225F8929Q9264F873b64871l7097h268j29682e6607B40827
18994F9464j9319J27895Q1862A26695L3264e22182B12670q3713k6215J43459b37462
18982B86000H8683c1427N350j26977e7199r692p3434f0250j89759i2195f881l02951
18970c09832j2989A8795g6478p3820j6262c514G8333Q7336N2784G3653M7251a20808
18957A13264K17200j41818F7613l0501a04457d0035A17582M3423f5378n5767E9890
$$ plain form
18945 -122248 42183 -149666 11641 -199345 20544 91962 -326999 -107264 -329046 -62316
18934 90062 -19908 -33953 41525 207503 258398 78015 -292200 126204 -226687 239227 61474
18922 -337001 -29960 -223356 -126898 -139597 291204 -139379 -76510 -229743 -79681 -39496 -333007
18911 -333007 -28771 -168549 32894 -101037 -197925 -73301 -212199 -77783 -30440 -98386 -29136
18899 64542 -126068 -212672 125839 -161437 114996 256374 298285 -55634 375002 -254924
18888 165362 -135416 -345238 58706 -274 -32803 46143 -158435 -150184 -412156 262633 142472
18877 142472 -175571 -22597 -28544 105716 140942 -260075 1864 185002 -201655 -241852 -14519
18865 -1128 -68993 -313730 -504314 -134888 -77636 -63587 -215874 -102962 101657 -165319
$$ packed form
18945a22248D2183a49666A1641a99345B0544P1418c26999a07264k21782f2316
18934I0062a9908j4045D1525J65978N0895G8015b92200A26204b26687B39227F1474
18922c37001b9960j93396R6458j2699B91204a39379O2869j53233g9681c9496k93511
18911c33007b8771j39778C2894a01037r6888g3301j38898g7783c0440o7946b9136
18899F4542a26068q6604A25839a61437A14996J41378M1911e5634C75002b54924
18888A65362a35416k09822E8706b74l2529D6143a58435Q251k61972B62633j20161
18877A42472a75571b2597n947A05716L5226b60075A864J83138b01655m0197a4519
18865a128o7865k44737j90584a34888N7252J4049j52287a02962A01657a65319
$$ plain form
18854 -74418 -187872 38248 -260543 -2496 -111642 -118738 -85723 -270169 240886 -153880 -93598
18843 -93598 370746 -91546 50343 31922 -247694 -22850 9238 170497 -117358 212507 121073
18832 121073 -279541 -92160 17299 46787 -90497 73114 -89593 -122800 98815 -52345 -27159
18821 -27159 97921 -18931 -155603 42023 -297826 65808 -150257 -27775 -57526 -129519 18767
18809 -65810 67102 28199 125454 -151233 117104 231378 -34397 -136861 -189680 38925 189292
18798 189292 594914 -59142 -93960 195156 169573 261555 -22739 -306310 -106426 97790 -112606
18786 278927 -109381 -462812 -34006 16532 127764 122020 -84850 -58621 77186 -376513 -227671
18775 -227671 -158737 111131 247435 8370 94106 -478867 -56452 -14674 146039 112338 -210709
$$ packed form
18854g4418j13454C8248b60543b496j09146p096L3015j84446B40886a53880O0282
18843i3598C70746i1546E0343j8421b47694b2850I238J61259a17358B12507r1434
18832A21073b79541i2160A7299K9488i0497G3114h9593l3207I8815e2345K5186
18821b7159I7921a8931j36672D2023b97826F5808a50257b7775k9751p1993A8767
18809f5810F7102B8199R7255a51233A17104J14274c4397j02464n2819C8925J50367
18798A89292M05622e9142l4818A95156k5583R1982b2739k83571a06426I7790a12606
18786B78927a09381l53431c4006A6532J11232n744h4850K6229G7186c76513J48842
18775b27671O8934A11131J36304H370Q5736d78867e6452a4674A46039l3701b10709
$$ plain form
18763 125386 -18515 -13975 -105446 154782 149084 -230502 114736 186236 226457 -68090 16303
18751 -228173 -231294 -44828 -101094 107551 104799 -297380 165329 -123101 -271187 67401 -300193
18739 -133379 121737 -120497 -398820 -99511 -133890 -114487 -70639 -302180 -210733 -237053 -196032
18728 -196032 104382 54212 -19859 196625 94944 -152195 -154037 -116897 -56363 43180 -156462
18716 104677 32099 100434 -27317 69478 113100 -554879 3270 -389459 -278121 -306678 108153
18704 -8486 -65519 -172701 -199737 67207 -11381 323003 97893 -12413 -287682 -99855 -33974
18692 236586 -192325 -410250 -130722 -178259 74022 46179 180319 103327 134449 -135652
18681 -122402 -96209 -283210 -126078 -100429 11652 -161960 -120213 -70824 -15658 -126047 -518024
$$ packed form
18763A25386a8515M540r1471A54782n698b30502A14736P1500M0221f8090A6303
18751b28173l121d4828n6266A07551k752b97380A65329a23101j48086F7401c00193
18739a33379A21737a20497k78323i9511l4379J9403M3848k31541R1447k6320M1021
18728a96032A04382n0170a9859A96625I4944a52195j842L7140e6363D3180a56462
18716A04677C2099O8335b7317F9478M3622e54879C270c89459J11338k8557A08153
18704h486n7033j07182k7036F7207a1381C23003I7893a2413k75269i9855c3974
18692B36586a92325k17925a30722m7537G4022k7843J34140p6992L1122a35652
18681a22402K6193j87001a26078K5649A1652a61960M1747M9389a5658j10389l91977
$$ plain form
18670 -518024 -130586 -217896 265957 -80757 -256614 -13401 -97654 -36342 -466028 -228953
18659 248369 -161202 165647 68765 -43906 -306470 102118 -6694 170379 -74023 -7861 215696
18647 -33080 -190617 21592 194647 -190412 78090 -208455 -273195 155152 318927 143512
18636 -68915 -65941 -91591 186158 57407 26227 -99115 -493985 -33401 -126992 -201433 9598 240121
18624 240121 -21340 -83418 -133661 290384 -883 -195531 -178464 -103554 -79915 124471 -262255
18612 47048 -194626 -347752 70460 11163 -165597 -302646 -26475 -37178 -156354 -367687
18602 -367687 17021 16258 21533 -136965 -141361 -11108 -55328 -172840 -246764 -162434 -353987 40052
18589 236741 7902 54361 -170310 -154182 -111260 19003 -129912 -289918 -161753 -397119 -312664
$$ packed form
18670e18024a30586q7310B65957h0757j75857a3401q4253c6342m29686b28953
18659B48369a61202A65647F8765d3906k62564A02118f694A70379g4023g861B15696
18647c3080j57537B1592J73055a90412G8090b08455o4740A55152J63775A43512
18636f8915K974k5650A86158E7407B6227i9115l94870c3401r3591p4441I598K30523
18624B40121b1340o2078n0243B90384h83j94648J7067P4910K3639A24471b62255
18612D7048a94626j53126G0460A1163a65597j37049b6475j0703j19176k11333
18602c67687A7021p63N275a36965m396a1108m4220j17512p3924Q4330j91553D0052
18589B36741G902M6459a70310J6128M2922A9003a29912j60006J28165k35366Q4455
$$ plain form
18578 -312664 -57401 -107717 -47766 -112854 9887 40945 -117438 154928 -79932 113978 -121713
18566 -142749 -374005 -294583 -26749 -291978 -70277 -295057 -327260 186416 161420 -71146 -95222
18555 -95222 97418 -263116 -174966 183508 -158296 -148008 -133840 -6533 100100 114842 -110220
18543 -49105 -197055 108875 -101403 20567 101488 -43404 385709 63996 -133103 217623
18532 16790 -125455 -20316 203174 4246 484279 32410 25015 -30837 305380 129506 77001
18521 77001 -5484 -237661 -267945 -9316 -214557 -322295 -78652 37738 221936 -6801 -123408
18510 -123408 -159254 -330419 -184844 -174687 -250100 -210918 -216744 -330674 34751 113288 85446
18499 85446 -59417 -29545 -170945 -216958 -118718 -321158 52546 -246163 -68415 175449 140701
$$ packed form
18578c12664e7401n0316d7766o5088I887L1058a17438A54928g9932A13978a21713
18566a42749k31256P9422b6749k65229g0277k24780l2203A86416k4996g1146k4076
18555i5222I7418b63116Q8150A83508a58296J0288J4168f533A00100J4742a10220
18543d9105j47950A08875a01403B0567Q0921d3404C85709F3996a33103B17623
18532A6790a25455b0316B03174D246M80033C2410p395c0837C05380A29506n2505
18521G7001e484k32177l0284i316k05241j07738g8652C7738J84198f801j16607
18510a23408l5846j71165J45575J0157p5413L9182n826j13930C4751P8537k7842
18499H5446e9417b9545j41400m6013R8240k02440E2546b46163f8415A75449l4748
$$ plain form
18488 140701 -208403 -61378 87749 54024 7109 -79803 193395 -7170 -344418 136810 -409311
18476 25567 -254144 89698 181205 125715 -248836 -286930 216119 -396527 -96170 -103280 -19649
18464 -300950 -241747 -289769 186605 -305872 247014 41920 314723 -91792 -373252 -80463
18453 -66930 46574 57752 89606 -26883 -160329 -28918 112747 -217136 104034 209718 -182307
18441 -151579 73125 -64951 -81934 -87164 -173456 -21845 -83054 207037 -114517 -530602 84545
18429 -222331 -158295 117617 -283 150769 408207 -32454 -83359 -273037 65197 -237033 125228
18417 -155497 460489 121610 -102173 -58687 -260616 -341092 -147357 -154856 84511 -101641
18406 -115349 65236 -166859 -12086 -91864 142557 9823 -257321 -346847 -242248 110357 23566
$$ packed form
18488A40701b08403f1378H7749l3725G109g9803A93395g170l37248A36810d09311
18476B5567b54144H9698R1507n5490b48836l8094B16119c96527i6170p110a9649
18464c00950N9203m8022A86605c05872B47014D1920K72803i1792k81460h0463
18453f6930D6574J1178L1854b6883j33446b8918A12747b17136A04034J05684a82307
18441a51579G3125f4951j6983n230q6292b1845o1209B07037a14517m16085H4545
18429b22331O4036A17617b83A50769K57438c2454n0905j89678F5197b37033A25228
18417a55497D60489A21610a02173M3486k01929q0476a47357p499H4511a01641
18406a15349F5236a66859a2086p9778A42557I823b57321q9526J04599A10357B3566
$$ plain form
18394 -73133 -121173 13972 368198 104153 49788 -40288 -67645 -47968 85637 53953 36231
18383 36231 -93334 213282 -204255 -120233 -100256 -231966 -80962 28372 6441 -96958 27782
18371 -161674 -225123 44559 106628 -44153 -71125 57844 -15870 -62214 -264820 210461 125025
18360 125025 -251555 -136996 231988 -210859 -99043 20666 -83198 202705 -192132 -183510
18350 -183510 14822 32757 36373 -125531 -69229 -48834 300122 124866 -79488 -2716 132010
18338 -300062 63544 261652 -107354 -20934 114481 -138105 129229 -44946 -35699 -179124
18328 -179124 39150 27074 -178198 -219511 9410 -253104 -144775 -88801 259015 -40541 -309051
18317 -309051 -53749 -266436 -185319 77566 -92915 -70196 -193615 339675 20412 171989 -7961
$$ packed form
18394g3133m8040A3972L54226A04153D9788d0288k7357J9677H5637l1684j7722
18383C6231i3334B13282b04255Q4022J9977j31710h0962B8372F441i6958B7782
18371a61674o3449D4559O2069d4153k6972E7844a5870m6344k02606B10461q5436
18360A25025b51555J14559B31988b10859i9043B0666h3198B02705a92132Q622
18350a83510A4822J7935L616a25531N6302K0395C00122A24866g9488b716A32010
18338c00062F3544J98108a07354b0934A14481a38105A29229d4946R247j43425
18328a79124C9150j2076a78198m1313I410b53104J08329N5974B59015d0541k68510
18317c09051e3749k12687Q1117G7566i2915K2719j23419C39675B0412J51577g961
$$ plain form
18305 154881 -212894 -117973 -127230 -87230 67532 269836 -153342 -175413 -35494 243576 -277708
18293 -40658 -219628 -156826 200381 169651 90040 -82793 76709 -33899 8227 164966 -37328
18281 -99109 153759 -164789 -322814 70232 -111508 -94921 29221 -4864 260942 87201 -49316
18269 128548 98882 177458 -91660 187658 52410 25030 99851 137698 -109980 110317 -207973
18257 -37449 272972 63963 1598 -49220 45097 -22032 75702 -25741 -103614 284521 8509 10949
18245 10949 70150 344538 9758 -79761 242233 -326467 34022 92213 254771 -7421 -268930
18234 -268930 294651 127045 25982 -152663 125146 202852 -32167 -21473 -13205 64061 149929
18223 149929 155928 23762 -48124 -4631 -51439 101176 -238433 61091 -15295 -228295 -204766
$$ packed form
18305A54881b12894R4921r257M0000F7532K02304a53342k2071c5494B43576b77708
18293d0658j78970O2802B00381l0730p9611h2793G6709c3899H227J56739c7328
18281i9109A53759a64789j58025G0232a11508J6587B9221d864B60942H7201d9316
18269A28548k9666P8576i1660A87658E2410B5030P4821L7847a09980A10317b07973
18257c7449B72972F3963A598d9220D5097b2032G5702b5741p7873B84521H509K440
18245A0949N9201K74388I758g9761B42233c26467C4022N8191J62558g421k61509
18234b68930B94651A27045B5982a52663A25146P7706c2167J0694Q268F4061Q5868
18223A49929N999B3762d8124d631m6808A01176b38433F1091a5295k13000K3529
$$ plain form
18212 -204766 -55463 -195602 -274153 -160135 28044 -88252 -314127 -54788 168783 -10848 13970
18200 130646 69644 -50151 2269 -273507 -423668 -298644 73779 -344291 6207 -266243 -223878
18189 -223878 282698 32600 77835 48879 187821 -14314 -234336 -66585 71793 -40894 269194
18177 114296 -84578 -246055 143127 -22936 200770 -189633 170405 -152174 -116896 121337
18166 242255 -35569 227059 -193446 -204432 179984 118043 47141 40120 -346928 201004 -30782
18154 -265182 -101145 257347 -194449 -260327 185673 -37923 -310113 -346962 146387 -70313
18143 -18946 -162732 -33650 7270 -140934 129592 68799 -2955 -297520 -47134 -79334 138709
18131 -128292 75199 3481 17054 -245127 -122875 -152666 26139 -37163 145066 -213255 100022
$$ packed form
18212b04766e5463j40139p8551J14018B8044h8252k25875e4788A68783a0848A3970
18200A30646o1002e0151B269b73507j50161J25024G3779c44291F207b66243M2365
18189b23878B82698C2600M5235k8956J38942a4314k20022f6585G1793d0894B69194
18177A14296h4578j61477A43127b2936B00770a89633A70405a52174L5278A21337
18166B42255c5569B27059a93446j0986A79984o1941D7141p021c46928B01004c0782
18154b65182a01145B57347a94449o5878A85673c7923k72190l6849A46387g0313
18143a8946j43786c3650G270a40934A29592o0793b955k94565d7134l2200A38709
18131a28292G5199C481J3573b45127J22252k9791B6139c7163A45066b13255A00022
$$ plain form
18119 -39130 -62493 -33221 304811 20305 -215860 -121027 113877 102405 -30322 21277 -88326
18107 68230 -90423 -96454 -179617 -104536 206405 -181063 163124 -30898 171896 -229035 -89167
18095 -35272 260563 102940 89484 -164100 189668 -184690 143736 143908 -86757 357649 -96519
18083 278313 100842 -165229 110624 -5882 97750 -67590 -123802 -209685 92697 -242677 -97189
18071 -146820 63568 78270 49818 -236293 -68488 -119611 -68032 -52534 17937 -104225 -121803
18060 -121803 110742 -24223 -232422 -193017 -85698 10044 5200 92545 107444 56884 116559
18049 116559 28463 -233733 -65529 109372 -112144 231405 -35375 75239 -235169 306881
18038 162562 3 180770 -71558 -486437 -82385 151314 284034 244313 224979 149510 -69659
$$ packed form
18119c9130k3363K9272C04811B0305b15860R4833A13877j1472c0322B1277h8326
18107F8230i0423o031q3163P5081B06405a81063A63124c0898A71896b29035h9167
18095c5272B60563A02940j3456a64100A89668a84690A43736J72h6757C57649i6519
18083B78313A00842a65229A10624e882I7750f7590n6212q5883I2697b42677i7189
18071a46820F3568J4702k8452b36293f8488n1123N1579J5498A7937a04225j7578
18060a21803A10742b4223k08199L9405h5698A0044m844Q7345J4899n0560N9675
18049A16559B8463b33733f5529A09372a12144B31405c5375G5239b35169C06881
18038A62562CJ80767g1558m14879h2385A51314J32720l9721j9334p5469f9659
$$ plain form
18026 -141196 -188621 -25513 35287 -175696 9679 86236 294940 -173027 -127059 50341 -65949
18014 93980 192363 -57844 22348 -34780 9534 75687 64580 -18458 -276569 -86574 -213392
18003 -213392 51271 151033 94474 -42207 68723 41498 -141595 -35823 -156599 74141 317876
17992 317876 225582 -142625 -179495 -18214 179047 125932 -164410 -94893 141766 -1383 104103
17980 104042 -200834 -289031 99140 207166 71753 -219735 -200778 -37559 145162 190898 135941
17969 135941 149131 -18317 -27489 -205737 -60043 -219871 -6716 146867 84263 41220 -127909
17957 -131668 -393772 217164 67644 -20193 27774 42458 -8265 -87538 213403 -417538 -30061
17945 -194770 247938 -407237 21582 -35893 -8501 -23709 -102222 -42123 17955 -12989 27933
$$ packed form
18026a41196m7425b5513C5287a75696I679P6557K08704a73027M5968E0341f5949
18014I3980R8383e7844B2348c4780I534O6153j1107a8458k58111h6574j26818
18003b13392E1271R9762n6559d2207F8723k7225a41595c5823j20776G4141K43735
17992C17876r2294a42625l6870a8214A79047n3115a64410O9517A41766a383A04103
17980A04042b00834q8197I9140J08026G1753b19735J8957c7559A45162M5736n4957
17969A35941J3190a8317r172j78248f0043j59828f716A46867o2604D1220a27909
17957a31668k62104B17164F7644b0193B7774J4684h265p9273B13403d17538c0061
17945a94770B47938d07237B1582c5893h501j5208p8513d2123A7955a2989B7933
$$ plain form
17933 -30357 119258 55975 8272 -64332 189045 -8030 142318 228500 91017 271283 -128184
17921 -107714 -13594 184105 -382346 121901 -176134 -246955 369837 85337 -37138 -5726 36808
17909 -393148 236902 -63730 -241272 311901 86060 38195 64444 55369 169939 -42948 377972
17897 44325 -11757 82051 -91892 15501 148836 5706 -67971 -177909 -36601 -173943 -39947
17885 59959 7749 159568 147038 112403 -93402 2813 91516 41377 -68107 115358 -2123 -197660
17873 -197660 168922 112233 -29610 201386 453628 137026 -178393 98965 -162575 87782
17862 17861 -91251 278189 -46814 16002 -48483 250356 132750 30118 160787 183692 62228
17850 -173938 299141 204627 32131 238938 92117 -115785 121157 -164909 -17995 75071
$$ packed form
17933c0357A19258E5975H272f4332A89045h030A42318Q6182I1017J80266a28184
17921a07714a3594A84105c82346A21901a76134p0821C69837H5337c7138e726C6808
17909c93148B36902f3730j77542C11901H6060C8195K6249r075J14570d2948C77972
17897D4325a1757H2051i1892A5501J33335E706f7971j09938c6601j37342c9947
17885E9959G749J51819j2530l4635i3402B813Q8703D1377f8107A15358b123j95537
17873a97660A68922n6689b9610B01386K52242A37026a78393I8965a62575H7782
17862A7861i1251B78189d6814A6002d8483B50356j17606C0118J30669K2905F2228
17850a73938B99141r4514C2131K06807I2117a15785A21157a64909a7995G5071
$$ plain form
17839 242795 -82932 117476 155784 60451 382027 -197577 -62444 26080 227754 83055 125104
17828 125104 71173 -12165 82670 -142438 -51432 147937 60116 239321 45487 312193 -102701
17816 66017 42422 17927 24397 -108890 112693 214529 -112579 37575 -44061 82639 183981
17805 183981 -173306 -25962 -192133 376252 266755 -111113 -69289 23411 -85129 109350
17794 -8850 296661 160692 -71813 62412 -103264 -44902 13277 -66798 -209851 94015 -50110
17782 277417 -28351 107592 -97892 162447 27836 -48542 -223453 96727 30263 -167315 -43736
17770 334791 -129750 127907 -7946 -15805 -92338 119294 -42273 42520 47195 -347113 172405
17758 76272 119793 157568 92801 13456 391229 -83064 -150543 -38126 121607 -152716 265747
$$ packed form
17839B42795h2932A17476L8308F0451L21576a97577f2444B6080K01674H3055M2049
17828A25104n3931a2165H2670a42438e1432A47937F0116J79205D5487K66706a02701
17816F6017k3595A7927O470a08890A12693J01836a12579C7575d4061H2639J01342
17805A83981a73306b5962j66171C76252j09497a11113M1824B3411h5129A09350
17794h850B96661j35969g1813F2412a03264d4902A3277f6798j43053I4015e0110
17782B77417b8351A07592i7892A62447B7836d8542j74911I6727C0263a67315d3736
17770C34791a29750A27907g946p859p6533A19294d2273D2520M675c47113A72405
17758G6272M3521L7775o4767A3456L77773h3064o7479c8126A21607a52716B65747
$$ plain form
17746 33476 94020 77558 -55195 154794 -39410 -117375 142518 -18514 106247 59809 -69575
17734 36347 -68169 319692 -73202 26158 -60345 60114 74361 -264932 236607 -58729 184323
17722 147751 29833 183555 -186784 333708 39751 -1619 136086 146689 17340 294023 -50475
17710 58693 -104231 -232667 180947 -105203 204780 -74589 -30867 -116617 196087 -29086
17699 356826 -127770 -208635 156929 -214923 136002 -41797 3096 58403 7791 -37276 -10983
17687 174359 138153 43461 41686 -59320 95677 5504 211314 -53357 -35535 14350 87440 178834
17675 178834 -60651 -57718 420188 400141 290710 -208207 64965 255301 100807 161734 188732
17664 188732 237169 195215 75428 36110 -114524 -10057 180424 109163 -34084 298073 183590
$$ packed form
17746C3476O0544j6462e5195A54794c9410p7965A42518a8514A06247m6438f9575
17734C6347f8169C19692g3202B6158f0345F0114J4247b64932B36607e8729A84323
17722A47751B9833J53722a86784C33708C9751a619A36086J0603A7340K76683e0475
17710E8693a04231j28436A80947a05203B04780g4589c0867q5750A96087b9086
17699C56826a27770q0865A56929b14923A36002d1797C096N5307G791c7276a0983
17687A74359l6206D3461j775e9320I5677E504K05810e3357J7822A4350P3090R1394
17675A78834f0651K933D20188k0047j09431b08207F4965J90336A00807O0927K6998
17664A88732M8437m1954G5428C6110a14524a0057A80424p1261c4084B98073j14483
$$ plain form
17653 183590 52131 181501 96444 455590 24491 246124 -166614 -12770 -72924 -36428 120520
17641 -5646 -246888 170840 -69073 145574 210683 49842 -328474 -100252 194987 6262 -119580
17629 102107 -3004 -25496 -182113 258409 62238 195470 -501068 -20932 109871 -61886 -72558
17618 -72558 -172175 340512 436864 207400 -80222 17546 226252 69540 270134 14713 154011
17607 154011 209296 151010 -202985 135093 272273 -62175 703776 -116174 -49205 74917
17596 -19365 183370 -9810 258956 333495 -132901 -82198 93643 -138917 345650 -253514 95952
17584 356494 -54414 220446 167854 -234979 163673 -59430 143069 -168994 100601 276820
17574 276820 171801 54746 162161 132087 120411 -49795 -261982 100565 -15245 174734
$$ packed form
17653A83590E2131J29370q5057L59146B4491K21633a66614a2770o0154c6428A20520
17641e646k41242A70840f9073A45574O5109D9842c28474a00252A94987F262a19580
17629A02107c004k2492j56617B58409F2238J33232e01068b0932A09871f1886j0672
17618g2558r9617C40512R6352B07400h0222A7546K08706F9540K00594A4713J39298
17607A54011N5285n8286b02985A35093J37180f2175G03776a16174d9205G4917
17596a9365A83370i810B58956P4539a32901N0703I3643a38917C45650b53514I5952
17584C56494e4414B20446n2592b34979A63673e9430A43069a68994A00601J76219
17574B76820j05019E4746J07415l0074j1676d9795k12187A00565a5245A74734
$$ plain form
17563 46038 -6524 47643 60212 77120 9760 66374 21148 97850 -136401 -16031 294748 78157
17550 -110767 230741 150387 64460 128631 -21952 197352 -26543 440750 151244 12123 106951
17539 106951 281408 -259511 -172776 578406 225082 148774 119079 103138 57200 25480 22182
17528 22182 153865 94943 211695 341530 209793 145786 82894 461222 231025 385699
17518 385699 162263 268979 449335 349657 276755 239771 309298 304678 611702 712992 748553
17507 748553 752179 769914 613044 981256 512719 532203 319018 504456 440914 332149
17497 332149 540529 140291 354298 486181 542298 692120 875991 267153 808838 583305
17487 583305 479204 334982 238020 337878 308647 215016 119941 -9017 244104 260512 203583
$$ packed form
17563D6038f524D7643J2569J6908I760N6614B1148P6702a36401a6031B94748G8157
17550a10767B30741q0354F4460O4171b1952A97352b6543D40750A51244A2123R4828
17539A06951J74457b59511Q6735E78406B25082p6308k9695j5941m5938B5480l298
17528B2182J31683n8922J16752J29835j31737o4007o2892L78328k30197J54674
17518C85699A62263J06716J80356r9678p2902l6984O9527m620L07024J01290L5561
17507G48553L626J7735j56870L68212m68537J9484k13185J85438o3542j08765
17497C32149K08380A40291K14007J31883N6117J49822J83871B67153N41685k25533
17487E83305j04101j44222r6962R9858k9231r3631r5075i017B44104J6408n6929
$$ plain form
17476 203583 335376 123351 -46387 513656 357884 182497 284473 460253 439943 191773
17465 459571 -250361 462305 17221 342350 284089 366538 180092 549459 198141 12654
17454 318885 301330 397348 252581 -12379 145191 244569 152150 25127 139267 327749 61913
17442 404911 449662 592318 303570 34109 111011 307679 34612 189323 -13358 22598 429055
17431 429055 202693 285648 -30850 296032 335195 137932 67214 -56312 234448 576967
17421 576967 294005 35752 155532 393541 377604 598936 365027 202096 305000 428364
17411 428364 498205 278570 418440 244651 174383 21975 357124 300494 243270 94005 148793
17400 148793 199712 293159 -226909 356094 564483 142085 204100 553389 781 349917 147778
$$ packed form
17476B03583J31793A23351d6387E13656j55772j75387J01976J75780k0310A91773
17465D59571b50361D62305A7221L25129n8261Q2449A80092L69367A98141A2654
17454C18885j7555R6018j44767a2379A45191R9378r2419B5127J14140J88482F1913
17442D04911M4751J42656k88748C4109P6902J96668C4612J54711a3358B2598M06457
17431D29055B02693Q2955c0850B96032L9163A37932F7214e6312B34448L42519
17421E76967k82962C5752J19780K38009j5937K21332k33909j62931J02904J23364
17411D28364O9841k19635J39870j73789p0268B1975L35149n6630n7224I4005N4788
17400A48793N0919R3447b26909C56094K08389A42085O2015L49289G81L49136A47778
$$ plain form
17388 2886 373301 95163 108503 163024 292475 208842 329783 164100 308642 299879 167295
17377 167295 13252 134929 251 236527 291851 143585 293206 364210 -14415 289003 312546
17366 312546 -13908 -8380 222817 193071 194000 362915 216767 9769 196294 79871 209372
17355 209372 193397 507840 36579 337418 334076 165386 40642 227464 225206 101454 540590
17344 540590 385305 115105 212521 148500 19948 408717 -245127 591329 726273 230048
17333 137512 155430 102753 252682 341858 73485 314950 55395 282982 8842 143684 11359
17321 18633 103147 165015 180541 65970 360132 156645 -214179 219221 193050 183370 142376
17310 142376 109839 469059 643705 -2194 170447 49797 379477 488311 164166 438404
$$ packed form
17388B886L70415I5163J3340N4521J29451q3633J20941A64100J44542q763j32584
17377A67295A3252J21677B51K36276N5324A43585J49621P1004a4415B89003K3543
17366C12546a3908N528B22817k9746R29J68915j46148I769J86525G9871J29501
17355B09372j5975L14443C6579L00839l342A65386D0642J86822k258A01454M39136
17344E40590j55285A15105R7416o4021A9948L88769b45127E91329J34944B30048
17333A37512J7918n2677J49929Q9176G3485K41465E5395K27587H842J34842A1359
17321A8633Q4514O1868J5526F5970K94162A56645b14179B19221k6171r680m0994
17310A42376l2537L59220J74646b194A70447D9797L29680J08834A64166K74238
$$ plain form
17300 438404 11323 293948 191267 230173 248335 11419 310553 278676 403114 183766
17289 188849 467780 184424 524268 227421 176227 192317 491777 302470 180664 444329
17279 444329 404907 -6698 138176 110701 295282 337487 262263 246373 79206 195622 -27026
17267 309610 32467 368705 -4204 155687 419006 260162 113223 448720 33569 43874
17257 43874 22765 468733 362587 384656 349332 -20926 360337 363182 -53649 289418 168006
17246 168006 437144 86106 144118 405964 336086 -24241 226275 508991 439943 167684
17235 474788 93457 218195 387521 318886 -76220 519090 310601 173729 263939 601944
17225 601944 231838 482156 97778 528953 38910 -33711 245991 172043 412143 343265
$$ packed form
17300D38404A1323K82625j02681L8906J8162A1419K99134l1877J24438A83766
17289A88849K78931A84424L39844B27421n1194J6090K99460j89307j21806K63665
17279D44329l9422f698A38176k7475J84581M2205p5224j5890G9206J16416b7026
17267C09610C2467L36238d204A55687K63319j58844A13223L35497C3569J0305
17257D3874k1109M45968j06146K2069l5324b0926C60337K845e3649B89418j21412
17246A68006K69138H6106N8012K61846o9878b4241B26275K82716o9048A67684
17235D74788I3457J24738J69326o8635g6220E19090k08489j36872R0210L38005
17225F01944B31838K50318I7778M31175C8910c3711B45991p3948K40100o8878
$$ plain form
17215 343265 92007 427429 292756 409115 59761 359059 238932 29545 219107 181420
17205 181420 46903 311613 52770 418277 -133611 543205 464526 162684 375861 325007
17195 325007 379432 218946 196385 86468 276382 490550 220888 97817 54629 93536 -65097
17183 -43236 406039 591287 238358 305734 -3510 -42417 252472 574871 168682 460857
17173 460857 472016 403019 501912 294053 644318 494549 327503 -59210 114265 128030
17163 128030 409055 345703 276952 341193 337691 518705 315430 409810 375103 455119 502663
17152 502663 844408 318595 251124 437580 236380 150510 297181 189238 174105 257421
17142 257421 786787 512821 520341 559997 274084 311250 416334 415815 437550 666217 597443
$$ packed form
17215C43265I2007L35422j34673J16359E9761K99298j20127B9545J89562l7687
17205A81420D6903K64710E2770L65507a33611E43205p8679A62684K13177n0854
17195C25007N4425j60486k2561H6468J89914K14168B20888I7817m3188L8907f5097
17183d3236D06039J85248B38358O7376c510l8907B52472L22399A68682K92175
17173D60857J1159o8997R8893k07859L50265j49769j67046e9210A14265J3765
17163A28030K81025o3352o8751O4241l502J81014k03275R4380l4707Q0016M7544
17152E02663L41745C18595o7471J86456k01200q5870J46671j07943j5133Q3316
17142B57421N29366k73966P520L9656B74084L7166J05084n19K1735K28667o8774
$$ plain form
17131 597443 482480 170206 6717 405274 548892 267580 389620 324364 253600 474484
17121 474484 669100 403843 506925 472695 405834 448548 309616 222690 246422 325892 612174
17110 612174 562557 142114 480566 283991 614636 327535 116856 537045 613513 668599
17100 668599 439276 506108 311843 419106 684206 598512 431467 688606 608248 496933
17090 496933 364606 413105 335919 395000 529550 240694 305323 862410 554201 593762
17080 593762 604483 410111 287137 209401 399412 591192 653577 439426 418917 532287
17070 532287 429817 782504 602707 300130 428617 395355 258101 435065 437141 603631
17060 603631 958430 80408 794430 589812 489797 579893 621248 723986 539930 393170
$$ packed form
17131E97443j14963A70206F717L98557J43618B67580J22040o5256p0764K20884
17121D74484J94616k65257J03082l4230o6861M2714j38932q6926K3732P9470K86282
17110F12174m9617A42114L38452j96575L30645k87101A16856M20189P6468N5086
17100F68599k29323O6832j94265J07263K65100q5694j67045K57139q0358j11315
17090D96933j32327M8499p7186N9081J34550B40694O4629N57087l08209L9561
17080E93762J0721j94372j22974p7736J90011J91780O2385k14151k0509J13370
17070E32287j02470L52687j79797C00130J28487l3262j37254J76964K076J66490
17060F03631L54799H0408P14022k04618j00015R0096M1355J02738j84056j46760
$$ plain form
17050 393170 840020 726613 673414 540237 551183 805434 765674 549798 345584 519013
17040 519013 471059 690573 583347 366040 783459 755935 659744 679634 690304 616317 946379
17029 946379 698840 570075 652613 724723 441726 687894 748535 955846 575407 685409
17019 685409 639685 458059 835667 673294 748657 646897 841014 1007001 800633 874727
17009 874727 676717 778764 866159 378422 938565 698702 647942 793235 687244 1019885
16999 1019885 894149 1014445 1031723 780715 1020704 1067397 736347 893601 863582 890015
16989 890015 722481 938306 1076547 648168 943121 629291 908680 989609 754343 726383
16979 726383 1097790 842395 777672 733050 709636 866722 1355131 1293121 888602 1179163
$$ packed form
17050C93170M46850j13407n3199j33177J0946K54251l9760k15876k04214J73429
17040E19013m7954K19514j07226k17307M17419k7524r6191J9890J0670p3987L30062
17029I46379k47539j28765Q2538P2110k82997K46168O0641K07311l80439J10002
17019F85409m5724j81626L77608j62373P5363j01760J94117J65987k06368P4094
17009H74727j98010J02047Q7395C78422N60143k39863n0760J45293j05991L32641
16999A019885j25736J20296J7278k51008K39989M6693l31050J57254l0019K6433
16989H90015j67534K15825J38241m28379K94953l13830K79389Q0929k35266k7960
16979G26383L71407k55395o4723m4622k3414J57086M88409o2010m04519K90561
$$ plain form
16969 1179163 889407 1222213 1253407 1038793 1171697 815483 765072 549301 1048664 1329888
16959 1329888 957490 1186141 893886 966567 1221478 1208065 845567 1143150 985562 1155491
16949 1155491 1524821 1198806 1088277 993030 1368196 1053679 1327432 1182215 1243239 784121
16939 784121 1260565 1257569 1618333 1319675 1519421 1381534 1567199 1085215 1182401 1582822
16929 1582822 1183752 1285416 1586903 1463451 1380244 1512833 1568250 1489067 1737450 1539644
16919 1539644 1528467 1591189 1512814 1851345 1728264 1666673 1847634 1336336 1620998 1382817
16909 1382817 1711327 1908239 1599703 1742087 1454651 1946143 1966869 1816950 1502684 1855250
16899 1855250 1752824 1633449 1769823 1978113 1812885 1675522 2128863 2104651 1966846 1970178
$$ packed form
16969A179163k89756L32806L1194k14614J32904l56214n0411k15771M99363K81224
16959A329888l72398K28651k92255P2681K54911j3413l62498K97583j57588J69929
16949A155491L69330l26015j10529r5247L75166l14517K73753j45217O1024m59118
16939G84121M76444k996L60764k98658J99746j37887J85665m81984R7186M00421
16929A582822l99070J01664L01487j23452q3207J32589N5417p9183K48383j97806
16919A539644j1177O2722p8375L38531j23081o1591J80961n11298K84662k38181
16909A382817L28510J96912l08536J42384k87436M91492K0726j49919l14266L52566
16899A855250j02426j19375J36374K08290j65228j37363M53341k4212j37805L332
$$ plain form
16889 1970178 2038353 1892627 1895532 1937417 2407570 2087252 2382565 2314314 2072122 2153884
16879 2153884 2559972 2348343 2038117 2477820 2287146 2505387 2499827 2380725 2466646 2406720
16869 2406720 2522190 2591630 2619193 2643044 2347151 2691331 2791326 2835948 2857350 3021396
16859 3021396 3108270 2747884 3096667 2733393 3322065 2868997 2919837 3127319 3452832 3344841
16849 3344841 3358025 3319778 3291036 3412744 3462774 3748622 3621590 3890064 3690776 3544248
16839 3544248 3932817 3653989 3747463 4089483 4210455 4099848 3970280 4300195 4197459 4324197
16829 4324197 4136124 4625382 4617663 4717850 4669640 4583536 5074232 4879746 5247711 5184619
16819 5184619 5131012 5239344 5548023 5617231 5895933 5617610 5756675 5784614 6107245 6196441
$$ packed form
16889A970178O8175j45726K905M1885M70153l20318K95313o8251k42192Q1762
16879B153884M06088k11629l10226M39703j90674K18241n560j19102Q5921n9926
16869B406720J15470O9440K7563K3851k95893L44180R9995M4622K1402J64046
16859C021396Q6874l60386L48783l63274N88672m53068N0840K07482L25513j07991
16849C344841J3184l8247k8742J21708N0030K85848j27032K68474j99288j46528
16839C544248L88569k78828R3474L42020J20972j10607j29568L29915j02736J26738
16829D324197j88073M89258p719J00187m8210q6104M90696j94486L67965o3092
16819E184619n3607J08332L08679O9208K78702k78323J39065K7939L22631Q9196
$$ plain form
16809 6196441 6173554 6162535 6431805 6566790 6866287 6558488 7029783 6962783 7193274 7454018
16799 7454018 7611014 7938785 7820888 7951919 8142189 8402079 8342580 8827903 9073894 9222814
16789 9222814 9101283 9625459 9995960 10197928 10328379 10831135 10885772 11030700 11447338 11491163
16779 11491163 11904484 12117756 12512256 13206005 13223339 13466538 14050542 14162333 14519013
16770 14519013 15549456 15570142 15950076 16507945 17150493 17588931 17787697 18902401 19241277
16761 19241277 19659934 20696799 21113003 21923884 22472088 23382552 24285448 25016526 25894245
16752 25894245 27062358 27703211 28916854 29880473 31447870 32434564 33861247 34781248 36513257
16743 36513257 38122520 39768414 41417957 42995708 45014292 46897900 49198959 51332920
$$ packed form
16809F196441k2887j1019K69270J34985K99497l07799M71295o7000K30491K60744
16799G454018J56996L27771j17897J31031J90270K59890n9499M85323K45991J48920
16789I222814j21531N24176L70501K01968J30451N02756N4637J44928M16638M3825
16779A1491163M13321K13272L94500O93749J7334K43199N84004J11791L56680
16770A4519013J030443K0686L79934N57869O42548M38438J98766J114704L38876
16761A9241277M18657J036865M16204Q10881N48204R10464R02896P31078Q77719
16752B5894245J168113O40853J213643R63619J567397R86694J426683R20001J732009
16743C6513257J609263J645894J649543J577751K018584J883608K301059K133961
$$ plain form
16735 51332920 53426309 56204046 58821945 61362657 64348070 67209089 70511985 73581639
16727 73581639 76894142 80509173 84426037 88102908 92475547 96597382 100603607 104640375
16719 104640375 109062113 113219823 117695604 121729511 125660281 129437718 132701115 136088301
16711 136088301 138885811 141316500 143252220 144486440 145585935 145849243 145425781 144827295
16703 144827295 143038169 141257948 138691116 135944471 132527089 129343833 125201721 121133815
16695 121133815 116840112 112558766 108021965 104045060 99710708 95412737 91221153 87119322
16687 87119322 83574662 79538730 75710286 72578347 69388325 65952198 62841445 60224369
16679 60224369 57230772 54867295 52170639 49810477 47638011 45972008 44055578 41778735
$$ packed form
16735E1332920K093389K777737K617899K540712K985413K861019L302896L069654
16727G3581639L312503L615031L916864L676871M372639M121835M006225M036768
16719A04640375M421738M157710M475781M033907L930770L777437L263397L387186
16711A36088301K797510K430689J935720J234220J099495K63308m23462n98486
16703A44827295j789126j780221k566832k746645l417382l183256m142112m067906
16695A21133815m293703m281346m536801l976905m334352m297971m191584m101831
16687H7119322l544660m035932l828444l131939l190022l436127l110753k617076
16679F0224369k993597k363477k696656k360162k172466j666003j916430k276843
$$ plain form
16671 41778735 40212040 38813516 37254777 35246732 33542743 32665424 31521107 30255791
16663 30255791 29094985 27851043 26727091 26179796 24970271 24288112 23230622 22899368
16655 22899368 21678464 20791003 20280354 19680611 18828171 18336384 17459986 17364484 16765069
16646 16765069 16162130 15862485 15246078 14847327 14798021 13847700 13795476 13406666 12920367 12642062
16636 12642062 12064109 11781646 11529367 11050700 10915478 10720457 10768788 10111809 9972640
16627 9972640 9934868 9487578 9117396 9170405 8984749 8554846 8257431 8239275 8065806 8103813
16617 8103813 7913831 7642087 7326232 7281537 7143551 7314651 6662942 6580557 6296899 6444551
16607 6444551 6296370 6186088 6111062 5807874 5411554 5745044 5554813 5665476 5312882 5460345
$$ packed form
16671D1778735j566695j398524j558739k008045j703989q77319j144317j265316
16663C0255791j160806j243942j123952n47295j209525o82159j057490l31254
16655B2899368j220904q87461n10649n99743q52440m91787q76398r5502n99415
16646A6765069o02939k99645o16407l98751m9306r50321n2224l88810m86299k78305
16636A2642062n77953k82463k52279m78667j35222j95021M8331o56979j39169
16627I972640l7772m47290l70182N3009j85656m29903k97415j8156j73469L8007
16617H103813j89982k71744l15855m4695j37986J71100o51709q2385k83658J47652
16607F444551j48181j10282p5026l03188l96320L33490j90231J10663l52594J47463
$$ plain form
16597 5460345 5320367 5037392 4993263 4827649 4830527 4341828 4504818 4193957 4239990 4472299
16587 4472299 4278228 4239889 4433339 4090737 3989789 4047423 4143089 3746563 3590929 3928196
16577 3928196 3671116 3688083 3724529 3542027 3673844 3754890 3564019 3388859 3187700 3186256
16567 3186256 3003762 3042583 3162074 3317143 3157734 2700205 2838030 2787768 2872176 2740793
16557 2740793 2573192 2476177 2762861 2792456 2778987 2584122 2379562 2546689 2533766 2476150
16547 2476150 2443088 2291997 2366412 2592795 2191816 2371835 2430727 2036158 2419190 2183021
16537 2183021 2216197 2345257 2260166 2140607 2039342 1813394 2153429 2134759 2566042 1673025
16527 1673025 2200814 1946995 2116035 2031243 1782905 1684503 2131961 1911953 1808412 1802412
$$ packed form
16597E460345j39978k82975m4129j65614K878m88699J62990l10861M6033K32309
16587D472299j94071l8339J93450l42602j00948N7634R5666l96526j55634L37267
16577C928196k57080J6967L6446j82502J31817Q1046j90871j75160k01159j444
16567C186256j82494L8821J19491J55069j59409m57529J37825n0262Q4408j31383
16557B740793j67601r7015K86684K9595j3469j94865k04560J67127j2923n7616
16547B476150l3062j51091P4415K26383m00979J80019N8892l94569L83032k36169
16537B183021L3176J29060q5091j19559j01265k25948L40035j8670M31283q93017
16527A673025N27789k53819J69040q4792k48338r8402M47458k20008j03541o000
$$ plain form
16517 1802412 1853294 1883900 1626450 1550675 1407486 1670396 1551527 1620850 1418094 1741121
16507 1741121 1752958 1410642 1677736 1386255 1535298 1528570 1711077 1555652 1575877 1413146
16497 1413146 1678030 1693871 1484357 1278387 1331481 1388114 1266391 1328075 1535211 1128248
16487 1128248 1440570 1229745 1301284 1307128 956294 1173967 1151963 1540515 1411663 994475
16477 994475 959820 1267280 1146489 1471951 1081164 1252217 1114992 1075033 1173757 907146
16467 907146 1145148 963356 1242363 1325933 1241547 974816 932045 1032504 1083451 907376
16457 907376 1134538 1091575 1055934 792424 935262 1469723 824364 856471 1268138 1287565
16447 1287565 1080504 1087418 905821 1075850 1027091 852049 719767 954609 518944 940733
$$ packed form
16517A802412N0882L0606k57450p5775j43189K62910j18869O9323k02756L23027
16507A741121J1837l42316K67094k91481J49043o728J82507j55425K0225j62731
16497A413146K64884J5841k09514k05970N3094N6633j21723O1684K07136m06963
16487A128248L12322k10825P1539N844l50834K17673k2004L88552j28852m17188
16477I94475l4655L07460j20791L25462l90787J71053j37225l9959R8724k66611
16467I07146K38002j81792K79007Q3570q4386k66731m2771J00459N0947j76075
16457I07376K27162m2963l5641k63510J42838N34461o45359L2107M11667J9427
16447A287565k07061O914j81597J70029m8759j75042j32282K34842m35665M21789
$$ plain form
16437 940733 822928 712480 886585 1028301 716680 576192 830687 1012606 770205 1017171
16427 1017171 1112888 813391 796873 999806 483515 639553 428062 702028 821517 910521
16417 910521 963515 771784 1142606 821629 1004091 1055866 917086 752817 449888 905549
16407 905549 848876 682966 638030 830955 824739 736105 1070133 666178 909180 833214 853666
16396 853666 804349 923498 425184 410641 431601 500105 568255 730731 671097 619465 692497
16385 692497 710705 689307 946692 487723 743814 803610 781936 829773 787284 458849 369721
16374 369721 726401 345739 602746 673282 592961 842831 516181 918919 467273 649728
16364 649728 606221 615357 755804 1012637 569779 1215561 584247 592207 745249 398654
$$ packed form
16437I40733j17805j10448J74105J41716l11621j40488K54495J81919k42401K46966
16427A017171R5717k99497j6518K02933D83515J56038k11491K73966J19489Q9004
16417I10521N2994j91731L70822l20977J82462N1775j38780j64269l02929M55661
16407I05549n6673j65910m4936J92925o216q8634L34028m03955K43002p5966K0452
16396H53666m9317J19149D25184j4543K0960O8504O8150J62476n9634n1632P3032
16385F92497J8208k1398K57385m58969K56091N9796k1674M7837m2489l28435q9128
16374C69721L56680C45739K57007P0536q0321K49870l26650M02738m51646J82455
16364F49728m3507R136J40447K56833m42858O45782E84247P960J53042l46595
$$ plain form
16354 398654 677909 295911 567352 187740 259345 664316 640386 628723 631081 412880
16344 412880 502706 491942 724212 663544 358765 680385 276606 663352 571830 874270
16334 874270 416044 328985 582633 514709 730115 397980 574046 654536 388068 426157
16324 426157 332469 401985 559169 645988 357570 321453 706734 370344 540066 405117
16314 405117 434546 522257 453027 396716 49223 659627 341169 350610 339173 801671 660891
16303 660891 267113 343166 472960 198143 614806 256360 145748 307076 483024 453952
16293 453952 354679 319715 490448 519335 532500 397898 427860 330780 262890 667969 62997
16281 607707 119766 189923 408290 112573 724838 282428 382821 347788 84727 500831
$$ packed form
16354C98654K79255B95911K71441A87740P1605M04971k3930j1663K358k18201
16344D12880Q9826j0764K32270o0668l04779L21620B76606L86746r1522L02440
16334H74270D16044q7059K53648o7924K15406l32135J76066Q0490k66468L8089
16324D26157r3688O9516J57184Q6819k88418l6117L85281l36390J69722j34949
16314D05117K9429Q7711o9230n6311D9223O10404l18458R441j1437M62498j40780
16303F60891B67113P6053J29794A98143M16663B56360j10612J61328J75948k9072
16293D53952r9273l4964J70733K8887J3165j34602K9962r7080o7890M05079F2997
16281F07707A19766P0157K18367A12573O12265B82428J00393l5033H4727M16104
$$ plain form
16271 500831 433870 244157 347520 665829 575872 266921 641872 131751 585752 555613
16261 555613 455302 377047 384529 662846 129301 516203 560944 224196 266321 332814 63412
16249 338101 263584 529645 382225 547479 320232 274998 410282 124817 697727 625808
16239 625808 296969 191854 362863 195911 62726 421392 532950 148567 577731 462266
16229 462266 675272 229076 413293 628805 500352 73303 348609 463999 202049 242929
16219 242929 37243 -1736 481313 288806 248279 168756 562150 255383 -44748 293236 268691
16208 268691 420015 121802 619643 301823 135873 89499 -31848 385381 260995 300849
16198 300849 158694 247974 100005 5220 130179 332588 289197 552368 288171 81520
$$ packed form
16271E00831o6961j89713J03363L18309q9957B66921L74951A31751M54001l0139
16261E55613j00311p8255P482K78317A29301L86902M4741B24196M2125O6493F3412
16249C38101p4517K66061j47420J65254k27247m5234J35284A24817N72910p1919
16239F25808B96969j05115J71009j66952F2726L58666J11558A48567M29164j15465
16229D62266K13006B29076J84217K15512j28453G3303K75306J15390B02049M0880
16219B42929C7243a736D81313j92507m0527p9523L93394B55383d4748B93236k4545
16208B68691J51324A21802M97841C01823A35873m6374c1848C85381j24386L9854
16198C00849j42155Q9280A00005E220J24959K02409m3391K63171k64197H1520
$$ plain form
16187 290080 557945 539592 390103 -85717 197069 126039 351579 171406 262855 259679 110071
16175 465238 118111 65929 270214 -25603 66427 144142 318997 -12162 391657 198325
16165 198325 100999 333280 149594 329798 -166868 148596 186145 -70635 456433 141764
16154 382213 70544 -63718 408430 208672 391030 -39145 190455 339260 174764 -202252
16143 -79173 239868 369800 -206173 210515 175004 312501 88061 -22182 284545 -24296
16132 52377 -116478 493274 178614 100778 1969 266815 31703 87743 114385 24782 239278
16121 239278 89089 883 212965 307038 303831 22833 81454 38491 14521 292583 -24873 175913
16108 -15375 118773 547496 36858 238768 50852 244912 -25711 -219823 -35894 304838
$$ packed form
16187B90080K67865j8353j49489h5717A97069p1030K25540A71406R1449l176A10071
16175D65238A18111n2182K04285b5603F6427P7715J74855a2162C91657j93332
16165A98325r7326K32281A49594J80204a66868A48596L7549g0635D56433A41764
16154C82213G0544f3718D08430j99758J82358c9145A90455J48805j64496b02252
16143g9173B39868J29932b06173B10515l5511J37497H8061b2182B84545b4296
16132E2377a16478D93274A78614p7836A969K64846C1703N6040K6642B4782K14496
16121B39278H9089H83K12082R4073l207B2833N8621C8491A4521K78062b4873A75913
16108a5375A18773M28723C6858K01910E0852J94060b5711j94112c5894C04838
$$ plain form
16097 99866 173147 226416 287817 -210754 -324742 12159 29877 -349732 -144001 -89855 150165
16085 33061 -52019 200319 -132787 123430 216866 235620 91915 34510 4672 -194343 113723
16073 -53379 352069 111861 249869 217206 216470 38308 -11983 75509 118085 227981 259943
16062 259943 31874 254717 73411 163434 -146488 -13702 133520 256330 -151533 1144 180433
16051 180433 -6494 -134901 139859 201570 97696 84601 -238203 43266 167582 116079 -49119
16039 92750 -61765 -65149 -56921 11032 146369 254873 58398 -104690 111239 37042 13629
16027 405729 22002 -68172 182412 187249 -146302 -90645 39289 -63841 21129 5740 228026
16016 228026 -92907 -124230 249770 -141037 223726 -242377 -123917 117154 202676 -144252
$$ packed form
16097I9866P3281N3269O1401b10754j13988A2159J7718c49732a44001N4146A50165
16085C3061e2019B00319a32787A23430R3436J8754I1915C4510D672a94343A13723
16073e3379C52069A11861J38008l2663p36C8308a1983G5509M2576J09896L1962
16062B59943C1874K22843G3411R0023a46488a3702A33520J22810a51533A144J79289
16051A80433f494j28407A39859O1711I7696j3095b38203D3266J24316n1503d9119
16039I2750f1765l384Q228A1032J35337J08504E8398a04690A11239C7042A3629
16027D05729B2002f8172A82412M837a46302N5657C9289f3841B1129E740K22286
16016B28026i2907l1323B49770a41037B23726b42377J18460A17154Q5522a44252
$$ plain form
16005 -206990 -160531 121052 -100649 288445 97351 108535 72728 23540 208121 -80539 -253509
15994 -253509 -31856 56992 83855 -104092 -140491 -39423 181197 -199112 -56324 -131635 38067
15982 199589 169168 92506 4291 78765 84441 44837 143007 191468 187639 234014 692412 737953
15970 737953 559226 620003 785335 648762 560123 215908 113306 -30038 310202 152765
15959 -27364 88930 51166 -60664 145856 -133039 -21512 -21186 -235417 -139382 -121049 -150438
15948 -150438 -232440 -169210 -24167 -140452 -304242 67131 -193991 155065 -213260 -114186
15938 -114186 233611 -103710 184556 -144603 -128818 -127408 71288 -100353 8767 -67579 -108509
15927 -108509 -130947 -171058 143187 -143854 -75781 -25074 62266 -284480 -24232 41697 23117
$$ packed form
16005b06990M6459A21052a00649B88445I7351J1184l5807B3540J84581h0539j72970
15994b53509c1856E6992K6863a04092l6399c9423A81197a99112e6324p5311C8067
15982A99589l0421p6662D291P4474N676l9604R8170M8461l829M6375M58398M5541
15970G37953j78727O0777J65332j36573q8639B15908j02602c0038C10202A52765
15959b7364H8930l7764f0664A45856a33039b1512L26k14231R6035J8333k9389
15948a50438q2002O3230b4167j16285j63790F7131a93991A55065b13260R9074
15938a14186B33611a03710A84556a44603J5785J410G1288a00353H767f7579m0930
15927a08509k2438m0111A43187a43854O8073b5074F2266b84480b4232D1697j8580
$$ plain form
15916 23117 1347 -110277 59016 39054 339540 177491 -287968 -12423 -123940 -144641 -57860
15904 23022 114329 71813 119648 -261576 -11981 -16068 -62282 156601 -45744 169674 -77937
15892 -64105 337867 -103260 -110636 -45912 167552 -560405 116331 -34431 128208 85400 242686
15881 242686 -193164 -199124 -242291 131556 -76480 -149589 76385 -201602 -91589 -374633 9441
15869 -143213 262157 -64666 226112 110822 -35373 -13067 35891 19795 190423 -202326
15858 -136849 -62617 -179899 -18338 -237545 -316438 39193 5867 291064 -117431 -45313 -227761
15847 -227761 93213 -251604 -224844 227886 -103392 -92498 204689 310053 170291 194216
15837 194216 -119148 156535 -342088 131395 12678 37336 -72062 44043 -181160 43288
$$ packed form
15916B3117A347a10277E9016j9962L00486j62049b87968a2423j11517k0701e7860
15904B3022R1307m2516M7835b61576a1981m087m6214A56601d5744A69674g7937
15892f4105C37867a03260p376d5912A67552e60405A16331c4431A28208m2808J57286
15881B42686a93164n960m3167A31556g6480p3109G6385b01602i1589k83044I441
15869a43213B62157f4666B26112A10822c5373a3067C5891j6096J70628b02326
15858a36849f2617j17282a8338k19207p8893C9193E867K85197a17431d5313j82448
15847b27761I3213b51604K6760B27886a03392J0894B04689J05364j39762K3925
15837A94216a19148A56535c42088A31395A2678K4658g2062D4043a81160D3288
$$ plain form
15826 24770 -167513 280871 277631 -83935 38478 17561 -92453 248789 -133493 76156 -129003
15814 216913 114013 -337419 165319 -23937 -56268 -113727 8393 -180209 -104769 61673 -209585
15802 -383542 -231227 133937 -160878 -9091 -203526 131724 -204935 -222618 -284005 -88706
15791 192735 -194542 -112717 -307909 167738 137598 233194 -272802 3184 100987 -64920 -38741
15780 -38741 72937 59242 47325 240971 -129954 6048 58244 -102204 170907 -186119 -41198
15768 -271837 2388 -208675 -111719 172259 -106964 11415 167463 -200001 392860 45708
15757 -4024 35464 -147903 -341205 -26966 322672 -117790 -199354 202901 19681 -2579 122744
15745 -32082 3211 -160783 -47404 -34449 58858 -38925 204432 466734 15008 30510 -147711
$$ packed form
15826B4770a67513B80871l240h3935C8478A7561i2453B48789a33493G6156a29003
15814B16913j02900c37419A65319b3937l2331n7459H393a80209P5440F1673b09585
15802c83542J52315A33937a60878i091j94435A31724b04935j7683o1387h8706
15791A92735a94542Q1825j95192A67738l0140R5596b72802C184R7803f4920K6179
15780c8741G2937j3695j1917J93646a29954F048N2196a02204A70907a86119d1198
15768b71837B388b08675R6956A72259a06964A1415J56048b00001C92860D5708
15757d024C5464a47903j93302b6966C22672a17790q1564B02901A9681b579A22744
15745c2082C211a60783d7404J2955E8858c8925B04432K62302A5008J5502a47711
$$ plain form
15733 185766 -232819 43745 114724 -32235 -286351 87961 -102353 -113604 27452 -71707 -339773
15722 -339773 -89821 -28028 -216000 -229963 47620 -12494 54026 3457 -91375 39669 39683 70609
15710 70609 -64780 115614 127317 -266554 263159 -247190 148599 52074 -115021 57181
15699 -15620 -47684 152679 -27587 82030 -260831 -291809 -131808 -59589 -87670 3863 -157077
15687 -262488 189129 -60263 -74437 247978 71342 -295588 -245406 -215267 -156785 -94361 95782
15675 -152590 75663 412518 91126 -1421 84811 321215 -84830 -12039 -208281 -61898 -32362
15664 -32362 63633 179974 -167945 -45589 -93905 -265363 279736 -246641 -199695 207526
15653 -229604 -82803 -73689 -215682 -151831 -59340 -214643 266386 180932 -9177 276973 -195328
$$ packed form
15733A85766b32819D3745P0979c2235k54116H7961a02353j1251B7452g1707k68066
15722c39773h9821b8028j87972j3963D7620a2494E4026C457i1375C9669J4L0926
15710G0609f4780A15614J1703b66554B63159b47190A48599E2074a15021E7181
15699a5620l2064A52679b7587H2030b60831l0978a31808e9589k8081C863a57077
15687b62488A89129f0263j4174B47978G1342b95588N0182L0139N8482O2424I5782
15675a52590G5663L36855I1126a421H4811K36404h4830a2039j96242f1898K9536
15664c2362F3633J16341a67945d5589m8316j71458B79736b46641M6946B07526
15653b29604h2803R114j41993O3851e9340j55303B66386q5454i177B76973a95328
$$ plain form
15641 326505 -7161 283717 -1869 -106552 16182 -188161 55477 230752 -309605 233267 88992
15629 35430 74745 -419421 -291601 -82351 -62506 277198 -205752 250459 -242254 -102530
15618 47538 -160944 -90511 -77914 -347142 -157167 -184391 -40204 -46914 -239086 -301495 -177192
15607 -177192 -126624 108000 23218 57855 86011 90127 -69945 -63247 -137055 -10367 82954 30247
15594 -173786 -222626 114665 285481 -44281 -40427 -14982 138214 173396 278993 -182773 -114271
15583 -114271 180914 -44886 92609 31226 15740 -209327 152678 90173 -82850 -286517 -29002
15571 -132903 258145 180164 -54453 186161 116103 68714 37897 -112320 -68953 305386 -165199
15559 -73198 -18016 25082 -114312 -97821 -211389 -178931 195699 -165637 -437545 -315273
$$ packed form
15641C26505g161B83717a869j04683A6182a88161E5477J75275c09605B33267H8992
15629C5430L9315d19421J27820h2351J9845B77198b05752B50459b42254a02530
15618D7538a60944P0433J2597k69228a57167k7224d0204o710j92172o2409J24303
15607a77192N0568A08000B3218L4637K8156M116f9945O698p3808a0367H2954C0247
15594a73786m8840A14665J70816d4281L854a4982A38214L5182J05597a82773O8502
15583a14271A80914d4886I2609C1226j5486b09327A52678o2505h2850k03667b9002
15571a32903B58145p7981e4453A86161p0058m7389l0817a12320M3367C05386a65199
15559g3198a8016B5082a14312J6491j13568L2458A95699a65637k71908J22272
$$ plain form
15549 -315273 36845 166387 -140172 -102979 310491 -179704 -156080 49571 -109458 -205086
15539 -205086 -244692 -118693 19935 384335 -331862 173676 25579 33395 -103953 -241320
15529 -241320 157276 -49721 -78221 -279108 99319 -254836 121598 148815 393700 -140512
15518 130661 66752 -171958 -199046 23074 187564 175570 139956 -70466 50032 -96817 -23746
15506 214387 -57221 -122280 -47633 264276 -125071 9652 139750 -50991 83204 143546 42020
15494 124099 203476 267542 85095 84784 34370 141762 4515 -59437 138847 120601 103067 -266845
15481 110227 183358 5177 -39890 363620 21705 169769 73899 202044 191556 56417 165138
15470 165138 -43204 96805 -135088 60600 287023 -151301 -40252 86059 -194509 191133
$$ packed form
15549c15273C6845J29542a40172L7193C10491a79704K3624D9571a09458r5628
15539b05086l9606a18693A9935L64400c31862A73676B5579P816a03953j37367
15529b41320A57276d9721k8500k00887I9319b54836A21598K7217K44885a40512
15518A30661o3909a71958k7088B3074J64490j1994l5614g0466E0032i6817b3746
15506B14387e7221o5059d7633B64276a25071I652J30098e0991H3204O0342D2020
15494A24099P9377O4066H5095l11C4370J07392D515e9437A38847j8246j7534b66845
15481A10227P3131E177c9890C63620B1705J48064G3899J28145j0488E6417J08721
15470A65138d3204I6805a35088F0600K26423a51301d0252H6059a94509A91133
$$ plain form
15459 -103935 221546 73914 361738 478473 309441 414216 285706 34381 58261 156424
15449 156424 440819 -62872 -152533 -3620 -402384 247922 205863 23463 134668 -77320 73507
15437 -162847 200275 28600 -327259 67282 116330 145801 -96013 161001 234448 240276 -24421
15425 174452 787243 835382 448225 447957 346399 28420 129784 241243 -64823 418018 411284
15414 411284 56093 -242755 142658 86727 -34591 94942 -89155 191750 80076 -21524 47502
15402 30698 -181685 43230 401825 106861 -99624 15887 156068 -210770 200399 -55024
15391 303472 137000 -295476 27096 5979 -366675 26962 175489 -107100 164029 -120295
15380 154631 -26282 -108988 219437 25070 -25782 -176008 -28419 195506 -122643 -61430 -484693
$$ packed form
15459a03935B21546G3914K87824J16735j69032J04775j28510C4381K3880R8163
15449A56424K84395f2872q9661c620l98764B47922m2059B3463J11205g7320G3507
15437a62847B00275B8600c27259F7282M9048K9471i6013A61001P3447N828b4421
15425A74452O12791M8139l87157k68j01558B8420J01364J11459f4823D18018o734
15414D11284E6093b42755A42658n5931c4591I4942h9155A91750H0076b1524D7502
15402C0698a81685D3230L58595A06861i9624A5887J40181b10770B00399e5024
15391C03472A37000b95476B7096E979c66675B6962J48527a07100A64029a20295
15380A54631b6282q2706B19437B5070b5782j50226b8419A95506a22643O1213m23263
$$ plain form
15369 -484693 139997 49767 -29040 -45380 39782 64611 -166439 83182 117321 -187001 49762
15357 276352 285187 105371 24957 232898 300591 -186375 -92464 -24859 276503 -119551 200175
15345 448802 106093 353206 -81259 -55051 149245 222541 42607 -9096 80168 382074 357384
15334 357384 310361 -168071 124769 -127831 124767 188701 222954 352907 -37528 158635
15323 470460 79415 211966 50391 104019 141995 -59320 -37688 -239005 -55510 -77877 65952
15311 68359 36781 226001 11623 -139113 -73095 -70045 23356 167545 -104054 -35795 232228
15299 -252082 212116 -29977 142855 60859 -30328 131291 301034 338103 211633 44213
15288 144578 -119252 26451 -34883 -3056 -140345 -19779 -3892 249149 -215937 -112706 336198
$$ packed form
15369d84693A39997D9767b9040j6340C9782K4829a66439H3182L4139a87001D9762
15357B76352Q835A05371B4957K07941O7693a86375i2464b4859B76503a19551B00175
15345D48802A06093K47113h1259K6208A49245P3296D2607i096H0168L01906k4690
15334C57384m7023a68071A24769a27831A24767O3934L4253J29953c7528A58635
15323D70460G9415J32551E0391N3628L7976e9320K1632k01317e5510k2367F5952
15311F8359l1578J89220A1623a39113O6018L050B3356J44189a04054c5795B32228
15299b52082B12116b9977A42855F0859c0328A31291J69743L7069j26470D4213
15288A44578a19252B6451c4883c056j37289a9779c892B49149b15937J03231C36198
$$ plain form
15276 28090 -42187 -113103 84651 -212748 -52842 38430 320657 249762 -268617 23993 -26347
15264 207118 155193 179581 -33708 555440 159334 513 63443 -201350 23376 196923 136169
15253 136169 -11571 235242 -209839 -173738 -249016 -52509 -51133 -62982 -45431 115286 92688
15242 92688 -327210 154988 72907 -217586 6581 140039 147113 -61637 34650 434319 300436
15231 300436 917590 1054867 1089871 747861 1119176 1253212 323088 150265 -7909 115129
15220 39301 158614 135160 102126 115668 208560 37895 -19745 -41449 -1022 -68973 62322 205758
15208 205758 39348 -79651 -41298 74261 -23333 308643 -106066 172307 -57101 -17063 169889
15196 328267 -20454 397129 264581 -50745 61025 31361 317663 422670 177466 63523
$$ packed form
15276B8090d2187p0916H4651b12748e2842C8430K82227p0895b68617B3993b6347
15264B07118n1925K4388c3708E55440A59334E13O2930b01350B3376J73547o0754
15253A36169a1571B35242b09839L6101p5278e2509J376j1849J7551A15286k2598
15242I2688c27210A54988G2907b17586F581J33458P074f1637C4650L99669j33883
15231C00436O17154J37277L5004l42010L71315J34036C23088A50265g909A15129
15220C9301J19313k3454l3034J3542R2892C7895a9745k1704a022o7951F2322J43436
15208B05758C9348g9651L8353G4261b3333C08643a06066A72307e7101a7063A69889
15196C28267b0454C97129j32548e0745F1025k9664K86302J05007A77466F3523
$$ plain form
15185 116938 -94046 268040 -202945 -38918 -21772 331133 -39786 -39911 -65105 26719 52024
15174 52024 -40921 123194 39335 -154055 23595 474744 -218784 -2732 122870 -26307 303520
15162 -214239 -98692 -116374 242591 32957 97894 225381 -53105 -86085 315485 -35626 8256
15150 16590 -155057 -90904 142110 120047 188059 -194510 46177 -325329 256251 46936 299045
15139 299045 -130161 -37551 -356922 -23747 -233687 -53223 264819 274186 80981 -83405 240704
15127 -58890 210442 -76405 -96273 -52881 87464 79630 115688 245116 197625 95312 -281833
15115 144929 364603 3582 105520 -14649 34857 117236 70863 -36234 -136109 -66253 113614
15103 545163 75078 165435 364261 144943 604 97648 -214367 -53997 188330 -54803 440028
$$ packed form
15185A16938i4046B68040b02945c8918J7146C31133c9786j25k5194B6719K5305
15174E2024d0921A23194C9335a54055B3595M51149b18784b732A22870b6307C03520
15162b14239i8692j7682B42591C2957O4937J27487e3105l2980C15485c5626H256
15150A6590a55057O4153A42110k2063O8012a94510D6177c25329B56251D6936K52109
15139B99045a30161c7551l19371b3747k09940e3223B64819R367H0981h3405B40704
15127e8890B10442g6405j9868M3392H7464p834L6058J29428m7491I5312b81833
15115A44929K19674C582J01938a4649C4857Q2379m6373c6234r9875f6253A13614
15103E45163G5078R0357J98826A44943F04R7044b14367e3997A88330e4803D40028
$$ plain form
15091 59794 384162 2473 -188396 99399 42913 -38083 7878 324746 -107836 23681 93863
15080 93863 49624 499548 -85204 -64452 -82532 83862 569462 -195589 248229 48088 -63504
15068 151325 262828 80553 154638 212327 11138 76077 244069 582011 192559 94417 -15059
15056 -38218 122802 407121 53812 -88869 84184 -126717 32440 338675 48966 166169 353713
15045 353713 253979 70125 415737 638209 334113 346904 63311 404814 472089 412959 471080
15034 471080 155663 453249 208615 455518 154563 66810 280132 229500 130182 210804
15024 210804 482764 80343 400083 205571 348808 343364 452327 207997 512005 757537
15014 757537 315353 418638 710408 472939 463988 454491 362792 561077 380034 301724 443662
$$ packed form
15091E9794L24368B473a88396I9399D2913c8083G878L16868a07836B3681P0182
15080I3863m4239M49924h5204K0752j8080H3862M85600a95589B48229D8088f3504
15068A51325J11503H0553P4085N7689A1138O4939J67992L37942A92559I4417a5059
15056c8218A22802K84319E3812h8869H4184a26717C2440L06235D8966J17203J87544
15045C53713r9734G0125L45612K22472l04096J2791F3311L41503O7275n9130N8121
15034D71080A55663K97586B08615K46903A54563F6810K13322n0632r9318Q0622
15024B10804K71960H0343L19740j94512J43237n444J08963B07997L04008K45532
15014G57537C15353J03285K91770k37469q951r497r1699J98285j81043p8310J41938
$$ plain form
15003 443662 474913 202718 383850 347813 503583 427940 386452 409398 358810 340589 688474
14992 688474 572775 413526 102175 227197 452074 359928 230467 391664 472596 289028
14982 289028 619022 491047 451531 249395 387052 281888 662965 216388 289284 433997
14972 433997 314465 404353 304325 394372 751818 435398 398136 680493 669790 715186
14962 715186 839903 392478 461049 591416 219473 161366 613979 593510 272380 221283
14952 221283 432677 424984 358357 364424 151611 -181777 575231 112469 339829 630981
14942 630981 448239 354055 380872 399476 491995 159683 617962 441258 337884 153201
14931 433646 158370 14212 219702 752382 298907 700160 320709 309515 403043 90023
$$ packed form
15003D43662L1251B02718J81132l6037J55770p5643m1488K2946n0588j8221L47885
14992F88474j15699j59249A02175J25022K24877r2146j29461J61197Q0932j83568
14982B89028L29994j27975l9516k02136J37657j05164L81077B16388P2896J44713
14972D33997j19532Q9888j00028R0047L57446l16420l7262K82357j0703M5396
14962G15186J24717C92478O8571J30367B19473n8107M52613k0469B72380n1097
14952B21283K11394p693o6627O067A51611a81777E75231A12469K27360K91152
14942F30981j82742r4184K6817J8604R2519A59683M58279j76704j03374A53201
14931D33646A58370A4212K05490N32680B98907M01253C20709j1194R3528I0023
$$ plain form
14920 304370 349044 303467 327000 451191 166136 378325 622049 931390 1078741 943712
14910 943712 1136204 1327495 1455876 1484000 1258668 1236799 1227256 1330145 1326612 1255059 1665500
14899 1665500 1530332 1715594 1424222 1379915 626871 1249292 665134 800608 437704 239633
14889 239633 113925 254400 587118 503109 392997 463127 25262 128500 425374 476367
14879 476367 326545 446765 41989 288494 195882 655402 234013 911276 454110 122415
14868 433102 694860 357619 675470 540766 570783 630524 620601 428993 655799 444604
14858 444604 684154 448421 639103 695019 348491 297160 550815 616202 495230 649808
14848 649808 883789 415099 637175 336746 675562 648568 546389 661375 179380 650772
$$ packed form
14920C04370M4674m5577K3533J24191A66136K12189K43724L09341J47351j35029
14910I43712J92492J91291J28381K8124k25332k1869r543J02889l533p1553M10441
14899A665500j35168J85262k91372m4307F26871O22421n84158J35474l62904j98071
14889B39633A13925J40475L32718q4009j10112P0130B5262J03238K96874N0993
14879D76367j49822J20220D1989K46505r2612M59520B34013O77263D54110A22415
14868D33102K61758l37241L17851j34704L0017N9741r923j91608K26806k11195
14858D44604K39550k35733J90682N5916l46528n1331K53655O5387j20972J54578
14848F49808K33981D15099K22076l00429L38816k6994j02179J14986A79380M71392
$$ plain form
14838 650772 372214 576085 415348 754921 268281 356777 443403 480459 251258 371778
14828 371778 212755 363278 729788 815296 515783 908161 955290 788164 1097388 484405
14817 1044570 722313 707075 414826 656282 633210 539537 317104 719487 475479 683496
14807 683496 577549 660222 403435 666708 584557 589754 705770 655618 691146 687322 927332
14796 927332 680773 693279 362138 561166 500789 723202 531097 283487 629952 853343
14786 853343 515578 790426 566514 782239 580074 814012 610734 409610 403810 488516
14776 488516 420624 591456 360760 399690 493875 766734 530519 386455 745836 738904
14766 738904 510138 817997 354479 844678 842135 452393 821030 982736 435442 666756
$$ packed form
14838F50772k78558K03871j60737L39573B68281Q8496Q6626L7056k29201J20520
14828C71778j59023J50523L66510Q5508k99513L92378M7129j67126L09224D84405
14817A044570l22257j5238k92249K41456k3072r3673k22433M02383k44008K08017
14807F83496j05947Q2673k56787K63273q2151N197J16016n0152L5528l824K40010
14796I27332k46559J2506l31141J99028o0377K22413j92105k47610L46465K23391
14786H53343l37765K74848k23912K15725k02165K33938k03278k01124n800Q4706
14776D88516o7892J70832k30696L8930R4185K72859k36215j44064L59381o932
14766G38904k28766L07859C54479M90199k543l89742L68637J61706D35442K31314
$$ plain form
14756 666756 707862 679271 539019 703124 419602 393156 628404 685234 328272 350893
14746 350893 612983 338736 964330 539744 721498 525433 669744 347290 819485 1001465
14736 1001465 624788 708756 982367 662185 431742 562852 793616 720645 679392 641844
14726 641844 726449 646458 719821 645557 717535 384565 894989 642092 849987 750074 604628
14715 604628 957507 839042 893403 1065284 840377 1277264 1625664 1277743 1253959 1417389
14705 1417389 1365781 1134228 1283251 983308 1036070 558727 899672 838188 673624 734134
14695 734134 727719 1032120 903129 890076 875752 909140 854122 992371 1154789 880689 1580280
14684 1580280 1521019 1520621 1372326 1383783 1284117 1362944 1243740 1022294 1162058 915607 1110219
$$ packed form
14756F66756M1106k8591j40252J64105k83522k6446K35248N6830C28272K2621
14746C50893K62090k74247O25594m24586J81754j96065J44311l22454M72195J81980
14736A001465l76677Q3968K73611l20182k30443J31110K30764p2971m1253l7548
14726F41844Q4605p9991P3363p4264P1978l32970N10424k52897K07895r9913j45446
14715F04628L52879j18465N4361J71881k24907M36887L48400l47921k3784J63430
14705A417389n1608k31553J49023k99943N2762m77343L40945o1484j64564O0510
14695G34134o415L04401j28991j3053j4324L3388n5018J38249J62418k74100O99591
14684A580280n9261l98j48295J1457r9666P8827j19204k21446J39764k46451J94612
$$ plain form
14673 1110219 1088710 675493 919437 607270 1114832 1188133 881320 875428 694623 837016
14663 837016 1006649 965351 578842 823170 969052 597801 594495 559568 843301 866005
14653 866005 926666 1102161 829858 833816 939671 913273 1117954 959178 952038 832953 1057624
14642 1057624 1156800 1362974 1155999 1092253 1110766 1086310 1115074 1174875 1042628 1307019
14632 1307019 885715 1135933 802282 943656 1259650 1115468 843756 1454598 778059
14623 778059 903858 1132642 1324020 1026835 1175306 1161221 1260693 1287134 1099188 944954
14613 944954 955786 1116920 1387350 1128095 1200967 1426915 1245432 1169626 1209910 1518242
14603 1518242 1248641 1253491 1309351 1146192 893874 1181535 1521331 1309151 1226800 1157497
$$ packed form
14673A110219k1509m13217K43944l12167N07562P3301l06813n892j80805J42393
14663H37016J69633m1298l86509K44328J45882l71251l306l4927K83733K2704
14653H66005O0661J75495k72303L958J05855k6398K04681j58776p140j19085K24671
14642A057624R9176K06174k06975o3746J8513k4456K8764N9801j32247K64391
14632A307019m21304K50218l33651J41374L15994j44182k71712O10842o76539
14623G78059J25799K28784J91378k97185J48471j4085R9472K6441j87946j54234
14613I44954J0832J61134K70430k59255P2872K25948j81483p5806M0284L08332
14603A518242k69601M850N5860j63159k52318K87661L39796k12180q2351o9303
$$ plain form
14593 1157497 1398470 1308074 1291772 1378692 1410827 1400779 1344549 1804567 1344862 1506222
14583 1506222 1346402 1304116 1323239 1548737 1506166 1466348 1643142 1202203 1731548 1574859
14573 1574859 1790620 1577700 1715758 1814210 1961126 1522046 1656596 1710908 1654214 1835856
14563 1835856 1666318 1917529 1870249 1892481 1701589 2062817 1859704 1900396 1952278 1866883
14553 1866883 2351806 2276703 1988567 2078237 2182224 2368529 2354348 2558542 2653110 2639579
14543 2639579 2854473 3252270 3389571 3558066 3943966 4512479 4829480 5672623 6727766
14534 6727766 9117781 13530031 19909106 28656132 27422429 17140158 10950345 7849635
14526 7849635 6141539 5042938 3406538 2905101 2811359 2425120 2430029 2081466 2096588 2390785
$$ packed form
14593A157497K40973r0396j6302Q6920L2135j0048n6230M60018m59705J61360
14583A506222j59820m2286J9123K25498m2571l9818J76794m40939N29345j56689
14573A574859K15761k12920J38058R8452J46916m39080J34550N4312n6694J81642
14563A835856j69538K51211m7280K2232j90892L61228k03113M0692N1882q5395
14553A866883M84923p5103k88136Q9670J03987J86305j4181K04194R4568j3531
14543B639579K14894L97797J37301J68495L85900N68513L17001Q43143J055143
14534F727766K390015M412250O379075Q747026j233703j0282271o189813l100710
14526G849635j708096j098601j636400n01437r3742l86239M909l48563J5122K94197
$$ plain form
14516 2390785 2027091 2143222 2144272 2219537 2318679 1910553 2405346 1936613 2139926 2019206
14506 2019206 2365744 2332506 2119379 2544601 2351113 2689198 2406368 2375743 2472303 2419154
14496 2419154 2480108 2819659 2515249 2614817 2612056 2473208 2567332 2881592 2456472 2725674
14486 2725674 2745389 2933850 3058821 2868069 2988054 3061726 3000250 3101725 2804461 3179874
14476 3179874 3115362 3030367 3764982 3377894 3302737 3231027 3040248 3205172 3274047 3711173
14466 3711173 3398244 3287467 3301313 3531811 3480365 3646150 3510724 3769782 3853793 3948621
14456 3948621 3751994 3913832 3930625 4045664 4091033 4015235 3888597 3778488 4302291 4370509
14446 4370509 4328782 4350879 4400118 4737342 4834040 4589609 4761440 4832647 4248627 4707844
$$ packed form
14516B390785l63694J16131J050P5265R9142m08126M94793m68733K03313j20720
14506B019206L46538l3238k13127M25222j93488L38085k82830l0625R6560n3149
14496B419154O0954L39551l04410R9568k761j38848R4124L14260m25120K69202
14486B725674J9715J88461J24971j90752J19985P3672o1476J01475k97264L75413
14476C179874o4512q4995P34615l87088p5157p1710j90779J64924O8875M37126
14466C711173l12929j10777J3846K30498n1446J65785j35426K59058Q4011R4828
14456C948621j96627J61838J6793J15039M5369p5798j26638j10109N23803O8218
14446D370509m1727K2097M9239L37224R6698k44431J71831P1207n84020M59217
$$ plain form
14436 4707844 4839357 4782600 5018416 5202015 5067167 5137172 5315263 5539923 5154662 5816080
14426 5816080 5606790 5350334 5444409 5771293 6010640 5850692 6164406 5927309 6168239 6436761
14416 6436761 6253388 6481540 6483625 6485284 6378810 6476879 6738000 6949415 7219487 6967722
14406 6967722 7246432 7193779 7560713 7582405 7700279 7848633 7889076 7960630 8039615 8122307
14396 8122307 8171082 8571135 8749482 8763603 8757964 8840406 8953149 9149000 9576934 9486842
14386 9486842 9529599 10002268 9852668 10227482 10370814 10414525 10379972 10429637 10908744 11027960
14376 11027960 11257602 11590795 11377257 11586744 12004011 12026861 12416069 12941609 12987918 13401439
14366 13401439 13153777 13526884 13853760 14437814 14638526 14666053 14948638 15621633 15785433
$$ packed form
14436D707844J31513n6757K35816J83599j34848P0005J78091K24660l85261O61418
14426E816080k09290k56456R4075L26884K39347j59948L13714k37097K40930K68522
14416F436761j83373K28152K085J659j06474R8069K61121K11415K70072k51765
14406F967722K78710n2653L66934K1692J17874J48354M0443P1554P8985Q2692
14396H122307M8775M00053J78347J4121n639Q2442J12743J95851M27934r0092
14386I486842M2757M72669j49600L74814J43332M3711l4553M9665M79107J19216
14376A1027960K29642L33193k13538K09487M17267K2850L89208N25540M6309M13521
14366A3401439k47662L73107L26876N84054K00712K7527K82585O72995J63800
$$ plain form
14357 15785433 16051647 16370179 15987027 16815810 16751886 17574223 17687201 18320657 18811846
14348 18811846 19125187 19331880 19892664 20357444 20849175 21330319 21835810 22211775 22616039
14339 22616039 23123281 23626507 24387452 25014849 25147904 26183404 26944095 27356874 28245598
14330 28245598 28603818 29424822 30442003 31223682 31940581 33255034 33802701 34820203 35917305
14321 35917305 36833029 37818166 39029108 40328219 41687211 42985302 44303993 45434401
14313 45434401 46998713 48629295 50091141 52199025 53680173 55918861 57740292 59777830
14305 59777830 61950445 64369430 66853196 69721946 72033060 74937883 77687562 80773760
14297 80773760 84148124 87632860 91752056 95768553 99842220 104355864 109397588 114730649
$$ packed form
14357A5785433K66214L18532l83152Q28783o3924Q22337J12978O33456M91189
14348A8811846L13341K06693N60784M64780M91731M81144N05491L75965M04264
14339B2616039N07242N03226P60945O27397J33055J035500P60691M12779Q88724
14330B8245598L58220Q21004J017181P81679P16899J314453N47667J017502J097102
14321C5917305R15724R85137J210942J299111J358992J298091J318691J130408
14313D5434401J564312J630582J461846K107884J481148K238688J821431K037538
14305E9777830K172615K418985K483766K868750K311114K904823K749679L086198
14297H0773760L374364L484736M119196M016497M073667M513644N041724N333061
$$ plain form
14289 114730649 120217104 125662954 132109839 138238533 145610416 153158644 160994549 169060915
14281 169060915 178339005 187624612 197583932 207575071 219695024 231459195 243763213
14274 243763213 256690098 270523467 284472086 298879911 313617142 328320713 343576372
14267 343576372 358169136 372766560 386083810 398499607 410354183 421333965 430949361
14260 430949361 440136025 448331944 454397241 456986348 458378530 460183970 458050586 449845526
14252 449845526 444598347 437957113 428787756 417245174 404492174 390612235 375962666
14245 375962666 361376498 346731587 332259946 317724594 303305180 289344521 275689392
14238 275689392 262411888 250158033 238541809 226906173 214476547 202583503 191596288
$$ packed form
14289A14730649N486455N445850O446885O128694P371883P548228P835905Q066366
14281A69060915R278090R285607R959320R991139J2119953J1764171J2304018
14274B43763213J2926885J3833369J3948619J4407825J4737231J4703571J5255659
14267C43576372J4592764J4597424J3317250J2415797J1854576J0979782R615396
14260D30949361R186664Q195919O065297K589107J392182J805440k133384q205060
14252D49845526n247179o641234r169357j1542582j2753000j3879939j4649569
14245C75962666j4586168j4644911j4471641j4535352j4419414j3960659j3655129
14238B75689392j3277504j2253855j1616224j1635636j2429626j1893044j0987215
$$ plain form
14231 191596288 181744279 172408231 163522259 155309378 147650936 140362952 134008705 127185753
14223 127185753 121424914 116052251 110659839 105717261 101036740 96942502 92639284 89179272
14215 89179272 85272095 81853902 78447784 75601976 72485497 70132779 67126154 64763745
14207 64763745 62396001 60541484 57902285 56332399 54042888 52230051 50637665 48897378
14199 48897378 47673452 46154756 44849504 43192635 41653752 40918979 39637250 39043046
14191 39043046 37801483 36464028 35214142 34414690 33105977 32715771 32131593 30905924
14183 30905924 30141690 29165565 28819632 28053766 27308309 26501167 25593464 25247259 24627038
14174 24627038 23947333 23507668 23007722 22386994 21505489 21354878 20527279 20306981 19819872
$$ packed form
14231A91596288r852009r336048q885972q212881p658442p287984o354247o822952
14223A27185753n760839n372663n392412m942578m680521m094238m303218l460012
14215H9179272l907177l418193l406118k845808l116479k352718l006625k362409
14207F4763745k367744j854517k639199j569886k289511j812837j592386j740287
14199D8897378j223926j518696j305252j656869j538883p34773j281729n94204
14191C9043046j241563j337455j249886p99452j308713l90206n84178j225669
14183C0905924p64234r76125l45933p65866p45457q07142r07703l46205o20221
14174B4627038o79705m39665m99946o20728q81505j50611q27599k20298m87109
$$ plain form
14165 19819872 19522359 19138182 18575359 17996739 18068874 17470008 17142970 16906254 16678716
14156 16678716 16067241 15617634 16068143 15230730 15027396 14874997 14564870 14118817 13950861
14147 13950861 14010421 13351782 13214719 12722026 12434303 12599915 12076692 12163788 11601059 11721503
14137 11721503 11539482 11068122 10956909 11073094 11013099 10594212 10096625 10253767 10029172
14128 10029172 9749009 9795628 9643673 9878640 9395042 9429823 9110045 8913767 8807383 8645896
14118 8645896 8408915 8670319 8253657 8111516 8195411 7883858 7927617 7775348 7656146 7744614
14108 7744614 7214110 7243353 6967207 7066364 7272735 7046574 7030812 6919105 6845322 6649397
14098 6649397 6428589 6752182 6239551 6473791 6303787 6076083 6327583 5939135 5853418 5936559
$$ packed form
14165A9819872k97513l84177n62823n78620P2135n98866l27038k36716k27538
14156A6678716o11475m49607M50509q37413k03334j52399l10127m46053j67956
14147A3950861N9560o58639j37063m92693k87723J65612n23223Q7096n62729J20444
14137A1721503j82021m71360j11213J16185n9995m18887m97587J57142k24595
14128A0029172k80163M6619j51955K34967m83598L4781l19778j96278j06384j61487
14118H645896k36981K61404m16662j42141Q3895l11553M3759j52269j19202Q8468
14108G744614n30504K9243k76146R9157K06371k26161j5762j11707p3783j95925
14098F649397k20808L23593n12631K34240j70004k27704K51500l88448q5717Q3141
$$ plain form
14088 5936559 5663805 5890936 5819980 5554046 5703341 5305481 5157811 5164949 5340534 5189319
14078 5189319 5191131 4984846 4849816 5249115 4609560 4966142 4730004 4880089 4558742 4633987
14068 4633987 4491603 4546825 4640035 4490412 4438008 4589193 4412263 4330761 4071934 4079454
14058 4079454 3970286 4235150 4151232 3959726 4023348 4269314 3739472 3707227 3665684 4047729
14048 4047729 3697616 3983303 3570952 3844966 3674828 3917713 3736307 3633846 3700949 3419549
14038 3419549 3605211 3463580 3499111 3505733 3080746 3245158 3260076 2921466 3002534 3221773
14028 3221773 3182593 2930077 3025601 2874421 3165141 2740885 2861479 3041238 3004339 2589262
14018 2589262 3241218 2853222 2676071 2527025 2855796 2957542 2854847 2460799 2686757
$$ packed form
14088E936559k72754K27131p0956k65934J49295l97860j47670P138J75585j51215
14078E189319J812k06285j35030L99299o39555L56582k36138J50085l21347P5245
14068D633987j42384N5222R3210j49623n2404J51185j76930q1502k58827P520
14058D079454j09168K64864q3918j91506O3622K45966n29842l2245m1543L82045
14048D047729l50113K85687m12351K74014j70138K42885j81406j02461O7103k81400
14038C419549J85662j41631L5531O622m24987J64412J4918l38610Q1068K19239
14028C221773l9180k52516R5524j51180K90720m24256J20594J79759l6899m15077
14018B589262O51956l87996j77151j49046L28771J01746j02695l94048K25958
$$ plain form
14009 2686757 2584433 2689289 2689157 2158028 2594027 2258541 2149277 2326837 2053250 2209398
13999 2209398 2256410 2288600 2067263 1936317 2214819 2147938 2171096 2480152 2283305 1971440
13989 1971440 1899555 2231307 1841983 2079267 2017187 2369727 2485077 2437737 2126583 2394621
13979 2394621 2756888 2767741 3124850 3576258 4535894 6127753 9386663 15332783 25367107
13970 25367107 28476475 20388006 13797343 10039312 7058488 5765516 4534260 3981416
13962 3981416 3766310 3022241 2998506 3119772 2567775 2752612 2564119 2030894 2377413 2301097
13952 2301097 2221784 2115237 2079361 2100718 1584395 1672316 1983137 1610813 2191121 2346559
13942 2346559 1715360 1899759 1788797 1692439 1899466 2029808 2069665 1927855 1960955 1734931
$$ packed form
14009B686757j02324J04856j32n31129M35999l35486j09264J77560k73587J56148
13999B209398M7012L2190k21337j30946K78502o6881K3158L09056j96847l11865
13989A971440p1885L31752l89324K37284o2080L52540J15350m7340l11154K68038
13979B394621L62267J0853L57109M51408R59636J591859L258910N946120J0034324
13970B5367107L109368q088469o590663l758031k980824j292972j231256n52844
13962C981416k15106p44069k3735J21266n51997J84837j88493n33225L46519p6316
13952B301097p9313j06547l5876K1357n16323Q7921L10821l72324N80308J55438
13942B346559o31199J84399j10962r6358K07027J30342L9857j41810L3100k26024
$$ plain form
13932 1734931 1686147 1659128 1584613 1546923 1552252 1485029 1597693 1693548 1568486 1643058 1696795
13921 1696795 1364674 1623248 1610777 1738919 1655885 1427099 1617353 1518195 1345725 1528033
13911 1528033 1471384 1305821 1182598 1441712 1303009 1317723 1551602 1572427 1245232 1441765
13901 1441765 1447600 1250337 1194893 1571291 1643151 1191458 903328 1160433 1110199 1615052
13891 1615052 990680 1498197 1505587 1070485 969693 1089251 1292733 1458539 1418787 1318832
13881 1318832 1447375 1270625 1341820 1222037 1083472 1166281 898919 1073515 1221205 926553
13871 926553 1275445 1125932 1043355 1153818 1118364 1290717 1171565 894775 1087497 1218414
13861 1218414 1273821 1087644 890976 839009 996478 721850 880299 991144 1064597 986854
$$ packed form
13932A734931m8784k7019p4515l7690N329o7223J12664R5855j25062P4572N3737
13921A696795l32121K58574j2471J28142q3034k28786J90254r9158j72470J82308
13911A528033n6649j65563j23223K59114j38703J4714K33879K0825l27195J96533
13901A441765N835j97263n5444L76398P1860m51693k88130K57105n0234N04853
13891A615052o24372N07517P390m35102j00792J19558K03482J65806l9752r9955
13881A318832J28543j76750P1195j19783j38565Q2809k67362J74596J47690k94652
13871I26553L48892j49513q2577J10463l5454J72353j19152k76790J92722J30917
13861A218414N5407j86177j96668n1967J57469k74628J58449J10845P3453p7743
$$ plain form
13851 986854 1180191 962512 1062308 1007895 1147189 1010167 901493 835720 908376 898765 1100756
13840 1100756 607289 772933 996987 689628 933787 1052880 663257 632392 1132222 579711
13830 579711 1004554 925976 1032855 1014409 1080752 783963 804189 665025 881765 1020487
13820 1020487 998781 719229 1067149 758615 831931 711936 709079 682127 1223338 857746
13810 857746 872495 692486 762493 883981 336513 761934 794526 920033 926697 905022 930556
13799 930556 998809 728500 861183 1083203 796748 1034690 637272 742055 715858 333071
13788 674121 767007 767609 1041649 801327 780213 771925 685506 654600 640928 300547 635762
13777 635762 720734 827779 669765 952785 721822 438603 972264 272206 779710 858152
$$ packed form
13851I86854J93337k17679R9796n4413J39294j37022j08674o5773P2656r611K01991
13840A100756m93467J65644K24054l07359K44159J19093l89623l0865M99830n52511
13830E79711M24843p8578J06879j8446O6343k96789K0226j39164K16740J38722
13820A020487k1706k79552L47920l08534P3316j19995k857k6952N41211l65592
13810H57746J4749j80009P0007J21488C36513M25421L2592J25507O664k1675K5534
13799I30556O8253k70309J32683K22020k86455K37942l97418J04783k6197C33071
13788F74121R2886O02K74040k40322k1114q288q6419l0906j3672C00547L35215
13777F35762Q4972J07045j58014K83020k30963k83219N33661B72206N07504P8442
$$ plain form
13767 858152 856201 447907 738631 710788 723423 608600 675901 576793 657263 711074 603152
13756 603152 632651 432470 733792 616064 591355 529615 656607 760985 634106 816648
13746 816648 733257 219425 848688 464560 730482 338119 545719 597955 764525 468644
13736 468644 691513 590844 727362 499676 488120 802290 462945 441654 507351 585712
13726 585712 654241 186868 713023 485189 399501 666647 504393 211628 583601 230990
13715 206978 567896 556695 441509 336962 380189 820156 374785 597379 599052 528317
13705 528317 326443 393063 188410 449285 401076 393610 762973 554753 422328 929570
13695 929570 723978 416253 357035 355874 159627 328699 336243 437076 458380 288616 519180
$$ packed form
13767H58152j951m08294K90724k7843J2635j14823O7301r9108Q0470N3811j07922
13756F03152K9499k00181L01322j17728k4709o1740J26992J04378j26879J82542
13746H16648q3391B19425O29263l84128K65922C38119K07600N2236J66570k95881
13736D68644K22869j00669J36518k27686j1556L14170l39345k1291O5697P8361
13726E85712O8529A86868N26155k27834q5688K67146j62254B11628L71973B30990
13715B06978L60918j1201j15186j04547M3227M39967C74785K22594J673p0735
13705E28317k01874O6620A88410K60875m8209p466L69363k08220j32425N07242
13695I29570k05592l07725n9218j161A59627J69072P544J00833K1304j69764K30564
$$ plain form
13684 519180 600701 571892 508672 324513 638679 536826 631649 588471 562638 694092 491865
13673 491865 55776 688355 639147 639807 264843 374409 472816 803207 501074 359174 600765
13662 600765 630961 326781 259187 341690 145178 308687 659618 124180 368062 233788
13652 233788 271189 200962 277893 749235 120578 306406 441751 641894 139899 277686
13642 277686 507852 526968 325976 141974 649583 315625 227673 457337 342236 162279
13631 293495 531858 404475 393206 371437 275452 257933 188280 771900 503170 126170
13620 327317 423702 303242 537794 374967 245919 706555 486988 561954 329220 640905
13610 640905 331552 477735 624906 456324 179399 513095 295129 408083 488736 343352
$$ packed form
13684E19180Q1521k8809o3220j84159L14166j01853R4823m3178k5833J31454k02227
13673D91865E5776O32579m9208O60B64843J09566R8407L30391l02133j41900K41591
13662F00765L0196l04180o7594Q2503A45178J63509L50931A24180K43882j34274
13652B33788L7401p0227P6931M71342A20578J85828J35345K00143A39899J37787
13642B77686K30166J9116k00992A41974N07609C15625q7952K29664j15101A62279
13631B93495K38363j27383j1269k1769r5985j7519o9653N83620k68730A26170
13620C27317R6385j20460K34552j62827j29048M60636k19567P4966k32734L11685
13610F40905l09353J46183J47171j68582A79399L33696k17966J12954Q0653j45384
$$ plain form
13600 343352 311975 336830 58794 241546 462751 159077 225797 474404 362066 176955
13589 323657 345150 463649 153153 436637 244408 577572 347065 -91163 282233 238674
13579 238674 379301 491560 472848 699274 199535 507131 167144 391055 500069 224894
13568 233226 181425 147953 138287 267941 634110 338500 613036 423972 265711 203909
13558 203909 434070 429636 300138 288339 272539 286477 -3382 130941 221329 292871 250268
13547 250268 5720 518870 157172 133977 210969 595902 417374 190528 84172 193580
13537 193580 38390 541277 230300 247671 447665 70186 278098 316447 340105 2062 74681
13526 74681 237075 402736 354374 134658 326903 308949 313692 460144 -80773 241256 4719
$$ packed form
13600C43352l1377K4855E8794J82752K21205A59077O6720K48607j12338A76955
13589C23657K1493J18499A53153K83484j92229L33164k30507i1163B82233m3559
13579B38674J40627J12259j8712K26426A99535L07596A67144K23911J09014B24894
13568B33226n1801l3472r666J29654L66169k95610K74536j89064j58261o1802
13558B03909K30161m434j29498j1799j5800J3938c382A30941R0388P1542m2603
13547B50268E720N13150A57172k3195P6992L84933j78528A90528H4172J09408
13537A93580C8390N02887B30300J7371J99994G0186K07912L8349K3658B062P2619
13526G4681J62394J65661m8362A34658J92245j7954M743J46452h0773B41256D719
$$ plain form
13514 385704 256980 267647 318686 -7838 218278 7162 167184 200393 131949 290676 156792
13503 156792 396287 53041 155202 263552 62250 293016 125130 24541 440672 208728
13492 -30417 23694 121764 611792 31530 436254 196985 36372 248332 393901 -97834 361037
13480 250308 158507 318862 409353 133935 66198 389933 233476 101139 462006 148291
13469 80201 -206750 28122 92547 419388 -30370 388567 137343 150725 206599 344154 117678
13457 472534 27538 -42593 316530 204821 -32502 162749 367004 -60009 339656 669689
13447 669689 227505 77827 -76646 -36333 348530 395686 51985 32843 381992 -130642 319939
13435 -72329 321763 109856 564070 3413 106648 78141 342599 186596 296938 119780
$$ packed form
13514C85704j28724J0667N1039g838B18278G162J60022L3209o8444J58727j33884
13503A56792K39495E3041J02161J08350F2250K30766A25130B4541M16131B08728
13492c0417B3694R8070M90028C1530M04724A96985C6372K11960J45569i7834C61037
13480B50308r1801J60355R0491A33935F6198L23735j56457A01139L60867A48291
13469H0201b06750B8122O4425L26841c0370C88567A37343J3382N5874J37555A17678
13457D72534B7538d2593C16530j11709c2502A62749K04255f0009C39656L30033
13447F69689B27505G7827g6646c6333C48530M7156E1985j9142L49149a30642C19939
13435g2329C21763A09856M54214C413J03235k8507K64458j56003J10342A19780
$$ plain form
13424 262173 -91200 3697 220302 161732 283354 186127 83215 283008 144125 301267 275091
13413 275091 279824 367800 336593 55521 387819 -42559 310852 -14692 46254 274564 217192
13402 217192 72482 110711 137340 251600 276264 58754 282340 317966 122222 -298718 211777
13390 111928 43230 55350 335103 -95133 17467 31991 80001 74811 -33876 -7204 -38124 225603
13377 215253 201067 159667 391835 115514 259165 -91826 240715 187976 319438 388030
13367 388030 13092 217422 144027 22970 105801 219376 118241 105244 330699 -54370 138389
13355 264029 202923 -25004 235527 239741 576980 290738 219531 91011 943 242194 92366
13343 338035 410476 318144 309560 42754 -114732 20977 316184 373071 258461 258455 159335 4089
$$ packed form
13424B62173i1200C697K16605n8570J21622r7227H3215J99793j38883J57142k6176
13413B75091M733Q7976l1207E5521L32298d2559C10852a4692D6254K28310n7372
13402B17192G2482L8229K6629J14260K4664E8754K23586L5626A22222b98718B11777
13390A11928D3230J2120K79753i5133A7467J4524M8010n190c3876g204l0920B25603
13377B15253j4186m1400K32168A15514J43651i1826B40715n2739J31462O8592
13367C88030A3092K04330p3395B2970Q2831J13575j01135j2997K25455e4370A38389
13355B64029o1106b5004B35527M214L37239k86242p1207I1011I43K41251I2366
13343C38035P2441r2332q584D2754a14732B0977K95207N6887j14610or9120D089
$$ plain form
13330 483632 70762 3401 -197619 159433 55302 394863 -234958 224903 60934 244940
13320 244940 117169 363933 -27057 225074 28903 97624 -58475 276655 6874 104041 179705
13309 179705 141525 -112251 134414 26654 -190071 375933 152943 -1120 442696 251080
13299 251080 338495 -66654 332947 354944 94943 -79718 16276 -139038 257815 171096 459259
13288 459259 -9198 52370 199204 243977 165940 81635 292920 100308 114633 135300 -125638
13276 143671 335217 55002 -127056 92030 -103005 45241 120801 44819 445554 447119 -61638
13264 98531 49975 -41552 353022 268640 -60965 -125579 46136 16362 -868 139402 294660
13253 294660 -119382 246391 8183 3370 81199 95374 289067 220226 -117351 126233 -27290
$$ packed form
13330D83632G0762C401a97619A59433E5302L39561b34958B24903F0934J84006
13320B44940A17169K46764b7057B25074B8903O8721e8475B76655F874R7167P5664
13309A79705l8180a12251A34414B6654a90071C75933A52943a120D42696j91616
13299B51080Q7415f6654C32947K1997I4943g9718A6276a39038B57815q6719K88163
13288D59259i198E2370J46834M4773p8037H1635K11285A00308J4325K0667a25638
13276A43671J91546E5002a27056I2030a03005D5241P5560D4819M00735J565f1638
13264I8531m8556d1552C53022q4382f0965o4614D6136A6362h68A39402J55258
13253B94660a19382B46391H183C370P7829J4175J93693o8841a17351A26233b7290
$$ plain form
13241 155605 60263 -14822 -42464 112546 25173 -96727 114086 324952 135213 128774 313031
13230 313031 287516 65893 8866 -90165 273879 203283 132645 457980 495367 101025 163845
13219 163845 254266 -349191 199037 54050 149074 389641 52118 -55214 -17065 132397 -56413
13207 304986 -157125 154880 174086 -202792 -118517 -137200 337516 148790 52455 50812 -10491
13195 -133595 241576 281331 293258 189953 225339 216154 -34387 210484 203500 -30704 393061
13183 434473 -53690 -92924 72998 -55982 447991 58216 -141936 -44147 -8458 22999 640304
13172 640304 -205703 -195749 -160091 -98961 57714 -116800 141356 54942 269889 20803 105700
13161 105700 108932 -107305 4597 153705 304411 36949 106583 -44412 -53430 310016 164 281141
$$ packed form
13241A55605F0263a4822k7642A12546B5173i6727A14086K10866A35213o439J84257
13230C13031k5515F5893H866i0165B73879p0596p0638L25335L7387A01025O2820
13219A63845R0421c49191A99037E4050R5024K40567E2118e5214a7065A32397e6413
13207C04986a57125A54880J9206b02792Q4275j8683C37516A48790E2455j643a0491
13195a33595B41576L9755J1927j03305L5386r185c4387B10484o984c0704C93061
13183D34473e3690l9234G2998e5982D47991E8216a41936d4147h458B2999O17305
13172F40304b05703R954L5658O1130E7714a16800A41356E4942K14947B0803Q4897
13161A05700L232a07305D597J49108J50706C6949O9634d4412r018C10016A64K80977
$$ plain form
13149 281141 235086 -16491 -137925 310801 59105 -206649 -121299 98336 258402 -19175 57348
13137 109956 94490 147595 94926 -129736 -98323 -104689 132241 80342 92178 -305712 140873
13125 97307 34549 -250414 -290788 187780 -4075 -94742 -181999 125451 -137244 73644 49733
13114 49733 204242 -83710 174879 -112709 38116 -8239 373074 -209882 5195 -76451 242734
13102 -164883 302576 -91586 56326 166262 80774 155103 66268 314664 102610 375499
13092 375499 450 -66870 278215 105149 58067 -345044 85687 263011 247816 -199917 391721
13080 112468 -46538 269577 42021 42826 80569 -108642 -191176 -15670 -111723 197679 -30879
13068 136413 -263243 219285 -261784 138827 -108378 36299 332898 70850 169128 -140603
$$ packed form
13149B81141m6055a6491j21434C10801E9105b06649Q5350I8336J60066a9175E7348
13137A09956j5466N3105n2669a29736L1413o366A32241n1899J1836c05712A40873
13125I7307C4549b50414m0374A87780d075r0667q7257A25451a37244G3644k3911
13114D9733J54509h3710A74879a12709C8116h239C73074b09882E195g6451B42734
13102a64883C02576i1586E6326J09936H0774P4329F6268K48396A02610K72889
13092C75499D50f6870B78215A05149m7082c45044H5687J77324j5195a99917C91721
13080A12468d6538B69577D2021Q05L7743a08642q2534a5670r6053A97679c0879
13068A36413b63243B19285b61784A38827a08378C6299K96599G0850R8278a40603
$$ plain form
13057 188266 284288 303501 -263386 119963 -378631 -39971 239038 335662 -138514 -184073
13047 -184073 -238304 32008 -262819 -86186 131035 94708 90068 -96798 -196969 325039 353301
13036 353301 36758 24819 1119 139855 -166359 95655 -9418 181843 -42333 -52691 16890
13024 210785 211818 98047 -195779 145108 -7069 10044 35557 203647 223329 -17558 154418
13012 236817 56615 -155617 130564 98142 149631 191535 51448 -58648 106471 16837 191025
13001 191025 -42952 -99752 -203014 561451 25230 48308 253970 97217 -86586 106168 286098
12990 286098 -135415 -753 -58864 226160 -65987 -47052 -141679 44342 116126 -107771 -107530 652505
12977 -169238 107574 42702 -68479 -189150 164757 173822 -71623 292071 -95892 280517 -192670
$$ packed form
13057A88266R6022J9213b63386A19963c78631c9971B39038R6624a38514m5559
13047a84073n4231C2008b62819h6186A31035l6327m640i6798j00171C25039K8262
13036C53301C6758j1939A119J38736a66359I5655i418A81843d2333j0358A6890
13024B10785J033I8047a95779A45108g069A0044K5513J68090J9682a7558A54418
13012B36817E6615a55617A30564l2422N1489M1904E1448e8648A06471A6837J74188
13001A91025d2952n6800j03262E61451B5230K3078K05662I7217h6586A06168J79930
12990B86098a35415g53n8111B26160f5987J8935r4627D4342P1784a07771K41F52505
12977a69238A07574D2702f8479j20671A64757R065g1623B92071i5892B80517a92670
$$ plain form
12965 -121687 167899 180969 201885 48401 12604 -253432 196019 73084 94703 -10792 -195692
12954 -195692 -179051 43249 80390 14806 22150 -357097 130146 -106440 296969 -239426 6460
12942 111842 160072 104352 62369 -61209 -249609 80472 179165 85102 -347287 303166 16932
12930 222499 -251903 -117535 -411797 -317203 52602 330082 -318669 -105729 115347 106565
12920 106565 144322 -83769 -8809 129465 -94109 -102636 183367 -62930 -90276 110501 164792
12909 164792 259337 214478 -66893 83270 70858 -228764 75818 -229910 -214245 22675 135621
12898 135621 -70142 -149504 42139 -47590 58134 55590 -320841 151494 -40947 217723 65584
12886 -115082 -308662 -9695 -82417 -140204 -135199 121384 -356836 -293558 -106144 -13913 1938
$$ packed form
12965a21687A67899J3070K0916D8401A2604b53432A96019G3084K1619a0792j84900
12954a95692J6641D3249L7141A4806P344c57097A30146a06440B96969b39426F460
12942A11842M8230n5720m1983f1209j88400H0472R8693H5102c47287C03166A6932
12930B22499b51903a17535k94262R4594E2602K77480c18669a05729A15347q782
12920A06565L7757h3769h809A29465i4109q527A83367f2930k7346A10501N4291
12909A64792R4545m4859f6893H3270j2412b28764G5818b29910J5665B2675J12946
12898A35621g0142p9362D2139d7590E8134k544c20841A51494d0947B17723F5584
12886a15082j93580i695p2722n7787N005A21384c56836O3278a06144a3913A938
$$ plain form
12874 135405 -116782 -225667 -194617 198822 11062 -139933 282392 -244650 -102359 -78594
12864 -78594 272254 -147666 -5724 -71316 -118530 -105762 -64716 174507 90058 90389 -171512
12852 -179616 141503 -2450 -111251 70664 -169465 19063 14704 86131 -5041 -134606 153497
12840 37075 -101338 -111395 11968 3762 114890 149966 11689 -109141 -169956 -83420 123066
12828 269734 -82106 187570 -140995 -92763 48529 4659 -12412 -88839 -190966 -22971 -149466
12817 -149466 231374 8502 -423261 -124345 320422 -416892 347657 -67421 84343 -28687
12806 278650 -163831 200449 269690 83739 -49327 -119094 228126 -20076 -167868 174680
12795 164927 -79412 54746 123093 82942 347959 -29625 -13320 -236226 52916 23050 34576
$$ packed form
12874A35405a16782j08885L1050A98822A1062a39933B82392b44650a02359K3765
12864g8594B72254a47666e724o5592m7214J2768M1046A74507q4449L31a71512
12852a79616A41503b450j08801G0664a69465A9063m359P1427e041j29565A53497
12840C7075a01338j0057A1968C762J11128L5076A1689a09141o0815h3420A23066
12828B69734h2106A87570a40995M8232D8529D659a2412p6427j02127b2971j26495
12817a49466B31374H502d23261a24345C20422d16892C47657f7421H4343b8687
12806B78650a63831B00449O9241H3739d9327o9767B28126b0076j47792A74680
12795A64927g9412E4746O8347m0151K65017b9625a3320k22906E2916B3050J1526
$$ plain form
12784 34576 -18604 178339 -120533 -221653 197353 -177920 -172691 43951 41568 -173590 60372
12772 -15956 -77286 -214310 -288177 313115 -111745 58626 -46889 35495 170785 49976 -39421
12760 266570 -105321 -120580 75223 -838 192144 -6635 -429506 196008 -249344 119651 -47681
12748 -157955 52852 -138049 303900 -236789 163238 110870 -259205 -73293 -106494 -131382
12738 -131382 -204128 2316 83231 -264408 181985 179014 -7043 -12500 -111667 -170712 302035 5212
12725 -141445 -91064 -133248 61281 171957 -146337 33768 -69860 -154720 -64093 29734 -176381
12713 393564 224427 157739 -196386 222006 -52988 18107 66907 13818 174684 -81837 -32216
12701 218201 -80196 62631 213089 -68983 140684 -97015 156556 212858 103058 46656 -52364
$$ packed form
12784C4576a8604A78339a20533j01120A97353a77920N229D3951k383a73590F0372
12772a5956o1330j37024p3867C13115a11745E8626d6889C5495J35290D9976c9421
12760B66570a05321j5259G5223h38A92144f635m22871A96008b49344A19651d7681
12748a57955E2852a38049C03900b36789A63238n2368b59205g3293l3201k4888
12738a31382p2746B316Q0915b64408A81985k971g043n457r9167n9045C02035E212
12725a41445N0381m2184F1281J10676a46337C3768f9860q4860f4093B9734a76381
12713C93564j69137o6688a96386B22006e2988A8107M8800A3818J60866h1837c2216
12701B18201h0196F2631J50458f8983A40684i7015A56556N6302A03058D6656e2364
$$ plain form
12689 40343 -3491 359597 -235822 -111885 17368 -205315 102420 144281 -444311 248514
12678 66874 160371 99811 215465 -27739 46107 -211238 -21027 110285 180599 127201 103091
12667 103091 8039 -119580 182895 173592 157799 196759 -145599 139721 -234445 94013 -2953
12655 178872 6642 -12528 414131 -122842 15291 134640 98412 -137843 -77986 168843 104853
12644 104853 139947 43314 34708 -56421 206165 87899 261202 -160304 -3939 -47465 118236
12632 17193 179964 173923 -76349 37905 14241 -32722 -42423 44514 -63126 -91429 134173 10204
12619 -256500 406212 19659 76797 118194 91304 27994 -62871 -153811 373407 210937 171265
12608 171265 132848 -159516 137844 23200 146389 191478 276809 -54675 -184182 167270
$$ packed form
12689D0343c491C59597b35822a11885A7368b05315A02420M1861d44311B48514
12678F6874R3497o0560J15654b7739D6107b11238b1027A10285P0314n3398k4110
12667A03091H039a19580A82895r303j5793L8960a45599A39721b34445I4013b953
12655A78872F642a2528D14131a22842A5291J19349l6228a37843N9857A68843o3990
12644A04853L5094D3314q606e6421B06165H7899J73303a60304c939m3526A18236
12632A7193J62771o041g6349C7905A4241c2722r701D4514f3126k8303A34173A0204
12619b56500D06212A9659N7138M1397k6890B7994f2871r0940C73407j62470l9672
12608A71265l8417a59516A37844B3200J23189M5089Q5331e4675j29507A67270
$$ plain form
12597 -44857 -261367 104006 -147858 -231251 215039 125948 -210778 -240629 27827 -164163
12586 73865 163152 65866 -201188 55063 277294 -228271 174766 -58290 111346 183233 184243
12575 184243 -158739 69019 230285 138403 -27524 -21889 -232938 -65607 -298621 -117877 38977
12563 128939 -80289 -28968 -45320 -124162 -21394 117301 -219892 47634 -60519 112979 298456
12552 298456 26853 119516 172752 290512 92340 -341548 42554 -2443 -156515 -143324 201494
12540 221896 -33571 49847 -213000 -9914 72227 25362 280745 -166733 -27729 -48262 114513
12528 -25124 -8120 -57532 59065 -39493 153470 41672 -140314 -219932 -294733 -9332 46536 29063
12516 29063 -71243 -119255 178302 -4960 -357840 272999 23120 241771 153726 -109230 282833
$$ packed form
12597d4857k16510A04006a47858q3393B15039q9091b10778k9851B7827a64163
12586G3865Q9287F5866b01188E5063K22231b28271A74766e8290A11346P1887J010
12575A84243a58739F9019J61266r1882b7524N635k11049f5607k33014a17877C8977
12563A28939h0289b8968j6352p8842b1394A17301b19892D7634f0519A12979J85477
12552B98456B6853R2663N3236J17760I2340c41548D2554b443j54072J3191B01494
12540B21896c3571D9847b13000i914G2227B5362K55383a66733b7729k0533A14513
12528b5124h120m9412E9065c9493A53470D1672a40314p9618p4801i332D6536j7473
12516B9063g1243m8012A78302d960l52880B72999B3120K18651q8045a09230B82833
$$ plain form
12504 23681 -202471 -285606 130468 17553 -37394 53759 19476 36415 186128 -425734 186059
12492 -357611 -60389 71117 -71310 -136100 316462 -226100 67973 -38238 -224069 280206 -42013
12480 -221824 86926 -137425 -271730 -46941 156035 -1124 163551 -5919 -417447 -419138 -9145
12468 -104734 -85709 -121136 -121288 283606 -118414 -215485 58526 -82869 -74566 -72939 119262 238020
12456 238020 174426 -138871 -231083 181677 30672 60070 157129 -225537 76591 175849 -165124
12444 84723 -171911 -183429 -190564 16599 -251176 -27775 -90044 -12839 -157897 -101066 114949
12432 -40697 -15366 24138 474294 375421 59174 -325907 56461 86677 -125760 -84840 -29828
12420 -52329 -321551 8742 -77790 -58953 248929 -218206 -68435 197137 23975 -200610 -313307
$$ packed form
12504B3681b02471q3135A30468A7553c7394E3759A9476J6939J49713d25734A86059
12492c57611f0389G1117g1310o4790C16462b26100F7973c8238j85831B80206d2013
12480b21824H6926a37425j34305d6941A56035a124A63551e919m11528j691i145
12468a04734J9025l5427j52B83606a18414r7071E8526h2869Q303J627A19262J18758
12456B38020o3594a38871r2212A81677C0672K9398R7059b25537G6591R9258a65124
12444H4723a71911j1518p135A6599b51176b7775o2269a2839j45058N6831A14949
12432d0697a5366B4138M50156r8873E9174c25907E6461L0216a25760M0920b9828
12420e2329k69222H742g7790J8837B48929b18206f8435A97137B3975b00610j12697
$$ plain form
12409 -313307 -192257 263645 -63166 -216684 -262500 87128 204092 64325 57230 -138461 271189
12397 279347 117896 65577 -187869 236586 28281 175483 245908 -421775 -136265 98108
12386 -25776 -225938 336894 -83637 -108384 47690 -233202 -124564 151177 256698 -72881
12375 -54339 -227409 190132 20021 263555 100525 -208929 238619 -75636 5083 148086
12365 148086 6141 146544 142912 216416 100911 91569 98402 -19183 -18864 308717 370874 106701
12352 155932 175386 -57361 83797 206356 18035 180749 -25199 -242846 354213 55291 -39015
12340 -104679 35884 100269 -49467 190546 158829 -1129 228988 -82019 133190 56636 33459
12329 33459 143706 -96918 116117 -446910 61740 -259732 -48718 248354 -38401 -105790 -352816
$$ packed form
12409c13307J21050B63645f3166j53518m5816H7128J16964F4325p095a38461B71189
12397B79347A17896n2319a87869B36586B8281J47202P0425d21775a36265I8108
12386b5776k00162C36894h3637k4747D7690b33202J08638A51177J05521g2881
12375e4339j73070A90132B0021K43534A00525b08929B38619g5636E083J43003
12365A48086F141J40403l632P3504A00911r342O833a9183L19C08717O2157A06701
12352A55932J9454e7361H3797J22559A8035J62714b5199k17647C54213E5291c9015
12340a04679C5884O4385d9467A90546l1717a129B28988h2019A33190E6636k3177
12329C3459J10247i6918A16117d46910F1740b59732d8718B48354c8401o7389k47026
$$ plain form
12318 -352816 269909 -190465 37331 419706 189677 313271 129543 -1800 147035 205163
12308 205163 -162143 7214 2524 -3466 227611 -255569 140346 63042 348668 -141700 58229
12296 258177 8948 -148 93051 109292 147077 106937 -121647 153369 133665 -62210 142095
12284 258515 -30657 -100263 212529 57613 157853 67508 92676 250009 -13000 76949 33466
12272 114665 283601 291003 143362 -387930 -76615 -65675 137678 -77103 -32130 177112 -159265
12260 280815 -35897 118218 50163 -224475 174703 467090 300678 171811 339126 -139446
12249 369384 266373 -331453 189704 -18075 309563 -109702 -150730 267585 476876 -98390
12238 87541 141204 -41121 -247235 325226 131512 140080 -105291 287050 -10600 -336399 146814
$$ packed form
12318c52816B69909a90465C7331L82375A89677J23594A29543a800A47035N8128
12308B05163a62143G214B524c466B27611b55569A40346F3042K85626a41700E8229
12296B58177H948a48I3051J6241L7785m0140a21647A53369j9704f2210A42095
12284B58515c0657o9606B12529E7613J00240F7508K5168J57333a3000G6949C3466
12272A14665J68936P402A43362c87930g6615J0940A37678g7103c2130A77112a59265
12260B80815c5897A18218E0163b24475A74703K92387j66412j28867J67315a39446
12249C69384j03011c31453A89704a8075C09563a09702m1028B67585K09291i8390
12238H7541N3663d1121k06114C25226A31512Q568a05291B87050a0600l25799A46814
$$ plain form
12226 114966 318978 -67284 134042 -281947 -67812 251431 63821 154174 -35352 -177677
12216 -177677 272339 30623 189578 157356 176769 124332 126061 -139910 112717 -56768 -51962
12205 -51962 218308 505986 111135 -71758 -18127 15848 425878 216001 33910 347248
12195 347248 120717 -174228 263741 -315713 203314 33181 65950 135691 332489 263490
12185 263490 152270 -183986 -40191 9704 181258 53551 193836 92753 -102539 420181
12174 200882 23193 284412 185018 446814 173464 108919 256054 195620 85073 63187 186536
12163 186536 161840 179107 359274 -169816 418270 -131119 98294 -16567 286298 208111
12153 208111 291661 -42500 135475 -168258 -40610 -159232 51891 -270200 250637 192709
$$ packed form
12226A14966K04012f7284A34042b81947f7812B51431F3821R0353c5352j42325
12216a77677B72339C0623J58955l2222J9413n2437J729a39910A12717e6768M806
12205e1962B18308K87678A11135g1758a8127A5848M10030k09877C3910L13338
12195C47248A20717a74228B63741c15713B03314C3181L2769O9741J96798o8999
12185B63490j11220a83986d0191I704J71554E3551J40285I2753a02539D20181
12174B00882B3193K61219r9394K61796A73464o4545J47135o0434H5073k1886J23349
12163A86536k4696J7267J80167a69816D18270a31119I8294a6567B86298p8187
12153B08111Q3550d2500A35475a68258d0610j18622E1891b70200B50637n7928
$$ plain form
12143 192709 231204 -256816 49248 -117584 18961 251827 359527 117874 31175 -182598
12132 -67133 4035 199474 253970 -322122 -69299 17332 136603 15827 51320 -35032 326094
12120 97187 152379 177505 -77342 174710 204404 -17998 82985 -305122 -74117 218491 124666
12109 124666 98121 33222 223510 -11215 182685 127356 99110 134366 219041 102223 37239
12097 327016 48236 103856 333340 105315 73891 131356 63887 142571 -423129 -28468 119321
12085 30176 -208498 6045 106427 47549 -246377 93140 -231808 -47058 -357722 136142 -15635
12073 104796 1040 24964 344837 109802 13568 123272 -251843 289287 249179 -169642
12062 143714 15704 -71868 60196 332853 138129 -281682 30096 243374 -63953 337358
$$ packed form
12143A92709L8495b56816D9248a17584A8961K32866J07700A17874C1175a82598
12132f7133D035J95439N4496c22122f9299A7332J19271A5827L5493c5032C26094
12120I7187N5192K5126g7342A74710K9694a7998H2985c05122g4117B18491r3825
12109A24666k6545C3222J90288a1215A82685n5329k8246L5256Q4675A02223C7239
12097C27016D8236N5620K29484A05315l1424N7465F3887P8684d23129b8468A19321
12085C0176b08498F045J00382D7549b46377I3140b31808d7058l10664A36142a5635
12073A04796A040K3924L19873A09802A3568J09704b51843B89287m0108a69642
12062A43714A5704g1868F0196K72657A38129b81682C0096K13278f3953C37358
$$ plain form
12051 443367 125318 20915 -138600 34281 -219978 76022 255620 171387 395540 -65428
12040 -45630 79349 -64145 -118552 -153657 -154658 129932 -60261 49126 237410 -69520 19480
12028 -126382 65293 -265682 -107766 116250 159429 -275692 -25884 10679 -367979 -84717
12017 245675 81967 294288 -262523 274653 -99718 -23610 190027 259904 -362855 -24665
12006 -127991 50952 -364635 -344673 -52706 -33008 -259691 -190741 244214 -79791 11487 -316905
11994 19438 -96983 89960 -32737 -135349 -172614 -88023 -106734 243727 -136392 -6925 -1980
11982 81563 -47137 205333 -6706 -223139 -87188 146731 417 -244299 -293340 220261 309205
11971 309205 38630 -199736 -174489 -83459 -108278 -60407 -121092 67942 65385 25379 170562
$$ packed form
12051D43367A25318B0915a38600C4281b19978G6022J79598q4233K24153f5428
12040d5630G9349f4145n4407l5105j001A29932f0261D9126J88284f9520A9480
12028a26382F5293b65682a07766A16250M3179b75692b5884A0679c67979h4717
12017B45675H1967K12321b62523B74653i9718b3610A90027O9877c62855b4665
12006a27991E0952c64635J9962e2706J9698k26683O8950B44214g9791A1487c16905
11994A9438i6983H9960c2737j02612l7265Q4591j8711B43727a36392f925a980
11982H1563d7137B05333f706k16433h7188A46731D17b44299m9041B20261Q8944
11971C09205C8630a99736K5247h3459k4819M7871o0685F7942k557B5379J45183
$$ plain form
11960 170562 -164475 5427 -57567 -296578 -380810 69910 -293666 -93299 -149960 1574 198224
11949 198224 175987 88233 11757 -81365 -95634 -89406 -82823 130653 -17797 -231093 -11093
11937 238373 96169 212577 -280980 -270732 -59507 153690 -392814 -64338 -95210 271424
11926 225329 -84821 253685 -19187 101318 -61226 86709 -444145 60403 169644 40537 -112190
11914 55872 -96337 22106 -160708 -136484 -44835 149933 107325 263186 197146 -22884 -148886
11903 -148886 177592 -22765 277891 113618 -110731 1217 -96703 -119770 -119876 -94598 443212
11891 11561 -5135 -412038 -223702 254220 -259487 -154311 -259497 61856 281347 -66683
11880 -39230 169410 138881 307781 23296 65990 -79746 87486 -186643 128934 13072 -194417
$$ packed form
11960A70562a64475E427e7567k39011q4232F9910b93666i3299n6661A574J96650
11949A98224k2237q7754A1757h1365j4269O228O583A30653a7797k13296a1093
11937B38373I6169J16408b80980J0248e9507A53690c92814f4338l0872B71424
11926B25329h4821B53685a9187A01318f1226H6709d44145F0403J09241D0537a12190
11914E5872i6337B2106a60708K4224d4835A49933m2608J55861o6040b2884j26002
11903a48886A77592b2765B77891A13618a10731A217i6703k3067j06K5278D43212
11891A1561e135m06903J88336B54220b59487J05176j05186F1856K19491f6683
11880c9230A69410l0529J68900B3296M2694g9746H7486a86643A28934A3072a94417
$$ plain form
11868 91201 -192411 -30365 -269110 -179991 -196633 96760 -71512 -120750 19765 50780 -378813
11856 -476527 -109135 -356054 -301887 207287 22301 -281236 130647 -2175 -263248 249512
11845 113445 -155528 2010 175824 -302124 208291 -144727 101703 -131764 -134309 -44811
11834 34209 -408912 -393940 85703 46077 127239 202942 187183 22847 65113 -236932 -297660
11823 -297660 -107639 -8949 4336 185335 229459 66237 197218 -153056 -243472 -103487 43990
11811 279059 93621 -58058 114328 35047 20030 -207907 25880 101813 -472998 -36561 28371
11799 -76899 -25057 -182523 -153225 39167 -139893 -252649 -222135 -119973 -130824 -140210 -412528
11788 -412528 -272073 22279 -9736 -139766 60873 7157 109101 -13039 -162044 -165361 181394
$$ packed form
11868I1201a92411c0365k38745Q9119j6642I6760g1512m9238A9765L1015c78813
11856d76527a09135k46919N4167B07287B2301b81236A30647b175k61073B49512
11845A13445a55528B010J73814c02124B08291a44727A01703a31764k545d4811
11834C4209d08912J4972H5703l9626Q1162P5703j5759B2847M2266b36932o0728
11823b97660a07639h949D336J80999M4124F6237J30981a53056r0416a03487D3990
11811B79059I3621e8058A14328C5047j5017b07907B5880P5933d72998c6561B8371
11799g6899b5057j57466K9298C9167a39893j12756L0514J02162j0851r386k72318
11788d12528J40455B2279i736j30030F0873G157J01944a3039j49005l317A81394
$$ plain form
11776 55507 -354435 -246894 -184742 434980 -35739 54238 200826 154872 201982 5306 -217258
11764 -103560 131250 158526 -79629 22530 -124935 234875 -114839 40792 -9867 35413 87618
11753 87618 29673 31971 -187652 -219215 -198688 -224370 -109310 -228946 -189369 -149149 -172155
11742 -172155 -174636 124408 -140695 213341 115098 245121 75675 76664 -336354 175515 -114642
11730 321835 37405 -31237 -243586 152793 334116 276234 -413732 109129 348034 -253465
11719 104176 -254104 159589 126711 -138999 69015 138729 -5246 85694 67952 -114770 399552
11707 195682 39523 288138 -64543 -85444 64389 -199422 12629 -93071 -242938 -155061 -170718
11696 -170718 106526 164456 50113 220646 -28234 -152704 55978 16876 -71179 -14169 63526
$$ packed form
11776E5507c54435J07541O2152D34980c5739E4238J46588m5954M7110E306b17258
11764a03560A31250K7276g9629B2530a24935B34875a14839D0792i867C5413N2205
11753H7618B9673K298a87652l1563K0527k5682a09310j19636L9577M0220k3006
11742a72155k481A24408a40695B13341r8243J30023G5675R89c36354A75515a14642
11730C21835C7405c1237k12349A52793J81323n7882d13732A09129K38905b53465
11719A04176b54104A59589l2878a38999F9015O9714e246H5694j7742a14770C99552
11707A95682C9523K48615f4543k0901F4389a99422A2629i3071j49867Q7877j5657
11696a70718A06526N7930E0113J70533b8234j24470E5978A6876g1179a4169F3526
$$ plain form
11684 -215557 -5931 49217 -98295 120117 -149942 67470 -66023 13086 135821 64663 31130
11672 91232 -131121 -66161 -204699 217240 182356 211832 -362708 -23102 117357 -18115 -77664
11661 -77664 130498 59846 -279721 -116376 -89824 31961 -44233 258359 186318 -49914 108727
11649 -249545 18560 126794 -289811 169578 -189625 127867 3720 -43850 -306585 -116971
11638 595573 -268667 -38415 267557 519 40133 -14459 58756 97066 -156701 -285232 30911
11626 -221507 82195 231762 -194595 274592 -129548 203508 -181967 9525 106193 -5006 -170586
11615 -170586 -5388 10938 -125113 68395 -16162 -30993 108434 -83075 144585 175141 58378
11603 206572 -58720 86002 -25755 95841 -120668 -46272 -295137 -128595 111718 -45922 -218359
$$ packed form
11684b15557e931D9217i8295A20117a49942F7470f6023A3086J22735F4663C1130
11672I1232a31121O4960j38538B17240l4884K9476c62708b3102A17357a8115n9549
11661g7664A30498E9846b79721a16376K6552C1961d4233B58359p2041d9914A08727
11649b49545A8560J08234b89811A69578a89625A27867C720d3850k62735a16971
11638E95573b68667c8415B67557E19L9614a4459E8756L8310a56701j28531C0911
11626b21507H2195J49567a94595B74592a29548B03508a81967I525R6668e006j65580
11615a70586e388A0938a25113F8395a6162j4831A08434h3075A44585L0556E8378
11603B06572e8720H6002b5755I5841a20668d6272k48865a28595A11718d5922j72437
$$ plain form
11592 -218359 -114586 162468 314076 34271 -204461 335152 81727 201109 -171242 -2267
11581 -105388 -95013 -304569 3096 196978 59364 87583 48718 -147847 55689 -49065 -210747
11570 -210747 -295623 -234344 13737 166913 -278826 -20033 28884 189413 11604 -51429 85730
11558 -159804 73526 -49212 -30691 85823 -215240 -88641 153199 150447 84385 149741 -106330
11546 -122673 -3550 120616 46561 28713 -51894 190073 5789 271718 -4928 -41275 -275115
11535 -275115 124644 126874 -30877 52416 -204971 -484617 72555 -118788 -67445 6112 30519
11524 30519 -188525 439230 -71528 219695 -58067 116651 -152754 35035 -111055 10662
11513 -102062 85532 31521 -268176 -312606 228655 19771 -44418 127689 101383 -129215 -92861
$$ packed form
11592b18359J03773A62468J51608C4271b04461C35152H1727J19382a71242b267
11581a05388J0375k09556C096J93882E9364K8219l8865a47847E5689d9065j61682
11570b10747q4876O1279A3737J53176b78826b0033B8884J60529A1604e1429H5730
11558a59804G3526d9212J8521H5823b15240h8641A53199k752o6062O5356a06330
11546a22673c550A20616D6561j7848e1894A90073E789K65929d928l6347k33840
11535b75115A24644K230c0877E2416b04971k79646G2555a18788N1343F112K4407
11524C0519a88525D39230g1528B19695e8067A16651a52754C5035a11055A0662
11513a02062H5532C1521b68176m4430B28655A9771d4418A27689k6306a29215L6354
$$ plain form
11502 -92861 18573 -140870 -148281 -78008 240525 212449 -50952 -204968 356525 -89836 -69421
11491 -69421 -24152 -33242 -63657 329069 -119261 -244287 170372 120281 4196 -46245 246228
11479 184889 216227 186264 249578 276852 51613 305940 102811 44917 -56245 97499 106684
11468 106684 94659 180461 228154 170606 370808 4682 18194 147144 368154 -54165 -84707
11457 -84707 -186783 208807 -250134 85453 198668 117512 385661 142988 231616 387651
11447 387651 49935 116533 10751 1794 -13784 -205941 96951 34949 389534 3847 17926
11436 17926 -154715 192185 -71947 -123778 277905 9272 -177595 30617 -152009 237270 -34592
11424 81924 41463 95382 141453 -154097 -144651 163412 69845 131850 -37237 203228 -90214
$$ packed form
11502i2861A8573a40870p411P0273B40525k8076e0952j54016C56525h9836K0415
11491f9421b4152r090l0415C29069a19261j25026A70372n0091D196d6245B46228
11479A84889L1338k9963O3314K7274E1613K54327A02811D4917e6245I7499R185
11468A06684j2025Q5802M7693n7548K00202D682J3512J28950K21010e4165l0542
11457h4707j02076B08807b50134H5453J13215q1156K68149A42988Q8628J56035
11447C87651D9935O6598A0751A794a3784j92157I6951C4949L54585C847J4079
11436A7926a54715A92185g1947n1831B77905I272a77595C0617a52009B37270c4592
11424H1924m0461N3919M6071a54097R446A63412F9845O2005c7237B03228i0214
$$ plain form
11412 -302967 -120419 44250 49147 -25767 870 145624 -37343 18080 -94382 -55665 -169067
11401 -169067 210131 -20824 39997 -192308 -160916 -104756 -195796 -116731 337104 -61890 -521373
11390 -521373 87643 -162154 56551 -140399 -174529 365906 -292668 -59386 -231484 223105
11379 123233 -88319 -177739 22336 -244608 179586 35447 -203710 100626 -50898 166602
11368 59353 -4307 325382 -4142 -117332 -342966 229170 -34692 261110 -883 -14298 80250
11356 39871 -7322 102558 53578 -14762 -68755 -31934 -28817 77364 114430 -132504 337771
11344 -87027 166090 233145 -33599 -16293 -412584 -52160 -15023 -17671 108015 -24823 -66605
11333 -66605 -179386 -286085 25014 130734 46809 -64420 -188432 58386 -208538 -258184 30033
$$ packed form
11412c02967a20419D4250M897b5767H70J44754c7343A8080i4382L8717j13402
11401a69067B10131b0824C9997a92308L1392N6160r1040P9065C37104f1890m59483
11390e21373H7643a62154E6551a40399l4130C65906b92668e9386j72098B23105
11379A23233h8319q9420B2336b44608A79586C5447b03710A00626e0898A66602
11368E9353d307C25382d142j13190k25634B29170c4692B61110h83j3415H0250
11356C9871g322A02558m8980a4762n3993c1934L117G7364L7066a32504C37771
11344h7027A66090O7055c3599a6293l96291e2160a5023k648A08015b4823m1782
11333f6605j12781j06699B5014J05720D6809f4420j24012E8386b08538m9646C0033
$$ plain form
11321 -156711 -41307 -320244 -145809 230056 18169 -191768 -185430 -6740 -1413 -39743 -35345
11310 -35345 255314 23834 392867 127304 -177674 -3441 -300287 60349 131647 -180609 -75761
11298 -47305 22051 29868 -231567 160880 -291766 -224545 -359791 9370 -80608 86322 -192511
11286 -24418 90606 -39746 30304 -28121 -33176 -103954 -1975 -130058 -60297 860 260978 -245628
11273 24275 -74618 -172056 -78040 -362542 -427216 -348239 -31252 -289321 -194928 -350301 -106010
11261 -41178 248816 -172680 227796 246451 -96239 64734 -227753 -249196 161872 -209772
11250 151475 -108697 237355 -183935 -82850 -11335 -191512 -63510 123684 136323 -11844
11239 -124178 -60594 -93459 -109800 13396 98673 21844 39158 -178220 150515 94614 -229479
$$ packed form
11321a56711d1307k78937a45809B30056A8169a91768O338f740a413l8330M398
11310c5345B55314B3834L69033A27304a77674c441k96846F0349P1298a80609g5761
11298d7305B2051P817b31567A60880b91766O7221j35246I370h0608H6322a92511
11286b4418I0606c9746C0304b8121n055p0778a975j28083f0297H60K60118b45628
11273B4275g4618r7438g8040k84502o4674P8977c1252k58069R4393j55373a06010
11261d1178B48816a72680B27796J8655i6239F4734b27753k1443A61872b09772
11250A51475a08697B37355a83935h2850a1335j80177f3510A23684J2639a1844
11239a24178f0594l2865j6341A3396Q5277B1844J7314a78220A50515n5901b29479
$$ plain form
11227 194097 35493 352779 99596 249690 37145 -408314 136068 -128968 263450 233515
11217 233515 -78962 153939 52401 -316213 -169572 -258517 -28982 1786 88210 45404 -192109
11205 22577 -20036 -104478 167208 -353287 -159593 21014 -251825 -522067 -184594 -494410
11195 -494410 104438 35453 -120729 73312 -12497 -10816 -128409 -170456 -202198 -183443 141181
11183 269470 -67601 74122 164055 -389644 -262788 -392951 -292610 -239503 -281745 168823
11172 -56060 -477323 -453993 23952 -290667 -85768 -207724 -197765 486383 165650 -6228 -427135
11161 -427135 -83173 -52157 27068 -90070 -378427 218398 -75846 135554 102700 -100030 33841
11149 -74536 3199 -169794 63693 -171516 78746 -93185 -274963 -189851 82183 -145674 -216111
$$ packed form
11227A94097C5493L17286I9596J50094C7145d08314A36068a28968B63450k9935
11217B33515g8962A53939E2401c16213J46641q8945b8982A786Q6424m2806a92109
11205B2577b0036q4442A67208c53287a59593B1014b51825k70242a84594l09816
11195d94410A04438C5453a20729G3312a2497J681j17593m2047l1742J8755A41181
11183B69470f7601G4122Q9933c89644J26856j30163J00341N3107m2242A68823
11172e6060m21263K3330B3952b90667h5768j21956R959D86383A65650f228m20907
11161d27135h3173L1016B7068i0070k88357B18398g5846A35554l2854a00030C3841
11149g4536C199a69794F3693a71516G8746i3185j81778Q5112H2183a45674p0437
$$ plain form
11138 -216111 53203 -92287 14862 -168381 66456 90461 -7928 -257705 5953 -191717 108731
11126 93373 315100 -43784 -149841 99185 -160188 15038 61057 44385 -130660 -348932 195065
11114 -243647 -145087 14203 178574 -149577 147225 2457 -84668 32735 -22201 205842 -163468
11102 -19606 -169517 112289 58509 -151720 -158886 72007 -205618 -138201 -1050 3313 -67240
11090 236520 211116 150725 119442 -67905 394675 161498 183054 57526 80776 -107114 261070
11078 52124 19208 -9418 -21896 -15732 -7768 395859 448201 434220 55123 435036 306047 -178023
11065 200633 56914 275700 364583 365234 225750 4648 280159 110927 97795 -175316 353238
11053 108236 251332 237205 119018 269421 77029 231386 372640 168386 152750 575515
$$ packed form
11138b16111E3203i2287A4862a68381F6456K4005g928k49777E953a91717A08731
11126I3373K21727d3784j06057I9185a60188A5038M6019j6672a30660k18272A95065
11114b43647R8560A4203J64371a49577A47225B457h4668C2735b2201B05842a63468
11102a9606j49911A12289n3780a51720p166G2007b05618O7417a050C313f7240
11090B36520k5404o0391l1283f7905C94675A61498K1556E7526K3250a07114B61070
11078E2124A9208i418j2478O164g768C95859N2342j3981E5123L79913j28989a78023
11065B00633E6914K18786Q8883O51j39484D648K75511A10927j3132a75316C53238
11053A08236J43096j4127j18187J50403G7029J54357J41254A68386j5636M22765
$$ plain form
11043 575515 357924 704657 53898 457297 702643 131895 889160 218634 757890 351622
11032 488918 303168 343395 506073 641016 280660 652022 514948 492553 877719 555914
11022 555914 618939 229804 463732 388030 301260 547930 335240 349502 388550 726417
11012 726417 505409 420357 583212 564092 330928 238791 474417 853131 788734 567480
11002 567480 379354 50317 115789 259547 324269 101845 762006 627528 734079 685856
10992 685856 355360 469341 422038 566260 478825 113770 568058 441102 224593 473925
10982 473925 265366 824308 416541 148890 442585 615889 207548 557195 463639 357327
10972 357327 590469 742645 689879 360746 887334 560887 766764 680513 1049234 826243
$$ packed form
11043E75515k17591L46733E3898M03399K45346A31895P57265B18634N39256C51622
11032D88918j85750M0227J62678J34943B80660L71362j37074k2395L85166l21805
11022E55914O3025B29804K33928p5702q6770K46670k12690J4262L9048L37867
11012G26417k21008q5052J62855j9120k33164r2137K35626L78714o4397k21254
11002E67480j88126E0317O5472J43758O4722A01845O60161j34478J06551m8223
10992F85856l30496J13981m7303J44222q7435A13770M54288j26956k16509K49332
10982D73925k08559N58942m07767A48890K93695J73304B07548L49647r3556j06312
10972C57327K33142J52176n2766l29133N26588l26447K05877q6251L68721k22991
$$ plain form
10962 826243 826618 870175 1122757 1469326 1500245 1411676 1674302 2113894 2002385 1918287 2024974
10951 2024974 1844458 1377238 1620582 1406144 1217234 1303967 1154529 928359 1369440 1301434
10941 1301434 1281013 996867 1208460 1421759 1123156 1150055 1305141 839666 688619 667309
10931 667309 302669 482916 347671 208603 399507 176962 229655 142011 341671 161093
10920 42749 442194 427322 51178 192544 -9967 -150159 -361567 -215801 -181751 129806 -87317
10908 256941 123588 157017 -376708 -29808 279129 -32671 260445 -328216 -2464 214525
10897 -114811 -131154 288839 -122688 94385 2776 32306 -41093 -457533 -53413 231106 73075
10885 -81748 85871 -255453 -114025 51772 -208727 73287 -27665 91451 -127684 -196366 -31642
$$ packed form
10962H26243L75M3557K52582L46569L0919q8569K62626M39592j11509q4098J06687
10951B024974j80516m67220K43344k14438j88910Q6733j49438k26170M41081o8006
10941A301434k0421k84146K11593K13299k98603K6899J55086m65475j51047k1310
10931F67309C02669J80247j35245j39068J90904A76962N2693q7644J99660A61093
10920D2749L99445j4872E1178J41366i967j40192k11408J45766L4050A29806h7317
10908B56941A23588L3429c76708b9808B79129c2671B60445c28216b464B14525
10897a14811j6343B88839a22688I4385B776K9530d1093m16440e3413B31106G3075
10885h1748H5871b55453a14025E1772b08727G3287b7665I1451a27684o8682c1642
$$ plain form
10873 -5868 22934 83701 -208689 236748 55046 -102193 -16967 -290609 15253 58095 -268291
10861 -36795 77880 58531 -67487 -12882 231499 -1577 34958 -241897 210737 -146427 -255831
10850 -255831 -192110 7558 -97979 7418 163541 -193061 14795 -192166 -112740 -329966 -98954
10838 -127665 -224025 -179408 75368 322234 -163228 -26991 -156728 44415 -11192 -119509 -171590
10827 -171590 -142492 88368 -206807 130108 346121 -237560 183887 276966 24599 -85583
10816 -75033 -156341 -228010 -212953 133215 343351 -58289 -217562 -224204 26374 -352300 -186716
10805 -186716 -212881 -235565 6056 81920 215190 52139 -69372 94807 -27913 -144430 -72327
10794 -72327 -185446 -43040 -3173 -211458 124595 161852 -97821 -23929 63693 -121166 -143335
$$ packed form
10873e868B2934O0767b08689B36748E5046a02193a6967k73642A5253M2842b68291
10861c6795G7880j9349f7487a2882B31499a577C4958b41897B10737a46427j09404
10850b55831O3721G558i7979G418J56123a93061A4795a92166P9426k17226i8954
10838a27665r6360M4617G5368K46866a63228b6991j29737D4415a1192j08317n2081
10827a71590K9098H8368b06807A30108K16013b37560A83887R3079B4599h5583
10816g5033q1308p1669J5057A33215K10136e8289j59273o642B6374c52300J65584
10805a86716k6165k2684F056P5864J33270E2139f9372I4807b7913j16517P2103
10794g2327j13119d3040c173k08285A24595L7257i7821b3929F3693a21166k2169
$$ plain form
10783 -143335 -46302 187901 -167329 -42357 -237535 74238 -36774 -177824 -113849 -191946 183360
10771 -68129 -110677 76434 77821 66258 -129999 17604 -165217 48561 64122 -37382 -90619
10760 -90619 -119563 -181652 -290751 228898 -60371 133036 -159550 268723 -215810 -107190
10749 -111198 -81960 -298706 316189 11585 228580 -58194 40441 -63163 14015 -222245 -244027
10738 -244027 98338 -174368 64160 -93879 -475463 -88259 -140791 -53845 -19098 -92840 -67441
10727 -67441 213148 -132398 -84070 63649 -138619 -13696 -161177 -307139 9631 -79116 -60229
10716 -60229 -269614 -95800 -135340 62650 19108 -157224 -148981 79705 -207357 71367 -195256
10704 19555 -55058 -193374 -34894 -14529 -221672 40209 -225204 115069 176455 -44711 -174208
$$ packed form
10783a43335d6302A87901a67329d2357j95178G4238c6774j41050O3975p8097A83360
10771f8129m2548G6434J387j1563a29999A7604a65217D8561J5561c7382n3237
10760i0619k8944o2089j09099B28898f0371A33036a59550B68723b15810a07190
10749a11198K9238k16746C16189A1585K16995e8194D0441f3163A4015b22245k1782
10738b44027I8338a74368F4160i3879l81584h8259n2532e3845a9098p3742K5399
10727f7441B13148a32398M8328F3649a38619a3696j47481j45962I631g9116J8887
10716f0229k09385i5800l9540F2650A9108a57224Q243G9705b07357G1367a95256
10704A9555e5058j38316c4894a4529k07143D0209b25204A15069O1386d4711j29497
$$ plain form
10693 -174208 -119942 -46048 -139976 -243014 -150678 -72369 -80684 -266651 -289571 72866 142741
10682 142741 9531 -25903 -322763 150987 -358081 -58149 -145189 -19509 -240000 130384 -250967
10670 -141966 10137 -215166 -118174 -138082 42723 -225276 -54501 -239484 -134305 25485 -56108
10658 132008 94170 -48127 28594 207002 125720 281939 -119122 86321 -45217 359369 -40995
10646 -270784 -19922 797 -361190 89132 -312498 -421112 -16212 -118220 -79848 124741 -432152
10634 -271469 -174455 121797 -183200 -400502 -232893 -235296 -372062 3476 248078 -13375 221222
10622 -53235 -24331 -22662 -44306 10037 -236032 102554 479863 -217899 24041 122823 -12297
10610 163266 -153393 -230136 85159 -176160 -338363 31494 28074 91799 -210684 52237 3730
$$ packed form
10693a74208N4266d6048r3928j03038R2336g2369q315j85967k2920G2866O9875
10682A42741I531b5903k96860A50987c58081e8149q7040a9509k20491A30384b50967
10670a41966A0137b15166R6992j9908D2723b25276e4501j84983J05179B5485e6108
10658A32008l7838d8127B8594J78408q1282J56219a19122H6321d5217C59369d0995
10646b70784a9922G97c61190H9132c12498j08614a6212j02008L8372A24741d32152
10634b71469R7014A21797a83200k17302J67609k403j36766C476K44602a3375B21222
10622e3235b4331J669k1644A0037b36032A02554L77309b17899B4041R8782a2297
10610A63266a53393p6743H5159a76160j62203C1494l420O3725b10684E2237C730
$$ plain form
10598 -119700 -208795 33675 87904 226812 -124663 109073 28262 22661 -385156 136490 185222
10587 185222 108900 -215231 233064 37310 130520 72726 -215466 111594 -74201 -20883 231430
10575 90469 -37904 231196 143656 74950 53522 240057 -42678 178755 -22004 -93032 -109037
10564 -109037 -67559 -104884 -508286 -135529 -190963 50179 183074 -79847 255046 -172092
10553 -81608 -60160 -91314 -108744 -56914 -35781 -81709 12814 -1956 142078 -157189 128242
10541 6665 -279322 -66350 -112794 -260698 85986 -130062 143615 -74123 -90314 6015 98647
10530 98647 -39504 111121 -14326 -1069 84331 156587 -172655 283716 228676 -171533 -368805
10519 -368805 -54694 325412 3930 -53134 33457 -251000 -121535 -60128 258255 -38816 -239160
$$ packed form
10598a19700q9095C3675N4229J38908a24663A09073B8262n601c85156A36490M8732
10587A85222p6322b15231B33064C7310R3210n7794b15466A11594g4201b0883B31430
10575I0469c7904B31196q7540o8706k1428J86535d2678A78755b2004p1028j6005
10564a09037M1478l7325m03402a35529n5434E0179J32895g9847B55046a72092
10553h1608K1448l1154j7430N1830K1133m5928A2814a956A42078a57189A28242
10541F665b79322f6350m6444j47904H5986a30062A43615g4123j6191F015R2632
10530I8647c9504A11121a4326a069H4331P2256a72655B83716n5040a71533j97272
10519c68805e4694C25412C930e3134C3457b51000a21535f0128B58255c8816k00344
$$ plain form
10508 -239160 97409 -327849 -402815 -28368 46594 -220370 -184402 -60559 -139020 -81969 69529
10496 -394955 -88146 -123853 8536 -169057 -179143 -328087 -341081 83789 -108199 155808 134225
10485 134225 89337 -32697 -228091 81411 177548 -51166 109041 -453442 -293638 -85442 -17749
10473 -5295 -335410 -191478 -92212 135479 -140868 -67822 -22531 130036 209352 96235 -86421
10461 480952 -114984 327596 84046 295909 91054 7929 -236931 -65606 161897 180324 1825
10449 37431 -98683 -142625 118717 26466 36422 336942 -48121 -22567 -264880 -127604 -74181
10438 -74181 -21067 -166942 220380 -87159 -150220 -1224 -29455 117817 -77479 -210925 -276866
10427 -276866 300829 -213421 83480 137750 -88361 174995 -307368 424129 22047 433286
$$ packed form
10508b39160I7409c27849p4966b8368D6594b20370L5968f0559p8461N7051F9529
10496c94955h8146l5707H536a69057j0086j48944j2994H3789a08199A55808k1583
10485A34225m4888c2697j95394H1411R6137e1166A09041d53442J59804h5442a7749
10473e295l30115J43932i2212A35479a40868f7822b2531A30036P9316I6235h6421
10461D80952a14984C27596H4046K11863I1054G929b36931f5606A61897J8427A825
10449C7431i8683m3942A18717B6466R956L00520d8121b2567k42313a27604N3423
10438g4181b1067j45875B20380h7159o3061a224k8231A17817g7479j33446o5941
10427b76866C00829b13421H3480N4270h8361A74995c07368D24129B2047M11239
$$ plain form
10417 433286 -99014 28107 -189963 160099 105151 -403051 -244036 197416 86567 -368825
10406 -210371 109123 48108 -28129 166586 -15273 -100455 35359 -19719 -75440 144756 -245353
10394 -225702 236989 -91402 -201951 -130947 -53043 -231311 71581 -76883 -43588 -192700 -59056
10382 -114697 -178891 92450 -59749 -53465 -34953 -115058 -78599 62552 -124804 -148839 -113893
10371 -113893 81305 290602 337727 -130484 2960 143721 239076 -110448 -68087 228455 -49412
10359 -78526 51538 -168048 249053 -42596 201794 215323 320128 168618 263365 239104 66852
10347 476997 35076 353698 346516 154694 273987 87067 35517 420268 70348 262268 76994
10335 171518 304346 162635 205304 93560 109484 67823 -94306 539860 14577 193140 -60749
$$ packed form
10417D33286i9014B8107a89963A60099n4948d03051J59015A97416H6567c68825
10406b10371A09123D8108b8129A66586a5273q5182C5359a9719n5721A44756b45353
10394b25702B36989i1402j10549P1004e3043j78268G1581g6883L3295j49112e9056
10382a14697o4194I2450e9749O284J8512q0105L6459F2552a24804k4035L4946
10371a13893H1305K09297M7125a30484B960J40761R5355a10448M2361B28455d9412
10359g8526E1538a68048B49053d2596B01794J3529J04805j51510R4747k4261F6852
10347D76997C5076L18622p182A54694J19293H7067C5517L84751G0348J91920G6994
10335A71518J32828j41711M2669I3560J5924m1661i4306E39860A4577J78563f0749
$$ plain form
10323 32773 384375 502721 159009 321359 -156486 434894 483140 -97365 -93347 246685
10312 268843 122238 290574 -47034 73909 117095 409896 159751 234385 4626 -54473 -33560
10301 -33560 -77217 171617 -57288 6021 -227988 93771 -28440 -44098 70190 -113592 29333
10289 72384 144329 122409 -198444 -89816 -109007 -24241 284151 95684 332584 72731 -137343
10277 -58435 -213562 54186 -146405 -50012 -47774 -305038 -110404 -41552 -142333 -95991 -100574
10266 -100574 -266368 -97192 58673 -91827 -147055 -38113 -47658 -70849 295559 -201025 26093
10254 283587 -25749 -218528 -66335 16704 -213025 -127740 61505 -105686 113204 -63837 106904
10242 17944 230905 237316 319078 -5127 125203 74241 -8021 134437 188442 -87759 44116 7762
$$ packed form
10323C2773L51602J18346A59009J62350a56486D34894M8246i7365M018B46685
10312B68843A22238J68336d7034G3909M3186K92801A59751P4634D626e4473K0913
10301c3560m3657A71617e7288F021b27988I3771b8440j5658G0190a13592B9333
10289G2384P1945k1920a98444h9816j9191b4241B84151I5684K36900G2731a37343
10277e8435j55127E4186a46405e0012K238k57264a10404d1552j00781M6342m583
10266a00574j65794i7192E8673i1827n5228c8113r545k3191B95559b01025B6093
10254B83587b5749j92779f6335A6704b13025Q5285F1505a05686A13204f3837A06904
10242A7944K12961O411Q1762e127A25203n0962h021A34437N4005h7759D4116G762
$$ plain form
10229 114322 23170 -39100 96854 -78592 50739 109934 -240501 -262841 74589 103211 127970
10218 127970 -1060 -244353 -23361 -295670 75637 -182066 -89553 -382006 -54531 149539 14232
10206 -163738 -182507 -2263 262563 -83291 -320482 15118 230708 -281396 212812 -118849
10195 -95206 -101147 96143 -70091 -97357 -65863 92792 -154791 81394 -480056 -141613 -65188
10183 -291615 -7762 -167874 -191246 -340570 -231677 204317 -350416 -44679 25431 -249349
10172 192985 11023 213016 31175 65428 4324 -231762 -60041 -191573 -277968 -113020 97553
10160 -28129 -310025 140615 -332433 5930 -108371 -88636 -36096 41351 -252181 -254454 275659
10148 73186 -178048 192148 -75752 -133282 137296 98226 -169184 -455290 -177845 -29649
$$ packed form
10229A14322B3170c9100I6854g8592E0739N9195b40501k2340G4589K8622K4759
10218A27970a060k43293b3361k72309G5637a82066h9553k92453e4531A49539A4232
10206a63738j8769b263B62563h3291k37191A5118K15590b81396B12812a18849
10195i5206n941I6143g0091k7266L1494I2792a54791H1394d80056a41613f5188
10183b91615g762j60112k3372j49324J08893B04317c50416d4679B5431b49349
10172A92985A1023K01993C1175L4253D324b31762f0041j31532q6395a13020I7553
10160b8129k81896A40615c32433E930a08371J9735c6096D1351b52181k273B75659
10148G3186a78048A92148g5752n7530A37296l9070a69184k86106a77845b9649
$$ plain form
10137 -31703 -256660 171204 25570 30685 26661 15488 180883 -199116 -6019 -24741 -273401
10126 -273401 254586 -197596 120895 -186834 -168297 -218859 270140 -65469 -21878 -381100
10116 -381100 268924 -87332 6230 -199508 5148 -279557 -120971 -34667 -126034 -93692 -143928
10105 -143928 -6007 95787 -131453 -61826 -213975 53570 -29121 -510736 -276569 238268 239009
10094 239009 -407912 -339969 179515 270754 -179090 -168686 -35334 184956 91955 19527 7643
10082 -75957 -32592 -105709 -144843 45242 -50815 -157786 316450 -89120 -18178 -117984 -118682 337985
10069 -43296 47411 13965 -255946 -288175 -167190 -182064 -25688 -61835 -115209 14617 -6247
10057 110108 -32125 -198981 194445 -153140 193892 129669 118600 -6911 136835 -357689
$$ packed form
10137c1703k24957A71204B5570N115m024j1173J65395a99116f019j8722k48660
10126b73401B54586a97596A20895a86834J8537n0562B70140f5469b1878l59222
10116c81100B68924h7332F230a99508E148b79557a20971c4667r1367L2342n0236
10105a43928f007I5787a31453f1826j52149E3570b9121m81615K34167B38268P41
10094B39009d07912O7943A79515R1239a79090J0404c5334A84956I1955A9527G643
10082g5957c2592p3117l9134D5242e0815j06971C16450h9120a8178r9806o98C37985
10069d3296D7411A3965b55946l2229J20985j4874b5688l6147n3374A4617f247
10057A10108c2125j66856A94445a53140A93892o4223j1069f911A36835c57689
$$ plain form
10046 -213966 -11451 -142081 -227281 131461 471993 58541 229095 -315400 -89554 -16401
10035 -206654 -300241 -330468 118082 182208 -168649 131289 -22028 20953 -49235 177026 -323745
10023 -204858 -114595 -221041 -239282 -56398 -377699 4110 -195533 -3564 -83848 -316293 -241765
10012 -241765 157948 286497 270877 -15905 -138465 -320425 -155317 139265 240922 29377
10001 -155712 -346935 -271731 -181133 -355532 -126544 -70671 71706 -226970 -107228 -233292
9991 -233292 -65300 11220 -213897 -106470 38306 33448 -122461 112918 138503 237819 -84526
9979 -220092 -45199 -249182 -1952 -263003 308557 25989 -160305 72069 74312 372086 -52613
9967 -49200 -115922 228225 -627597 57142 -37218 271243 -403839 -113900 -28224 108894 175185
$$ packed form
10046b13966a1451j30630q5200A31461L40532E8541J70554c15400h9554a6401
10035b06654r3587l0227A18082O4126a68649A31289b2028B0953d9235A77026c23745
10023b04858R0263j06446j8241e6398l21301D110a95533c564q0284k32445P4528
10012b41765A57948J28549j5620a5905j22560j81960a55317A39265J01657B9377
10001a55712j91223P5204R0598j74399a26544N5873G1706b26970a07228j26064
9991b33292f5300A1220b13897a06470C8306m858a22461A12918K5585R9316h4526
9979b20092d5199k03983a952k61051C08557B5989a60305G2069K243K97774e2613
9967d9200o6722B28225f27597E7142c7218B71243d03839a13900b8224A08894O6291
$$ plain form
9956 175185 -131632 -11641 101858 48641 -22744 -9169 -200544 -72468 -77244 -230809 -56790
9944 -213979 -156955 -61988 130831 -253401 -180960 -98472 -355697 -46157 -218824 -175927 -295043
9933 -295043 -232413 72584 81115 230192 145218 233175 19896 116733 -179550 -329664 107312
9921 84719 -189582 20161 100815 -38817 -98645 -625185 -81152 79441 75028 -44250 -154192
9910 -154192 105848 130448 -160082 -80685 78892 -35332 -15785 -27338 -96758 -20492 -20503 -291432
9898 -291432 -11237 -77444 261803 -415328 148447 -188977 -127525 18801 -361564 -321989 -158774
9886 -24111 -237184 170279 -116029 -95327 5234 -271743 -129838 -173746 52289 31307 193909
9875 193909 -230070 221326 -318135 21321 -112297 90579 -109765 137504 -190376 -143 -102303
$$ packed form
9956A75185a31632a1641A01858D8641b2744i169j91375g2468m776j53565e6790
9944b13979N7024f1988A30831b53401P2441Q2488k57225d6157j72667M2897j19116
9933b95043O2630G2584Q531J49077q4974Q7957A9896R6837a79550j50114A07312
9921H4719a89582B0161Q0654c8817n9828n26540h1152G9441m413d4250j09942
9910a54192A05848K4600a60082P9397G8892c5332a5785j1553o9420b0492j1k70929
9898b91432a1237o6207B61803d15328A48447a88977O1452A8801c61564L9575a58774
9886b4111k13073A70279a16029K0702E234b71743a29838m3908E2289k0982J62602
9875A93909b30070B21326c18135B1321a12297I0579a09765A37504a90376a43j02160
$$ plain form
9864 -102303 32612 779 -118000 109070 -319023 -47143 -3961 -94428 -16646 -97402 -242088
9853 -242088 -269214 -189424 -130558 115113 -189284 -446760 -55991 388883 -206143 -277741 10937
9841 -266718 -96643 -18454 -157909 -73988 -89613 -436875 -88733 44821 -221615 -78340 -1150
9829 -4639 -69825 84572 -174171 -226080 11559 63009 208484 190502 79079 116847 166 130193
9817 130193 16602 265259 -205140 -13616 105708 -200065 126226 42515 130330 -201931
9806 182329 117397 -329029 41959 -193025 -114399 -116474 92370 -142880 -69418 -3367 138199
9794 -177616 -37141 -116528 158225 -346034 -84543 47394 -78245 -68210 59036 -170652 -361348
9783 -361348 -1998 -27254 311003 68234 -174650 -38184 -230469 136121 -139856 24133 -135400
$$ packed form
9864a02303C2612G79a18000A09070c19023d7143c961r0467a6646q0756j44686
9853b42088k7126P9790N8866A15113a89284k57476e5991C88883b06143p1598A0937
9841b66718i6643a8454j39455g3988j5625l47262h8733D4821b21615g8340a150
9829d639o5186H4572a74171n1909A1559N1450J45475j7982G9079L7768A66J30027
9817A30193A6602K48657b05140a3616A05708b00065A26226D2515Q7815b01931
9806A82329o4932c29029D1959a93025P8626k075I2370a42880f9418c367A38199
9794a77616c7141p9387A58225c46034h4543D7394g8245J0035E9036a70652j90696
9783c61348a998k5256C11003F8234a74650c8184j92285A36121a39856B4133a35400
$$ plain form
9771 178458 -222720 -296822 10669 -90867 -58321 -233992 -64175 311832 -76041 19245 132347
9760 132347 94582 -290136 -116957 43287 -84643 264321 247846 -195910 -49384 -25877 264219
9748 -272388 146031 -224664 52726 -246052 -179896 -258177 -177334 -282868 -88961 -179271 -201924
9737 -201924 130732 -92296 180514 -58548 -188816 -285872 -46837 140681 -9183 -274004 -250068
9726 -250068 320587 -368978 -122949 -35492 -291817 333744 -72996 182517 -46691 565988
9715 -109935 -334159 -88412 -84991 -202570 -196006 96303 83547 226433 -53370 -158613 21622
9703 -158624 -398427 27012 143065 165434 166418 -165892 -221137 117850 83978 -189720 -1683
9691 -142742 -47654 -115792 -36878 89678 -49446 -94442 186709 -87733 85655 -42833 -149375
$$ packed form
9771A78458b22720p4102A0669i0867L2546j75671f4175C11832g6041A9245J13102
9760A32347l7765b90136a16957D3287h4643B64321j6475a95910d9384K3507B64219
9748b72388A46031b24664E2726b46052O6156p8281Q0843j05534h8961r0310k2653
9737b01924A30732i2296A80514e8548j30268r7056d6837A40681i183k64821K3936
9726b50068C20587c68978a22949c5492k56325C33744g2996A82517d6691E65988
9715a09935k24224h8412L421j17579O564I6303j2756J42886e3370j05243B1622
9703a58624k39803B7012J16053K2369R84a65892n5245A17850l3872a89720a683
9691a42742d7654o8138c6878H9678d9446m4996A86709h7733H5655d2833j06542
$$ plain form
9680 -149375 -192843 -219267 52043 -12050 251165 -17148 -275063 91574 -56037 -173967 63813
9668 -126448 56838 -611506 -307809 63875 -44711 88086 -366405 -313040 49519 99767 12628
9656 -92075 -129938 -21744 -163977 23431 -23989 -153077 345676 -119577 -68639 -62607 130674
9644 -9222 139138 -403967 -9420 34491 4825 -162380 -174946 -439003 54056 -19384 35068 -267850
9631 -296874 -72729 -36148 -369660 -341163 -85652 -103050 -130258 161869 -308590 150313 -127199
9619 -35361 31322 -7397 -185530 -2893 16100 185112 10974 -129389 156442 -100498 115089
9607 373306 -56299 -148910 -136473 -127194 -154380 -215532 -267982 -543000 -50430 -448506 158015
9595 -85630 -134566 376283 86322 -19271 -30671 -368177 -30107 166069 -30344 116643 -306332
$$ packed form
9680a49375m3468k6424E2043a2050B51165a7148k57915I1574e6037j17930F3813
9668a26448E6838f11506L03697F3875d4711H8086c66405N3365D9519N0248A2628
9656i2075l7863b1744j42233B3431b3989j29088C45676a19577N0938O032A30674
9644i222A39138d03967i420C4491D825a62380j2566k64057E4056a9384C5068b67850
9631b96874g2729c6148l33512K8497h5652j7398k7208A61869c08590A50313a27199
9619c5361C1322g397j78133b893A6100J69012A0974a29389A56442a00498A15089
9607C73306e6299r2611J2437R279k7186o1152n2450k75018e0430l98076A58015
9595h5630m8936C76283H6322a9271j1400l37506c0107A66069c0344A16643c06332
$$ plain form
9583 90162 -68945 -160442 -133576 -289237 207212 -211732 -56160 53362 130429 153022 59006
9571 103590 -162937 35522 -58029 35606 -235890 -176083 69741 20654 7286 -161993 -29283
9559 160170 63468 -61010 -423486 -208027 -1393 383090 -51131 -184106 -265451 -86254 89110
9547 139893 -73386 -100411 36371 -154520 -73082 -128216 -226745 -80313 31870 42196 131254
9536 131254 -127497 -156298 140254 63909 79991 1063 30223 -108465 -17008 33419 77762
9525 77762 50519 199239 231948 -151016 -141845 -58780 -5236 -106897 -154249 177066 -205721
9513 222327 -171476 -390911 107668 -214334 -160430 -3004 -168190 -235666 -250512 24963 130788
9502 130788 186833 13526 -164621 144685 215878 -140105 -149872 348579 -88481 -263900 -54887
$$ packed form
9583I0162f8945r1497K6866j55661B07212b11732e6160E3362P7067K2593E9006
9571A03590a62937C5522e8029C5606b35890N9807F9741B0654G286a61993b9283
9559A60170F3468f1010l62476b08027a393C83090e1131j32975q1345h6254H9110
9547A39893g3386k7025C6371a54520g3082n5134r8529h0313C1870J0326Q9058
9536A31254a27497k8801A40254F3909J6082A063K9160a08465a7008C3419M4343
9525G7762k7243J48720L2709a51016R171e8780e236j01661m7352A77066b05721
9513B22327a71476k19435A07668b14334N3904c004j65186o7476j4846B4963J05825
9502A30788N6045A3526a64621A44685P1193a40105r767C48579h8481j75419e4887
$$ plain form
9490 -90580 61915 -165488 -57497 -2870 -27677 -198766 -133840 -251321 -277174 -141274 158885
9478 -98270 -45141 22741 -479115 -31823 -20465 -188142 -217281 -77897 -23347 -116398 -84171
9467 -84171 -192212 -55486 -112634 51048 -131343 -135747 -94275 -97679 172359 88210 251385
9456 251385 23240 32488 -15493 -39602 -287395 -339097 -84581 34148 -265315 -165452 66745
9444 -188611 18420 37309 -211462 -108150 -243590 131824 267470 -403555 -276144 -218430
9434 -218430 -278319 -160561 102690 74428 378054 87201 2289 -69279 183232 -120483 48487
9422 125234 -330928 -252156 103322 250523 -161962 -145644 70329 -266839 10747 9928 -321
9410 -228825 27271 50549 -155959 -162083 -168777 52799 54504 -226921 -95746 -72114 -290571 -274492
$$ packed form
9490i0580F1915a65488e7497b870k4807j71089O4926j17481k5853J35900A58885
9478i8270d5141B2741d79115c1823J1358j67677k9139g7897b3347r3051L2227
9467h4171j08041e5486n7148E1048a31343m404M1472l404A72359q4149J63175
9456B51385B3240R248a5493k4109k47793n1702h4581C4148b65315R9863F6745
9444a88611A8420J8889b11462J03312j35440A31824J35646d03555J27411N7714
9434b18430n9889J17758A02690k8262L03626H7201B289f9279A83232a20483D8487
9422A25234c30928P8772A03322J47201a61962J6318G0329b66839A0747q19c21
9410b28825B7271K3278a55959o124o694E2799J705b26921i5746K3632k18457J6079
$$ plain form
9398 -274492 39022 93016 -366131 -262210 -183474 -124330 137777 -296538 -6548 -11521 -67501
9387 -67501 128470 -94091 84379 118047 94117 78794 -86820 -34133 -111389 244703 67309
9375 11227 -270089 -58680 -193279 11229 -54657 -207125 80622 -313926 79727 144718 -223500
9363 -90124 -129059 -84478 -215051 -255976 -95757 -150622 -44652 -124679 -13824 -262722 -355458
9352 -355458 162088 -196335 -207639 -345278 10684 53566 -234771 -55063 78668 94872 -212389
9340 -160908 -4086 -216010 -233682 -39272 77074 246763 -42952 -69989 161319 138002 158662
9329 158662 -179671 6723 -176106 -107950 8973 266940 -90695 -47439 4653 140426 173336
9318 173336 115457 305080 29953 158748 32338 -50184 -160533 -121665 -177456 12576 411883
$$ packed form
9398b74492C9022N3994c66131J03921P8736N9144A37777b96538f548m973n5980
9387f7501A28470i4091H4379L3668k3930j5323h6820c4133p7256B44703F7309
9375A1227b70089e8680j34599A1229e4657j52468H0622c13926G9727O4991b23500
9363i0124l8935M4581j30573m0925i5757n4865d4652q0027a3824k48898r2736
9352c55458A62088a96335j1304j37639A0684M2882b34771e5063G8668J6204b12389
9340a60908d086k11924j7672c9272G7074J69689d2952k7037A61319k3317K0660
9329A58662a79671F723a76106O8156H973K57967i0695M3256D653J35773L2910
9318A73336n7879J89623B9953J28795C2338e0184j10349L8868n5791A2576L99307
$$ plain form
9307 411883 49702 343921 -6067 -148650 -196043 248468 -67596 96537 -291210 -16956 -105
9295 -118494 35574 -81385 -113298 209558 54616 153072 61616 180117 39735 216679 27467
9283 166921 -242021 -146232 -274868 36566 93086 -198657 -40022 142902 47701 177938 148381
9272 148381 -195875 -19987 151849 -75965 -9734 -211508 -213376 -30480 -202282 318620 -211795
9260 -365237 -14227 24058 436008 -115895 46678 -487918 -546505 -87115 -2791 -174534 -95584
9249 -95584 240960 -21113 -73679 -130051 -196736 -15300 -43405 100431 -6236 -76218 127925
9237 22416 -75263 107495 -233226 -13311 -111243 -68141 75301 -167037 -120101 -59960 -7687
9225 177908 -87617 136090 -237838 -18081 32557 -119286 -27010 -413464 -327507 -149286 -34820
$$ packed form
9307D11883D9702K94219f067j42583m7393B48468f7596I6537b91210a6956a05
9295a18494C5574h1385l1913B09558E4616R8456F1616J18501C9735J76944B7467
9283A66921b42021R5789j28636C6566N6520a98657d0022A42902D7701J30237k9557
9272A48381a95875a9987A51849g5965i734k01774j868c0480j71802C18620b11795
9260c65237a4227B4058M11950a15895D6678d87918n8587h7115b791j71743P8950
9249i5584B40960b1113n2566n6372o6685a5300k8105A00431f236o9982A27925
9237B2416g5263A07495b33226a3311r7932M3102G5301a67037M6936e9960g687
9225A77908h7617A36090b37838a8081C2557a19286b7010l86454Q5957a49286c4820
$$ plain form
9213 -30143 -165085 23420 -121815 -4757 -111213 -321900 -170224 2911 -132553 -18547 208325
9201 -381434 -22316 -88931 -196538 285323 -175956 -208068 -76679 -37962 -153 140756 -45708
9189 -64600 -171505 -277006 -39384 140292 -46342 -240047 -8438 -177176 225525 -59877 -73516
9178 -73516 -149146 -19152 99088 41346 174122 -49422 3411 -344645 35631 -296323 -304459 266399
9165 51541 13510 130841 -207323 -7306 -180735 -130250 16672 -319996 -157889 -103132 23623
9153 54335 -472673 -90097 164129 77092 -149343 47596 28660 -38496 -21915 -171120 23582
9141 77582 -81584 -130 -243125 307928 -77148 87766 150886 88915 -44786 -52755 26479 -51580
9128 324273 -549836 84768 -62589 238265 67942 17990 -133466 -278198 1116 -36806 -399580
$$ packed form
9213c0143j34942B3420a21815d757j06456k10687J51676B911a32553a8547B08325
9201c81434b2316o6615j07607B85323a75956l2112g6679c7962a53A40756d5708
9189f4600j06905j05501c9384A40292d6342j93705h438j68738B25525e9877j3639
9178g3516p5630a9152I9088D1346J32776d9422C411c44645C5631b96323q136B66399
9165E1541A3510J17331b07323g306j73429N0485A6672c19996a57889N4757B3623
9153E4335d72673i0097A64129G7092a49343D7596j8936c8496J6581j49205B3582
9141G7582h1584a30k42995C07928g7148H7766O3120o1971d4786p969B6479e1580
9128C24273e49836H4768f2589B38265F7942A7990a33466j44732A116c6806l62774
$$ plain form
9117 -399580 -147362 -146605 51484 -105882 247734 -93132 -32577 -168673 -97472 27182 -330041
9105 -126530 134529 291978 -478903 -7219 -150330 132986 55713 282360 -62034 157889
9094 125709 -158849 -115692 155383 -418466 -230855 -169173 -195265 -78384 -107584 -166740 4926
9082 97748 97486 109646 205769 -43293 -132376 167550 75800 -368136 1652 83847 -207834 -294032
9070 -294032 -234491 -30913 133785 419144 -74127 -222731 61752 355781 82517 -226386 -330205
9059 -330205 -195788 -56900 113029 118931 -63151 238557 9260 -384423 -271149 -46135 -258599
9048 -258599 -317814 -424565 45022 70622 -14046 -147369 -205449 47822 -379555 -310317 -271852
9037 -271852 -175694 -116098 -13911 82729 114120 128218 -87749 -311199 -110466 -100053 34664
$$ packed form
9117c99580a47362P57E1484a05882B47734i3132c2577j36096P1201B7182c30041
9105a26530A34529J57449d78903g219j43111A32986E5713K26647f2034A57889
9094A25709a58849M3157A55383d18466J87611O1682k6092g8384k9200n9156D926
9082I7748k62J2160R6123d3293q9083A67550G5800c68136A652Q2195b07834q6198
9070b94032N9541c0913A33785K85359g4127j48604F1752K94029H2517b26386j03819
9059c30205J34417e6900A13029N902f3151B38557I260c84423J13274d6135k12464
9048b58599n9215j06751D5022K5600a4046j33323n8080D7822c79555O9238L8465
9037b71852R6158N9596a3911H2729L1391J4098h7749k23450a10466J0413C4664
$$ plain form
9025 -140276 -148271 -186474 -184963 -81910 64384 -98190 -16793 -16928 -318106 -11854 -29089 110507
9012 -420139 108758 -15235 150153 153411 377340 32017 -8251 41040 226720 49493 50272 -152360
8999 -90760 210343 54159 -226602 88743 20347 130087 -161969 -9186 -53563 -257964 -156095
8988 -156095 -185690 168141 -63970 -56129 -144468 84689 220169 -26711 243795 -356899 195322
8976 -304983 57646 -72712 -127029 -124656 77507 78860 45201 198719 33385 -96134 -89314 -216174
8964 -216174 82303 204666 7955 319011 -11113 -420988 -284559 24092 -12659 -34785 -324447
8953 -324447 -80339 -148468 -143875 -166130 114933 80292 -239774 -133257 88939 -29360 253310
8941 -344463 -44575 -260633 231761 104408 -55538 297870 69427 -85649 -263217 262530
$$ packed form
9025a40276p995l8203J511h1910F4384i8190a6793j35l01178a1854j7235A10507
9012d20139A08758a5235A50153L258K23929C2017h251D1040J85680D9493P79a52360
8999i0760B10343E4159b26602H8743B0347J09740a61969i186m4377k04401J01869
8988a56095k9595A68141f3970P841q8339H4689J35480b6711B43795c56899A95322
8976c04983E7646g2712n4317K373G7507J353l3659J53518C3385i6134O820j26860
8964b16174H2303J22363G955L11056a1113m09875J36429B4092a2659k2126k89662
8953c24447h0339o8129M593k2255A14933l4641b39774J06517H8939b9360B53310
8941c44463d4575k16058B31761A04408e5538B97870F9427h5649j77568B62530
$$ plain form
8930 195906 109737 -275494 -191642 -286231 -17283 -39658 88660 -71523 -219354 195388 -330
8918 252361 21904 -115195 -331854 103843 34465 239543 -176265 19766 136528 221616
8908 221616 397272 606312 1068515 2444137 4696976 3626298 2006944 1259021 264860
8898 406352 325820 210818 23110 190660 -11947 199362 31441 -28736 151919 -35767 87974
8886 139473 -229432 -124097 -190077 -66169 118738 148623 -112849 238343 2033 -294904 83236
8874 56198 -105728 -40388 -11767 112095 -150099 -484442 83280 -58771 -34337 50210 -213712
8862 -21121 -290897 -12032 278860 -188479 -16937 44906 -251087 -168069 -44147 308896 28643
8850 214842 -176340 -64984 -253798 -91012 182853 -226402 -62343 -197858 -30267 -176352
$$ packed form
8930A95906q6169b75494Q3852r4589a7283k2375H8660g1523j47831A95388c30
8918B52361B1904a15195k16659A03843C4465K05078a76265A9766J16762Q5088
8908B21616J75656K09040M62203J375622K252839j070678j619354p47923B64860
8898D06352q0532j15002B3110J67550a1947A99362C1441b8736A51919c5767H7974
8886A39473b29432J05335o5980f6169A18738K9885a12849B38343B033b94904H3236
8874E6198a05728d0388a1767A12095a50099l34343H3280e8771K4434E0210b13712
8862b1121k69776a2032B78860a88479a6937D4906b51087Q3018d4147C08896B8643
8850B14842a76340f4984j88814i1012A82853b26402f2343j35515c0267j46085
$$ plain form
8840 -176352 -66585 58906 12684 -15481 36486 -224070 -30812 93200 -228908 -51063 8846
8828 -291708 39532 -55805 -73073 91964 -42359 322103 -97314 -201938 -7755 -249475 -46795
8816 -143574 -13282 -83652 -43196 -128607 -279271 11716 -261839 76442 -230946 -236423 -289161
8805 -289161 49408 -67964 16880 -9565 168970 231812 -131038 -148951 -75944 22997 81528
$$ packed form
8840a76352f6585E8906A2684a5481C6486b24070c0812I3200b28908e1063H846
8828b91708C9532e5805j7268I1964d2359C22103i7314j04624g755k41720d6795
8816a43574a3282p0370M0456q5411j50664A1716b61839G6442b30946n477n2738
8805b89161D9408f7964A6880i565A68970O2842a31038j7913P3007B2997N8531
$$ [...]
##END NTUPLES=NMR SPECTRUM
##END=
