
##TITLE=AC1116_Cauca1_5835603_bxzCjDc94Z
##JCAMPDX= 6.0         $$ Bruker NMR JCAMP-DX V2.0
##DATA TYPE= NMR SPECTRUM
##DATA CLASS= NTUPLES
##ORIGIN= BRUKER
##OWNER= Administrator
$$ 1.72 TOPSPIN		Version 2.1
$$ 2012-04-16 19:07:42.437 -0500  Administrator@TOPSPIN
$$ Compression mode = diff/dup
##.OBSERVE FREQUENCY= 400.13188235
##.OBSERVE NUCLEUS= ^1H
##.ACQUISITION MODE= SIMULTANEOUS (DQD)
##.ACQUISITION SCHEME= undefined
##.AVERAGES= 64
##.DIGITISER RES= 22
##SPECTROMETER/DATA SYSTEM= spect
##.PULSE SEQUENCE= noesygpps1d.comp
##.SOLVENT NAME= COFFEE_meoh
##.SHIFT REFERENCE= INTERNAL, COFFEE_meoh, 1, 14.96801
##AUDIT TRAIL= $$ (NUMBER, WHEN, WHO, WHERE, PROCESS, VERSION, WHAT)
$$ ##TITLE= Audit trail, TOPSPIN		Version 2.1
$$ ##JCAMPDX= 5.01
$$ ##ORIGIN= Bruker BioSpin GmbH
$$ ##OWNER= Administrator
$$ $$ C:\Bruker\TOPSPIN/data/COFFEE/nmr/AC1116_Cauca1_5835603_bxzCjDc94Z/22/pdata/1/auditp.txt
$$ ##AUDIT TRAIL=  $$ (NUMBER, WHEN, WHO, WHERE, PROCESS, VERSION, WHAT)
(   1,<2012-04-15 16:52:04.781 -0500>,<Administrator>,<TOPSPIN>,<go>,<TOPSPIN 2.1>,
      <created by zg
	started at 2012-04-15 16:40:32.906 -0500,
	POWCHK enabled, PULCHK disabled,
       configuration hash MD5:
       1A 1E CE 29 27 FD 77 03 67 4E F0 E3 C4 B2 CB 90
       data hash MD5: 64K
       8D 6C 3C 6E 7D 93 32 E8 E1 92 1A 5A F4 ED BE D6>)
(   2,<2012-04-15 16:52:07.562 -0500>,<Administrator>,<TOPSPIN>,<proc1d>,<TOPSPIN 2.1>,
      <Start of raw data processing
       efp LB = 0.3 FT_mod = 6 PKNL = 1 PHC0 = 0 PHC1 = 0 SI = 128K 
       data hash MD5: 128K
       65 C1 01 4F C4 BD 84 98 3F E5 76 3F 19 C3 4A 3C>)
(   3,<2012-04-15 16:52:08.781 -0500>,<Administrator>,<TOPSPIN>,<proc1d>,<TOPSPIN 2.1>,
      <pk PHC0 = 37.00195 PHC1 = 0 
       data hash MD5: 128K
       A3 90 B9 F2 67 46 7D E7 A9 00 E5 CC 38 94 4D 60>)
(   4,<2012-04-15 16:52:09.328 -0500>,<Administrator>,<TOPSPIN>,<proc1d>,<TOPSPIN 2.1>,
      <abs ABSG = 1 
       data hash MD5: 128K
       7B 02 A8 F0 96 DC 6F 9B B0 65 6C 95 5C 1F C5 3F>)
(   5,<2012-04-15 16:52:09.406 -0500>,<Administrator>,<TOPSPIN>,<proc1d>,<TOPSPIN 2.1>,
      <abs ABSG = 2 
       data hash MD5: 128K
       3E 17 EE 80 DC 1D E7 68 5D 03 E9 15 4F EE C5 20>)
(   6,<2012-04-15 16:52:09.453 -0500>,<Administrator>,<TOPSPIN>,<proc1d>,<TOPSPIN 2.1>,
      <abs ABSG = 3 
       data hash MD5: 128K
       8E 12 F9 A2 4A 2B 97 0C C4 BA C8 13 B2 E5 55 BD>)
(   7,<2012-04-15 16:52:09.500 -0500>,<Administrator>,<TOPSPIN>,<proc1d>,<TOPSPIN 2.1>,
      <abs ABSG = 4 
       data hash MD5: 128K
       5A 52 3E FB A3 A6 B3 BB 1E 0A 4C 82 79 0F 8B BC>)
(   8,<2012-04-15 16:52:09.562 -0500>,<Administrator>,<TOPSPIN>,<proc1d>,<TOPSPIN 2.1>,
      <abs ABSG = 5 
       data hash MD5: 128K
       67 A7 40 AA 65 61 E4 13 B9 AD 4A 36 18 28 B9 F9>)
(   9,<2012-04-15 16:52:09.781 -0500>,<Administrator>,<TOPSPIN>,<audit>,<TOPSPIN 2.1>,
      <user comment:
       ICON-NMR User ID: COFFEE
       data hash MD5: 128K
$$ [...]
##$TP07= 0
##$TPNAME0= <>
##$TPNAME1= <>
##$TPNAME2= <>
##$TPNAME3= <>
##$TPNAME4= <>
##$TPNAME5= <>
##$TPNAME6= <>
##$TPNAME7= <>
##$TPOAL= (0..7)
0.5 0.5 0.5 0.5 0.5 0.5 0.5 0.5
##$TPOFFS= (0..7)
0 0 0 0 0 0 0 0
##$TUNHIN= 0
##$TUNHOUT= 0
##$TUNXOUT= 0
##$USERA1= <user>
##$USERA2= <user>
##$USERA3= <user>
##$USERA4= <user>
##$USERA5= <user>
##$V9= 5
##$VALIST= <valist>
##$VCLIST= <CCCCCCCCCCCCCCC>
##$VD= 0
##$VDLIST= <DDDDDDDDDDDDDDD>
##$VPLIST= <PPPPPPPPPPPPPPP>
##$VTLIST= <TTTTTTTTTTTTTTT>
##$WBST= 2048
##$WBSW= 25
##$XGAIN= (0..3)
0 0 0 0
##$XL= 0
##$YL= 0
##$YMAX_a= 10688261
##$YMIN_a= -6057074
##$ZGOPTNS= <>
##$ZL1= 120
##$ZL2= 120
##$ZL3= 120
##$ZL4= 120
##$ABSF1= 14.96801
##$ABSF2= -5.58452
##$ABSG= 5
##$ABSL= 3
##$ALPHA= 0
##$AQORDER= 0
##$ASSFAC= 0
##$ASSFACI= 0
##$ASSFACX= 0
##$ASSWID= 0
##$AUNMP= <proc_prof1d_extract.lims>
##$AXLEFT= 0
##$AXNAME= <>
##$AXNUC= <1H>
##$AXRIGHT= 0
##$AXTYPE= 0
##$AXUNIT= <>
##$AZFE= 0.1
##$AZFW= 0.1
##$BCFW= 0
##$BC_mod= 0
##$BYTORDP= 0
##$COROFFS= 0
##$CY= 15
##$DATMOD= 1
##$DC= 0
##$DFILT= <>
##$DTYPP= 0
##$F1P= 0
##$F2P= 0
##$FCOR= 0.5
##$FTSIZE= 131072
##$FT_mod= 6
##$GAMMA= 0
##$GB= 0
##$INTBC= 1
##$INTSCL= 1
##$ISEN= 128
##$LB= 0.3
##$LEV0= 0
##$LPBIN= 0
##$MAXI= 10000
##$MC2= 0
##$MEAN= 0
##$ME_mod= 0
##$MI= 0
##$NCOEF= 0
##$NC_proc= -3
##$NLEV= 6
##$NOISF1= 0
##$NOISF2= 0
##$NSP= 0
##$NTH_PI= 0
##$NZP= 0
##$OFFSET= 14.96801
##$PC= 1
##$PHC0= 37.00195
##$PHC1= 0
##$PH_mod= 1
##$PKNL= yes
##$PPARMOD= 0
##$PPDIAG= 0
##$PPIPTYP= 0
##$PPMPNUM= 2147483647
##$PPRESOL= 1
##$PSCAL= 4
##$PSIGN= 0
##$PYNMP= <proc.py>
##$REVERSE= no
##$SF= 400.130005043477
##$SI= 131072
##$SIGF1= 0
##$SIGF2= 0
##$SINO= 400
##$SIOLD= 131072
##$SPECTYP= <>
##$SREGLST= <1H.CDCl3>
##$SSB= 0
##$STSI= 131072
##$STSR= 0
##$SW_p= 8223.68421052632
##$SYMM= 0
##$S_DEV= 0
##$TDeff= 65536
##$TDoff= 0
##$TI= <>
##$TILT= no
##$TM1= 0
##$TM2= 0
##$TOPLEV= 0
##$USERP1= <user>
##$USERP2= <user>
##$USERP3= <user>
##$USERP4= <user>
##$USERP5= <user>
##$WDW= 1
##$XDIM= 131072
##$YMAX_p= 458693830
##$YMIN_p= -505519849
##$CURPLOT= <Network HP LaserJet P1505>
##$CURPRIN= <$Network HP LaserJet P1505>
##$DFORMAT= <normdp>
##$LAYOUT= <+/1D_H.xwp>
##$LFORMAT= <normlp>
##$PFORMAT= <normpl>
##$SURQMSG= 1
$$ End of Bruker specific parameters
$$ ---------------------------------
##NTUPLES= NMR SPECTRUM
##VAR_NAME=  FREQUENCY,     SPECTRUM/REAL,   SPECTRUM/IMAG
##SYMBOL=    X,             R,               I
##VAR_TYPE=  INDEPENDENT,   DEPENDENT,       DEPENDENT
##VAR_FORM=  AFFN,          ASDF,            ASDF
##VAR_DIM=   131072,        131072,          131072
##UNITS=     HZ,            ARBITRARY UNITS, ARBITRARY UNITS
##FACTOR=    0.0627417313425165, 1,          1
##FIRST=     8223.62146879498, -3799,        -82177
##LAST=      0,             919,             -83803
##MIN=       0,             -505519849,      0
##MAX=       8223.62146879498, 458693830,    0
$$ Real data points
##PAGE= N=1
##DATA TABLE= (X++(R..R)), XYDATA
$$ [...]
61804E411290k81545k56873k34151k14065j95456j77249j60053j44786j31090
61795C616022j18293j06795r7150q8733q0586p2928o6495o0968n5298m9201m3243
61784B776332l7828l3201l0053k8878k8757k7854k5287k1830j8786j6661j4901
61773B492296j2444q714m417j017R54K431M316O237P553Q786J0886J3599J5720
61760B536186J6768J7465J8615K0350K2368K4239K5651K7036K9504L3502L7953
61749B809637M1690M5235N0064N6285O2366O7269P1745P7236Q4219R2051R9909
61738C557706J07691J16136J25902J36407J46206J54949J64229J75691J88988
61729D873905K02723K16746K32119K49218K67405K86735L08504L33677L61852
$$ y = [5411290, 5129745, 4872872, 4638721, 4424656, 4229200, 4051951, 3891898, 3747112, 3616022, 3497729, 3390934, 3293784, 3205051, 3124465, 3051537, 2985042, 2924074, 2868776, 2819575, 2776332, 2738504, 2705303, 2675250, 2646372, 2617615, 2589761, 2564474, 2542644, 2523858, 2507197, 2492296, 2479852, 2471138, 2466721, 2465704, 2466658, 2469089, 2473405, 2479642, 2487195, 2495981, 2506867, 2520466, 2536186, 2552954, 2570419, 2589034, 2609384, 2631752, 2655991, 2681642, 2708678, 2738182, 2771684, 2809637, 2851327, 2896562, 2946626, 3002911, 3065277, 3132546, 3204291, 3281527, 3365746, 3457797, 3557706, 3665397, 3781533, 3907435, 4043842, 4190048, 4344997, 4509226, 4684917, 4873905, 5076628, 5293374, 5525493, 5774711, 6042116, 6328851, 6637355, 6971032, 7332884]
61720G332884L92276M25124M61402N02140N47915N98562O53333P11764P74215
61711A2399615Q40928R10743R81360J050417J115361J172504J217115J243921
61703B0931964J246365J215955J144349J026825Q63290O57071M15147J50020j21109
61694B7529877l80889o15768q16327r76558j094556j172890j216681j231275j221759
61685A8803174j193214j150097j095862j033879r68055r01736q36526p72906p11478
61676A0139421o53052n98197n47376n01066m59131m20675l85088l52733l24012
61667E898091k98354k74740k52650k31971k12514j94435j78566j65529j54726
61658C934606j44830j35094j25695j17120j09641j03235r7646r2580q7890q3290
$$ y = [7332884, 7725160, 8150284, 8611686, 9113826, 9661741, 10260303, 10913636, 11625400, 12399615, 13240543, 14151286, 15132646, 16183063, 17298424, 18470928, 19688043, 20931964, 22178329, 23394284, 24538633, 25565458, 26428748, 27085819, 27500966, 27650986, 27529877, 27148988, 26533220, 25716893, 24740335, 23645779, 22472889, 21256208, 20024933, 18803174, 17609960, 16459863, 15364001, 14330122, 13362067, 12460331, 11623805, 10850899, 10139421, 9486369, 8888172, 8340796, 7839730, 7380599, 6959924, 6574836, 6222103, 5898091, 5599737, 5324997, 5072347, 4840376, 4627862, 4433427, 4254861, 4089332, 3934606, 3789776, 3654682, 3528987, 3411867, 3302226, 3198991, 3101345, 3008765, 2920875, 2837585]
61648B837585p8146p2199o6355o1838n8518n5120n1285m8100m6183m4548m2235
61637B213058l9832l8286l7231l5716l3988l3226l3829l4951l5441l4518l2009
61626A824031k8807k6615k6296k6774k6406k4998k3596k2759k2138k1535k1151
61615A552956k0678j9189j6362j3225j1386j1680j3649j6020j7743j8631j8884
61604A375509j8138j5760j2198r221q239q970j0128j0647r821p404m388k771l419
61591A254405m769m758l390k271k121k101j342R0J726L172M021M069L628L081
61577A253440K425J749J581J993J965O67j230k508l124l785m279l713k212j096
61563A241873j278k466l787m334l543k064j783l715o359p538p291p264p779p592
$$ y = [2837585, 2759439, 2687240, 2620885, 2559047, 2500529, 2445409, 2394124, 2346024, 2299841, 2255293, 2213058, 2173226, 2134940, 2097709, 2061993, 2028005, 1994779, 1960950, 1925999, 1890558, 1856040, 1824031, 1795224, 1768609, 1742313, 1715539, 1689133, 1664135, 1640539, 1617780, 1595642, 1574107, 1552956, 1532278, 1513089, 1496727, 1483502, 1472116, 1460436, 1446787, 1430767, 1413024, 1394393, 1375509, 1357371, 1341611, 1329413, 1320192, 1311953, 1302983, 1292855, 1282208, 1272387, 1264983, 1260595, 1257824, 1254405, 1249636, 1244878, 1241488, 1239217, 1237096, 1234995, 1233653, 1233743, 1235469, 1238641, 1242662, 1246731, 1250359, 1253440, 1255865, 1257614, 1259195, 1261188, 1263153, 1263820, 1262590, 1260082, 1256958, 1253173, 1248894, 1245181, 1242969, 1241873, 1240595, 1238129, 1234342, 1230008, 1226465, 1224401, 1222618, 1218903, 1212544, 1205006, 1197715, 1190451, 1182672, 1175080]
61549A175080o477n838o383p180p545p950q441p971o162m146k840j911j164j261
61535A099811k061j986k77J699K590L051M150N313N573N666O997R328J1281J2533
61521A163668J3729J4795J5136J5281J6523J8924K1242K2964K4979K7916L1053
61510A386210L3261L4190L4320L4602L6003L8553M0928M1776M1421M1226M1508
61499A803998M1328M0357L9586L9738M0163L9899L8787L6879L3743K9392K5184
61488B209054K2749K1992K1024J8173J3537Q546M406J342r77k757m054n080o157
61475B301798p336q416r334j0017r758p493l221J429M766O872R248J2907J7644
61462B299089K2974K8816L5010M0887M5853N0191N5108O2064P1720Q3135R4203
$$ y = [1175080, 1168603, 1162765, 1156382, 1149202, 1141657, 1133707, 1125266, 1117295, 1111133, 1106987, 1104147, 1102236, 1101072, 1099811, 1097750, 1095764, 1095487, 1097186, 1099776, 1102827, 1106977, 1112290, 1117863, 1123529, 1130526, 1139854, 1151135, 1163668, 1177397, 1192192, 1207328, 1222609, 1239132, 1258056, 1279298, 1302262, 1327241, 1355157, 1386210, 1419471, 1453661, 1487981, 1522583, 1558586, 1597139, 1638067, 1679843, 1721264, 1762490, 1803998, 1845326, 1885683, 1925269, 1965007, 2005170, 2045069, 2083856, 2120735, 2154478, 2183870, 2209054, 2231803, 2253795, 2274819, 2292992, 2306529, 2315075, 2319481, 2320823, 2319846, 2317089, 2313035, 2307955, 2301798, 2294462, 2286046, 2276712, 2266695, 2256937, 2249444, 2246223, 2247652, 2252418, 2259290, 2268538, 2281445, 2299089, 2322063, 2350879, 2385889, 2426776, 2472629, 2522820, 2577928, 2639992, 2711712, 2794847, 2889050]
61451B889050J03560J12131J22250J35194J50013J64772J78443J91543K05400
61442D252356K20946K37655K53476K66054K74113K77559K76388K69910K56870
61433F585327K35943K06433J69190J26623Q1210L4294j2829n7175r4971j24620
61423G149425j47480j65324j78256j85784j88475j87320j82470j74062j63559
61414E576695j52724j41506j28510j13546r8208q3578o8926n3491l8282k4818
61404D673106j2826o30J2217K4148L3849M2182N0839N9679O6722P0993P4086P7965
61392E172330Q1964Q3432Q1414P8188P6444P6066P4952P2323O9581O7886O6481
61381F001061O4065O0614N6849N2791M8070M3147L8903L5070L0341K4476J9039
$$ y = [2889050, 2992610, 3104741, 3226991, 3362185, 3512198, 3676970, 3855413, 4046956, 4252356, 4473302, 4710957, 4964433, 5230487, 5504600, 5782159, 6058547, 6328457, 6585327, 6821270, 7027703, 7196893, 7323516, 7404726, 7439020, 7426191, 7369016, 7274045, 7149425, 7001945, 6836621, 6658365, 6472581, 6284106, 6096786, 5914316, 5740254, 5576695, 5423971, 5282465, 5153955, 5040409, 4942201, 4858623, 4789697, 4736206, 4697924, 4673106, 4660280, 4659650, 4671867, 4696015, 4729864, 4772046, 4822885, 4882564, 4949286, 5020279, 5094365, 5172330, 5254294, 5337726, 5419140, 5497328, 5573772, 5649838, 5724790, 5797113, 5866694, 5934580, 6001061, 6065126, 6125740, 6182589, 6235380, 6283450, 6326597, 6365500, 6400570, 6430911, 6455387, 6474426]
61370F474426J5331J2486Q692L804n65l517o200j0058j4754j8772k1556k3988
61358F415329k6700k8895k9303k7705k5108k2813k1667k1852k2753k3352k3271
61347F141910k3320k4372k5895k6446k5751k5247k6077k7403k7616k6411k4566
61336E858806k1959j7303j0041j193Q332J9224L2565M7901O3689P9430R6251J15284
61324F270986J36313J58202J79924K00879K20823K39903K58203K74838K87851
61315H227922K95427K96862K92100K80733K62076K35851K02186J61207J13638
61306A0368002O2011J0437l7572q0988j20705j57406j90411k18501k41283k59469
61296I134115k74033k85266k92654k95550k94031k89037k81598k72068k60394
$$ y = [6474426, 6489757, 6502243, 6510935, 6514739, 6514174, 6510657, 6504457, 6494399, 6479645, 6460873, 6439317, 6415329, 6388629, 6359734, 6330431, 6302726, 6277618, 6254805, 6233138, 6211286, 6188533, 6165181, 6141910, 6118590, 6094218, 6068323, 6041877, 6016126, 5990879, 5964802, 5937399, 5909783, 5883372, 5858806, 5836847, 5819544, 5809503, 5808310, 5816642, 5835866, 5868431, 5916332, 5980021, 6059451, 6155702, 6270986, 6407299, 6565501, 6745425, 6946304, 7167127, 7407030, 7665233, 7940071, 8227922, 8523349, 8820211, 9112311, 9393044, 9655120, 9890971, 10093157, 10254364, 10368002, 10430013, 10440450, 10402878, 10321890, 10201185, 10043779, 9853368, 9634867, 9393584, 9134115, 8860082, 8574816, 8282162, 7986612, 7692581, 7403544, 7121946, 6849878, 6589484]
61287F589484k47008k32883k18500k03196j86178j67897j49822j32915j16949
61278D934136j01515q6919p3612o1180m8582l5346k2088r791J211J1356K1124
61267D528794L0221L7634M2753M6326M9861N3938N7630N9834O0549O0265N8728
61256E086533N5246N0078M4597L9855L5661L1267K6389K1207J5866J0371M676
61245E421746j386q034j5129k2043k8152l3411l8237m2938m7318n0887n3521n5814
61233E024876n8458o1176o2806o2858o2349o2334o2157o0210n6257n1710m7573
61222D376988m3544l9607l6992l6392l6322l4793l2102l0434l0741l1449l0700
61211C993912k8745k7326k7362k8042k7916k6194k2926j8529j3499q384l543J321
$$ y = [6589484, 6342476, 6109593, 5891093, 5687897, 5501719, 5333822, 5184000, 5051085, 4934136, 4832621, 4745702, 4672090, 4610910, 4562328, 4526982, 4504894, 4495103, 4496314, 4507670, 4528794, 4559015, 4596649, 4639402, 4685728, 4735589, 4789527, 4847157, 4906991, 4967540, 5027805, 5086533, 5141779, 5191857, 5236454, 5276309, 5311970, 5343237, 5369626, 5390833, 5406699, 5417070, 5421746, 5420360, 5412326, 5397197, 5375154, 5347002, 5313591, 5275354, 5232416, 5185098, 5134211, 5080690, 5024876, 4966418, 4905242, 4842436, 4779578, 4717229, 4654895, 4592738, 4532528, 4476271, 4424561, 4376988, 4333444, 4293837, 4256845, 4220453, 4184131, 4149338, 4117236, 4086802, 4056061, 4024612, 3993912, 3965167, 3937841, 3910479, 3882437, 3854521, 3828327, 3805401, 3786872, 3773373, 3764989, 3761446, 3762767]
61199C762767P129J4475K2687L0258L6576M2975N1607O3211P6258Q8336R8145
61188D294424J06076J13093J19372J24026J25837J23871J17550J06559R0951P0908
61178E392667M6262J6838j6181m9702q0423j06889j29309j47639j60994j69033
61168D595597j72684j72964j69968j63771j55563j46950j38477j29591j19979
61159C225650j10284j01484r3933q7096q0155p2918o6012n9890n3819m6639l8540
61148B414880l1191k5749k1629j7709j3834j0283o543j807L601Q330J1575J3709
61136B323350J5333J6324J6058J4111J0690O561K576q78l947o790r407j1881j4313
61123B357787j6396j7795j9106k1516k5081k8154k9224k8549k7401k6478k5855
$$ y = [3762767, 3769896, 3784371, 3807058, 3837316, 3873892, 3916867, 3968474, 4031685, 4107943, 4196279, 4294424, 4400500, 4513593, 4632965, 4756991, 4882828, 5006699, 5124249, 5230808, 5321759, 5392667, 5438929, 5455767, 5439586, 5389884, 5309461, 5202572, 5073263, 4925624, 4764630, 4595597, 4422913, 4249949, 4079981, 3916210, 3760647, 3613697, 3475220, 3345629, 3225650, 3115366, 3013882, 2919949, 2832853, 2752698, 2679780, 2613768, 2553878, 2500059, 2453420, 2414880, 2383689, 2357940, 2336311, 2318602, 2304768, 2294485, 2287942, 2286135, 2289736, 2298066, 2309641, 2323350, 2338683, 2355007, 2371065, 2385176, 2395866, 2402427, 2405003, 2404125, 2400178, 2393388, 2383981, 2372100, 2357787, 2341391, 2323596, 2304490, 2282974, 2257893, 2229739, 2200515, 2171966, 2144565, 2118087, 2092232]
61112B092232k5673k5902k5963k5504k5046k5168k5639k6210k7356k9283l1060
61101A799428l1923l2592l3935l5147l4815l3187l1577l0022k7553k4613k3165
61090A460899k4075k6030k7508k8254k8575k8608k8732k9331k9776k8885k6618
61079A154507k4074k1822j9691j8030j7300j6398j3623r736p602p935p846n014
61067I85436r94J445K305L480N383O882P759Q994J0828J2368J2983J2790J2129
61054A081788J1691J2578J4834J6423J5248J1990R406Q979R577R399P980O026
61042A215919M306K930J198j694n342p965q358p434o930p113o966o151n525n797
61028A155078o757p794q297p778o469n490n495n507m147j779j36nm11j91O01J085
$$ y = [2092232, 2066559, 2040657, 2014694, 1989190, 1964144, 1938976, 1913337, 1887127, 1859771, 1830488, 1799428, 1767505, 1734913, 1700978, 1665831, 1631016, 1597829, 1566252, 1536230, 1508677, 1484064, 1460899, 1436824, 1410794, 1383286, 1355032, 1326457, 1297849, 1269117, 1239786, 1210010, 1181125, 1154507, 1130433, 1108611, 1088920, 1070890, 1053590, 1037192, 1023569, 1013833, 1006231, 998296, 990450, 985436, 984442, 985887, 988192, 991672, 997055, 1003937, 1011696, 1020690, 1031518, 1043886, 1056869, 1069659, 1081788, 1093479, 1106057, 1120891, 1137314, 1152562, 1164552, 1173958, 1182937, 1192514, 1201913, 1209893, 1215919, 1220225, 1223155, 1224353, 1222659, 1217317, 1209352, 1200994, 1193560, 1186630, 1179517, 1172551, 1166400, 1160875, 1155078, 1148321, 1140527, 1132230, 1124452, 1117983, 1112493, 1106998, 1101491, 1097344, 1095565, 1095429, 1095424, 1095013, 1094822, 1095423, 1096508]
61012A096508O53l99r53m1J878L279L680M351O086P514P123N792N492O202O277
60997A153442N382M786M820M403L391L234M627O425P645Q858J0744J2815J4348
60984A244920J5418J6242J6797J7527J9111K1155K2640K4030K7007L1485L5035
60973A491367L6487L7938M1595M6484N0457N3925N9015O5784P1828P5678P8535
60962B109093Q2261Q7316R3254J00003J07889J16947J26646J36094J44592J52282
60952C256377J60078J68719J78316J89025K01546K16462K33744K53319K75328
60943E132914K99394L24736L51973L84181M25282M78028N44035O24684P21024
60934I286251Q33593R62759J107937J266231J434638J615158J814093K031640
$$ y = [1096508, 1097161, 1096762, 1095809, 1095768, 1097646, 1100925, 1104605, 1108956, 1115042, 1122556, 1129679, 1135471, 1140963, 1147165, 1153442, 1158824, 1163610, 1168430, 1172833, 1176224, 1179458, 1184085, 1190510, 1198155, 1207013, 1217757, 1230572, 1244920, 1260338, 1276580, 1293377, 1310904, 1330015, 1351170, 1373810, 1397840, 1424847, 1456332, 1491367, 1527854, 1565792, 1607387, 1653871, 1704328, 1758253, 1817268, 1883052, 1954880, 2030558, 2109093, 2191354, 2278670, 2371924, 2471927, 2579816, 2696763, 2823409, 2959503, 3104095, 3256377, 3416455, 3585174, 3763490, 3952515, 4154061, 4370523, 4604267, 4857586, 5132914, 5432308, 5757044, 6109017, 6493198, 6918480, 7396508, 7940543, 8565227, 9286251, 10119844, 11082603, 12190540, 13456771, 14891409, 16506567, 18320660, 20352300]
60926B0352300K251952K443688K564800K562340K379467J989511J441783Q66575
60918C6852416M12189J60095R3455J35444K00253K05991O8651k73273q06129j421216
60908C5627876j966473k331227k491310k488805k384176k226514k049408j873869
60900A7816094j708475j551787j399669j251220j108726r75042q52691p44143
60892H224341o51121n73386n08619m53568m05493l62966l25512k92573k63288
60883D387815k37330k15004j95880j78287j61297j46451j36058j29920j25092
60874B862496j18907j11068j02803r5382q9710q6026q3200p9316p3540o6878o0804
60863A894862n5940n2355n0073m8608m6853m4274m1726m0444m0611m1367m1705
$$ y = [20352300, 22604252, 25047940, 27612740, 30175080, 32554547, 34544058, 35985841, 36852416, 37264605, 37424700, 37518155, 37653599, 37853852, 38059843, 38128494, 37855221, 37049092, 35627876, 33661403, 31330176, 28838866, 26350061, 23965885, 21739371, 19689963, 17816094, 16107619, 14555832, 13156163, 11904943, 10796217, 9821175, 8968484, 8224341, 7573220, 6999834, 6491215, 6037647, 5632154, 5269188, 4943676, 4651103, 4387815, 4150485, 3935481, 3739601, 3561314, 3400017, 3253566, 3117508, 2987588, 2862496, 2743589, 2632521, 2529718, 2434336, 2344626, 2258600, 2175400, 2096084, 2022544, 1955666, 1894862, 1838922, 1786567, 1736494, 1687886, 1641033, 1596759, 1555033, 1514589, 1473978, 1432611, 1390906]
60852A390906m0962l8973l6374l4267l3112l2242l0909k9241k7652k5925k3625
60841A037624k0958j8517j6517j4984j4313j4621j4805j3434j0804q972r096r667
60829H70936q235m470n23J539J710J337J359J812K483L165L499L276K998L359
60815H84245M125M283L576L054L491M041L362J585J08m44r09k117l673m645m799
60800H95283m649m616m560m010k649p42J018K328L746N857Q092R101Q399O957
60786I19555O060O234P511R783J2322J3678J3022J1169R618Q764P854O617N901
60773A038088O361P187O914N304L754L577M424M926M597M321M854N674N873N526
60759A111380N377N514N253M212K617N57k062m573n530m312k171j057j747l517
$$ y = [1390906, 1349944, 1310971, 1274597, 1240330, 1207218, 1174976, 1144067, 1114826, 1087174, 1061249, 1037624, 1016666, 998149, 981632, 966648, 952335, 937714, 922909, 909475, 898671, 889699, 880603, 870936, 862701, 858231, 857708, 859247, 860957, 862294, 863653, 865465, 867948, 871113, 874612, 877888, 880886, 884245, 888370, 892653, 896229, 899283, 902774, 906815, 910177, 911762, 911870, 911426, 910517, 908400, 904727, 900082, 895283, 890634, 886018, 881458, 877448, 874799, 874057, 875075, 877403, 881149, 887006, 895098, 904199, 912598, 919555, 925615, 931849, 939360, 949143, 961465, 975143, 988165, 999334, 1008952, 1017716, 1025570, 1032187, 1038088, 1044449, 1051636, 1058550, 1063854, 1067608, 1071185, 1075609, 1080535, 1085132, 1089453, 1094307, 1099981, 1105854, 1111380, 1116757, 1122271, 1127524, 1131736, 1134353, 1134910, 1132848, 1128275, 1122745, 1118433, 1116262, 1115205, 1113458, 1109941]
60745A109941n381o963q243r044r137q828r067j0512j2405j3045j1820j0163r703
60732I85630r963r050o469l943l036l200k809j217Q83K541L283L358L757N431
60718I65196Q034J0045J0657J0795J1582J2680J3081J2986J3623J5351J7094J7843
60706A118967J7947J8482J9820K1101K1071J9396J7041J5170J3849J2390J0835
60695A306069J0082J0199R741P558M588K818K971L981M384L374J070j371k351
60682A363113j620j141l036o857j0021j0875j0197r563r526r832j0357j1089j1727
60669A257272j1861j1365j0441r552r184r238q915p866p112p733q791p866m163
60656A143185K08K738L360L830N053O261O546O030N257M362L293K377K097K473
$$ y = [1109941, 1104560, 1097597, 1089354, 1080310, 1071173, 1062345, 1053278, 1042766, 1030361, 1017316, 1005496, 995333, 985630, 975667, 966617, 960148, 956205, 953169, 949969, 947160, 945943, 946826, 949367, 952650, 956008, 959765, 965196, 973230, 983275, 993932, 1004727, 1016309, 1028989, 1042070, 1055056, 1068679, 1084030, 1101124, 1118967, 1136914, 1155396, 1175216, 1196317, 1217388, 1236784, 1253825, 1268995, 1282844, 1295234, 1306069, 1316151, 1326350, 1336091, 1343649, 1348237, 1351055, 1354026, 1358007, 1362391, 1365765, 1366835, 1365464, 1363113, 1361493, 1360352, 1357316, 1350459, 1340438, 1329563, 1319366, 1309803, 1300277, 1290445, 1280088, 1268999, 1257272, 1245411, 1234046, 1223605, 1214053, 1204869, 1195631, 1186716, 1178850, 1171738, 1164005, 1155214, 1147348, 1143185, 1143393, 1146131, 1149491, 1153321, 1158374, 1164635, 1171181, 1177211, 1182468, 1186830, 1190123, 1192500, 1194597, 1197070]
60642A197070L039L405L445K872J148j671m272n033l820k212j690k216k981l814
60628A183270n120o875q545r815j0789j1569j2197j2751j3043j2649j1829j1773
60616A056315j3040j4282j3732j1685j0228j0510j1533j1717j0506q216n588l733
60604I31545l440m074m122l087j698k69J668L686M195K878J779K743M900O157
60590I42861O118N979O355O915P714R067J0186R585P182M688L603L834M490N049
60576A033626N262M892M108L600L860M765O022P511Q961R800R729R164Q884R437
60562A129621J0902J2918J4934J6724J8551K0505K1938K2096K1198K0260J9775
60551A329422J9168J7683J5271J2377R378O378L216m59m690q701j1396j2607j3392
$$ y = [1197070, 1200109, 1203514, 1206959, 1209831, 1210979, 1209308, 1205036, 1200003, 1196183, 1193971, 1192281, 1190065, 1187084, 1183270, 1178150, 1171275, 1162730, 1152915, 1142126, 1130557, 1118360, 1105609, 1092566, 1079917, 1068088, 1056315, 1043275, 1028993, 1015261, 1003576, 993348, 982838, 971305, 959588, 949082, 940866, 935278, 931545, 928105, 924031, 919909, 916822, 915124, 914855, 916523, 920209, 924404, 927282, 929061, 931804, 936704, 942861, 948979, 954958, 961313, 968228, 975942, 985009, 995195, 1004780, 1011962, 1016650, 1020253, 1024087, 1028577, 1033626, 1038888, 1043780, 1047888, 1051488, 1055348, 1060113, 1066135, 1073646, 1082607, 1092407, 1102136, 1111300, 1120184, 1129621, 1140523, 1153441, 1168375, 1185099, 1203650, 1224155, 1246093, 1268189, 1289387, 1309647, 1329422, 1348590, 1366273, 1381544, 1393921, 1403299, 1409677, 1412893, 1412434, 1407744, 1399043, 1387647, 1375040, 1361648]
60538A361648j4819j6771j8243j8431j7419j5995j5069j4878j4662j3508j1652
60527A190201j0311r966r488p697n173l518l031k319n39J172J367N70O78K203
60513A144149L427K753Q99q5N85J794K399K635L403M819O051O394O104O187P542
60498A199056J0092J2730J4297J4683J4765J5198J5634J5400J4653J4569J6258
60487A357335J9591K3112K5333K6216K7194K9508L2776L5632L7316L7997L7851
60476A689861L6711L4595L1506K6629J8958R193j84p449j3291j9033k4191k7054
60464A756251k7081k5324k2799j9663j6045j2442q965n055m20M262P859R772J0513
60451A650863J1539J4169J8156K1791K4040K6194L0487L7398M5391N3071O0498
$$ y = [1361648, 1346829, 1330058, 1311815, 1293384, 1275965, 1259970, 1244901, 1230023, 1215361, 1201853, 1190201, 1179890, 1169924, 1160436, 1152739, 1147566, 1144048, 1141017, 1138698, 1138159, 1139331, 1140698, 1141268, 1141946, 1144149, 1147576, 1150329, 1151228, 1151143, 1151728, 1153522, 1155921, 1158556, 1161959, 1166778, 1172829, 1179223, 1185327, 1191514, 1199056, 1209148, 1221878, 1236175, 1250858, 1265623, 1280821, 1296455, 1311855, 1326508, 1341077, 1357335, 1376926, 1400038, 1425371, 1451587, 1478781, 1508289, 1541065, 1576697, 1614013, 1652010, 1689861, 1726572, 1761167, 1792673, 1819302, 1838260, 1847453, 1847269, 1839820, 1826529, 1807496, 1783305, 1756251, 1729170, 1703846, 1681047, 1661384, 1645339, 1632897, 1623932, 1618877, 1618457, 1622719, 1630578, 1640350, 1650863, 1662402, 1676571, 1694727, 1716518, 1740558, 1766752, 1797239, 1834637, 1880028, 1933099, 1993597]
60440A993597O8284P6632Q5567R5100J04721J13587J21721J30189J39832J50547
60430C079777J62310J75925J92149K10671K30717K51919K73706K94189L10382
60421E181745L19349L18346L04002K72452K21272J51725O9331j7901j02351j78572
60411F539398k42974k92738l26104l43647l48303l43507l31581l14085k92921
60402C703538k70343k47966k26322k05354j85133j66083j48640j32765j18072
60393B002860j04589r3070q3932p6220o8508o0718n4186m9695m6358m2778l8502
60382A284304l3963k9818k6805k5316k4522k2691j9176j5386j3094j2457j2440
60371A048636j2348j1931j0762q820p381p901j0083j2022j2275j0835q285n305
$$ y = [1993597, 2061881, 2138513, 2224080, 2319180, 2423901, 2537488, 2659209, 2789398, 2929230, 3079777, 3242087, 3418012, 3610161, 3820832, 4051549, 4303468, 4577174, 4871363, 5181745, 5501094, 5819440, 6123442, 6395894, 6617166, 6768891, 6838222, 6820321, 6717970, 6539398, 6296424, 6003686, 5677582, 5333935, 4985632, 4642125, 4310544, 3996459, 3703538, 3433195, 3185229, 2958907, 2753553, 2568420, 2402337, 2253697, 2120932, 2002860, 1898271, 1805201, 1721269, 1645049, 1576541, 1515823, 1461637, 1411942, 1365584, 1322806, 1284304, 1250341, 1220523, 1193718, 1168402, 1143880, 1121189, 1102013, 1086627, 1073533, 1061076, 1048636, 1036288, 1024357, 1013595, 1004775, 997394, 989493, 979410, 967388, 955113, 944278, 935993, 930688]
60359I30688l066k710l906m896m526l361k382j557m08P91J340J195R24Q17P99
60344I09742R92J687K786L835M603N189N659O025O541P438Q278Q219P135N958
60330I84087N476N361M911M423M845O151O973O341M972M074L506K134k36k414
60316A040604l479l774l812l264j888o13o26j684k405k056j102j25Q05J484J446
60301A019511Q43O23J252K040K347K726M044N987P512Q473R699J1290J2134J1524
60287A100005J0363R931J0122R865Q923Q122P787P133N620M012L346L456L459
60274A192144L228L374L881L827K805J785J927K986L505K413k2k819n383p720
60260A205931r701j0536r459o985m846m215m414m078l160k799l264l364k249p80
$$ y = [930688, 927622, 924912, 921006, 916110, 911584, 908223, 905841, 904284, 903876, 904667, 906007, 907202, 908126, 908943, 909742, 910734, 912421, 915207, 919042, 923645, 928834, 934493, 940518, 947059, 954497, 962775, 970994, 978129, 984087, 989563, 994924, 999835, 1004258, 1009103, 1015254, 1022227, 1028568, 1033540, 1037614, 1041120, 1043254, 1043018, 1040604, 1037125, 1033351, 1029539, 1026275, 1024387, 1023774, 1023148, 1021464, 1019059, 1017003, 1015901, 1015776, 1016581, 1018065, 1019511, 1020354, 1020977, 1022229, 1024269, 1026616, 1029342, 1033386, 1039373, 1046885, 1055358, 1065057, 1076347, 1088481, 1100005, 1110368, 1120299, 1130421, 1140286, 1149209, 1157331, 1165118, 1172251, 1177871, 1181883, 1185229, 1188685, 1192144, 1195372, 1198746, 1202627, 1206454, 1209259, 1211044, 1212971, 1215957, 1219462, 1221875, 1221853, 1219034, 1213651, 1205931, 1196230, 1185694, 1176235, 1169250, 1164404, 1160189, 1155775, 1151697, 1148537, 1145738, 1142474, 1139110, 1136861, 1136081]
60246A136081l07q69j437j407j007n75k08j6j14l66m60j60O18J528J542k90l344
60229A129209n471n224l324j244P28K898M556M616L627L542N205P425Q861R574
60215A164978J0191J0780J1260J2143J3985J6523J8872K0242K0238J9016J7468
60204A335696J6706J6970J7508J7679J7652J7786J8108J8830K0549K3389K6461
60193A547334K8872L0757L2864L5582L8943M3060M7884N2826N7282O1385O5664
60182B042453P0343P5507Q1726Q9639R8886J08120J16295J23584J30789J38242
60172C075584J45526J52054J57596J61982J64454J63764J59253J51663J42461
60163D474337J32384J21097J08108R3404P7143N9500M1136K3243O784p841k0116
$$ y = [1136081, 1135774, 1134905, 1133468, 1132061, 1131054, 1130479, 1130271, 1130255, 1130141, 1129775, 1129315, 1129155, 1129773, 1131301, 1132843, 1132553, 1129209, 1123738, 1118514, 1115190, 1113946, 1114674, 1117572, 1122128, 1126744, 1130371, 1133913, 1139118, 1146543, 1155404, 1164978, 1175169, 1185949, 1197209, 1209352, 1223337, 1239860, 1258732, 1278974, 1299212, 1318228, 1335696, 1352402, 1369372, 1386880, 1404559, 1422211, 1439997, 1458105, 1476935, 1497484, 1520873, 1547334, 1576206, 1606963, 1639827, 1675409, 1714352, 1757412, 1805296, 1858122, 1915404, 1976789, 2042453, 2112796, 2188303, 2270029, 2359668, 2458554, 2566674, 2682969, 2806553, 2937342, 3075584, 3221110, 3373164, 3530760, 3692742, 3857196, 4020960, 4180213, 4331876, 4474337, 4606721, 4727818, 4835926, 4929330, 5006473, 5065973, 5107109, 5130352, 5137136, 5129295, 5109179]
60152E109179k9176l4708l7528l8691l8382l6077l1316k3886j3802j756J0960
60141D834817K3549L6532N0879O6686Q3072R8906J13160J25151J35059J43696
60131E711507J50914J54786J53351J46813J37094J25525J11892R5627P6859N6294
60121F920662L4866J3514p386k8215m9038o8666q5529r8985j08651j13181j11485
60110F297906j05023r6904q8331p7682o3735m7875l1996j5920J439J9493L6329
60099E827701N1075O4308P6277Q6108R2739R5703R5082R1480Q5890P8767O9584
60088F714714N8174M6085L5450K6788J9232J2847R269R694J3626K0163K9339M1473
60076G036854N6180P2959R1991J13329J35861J58228J80550K04178K29767K56528
$$ y = [5109179, 5080003, 5045295, 5007767, 4969076, 4930694, 4894617, 4863301, 4839415, 4825613, 4823857, 4834817, 4858366, 4894898, 4945777, 5012463, 5095535, 5194441, 5307601, 5432752, 5567811, 5711507, 5862421, 6017207, 6170558, 6317371, 6454465, 6579990, 6691882, 6787509, 6864368, 6920662, 6955528, 6969042, 6961656, 6933441, 6884403, 6815737, 6730208, 6631223, 6522572, 6409391, 6297906, 6192883, 6095979, 6007648, 5929966, 5866231, 5818356, 5786360, 5770440, 5771879, 5791372, 5827701, 5878776, 5943084, 6019361, 6105469, 6198208, 6293911, 6388993, 6480473, 6566363, 6645130, 6714714, 6772888, 6818973, 6854423, 6881211, 6900443, 6913290, 6922559, 6932253, 6945879, 6966042, 6995381, 7036854, 7093034, 7165993, 7257984, 7371313, 7507174, 7665402, 7845952, 8050130, 8279897, 8536425]
60066H536425K83631L11311L39952L68753L96105M21013M43269M62277M76519
60057A2039255M84607M86057M80374M65949M41106M06303L64239L17160K64810
60048A5749860K05784J40456P1632K448o5541j31983j96022k55371l06932l48344
60038A4865987l78998l99610m10709m12069m03857l87699l65775l39092l07463
60029A1460715k71133k31582j90760j50431j12236p7356m5709j6470J0079L2190
60019A0407307M8582N9736O6460O8235O4113N4518M0861K3960M274j6724l7263
60008A0784059n7421p8795j01440j22877j41115j57148j72989j88319k00905k09710
59998I353340k15530k18611k17670k12075k03245j92643j79646j63011j43716
$$ y = [8536425, 8820056, 9131367, 9471319, 9840072, 10236177, 10657190, 11100459, 11562736, 12039255, 12523862, 13009919, 13490293, 13956242, 14397348, 14803651, 15167890, 15485050, 15749860, 15955644, 16096100, 16167732, 16170180, 16104639, 15972656, 15776634, 15521263, 15214331, 14865987, 14486989, 14087379, 13676670, 13264601, 12860744, 12473045, 12107270, 11768178, 11460715, 11189582, 10958000, 10767240, 10616809, 10504573, 10427217, 10381508, 10365038, 10375117, 10407307, 10455889, 10515625, 10582085, 10650320, 10714433, 10768951, 10809812, 10833772, 10838046, 10821322, 10784059, 10726638, 10647843, 10546403, 10423526, 10282411, 10125263, 9952274, 9763955, 9563050, 9353340, 9137810, 8919199, 8701529, 8489454, 8286209, 8093566, 7913920, 7750909, 7607193]
59989G607193j24401j06007q6804o5297m2499k0266J307K3356M5742O6856Q5933
59978G385113J03973J21669J37524J48896J54350J54274J49622J40783J27583
59969H623787J09843Q7864O2555L5035O174k3260n2125p9302j04607j28395j49822
59958H387747j66536j76805j81210j81231j77137j68580j56619j43170j28428
59949F908031j10689q9363o6572m4692k3461p85K4250N0355P5686R9517J22404
59938F944681J45351J68658J90977K09800K23376K31915K36196K35512K27983
59929H814449K12865J91533J65877J36573J03508O7322K9866o806m1498p3841
59919I599848j03471j29504j50911j67177j78165j83325j81670j72992j58738
$$ y = [7607193, 7482792, 7376785, 7289981, 7224684, 7182185, 7161919, 7163226, 7186582, 7232324, 7299180, 7385113, 7489086, 7610755, 7748279, 7897175, 8051525, 8205799, 8355421, 8496204, 8623787, 8733630, 8821494, 8884049, 8919084, 8925258, 8901998, 8849873, 8770571, 8665964, 8537569, 8387747, 8221211, 8044406, 7863196, 7681965, 7504828, 7336248, 7179629, 7036459, 6908031, 6797342, 6707979, 6641407, 6596715, 6573254, 6572469, 6596719, 6647074, 6722760, 6822277, 6944681, 7090032, 7258690, 7449667, 7659467, 7882843, 8114758, 8350954, 8586466, 8814449, 9027314, 9218847, 9384724, 9521297, 9624805, 9692127, 9721993, 9715187, 9673689, 9599848, 9496377, 9366873, 9215962, 9048785, 8870620, 8687295, 8505625, 8332633, 8173895]
59910H173895j41102j21432r9951p6831n2805k8658m674J9146M2598O5052Q5510
59899G860748J03006J17430J29796J41116J50831J57120J59014J57633J54766
59890I131460J50746J44505J35557J24950J13986J02858R1381Q0719P3254P0355
59880A0219771P1110P3984P9248Q8865J04191J24831J49797J78651K10916K45331
59870A1546695K80553L15998L51167L84633M14395M38798M56153M63950M59545
59861A5111887M41561M09717L63653L03235K30133J47930O0331k9637j18445k01435
59851A6718930k74409l35285l83628m19264m42040m52426m51679m41557m24070
59842A3094572m00811l72228l38240k99938k59783k19550j79085j37941r7192
$$ y = [8173895, 8032793, 7911361, 7811410, 7734579, 7681774, 7653116, 7648442, 7667588, 7710186, 7775238, 7860748, 7963754, 8081184, 8210980, 8352096, 8502927, 8660047, 8819061, 8976694, 9131460, 9282206, 9426711, 9562268, 9687218, 9801204, 9904062, 9995443, 10076162, 10149416, 10219771, 10290881, 10364865, 10444113, 10532978, 10637169, 10762000, 10911797, 11090448, 11301364, 11546695, 11827248, 12143246, 12494413, 12879046, 13293441, 13732239, 14188392, 14652342, 15111887, 15553448, 15963165, 16326818, 16630053, 16860186, 17008116, 17068447, 17038810, 16920365, 16718930, 16444521, 16109236, 15725608, 15306344, 14864304, 14411878, 13960199, 13518642, 13094572, 12693761, 12321533, 11983293, 11683355, 11423572, 11204022, 11024937, 10886996, 10789804]
59833A0789804n8285k0925J6147N2362Q4909J11384J31582J46182J54881J56536
59823A1564577J50310J35811J12564Q0184L9160q768o0815j13693j64455k11258
59813A1523617k53219k89542l19215l41644l57007l65658l67641l63247l53687
59804H512757l40692l25470l08259k88771k66944k43492k19897j97508j76464
59795F145260j55899j35542j16586j00365q6652p4108o2445n3132m7503m4777
59785E268251m2600l9404l5692l2918l1518l0477k8807k7037k6800k8935l2544
59774D911519l6227l9843m4424n0471n7069o2765o6668o8392o7705o4984o1616
59763D291355n9029n7267n5023n1215m5915l9744l3086k6186j9469j3105o612
$$ y = [10789804, 10731519, 10710594, 10726741, 10779103, 10864012, 10975396, 11106978, 11253160, 11408041, 11564577, 11714887, 11850698, 11963262, 12043446, 12082606, 12073838, 12013023, 11899330, 11734875, 11523617, 11270398, 10980856, 10661641, 10319997, 9962990, 9597332, 9229691, 8866444, 8512757, 8172065, 7846595, 7538336, 7249565, 6982621, 6739129, 6519232, 6321724, 6145260, 5989361, 5853819, 5737233, 5636868, 5550216, 5476108, 5413663, 5360531, 5313028, 5268251, 5225651, 5186247, 5150555, 5117637, 5086119, 5055642, 5026835, 4999798, 4972998, 4944063, 4911519, 4875292, 4835449, 4791025, 4740554, 4683485, 4620720, 4554052, 4485660, 4417955, 4352971, 4291355, 4232326, 4175059, 4120036, 4068821, 4022906, 3983162, 3950076, 3923890, 3904421, 3891316, 3884704]
59752C884704O00Q516J6710K5038L3606M2148N0103N7286O4034P0488P6231Q0804
59740D410268Q4182Q6448Q7369Q6618Q4225Q0456P5456O9320O2446N5475M9005
59729E231268M3694M0473M0163M2643M6876N2192N9282O9404Q2650R7561J12757
59718E918963J28513J46322J67249J91232K17813K46735K77484L08942L40066
59709G943319L70620M00552M28516M51269M64443M63540M44326M03132L38045
59700A1707762K50816J48115M0561o0585j47076k15036k63609k93128l04835l01517
59690A0561468k87225k65913k40389k12257j82314j51027j19085q7554n7213k7816
59680H930675J630L1756O2257R2266J20985J48162J74525K01596K30486K60834
$$ y = [3884704, 3885304, 3893820, 3910530, 3935568, 3969174, 4011322, 4061425, 4118711, 4182745, 4253233, 4329464, 4410268, 4494450, 4580898, 4668267, 4754885, 4839110, 4919566, 4995022, 5064342, 5126788, 5182263, 5231268, 5274962, 5315435, 5355598, 5398241, 5445117, 5497309, 5556591, 5625995, 5708645, 5806206, 5918963, 6047476, 6193798, 6361047, 6552279, 6770092, 7016827, 7294311, 7603253, 7943319, 8313939, 8714491, 9143007, 9594276, 10058719, 10522259, 10966585, 11369717, 11707762, 11958578, 12106693, 12147254, 12086669, 11939593, 11724557, 11460948, 11167820, 10862985, 10561468, 10274243, 10008330, 9767941, 9555684, 9373370, 9222343, 9103258, 9015704, 8958491, 8930675, 8932305, 8964061, 9026318, 9118584, 9239569, 9387731, 9562256, 9763852, 9994338, 10255172]
59670A0255172K91405L21882L53567L88140M26164M66913N09278N52676N97396
59661A4162593O44153O93070P43173P93087Q42004Q89506R34594R75454J009900
59652B1687534J035414J049189J049394J036750J013962R83589R47335R07664
59644B9710831Q68489Q33336Q03353P77806P55614P35447P14797O90172O58381
59635C6548226O17369N66184N04767M33859L54926K70387J83767R8999J9367n2351
59625C9545500j12846j58621j87841k00897j98591j80829j47837j01481m4185
59616C8212372K2821R9091J83558K74509L70246M68568N66163O59788P47280Q26046
59606D2430442Q91109R36477R58060R53288R17901Q45578P31964N77896L88125
$$ y = [10255172, 10546577, 10868459, 11222026, 11610166, 12036330, 12503243, 13012521, 13565197, 14162593, 14806746, 15499816, 16242989, 17036076, 17878080, 18767586, 19702180, 20677634, 21687534, 22722948, 23772137, 24821531, 25858281, 26872243, 27855832, 28803167, 29710831, 30579320, 31412656, 32216009, 32993815, 33749429, 34484876, 35199673, 35889845, 36548226, 37165595, 37731779, 38236546, 38670405, 39025331, 39295718, 39479485, 39578484, 39597851, 39545500, 39432654, 39274033, 39086192, 38885295, 38686704, 38505875, 38358038, 38256557, 38212372, 38235193, 38334284, 38517842, 38792351, 39162597, 39631165, 40197328, 40857116, 41604396, 42430442, 43321551, 44258028, 45216088, 46169376, 47087277, 47932855, 48664819, 49242715, 49630840]
59597D9630840J68861p1789l22052n67441p94370r92887j156848j283054j370887
59588D3240373j422130j440346j430012j396096j344148j280368j211200j142969
59580C2573104j082192j035846j009906j006601j022942j051951j084815j112356
59572B4166495j126835j124455j105991j074023j030230r76389r16618q56054
59564A5955900p97215p39461o82297o27224n75796n27781m82415m40029m01202
59555A0682480l65288l31124k98759k69438k44031k22108k02395j83849j66561
59546H398927j51804j40805j33491j28968j26840j27065j28663j30043j30868
59537G200380j32270j34724j37027j37920j37342j35248j30650j23076j13980
$$ y = [49630840, 49799701, 49727912, 49405860, 48838419, 48044049, 47051162, 45894314, 44611260, 43240373, 41818243, 40377897, 38947885, 37551789, 36207641, 34927273, 33716073, 32573104, 31490912, 30455066, 29445160, 28438559, 27415617, 26363666, 25278851, 24166495, 23039660, 21915205, 20809214, 19735191, 18704961, 17728572, 16811954, 15955900, 15158685, 14419224, 13736927, 13109703, 12533907, 12006126, 11523711, 11083682, 10682480, 10317192, 9986068, 9687309, 9417871, 9173840, 8951732, 8749337, 8565488, 8398927, 8247123, 8106318, 7972827, 7843859, 7717019, 7589954, 7461291, 7331248, 7200380, 7068110, 6933386, 6796359, 6658439, 6521097, 6385849, 6255199, 6132123, 6018143]
59528F018143j05359r7533q9361q0098p0021n9678m9436l9525k9955k0733j2388
59517E364056n508N54P364J5280K2856K9082L4790M0830M6395N0712N5017O0892
59505E722320O7673P3437P7964Q2651Q8057R3657R9786J07662J17443J28223J39990
59494F798863J53515J68167J82081J95147K09559K26454K43994K60042K74991
59485H712813K90425L06306L21081L33570L43167L48965L50227L47290L40719
59476A1694563L29794L12906K89192K59093K24010J86545J50227J17340Q7040
59467A3650710N7054K7227pk2845m2140n9400p4034q3642q6386q2011p1032n4054
59455A3159440l1891n372K5165N9556R6681J34143J69406K00807K27109K46488
$$ y = [6018143, 5912784, 5815251, 5725890, 5645792, 5575771, 5516093, 5466657, 5427132, 5397177, 5376444, 5364056, 5358548, 5359102, 5366466, 5381746, 5404602, 5433684, 5468474, 5509304, 5555699, 5606411, 5661428, 5722320, 5789993, 5863430, 5941394, 6024045, 6112102, 6205759, 6305545, 6413207, 6530650, 6658873, 6798863, 6952378, 7120545, 7302626, 7497773, 7707332, 7933786, 8177780, 8437822, 8712813, 9003238, 9309544, 9630625, 9964195, 10307362, 10656327, 11006554, 11353844, 11694563, 12024357, 12337263, 12626455, 12885548, 13109558, 13296103, 13446330, 13563670, 13650710, 13707764, 13734991, 13734984, 13712139, 13669999, 13610599, 13536565, 13452923, 13366537, 13284526, 13213494, 13159440, 13127549, 13122177, 13147342, 13206898, 13303579, 13437722, 13607128, 13807935, 14035044, 14281532]
59445A4281532K56380K54227K38176K07534J63270J07909M4317k5415r9329j74025
59435A5254576k44765l07576l60741m03898m36454m57430m66357m63654m50647
59426A1663054m29804m04350l76675l47180l15328k81486k46893k12134j76899
59417H872305j41465j07395p6098m7184j8803J0548M0644O9887R6935J22002J46230
59406H967606J69709J90772K07744K20550K29640K33992K31544K21388K04050
59397A0876995J79633J47384J07611O2565J4581l5515q7193j38446j86331k28711
59387A0712573k64638k93652l15692l31296l41022l45042l43895l38999l31549
59378G806788l21423l08152k92418k75525k57950k39647k21408k04378j88285
$$ y = [14281532, 14537912, 14792139, 15030315, 15237849, 15401119, 15509028, 15553345, 15527930, 15428601, 15254576, 15009811, 14702235, 14341494, 13937596, 13501142, 13043712, 12577355, 12113701, 11663054, 11233250, 10828900, 10452225, 10105045, 9789717, 9508231, 9261338, 9049204, 8872305, 8730840, 8623445, 8547347, 8500163, 8481360, 8491908, 8532552, 8602439, 8699374, 8821376, 8967606, 9137315, 9328087, 9535831, 9756381, 9986021, 10220013, 10451557, 10672945, 10876995, 11056628, 11204012, 11311623, 11374188, 11388769, 11353254, 11266061, 11127615, 10941284, 10712573, 10447935, 10154283, 9838591, 9507295, 9166273, 8821231, 8477336, 8138337, 7806788, 7485365, 7177213, 6884795, 6609270, 6351320, 6111673, 5890265, 5685887, 5497602]
59369E497602j71821j55161j40392j28605j17945j05834r2174p8851o6758n4998
59359D385063m3117l2399k4034j7185r926j699O359J3259J9141K3954K6308K4689
59347D370413J9562J3438Q937P388R005J3284J9067K5319L2356M1249N1221N8727
59335D669966O0571N7716N4803N5958O2054P1722Q3350R5571J07342J18773J31302
59324E569128J46124J62928J80781J99524K19461K40378K62002K85117L10987
59315G576430L39719L70427M03030M38639M77729N19011N60762O02291O43325
59306A1931363O82799P19240P51686P79076P99042Q08528Q05782P91036P65470
59297A8834022P30562O88518O42025N92880N41462M88031M33743L79695L25500
$$ y = [5497602, 5325781, 5170620, 5030228, 4901623, 4783678, 4677844, 4585670, 4506819, 4440061, 4385063, 4341946, 4309547, 4285513, 4268328, 4258402, 4256703, 4263062, 4276321, 4295462, 4319416, 4345724, 4370413, 4389975, 4403413, 4412350, 4419738, 4428743, 4442027, 4461094, 4486413, 4518769, 4560018, 4611239, 4669966, 4730537, 4788253, 4843056, 4899014, 4961068, 5032790, 5116140, 5211711, 5319053, 5437826, 5569128, 5715252, 5878180, 6058961, 6258485, 6477946, 6718324, 6980326, 7265443, 7576430, 7916149, 8286576, 8689606, 9128245, 9605974, 10124985, 10685747, 11288038, 11931363, 12614162, 13333402, 14085088, 14864164, 15663206, 16471734, 17277516, 18068552, 18834022, 19564584, 20253102, 20895127, 21488007, 22029469, 22517500, 22951243, 23330938, 23656438]
59288B3656438K69458K09843J45376P4880k603q7214j78157k73891l71824m68015
59278B2974291n58079o38667p07733p63484q04033q28576q38257q35261q21365
59269A6178836p97832p66407p29627o89889o48543o06007n62502n18556m75055
59260A0384418m32964l92921l55042l19244k85721k54815k26416j99882j74881
59251G742532j52039j32201j15166r9599q4276o8960n4020l9848k6880j5627o204
59240F947712J812Q812J4901K0483K6249L1898L5751L6755L6342L6837L8413L9241
59228G275206L8673L8413L9891M2283M4297M6486N0085N4488N7598N8664N9506
59217G805590O2781O9793P9771R0526R9976J07610J14138J19257J20848J17423
$$ y = [23656438, 23925896, 24135739, 24281115, 24355995, 24353392, 24266178, 24088021, 23814130, 23442306, 22974291, 22416212, 21777545, 21069812, 20306328, 19502295, 18673719, 17835462, 17000201, 16178836, 15381004, 14614597, 13884970, 13195081, 12546538, 11940531, 11378029, 10859473, 10384418, 9951454, 9558533, 9203491, 8884247, 8598526, 8343711, 8117295, 7917413, 7742532, 7590493, 7458292, 7343126, 7243527, 7159251, 7090291, 7036271, 6996423, 6969543, 6953916, 6947712, 6949524, 6958336, 6973237, 6993720, 7019969, 7051867, 7087618, 7124373, 7160715, 7197552, 7235965, 7275206, 7313879, 7352292, 7392183, 7434466, 7478763, 7525249, 7575334, 7629822, 7687420, 7746084, 7805590, 7868371, 7938164, 8017935, 8108461, 8208437, 8316047, 8430185, 8549442, 8670290, 8787713]
59207H787713J10427J02287R2666P8651N8836L5239J0656j3914l8101o0203p8345
59196I085912r2792j05257j16053j23456j26246j25552j23412j20369j15477j08395
59186G928903j00330r2581q5112p7349o9888o4197o0681n8176n5590n2859m9808
59175G162332m5495l9815l4493l0879k7536k1681j2629j946R489K2551L7807N4329
59163G072034P1332Q9454J09708J32409J57699J85798K16132K47433K79286L12174
59153H873459L45410L76655M04311M28553M48718M61369M62674M51281M27098
59144A2679528L88628L34170K65063J85492R9105P835q5861j77666k62960l38499
59134A3094835m02309m53277m91226n16355n28524n28213n17946n01313m80312
$$ y = [8787713, 8898140, 9000427, 9093093, 9171744, 9230580, 9265819, 9276475, 9262561, 9224460, 9164257, 9085912, 8993120, 8887863, 8771810, 8648354, 8522108, 8396556, 8273144, 8152775, 8037298, 7928903, 7828573, 7735992, 7650880, 7573531, 7503643, 7439446, 7378765, 7320589, 7264999, 7212140, 7162332, 7116837, 7077022, 7042529, 7011650, 6984114, 6962433, 6949804, 6947858, 6957347, 6979898, 7017705, 7072034, 7143366, 7232820, 7342528, 7474937, 7632636, 7818434, 8034566, 8281999, 8561285, 8873459, 9218869, 9595524, 9999835, 10428388, 10877106, 11338475, 11801149, 12252430, 12679528, 13068156, 13402326, 13667389, 13852881, 13951986, 13959821, 13873960, 13696294, 13433334, 13094835, 12692526, 12239249, 11748023, 11231668, 10703144, 10174931, 9656985, 9155672, 8675360]
59125H675360m55155m26723l97387l68813l40717l12707k85791k60945k37518
59116E589604k14499j92349j72163j53882j36771j21195j08188r7415q7038p5918
59106D230186o4800n4811m5879l7244k8929k1805j6275j1453n913R45Q414J5292
59094C967728K0960K5597K9688L3733L8182M3094M7868N1873N5383N9160O3009
59083D436275O5672O6495O6232O5558O3801O0165N5491N1358M7766M3185L7076
59072E059074L0917K6171K2336J7842J2139O109R60k466l674k763o11J842M705
59059E172581R011J5333K2988L0812L8377M6135N4498O3141P1392P9118Q6902
59048E690288R5211J03811J12322J21158J31133J42201J53300J63766J74126J84993
$$ y = [8675360, 8220205, 7793482, 7396095, 7027282, 6686565, 6373858, 6088067, 5827122, 5589604, 5375105, 5182756, 5010593, 4856711, 4719940, 4598745, 4490557, 4393142, 4306104, 4230186, 4165386, 4110575, 4064696, 4027452, 3998523, 3976718, 3960443, 3948990, 3943077, 3944022, 3952436, 3967728, 3988688, 4014285, 4043973, 4077706, 4115888, 4158982, 4206850, 4258723, 4314106, 4373266, 4436275, 4501947, 4568442, 4634674, 4700232, 4764033, 4824198, 4879689, 4931047, 4978813, 5021998, 5059074, 5089991, 5116162, 5138498, 5156340, 5168479, 5174588, 5175548, 5173082, 5169408, 5166645, 5166034, 5167876, 5172581, 5181592, 5196925, 5219913, 5250725, 5289102, 5335237, 5389735, 5452876, 5524268, 5603386, 5690288, 5785499, 5889310, 6001632, 6122790, 6253923, 6396124, 6549424, 6713190, 6887316, 7072309]
59038G072309J95896K05914K14854K22915K29611K33940K35144K32122K22578
59029I065283K04382J77910J45521J08425O5875J8100l1772q0151j25858j69033
59019I378682k08410k41744k68255k88553l02490l09322l10115l07786l03995
59010F838012k97780k88053k75853k62997k49937k36174k21882k07802j94196
59001D603338j80964j68359j56807j46426j37335j29631j22485j14327j04974
58992C342030r6539r0917q7117q2504p6096o9101o2723n7167n2613m9289m6363
58981B571601m2491l7957l4654l3412l2850l1612l0184k9419k8686k6988k4929
58970B218419k3888k3738k2957k0929j8651j7014j5630j3778j1523r396p648o360
$$ y = [7072309, 7268205, 7474119, 7688973, 7911888, 8141499, 8375439, 8610583, 8842705, 9065283, 9269665, 9447575, 9593096, 9701521, 9767396, 9785496, 9753724, 9673573, 9547715, 9378682, 9170272, 8928528, 8660273, 8371720, 8069230, 7759908, 7449793, 7142007, 6838012, 6540232, 6252179, 5976326, 5713329, 5463392, 5227218, 5005336, 4797534, 4603338, 4422374, 4254015, 4097208, 3950782, 3813447, 3683816, 3561331, 3447004, 3342030, 3245491, 3154574, 3067457, 2984953, 2908857, 2839756, 2777033, 2719866, 2667253, 2617964, 2571601, 2529110, 2491153, 2456499, 2423087, 2390237, 2358625, 2328441, 2299022, 2270336, 2243348, 2218419, 2194531, 2170793, 2147836, 2126907, 2108256, 2091242, 2075612, 2061834, 2050311, 2040915, 2033267, 2026907]
58958B026907n666n477n360n082m879m875m636l775k652j866j237P9K348M606
58944A988435N584N113M227L918M029L762L086L096M526O283O290L990J238K99
58930B043876J421L031L824L887L890M248N240P104R518J1565J2692J3268J3977
58917B137541J5025J6304J7746J9097J9884K0198K0945K2731K4895K6455K7503
58906B368324K8752L0087L0626L0223K9767K9897L0421L1308L3179L6193L9182
58895B717959M0692M0574M0119M0856M3475M7522N1832N5509N8670O1971O5536
58884C264715O8899P1956P5182P8711Q2029Q5019Q8544R3453R9520J05926J12289
58873D226243J18786J25681J33254J41807J51254J61075J71139J82134J94790
$$ y = [2026907, 2021241, 2015764, 2010404, 2005322, 2000443, 1995568, 1990932, 1987157, 1984505, 1982639, 1981402, 1981481, 1983829, 1988435, 1994019, 1999132, 2003359, 2007277, 2011306, 2015068, 2018154, 2021250, 2025776, 2032059, 2038349, 2042339, 2043577, 2043876, 2045297, 2048328, 2052152, 2056039, 2059929, 2064177, 2069417, 2076521, 2086039, 2097604, 2110296, 2123564, 2137541, 2152566, 2168870, 2186616, 2205713, 2225597, 2245795, 2266740, 2289471, 2314366, 2340821, 2368324, 2397076, 2427163, 2457789, 2488012, 2517779, 2547676, 2578097, 2609405, 2642584, 2678777, 2717959, 2758651, 2799225, 2839344, 2880200, 2923675, 2971197, 3023029, 3078538, 3137208, 3199179, 3264715, 3333614, 3405570, 3480752, 3559463, 3641492, 3726511, 3815055, 3908508, 4008028, 4113954, 4226243, 4345029, 4470710, 4603964, 4745771, 4897025, 5058100, 5229239, 5411373, 5606163]
58864E606163K08972K23924K39069K54278K69863K86668L05631L26776L49122
58855H070466L71881L95325M20063M46245M74073N04324N37529N72971O09255
58846A2402132O45533O81543P16792P50452P81623Q09025Q30625Q44177Q47806
58837A9309708Q39610Q17223P78592P22832O49716N58907M50781L27894J94827
58828B4650090N6651q1989k16754l43526m58543n58399o40570p04519p51682p83562
58818B0167197q00504q03290p94929p79360p58631p32780p02217o68799o34422
58809A3492265o00001n66005n32843n00528m69011m38966m11171l85293l60549
58800I227898l37496l17470k99988k82538k63680k44698k27181k10586j93627
$$ y = [5606163, 5815135, 6039059, 6278128, 6532406, 6802269, 7088937, 7394568, 7721344, 8070466, 8442347, 8837672, 9257735, 9703980, 10178053, 10682377, 11219906, 11792877, 12402132, 13047665, 13729208, 14446000, 15196452, 15978075, 16787100, 17617725, 18461902, 19309708, 20149318, 20966541, 21745133, 22467965, 23117681, 23676588, 24127369, 24455263, 24650090, 24706741, 24624752, 24407998, 24064472, 23605929, 23047530, 22406960, 21702441, 20950759, 20167197, 19366693, 18563403, 17768474, 16989114, 16230483, 15497703, 14795486, 14126687, 13492265, 12892264, 12326259, 11793416, 11292888, 10823877, 10384911, 9973740, 9588447, 9227898, 8890402, 8572932, 8272944, 7990406, 7726726, 7482028, 7254847, 7044261, 6850634]
58791F850634j76826j61835j48896j36563j23832j11062r8656q6140p3026n9746
58781E674052m7179l5603k4562j3514k397Q331J8162K7099L5764M4871N4649O4859
58769E804532P5224Q5733R6562J07881J19690J31804J44044J56492J69567J83831
58759G075360J99666K17018K35479K54692K74673K95669L17918L41810L67938
58750I580223L96315M25818M55328M85468N18150N54046N91618O29053O65883
58741A4301902P01864P35462P64688P88430Q05599Q13678Q09463P90792P56312
58732B1268190P04324O33458N44104M37931L16660J83035M2426r8513k34758l62879
58722B3433978m78848n78535o60608p26598p77418q11905q29641q33139q26173
$$ y = [6850634, 6673808, 6511973, 6363077, 6226514, 6102682, 5991620, 5892964, 5806824, 5733798, 5674052, 5626873, 5591270, 5566708, 5553194, 5550797, 5559128, 5577290, 5604389, 5640153, 5685024, 5739673, 5804532, 5879756, 5965489, 6062051, 6169932, 6289622, 6421426, 6565470, 6721962, 6891529, 7075360, 7275026, 7492044, 7727523, 7982215, 8256888, 8552557, 8870475, 9212285, 9580223, 9976538, 10402356, 10857684, 11343152, 11861302, 12415348, 13006966, 13636019, 14301902, 15003766, 15739228, 16503916, 17292346, 18097945, 18911623, 19721086, 20511878, 21268190, 21972514, 22605972, 23150076, 23588007, 23904667, 24087702, 24130128, 24031615, 23796857, 23433978, 22955130, 22376595, 21715987, 20989389, 20211971, 19400066, 18570425, 17737286, 16911113]
58713A6911113q11571p91339p67161p39719p09053o76405o43912o11651n77328
58704A0582974n40310n03795m71111m41889m14016l87445l63178l39940l15379
58695F805911k90343k68617k51818k37212k21656k05413j90666j78019j66224
58686D795943j54454j43181j33029j23948j15742j08575j02573r7251r1808q6032
58676C639350q0603p6162p2318o8127o3491n9368n6328n3759n0906m8041m5915
58665B964332m4628m3661m2658m1481l9945l8149l6914l7282l9648m3537m7882
58654B508547n1320n2875n2845n2493n2474n2217n1175m9800m8519m6661m3561
58643A954607m0174l8364l8545l9067l8110l5515l2543l0296k8681k6915k4872
$$ y = [16911113, 16099542, 15308203, 14541042, 13801323, 13092270, 12415865, 11771953, 11160302, 10582974, 10042664, 9538869, 9067758, 8625869, 8211853, 7824408, 7461230, 7121290, 6805911, 6515568, 6246951, 5995133, 5757921, 5536265, 5330852, 5140186, 4962167, 4795943, 4641489, 4498308, 4365279, 4241331, 4125589, 4017014, 3914441, 3817190, 3725382, 3639350, 3558747, 3482585, 3410267, 3342140, 3278649, 3219281, 3162953, 3109194, 3058288, 3010247, 2964332, 2919704, 2876043, 2833385, 2791904, 2751959, 2713810, 2676896, 2639614, 2599966, 2556429, 2508547, 2457227, 2404352, 2351507, 2299014, 2246540, 2194323, 2143148, 2093348, 2044829, 1998168, 1954607, 1914433, 1876069, 1837524, 1798457, 1760347, 1724832, 1692289, 1661993, 1633312, 1606397, 1581525]
58632A581525k3508k3554k4178k3896k2583k1431k0906k0189j9006j8332j8415
58621A345527j7692j5103j2134j0914j1085j0352p777m756k883k154j568l47J545
58608A250307L470M662N255O321Q256R838R899R176R135R377P920M152j9k476
58594A335273l271m012n612p325p833o839n423m722m439l180k72L461O819R222
58580A301847J0430J0528J0693J2625J6320J9708K1470K2844K5359K8285L0165
58569A510274L1536L4043L7673M1180M4576M8807N3281N6303N8045O0738O5508
58558B041964P1300P7283Q4107R1922R9402J05932J13002J22137J32820J43609
58548C083478J54084J64618J75375J86543J98493K10609K20972K28268K33035
$$ y = [1581525, 1558017, 1534463, 1510285, 1486389, 1463806, 1442375, 1421469, 1401280, 1382274, 1363942, 1345527, 1327835, 1312732, 1300598, 1289684, 1278599, 1268247, 1260470, 1255714, 1252831, 1250677, 1249109, 1248762, 1250307, 1253777, 1258439, 1263694, 1270015, 1278271, 1288109, 1298008, 1307184, 1316319, 1325696, 1333616, 1337768, 1337749, 1335273, 1332002, 1327990, 1322378, 1315053, 1307220, 1300381, 1294958, 1290236, 1285797, 1282617, 1282345, 1285806, 1292625, 1301847, 1312277, 1322805, 1333498, 1346123, 1362443, 1382151, 1403621, 1426465, 1451824, 1480109, 1510274, 1541810, 1575853, 1613526, 1654706, 1699282, 1748089, 1801370, 1857673, 1915718, 1976456, 2041964, 2113264, 2190547, 2274654, 2366576, 2465978, 2571910, 2684912, 2807049, 2939869, 3083478, 3237562, 3402180, 3577555, 3764098, 3962591, 4173200, 4394172, 4622440, 4855475]
58539D855475K35861K35168K28157K13428J91550J63503J29718R0712M7785L051
58529F394408m0915q1704j17893j49095j75031j94952k08368k15783k18346k17033
58519D775288k12476k05024j94789j82128j68252j54643j41704j28856j16381
58510C271035j05971r8548r2515q5595p7937p1891o8637o6405o2740n7598n3256
58499B429942n1494n1658n1672n0281m7880m5540m3796m2508m1443m0491l9560
58488A923619l8469l7136l5672l4320l3163l1922l0230k8331k7172k7355k8286
58477A571563k8941k9102k9006k8138k5823k2971k1651k2298k2889k1718j9628
58466A299398j8391j8128j7726j6724j5390j3753j1969j0900j0877j0697r279
$$ y = [4855475, 5091336, 5326504, 5554661, 5768089, 5959639, 6123142, 6252860, 6343572, 6391357, 6394408, 6353493, 6271789, 6153896, 6004801, 5829770, 5634818, 5426450, 5210667, 4992321, 4775288, 4562812, 4357788, 4162999, 3980871, 3812619, 3657976, 3516272, 3387416, 3271035, 3165064, 3066516, 2974001, 2888406, 2810469, 2738578, 2669941, 2603536, 2540796, 2483198, 2429942, 2378448, 2326790, 2275118, 2224837, 2176957, 2131417, 2087621, 2045113, 2003670, 1963179, 1923619, 1885150, 1848014, 1812342, 1778022, 1744859, 1712937, 1682707, 1654376, 1627204, 1599849, 1571563, 1542622, 1513520, 1484514, 1456376, 1430553, 1407582, 1385931, 1363633, 1340744, 1319026, 1299398, 1281007, 1262879, 1245153, 1228429, 1213039, 1199286, 1187317, 1176417, 1165540, 1154843, 1145564]
58455A145564p555p117p708p823p067o116m906l023j544k135m287n589n033l983
58441A071678l547l048j882r30j171k247l274l921m147m009m170n368o998p555
58427A019411o815o197o438o402m967k841j610j880k917l515k932j733j640l515
58413I66009n801o218m698l059k097j095j08l67j939l233l489l577l697k669n91
58398I23371K58j248k939k312P6J934K434K292K008J837K455L863M538L355J633
58383I43555J718L982O581P796P476O653O523P373Q001P020N026M066M468M139
58369A024377J998M1L02J479Q72j647l873m667m865n125n019m389l932m117m572
58354I86863m639l755j681R64K886L624M138N213O232O538O815P816Q788Q749
$$ y = [1145564, 1138009, 1130892, 1123184, 1115361, 1108294, 1102178, 1097272, 1094249, 1092705, 1090570, 1086283, 1080694, 1075661, 1071678, 1068131, 1065083, 1063201, 1062271, 1061100, 1058853, 1055579, 1051658, 1047511, 1043502, 1039332, 1033964, 1026966, 1019411, 1012596, 1006399, 999961, 993559, 988592, 985751, 984141, 982261, 979344, 975829, 972897, 971164, 969524, 966009, 960208, 953990, 949292, 946233, 944136, 943041, 942933, 942566, 940627, 937394, 933905, 930328, 926631, 923962, 923371, 923629, 922381, 919442, 917130, 917206, 919140, 921574, 923866, 925874, 927711, 930166, 934029, 938567, 941922, 943555, 945273, 949255, 955836, 963632, 971108, 977761, 984284, 991657, 999658, 1006678, 1011704, 1015770, 1020238, 1024377, 1026375, 1026416, 1026718, 1028197, 1029069, 1027422, 1023549, 1018882, 1014017, 1008892, 1003873, 999484, 995552, 991435, 986863, 982224, 978469, 976788, 977752, 980638, 984262, 988400, 993613, 999845, 1006383, 1013198, 1021014, 1029802, 1038551]
58340A038551Q334Q745R609R761R456R829J0506R834P543N393M808N511O759Q466
58326A153105J0407J1570J1165R695Q499Q492R450J0212R652P760N572L839K208
58313A261626K33j469j783n15J435L038L841M074M461N582P136Q318R077J0121
58299A315175J1515J2344J2175J1752J1691J1611J1244J1246J2166J3565J4801
58288A449285J5583J5260J3091J0017Q479R318J0367R460P343O060N966O099O246
58275A572574O681O816O097N522O450Q449J0098J1305J3014J5082J6406J6892
58263A695386J7528J8534J9148J9335K0228K2505K5430K7734K8714K8443K7633
58252A950618K7223K7525K7946K7968K7955K8550K9689L0659L0651K9207K6861
$$ y = [1038551, 1046885, 1055630, 1065239, 1075000, 1084456, 1094285, 1104791, 1114625, 1122168, 1127561, 1132369, 1137880, 1144639, 1153105, 1163512, 1175082, 1186247, 1195942, 1204441, 1212933, 1222383, 1232595, 1242247, 1250007, 1255579, 1259418, 1261626, 1261859, 1260390, 1258607, 1258092, 1259527, 1262565, 1266406, 1270480, 1274941, 1280523, 1287659, 1295977, 1305054, 1315175, 1326690, 1339034, 1351209, 1362961, 1374652, 1386263, 1397507, 1408753, 1420919, 1434484, 1449285, 1464868, 1480128, 1493219, 1503236, 1511715, 1521033, 1531400, 1540860, 1548203, 1554263, 1560229, 1566328, 1572574, 1579255, 1586071, 1592168, 1597690, 1604140, 1612589, 1622687, 1633992, 1647006, 1662088, 1678494, 1695386, 1712914, 1731448, 1750596, 1769931, 1790159, 1812664, 1838094, 1865828, 1894542, 1922985, 1950618, 1977841, 2005366, 2033312, 2061280, 2089235, 2117785, 2147474, 2178133, 2208784, 2237991, 2264852]
58241B264852K5468K6715L0040L3106L4532L4902L5152L5664L7133M0199M3773
58230B641536M5895M6804M8857N2689N6009N7233N7657N8802O0225O1506O3650
58219C250863O6909O9762P1723P4445P8400Q1549Q3185Q5808R0810R5789R9001
58208D148244J02992J10298J18715J24825J29531J35976J44211J52076J59433
58199E326301J67470J75463J82263J89461J99243K10486K20538K29321K38324
58190G138870K47413K56244K66791K80554K95375L08941L23261L41483L62587
58181I821519L83902M06601M33620M63985M94329N24445N56479N90353O25064
58172A4300297O62716P06051P53710Q02889Q54573R10742R69097J026723J086657
$$ y = [2264852, 2290320, 2317035, 2347075, 2380181, 2414713, 2449615, 2484767, 2520431, 2557564, 2597763, 2641536, 2687431, 2734235, 2783092, 2835781, 2891790, 2949023, 3006680, 3065482, 3125707, 3187213, 3250863, 3317772, 3387534, 3459257, 3533702, 3612102, 3693651, 3776836, 3862644, 3953454, 4049243, 4148244, 4251236, 4361534, 4480249, 4605074, 4734605, 4870581, 5014792, 5166868, 5326301, 5493771, 5669234, 5851497, 6040958, 6240201, 6450687, 6671225, 6900546, 7138870, 7386283, 7642527, 7909318, 8189872, 8485247, 8794188, 9117449, 9458932, 9821519, 10205421, 10612022, 11045642, 11509627, 12003956, 12528401, 13084880, 13675233, 14300297, 14963013, 15669064, 16422774, 17225663, 18080236, 18990978, 19960075, 20986798, 22073455]
58163B2073455J154255J229302J308553J393795J489798J596184J709171J829813
58155C3784326J962630K107777K262996K431862K621459K833284L065422L322400
58147E4392156L613931L945823M322239M755282N262239N855853O549041P367189
58139I6063753Q343916R507014J0878301J2476239J4296074J6291110J8397819
58132A86254226K0582128K2846987K5207091K7668413L0152288L2275727L3128747
58125C78115607L1413764K6096773J7171051N896635n707781j5725614k2979569
58118D14280866k7186539k8747047k8405762k6946284k4989717k2911344k0859292
58111B34234881j8840515j6822924j4801617j2819594j0981850r472914q512373
$$ y = [22073455, 23227710, 24457012, 25765565, 27159360, 28649158, 30245342, 31954513, 33784326, 35746956, 37854733, 40117729, 42549591, 45171050, 48004334, 51069756, 54392156, 58006087, 61951910, 66274149, 71029431, 76291670, 82147523, 88696564, 96063753, 104407669, 113914683, 124792984, 137269223, 151565297, 167856407, 186254226, 206836354, 229683341, 254890432, 282558845, 312711133, 344986860, 378115607, 409529371, 435626144, 452797195, 458693830, 452986049, 437260435, 414280866, 387094327, 358347280, 329941518, 302995234, 278005517, 255094173, 234234881, 215394366, 198571442, 183769825, 170950231, 159968381, 150495467, 141983094]
58104A41983094q209634q425702q807436q996417q821739q320097p627069o878223
58096G5896777o172585n562163n049049m605066m203168l828863l472919l131274
58088C9871690k811642k526691k279301k063049j874433j714086j577673j456336
58080B3568479j346103j248073j160126j077264r99505r30866q70528q12875p56199
58071A4366940p03881o56932o12597n70592n33722n01877m72043m44700m23720
58062I446876m08992l95161l78832l61716l45697l29986l14194k99464k85585
58053F327249k71087k56751k44906k35020k24356k13070k04209j98298j92305
58044D287247j84366j75312j65326j53558j41491j32212j25545j18148j09142
$$ y = [141983094, 133773460, 125347758, 116540322, 107543905, 98722166, 90402069, 82775000, 75896777, 69724192, 64162029, 59112980, 54507914, 50304746, 46475883, 43002964, 39871690, 37060048, 34533357, 32254056, 30191007, 28316574, 26602488, 25024815, 23568479, 22222376, 20974303, 19814177, 18736913, 17737408, 16806542, 15936014, 15123139, 14366940, 13663059, 13006127, 12393530, 11822938, 11289216, 10787339, 10315296, 9870596, 9446876, 9037884, 8642723, 8263891, 7902175, 7556478, 7226492, 6912298, 6612834, 6327249, 6056162, 5799411, 5554505, 5319485, 5095129, 4882059, 4677850, 4479552, 4287247, 4102881, 3927569, 3762243, 3608685, 3467194, 3334982, 3209437, 3091289, 2982147]
58035B982147j01326r5944r0688q4143p8075p3764o9935o5813o2634o0624n7968
58024B141233n4376n2206n2294n1991m9309m5990m4283m3415m1515l8778l6447
58013A630629l4515l2465l0742k9704k8590k7039k6209k6891k7741k6831k3989
58002A315913k0466j7254j4812j3570j3646j4546j5645j6536j6903j6806j6857
57991A138872j7137j6389j3646j0252q601r117j0165j0667j0850j0643r545q220
57979A003640p998q520q050o486n765o676p502o737n188m296m175m542n901q449
57965I13355j0961j1981j1476j0511j0006j0255j0920j1118j0240q811p830p427
57953G91819p123o969p205p292o767o605p960r894j0336r121p966p535o888n979
$$ y = [2982147, 2880821, 2784877, 2694189, 2610046, 2531971, 2458207, 2388272, 2322459, 2259825, 2199201, 2141233, 2086857, 2034651, 1982357, 1930366, 1881057, 1835067, 1790784, 1747369, 1705854, 1667076, 1630629, 1596114, 1563649, 1532907, 1503203, 1474613, 1447574, 1421365, 1394474, 1366733, 1339902, 1315913, 1295447, 1278193, 1263381, 1249811, 1236165, 1221619, 1205974, 1189438, 1172535, 1155729, 1138872, 1121735, 1105346, 1091700, 1081448, 1072847, 1063730, 1053565, 1042898, 1032048, 1021405, 1011860, 1003640, 995642, 987122, 979072, 972586, 966821, 960145, 952643, 945906, 940718, 936422, 932247, 927705, 921804, 913355, 902394, 890413, 878937, 868426, 858420, 848165, 837245, 826127, 815887, 807076, 799246, 791819, 784696, 777727, 770522, 763230, 756463, 749858, 741898, 732004, 721668, 712547, 704581, 697046, 690158, 684179]
57939F84179o134p481q210p244n544m108k805j943k684m770n924m797k719j375
57925F18441o00K49O78L19J88J105K141K050J021j58j346k190j575O43K620K727
57909F26313J585N63l42j564k339j985j706k957m728m708k809j401j907l081l245
57894E95689k631k674l931n517o198n523m035k661j934j683j301j66J896M155
57880E63486N348N142M737N144N452M193J870L09l77j837m157n067l606k230l514
57865E74893o682r289j0647j1418j1224r311o869o147p315q310p761o253m595
57852D69072k725o48J082K261L210L862L868L657M154N208N624N008M300M057
57838E11990L503J975K43l55N31K157L488L688K503P05m80q42j592l742o659q735
$$ y = [684179, 678045, 670564, 662354, 655110, 649566, 645458, 642653, 640710, 638026, 633256, 627332, 622535, 619816, 618441, 617841, 618090, 618768, 619087, 619275, 620380, 622521, 624571, 625592, 625434, 624088, 621898, 620323, 620966, 623586, 626313, 627898, 628461, 628119, 626555, 624216, 622231, 620525, 617568, 612840, 608132, 605323, 603922, 602015, 598934, 595689, 593058, 590384, 586453, 580936, 574738, 569215, 565180, 562519, 560585, 558902, 557601, 557435, 559331, 563486, 568834, 573976, 578713, 583857, 589309, 593502, 595372, 595681, 595304, 593467, 589310, 584243, 580637, 578407, 574893, 568211, 558922, 548275, 536857, 525633, 516322, 509453, 503306, 495991, 487681, 479920, 473667, 469072, 466347, 465699, 466781, 469042, 472252, 476114, 479982, 483639, 487793, 493001, 498625, 503633, 507933, 511990, 515493, 517468, 517711, 517356, 517887, 520044, 523532, 527220, 529723, 530428, 529948, 529106, 527514, 523772, 517113, 508378]
57822E08378r103q087o346m411k965k708l606m640m719l761k575j790j163q4J592
57807D54012L449N068O198O538N870M619L771L923M717N443N800N758N180M052
57793E24398K788J734N17j477l961n726o044n746o438q692j1296j2321j0885p817
57779D49034m855l395l808n401o789o758n279l484k465k383k985m266n901o772
57765C84493o264n695o977r799j1677j1135r422q354p989p541p307q005q915q415
57751B66998o299m078k906k367j608n02P26K098L419L826K599J61k178l422l580
57736B52887l307l150l081k626j389N32K583M182N043N272N348N821O805P740
57722B82660P872O969N429L801K434J499J001N53m53k172l975n107n668o459p768
$$ y = [508378, 499275, 491188, 484842, 480431, 477466, 474758, 471152, 466512, 461793, 458032, 455457, 453667, 452504, 452420, 454012, 457461, 462529, 468727, 475265, 481135, 485754, 489525, 493448, 498165, 503608, 509408, 515166, 520346, 524398, 527186, 528920, 529437, 527960, 523999, 518273, 512229, 506483, 500045, 491353, 480057, 467736, 456851, 449034, 444179, 440784, 436976, 431575, 424786, 418028, 412749, 409265, 406800, 404417, 401432, 397166, 391265, 384493, 378229, 372534, 365557, 355758, 344081, 332946, 323524, 315170, 307181, 299640, 292333, 284328, 275413, 266998, 260699, 256621, 253715, 251348, 249740, 249238, 249964, 252062, 255481, 259307, 261906, 262067, 259889, 256467, 252887, 249580, 246430, 243349, 240723, 239334, 239866, 242449, 246631, 251674, 256946, 262294, 268115, 274920, 282660, 290532, 297501, 302930, 306731, 309165, 310664, 311665, 312218, 311765, 309593, 305618, 300511, 294843, 288384, 280616]
57707B80616q797q588p209n482l942k630j737j542j749j738j574j764j823l83
57693B31658K603N078N364M341L912M304M447M199M276M459L912L245M105O394
57679B92297P824P063N537N295O447P712Q226P874O903O098O350P279P412O356
57665C88673N512N820O326O067N868O690P625P305O375O536P790Q650Q724R126
57651D87087J0381J1704J2590J3597J5190J7097J8943K0332K0414J8828J7238
57640F63401J8248K2212K6565K8954K9756L0766L2673L4986L7496M0486M3836
57629A009379M6971M9725N2614N6250O0798O5937P1160P6406Q2479R0535J00985
57618A763239J13209J26429J40316J54690J69350J84526K00935K18833K37294
$$ y = [280616, 271819, 263231, 256022, 250540, 246598, 243968, 242231, 240689, 238940, 237202, 235628, 233864, 232041, 231658, 234261, 239339, 244703, 249044, 252956, 257260, 261707, 265906, 270182, 274641, 278553, 281798, 285903, 292297, 300121, 307184, 312721, 318016, 324463, 332175, 340401, 348275, 355178, 361276, 367626, 374905, 382317, 388673, 394185, 400005, 406331, 412398, 418266, 424956, 432581, 439886, 446261, 452797, 460587, 469237, 477961, 487087, 497468, 509172, 521762, 535359, 550549, 567646, 586589, 606921, 627335, 646163, 663401, 681649, 703861, 730426, 759380, 789136, 819902, 852575, 887561, 925057, 965543, 1009379, 1056350, 1106075, 1158689, 1214939, 1275737, 1341674, 1412834, 1489240, 1571719, 1662254, 1763239, 1876448, 2002877, 2143193, 2297883, 2467233, 2651759, 2852694, 3071527, 3308821]
57609C308821K54683K69198K78378K78593K66046K38955J99014J51005J00906
57600E345599N3365R971l0263o8452j03925j34781j59804j79069j92794k00612
57590D339235k02542k00028j95184j88927j80555j69398j56404j43558j31979
57581B770660j21148j10132r8967q8473p8997o9932o0647n1443m3161l6044k9430
57570A982286k2712j6010r578l085L681R800J4215J7828K3155L1135L9613M6170
57558B116498N1389N7751O6142P5393Q4946R5606J07317J18192J26709J33362
57548C033305J39293J44616J48866J51648J51748J46835J35353J17848R5634O9254
57538D334400L9182O786k6470n9606r0733j16740j36046j50421j62138j70544
$$ y = [3308821, 3563504, 3832702, 4111080, 4389673, 4655719, 4894674, 5093688, 5244693, 5345599, 5398964, 5408935, 5378672, 5310220, 5206295, 5071514, 4911710, 4732641, 4539847, 4339235, 4136693, 3936665, 3741481, 3552554, 3371999, 3202601, 3046197, 2902639, 2770660, 2649512, 2539380, 2440413, 2351940, 2272943, 2203011, 2142364, 2090921, 2047760, 2011716, 1982286, 1959574, 1943564, 1933986, 1930901, 1934582, 1944382, 1958597, 1976425, 1999580, 2030715, 2070328, 2116498, 2167887, 2225638, 2291780, 2367173, 2452119, 2547725, 2655042, 2773234, 2899943, 3033305, 3172598, 3317214, 3466080, 3617728, 3769476, 3916311, 4051664, 4169512, 4265146, 4334400, 4373582, 4380368, 4353898, 4294292, 4203559, 4086819, 3950773, 3800352, 3638214, 3467670]
57528C467670j73704j72320j69231j65438j59519j51118j42286j34605j27350
57519B072099j19482j11419j03762r6051q8017q0512p4077o7878o1294n5266n0773
57508A163568m7043m2740l8110l4572l2541l0919k8578k5448k2194j9485j7501
57497H24437j5835j4052j2415j1485j0839r130n919k595p85l95J49K133N433Q699
57483G57401J0364J0035R106R446J1364J3755J6122J9077K2567K5237K6439K7524
57471I58437L0021L3671L7401M1159M5441M9940N4065N8073O2438O6811P0963
57460A508420P5964Q2868R0688R7424J02726J07887J13429J18355J21776J23524
57450B543061J22920J18582J09998R7937Q2861O4216M1808J6843q888l3842n6440
$$ y = [3467670, 3293966, 3121646, 2952415, 2786977, 2627458, 2476340, 2334054, 2199449, 2072099, 1952617, 1841198, 1737436, 1641385, 1553368, 1472856, 1398779, 1330901, 1269607, 1214341, 1163568, 1116525, 1073785, 1035675, 1001103, 968562, 937643, 909065, 883617, 861423, 841938, 824437, 808602, 794550, 782135, 770650, 759811, 750681, 744762, 742167, 741382, 740987, 741136, 743269, 748702, 757401, 767765, 777800, 786906, 796352, 807716, 821471, 837593, 856670, 879237, 904474, 930913, 958437, 988458, 1022129, 1059530, 1100689, 1146130, 1196070, 1250135, 1308208, 1370646, 1437457, 1508420, 1584384, 1667252, 1757940, 1855364, 1958090, 2065977, 2179406, 2297761, 2419537, 2543061, 2665981, 2784563, 2894561, 2992498, 3075359, 3139575, 3181383, 3198226, 3189338, 3155496, 3099056]
57439C099056p5362r0676j03566j14264j21371j23976j23237j20949j17569j12684
57429A995402j06520r9738r2403q4459p6747p0226o4449n8062n0804m3770l7578
57418A210646l1497k4902j8571j3795j0690q024m465M91O525J2887J8790K3754
57406A161149K7723L0965L3984L7579M2455M8474N4556N9926O5281P2042Q0315
57395A714449Q8336R4436R8976J03449J07973J10637J09459J04062R5059Q2780
57385B709616O7242M8711K7480L584k2275m7913p0722q9544j04729j16630j25070
57374B279750j30249j32989j33754j32302j28727j23922j18535j12265j04838
57365A162169r7043r0149q4585p9659p4306o7860o0613n3891m9004m5887m3339
$$ y = [3099056, 3023694, 2933018, 2829452, 2715188, 2593817, 2469841, 2346604, 2225655, 2108086, 1995402, 1888882, 1789144, 1696741, 1612282, 1535535, 1465309, 1400860, 1342798, 1291994, 1248224, 1210646, 1179149, 1154247, 1135676, 1121881, 1111191, 1103167, 1098702, 1099193, 1105718, 1118605, 1137395, 1161149, 1188872, 1219837, 1253821, 1291400, 1333855, 1382329, 1436885, 1496811, 1562092, 1634134, 1714449, 1802785, 1897221, 1996197, 2099646, 2207619, 2318256, 2427715, 2531777, 2626836, 2709616, 2776858, 2825569, 2853049, 2856633, 2834358, 2786445, 2715723, 2626179, 2521450, 2404820, 2279750, 2149501, 2016512, 1882758, 1750456, 1621729, 1497807, 1379272, 1267007, 1162169, 1065126, 974977, 890392, 810733, 736427, 668567, 607954, 554063, 505059, 459172, 415833]
57354D15833m0781l8773l7452l5650l2485k8793k5927k3951k2234k0984k0696
57343H8107k0574j9256j6977j5432E55a4923j4965j4263j4088j4034j3318j1908
57331i7499j0227q563p304p033p702q409q515q289p955p072n566m450m588n412
57317a98584n882o040o598p501q088q282q410q113o706m615l141k614k006p24
57303b77304L08R8r02j591j896k675m052m855m011k071q30j384k927l749l267
57288c11108k506k483k838k722k307k404k832k429r41L20K27o24r65p43r19j684
57272c36958k020j269k45l08j663l092l271k042m08L81j47j311j748n27J907L991
57256c48730M568M090L916M507M924M304L217K890L550M267M372M165M035L607
$$ y = [415833, 375052, 336279, 298827, 263177, 230692, 201899, 175972, 152021, 129787, 108803, 88107, 67533, 48277, 31300, 15868, 555, -14923, -29888, -44151, -58239, -72273, -85591, -97499, -107726, -116289, -123593, -130626, -138328, -146737, -155252, -163541, -171496, -178568, -184134, -188584, -193172, -198584, -204466, -210506, -217104, -224605, -232693, -240975, -249385, -257498, -264204, -268819, -271960, -274574, -276580, -277304, -276996, -276898, -277800, -279391, -281287, -283962, -288014, -292869, -296880, -298951, -299781, -301165, -304092, -307841, -311108, -313614, -316097, -318935, -321657, -323964, -326368, -329200, -331629, -332570, -332250, -332023, -332647, -333612, -334355, -335274, -336958, -338978, -340247, -340492, -340800, -342463, -345555, -348826, -350868, -351276, -350895, -351042, -352353, -354101, -354628, -352721, -348730, -344162, -340072, -336156, -331649, -326725, -322421, -319204, -316314, -312764, -308497, -304125, -299960, -295925, -292318]
57242b92318K390Q50K71J340L296M650M692M046L843M518N631O654P657R123J1392
57227b21965J4318J7271J9462K0584K1247K2522K4870K7660b4239F413L0554L0296
57215F7263L0214K9326K6152K0959J6336J4210J2856Q812J609n695j1254j6937
57203A93851k4470l1603l4801l4306l3504A215c2797l2533l0885l0644l1191l0821
57191a88871k8766k5372k1512j8396j6794j6131j5264j4170j3539j2961j1416
57180c83192r495q918r366q233m493n48J254J870L620O661R393J1213J2788J4320
57166c63126J5395J6216J7546J9570K1906K4351K6682K8157K8277K7690K7599
57155a09737K8592L0423a8471A4297L1241K8944K8344L0065L2066L2650L2582
$$ y = [-292318, -289928, -289078, -288807, -287467, -284171, -279521, -274829, -270783, -266940, -262422, -256791, -250137, -242480, -233357, -221965, -207647, -190376, -170914, -150330, -129083, -106561, -81691, -54031, -24239, 6413, 36967, 67263, 97477, 126803, 152955, 173914, 190250, 204460, 217316, 226128, 227737, 222042, 210788, 193851, 169381, 137778, 102977, 68671, 35167, 1215, -32797, -65330, -96215, -126859, -158050, -188871, -217637, -243009, -264521, -282917, -299711, -315842, -331106, -345276, -358815, -371776, -383192, -392687, -401605, -410971, -419204, -423697, -424245, -422991, -421121, -417501, -410840, -401447, -390234, -377446, -363126, -347731, -331515, -313969, -294399, -272493, -248142, -221460, -193303, -165026, -137336, -109737, -81145, -50722, -18471, 14297, 45538, 74482, 102826, 132891, 164957, 197607, 230189]
57144B30189L3009L3107L1581K9173K7727K7894K9461L2653L6911L9674L8992
57133E90371L6744L6633L9317M1999M2708M2266M1732M0634L8688L7096L6754
57122A024942L6631L5197L2452K9736K8195K8092K8896K9616K9501K8604K7272
57111A359134K5496K3403K1869K1472K1280J9964J7797J6237J5726J5313J4272
57100A571963J2597R961N807P42l753p339j1399j7187k4488l2314l9940m7012
57088A417638n3644o0590o8564p7487q7200r8427j11901j26853j41644j55631
57078D35697j69149H4386a10099k07278k22487k40674k60478k80472l00549l21699
57068a943736l45514l73634m06608m43690m84870n32269n88266o53044p25633
$$ y = [230189, 263198, 296305, 327886, 357059, 384786, 412680, 442141, 474794, 511705, 551379, 590371, 627115, 663748, 703065, 745064, 787772, 830038, 871770, 912404, 951092, 988188, 1024942, 1061573, 1096770, 1129222, 1158958, 1187153, 1215245, 1244141, 1273757, 1303258, 1331862, 1359134, 1384630, 1408033, 1429902, 1451374, 1472654, 1492618, 1510415, 1526652, 1542378, 1557691, 1571963, 1584560, 1594521, 1600328, 1601070, 1597317, 1589978, 1578579, 1561392, 1536904, 1504590, 1464650, 1417638, 1363994, 1303404, 1234840, 1157353, 1070153, 971726, 859825, 732972, 591328, 435697, 266548, 84386, -110099, -317377, -539864, -780538, -1041016, -1321488, -1622037, -1943736, -2289250, -2662884, -3069492, -3513182, -3998052, -4530321, -5118587, -5771631, -6497264]
57059f497264q06480q97177r98437j110418j234483j372718j526334j696505j886083
57050a8025899k098574k336235k601192k897436l229911l602985m022176m495704
57042d3310112n032110n638720o325846p110531q012539r048175j0230297j1569807
57034a06278137j3070892j4725362j6512669j8397321k0319526k2197125k3948986
57027b35450018k5511111k6819176k7789372k8343014k8439760k8034127k6965949
57020d27352527k4924438k1582852j6814137j0809685m036210K893064R353900
57013d93272885J4841781J9085806K2090644K4074098K5342673K6173294K6734156
57006c34930433K7055107K7060446K6652192K5787858K4502324K2882327K1035812
$$ y = [-6497264, -7303744, -8200921, -9199358, -10309776, -11544259, -12916977, -14443311, -16139816, -18025899, -20124473, -22460708, -25061900, -27959336, -31189247, -34792232, -38814408, -43310112, -48342222, -53980942, -60306788, -67417319, -75429858, -84478033, -94708330, -106278137, -119349029, -134074391, -150587060, -168984381, -189303907, -211501032, -235450018, -260961129, -287780305, -315569677, -343912691, -372352451, -400386578, -427352527, -452276965, -473859817, -490673954, -501483639, -505519849, -502626785, -493272885, -478431104, -459345298, -437254654, -413180556, -387837883, -361664589, -334930433, -307875326, -280814880, -254162688, -228374830, -203872506, -180990179, -159954367]
56999a59954367J9074119J7096939J5178780J3368160J1697802J0190456Q856457
56992f4491654P693031O689062N828839N093171M462585L921627L458481L061448
56984b4283410K718952K422328K165229J940625J741457J564085J407953J271446
56976i051335J150518J041456R42665Q53450P72962P00559O35570N76684N22796
56967a854675M74057M30817L92269b00025A26928L00975K77921K55659K34286
56958A195769K15518J99732J85506J71763J58656J46429J34760J22779J08291
56949B639203Q7444N6882J6686k9112p4263j12533j40413j59446j74676j89012
56939A920760k00061k03809j99683j89951j75907j57621j36610j15825r7007q0364
$$ y = [-159954367, -140880248, -123783309, -108604529, -95236369, -83538567, -73348111, -64491654, -56798623, -50109561, -44280722, -39187551, -34724966, -30803339, -27344858, -24283410, -21564458, -19142130, -16976901, -15036276, -13294819, -11730734, -10322781, -9051335, -7900817, -6859361, -5916696, -5063246, -4290284, -3589725, -2954155, -2377471, -1854675, -1380618, -949801, -557532, -200025, 126928, 427903, 705824, 961483, 1195769, 1411287, 1611019, 1796525, 1968288, 2126944, 2273373, 2408133, 2530912, 2639203, 2726647, 2783529, 2800215, 2771103, 2696840, 2584307, 2443894, 2284448, 2109772, 1920760, 1720699, 1516890, 1317207, 1127256, 951349, 793728, 657118, 541293, 444286, 363922]
56929C63922o6485n6150m8374m1110l4057k8661k5300k2662k0125B487a5616j7992
56917c3608j7817j8408j9993k1480k2026k1833k0996j9141j6600j4380j2501r920
56905b48703o401k913K81M136Q781J2697J4818J6111J7937J9994K0852J9755J7186
56892a05469J4315J2318J1428J0421P940M549K391K651M592P169J0002e317G805
56878B0262J2304J3786J5750J6913J8011K0269K2987K4464K4487K3935K2344J8008
56866B53520J0835L342k053n565q897j2424j4738j4913j4002j3588j3481j1949
56854A56087q389m665k931k948k726j535p82j548k663k102M01L086M166L455K171
56839A39077J676K416L856N379P015R003J0882J1793J1632J1274J1490J2337J3694
$$ y = [363922, 297437, 241287, 192913, 151803, 117746, 89085, 63785, 41123, 20998, 2487, -15616, -33608, -51425, -69833, -89826, -111306, -133332, -155165, -176161, -195302, -211902, -226282, -238783, -248703, -255104, -258017, -257736, -253600, -244819, -232122, -217304, -201193, -183256, -163262, -142410, -122655, -105469, -91154, -78836, -67408, -56987, -49047, -44498, -42107, -39456, -34864, -27695, -17693, -5317, 7805, 20262, 32566, 46352, 62102, 79015, 97026, 117295, 140282, 164746, 189233, 213168, 235512, 253520, 264355, 267697, 265644, 260079, 251182, 238758, 224020, 209107, 195105, 181517, 168036, 156087, 147698, 143033, 140102, 137154, 134428, 132893, 132111, 130563, 127900, 125798, 126199, 129285, 133451, 136906, 139077, 140753, 143169, 147025, 152404, 159419, 168422, 179304, 191097, 202729, 214003, 225493, 237830, 251524]
56826B51524J5528J7207J7341J4964J0477N115M0l803n841o551p314q754r667
56813B90266q447n239j742R57L392O459J0019J3323J6280J9618K3850K8477L2394
56800D29607L4787L5427L4204L0757K4770J6493O952k144q817j1818j1713j0559
56788E67946r858r148p079l461O16M448Q414J2914J7664K2436K7627L3405L8895
56775G04819M2880M4971M5398M3852L9145L0245J7585L419r272j8503k4128k7011
56763H93400k7733k6624k4662k3265k2822k2119j9634j5028r188l403J356M948
56751G05226Q317J2654J7898K2445K4644K4064K1041J5701Q093j081j0525j8927
56739H29550k5199k8726k9981l0387l0804l0407k7819k3160j8212j4406j1438
$$ y = [251524, 267052, 284259, 301600, 316564, 327041, 332156, 332196, 328393, 322552, 316001, 308687, 299933, 290266, 281819, 276580, 274838, 275795, 279187, 285646, 295665, 308988, 325268, 344886, 368736, 397213, 429607, 464394, 499821, 534025, 564782, 589552, 606045, 612997, 610853, 602036, 590218, 578505, 567946, 558088, 548940, 541861, 538400, 539016, 543464, 551878, 564792, 582456, 604892, 632519, 665924, 704819, 747699, 792670, 838068, 881920, 921065, 951310, 968895, 972314, 963042, 944539, 920411, 893400, 865667, 839043, 814381, 791116, 768294, 746175, 726541, 711513, 702325, 698922, 700278, 705226, 713543, 726197, 744095, 766540, 791184, 815248, 836289, 851990, 860083, 859002, 848477, 829550, 804351, 775625, 745644, 715257, 684453, 654046, 626227, 603067, 584855, 570449, 559011]
56728E59011q099m047j76K592M404O222Q541J0724J1649J0716P942L543j931p283
56714F03808j1423j4360j6687j8186j8213j7551j8188k0322k1246j8749j4392
56703D14491j1561j0935j0230q176o313o148o727o365n236m626m736m753m528
56690C24157m651n117n219m731m033l254k288j543j535j736j126o5j86j907l439
56675B83327l079j419j76J80M33Q52Q51J93o80j537k409k836k126o22L47mj247
56658B70048k738m152m746l384k29K620L149J637j5o09n02m43o00p13n51j88j09
56641B58475p66j749j913q41M02O77K87J88K66k96j196j057M55J878J934J265
56625B58009J355K435L306K998J865J007J013J414J302M76k30J2Q65J165M60l97
$$ y = [559011, 550912, 546865, 546689, 549281, 553685, 559907, 568448, 579172, 590821, 601537, 609479, 613022, 611091, 603808, 592385, 578025, 561338, 543152, 524939, 507388, 489200, 468878, 447632, 428883, 414491, 402930, 391995, 381765, 373589, 367276, 361128, 354401, 348036, 342800, 338174, 333438, 328685, 324157, 319506, 314389, 309170, 304439, 300406, 297152, 294864, 293321, 291786, 290050, 288924, 288859, 288673, 286766, 283327, 280248, 278829, 278653, 278833, 279266, 280118, 280969, 281162, 280482, 278945, 276536, 273700, 271574, 270952, 271299, 271295, 270048, 267310, 263158, 258412, 255028, 254799, 257419, 260568, 262205, 262190, 261581, 261079, 260636, 260036, 259323, 258772, 258584, 258475, 257709, 255960, 254047, 253206, 253608, 254285, 254572, 254760, 255026, 254730, 253534, 252477, 252932, 254810, 256744, 258009, 259364, 261799, 265105, 268103, 269968, 270975, 271988, 273402, 274704, 275180, 274950, 274962, 275827, 276992, 277452, 277055]
56609B77055l46O39J644J873J358P82Q15J494K298K806L118L361L168K204J042
56594C03311P78J712K961L515L087J830r1k199l531l353j955l35O90Q54J17j402
56578C05989l076l776k761o31R56Q73l79j415j532j023k36Q26J872K262J906J327
56562C01182O16p42k493l326k758k009j977j685k26R99J18k043k971k282k011
56547B78392l019l698k892j632q88K05K277L757K816K46j410r23P30K009K197
56532B78167J589J270K171L699M038K581J027J036J859J698N78L02J851M217N746
56517C11829N514L600J030p02r65o28o32n77K67J250J192N51J046L024M822N158
56501C35779M679M489M436L770K742K443L408M965N911N452L871K479K571M014
$$ y = [277055, 276709, 277348, 278992, 280865, 282223, 283005, 283820, 285314, 287612, 290418, 293536, 296897, 300065, 302269, 303311, 304089, 305801, 308762, 312277, 315364, 317194, 317103, 314904, 311373, 308020, 306065, 305730, 306420, 307274, 307391, 305989, 302913, 299137, 296376, 295745, 296701, 297574, 297195, 295780, 294248, 293225, 292989, 293815, 295687, 297949, 299855, 301182, 301798, 301056, 298563, 295237, 292479, 290470, 288493, 286808, 286582, 287581, 287699, 285656, 282685, 280403, 278392, 275373, 271675, 268783, 267151, 266263, 266468, 268745, 272502, 275318, 275564, 274154, 273231, 273961, 275970, 278167, 279756, 281026, 283197, 286896, 290934, 293515, 294542, 295578, 297437, 299135, 299713, 300015, 301866, 306083, 311829, 317343, 320943, 321973, 321271, 320306, 319678, 319046, 318469, 318736, 319986, 321178, 321729, 322775, 325799, 330621, 335779, 340458, 344947, 349383, 353153, 355895, 358338, 361746, 366711, 372622, 378074, 381945, 384424, 386995, 391009]
56487C91009N118M341K004N3%J360K213J255r81l014m052m280l912k902j659j140
56471C85413j693k559k978l070l180l077k546k099k270k710k768k509k329k015
56457C49610j144j42k3j088k572l357k664m76J994K869J539l57q20RL16p44k121
56440C40829k564k014j063l5R10J363P99r30l224m695m044j437J308K491K050
56425C29744R90M0l86J45J407K238K061J912K802L864L634K439J739J666J281
56410C55576Q85J874M155N914O345O551P238P580P140O966P735Q477Q226P438
56396D42100O821O187N521N583O313O111M058J512J23m63j406k458k655k270k187
56381D72890k060r12P10R79q31l572n765o779o651n844n131m806m269l212k635
$$ y = [391009, 396127, 400468, 402472, 402525, 402525, 403885, 406098, 407353, 406372, 403358, 399306, 395026, 391114, 388212, 386553, 385413, 383720, 381161, 378183, 375113, 371933, 368856, 366310, 364211, 361941, 359231, 356463, 353954, 351625, 349610, 348466, 348324, 348301, 347213, 344641, 341284, 338620, 338144, 340138, 343007, 344546, 344189, 343369, 343378, 343694, 342950, 340829, 338265, 336251, 335188, 335153, 336063, 337426, 338225, 337295, 334071, 329376, 325332, 323895, 325203, 327694, 329744, 330734, 330774, 330388, 330533, 331940, 334178, 336239, 338151, 340953, 344817, 348451, 350890, 352629, 354295, 355576, 356461, 358335, 362490, 368404, 374749, 381300, 388538, 396118, 403258, 410224, 417959, 426436, 434662, 442100, 448921, 455108, 460629, 466212, 472525, 478636, 482694, 484206, 484329, 483866, 482460, 480002, 477347, 475077, 472890, 470830, 469918, 470628, 471607, 470776, 467204, 461439, 454660, 448009, 442165, 437034, 432228, 427959, 424747, 422112]
56366D22112l500n014n552m942m247l715k603j065m12j069j857j897j790k239
56352C82210k728k566k173k229k243j175Q55K511K921K677K901L778M356L701
56338C92796J981K40p67j129j112o07L19P89rj632k912l549m135m590l842j639
56322C70202M39Q05l9l13O20J839K693L604M695M902L472J427M33O01P19M77R79
56305C97555K658M097L903K679K067K478L133L722M517N037M241K330R75J272
56291D40664K573L724M331M357L746L065L399M789N873N759N114M602L595J642
56277D97233L6L30K114L784M721N143M605K692Q36J221L720N808N916N057M574
56262E47790M233L638L843N909Q731R892Q530O293N472O928R686J1938J2357J0904
$$ y = [422112, 418612, 413598, 408046, 403104, 398857, 395142, 392539, 391474, 391062, 389993, 388136, 386239, 384449, 382210, 379482, 376916, 374743, 372514, 370271, 369096, 369951, 372462, 375383, 378060, 380961, 384739, 389095, 392796, 394777, 395017, 394250, 393121, 392009, 391402, 391721, 392510, 392501, 390869, 387957, 384408, 380273, 375683, 371841, 370202, 370641, 371446, 371407, 371094, 371714, 373553, 376246, 379850, 384545, 389447, 392919, 394346, 394779, 395380, 396099, 396576, 397555, 400213, 404310, 408213, 410892, 412959, 415437, 418570, 422292, 426809, 431846, 436087, 438417, 439392, 440664, 443237, 446961, 451292, 455649, 459395, 462460, 465859, 470648, 476521, 482280, 487394, 491996, 495591, 497233, 497269, 497599, 499713, 503497, 508218, 513361, 517966, 520658, 521494, 522715, 526435, 532243, 538159, 543216, 547790, 552023, 555661, 559504, 565413, 574144, 584036, 592566, 598859, 604331, 611259, 620945, 632883, 645240, 656144]
56248F56144Q620O797O430Q020J1133J4061J4861J3267J1063J0203J0972J2393
56236G83964J3654J4504J4647J3701J1891J0226R698J0364J1290J1420J0683J0231
56224I26273J1323J3863J6323J7253J6693J6011J6676J9209K3009K6906L0042
56213A133581L2399L4500L6746L9290M2366M6205N0635N5315O0449O6679P3983
56202A672148Q1357Q8034R4499J01792J10109J18829J27569J36482J45508J54092
56192B830419J61754J68266J73030J75014J73872J70587J66177J60082J50674
56183D329875J37245J20545J01282P9354N5290L1378J0087q337k5596m2784n9055
56172D729284p2791q3130r0225r4996r8929j03240j07846j11684j14266j16153
$$ y = [656144, 664764, 671561, 677991, 686011, 697144, 711205, 726066, 739333, 750396, 760599, 771571, 783964, 797618, 812122, 826769, 840470, 852361, 862587, 872285, 882649, 893939, 905359, 916042, 926273, 937596, 951459, 967782, 985035, 1001728, 1017739, 1034415, 1053624, 1076633, 1103539, 1133581, 1165980, 1200480, 1237226, 1276516, 1318882, 1365087, 1415722, 1471037, 1531486, 1598165, 1672148, 1753505, 1841539, 1936038, 2037830, 2147939, 2266768, 2394337, 2530819, 2676327, 2830419, 2992173, 3160439, 3333469, 3508483, 3682355, 3852942, 4019119, 4179201, 4329875, 4467120, 4587665, 4688947, 4768301, 4823591, 4854969, 4865056, 4856719, 4831123, 4788339, 4729284, 4656493, 4573363, 4483138, 4388142, 4289213, 4185973, 4078127, 3966443, 3852177, 3736024]
56162C736024j17852j19132j19755j19911j19598j18508j16917j15735j15129
56153B673487j14023j11462j07585j02788r7135r1201q6147q2075p7548p1718
56143A731805o5641o0339n5095m9238m4173m1556m0442l8406l4920l1301k7889
56132A242805k3791j9447j6965j7161j8207j7914j5903j2990j0052p965p145o611
56120A068654m852k181o65j111j588J94M231Q615J1493J1943J0190P882P276R301
56106A129382J2939J6735J9932K1903K1949K0468J9333K0211K3063K6669K9785
56095A362369L1484L1513L0864L1036L2296L3608L4561L6199L9444M3833M8372
56084A755579N2603N6424O0010O4403P1030Q0041R0136J00119J09444J17175J22158
$$ y = [3736024, 3618172, 3499040, 3379285, 3259374, 3139776, 3021268, 2904351, 2788616, 2673487, 2559464, 2448002, 2340417, 2237629, 2140494, 2049293, 1963146, 1881071, 1803523, 1731805, 1666164, 1605825, 1550730, 1501492, 1457319, 1415763, 1375321, 1336915, 1301995, 1270694, 1242805, 1219014, 1199567, 1182602, 1165441, 1147234, 1129320, 1113417, 1100427, 1090375, 1082410, 1075265, 1068654, 1063802, 1061621, 1060956, 1059845, 1058257, 1058451, 1062682, 1071297, 1082790, 1094733, 1104923, 1112805, 1120081, 1129382, 1142321, 1159056, 1178988, 1200891, 1222840, 1243308, 1262641, 1282852, 1305915, 1332584, 1362369, 1393853, 1425366, 1456230, 1487266, 1519562, 1553170, 1587731, 1623930, 1663374, 1707207, 1755579, 1808182, 1864606, 1924616, 1989019, 2060049, 2140090, 2230226, 2330345, 2439789, 2556964, 2679122]
56073B679122J24504J25066J23070J16563J06089R5563Q8110Q2971P7907P2348
56063C691313O6191N7652M5036K9522J3728j573j7060l1979m4291n3738o2712
56052C692089p3727q7203j01627j14584j23834j28551j29567j27744j22836j14736
56042B567680j04921r5314q6474p8086p0359o3474n6399m7985l8928l1293k6188
56031A868259k2865j9723j5416r777m454j578r75J28L492P517R776J0240J0171
56018A834795R485P674O022O315Q045R223R328R244R071Q420Q231R722J2066J3533
56004A961174J4409J6165J8297J9080J9118K0876K4449K7118K7778K8672L1549
55993B208685L5010L7167L8433L9992M1479M2070M2401M3735M6125M8628N0621
$$ y = [2679122, 2803626, 2928692, 3051762, 3168325, 3274414, 3369977, 3458087, 3541058, 3618965, 3691313, 3757504, 3815156, 3860192, 3889714, 3903442, 3901869, 3884809, 3852830, 3808539, 3754801, 3692089, 3618362, 3531159, 3429532, 3314948, 3191114, 3062563, 2932996, 2805252, 2682416, 2567680, 2462759, 2367445, 2280971, 2202885, 2132526, 2069052, 2012653, 1964668, 1925740, 1894447, 1868259, 1845394, 1825671, 1810255, 1800478, 1796024, 1794446, 1793471, 1793599, 1797091, 1804608, 1814384, 1824624, 1834795, 1844280, 1851954, 1857976, 1864291, 1872336, 1881559, 1890887, 1900131, 1909202, 1917622, 1925853, 1935575, 1947641, 1961174, 1975583, 1991748, 2010045, 2029125, 2048243, 2069119, 2093568, 2120686, 2148464, 2177136, 2208685, 2243695, 2280862, 2319295, 2359287, 2400766, 2442836, 2485237, 2528972, 2575097, 2623725, 2674346]
55982B674346N2048N3059N4138N5864N8228O0795O3524O6596O9566P1786P3606
55971C353556P6104P9760Q4388Q9827R5600J00637J04756J09586J16456J24340
55961D335010J31673J39005J47537J56281J63523J70148J78345J87598J95462
55952E804582K02020K09963K20024K30074K39326K49776K62416K75394K87433
55943G981008L00251L16064L34975L55903L77992M00312M22355M45419M71415
55934A1405694N00166N30197N61939N97393O36806O78812P23439P71408Q21033
55925A7226887Q70046R20454R77079J041227J110447J184714J267422J359458
55917B5957734J457904J561961J674977J799355J934782K082728K247044K428881
$$ y = [2674346, 2726394, 2779453, 2833591, 2889455, 2947683, 3008478, 3072002, 3138598, 3208164, 3279950, 3353556, 3429660, 3509420, 3593808, 3683635, 3779235, 3879872, 3984628, 4094214, 4210670, 4335010, 4466683, 4605688, 4753225, 4909506, 5073029, 5243177, 5421522, 5609120, 5804582, 6006602, 6216565, 6436589, 6666663, 6905989, 7155765, 7418181, 7693575, 7981008, 8281259, 8597323, 8932298, 9288201, 9666193, 10066505, 10488860, 10934279, 11405694, 11905860, 12436057, 12997996, 13595389, 14232195, 14911007, 15634446, 16405854, 17226887, 18096933, 19017387, 19994466, 21035693, 22146140, 23330854, 24598276, 25957734, 27415638, 28977599, 30652576, 32451931, 34386713, 36469441, 38716485, 41145366]
55909D1145366K627233K845947L093748L376201L695233M058664M482584M982388
55901G0307364N569974O261992P081721Q050347R185487J0507075J2028127J3735586
55893A42727673J5597685J7597045J9739597K2025462K4423554K6837098K8972163
55886B97920277L0142352K9279865K5383793J8205023Q610572j725604j1075980
55879C96740298j8303050k3052820k5568751k6381207k6052419k5033586k3626592
55872B28721873k2011487k0291092j8526666j6764200j5049425j3425046j1919818
55865A10734139j0547751r316189q227281p273230o439063n711797n081481m534852
55857E3602495m055964l634273l265679k945025k663680k415214k197195k006070
$$ y = [41145366, 43772599, 46618546, 49712294, 53088495, 56783728, 60842392, 65324976, 70307364, 75877338, 82139330, 89221051, 97271398, 106456885, 116963960, 128992087, 142727673, 158325358, 175922403, 195662000, 217687462, 242111016, 268948114, 297920277, 328062629, 357342494, 382726287, 400931310, 409541882, 407816278, 396740298, 378437248, 355384428, 329815677, 303434470, 277382051, 252348465, 228721873, 206710386, 186419294, 167892628, 151128428, 136079003, 122653957, 110734139, 100186388, 90870199, 82642918, 75369688, 68930625, 63218828, 58137347, 53602495, 49546531, 45912258, 42646579, 39701554, 37037874, 34622660, 32425465, 30419395]
55849C0419395j835734j682478j546399j426762j320409j225488j142091j068397
55841A9171637j000658r37701q80952q29366p79003p28573o80869o37711n97810
55832A2098994n60573n27427m97962m69175m40181m13685l91221l70969l51769
55823H076032l35106l21190l07099k91220k75920k63365k51976k39583k27001
55814E563572k15806k05204j93861j82721j73395j65722j59132j54573j52791
55805C960367j52160j50432j47249j43268j38162j31374j23605j15914j08328
55796B749875j00608r3300q6864q0903p5198p0260o6062o1734n7296n4129n2819
55785A950702n2120n0787m8809m6088m2027l7330l4125l3031l1985k9215k5425
$$ y = [30419395, 28583661, 26901183, 25354784, 23928022, 22607613, 21382125, 20240034, 19171637, 18170979, 17233278, 16352326, 15522960, 14743957, 14015384, 13334515, 12696804, 12098994, 11538421, 11010994, 10513032, 10043857, 9603676, 9189991, 8798770, 8427801, 8076032, 7740926, 7419736, 7112637, 6821417, 6545497, 6282132, 6030156, 5790573, 5563572, 5347766, 5142562, 4948701, 4765980, 4592585, 4426863, 4267731, 4113158, 3960367, 3808207, 3657775, 3510526, 3367258, 3229096, 3097722, 2974117, 2858203, 2749875, 2649267, 2555967, 2469103, 2388200, 2313002, 2242742, 2176680, 2114946, 2057650, 2003521, 1950702, 1898582, 1847795, 1798986, 1752898, 1710871, 1673541, 1639416, 1606385, 1574400, 1545185, 1519760]
55774A519760k1934j8780j6074j4989j5583j5701j3928j1817j1200j1188j0045
55763A358521q273p362o966n972n287o795j0245j3630j6271j9057k1936k3630
55751A213097k3950k4194k4945k5349k4999k4722k4898k4516k2626j9746j7105
55740I56047j5242j3891j2711j1771j1492j2154j3311j3935j3477j2321j0843
55729H14899q671n530k368p36j196k764l798l159j033R95J149r15m074p412j0933
55714G64454j4278j6018j5298j3418j2597j3434j4485j4098j2036r461p843p767
55702F13721q554r248r849j0972j2371j2884j2046j0694r669q955q463q516r008
55689D82492r266r172r237r210q120o321n664o687p321n843l493k593l374m419
$$ y = [1519760, 1497826, 1479046, 1462972, 1447983, 1432400, 1416699, 1402771, 1390954, 1379754, 1368566, 1358521, 1350248, 1342886, 1335920, 1329948, 1324661, 1317866, 1307621, 1293991, 1277720, 1258663, 1236727, 1213097, 1189147, 1164953, 1140008, 1114659, 1089660, 1064938, 1040040, 1015524, 992898, 973152, 956047, 940805, 926914, 914203, 902432, 890940, 878786, 865475, 851540, 838063, 825742, 814899, 806228, 800698, 798330, 797594, 796398, 793634, 789836, 786677, 785644, 786639, 787788, 786873, 782799, 775387, 764454, 750176, 734158, 718860, 705442, 692845, 679411, 664926, 650828, 638792, 629331, 621488, 613721, 605167, 595919, 586070, 575098, 562727, 549843, 537797, 527103, 517434, 508479, 500016, 491500, 482492, 473226, 464054, 454817, 445607, 437487, 431166, 425502, 418815, 411494, 405651, 402158, 399565, 396191, 391772]
55675C91772n052n395n075l775k492k378k884k730k119k198k921l406l940n461
55661C41946p206p145n108l446l901n533o430o020m805l140j372l34o08j568j804
55646B83526m62J944L830L701J522j118k549k570k074j612j149q95j286k181k888
55631B75739l060k845k200p68J346L376M502M365L152J666J055J896L589N099
55617B96912O017O512O781P016P345P236N776L175J204J004J422P49o45j087n17
55602C48900o09j940k922k275j008r41k068k520r45J717L122K179M05L4R14O27
55586C42670j896m494m643k801j163l84L91R68J53j794l116l284l481m012l490
55571C09624j589m61j983n066p191p572p434p904q839r426r015p628o153n658
$$ y = [391772, 386720, 381325, 376250, 372475, 369983, 367605, 364721, 361991, 359872, 357674, 354753, 351347, 347407, 341946, 334740, 327595, 322487, 319041, 315140, 309607, 303177, 297157, 292352, 289212, 287840, 287506, 286898, 285330, 283526, 283064, 285008, 288838, 292539, 294061, 292943, 290394, 287824, 285750, 284138, 282989, 282094, 280808, 278627, 275739, 272679, 269834, 267634, 266866, 268212, 271588, 276090, 280455, 283607, 285273, 286328, 288224, 291813, 296912, 302929, 309441, 316222, 323238, 330583, 337819, 343595, 346770, 347974, 348978, 350400, 351149, 350504, 349417, 348900, 348291, 346351, 343429, 341154, 340146, 339205, 337137, 334617, 333672, 335389, 338511, 340690, 341095, 341129, 342043, 342670, 340774, 336280, 331637, 328836, 327673, 327289, 327680, 328648, 328801, 327007, 323891, 320607, 317126, 313114, 309624, 308035, 307574, 305591, 300525, 293334, 285762, 278328, 270424, 261585, 252159, 243144, 235516, 229363, 223705]
55557B23705o179o650o273n356m614m282m202m096l549k456j527j526k013j890
55543A69092j142q40j192j005L44J731J792N81r28k006k281j711j009j192k116
55528A58118k496j804j032j038j457j885k709l786l768k003Q5P93K74l61r07j504
55512A34520j370O2J534J408K56P9J184J847J184L88P00J691K284K166J480K00
55496A49613j487k886l564l770l851l761l504l353l346l228l121l505m195m123
55482A01919k714q74n5o95j948k553j686N15K825L756L039J948J817K585L223
55467A11102L130K469J515M57k30K0J128K370L155L442L255K486J373N57K44k15
55451A36258j302k309k117q13L32N55M85R97J820J880O64j206k618k869k251j898
$$ y = [223705, 217526, 210876, 204603, 199247, 194633, 190351, 186149, 182053, 178504, 176048, 174521, 172995, 170982, 169092, 167950, 167110, 165918, 164913, 165257, 166988, 168780, 169361, 168433, 166427, 164146, 162435, 161426, 160234, 158118, 155622, 153818, 152786, 151748, 150291, 148406, 145697, 141911, 138143, 136140, 136225, 137018, 137292, 136931, 136024, 134520, 133150, 133212, 134746, 136154, 136410, 136489, 137673, 139520, 140704, 141092, 141792, 143483, 145767, 147933, 149413, 149613, 148126, 145240, 141676, 137906, 134055, 130294, 126790, 123437, 120091, 116863, 113742, 110237, 106042, 101919, 99205, 98331, 98276, 97581, 95633, 93080, 91394, 91909, 94734, 98490, 101529, 103477, 105294, 107879, 111102, 114232, 116701, 118216, 118673, 118443, 118463, 119591, 121961, 125116, 128558, 131813, 134299, 135672, 136229, 136473, 136258, 134956, 132647, 130530, 129717, 130049, 130604, 131089, 132086, 133906, 135786, 136450, 135244, 132626, 129757, 127506, 125608]
55435A25608k715m169m600l225j384j138k868m824n014k998l7J975J799j92k274
55420I3944k933k262j533j643k438l293l761l665l121k464j782p92M07Q85k1j527
55404F4001k251k079k142k900l354k514p56O69R55K71n46o86j60J74j82n33q0
55387D7887O48N23l80j021j158j391j535o76Q91J641J192R55J675K178J529O13
55371E3571L15j88j661k891k446j206r94j526q95J197K852K644J094o20j743j577
55355D5926K94K780L663J950r08k527j670J137M017M737K481r76k792k036l33
55340E5743M89K08n62j548k475k640j793o93J5P42J911K660J778l59j955j935
55324D9586j009l02J55R85K026K220J030o09j266p85m68j318k560k483o34J505
$$ y = [125608, 122893, 118724, 114124, 110899, 109515, 108377, 105509, 100685, 95671, 92673, 92636, 94611, 96410, 96218, 93944, 91011, 88749, 87216, 85573, 83135, 79842, 76081, 72416, 69295, 66831, 65049, 64257, 64664, 65549, 65528, 64001, 61750, 59671, 57529, 54629, 51275, 48761, 48005, 48674, 49629, 49900, 49354, 48668, 48508, 48682, 48500, 47967, 47887, 48535, 49058, 48678, 47657, 46499, 45108, 43573, 42897, 43788, 45429, 46621, 47576, 49251, 51429, 52958, 53571, 53886, 53698, 52037, 49146, 46700, 45494, 44500, 42974, 42079, 43276, 46128, 48772, 49866, 49246, 47503, 45926, 46220, 49000, 52663, 54613, 53705, 51178, 49508, 50645, 54662, 59399, 61880, 60904, 58112, 56076, 55743, 56232, 56440, 55878, 54330, 51855, 49215, 47422, 46729, 46744, 47486, 49397, 52057, 53835, 53476, 51521, 49586, 48577, 48275, 48430, 49415, 51441, 53661, 54691, 54082, 52816, 52031, 51563, 50245, 47685, 45202, 44568, 46073]
55308D6073K236J502O07M27M95j4j061j859j879j174J5J338K009J239n61j715
55292D7678j131L34J057P83N16O73N12m34j538k099k208k153j779r60j47J08k55
55275C8957q88j283r70j15L05j90l48J303L759M177J669j406k702k631k629k545
55259C4463j492M2Q27P03J83p60j848j609O34K828K490K77j042p00l46o06o7J765
55241C5742L107K641J517J360K034K504K591K596K266J291K0j081j960k486k291
55226D9851j579j080q39j62Q66J148L97k32p8q7j000j757j050O05J612J499J136
55209D9250J240J718K126J977R67n59j700k024j915j677j157o32q69j753j991
55194D3001r72K70P17P78J017R14J89m6R15J505j67l124m332k479P33K941L210
$$ y = [46073, 48309, 49811, 50418, 50845, 51340, 51326, 50265, 48406, 46527, 45353, 45368, 46706, 48715, 49954, 49393, 47678, 46547, 46881, 47938, 48721, 49237, 49910, 50422, 49988, 48450, 46351, 44143, 41990, 40211, 39251, 39104, 39212, 38957, 38069, 36786, 35816, 35701, 36006, 35816, 35468, 36771, 40530, 44707, 46376, 44970, 42268, 39637, 37008, 34463, 32971, 33013, 33840, 34543, 34726, 33966, 32118, 30509, 31143, 33971, 36461, 36738, 35696, 34996, 34650, 34044, 33977, 35742, 38849, 41490, 43007, 44367, 46401, 48905, 51496, 54092, 56358, 57649, 57669, 56588, 54628, 52142, 49851, 48272, 47192, 46353, 46191, 47057, 48205, 48602, 48370, 48292, 48205, 47205, 45448, 44398, 45003, 46615, 48114, 49250, 50490, 52208, 54334, 56311, 57278, 56719, 55019, 52995, 51080, 49403, 48246, 47614, 46745, 44992, 43001, 42029, 42299, 43016, 43794, 44811, 45725, 45914, 45868, 46783, 48288, 48121, 44997, 40665, 38186, 38919, 41860, 45070]
55177D5070J894O9p88L6J425J734J038P83J349J575Q23j68p89j350j873j638o31
55160D8559l5m07o41K73J606K107J860J722J630Q48m52j068l17J235K581L135
55144F2636K784J747N28l95q89j031q16l85k56q68j926k631k553k048j797k136
55128D9964k726k794j837k82Q60J135J137J570K194K209J419M89J18M35J113J559
55112E6563J094m45k096k421j090N99J184O34P4K88R74J366J008n9j283j708p40
55095E3942R73J863J042o68j622r74P59K274K308M80k092l404k559p87K14O00
55079E2349J773L741M632L351J256J07l99j640l374l799k283m40N6n11p66l36
55063E3717j20p50j597j504j09J681K533K008R85O79J299J994K027J547J116R45
$$ y = [45070, 46964, 47033, 46245, 46281, 47706, 49440, 50478, 51261, 52610, 54185, 55008, 54840, 54051, 52701, 50828, 49190, 48559, 48524, 48117, 47476, 47749, 49355, 51462, 53322, 55044, 56674, 57522, 57070, 56002, 55685, 56920, 59501, 62636, 65420, 67167, 67695, 67300, 66411, 65380, 64564, 64179, 63923, 63055, 61129, 58498, 55945, 53897, 52100, 49964, 47238, 44444, 42607, 42325, 43185, 44320, 45457, 47027, 49221, 51430, 52849, 53338, 53456, 53891, 55004, 56563, 57657, 57212, 55116, 52695, 51605, 52204, 53388, 54022, 54096, 54384, 55358, 56724, 57732, 57673, 56390, 54682, 53942, 54915, 56778, 57820, 57152, 55530, 54556, 55315, 57589, 59897, 60377, 58285, 54881, 52322, 51535, 51749, 52349, 54122, 57863, 62495, 65846, 67102, 67209, 66810, 65170, 61796, 57997, 55714, 55274, 55330, 54819, 54053, 53717, 53597, 52847, 51250, 49746, 49637, 51318, 53851, 55859, 56844, 57523, 58822, 60816, 62843, 64390, 65506, 66451]
55047F6451R81J373K306L355L578K621J458J565L151M668M412K468N14l05o38
55032I7958j754l667n098m989l442j318M78J315J239J166K086L710M568L785K212
55017I8249J271J199J139N85j25o94j246j591j083J81P65n37k844l973l100j743
55001H6453j658k691l320k760j634p55j16P27J754K256J375j007l698m862l704
54986F6360j425R3L90N35J268J972J796J020O90J305K340K802J973O1j689j960
54970G7531q11L52M44j88o43o68l87M14J830L106L273K350J188M21K52Q50K008
54953I1322K656J771k03j711j846r29M21J722K213J375J82M66K446M061L532J519
54937A08997j21p12p75n15K63J006O20j037k738l188k147m05P88N17p92j413k54
$$ y = [66451, 67432, 68805, 71111, 74466, 78044, 80665, 82123, 83688, 86839, 91507, 95919, 98387, 98901, 98596, 97958, 96204, 92537, 87439, 82450, 79008, 77690, 78168, 79483, 80722, 81888, 83974, 87684, 92252, 96037, 98249, 99520, 100719, 101858, 102443, 102318, 101624, 100378, 98787, 97704, 97885, 98650, 98113, 95269, 91296, 88196, 86453, 84795, 82104, 78784, 76024, 74390, 73635, 73519, 74246, 76000, 78256, 79631, 78624, 74926, 70064, 66360, 64935, 65028, 65418, 65953, 67221, 69193, 70989, 72009, 72699, 74004, 76344, 79146, 81119, 81180, 79491, 77531, 76720, 77072, 77516, 77328, 76685, 76017, 75630, 76044, 77874, 80980, 84253, 86603, 87791, 88212, 88464, 89314, 91322, 93978, 95749, 95546, 93835, 91989, 91060, 91481, 93203, 95416, 96791, 96973, 97439, 99885, 103946, 107478, 108997, 108876, 108164, 107389, 106874, 107137, 108143, 108763, 107726, 104988, 101800, 99653, 99248, 100036, 100553, 99761, 98348, 98094]
54920I8094J571K149J498J354K192K261L83j876k233p71N13N96K43K50M77P55
54904A07456J268J756J504O24J54L66K24q63j835j591q04q31j499j358J51K111
54888A06833L651M740N348N141M500M702O355Q396R343R079Q729R195J0366J1567
54874B07945J2234J2197J1548J0250P944M543Q96j800l487n353q028j0373j0775
54861B27741r225p383o797p598q851r484q949p444n713m461l922l935m100l838
54847A36041k810j483p45o92m40N32J643K378L287M864O274O437N851O012P291
54832A74440Q799J0169J1768J3069J2581J0126P498N788L593o58n699q621q633
54819B34220p805q023q915r236q891q638q673q619q474q617q916q593p199n292
$$ y = [98094, 99665, 101814, 103312, 104666, 106858, 109119, 109502, 107626, 105393, 104622, 105135, 105731, 105974, 106224, 106701, 107456, 108724, 110480, 111984, 112608, 112762, 113128, 113352, 112489, 110654, 109063, 108259, 107428, 105929, 104571, 104722, 106833, 110484, 115224, 120572, 125713, 130213, 134915, 141270, 149666, 159009, 168088, 176817, 186012, 196378, 207945, 220179, 232376, 243924, 254174, 262118, 266661, 267557, 265757, 262270, 256917, 248889, 238516, 227741, 218516, 211133, 204336, 196738, 187887, 178403, 169454, 162010, 156297, 151836, 147914, 143979, 139879, 136041, 133231, 131748, 131003, 130311, 129871, 130403, 132046, 134424, 137711, 142575, 148849, 155286, 161137, 167149, 174440, 183239, 193408, 205176, 218245, 230826, 240952, 248450, 254238, 257831, 257173, 251474, 242853, 234220, 226415, 218392, 209477, 200241, 191350, 182712, 174039, 165420, 156946, 148329, 139413, 130820, 123621, 118329]
54805A18329l954l769m391m889m523l294j855q46l69j41J9J22L03Q10J501J742
54789I4795J005m93j955k648k315j249k60k73j444k726k698r82J345K763K505
54774H5370R81o52j311r17m58q33j741k184j903j508j232n03Q37J876J824J118
54758G8764O64N72L98R5j48n21j098j079L27K374L221K144M09l06L34J463K266
54741H9879K634K963L551M001L441J708J02K25K049L976M846N029N354N899O416
54726A42073P150Q463J0033J1103J1406J1331J1284J1218J0828J0032R187Q688
54714B62796Q183O631L643L95j638k721m394o950q717q493p307o750o644n778
54700B22256m162k979k551j997j025n28r36j325q77j10K17N75J906L970N579O314
$$ y = [118329, 114375, 110606, 106215, 101326, 96803, 93509, 91654, 90808, 90439, 90298, 90317, 90439, 90742, 91552, 93053, 94795, 95800, 95307, 93352, 90704, 88389, 87140, 86880, 86607, 85163, 82437, 79739, 78757, 80102, 82865, 85370, 86351, 85699, 84388, 83471, 83013, 82180, 80439, 78255, 76352, 74844, 73612, 73109, 73946, 75822, 77646, 78764, 79428, 80000, 80398, 80493, 80345, 79824, 78726, 77647, 77974, 80348, 83569, 85713, 86122, 85816, 86150, 87613, 89879, 92513, 95476, 99027, 103028, 106469, 108177, 108279, 108504, 110553, 114529, 119375, 124404, 129758, 135657, 142073, 149223, 157686, 167719, 178822, 190228, 201559, 212843, 224061, 234889, 244921, 254108, 262796, 270979, 277610, 281253, 281648, 280010, 277289, 272895, 265945, 257228, 248735, 241428, 234678, 228034, 222256, 218094, 215115, 212564, 210567, 209542, 209014, 208078, 206753, 205876, 205766, 205983, 206558, 208464, 212434, 218013, 224327]
54684B24327O891P892R104J0336J1899J3845J5490J6324J6679J6866J6290J4311
54672C80254J1465Q723N798J529m000r086j2561j5058j7369j8729j8068j6046
54660B96852j4421j3755j3094j1753j0170q966q340q373q826q600o781m393l603
54647A75777m755n693m756k960k179k554l083l547m142m056k370n3Q45pr38r65
54631A34564r03j327j182L21J889J672o2j274q36L96J201J505J863K282K203J408
54615A43720N12M06J395K895M019M383M183L698L140K916L394M127M033K834J771
54600A87426K028K948K767J022q19j287m63P62J894K692K669J762R66J331K512
54585B08210L222K967K501K534K978L562M336N232N836O059O444P426Q786J0249
$$ y = [224327, 231218, 239110, 248214, 258550, 270449, 284294, 299784, 316108, 332787, 349653, 365943, 380254, 391719, 400442, 406240, 407769, 403769, 394683, 382122, 367064, 349695, 330966, 312898, 296852, 282431, 268676, 255582, 243829, 233659, 224693, 216353, 207980, 199154, 190554, 183773, 179380, 175777, 171022, 165329, 160573, 157613, 155434, 152880, 149797, 146250, 142108, 138052, 135682, 135629, 136474, 136467, 135529, 134564, 133661, 132334, 131152, 131473, 133362, 135034, 134972, 133698, 132862, 133258, 134459, 135964, 137827, 140109, 142312, 143720, 144232, 144638, 146033, 148928, 152947, 157330, 161513, 165211, 168351, 171267, 174661, 178788, 182821, 185655, 187426, 189454, 192402, 195169, 196191, 195372, 194085, 193622, 194384, 196278, 198970, 201639, 203401, 204367, 205698, 208210, 211432, 214399, 216900, 219434, 222412, 225974, 230310, 235542, 241378, 247437, 253881, 261307, 270093, 280342]
54571B80342J1971J4018J5777J6514J6205J5497J4999J4923J4903J3848J0606
54560D39603N352j18m115o667q892j1310j3587j5491j6961j7397j5966j2960j0074
54547C11417q905r541j0711j0994r875q081o938o994p495p481p020o747o659o303
54533A97673n843n776n737m785l063j944k182l070l830m616n433n305l627j507
54519A40955o98j542k865l503l149k131j202j172j966k331j365R5M74m05j242
54504A17953j202p50m40n4N58P42n7j230j667j105j82M92O62O4j239k158j291
54487A09096J073K590J477j039k044n90J258J305m5p38K51K175L833M543M136
54472A27281L073K416K835L629L605K745K174K526L441M554N900P141P549P107
$$ y = [280342, 292313, 306331, 322108, 338622, 354827, 370324, 385323, 400246, 415149, 428997, 439603, 444955, 444837, 440722, 434055, 425163, 413853, 400266, 384775, 367814, 350417, 334451, 321491, 311417, 302512, 292971, 282260, 271266, 261391, 253310, 246372, 239378, 231883, 224402, 217382, 210635, 203976, 197673, 191830, 186054, 180317, 175532, 172469, 170525, 168343, 165273, 161443, 156827, 151394, 146089, 142462, 140955, 140257, 138715, 135850, 132347, 129198, 127067, 125865, 124693, 122727, 120396, 119031, 119126, 119600, 119195, 117953, 116751, 116001, 115561, 115507, 116065, 116807, 116750, 115520, 113853, 112748, 112566, 113058, 113720, 113784, 112545, 110387, 109096, 110169, 112759, 114236, 113197, 111153, 110563, 111821, 113126, 113081, 112343, 112594, 114769, 118602, 123145, 127281, 130354, 132770, 135605, 139234, 142839, 145584, 147758, 150284, 153725, 158279, 164179, 171320, 178869, 185976]
54458A85976O724O865P006O733O508O580O056L830J67l339n152n029m173m226
54444B14526n700p403p930p359o669n943m525k783k121k951m147m854n287n378
54430A41476m436k829k157k710k708j178K26p3r57o72K4p61k582l040j226J440
54414A17837L449M330L741J618p55j556n38R85K017K338J641J2j154o73M12K70
54398A33974n94j52J447J810K75r40m69J58m61j106k81J053J154K36m67j094k508
54381A32035m219m873m208k940j418J04O71j72j001k28J325J459l1j024l02Q39
54365A16017P71l17j291j767j896j399K4J744K695K716K693L310M219M682M544
54350A36745M183L684K730J399N06O57J403J945K297K901L377K865J731J604L118
$$ y = [185976, 192700, 199565, 206571, 213304, 219812, 226392, 232448, 236278, 236445, 233106, 227954, 222925, 218752, 214526, 208826, 201423, 193493, 186134, 179465, 173522, 168997, 166214, 164093, 161142, 156995, 152141, 146854, 141476, 137040, 134211, 132054, 129344, 126636, 125458, 125684, 125611, 124654, 123982, 124006, 123245, 120663, 117623, 116397, 117837, 121286, 125616, 129357, 130975, 130220, 128664, 128126, 129111, 131128, 133466, 135107, 135119, 133965, 133292, 133704, 133974, 133380, 133228, 134675, 136485, 136760, 135820, 135351, 135509, 135048, 133942, 133661, 134714, 135868, 136104, 135637, 134543, 132035, 127816, 122943, 118735, 115795, 114377, 114481, 115152, 114980, 113979, 113751, 115076, 116535, 116504, 115480, 115178, 116017, 116788, 116471, 115180, 113413, 111517, 110118, 110142, 111886, 114581, 117297, 119990, 123300, 127519, 132201, 136745, 140928, 144612, 147342, 148741, 149247, 149904, 151307, 153252, 155549, 158450, 161827, 164692, 166423, 168027, 171145]
54335A71145M740M746L412K362K390K974L349L048J680o98l111m474m801m866
54321A81896m824m173k983k148k198k657k855k699k351j840j315j134j290j302
54307A48127j047j204k285l624l965k996j617o79q3N83J078Q47J46P8J311L259
54291A37929M774N234M656L257J551N07Q41K110L111L197K688K026J241L71k48
54276A73245m60n56p47q22o25m87p94j383j752j684j451j456j775k002j656q92
54260A54703n78j339k727l718l785l222k667k729l569m267l319p58J026n1k705
54245A20295l587j587R80J632K87j875m062n346m461j610Q18Q95m70j157q16n78
54229I9358p51n77K3J35p04j948k872l037k110k89J330J750J296R77R74O88J6
$$ y = [171145, 175885, 180631, 184043, 186405, 188795, 191769, 195118, 198166, 199846, 199148, 196037, 191563, 186762, 181896, 177072, 172899, 169916, 167768, 165570, 162913, 160058, 157359, 155008, 153168, 151853, 150719, 149429, 148127, 147080, 145876, 143591, 139967, 136002, 133006, 131389, 130710, 130627, 131210, 132288, 133135, 133281, 133359, 134670, 137929, 142703, 147937, 152593, 155850, 157401, 157908, 158749, 160859, 163970, 167167, 169855, 171881, 173122, 173493, 173245, 172785, 172229, 171482, 170660, 170035, 169548, 168754, 167371, 165619, 163935, 162484, 161028, 159253, 157251, 155595, 154703, 154125, 152786, 150059, 146341, 142556, 139334, 136667, 133938, 130369, 126102, 122783, 122025, 123051, 123000, 120295, 116708, 115121, 116101, 117733, 118020, 116145, 112083, 106737, 102276, 100666, 101484, 102379, 101909, 100752, 99936, 99358, 98607, 98030, 98053, 98188, 97484, 95536, 92664, 89627, 87517, 87228, 88558, 90308, 91604, 92581, 93555, 94243, 94259]
54212I4259l65P0J120K002J603o46l483m373k311P65K505K967L414L569K277K99
54196A03672j46J327K651K397J457J078J075Q00K43n62j803k883k608j155l21
54181A05222q88j243K32K645L679K405j12k167k470p55J624K540J480K82O33J828
54165A14935K203J680J395J462R01l37r82k30J193K005J528j47k209l358k907
54150A17132j738j418k265l129l009j915k30J602K563J614n89j714m75J524J819
54135A09772L23p79k65N34j82k111l277k530p38M29J85r67j990k213j735j137
54119I3319p80m15K95J128J515J384J237J421J798K139K185J288j084m097n720
54104I5613m907k879j491j067p67l87m61r66j293j429j777j878p43J205K039Q71
$$ y = [94259, 93894, 93964, 95084, 97086, 98689, 98043, 94560, 90187, 87876, 88641, 91146, 94113, 97527, 101096, 103373, 103672, 103526, 104853, 107504, 109901, 111358, 112436, 113511, 114311, 114554, 113992, 112189, 109306, 106698, 105543, 105222, 104334, 103091, 103323, 105968, 109647, 112052, 111940, 109773, 107303, 106548, 108172, 110712, 112192, 112474, 113107, 114935, 117138, 118818, 120213, 121675, 122576, 122239, 121257, 121027, 122220, 124225, 125753, 125606, 123397, 120039, 117132, 115394, 113976, 111711, 108582, 105573, 103658, 103428, 105030, 107593, 109207, 108618, 106904, 106429, 107953, 109772, 110095, 109316, 109051, 109585, 109403, 107292, 104015, 101485, 100747, 101176, 101361, 100394, 98404, 96191, 94456, 93319, 92539, 92124, 92419, 93547, 95062, 96446, 97683, 99104, 100902, 103041, 105226, 106514, 105430, 101333, 95613, 90706, 87827, 86336, 85269, 84502, 84115, 83654, 82688, 81395, 79966, 78189, 76311, 75568, 76773, 78812, 79683]
54088G9683p37p69P25J975J725J90j609k645k295p98Q10J653J780J675J359L92
54072H3114j378l324m134k580J092M549N166K869L96R0J293J673L70j317j928
54057H5951j330k47O97J165R98K88o17j326j614j488j115o39p0L64J22q33j349
54040G8957k43J795K620J305p80j947j959j147P00L175M356K869K42p10N30J909
54024I1672J931J171N53l5o75o00O45K190K903K782K594K722K917K722J875O55
54008A16022o3K74R40P64j51o29m12n68j400j534o5J663J818Q01P07K525N130
53991A25822O933P324O557N226M000L104K105Q93N38K130M869O554O168M841L943
53976A91007L469L025L188M640O522P015N633L952L779N212O846P395O820O042
$$ y = [79683, 78946, 78177, 78902, 80877, 82602, 82792, 81183, 78538, 76243, 75445, 76255, 77908, 79688, 81363, 82722, 83114, 81736, 78412, 74278, 71698, 72790, 77339, 82505, 85374, 85770, 85860, 87153, 88826, 89196, 87879, 85951, 84621, 84374, 85071, 86236, 87234, 87522, 86905, 85579, 83965, 82477, 81362, 80723, 80653, 81017, 81139, 80306, 78957, 78714, 80509, 83129, 84434, 83654, 81707, 79748, 78601, 79301, 82476, 86832, 89701, 89943, 89233, 89763, 91672, 93603, 94774, 95327, 95292, 94617, 94017, 94662, 96852, 99755, 102537, 105131, 107853, 110770, 113492, 115367, 116022, 115959, 116233, 117173, 117937, 117786, 117157, 116745, 116177, 114777, 113243, 113178, 114841, 116659, 117460, 118167, 120692, 125822, 132755, 140079, 146636, 151862, 155862, 158966, 161071, 161964, 162502, 164632, 169501, 176055, 182223, 187064, 191007, 194476, 197501, 200689, 205329, 211851, 218866, 224499, 228451, 232230, 237442, 244288, 251683, 258503, 264545]
53962B64545N741N542M525K617J000O52R00K66j379k530k252j616k219l979n414
53947B66399n589m876l976l262k992l136k895j582k61j168m732q269q735o080
53933B08846k788q43l94r08j907k463j520O76K498K803J989Q12o58k301l265l121
53917A97456k797l228l688k786p99M63J64o41q54q40j369k179k494k288k036j651
53901A70433p25L39N07m47j530j784j246l40Q63K154K718K041R91R69J976K546
53885A79465J889J091J519K845L633L469L358L981M740M917M921N570O779P622
53871B35799P506O581N231L822K892K899L609M216M206L734L065K227J486J643
53857B88916L327O125Q689R825R337P971O744O153N995N951O152O937P973Q110
$$ y = [264545, 270286, 275828, 280353, 282970, 283970, 284622, 285522, 285788, 284409, 281879, 279627, 278011, 275792, 271813, 266399, 260810, 255934, 251958, 248696, 245704, 242568, 239673, 238091, 237830, 236662, 231930, 223661, 214926, 208846, 206058, 205215, 204821, 203913, 202006, 199543, 198023, 198699, 201197, 204000, 205989, 206801, 206143, 203842, 200577, 197456, 194659, 191431, 187743, 184957, 184158, 184621, 184785, 184144, 183290, 182450, 181081, 178902, 176408, 174120, 172084, 170433, 169708, 170047, 170554, 170107, 168577, 166793, 165547, 165207, 166070, 168224, 170942, 172983, 173974, 174943, 176919, 179465, 181354, 182445, 183964, 186809, 190442, 193911, 197269, 201250, 205990, 210907, 215828, 221398, 228177, 235799, 243305, 249886, 255117, 258939, 261831, 264730, 268339, 272555, 276761, 280495, 283560, 285787, 287273, 288916, 292243, 298368, 307057, 316882, 326219, 334190, 340934, 347087, 353082, 359033, 365185, 372122, 380095, 388205]
53843C88205O432L254o0k135k408j386l92o19k101l685m359m233m056m243m788
53828C63426n655o531o665n826n135o010q265j0193j0549r587q057o316m821m330
53814B65486m895n470n288m958n390o260o420n499m200l284l014l343l913m042
53800A99510l413k628k541l308m539n883o715n921l091L30K286K240J146l19j975
53785A65179k918j989J32J047l34k375l182l000k941k733j423N29J692J786J807
53770A51277K098J906R85J79r2o75k226l756l592j450J092K240J714Q66J191K757
53754A54514M191M218L033J882J612J989K295K051J358Q62J383L079N105O459
53740A94031P057P508Q062Q356Q102P358O258N066M555N320O655O985N818M321
$$ y = [388205, 394637, 397891, 397831, 395696, 393288, 391902, 391510, 390891, 388790, 385105, 380746, 376513, 372457, 368214, 363426, 357771, 351240, 344575, 338749, 333614, 327604, 319339, 309146, 298597, 289010, 280953, 274637, 269816, 265486, 260591, 255121, 249833, 244875, 239485, 233225, 226805, 221306, 217106, 213822, 210808, 207465, 203552, 199510, 196097, 193469, 190928, 187620, 183081, 177198, 170483, 164562, 161471, 161801, 164087, 166327, 167473, 167154, 165179, 162261, 160272, 160404, 161451, 161117, 158742, 155560, 152560, 149619, 146886, 145463, 145992, 147684, 149470, 151277, 153375, 155281, 156266, 156445, 156353, 155678, 153452, 149696, 146104, 144654, 145746, 147986, 149700, 150566, 151757, 154514, 158705, 162923, 165956, 167838, 169450, 171439, 173734, 175785, 177143, 178005, 179388, 182467, 187572, 194031, 201088, 208596, 216658, 225014, 233116, 240474, 246732, 251798, 256353, 261673, 268328, 275313, 281131, 285452]
53726B85452L475K695J216k7M79K160K385k34l842n477m476k738k059k415k822
53711B73772k819k574k255j906j570j106k53P03Q00l87j840k217j725j852l135
53696B51636m242l800k324j610k660m794o559o911n773l966k536j879j536r64
53682B02082k35K29J55n86j955l327l637k577j226p88j091j056l69K28K22rP0
53665A86130M36P92J008J084J047J061J328J859K626L765N134N895N224L496K036
53650B22921J603J698J449O87j28m43L4J134K174K560K507K740L442M009L894
53635B50281L138K123J316J242K012K824K800K315K506L298L143J325n86n51J391
53620B78577L319L631K159k88k465l112j930j00R05R03O58M04k36j048j187n73
$$ y = [285452, 288927, 291622, 292838, 292811, 293290, 295450, 297835, 297601, 293759, 288282, 283806, 281068, 279009, 276594, 273772, 270953, 268379, 266124, 264218, 262648, 261542, 261289, 261992, 262792, 262405, 260565, 258348, 256623, 254771, 251636, 247394, 243594, 241270, 239660, 237000, 232206, 225647, 218736, 212963, 208997, 206461, 204582, 203046, 202082, 201847, 202076, 202231, 201645, 199690, 196363, 192726, 190149, 188923, 188135, 187044, 185988, 185619, 185847, 186069, 186060, 186130, 186566, 187358, 188366, 189450, 190497, 191558, 192886, 194745, 197371, 201136, 206270, 212165, 217389, 220885, 222921, 224524, 226222, 227671, 228358, 228230, 227787, 227821, 228955, 231129, 233689, 236196, 238936, 242378, 246387, 250281, 253419, 255542, 256858, 258100, 260112, 262936, 265736, 268051, 270557, 273855, 276998, 278323, 277737, 277186, 278577, 281896, 285527, 287686, 287398, 284933, 281821, 279891, 279791, 280696, 281599, 282257, 282661, 282425, 281377, 280190, 279617]
53604B79617j18j59K38J657K890K113p34l629m583l470j769r29j152j476r49K79
53588B67826J097P87K2R8J234K198J873P74M34J382K433K248J097M55J132K455
53572B87545L332L407K967K357J901J894K169K084J537J481K656M130M147K477
53558C24084R61J376L518N814P022O883N774M564M213M791N143M323L039K851
53544C84356M171N935P179P830P928P195N851M822M582M630M712N448O902P562
53530D69103O093L521K074K137J954N15r64j000J36J232J800J913J314j07j446
53515D88275j635q85l11k60j35J52k81j891l720m425l795k651j600n62M87J015
53499D67778P23L96J156K664L055J396n42k56K130M021L977L367L728M328L758
$$ y = [279617, 279499, 279340, 279578, 281235, 284125, 286238, 285504, 281875, 277292, 273822, 272053, 271124, 269972, 268496, 267547, 267826, 268923, 269710, 269732, 269830, 271064, 273262, 275135, 275909, 276343, 277725, 280158, 282406, 283503, 283958, 285090, 287545, 290877, 294284, 297251, 299608, 301509, 303403, 305572, 307656, 309193, 310674, 313330, 317460, 321607, 324084, 325045, 326421, 329939, 335753, 342775, 349658, 355432, 359996, 364209, 369000, 374143, 378466, 381505, 384356, 388527, 394462, 401641, 409471, 417399, 424594, 430445, 435267, 439849, 444479, 449191, 454639, 461541, 469103, 475196, 478717, 480791, 482928, 484882, 485397, 484433, 483433, 483569, 484801, 486601, 488514, 489828, 489721, 488275, 486640, 485755, 485444, 485184, 485049, 485201, 484920, 483029, 479309, 474884, 471089, 468438, 466838, 466276, 466763, 467778, 468501, 468897, 470053, 472717, 475772, 477168, 476626, 476370, 478500, 482521, 486498, 489865, 493593, 497921, 501679]
53484E01679K521K132K558K611K398L264N274O768O909O840P660Q801R340R522
53470E78277R925J0282J0225J0291J1067J2045J2501J2902J4204J6075J7146J7044
53458G31984J7076J8456K0616K1828K1270J9972J9700K1097K3181K4705K5555
53447I65440K6455K7642K8723K9704L1246L3504L5482L6120L5542L4760L4437
53436A319055L4388L4077L3372L2881L3371L4634L5277L4237L2311L1244L1569
53425A686416L2328L2791L3104L3164L2385L1087L0571L1068L1034K9437K7493
53414B030878K6908K7514K7836K7035K5104K2099J8544J5724J4184J2713J0151
53403B258690P295N509M311K227p12l325n601q474j1606j3630j4734j6533j9085
$$ y = [501679, 504200, 506332, 508890, 511501, 513899, 517163, 522437, 529205, 536114, 542954, 550614, 559415, 568755, 578277, 588202, 598484, 608709, 619000, 630067, 642112, 654613, 667515, 681719, 697794, 714940, 731984, 749060, 767516, 788132, 809960, 831230, 851202, 870902, 891999, 915180, 939885, 965440, 991895, 1019537, 1048260, 1077964, 1109210, 1142714, 1178196, 1214316, 1249858, 1284618, 1319055, 1353443, 1387520, 1420892, 1453773, 1487144, 1521778, 1557055, 1591292, 1623603, 1654847, 1686416, 1718744, 1751535, 1784639, 1817803, 1850188, 1881275, 1911846, 1942914, 1973948, 2003385, 2030878, 2057786, 2085300, 2113136, 2140171, 2165275, 2187374, 2205918, 2221642, 2235826, 2248539, 2258690, 2265985, 2271494, 2275805, 2278032, 2277320, 2273995, 2268394, 2259920, 2248314, 2234684, 2219950, 2203417, 2184332]
53390B184332k0378j9618j8747j9594k1468k2883k3893k5083k5839k5479k5017
53379A936333k5816k7144k6927k4706k2244k1083k0872k0359j8991j7075j5048
53368A696068j2968j0558p725n052l419k892k468j303M00K169M180O652R007J0603
53354A682694J1934J4064J7127K0216K2689K4605K5970K6623K7026K8194L0442
53343A931584L2939L4929L6825L9441M2660M5484M7382M8969N1220N4312N7515
53332B423260O0136O2160O3812O4905O5167O5170O6111O8258P0174P0168O8347
53321C147668O6512O6090O6678O6775O5427O2841N9763N6707N3730N0615M6991
53310C809797M2493L7088L1337K5972K1062J5837R627K704m164j0615j6684k2208
$$ y = [2184332, 2163954, 2144336, 2125589, 2105995, 2084527, 2061644, 2037751, 2012668, 1986829, 1961350, 1936333, 1910517, 1883373, 1856446, 1831740, 1809496, 1788413, 1767541, 1747182, 1728191, 1711116, 1696068, 1683100, 1672542, 1664817, 1659765, 1656346, 1653454, 1650986, 1649683, 1650083, 1652252, 1656432, 1663084, 1672091, 1682694, 1694628, 1708692, 1725819, 1746035, 1768724, 1793329, 1819299, 1845922, 1872948, 1901142, 1931584, 1964523, 1999452, 2036277, 2075718, 2118378, 2163862, 2211244, 2260213, 2311433, 2365745, 2423260, 2483396, 2545556, 2609368, 2674273, 2739440, 2804610, 2870721, 2938979, 3009153, 3079321, 3147668, 3214180, 3280270, 3346948, 3413723, 3479150, 3541991, 3601754, 3658461, 3712191, 3762806, 3809797, 3852290, 3889378, 3920715, 3946687, 3967749, 3983586, 3993213, 3995917, 3991753, 3981138, 3964454, 3942246]
53298C942246k7046l1715l6922m2352m6932n0392n3604n6949n9548o0759o1455
53287C414572o2736o4202o4751o4518o4671o5435o5539o3899o0888n7782n5633
53276B724518n4844n5098n5424n4881n3274n0874m7688m3757l9953l7509l6525
53265B194691l5849l4607l2967l1166k8854k5971k3385k1762k0475j8657j6905
53254A904093j6772j8420j9782j8745j5614j2784j1872j1970j1098q854o585n054
53242A746543l218j50L009M439M435N132P457J0069J1742J3127J5212J7500J8992
53229A854289J9953K1254K2794K4011K5342K7590L0178L1741L2347L3344L4776
53218B157619L4676L1794K7492K3949K1539J9168J6272J3178J0005O583L305R11
$$ y = [3942246, 3915200, 3883485, 3846563, 3804211, 3757279, 3706887, 3653283, 3596334, 3536786, 3476027, 3414572, 3351836, 3287634, 3222883, 3158365, 3093694, 3028259, 2962720, 2898821, 2837933, 2780151, 2724518, 2669674, 2614576, 2559152, 2504271, 2450997, 2400123, 2352435, 2308678, 2268725, 2231216, 2194691, 2158842, 2124235, 2091268, 2060102, 2031248, 2005277, 1981892, 1960130, 1939655, 1920998, 1904093, 1887321, 1868901, 1849119, 1830374, 1814760, 1801976, 1790104, 1778134, 1767036, 1758182, 1751597, 1746543, 1743325, 1743175, 1746184, 1750623, 1755058, 1760190, 1767647, 1777716, 1789458, 1802585, 1817797, 1835297, 1854289, 1874242, 1895496, 1918290, 1942301, 1967643, 1995233, 2025411, 2057152, 2089499, 2122843, 2157619, 2192295, 2224089, 2251581, 2275530, 2297069, 2316237, 2332509, 2345687, 2355692, 2362275, 2365580, 2366491]
53206B366491p48k778n833r207j1707j3022j4134j6555k0981k6309l0186l1139
53194B183892l0153k9535l0366l1747l2601l3272l4744l6998l8861l9319l8411
53183A807885l6889l5521l4674l4220l3637l2497l0993k9915k9854l0453l0537
53172A448695k9226k6921k4997k4328k4344k3697k1773j9185j6995j5812j5569
53161A205848j5619j5011j3191j0712q847q206q188q046q059r118j1394j3967
53149A075490j5777j6590j6922j7279j7566j7302j6350j5231j4406j3475j1725
53138I02867r468q045q129q836r073r088r761j0952j1614j1352j0792j0469j0332
53125G74956j0393j0872j1423j1300j0561j0170j0391j0164q848p592p935r644
$$ y = [2366491, 2365743, 2362965, 2357132, 2347925, 2336218, 2323196, 2309062, 2292507, 2271526, 2245217, 2215031, 2183892, 2153739, 2124204, 2093838, 2062091, 2029490, 1996218, 1961474, 1924476, 1885615, 1846296, 1807885, 1770996, 1735475, 1700801, 1666581, 1632944, 1600447, 1569454, 1539539, 1509685, 1479232, 1448695, 1419469, 1392548, 1367551, 1343223, 1318879, 1295182, 1273409, 1254224, 1237229, 1221417, 1205848, 1190229, 1175218, 1162027, 1151315, 1142468, 1134262, 1126074, 1118028, 1109969, 1100851, 1089457, 1075490, 1059713, 1043123, 1026201, 1008922, 991356, 974054, 957704, 942473, 928067, 914592, 902867, 893399, 885354, 877225, 868389, 859316, 850228, 840467, 829515, 817901, 806549, 795757, 785288, 774956, 764563, 753691, 742268, 730968, 720407, 710237, 699846, 689682, 680834, 673242, 665307, 655663]
53113F55663j1056j1148j0198q758p223o408p146q884r735q551o267m548l892
53100E51849l682l416l018k453k007k659n050q063r543q773p245o529o349n593
53086D77469m421m017m597m926m171l162l206m359n514n822n455n178n513o178
53072D10950o098m360j541L38j92k345l996m150l719l862m469m620l949k928k200
53057C62859k070k485l021l067k460j897k383m093o020o848o071m283k548j648
53043C13965j720k390l090l346l027k443k163k526l247l569k979j795r44r55j302
53028B78469j112n37p91k347l702k950m68J189M07j493k121r93M08Q56M65k46
53012B65034j084j697j450k58J004J468J222J020J336J979K400K295K029K337
$$ y = [655663, 644607, 633459, 623261, 614503, 607280, 600872, 593726, 584842, 575107, 566556, 560289, 555741, 551849, 548167, 544751, 541733, 539280, 537273, 534614, 529564, 521501, 511958, 503185, 495940, 489411, 483062, 477469, 473048, 469031, 464434, 459508, 455337, 452175, 448969, 444610, 439096, 433274, 427819, 422641, 417128, 410950, 404852, 400492, 398951, 399289, 399097, 396752, 392756, 388606, 384887, 381025, 376556, 371936, 367987, 365059, 362859, 360789, 358304, 355283, 352216, 349756, 347859, 345476, 341383, 335363, 328515, 322444, 318161, 315613, 313965, 312245, 309855, 306765, 303419, 300392, 297949, 295786, 293260, 290013, 286444, 283465, 281670, 280726, 279771, 278469, 277357, 276820, 276029, 273682, 269980, 267030, 266562, 267751, 268158, 266665, 264544, 263551, 263959, 264815, 265280, 265034, 263950, 262253, 260803, 260545, 261549, 263017, 264239, 265259, 266595, 268574, 270974, 273269, 275298, 277635]
52998B77635L311L972L357J785M07k84o76q58m08M33L85j333l788n332n378m704
52982B68524m266m248m155l591k967l236m537n526m858l152k300k794l129k347
52968B17418j625k382m051n126n464n966o449n563l007l76P24M68J94N67R83N96
52952A80941n24j473j659j492j492j187J44J731J683m14k623l213k713k360j861
52937A63488m28J046J012k3j2J378K252J555N83P01J417J762K008K675L056K129
52921A84599J47j790l102l696l338k218j437j782k352j637K81J803K011J654J717
52906A70860K054J921J230O59P57J301J616J383J061J306K046K398J699L13q00
52891A89804j029l97P30J895K673K811K228J016k36m04J064K954L311K023J249
$$ y = [277635, 280946, 284918, 288275, 290060, 290467, 290183, 289507, 288649, 288241, 288674, 289059, 287726, 283938, 278606, 273228, 268524, 264258, 260010, 255855, 252264, 249297, 246061, 241524, 235998, 231140, 227988, 225688, 222894, 219765, 217418, 215793, 213411, 209360, 204234, 198770, 192804, 186355, 180792, 177785, 177409, 178133, 178601, 178795, 179362, 180345, 180941, 180417, 178944, 177285, 175793, 174301, 173114, 173258, 174989, 176672, 176258, 173635, 170422, 167709, 165349, 163488, 163060, 164106, 165118, 165095, 165083, 166461, 168713, 170268, 170851, 171552, 172969, 174731, 176739, 179414, 182470, 184599, 184746, 182956, 179854, 176158, 172820, 170602, 169165, 167383, 165031, 163394, 163675, 165478, 167489, 169143, 170860, 172914, 174835, 176065, 176724, 177481, 178782, 180398, 181781, 182842, 184148, 186194, 188592, 190291, 190604, 189804, 188775, 188378, 189108, 191003, 193676, 196487, 198715, 199731, 199495, 199091, 200155, 203109, 206420, 208443, 209692]
52876B09692K446M085L605J029r39l15K067M030M389L434K191J821K981M965O006
52861B51487N007K814J298J474K833M246N015N203N236N365N339M764L722K862
52847C06665K699K989K965K192J041L51N10R51P29l48j536k221k668l198l286
52832C07835k300q23j00k76l98m01j564m262o600o514m436k390j137J55J611K004
52816B80404P92p61j437j698k443l204k867j488j3J276K657L459K385l46k628
52801B74088k889j825j015q05n51j10J10J73N06Q83M96q06k132k488j548M29K720
52784B65236M196M108K991K072J664J021o4o02P5J010Q33m35j684k343k654k580
52768B72844j696l88K9r94k192j961m63O03K85m53k03Q62J213Q1j507k260k426
$$ y = [209692, 212138, 216223, 219828, 220857, 219918, 219603, 221670, 225700, 230089, 233523, 235714, 237535, 240516, 245481, 251487, 256494, 259308, 260606, 262080, 264913, 269159, 274174, 279377, 284613, 289978, 295317, 300081, 303803, 306665, 309364, 312353, 315318, 317510, 318551, 318902, 319412, 320363, 321092, 320744, 319208, 316987, 314319, 311121, 307835, 305535, 304712, 304612, 304336, 303938, 303537, 301973, 297711, 291111, 284597, 280161, 277771, 276634, 276789, 278400, 280404, 281196, 280435, 278998, 277300, 274857, 271653, 268786, 267298, 267285, 268561, 271218, 274677, 277062, 276716, 274088, 271199, 269374, 268359, 267554, 267003, 266893, 267003, 267176, 267682, 268565, 269061, 268255, 266123, 263635, 262087, 262516, 265236, 269432, 273540, 276531, 278603, 280267, 281288, 281224, 280622, 280697, 281707, 282540, 282105, 280421, 278078, 275424, 272844, 271148, 270760, 270789, 269795, 267603, 265642, 265179, 265782, 266067, 265614, 265411, 266273, 267486, 267567, 266060, 263800, 261374]
52751B61374l252m858n727m626k127J86J365J416O56l31n83L15J333R91n07j133
52735B44492M81L142M401L420J782J400K251K675J661J28m60k43p40k432l764
52720B58194l301j941j727k981m080m009l564l646l848l578l372l906m524m059
52706B09658k737k040k733l916m161k882p04R52Q28r20k584k717j870j719k759
52691A79696l967m610n054n472n065l385j451o95j294k289k882k939k579j927
52677A36087j134k71N68R12K54r58j475r09m25j076k255k705k334j839j143L47
52661A21644K138K861K177J203P99N96J26l95q40j649k814l366k682j498q88q73
52645A16539q55p40q16r17o31r5J40j16n60q88r29n76j8K58J31K10R90J968K141
$$ y = [261374, 258122, 253264, 247537, 242911, 240784, 240970, 242335, 243751, 244407, 244076, 243493, 243808, 245141, 246132, 245625, 244492, 244973, 248115, 252516, 255936, 257718, 259118, 261369, 264044, 265705, 265833, 265373, 265130, 264390, 261958, 258194, 254893, 252952, 251225, 248244, 244164, 240155, 236591, 232945, 229097, 225519, 222147, 218241, 213717, 209658, 206921, 204881, 202148, 198232, 194071, 191189, 190485, 191437, 192265, 191345, 188761, 186044, 184174, 182455, 179696, 175729, 171119, 166065, 160593, 155528, 152143, 150692, 149997, 148703, 146414, 143532, 140593, 138014, 136087, 134953, 134682, 135250, 136162, 136416, 135458, 133983, 133074, 132649, 131573, 129318, 126613, 124279, 122440, 121297, 121644, 123782, 126643, 128820, 130023, 130822, 131418, 131544, 131149, 130309, 128660, 125846, 122480, 119798, 118300, 117412, 116539, 115684, 114944, 114128, 113211, 112580, 112485, 112625, 112509, 111949, 111061, 110132, 109556, 109538, 109796, 109927, 110137, 111127, 113095, 115236]
52626A15236J267K27J50J324K684K553N20j411p29K355M743M314K423J501J555
52611A38712R04o78j734j595r37mJ524K734J912m83j573J1J967J597l76j233k08
52594A40540J071J506J647J936J859J257R48J332J604J082M30P21J953L175L748
52579A64809L736L412L040L019L530L973L382J691J09k51K38K28p76j882k214
52564A86044k161k652l660m183l540k148j031j015k178l629l997k793j186o52
52550A51219r87o66Q31K133J938Q29L14O65P56k28j672k278j459J38J295J394
52534A54222R25Q21J333J812J552N57n08q21p8J039J315L71p78j089q11n73O9
52517A59358J761L509L553K085J165J585J932J360J120K044K628J458j58j19J168
$$ y = [115236, 116503, 116730, 116880, 118204, 120888, 123441, 123961, 122550, 121821, 124176, 128919, 133233, 135656, 137157, 138712, 139616, 138938, 137204, 135609, 134672, 134668, 136192, 138926, 140838, 140355, 138782, 138793, 140760, 142357, 141981, 140748, 140540, 141611, 143117, 144764, 146700, 148559, 149816, 150764, 152096, 153700, 154782, 155212, 155933, 157886, 161061, 164809, 168545, 171957, 174997, 178016, 181546, 185519, 188901, 190592, 190701, 190450, 190688, 190916, 190140, 188258, 186044, 183883, 181231, 177571, 173388, 169848, 167700, 166669, 165654, 163476, 159847, 155850, 153057, 151871, 151219, 150232, 149566, 150397, 152530, 154468, 155297, 155611, 156276, 157032, 156804, 155132, 152854, 151395, 151533, 152828, 154222, 155147, 155968, 157301, 159113, 160665, 161222, 160714, 159893, 159815, 160854, 162169, 162540, 161762, 160673, 159862, 159289, 159358, 161119, 164628, 168181, 170266, 171431, 173016, 174948, 176308, 177428, 179472, 182100, 183558, 183400, 183281, 184449]
52502A84449J646Q75K32L72P26J222K284L235K750J176M43J276K248J972P57l67
52486B05296p56k9J656K889K198L37l14Q44J740Q34o55r58m53n04r06k52J738
52469B12705L813M820M626L715K700K034J580Q22j19m14J41P31R38J458K519K911
52453B44980J792K77l03o99k436m771n139k617P56K535K231Q25p20j759j874j295
52437B31783q76j089j430j109Q6J668K779K640J281k23p70m32q8j33k58l79o74
52420B32776p46J55J769K730K290J272Q26J082J584K211K830K719J346n69j578
52405B50697j106P5Q75R27O59P06J235J640J142q5q43l47O64R13L22q8N8j39j307
52386B55998k432j855O24L257M166L182J716J066J202J184M86m49r20r10r50j183
$$ y = [184449, 186095, 186970, 187202, 187574, 188300, 189522, 191806, 195041, 197791, 198967, 199410, 200686, 202934, 204906, 205663, 205296, 204540, 204511, 206167, 209056, 211254, 211591, 211277, 212121, 213861, 214695, 214040, 213082, 212629, 212125, 211219, 210967, 212705, 216518, 221338, 225964, 229679, 232379, 234413, 235993, 236815, 236696, 236282, 236423, 237154, 238092, 239550, 242069, 244980, 246772, 247049, 246746, 246047, 243611, 238840, 233701, 231084, 231840, 234375, 236606, 237431, 236711, 234952, 233078, 231783, 230907, 229818, 228388, 227279, 227365, 229033, 231812, 234452, 235733, 235510, 234740, 234308, 234220, 234087, 233829, 233450, 232776, 232030, 232185, 233954, 236684, 238974, 240246, 241072, 242154, 243738, 245949, 248779, 251498, 252844, 252275, 250697, 249591, 249666, 250541, 251468, 252127, 252833, 254068, 255708, 256850, 256765, 255922, 255575, 256239, 257152, 257474, 257386, 257444, 257305, 255998, 253566, 251711, 252335, 255592, 259758, 262940, 264656, 265722, 266924, 268108, 268594, 268145, 267225, 266315, 265365, 264182]
52370B64182j108l99M10N81K59K88Q61R41m43k671l904l003p43J014J100Rp17
52353B56657L4J823L071K666R90q02k142l117l457k483l06J770K636K519K219
52338B62078J811R03j89n79p5M71L35j70k11N55J685K411K262J512J075J646K901
52321B78421L802L753L179K898L156L391K827J364o6l16N68J227P46P6Q50K986
52305C08862M538M081K270O16l00p25o98k0J203K706M505O376P294O322M098K493
52289C53621K603L753M629M662M006K863J516O47R19K270L962N310O137O572O759
52274D10229O738O437N743M778L998L862M379N121N719O188O761P530Q354R143
52260D94980J0161J1761J3655J4684J3938J2248J1873J4135J7714K0051K0225
$$ y = [264182, 263074, 262675, 263085, 263666, 263925, 264213, 265074, 266015, 265572, 262901, 258997, 255994, 255251, 256265, 257365, 257374, 256657, 256691, 258514, 261585, 264251, 265241, 264439, 262297, 259180, 255723, 253240, 252934, 254704, 257340, 259859, 262078, 263889, 264792, 264603, 264024, 263949, 264420, 264755, 264585, 264374, 264929, 266614, 269025, 271287, 272799, 273874, 275520, 278421, 282223, 285976, 289155, 292053, 295209, 298600, 301427, 302791, 302725, 302409, 302977, 304204, 304950, 305026, 305876, 308862, 313400, 317481, 319751, 320367, 320067, 319342, 318644, 318624, 319827, 322533, 327038, 333414, 340708, 347030, 351128, 353621, 356224, 359977, 364606, 369268, 373274, 376137, 377653, 378300, 379219, 381489, 385451, 390761, 396898, 403470, 410229, 416967, 423404, 429147, 433925, 437923, 441785, 446164, 451285, 457004, 463192, 469953, 477483, 485837, 494980, 505141, 516902, 530557, 545241, 559179, 571427, 583300, 597435, 615149, 635200, 655425]
52249F55425J9639J9851K0782K1592K2332K3783K5952K7790K8415K7947K7059
52238I20567K6315K6024K6149K6198K5656K4679K3805K2963K1480J9332J7599
52227A180767J7031J6839J5732J3736J1974J0797R186O412L359J556J274J292
52215A289955M20j291k897l678l631l224k953l086l450l443k588j354r88j944
52201A255848k767j356K407O161P712P607Q148J0334J2863J4216J4567J5057J6068
52188A366865J7066J7669J7961J7903J7284J6359J5778J5647J5264J4135J2711
52177A544642J1548J0249P925M520R81j839l738m725n001n527p542j0753j3002
52164A527738j2863j1896j2847j5874j8197j7830j6027j5174j5628j5919j5265
$$ y = [655425, 675064, 694915, 715697, 737289, 759621, 783404, 809356, 837146, 865561, 893508, 920567, 946882, 972906, 999055, 1025253, 1050909, 1075588, 1099393, 1122356, 1143836, 1163168, 1180767, 1197798, 1214637, 1230369, 1244105, 1256079, 1266876, 1276062, 1282474, 1285833, 1287389, 1288663, 1289955, 1290375, 1289084, 1286187, 1282509, 1278878, 1275654, 1272701, 1269615, 1266165, 1262722, 1260134, 1258780, 1257792, 1255848, 1253081, 1251725, 1254132, 1260293, 1268005, 1275612, 1283760, 1294094, 1306957, 1321173, 1335740, 1350797, 1366865, 1383931, 1401600, 1419561, 1437464, 1454748, 1471107, 1486885, 1502532, 1517796, 1531931, 1544642, 1556190, 1566439, 1574364, 1578884, 1579865, 1578026, 1574288, 1569563, 1564562, 1559035, 1551493, 1540740, 1527738, 1514875, 1502979, 1490132, 1474258, 1456061, 1438231, 1422204, 1407030, 1391402, 1375483, 1360218]
52153A360218j4424j4260j4732j5299j5466j4827j3423j1934j0888r765p880n931
52141A211389n478o646p634p041n592m697m252l068r76O85P14o59k205k949k908
52126A158683k931l645m341l502r94R62J51k520l739j927O54P44k013n094o432
52111A124056o395o464p121p576p052n761m652m386m615m439l690l270l809m429
52097A050397l732j837m69q42k421m051n276n927n491l947k530k502l485m121
52083A003766m070m002l872k696m31J366J497O29J15K36M24M09K54j28n51j83
52067I92763J407L245M017L904M255N541O691O735O263O750Q840J1599J3462J4005
52053A089477J4654J7130K1032K3927K4402K3989K4886K6787K7601K6888K6524
$$ y = [1360218, 1345794, 1331534, 1316802, 1301503, 1286037, 1271210, 1257787, 1245853, 1234965, 1225200, 1217320, 1211389, 1205911, 1199265, 1191631, 1184590, 1178998, 1174301, 1170049, 1166981, 1166005, 1166690, 1167404, 1166745, 1164540, 1161591, 1158683, 1155752, 1152107, 1147766, 1144264, 1143270, 1144232, 1144383, 1141863, 1138124, 1136197, 1136851, 1137595, 1135582, 1130488, 1124056, 1117661, 1111197, 1104076, 1096500, 1089448, 1083687, 1079035, 1074649, 1070034, 1065595, 1061905, 1058635, 1054826, 1050397, 1046665, 1044828, 1044359, 1043517, 1041096, 1037045, 1031769, 1025842, 1020351, 1016404, 1013874, 1011372, 1007887, 1003766, 999696, 995694, 991822, 989126, 988695, 990061, 991558, 992187, 992302, 992538, 992962, 993371, 993625, 993497, 992946, 992763, 994170, 997415, 1001432, 1005336, 1009591, 1015132, 1021823, 1028558, 1034821, 1041571, 1050411, 1062010, 1075472, 1089477, 1104131, 1121261, 1142293, 1166220, 1190622, 1214611, 1239497, 1266284, 1293885, 1320773, 1347297]
52042A347297K7750K9521L0456L0817L1422L1809L0792K8237K5239K2911K1629
52031A657880K1000K0062J7969J4958J2038R446O306K377j065k978m169o010q421
52018A739393j0366j1606j2440j2396j0981r477j0019j2606j4704j4396j2451
52007A607951j0648r519q643p935p305n876k906Q61L808N242N684N667N285M964
51993A586630N603P554J0052J2049J3191J3670J3535J2719J1626J1037J1171J1040
51981A719877R369O143K842P61m85k219m789p167q584r582j1011j2722j4042j5142
51967A653249j6957j9769k2620k4342k4680k4179k3542k3322k3849k5099k6695
51956A398195k8264k9603l0402l0163k8737k6773k5302k4859k5219k5963k6979
$$ y = [1347297, 1375047, 1404568, 1435024, 1465841, 1497263, 1529072, 1559864, 1588101, 1613340, 1636251, 1657880, 1678880, 1698942, 1716911, 1731869, 1743907, 1753353, 1759659, 1762036, 1760971, 1757993, 1753824, 1747814, 1739393, 1729027, 1717421, 1704981, 1692585, 1681604, 1672127, 1662108, 1649502, 1634798, 1620402, 1607951, 1597303, 1587784, 1579141, 1571206, 1563901, 1558025, 1555119, 1555980, 1559788, 1565030, 1570714, 1576381, 1581666, 1586630, 1592233, 1599787, 1609839, 1621888, 1635079, 1648749, 1662284, 1675003, 1686629, 1697666, 1708837, 1719877, 1729246, 1735389, 1738231, 1738992, 1738507, 1736288, 1731499, 1724332, 1715748, 1706166, 1695155, 1682433, 1668391, 1653249, 1636292, 1616523, 1593903, 1569561, 1544881, 1520702, 1497160, 1473838, 1449989, 1424890, 1398195, 1369931, 1340328, 1309926, 1279763, 1251026, 1224253, 1198951, 1174092, 1148873, 1122910, 1095931]
51945A095931k8249k9319k9287k7523k4476k1639k0468k1160k2539k3291k3200
51934H24780k3046k3399k3862k3600k2394k0966k0280k0604k1254k1236k0205
51923E83934j8713j7526j6806j6229j5652j5166j4421j2679r974p661p040p728
51911D24339q251q090q166r030r611q556o197m312m150n383o822p490o954n395
51897C25932l652k746k988l712m088l915l477k914k064r38r5k48j375k382k025
51882B89313l68J090J065o5r22q83m96l46m13o83j425k407k594j449RJ80j254
51865B78352l130m333m785m922m892m529l779k901k432k844l916m605m068k795
51851B24421k099k454l049l135l007l072k862j739j95N93L40j88n23j052j939
$$ y = [1095931, 1067682, 1038363, 1009076, 981553, 957077, 935438, 914970, 893810, 871271, 847980, 824780, 801734, 778335, 754473, 730873, 708479, 687513, 667233, 646629, 625375, 604139, 583934, 565221, 547695, 530889, 514660, 499008, 483842, 469421, 456742, 446768, 439107, 432067, 424339, 416088, 407998, 399832, 390802, 381191, 372635, 366438, 362126, 357976, 352593, 345771, 338281, 331327, 325932, 322280, 319534, 316546, 312834, 308746, 304831, 301354, 298440, 296376, 295438, 295343, 295095, 293720, 291338, 289313, 288945, 290035, 291100, 291035, 290113, 289230, 288734, 288388, 287975, 287292, 285867, 283460, 280866, 279417, 279426, 279606, 278352, 275222, 270889, 266104, 261182, 256290, 251761, 247982, 245081, 242649, 239805, 235889, 231284, 227216, 224421, 222322, 219868, 216819, 213684, 210677, 207605, 204743, 203004, 202809, 203402, 203742, 203554, 203031, 201979, 200040]
51836B00040k440j871p41j56n02j178j409q48L25J374J332k1j661k354k016j359
51820A86515m39J266L221L598J529j315k499j648l74J61L14N77O35L33L10Q55
51804A93039J120M64k37K17J333J616R89R38K127L357L551L244L126K445L14k218
51788B15425l078j871k06O97J152J664J875J495J023Q01L68m83r29l11P32J212
51772B19566J186J266J330R74O30R31J355Q85q7jJ511K905K804J570K28r65k071
51755B34017k579j988p40K84P80Q98N18n01j733k531k775k691k252j399n76l24
51739B16408m67l83j9ko03j203j021n3R38J289J099J016J339J588J330J076J546
51722B23878K125J276j046k604j528J150K805K459J415J061J449K008K275J792
$$ y = [200040, 197600, 195729, 194988, 194832, 194330, 193152, 191743, 190895, 191220, 192594, 193926, 193905, 192244, 189890, 187874, 186515, 186076, 187342, 190563, 194161, 195690, 194375, 191876, 190228, 189854, 190015, 190329, 190906, 191541, 191874, 192184, 193039, 194159, 194623, 194386, 194603, 195936, 197552, 198541, 199479, 201606, 204963, 208514, 211758, 214884, 217329, 217643, 215425, 212347, 210476, 210270, 210967, 212119, 213783, 215658, 217153, 218176, 218977, 219345, 218862, 217933, 217622, 218354, 219566, 220752, 222018, 223348, 224322, 224952, 225883, 227238, 228123, 228036, 228035, 229546, 232451, 235255, 236825, 237053, 236088, 234017, 231438, 229450, 228710, 228994, 229774, 230672, 231190, 230689, 228956, 226425, 223650, 220959, 218707, 217308, 216732, 216408, 215941, 215558, 215539, 215537, 214934, 213731, 212710, 212657, 213595, 214884, 215983, 216999, 218338, 219926, 221256, 222332, 223878, 226003, 227279, 226233, 223629, 222101, 223251, 226056, 228515, 229930, 230991, 232440, 234448, 236723, 238515]
51708B38515M89n82q5J701K993K851K215K110K142J636J125J542K640L367L355
51693B66014L096K986L112L695M897O386P750Q970R866R595P688N210L688L197
51679C46150K667J923J966K872L075J532n46j243m71J54m59j841k987l382k980
51664C46430j968p91J02O45R41P90j0r32j139p11n76r34o88Q66K618K892J658
51647C49193M31K65R35J977L206L984L356J601M85J059K196K327J796K084L399
51632C78294M580N193N988P163P790P557P544Q523R689J0042R842R589Q650O290
51618D86734L406J701J463J505J119O47J78q65k419l367l023k098j609j656j861
51603D79855k207k776l218l235l127l261l405l066k236j321p67j044k422m256
$$ y = [238515, 239004, 238422, 238337, 240038, 243031, 245882, 248097, 250207, 252349, 253985, 255110, 256652, 259292, 262659, 266014, 269110, 272096, 275208, 278903, 283800, 290186, 297936, 306906, 316772, 326367, 334055, 339265, 342953, 346150, 348817, 350740, 352706, 355578, 358653, 360185, 359639, 358396, 357925, 358079, 357620, 355779, 352792, 349410, 346430, 344462, 343671, 343773, 344418, 345359, 346149, 346139, 345207, 344068, 343357, 342781, 341847, 341159, 342025, 344643, 347535, 349193, 349624, 349889, 350824, 352801, 356007, 359991, 363347, 364948, 365433, 366492, 368688, 371015, 372811, 374895, 378294, 382874, 388067, 394055, 401218, 409008, 416565, 424109, 432632, 442321, 452363, 462205, 471794, 480444, 486734, 490140, 491841, 493304, 494809, 495928, 496575, 496753, 495888, 493469, 490102, 487079, 484981, 483372, 481716, 479855, 477648, 474872, 471654, 468419, 465292, 462031, 458626, 455560, 453324, 452003, 451236, 450192, 447770, 443514]
51589D43514n200m762l982l855l844l076k240k697m038m263k716j090r03j479
51575C99369j412p90o60j231j979k825l876m417l619k053j148j211j378j490k338
51560C68942l763m234l128j852j603j456j26J476J312o80k426k525j592o91q4
51545C47570Q9n49j576j608m4J970L115L514L872M016L410K456K032K161K290
51530C72718K556L422M207L444J110q05o66P25J279K48j209j761j396r97j117
51515C81758j512j786k086k883m030m565l808k349j327r10k32J060K113K138J629
51500C63210J579J987K010J428J070J586K462K659J899R27N77Q44R18J56j150
51485C82162k157k543k810l304l427k376m79R41J161Q46R97J612J897J469P38
$$ y = [443514, 438314, 433552, 429570, 425715, 421871, 418795, 416555, 413858, 409820, 405557, 402841, 401751, 400848, 399369, 397957, 397167, 396507, 395276, 393297, 390472, 386596, 382179, 378560, 376507, 375359, 374148, 372770, 371280, 368942, 365179, 360945, 357817, 355965, 354362, 352906, 352780, 354256, 355568, 354888, 352462, 349937, 348345, 347654, 347570, 347659, 347110, 345534, 343926, 343882, 345852, 348967, 352481, 356353, 360369, 363779, 366235, 368267, 370428, 372718, 375274, 378696, 382903, 386347, 387457, 386652, 385986, 386711, 387990, 388238, 387029, 385268, 383872, 382875, 381758, 380246, 378460, 376374, 373491, 369461, 364896, 361088, 358739, 357412, 356502, 356270, 357330, 359443, 361581, 363210, 364789, 366776, 368786, 370214, 371284, 372870, 375332, 377991, 379890, 380817, 381394, 382238, 383156, 383312, 382162, 380005, 377462, 374652, 371348, 367921, 365545, 365066, 366007, 367168, 368014, 369011, 370623, 372520, 373989, 374727]
51470C74727J89j33k90l2Q85K181L120L200K667K239K333K503J846J25j669k285
51454C91606j838j808k990m045l137q37r0k556o157p440n776l696l147l169j973
51439C42947J80J434R20m65j446j399k53J377K058R02q83j130K49R44m18k099
51423C42918j839k03M88j21P0K275M985O171N813N246N176N435N839O053N265
51408C93571L278J596K097M535O537O388M784L442K980K901K903L087L083K060
51394D43242o1k034k517j624o82n03m17O45K413L396K742J471J184J929K100O45
51378D51929j322j663K61K754L569K144j66j827k616l248l934l958k831j301p06
51363D37085j431k545k999k637j868q48M30J516J638O88l96o05k7L75J27j24M05
$$ y = [374727, 374916, 374783, 374493, 374461, 375346, 377527, 380647, 383847, 386514, 388753, 391086, 393589, 395435, 395560, 393891, 391606, 389768, 387960, 384970, 380925, 377788, 376951, 376861, 374305, 368148, 360708, 354932, 351236, 348089, 344920, 342947, 343127, 344561, 345481, 345016, 343570, 342171, 341918, 343295, 345353, 346255, 345372, 344242, 344491, 345435, 345017, 342918, 341079, 340876, 341364, 341243, 341313, 343588, 348573, 354744, 360557, 365803, 370979, 376414, 382253, 388306, 393571, 396849, 398445, 400542, 405077, 411614, 418002, 422786, 426228, 429208, 432109, 435012, 438099, 441182, 443242, 443181, 441147, 438630, 437006, 436324, 435821, 435404, 436049, 438462, 441858, 444600, 446071, 447255, 449184, 451284, 451929, 450607, 448944, 449205, 451959, 455528, 457672, 457506, 455679, 453063, 449815, 445881, 441923, 439092, 437791, 437085, 435654, 433109, 430110, 427473, 425605, 424757, 425187, 426703, 428341, 429029, 428633, 428028, 428001, 428376, 428503, 428379, 428784]
51346D28784J494K327K776L507M770N853O017N308L968J905m55j567l59J863K508
51331D68699Q46j354k607l552n129o443o122m980n333p641r521q774o078l926
51317C98085l705m765n802o155n902n452n221n215m949m151l454l805n021n679
51303C28809m892l693l794n149n826m613k756k259l173l813l319k479j899r24
51289B80220P41J780J032m52p62l1k31k019l589l174j307K67P13K67p33j833k198
51272B68691j427l36nl89o65m33K29J415K943L751L057J974K392M221N218M111
51256B94747K375J982K739L028K237J092J03q77j761k162k273k739l586m183m381
51241B86341m699n164m931l568j934j297k068l670n018n012l408j605j631l650
$$ y = [428784, 430278, 432605, 435381, 438888, 443658, 449511, 455528, 460836, 464804, 466709, 466254, 464687, 464328, 466191, 468699, 469545, 468191, 465584, 462032, 456903, 450460, 444338, 439358, 434025, 426384, 416863, 408089, 402011, 398085, 394380, 389615, 383813, 377658, 371756, 366304, 361083, 355868, 350919, 346768, 343314, 339509, 334488, 328809, 323917, 320224, 316430, 311281, 305455, 300842, 298086, 295827, 292654, 288841, 285522, 283043, 281144, 280220, 280961, 282741, 283773, 283321, 282559, 282528, 282297, 280278, 276689, 273515, 272208, 272475, 273188, 273455, 272722, 270889, 268691, 267264, 266928, 266923, 266534, 265869, 265436, 265665, 267080, 270023, 273774, 276831, 278805, 281197, 285418, 290636, 294747, 297122, 299104, 301843, 304871, 307108, 308200, 308303, 307426, 305665, 303503, 301230, 298491, 294905, 290722, 286341, 281642, 276478, 271547, 267979, 266045, 264748, 262680, 259010, 253992, 248980, 245572, 243967, 242336, 238686]
51227B38686n374m661j938P64K287K622J606q99l658m607l225j070K98P28N52
51212B22111k68j324j429j99J083J229Q35R46R73m61l007m750m874m552m795m931
51196A96587l930k064l32R92K223L185L304K615J956J996K486K583J699R4j350
51181B12044j990k080k268k560k318j319j37O88J196J323N64j034k171j615J17
51166A98440J373J502J383J749K024J288l84k043k881k699j781p49j70M4O12J898
51150A99606L251L733L211K290J404N41k21n58l77N6N90J309J956J812O43n96
51134B18650o84K58P54j69j680k168j165L82J486K027K070J275l05j465r20Q85
51118B19231J964J123p36k010k288k113j635o98L0n94k378l501k778j223n68r45
$$ y = [238686, 233312, 228651, 226713, 227477, 229764, 232386, 233992, 233093, 229435, 224828, 221603, 220533, 220831, 221559, 222111, 221843, 220519, 219090, 218891, 219974, 221203, 222038, 222984, 223957, 223496, 220489, 215739, 210865, 206313, 201518, 196587, 192657, 190593, 190261, 191253, 193476, 196661, 199965, 202580, 204536, 206532, 209018, 211601, 213300, 213394, 212044, 210054, 207974, 205706, 203146, 200828, 199509, 199372, 200060, 201256, 202579, 203143, 202109, 199938, 198323, 198440, 199813, 201315, 202698, 204447, 206471, 207759, 207375, 205332, 202451, 199752, 197971, 197222, 197052, 197096, 197708, 199606, 202857, 206590, 209801, 212091, 213495, 214036, 213815, 213257, 212880, 212936, 213526, 214835, 216791, 218603, 219246, 218650, 217966, 218224, 218978, 218809, 217129, 214961, 213796, 214178, 215664, 217691, 219761, 221036, 220731, 219266, 218346, 219231, 221195, 222318, 221582, 219572, 217284, 215171, 213536, 212838, 212868, 212274, 209896, 206395, 203617, 202394, 201826, 200881]
51102B00881j173r29j193k422l523l327k120j027m66p2K86L08K7o9J55J29o27
51085A84838j729k164j275N40J956J740n9j938k369j342j59K66K38L91O91P94
51069A80419Q82J493K717M010M691M305K724L29j967l416m052m250l829k274J16
51054A81898J965K160J036j45n67l82j26o2o4J29O16J129J233Q74N02M49M24n3
51036A91016r15j658j990j921j298O2J643K362J847J054J133K000K733L057L547
51021B02672M263M174K583M50n71k18J65l24q19mJ906L361L407K533J561P05M9
51004B25893O8R09J759J724J011M71K43j56o01l68M79Q75L89K2O77J726J928J067
50986B38116j04r69j145j69J707K936K199M11j99R03J911J314j53q93n94p9P8
$$ y = [200881, 199708, 198779, 197586, 195164, 191641, 188314, 186194, 185167, 184701, 184629, 184915, 185223, 185250, 185181, 185336, 185465, 184838, 183109, 180945, 179670, 180210, 182166, 183906, 183847, 181909, 179540, 178198, 178039, 178305, 178543, 178934, 179625, 180419, 181301, 182794, 185511, 189521, 194212, 198517, 201241, 201570, 199603, 196187, 192135, 187885, 184056, 181782, 181898, 183863, 186023, 187059, 186914, 186347, 185965, 185839, 185777, 185713, 185842, 186458, 187587, 188820, 189694, 190196, 190645, 191069, 191016, 190101, 188443, 186453, 184532, 183234, 183296, 184939, 187301, 189148, 190202, 191335, 193335, 196068, 199125, 202672, 206935, 211109, 213692, 214142, 213571, 213353, 213518, 213194, 212375, 212371, 214277, 217638, 221045, 223578, 225139, 225844, 225893, 225961, 226870, 228629, 230353, 231364, 231835, 232078, 231922, 231321, 230953, 231432, 232307, 232696, 232718, 233395, 235121, 237049, 238116, 238012, 237043, 235898, 235729, 237436, 240372, 242571, 242982, 242783, 243686, 245597, 246911, 246758, 245865, 245271, 245192, 245270]
50969B45270j18n32q13k86J218K857L726L880L793L360K328J299J193J930K500
50954B71605K376K005J886K012K291K774L338L765M261N165O112O303N790N698
50940C25381O679P935Q343Q010P922Q416Q820Q703Q636R365J0653J1664J2332
50927D42859J3560J5719J7601J7848J7088J7468J9758K2253K3233K3367K4488
50916F55242K6861K9252L1219L3645L6940M0428M3896M8147N3363N8351O2327
50905A119671O6153P0664P4975P7852P9966Q3038Q7055Q9938R0167Q8323Q5653
$$ y = [245270, 245152, 244620, 243807, 243521, 244739, 247596, 251322, 255202, 258995, 262355, 264683, 265982, 267175, 269105, 271605, 273981, 275986, 277872, 279884, 282175, 284949, 288287, 292052, 296313, 301478, 307590, 313893, 319683, 325381, 332060, 339995, 348338, 356348, 364270, 372686, 381506, 390209, 398845, 408210, 418863, 430527, 442859, 456419, 472138, 489739, 507587, 524675, 542143, 561901, 584154, 607387, 630754, 655242, 682103, 711355, 742574, 776219, 813159, 853587, 897483, 945630, 998993, 1057344, 1119671, 1185824, 1256488, 1331463, 1409315, 1489281, 1572319, 1659374, 1749312, 1839479, 1927802, 2013455]
$$ [...]
##END NTUPLES=NMR SPECTRUM
##END=
