
##TITLE=AC1117_Cauca2_5835426_EAq6SDhmyq
##JCAMPDX= 6.0         $$ Bruker NMR JCAMP-DX V2.0
##DATA TYPE= NMR SPECTRUM
##DATA CLASS= NTUPLES
##ORIGIN= BRUKER
##OWNER= Administrator
$$ 1.72 TOPSPIN		Version 2.1
$$ 2012-03-26 23:00:14.390 -0500  Administrator@TOPSPIN
$$ Compression mode = diff/dup
##.OBSERVE FREQUENCY= 400.13188235
##.OBSERVE NUCLEUS= ^1H
##.ACQUISITION MODE= SIMULTANEOUS (DQD)
##.ACQUISITION SCHEME= undefined
##.AVERAGES= 8
##.DIGITISER RES= 22
##SPECTROMETER/DATA SYSTEM= spect
##.PULSE SEQUENCE= zg30
##.SOLVENT NAME= COFFEE_meoh
##.SHIFT REFERENCE= INTERNAL, COFFEE_meoh, 1, 14.98061
##AUDIT TRAIL= $$ (NUMBER, WHEN, WHO, WHERE, PROCESS, VERSION, WHAT)
$$ ##TITLE= Audit trail, TOPSPIN		Version 2.1
$$ ##JCAMPDX= 5.01
$$ ##ORIGIN= Bruker BioSpin GmbH
$$ ##OWNER= Administrator
$$ $$ C:\Bruker\TOPSPIN/data/COFFEE/nmr/AC1117_Cauca2_5835426_EAq6SDhmyq/10/pdata/1/auditp.txt
$$ ##AUDIT TRAIL=  $$ (NUMBER, WHEN, WHO, WHERE, PROCESS, VERSION, WHAT)
(   1,<2012-03-26 23:00:07.609 -0500>,<Administrator>,<TOPSPIN>,<go>,<TOPSPIN 2.1>,
      <created by zg
	started at 2012-03-26 22:59:00.968 -0500,
	POWCHK enabled, PULCHK disabled,
       configuration hash MD5:
       1A 1E CE 29 27 FD 77 03 67 4E F0 E3 C4 B2 CB 90
       data hash MD5: 64K
       B6 D2 40 0C 59 E8 0B 73 88 49 8A F9 51 0D DB 18>)
(   2,<2012-03-26 23:00:10.375 -0500>,<Administrator>,<TOPSPIN>,<proc1d>,<TOPSPIN 2.1>,
      <Start of raw data processing
       efp LB = 0 FT_mod = 6 PKNL = 1 PHC0 = 0 PHC1 = 0 SI = 32K 
       data hash MD5: 32K
       D1 7D 3C CD 4A FC BA 8E F9 00 00 A7 AB F7 3E 95>)
(   3,<2012-03-26 23:00:10.750 -0500>,<Administrator>,<TOPSPIN>,<proc1d>,<TOPSPIN 2.1>,
      <pk PHC0 = 210.9485 PHC1 = 0 
       data hash MD5: 32K
       76 F5 42 D3 C0 8D A2 4A C9 97 62 0D 62 F2 C1 DA>)
(   4,<2012-03-26 23:00:10.812 -0500>,<Administrator>,<TOPSPIN>,<proc1d>,<TOPSPIN 2.1>,
      <abs ABSG = 1 
       data hash MD5: 32K
       8E 93 AF 05 A0 2B 89 AA D1 15 21 CC 14 E1 82 10>)
(   5,<2012-03-26 23:00:10.843 -0500>,<Administrator>,<TOPSPIN>,<proc1d>,<TOPSPIN 2.1>,
      <abs ABSG = 2 
       data hash MD5: 32K
       58 5E E5 DA D2 7B C2 52 7C 45 FC FF C4 24 0E 27>)
(   6,<2012-03-26 23:00:10.875 -0500>,<Administrator>,<TOPSPIN>,<proc1d>,<TOPSPIN 2.1>,
      <abs ABSG = 3 
       data hash MD5: 32K
       08 22 0B 6E E8 34 C6 14 6D 6E B0 9E 89 38 8D E7>)
(   7,<2012-03-26 23:00:10.906 -0500>,<Administrator>,<TOPSPIN>,<proc1d>,<TOPSPIN 2.1>,
      <abs ABSG = 4 
       data hash MD5: 32K
       7D F0 6B E1 14 02 D4 2B 53 6E 08 B8 31 32 47 6C>)
(   8,<2012-03-26 23:00:10.937 -0500>,<Administrator>,<TOPSPIN>,<proc1d>,<TOPSPIN 2.1>,
      <abs ABSG = 5 
       data hash MD5: 32K
       10 07 7F E0 57 C6 7B 46 1D 6F 45 BB 9B A5 A7 15>)
$$ ##END=
$$ 
$$ $$ hash MD5
$$ $$ 1F B5 EA 2E 38 8B 17 27 C4 B9 56 40 E2 EB 05 3E
##$RELAX= 
##$RELAX= 
##$RELAX= 
##$RELAX= 
##$RELAX= 
##$RELAX= 
##$RELAX= 
$$ Bruker specific parameters
$$ --------------------------
$$ [...]
##$TP= (0..7)
150 150 150 150 150 150 150 150
##$TP07= 0
##$TPNAME0= <>
##$TPNAME1= <>
##$TPNAME2= <>
##$TPNAME3= <>
##$TPNAME4= <>
##$TPNAME5= <>
##$TPNAME6= <>
##$TPNAME7= <>
##$TPOAL= (0..7)
0.5 0.5 0.5 0.5 0.5 0.5 0.5 0.5
##$TPOFFS= (0..7)
0 0 0 0 0 0 0 0
##$TUNHIN= 0
##$TUNHOUT= 0
##$TUNXOUT= 0
##$USERA1= <user>
##$USERA2= <user>
##$USERA3= <user>
##$USERA4= <user>
##$USERA5= <user>
##$V9= 5
##$VALIST= <valist>
##$VCLIST= <CCCCCCCCCCCCCCC>
##$VD= 0
##$VDLIST= <DDDDDDDDDDDDDDD>
##$VPLIST= <PPPPPPPPPPPPPPP>
##$VTLIST= <TTTTTTTTTTTTTTT>
##$WBST= 1024
##$WBSW= 4
##$XGAIN= (0..3)
0 0 0 0
##$XL= 0
##$YL= 0
##$YMAX_a= 538755
##$YMIN_a= -663130
##$ZGOPTNS= <>
##$ZL1= 120
##$ZL2= 120
##$ZL3= 120
##$ZL4= 120
##$ABSF1= 14.98061
##$ABSF2= -5.57192
##$ABSG= 5
##$ABSL= 3
##$ALPHA= 0
##$AQORDER= 0
##$ASSFAC= 0
##$ASSFACI= 0
##$ASSFACX= 0
##$ASSWID= 0
##$AUNMP= <proc_prof1d_extract_pilot.lims>
##$AXLEFT= 0
##$AXNAME= <>
##$AXNUC= <1H>
##$AXRIGHT= 0
##$AXTYPE= 0
##$AXUNIT= <>
##$AZFE= 0.1
##$AZFW= 0.1
##$BCFW= 0
##$BC_mod= 0
##$BYTORDP= 0
##$COROFFS= 0
##$CY= 15
##$DATMOD= 1
##$DC= 0
##$DFILT= <>
##$DTYPP= 0
##$F1P= 0
##$F2P= 0
##$FCOR= 0.5
##$FTSIZE= 32768
##$FT_mod= 6
##$GAMMA= 0
##$GB= 0
##$INTBC= 1
##$INTSCL= 1
##$ISEN= 128
##$LB= 0
##$LEV0= 0
##$LPBIN= 0
##$MAXI= 10000
##$MC2= 0
##$MEAN= 0
##$ME_mod= 0
##$MI= 0
##$NCOEF= 0
##$NC_proc= -8
##$NLEV= 6
##$NOISF1= 0
##$NOISF2= 0
##$NSP= 0
##$NTH_PI= 0
##$NZP= 0
##$OFFSET= 14.98061
##$PC= 1
##$PHC0= 210.9485
##$PHC1= 0
##$PH_mod= 1
##$PKNL= yes
##$PPARMOD= 0
##$PPDIAG= 0
##$PPIPTYP= 0
##$PPMPNUM= 2147483647
##$PPRESOL= 1
##$PSCAL= 4
##$PSIGN= 0
##$PYNMP= <proc.py>
##$REVERSE= no
##$SF= 400.13
##$SI= 32768
##$SIGF1= 0
##$SIGF2= 0
##$SINO= 400
##$SIOLD= 32768
##$SPECTYP= <>
##$SREGLST= <1H.CDCl3>
##$SSB= 0
##$STSI= 32768
##$STSR= 0
##$SW_p= 8223.68421052632
##$SYMM= 0
##$S_DEV= 0
##$TDeff= 65536
##$TDoff= 0
##$TI= <>
##$TILT= no
##$TM1= 0
##$TM2= 0
##$TOPLEV= 0
##$USERP1= <user>
##$USERP2= <user>
##$USERP3= <user>
##$USERP4= <user>
##$USERP5= <user>
##$WDW= 1
##$XDIM= 32768
##$YMAX_p= 470475769
##$YMIN_p= -746657
##$CURPLOT= <Network HP LaserJet P1505>
##$CURPRIN= <$Network HP LaserJet P1505>
##$DFORMAT= <normdp>
##$LAYOUT= <+/1D_H.xwp>
##$LFORMAT= <normlp>
##$PFORMAT= <normpl>
##$SURQMSG= 1
$$ End of Bruker specific parameters
$$ ---------------------------------
##NTUPLES= NMR SPECTRUM
##VAR_NAME=  FREQUENCY,     SPECTRUM/REAL,   SPECTRUM/IMAG
##SYMBOL=    X,             R,               I
##VAR_TYPE=  INDEPENDENT,   DEPENDENT,       DEPENDENT
##VAR_FORM=  AFFN,          ASDF,            ASDF
##VAR_DIM=   32768,         32768,           32768
##UNITS=     HZ,            ARBITRARY UNITS, ARBITRARY UNITS
##FACTOR=    0.250966925370066, 1,           1
##FIRST=     8223.43324360095, -95169,       24473
##LAST=      0,             174258,          -241677
##MIN=       0,             -746657,         0
##MAX=       8223.43324360095, 470475769,    0
$$ Real data points
##PAGE= N=1
##DATA TABLE= (X++(R..R)), XYDATA
$$ [...]
19493B67059d9190r3211k278q2669O2819b8680j19680E1828h4748k05557c85k70558
19481b70943A4713a42335O5484c3739A0210d6149A9414c36981F5522k242a80718
19469b56148C8247a71406F8074N5079b49018h3431l19547G9282c7714j9679P058
19458e0335l334G848a52069O6148b9922m1844G25J91669c6037C494j546Q7889
19446H9837a09392k02610C9255d99700a89455D4937A384b90209I2073d57009a29726
19434b74514F0684c1710k6483A25469J78947i3226q9358j88399g293k88379d229
19422a0139k04413L7746n1344N0864D6586b07858g9911F845b10556f2667l14933
19411c77600A13008n5065b97737j3073n1103h1897F7811J15433d26822J44346
$$ y = [267059, -49190, -142401, -144679, -227348, -164529, -28680, -148360, 51828, -84748, -290305, -385, -270943, 14713, -142335, -76851, -33739, 10210, -46149, 19414, -336981, 65522, 63280, -180718, -256148, 38247, -171406, 68074, 123153, -249018, -83431, -402978, 79282, -37714, -57393, -50335, -53669, 7848, -152069, -85921, -29922, -71766, 725, 192394, -36037, 3494, 1948, 89837, -109392, -312002, 39255, -499700, -189455, 44937, 1384, -290209, 92073, -457009, -129726, -274514, 60684, -31710, -58193, 125469, 304416, -93226, -182584, -370983, -7293, -295672, -4229, -10139, -214552, -176806, -228150, -177286, 46586, -207858, -79911, 6845, -210556, -62667, -377600, 113008, 57943, -297737, -310810, -361913, -81897, 67811, 183244, -426822, -282476]
19401b82476A14416i0066j67578h7612A14944J8829A0396a02478K0097q4315j85386
19390c52082b7431G4610J462b9970F6421l0129f12202b68295N0285B18372e6069
19378a23222D0378f5623A35905a42127J721l7542F30f714o7574n2164m887j82208
19366c13547A26674a10856A42211P1978g0877j55209j1155D9904c053A0691b50334
19354B31775a43675j73892C1853L3346i9608K7861J4500k29963d4257q7707F892
19342a11250n416N5200j12034I711h518p5971j2323n2482O2075A72091f4163k0314
19330h4477C821R6591c10668O8552B21519d5834A2346J44658a39041f4248r9864
19319a64112e1870K3380m9841K3563A34872a56173e8420j79072P7296c156k23502
$$ y = [-282476, 114416, -90066, -257644, -87612, 114944, 133773, 10396, -102478, -82381, -166696, -352082, -27431, 74610, 76072, -29970, 66421, 36292, -612202, -268295, -218010, 218372, -56069, -123222, 40378, -65623, 135905, -142127, -140406, -177948, 630, -6714, -74288, -126452, -131339, -313547, 126674, -110856, 142211, 214189, -70877, -226086, -237241, 49904, -3053, 10691, -250334, 231775, -143675, -317567, 31853, 65199, -99608, -71747, -57247, -287210, -44257, -131964, 6892, -111250, -116666, -61466, -173500, 9711, -8518, -84489, -96812, -149294, -87219, 172091, -64163, -84477, 3821, 100412, -310668, -242116, 221519, -45834, 12346, 157004, -139041, -64248, -164112, -51870, -28490, -78331, -54768, 134872, -156173, -58420, -237492, -160196, -3156, -226658]
19308b26658M0000B8720a02483B986J35113g0090p6425j69469f7186b3250m4061
19297f7311j92969A30809l0931a66420A32613b7004k39804K917p2920d957k88000
19286b92957c0679p8259m4231k15266B17788G4574a33644A55293a12914B39299
19275b40290J06445H6058i78r5791A22021M7293p7829g6147q5207A45784a9527
19263G5770B0286d39971A857c62764e4903k27818b989A15122M1090b71678c0519
19251a03930A6107i1636L2806k30539J36893A33451c9518p5734q1268i8065r3613
19240a91678e4343j81440a5397j37188A25432a70701B3199b031A84875a81419
19229C3482b2176k26645L9756C2774b04520p0707H1561a72052A68435H0366k1418
$$ y = [-226658, -186658, 28720, -102483, 2986, 138099, -70090, -146515, -315984, -67186, -23250, -67311, -260280, 130809, 99878, -166420, 132613, -27004, -266808, -263891, -336811, -4957, -292957, -30679, -108938, -153169, -368435, 217788, 74574, -133644, 155293, -112914, 239299, -240290, -133845, 86058, -978, -96769, 122021, 169314, 91485, -76147, -161354, 145784, -19527, 75770, 20286, -439971, 1857, -362764, -54903, -282721, -2989, 115122, 156212, -271678, -30519, -103930, 16107, -91636, -58830, -289369, -152476, 133451, -39518, -115252, -196520, -98065, -191678, -54343, -235783, -15397, -152585, 125432, -170701, 23199, -2031, 184875, -181419, 33482, -22176, -248821, -209065, 32774, -204520, -275227, 81561, -172052, 168435, 80366, 58948]
19218E8948b43863A62489a63637A47918c50034C8398d0451l05970a21755k3728
19208a45483D6442g0619l8509j83855M9848d2894n5272a5415j38859k5839k2899
19197b03012A05572a26844e2415B72818c80290a55211d1551o140F5996p58a53293
19185a30144A65539a96620P4649A07429J16973f6419K2956m8118o6638e8744j29579
19174a88323B22603a61362F7262b3294F8391a05864q170I9690b31050m7059D9274
19162i5976a0337j24811j08597a7309A23295L059A1849a66092A67914c15991I7419
19150i9883k7389j7926r7670B2189c1442k04145O1241f8727b597B6042c03803
19138a14768K9005C37048e6657r1463O8296l7324m55987a1398A2067b69784a28440
$$ y = [58948, -243863, 162489, -163637, 147918, -350034, 38398, -40451, -346421, -121755, -145483, 46442, -70619, -109128, -292983, -243135, -42894, -98166, -15415, -154274, -180113, -203012, 105572, -126844, -52415, 272818, -380290, -155211, -41551, -47691, 65996, 65238, -153293, -130144, 165539, -196620, -121971, 107429, 224402, -66419, -43463, -91581, -158219, -58744, -188323, 222603, -161362, 67262, -23294, 68391, -105864, -114034, 99690, -231050, -278109, 49274, -95976, -10337, -135148, -243745, -17309, 123295, 126354, 11849, -166092, 167914, -315991, 97419, -99883, -127272, -145198, -242868, 22189, -31442, -235587, -174346, -68727, -2597, 26042, -303803, -114768, -85763, 337048, -56657, -148120, -79824, -117148, -573135, -11398, 12067, -269784, -128440]
19126E6750b13567A25566P4989F6263c33345e697q1782E5654K86049A41086C9582
19114a31403C9264d81292B72440c5983F0589a8129B80502h9353m1171L9182n7953
19103a49295f4946B2805e4925l3670B53377c48783A08260l4070l7001b11776A41385
19091b09363i6984P941j86171O5338h5963J7439k63617A15903d6035p7441B0248
19079A55027a91988N9186q8683G9637B7413M1273c967I0581a95734K59d1319k6319
19067f7638E9497P179b53403o5513d5881l47887C43228c004m3693A42519M6628
19056A89147d7132k15719A72653Q847H9431a43041L181M1575C5805b31157j67819
19045c98976a49467L7017F3160K5513b78489B32314B6013i9663j26163l1038H3474
$$ y = [56750, -213567, 125566, 200555, 66263, -333345, -5697, -87479, 55654, 341703, 141086, 39582, -131403, 39264, -481292, 272440, -35983, 60589, -18129, 280502, -89353, -130524, -91342, -149295, -64946, 22805, -54925, -88595, 253377, -348783, 108260, 74190, 37189, -211776, 141385, -209363, -96984, -89043, -275214, -209876, -85963, -68524, -332141, 115903, -46035, -123476, 20248, 155027, -191988, -132802, -221485, 79637, 27413, 68686, -3967, 90581, -195734, -195475, -41319, -67638, 59497, 66676, -253403, -318916, -45881, -393768, 343228, -3004, -46697, 142519, 189147, -47132, -262851, 172653, 181500, 89431, -143041, -139860, -98285, 35805, -231157, -398976, -149467, -112450, 63160, 88673, -278489, 232314, 26013, -99663, -225826, -256864, 83474]
19033B87923d7807A5981Q741J7881J27731a23291b7660l31292b2779A84358L6234
19022B20592m2039l0261a33285I5039a93759b2903A33105M8415a34058C1329a46886
19010c30654J38451n8645G6244J52099o2467P8275g2459q2406i778D1704c65737
18998b72749B67518A26872b03464B11416a38216B47558A8702J7336J49492i49
18987f503j57542k28675M0531A04524N1202i1002L7344A63522b37445B59155b35768
18975A69521c76930a08790L0496k85911a07900j12406G1228i1019j11132i0856
18964b02475r689A41681J27221a56977d3618C49840j16202E3813L29821H4836
18953A28687a51040A02992d5022A09986a7834o8610j91278J20198C4352a40563
$$ y = [287923, -47807, 15981, 24722, 42603, 170334, -123291, -27660, -358952, -22779, 184358, 220592, 178553, 148292, -133285, 95039, -193759, -22903, 133105, 181520, -134058, 31329, -146886, -330654, -192203, -250848, 76244, 228343, 165876, 244151, -72459, -154865, -9778, 41704, -365737, -272749, 267518, 126872, -203464, 211416, -138216, 247558, 18702, 36038, 185530, -949, -6503, -164045, -392720, -352189, 104524, 155726, -91002, -53658, 163522, -237445, 259155, -235768, 169521, -376930, -108790, -78294, -364205, -107900, -220306, 71228, -91019, -202151, -90856, -202475, -212164, 141681, 268902, -156977, -43618, 349840, 233638, 53813, 383634, 84836, 128687, -151040, 102992, -45022, 109986, -17834, -86444, -277722, -157524, 34352, -140563]
18942c50588a27568B09890a64169O3135j12221R9070I6178a60843l6965A52094
18931b87139C0474e5530A40753J53834b8328B1716J81459q4875b01235D2379J255
18920D3634b70013e8483k55905k12837A69796b51805b6152A45011b24051B68811
18909a32785J0029F555a70136L719A55606F1234J0509M0781B8431O9675J03652
18898B01758a58219i017E4026J48819J13437m2596J39166j99749r4737Q0967a76419
18886B07563p4619o0252b10171A63352K34641b33519h5107m14391H854c70936
18875a147o9642J3661A51626g9699j68621B06825q4825i0125p973r5365B08302
18863c42591J32499P474i187B396M4385B045P9589C8030a69061j79122B5446J83277
$$ y = [-350588, -127568, 209890, -164169, -101034, -213255, -114185, 96178, -160843, -197808, 152094, -287139, 30474, -55530, 140753, 294587, -28328, 21716, 203175, 118300, -201235, 42379, 43634, -270013, -58483, -314388, -527225, 169796, -251805, -26152, 145011, -224051, 268811, -132785, -122756, 6555, -170136, -166417, 155606, 61234, 71743, 112524, 28431, 98106, 201758, -158219, -9017, 54026, 202845, 316282, 273686, 412852, 213103, 118366, 199333, -176419, 207563, 132944, 72692, -210171, 163352, 397993, -233519, -85107, -499498, 8854, -370936, -1147, -70789, -57128, 151626, -79699, -248320, 206825, 122000, -90125, -98098, -193463, 208302, -342591, -210092, -202618, -9187, 2396, 46781, 2045, 81634, 38030, -169061, -348183, 25446, 208723]
18851B08723g9786B70956b89494B3061c048F5304j0732J03968b21504J05008d6114
18839B64057c2559A91755C9292b60777C9992R9824J8725E3777J24115a44112A26171
18827A9174b24190G5376J67102o5898d5525B5699Q1666p562a40733A25063a4741
18815A25181C461f23882a54793C6511b97894i9380O022E1016b43041K7072f8074
18803I2276l4212r759a17256H5397d72937B27359E5397f803B71432A4338J24127
18792A38465M7575B0861b24433f997k18868G4263e6741j75096A24050b72985A11884
18780b89459d1985m2236k97247e4832G0238c2879j71690b2031k98486J22080E9920
18768b39040d0893j39305A5478E343a80284A09295h9743j33049A20911C469h1050
$$ y = [208723, -79786, 270956, -289494, 23061, -3048, 65304, 54572, 158540, -221504, -116496, -46114, 264057, -32559, 191755, 39292, -260777, 39992, 139816, 158541, 53777, 177892, -144112, 126171, 19174, -224190, 75376, 242478, 176580, -45525, 25699, 107365, 99803, -140733, 125063, -14741, 125181, 3461, -623882, -154793, 36511, -297894, -99380, -93358, 51016, -243041, -215969, -68074, 92276, 58064, 48305, -117256, 85397, -472937, 227359, 55397, -6803, 271432, 14338, 138465, 186040, 20861, -224433, -6997, -225865, 74263, -56741, -231837, 124050, -272985, 111884, -289459, -41985, -84221, -381468, -54832, 70238, -32879, -204569, -22031, -320517, -198437, 59920, -239040, -40893, -180198, 15478, 5343, -180284, 109295, -89743, -222792, 120911, 3469, -81050]
18756e293j00804A93069c06679a17477K8336B8264J79362A9059c01100a45321
18745A16069a88244G9541b06915C8643O3036c98492g0302a2801j17116j05766
18735b35683h7234B12086b9660j11176C15472a86254k7114b9582k90119A41100
18724b59385A91235I1247J23143e4334B80933l2038a27843P83H2261I929N00670
18713E10599a42032k39963B2480b16565f3481E256J22586A6822a8338D7862f3268
18701a48826l381K3197k56669J62075A78539a23093l3777B1724c1019k11742k6444
18690b69205j8789b6816D07361a34237D8590J91152G9553c6319j2052j45874A87335
18678a91062c791m6240l42111b6080j80932C03852D8778b51682j0279A4351J08254
$$ y = [-5293, -106097, 193069, -306679, -117477, -89141, 28264, 207626, 19059, -301100, -145321, 116069, -188244, 79541, -206915, 38643, 101679, -398492, -70302, -12801, -129917, -235683, -87234, 212086, -29660, -140836, 315472, -186254, -213368, -29582, -319701, 141100, -259385, 191235, 91247, 214390, -54334, 280933, 248895, -127843, -127060, 82261, 9929, 510599, -142032, -381995, 22480, -216565, -63481, 5256, 127842, 16822, -18338, 47862, -63268, -148826, -152207, -129010, -385679, -223604, 178539, -123093, -156870, 21724, -31019, -242761, -269205, -287994, -26816, 407361, -134237, 48590, 239742, 79553, -36319, -48371, -194245, 187335, -191062, -3791, -50031, -392142, -26080, -207012, 303852, 48778, -251682, -261961, 14351, 122605]
18667A22605D1901c76582O6108c3711A29018b70038g1261F9897d44811A5350h1379
18655A99289C8513b43200a07325d5946m8924G9910b14447j534c5358n4064H3844
18643e2867j02528L6745r7934A60993j3598a87637c6089j02813f1546J6718k11509
18632b56337o8018A82613a59273O1583A28924d9529b590k73356p0064i0502J99
18621i0303F4478O548B3863M8005K02444C1563J15747Q3703b16239b0025l14033
18610c34058h1473k20752a06283k85093B76936b91333a31148m620A96979B467
18599i0404C56306b33450a00125o7339A90666a9352A06379a27875l16497e9775
18588C51288G8609b32148c0578j11364O9592n163A09172K0490d2243k83746D9566
$$ y = [122605, 41901, -376582, -310474, -33711, 129018, -270038, -71261, 69897, -444811, 15350, -81379, 199289, 38513, -243200, -107325, -45946, -94870, 79910, -214447, -215981, -35358, -89422, 83844, -52867, -155395, -118650, -216584, 160993, 147395, -187637, -36089, -138902, -61546, -44828, -256337, -324355, 182613, -159273, -97690, 128924, -49529, -2590, -275946, -346010, -90502, -90303, 64478, 71026, 23863, 71868, 274312, 31563, 147310, 231013, -216239, -20025, -334058, -81473, -302225, -106283, -391376, 276936, -291333, -131148, -135768, 196979, 2467, -90404, 356306, -233450, -100125, -167464, 190666, -19352, 106379, -127875, -444372, -59775, 351288, 78609, -232148, -30578, -141942, -72350, -77513, 109172, 129662, -42243, -325989, 49566]
18576A31423d07074C21161H51R0796i0466K1183n6947n4008B05212l27q922a04306
18563a66402M2026B91316a55925m9181N7554b8101q9483F9822a2187I0548a64793
18551F7191a12831M5185k78884J61272E0963J95705a14539L3646K2155j59519
18541b18257d7984A66013a87220D0352P0456g1736C06750J43408g5720p9332H0218
18529g428k319l28501J03728C52427a39407m4322O290j20330a48213I1540i3400
18517B52047a02012G8558c2178j29151N7182d0208C17622I0384M5739A4565c16731
18505a97006C2305J94930a51701B26892p4112b0699A95318C0766e8649k10164
18495b68813m8198a40493A66216E3350a79669A55289g8011A71886M109b73007
$$ y = [131423, -407074, 321161, 851, 91647, -90466, -69283, -126230, -180238, 205212, 204885, 195963, -104306, -166402, -124376, 291316, -155925, -205106, -147552, -28101, -117584, 69822, -12187, 90548, -164793, 67191, -112831, -67646, -346530, -185258, 50963, 246668, -114539, -80893, -58738, -218257, -47984, 166013, -187220, 40352, 110808, -71736, 306750, 450158, -75720, -155052, 80218, -7428, -9747, -338248, -234520, 352427, -139407, -183729, -177439, -297769, -148213, 91540, -93400, 252047, -102012, 78558, -32178, -161329, -104147, -40208, 317622, 90384, 136123, 14565, -316731, -197006, 32305, 227235, -151701, 226892, 152780, -20699, 195318, 30766, -58649, -268813, -317011, -140493, 166216, 53350, -179669, 155289, -78011, 171886, 175995, -273007]
18484d34968a21966k4010j09867d368j98760k3162k9190K5174A73474h8059a5146
18472B25919F0995b05032j29236I7740M3738N2708C3849J11975a25142q4788R4870
18461a15060A01695f5417B88776A34308c5940j94731l52886L0539f4434k2176
18451h6610c8987j64865P3859B0268b1713m5577j72139h9948j99758N7104C9558
18439c15841a20893c1637K585C27058a28924B72072b10144A364O438c52381N7331
18428b95050c58B06379a49107G3829K18244a7613A08344e3381k16232C21598j43474
18417A78124D4340N5461e3497k35913b9944k72959a36667H2706e6241l50614B48647
18405B2932f3042j36459k0249P5505I8559g562n4012A27542b51477R2153f473
$$ y = [-434968, -121966, -145976, -255843, -4368, -203128, -226290, -255480, -230306, 173474, -88059, -15146, 225919, 60995, -205032, -334268, 97740, 141478, 194186, 33849, 145824, -125142, -209930, -115060, 101695, -65417, 288776, 134308, -35940, -230671, -583557, -553018, -64434, -86610, -38987, -203852, -129993, 20268, -21713, -67290, -239429, -89948, -289706, -232602, 39558, -315841, -120893, -31637, -29052, 327058, -128924, 272072, -210144, 1364, 7802, -352381, -295050, -358, 206379, -149107, 73829, 292073, -17613, 108344, -53381, -269613, 321598, 178124, 44340, 99801, -53497, -289410, -29944, -302903, -136667, 82706, -56241, -406855, 248647, 22932, -63042, -199501, -219750, -144245, 98559, -7562, -61574, 127542, -251477, -159324, -6473]
18393c1547D013i3413j8421E0912L8021K11272f4890g132j89169M4978C7498J20279
18381A57777a74453D2861j7425a6011j45325c2938C4580a57814F1337J51100c9737
18369d49869K19552A87621a22080A30866o0660a82212j36030J33542O8258A7651
18358g3487j99745A29623m3368c6663A73365b709A32509C3949K55971h386B61739
18346B370J28092a86722A67645p5689A6663M413c53408Q8690B3261J31263i771
18334C64999a54960J0228M4528N594A8374P8706a39032G3574e0410C43640A47389
18322b8220B9628J15327B9870d0353j29265B5823P4201a34559k37003C03110A8201
18310a02277I7941a61012O0086o4723G1042A5692d0506j89843k7754R4475J0915
$$ y = [-31547, 4013, -93413, -111834, 50912, 88933, 300205, -64890, -7132, -196301, -151323, 37498, 157777, -174453, 42861, 25436, -16011, -161336, -32938, 34580, -157814, 61337, 212437, -39737, -449869, -230317, 187621, -122080, 130866, 70206, -182212, -318242, -184700, -116442, 17651, -73487, -273232, 129623, 86255, -36663, 173365, -2709, 132509, 33949, 289920, -8386, 261739, 2370, 130462, -186722, 167645, 91956, 16663, 21076, -353408, -264718, 23261, 154524, -9771, 364999, -154960, -144732, -100204, -94610, 18374, 97080, -139032, 73574, -50410, 343640, 147389, -28220, 29628, 144955, 29870, -40353, -169618, 25823, 100024, -134559, -371562, 303110, 18201, -102277, 97941, -161012, -100926, -165649, 71042, 15692, -40506, -230349, -258103, -163628, -152713]
18299a52713f379A45747L3135G1824b01585A00800l052l4860a05806K701m3854
18288a46959c4388n9235j06492D8016b3803A3236a42055C80156d3296R040A76240
18276A76818k5134c07598A58341b12097q5300a16642H5500a7574B13843a72662
18265d6333E3845e992q9556C49949G5192A2562K27420d7368F6998g5501j20006
18254a95507P4720j71434A7826g8087A19453l7339d33842E0224b3925k46119d2832
18242c06111F8647L6132b24618F984K3883o24b3860o2401A24255g9348n2875F4214
18229a84361L0398M6425B3444o454R1400e9373A50597O6542B6050J70577l6043
18218A60584a6814k8739C12776j01550C8823a35285e0237H5328d5291a6995A13798
$$ y = [-152713, -6379, 145747, 178882, 71824, -201585, 100800, 97748, 62888, -105806, -103105, -146959, -34388, -93623, -200115, 48016, -23803, 13236, -142055, 380156, -43296, -34256, 176240, 176818, 151684, -307598, 158341, -212097, -297397, -116642, 85500, -17574, 213843, -172662, -46333, 53845, -5992, -95548, 349949, 75192, 12562, 239982, -47368, 66998, -75501, -195507, -120787, -292221, 17826, -78087, 119453, 82114, -433842, 50224, -23925, -270044, -42832, -306111, 68647, 104779, -224618, 6984, 30867, 30243, -23860, -86261, 124255, -79348, -132223, 64214, -184361, -153963, -107538, 23444, 16990, 108390, -59373, 150597, 217139, 26050, 196627, 160584, -16814, -45553, 312776, 211226, 38823, -135285, -50237, 85328, -45291, -16995, 113798]
18206a89769b8392A3238P3795e7328r1479C22964J06690h2288C21239A02356l6052
18195F6304c09804g6724l06374h2445l80497a42920k08163k2327E1196b8831B4827
18183A62403d13983B3336a91334M61C7483L9115b88860A44677n9129b64919i1276
18171A47003i2662k10674i0000j32107B43776B0649h4710q7654I2023J4912f3316
18159I1780P6864m0724J0558a788r6211j99142c6323j2373j7436I712h5201A30176
18146A72496C1557Q3999h6591A11404C8867K2897b67386a5463n7607A03930j0897
18135I3033c99489g2714l801A02589a25418B7796J86837d8273o1728n4356A6369
18123c55130h9301B74156K8133c0785A13156o617b66951O2516Q6519A04348i2357
$$ y = [-189769, -28392, 13238, 87033, -57328, -148807, 322964, 429654, -82288, 321239, 102356, 66304, -309804, -76724, -383098, -82445, -462942, -142920, -351083, -373410, 51196, -28831, 24827, 162403, -413983, 23336, -191334, -190873, 37483, 76598, -288860, 144677, 85548, -264919, -91276, 147003, -92662, -303336, -90000, -222107, 243776, 20649, -84710, -172364, 92023, 106935, -63316, 91780, 168644, 127920, 138478, -1788, -97999, -297141, -36323, -48696, -66132, 9712, -85201, 130176, 172496, 31557, 115556, -86591, 111404, 38867, 61764, -267386, -15463, -73070, 103930, 93033, -399489, -72714, -76515, 102589, -125418, 27796, 214633, -48273, -110001, -164357, 16369, -355130, -89301, 274156, 302289, -30785, 113156, 106539, -266951, -204435, -117916, 104348, -92357]
18111a61967k54239J5655h917j42612k56b3029p5745A88344a9644j55449A76370
18099A12215R7828n6718i6456m0652L3015m4179l3392B47602B5695a31060J185
18088a29875C57485j1608a85313A8425f7551k3841A50161G1749c3931B54956F9265
18076E4818P8677a09530B31372D6678c72011D03720f2886m9893d0490m2953a7258
18064d7418G9227L9579E487b2798j28555m51810G0954O6923D0255h8845B9968
18052e0048k10400N1577O4190H7164J76402H3677A9765f8500l33107a71774A79573
18040D6587b58107b2106K618F2249j5182c5622f797q2758l422A1756f2325A70627
18027A16840F107J64490q1373D775K73258C8626J29575N8946h3554A30146a81285
$$ y = [-161967, -416206, -400551, -8917, -151529, -151785, -23029, -98774, 188344, -19644, -175093, 176370, 112215, 210043, 153325, -96456, -137108, -104093, -148272, -181664, 247602, 25695, -131060, -129875, 357485, 345877, -185313, 18425, -67551, -91392, 150161, 71749, -33931, 254956, 69265, 54818, 133495, -109530, 231372, 46678, -372011, 403720, -62886, -112779, -40490, -83443, -17258, -47418, 79227, 118806, 5487, -22798, -151353, -603163, 70954, 137877, 40255, -88845, 29968, -50048, -260448, -208871, -144681, 87164, 263566, 83677, 19765, -68500, -401607, -171774, 179573, 46587, -258107, -22106, -19488, 62249, 47067, -35622, -6797, -89555, -92977, 11756, -62325, 170627, 116840, 6107, 170597, 89224, 4775, 278033, 38626, 168201, 227147, -83554, 130146, -181285]
18015b98891E976i835j12573N3908C27243A31784Q8996b02851P0450q823f5737
18003B85701R634h0279F839a12040J0451j08554A15785a16969K2122A53934C9653
17991C09017a79246b0703C04748A5053d0747p2983c0224o1693A16276l0063a48835
17979b5346j50363B22216a45516B02123J88585A87352B3428f5780k01619P2217
17969a95182L4245j34906h0519L8520j28080A63194f9124B53857a64060D4496
17958F0317q859K982h4030j57777b1217h433l06967h1745n310A93922n1406L4683
17946A77199f170k04156g6252A970K87335f465B68900b2612A6076N5834L02062
17935C73972A06200A1848N5450N5752m8066a67152J9916k45203a27054m8166L1479
$$ y = [-298891, 5976, -9835, -122408, -68500, 327243, 131784, 220780, -202851, -132401, -141224, -65737, 285701, 295335, -80279, 6839, -112040, -101589, -210143, 115785, -116969, -94847, 153934, 39653, 309017, -179246, -20703, 304748, 15053, -40747, -113730, -30224, -91917, 116276, 86213, -148835, -25346, -175709, 222216, -145516, 202123, 390708, 187352, 23428, -65780, -267399, -195182, -160937, -295843, -80519, -41999, -170079, 163194, -69124, 253857, -164060, 44496, 60317, 51458, 54440, -84030, -241807, -21217, -8433, -315400, -81745, -87055, 193922, 142516, 177199, -6170, -210326, -76252, 1970, 289305, -6465, 268900, -22612, 16076, 71910, 373972, 106200, 11848, 67298, 123050, 74984, -167152, -147236, -392439, -127054, -175220, -143741]
17924a43741A30907D2124c9725H8714J40179g4612C88835H4201g3388L5350B40732
17912c25300I2934a10827A62897n1011L65474I3151f2202A61792j1260h1624E41464
17900C07405m1637a066k04498A60061B6809c08248B16196a95276A12325g307A79281
17888f7672C23410A43383a19411A33283J02398g6463K6858k33C28264A27722d02920
17876b80216a12682b4927j93128L1257C20481b15464D9020a54272L9022B06642
17865B9543b1465I6849l646a07904j49787I3788a13219C8520J4854b1112B015
17853C24072j17269k7338b87734B10872b21829A2160a20896J8867j45590D3575
17842D56770B5410l322g8518B39075r6005a89979A57978p5492K27600f4983k4918
$$ y = [-143741, 130907, 42124, -39725, 88714, 228893, -74612, 388835, 84201, -73388, -38038, 240732, -325300, 92934, -110827, 162897, 111886, 477360, 93151, -62202, 161792, 150532, -81624, 541464, 307405, 265768, -1066, -205564, 160061, 26809, -308248, 216196, -195276, 112325, -7307, 179281, -67672, 323410, 143383, -119411, 133283, 235681, -76463, -49605, -49838, 328264, 127722, -402920, -280216, -112682, -24927, -218055, -186798, 320481, -215464, 49020, -154272, -115250, 206642, 29543, -21465, 96849, 93203, -107904, -257691, 93788, -113219, 38520, 53374, -21112, 2015, 324072, 206803, 179465, -287734, 210872, -221829, 12160, -120896, -102029, -247619, 43575, 456770, 25410, 22088, -78518, 239075, 143070, -189979, 157978, 82486, 310086, -64983, -89901]
17831h9901F227d07302a25635O0420I9823B8890b75279a2726C5409i7617l8130
17820a35747A54283i057k97024F4862a78432c5347B44160a74705k9769A07084
17809A88138c3181C02805A11317M2383l385b50996a4991F0177E975J37392a6870
17797F8754R9024c28876g856H853b3111C3403K26935I781c32071C41545A2250
17785A56032K88256g2631A53506d29648D08649A68062M5046f8203K9131q0499
17775a19571A22257K4020l45a12474A17271E5300L22538F9888h0607A22571a81630
17763I3802L16252e6491j60979A47761F31d6865B00867e1903o5662B8006L4936
17752F2942b67686B53969a10819A14435b7447A55801k0058C1920b24957C4161
$$ y = [-89901, 6227, -407302, -125635, -65215, 99823, 28890, -275279, -12726, 35409, -97617, -135747, 154283, -9057, -306081, 64862, -178432, -35347, 244160, -174705, -204474, 107084, 188138, -33181, 302805, 111317, 153700, 150315, -250996, -14991, 60177, 5975, 143367, -16870, 68754, 167778, -328876, -7856, 8853, -23111, 33403, 260338, 9781, -332071, 341545, 12250, 156032, 444288, -72631, 153506, -429648, 408649, 168062, 213108, -68203, -39072, -119571, 122257, 146277, 145932, -112474, 117271, 55300, 377838, 69888, -80607, 122571, -181630, 93802, 410054, -56491, -217470, 147761, 631, -46865, 200867, -51903, -117565, 28006, 62942, -267686, 253969, -110819, 114435, -27447, 155801, 135743, 31920, -224957, 34161]
17741D827J58019O6275f1374D24225E3973b1358j1225C77845a21738b8325H9641
17729B25485J33576f3245D16344A01769q241L40654a37524A86172n9824N1558
17719A77906P8640b60550A39528b51365p1655F4822K31803a12914d0780H0503
17708g3674k9256c8736A4849i3889K2254A87764n7485n6722L24925A28769D5602
17696C62206f8361k3618D900Q0898b66570P9027A31793k5457B753M10845h3160
17684A30736J32292c1584A12271J53322G5330b31724B05503E0117r006R1148g167
17672C2441K93708A52458e2826K669B20250b59543e5226a9939p1535B16304n5496
17661A60808M2091a14477B04702a4263I132c26826B0631L56498j14557a35487
$$ y = [4827, 162846, 229121, -61374, 424225, 53973, -21358, -32583, 377845, -121738, -28325, 89641, 225485, 359061, -63245, 416344, 101769, 93528, 434182, -137524, 186172, 126348, 177906, 256546, -260550, 139528, -251365, -323020, 64822, 296625, -112914, -40780, 80503, -73674, -102930, -38736, 14849, -93889, -71635, 187764, 130279, 73557, 398482, 128769, 45602, 362206, -68361, -91979, 4900, 85798, -266570, -187543, 131793, 106336, 2753, 413598, -83160, 130736, 263028, -31584, 112271, 265593, 75330, -231724, 205503, 50117, 41111, 132259, -7167, 32441, 326149, 152458, -52826, -50157, 220250, -259543, -55226, -19939, -91474, 216304, 160808, 202899, -114477, 204702, -14263, 9132, -326826, 20631, 377129, 262572, -135487]
17650a14133B68748b8025A07729J33514j03945e6802G8527J41032r7612J21304
17640B43251J64287a24569C89458H9885J92936B2082J55855a67876A32149a35458
17629d0415j43386A44096J09355a57842B85972G5664J15855g4286A33882B417
17618B55967B0509J75155B5632L25852A45898L1923J50867j57216n9875a2826
17607a40311A76506K8768C359J39940J61768j12542R7463E1010J4013J73704c8046
17595e8577A66543J26335k793I5054c9598B2460J63826A6111N47267k51568A49264
17583E6631a35687E7630J0995c5555A49530J50137K1277m7362j27136c3052A71889
17571B86369E8128r056L36439e6611B51442A24212P5748a12046A81252N1876I3026
$$ y = [-114133, 268748, -28025, 107729, 241243, 137298, -56802, 78527, 219559, 121947, 243251, 407538, -124569, 389458, 89885, 282821, 22082, 177937, -167876, 132149, -135458, -40415, -183801, 144096, 253451, -157842, 285972, 75664, 191519, -74286, 133882, 2417, 255967, 20509, 195664, 25632, 351484, 145898, 177821, 328688, 171472, 111597, -12826, -140311, 176506, 205274, 3359, 143299, 305067, 192525, 289988, 51010, 65023, 238727, -38046, -58577, 166543, 292878, 290085, 95054, -39598, 22460, 186286, 16111, 563378, 311810, 149264, 56631, -135687, 57630, 68625, -35555, 149530, 299667, 320944, 273582, 146446, -33052, 171889, 286369, 58128, 49072, 385511, -56611, 251442, 124212, 199960, -112046, 181252, 233128, 93026]
17559A48192J15507A24748J15393d5406A22992b8770E7832L02069b17655A4399
17548I9911J65774E2573j2137K0591K29216b4285k52882i0092C42002j57105a1889
17536f1938A87461J2899L7860D1394O5036K02832P4014A44297a65602B23829H8424
17524C91373A80087J05476J28671A01071K04089K1122q0443J81641P5311j88810
17514C13981l6749P35J50078P6405J48395K81948j07995l813j35505l949l35200
17503C48331J25180J23246j77182j73954P3889J20208k8587j02177L79919M3692
17493G32565N5365P7900Q8511k86233j51453R958j15003j85681Q378Q4405j37384
17482A81328E2487K83755J0098J74526j73737A03611J07034p8937K18537K65763
$$ y = [148192, 263699, 124748, 240141, -45406, 122992, -28770, 57832, 359901, -217655, 14399, 99911, 265685, 52573, 40436, 61027, 290243, -24285, -277167, -90092, 342002, 184897, -11889, -61938, 187461, 200360, 238220, 41394, 106430, 309262, 383276, 144297, -165602, 223829, 88424, 391373, 180087, 285563, 414234, 101071, 305160, 326282, 245839, 427480, 502791, 313981, 277232, 277967, 428045, 504450, 652845, 934793, 826798, 822985, 687480, 683531, 348331, 473511, 596757, 419575, 245621, 319510, 439718, 411131, 308954, 688873, 732565, 787930, 865830, 954341, 668108, 516655, 526613, 411610, 225929, 234307, 318712, 181328, 52487, 336242, 346340, 520866, 347129, 103611, 210645, 131708, 350245, 616008]
17472F16008B33931A11511L96973A53472J93350H5579J21865K19867m2620j72145
17462B12546J58980j7902c4679B69154J55875H0798Q5388J05302R6099A71034
17451b21347E44066A92202K47639A71446N3396K83352B41490h4456C15104j23835
17441A91269q1263J31759B1482N05797q0759j9953p4052K36177k616p3238q487
17430E04351B47166J9319K50995K47727C35477J3494A7283K81993O9412O3064
17420D31752j63283a09220C81696O0869j96015P4259a21441D90507L5682M2681
17410E68870B61857J23368r9474Q2437G0889L66419j94283K27973j58356j6518
17400B96124q2397L62622l8600j10054o0217J09276H5622L02398A84638J90106
$$ y = [616008, 233931, 111511, 508484, 153472, 346822, 85579, 207444, 427311, 384691, 212546, 371526, 353624, -34679, 269154, 425029, 80798, 166186, 271488, 367587, 171034, -221347, 544066, 192202, 439841, 171446, 224842, 508194, 241490, -84456, 315104, 191269, 110006, 241765, 21482, 527279, 446520, 426567, 352515, 588692, 586076, 512838, 504351, 247166, 266485, 517480, 765207, 335477, 348971, 17283, 299276, 368688, 431752, 268469, -109220, 381696, 442565, 246550, 320809, -121441, 490507, 526189, 568870, 261857, 385225, 285751, 368188, 70889, 437308, 243025, 470998, 312642, 296124, 213727, 576349, 537749, 427695, 367478, 476754, 85622, 388020, 184638, 374744]
17390C74744J77097A09668J5451m6034Q9726C810J85216C6741K12527J87539k2250
17379D14557A37791J36593C3691J34049a3233B89062K23734B07430P9105J39200
17369D25735M80897C81409j2554j61634J6909Q4553o2165Q5082K2178e6465C65407
17357D23029H8248J65780j18085J60441N1406A03187j7155R9271R7587q0665J64132
17346C66357a77565C79372F4377K06665J55495I0794K43989J046a08558B24383
17335C55383j23684R1359J72093j86921J7949n5695A34500K65263j11408J06870
17325C95225A64892l4655J59718M1575L4202M6320m8901C0194j4042L18810J88492
17314E23454B10752j1139K02995r9252J02269K4663p5750A06614K81595J58217
$$ y = [374744, 551841, 109668, 125119, 79085, 168811, 3810, 189026, 36741, 249268, 436807, 414557, 137791, 274384, 33691, 167740, -13233, 289062, 512796, 207430, 286535, 425735, 906632, 381409, 368855, 207221, 224130, 308683, 246518, 331600, 353778, -56465, 365407, 423029, 88248, 254028, 135943, 296384, 347790, 103187, 86032, 185303, 282890, 202225, 366357, -177565, 379372, 64377, 271042, 426537, 90794, 334783, 335829, -108558, 224383, 355383, 231699, 323058, 495151, 308230, 326179, 270484, 134500, 399763, 288355, 395225, 164892, 130237, 289955, 331530, 365732, 412052, 363151, 30194, 16152, 334962, 523454, 210752, 199613, 402608, 303356, 405625, 430288, 354538, 106614, 388209, 546426]
17304E46426c4028B42043D9026M02582j57345A26675L2142M99593A31799J76951
17294C08750j087J37213B17103J45003A37485e7755H5638L5495Q369K16981l7277
17283C09206j1854A27231J44957K25524k35480l4155o2457J32531A11977J25343
17273B37320J26124B0606a45383C28354J01805J0842D4704L20996D8360K64692
17263C13052o083m3084l9383E2094M30583p8785P0296A94417B3344J58114o2082
17252A19376J11880m5055q160M99910B19736G1230K92658B2919N11118k55664
17242B78373J83861B30662J8724j7251q4598J75926N8379G2029R6552R8403J09255
17231C76239J32475N909k34239P7406A15840L67323B27546P2305O8619E6538L04309
$$ y = [546426, -34028, 242043, 49026, 451608, 294263, 126675, 158817, 658410, 131799, 308750, 307663, 444876, 217103, 362106, 137485, -57755, 85638, 121133, 129502, 346483, 309206, 297352, 127231, 272188, 497712, 262232, 228077, 165620, 298151, 111977, 237320, 363444, 20606, -145383, 328354, 430159, 441001, 44704, 365700, 48360, 313052, 306969, 263885, 224502, 52094, 482677, 403892, 474188, 194417, 23344, 181458, 119376, 231256, 186201, 178041, 677951, 219736, 71230, 363888, 22919, 534037, 278373, 462234, 230662, 249386, 232135, 147537, 323463, 381842, 72029, 168581, 266984, 376239, 508714, 514623, 280384, 357790, 115840, 483163, 227546, 299851, 368470, 56538, 360847]
17220C60847j52404J90352J69884p3093j92285p8086Q1109N35990B76460F1780
17209H6029M3769J64053j18970K48515A94053q5399m1126M08899L8202K0875j48068
17198C87436n8959J28990R1005j31083p5319l6172J25951k6121j6650B2714L81940
17187D04654L8907B18621J59792j22597P9551J13126M9627J08762J16218A28353
17176E99713j88208Q3005j55749N9267n5552A2755K92215F044K58181L23707k75727
17165C12205o7516h7965B20275Q1742A06146M52782B34398J80214j92299J14347
17155C36660K83451j26852p5737J9535M671B13946K02779J3896K9243P1152r367
17144E21649j46180j40619L48403j88418Q278J44912j34714J46294j43074n4692
$$ y = [360847, 208443, 398795, 568679, 495586, 303301, 225215, 306324, 842314, 276460, 61780, 86029, 129798, 293851, 174881, 423396, 194053, 108654, 67528, 476427, 514629, 535504, 387436, 328477, 457467, 548472, 417389, 342070, 305898, 431849, 405728, 389078, 22714, 404654, 443561, 218621, 378413, 255816, 335367, 448493, 498120, 606882, 723100, 128353, 599713, 411505, 494510, 338761, 398028, 342476, 12755, 304970, 6044, 264225, 587932, 312205, 244689, -87965, 220275, 302017, 106146, 558928, 234398, 414612, 222313, 336660, 620111, 493259, 417522, 437057, 441728, 213946, 416725, 430621, 459864, 531016, 521649, 375469, 234850, 583253, 394835, 403113, 548025, 413311, 559605, 416531, 361839]
17134C61839J10001C4536M64844K20430j4582k80700q9785R3372Q2609J4219J46406
17123F71349j47407j5333J33778o0021k116N823J7135j4214j94716L02985L4720
17112G31983l65428J81440j35361l9037L88915k20971o9118K36749l04876J70599
17102E74895P0169k78665O84590B88733L88283B12276M25872M3438j78801J69740
17092F72525k49292J95312O825P7131l6392k9854K75692C03834M04044C13293
17081E92676o4765J71964k56489J11805P1256j1606k9994J48365N8579q4783p9659
17070F27349m3532O7058k25826O3616K93527L0957k18628M240k26430K17113K36487
17059H25931l06799K78129j14143k2163P7046j41356R3918j74383K58073k25876
$$ y = [361839, 471840, 34536, 499380, 719810, 705228, 424528, 334743, 428115, 510724, 524943, 671349, 523942, 508609, 642387, 582366, 580250, 586073, 603208, 588994, 394278, 697263, 731983, 366555, 547995, 412634, 373597, 762512, 541541, 472423, 709172, 404296, 574895, 645064, 366399, 1050989, 288733, 677016, 212276, 638148, 681586, 502785, 672525, 423233, 618545, 625370, 702501, 666109, 636255, 911947, 303834, 707878, 313293, 592676, 527911, 699875, 443386, 555191, 626447, 614841, 584847, 733212, 791791, 707008, 627349, 583817, 650875, 425049, 488665, 782192, 813149, 594521, 598761, 372331, 589444, 825931, 519132, 797261, 683118, 660955, 738001, 596645, 690563, 516180, 774253, 548377]
17049E48377j67856K95148P0202K16360j56673P9500k88299M58257k51068k07210
17039E96738J12379K45740j79950k03464K14616j93252L87735j16360k10811N4976
17029G08347R6488l67428K27725K66502k73345L53436k04480n9605L65596k25902
17019H87334L26608j68402j78651K523M28l01305L50243p3134q0814L17781m55658
17008F26953L61973L3588j27396r4185N3828j2615J43561M8610q5311j64530J82891
16997I67367K42256o9842j68526k0190J45574k33732J00540J59018n8080M16313
16987A480698o21377j99433K22457K14757K47479j26010q4755j8904L6852k0320
16977A131444j45282J90312j10452L68196l64554M1469J55169j60132M58179m59078
$$ y = [548377, 380521, 675669, 745871, 962231, 805558, 885058, 596759, 1055016, 803948, 596738, 709117, 954857, 774907, 571443, 786059, 592807, 980542, 864182, 653371, 708347, 804835, 437407, 665132, 931634, 658289, 1011725, 807245, 747640, 1113236, 887334, 1213942, 1045540, 866889, 869412, 869840, 568535, 918778, 845644, 764830, 1082611, 626953, 988926, 1022514, 895118, 800933, 854761, 842146, 985707, 1034317, 949006, 784476, 967367, 1209623, 1139781, 971255, 951065, 1096639, 862907, 963447, 1122465, 1064385, 1480698, 859321, 659888, 882345, 1097102, 1344581, 1218571, 1133816, 1114912, 1151764, 1131444, 986162, 1176474, 1066022, 1434218, 1069664, 1111133, 1266302, 1106170, 1564349, 1105271]
16967A105271k7050N55390k04379j93252J29331l4251o1731R4456j27983K08680
16957A444482J6928P2275J12611l80903n2259J99328j68061J07896J94903j15796
16947A431404K43812l8293p0547k8100n5433R6133j7198k12851J72373R1098J96659
16936A809057l61085R5544k31926R0811L00231l16030J15909K30286r8560O8292
16926A702529M6439J03909l77163j50787K2655N15300j66655O410p9771M53790
16916B076656l17549Q4247L19945m19922Q5649K71883l40448j39338P7869J06276
16906A805268K72582q9550j14350O3169K61204j02310j12874J50048N4130k32546
16896A954771j44520N91523j6766k7012K07862j45061L42288m38349K45654j56365
$$ y = [1105271, 1078221, 1633611, 1429232, 1235980, 1365311, 1331060, 1269329, 1363785, 1235802, 1444482, 1461410, 1533685, 1646296, 1265393, 1213134, 1412462, 1244401, 1352297, 1547200, 1431404, 1675216, 1636923, 1566376, 1538276, 1482843, 1578976, 1561778, 1348927, 1521300, 1612398, 1809057, 1447972, 1543516, 1311590, 1402401, 1702632, 1386602, 1502511, 1732797, 1634237, 1702529, 1748968, 1852877, 1475714, 1324927, 1347582, 1862882, 1696227, 1702637, 1622866, 2076656, 1759107, 1843354, 2163299, 1743377, 1829026, 2100909, 1760461, 1621123, 1698992, 1805268, 2077850, 1988300, 1873950, 1937119, 2198323, 2096013, 1983139, 2133187, 2187317, 1954771, 1810251, 2401774, 2385008, 2357996, 2565858, 2420797, 2763085, 2324736, 2570390, 2414025]
16886B414025K2335J36606j65095L80651p3667J30094k09382O3813k41655K85275
16876B743000N8923M4083n7136j52897L57798Q7483j66629M29204m42180L30645
16866C232294l5851K4909k24028J14378r5299N24074o3711j10170J11314n7298
16856C420612L79811P5374O2909k3432l69631L18884K33366j08962J22362J84991
16846D296284k62571l114O1597P7786K63574N3722p9669m3605J22731L53424l61509
16835D478650K10574L50884l5328k15697K26567P7268n965L17124k02111K16630
16825E418596K00079J06037j81429J19863N09641m81661L75405M3257L66220j47047
16815F328961M00882o8221P3377P1285J72850L27291J53386l12268L31540K05193
$$ y = [2414025, 2436360, 2572966, 2407871, 2788522, 2714855, 2844949, 2635567, 2699380, 2457725, 2743000, 2801923, 2846006, 2788870, 2635973, 2993771, 3081254, 2914625, 3343829, 2901649, 3232294, 3196443, 3221352, 2997324, 3111702, 3016403, 3540477, 3476766, 3366596, 3477910, 3420612, 3800423, 3875797, 3938706, 3915274, 3545643, 3864527, 4097893, 3988931, 4111293, 4296284, 4033713, 4030599, 4092196, 4169982, 4433556, 4487278, 4407609, 4364004, 4486735, 4840159, 4478650, 4689224, 5040108, 5004780, 4789083, 5015650, 5092918, 5086953, 5404077, 5201966, 5418596, 5618675, 5724712, 5543283, 5663146, 6172787, 5691126, 6066531, 6109788, 6476008, 6328961, 6729843, 6661622, 6734999, 6806284, 6979134, 7306425, 7459811, 7147543, 7479083, 7684276]
16805G684276p1616K82896K91476L75320R7142K464J35135L69725K91852L07820
16795I766490j42367L10300J0275K56194K50869M00034o8591M91037N03421J02414
16785A1880076K59925K44771K79437K94373L91694L77824L01294L92536K43494
16776A4665424L85058K81103K93231Q15367O54Q57005K91138O91807M44308M54039
16766A9179134O00190M26015R01211M44482Q46885N88963Q46849O10666P15999
16757B5160394R27482Q80008P05294J268438Q95670J071690J354231J094397J015279
16748C4372883J469793J272344J010743J724690J462969J981773J468386J902012
16740D6665593J720982K113187K154659K203199K073500K340336K805097K762032
$$ y = [7684276, 7612660, 7895556, 8187032, 8562352, 8659494, 8661958, 8797093, 9166818, 9458670, 9766490, 9624123, 9934423, 9944698, 10200892, 10451761, 10851795, 10783204, 11274241, 11777662, 11880076, 12140001, 12384772, 12664209, 12958582, 13350276, 13728100, 14029394, 14421930, 14665424, 15050482, 15331585, 15624816, 16440183, 16440837, 17297842, 17588980, 18280787, 18725095, 19179134, 19779324, 20205339, 21106550, 21551032, 22397917, 22986880, 23833729, 24444395, 25160394, 26087876, 26967884, 27673178, 28941616, 29837286, 30908976, 32263207, 33357604, 34372883, 35842676, 37115020, 38125763, 39850453, 41313422, 43295195, 44763581, 46665593, 48386575, 50499762, 52654421, 54857620, 56931120, 59271456, 62076553, 64838585]
16732F4838585K888611K858269K911057L191370L353880L600561L204494L809648
16724I0656475L917321L782467L915916L845113M242555L943306L910215M032341
16716A22245709L584621L854269K874850L176370K751649K445924K129519J610539
16708A44673450R91454M69035Q17750n20142p81556j458453j645316k181867k692568
16699A37671787k619405l433608l602961l396806m046186l955365l583871m126719
16691A08906866m493463l655721m182614l534885l744225l725321l607508l531166
16683G8431963k917748l374699l210395k737309k790518k904358k458291k271921
16675E5766724k311238k012808k279016j778351k173786j439914j856372j664158
$$ y = [64838585, 67727196, 70585465, 73496522, 76687892, 80041772, 83642333, 86846827, 90656475, 94573796, 98356263, 102272179, 106117292, 110359847, 114303153, 118213368, 122245709, 125830330, 129684599, 132559449, 135735819, 138487468, 140933392, 143062911, 144673450, 145664904, 146133939, 146951689, 146431547, 145649991, 144191538, 142546222, 140364355, 137671787, 135052382, 131618774, 128015813, 124619007, 120572821, 116617456, 113033585, 108906866, 104413403, 100757682, 96575068, 93040183, 89295958, 85570637, 81963129, 78431963, 75514215, 72139516, 68929121, 66191812, 63401294, 60496936, 58038645, 55766724, 53455486, 51442678, 49163662, 47385311, 45211525, 43771611, 41915239, 40251081]
16667D0251081j730535j116972j622016j361178j421689r13269j164462j100864
16659B9820096j033872q20010r75688j005254p04431j198590o96246p90672m09896
16650B2185437r25361l31146r07783o72488j46096p62217o59421n70324k64019
16641A6946582k22913p30029n04285l35738l68525o97005j28571m55712m69113
16632A3034691j0191m88337n83987K30469o33775j00857k63824l79046j49534
16623A0655609l43680n30495P4494K12638o93557K7417n28550K63124l69911j54096
16613H612993K46980o83925k58042J66535k38299m39469l6109K5918l61654j79600
16603F855328R4636k2900Q8396k21805l34173j44782q2781m99276K68266n7853
$$ y = [40251081, 38520546, 37403574, 35781558, 34420380, 32998691, 32085422, 30920960, 29820096, 28786224, 27966214, 26990526, 25985272, 25280841, 24082251, 23386005, 22595333, 22185437, 21260076, 20928930, 20021147, 19348659, 19202563, 18440346, 17780925, 17210601, 16946582, 16723669, 15993640, 15489355, 15153617, 14785092, 14088087, 13959516, 13503804, 13034691, 13024500, 12536163, 11952176, 12182645, 11548870, 11448013, 11184189, 10805143, 10655609, 10311929, 9781434, 9855928, 10068566, 9375009, 9402426, 8873876, 9137000, 8767089, 8612993, 8859973, 8176048, 7918006, 8084541, 7846242, 7406773, 7370664, 7396582, 7034928, 6855328, 6949964, 6927064, 7015460, 6793655, 6459482, 6314700, 6231919, 5732643, 6000909, 5943056]
16593E943056j9788n5756k69654k06378k95721P6852K51379l74606k12291L19164
16583E156257m01633L077q921m00617O1190j46891J58691k247j87125K95362j55971
16572D371172l36370Q7446J54190k64732P2335k46201k85171K65412J34117n1579
16562C900619l31941K61694n95481L34651R4508k04191l7821m2936k78542L66635
16552C467195J2402k45380K0252j27263K48138k61369k90142J33224j8697k77118
16542B661242O4988l26418L89868j88906K3614P8875j0252j94616n4232Q0611
16532B524774K25495j63406o37l55825K9361M00571l41255p9347L09449j89344
16522B359836k01133k5694J01712p4330L6903K19566o32989K49127K39165l27464
$$ y = [5943056, 5923268, 5867512, 5597858, 5391480, 5095759, 5172611, 5423990, 5049384, 4837093, 5156257, 4754624, 4757701, 4748780, 4348163, 4409353, 4262462, 4421153, 4418906, 4231781, 4527143, 4371172, 4034802, 4122248, 4276438, 4011706, 4084041, 3837840, 3552669, 3818081, 3952198, 3900619, 3568678, 3830372, 3234891, 3569542, 3664050, 3459859, 3422038, 3379102, 3100560, 3467195, 3479597, 3234217, 3254469, 3127206, 3375344, 3113975, 2823833, 2957057, 2938360, 2661242, 2726230, 2399812, 2789680, 2600774, 2624388, 2703263, 2693011, 2498395, 2444163, 2524774, 2750269, 2586863, 2586226, 2230401, 2259762, 2660333, 2319078, 2239731, 2549180, 2359836, 2158703, 2133009, 2234721, 2160391, 2197294, 2416860, 1783871, 2032998, 2272163, 1944699]
16512A944699K64808l66732L70806m02837K8055k33382M05433l89454K29392N5508
16502A906296k0331r1905M8207l94677J20872K32753Q5322m38746P3474o9218
16492A452047M12833k97284J56764k81507j32196K8286J76545Q776J36808l05598
16482A355474L59050k89386q2108N017M70870l25777k59044L12848l58470N65581
16472A754055l10004n5144j14316r4516J05925P6616j84777j84181M82525k85553
16462A190630L35037j65275l21942L09945n82287P22114q9863j41528j2680L0215
16452A274366p4677K3574k01671L94773k59221L9390k4822j35904J09175l77025
16442G67958K15671J91667l26560M51597m25258K55261k17562L8857Q9337O5811
$$ y = [1944699, 2209507, 1842775, 2213581, 1810744, 1838799, 1605417, 2010850, 1621396, 1850788, 1906296, 1885965, 1794060, 1842267, 1447590, 1568462, 1801215, 1886537, 1447791, 1521265, 1452047, 1864880, 1567596, 1724360, 1442853, 1310657, 1338943, 1515488, 1524264, 1661072, 1355474, 1714524, 1425138, 1343030, 1348047, 1818917, 1493140, 1234096, 1546944, 1188474, 1754055, 1444051, 1388907, 1274591, 1180075, 1286000, 1362616, 1177839, 993658, 1476183, 1190630, 1525667, 1360392, 1038450, 1348395, 766108, 1488222, 1398359, 1256831, 1244151, 1274366, 1199689, 1223263, 1021592, 1416365, 1157144, 1196534, 1171712, 1035808, 1144983, 767958, 983629, 1175296, 848736, 1300333, 875075, 1130336, 912774, 951631, 1040968, 1106779]
16432A106779K7567j47808j30149K74865P2609j15643J54121j03555m5063p5409
16422A018314L70979m74135K2646j12712O1555o3121l49856K79982K65608m42200
16412E77060L89029j753p7557K04363m15652J85446Q2811N4355l70127n7541J42932
16401G13366K85163J9558k87693j62817j19898K79692L4524J77053j06196M7140
16391H79892l66420R1837L50002D10811N83651M462k42943m1765j37722j92M23522
16380I99824r4012j4867k34517Q3871l2365j40206L95275j58826K892j95372M79097
16369A090794l88316M3550J09939j81751K44573j06862j64988r0816K95854k44523
16359F07454M76932l15965k24824l348j7115M21860j25046j96834B52646M09754
$$ y = [1106779, 1134346, 986538, 856389, 1131254, 1203863, 1088220, 1242341, 1138786, 1093723, 1018314, 1389293, 915158, 937804, 825092, 886647, 823526, 473670, 753652, 1019260, 577060, 966089, 964336, 886779, 1091142, 675490, 860936, 943747, 998102, 627975, 570434, 713366, 998529, 1018087, 730394, 567577, 447679, 727371, 761895, 938948, 832752, 879892, 513472, 605309, 955311, 410811, 994462, 998924, 755981, 714216, 576494, 576302, 999824, 905812, 890945, 656428, 740299, 707934, 567728, 963003, 804177, 807069, 611697, 1090794, 702478, 746028, 855967, 674216, 918789, 811927, 646939, 556123, 851977, 607454, 1084386, 768421, 543597, 540249, 523134, 944994, 819948, 623114, 252646, 662400]
16349F62400J12318k06878K8586K07870k52091j83420L13315k87351J85423R239
16339E89411N3623A82001P58537D61350F3247P74984l68739l6357J25643J33495
16329F92273K70911m49547J90751B06637N25859k19424k6955K78011l20419J49747
16319E93456J27195J03866l77869j63198J76200Q8636r15j68809L3471L5938J15384
16308E63355r147q3406L81645l31852N6046A94215O03874j89098A05968N45958
16298F51926r2956l2871j50662L6863k8071K28447j34476m7390J54578k24294
16288C61094o5892R1338J93967o3409B46642m5164L47987A95048N17327B01544
16277B10833L30793P1754r0117B58412K27402R4849j01260Q2322j89412j20837
$$ y = [662400, 774718, 567840, 596426, 804296, 552205, 368785, 682100, 394749, 580172, 589411, 643034, 182001, 940538, 461350, 63247, 838231, 469492, 433135, 558778, 692273, 963184, 513637, 704388, 206637, 732496, 513072, 486117, 764128, 443709, 593456, 720651, 824517, 446648, 283450, 459650, 548286, 547371, 378562, 412033, 447971, 563355, 554208, 470802, 852447, 520595, 576641, 194215, 798089, 608991, 105968, 651926, 558970, 526099, 375437, 412300, 384229, 612676, 478200, 430810, 585388, 361094, 295202, 386540, 580507, 517098, 246642, 201478, 549465, 195048, 712375, 201544, 210833, 541626, 613380, 523263, 258412, 485814, 580663, 479403, 561725, 372313, 251476]
16267B51476P1879K55251A87770J73682n7256n5782J98925A77801M71470j96816
16257D52455M1298o2416K6082K4196m4250O050B09147p3252J54517L56706J12701
16246G59819C06085j4469J3619m4158b4400E66579k63724A2416K14985J72127
16236C99528j63390K63616A56117K7945p9924M29909A92552J50612R6071A52366
16225C22721k7156n583j41431J11260A13839J01622b4240E91974B45206J36385
16215C81591j62478j00120J05521H0074M8667M93068C2575M35275K7150B27069
16204C46909A06845K62667A28837K3967K82606j22496l2815K24804j1548A75392
16193C19423N6775H3227J44733B0863K42569m6942J61794a0791C07542Q1441j26084
$$ y = [251476, 323355, 578606, 187770, 361452, 304196, 248414, 447339, 177801, 649271, 452455, 493753, 431337, 457419, 481615, 437365, 443415, 209147, 135895, 290412, 647118, 759819, 306085, 291616, 305235, 261077, -24400, 566579, 302855, 12416, 227401, 399528, 236138, 499754, 156117, 184062, 104138, 534047, 192552, 343164, 439235, 152366, 322721, 295565, 289982, 148551, 259811, 113839, 215461, -24240, 591974, 245206, 381591, 219113, 118993, 224514, 80074, 128741, 621809, 32575, 467850, 495000, 227069, 346909, 106845, 369512, 128837, 152804, 435410, 312914, 280099, 504903, 493355, 175392, 319423, 376198, 83227, 227960, 20863, 263432, 216490, 378284, -10791, 307542, 388983, 262899]
16182B62899r4324L11318A18151J39866J5309J18664j63487L23924j57894A87639
16171B40884m5446K35448j09177a06140B03735N213J0462J879J18597r0203k9049
16160B20634k2299o7074K16418j23213J07204A59633M12231E2620a23958C04474
16149F1062K00990F2434R1662J51548O7724G7023K43354A3481J98153M9977c4151
16137D44336C2609O8044L89177o6030A19215K93700A25389L24701b18495C35183
16126C15279b93902G7109J18026F4637J76529O9913q1266C1226K60097n1704c2162
16114H6648L7632D2880h2009A8237J33442J5350E47a63532M1472D89345j25223
16103C64122A10213N2693p3972a48453N863k51675I9624J41359J52688j61263
$$ y = [262899, 168575, 479893, 118151, 258017, 273326, 391990, 228503, 552427, 394533, 187639, 240884, 195438, 430886, 321709, -106140, 203735, 208948, 219410, 221289, 339886, 249683, 220634, 198335, 131261, 347679, 224466, 331670, 159633, 571864, 52620, -123958, 304474, 61062, 262052, 62434, 154096, 305644, 373368, 77023, 320377, 13481, 211634, 261611, -34151, 444336, 32609, 100653, 489830, 423800, 119215, 412915, 125389, 450090, -218495, 335183, 315279, -293902, 77109, 195135, 64637, 241166, 311079, 229813, 31226, 291323, 239619, -32162, 86648, 124280, 42880, -82009, 18237, 151679, 167029, 547, -163532, -122060, 489345, 364122, 110213, 162906, 88934, -148453, -142590, -394265, 99624, 240983, 393671, 232408]
16093B32408G9701L3698J1709A8162J39415j3639m583F2261K13934j02572J88265
16082C61888A80715o9991a23980C7098c777D0610J77452a44795C68120H3857k8351
16071E5506a10398F938a2575G5709j093L6618k9653J19055d5226l131C75524F5472
16058B1627R9832A1645K50290L0182f9044A2893K71059d933r6081A45897D3305
16046B314K46191a83864B5329e6362B2078J84599A0028L4020J84646L9722A4075
16034h4180B3836c537D5736c9624A50303C7429J45815R7540a34227A30211b2576
16022A17579R6956a80830A02852b9154B66803c575r0198A83792g7351B16268d6505
16010A33484d3307A36673F6100b10319B47111b6778j83272g3846B01705g7516
$$ y = [232408, 79701, 113399, 125108, 18162, 157577, 143938, 139355, 62261, 276195, 173623, 361888, 180715, 110724, -123980, 37098, -3777, 40610, 218062, -144795, 368120, 83857, 55506, -110398, 6938, -12575, 75709, 74616, 111234, 81581, 200636, -45226, -48357, 375524, 65472, 21627, 121459, 11645, 261935, 292117, -69044, 12893, 283952, -4933, -101014, 145897, 43305, 2314, 248505, -183864, 25329, -56362, 22078, 206677, 10028, 44048, 228694, 268416, 14075, -84180, 23836, -3537, 45736, -39624, 150303, 37429, 183244, 280784, -134227, 130211, -22576, 117579, 214535, -180830, 102852, -29154, 266803, -3575, -93773, 183792, -77351, 216268, -46505, 133484, -43307, 136673, 66100, -210319, 247111, -26778, -210050, -73846, 201705, -77516]
15999G0494N8320b06222C46540g3563j91472g9114G8996d60224A82971a54051
15988E382a18391A84890D1811k0608g2978j5872A41131j8907j3461Q0246I1558
15976a16250j89807C30371B783K87711J3520K30028K06535m0624m1116j20888
15966E37949j05262N1550C6622J17516P3215h8389A42400a55030O5986h152o5876
15955g4028C6549c8579l5104A38355b23424b3452C1363M0976b5412o7645B74515
15943a05250B6795O1103j1467k1690c11874C11008f6317H6986b78755c1311l75400
15932d06711a18705I1904d3946G4885K4898b61597c5414p0858K959B7775b74065
15920B31053F4168k998P5331a02592B38574a6832f239k30511A30002P0845N8830
$$ y = [70494, 128814, -206222, 346540, -73563, -265035, -79114, 78996, -460224, 182971, -154051, 5382, -118391, 184890, 41811, 21203, -72978, -88850, 141131, 122224, 108763, 189009, 91558, -116250, -306057, 330371, 2783, 290494, 304014, 534042, 740577, 699953, 658837, 537949, 432687, 484237, 36622, 154138, 227353, -88389, 142400, -155030, -89044, -8152, -74028, 36549, -38579, -73683, 138355, -223424, -23452, 31363, 72339, -25412, -93057, 274515, -105250, 26795, 87898, 76431, 54741, -311874, 311008, -66317, 86986, -278755, -31311, -406711, -118705, 91904, -43946, 74885, 99783, -261597, -35414, -106272, -103313, 27775, -274065, 231053, 64168, 61170, 136501, -102592, 238574, -16832, -6239, -236750, 130002, 200847, 259677]
15909B59677a9709o5826j15540C06843G3841a18143A38620a65253A44675a17060
15898I7901a41857H250a50714A77388M3215l7593d1130k99026J17232m6772A26753
15886b26334R7571j2672j8375F7609a5920C6134e7156G3953a35960A38551J68295
15875C06846b13196g4692j24121R3942A83259a33485K6738n315A06698b62084
15864E7417a95075h2862A27935L7595a72883j20376C6793a35125d6232C595J55183
15853A58778J49803b47404A80733E2132f6850C1909h4938j6312A3992a08240j55798
15842b64038A8973a0642j62084A74594D2770J93764b11891B3600J31675a79400
15831b76131J24668A87347n6362a51966k34257F3761J70612b19347B74756A35218
$$ y = [259677, -19709, -85535, -201075, 306843, 73841, -118143, 138620, -165253, 144675, -117060, 97901, -141857, 8250, -150714, 177388, 220603, 183010, -41130, -340156, -222924, -269696, 126753, -226334, -128763, -141435, -159810, 67609, -15920, 36134, -57156, 73953, -135960, 138551, 306846, -213196, -74692, -198813, -104871, 183259, -133485, -106747, -112062, 106698, -262084, 57417, -195075, -82862, 127935, 165530, -172883, -293259, 36793, -135125, -46232, 3595, 158778, 308581, -247404, 180733, 52132, -66850, 31909, -84938, -101250, 13992, -108240, -264038, 18973, -10642, -172726, 174594, 42770, 236534, -211891, 23600, 155275, -179400, -276131, -151463, 187347, 130985, -151966, -386223, 63761, 234373, -219347, 274756, 135218]
15820c77704B47949a23977M9805R05m03115B00806c46405e0129m129A803b60283
15808A84571g9111j74225p9020B66049G2426Q199e6218k57362j26101a02310L6419
15797f5891E7319b35990B61410a59179C0150a67834k69998f3593N724j8645F9815
15785B21569k4534g4034D9627Q904J5400b41770o5528A45417h1823A97923Q8653
15774B86576a80860M8751j54670e2150i754B6443K02990a5441k4688A42548e8222
15762h3057l7060G4859M83195C5627a88740C4378P7582a32661B01573a72591G7549
15750A33536P9257r9244b25616h9082K1139A79856q5823O510J11131C6466b36741
15738E04244A8467K56999a1257j58166f0630J5428c74C87759A29353b43569G1912
$$ y = [-377704, 247949, -123977, -74172, -73267, -476382, 200806, -346405, -50129, -54258, 1803, -260283, 184571, -79111, -253336, -332356, 266049, 72426, 80625, -56218, -313580, -439681, -102310, -65891, 57319, -235990, 261410, -159179, 30150, -167834, -437832, -63593, -57869, -76514, 69815, 221569, 197035, -74034, 49627, 58531, 73931, -241770, -307298, 145417, -81823, 197923, 286576, -180860, -132109, -286779, -52150, -9754, 26443, 229433, -15441, -40129, 142548, -58222, -83057, -120117, 74859, 558054, 35627, -188740, 34378, 111960, -132661, 201573, -172591, 77549, 133536, 212793, 113549, -225616, -89082, -67943, 179856, 94033, 100543, 211674, 36466, -236741, 504244, 18467, 275466, -11257, -169423, -60630, -45202, -374, 387759, 129353, -243569, 71912]
15726A38432b25708J07940j06292O5120J2895j0560B6743N1687K59453E5256J06251
15715A61507h2305m6290J870j13909h3494n120A47238K48760E2960a89795A97978
15703b12044J2442L4240G3495e4558A23215b18355i9711Q632B58630a79835D3232
15691g0896H0367b05020N2063d1592J8731k02136a02574H6270J3324j1215g2680
15679H1217d6735B15121m2050h9463B94297j19748Q7687a69735A39789B4768K25155
15668B49923i2925l7008n6470r2346H0930K25414f3668F3761J30160H0653i8789
15656B3379b47414B04224N7039g1748m1322F4166N5423K28068A08085b0348A60803
15644D0323d75755c1561m5683A84170a45973q961d2323J0891n3108B0948K70796
$$ y = [138432, -225708, -117768, -224060, -158940, -146045, -156605, 26743, 78430, 337883, 55256, 161507, -82305, -128595, -126725, -240634, -83494, -88614, 147238, 395998, 52960, -189795, 197978, -212044, -199602, -165362, 73495, -54558, 123215, -218355, -99711, -91079, 258630, -179835, 43232, -70896, 80367, -205020, -152957, -41592, -22861, -224997, -102574, 86270, 99594, 88379, -72680, 81217, -46735, 215121, 173071, -89463, 294297, 174549, 262236, -169735, 139789, 24768, 249923, -92925, -129933, -186403, -278749, 80930, 306344, -63668, 63761, 193921, 80653, -98789, 23379, -247414, 204224, 261263, -71748, -113070, 64166, 119589, 347657, 108085, -20348, 160803, 40323, -475755, -31561, -77244, 184170, -145973, -154934, -42323, -31432, -84540, 20948, 291744]
15633B91744i6468A08965b0766o2642G7770K36846i4773E0165B3029a03190m9989
15622a53179j8324j41321J09447R0152N0983C2818b47148B87292a02801l91C8500
15610c35581a42609j00705a16773k449D8642b7813E1250K00393a74851L3802N3020
15599h8029E2785e75921A02943b23146b4030H9473c32387B72894a61273j53333
15589c14606a38116l4397b4127j01182k4785o262A71832j5384d4981B30032E4345
15577b94410a39025B47632F3662a11896b3527A03611Q3677c00527e8172A81530
15566a57238p7820j49793a27528E4980k1644b17009A28261a03149F1903b55329
15555A02279e5835j44868h4794J5157a6343B57549a84499L8057M4344a2910r1710
$$ y = [291744, -96468, 108965, -20766, -83408, 77770, 314616, -94773, 50165, 23029, -103190, -153179, -171503, -312824, -203377, -113225, -62242, 32818, -247148, 287292, -102801, -103192, 38500, -335581, -142609, -243314, -116773, -119222, 48642, -27813, 51250, 251643, -174851, -141049, -88029, 52785, -575921, 102943, -223146, -24030, 89473, -332387, 272894, -161273, -314606, -138116, -172513, -24127, -125309, -150094, -156356, 171832, 156448, -44981, 230032, 54345, -294410, -139025, 247632, 63662, -111896, -23527, 103611, 187288, -300527, -58172, 181530, -157238, -235058, -384851, -127528, 54980, 33336, -217009, 128261, -103149, 61903, -255329, 102279, -55835, -200703, -84794, -69637, -16343, 257549, -184499, -146442, -102098, -12910, -104620]
15544a04620D3399K64833A39505o1332b83621A8842h1078C06380a98180H2459
15533a3825H5797J09044b33771B44248D6085K2415g6079A6824b90116A66998a5973
15521A98254a10402K0361M0037l20468R0098D68380E6795K90105c6602j11952
15511a48554i500l3351B10873j1040E0781a14948j301E02283j29568a80112B81734
15499A80116R4267b23111A99896r8006N3069h5609E0645J27230a04929I7849M0519
15488A38368Q5636J56880p0124G6306J08484H613g6992L6936A46642L7479J23643
15477C07764b36971a233A93153D8320h4159A04381i0439c0043B37570b0491A16862
15465B00127J65851l2690A40870A7849M64544B31764K4772J17156J10165k28562
$$ y = [-104620, 43399, 308232, 139505, 78173, -283621, 18842, -81078, 306380, -198180, 82459, -13825, 85797, 194841, -233771, 244248, 46085, 68500, -76079, 16824, -290116, 166998, -15973, 198254, -110402, -90041, -50004, -370472, -280374, 468380, 56795, 346900, -36602, -148554, -9500, -42851, 210873, 199833, 50781, -114948, -116249, 502283, 372715, -180112, 281734, 180116, 274383, -223111, 199896, 101890, 154959, -85609, 50645, 177875, -104929, 97849, 138368, 224004, 380884, 310760, 76306, 184790, 8613, -76992, -40056, 146642, 184121, 307764, -236971, -1233, 193153, 48320, -84159, 104381, -90439, -30043, 237570, -20491, 116862, 200127, 365978, 333288, 140870, 17849, 482393, 231764, 256536, 373692, 483857, 255295]
15455B55295A02695M9042a03424B07863a3044K21B58784H970J64606J08798b82248
15443A57365a49520J6820c8010j15429c5905J5457D13748A28087a06442A72923
15432d8362A35393c5242B66153n1133j02930L51993N9813M20038J01497j46299
15422H99132l70379k29508K23120A59889J6018C4684a06751M8009E6321J63717
15412B20038l7443i0689l18469c670A51885h309B9957e9453E5898a15313r1200
15401b06513C53974b6456B06753a48219b8946E1341A4651R2917J67567B3845a48808
15389I459K14295A7885g9907B3972b26305A12668b62500G5913f3116A74178d3752
15377a38117E8297g6076n4276A6956J7134Q3065m5070a3941F9005J375P3441o9155
$$ y = [255295, 102695, 151737, -103424, 207863, -13044, -12823, 258784, 8970, 173576, 282374, -282248, 157365, -149520, -132700, -38010, -153439, -35905, -20448, 413748, 128087, -106442, 172923, -48362, 135393, -35242, 266153, 215020, 112090, 464083, 523896, 943934, 1045431, 899132, 528753, 299245, 522365, 159889, 175907, 34684, -106751, -58742, 56321, 220038, 182595, -90689, -409158, -3670, 151885, -8309, 29957, -59453, 55898, -115313, -206513, 353974, -26456, 206753, -148219, -28946, 51341, 14651, 107568, 275135, 23845, -148808, 9459, 223754, 17885, -79907, 23972, -226305, 112668, -262500, 75913, -63116, 174178, -43752, -138117, 58297, -76076, -130352, 16956, 34090, 117155, 72085, -13941, 69005, 70380, 143821, 74666]
15365G4666K92560j49559F5004c2618j92380C4727C783M64626n6268j90277R7326
15354C19190e0333A58634n6602J43612l2113B0408J94701a39094E5564i9682C05137
15342a13055l8403g29A52903J18930O8051G9052J05043n8331a30947A63207M2476
15331B05683j0651K83720j16827j09994A9692b7189B32758n5066M8420i06B8124
15319h842A00882J92321D6471L75803g4469H5939B844b22750D49005j15679A3612
15307C4043K83225G8248K47352H8849Q80L43982j61428D2564L4534J15675E0240
15295A28700d9491C95592c02750E19965j80107b1994C68781h6445L7065k15004
15285b64384i3837D9369O9284a81548k48161C01386C7334f0194j54266A43779
$$ y = [74666, 367226, 217667, 65004, -32618, -224998, 34727, 3783, 468409, 412141, 221864, 319190, -50333, 158634, 102032, 245644, 213531, 20408, 215109, -139094, 55564, -99682, 305137, -113055, -151458, -729, 152903, 271833, 339884, 79052, 184095, 125764, -130947, 163207, 205683, 195032, 478752, 361925, 251931, 19692, -27189, 232758, 177692, 226112, -906, 28124, -8842, 100882, 293203, 46471, 422274, -74469, 85939, 2844, -222750, 449005, 333326, 13612, 34043, 317268, 78248, 325600, 88849, 89729, 433711, 272283, 42564, 77098, 192773, 50240, 128700, -49491, 395592, -302750, 519965, 339858, -21994, 368781, -86445, -49380, -264384, -93837, 49369, 118653, -181548, -429709, 301386, 37334, -60194, -214460, 143779]
15274a144j26347K3637A42692a00131B8661K7056f8405B74617M003F7412d3103
15262a32756I0687N8338a7886A57960O8498F5779a59061D9646d5194p90A66654
15250I340M46957j46312A41743a23184A16743N1542C6256a14151A79507B1857
15239C67514a23282B30061J19091j31893A8002L12942o2912L42259J7354J37292
15229G64937O56321l540O5938n6367E41255j18733n0322J2811j74648a44672A99835
15217H5938J94655A00398i196C0080a03390F761L83216D5416d445o3743A42064
15205B9461R059M26P7345J53149F3897J15510a84025A79970p9589K87398a87266
15193E0361i530A9545K66266i969p9889b101C5301A0819L1797b11299P7185N3709
$$ y = [-1144, -127491, -103854, 142692, -100131, 28661, 55717, -68405, 274617, 278620, 67412, -43103, -132756, 90687, 149025, -17886, 157960, 226458, 65779, -159061, 49646, -45194, -45984, 166654, 9340, 456297, 309985, 141743, -123184, 116743, 168285, 36256, -114151, 179507, 21857, 367514, -123282, 230061, 349152, 217259, 18002, 330944, 268032, 610291, 627645, 764937, 1421258, 1417718, 1483656, 1427289, 541255, 422522, 372200, 385011, 210363, -144672, 199835, 85938, 280593, 100398, -9196, 30080, -103390, 6761, 389977, 45416, -4445, -68188, 142064, 29461, 38520, 38946, 116291, 269440, 63897, 179407, -184025, 179970, 100381, 387779, -187266, 50361, -9530, 19545, 285811, -9969, -89858, -2101, 35301, 10819, 42616, -211299, -134114, -80405]
15181h0405n0432A35885L3210K273M622A9450b0566A37102o3607J37530d2034
15169B91141f8448C31548A13943J96160A51942b5089C6912N4957m1633c13651
15158A65300q426M2928A7257K8652M5991a86043j8089D4677e735A117h984B64806
15145A95093J4377f4595C23611A27822J45603A12491a28965A36088Q7857E1370
15134a73007C80490A22512D1247N3875K05190D3248J11541K28161A45995e76I0656
15122C19435d2529B16143B4598e2963j77634c8582C49310M0699d7107C6643P9287
15111A15930L51488h9859c0505C04442J14429j28265j299j8344J41267j42887
15101B69343k8080O412n8548K18228A59004K19132c8242j03773B51912N2475B1001
$$ y = [-80405, -130837, 135885, 169095, 171368, 175990, 19450, -20566, 137102, 73495, 211025, -42034, 291141, -68448, 331548, 113943, 310103, 151942, -25089, 36912, 91869, 50236, -313651, 165300, 156874, 199802, 17257, 45909, 91900, -186043, -204132, 44677, -5735, 1117, -8984, 264806, 195093, 209470, -64595, 323611, 127822, 273425, 112491, -128965, 136088, 223945, 51370, -173007, 380490, 122512, 41247, 95122, 300312, 43248, 154789, 382950, 145995, -576, 90656, 319435, -42529, 216143, 24598, -52963, -230597, -38582, 349310, 390009, -47107, 36643, 115930, 467418, -89859, -30505, 304442, 418871, 290606, 289307, 270963, 412230, 269343, 241263, 247675, 189127, 407355, 159004, 378136, -38242, -142015, 251912, 304387, 21001]
15089A57314A5270Q0821a9858H9111L43868p2169A55680Q9669h1271A56129n6827
15078I9302N6498O2511E8073K98484i8233a2270B34177k2904J9973q0167e2754
15066e4315C68801A20773D3542P3984J26235K22303A75631p6760k1879k0321N9728
15055A16399K52605a78586A27140a06424E7198k4738M01400j34891M2409a15881
15044B03983G345N94948A87163J86559B5362M15131J2449k11273N337Q2646A29654
15032A93473R9123C1938M02487h7435D73816A02288K88457p3608Q6015I9126K72215
15021C71341n3235K93164A86264R8519p382J32389K01359k49082K17250K63071
15011H42388o8124j24463k42046M0494j80825L47661j58221J96508k63151O6552
$$ y = [157314, 15270, 96091, -19858, 89111, 432979, 360810, 155680, 245349, -81271, 156129, 99302, 155800, 218311, 58073, 356557, -98233, -12270, 234177, 211273, 231246, 151079, -52754, -54315, 368801, 120773, 43542, 117526, 243761, 466064, 175631, 98871, 76992, 56671, 116399, 369004, -178586, 127140, -106424, 57198, 32460, 433860, 298969, 341378, -115881, 203983, 7345, 602293, 187163, 373722, 25362, 440493, 452942, 241669, 247006, 329652, 129654, 193473, 292596, 31938, 434425, -87435, 473816, 102288, 390745, 317137, 403152, 99126, 371341, 318106, 611270, 186264, 284783, 277401, 409790, 611149, 362067, 579317, 842388, 774264, 649801, 407755, 448249, 267424, 615085, 456864, 653372, 390221, 456773]
15001D56773j34245n7622L80591J3780B73590Q6601A04394J24398J57093k1929
14991C63956J02246A99362J69253K5072A52313M37663j84581M6997L27527B70780
14980A55947L39279B22266J04669j11610L00771m9209P925R0590j92915A37615
14969D78549j67220M31603N9141j04501K77524L5475l06365k79772j32489m3781
14959B48164L11021K08786k46971N7868j22334O3193j8492j01532M9293m2850
14949D06146C5448L47658Q9031m4688j08576n2976M04352k39369A78535J15142
14939B93677K75703H5273J16385L05256J9838B09018J6692G3534M77907A36382
14928F77457j84525N866K61782k75303j80800J18635M19073D02456Q6731P1953
$$ y = [456773, 322528, 264906, 645497, 659277, 273590, 360191, 104394, 228792, 385885, 363956, 466202, 199362, 368615, 393687, 152313, 589976, 405395, 452392, 779919, 270780, 155947, 495226, 222266, 326935, 215325, 516096, 466887, 474812, 565402, 372487, 137615, 478549, 311329, 742932, 802073, 697572, 975096, 1010571, 704206, 424434, 291945, 248164, 559185, 767971, 521000, 578868, 456534, 519727, 501235, 399703, 448996, 406146, 35448, 383106, 472137, 427449, 318873, 265897, 670249, 430880, 178535, 293677, 569380, 85273, 201658, 506914, 526752, 209018, 225710, 73534, 551441, 136382, 677457, 492932, 498798, 760580, 485277, 304477, 423112, 842185, 402456, 489187, 561140]
14918E61140O2954Q9028k22049M78415J63259K96027j81534k8532N3683L21583
14908A593974m12903K63420j86957j75657L73860M7931j159j50474L86588R5296
14898A833919j49075j78420m43869k14375O0505R5000l21963l15575J58646J47434
14888F72227B57069N2047K70835j64394J93088k62119K48098k23874n7762q1889
14878B31099l2892K44774j81743J79777j07658L48906j44276K17940K8230K18444
14868A002601k07710k24323J63536K6352J92455j20993j12894r5454J72174k49395
14858E46349L84024j71690B71215K34425K49975m0141k19280B25031N00869K16085
14848I41985j05586j87504q5490J04563k08104B10827N35695l37642p7416J07691
$$ y = [561140, 624094, 713122, 491073, 969488, 1132747, 1428774, 1247240, 1218708, 1272391, 1593974, 1181071, 1444491, 1257534, 1081877, 1455737, 1503668, 1502509, 1352035, 1738623, 1833919, 1684844, 1506424, 1062555, 848180, 908685, 1003685, 681722, 366147, 524793, 672227, 257069, 309116, 579951, 415557, 608645, 346526, 594624, 370750, 312988, 231099, 198207, 442981, 261238, 441015, 333357, 682263, 537987, 755927, 784157, 1002601, 794891, 570568, 734104, 760456, 952911, 831918, 719024, 623570, 795744, 546349, 930373, 758683, 271215, 505640, 755615, 715474, 496194, 225031, 725900, 941985, 836399, 648895, 563405, 667968, 459864, 210827, 746522, 408880, 331464, 439155]
14838D39155J51701P2670B20386N2566p210K76483J58781l23956O2856J98525
14828F38431K47750j60616R2455M67730m95283L33154j69809L31263k23875k65944
14818G95256n5276k8895N0940B18408L09764K07682C25900M17774J88069j73455
14808G58288l6471k8281J20950l55845K97439j58284J38541j00928L22941C50946
14797F33556o6025K65442Q0603l92730J62473k96086K62316J21683l7966O8103
14787H01369P690j74567M22139k71653j11191R343P4364O0610j77261N5785k35794
14776D60834Q1471K90567j69962J82785l04475J0987J33719K08992k24256o3594
14766F07068O1023P6594o2533K64588k61464K07028j36463l35318O19717Q4490
$$ y = [439155, 590856, 663526, 220386, 272952, 265742, 542225, 701006, 377050, 439906, 638431, 886181, 725565, 818020, 1285750, 790467, 1123621, 953812, 1285075, 1061200, 795256, 739980, 711085, 762025, 218408, 528172, 735854, 325900, 743674, 931743, 758288, 721817, 693536, 814486, 458641, 756080, 597796, 736337, 635409, 958350, 350946, 633556, 567531, 832973, 913576, 520846, 683319, 387233, 649549, 771232, 733266, 801369, 809059, 634492, 1056631, 784978, 673787, 683130, 757494, 818104, 640843, 696628, 460834, 542305, 832872, 662910, 845695, 541220, 552207, 685926, 894918, 670662, 607068, 668091, 744685, 682152, 946740, 685276, 892304, 755841, 420523, 1040240, 1124730]
14756A124730o4255j86643j04719K26628k06579k31363j81915L98470j17225k77471
14746C79658M73166j80756J6989j66541J21429N245O678M14026m75493m5244k0693
14735E28464N20518k9707k52576k4987B72334J68882L98847l65807J43296P7699
14725F95251p9322K93689k46939k13934R6325K05516n3400J30251K07475p1454
14715I63458O8079K77117o7232n25367P28835j41575M42401l06643O7846N6062
14705A562981k83309q9255r3648j29755r4046K44450p4604k10560j15878P3982
14695G90358K29500m6756K54565j78809l77358N10094J19932j56200K09835j83027
14685A172134K96811N14937j27290j30480m27044M70611o56591l068K49477n0041
$$ y = [1124730, 1060475, 873832, 769113, 995741, 789162, 557799, 375884, 774354, 657129, 379658, 852824, 672068, 689057, 522516, 643945, 649190, 655868, 1069894, 594401, 549157, 528464, 1048982, 1019275, 766699, 741712, 272334, 441216, 840063, 474256, 617552, 695251, 615929, 909618, 662679, 448745, 545070, 750586, 697186, 827437, 1034912, 963458, 1031537, 1308654, 1241422, 716055, 1444890, 1303315, 1745716, 1439073, 1506919, 1562981, 1279672, 1190417, 1096769, 967014, 872968, 1117418, 1042814, 832254, 716376, 790358, 1019858, 973102, 1227667, 1048858, 671500, 1181594, 1301526, 1145326, 1355161, 1172134, 1468945, 1983882, 1856592, 1726112, 1299068, 1769679, 1113088, 1110020, 1359497, 1309456]
14675A309456j40407l2994l1225J93821m78947O7101L5964J89859j85736k24684
14665G02208N58692j37809j91936k9506K03623p2725n8129J19883k28292M59411
14655A325420l16942M4901J66337l0520K84869o07086K66249k68001L32193k80262
14645I17158K92734N5288k91448L37276k34428J2636l42095L88671j2570K38326
14635A361548j41518K74592k8960j75616P7302l25088M19516J00997j78753j47835
14625A236185l38514K68430K84452k74245j22522R5163L64712N2810p18284L57818
14615A206005L96650j18451L783K139q4904l45914K53883m9202k23104K73797
14605A314682K55629j49681J38458J72833o02655N95435j13978Q2440r4219l14735
$$ y = [1309456, 1169049, 1136055, 1104830, 1298651, 819704, 886805, 922769, 1112628, 926892, 702208, 1260900, 1123091, 931155, 901649, 1105272, 1032547, 974418, 1094301, 866009, 1325420, 1008478, 1053379, 1219716, 1189196, 1474065, 866979, 1133228, 865227, 1197420, 917158, 1209892, 1265180, 973732, 1311008, 1076580, 1089216, 747121, 1135792, 1123222, 1361548, 1220030, 1494622, 1465662, 1290046, 1367348, 1042260, 1461776, 1562773, 1384020, 1236185, 897671, 1166101, 1450553, 1176308, 1053786, 1148949, 1513661, 1566471, 848187, 1206005, 1602655, 1484204, 1487987, 1490126, 1405222, 1059308, 1313191, 1263989, 1040885, 1314682, 1570311, 1420630, 1559088, 1731921, 1129266, 1724701, 1610723, 1693163, 1598944, 1284209]
14595A284209L95366j23188J36598m0332j95416M11166l89602J15410k00795K18062
14585A611478N5504J03514L3219O2100K5860j10977m03846N97950k66978j02626
14575A605198J47503K00924p111l2331O2602K13352P0950j98977j74385j21702
14565A766023L15372p2605J59952j38063K9004K31353j97198j67441J59611o1922
14555B024086K51388J86651j4805J2265j04053K7297K07157K69878J11155r3408
14545B877611j8226P3360J27292K05286L68841K77117K28220P07646M62116J006178
14535F315441J322400K599563L807120O641992J0270263J950681j2793471q138003
14527A1975986m322850k002326K99546p69249j461214l03686m23395m80161m02615
$$ y = [1284209, 1679575, 1556387, 1692985, 1652653, 1457237, 1868403, 1478801, 1594211, 1393416, 1611478, 1666982, 1770496, 1803715, 1865815, 1891675, 1780698, 1376852, 1974802, 1707824, 1605198, 1752701, 1953625, 1946514, 1914183, 1976785, 2190137, 2261087, 2062110, 1887725, 1766023, 2081395, 2008790, 2168742, 2030679, 2059683, 2291036, 2093838, 1926397, 2086008, 2024086, 2275474, 2462125, 2447320, 2459585, 2355532, 2382829, 2589986, 2859864, 2971019, 2877611, 2859385, 2932745, 3060037, 3265323, 3634164, 3911281, 4139501, 4847147, 5309263, 6315441, 7637841, 10237404, 14044524, 20686516, 30956779, 32907460, 20113989, 11975986, 7653136, 5650810, 5950356, 5181107, 3719893, 3416207, 2992812, 2512651, 2110036]
14518B110036L09621N6760Q2533j52611j09738R5366j23021O9129K20694k6778
14508B531991k5414L61341k54915K81L5961K84343l29741p280K76328m73337J60727
14497B560285K77337J18130j82511P4796K41846j94767L6996L4821J50625N1150
14487C168708r407M1K37039k69477K7420K80746j75673M13462m29307K53739K10900
14476C708191O845k79907r7788K25945J05031l8107K66748o6908k22992k2546
14466C584512L55878M26723o25914L46380R1295k3055P7171K77725q8373j27781
14456D294561K45776J01376l66097J06638P2361K98223L8126N3729K4029J5165
14446D883887L8709N1553J4702K15165J03532L6297q010l71609J63642J51024
$$ y = [2110036, 2419657, 2476417, 2558950, 2406339, 2296601, 2391967, 2268946, 2338075, 2558769, 2531991, 2506577, 2867918, 2613003, 2613284, 2649245, 2933588, 2603847, 2596567, 2872895, 2399558, 2560285, 2837622, 2955752, 2773241, 2848037, 3089883, 2895116, 2932112, 2966933, 3117558, 3168708, 3159301, 3159342, 3396381, 3126904, 3154324, 3435070, 3259397, 3672859, 3243552, 3497291, 3708191, 3715036, 3435129, 3337341, 3563286, 3668317, 3630210, 3896958, 3830050, 3607058, 3584512, 3940390, 4367113, 3741199, 4087579, 4178874, 4155819, 4232990, 4510715, 4422342, 4294561, 4540337, 4641713, 4275616, 4382254, 4454615, 4752838, 4790964, 4844693, 4868722, 4883887, 4922596, 4974149, 4988851, 5204016, 5307548, 5343845, 5335835, 4964226, 5127868, 5278892]
14436E278892L77392r6373Q1785p3145K57609J17120M2367L65444n9078j40191
14426F151822Q925M8592M01780L7005K17290J30958l06328J98034N33388l69944
14416G051522q409K12291K7987K41502j33904J58575N39081j21812k38583K60901
14406G989151J27594M62358J48068L07715o712j58867O84073j58524J60826m2924
14396I512758k65435K35879L96567K47020l90694J41963M31780M03825L62517
14387A1076180k09482K53886N78841j83071L60028k3853R4086J07576O6022L00707
14377A2420920L21248M17573K4593K85247Q8836L33231J09119L34558J76473L77825
14367A4889623M06042R3905M22765J03933M83951N67876j01654M94563N18061
$$ y = [5278892, 5656284, 5559911, 5641696, 5568551, 5826160, 5943280, 5985647, 6351091, 6292013, 6151822, 6160747, 6209339, 6611119, 6648124, 6865414, 6996372, 6690044, 6888078, 7421466, 7051522, 7043113, 7255404, 7283391, 7524893, 7390989, 7549564, 8088645, 7966833, 7728250, 7989151, 8116745, 8579103, 8727171, 9034886, 9028174, 8869307, 9553380, 9394856, 9555682, 9512758, 9247323, 9483202, 9879769, 10126789, 9736095, 9878058, 10309838, 10713663, 11076180, 10866698, 11120584, 11699425, 11516354, 11876382, 11852529, 11946615, 12054191, 12120213, 12420920, 12742168, 13159741, 13184334, 13469581, 13558417, 13891648, 14000767, 14335325, 14511798, 14889623, 15295665, 15389570, 15812335, 15916268, 16400219, 16968095, 16866441, 17361004, 17879065]
14358A7879065j41100P15097K75489N9799O41406L94651N20751J91598Q01933
14349B1338689J29677O88170N00204N12126L90100O20158O6958Q04297K48110
14340B5298489O75095Q84377O57531L84594O78557N48603J185085N46437R72204
14331C1830972Q05524M47463J272841Q91329J318238L81558J237044Q56419J379483
14322D0420871J381466R60673J240819J423000J099793J778568J356528J635150
14314E1296868J845518J303085K099369J497190K206776J884372K286552K248319
14306F6668049K689475K474129K503991L240885K474467L255390K973937L712813
14298H9993136L478708M228268L796512M215372M460902M540616N661461N362448
$$ y = [17879065, 17737965, 18453062, 18728551, 18788350, 19429756, 19824407, 20345158, 20536756, 21338689, 21468366, 22156536, 22656740, 23168866, 23558966, 24179124, 24246082, 25050379, 25298489, 25973584, 26857961, 27515492, 27900086, 28578643, 29127246, 30312331, 30858768, 31830972, 32636496, 33083959, 34356800, 35248129, 36566367, 36947925, 38184969, 39041388, 40420871, 41802337, 42763010, 44003829, 45426829, 46526622, 48305190, 49661718, 51296868, 53142386, 54445471, 56544840, 58042030, 60248806, 62133178, 64419730, 66668049, 69357524, 71831653, 74335644, 77576529, 80050996, 83306386, 86280323, 89993136, 93471844, 97700112, 101496624, 105711996, 110172898, 114713514, 120374975, 125737423]
14290A25737423N251255O379947O427246P015290P395978P616858Q206044Q643474
14282A82673515R115558J0045697J0270458J0770063J1398500J1993253J2364948
14275B58631992J3430191J4260766J4204249J4545935J4928302J4976890J5082053
14268C60060378J4322188J3655297J3195460J2480488J1768366J0704117R363204
14261D45549498Q323143P128315N733565K982400r247J80195N87900l540067q131979
14252D58803723n594634p375056j0187709j3466903j3293339j4236588j5197702
14245C79451792j4586982j1938806j3573186j4661402j4747288j3592776j3281096
14238B83070256j2677631j2003585j2035946j0874367j1255379j0614818j0239739
$$ y = [125737423, 130988678, 137368625, 143795871, 150811161, 158207139, 165823997, 174030041, 182673515, 191789073, 201834770, 212105228, 222875291, 234273791, 246267044, 258631992, 272062183, 286322949, 300527198, 315073133, 330001435, 344978325, 360060378, 374382566, 388037863, 401233323, 413713811, 425482177, 436186294, 445549498, 453872641, 461000956, 466734521, 469716921, 469707674, 469887869, 470475769, 466935702, 458803723, 453209089, 445834033, 435646324, 422179421, 408886082, 394649494, 379451792, 364864810, 352926004, 339352818, 324691416, 309944128, 296351352, 283070256, 270392625, 258389040, 246353094, 235478727, 224223348, 213608530, 203368791]
14231B03368791j0959219r205962q841966q374932p935499p347887p165701o645981
14223A36891644n805781n970744n347323n160525n096957m541955m231427l827143
14215I6909789l944567l438710l849671l041174k879379l317236k825977k412377
14207G1200698k590263k348370k236031k093598k171776j713339k095311j288602
14199E4663408j862862j875252j028089j363701k031883j402863q26526j002836
14191D3269396j464233j297792r47083j217553p97717r27711q05414j196937q52628
14182C3762328j046693o45929o34807r48847o76801o87078o44869r21055n62980
14173B6993269q25673k27765p06094l82299q04308o33896l49626n38052l75356
$$ y = [203368791, 192409572, 183203610, 174361644, 165986712, 158051213, 150703326, 143537625, 136891644, 131085863, 125115119, 119767796, 114607271, 109510314, 104968359, 100736932, 96909789, 92965222, 89526512, 85676841, 82635667, 79756288, 76439052, 73613075, 71200698, 68610435, 66262065, 64026034, 61932436, 59760660, 58047321, 55952010, 54663408, 52800546, 50925294, 49897205, 48533504, 46501621, 45098758, 44272232, 43269396, 41805163, 40507371, 39560288, 38342735, 37545018, 36617307, 35811893, 34614956, 33762328, 32715635, 32069706, 31434899, 30486052, 29809251, 29122173, 28477304, 27556249, 26993269, 26167596, 25939831, 25233737, 24851438, 24047130, 23413234, 23063608, 22525556, 22150200]
14164B2150200o51195l43376l10436n98976n42141m3580l44046p37696n10842
14155A8067912L0730o46818r5328k28378l25828o28726J17803n81323k12802j83933
14145A5313309m8966m4882q45702j61477m00658J43656r1333n03561o02452L81004
14135A3138938l94550n9031o30648M6288k52377k87815P3409k74422j96079l99820
14125A0763893J43221k85490k02009k44645P3272M9818n12962k60169J57704n05126
14115I177507M56951l35987j76965m75328L42121j09357j80718l29633n4176k6849
14105H287566l58615k65807L9464j93606j1932M54616o35516J08650L36646j61565
14095G599901p41909K00033O4187O884m5932j91909j12396k08l23586r1828o9713
$$ y = [22150200, 21499005, 21155629, 20845193, 20246217, 19704076, 19660496, 19316450, 18578754, 18067912, 18098642, 17451824, 17356496, 17128118, 16802290, 16173564, 16291367, 15710044, 15497242, 15313309, 15264343, 15219461, 14373759, 14212282, 13811624, 13955280, 13863947, 13360386, 12757934, 13138938, 12744388, 12685357, 12054709, 12100997, 11848620, 11560805, 11634214, 11359792, 11163713, 10763893, 10907114, 10621624, 10419615, 10174970, 10248242, 10298060, 9785098, 9524929, 9682633, 9177507, 9634458, 9298471, 9121506, 8646178, 8988299, 8878942, 8698224, 8368591, 8314415, 8287566, 7928951, 7663144, 7702608, 7509002, 7497070, 7951686, 7316170, 7424820, 7761466, 7599901, 6857992, 7058025, 7122212, 7129096, 7083164, 6891255, 6778859, 6778651, 6455065, 6363237, 6293524]
14084F293524j98463K31126k76691J97586K59325m54616P1468n7187m95966j52587
14074E417519M20486n4136m56082J45271j68792Q6278k89622M4331J03576j59487
14064E089342n5141k530j48176J68917k08753m4668L8719j83446k0055k19051
14054D415158M0172J2533m31506J42035K27178j48419l2917q8984J19787k61422
14044C993615K44279k5568j9832l2610P5027k66292K0545j48118M9139q1391l39885
14033C468909J49067j7668M5968j9819r4503P8535k47458K11910l44174k82238
14023B948529M98565o630k10973Q3787k6749K1551j16382K08772j85246k82068
14013B933156L71352k22240J16724n4481k08267j33814K6050J89152j11776J150
$$ y = [6293524, 6095061, 6326187, 6049496, 6247082, 6506407, 6051791, 6123259, 6066072, 5570106, 5417519, 5838005, 5783869, 5327787, 5473058, 5304266, 5390544, 5100922, 5145253, 5248829, 5089342, 5034201, 5031671, 4883495, 5052412, 4843659, 4798991, 4837710, 4654264, 4634209, 4415158, 4455330, 4467863, 4036357, 4178392, 4405570, 4257151, 4224234, 4135250, 4255037, 3993615, 4237894, 4212326, 4192494, 4159884, 4234911, 3968619, 3989164, 3841046, 3890185, 3808794, 3468909, 3617976, 3600308, 3646276, 3626457, 3531954, 3610489, 3363031, 3574941, 3230767, 2948529, 3447094, 3440464, 3229491, 3313278, 3286529, 3308080, 3191698, 3400470, 3215224, 2933156, 3304508, 3082268, 3198992, 3144511, 2936244, 2802430, 2828480, 3017632, 2905856, 2907006]
14003B907006j34449J3319j763m3643j37904l03822M84674k06334l31585L25380
13993B570879k47752L35361j9749k89508J64600j2275j42836M13495l94933K47529
13983B624811q1487j32225K37817k33434N12676K54994L26050M09330Q83809J601770
13973F404111L516756N089955J0396326Q772204j0568069p663176n480000l122432
13965G345675j154913j246783n83602l20406M3836l15265m60602M8661o0067m95484
13955B801050m2440r2678K31739j0275m13621J23729p7813k39398p9692j20451
13945B080150j47899K08334K29389k42992o1177j36617K12749N8336M768k57289
13935A947752J79855r5688j97122n22J01741L72591J55729m36822j76581J65816
$$ y = [2907006, 2772557, 2785876, 2784113, 2740470, 2602566, 2298744, 2783418, 2577084, 2245499, 2570879, 2323127, 2658488, 2638739, 2349231, 2513831, 2501556, 2358720, 2772215, 2377282, 2624811, 2543324, 2411099, 2648916, 2415482, 2928158, 3183152, 3509202, 3918532, 4802341, 6404111, 9920867, 15010822, 25407148, 34179352, 23611283, 15948107, 10468107, 7345675, 6190762, 4943979, 4360377, 4039971, 4083807, 3768542, 3307940, 3356601, 3296534, 2801050, 2758610, 2665932, 2897671, 2887396, 2473775, 2597504, 2519691, 2280293, 2200601, 2080150, 1932251, 2140585, 2369974, 2126982, 2065805, 1929188, 2141937, 2200273, 2205041, 1947752, 2127607, 2031919, 1834797, 1834275, 1936016, 2308607, 2464336, 2027514, 1850933, 2016749]
13925B016749J54445l56561K1371n0057K44258j47416j81302K23262k69119J12942
13915A768572j16289o2472K46158O618j84784M3860Q2180j19764Q6026l60783
13905A389322K72403O6239K4727j42499j73393L12203j70354J24097m1641k35716
13895A425388m9156K6225K24358l118l23219L94117k00636l8041Q4759Q4773k29190
13884A396260p0049N2829k88713J02113K06057j14832M774l37951J37859J38465
13874A226812j35807M7617M4164j6888N94389n71923j21571K22669K17784l57943
13864A149303L70835l66930P9647k15651L37122J26639o04653L95635J82511J14353
13854A568811m97511l14485R71317k19346k41815J20315j42048l25918P7323K77700
$$ y = [2016749, 2171194, 1814633, 1836004, 1785947, 2030205, 1882789, 1701487, 1924749, 1655630, 1768572, 1652283, 1589811, 1835969, 1842587, 1657803, 1701663, 1783843, 1664079, 1750105, 1389322, 1661725, 1727964, 1752691, 1610192, 1436799, 1749002, 1578648, 1702745, 1661104, 1425388, 1376232, 1402457, 1626815, 1623697, 1300478, 1694595, 1493959, 1455918, 1540677, 1625450, 1396260, 1326211, 1379040, 1090327, 1192440, 1398497, 1283665, 1288439, 950488, 1088347, 1226812, 1091005, 1138622, 1182786, 1165898, 1760287, 1188364, 1066793, 1289462, 1507246, 1149303, 1520138, 1153208, 1232855, 1017204, 1354326, 1480965, 876312, 1271947, 1454458, 1568811, 1071300, 756815, 1728132, 1508786, 1266971, 1387286, 1245238, 919320, 996643, 1274343]
13844A274343m78286J68898R5235N3549N1074l90326J96570j03606K79220k15293
13834I31378J67666J54401j01755n3911o4414J52766J48419j94575l503l12562
13824H23910P9291K9876J15349J8949k136L6395p6344K51548l30795j94395N570
13813G57218q9744K93258J21200l5169k66612L9065J59900R3312l13032J34781
13803H94177k3891R0068J26128k7330M0428l27203o7634L77094j30611k31112
13793G20114j86044K08640K06642o4476j1833k63954M00600k14483L17213j12034
13783A000385R913P9431k5820j08737l54041K43745j39519q1393J74553j45043
13773F53474K14981J31574m62248j57847K30584o1574M02713j79659j35421K12497
$$ y = [1274343, 796057, 964955, 1060190, 1113739, 1164813, 774487, 971057, 867451, 1146671, 931378, 1099044, 1253445, 1151690, 1097779, 1033365, 1186131, 1334550, 1139975, 1136472, 823910, 903201, 933077, 1048426, 1067375, 1065239, 1101634, 1025290, 1276838, 946043, 751648, 757218, 667474, 960732, 1081932, 1046763, 780151, 819216, 979116, 1072428, 759396, 894177, 870286, 960354, 1086482, 1059152, 1099580, 772377, 704743, 1081837, 951226, 720114, 534070, 742710, 949352, 884876, 873043, 609089, 1009689, 795206, 1112419, 1000385, 1010298, 1089729, 1063909, 955172, 601131, 844876, 705357, 623964, 798517, 653474, 868455, 1000029, 537781, 379934, 610518, 548944, 951657, 771998, 636577, 849074]
13763H49074j66368M53937l33772m3985l16861M43351k01403l6368L8088k3917
13753F61776p5279J19875l4561R2283Q7754l07979N5594L44111C85514M50696
13743H36210J9311n2030n3226L16280k20746l95815Q4637J95709J25821l58325
13733D97826L06962N6975k99536p3145N3385J42082l06574n0412M41946p4891
13723F94618k39207J61745J61258j58894C00359J41155L62882j90654B78906N7659
13713C36565P5342L52674j27110R4193k85068J63128l9499j30902L04185k03294
13703E40214J86348k6886A95395K98936J08735k18535q113K16967p9039J55062
13693F69408k4660q7300K55703K545j08828l44599N48377C80235R0185K04072
$$ y = [849074, 682706, 1136643, 802871, 758886, 442025, 885376, 683973, 647605, 685693, 661776, 586497, 706372, 671811, 764094, 851848, 543869, 599463, 943574, 385514, 836210, 855521, 803491, 750265, 1066545, 845799, 449984, 534621, 730330, 856151, 497826, 804788, 861763, 562227, 489082, 542467, 684549, 377975, 327563, 769509, 694618, 455411, 617156, 778414, 619520, 300359, 441514, 804396, 613742, 278906, 336565, 411907, 764581, 637471, 731664, 446596, 609724, 570225, 439323, 743508, 540214, 726562, 699676, 195395, 494331, 603066, 384531, 376418, 593385, 514346, 669408, 644748, 557448, 813151, 815696, 706868, 362269, 910646, 380235, 470420, 674492]
13683F74492O5620k25595N7814j45081J69942k15713J22084l8474K75081j68655
13673E71515L9875j42938J99308A98243R5658L07827N4900P3700l51195J7248
13663C96381J69319r2652k32547L7883M77081l24520K16856n9139j67707m0526
13653C80429J57970l6197l7787j18034L06726B03610J87673R8422j19654L18601
13643F88652B46759P8578K19018k12150K5181P075K74770j72512j78634J33093
13633D21178L32108j12926B92636J20525M3622J78112B39673M40555p2792j36396
13623D71040K57852k19217K53370C25899k8487K11713J065D502M11220P51K32087
13612F48560C18674J26083n5188K21262B79996L62480k89540A61396M26380j17921
$$ y = [674492, 740112, 514517, 572331, 427250, 597192, 381479, 503563, 465089, 740170, 571515, 611390, 468452, 667760, 198243, 293901, 601728, 656628, 730328, 379133, 396381, 565700, 473048, 240501, 278384, 755465, 430945, 647801, 588662, 420955, 380429, 538399, 502202, 464415, 346381, 653107, 203610, 391283, 489705, 370051, 688652, 246759, 325337, 544355, 332205, 357386, 364461, 639231, 466719, 288085, 421178, 753286, 640360, 292636, 413161, 456783, 634895, 239673, 680228, 607436, 471040, 728892, 509675, 763045, 325899, 297412, 509125, 510190, 4502, 415722, 416473, 648560, 318674, 444757, 389569, 610831, 279996, 642476, 352936, 161396, 587776, 469855]
13602D69855A99935K89697B27973J25425A32671L56198j15695L27115B77176K48921
13592E26097k40290J856E8642K88596o1911M31332B00484K68047A20698L68984
13582D89682m0879J48364j77881j73522O4296j19224J52908j24469K74530k35400
13572B58405D739M68496A74871M45582B90238J11203j93406K79817E349M55995
13562D61344o3223o2608j44518M70194j81455m6909K55193l23026M0756p176I3869
13550A88413P7966R5092j0810J2176G1616L27164p8057c165D25747D6100L30382
13539C76482e5038A71550L75004B66671J66682A2376g7891B2307K82282r1526
13529B13063K46058B14078J65988M4490O9067n8675j8329F1418K64412L20173
$$ y = [469855, 199935, 489632, 227973, 353398, 132671, 488869, 373174, 700289, 277176, 526097, 285807, 287663, 58642, 347238, 285327, 716659, 200484, 468531, 120698, 489682, 448803, 597167, 419286, 245764, 310060, 190836, 343744, 219275, 493805, 258405, 4739, 473235, 174871, 620453, 290238, 401441, 208035, 487852, 5349, 461344, 398121, 335513, 190995, 661189, 479734, 432825, 688018, 364992, 405748, 398572, 93869, 188413, 266379, 361471, 350661, 362837, 71616, 398780, 320723, -3165, 425747, 46100, 376482, -55038, 171550, 546554, 266671, 433353, 12376, -77891, 22307, 304589, 213063, 459121, 214078, 380066, 424556, 493623, 434948, 416619, 61418, 325830, 646003]
13519F46003E6485d0657B42944q2187L20904j05676j3945k3086D0628L41401p0258
13508C11771j340L7227H8307K32581J7067j50534R8149P3724L4787j24743k2874
13497B46464j06082J99079e7868B00515R0106E3706K18820L7142J32657H1120
13486D08367A30030J91970j03763P6902k2274J1894d0595C01020A44277J35116
13476B79393j26146l6364N23406k50061j72400O054L8300l5274g3532B44099L3413
13465B77512p2461L21483j90103J329H1731K28630P1664H0593K29908k3514J7295
13454C04282B6552J59754N5163m9285L26919j252k26124m1948j520L6547L42234
13443F27040A36295K994K56142A22057l8400J00281K65385o7843o6426J056A33067
$$ y = [646003, 56485, -40657, 242944, 160757, 481661, 375985, 362040, 338954, 40628, 382029, 311771, 310431, 347658, 88307, 320888, 337955, 187421, 285570, 359294, 394081, 269338, 246464, 140382, 339461, -57868, 200515, 290621, 53706, 272526, 309668, 442325, 81120, 408367, 130030, 322000, 218237, 295139, 272865, 284759, -40595, 301020, 144277, 279393, 153247, 116883, 640289, 390228, 217828, 223882, 262182, 226908, -73532, 244099, 277512, 205051, 526534, 336431, 337760, 81731, 310361, 382025, 80593, 310501, 286987, 304282, 26552, 186306, 241469, 192184, 519103, 517851, 291727, 249779, 248259, 284806, 627040, 136295, 139289, 395431, 122057, 83657, 183938, 449323, 381480, 315054, 316110, 133067]
13431B32040j13949L89005G1873K76395A35920L4172l823J0153K17230D5738A739
13419E64190k75441A31746a84349B37330d6850a2614A71196J39661O1103C0880
13408A98596k3211M364P462D2615K49149G2468b7934A27241b90598G23834C48877
13396C31091I6647J5400R7817K7172b5323C20461a56862a0171A10597K4928L2683
13385A68208R5854r9556L96219G5483J4454N6796a35086C79087J12049A78961
13374a3994C34003n0922n0662j00792L06892m7169A16066a8892A00089K33773
13364C33862j02457G4630L09929h5845C59385C0677J49994a04319A52789k9555
13354A23234O083R4451K41678A35938J66362k0163j05162j1881L89367B31158
$$ y = [232040, 118091, 507096, 71873, 348268, 135920, 170092, 166269, 176422, 393652, 45738, 1739, 564190, 288749, 131746, -184349, 237330, -46850, -12614, 171196, 310857, 371960, 30880, 198596, 175385, 179749, 187211, 42615, 291764, 72468, -27934, 127241, -290598, 723834, 348877, 331091, 96647, 112047, 209864, 237036, -25323, 320461, -156862, -10171, 110597, 135525, 168208, 264062, 164506, 560725, 75483, 89937, 146733, -135086, 379087, 491136, 178961, -13994, 334003, 283081, 232419, 131627, 438519, 391350, 116066, -18892, 100089, 333862, 231405, 74630, 384559, -85845, 359385, 30677, 180671, -104319, 152789, 123234, 129317, 223768, 465446, 135938, 302300, 282137, 176975, 165094, 554461, 231158]
13343C92845H6664J3164J28660J42623A41629M12368A76385R5162d9819B65082
13332B30114J08049L94280G6805c9472B70009Q95l2332J4474L6197P6752a2173
13320D63476k07509P7624g9862B60696b2430A13121L49693a15354C48107P4697
13310D22804K0935B21128N8244I0906K40732O1286r3179B3645J53136O0546K51756
13299D89083c9790A31082R7596e9688m2065j15079L7904A16582D6572K25911J39913
13288D12396j26855J08806A41513c2926A09272J22953a00522A91862a95400C31028
13277C75748j37573e4691D5847J44754b8222A05330R8891q9613D5660J57091K10251
13266D13002A29536k7180C0014a54474A60883M357J3485B2086J39460Q704a09320
$$ y = [392845, 86664, 99828, 228488, 371111, 141629, 553997, 176385, 271547, -49819, 265082, 230114, 338163, 732443, 76805, -39472, 270009, 270904, 238572, 253046, 289243, 365995, -12173, 463476, 255967, 333591, -79862, 260696, -22430, 113121, 462814, -115354, 348107, 422804, 443739, 221128, 279372, 90906, 331638, 392924, 299745, 23645, 176781, 237327, 489083, -39790, 131082, 228678, -59688, -101753, -216832, -178928, 116582, 46572, 272483, 412396, 285541, 394347, 141513, -32926, 109272, 232225, -100522, 191862, -195400, 331028, 375748, 238175, -54691, 45847, 190601, -28222, 105330, 204221, 114608, 45660, 202751, 413002, 129536, 102356, 30014, -154474, 160883, 165240, 178725, 22086, 161546, 170250, -109320]
13254C70065g5230C30914r6948o4872J05770a02062B66507B033K87539h3691J1025
13243g2666k3111D79914J3062a18490E4497L31407g7529A59038J37378j3802d935
13231b52504R0676P6358L6388C12761j14715Q90H1961a04741L8336j01977A9805
13219D61213A89106K43235j64312q474r1994l4218K74888h1769C43941a6771k20438
13208b37209I1449a33899B2788c06761A93227j7667D2390J0476b4678E4215R6776
13197A50991L4183o9177k1197C6492b3788n9474A77901H939e116A18666J63973
13186B82639N881G3203J49476c4123D3530L10514A18958h8022r6275A23562B7846
13174B73911g3711A56646n9328b57503B16267a40481e0871p2566A02479K03924
$$ y = [370065, -75230, 330914, 233966, 169094, 274864, -102062, 266507, 2033, 289572, -83691, -72666, -95777, 479914, 492976, -118490, 54497, 385904, -77529, 159038, 296416, 282614, -4935, -252504, -161828, -85470, -49082, 312761, 198046, 198936, 81961, -104741, -66405, -168382, 19805, 461213, 189106, 432341, 268029, 259555, 167561, 133343, 408231, -81769, 343941, -16771, -237209, 91449, -133899, 22788, -306761, 193227, 175560, 42390, 52866, -24678, 54215, 150991, 185174, 115997, 94800, 36492, -23788, -83262, 177901, 8939, -5116, 118666, 282639, 288520, 73203, 222679, -34123, 43530, 354044, 118958, -88022, -184297, 123562, 27846, 273911, -73711, 156646, 97318, -257503, 216267, -140481, -50871, -123437, 102479, 306403]
13164C06403A14814L614a5557m3411C5276b99081E1764J99285I2074N3326P4715
13153B20115A7975K20370b41687Q3731A03344a8169D732R2602P8984H0040a22027
13141A03268Q7662a9976k45073B07074a85076A14033j5164a44036f4489J3265
13131e1224B35544b25602A96961E2514b43682A41422J8700f8852B41706a93370
13120H5366B1156e1298k02984a7955M540C9310L93036a33066A4677a17315D70479
13108B50329J43271j19138D196R6957b26974A98354G7888f5088B87110A07296
13097c6228a4329H1354b2008A29314d7852A28025J4570D1776J55699J18147J31943
13086D47565b2871E4720b43090B01285p53a8224H4733K88725A24846K27749a14030
$$ y = [306403, 114814, 118428, -15557, -58968, 35276, -299081, 51764, 251049, 92074, 145400, 220115, 17975, 238345, -241687, -157956, 103344, -18169, 4732, 97334, 176318, 80040, -122027, 103268, 190930, -19976, -265049, 207074, -185076, 114033, 98869, -144036, -64489, -51224, 235544, -225602, 196961, 52514, -243682, 141422, 160122, -68852, 241706, -193370, 85366, 21156, -51298, -254282, -17955, -13415, 39310, 432346, -133066, 14677, -117315, 470479, 250329, 393600, 274462, 4196, 101153, -226974, 198354, 77888, -65088, 287110, 107296, -36228, -14329, 81354, -22008, 129314, -47852, 128025, 142595, 41776, 197475, 315622, 447565, -22871, 54720, -243090, 201285, 200532, -18224, 84733, 373458, 124846, 352595, -114030]
13074D3424e5121A17683a03088j3961I3585P8176K35917A40507A5874J86480m6118
13063A56236M8701r1313b00323C00525c4981a2001d832l7194n744I7101J6128
13052A13229J57002A23124J8065a62419D4608J66894b2264j72460H8770a88968
13041I7936k7502a13886A78164a43202I7767L9258o2995J4826b8985n0346B74971
13029A33000e7351C77190D9634a55045A48029b7831A30882K3137l5891c7210k3313
13018f0523B10244d7447A85239n521H6745d36479E0438N9616A8593a50523A47035
13006A44257J86426A63767b3309j13885C50617g3513C87303a8027B30519a8679
12995C4938M27553j42222M8458G5083M0022B2930J20291a48837b0543j24793G9969
$$ y = [43424, -55121, 117683, -103088, -117049, 93585, 171761, 407678, 140507, 15874, 202354, 156236, 204937, 113624, -200323, 300525, -34981, -12001, -4832, -42026, -47770, 97101, 113229, 270231, 123124, 141189, -162419, 44608, 211502, -22264, -194724, 88770, -188968, 97936, 70434, -113886, 178164, -143202, 97767, 137025, 74030, 88856, -28985, -79331, 274971, 133000, -57351, 377190, 49634, -155045, 148029, -27831, 130882, 154019, 118128, -37210, -60523, 210244, -47447, 185239, 179718, 86745, -436479, 50438, 110054, 18593, -150523, 147035, 144257, 330683, 163767, -23309, -137194, 350617, -73513, 387303, -18027, 230519, -18679, 34938, 462491, 320269, 368727, 75083, 115105, 22930, 143221, -148837, -20543, -145336, 79969]
12983B96411A11792J8352B6235a05850A89540b47497A61722b6012a0314H7083
12972a26479B2271a19880A28707N7950L3089a6431C00618a49097A4381K00371
12962B14752c04117a35517C69903c3044j627D933N3666K50381C9633a7390B9905
12950c03946B63408a62908p3322A82334a1202k78965Q7521H8717a37894A73057
12939e6044H0358P5811c5093C00534a43221a168F5505a24223A34857i5700C21108
12927B1523O7148a10281B95676a25591l4628A23515J41874b0273I0467N2586b66216
12915D499M0313J88485D8428a1331B23911a57343C313a28773A3689J09486H504
12903b07709M4783d1592B04171b19151r3710g1103A59066B1683K16761P9224B4668
$$ y = [296411, 111792, 130144, 26235, -105850, 189540, -247497, 161722, -26012, -10314, 87083, -126479, 22271, -119880, 128707, 186657, 219746, -16431, 300618, -149097, 14381, 214752, -304117, -135517, 369903, -33044, -34671, 4933, 58599, 308980, 39633, -17390, 29905, -303946, 263408, -162908, -236230, 182334, -11202, -290167, -202646, 88717, -137894, 173057, -56044, 80358, 156169, -35093, 300534, -143221, -1168, 65505, -124223, 134857, -95700, 321108, 21523, 88671, -110281, 295676, -125591, -160219, 123515, 265389, -20273, 90467, 143053, -266216, 4499, 44812, 233297, 48428, -11331, 223911, -157343, 3313, -128773, 13689, 123175, 8504, -207709, -162926, -41592, 204171, -219151, -312861, -71103, 159066, 21683, 238444, 317668, 24668]
12891D3592a75894H8544a20430A37560A1385L01231I098a26496g953n9228J8907
12880d8274B93692K67735d05294I7634L36692b14669j6882h9280C9812b36696
12869A56916f4571H966a69498m59G2011a71948B4303f843D5432b47356F2439a12001
12856C91025k0738g2285A01930A4806L1191b79002B19235H2085L59832I4567c8942
12844B65220m6831a002A94543h9349a5327C12875a19250H0347B1335e5070j88129
12833b43199g5102J211j00077b3678F3142J36000L1204r2388G037b298p2655B7078
12820b4608H5985O3971a06595A68231a6203l6121j6466n4759B37499j12042a12735
12808a56292A66756b39814B0727J94733I9465B5634L11641J089B8422Q2924a12894
$$ y = [43592, -175894, 88544, -120430, 137560, 11385, 312616, 9098, -126496, -7953, -67181, -48274, 293692, 561427, -405294, 97634, 434326, -214669, -231551, -89280, 39812, -236696, 156916, -64571, 8966, -169498, -169957, 72011, -171948, 24303, -6843, 45432, -247356, 62439, -112001, 391025, 370287, -72285, 101930, 14806, 45997, -279002, 219235, 82085, 441917, 94567, -38942, 265220, 218389, -1002, 194543, -89349, -15327, 312875, -119250, 80347, 21335, -55070, -243199, -75102, -73891, -173968, -23678, 63142, 199142, 230346, 137958, 7037, -2298, -74953, 27078, -24608, 85985, 149956, -106595, 168231, -16203, -52324, -68790, -123549, 237499, 125457, -112735, -156292, 166756, -239814, 20727, 215460, 99465, 25634, 337275, 338364, 28422, 111346, -112894]
12796H5541L2986a11682B29324L3351r4031a37058A38690a16349d7381A77778
12785a08760k01217C6958e5679A35987c8382p2117C06920A6546a51665j0446A43668
12773A99940a572r8275B08338r9780E2540e6364A17926D969b08401c3820A25434
12761a8392H5584L8205k0997a1314D14624k01063c7988H6896b66532I4108c4546
12749C50602a44928J3910C4208b19867P4827A35772L4267b51916i5162r0198n794
12738a91154A51344a96803e7791I4032a68377B7091b73039O9920A63077F9469
12727a78580I0314a76077a7419B69691e7396L683B41418b73364a06070A58590
12716B57207E8455K4279M665g8945j49368a4266F8993a46152O6751E8376e7004
$$ y = [85541, 118527, -111682, 229324, 262675, 168644, -137058, 138690, -116349, -47381, 177778, -108760, -309977, 36958, -55679, 135987, -38382, -110499, 306920, 16546, -151665, -162111, 143668, 199940, -1572, -99847, 208338, 108558, 52540, -56364, 117926, 4969, -208401, -33820, 125434, -18392, 85584, 123789, 102792, -11314, 414624, 213561, -37988, 86896, -266532, 94108, -34546, 350602, -144928, -131018, 34208, -219867, -145040, 135772, 170039, -251916, -95162, -185360, -191154, 151344, -196803, -57791, 94032, -168377, 27091, -273039, -203119, 163077, 69469, -178580, 90314, -176077, -17419, 269691, -57396, -53713, 241418, -273364, -106070, 158590, 257207, 58455, 82734, 87399, -78945, -228313, -14266, 68993, -146152, -79401, 58376, -57004]
12704E8008J00690a18997A27430K8904h5572A54122p0787j4612K7026J00755m8869
12693A47635J54302R2441j81482r0539K49224A44086L2197j8570a3079A43956
12682D13636d7835D9023N7961b56659D5351K3041j634e8961A43067B4350M9629
12671G3979K5486D5145K22356C8627c5412I1443Q067b14920E5542j7932J4131
12660E1741r329a84338k3933I714h1201e101r3253D7238c66406J51446c1301p1270
12648a02571B92828A03271p569c21259A9470Q4904C0187c4351A9574M6703k2600
12637D3677L7905J39548c11098B10720a31540A65976f821B14390D5591J62475
12627B08066d3716l44027a9599A49671b41817C6151P6408J05537p3955r607a55694
$$ y = [58008, 158698, -118997, 127430, 156334, -85572, 154122, 83335, 68723, 95749, 196504, 147635, 301937, 394378, 212896, 122357, 371581, 144086, 176283, 157713, -13079, 143956, 413636, -47835, 49023, 106984, -256659, 45351, 68392, 66758, -58961, 143067, 24350, 73979, 99465, 45145, 267501, 38627, -35412, 91443, 99510, -214920, 55542, 37610, 51741, 42412, -184338, -208271, 9714, -81201, -5101, -98354, 47238, -366406, -214960, -31301, -102571, 292828, 103271, 95702, -321259, 19470, 104374, 30187, -34351, 19574, 66277, 43677, 81582, 221130, -311098, 210720, -131540, 165976, -6821, 214390, 45591, 208066, -43716, -387743, -19599, 149671, -241817, 36151, 112559, 218096, 144141, 134534, -155694]
12615G0928L3071J4155K26954O2245j6386f3372B25260N2432J47928n9038A06586
12603h2125B12489e7340E3209M1881a98424F4814b99834B35491a69468b1180k209
12592b3389m1493K2396k28995A50248o6844f4293A52244K75260B13113M6216d5839
12580C44223G9542a15369B5866J00530h4095Q679R903b9410m5253l1423d2332
12568B1989R626L4793O8743a51975A33510C834N8513a86185j40461J50457N9619
12557a16570E1618e4432F6962h092l9977K581C6982J43431o9711K04017a4528
12545b83419A21823D8622e0413l6005r5735O5334C3115O8476h8577b4660H4177
12533i9938l20980B25149n8253L61620b94725A77335b74474b1713j67576L9660
$$ y = [70928, 103999, 118154, 345108, 407353, 390967, -63372, 225260, 277692, 425620, 366582, 106586, -82125, 212489, -57340, 53209, 95090, -198424, 64814, -299834, 235491, -169468, -21180, -23389, -64882, -42486, -271481, 150248, 83404, -64293, 152244, 427504, 213113, 259329, -45839, 344223, 79542, -115369, 25866, 126396, -84095, -75416, -65513, -29410, -74663, -106086, -42332, 21989, 31615, 66408, 135151, -151975, 133510, 3834, 62347, -186185, -326646, -176189, -116570, 51618, -54432, 66962, -8092, -48069, -45488, 36982, 180413, 110702, 314719, -14528, -283419, 121823, 48622, -50413, -86418, -182153, -116819, 33115, 101591, -88577, -24660, 84177, -99938, -420918, 225149, 166896, 528516, -294725, 177335, -274474, -21713, -189289, -149629]
12523a49629A78286a51914A20777a35360n8677A07253P7014D6618O6476g3286
12512A29887J39559j11347e2787p7581g390A35892b20417b7459m8965j013C4809
12500b32707D12248b2764A19359J09026B7195f4238J4948A37174e9094A37458
12489A83465a01533j24336b7727B3571a3660r0087k70578A47393a6764C29255
12478a11364D9276K18716p5424B2424a83529L1030h169B29210b57209J21842m8590
12467a83957B36110c8377k58676f9148A20961A90J46703d6006A63417L1187a41872
12455a27175B86629d00046j9351A78655C6793K77892c0060D0178b86621J35511
12445a51110k2595G3171b13091m159q3061a00310k39644a56230j71285a13239
$$ y = [-149629, 178286, -151914, 120777, -135360, -194037, 107253, 184267, 46618, 113094, -73286, 129887, 269446, 158099, -52787, -130368, -7390, 135892, -220417, -27459, -76424, -77437, 34809, -232707, 412248, -22764, 119359, 228385, 27195, -64238, -49290, 137174, -59094, 137458, 183465, -101533, -225869, -27727, 23571, -13660, -103747, -374325, 147393, -16764, 329255, -111364, 49276, 267992, 192568, 22424, -183529, -152499, -8169, 229210, -257209, -135367, -183957, 236110, -38377, -297053, -69148, 120961, 190, 146893, -46006, 163417, 194604, -141872, -127175, 286629, -400046, -419397, 178655, 36793, 314685, -30060, 40178, -286621, -151110, -173705, 73171, -213091, -217250, -300311, -100310, -339954, -156230, -327515, -113239]
12434A25782R7793a76230D3636a42925b4848l8015j81171B95864A41060o1960
12424G9100a69511k3247k02194E2162L8143b01109A9273c08615i7402A98189a31994
12412A79404g3806r4814q3509A25350c28472A19378h1921B5712g9700p5157B23055
12400b19318A53309M3188o1480B9174a40292B6564a68915J0694B45010G5027i2347
12388a74783G705J06335d19707b3534B89207A8125b97890R0991A16236K38300
12378C54536a10751B97018h5526l67208A50265d2526J7442A80576a09445l18797
12368d28242G3900J80392r9027E0201N4580c20099H1197a68174h1127C0485J44380
12357A74865a9719j97912d5273k55997B95602F4401b59414R9208B2904b93596
$$ y = [125782, 223575, -176230, 43636, -142925, -24848, -62863, -244034, 295864, 141060, 79100, -169511, -192758, -394952, 52162, 90305, -201109, 19273, -308615, -97402, 198189, -131994, 179404, -73806, -168620, -252129, 125350, -328472, 119378, -81921, 25712, -79700, -154857, 223055, -219318, 153309, 196497, 135017, 29174, -140292, 26564, -168915, -158221, 245010, 75027, -92347, -174783, 7705, 114040, -419707, -23534, 289207, 18125, -297890, -206899, 116236, 354536, -110751, 297018, -85526, -452734, 150265, -42526, -25084, 180576, -109445, -428242, 73900, 254292, 155265, 50201, 104781, -320099, 81197, -168174, -81127, 30485, 174865, -19719, -217631, -45273, -301270, 295602, 64401, -259414, -160206, 22904, -293596]
12346A55972c27954a46468n6626A17872k4161I35K8689c56905a59435C67509a32114
12334b91055F2376p575J07510d2931H3858k5785b48349B19859a79202C82729j82583
12323B00146i1526B04471j4466K44995A59311G2640Q719J37064b35824A34871
12312A71330o3967g8124A76407L0070G6744C3141O7833A2424L05991q5891a3492
12300C15532b99556a40580C07813a6581B68462D8434J22834a05999B70646A17153
12289A98611b02115D43091G0388j5860a74968B26063D4268A7168J6573J2642P928
12278E4311K12286c850A26350b04822E7151O6911J26581l6862J36887F5265E360
12266c4169j05217a221A49765g882j6062A28726j5483l4080a05807l2257C18132
$$ y = [155972, -327954, -146468, -203094, 117872, 93711, 935, 29624, -356905, -159435, 367509, -132114, -291055, 62376, 54801, 162311, -42931, 83858, 58073, -248349, 219859, -179202, 382729, 200146, -91526, 204471, 190005, 435000, 159311, 72640, 81359, 218423, -235824, 134871, 171330, 107363, -78124, 176407, 206477, 76744, 33141, 100974, 12424, 318415, 232524, -13492, 315532, -299556, -140580, 307813, -16581, 268462, 48434, 171268, -105999, 270646, 117153, 198611, -202115, 443091, 70388, 54528, -174968, 226063, 44268, 17168, 33741, 46383, 54311, 266597, -3850, 126350, -204822, 57151, 124062, 250643, 213781, 350668, 65265, 5360, -34169, -139386, -1221, 149765, -7882, -23944, 128726, 113243, 79163, -105807, -138064, 318132]
12254A68455b10424B01723J68016d2243m6252D15004A52828J07606f9149B92390
12243c4459p8462B81713o2317I9878i7942F6983i2377A95545r2593k4246K57024
12232C35730h2126c8341A10356N0609a15517p2005E8453P7782a26319A99520K09530
12221D09050C8431f0229D0521O2998R6183M1293a693G3673B3480a22641B22440
12209F496N9010J21856c1550C35694j55893l1037e2558E63823j93134j62923q4979
12198A22787K0808h0600A57586o7993M0466a82134H2534e5092m6390A0473J25180
12187A35653J46862e0917D52241A94533j9581D4579O1631k5455M27781O5154g51
12175A81219a28468e63B72582J73236C2936J9301A4483b0820A14900K8808a1106
$$ y = [168455, -210424, 201723, 369739, -42243, -88495, 415004, 152828, 260434, -69149, 292390, -34459, -112921, 281713, 219396, 99878, -97942, 66983, -92377, 195545, 102952, 78706, 335730, -82126, -38341, 110356, 160965, -115517, -187522, 58453, 136235, -126319, 199520, 409050, 38431, -60229, 40521, 103519, 199702, 240995, -1693, 73673, 23480, -122641, 222440, 6496, 65506, 187362, -31550, 335694, 179801, 148764, -52558, 563823, 370689, 207766, 122787, 143595, -80600, 157586, 89593, 130059, -182134, 82534, -55092, -101482, 10473, 135653, 282515, -50917, 452241, 194533, 174952, 44579, 106210, 80755, 508536, 573690, -751, 181219, -128468, -563, 272582, 445818, 32936, 52237, 14483, -20820, 114900, 143708, -11106]
12163B37431K787K05719n6270G0982a10031B63763j21748L7145R303b8876B37709
12151B99398f7569C07990l7067k3668a44874D18768j84666J3818m2488B7141a2919
12139F431J65582F5543i6112A68415J74193a903A8678J4036n018J09600I000L02310
12127C11310a78430g0162B75151n6620G0715P8693E7749B5230a9821B00259h5335
12115G8167B3872a16468F9390M1838L16462j88535I8184J38768a994A52066J15261
12104B67327r2431J78304A8500J47672k6672e8658G4693F762K42127n9147K34396
12093D24138A14831I585K60146n747p9467a39484C28750a76921l6296A81403a71185
12081A84277a33987B40788o423b1587A02297K2119h9824I5750J55178b8132A4584
$$ y = [237431, 240218, 445937, 389667, 70982, -110031, 263763, 142015, 179160, 188463, -28876, 237709, 299398, -67569, 307990, 270923, 247255, -144874, 418768, 234102, 247920, 205432, 27141, -12919, 6431, 172013, 65543, -96112, 168415, 342608, -1903, 18678, 32714, 27696, 137296, 9000, 311310, -178430, -70162, 275151, 218531, 70715, 149408, 57749, 25230, -19821, 200259, -85335, 78167, 23872, -116468, 69390, 111228, 427690, 239155, 98184, 236952, -1994, 152066, 267327, 174896, 353200, 18500, 166172, 139500, -58658, 74693, 6762, 248889, 189742, 424138, 114831, 9585, 269731, 263984, 184517, -139484, 328750, -176921, -213217, 181403, -171185, 184277, -133987, 240788, 234365, -21587, 102297, 124416, -89824, 95750, 250928, -28132, 14584]
12069a26662H3018L1744J27132D3533k0552M64105B30677H2646a44195H27K21247
12058B22074K57213k17775l1766j07003J37889F5947J37828a6030k22774I3202
12047A39705J21702J14681A63744a30320N8539q1104A87272a46598p8279A69297
12036G4873g0853a3936c603n8630p5805d7340j23190j20478B41355D6091g1908
12024c95363I8744J67828e3426j50085O5240A37032a73482m7446A27444K5846
12014A53290k2741l5373b35322F0928J32503B4105L20621I2249c5268j24737A35250
12002H2579b4799A91112K39170o5940j32986j07518A1248K01713a3147A00842
11991d5981A17338Q9142h7018L0966o3052d4438k89614B16282b26289C0694q879
$$ y = [-126662, 83018, 114762, 241894, 43533, 22981, 487086, 230677, 82646, -144195, 827, 222074, 479287, 261512, 229746, 122743, 260632, 65947, 203775, -16030, -238804, 93202, 139705, 261407, 376088, 163744, -130320, -71781, -152885, 187272, -146598, -224877, 169297, 74873, -70853, -13936, -3603, -62233, -138038, -47340, -170530, -291008, 241355, 46091, -71908, -395363, 98744, 266572, -53426, -203511, -138271, 137032, -173482, -220928, 127444, 153290, 130549, 95176, -235322, 60928, 193431, 24105, 344726, 92249, -35268, -160005, 135250, 82579, -24799, 191112, 430282, 364342, 231356, 123838, 11248, 212961, -13147, 100842, -45981, 117338, 206480, -87018, -56052, -119104, -44438, -334052, 216282, -226289, 30694, 21815]
11980B1815d3464J1145k05435F9706q566K9845P2911l6075E4023b19000k84331
11969e03331e1061j07798B03598a67006C5392d10895A02833f3363q3450o9273
11959b16086R9388k57037f9378k7224m0770e9590c797j24385Q696j37419A7649
11947B2839q880P6467a3814m84027i7093B87313A14968b87942d526k58934d6011
11935B19809I5584i2500l8647D8547A6582f9454j90417j1293A63373h3391m4547
11924a27938A44645p1241j2188a82872a3830k599E7653J30354A5501J6656i9314
11912d61732A09082C8943J71507o4109a21109B14017b83968J0575a12608B61667
11901A07438J8116E4820c40919b6954B6540b58748B75708K2055D9662K5417b36697
$$ y = [21815, -43464, -32319, -237754, 69706, 61140, 90985, 163896, 127821, 54023, -219000, -503331, -51061, -158859, 203598, -167006, 35392, -410895, 102833, -63363, -146813, -216086, -116698, -373735, -69378, -96602, -137372, -59590, -3797, -128182, -119486, -256905, 17649, 22839, 13959, 90426, -13814, -497841, -97093, 287313, 114968, -287942, -4526, -263460, -46011, 219809, 95584, -92500, -131147, 48547, 16582, -69454, -259871, -271164, 163373, -83391, -127938, 144645, 73404, 61216, -182872, -13830, -16429, 57653, 188007, 15501, 32157, -99314, -461732, 109082, 38943, 210450, 146341, -121109, 214017, -283968, -273393, -112608, 261667, 107438, 125554, 54820, -340919, -26954, 26540, -258748, 275708, 297763, 49662, 75079, -236697]
11889A20430p557c9108k87573A32349f2409j86585R9937E8538P4905i9597p108
11878a06705G4343b10568A23718e7082B9085a00683k05470c542o8656L0177g158
11866b59969C30648e5701k6648k48105J54701B94532b57960B51271h3206J0850
11856g2356b4768j93049M2268C0930a27853L447m2137A08530l4102N4692f7248
11844A35381B5637b33726f2890F4888a79229C7911g7659j578j64808g488o1518
11833f9006j84060E7194a90106C52802d9780A69000b99269A20167b57752A28176
11822a5144A14982b40266k01117a24675C87017d86335L9719a70241G3961b6128
11811a75230k9863e5437B92320f7943D6696J3580b85803a18169I6541c57929D6816
$$ y = [120430, 112873, -39108, -326681, 132349, -62409, -248994, -149057, 58538, 133443, -99597, -106705, 74343, -210568, 123718, -57082, 29085, -100683, -306153, -3542, -72198, -42021, -7158, -259969, 330648, -55701, -82349, -330454, -175753, 294532, -257960, 251271, -83206, -72356, -24768, -217817, -175549, 30930, -127853, -124406, -166543, 108530, 74428, 129120, -67248, 135381, 25637, -233726, -62890, 64888, -179229, 37911, -77659, -79237, -244045, -7488, -69006, -253066, 57194, -190106, 352802, -49780, 169000, -299269, 120167, -257752, 128176, -15144, 114982, -240266, -441383, -124675, 387017, -486335, -446616, -170241, 73961, -26128, -175230, -205093, -55437, 292320, -67943, 46696, 60276, -285803, -118169, 96541, -357929, 46816]
11799b93445A89421A6139e9105A39242c61242B12611b91505e6404j44052D3172
11788B16292b78216A13484a82660L3392n8030A00260R4811c5803A19820g9374
11777a73373E3607c7233m6994j32351A58365E3641a97841Q6930k9069j1979E0100
11765f2152l71524E3300R3612a070E9172j1512i2040j63140N7930P7273k4397
11754a44374A15266b63409A4693a23760j306k23424a0346D2222i9456A9885b02865
11742B17673a45385O0946k3813B7802R5699J01601b06025B23788a13067i378A60669
11730b16425a07918I4698c1493j5244b1078A76911a37489o6085a7442A19337a81971
11718D1092Q2128n8180j553J43712P5157n0303i5254B39151b7378B03020a3342
$$ y = [-293445, 189421, 16139, -59105, 139242, -361242, 212611, -291505, -56404, -200456, 43172, 216292, -278216, 113484, -182660, -149268, -207298, 100260, 195071, -35803, 119820, -79374, -173373, 53607, -37233, -84227, -216578, 158365, 53641, -197841, -110911, -139980, -151959, 50100, -62152, -433676, 53300, 146912, -1070, 59172, 47660, -92040, -255180, -197250, -119977, -144374, 115266, -263409, 14693, -123760, -125066, -348490, -10346, 42222, -99456, 19885, -202865, 217673, -145385, -84439, -108252, 27802, 123501, 225102, -206025, 223788, -113067, -9378, 160669, -216425, -107918, 94698, -31493, -46737, -21078, 176911, -137489, -203574, -17442, 119337, -181971, 41092, 123220, 65040, 63487, 207199, 282356, 232053, -95254, 239151, -27378, 203020, -13342]
11706b49295N3950M2709A80037a54285O949E3193i5379l92584i3743l2022D16113
11694B48917N2279E4164c2304B2461O4647L40148a75274B44124d2371j13503A59678
11682B5692I442J95967j4221b9773G7898d8964j07524p0425I800d1926a9953j26660
11670a46613q6772D1599b9690b073j66815A2594J40766e4735A05417j6125J87696
11659B76988j36372c3129A8272c6970c046A89624j8713C6252a2476A98267e58
11647E170K01287b07667B92143r6905m4168b62324Q6763b6736B0753Q5688b0872
11635A44539m582J09244c5511A01247D8219a10011l96434C3483a16066D0108a26170
11623A35671b00926l7528O9790P041j69569f0958A63147b3139l95733b3240j37484
$$ y = [-249295, -195345, -152636, 180037, -154285, -147336, 53193, -95379, -487963, -93743, -125765, 416113, 248917, 301196, 54164, -32304, 22461, 87108, 427256, -175274, 244124, -42371, -155874, 159678, 25692, 9442, 205409, 191188, -29773, 77898, -48964, -156488, -226913, 9800, -41926, -19953, -146613, -233385, 41599, -29690, -2073, -168888, 12594, 153360, -54735, 105417, 89292, 276988, 140616, -33129, 18272, -36970, -3046, 189624, 170911, 36252, -12476, 198267, -558, 5170, 206457, -207667, 292143, 195238, 151070, -262324, -175561, -26736, 20753, 106441, -20872, 144539, 139957, 249201, -35511, 101247, 48219, -110011, -506445, 33483, -116066, 40108, -126170, 135671, -200926, -238454, -168664, -161623, -331192, -60958, 163147, -23139, -418872, -23240, -160724]
11612a60724N1102C30423A40765a47420M0061j11685C2004K62349F514K2324a80395
11600H9994j4041Q0038b3224k63660j9723B25231g9097A47907b42748N4307C899
11588a85543k25450a6718k0699j97958h8369A43034J2073o7374f9904A21035M7699
11577A68734N8497N2100C6718b31776D0913a28699H2629R9373a11907A30187B6930
11565A30346A7956f898j59004B13164J7992F8916L05323B8247K93608e7365C48132
11553a41831C93950j76051B4420a80984Q62A07588c38704B47148P1065B7702L09773
11542C37475o5996i0419p6439k1974I950c6367F6867J83k6236J32259i5477j12500
11530b07977j8983C7037O5439b30243A38134L22192j9873r8240b3082A26344J28067
$$ y = [-160724, -109622, 330423, 140765, -147420, -107359, -219044, 32004, 294353, 6514, 28838, -180395, 89994, 75953, 155991, -23224, -286884, -306607, 225231, -79097, 147907, -242748, -188441, 3899, -185543, -410993, -16718, -37417, -235375, -88369, 143034, 155107, 87733, -69904, 121035, 168734, 227231, 279331, 36718, -231776, 40913, -128699, 82629, 182002, -111907, 130187, 26930, 130346, 17956, -6898, -165902, 213164, 231156, 68916, 374239, 28247, 321855, -57365, 348132, -141831, 393950, 217899, 24420, -180984, -180122, 107588, -338704, 247148, 318213, 27702, 337475, 271479, -90419, -166858, -188832, 9950, -36367, 66867, 67050, 40814, 173073, -95477, -207977, -226960, 37037, 102476, -230243, 138134, 460326, 440453, 342213, -23082, 126344, 254411]
11519B54411a42018B32958F3339a42451C75940D5766J28071A3411K10249B9825
11508A05179b26801A39683J71756l1090j07398h9003D48886j72439A30273c0245
11497C5102c1909j98814d0474A49175d8458A0231J28772i5078A52792m9675K2188
11486A25305K57407j17567a03380C68271H3594a01683l4167e2080A58425a11645
11475B17824F7303i4317C64760A06432b87117B30167A2100a90547e64B63957A18797
11463F1984J90887j04706K81926j13714g106D3887P4099M342M8331O1115l9266
11452A92508B2055B058J60499b64078L0138J11302j61774R4051a3143o6876B93123
11440a34945G0920c9077B63347a56973I5429L58941k19208j14205K213o0899O4013
$$ y = [254411, -142018, 232958, 63339, -142451, 375940, 45766, 173837, 13411, 223660, 29825, 105179, -226801, 139683, 311439, 280349, 172951, -89003, 448886, 276447, 130273, -30245, 35102, -31909, -230723, -40474, 149175, -48458, 10231, 139003, -95078, 152792, 103117, 125305, 382712, 265145, -103380, 368271, 83594, -101683, -135850, -52080, 158425, -111645, 217824, 67303, -94317, 364760, 106432, -287117, 230167, 12100, -190547, -564, 263957, 118797, 61984, 252871, 148165, 430091, 316377, -7106, 43887, 117986, 122328, 170659, 231774, 192508, 22055, 2058, 162557, -264078, -233940, -122638, -284412, -190361, -13143, -80019, 293123, -134945, 70920, -39077, 263347, -156973, 95429, 454370, 235162, 120957, 123170, 62271, 126284]
11429A26284k1506J36262a05631A13396a66369j1078A09415C9254K20628E497
11418I1739c0319A86309D3510a45137G7352N6928J17045G6356k6158B4302a09989
11406a42231B03187a54531B82875e8711B6977L04498F7901N0080m4506b2401B5293
11394a58850M9185O394C6914J9326b01158g909E7779A627c22224q9242A75115
11382e9842E6441K97267o0864h8417f561B7131J44141E4987a40750m44986c3445
11370d2971j01112A89973K6444a9505q9090l8787r3051A15417a84355D6c26108
11358b80068c241j87557C74394A3944a37737L5880A31329h4272k23232J38616
11348a68888Q2715j07625m913p1115D1121h7222j50349A17859K44355j07716A07996
$$ y = [126284, 104778, 241040, -105631, 113396, -166369, -177447, 109415, 39254, 259882, 5497, 91739, -30319, 186309, 43510, -145137, 77352, 134280, 251325, 76356, 50198, 24302, -109989, -142231, 203187, -154531, 282875, -58711, 26977, 331475, 67901, 117981, 73475, -22401, 25293, -158850, -109665, -103271, 36914, 56240, -201158, -7909, 57779, 1627, -322224, -411466, 175115, -59842, 56441, 353708, 292844, -88417, -6561, 27131, 171272, 54987, -140750, -585736, -33445, -42971, -144083, 189973, 216417, -19505, -108595, -147382, -240433, 115417, -184355, 46, -326108, -280068, -3241, -190798, 374394, 13944, -137737, -101857, 131329, -84272, -307504, -168888, -86173, -193798, -198711, -269826, 41121, -87222, -237571, 117859, 362214, 254498, 107996]
11336b25545e6609E4143J36671b03721A89086b3985o5381G0172G383J906J30857
11325A40146f7098B60336g7059B32425f7892q5699B67635c5187k93135H9299j0261
11314G9038N2110e5954A4190c92509G568b0064C20946f79639K81069a64651O1110
11303a03541L5434r6534a4730A66206p6634R0095b5811B19567c24243C5224K9384
11292F4608a658j96620F0096d25039B02349d94741a11851G600a92267C521K30980
11281B34501e1688E4196Q4789a54899l16808a34501J0737N6825J347l2406D7430
11269a75906r918R0297E1921c01049a24100C0655J53671A1435K64029i4170B97549
11257a44845k9156f4992j69545J16766A03658a53809B8940o94P7714D3133K36578
$$ y = [-225545, -56609, 54143, 190814, -203721, 189086, -23985, -89366, 70172, 7383, 9289, 140146, -67098, 260336, -77059, 232425, -67892, -153591, 267635, -35187, -328322, 89299, 79038, 131148, -55954, 14190, -392509, 7568, -20064, 320946, -679639, -398570, -164651, -103541, -68107, -164641, -14730, 166206, 89572, 179667, -25811, 219567, -324243, 35224, 64608, -1658, -198278, 60096, -425039, 202349, -494741, -111851, 7600, -192267, 3521, 234501, -51688, 54196, 138985, -154899, -471707, -134501, -123764, -66939, -65592, -97998, 47430, -175906, -185824, -95527, 51921, -301049, -124100, 30655, 184326, 11435, 275464, -94170, 297549, -144845, -174001, -64992, -234537, -117771, 103658, -153809, 28940, 28246, 105960, 43133, 279711]
11246B79711b68758a06754C21766a17260j24245A14799B8362K60023D5401C001
11235b5151A24156b00174C80836b16806i9184A48995f3692k30693c7821j19117
11225a56938d1290l12094H6259a30356A60363D7413a07692o8043P5017N982n6687
11214a51423c6240i421K042n0057A63400a79795H3157N2113A8188b08663i529
11202D3516b1204B5681d5923q7857L2884K903I7491H562a30178a9148k78631j09638
11190d07417f2943a7569j47711j63243A31551F3465J07875e08401K00809A53116
11179B7943a58816A16344l2927a83090A04585a89186B9089e2850I4665c23531
11168c02012D3859R3995a08923j4697B30244I4722c22175e8752a2697C6523J52465
$$ y = [279711, -268758, -106754, 321766, -117260, -241505, 114799, 28362, 288385, 45401, 3001, -25151, 124156, -200174, 380836, -216806, -99184, 148995, -63692, -294385, -37821, -156938, -41290, -353384, 86259, -130356, 160363, 47413, -107692, -175735, -100718, -94736, -151423, -36240, -9421, -7379, -57436, 163400, -179795, 83157, 135270, 18188, -208663, -9529, 43516, -21204, 25681, -45923, -133780, -100896, -97993, 97491, 8562, -130178, -19148, -297779, -407417, -62943, -17569, -165280, -328523, 131551, 63465, 171340, -508401, -307592, 153116, 27943, -158816, 116344, 83417, -183090, 104585, -189186, 29089, -52850, 94665, -323531, -302012, 43859, 137854, -108923, -123620, 230244, 94722, -322175, -58752, -12697, 36523, 188988]
11157A88988c27152A14948b68493c1340B2535a68150B7523A550g621q2242n2674
11146a42537B43456a7135F4118a51371e9479B24641a67676n7475Q3145c9448B15354
11134a46916f9288n9728r5777R4297J0020K8600A75920m7500a50167F5845Q1778
11123A47623J60752C775c03297o7089A08692J77449A36296J01211b22465g7481
11112B93155K26097D1151R4409a27975c887B38178h3781j97333a05822A86763
11101B99445a55338J8099D920J20101K14082b35976F4147L9112J05132G5878J78033
11090B53911p2110A5964K70386p1080b894B79401A327a866A09498d486A57397
11078a087A43925O9456A8720L53622F4634f2862C00908J7056J928n1967H4363
$$ y = [188988, -327152, 114948, -268493, -31340, 22535, -168150, 27523, 1550, -7621, -89863, -142537, 243456, -17135, 64118, -151371, -59479, 224641, -167676, -225151, -142006, -39448, 215354, -146916, -69288, -129016, -224793, -130496, -120476, -91876, 175920, 128420, -150167, 65845, 147623, 308375, 3775, -303297, -370386, 108692, 286141, 136296, 237507, -222465, -77481, 293155, 519252, 41151, 135560, -127975, -3887, 238178, -83781, -281114, -105822, 186763, 299445, -155338, -137239, 4920, 125021, 339103, -235976, 64147, 103259, 208391, 75878, 253911, 181801, 15964, 286350, 215270, -2894, 279401, 1327, -1866, 109498, -4486, 157397, -1087, 143925, 213381, 18720, 372342, 64634, -62862, 300908, 317964, 319892, 267925, 84363]
11066C03746c08369A32920J06194B526K53922B5263c9489D20448A69088J25789
11056B94877m9228L61027j46984o8516f277C22078B3650J42267K73268K54756
11046F93941j65019B44874H0617M80087P6152O5678H9581J78596M64812l02592
11036D30397N7137J58495J20924P6754k60125k707L72461k23814m0683k43183
11026D45656K47365M6369k9051J14647k27865M62342m76928M02371j25833L2307
11016H91380j83650j06136R9261K97805C88730K01103J49869J54109j84861J274
11006G10224L396j7722K93008k84163p9278N3758A67233N58849K66642l51076
10996F41648L8929C18753L17980p2104j5766O0582J04826j93960P7392j84324
$$ y = [303746, -308369, 132920, 239114, 2526, 256448, 25263, -39489, 420448, 169088, 294877, 245649, 606676, 459692, 391176, -6277, 322078, 23650, 165917, 439185, 693941, 528922, 244874, 80617, 560704, 636856, 702534, 89581, 268177, 732989, 430397, 487534, 646029, 766953, 843707, 583582, 580875, 953336, 729522, 688839, 445656, 693021, 739390, 710339, 824986, 597121, 1059463, 582535, 984906, 859073, 891380, 707730, 601594, 700855, 998660, 388730, 589833, 739702, 893811, 708950, 710224, 713620, 695898, 988906, 704743, 625465, 679223, 167233, 726082, 992724, 641648, 680577, 318753, 636733, 564629, 548863, 609445, 714271, 520311, 597703, 413379]
10986D13379L87341r412k0410J10416l67847M7610J33033j40622m1810L57225
10976H68903k98882k498Q3096N8136o8753j68102K19554R0806n4749J55028p8085
10965H04454j398J70018J20251m520K80426j37741J44359L07834L74288R6526
10955B154497k31256N90058L22985n42763J4879J27844k92282j81739O9841j99939
10945A832125j46858k94489L15865j02707q9064q0550L54986j67549m47302L15953
10935A490410K62415m73899D51657R0560L75492p232m26755q9046A96305h3912
10924A60456J36362j0447j09065O1506A05757P9123K25219A04181a11371A54679
10913a50306e4650A27320J42221a94340h4022G8004b64677A96939a0728A58406
$$ y = [413379, 800720, 791308, 770898, 881314, 513467, 561077, 694110, 553488, 511678, 868903, 570021, 567523, 650619, 708755, 640002, 471900, 691454, 782260, 727511, 882539, 804454, 803056, 973074, 1093325, 1088805, 1369231, 1231490, 1375849, 1683683, 2057971, 2154497, 1923241, 2513299, 2836284, 2293521, 2308400, 2436244, 2143962, 1962223, 2032064, 1832125, 1685267, 1390778, 1706643, 1603936, 1514872, 1434322, 1789308, 1621759, 1174457, 1490410, 1752825, 1278926, 451657, 542217, 917709, 910477, 483722, 394676, 196305, -83912, 160456, 296818, 286371, 177306, 238812, 105757, 184880, 410099, 104181, -111371, 154679, -150306, -54650, 127320, 269541, -194340, -84022, 78004, -264677, 196939, -10728, 158406]
10902a61578a5112H3740k1193L73211b95781A45035a17082j25300A56160m681
10892A51479L9431H5870J31618G7279J29589g2823A41957c274B05990d96159B14473
10880i4333D7173L75101j54427j02640d1411m1998a1820q7745o6986a5790p9389
10869i5179B28527a50476j83966A3623h0973m21450h6868j717I3676R3882h4121
10857E1530J35196l5414P222b00093j18748J37497C3168K6552a90359k44915D2021
10845h6525J3624A43994c57611a62253M6472G8653M8055b2961A63402R969G6306
10833A85925a48461c636C87255c76508a43507H6222e7348B05813a86474M9215
10823a37259B14725b41767e8490j5861C8560h0870L2133q7459B34299A9498d74153
$$ y = [-161578, -15112, 83740, 62547, 435758, -295781, 145035, -117082, -242382, 156160, 151479, 190910, 85870, 217488, 77279, 206868, -72823, 141957, -3274, 205990, -496159, 214473, -94333, 47173, 422274, 267847, 165207, -41411, -83409, -11820, -99565, -166551, -15790, -95179, 228527, -150476, -334442, 13623, -80973, -502423, -86868, -88585, 93676, 187558, -84121, 51530, 186726, 151312, 158534, -200093, -318841, -181344, 33168, 59720, -190359, -435274, 42021, -86525, -72901, 143994, -357611, -162253, -115781, 78653, 126708, -22961, 163402, 173371, 76306, 185925, -148461, -3636, 387255, -376508, -143507, 86222, -57348, 205813, -186474, -137259, 214725, -241767, -58490, -74351, 38560, -80870, -48737, -136196, 234299, 19498, -474153]
10811B56597a68273j4827l191g6540I6154f814q5820j005D355a00253c4748A21520
10798a45994E442N3496b76043G9285d6338j92763k41369D4958J9105j3307r434
10787D1322c45014B19912h6570j75815f0083m3546k7312L2860A33944a76226b5936
10775G702a20524N0804k83112a06321c1959J236K072i564k37799A19895f1974
10763c7972K813E4993b23500A08494f2322H9344J5024J199A1256R2153k9002C6431
10750D6773g3793j41102K4866D9004b10332R7976j11842a0882r9732j08035L9473
10739a79176h3805k75194g0947r4649l8607g8231m3458E1735J24499B0019a17691
10727A53699a29938M3537K1107j93229H3943a59907g2069a5753j45399A75863
$$ y = [256597, -168273, -183100, -186291, -76540, 96154, -6814, -92634, -93639, 4355, -100253, -34748, 121520, -145994, 5442, 58938, -276043, 79285, -46338, -239101, -480470, 44958, 64063, 50756, 41322, -345014, 219912, -86570, -262385, -60083, -103629, -130941, -98081, 133944, -176226, -25936, 7702, -120524, -69720, -352832, -106321, -31959, -30723, -28651, -9564, -247363, 119895, -61974, -37972, -35159, 54993, -223500, 108494, -62322, 89344, 104368, 105567, 11256, 103409, 74407, 36431, 46773, -73793, -214895, -190029, 49004, -210332, -112356, -224198, -10882, -110614, -218649, -179176, -83805, -358999, -70947, -165596, -204203, -78231, -121689, 51735, 176234, 20019, -117691, 153699, -129938, -86401, -65294, -258523, 83943, -159907, -72069, -15753, -161152, 175863]
10716a62285g4959n347j39187K3231B2430a34200A17990b15596A56855J9638B3115
10704a48071q2954j76286E9098c48305g1510k3908p0515d6866l67300a64024g8668
10692f8125B3830J41812b31169P4332B28364g9264B34722b56907a2405l8548m14797
10681d65750e9214j57160b0558F0934b99255h9594H2810A4531J03471a28358o6410
10670a94768D4410c87335h8091m1240E5222d13008a18627B07156a15965G0957
10659c6017k92193B1079b74187a31286B2220J74953n2342a25079k10556a46518
10648b9464q6439C12510L5568a12034d4743j22143q2249F5826f7117A64680a69580
10636G3573b85601g1835a9935B81987a77536N6569r5530N2834A94397a999j09179
$$ y = [-162285, -74959, -80306, -219493, -196262, 22430, -134200, 117990, -215596, 156855, 176493, 23115, -148071, -231025, -407311, 59098, -348305, -71510, -95418, -165933, -46866, -414166, -164024, -78668, -68125, 23830, 165642, -231169, -156837, 228364, -79264, 234722, -256907, -12405, -50953, -465750, -59214, -216374, -20558, 60934, -299255, -89594, 82810, 14531, 118002, -128358, -194768, 44410, -387335, -88091, -129331, 55222, -413008, -118627, 207156, -115965, 70957, -36017, -328210, 21079, -274187, -131286, 22220, 197173, 144831, -125079, -335635, -146518, -29464, -115903, 312510, 348078, -112034, -44743, -166886, -249135, 65826, -67117, 164680, -169580, 73573, -285601, -71835, -19935, 281987, -177536, -120967, -216497, -163663, 194397, -1999, -111178]
10625a11178A29064a45808A71824g9375E6292a89984Q3173k85003b7970q2722
10615a10692B38662a13322D4669K94647a69620M3440j54123A69152b7242r1905
10605a19147A37731A6923e1786k89897b8127D2517o093b42644Q6014j7882a7750
10593a34728N0038o5160k40048Q6452c4846D4704O5735e5615p6577q0238B67553
10581b02640N4230L408N1139j61393m9205A3241b1648F969c483q9724A25662b51155
10568d08181d9936l2845F2351J8673c29506c2961q1937A63934k6836A1331b36423
10556b46168A02823K66999b26166H5678H562J88248D5252J81916e9472H0719J6236
10545I6955J94077L5927E6364a51053A32840b32097A5799L3853J17397a89571
$$ y = [-111178, 129064, -145808, 171824, -79375, 56292, -189984, -106811, -391814, -27970, -110692, 238662, -113322, 44669, 339316, -169620, -126180, -280303, 169152, -27242, -119147, 137731, 16923, -51786, -341683, -28127, 42517, 36424, -242644, -156630, -174512, -17750, -134728, -84690, -149850, -389898, -303446, -34846, 44704, 110439, -55615, -132192, -212430, 267553, -202640, -148410, -145002, -93863, -255256, -304461, 13241, -21648, 6969, -3483, -93207, 125662, -251155, -408181, -49936, -82781, 62351, 81024, -329506, -32961, -114898, 163934, 137098, 11331, -236423, -246168, 102823, 369822, -226166, 85678, 8562, 196810, 45252, 227168, -59472, 80719, 96955, 291032, 326959, 56364, -151053, 132840, -232097, 15799, 49652, 167049, -189571]
10534b14169J04593l04374c7986m13048A0595a47043P2229C58156b50342P9200
10524a71142B2665J3806c17117a10367M4951h484k8494j91610R5213c0908a4388
10512A88511n876C3474J43025F7088c422k99726E9683a82126C07151d0313C691
10500H7208a91944n5914e5608q9512J8343k54071K5922C4478c5510p1383A61315
10488b62864B03167b43223b6935F595a23687H0428b918j21708A07467B8259J59566
10477A87825b19397P9013B7056a93370f4586l74685J32622A85394K42480E220
10466c0989A97433e5851G5018K14570A17532L80186r5154A00116j7854O0521J7318
10455A60101J42002E8308A6544K32424a2344n4905A74586a00399I4699K4797q157
$$ y = [-214169, -109576, -413950, -37986, -451034, 10595, -147043, -74814, 358156, -250342, -171142, 22665, 36471, -317117, -110367, -65416, -8484, -36978, -228588, -133375, -30908, -14388, 188511, 182635, 33474, 176499, 67088, -3422, -303148, 59683, -182126, 307151, -40313, 3691, 87208, -191944, -247858, -55608, -145120, -126777, -380848, -354926, 34478, -35510, -106893, 161315, -262864, 203167, -243223, -26935, 6595, -123687, 80428, -2918, -124626, 107467, 28259, 187825, -219397, -140384, 27056, -193370, -64586, -439271, -306649, 185394, 427874, 5220, -30989, 197433, -55851, 75018, 289588, 117532, 497718, 402564, 100116, 82262, 142783, 160101, 302103, 58308, 16544, 248968, -12344, -67249, 174586, -100399, 94699, 119496, 111339]
10444A11339d0599l61897a49988j35785N3635A6355i9016K296c76I1849g9369
10432B35413a24938B49852b70832L0632f4884o6680j00959f096p5326G6779J10306
10421A87085H6395g8817A15887b33459E9667k8513b39343a15990e3408D6650J44070
10410A90720h0203j53146C5324P7106d01413i2699K2269F1814B605h8809l2201
10399a21010k9231n0743A22638J41889g7047K7787F5677b0497E4209M2321c15489
10387C3011Q9640k6391b09387n2766a15405G3409a11843d759q6211c7366C15104
10375c52901B61533I3231J74227g0302B96346M9538a00941A21296D5207J34646
10365A79853b13116k379D05164h3291D72002C5871M2874J10390B8742L18942L1792
$$ y = [111339, -40599, -402496, -149988, -285773, -232138, 16355, -99016, -96720, -376, 91849, -79369, 235413, -124938, 249852, -270832, -240200, -64884, -131564, -232523, -6096, -81422, 76779, 187085, 86395, -78817, 115887, -233459, 59667, 31154, -239343, -115990, -53408, 46650, 190720, -80203, -233349, 35324, 112430, -401413, -92699, -70430, 61814, 2605, -88809, -121010, -150241, -200984, 122638, 264527, -77047, -49260, 65677, -20497, 54209, 96530, -315489, 33011, 122651, 96260, -209387, -262153, -115405, 73409, -111843, -4759, -90970, -37366, 315104, -352901, 261533, 93231, 267458, -70302, 296346, 345884, -100941, 121296, 45207, 179853, -213116, -215495, 405164, -83291, 472002, 35871, 78745, 189135, 28742, 347684, 379476]
10354C79476q1254k7883L5799K84755B9403N02465j4147Q8968j64720r1099A28630
10342B61640O9167A43389a6347C23983e207C10269A40500B0335L61764q8128j02501
10331A91470L40116A97833J25273A53550N154K03289j60170K8373J55048j54292
10321B30952R739C6258L00364A65159a24788C25985A43177J21821p4745c5951
10310e8459E0258L13775p9074A26165F870g660B37356J42093A05017J63516g2253
10298g4975B06684b07633Q8634A23803d877G4908a29457n5207l9871C28617e6472
10286b0546A5550d4217a7965A37441J78247E5566o83c03358D1079c6599A20304
10274b40730F2889c54623A49149f9951k43585A59609b29103Q8911D3253j7537
$$ y = [379476, 298222, 270339, 306138, 590893, 29403, 531868, 517721, 606689, 441969, 350870, 128630, 261640, 330807, 143389, -16347, 323983, -5207, 310269, 140500, 20335, 382099, 293971, 191470, 531586, 197833, 323106, 153550, 158704, 361993, 201823, 230196, 385244, 230952, 240691, 36258, 336622, 165159, -124788, 325985, 143177, 264998, 190253, -35951, -58459, 50258, 364033, 284959, 126165, 6870, -7660, 237356, 379449, 105017, 268533, -72253, -74975, 206684, -207633, -118999, 123803, -4877, 74908, -129457, -184664, -224535, 328617, -56472, -20546, 15550, -44217, -17965, 137441, 315688, 55566, 54883, -303358, 41079, -36599, 120304, -240730, 62889, -354623, 149149, -69951, -313536, 159609, -229103, -140192, 43253, 25716]
10264B5716J22635i3475j31894H4772a30804k06158a38893f3119k5183E5967F618
10252b9421E2468b03760l5545K0893A66091m1454d1750A32815E8174a43014O7707
10241g5307C56203A60947G2347O9124J94605j55593n6245N5911A5169K99331i8440
10229C13462a86460j10337A5163a59296i304l45847e1748B02441r2342f3819r5352
10218a59171B3566a32733C96993a51901e1079D6820a3671A33596c23887O9378
10208b54509j16178c3174k65238J22114o0335A5959c12210D284a39294A61186
10197A30187C2930R2942b4548A82804b5222A98744I8633a38165o272e1700B57315
10185A6167c01832d343o3791k26087A9731b65747a10724C6468a46749a0744G321
$$ y = [25716, 148351, -93475, -225369, 84772, -130804, -336962, -138893, -63119, -88302, 55967, 6618, -29421, 52468, -203760, -239305, -218412, 166091, 124637, -41750, 132815, 58174, -143014, -75307, 356203, 160947, 72347, 141471, 336076, 180483, 124238, 180149, 15169, 314500, -98440, 313462, -186460, -296797, 15163, -159296, -9304, -355151, -51748, 202441, 110099, -63819, -159171, 23566, -132733, 396993, -151901, -51079, 46820, -13671, 133596, -323887, -254509, -370687, -33174, -298412, -176298, -236633, 15959, -312210, 4284, -139294, 161186, 130187, 32930, 125872, -24548, 182804, -25222, 198744, 98633, -138165, -144437, -51700, 257315, 16167, -301832, -4343, -68134, -294221, 19731, -265747, -110724, 36468, -146749, -10744, 7321]
10173b52516L3277P5680A80404a31977A70103H89h6671q9113O1569B30099D6582
10161a03655N0448j50423K0254G6566a96831G4601a4483A33414B6749L46479a21702
10149E362a73072c3739O586j6706J1666k5330f732E9315b16922g7561A976N344
10137G320J44459c8400j70762A86411d38291d6837q0699p6428j35774J68576P1479
10126i9683d8048A01197j3584b02944k57851b6376a0460l5976J5139j39971H3766
10114d01446d9433B73059f3871q4432C793J83455c2996j92788E4213M432J65338
10103B23983a16106j5098b5148j1800E1276c146A84725b28174B73375a94767P6537
10092a18230D8650h3697q7585l4128C0221b77697D6104J36678e0127j28952A73539
$$ y = [-252516, -219239, -143559, 180404, -131977, 170103, 889, -86671, -175784, -114215, 230099, 46582, -103655, -53207, -203630, -183376, 76566, -196831, 74601, -14483, 133414, 26749, 373228, -121702, 5362, -173072, -33739, -27153, -43859, -32193, -57523, -6732, 59315, -216922, -77561, 1976, 7320, 151779, -38400, -209162, 186411, -438291, -46837, -127536, -203964, -339738, -171162, -99683, -48048, 101197, 87613, -202944, -460795, -26376, -10460, -46436, -31297, -171268, 83766, -401446, -49433, 273059, -63871, -148303, 3793, 187248, -32996, -225784, 54213, 58645, 223983, -116106, -131204, -25148, -36948, 51276, -3146, 184725, -228174, 273375, -194767, -118230, 48650, -83697, -171282, -205410, 30221, -277697, 46104, 182782, -50127, -179079, 173539]
10080D65595b98125A09158g9667B3769J01820b04404j6084A14006k0794b97625
10069c3220Q099B0704c2583o3378j11236A07511K0493C19a05359a6730H7534a46771
10056C5146a17582A0063a16476G6695j0863h8600C5992a1532A21518i5045D196
10044a64447a8452k70059k7756c4623r0068A51321p3981J18593e428m2982j8086
10033f6496R452j28111a2905C87043h3606M1068j30127O9009b5820m0189p3583
10022a39592K6364n5445C0284P1399a84010I9384M5822b15714k48734J64728b8824
10010a21865C8599e3268A04177g117j19843A5608b09479M0287A69276a22773j58987
9999b81760A25423m2812c83942I3599D6622f9089k65777a00544n102n7041P4015
$$ y = [465595, -298125, 109158, -79667, 23769, 125589, -204404, -220488, 114006, 93212, -297625, -33220, -25121, 20704, -32583, -95961, -207197, 107511, 128004, 319, -105359, -16730, 87534, -146771, 35146, -117582, 10063, -116476, 76695, 65832, -88600, 35992, -11532, 121518, -95045, 4196, -164447, -18452, -288511, -316267, -34623, -124691, 151321, 77340, 195933, -5428, -48410, -66496, -57044, -185155, -12905, 387043, -83606, -42538, -172665, -103656, -25820, -66009, -139592, -113228, -168673, 30284, 101683, -184010, 99384, 145206, -215714, -464448, -299720, -28824, -121865, 38599, -53268, 104177, -7117, -126960, 15608, -209479, -169192, 169276, -122773, -281760, 125423, 82611, -383942, 93599, 46622, -69089, -334866, -100544, -105646, -162687, -88672]
9988h8672C5593L5550h0831K5072k54157O7020H5798c05463J39645M2999A25707
9976A40079b10010L2280G5631L3175b02425k14289G969K1193b4433B8217Q676
9965C6893N8385j8584Q6361D9356c76428J02525O0643P5083b9817r3367N769A06047
9952B3977a42583A60360b05497K4039k11230j843H3985C7392h3602d0277A1203
9940b47351G4396Q2409A7882h2243b1613A53437M1426E3004h0924B13138a67324
9928a30964A63895b99377I723f0144A69277o1031c84874J21106D0858c10408a34859
9916F3791b07827B79524Q341b55722L4310G6564J3998a66602c6083j19839e8172
9904h6325j90597l6990b4531r2561o5436A06812l8283p548c2661l05053J27099
$$ y = [-88672, 35593, 71143, -80831, -55759, -309916, -242896, 85798, -305463, -165818, -122819, 125707, 140079, -210010, -177730, 75631, 108806, -202425, -416714, 7969, 29162, -24433, 28217, 36893, 95278, 76694, 163055, 49356, -376428, -273903, -213260, -138177, -29817, -123184, -117415, 106047, 23977, -142583, 160360, -205497, -181458, -392688, -394531, 83985, 37392, -83602, -40277, 11203, -247351, 74396, 156805, 17882, -82243, -21613, 153437, 194863, 53004, -80924, 213138, -167324, -130964, 163895, -299377, 9723, -60144, 169277, 108246, -384874, -263768, 40858, -310408, -134859, 63791, -207827, 279524, 287865, -255722, -221412, 76564, 90562, -166602, -36083, -155922, -58172, -86325, -276922, -313912, -24531, -117092, -182528, 106812, 68529, 60981, -32661, -337714, -210615]
9893b10615J04145A00352a9191j62286j3966F4366a50223f8220j07232F0886f4634
9881c22220k56824a47741f2756B92977b04046H3189L2462e0367A02140k7374a87786
9869E3875J42977I8130a16247A08136e744r4455B3949M17b24510R5483A79674
9857b929n5471A06278k338m2236J87272B3640C1b98552K0570A65366h7482d079
9844D35245i1778D11a25709C7782d66826a07637l2511A59138b59615A70043a07687
9832a73343c5363B40381C3454a32027e5143m0888A17765a10173A64466b09676
9821F421c22995G65b94036G4689a88111M8732B23299a56650B5853c88830a29939
9809a58080K3213j2826p7926e1574j70769R7797A78829e53557b25218j38726i9712
$$ y = [-210615, -106470, 100352, -19191, -181477, -195443, 64366, -150223, -68220, -175452, 60886, -64634, -322220, -579044, -147741, -62756, 292977, -204046, 83189, 115651, -50367, 102140, 74766, -187786, 53875, 196852, 98130, -116247, 108136, -5744, -100199, 23949, 24366, -224510, -129027, 179674, -2929, -58400, 106278, 103940, 61704, 248976, 23640, 31, -298552, -277982, 165366, -87482, -4079, 435245, -91778, 411, -125709, 37782, -466826, -107637, -140148, 159138, -259615, 170043, -107687, -173343, -35363, 240381, 33454, -132027, -55143, -96031, 117765, -110173, 164466, -209676, 6421, -322995, 765, -294036, 74689, -188111, -139379, 223299, -156650, 25853, -388830, -129939, -158080, -134867, -147693, -225619, -51574, -222343, -124546, 178829, -553557, -225218, -363944, -99712]
9797A82035a00162k09298c9224j91807F6179N2304c9002k3679j55196j35172B0384
9785B28108a45288B68007G9857c2087P72j19761a5783q6600k35725A19a83949
9773B82594b21632B91201D1454a9508G3024d6724A50105K2933a95645k17034b0385
9761C9060i524B0561c45388a02096J6377K5202l01329a12489A50385a21730l9768
9750a61498l18089F0020b32601h9748b5835j22457N3064a033m4984q8897C4893
9738a40255I1003O0422o4353Q3240p4692b56083L2276h7868j13581f3587G4955
9726f4480m01k34263g6316b3677j22497j13663g9130j1340A72033B3510L27899
9715C51409C4459j0084a93538a2494E5396b14832E437a91204P3170J5857A94733
$$ y = [182035, -100162, -309460, -39224, -231031, 66179, 118483, -39002, -62681, -217877, -353049, 20384, 228108, -145288, 268007, 79857, -32087, -31315, -151076, -15783, -102383, -338108, 119, -183949, 282594, -221632, 291201, 41454, -19508, 73024, -46724, 150105, 173038, -195645, -412679, -20385, 39060, -9524, 20561, -345388, -102096, -85719, -60517, -361846, -112489, 150385, -121730, -161498, -479587, 60020, -232601, -89748, -25835, -148292, -95228, -1033, -46017, -134914, 34893, -140255, 91003, 151425, 87072, 170312, 95620, -256083, -223807, -87868, -201449, -63587, 74955, -64480, -64881, -299144, -76316, -23677, -146174, -259837, -79130, -90470, 172033, 23510, 351409, 34459, 24375, -193538, -12494, 55396, -214832, 5437, -191204, -118034, -102177, 194733]
9703b07159l9537c6492e884j50953A82582a39184A35756a7566e942k32515j19884
9692c58341Q497P8558E4900J46318c5204j52523g5694j03726B10500F5584c00265
9680c42620b7534k5526k09256A17004n6003E788c14575f5216I2177b97251a47587
9668I726a06873A21252a06775l8367f8498p8599K2883j34503g6589A1568b53893
9656D7182A6938K99241a51859j53839A5039b6848F5840b77617g7389j20569N6982
9645a40976A5547b23262p2795J32410A9608K10489g8818e418j40503L3677a2011
9633B2455h9613p4736q7280P8567C3554b76556D1001a60556h0104L6147k13765
9622b57722c8555k69005a52687J1478j7245j88510a48930n3232R5322A4664O9498
$$ y = [-207159, -246696, -36492, -5884, -156837, 182582, -139184, 135756, -17566, -5942, -238457, -358341, -349844, -271286, 54900, 201218, -35204, -187727, -75694, -179420, 210500, 65584, -300265, -342620, -27534, -53060, -262316, 117004, 61001, 5788, -314575, -65216, 92177, -297251, -147587, 9726, -106873, 121252, -106775, -145142, -68498, -147097, -124214, -258717, -76589, 11568, -253893, 47182, 16938, 316179, -151859, -305698, 15039, -26848, 65840, -277617, -77389, -197958, -140976, 15547, -223262, -296057, -163647, 19608, 230097, -78818, -5418, -145921, -112244, -12011, 22455, -89613, -164349, -251629, -173062, 33554, -276556, 41001, -160556, -80104, -43957, -257722, -38555, -307560, -152687, -141209, -158454, -346964, -148930, -202162, -106840, 14664, 84162]
9611H4162h4689A18586a1442k60450H1686R6747a40740O3710A83573D1907L9101
9600H1008b08006A9965Q2055l5001a63396H3012O8347a09613F0353a43279N495
9589a37784e8821A69353i8123q157p23j72158A00199l686a57940J2348C7605L548
9577D1153b4317q8074k63776J58217p055G3093J15637b9906D50971a29015o9160
9566a98175c9924G5111A1246J3094R6755d0168B9626c3020G8906b7054C4315c1976
9553D2299i3294N193K6391b3837l04880A39952a58831M7087d9106n161D6857k1292
9541B5565a41084a9408k66434A71679j8353f974p1772k5271M5387A34421a687
9529C4134a2254m2655D2889P5710I963g2616B07874a8288l73662d8909A99133
$$ y = [84162, -84689, 118586, -11442, -271892, 81686, 178433, -140740, -77030, 183573, 41907, 81008, -208006, 19965, 102020, 67019, -163396, 83012, 151359, -109613, 60353, -143279, -137784, -58821, 169353, -98123, -106280, -107003, -279161, 100199, 96513, -157940, -145592, 37605, 41153, -24317, -112391, -376167, -217950, -225005, 73093, 188730, -29906, 450971, -129015, -198175, -39924, 75111, 11246, 24340, 121095, -40168, 29626, -33020, 78906, -27054, 34315, -31976, 42299, -93294, -88101, -61710, -23837, -328717, 139952, -158831, -111744, -49106, -54267, 46857, 25565, -141084, -19408, -285842, 171679, 153326, -6974, -78746, -104017, -58630, 134421, -1687, 34134, -12254, -54909, 42889, 118599, 9963, -72616, 207874, -18288, -391950, -48909, 199133]
9517B43091c7824A76701H0306L7057I070L9903a89624o9453J13436o8172a5j48288
9505a48303j49888A544g3882B5598J00182c740l6460q0411m4861A26920c8658
9493C6584c46203a57456j29445e631m6027l26536B31994a23921E1260J112h5506
9481B50554F1739a55079g336D6722b04390f3813m0817N510E8396a95035B8178
9469E3213e067B84783c10964a51950A2841J32277b94254A98866a71057B19502
9458a0843m92256A88632o2013c969B250a16134a2246F8008J057b46908p2200g4338
9445b39825Q4477j32068f9925F5116a48404a3265j11476r9180A7603J86534a22097
9433D6730a99447R8102A7629a42357M8345K9866G0576j8010a37721e0005d106
$$ y = [243091, -37824, 176701, 80306, 117363, 9070, 48973, -189624, -259077, -145641, -213813, -15, -148303, -298191, 1544, -73882, 25598, 125780, -3740, -40200, -120611, -165472, 126920, -38658, 36584, -346203, -157456, -286901, -5631, -51658, -378194, 231994, -123921, 51260, 52372, -85506, 250554, 61739, -155079, -7336, 46722, -204390, -63813, -104630, -99120, 58396, -195035, 28178, 53213, -5067, 284783, -310964, -151950, 12841, 145118, -294254, 198866, -171057, 219502, -10843, -503099, 188632, 126619, -3969, 2250, -116134, -12246, 68008, 69065, -246908, -319108, -74338, -239825, -155348, -287416, -69925, 65116, -148404, -13265, -124741, -223921, 17603, 204137, -122097, 46730, -199447, -101345, 17629, -142357, -94012, -64146, 70576, 52566, -137721, -50005, -4106]
9421c7874I4163a07827Q442j68366n1361a34345B830J12921a351j31748A32232
9409A85260f9898k40686J28828A12633a34280J3461A61845d65344i6346O160j54030
9398b44216D9640e05472a83332F1425d0734k81544e9393H3213b9197k39026L1399
9387b36824B53104a13866k26122J11388h8374k08988Q6761a400n8077E8771h3453
9375a13608A97154b43962a2467A09183Q496b20944A36596m2859b9625j02154I44
9363f6000j35748b1963B31440O1807e1262j48738d1461G78Q8425a89750g4216
9351f5478C39728C4688J9758K62755C4502d77577a59160k2995A72445a20582d8645
9339A44474a78030B93843a37949f5440E1315f9851k24324J40245I4594b42050
$$ y = [-37874, 94163, -107827, -99385, -267751, -319112, -134345, 2830, 115751, -1351, -133099, 132232, 185260, -69898, -310584, -181756, 112633, -134280, -120819, 161845, -465344, -96346, -90186, -244216, 49640, -505472, -183332, 61425, -40734, -322278, -59393, 83213, -29197, -268223, -236824, 253104, -113866, -339988, -228600, -88374, -297362, -210601, -1400, -59477, 58771, -83453, -113608, 197154, -243962, -12467, 109183, 117679, -220944, 136596, 93737, -29625, -131779, 944, -66000, -201748, -21963, 231440, 293247, -51262, -200000, -41461, 778, 89203, -189750, -74216, -65478, 339728, 34688, 54446, 317201, 34502, -477577, -159160, -182155, 172445, -120582, -48645, 144474, -178030, 293843, -137949, -65440, 51315, -69851, -294175, -153930, 94594, -242050]
9328b23999e7457j62896i8264k34902J64856j64814O8890j16358a28795f3969
9317A06829I897J32090b95266g2709j4497k9456o0567J1904I1469b11268C6280
9305e1330J8177E1496b00414M5149c1469j54444g5639l27842J96469e4976F3856
9293g7810B98042g273k42917c0419A1257a38204k07484q0377b06487P2707n097
9282a38877D374L0754a17055A55008g0884j42624p6590J20178c3427j38174b9273
9270C7557L295c67007E0000N2519D2779L46613g8092A13186a68363A25905h0512
9258h4821o2842A48760a18068e0745a6272C21281A32620D3089h7830E8852M2354
9247A01206a21727K6166F654K17965a49783d5153k43127n5068a67206b6337I4843
$$ y = [-223999, -57457, -220353, -98264, -333166, -168310, -333124, -264234, -380592, -128795, -63969, 106829, 9897, 141987, -295266, -72709, -87206, -116662, -177229, -165325, 91469, -211268, 36280, -51330, -33153, 51496, -200414, -155265, -31469, -185913, -75639, -403481, -207012, -54976, 63856, -77810, 298042, -7273, -250190, -30419, 11257, -138204, -345688, -426065, -206487, -133780, -138877, 4374, 35128, -117055, 155008, -70884, -213508, -290098, -169920, -33427, -171601, -29273, 37557, 40852, -367007, 50000, 102519, 42779, 389392, -78092, 113186, -168363, 125905, -80512, -84821, -147663, 148760, -118068, -50745, -16272, 321281, 132620, 43089, -87830, 58852, 101206, -121727, -95561, 6654, 224619, -149783, -45153, -288280, -343348, -167206, -26337, 94843]
9235a02189J8045q3289b0357D4330i5959q7608f0638E7335a11934j69538M9226
9224b32246B08539g005m56369B48145b92510A21453c3761j30962B0910J59394
9214A80304p0232c6155B2035a28055H085a88858A21631g9600a3463A41553c45319
9202b28232Q3814C37327e0109q0485e5873k54949A02959a11604b4383k90004e8251
9190e64832b27703c0145j11244g511j54971j05523J29543k8253D3989L5167a91958
9178c7282A41966E1650b07285b6432A18208m9089a71599A47623E1729i6076A87007
9166a960B42098p0419n3497A1458a31897G5927a19879m1822I1205M7470h1806
9154c2395p6720j19217h7221l74355J91624a18327C7358q027O36L68976b63457
$$ y = [-102189, -84144, -167433, -20357, 44330, -95959, -183567, -60638, 57335, -111934, -281472, -232246, 208539, -7005, -463374, 248145, -292510, 121453, -33761, -164723, 20910, 180304, 110072, -36155, 22035, -128055, 8085, -188858, 121631, -79600, -13463, 141553, -345319, -228232, -144418, 337327, -50109, -130594, -55873, -310822, 102959, -111604, -24383, -314387, -58251, -564832, -227703, -30145, -141389, -7511, -162482, -268005, -138462, -166715, 43989, 79156, -191958, -37282, 141966, 51650, -207285, -26432, 118208, 69119, -171599, 147623, 51729, -96076, 187007, -1960, 242098, 171679, 118182, 11458, -131897, 75927, -119879, -161701, 91205, 138675, -81806, -32395, -109115, -228332, -87221, -461576, -269952, -118327, 37358, 29331, 29967, 398943, -263457]
9142A83077d9608D5082J22160b22613L6977Q2385F3656e347E7968c88135J73220
9131b14915p7758r5016a06386c4340p7587r0222g4876j34348D18650j71426b89561
9119b8282q8443d407B00886j00238D4556d8883G8815e4954l9983k93240C08534
9107e31616A0464J03455j703f1820E0503A3372e0478A4170J86813c05385e7168
9095c5139r6697l7523F6287f5160l15076o973J7475a78310A21811B3142c00313
9083G2371d2381k15836A23845c8166B75129i6076E1596a6288G1215a72154g126
9071B05056c84189a4326O902p3500F6440M1376a91886R2231b6016I7440i2558
9059c16544A4929h5748C93505a83113l0003Q9128A87775a72969A08439A0804a20774
$$ y = [183077, -49608, 45082, 167242, -222613, -185636, -103251, 63656, -5347, 57968, -388135, -214915, -292673, -387689, -106386, -34340, -111927, -202149, -74876, -209224, 418650, 247224, -289561, -28282, -116725, -4407, 200886, 100648, 44556, -48883, 78815, -54954, -94937, -388177, 308534, -531616, 10464, 113919, 112216, -61820, 50503, 13372, -50478, 14170, 200983, -305385, -57168, -35139, -131836, -169359, 66287, -65160, -380236, -387209, -369734, -178310, 121811, 23142, -300313, 72371, -42381, -258217, 123845, -38166, 275129, -96076, 51596, -16288, 71215, -172154, -7126, 205056, -384189, -14326, -7424, -80924, 66440, 107816, -191886, -99655, -26016, 97440, -92558, -316544, 14929, -85748, 393505, -183113, -213116, -123988, 187775, -172969, 108439, 10804, -120774]
9047a93500j94454D5317A4722h2205c5757A6936M3902b85207a37690j764a887
9035A99730p5704A58b32779i7528j88156A84902E36b22433E4706J99255a80147
9023a27135F6631a0403k30387j46297B54080a55069n3426f5697R155H9393g5400
9011b60893G8919j4156f6550B85701b16157C08793b09702j1488K1388B4925Q5427
9000A10352A3551f2227A54812a07926A33841J59713q8254a47077D9024e8207m9736
8989a07943j78808h8183c4801B4313J11376J4704d4480j49049J2557F1749c20300
8977d6828J1531k00517Q7106B29387I0241a11498A9287f7328B15860b85778A54307
8965a46176F4971a60103k0222a4020l37962a40189d1413l09964j475J35917l2804
$$ y = [-193500, -387954, 45317, 14722, -82205, -35757, 16936, 60838, -285207, -137690, -139454, -1887, 199730, 124026, 158, -232779, -97528, -285684, 184902, 536, -222433, 54706, 253961, -180147, -127135, 66631, -10403, -240790, -387087, 254080, -155069, -208495, -65697, -56542, 89393, -75400, -260893, 78919, 64763, -66550, 285701, -216157, 308793, -209702, -221190, -199802, 24925, 110352, 13551, -62227, 154812, -107926, 133841, 293554, 205300, -147077, 49024, -58207, -107943, -286751, -88183, -34801, 24313, 135689, 150393, -44480, -193529, -180972, 61749, -320300, -46828, -35297, -235814, -148708, 229387, 90241, -111498, 19287, -67328, 215860, -285778, 154307, -146176, 64971, -160103, -180325, -14020, -351982, -140189, -41413, -351377, -352852, -216935, -249739]
8954b49739J03821C02722b3541r2613c5298l8902R319k00281a06297e2746j0329
8943f3075m05331C7708a35929A70814i6557k20277A89039d8435l6469m4955G653
8931a60357N2819J3720k38038a23999B772a84919A06746j9965J48789c37017h7588
8919B67001d06602a35831A84361n007J19958I7541B93K91979H7440C7380J59069
8908A96449g6216H41986K74005R37852K499323K882334C509896j514631q24978
8899A170287C28291K30485k28608G7441k9276K63650j18731a08236C04782j06806
8889A97976F4688K806b28490C12671a07076B31521F757c11264A7300c83218A8539
8877b7805j98359B7689b65278R2805H7538a35805F4019D940K16581a84376A20709
$$ y = [-249739, -145918, 302722, -23541, -116154, -35298, -74200, -64881, -265162, -106297, -52746, -63075, -468406, 37708, -135929, 170814, -96557, -316834, 189039, -48435, -84904, -129859, 7653, -160357, -107538, -93818, -331856, -123999, 2772, -184919, 106746, 86781, 235570, -337017, -87588, 267001, -406602, -135831, 184361, 179354, 299312, 97541, 293, 292272, 87440, 37380, 196449, -76216, 841986, 1115991, 2053843, 4553166, 7435500, 3509896, 1995265, 1170287, 328291, 558776, 330168, 77441, 48165, 311815, 193084, -108236, 304782, 197976, 64688, 67494, -228490, 312671, -107076, 231521, 6757, -311264, 17300, -383218, 18539, -27805, -226164, 27689, -265278, -172473, 87538, -135805, 64019, 4940, 221521, -184376, 120709]
8865b2880I3377C7744n562a95692B2221L92824a80836O5717K5831A12579a65355
8853A63113d5693m543j8425j11279A7617L7620M9612k6815h0494G9689b92950
8841b56448R9134a340A16476A5257c1238k2244E4111a73836N3682j65647i742
$$ y = [-22880, 93377, 37744, 32182, -195692, 22221, 415045, -180836, -115119, -89288, 112579, -165355, 163113, -45693, -50236, -68661, -179940, 17617, 55237, 104849, 78034, -80494, 79689, -292950, -256448, -157314, -1340, 116476, 15257, -31238, -53482, 54111, -173836, -120154, -285801, -9742]
$$ [...]
##END NTUPLES=NMR SPECTRUM
##END=
