
##TITLE=AC1117_Cauca2_5835426_EAq6SDhmyq
##JCAMPDX= 6.0         $$ Bruker NMR JCAMP-DX V2.0
##DATA TYPE= NMR SPECTRUM
##DATA CLASS= NTUPLES
##ORIGIN= BRUKER
##OWNER= Administrator
$$ 1.72 TOPSPIN		Version 2.1
$$ 2012-03-26 23:13:51.687 -0500  Administrator@TOPSPIN
$$ Compression mode = diff/dup
##.OBSERVE FREQUENCY= 400.13188235
##.OBSERVE NUCLEUS= ^1H
##.ACQUISITION MODE= SIMULTANEOUS (DQD)
##.ACQUISITION SCHEME= undefined
##.AVERAGES= 64
##.DIGITISER RES= 22
##SPECTROMETER/DATA SYSTEM= spect
##.PULSE SEQUENCE= noesygpps1d.comp
##.SOLVENT NAME= COFFEE_meoh
##.SHIFT REFERENCE= INTERNAL, COFFEE_meoh, 1, 14.96821
##AUDIT TRAIL= $$ (NUMBER, WHEN, WHO, WHERE, PROCESS, VERSION, WHAT)
$$ ##TITLE= Audit trail, TOPSPIN		Version 2.1
$$ ##JCAMPDX= 5.01
$$ ##ORIGIN= Bruker BioSpin GmbH
$$ ##OWNER= Administrator
$$ $$ C:\Bruker\TOPSPIN/data/COFFEE/nmr/AC1117_Cauca2_5835426_EAq6SDhmyq/12/pdata/1/auditp.txt
$$ ##AUDIT TRAIL=  $$ (NUMBER, WHEN, WHO, WHERE, PROCESS, VERSION, WHAT)
(   1,<2012-03-26 23:13:46.875 -0500>,<Administrator>,<TOPSPIN>,<go>,<TOPSPIN 2.1>,
      <created by zg
	started at 2012-03-26 23:02:15.453 -0500,
	POWCHK enabled, PULCHK disabled,
       configuration hash MD5:
       1A 1E CE 29 27 FD 77 03 67 4E F0 E3 C4 B2 CB 90
       data hash MD5: 64K
       AD D5 4F 0C E0 B1 C3 9D CA 7B C9 6F 69 DC 71 97>)
(   2,<2012-03-26 23:13:49.718 -0500>,<Administrator>,<TOPSPIN>,<proc1d>,<TOPSPIN 2.1>,
      <Start of raw data processing
       efp LB = 0.3 FT_mod = 6 PKNL = 1 PHC0 = 0 PHC1 = 0 SI = 128K 
       data hash MD5: 128K
       9D 1B 0E 95 8A 64 75 84 60 D6 30 C4 F0 28 57 60>)
(   3,<2012-03-26 23:13:50.890 -0500>,<Administrator>,<TOPSPIN>,<proc1d>,<TOPSPIN 2.1>,
      <pk PHC0 = 32.70081 PHC1 = 0 
       data hash MD5: 128K
       2D 3E 14 12 A0 23 5B A0 85 4E 9B 04 B1 0C 1A FA>)
(   4,<2012-03-26 23:13:51.125 -0500>,<Administrator>,<TOPSPIN>,<proc1d>,<TOPSPIN 2.1>,
      <abs ABSG = 1 
       data hash MD5: 128K
       B1 3D 57 A3 44 18 6C B1 A6 F9 2A 25 C0 BC A1 08>)
(   5,<2012-03-26 23:13:51.250 -0500>,<Administrator>,<TOPSPIN>,<proc1d>,<TOPSPIN 2.1>,
      <abs ABSG = 2 
       data hash MD5: 128K
       9C 9D EE 00 2E E1 0A 34 C4 5F 27 CF FC C3 82 F6>)
(   6,<2012-03-26 23:13:51.468 -0500>,<Administrator>,<TOPSPIN>,<proc1d>,<TOPSPIN 2.1>,
      <abs ABSG = 3 
       data hash MD5: 128K
       77 57 56 27 2A 88 17 AE 16 80 CC 21 77 1E 79 7B>)
(   7,<2012-03-26 23:13:51.531 -0500>,<Administrator>,<TOPSPIN>,<proc1d>,<TOPSPIN 2.1>,
      <abs ABSG = 4 
       data hash MD5: 128K
       5E 17 0E BF 7A 28 89 F7 CE 21 8A 85 06 95 4A 6B>)
(   8,<2012-03-26 23:13:51.593 -0500>,<Administrator>,<TOPSPIN>,<proc1d>,<TOPSPIN 2.1>,
      <abs ABSG = 5 
       data hash MD5: 128K
       FB 4D 9A 44 DA AE B7 BB E2 8A 8D 8D 03 CC CA 8B>)
$$ ##END=
$$ 
$$ $$ hash MD5
$$ $$ B7 CB A7 5B 05 20 D7 88 CF 8E 52 B5 CA 74 E3 08
##$RELAX= 
##$RELAX= 
##$RELAX= 
##$RELAX= 
##$RELAX= 
##$RELAX= 
##$RELAX= 
##$RELAX= 
$$ Bruker specific parameters
$$ [...]
##$TP07= 0
##$TPNAME0= <>
##$TPNAME1= <>
##$TPNAME2= <>
##$TPNAME3= <>
##$TPNAME4= <>
##$TPNAME5= <>
##$TPNAME6= <>
##$TPNAME7= <>
##$TPOAL= (0..7)
0.5 0.5 0.5 0.5 0.5 0.5 0.5 0.5
##$TPOFFS= (0..7)
0 0 0 0 0 0 0 0
##$TUNHIN= 0
##$TUNHOUT= 0
##$TUNXOUT= 0
##$USERA1= <user>
##$USERA2= <user>
##$USERA3= <user>
##$USERA4= <user>
##$USERA5= <user>
##$V9= 5
##$VALIST= <valist>
##$VCLIST= <CCCCCCCCCCCCCCC>
##$VD= 0
##$VDLIST= <DDDDDDDDDDDDDDD>
##$VPLIST= <PPPPPPPPPPPPPPP>
##$VTLIST= <TTTTTTTTTTTTTTT>
##$WBST= 1024
##$WBSW= 4
##$XGAIN= (0..3)
0 0 0 0
##$XL= 0
##$YL= 0
##$YMAX_a= 13933578
##$YMIN_a= -6201392
##$ZGOPTNS= <>
##$ZL1= 120
##$ZL2= 120
##$ZL3= 120
##$ZL4= 120
##$ABSF1= 14.96821
##$ABSF2= -5.58432
##$ABSG= 5
##$ABSL= 3
##$ALPHA= 0
##$AQORDER= 0
##$ASSFAC= 0
##$ASSFACI= 0
##$ASSFACX= 0
##$ASSWID= 0
##$AUNMP= <proc_prof1d_extract.lims>
##$AXLEFT= 0
##$AXNAME= <>
##$AXNUC= <1H>
##$AXRIGHT= 0
##$AXTYPE= 0
##$AXUNIT= <>
##$AZFE= 0.1
##$AZFW= 0.1
##$BCFW= 0
##$BC_mod= 0
##$BYTORDP= 0
##$COROFFS= 0
##$CY= 15
##$DATMOD= 1
##$DC= 0
##$DFILT= <>
##$DTYPP= 0
##$F1P= 0
##$F2P= 0
##$FCOR= 0.5
##$FTSIZE= 131072
##$FT_mod= 6
##$GAMMA= 0
##$GB= 0
##$INTBC= 1
##$INTSCL= 1
##$ISEN= 128
##$LB= 0.3
##$LEV0= 0
##$LPBIN= 0
##$MAXI= 10000
##$MC2= 0
##$MEAN= 0
##$ME_mod= 0
##$MI= 0
##$NCOEF= 0
##$NC_proc= -3
##$NLEV= 6
##$NOISF1= 0
##$NOISF2= 0
##$NSP= 0
##$NTH_PI= 0
##$NZP= 0
##$OFFSET= 14.96821
##$PC= 1
##$PHC0= 32.70081
##$PHC1= 0
##$PH_mod= 1
##$PKNL= yes
##$PPARMOD= 0
##$PPDIAG= 0
##$PPIPTYP= 0
##$PPMPNUM= 2147483647
##$PPRESOL= 1
##$PSCAL= 4
##$PSIGN= 0
##$PYNMP= <proc.py>
##$REVERSE= no
##$SF= 400.130004963089
##$SI= 131072
##$SIGF1= 0
##$SIGF2= 0
##$SINO= 400
##$SIOLD= 131072
##$SPECTYP= <>
##$SREGLST= <1H.CDCl3>
##$SSB= 0
##$STSI= 131072
##$STSR= 0
##$SW_p= 8223.68421052632
##$SYMM= 0
##$S_DEV= 0
##$TDeff= 65536
##$TDoff= 0
##$TI= <>
##$TILT= no
##$TM1= 0
##$TM2= 0
##$TOPLEV= 0
##$USERP1= <user>
##$USERP2= <user>
##$USERP3= <user>
##$USERP4= <user>
##$USERP5= <user>
##$WDW= 1
##$XDIM= 131072
##$YMAX_p= 491032865
##$YMIN_p= -249525404
##$CURPLOT= <Network HP LaserJet P1505>
##$CURPRIN= <$Network HP LaserJet P1505>
##$DFORMAT= <normdp>
##$LAYOUT= <+/1D_H.xwp>
##$LFORMAT= <normlp>
##$PFORMAT= <normpl>
##$SURQMSG= 1
$$ End of Bruker specific parameters
$$ ---------------------------------
##NTUPLES= NMR SPECTRUM
##VAR_NAME=  FREQUENCY,     SPECTRUM/REAL,   SPECTRUM/IMAG
##SYMBOL=    X,             R,               I
##VAR_TYPE=  INDEPENDENT,   DEPENDENT,       DEPENDENT
##VAR_FORM=  AFFN,          ASDF,            ASDF
##VAR_DIM=   131072,        131072,          131072
##UNITS=     HZ,            ARBITRARY UNITS, ARBITRARY UNITS
##FACTOR=    0.0627417313425165, 1,          1
##FIRST=     8223.62146879498, 4897,         -104762
##LAST=      0,             7448,            -104422
##MIN=       0,             -249525404,      0
##MAX=       8223.62146879498, 491032865,    0
$$ Real data points
##PAGE= N=1
##DATA TABLE= (X++(R..R)), XYDATA
$$ [...]
$$ plain form
62948 2785754 2726833 2675175 2630411 2593413 2564521 2543669 2531594 2528874 2533783 2542846 2553902 2567419
62936 2567419 2584674 2605835 2630039 2656148 2682990 2709617 2735678 2761092 2785465 2808308 2829365
62925 2829365 2847891 2862121 2870608 2873784 2872834 2867148 2854199 2831935 2799846 2757628 2704742 2642228
62913 2642228 2573419 2501415 2426554 2347612 2265016 2181704 2100935 2024170 1951145 1881137 1813886
62902 1813886 1749834 1689819 1634313 1582877 1534698 1489694 1448559 1411378 1376811 1343460 1311805
62891 1311805 1283713 1259763 1238073 1216528 1195417 1176789 1161631 1148767 1136320 1123071 1108474
62880 1108474 1092731 1077234 1063690 1052246 1041366 1029934 1018429 1007583 997175 986928 977383
62869 977383 968775 959952 949591 937889 925992 914427 903176 892769 884050 877076 871154 865720 860390
$$ packed form
62948B785754n8921n1658m4764l6998k8892k0852j2075k720M909R063J1056J3517
62936B567419J7255K1161K4204K6109K6842K6627K6061K5414K4373K2843K1057
62925B829365J8526J4230Q487L176r50n686j2949k2264l2089m2218n2886o2514
62913B642228o8809p2004p4861p8942q2596q3312q0769p6765p3025p0008o7251
62902A813886o4052o0015n5506n1436m8179m5004m1135l7181l4567l3351l1655
62891A311805k8092k3950k1690k1545k1111j8628j5158j2864j2447j3249j4597
62880A108474j5743j5497j3544j1444j0880j1432j1505j0846j0408j0247r545
62869I77383q608q823j0361j1702j1897j1565j1251j0407q719o974n922n434n330
$$ plain form
62856 860390 854646 848480 843001 839391 837450 836035 834705 834077 834738 836627 839253 841738 842902 842193 840407
62841 840407 838857 838021 837557 837260 837334 838100 840024 843446 847696 851222 853388 855251 857542 858869 857378 853537
62825 853537 849707 847354 846130 845318 844585 843453 841537 839321 837420 835346 832354 829198 827336 826543 825077
62810 825077 822201 818720 814795 809359 802328 795529 790389 786157 781422 776197 771430 767419 763702 759873
62796 759873 755737 751158 746299 741534 736951 732527 728758 726100 723795 720497 716367 713316 712777 714271
62782 714271 716476 718468 719555 719284 718112 716940 715628 713479 711576 712716 717891 724426 728986 731190
62768 731190 732972 735656 739301 743973 749808 756107 761705 766100 769339 771383 772685 774789 779109 785393
62754 785393 792359 799380 806582 813914 821420 830035 840708 852828 864765 876003 887669 900921 915853
$$ packed form
62856H60390n744o166n479l610j941j415j330o28O61J889K626K485J164p09j786
62841H40407j550q36m64k97P4P66J924L422M250L526K166J863K291J327j491l841
62825H53537l830k353j224q12p33j132j916k216j901k074k992l156j862p93j466
62810H25077k876l481l925n436p031o799n140m232m735n225m767m011l717l829
62796G59873m136m579m859m765m583m424l769k658k305l298m130l051n39J494
62782G14271K205J992J087k71j172j172j312k149j903J140N175O535M560K204
62768G31190J782K684L645M672N835O299N598M395L239K044J302K104M320O284
62754G85393O966P021P202P332P506Q615J0673J2120J1937J1238J1666J3252J4932
$$ plain form
62741 915853 932153 949841 969039 989717 1012015 1036387 1063368 1093502 1127207 1164145 1202985
62730 1202985 1242633 1283648 1327825 1376509 1430038 1488652 1552922 1623023 1698401 1778583 1863851
62719 1863851 1954878 2052077 2155457 2264677 2379071 2498096 2621860 2750593 2883062 3015775
62709 3015775 3144208 3264774 3375331 3473993 3558220 3625511 3674626 3705355 3716965 3707638 3676076
62698 3676076 3623292 3552189 3465653 3365783 3254729 3135132 3009404 2879422 2747366 2616069
62688 2616069 2487867 2363514 2242923 2126804 2017043 1915430 1822220 1736026 1655252 1579704
62678 1579704 1510472 1447998 1390857 1337134 1286495 1239897 1197701 1159445 1125260 1095819 1070523
62667 1070523 1047351 1025197 1004980 987769 973263 961104 952139 946989 944446 942699 941400 941247 942411
$$ packed form
62741I15853J6300J7688J9198K0678K2298K4372K6981L0134L3705L6938L8840
62730A202985L9648M1015M4177M8684N3529N8614O4270P0101P5378Q0182Q5268
62719A863851R1027R7199J03380J09220J14394J19025J23764J28733J32469J32713
62709C015775J28433J20566J10557R8662Q4227O7291M9115L0729J1610r327l1562
62698C676076n2784p1103q6536r9870j11054j19597j25728j29982j32056j31297
62688B616069j28202j24353j20591j16119j09761j01613r3210q6194q0774p5548
62678A579704o9232o2474n7141n3723n0639m6598m2196l8256l4185k9441k5296
62667A070523k3172k2154k0217j7211j4506j2159q965n150k543j747j299j53J164
$$ plain form
62654 942411 944860 949533 957599 968906 982563 998693 1018143 1040731 1065355 1091885 1121565 1155396
62642 1155396 1193208 1234374 1278422 1325045 1374697 1428987 1489183 1554280 1621980 1691635 1764616
62631 1764616 1841377 1919753 1996876 2071303 2142282 2208267 2267463 2318935 2361717 2393375 2410980
62620 2410980 2413553 2402429 2379136 2343988 2297096 2239756 2174176 2102379 2026022 1946963 1867189
62609 1867189 1788104 1710343 1634354 1560562 1488916 1419094 1351640 1288205 1229916 1176105 1125635
62598 1125635 1079008 1037769 1001918 969485 938965 910655 884900 860566 836434 813005 791542
62587 791542 772149 754063 737139 721723 707569 694215 682011 671411 661663 651653 641734 633137
62575 633137 625707 617929 609395 601529 595355 590111 584879 580266 577452 576432 576111 575498 574106 571895 569659
$$ packed form
62654I42411K449M673Q066J1307J3657J6130J9450K2588K4624K6530K9680L3831
62642A155396L7812M1166M4048M6623M9652N4290O0196O5097O7700O9655P2981
62631A764616P6761P8376P7123P4427P0979O5985N9196N1472M2782L1658J7605
62620B410980K573j1124k3293l5148m6892n7340o5580p1797p6357p9059p9774
62609A867189p9085p7761p5989p3792p1646o9822o7454o3435n8289n3811n0470
62598A125635m6627m1239l5851l2433l0520k8310k5755k4334k4132k3429k1463
62587G91542j9393j8086j6924j5416j4154j3354j2204j0600r748j0010r919q597
62575F33137p430p778q534p866o174n244n232m613k814j020l21o13j392k211k236
$$ plain form
62560 569659 569020 571231 576058 582195 588511 594743 601482 609706 619762 630499 640130 648394 657191 668538
62546 668538 682605 698475 716141 736614 760242 786100 813417 842833 875726 912712 953424
62535 953424 997617 1045755 1098247 1154557 1213689 1275354 1339964 1407322 1476015 1544376 1611388
62524 1611388 1676087 1736703 1791084 1837560 1874744 1900955 1914802 1916179 1905971 1885024 1854164
62513 1854164 1814861 1768850 1717286 1661242 1602802 1544392 1486927 1429849 1373145 1318003 1265150
62502 1265150 1213956 1164005 1116519 1073251 1034663 999913 967970 938055 909593 882564 857537
62491 857537 834816 813928 794334 775956 758525 741197 723690 707198 693286 682217 673187 665734
62479 665734 659815 654598 648439 640555 632172 625495 621789 620720 621342 623306 626914 632214 638558 645443
$$ packed form
62560E69659o39K211M827O137O316O232O739Q224J0056J0737R631Q264Q797J1347
62546F68538J4067J5870J7666K0473K3628K5858K7317K9416L2893L6986M0712
62535I53424M4193M8138N2492N6310N9132O1665O4610O7358O8693O8361O7012
62524A611388O4699O0616N4381M6476L7184K6211J3847J377j0208k0947l0860
62513A854164l9303m6011n1564n6044n8440n8410n7465n7078n6704n5142n2853
62502A265150n1194m9951m7486m3268l8588l4750l1943k9915k8462k7029k5027
62491H57537k2721k0888j9594j8378j7431j7328j7507j6492j3912j1069r030p453
62479F65734n919n217o159p884q383o677l706j069O22J964L608N300O344O885
$$ plain form
62465 645443 653338 662969 673901 684790 695347 707276 722699 742094 764204 787460 811073 835275
62453 835275 861128 889728 921054 953936 987659 1023193 1062089 1104284 1147557 1189135 1227433
62442 1227433 1262314 1294122 1322563 1346299 1363574 1373253 1375210 1369945 1358308 1341458 1320320 1294832
62430 1294832 1264393 1229367 1191498 1152689 1114206 1077339 1043555 1013144 984790 957594 932680
62419 932680 911506 893379 876182 859120 843078 828583 815277 803599 794977 789529 785147 779926
62407 779926 774283 769615 766008 762681 759773 758079 757349 756511 755717 756748 760841 767210 774334 781809 790026
62392 790026 798650 806606 813629 820866 829512 839450 849739 860023 870630 881303 890712 897742 902675
62379 902675 906332 908271 906822 901188 892658 883061 872564 859858 844356 827275 810293 793821 777116
$$ packed form
62465F45443P895R631J0932J0889J0557J1929J5423J9395K2110K3256K3613K4202
62453H35275K5853K8600L1326L2882L3723L5534L8896M2195M3273M1578L8298
62442A227433L4881L1808K8441K3736J7275R679J957n265j1637j6850k1138k5488
62430A294832l0439l5026l7869l8809l8483l6867l3784l0411k8354k7196k4914
62419I32680k1174j8127j7197j7062j6042j4495j3306j1678q622n448m382n221
62407G79926n643m668l607l327k908j694p30q38p94J031M093O369P124P475Q217
62392G90026Q624P956P023P237Q646R938J0289J0284J0607J0673R409P030M933
62379I02675L657J939j449n634q530r597j0497j2706j5502j7081j6982j6472j6705
$$ plain form
62366 777116 759573 741436 723608 707365 693978 683829 675785 668151 660572 654543 651667 651789 653284
62353 653284 654888 656679 659203 662161 664407 665312 665960 668591 674551 682995 692071 701211 711620 724451
62339 724451 739441 755666 772584 789521 804971 817691 828147 837831 847341 856236 864492 872664
62327 872664 880465 886552 890165 891866 892301 891599 890621 891352 894823 899670 904058 908300 914305 923058 934205
62312 934205 947784 964693 985252 1008789 1035170 1065590 1101157 1141543 1185742 1233597 1285963
62301 1285963 1343750 1407352 1476635 1550832 1628447 1707699 1787207 1866160 1943687 2017895 2085441
62290 2085441 2142438 2186417 2217526 2237609 2248217 2249760 2242124 2225201 2198803 2162939 2118549 2067423
62278 2067423 2011145 1950725 1887395 1822890 1758434 1694163 1630298 1568303 1510088 1456421 1406868
$$ packed form
62366G77116j7543j8137j7828j6243j3387j0149q044p634p579o029k876J22J495
62353F53284J604J791K524K958K246R05O48K631N960Q444R076R140J0409J2831
62339G24451J4990J6225J6918J6937J5450J2720J0456R684R510Q895Q256Q172
62327H72664P801O087L613J701M35p02r78P31L471M847M388M242O005Q753J1147
62312I34205J3579J6909K0559K3537K6381L0420L5567M0386M4199M7855N2366
62301A285963N7787O3602O9283P4197P7615P9252P9508P8953P7527P4208O7546
62290B085441N6997M3979L1109K0083J0608J543p636j6923k6398l5864m4390n1126
62278B067423n6278o0420o3330o4505o4456o4271o3865o1995n8215n3667m9553
$$ plain form
62267 1406868 1360977 1318555 1278943 1241045 1204421 1169669 1137484 1107857 1080465 1055331 1032752
62256 1032752 1012884 995619 980609 967408 955981 947009 941081 937534 934916 932901 932857 935870 940933
62243 940933 945888 949537 951850 952600 951190 947992 944740 943084 943376 944965 946896 948061 947643 946040 944784
62228 944784 945094 947018 950324 955359 962322 970406 978533 986516 994692 1002857 1010657 1018836 1029030 1042187
62214 1042187 1057873 1075190 1093724 1113657 1135689 1160863 1189683 1221406 1255014 1290903 1330725
62203 1330725 1375473 1424766 1478245 1536442 1599728 1667503 1739191 1815002 1894663 1976111 2056407
62192 2056407 2133291 2204824 2268238 2320682 2360967 2389232 2404952 2406687 2394157 2369303 2334646
62181 2334646 2291518 2240450 2182427 2118928 2051348 1981043 1909563 1838321 1768470 1701553 1639610
$$ packed form
62267A406868m5891m2422l9612l7898l6624l4752l2185k9627k7392k5134k2579
62256A032752j9868j7265j5010j3201j1427q972n928l547k618k015m4L013N063
62243I40933M955L649K313P50j410l198l252j656K92J589J931J165m18j603j256
62228I44784L10J924L306N035O963Q084Q127P983Q176Q165P800Q179J0194J3157
62214A042187J5686J7317J8534J9933K2032K5174K8820L1723L3608L5889L9822
62203A330725M4748M9293N3479N8197O3286O7775P1688P5811P9661Q1448Q0296
62192B056407P6884P1533O3414N2444M0285K8265J5720J735j2530k4854l4657
62181B334646m3128n1068n8023o3499o7580p0305p1480p1242o9851o6917o1943
$$ plain form
62170 1639610 1583874 1533931 1488997 1449450 1416097 1388270 1364017 1342249 1323503 1308368 1296406
62159 1296406 1287143 1280888 1277736 1276748 1277064 1278973 1282782 1287402 1291578 1296030 1302706 1311838 1321324 1329435
62145 1329435 1336728 1344622 1353432 1362751 1372711 1383734 1395730 1408595 1423011 1439707 1458356 1478183
62133 1478183 1499337 1522677 1548438 1576145 1605647 1637236 1670832 1706099 1743352 1783124 1824547
62122 1824547 1865136 1902605 1936189 1965993 1992003 2014344 2033869 2051862 2069496 2087851 2108022
62111 2108022 2131019 2158019 2190689 2230347 2276372 2326174 2377258 2428815 2480876 2532658 2582319
62100 2582319 2627737 2666914 2698214 2721070 2736314 2745231 2748437 2745970 2737883 2724202 2704823 2680303
62088 2680303 2652402 2623000 2592675 2561289 2529884 2500923 2476177 2455066 2435699 2417240 2400722
$$ packed form
62170A639610n5736m9943m4934l9547l3353k7827k4253k1768j8746j5135j1962
62159A296406r263o255l152r88L16J909L809M620M176M452O676R132R486Q111
62145A329435P293P894Q810R319R960J1023J1996J2865J4416J6696J8649J9827
62133A478183K1154K3340K5761K7707K9502L1589L3596L5267L7253L9772M1423
62122A824547M0589L7469L3584K9804K6010K2341J9525J7993J7634J8355K0171
62111B108022K2997K7000L2670L9658M6025M9802N1084N1557N2061N1782M9661
62100B582319M5418L9177L1300K2856J5244Q917L206k467q087j3681j9379k4520
62088B680303k7901k9402l0325l1386l1405k8961k4746k1111j9367j8459j6518
$$ plain form
62077 2400722 2387601 2378061 2371124 2366212 2363968 2365140 2369119 2374406 2380513 2388477 2399157 2411871 2425416
62064 2425416 2439765 2455900 2474333 2494713 2516741 2540583 2566326 2593808 2623227 2655303 2690450
62053 2690450 2728094 2766993 2806079 2845087 2884789 2926564 2971243 3018198 3066012 3114176 3163808
62042 3163808 3216522 3272976 3332500 3393450 3453472 3510156 3562610 3612606 3663448 3717184 3773225
62031 3773225 3829985 3887229 3945932 4005985 4065236 4121478 4174842 4227654 4282400 4340472 4402406
62020 4402406 4468215 4537414 4609448 4684114 4760917 4838259 4914406 4989344 5064415 5139706 5213147
62009 5213147 5283094 5350714 5418539 5487345 5555783 5622789 5688800 5754196 5817515 5875911 5927119
61998 5927119 5970723 6007690 6038845 6063850 6081838 6092869 6098177 6098785 6094559 6084979 6070089 6050099
$$ packed form
62077B400722j3121r540o937m912k244J172L979N287O107P964J0680J2714J3545
62064B425416J4349J6135J8433K0380K2028K3842K5743K7482K9419L2076L5147
62053B690450L7644L8899L9086L9008L9702M1775M4679M6955M7814M8164M9632
62042C163808N2714N6454N9524O0950O0022N6684N2454M9996N0842N3736N6041
62031C773225N6760N7244N8703O0053N9251N6242N3364N2812N4746N8072O1934
62020D402406O5809O9199P2034P4666P6803P7342P6147P4938P5071P5291P3441
62009E213147O9947O7620O7825O8806O8438O7006O6011O5396O3319N8396N1208
61998E927119M3604L6967L1155K5005J7988J1031N308O08m226r580j4890j9990
$$ plain form
61986 6050099 6024918 5995072 5962537 5929521 5896724 5863793 5831130 5799928 5770534 5742165 5714527
61975 5714527 5688424 5664307 5641388 5618913 5597406 5577826 5560238 5544171 5529730 5517404 5506976
61964 5506976 5497427 5487880 5478066 5467976 5457622 5447243 5437229 5427637 5418066 5408215 5398450 5389731 5382996
61951 5382996 5378566 5376038 5374693 5373988 5373698 5373809 5374494 5376061 5378628 5381833 5385137 5388402 5391871 5395550 5398896
61936 5398896 5401138 5401373 5398078 5388993 5372124 5346864 5313806 5273559 5226323 5172721 5114499 5053862
61924 5053862 4992284 4930440 4869121 4809471 4752075 4696444 4641948 4588824 4537759 4488874 4441867
61913 4441867 4396840 4354069 4313024 4272721 4233206 4195635 4160474 4126618 4092999 4060115 4029161
61902 4029161 4000335 3972883 3946245 3920300 3895083 3871230 3850203 3832954 3818669 3805821 3794093
$$ packed form
61986F050099k5181k9846l2535l3016l2797l2931l2663l1202k9394k8369k7638
61975E714527k6103k4117k2919k2475k1507j9580j7588j6067j4441j2326j0428
61964E506976r549r547r814j0090j0354j0379j0014r592r571r851r765q719o735
61951E382996m430k528j345p05k90J11O85J567K567L205L304L265L469L679L346
61936E398896K242K35l295r085j6869k5260l3058m0247m7236n3602n8222o0637
61924E053862o1578o1844o1319n9650n7396n5631n4496n3124n1065m8885m7007
61913D441867m5027m2771m1045m0303l9515l7571l5161l3856l3619l2884l0954
61902D029161k8826k7452k6638k5945k5217k3853k1027j7249j4285j2848j1728
$$ plain form
61891 3794093 3784108 3775767 3768479 3762958 3760932 3762551 3765819 3769544 3775401 3785691 3800137 3816482 3833814
61878 3833814 3853598 3877423 3905253 3936480 3971503 4011223 4055461 4102960 4152983 4206119 4263189
61867 4263189 4323979 4387733 4454709 4526539 4604940 4690692 4784202 4886535 4999353 5124150 5262033
61856 5262033 5414093 5581610 5766114 5969711 6195067 6444551 6719609 7021676 7353640
61847 7353640 7719739 8123808 8568046 9053436 9580797 10151129 10765270 11423288 12123815
61838 12123815 12863536 13636702 14433980 15240568 16035018 16789929 17473581 18051512 18489427
61829 18489427 18758896 18843455 18740731 18460059 18019365 17443646 16763070 16008841 15208720
61820 15208720 14385319 13557203 12740291 11947923 11189987 10472476 9798461 9169974 8588972
$$ packed form
61891C794093r985q341p288n521k026J619L268L725N857J0290J4446J6345J7332
61878C833814J9784K3825K7830L1227L5023L9720M4238M7499N0023N3136N7070
61867D263189O0790O3754O6976P1830P8401Q5752R3510J02333J12818J24797J37883
61856E262033J52060J67517J84504K03597K25356K49484K75058L02067L31964
61847G353640L66099M04069M44238M85390N27361N70332O14141O58018P00527
61838A2123815P39721P73166P97278Q06588P94450P54911O83652N77931M37915
61829A8489427K69469Q4559j02724k80672m40694n75719o80576p54229q00121
61820A5208720q23401q28116q16912p92368p57936p17511o74015o28487n81002
$$ plain form
61811 8588972 8056302 7570231 7126896 6722386 6353915 6019188 5715612 5440497 5191457
61802 5191457 4966387 4763612 4582128 4420944 4277942 4150125 4035300 3932852 3842588 3763623
61792 3763623 3694747 3635009 3583311 3538101 3498164 3463208 3433050 3406657 3382566 3359874 3338325
61781 3338325 3317736 3297698 3277473 3256052 3233103 3210248 3190461 3175453 3164391 3155964 3150770 3150386
61769 3150386 3154753 3162042 3170910 3181389 3193334 3205534 3217048 3228357 3240263 3252254 3262844 3271269
61757 3271269 3278270 3285395 3294191 3306014 3321907 3342184 3366325 3393789 3425074 3461719 3505056 3555240
61745 3555240 3611989 3676136 3749686 3834026 3928639 4032105 4143999 4265334 4397515 4541494
61735 4541494 4697810 4866778 5048697 5244421 5455686 5684231 5930578 6194409 6476439
$$ packed form
61811H588972n32670m86071m43335m04510l68471l34727l03576k75115k49040
61802E191457k25070k02775j81484j61184j43002j27817j14825j02448r0264p8965
61792C763623o8876n9738n1698m5210l9937l4956l0158k6393k4091k2692k1549
61781C338325k0589k0038k0225k1421k2949k2855j9787j5008j1062q427n194l84
61769C150386M367P289Q868J0479J1945J2200J1514J1309J1906J1991J0590Q425
61757C271269P001P125Q796J1823J5893K0277K4141K7464L1285L6645M3337N0184
61745C555240N6749O4147P3550Q4340R4613J03466J11894J21335J32181J43979
61735D541494J56316J68968J81919J95724K11265K28545K46347K63831K82030
$$ plain form
61726 6476439 6779315 7106262 7459554 7841024 8253768 8702436 9191658 9724904 10305391
61717 10305391 10937798 11628602 12384700 13211882 14114322 15094834 16155120 17295705 18515520
61708 18515520 19810998 21174810 22594608 24051616 25518544 26957293 28318310 29543112
61700 29543112 30569618 31339124 31804210 31936338 31730354 31203797 30392202 29343449 28112284
61691 28112284 26754253 25319648 23850118 22379031 20933397 19534724 18198854 16936214
61683 16936214 15752804 14651263 13631713 12692636 11831492 11044875 10328444 9677100 9085345
61674 9085345 8547645 8058831 7614416 7210502 6843367 6509269 6204651 5926468 5672398
61665 5672398 5440769 5229870 5036946 4858231 4690583 4532887 4385175 4246493 4114462
$$ packed form
61726F476439L02876L26947L53292L81470M12744M48668M89222N33246N80487
61717A0305391O32407O90804P56098Q27182R02440R80512J060286J140585J219815
61708A8515520J295478J363812J419798J457008J466928J438749J361017J224802
61700B9543112J026506P69506M65086J32128k05984n26557q11595j048753j231165
61691B8112284j358031j434605j469530j471087j445634j398673j335870j262640
61683A6936214j183410j101541j019550r39077q61144p86617p16431o51344n91755
61674I085345n37700m88814m44415m03914l67135l34098l04618k78183k54070
61665E672398k31629k10899j92924j78715j67648j57696j47712j38682j32031
$$ plain form
61656 4114462 3987092 3864179 3746553 3634564 3527804 3425833 3328665 3236656 3150132 3069055
61646 3069055 2993098 2922236 2856916 2797049 2741127 2687233 2634889 2584977 2537771 2492224 2447505
61635 2447505 2404023 2362310 2321954 2282537 2244686 2209169 2175583 2142932 2111010 2080222 2050409
61624 2050409 2020895 1991480 1962488 1934019 1906064 1879247 1854497 1831853 1810341 1789192 1768584
61613 1768584 1749015 1730485 1712424 1694092 1675058 1655676 1637063 1620210 1605093 1590941 1577171
61602 1577171 1563701 1550703 1538687 1528593 1520971 1514936 1508673 1501316 1493869 1488006 1484326 1482173 1480879
61589 1480879 1480715 1482529 1486639 1492302 1498353 1504148 1509671 1514895 1519501 1523261 1526211 1528285 1529300 1529610
61575 1529610 1530269 1532095 1534875 1537833 1540491 1542737 1544582 1546397 1549040 1553049 1557865 1562428 1566365 1570000
$$ packed form
61656D114462j27370j22913j17626j11989j06760j01971r7168r2009q6524q1077
61646C069055p5957p0862o5320n9867n5922n3894n2344m9912m7206m5547m4719
61635B447505m3482m1713m0356l9417l7851l5517l3586l2651l1922l0788k9813
61624B050409k9514k9415k8992k8469k7955k6817k4750k2644k1512k1149k0608
61613A768584j9569j8530j8061j8332j9034j9382j8613j6853j5117j4152j3770
61602A577171j3470j2998j2016j0094p622o035o263p357p447n863l680k153j294
61589A480879j64J814M110N663O051N795N523N224M606L760K950K074J015L10
61575A529610O59J826K780K958K658K246J845J815K643M009M816M563L937L635
$$ plain form
61561 1570000 1573280 1575275 1574837 1571314 1564639 1555135 1543398 1530151 1516096 1501840 1487709 1473512 1458784
61548 1458784 1443425 1427784 1412008 1395849 1379517 1364189 1351019 1339932 1329903 1320312 1311604 1304781
61536 1304781 1300560 1298809 1298406 1297937 1296826 1295704 1295581 1297146 1300938 1307343 1315917 1325533 1335944 1348480
61522 1348480 1364265 1382289 1400349 1417583 1435143 1454632 1476935 1502398 1530926 1561678 1593581
61511 1593581 1626475 1661151 1698242 1737788 1779863 1824697 1871922 1920413 1969214 2017973 2066274
61500 2066274 2113199 2157999 2200846 2242678 2284472 2326649 2368653 2408985 2446083 2479383 2509364
61489 2509364 2536664 2561545 2584095 2604409 2622378 2637558 2649225 2656495 2658849 2656937 2652394 2646286
61477 2646286 2638200 2627623 2615663 2604221 2593694 2582782 2570750 2558803 2549021 2543091 2542435 2548369
$$ packed form
61561A570000L280J995m38l523o675r504j1737j3247j4055j4256j4131j4197j4728
61548A458784j5359j5641j5776j6159j6332j5328j3170j1087j0029r591q708o823
61536A304781m221j751m03m69j111j122j23J565L792O405Q574R616J0411J2536
61522A348480J5785J8024J8060J7234J7560J9489K2303K5463K8528L0752L1903
61511A593581L2894L4676L7091L9546M2075M4834M7225M8491M8801M8759M8301
61500B066274M6925M4800M2847M1832M1794M2177M2004M0332L7098L3300K9981
61489B509364K7300K4881K2550K0314J7969J5180J1667P270K354j912m543o108
61477B646286q086j0577j1960j1442j0527j0912j2032j1947r782n930o56N934
$$ plain form
61465 2548369 2561265 2580253 2604519 2634426 2670708 2713208 2761321 2815567 2877941 2950474 3033699
61454 3033699 3126619 3228151 3338669 3460238 3595413 3745966 3912837 4096640 4297473 4514515
61444 4514515 4746863 4995043 5260828 5544979 5845507 6158328 6478880 6802222 7121544
61435 7121544 7427201 7707729 7952423 8153536 8306344 8407440 8453806 8444402 8382433 8275046
61425 8275046 8130483 7955954 7758069 7544042 7321485 7097165 6876207 6662143 6457442
61416 6457442 6264371 6085605 5923668 5779717 5653381 5544066 5451849 5376869 5318548 5276138
61406 5276138 5249539 5238774 5242681 5258924 5285629 5322790 5371729 5433016 5504804 5583228 5664615
61395 5664615 5747494 5832489 5920454 6010995 6102614 6193663 6282907 6369552 6453282 6534278 6612978
$$ packed form
61465B548369J2896J8988K4266K9907L6282M2500M8113N4246O2374P2533Q3225
61454C033699R2920J01532J10518J21569J35175J50553J66871J83803K00833K17042
61444D514515K32348K48180K65785K84151L00528L12821L20552L23342L19322
61435G121544L05657K80528K44694K01113J52808J01096M6366r404o1969j07387
61425H275046j44563j74529j97885k14027k22557k24320k20958k14064k04701
61416F457442j93071j78766j61937j43951j26336j09315r2217p4980n8321m2410
61406E276138k6599j0765L907J6243K6705L7161M8939O1287P1788P8424Q1387
61395E664615Q2879Q4995Q7965R0541R1619R1049Q9244Q6645Q3730Q0996P8700
$$ plain form
61384 6612978 6689710 6764587 6837663 6908920 6977897 7043276 7103242 7156740 7204358 7247408 7285913
61373 7285913 7318132 7342504 7359497 7370830 7377252 7377938 7371988 7359588 7341520 7318340 7290552 7259132
61361 7259132 7225271 7189665 7152360 7113407 7073621 7034632 6998024 6964399 6933450 6904945 6879226
61350 6879226 6856560 6836513 6818279 6801190 6784456 6766820 6747097 6724940 6700761 6675249 6649286
61339 6649286 6623909 6599948 6578202 6560454 6549665 6548483 6558174 6579708 6615100 6666614 6735370 6822131
61327 6822131 6929033 7058911 7212881 7390021 7589676 7812735 8060214 8331613 8625015
61318 8625015 8937735 9266320 9606519 9953358 10300295 10638105 10955627 11242095 11488255
61309 11488255 11685738 11827336 11909046 11931087 11896322 11808343 11671301 11490192 11270140 11015863
$$ packed form
61384F612978P6732P4877P3076P1257O8977O5379N9966N3498M7618M3050L8505
61373G285913L2219K4372J6993J1333O422O86n950j2400j8068k3180k7788l1420
61361G259132l3861l5606l7305l8953l9786l8989l6608l3625l0949k8505k5719
61350F879226k2666k0047j8234j7089j6734j7636j9723k2157k4179k5512k5963
61339F649286k5377k3961k1746j7748j0789j182R691K1534L5392N1514O8756Q6761
61327F822131J06902J29878J53970J77140J99655K23059K47479K71399K93402
61318H625015L12720L28585L40199L46839L46937L37810L17522K86468K46160
61309A1488255J97483J41598Q1710K2041l4765q7979j37042j81109k20052k54277
$$ plain form
61299 11015863 10732482 10426220 10103600 9770403 9431847 9092905 8757578 8428346 8107152
61290 8107152 7796659 7499913 7219099 6955280 6709068 6480982 6271377 6080667 5909498
61281 5909498 5758121 5625580 5510061 5410254 5326094 5257979 5205456 5167072 5141621 5129047 5129546
61270 5129546 5141991 5164220 5195051 5234906 5283784 5339674 5400017 5463809 5530931 5599999 5668399
61259 5668399 5734151 5796278 5853667 5905254 5951411 5993518 6031800 6065036 6092659 6115557 6134269
61248 6134269 6147847 6155229 6156459 6151740 6140312 6121048 6093435 6057582 6014105 5964373 5909898 5851202
61236 5851202 5788234 5721893 5653898 5585051 5515077 5444340 5374005 5304251 5234383 5165387 5100266
61225 5100266 5040696 4985268 4932352 4882816 4838309 4798590 4762455 4729898 4701254 4675240 4649974
$$ packed form
61299A1015863k83381l06262l22620l33197l38556l38942l35327l29232l21194
61290H107152l10493k96746k80814k63819k46212k28086k09605j90710j71169
61281E909498j51377j32541j15519r9807q4160o8115n2523l8384k5451j2574M99
61270E129546J2445K2229L0831L9855M8878N5890O0343O3792O7122O9068O8400
61259E668399O5752O2127N7389N1587M6157M2107L8282L3236K7623K2898J8712
61248F134269J3578P382J230m719j1428j9264k7613l5853m3477m9732n4475n8696
61236E851202o2968o6341o7995o8847o9974p0737p0335o9754o9868o8996o5121
61225E100266n9570n5428n2916m9536m4507l9719l6135l2557k8644k6014k5266
$$ plain form
61214 4649974 4625233 4601751 4578803 4554453 4528028 4500761 4474192 4449420 4427760 4410657 4398863
61203 4398863 4392682 4392798 4399811 4413310 4432518 4457678 4489893 4530039 4578758 4636971 4705301 4783535
61191 4783535 4871695 4970940 5082215 5204557 5335917 5474710 5618888 5764017 5903997 6033276
61181 6033276 6146661 6237324 6297259 6320405 6304296 6249036 6156502 6030883 5878229 5704595
61171 5704595 5515322 5315905 5111908 4907534 4705551 4509082 4322118 4147519 3985468
61162 3985468 3834568 3693791 3563039 3442793 3333842 3236694 3150633 3073742 3004180 2941103
61152 2941103 2884334 2833860 2789881 2752766 2722601 2699141 2682198 2671630 2666908 2667139 2671517 2679432
61140 2679432 2690363 2704109 2720856 2740334 2761075 2781014 2798567 2812675 2822364 2827184 2827706 2824721
$$ packed form
61214D649974k4741k3482k2948k4350k6425k7267k6569k4772k1660j7103j1794
61203D398863o181J16P013J3499J9208K5160L2215M0146M8719N8213O8330P8234
61191D783535Q8160R9245J11275J22342J31360J38793J44178J45129J39980J29279
61181F033276J13385R0663N9935K3146j6109n5260r2534j25619j52654j73634
61171E704595j89273j99417k03997k04374k01983j96469j86964j74599j62051
61162C985468j50900j40777j30752j20246j08951r7148q6061p6891o9562o3077
61152B941103n6769n0474m3979l7115l0165k3460j6943j0568m722K31M378P915
61140B679432J0931J3746J6747J9478K0741J9939J7553J4108R689M820N22k985
$$ plain form
61128 2824721 2818171 2807726 2794030 2778309 2760939 2741475 2719909 2696758 2671914 2644632 2614944
61117 2614944 2584195 2553803 2524121 2494618 2464434 2432621 2398583 2362554 2325227 2286771 2246619
61106 2246619 2204215 2159756 2114381 2069833 2027417 1986924 1947151 1907829 1870255 1835479 1802973
61095 1802973 1771983 1742989 1716474 1691113 1664759 1636651 1607212 1576331 1543515 1509315 1474919
61084 1474919 1440651 1406468 1373576 1343689 1316825 1291714 1268362 1248251 1231906 1218196 1206354
61073 1206354 1196739 1189154 1182478 1176781 1173953 1175104 1178797 1182938 1187218 1192738 1200276 1209851 1221048 1232959
61059 1232959 1244714 1256707 1270367 1286092 1302400 1317791 1332500 1347632 1363483 1379440 1394818
61048 1394818 1409134 1422136 1433935 1444362 1452052 1455370 1454727 1452668 1450793 1447637 1440601 1429202 1415480
$$ packed form
61128B824721o550j0445j3696j5721j7370j9464k1566k3151k4844k7282k9688
61117B614944l0749l0392k9682k9503l0184l1813l4038l6029l7327l8456m0152
61106B246619m2404m4459m5375m4548m2416m0493l9773l9322l7574l4776l2506
61095A802973l0990k8994k6515k5361k6354k8108k9439l0881l2816l4200l4396
61084A474919l4268l4183l2892k9887k6864k5111k3352k0111j6345j3710j1842
61073A206354r615p585o676n697k828J151L693M141M280N520P538R575J1197J1911
61059A232959J1755J1993J3660J5725J6308J5391J4709J5132J5851J5957J5378
61048A394818J4316J3002J1799J0427P690L318o43k059j875l156p036j1399j3722
$$ plain form
61035 1415480 1401841 1389450 1378329 1368051 1358243 1348799 1339692 1330816 1322396 1315276 1310014 1305829 1301317
61022 1301317 1296134 1290945 1285917 1280528 1274937 1270166 1266666 1263954 1261850 1260556 1259222 1256224 1251624 1247791
61008 1247791 1246482 1246657 1246280 1245107 1244433 1244987 1246399 1248175 1250112 1251988 1253640 1255110 1256418 1257758 1260049
60993 1260049 1264356 1270380 1276571 1282222 1288306 1295660 1303710 1311994 1321759 1334700 1350858 1369082 1388994
60980 1388994 1411189 1435668 1461295 1487100 1513529 1542135 1574192 1609669 1647576 1687363 1729571
60969 1729571 1774859 1823095 1874235 1929432 1989936 2055291 2124132 2196628 2274609 2359312 2450562
60958 2450562 2548142 2652281 2762785 2879707 3005129 3142144 3291450 3450788 3618220 3793907
60948 3793907 3978171 4170381 4371105 4583460 4811251 5057653 5326543 5622794 5949865
$$ packed form
61035A415480j3639j2391j1121j0278r808r444r107q876q420p120n262m185m512
61022A301317n183n189n028n389n591m771l500k712k104j294j334k998m600l833
61008A247791j309J75l77j173o74N54J412J776J937J876J652J470J308J340K291
60993A260049M307O024O191N651O084P354Q050Q284R765J2941J6158J8224J9912
60980A388994K2195K4479K5627K5805K6429K8606L2057L5477L7907L9787M2208
60969A729571M5288M8236N1140N5197O0504O5355O8841P2496P7981Q4703R1250
60958B450562R7580J04139J10504J16922J25422J37015J49306J59338J67432J75687
60948C793907J84264J92210K00724K12355K27791K46402K68890K96251L27071
$$ plain form
60939 5949865 6309017 6702013 7132878 7607150 8133264 8726139 9405327 10186928 11080196
60930 11080196 12093644 13239759 14531495 15982026 17615793 19475209 21608213 24053524
60922 24053524 26844638 30006613 33496461 37107609 40450838 43094797 44790850 45597056
60914 45597056 45801951 45742340 45682990 45803085 46189868 46767751 47241880 47184741 46254199 44374038
60904 44374038 41735043 38649154 35400876 32186944 29124589 26274128 23657289 21275848
60896 21275848 19125760 17199574 15484199 13963763 12624030 11451250 10429042 9539680
60888 9539680 8767048 8095912 7510283 6995422 6540349 6136291 5774236 5446516 5149495
60879 5149495 4882061 4641907 4425109 4228299 4048957 3883923 3729473 3582741 3441798
$$ packed form
60939E949865L59152L92996M30865M74272N26114N92875O79188P81601Q93268
60930A1080196J013448J146115J291736J450531J633767J859416K133004K445311
60922B4053524K791114L161975L489848L611148L343229K643959J696053Q06206
60914D5597056K04895n9611n9350J20095L86783N77883M74129n7139r30542j880161
60904D4374038k638995l085889l248278l213932l062355k850461k616839k381441
60896B1275848k150088j926186j715375j520436j339733j172780j022208q89362
60888I539680p72632o71136n85629n14861m55073m04058l62055l27720k97021
60879E149495k67434k40154k16798j96810j79342j65034j54450j46732j40943
$$ plain form
60870 3441798 3305054 3172051 3044206 2923036 2807966 2697273 2590728 2489763 2395229 2306521
60860 2306521 2222845 2143948 2069410 1998428 1930711 1866820 1807328 1752145 1700602 1651694 1604397
60849 1604397 1558358 1514278 1473182 1435448 1400786 1368784 1338981 1310800 1284059 1259293 1236983
60838 1236983 1216672 1197315 1178360 1160045 1142913 1127529 1114471 1104029 1095763 1088692 1082018 1075671
60826 1075671 1070308 1066744 1065159 1064848 1065064 1065941 1068136 1071695 1075927 1080306 1084673 1088444 1090583 1090694 1089286
60811 1089286 1086549 1081810 1074814 1066698 1058759 1050788 1041633 1031265 1021439 1014131 1009694 1006685 1003358 999388
60797 999388 996170 995316 996952 999941 1003739 1009250 1017580 1028584 1041226 1054948 1069964 1086286 1103079
60784 1103079 1119390 1135343 1152213 1171021 1191137 1210722 1228555 1244872 1260340 1275045 1288989
$$ packed form
60870C441798j36744j33003j27845j21170j15070j10693j06545j00965r4534q8708
60860B306521q3676p8897p4538p0982o7717o3891n9492n5183n1543m8908m7297
60849A604397m6039m4080m1096l7734l4662l2002k9803k8181k6741k4766k2310
60838A236983k0311j9357j8955j8315j7132j5384j3058j0442q266p071o674o347
60826A075671n363l564j585l11K16Q77K195L559M232M379M367L771K139J11j408
60811A089286k737m739o996q116p939p971r155j0368r826p308m437l009l327l970
60797I99388l218q54J636K989L798N511Q330J1004J2642J3722J5016J6322J6793
60784A103079J6311J5953J6870J8808K0116J9585J7833J6317J5468J4705J3944
$$ plain form
60773 1288989 1302531 1315392 1326052 1333444 1338645 1343428 1347609 1349527 1348995 1347846 1347274 1346609 1345429 1345044
60759 1345044 1346610 1349120 1350657 1350787 1350446 1350100 1349195 1346963 1342743 1335831 1326034 1314300 1302137 1290382
60745 1290382 1278871 1267005 1254321 1240853 1227313 1214511 1202441 1190483 1178643 1167744 1158075
60734 1158075 1148864 1139761 1131989 1127080 1124976 1124261 1123979 1124534 1127009 1132127 1139662 1148525 1157755 1167545 1178711
60719 1178711 1191068 1203228 1214494 1226040 1239533 1255474 1273563 1293689 1315446 1337485 1358778
60708 1358778 1380270 1403925 1429963 1455942 1478838 1497494 1513031 1527436 1541800 1555518 1567149
60697 1567149 1576098 1583118 1589043 1593790 1597144 1599806 1602612 1605018 1605419 1603174 1599692 1597255 1597008 1598067
60683 1598067 1598301 1596061 1591352 1585261 1578270 1569515 1557889 1543480 1527809 1513009 1500681 1490807 1481648
$$ packed form
60773A288989J3542J2861J0660P392N201M783M181J918n32j149n72o65j180l85
60759A345044J566K510J537J30l41l46r05k232m220o912r797j1734j2163j1755
60745A290382j1511j1866j2684j3468j3540j2802j2070j1958j1840j0899r669
60734A158075r211r103p772m909k104p15k82N55K475N118P535Q863R230R790J1166
60719A178711J2357J2160J1266J1546J3493J5941J8089K0126K1757K2039K1293
60708A358778K1492K3655K6038K5979K2896J8656J5537J4405J4364J3718J1631
60697A567149Q949P020N925M747L354K662K806K406M01k245l482k437k47J059
60683A598067K34k240m709o091o991q755j1626j4409j5671j4800j2328r874r159
$$ plain form
60670 1481648 1471491 1460659 1450872 1442512 1433862 1423693 1413227 1404415 1397416 1391154 1385562 1381761 1380398
60657 1380398 1381102 1383342 1386712 1390637 1394804 1399523 1404691 1409030 1411650 1413687 1416747 1420128 1421576 1420791
60643 1420791 1419954 1420193 1419605 1416144 1410838 1406449 1403810 1401165 1396854 1391124 1385100 1379105 1372549 1364822 1355715
60628 1355715 1345072 1332565 1318150 1302684 1287648 1273855 1260666 1246918 1232440 1218032 1204089
60617 1204089 1190103 1175730 1161493 1147939 1134736 1121240 1107610 1094734 1083323 1073583 1065646 1059747
60605 1059747 1055995 1054419 1055201 1058446 1063658 1069874 1076498 1083682 1091638 1099930 1107808 1115162 1122779 1131599
60591 1131599 1141941 1153431 1165391 1177152 1188365 1199199 1209978 1220326 1228994 1235009 1238875 1242184
60579 1242184 1246061 1250460 1254917 1259365 1264065 1269319 1275598 1283529 1293376 1304767 1317165 1330296 1343894
$$ packed form
60670A481648j0157j0832r787q360q650j0169j0466q812o999o262n592l801j363
60657A380398P04K240L370L925M167M719N168M339K620K037L060L381J448p85
60643A420791q37K39n88l461n306m389k639k645m311n730o024n995o556p727r107
60628A355715j0643j2507j4415j5466j5036j3793j3189j3748j4478j4408j3943
60617A204089j3986j4373j4237j3554j3203j3496j3630j2876j1411r740p937n899
60605A059747l752j576P82L245N212O216O624P184P956Q292P878P354P617Q820
60591A131599J0342J1490J1960J1761J1213J0834J0779J0348Q668O015L866L309
60579A242184L877M399M457M448M700N254O279P931R847J1391J2398J3131J3598
$$ plain form
60566 1343894 1357401 1370408 1383355 1397518 1414175 1433582 1454518 1474943 1493622 1511143 1528964
60555 1528964 1547529 1565948 1583570 1600875 1618286 1634850 1648866 1659395 1666382 1669687 1668819 1663647
60543 1663647 1654585 1641851 1625067 1603961 1579313 1552917 1526481 1500563 1474744 1449004 1424721
60532 1424721 1403922 1387539 1374787 1364146 1354445 1345132 1336331 1328999 1324330 1322546 1322686 1323850 1326079
60519 1326079 1329693 1334372 1339384 1344162 1348119 1350476 1350909 1350172 1349604 1350287 1352808 1357216 1362759 1368318 1373646
60504 1373646 1379723 1387441 1396620 1406804 1418151 1430565 1442708 1453136 1462211 1471746 1482768 1494488
60492 1494488 1505506 1515238 1524078 1532927 1542751 1554119 1566987 1581218 1597212 1615795 1637689 1663412
60480 1663412 1693329 1727388 1765184 1806693 1852430 1902124 1953454 2002620 2045946 2080588 2104368
$$ packed form
60566A343894J3507J3007J2947J4163J6657J9407K0936K0425J8679J7521J7821
60555A528964J8565J8419J7622J7305J7411J6564J4016J0529O987L305q68n172
60543A663647r062j2734j6784k1106k4648k6396k6436k5918k5819k5740k4283
60532A424721k0799j6383j2752j0641r701r313q801p332m669j784J40J164K229
60519A326079L614M679N012M778L957K357M33p37n68O83K521M408N543N559N328
60504A373646O077P718R179J0184J1347J2414J2143J0428R075R535J1022J1720
60492A494488J1018R732Q840Q849R824J1368J2868J4231J5994J8583K1894K5723
60480A663412K9917L4059L7796M1509M5737M9694N1330M9166M3326L4642K3780
$$ plain form
60469 2104368 2115867 2114780 2102005 2079875 2052408 2024119 1997498 1972282 1948009 1926434 1910273
60458 1910273 1900350 1895441 1894358 1896664 1901735 1908926 1918774 1932433 1949692 1968997 1989783 2013501 2041954
60445 2041954 2075829 2115268 2160802 2213326 2274066 2344706 2426348 2518306 2619424 2730939 2856287
60434 2856287 2997289 3152069 3317862 3494571 3684193 3887883 4105486 4337848 4588308
60425 4588308 4861698 5162517 5493708 5855995 6247294 6661591 7086834 7503172 7884252
60416 7884252 8201921 8431252 8553474 8557873 8443852 8221442 7908634 7527488 7101539 6653749
60406 6653749 6203304 5762934 5339707 4938229 4562416 4214840 3896220 3606416 3345179
60397 3345179 3111432 2902538 2715149 2546736 2396052 2262342 2144521 2041048 1950131 1869731
$$ packed form
60469B104368J1499j087j2775k2130k7467k8289k6621k5216k4273k1575j6161
60458A910273r923m909j083K306N071P191R848J3659J7259J9305K0786K3718K8453
60445B041954L3875L9439M5534N2524O0740P0640Q1642R1958J01118J11515J25348
60434B856287J41002J54780J65793J76709J89622K03690K17603K32362K50460
60425D588308K73390L00819L31191L62287L91299M14297M25243M16338L81080
60416G884252L17669K29331J22222M399j14021k22410l12808l81146m25949m47790
60406F653749m50445m40370m23227m01478l75813l47576l18620k89804k61237
60397C345179k33747k08894j87389j68413j50684j33710j17821j03473r0917q0400
$$ plain form
60387 1869731 1797485 1731194 1669871 1614169 1565244 1523093 1486352 1453535 1423711 1395967 1369336
60376 1369336 1343863 1320792 1300715 1282111 1262824 1242777 1224195 1209131 1197606 1188073 1178641 1167656
60364 1167656 1154243 1139173 1124708 1112778 1103311 1094662 1085594 1076493 1068675 1062789 1058036 1053095 1047863
60351 1047863 1044040 1043585 1046516 1050620 1053534 1054843 1055940 1058136 1061283 1064133 1065751 1066545 1068054 1071708
60337 1071708 1077715 1085173 1093197 1101615 1110409 1118934 1126302 1132479 1138452 1145136 1152513 1159879 1166471 1171554
60323 1171554 1174592 1175940 1176967 1178704 1180504 1180779 1178986 1176017 1172546 1168109 1162461 1156953 1153545 1152690
60309 1152690 1152964 1152676 1151147 1148617 1145716 1143338 1142439 1143542 1146490 1150655 1155286 1159885 1164626 1170259 1177203
60294 1177203 1184835 1192058 1198462 1204625 1211510 1220108 1231258 1244879 1259283 1272184 1282830 1292523 1302664
$$ packed form
60387A869731p2246o6291o1323n5702m8925m2151l6741l2817k9824k7744k6631
60376A369336k5473k3071k0077j8604j9287k0047j8582j5064j1525r533r432j0985
60364A167656j3413j5070j4465j1930r467q649r068r101p818n886m753m941n232
60351A047863l823m55K931M104K914J309J097K196L147K850J618P94J509L654
60337A071708O007P458Q024Q418Q794Q525P368O177N973O684P377P366O592N083
60323A171554L038J348J027J737J800K75j793k969l471m437n648n508l408q55
60309A152690K74k88j529k530k901k378q99J103K948M165M631M599M741N633O944
60294A177203P632P223O404O163O885Q598J1150J3621J4404J2901J0646R693J0141
$$ plain form
60281 1302664 1312905 1321686 1328024 1332040 1334060 1334128 1332518 1330076 1327588 1325065 1322068 1318761 1316325 1316049
60267 1316049 1318065 1321145 1323678 1324581 1323443 1320449 1316562 1313223 1311217 1309887 1307914 1304709 1300647 1296258
60253 1296258 1291923 1288233 1285734 1284053 1282059 1279366 1277223 1277334 1279979 1283647 1286371 1287126 1286156 1284469 1283262
60238 1283262 1283522 1285658 1289121 1292447 1294089 1293495 1291306 1288590 1286223 1284938 1285169 1286393 1287319 1287462 1288100
60223 1288100 1290921 1296153 1302966 1311470 1323062 1338473 1356328 1374193 1390636 1406117 1422250 1440273
60211 1440273 1459816 1479182 1497167 1514330 1531917 1550012 1567757 1585075 1602882 1621507 1640276
60200 1640276 1659068 1679079 1701515 1726606 1754472 1785758 1820640 1858303 1898450 1942459 1991954
60189 1991954 2046913 2106255 2169699 2238014 2312069 2392837 2481830 2580123 2687083 2801345 2922994
$$ packed form
60281A302664J0241Q781O338M016K020O8j610k442k488k523k997l307k436k76
60267A316049K016L080K533R03j138k994l887l339k006j330j973l205m062m389
60253A296258m335l690k499j681j994k693k143J11K645L668K724P55r70j687j207
60238A283262K60K136L463L326J642n94k189k716k367j285K31J224R26J43O38
60223A288100K821N232O813Q504J1592J5411J7855J7865J6443J5481J6133J8023
60211A440273J9543J9366J7985J7163J7587J8095J7745J7318J7807J8625J8769
60200A640276J8792K0011K2436K5091K7866L1286L4882L7663M0147M4009M9495
60189A991954N4959N9342O3444O8315P4055Q0768Q8993R8293J06960J14262J21649
$$ plain form
60178 2922994 3053625 3194227 3344197 3502553 3668741 3841735 4019456 4199784 4381326
60169 4381326 4562463 4740362 4911719 5073954 5224913 5361911 5482158 5584205 5668189 5734412
60159 5734412 5782191 5810461 5819135 5809611 5784305 5746276 5699333 5647876 5595917 5546136 5500203 5460153
60147 5460153 5429107 5410360 5406018 5416826 5443071 5485123 5543175 5617147 5707213 5813990 5937670
60136 5937670 6076968 6229134 6390936 6559428 6731821 6904814 7074122 7234629 7381232
60127 7381232 7509980 7618571 7705664 7769780 7809119 7822441 7809645 7771388 7708760 7624079 7521760
60116 7521760 7407556 7286641 7162837 7039625 6920992 6810669 6711091 6623979 6551801 6497993
60106 6497993 6465512 6455462 6467135 6499081 6550101 6619312 6705306 6805187 6914685 7029381 7145624
$$ packed form
60178B922994J30631J40602J49970J58356J66188J72994J77721J80328J81542
60169D381326J81137J77899J71357J62235J50959J36998J20247J02047Q3984O6223
60159E734412M7779K8270Q674r524k5306l8029m6943n1457n1959m9781m5933m0050
60147E460153l1046j8747m342J0808K6245M2052N8052P3972R0066J06777J23680
60136E937670J39298J52166J61802J68492J72393J72993J69308J60507J46603
60127G381232J28748J08591Q7093O4116L9339J3322j2796l8257o2628q4681j02319
60116G521760j14204j20915j23804j23212j18633j10323r9578q7112p2178n3808
60106F497993l2481j0050J1673L1946N1020O9211Q5994R9881J09498J14696J16243
$$ plain form
60095 7145624 7260217 7369827 7471220 7561783 7639474 7702789 7751456 7786732 7810260 7823027 7826402
60084 7826402 7823950 7820999 7822321 7831254 7851258 7886874 7942204 8019124 8117766 8238320 8381817 8549849
60072 8549849 8744550 8968684 9224831 9514091 9835845 10188833 10572285 10986090 11430112
60063 11430112 11903353 12403429 12926435 13466852 14017393 14569380 15113875 15642424 16146451
60054 16146451 16616380 17042298 17415566 17729128 17976392 18151083 18248749 18267701 18207987 18070370
60044 18070370 17857203 17573894 17228758 16831770 16394137 15928535 15448444 14966552 14493819
60035 14493819 14039736 13612712 13219809 12866263 12555437 12289318 12069202 11895885 11769032
60026 11769032 11686390 11644123 11638120 11664567 11719055 11795592 11887039 11986304 12086785 12181977 12265288
$$ packed form
60095G145624J14593J09610J01393R0563P7691O3315M8667L5276K3528J2767L375
60084G826402k452k951J322Q933K0004L5616N5330P6920R8642J20554J43497J68032
60072H549849J94701K24134K56147K89260L21754L52988L83452M13805M44022
60063A1430112M73241N00076N23006N40417N50541N51987N44495N28549N04027
60054A6146451M69929M25918L73268L13562K47264J74691R7666J8952n9714j37617
60044A8070370k13167k83309l45136l96988m37633m65602m80091m81892m72733
60035A4493819m54083m27024l92903l53546l10826k66119k20116j73317j26853
60026A1769032q2642m2267o003K6447N4488P6537R1447R9265J00481R5192Q3311
$$ plain form
60015 12265288 12330576 12373015 12389770 12380034 12344214 12282823 12196150 12084768 11949813 11792550 11614093
60004 11614093 11415817 11199730 10968316 10724553 10472432 10217059 9963649 9716396 9478310
59995 9478310 9251754 9038925 8842205 8664376 8508262 8375973 8268752 8187581 8133349 8106194
59985 8106194 8105345 8129974 8179800 8254451 8352820 8473365 8614225 8772186 8942028 9117933 9295257
59974 9295257 9469821 9635388 9783157 9904842 9996130 10056661 10086886 10085568 10050542 9981234 9879708
59963 9879708 9749386 9593683 9416368 9222538 9018195 8808944 8599681 8395283 8200601
59954 8200601 8019625 7855486 7711289 7589924 7492757 7419594 7370615 7347595 7352450 7385268 7444580
59943 7444580 7529265 7639445 7775804 7938716 8127849 8341889 8578204 8832650 9099539 9371861
$$ packed form
60015A2265288O5288M2439J6755r736l5820o1391q6673j11382j34955j57263j78457
60004A1614093j98276k16087k31414k43763k52121k55373k53410k47253k38086
59995I478310k26556k12829j96720j77829j56114j32289j07221q1171n4232k7155
59985H106194q49K4629M9826P4651R8369J20545J40860J57961J69842J75905J77324
59974I295257J74564J65567J47769J21685R1288O0531L0225j318l5026o9308j01526
59963I879708j30322j55703j77315j93830k04343k09251k09263k04398j94682
59954H200601j80976j64139j44197j21365r7167p3163m8979k3020M855L2818N9312
59943G444580Q4685J10180J36359J62912J89133K14040K36315K54446K66889K72322
$$ plain form
59933 9371861 9642048 9902723 10146649 10366540 10556049 10711188 10830024 10910855 10951587 10950985
59923 10950985 10909410 10828067 10708962 10556381 10377178 10178619 9966909 9748713 9532759 9328175
59913 9328175 9141498 8976214 8834453 8717853 8627437 8564250 8529957 8525604 8549995 8600446 8674900
59902 8674900 8772127 8890130 9025832 9176332 9339092 9510629 9686361 9862280 10035881 10205169
59892 10205169 10367714 10521148 10663741 10794094 10911010 11014293 11105290 11186312 11259792 11328160
59882 11328160 11394293 11462110 11537013 11625449 11733408 11865286 12024479 12214693 12440116 12704630
59872 12704630 13011378 13362425 13757732 14194623 14668927 15176051 15709649 16259578 16812471
59863 16812471 17353974 17868752 18338503 18742582 19062375 19284770 19401620 19408223 19304365 19096187
$$ packed form
59933I371861K70187K60675K43926K19891J89509J55139J18836Q0831M0732o02
59923A0950985m1575q1343j19105j52581j79203j98559k11710k18196k15954k04584
59913I328175j86677j65284j41761j16600r0416o3187l4293m353K4391N0451P4454
59902H674900R7227J18003J35702J50500J62760J71537J75732J75919J73601J69288
59892A0205169J62545J53434J42593J30353J16916J03283R0997Q1022P3480O8368
59882A1328160O6133O7817P4903Q8436J07959J31878J59193J90214K25423K64514
59872A2704630L06748L51047L95307M36891M74304N07124N33598N49929N52893
59863A6812471N41503N14778M69751M04079L19793K22395J16850O603j03858k08178
$$ plain form
59853 19096187 18795380 18416288 17973976 17483994 16962129 16423698 15883055 15353194 14844859
59844 14844859 14365914 13921959 13517521 13156388 12841215 12573526 12354194 12183660 12061770
59835 12061770 11987685 11959826 11975650 12031744 12124464 12250276 12404915 12582149 12773651 12970090
59825 12970090 13162069 13340061 13493954 13613268 13688210 13710742 13674952 13576945 13415150 13191265
59815 13191265 12910821 12582300 12215227 11818849 11402091 10973892 10542830 10116254 9699955
59806 9699955 9298720 8916889 8558007 8224065 7915627 7633021 7377006 7147910 6944594
59797 6944594 6765060 6607924 6472468 6357255 6259606 6176616 6105746 6044062 5987899 5934049
59787 5934049 5880754 5827124 5772479 5717051 5662623 5611488 5564992 5523425 5486393 5452292 5418092
$$ packed form
59853A9096187l00807l79092m42312m89982n21865n38431n40643n29861n08335
59844A4844859m78945m43955m04438l61133l15173k67689k19332j70534j21890
59835A2061770p4085k7859J5824N6094R2720J25812J54639J77234J91502J96439
59825A2970090J91979J77992J53893J19314P4942K2532l5790r8007j61795k23885
59815A3191265k80444l28521l67073l96378m16758m28199m31062m26576m16299
59806I699955m01235l81831l58882l33942l08438k82606k56015k29096k03316
59797F944594j79534j57136j35456j15213r7649q2990p0870o1684n6163n3850
59787E934049n3295n3630n4645n5428n4428n1135m6496m1567l7032l4101l4200
$$ plain form
59776 5418092 5380908 5339726 5294902 5246507 5194224 5138445 5080201 5019997 4957729 4893739 4829131
59765 4829131 4765140 4703213 4645700 4595416 4554039 4521342 4495933 4476368 4461922 4453091 4451150 4456543
59753 4456543 4468082 4484537 4506570 4536137 4574426 4621655 4678484 4745956 4823698 4909381 5000234
59742 5000234 5094204 5189620 5284911 5378829 5469840 5555225 5632083 5699560 5759000 5811761 5858297
59731 5858297 5899846 5939417 5980110 6023488 6070678 6124310 6188273 6265797 6358453 6467009 6593048
59720 6593048 6739951 6912158 7112888 7342698 7600902 7888171 8206843 8559088 8946207
59711 8946207 9369545 9829914 10324851 10846939 11384254 11919802 12428935 12879325 13237019
59702 13237019 13475327 13580931 13555595 13414601 13182061 12884158 12544388 12183216 11819146
$$ packed form
59776E418092l7184m1182m4824m8395n2283n5779n8244o0204o2268o3990o4608
59765D829131o3991o1927n7513n0284m1377l2697k5409j9565j4446q831j941N393
59753D456543J1539J6455K2033K9567L8289M7229N6829O7472P7742Q5683R0853
59742E000234R3970R5416R5291R3918R1011Q5385P6858O7477N9440N2761M6536
59731E858297M1549L9571M0693M3378M7190N3632O3963P7524R2656J08556J26039
59720F593048J46903J72207K00730K29810K58204K87269L18672L52245L87119
59711H946207M23338M60369M94937N22088N37315N35548N09133M50390L57694
59702A3237019K38308J05604k5336j40994k32540k97903l39770l61172l64070
$$ plain form
59693 11819146 11467278 11137046 10833204 10559359 10319481 10116289 9950015 9819794 9725512
59684 9725512 9667700 9646168 9659461 9705579 9782898 9890525 10028135 10195760 10393810 10623205
59674 10623205 10885252 11181353 11512937 11881453 12288091 12733657 13219265 13747226 14320815
59665 14320815 14943049 15615987 16341118 17119914 17953898 18844236 19790702 20790282 21837001
59656 21837001 22923614 24042787 25185408 26338346 27485733 28612938 29708499 30763223
59648 30763223 31770583 32729732 33646641 34530686 35390518 36233364 37065893 37892999 38715335
59639 38715335 39528608 40324486 41091164 41813910 42476819 43064769 43564184 43963839 44256963
59630 44256963 44442816 44525841 44514147 44419779 44259368 44052516 43819163 43579046 43352743 43160988
$$ packed form
59693A1819146l51868l30232l03842k73845k39878k03192j66274j30221r4282
59684I725512n7812k1532J3293M6118P7319J07627J37610J67625J98050K29395
59674A0623205K62047K96101L31584L68516M06638M45566M85608N27961N73589
59665A4320815O22234O72938P25131P78796Q33984Q90338R46466R99580J046719
59656B1837001J086613J119173J142621J152938J147387J127205J095561J054724
59648C0763223J007360R59149R16909Q84045Q59832Q42846Q32529Q27106Q22336
59639C8715335Q13273P95878P66678P22746O62909N87950M99415L99655K93124
59630D4256963J85853Q3025j1694r4368j60411k06852k33353k40117k26303j91755
$$ plain form
59620 43160988 43021924 42949581 42955215 43049455 43242795 43544231 43959497 44490478 45136420 45895411
59610 45895411 46763575 47732101 48785487 49902750 51058819 52223400 53359153 54422343
59602 54422343 55365221 56137905 56690873 56980634 56976926 56666903 56055083 55161609 54020157
59593 54020157 52674265 51172324 49563390 47894494 46208020 44539274 42915924 41359041
59585 41359041 39883138 38494406 37189233 35954372 34768146 33602758 32429224 31224335
59577 31224335 29976202 28685901 27365946 26036905 24722176 23442148 22210943 21037448
59569 21037448 19928154 18888275 17920821 17025785 16200599 15441296 14743678 14104186 13519930
59560 13519930 12987722 12503240 12061730 11659619 11294876 10965462 10667989 10398578 10154678
$$ packed form
59620D3160988j39064p2343N634R4240J93340L01436M15266N30981O45942P58991
59610D5895411Q68164R68526J053386J117263J156069J164581J135753J063190
59602E4422343R42878P72684N52968K89761l708l10023o11820q93474j141452
59593E4020157j345892j501941j608934j668896j686474j668746j623350j556883
59585D1359041j475903j388732j305173j234861j186226j165388j173534j204889
59577C1224335j248133j290301j319955j329041j314729j280028j231205j173495
59569B1037448j109294j039879r67454q95036q25186p59303o97618o39492n84256
59560A3519930n32208m84482m41510m02111l64743l29414k97473k69411k43900
$$ plain form
59551 10154678 9934917 9736921 9556328 9388759 9231895 9084420 8943377 8804121 8663115
59542 8663115 8519472 8373351 8224126 8071058 7914774 7757014 7599422 7443500 7291256
59533 7291256 7144839 7005507 6873601 6749400 6633506 6526657 6429805 6344130 6270394 6208385
59523 6208385 6157455 6117230 6087278 6066611 6054388 6050831 6056510 6070805 6092115 6119652 6154022 6195606
59511 6195606 6243209 6294949 6349929 6408385 6470589 6536515 6606697 6682645 6765867 6856898 6955985
59500 6955985 7064597 7185363 7320095 7468655 7630494 7806775 8000016 8211902 8442550
59491 8442550 8691933 8960835 9250017 9559402 9888619 10237463 10605051 10988982 11385840
59482 11385840 11792077 12203959 12617140 13026816 13428117 13816101 14185595 14530884 14845138
$$ packed form
59551A0154678k19761j97996j80593j67569j56864j47475j41043j39256j41006
59542H663115j43643j46121j49225j53068j56284j57760j57592j55922j52244
59533G291256j46417j39332j31906j24201j15894j06849r6852q5675p3736o2009
59523F208385n0930m0225k9952k0667j2223l557N679J4295K1310K7537L4370M1584
59511F195606M7603N1740N4980N8456O2204O5926P0182P5948Q3222R1031R9087
59500F955985J08612J20766J34732J48560J61839J76281J93241K11886K30648
59491H442550K49383K68902K89182L09385L29217L48844L67588L83931L96858
59482A1385840M06237M11882M13181M09676M01301L87984L69494L45289L14254
$$ plain form
59473 14845138 15120735 15351880 15537741 15682238 15790294 15864917 15907846 15921479 15909328 15875867
59463 15875867 15827031 15769948 15711150 15655719 15609018 15578203 15570831 15592631 15647684 15739742 15871609
59452 15871609 16043201 16251113 16489460 16749630 17019197 17282383 17522251 17722511 17868195
59443 17868195 17946167 17945763 17859332 17683168 17418749 17072579 16654267 16175323 15649849 15094315
59433 15094315 14524466 13952626 13388876 12843588 12326685 11844649 11399932 10993417 10626202
59424 10626202 10299368 10013634 9769371 9565727 9399870 9268577 9170728 9107038 9077568 9080994
59414 9080994 9116202 9182791 9279665 9404884 9557451 9737608 9944411 10174399 10423577 10689453
59404 10689453 10969759 11259880 11552706 11840503 12115631 12369529 12592103 12772855 12902757
$$ packed form
59473A4845138K75597K31145J85861J44497J08056P4623M2929J3633j2151l3461
59463A5875867m8836n7083n8798n5431m6701l0815p372K1800N5053R2058J31867
59452A5871609J71592K07912K38347K60170K69567K63186K39868K00260J45684
59443A7868195P7972m04q6431j76164k64419l46170m18312m78944n25474n55534
59433A5094315n69849n71840n63750n45288n16903m82036m44717m06515l67215
59424A0626202l26834k85734k44263k03644j65857j31293r7849o3690k9470L426
59414I080994L5208O6589R6874J25219J52567J80157K06803K29988K49178K65876
59404A0689453K80306K90121K92826K87797K75128K53898K22574J80752J29902
$$ plain form
59395 12902757 12975499 12987654 12938032 12826871 12655631 12427456 12147813 11824610 11467458 11086124
59385 11086124 10689010 10282789 9873211 9465837 9066095 8679201 8309997 7961926 7635788
59376 7635788 7330265 7044078 6777030 6528945 6299095 6087474 5895349 5723361 5569990
59367 5569990 5432978 5311267 5204334 5110673 5028580 4957814 4898981 4851696 4814678 4787012 4768001
59356 4768001 4756472 4751819 4755098 4767542 4788723 4817694 4854502 4897752 4941356 4977216 5002171 5020280
59344 5020280 5037863 5058603 5083996 5115780 5156239 5207653 5272331 5351260 5441395 5536009 5629567
59333 5629567 5721786 5816475 5917987 6029767 6154561 6294205 6449929 6623979 6820084 7041266
59323 7041266 7288259 7561212 7861824 8192322 8553423 8945422 9371225 9836507 10346374
$$ packed form
59395A2902757P2742J2155m9622j11161j71240k28175k79643l23203l57152l81334
59385A1086124l97114m06221m09578m07374l99742l86894l69204l48071l26138
59376G635788l05523k86187k67048k48085k29850k11621j92125j71988j53371
59367E569990j37012j21711j06933r3661q2093p0766n8833m7285l7018k7666j9011
59356D768001j1529m653L279J2444K1181K8971L6808M3250M3604L5860K4955J8109
59344E020280J7583K0740K5393L1784M0459N1414O4678P8929R0135R4614R3558
59333E629567R2219R4689J01512J11780J24794J39644J55724J74050J96105K21182
59323G041266K46993K72953L00612L30498L61101L91999M25803M65282N09867
$$ plain form
59314 10346374 10902819 11505728 12155362 12853113 13600049 14395139 15234606 16112157 17018869
59305 17018869 17942596 18868492 19781228 20667000 21513579 22309948 23047737 23723022 24335548
59296 24335548 24886190 25376053 25807062 26181001 26497379 26753661 26947631 27077276 27137402
59287 27137402 27118297 27009377 26803493 26497425 26090405 25584332 24984919 24301233 23544420
59278 23544420 22727565 21865808 20974995 20069902 19163724 18268180 17393155 16546634 15735469
59269 15735469 14965494 14240453 13561806 12930277 12346735 11811068 11321547 10876348 10474606
59260 10474606 10114822 9793350 9506008 9250500 9025776 8829592 8658428 8509757 8382855
59251 8382855 8276980 8189927 8118917 8062251 8019628 7991154 7976180 7972820 7978504 7991173 8009897
$$ packed form
59314A0346374N56445O02909O49634O97751P46936P95090Q39467Q77551R06712
59305A7018869R23727R25896R12736Q85772Q46579P96369P37789O75285O12526
59296B4335548N50642M89863M31009L73939L16378K56282J93970J29645O0126
59287B7137402j9105j08920k05884l06068m07020n06073n99413o83686p56813
59278B3544420q16855q61757q90813r05093r06178q95544q75025q46521q11165
59269A5735469p69975p25041o78647o31529n83542n35667m89521m45199m01742
59260A0474606l59784l21472k87342k55508k24724j96184j71164j48671j26902
59251H382855j05875q7053p1010n6666m2623k8474j4974l360N684J2669J8724
$$ plain form
59240 8009897 8034236 8063133 8094559 8126080 8155779 8182913 8207721 8230319 8250015 8266195 8279632
59229 8279632 8292222 8305690 8321492 8341763 8368933 8404177 8447553 8500291 8565852 8647801 8747021
59218 8747021 8861102 8985574 9115623 9248050 9382549 9520624 9662897 9808011 9953807
59209 9953807 10097945 10236922 10365944 10480504 10576927 10650977 10697772 10714337 10701094 10660031
59199 10660031 10592915 10502482 10393677 10271753 10139938 10000519 9857264 9714898 9576635 9443745
59189 9443745 9317105 9197501 9084667 8977695 8876544 8781788 8692807 8607561 8524521 8443883
59179 8443883 8366648 8293469 8224896 8162152 8107130 8061602 8026526 8002091 7988824 7988790 8005349 8041593
59167 8041593 8099447 8180218 8285147 8415310 8572236 8759220 8980900 9240551 9538541 9874061
$$ packed form
59240H009897K4339K8897L1426L1521K9699K7134K4808K2598J9696J6180J3437
59229H279632J2590J3468J5802K0271K7170L5244M3376N2738O5561Q1949R9220
59218H747021J14081J24472J30049J32427J34499J38075J42273J45114J45796
59209I953807J44138J38977J29022J14560R6423P4050M6795J6565j3243m1063
59199A0660031o7116r0433j08805j21924j31815j39419j43255j42366j38263j32890
59189I443745j26640j19604j12834j06972j01151r4756q8981q5246q3040q0638
59179H443883p7235p3179o8573o2744n5022m5528l5076k4435j3267l4J6559L6244
59167H041593N7854Q0771J04929J30163J56926J86984K21680K59651K97990L35520
$$ plain form
59157 9874061 10247273 10658649 11107037 11589409 12101388 12636149 13182729 13726523 14251376
59148 14251376 14740547 15176468 15541483 15819824 15999036 16070359 16029064 15874878 15611838 15248114
59138 15248114 14796354 14273436 13698501 13090338 12465786 11839108 11221673 10622334 10048442
59129 10048442 9505985 8998500 8526789 8090494 7689486 7323339 6990359 6687952 6413425
59120 6413425 6164096 5937568 5732646 5549215 5386657 5243230 5117351 5008128 4913776 4830956
59110 4830956 4757066 4692220 4637770 4593726 4558761 4531711 4511729 4497986 4490721 4491698 4501964 4519711
59098 4519711 4541946 4567819 4598884 4636609 4681191 4732481 4790504 4855005 4925429 5001007 5080050
59087 5080050 5160088 5240019 5321229 5404864 5488695 5568445 5641794 5709181 5771092 5826754 5875567
$$ packed form
59157I874061L73212M11376M48388M82372N11979N34761N46580N43794N24853
59148A4251376M89171M35921L65015K78341J79212P1323m1295j54186k63040l63724
59138A5248114m51760n22918n74935o08163o24552o26678o17435n99339n73892
59129A0048442n42457n07485m71711m36295m01008l66147l32980l02407k74527
59120F413425k49329k26528k04922j83431j62558j43427j25879j09223r4352q2820
59110D830956p3890o4846n4450m4044l4965k7050j9982j3743p265R77J0266J7747
59098D519711K2235K5873L1065L7725M4582N1290N8023O4501P0424P5578P9043
59087E080050Q0038P9931Q1210Q3635Q3831P9750P3349O7387O1911N5662M8813
$$ plain form
59076 5875567 5917790 5953200 5980610 5999253 6009461 6011746 6006609 5995749 5982233 5968874 5957241 5948564
59064 5948564 5944805 5948386 5961251 5984185 6016744 6058241 6109420 6172619 6249627 6340074 6442714
59053 6442714 6557288 6683861 6821374 6968643 7126225 7295577 7476852 7669365 7873788
59044 7873788 8091685 8322746 8564415 8814572 9072943 9339613 9613752 9893936 10177800
59035 10177800 10460764 10736472 10998715 11241311 11455839 11631512 11758286 11828938 11838083 11781634
59025 11781634 11659019 11474814 11236856 10953362 10632354 10282218 9910983 9525344 9131422
59016 9131422 8736080 8346406 7967846 7603289 7253854 6920178 6603179 6303934 6022872
59007 6022872 5759322 5512234 5281188 5066225 4866935 4682310 4511250 4352520 4204592
$$ packed form
59076E875567M2223L5410K7410J8643J0208K285n137j0860j3516j3359j1633q677
59064E948564l759L581J2865K2934L2559M1497N1179O3199P7008R0447J02640
59053F442714J14574J26573J37513J47269J57582J69352J81275J92513K04423
59044G873788K17897K31061K41669K50157K58371K66670K74139K80184K83864
59035A0177800K82964K75708K62243K42596K14528J75673J26774P0652R145n6449
59025A1781634j22615j84205k37958k83494l21008l50136l71235l85639l93922
59016I131422l95342l89674l78560l64557l49435l33676l16999k99245k81062
59007F022872k63550k47088k31046k14963j99290j84625j71060j58730j47928
$$ plain form
58998 4204592 4066528 3938829 3822346 3716366 3618755 3527869 3443283 3364864 3292437 3226412
58988 3226412 3167243 3113813 3063679 3015552 2970517 2930173 2894413 2861632 2830254 2799347 2768390
58977 2768390 2737377 2707009 2678299 2651878 2627653 2605010 2583502 2563689 2547057 2534739 2526531
58966 2526531 2521492 2519086 2519217 2521614 2525789 2531173 2536774 2541334 2544529 2547248 2549969 2551703 2551480 2549899
58952 2549899 2548088 2546229 2544548 2544619 2547755 2552991 2558657 2565187 2574089 2584701 2594644 2603421 2612804 2623138
58938 2623138 2631815 2636341 2636855 2634627 2629905 2622324 2611978 2599173 2584415 2569325 2556203 2545984 2537848
58925 2537848 2531299 2527101 2525667 2526182 2528100 2531981 2538059 2545438 2553514 2562864 2574026 2586885 2601998
58912 2601998 2620803 2643421 2667736 2691867 2716350 2742835 2771981 2803811 2838823 2877181 2917652
$$ packed form
58998D204592j38064j27699j16483j05980r7611r0886q4586p8419p2427o6025
58988C226412n9169n3430n0134m8127m5035m0344l5760l2781l1378l0907l0957
58977B768390l1013l0368k8710k6421k4225k2643k1508j9813j6632j2318q208
58966B526531n039k406J31K397M175N384N601M560L195K719K721J734k23j581
58952B549899j811j859j681P1L136N236N666O530Q902J0612R943Q777R383J0334
58938B623138Q677M526N14k228m722p581j0346j2805j4758j5090j3122j0219q136
58925B537848o549m198j434N15J918L881O078P379Q076R350J1162J2859J5113
58912B601998J8805K2618K4315K4131K4483K6485K9146L1830L5012L8358M0471
$$ plain form
58901 2917652 2958642 2999624 3040632 3081370 3122047 3164323 3210092 3259768 3312720 3368787 3428389
58890 3428389 3491677 3558606 3629425 3704272 3782610 3863798 3947947 4035728 4127860 4225259 4329053
58879 4329053 4439774 4556971 4680103 4809446 4945903 5090715 5245692 5412869 5593187
58870 5593187 5786140 5991244 6209409 6442513 6692313 6960226 7247510 7555071 7883469
58861 7883469 8233490 8606469 9004086 9428381 9881927 10367262 10886098 11439737 12030068
58852 12030068 12659343 13329047 14039883 14792676 15588174 16425895 17303824 18218693 19165348
58843 19165348 20136173 21122194 22113742 23097983 24056213 24965753 25804545 26552196 27187546
58834 27187546 27689012 28038966 28226351 28245377 28095125 27782016 27320220 26727786 26023482
$$ packed form
58901B917652M0990M0982M1008M0738M0677M2276M5769M9676N2952N6067N9602
58890C428389O3288O6929P0819P4847P8338Q1188Q4149Q7781R2132R7399J03794
58879D329053J10721J17197J23132J29343J36457J44812J54977J67177J80318
58870E593187J92953K05104K18165K33104K49800K67913K87284L07561L28398
58861G883469L50021L72979L97617M24295M53546M85335N18836N53639N90331
58852A2030068O29275O69704P10836P52793P95498Q37721Q77929R14869R46655
58843A9165348R70825R86021R91548R84241R58230R09540Q38792P47651O35350
58834B7187546N01466L49954J87385J9026j50252l13109m61796n92434p04304
$$ plain form
58825 26023482 25227481 24361819 23447835 22504493 21549890 20601485 19672435 18769525 17896863
58816 17896863 17060120 16265150 15514128 14805641 14138025 13510817 12923642 12375325 11863590
58807 11863590 11384687 10934466 10510942 10114493 9744441 9397315 9070145 8763552 8479294
58798 8479294 8216237 7971278 7743197 7533009 7341054 7166096 7006944 6862822 6732365
58789 6732365 6614250 6508655 6416400 6336908 6268825 6212390 6169365 6140620 6125294 6122230 6130760
58778 6130760 6150234 6180341 6221843 6275617 6341070 6416767 6502513 6599561 6709024 6831386 6967308
58767 6967308 7117514 7282010 7460766 7655111 7867156 8097923 8347311 8615831 8905148
58758 8905148 9216863 9551921 9911373 10296890 10710680 11155729 11635715 12153495 12709801
$$ packed form
58825B6023482p96001q65662r13984r43342r54603r48405r29050r02910q72662
58816A7896863q36743p94970p51022p08487o67616o27208n87175n48317n11735
58807A1863590m78903m50221m23524l96449l70052l47126l27170l06593k84258
58798H479294k63057k44959k28081k10188j91955j74958j59152j44122j30457
58789F732365j18115j05595r2255p9492o8083n6435m3025k8745j5326l064Q530
58778F130760J9474L0107M1502N3774O5453P5697Q5746R7048J09463J22362J35922
58767F967308J50206J64496J78756J94345K12045K30767K49388K68520K89317
58758H905148L11715L35058L59452L85517M13790M45049M79986N17780N56306
$$ plain form
58749 12709801 13304430 13938540 14614723 15334965 16099436 16906830 17754429 18637588 19549951
58740 19549951 20484010 21430412 22376543 23306254 24200555 25037844 25794313 26446055 26971786
58731 26971786 27353842 27578020 27634765 27521514 27243435 26811680 26241172 25549572 24756980
58722 24756980 23885361 22957264 21993855 21013255 20030431 19058167 18107085 17184596 16295093
58713 16295093 15441915 14628351 13856459 13126312 12437397 11789725 11182783 10614608 10083136
58704 10083136 9587505 9126875 8698851 8300306 7928959 7582994 7260054 6958075 6676525
58695 6676525 6415413 6173427 5948252 5738400 5543589 5363561 5197248 5042712 4897342
58686 4897342 4758910 4627174 4503718 4389496 4283447 4184148 4091445 4005391 3924848 3848501
$$ packed form
58749A2709801N94629O34110O76183P20242P64471Q07394Q47599Q83159R12363
58740A9549951R34059R46402R46131R29711Q94301Q37289P56469O51742N25731
58731B6971786L82056K24178N6745j13251k78079m31755n70508o91600p92592
58722B4756980q71619r28097r63409r80600r82824r72264r51082r22489q89503
58713A6295093q53178q13564p71892p30147o88915o47672o06942n68175n31472
58704A0083136m95631m60630m28024l98545l71347l45965l22940l01979k81550
58695F676525k61112k41986k25175k09852j94811j80028j66313j54536j45370
58686D897342j38432j31736j23456j14222j06049r9299r2703q6054q0543p6347
$$ plain form
58676 3848501 3776206 3708019 3642898 3579705 3518510 3459578 3402141 3345590 3290817 3238841 3189087
58665 3189087 3140489 3093178 3047362 3001628 2954254 2905260 2855298 2803486 2748474 2691047 2633462
58654 2633462 2576695 2520349 2464828 2411365 2359967 2309287 2258629 2208443 2159064 2110630 2064097
58643 2064097 2020610 1979858 1940618 1902816 1867595 1835472 1805915 1778528 1753229 1729428 1706358
58632 1706358 1683920 1661876 1638767 1613279 1586359 1560375 1536497 1514463 1494471 1477369 1462991
58621 1462991 1450069 1438007 1427450 1419086 1413042 1409330 1407772 1407793 1409200 1412647 1418444 1425885 1434861 1446694
58607 1446694 1461681 1477104 1489741 1499207 1506594 1511147 1511159 1507474 1502994 1498753 1493177 1485246 1475716 1465087
58593 1465087 1453132 1440983 1431126 1424491 1419615 1415501 1413393 1414945 1420243 1428245 1437792 1447792 1457916
$$ packed form
58676C848501p2295o8187o5121o3193o1195n8932n7437n6551n4773n1976m9754
58665C189087m8598m7311m5816m5734m7374m8994m9962n1812n5012n7427n7585
58654B633462n6767n6346n5521n3463n1398n0680n0658n0186m9379m8434m6533
58643B064097m3487m0752l9240l7802l5221l2123k9557k7387k5299k3801k3070
58632A706358k2438k2044k3109k5488k6920k5984k3878k2034j9992j7102j4378
58621A462991j2922j2062j0557q364o044l712j558K1J407L447N797P441Q976J1833
58607A446694J4987J5423J2637R466P387M553J2l685m480m241n576p931r530j0629
58593A465087j1955j2149r857o635m876m114k108J552N298Q002R547J0000J0124
$$ plain form
58580 1457916 1469496 1484444 1503187 1524936 1549722 1578463 1611121 1646596 1684425 1724930 1767880
58569 1767880 1812935 1861290 1914767 1973241 2035041 2100051 2170289 2247182 2330380 2419695 2516187
58558 2516187 2620786 2733657 2855420 2987275 3129598 3282115 3445756 3622561 3813514
58549 3813514 4018188 4236664 4469765 4716967 4975874 5244013 5519244 5798079 6075366
58540 6075366 6345747 6603296 6839449 7043624 7206752 7322752 7386926 7395911 7350330 7255356
58530 7255356 7117455 6942185 6735678 6505843 6260599 6006269 5748522 5493121 5244542
58521 5244542 5005227 4777201 4563141 4365112 4183528 4018114 3868578 3733596 3610516
58512 3610516 3497023 3392198 3295480 3205714 3121779 3043055 2968717 2897537 2828921 2763418 2701905
$$ packed form
58580A457916J1580J4948J8743K1749K4786K8741L2658L5475L7829M0505M2950
58569A767880M5055M8355N3477N8474O1800O5010P0238P6893Q3198Q9315R6492
58558B516187J04599J12871J21763J31855J42323J52517J63641J76805J90953
58549C813514K04674K18476K33101K47202K58907K68139K75231K78835K77287
58540F075366K70381K57549K36153K04175J63128J16000O4174Q985m5581r4974
58530G255356j37901j75270k06507k29835k45244k54330k57747k55401k48579
58521E244542k39315k28026k14060j98029j81584j65414j49536j34982j23080
58512C610516j13493j04825r6718q9766q3935p8724p4338p1180o8616o5503o1513
$$ plain form
58501 2701905 2644875 2592400 2544028 2498888 2456455 2416541 2377900 2338210 2296825 2256155 2218409
58490 2218409 2182211 2144521 2104618 2063572 2021048 1975982 1929902 1886171 1845820 1807160 1769659
58479 1769659 1735081 1704326 1676065 1649157 1623772 1599583 1575544 1552061 1530918 1512488 1495460
58468 1495460 1479693 1466677 1456655 1447850 1439164 1431140 1423763 1415835 1407013 1397891 1387703 1374709 1359353
58455 1359353 1344263 1330520 1316668 1301844 1286977 1272292 1256741 1240711 1226308 1214092 1202403
58444 1202403 1190703 1180620 1172853 1166100 1159960 1155715 1153327 1150812 1147619 1145409 1144517 1143031 1140510 1139053
58430 1139053 1139377 1139499 1138816 1139746 1143294 1146591 1147029 1145664 1144422 1143226 1142033 1142233 1143464 1142307 1137027
58415 1137027 1130815 1127423 1126176 1124147 1120722 1116963 1112520 1106400 1099471 1093604 1089430 1086754 1085724 1085922
$$ packed form
58501B701905n7030n2475m8372m5140m2433l9914l8641l9690m1385m0670l7746
58490B218409l6198l7690l9903m1046m2524m5066m6080m3731m0351l8660l7501
58479A769659l4578l0755k8261k6908k5385k4189k4039k3483k1143j8430j7028
58468A495460j5767j3016j0022q805q686q024p377p928q822r122j0188j2994j5356
58455A359353j5090j3743j3852j4824j4867j4685j5551j6030j4403j2216j1689
58444A202403j1700j0083p767o753o140m245k388k515l193k210q92j486k521j457
58430A139053L24J22o83R30L548L297M38j365j242j196j193K00J231j157n280
58415A137027o212l392j247k029l425l759m443o120o929n867m174k676j030J98
$$ plain form
58401 1085922 1085967 1085563 1086182 1088431 1090797 1092254 1093809 1096094 1097947 1098779 1099790 1101368 1101904 1100711 1099315
58386 1099315 1098479 1097022 1095205 1095872 1100153 1105275 1108839 1112076 1116573 1121111 1124460 1128248 1134193 1141170
58372 1141170 1147698 1154640 1162762 1170213 1175098 1178026 1179784 1179243 1176016 1172281 1169366 1165472 1159404 1153511
58358 1153511 1150106 1147939 1145150 1142758 1142235 1142700 1143708 1147830 1157065 1169314 1181673 1194566 1209522
58345 1209522 1225710 1242012 1259745 1279914 1300357 1318855 1336404 1354209 1370375 1382966 1393279
58334 1393279 1402515 1408224 1407885 1403213 1397181 1389700 1380138 1371018 1364801 1359661 1352680 1344862 1338972 1334997
58320 1334997 1331821 1330682 1332697 1335611 1337260 1339577 1344803 1350537 1353307 1354528 1358103 1364482 1371719 1380014
58306 1380014 1390399 1401170 1410373 1419595 1430859 1442421 1452411 1463634 1479473 1497807 1514631 1531033
$$ packed form
58401A085922M5m04O19K249K366J457J555K285J853Q32J011J578N36j193j396
58386A099315q36j457j817O67M281N122L564L237M497M538L349L788N945O977
58372A141170O528O942Q122P451M885K928J758n41l227l735k915l894o068n893
58358A153511l405k167k789k392n23M65J008M122R235J2249J2359J2893J4956
58345A209522J6188J6302J7733K0169K0443J8498J7549J7805J6166J2591J0313
58334A393279R236N709l39m672o032p481r562r120o217n140o981p818n890l975
58320A334997l176j139K015K914J649K317N226N734K770J221L575O379P237Q295
58306A380014J0385J0771R203R222J1264J1562R990J1223J5839J8334J6824J6402
$$ plain form
58294 1531033 1550546 1571882 1590626 1606425 1622317 1638450 1652578 1665547 1680261 1696106 1710047
58283 1710047 1722216 1734970 1747577 1757330 1764623 1771319 1775547 1774115 1769062 1766005 1766901 1769919 1775127
58270 1775127 1784258 1795970 1807452 1819918 1836700 1856824 1876461 1895689 1917676 1942095 1965645
58259 1965645 1988328 2012937 2039025 2063679 2087629 2114306 2143519 2172448 2202162 2236370 2274102
58248 2274102 2310337 2343693 2376898 2409945 2439622 2465875 2491908 2517775 2540353 2559918 2580384
58237 2580384 2602951 2625836 2650131 2679307 2712814 2746676 2780428 2817016 2856062 2894033 2931092
58226 2931092 2971084 3014782 3059758 3106609 3158466 3214754 3272416 3332693 3399318 3470738 3542018
58215 3542018 3613866 3691382 3774143 3856330 3937002 4021464 4111609 4203413 4295077 4389418 4487133
$$ packed form
58294A531033J9513K1336J8744J5799J5892J6133J4128J2969J4714J5845J3941
58283A710047J2169J2754J2607R753P293O696M228j432n053l057Q96L018N208
58270A775127R131J1712J1482J2466J6782K0124J9637J9228K1987K4419K3550
58259A965645K2683K4609K6088K4654K3950K6677K9213K8929K9714L4208L7732
58248B274102L6235L3356L3205L3047K9677K6253K6033K5867K2578J9565K0466
58237B580384K2567K2885K4295K9176L3507L3862L3752L6588L9046L7971L7059
58226B931092L9992M3698M4976M6851N1857N6288N7662O0277O6625P1420P1280
58215C542018P1848P7516Q2761Q2187Q0672Q4462R0145R1804R1664R4341R7715
$$ plain form
58204 4487133 4585767 4686387 4793533 4907902 5026690 5151156 5285569 5428926 5576563 5729949
58194 5729949 5895755 6075309 6264445 6463857 6679684 6913535 7161843 7425231 7708314
58185 7708314 8010098 8325289 8655341 9007496 9383254 9779457 10200334 10655523 11145513
58176 11145513 11662009 12203416 12776830 13384395 14022353 14694913 15414053 16183366 16996986
58167 16996986 17856693 18774841 19758063 20803859 21915970 23107117 24384230 25748033
58159 25748033 27209940 28791445 30503492 32344217 34319082 36443349 38722673 41154147
58151 41154147 43751429 46547279 49568372 52832672 56376078 60255205 64519494 69211365
58143 69211365 74403195 80206983 86743477 94134861 102530064 112092810 122953367 135217259
$$ packed form
58204D487133R8634J00620J07146J14369J18788J24466J34413J43357J47637J53386
58194E729949J65806J79554J89136J99412K15827K33851K48308K63388K83083
58185G708314L01784L15191L30052L52155L75758L96203M20877M55189M89990
58176A1145513N16496N41407N73414O07565O37958O72560P19140P69313Q13620
58167A6996986Q59707R18148R83222J045796J112111J191147J277113J363803
58159B5748033J461907J581505J712047J840725J974865K124267K279324K431474
58151D1154147K597282K795850L021093L264300L543406L879127M264289M691871
58143F9211365N191830N803788O536494P391384Q395203R562746J0860557J2263892
$$ plain form
58135 135217259 149035565 164620581 182183509 201914660 224031054 248767403 276323233
58128 276323233 306928935 340872052 377942446 416250934 451504766 477991508 491032865
58121 491032865 489094765 474003594 449488739 419474323 387132825 354677154 323465150
58114 323465150 294207178 267224794 242653959 220518189 200744503 183219355 167861859
58107 167861859 154639329 143530063 134497977 127487333 122366270 118782015 116037555 113185391
58099 113185391 109386954 104297648 98148754 91472669 84753746 78281877 72198874 66565322
58091 66565322 61382105 56618888 52256338 48289107 44695372 41434211 38473960 35796890
58083 35796890 33375412 31169930 29153840 27318069 25647873 24116608 22705959 21411788
$$ packed form
58135A35217259J3818306J5585016J7562928J9731151K2116394K4736349K7555830
58128B76323233L0605702L3943117L7070394L8308488L5253832K6486742J3041357
58121D91032865j938100j5091171k4514855l0014416l2341498l2455671l1212004
58114C23465150k9257972k6982384k4570835k2135770j9773686j7525148j5357496
58107A67861859j3222530j1109266r032086p010644n121063l584255k744460k852164
58099A13185391l798437n089306o148894o676085o718923o471869o083003n633552
58091F6565322n183217m763217m362550l967231l593735l261161k960251k677070
58083C5796890k421478k205482k016090j835771j670196j531265j410649j294171
$$ plain form
58075 21411788 20225424 19127694 18106150 17160967 16289128 15478673 14722723 14023603 13378477
58066 13378477 12775367 12207725 11679113 11189347 10729515 10294702 9888057 9507359 9140307
58057 9140307 8778481 8424630 8081646 7745864 7416301 7099517 6799781 6513888 6240264
58048 6240264 5983582 5745609 5520579 5304278 5099216 4906704 4722294 4543244 4372340
58039 4372340 4210393 4052968 3898264 3750249 3610303 3473916 3339532 3212573 3096488
58030 3096488 2987515 2882485 2784055 2693737 2607285 2522047 2441978 2370280 2303329 2236781 2171637
58019 2171637 2109371 2046954 1981993 1917755 1858079 1801749 1746458 1693912 1646435 1602434 1559542
58008 1559542 1518847 1482252 1448949 1417834 1390112 1366445 1344727 1323378 1303634 1286331 1269854
$$ packed form
58075B1411788j186364j097730j021544r45183q71839q10455p55950o99120o45126
58066A3378477o03110n67642n28612m89766m59832m34813m06645l80698l67052
58057I140307l61826l53851l42984l35782l29563l16784k99736k85893k73624
58048F240264k56682k37973k25030k16301k05062j92512j84410j79050j70904
58039D372340j61947j57425j54704j48015j39946j36387j34384j26959j16085
58030C096488j08973j05030r8430r0318q6452q5238q0069p1698o6951o6548o5144
58019B171637o2266o2417o4961o4238n9676n6330n5291n2546m7477m4001m2892
58008A559542m0695l6595l3303l1115k7722k3667k1718k1349j9744j7303j6477
$$ plain form
57997 1269854 1253326 1238042 1223706 1207234 1187475 1167186 1148298 1129287 1109297 1090584 1074619
57986 1074619 1060019 1046580 1036954 1031732 1027142 1020342 1012960 1006767 1000015 990997 981397 973108 965242
57973 965242 957033 950164 945497 940932 935179 930266 927777 925984 923283 921045 920485 920037 918354 916583 915236
57958 915236 912318 907080 902087 898830 894829 887919 879952 873186 866330 857400 847360 837637 826943 814013
57944 814013 800892 790150 780935 770913 760018 749472 739189 729023 720664 715525 712319 708930
57932 708930 705025 701031 696769 692962 691671 693286 695607 697768 702152 710136 718975 725591 730634 736018
57918 736018 741139 744605 747210 749938 751206 749356 746147 744741 745650 747213 748373 748484 746373 742330 739255
57903 739255 739125 739978 738895 736023 733031 729651 724868 719765 715994 712839 708811 704775 702374 700601 697147
$$ packed form
57997A269854j6528j5284j4336j6472j9759k0289j8888j9011j9990j8713j5965
57986A074619j4600j3439r626n222m590o800p382o193o752r018r600q289p866
57973I65242q209o869m667m565n753m913k489j793k701k238n60m48j683j771j347
57958I15236k918n238m993l257m001o910p967o766o856q930j0040r723j0694j2930
57944H14013j3121j0742r215j0022j0895j0546j0283j0166q359n139l206l389
57932G08930l905l994m262l807j291J615K321K161M384P984Q839O616N043N384
57918G36018N121L466K605K728J268j850l209j406R09J563J160J11k111m043l075
57903G39255j30Q53j083k872k992l380m783n103l771l155m028m036k401j773l454
$$ plain form
57888 697147 692305 688440 686269 684580 683173 683228 684923 687079 689090 691233 693349 694982 696420 698005 699002
57873 699002 698557 696904 694180 689262 681444 672107 662887 653377 642512 631024 620570 611420 602909 595045
57859 595045 587776 579897 570806 562305 556570 553329 551092 549907 550634 552560 554424 557172 563081 572399
57845 572399 583126 593906 604953 616184 626517 635289 642753 649123 654417 659075 663468 666970 668634
57832 668634 668359 666477 663059 658859 655838 654991 654377 651053 644455 636293 627827 619232 611256 605341 601661
57817 601661 598547 594329 588816 582845 577240 572423 568431 565206 563090 562689 564115 566922 570934 576322
57803 576322 582771 589671 597294 606424 616481 625468 632317 637783 642548 646095 648083 648973 648524 645579
57789 645579 640339 634958 630791 626901 622261 617281 611965 604930 595843 586685 578889 571394 563331 556288
$$ packed form
57888F97147m842l865k171j689j407N5J695K156K011K143K116J633J438J585R97
57873F99002m45j653k724m918p818r337r220r510j0865j1488j0454r150q511p864
57859E95045p269p879r091q501n735l241k237j185P27J926J864K748N909R318
57845E72399J0727J0780J1047J1231J0333Q772P464O370N294M658M393L502J664
57832F68634k75j882l418m200l021q47o14l324o598q162q466q595p976n915l680
57817F01661l114m218n513n971n605m817l992l225k116m01J426K807M012N388
57803E76322O449O900P623R130J0057Q987O849N466M765L547J988Q90m49k945
57789F45579n240n381m167l890m640m980n316p035r087r158p796p495q063p043
$$ plain form
57775 556288 551681 548006 543127 537467 532488 527823 522473 517104 512344 506231 496302 483229 469782 457168
57761 457168 444812 432621 420912 409129 397128 386628 378932 372390 364791 357012 351471 348186 345449
57748 345449 343285 342853 343203 342224 340517 340821 343649 346833 349455 352871 357363 360994 362590 363113 363405 363122
57732 363122 362635 363566 366617 370902 375864 381822 388436 394837 401501 409605 418301 425095 429328 432705 435894
57717 435894 437217 435468 431564 426546 420246 412745 404803 396014 385026 372700 362549 356562 352705
57704 352705 348041 342383 337318 333465 330549 328832 328682 329499 330349 331016 331691 332541 334197 337467 341995 346455
57688 346455 350649 355937 362907 370304 377168 384385 392924 401909 409755 416126 421687 427006 432703 439429
57674 439429 446514 451738 453757 453977 455011 458028 462572 467949 473670 479342 485317 492831 502533 513546
$$ packed form
57775E56288m607l675m879n660m979m665n350n369m760o113r929j3073j3447j2614
57761D57168j2356j2191j1709j1783j2001j0500p696o542p599p779n541l285k737
57748C45449k164m32L50r79j707L04K828L184K622L416M492L631J596N23K92k83
57732C63122m87R31L051M285M962N958O614O401O664Q104Q696O794M233L377L189
57717D35894J323j749l904n018o300p501p942q789j0988j2326j0151n987l857
57704C52705m664n658n065l853k916j717j50Q17Q50O67O75Q50J656L270M528M460
57688C46455M194N288O970P397O864P217Q539Q985P846O371N561N319N697O726
57674D39429P085N224K019K20J034L017M544N377N721N672N975P514R702J1013
$$ plain form
57660 513546 524908 537081 550833 565318 578785 591022 603910 619393 637727 657764 678213
57649 678213 698428 718342 738004 757304 776384 796244 818471 844211 873656 906437 942048
57638 942048 979978 1020082 1062823 1108538 1156614 1206133 1257315 1311513 1369831 1432690 1500791
57627 1500791 1575409 1657510 1747461 1845827 1953581 2071379 2199576 2339200 2492031 2659554
57617 2659554 2842743 3042935 3261725 3499654 3755970 4029899 4321009 4627875 4947107
57608 4947107 5273317 5597801 5905846 6176463 6386902 6519350 6565815 6529636 6423286 6262773
57598 6262773 6061726 5829785 5575486 5308630 5038984 4773877 4517918 4274013 4043778
57589 4043778 3827931 3627351 3443304 3276200 3125054 2988853 2867464 2760442 2665964 2582006
$$ packed form
57660E13546J1362J2173J3752J4485J3467J2237J2888J5483J8334K0037K0449
57649F78213K0215J9914J9662J9300J9080J9860K2227K5740K9445L2781L5611
57638I42048L7930M0104M2741M5715M8076M9519N1182N4198N8318O2859O8101
57627A500791P4618Q2101Q9951R8366J07754J17798J28197J39624J52831J67523
57617B659554J83189K00192K18790K37929K56316K73929K91110L06866L19232
57608D947107L26210L24484L08045K70617K10439J32448M6465l6179j06350j60513
57598F262773k01047k31941k54299k66856k69646k65107k55959k43905k30235
57589D043778k15847k00580j84047j67104j51146j36201j21389j07022r4478q3958
$$ plain form
57579 2582006 2507987 2444319 2390938 2347114 2312221 2285934 2268074 2258758 2258082 2265204 2278594 2297920
57567 2297920 2324744 2360415 2404063 2453762 2509084 2571281 2641362 2719278 2805087 2899984 3005965
57556 3005965 3124895 3257674 3403684 3561098 3728115 3903545 4085616 4270594 4453310
57547 4453310 4628789 4792567 4939413 5062501 5154259 5208065 5219670 5188002 5115154 5005557
57537 5005557 4864881 4699367 4515537 4319768 4117645 3913414 3709921 3509167 3313193
57528 3313193 3124329 2944419 2774121 2613518 2463279 2324564 2197679 2081382 1973776
57519 1973776 1873687 1781180 1697015 1621509 1553683 1491699 1434367 1381735 1333852 1289743 1248448
57508 1248448 1210367 1176400 1146242 1118749 1093619 1071374 1051960 1034790 1019884 1007379 996115
$$ packed form
57579B582006p4019o3668n3381m3824l4893k6287j7860r316o76P122J3390J9326
57567B297920K6824L5671M3648M9699N5322O2197P0081P7916Q5809R4897J05981
57556C005965J18930J32779J46010J57414J67017J75430J82071J84978J82716
57547D453310J75479J63778J46846J23088R1758N3806J1605l1668p2848j09597
57537E005557j40676j65514j83830j95769k02123k04231k03493k00754j95974
57528C313193j88864j79910j70298j60603j50239j38715j26885j16297j07606
57519A973776j00089r2507q4165p5506o7826o1984n7332n2632m7883m4109m1295
57508A248448l8081l3967l0158k7493k5130k2245j9414j7170j4906j2505j1264
$$ plain form
57497 996115 984607 973526 965298 960945 959311 959739 963175 969685 977227 984414 992618 1003706 1017445
57484 1017445 1032971 1051146 1073159 1097864 1122989 1148474 1176370 1207596 1240951 1275648 1312960
57473 1312960 1354646 1400953 1450878 1503685 1559718 1620090 1685834 1757264 1834374 1917835 2008869
57462 2008869 2107898 2214289 2327901 2449621 2579471 2715315 2854584 2996030 3138203 3277149
57452 3277149 3407491 3525178 3627359 3709986 3767793 3796949 3796237 3765634 3705675 3618789 3509787
57441 3509787 3384195 3246947 3102803 2956561 2812000 2671294 2535846 2406967 2285633
57432 2285633 2172488 2068316 1973590 1887544 1808807 1737231 1674092 1620230 1575050 1537436 1506392
57421 1506392 1480533 1458403 1440029 1426973 1420101 1418393 1420747 1427838 1441209 1461386 1487845 1520040
$$ packed form
57497I96115j1508j1081q228m353j634M28L436O510P542P187Q204J1088J3739
57484A017445J5526J8175K2013K4705K5125K5485K7896L1226L3355L4697L7312
57473A312960M1686M6307M9925N2807N6033O0372O5744P1430P7110Q3461R1034
57462B008869R9029J06391J13612J21720J29850J35844J39269J41446J42173J38946
57452C277149J30342J17687J02181Q2627N7807K9156p12l0603n9959q6886j09002
57441C509787j25592j37248j44144j46242j44561j40706j35448j28879j21334
57432B285633j13145j04172r4726q6046p8737p1576o3139n3862m5180l7614l1044
57421A506392k5859k2130j8374j3056o872j708K354P091J3371K0177K6459L2195
$$ plain form
57409 1520040 1557379 1598909 1644271 1694634 1751728 1816210 1887838 1966848 2054102 2149982 2253970
57398 2253970 2365229 2482841 2605435 2731312 2858960 2986879 3112734 3232766 3341660
57389 3341660 3432741 3499178 3536171 3542137 3517467 3462875 3379849 3272088 3144953 3003296 2850804
57378 2850804 2691381 2529613 2369318 2212716 2061539 1917778 1782506 1655030 1534475
57369 1534475 1421682 1318380 1224799 1139298 1060271 987361 920626 859486 802949 750344 701426
57358 701426 656140 614525 576540 541876 510232 481712 456324 433040 410068 386419 362660
57347 362660 339762 317883 296865 277321 260181 245223 230903 215950 200631 186166 173272
57336 173272 161628 150583 140027 130440 122242 115278 109126 103741 99398 95814 91773 86109 78960
$$ packed form
57409A520040L7339M1530M5362N0363N7094O4482P1628P9010Q7254R5880J03988
57398B253970J11259J17612J22594J25877J27648J27919J25855J20032J08894
57389C341660R1081O6437L6993N966k4670n4592q3026j07761j27135j41657j52492
57378B850804j59423j61768j60295j56602j51177j43761j35272j27476j20555
57369A534475j12793j03302r3581q5501p9027p2910o6735o1140n6537n2605m8918
57358G01426m5286m1615l7985l4664l1644k8520k5388k3284k2972k3649k3759
57347C62660k2898k1879k1018j9544j7140j4958j4320j4953j5319j4465j2894
57336A73272j1644j1045j0556r587q198o964o152n385m343l584m041n664p149
$$ plain form
57323 78960 71685 65510 60604 56502 53007 50339 48527 46928 44595 41240 37748 35421 34623 34339 33232
57308 33232 30845 27620 24083 20419 16667 12892 9143 5472 1889 -1829 -6021 -10396 -13738 -14907
57294 -14907 -14167 -12936 -12243 -11875 -11134 -9747 -7677 -4517 230 6310 12636 18449 24330 31645 40735 50019
57278 50019 57465 62927 68379 75583 84197 92653 100168 106982 113086 117942 121629 125321 130235 136738
57264 136738 144753 154284 165048 176155 186821 197211 208145 220112 232843 245695 258174 270215
57252 270215 282080 293803 304768 314357 323235 333368 346126 360768 375451 389587 404317 420555
57240 420555 437518 453870 469756 486699 505482 525062 544013 562378 581385 601739 623078
57229 623078 645106 668283 692979 718673 744726 771589 800608 832694 867626 904558 942653
$$ packed form
57323G8960p275o175m906m102l495k668j812j599k333l355l492k327p98k84j107
57308C3232k387l225l537l664l752l775l749l671A889a829m192m375l342j169
57294a4907P40J231O93L68P41J387K070L160B30O080O326N813N881P315R090R284
57278E0019P446N462N452P204Q614Q456P515O814O104M856L687L692M914O503
57264A36738Q015R531J0764J1107J0666J0390J0934J1967J2731J2852J2479J2041
57252B70215J1865J1723J0965R589Q878J0133J2758J4642J4683J4136J4730J6238
57240D20555J6963J6352J5886J6943J8783J9580J8951J8365J9007K0354K1339
57229F23078K2028K3177K4696K5694K6053K6863K9019L2086L4932L6932L8095
$$ plain form
57218 942653 981122 1019211 1056480 1093005 1128962 1163866 1196169 1223794 1245369 1260930 1271235
57207 1271235 1276414 1275679 1268408 1255044 1236710 1214270 1187950 1157693 1123922 1088377 1054027 1023230
57195 1023230 995751 969495 943658 920189 901465 887497 876493 867348 860148 854580 849456 844223
57183 844223 839758 837130 836221 836099 836229 836841 838305 840507 842890 845116 847543 850707 854330 857418 859621
57168 859621 861912 865502 870695 877189 884606 891928 897328 899930 901304 903937 908405 913335 917924 922870
57154 922870 928461 933318 936079 937524 940090 945640 954261 964892 976443 988412 1000974 1014761 1030535
57141 1030535 1048971 1070449 1094798 1121255 1148776 1176498 1204194 1232776 1264259 1300473 1341481
57130 1341481 1385808 1432476 1482181 1536064 1593993 1654547 1716215 1778182 1840357 1902837 1964819
$$ packed form
57218I42653L8469L8089L7269L6525L5957L4904L2303K7625K1575J5561J0305
57207A271235N179p35p271j3364j8334k2440k6320l0257l3771l5545l4350l0797
57195A023230k7479k6256k5837k3469j8724j3968j1004r145p200n568n124n233
57183H44223m465k628r09j22J30O12J464K202K383K226K427L164L623L088K203
57168H59621K291L590N193O494P417P322N400K602J374K633M468M930M589M946
57154I22870N591M857K761J445K566N550Q621J0631J1551J1969J2562J3787J5774
57141A030535J8436K1478K4349K6457K7521K7722K7696K8582L1483L6214M1008
57130A341481M4327M6668M9705N3883N7929O0554O1668O1967O2175O2480O1982
$$ plain form
57119 1964819 2024215 2079284 2130615 2180013 2227267 2269734 2305688 2336121 2362430 2384585 2403141
57108 2403141 2420843 2439953 2459500 2477440 2494107 2511016 2527480 2541317 2552295 2562076 2571063 2578065
57096 2578065 2583061 2587592 2591936 2594217 2592924 2588465 2581818 2573408 2563883 2554529 2546468 2540252 2535803 2531306
57082 2531306 2522729 2506135 2480344 2446040 2403161 2351075 2290506 2222928 2148348 2065595 1974332
57071 1974332 1874786 1766201 1647707 1519861 1382766 1233105 1065178 874237 656755 408909
57061 408909 127670 -187767 -538729 -930035 -1367280 -1852619 -2387060 -2975865 -3628094 -4352474
57051 -4352474 -5158364 -6059805 -7073936 -8216083 -9500946 -10947744 -12579489 -14418121
57043 -14418121 -16485110 -18805504 -21406855 -24317386 -27572755 -31223902 -35332944 -39965098
$$ packed form
57119A964819N9396N5069N1331M9398M7254M2467L5954L0433K6309K2155J8556
57108B403141J7702J9110J9547J7940J6667J6909J6464J3837J0978R781Q987P002
57096B578065M996M531M344K281j293m459o647q410r525r354q061o216m449m497
57082B531306q577j6594k5791l4304m2879n2086o0569o7578p4580q2753r1263
57071A974332r9546j08585j18494j27846j37095j49661j67927j90941k17482k47846
57061D08909A27670a87767l50962l91306m37245m85339n34441n88805o52229p24380
57051d352474q05890r01441j014131j142147j284863j446798j631745j838632
57043a4418121k066989k320394k601351k910531l255369l651147m109042m632154
$$ plain form
57035 -39965098 -45192438 -51101018 -57782358 -65317131 -73771866 -83201728 -93641886 -105101252
57027 -105101252 -117569560 -130992273 -145182926 -159774368 -174350749 -188686401 -202786083
57020 -202786083 -216559181 -229390481 -240058314 -247130707 -249525404 -246849664 -239414543
57013 -239414543 -228051121 -213864241 -197995360 -181450478 -165023063 -149277242 -134541688
57006 -134541688 -120922274 -108367391 -96766807 -86024261 -76080218 -66909855 -58515609
56999 -58515609 -50909807 -44091496 -38035998 -32700280 -28028878 -23955525 -20409542 -17325959
56991 -17325959 -14647635 -12319941 -10290297 -8513631 -6953119 -5575302 -4349176 -3249889
56983 -3249889 -2258453 -1357494 -531309 230221 932067 1578031 2170294 2705624 3177254
$$ packed form
57035c9965098n227340n908580o681340p534773q454735r429862j0440158j1459366
57027a05101252j2468308j3422713j4190653j4591442j4576381j4335652j4099682
57020b02786083j3773098j2831300j0667833p072393k394697K675740P435121
57013b39414543J1363422J4186880J5868881J6544882J6427415J5745821J4735554
57006a34541688J3619414J2554883J1600584J0742546R944043R170363Q394246
56999e8515609P605802O818311O055498N335718M671402M073353L545983L083583
56991a7325959K678324K327694K029644J776666J560512J377817J226126J099287
56983c249889R91436R00959e31309B30221P01846O45964N92263N35330M71630
$$ plain form
56974 3177254 3582000 3923337 4208579 4446995 4650104 4829206 4991394 5140178 5279354
56965 5279354 5413029 5542378 5665868 5782737 5893345 5996703 6090995 6176756 6256939 6333963
56955 6333963 6408692 6481245 6550468 6613970 6671300 6725335 6777861 6826808 6872026 6920155 6976032
56944 6976032 7029104 7055343 7035482 6968013 6864238 6736388 6592742 6438788 6277975 6112352
56934 6112352 5944600 5778347 5615692 5456358 5299781 5145511 4990867 4831153 4663759
56925 4663759 4490126 4312935 4133984 3955830 3782715 3617980 3462378 3316084 3180220
56916 3180220 3054938 2937919 2826533 2720157 2619055 2522269 2427966 2335045 2243643 2154986
56906 2154986 2071210 1994265 1924524 1861357 1804827 1755305 1711759 1672500 1637742 1609142 1586215
$$ packed form
56974C177254M04746L41337K85242K38416K03109J79102J62188J48784J39176
56965E279354J33675J29349J23490J16869J10608J03358R4292Q5761Q0183P7024
56955F333963P4729P2553O9223O3502N7330N4035N2526M8947M5218M8129N5877
56944F976032N3072K6239j9861o7469j03775j27850j43646j53954j60813j65623
56934F112352j67752j66253j62655j59334j56577j54270j54644j59714j67394
56925D663759j73633j77191j78951j78154j73115j64735j55602j46294j35864
56916C180220j25282j17019j11386j06376j01102r6786r4303r2921r1402q8657
56906B154986q3776p6945o9741o3167n6530m9522m3546l9259l4758k8600k2927
$$ plain form
56895 1586215 1565215 1542236 1515600 1484920 1450204 1412844 1375373 1338938 1302545 1265612 1229492
56884 1229492 1195558 1163580 1133057 1104439 1077887 1052423 1027628 1004899 985874 970774 959177
56873 959177 951163 946631 944636 944302 945072 945117 940929 929882 912454 890928 866702 839796 810201 778801
56859 778801 747444 718512 693616 672201 652194 632331 612970 594581 576858 559819 544462
56848 544462 531622 521141 512540 505341 498324 489826 479492 468618 458218 447892 437165 426725
56836 426725 417629 410195 404141 398801 392891 385356 376865 369242 363022 357003 350639 345188 341596 338725
56822 338725 334817 329607 324020 318805 314433 311525 310480 311158 313356 316983 321757 327795 336521 349596
56808 349596 366648 385470 404869 425945 450240 478260 510315 547106 588562 633223 679072
$$ packed form
56895A586215k1000k2979k6636l0680l4716l7360l7471l6435l6393l6933l6120
56884A229492l3934l1978l0523k8618k6552k5464k4795k2729j9025j5100j1597
56873I59177q014m532j995l34P70M5m188j1047j7428k1526k4226k6906k9595l1400
56859G78801l1357k8932k4896k1415k0007j9863j9361j8389j7723j7039j5357
56848E44462j2840j0481q601p199p017q498j0334j0874j0400j0326j0727j0440
56836D26725r096p434o054n340n910p535q491p623o220o019o364n451l592k871
56822C38725l908n210n587n215m372k908j045O78K198L627M774O038Q726J3075
56808C49596J7052J8822J9399K1076K4295K8020L2055L6791M1456M4661M5849
$$ plain form
56797 679072 723472 761967 789255 802482 802514 791896 773510 751393 729978 711027 693345 676739
56785 676739 664060 657846 657309 660576 667835 680104 696817 717270 743130 776956 818965 867359
56773 867359 920802 977924 1034593 1083765 1118368 1133650 1128144 1104581 1069369 1029112 987219 944649
56761 944649 902796 863981 829808 800847 777557 760019 747358 739071 736431 741001 752318 768767
56749 768767 790142 817265 849211 882681 914057 940364 958389 964994 959070 942035 916143 883401
56737 883401 846128 807190 769105 733631 702121 675375 653203 635080 621078 611296 604764 600130
56725 600130 597345 597619 601763 609513 620196 632875 645817 656822 664272 667263 665034 657125 643942
56712 643942 626541 606096 584029 561934 540519 519321 498259 478644 461604 446403 431589
$$ packed form
56797F79072M4400L8495K7288J3227L2j0618j8386k2117k1415j8951j7682j6606
56785F76739j2679o214n37L267P259J2269J6713K0453K5860L3826M2009M8394
56773H67359N3443N7122N6669M9172L4603J5282n506k3563l5212m0257m1893m2570
56761I44649m1853l8815l4173k8961k3290j7538j2661q287k640M570J1317J6449
56749G68767K1375K7123L1946L3470L1376K6307J8025O605n924j7035k5892l2742
56737H83401l7273l8938l8085l5474l1510k6746k2172j8123j4002r782o532m634
56725F00130k785K74M144P750J0683J2679J2942J1005P450K991k229p909j3183
56712F43942j7401k0445k2067k2095k1415k1198k1062j9615j7040j5201j4814
$$ plain form
56701 431589 417061 403722 391903 381634 373714 368742 365515 362009 357687 353472 349967 347243 345816
56688 345816 345943 346208 344655 341247 337558 334280 330885 327623 325825 325937 327025 328518 330798 333770 336488
56673 336488 338523 340198 341140 340145 336860 332256 327295 322537 319046 317849 318110 317586 315477 313193 311910
56658 311910 311057 309867 308595 307287 304962 301148 296998 293886 291898 290514 289608 288982 287959 286256 284359
56643 284359 282470 280108 277317 274903 272833 269761 265146 260593 257935 256990 256407 255829 255910 256749 257592 257924
56627 257924 258023 258564 260219 263317 267383 271332 274476 277033 279560 282481 286203 290793 295356 298674 300851
56612 300851 303381 307133 311210 314247 315915 316647 316897 317316 318662 320741 322162 321872 320390 319090 318888
56597 318888 319951 321768 323067 322640 320871 319479 319215 318870 317238 314926 313217 312199 311242 310631 311318 313333
$$ packed form
56701D31589j4528j3339j1819j0269p920m972l227l506m322m215l505k724j427
56688C45816J27K65j553l408l689l278l395l262j798J12J088J493K280K972K718
56673C36488K035J675R42r95l285m604m961m758l491j197K61n24k109k284j283
56658C11910q53j190j272j308k325l814m150l112j988j384r06o26j023j703j897
56643B84359j889k362k791k414k070l072m615m553k658r45n83n78Q1Q39Q43L32
56627B57924R9N41J655L098M066L949L144K557K527K921L722M590M563L318K177
56612C00851K530L752M077L037J668P32K50M19J346K079J421k90j482j300k02
56597C18888J063J817J299m27j769j392k64l45j632k312j709j018r57o11O87K015
$$ plain form
56581 313333 315502 316813 317343 317801 318619 319479 319549 318386 316543 314883 313474 311921 310535 309981 309723 308315
56565 308315 305669 303540 303020 302916 301636 299499 297964 297580 297922 298734 299828 300394 299617 297633 294957 291528
56549 291528 287336 283492 281511 281697 283094 284754 286189 286963 286857 286401 286476 287344 288560 289639 290284 290273 289750
56532 289750 289506 290446 292743 295682 298126 299100 298420 296911 295645 294950 294720 295443 297731 300747 302458 302126
56516 302126 301491 302739 306157 310469 314520 317909 320756 323644 327219 331299 335076 338448 342170 346326
56502 346326 349907 352539 355362 359400 364244 369097 373857 378271 381379 382943 384252 386459 389262 392205
56488 392205 395835 400315 404370 407119 409574 412699 415329 415863 414768 413394 411508 408297 404884 403299
56474 403299 403422 403226 401797 399788 397225 393311 388563 384854 382888 381527 379909 378367 376945 374872 372112
$$ packed form
56581C13333K169J311N30M58Q18Q60P0j163j843j660j409j553j386n54k58j408
56565C08315k646k129n20j04j280k137j535l84L42Q12J094N66p77j984k676l429
56549B91528m192l844j981J86J397J660J435P74j06m56P5Q68J216J079O45j1n23
56532B89750k44R40K297K939K444R74o80j509j266o95k30P23K288L016J711l32
56516C02126o35J248L418M312M051L389K847K888L575M080L777L372L722M156
56502C46326L581K632K823M038M844M853M760M414L108J564J309K207K803K943
56488C92205L630M480M055K749K455L125K630N34j095j374j886l211l413j585
56474D03299J23j96j429k009k563l914m748l709j966j361j618j542j422k073k760
$$ plain form
56459 372112 369705 368051 366298 363925 361555 359768 358442 357622 357637 357994 357452 355608 353244 350830 347969
56444 347969 344515 340969 337547 334216 331667 330730 330663 329810 328327 328323 330522 332600 332007 329093 326279 325217
56428 325217 325872 327438 329092 330455 332148 335270 339779 344121 347082 349264 352070 355902 359934 363072
56414 363072 364625 364659 364173 364538 366435 369725 374219 379714 385421 390457 395109 400514 406841 412895 417894
56399 417894 422476 427541 433151 439096 445433 451859 457440 461636 464830 467474 469546 471176 472808 474277
56385 474277 474641 473406 471048 467981 464040 459385 454826 450714 446572 442325 438737 435939 432705 428097
56371 428097 422877 418420 414972 411752 408031 403363 397557 391310 386308 383929 384116 385834 387933 389327
56357 389327 389306 388313 387644 387825 388081 387826 387652 388197 389054 389646 390410 392105 394519 396609 397551 397159 395785 394213
$$ packed form
56459C72112k407j654j753k373k370j787j326q20J5L57n42j844k364k414k861
56444C47969l454l546l422l331k549r37o7q53j483mK199K078n93k914k814j062
56428C25217O55J566J654J363J693L122M509M342K961K182K806L832M032L138
56414C63072J553L4m86L65J897L290M494N495N707N036M652N405O327O054M999
56399D17894M582N065N610N945O337O426N581M196L194K644K072J630J632J469
56385D74277L64j235k358l067l941m655m559m112m142m247l588k798l234m608
56371D28097n220m457l448l220l721m668n806o247n002k379J87J718K099J394
56357C89327k1r93o69J81K56k55j74N45Q57N92P64J695K414K090R42l92j374j572
$$ plain form
56339 394213 393014 391667 389068 385251 381632 379152 377146 374705 372164 370603 370639 372294 375168 378270 380619
56324 380619 382517 385131 388357 390482 390776 390986 393019 396350 399013 400228 400694 401168 402150 404401 408294
56309 408294 412860 416520 418546 419099 418540 417711 418256 421407 426610 432179 436982 440858 444044 447120 450962
56294 450962 455737 460290 463408 465312 467198 469850 473433 478038 483433 488750 493306 497357 501406 505333
56280 505333 508920 512469 516006 518713 520315 522304 526384 532032 536951 539906 542048 545420 550918 557694
56266 557694 563889 568184 571234 575399 582521 592264 602926 613194 622526 630723 638193 646174 655732 666755
56252 666755 678451 690317 702114 713762 726042 740474 757420 775076 791471 806754 822218
56241 822218 837677 851360 862278 871373 880188 889363 898549 907014 914305 920840 927734 935625 944037
$$ packed form
56339C94213j199j347k599l817l619k480k006k441k541j561L6J655K874L102K349
56324C80619J898K614L226K125K94K10K033L331K663J215M66M74R82K251L893
56309D08294M566L660K026N53n59q29N45L151N203N569M803L876L186L076L842
56294D50962M775M553L118J904J886K652L583M605N395N317M556M051M049L927
56280E05333L587L549L537K707J602J989M080N648M919K955K142L372N498O776
56266E57694O195M295L050M165P122R743J0662J0268R332Q197P470P981R558J1023
56252F66755J1696J1866J1797J1648J2280J4432J6946J7656J6395J5283J5464
56241H22218J5459J3683J0918R095Q815R175R186Q465P291O535O894P891Q412
$$ plain form
56228 944037 952398 961146 971194 982891 996227 1011582 1029451 1049745 1071949 1095721 1121002 1148201
56216 1148201 1178563 1213529 1253180 1296188 1341786 1390762 1444008 1501351 1562688 1629015 1701331
56205 1701331 1779625 1864000 1955653 2055735 2164429 2282266 2410861 2550906 2700829 2859106
56195 2859106 3026592 3204634 3391971 3585624 3784053 3987123 4193276 4398697 4599134
56186 4599134 4790811 4969754 5131881 5273781 5392399 5484643 5548878 5586349 5599620 5590166
56176 5590166 5558919 5508333 5441884 5361959 5270068 5168716 5061038 4948642 4831557 4710217
56166 4710217 4585771 4458574 4328049 4194084 4057117 3917043 3773588 3627701 3481219
56157 3481219 3335379 3190942 3049270 2911827 2779085 2651342 2529898 2415693 2307551
$$ packed form
56228I44037Q361Q748J0048J1697J3336J5355J7869K0294K2204K3772K5281K7199
56216A148201L0362L4966L9651M3008M5598M8976N3246N7343O1337O6327P2316
56205A701331P8294Q4375R1653J00082J08694J17837J28595J40045J49923J58277
56195B859106J67486J78042J87337J93653J98429K03070K06153K05421K00437
56186D599134J91677J78943J62127J41900J18618R2244O4235L7471J3271r454
56176E590166l1247n0586o6449p9925r1891j01352j07678j12396j17085j21340
56166D710217j24446j27197j30525j33965j36967j40074j43455j45887j46482
56157C481219j45840j44437j41672j37443j32742j27743j21444j14205j08142
$$ plain form
56148 2307551 2203699 2104475 2011626 1925655 1845996 1773120 1707975 1649657 1596085 1546833 1502880
56137 1502880 1463677 1426983 1391798 1359101 1329470 1302319 1277704 1256531 1238527 1222125 1206710
56126 1206710 1192914 1180562 1168582 1157174 1147794 1140793 1135400 1132079 1132068 1134295 1135917 1136844 1140576 1149144
56112 1149144 1160090 1170358 1180697 1193999 1211115 1230559 1250980 1271926 1293104 1314681 1337732
56101 1337732 1363054 1390080 1417903 1446669 1477016 1508829 1541495 1574885 1609362 1645075 1681643
56090 1681643 1718352 1754774 1791716 1831254 1875241 1924312 1979120 2041566 2113482 2194925 2285466
56079 2285466 2386415 2499927 2626506 2765281 2915822 3077053 3244523 3411281 3571630
56070 3571630 3722297 3860692 3985066 4096565 4198383 4292183 4377045 4451328 4512660 4556208
$$ packed form
56148B307551j03852r9224r2849q5971p9659p2876o5145n8318n3572m9252m3953
56137A502880l9203l6694l5185l2697k9631k7151k4615k1173j8004j6402j5415
56126A206710j3796j2352j1980j1408r380p001n393l321j1K227J622R27L732Q568
56112A149144J0946J0268J0339J3302J7116J9444K0421K0946K1178K1577K3051
56101A337732K5322K7026K7823K8766L0347L1813L2666L3390L4477L5713L6568
56090A681643L6709L6422L6942L9538M3987M9071N4808O2446P1916Q1443R0541
56079B285466J00949J13512J26579J38775J50541J61231J67470J66758J60349
56070C571630J50667J38395J24374J11499J01818R3800Q4862P4283O1332M3548
$$ plain form
56060 4556208 4576484 4572236 4547595 4508020 4457191 4397502 4330094 4253117 4162285 4054235 3928046
56049 3928046 3784300 3625809 3459404 3293665 3133898 2981686 2839169 2710156 2596238
56040 2596238 2495247 2404735 2324136 2252738 2188858 2132356 2084953 2046811 2015422 1988938 1967842
56029 1967842 1952458 1941732 1935250 1933360 1934406 1935115 1934754 1935563 1938093 1939617 1938522 1936707 1936035 1935683 1934552
56014 1934552 1933187 1931894 1930101 1928810 1930361 1934686 1939311 1944133 1952303 1965185 1980612 1997503 2017687
56001 2017687 2041413 2065652 2089033 2113895 2141122 2167654 2191902 2217086 2246088 2277211 2308143
55990 2308143 2339826 2373060 2405520 2435884 2467257 2502889 2541973 2582855 2626651 2674284 2723749
55979 2723749 2773901 2827301 2885721 2946433 3006571 3067613 3131883 3198222 3264796 3332783 3403674
$$ packed form
56060D556208K0276m248k4641l9575n0829n9689o7408p6977r0832j08050j26189
56049C928046j43746j58491j66405j65739j59767j52212j42517j29013j13918
56040B596238j00991r0512q0599p1398o3880n6502m7403l8142l1389k6484k1096
56029A967842j5384j0726o482j890J046P09l61Q09K530J524j095j815o72l52j131
56014A934552j365j293j793j291J551M325M625M822Q170J2882J5427J6891K0184
56001B017687K3726K4239K3381K4862K7227K6532K4248K5184K9002L1123L0932
55990B308143L1683L3234L2460L0364L1373L5632L9084M0882M3796M7633M9465
55979B723749N0152N3400N8420O0712O0138O1042O4270O6339O6574O7987P0891
$$ plain form
55968 3403674 3476326 3550119 3627603 3710691 3797845 3888233 3984800 4090021 4202599 4321310 4447680
55957 4447680 4581810 4720666 4864008 5016850 5182403 5358038 5542002 5738105 5949308
55948 5949308 6172848 6406623 6654233 6918385 7195556 7483122 7785828 8109314 8453219
55939 8453219 8816615 9203845 9618482 10057812 10519955 11010006 11532348 12083769 12661616
55930 12661616 13271963 13922079 14611777 15340053 16112874 16936115 17808592 18731251 19715735
55921 19715735 20774766 21912148 23131789 24447737 25874378 27414864 29069491 30846254
55913 30846254 32752638 34788360 36959660 39291012 41810699 44537103 47492924 50719257
55905 50719257 54260294 58150256 62435944 67200537 72549624 78592699 85457801 93298999
$$ packed form
55968C403674P2652P3793P7484Q3088Q7154R0388R6567J05221J12578J18711J26370
55957D447680J34130J38856J43342J52842J65553J75635J83964J96103K11203
55948E949308K23540K33775K47610K64152K77171K87566L02706L23486L43905
55939H453219L63396L87230M14637M39330M62143M90051N22342N51421N77847
55930A2661616O10347O50116O89698P28276P72821Q23241Q72477R22659R84484
55921A9715735J059031J137382J219641J315948J426641J540486J654627J776763
55913C0846254J906384K035722K171300K331352K519687K726404K955821L226333
55905E0719257L541037L889962M285688M764593N349087O043075O865102P841198
$$ plain form
55897 93298999 102258098 112437292 123939626 136920119 151582231 168177548 187061459
55890 187061459 208698553 233526821 261809822 293570623 328334810 364427888 398331191
55883 398331191 425135936 440362714 441960526 430948083 410411927 383932123 354539974
55876 354539974 324411903 294935465 266890515 240680929 216523585 194510841 174612095
55869 174612095 156720178 140718474 126490920 113897074 102781484 93003440 84432301
55862 84432301 76924158 70329630 64519413 59383879 54818707 50733510 47068736 43785269
55854 43785269 40841817 38196069 35818279 33685205 31765232 30024092 28439858 26998369
55846 26998369 25678851 24456727 23315080 22240691 21214170 20217130 19245636 18305785
$$ packed form
55897I3298999Q959099J0179194J1502334J2980493J4662112J6595317J8883911
55890A87061459K1637094K4828268K8283001L1760801L4764187L6093078L3903303
55883C98331191K6804745J5226778J597812j1012443k0536156k6479804k9392149
55876C54539974l0128071k9476438k8044950k6209586k4157344k2012744j9898746
55869A74612095j7891917j6001704j4227554j2593846j1115590r778044q571139
55862H4432301p508143o594528n810217n135534m565172m085197l664774l283467
55854D3785269k943452k645748k377790k133074j919973j741140j584234j441489
55846B6998369j319518j222124j141647j074389j026521r97040r71494r39851
$$ plain form
55838 18305785 17400400 16530174 15702020 14923906 14194716 13509326 12869443 12278974 11732730
55829 11732730 11220411 10738619 10289071 9868276 9469118 9090020 8733074 8395632 8072885
55820 8072885 7766196 7479719 7210867 6952803 6704303 6468556 6244301 6026854 5816423
55811 5816423 5617153 5429250 5249718 5079227 4920300 4770190 4623525 4480840 4346517
55802 4346517 4219021 4090871 3957919 3821401 3681545 3536929 3390505 3248938 3114949
55793 3114949 2986221 2862030 2744876 2635301 2531182 2432679 2342216 2259075 2179506 2102754
55783 2102754 2031848 1967962 1908997 1854092 1804514 1759470 1715889 1673220 1634140 1599781 1568279
55772 1568279 1538628 1512176 1489759 1470746 1455114 1443279 1433916 1425007 1416558 1409339 1401833 1391622
$$ packed form
55838A8305785r05385q70226q28154p78114p29190o85390o39883n90469n46244
55829A1732730n12319m81792m49548m20795l99158l79098l56946l37442l22747
55820H072885l06689k86477k68852k58064k48500k35747k24255k17447k10431
55811E816423j99270j87903j79532j70491j58927j50110j46665j42685j34323
55802D346517j27496j28150j32952j36518j39856j44616j46424j41567j33989
55793C114949j28728j24191j17154j09575j04119r8503r0463q3141p9569p6752
55783B102754p0906o3886n8965n4905m9578m5044m3581m2669l9080l4359l1502
55772A568279k9651k6452k2417j9013j5632j1835r363q909q449p219p506j0211
$$ plain form
55760 1391622 1378562 1363234 1343940 1319167 1291296 1263560 1234946 1202897 1169415 1139002 1111498
55749 1111498 1082731 1052061 1023671 999934 978824 958697 940740 925577 911836 899258 889401
55738 889401 882372 876321 870617 866024 861630 855545 848927 845355 845699 847272 848209 848754 848100 844311 838132
55723 838132 832799 829247 825251 819898 814908 810775 805537 798273 789880 779567 764596 744794 723481
55710 723481 702762 681674 660233 641163 625761 611718 597130 583421 572300 562776 553200 543613
55698 543613 534252 524175 513011 501804 490856 479218 467424 457902 451337 445483 439056 433878 431380
55685 431380 429909 427749 426308 427763 431316 434051 434199 431738 427065 420774 413726 406183 397931 390013
55671 390013 384762 383103 383263 382997 381665 379507 376639 373635 371360 369271 365510 359464 352679 346564 340919
$$ packed form
55760A391622j3060j5328j9294k4773k7871k7736k8614l2049l3482l0413k7504
55749A111498k8767l0670k8390k3737k1110k0127j7957j5163j3741j2578r857
55738H89401p029o051n704m593m394o085o618l572L44J573R37N45o54l789o179
55723H38132n333l552l996n353m990m133n238p264q393j0313j4971j9802k1313
55710G23481k0719k1088k1441j9070j5402j4043j4588j3709j1121r524r576r587
55698E43613r361j0077j1164j1207j0948j1638j1794r522o565n854o427n178k498
55685D31380j471k160j441J455L553K735J48k461m673o291p048p543q252p918
55671C90013n251j659J60k66j332k158k868l004k275k089l761o046o785o115n645
$$ plain form
55656 340919 335423 330671 326826 323043 319171 316369 315076 314048 312320 310528 309426 308723 308344 309229 311780
55641 311780 314811 317007 318261 318811 318311 316484 313726 310450 306708 302711 298842 295263 292597 292447 295662
55626 295662 300608 305026 309101 314575 321297 327286 332075 337305 343844 351000 358683 367419 375857 381260
55612 381260 383277 384343 385579 385219 382006 377150 371752 365359 358450 353377 351087 349668 347888 347421 349482
55597 349482 351975 352436 351643 351813 353113 354490 356336 359648 363483 365539 364821 362211 359214 357342 357547
55582 357547 358844 358576 355301 350453 346190 343021 340461 338247 335547 330701 323401 315666 309182 303091
55568 303091 295905 288015 280588 273388 265540 257306 249390 241576 233722 227048 222707 219871 216770 212927
55554 212927 209071 205675 202804 200558 198530 195770 192212 189095 187085 185323 183309 182046 182074 182021 180709
$$ packed form
55656C40919n496m752l845l783l872k802j293j028j728j792j102p03l79Q85K551
55641C11780L031K196J254N50n00j827k758l276l742l997l869l579k666j50L215
55626B95662M946M418M075N474O722N989M789N230O539P156P683Q736Q438N403
55612C81260K017J066J236l60l213m856n398o393o909n073k290j419j780m67K061
55597C49482K493M61p93J70J300J377J846L312L835K056p18k610k997j872K05
55582C57547J297k68l275m848m263l169k560k214k700m846p300p735o484o091
55568C03091p186p890p427p200p848q234p916p814p854o674m341k836l101l843
55554B12927l856l396k871k246k028k760l558l117k010j762k014j263K8n3j312
$$ plain form
55539 180709 179226 179132 179888 179846 178714 177280 175589 173067 169753 166082 162204 158655 156583 156110 155624 153970
55523 153970 152093 151203 150596 148771 145427 141088 136187 131939 130407 131838 133518 133269 132573 134089 137536
55508 137536 140505 142199 143740 145538 146949 148081 149600 151053 151429 150966 150449 149325 146562 142775 139293
55493 139293 135828 131487 127444 125785 125811 124335 120017 114921 111273 109129 107972 108310 110549 113893 117331
55478 117331 120382 122380 122569 121523 120961 121455 121767 121148 120782 122007 124356 126499 128152 129943 132008 133739
55462 133739 134708 135264 136405 139247 144163 150153 155435 158820 160160 159666 157626 154950 153101 152923 153953
55447 153953 155253 156557 158117 159587 159625 156967 151904 146318 142014 139298 137469 136046 134564 131719 126309
55432 126309 119192 112773 108064 103718 98653 94014 91355 90198 88852 86755 84610 82853 81254 79640
$$ packed form
55539A80709j483r4P56m2j132j434j691k522l314l671l878l549k072m73m86j654
55523A53970j877q90o07j825l344m339m901m248j532J431J680k49o96J516L447
55508A37536K969J694J541J798J411J132J519J453L76m63n17j124k763l787l482
55493A39293l465m341m043j659K6j476m318n096l648k144j157L38K239L344L438
55478A17331L051J998J89j046n62M94L12o19l66J225K349K143J653J791K065J731
55462A33739R69N56J141K842M916N990N282L385J340m94k040k676j849j78J030
55447A53953J300J304J560J470L8k658n063n586m304k716j829j423j482k845n410
55432A26309p117o419m709m346n065m639k659j157j346k097k145j757j599j614
$$ plain form
55418 79640 78057 76595 75671 75687 75881 74678 71927 69400 68073 66540 63530 60394 59198 59641 59989 59898
55402 59898 60058 59940 58489 56550 56052 56946 57388 56973 57196 58361 58551 56614 54096 53047 53468 54057 54207
55385 54207 54153 54044 53792 53341 52529 51165 49510 48197 47673 48189 50026 52861 55338 56355 56476 56888 57326
55368 57326 56609 55107 54892 56958 59788 61273 60941 59746 58692 58319 58790 59949 61652 64036 66916 69314
55352 69314 70545 71492 73540 76365 78081 77625 75731 73465 71268 69768 70049 72199 74510 74912 72796
55337 72796 69268 66198 65057 65800 66676 65790 62943 59401 56239 53851 52679 53008 54053 54577 54538 54941
55321 54941 55992 56792 57020 57375 57947 57663 56040 54152 53014 52178 50871 49575 49368 50284 51288 51633 51551
55304 51551 51786 52822 54442 55818 56221 55610 54295 52362 50022 48119 47397 47358 46797 45428 44042 43102
$$ packed form
55418G9640j583j462r24J6J94j203k751k527j327j533l010l136j196M43L48r1
55402E9898J60j18j451j939m98Q94M42m15K23J165J90j937k518j049M21N89J50
55385E4207n4j09k52m51q12j364j655j313n24N16J837K835K477J017J21M12M38
55368E7326p17j502k15K066K830J485l32j195j054l73M71J159J703K384K880K398
55352F9314J231R47K048K825J716m56j894k266k197j500K81K150K311M02k116
55337G2796l528l070j141P43Q76q86k847l542l162k388j172L29J045N24l9M03
55321E4941J051Q00K28L55N72k84j623j888j138q36j307j296k07R16J004L45q2
55304E1551K35J036J620J376M03o11j315j933k340j903p22l9n61j369j386r40
$$ plain form
55288 43102 42195 41046 40079 39751 40123 41203 42938 44801 46182 47123 47843 47819 46488 44711 44130 44918 45590
55271 45590 45312 44939 45185 45204 43936 41880 40494 40394 40999 41633 42373 43782 46040 48324 49376 48938 48058
55254 48058 47399 46149 43735 41762 42485 45632 48594 49916 50713 52283 54118 55054 54935 54244 53306 52575
55238 52575 52608 53110 53057 52340 52129 53004 54015 54327 54593 55724 57310 58257 58180 57402 56307 55441 55473 56332 57068
55219 57068 57128 56977 56990 56676 55661 54529 54010 54135 54733 55795 56801 56816 56064 56346 58934 62877 66295 68409
55201 68409 69332 68840 66776 64199 62846 63385 64857 65658 64721 62139 59170 57128 55942 54347 51824 49493
55185 49493 48596 48974 49610 49819 49257 47670 45551 44300 44842 46537 48080 48902 49198 49301 49651 50633 51868
55168 51868 52355 51855 51271 51281 51619 52192 53531 55410 56542 56713 57680 60436 63026 62948 60645 58549 57476
$$ packed form
55288D3102r07j149r67l28L72J080J735J863J381R41P20k4j331j777n81P88O72
55271D5590k78l73K46J9j268k056j386j00O05O34P40J409K258K284J052m38q80
55254D8058o59j250k414j973P23L147K962J322P97J570J835R36j19o91r38p31
55238E2575L3N02n3p17k11Q75J011L12K66J131J586R47p7p78j095q66L2Q59P36
55219E7068O0j51J3l14j015j132n19J25N98J062J006J5p52K82K588L943L418K114
55201F8409R23m92k064k577j353N39J472Q01r37k582k969k042j186j595k523k331
55185D9493q97L78O36K09n62j587k119j251N42J695J543Q22K96J03L50R82J235
55168E1868M87n00n84J0L38N73J339J879J132J71R67K756K590p8k303k096j073
$$ plain form
55151 57476 56277 54764 54541 56460 59248 61396 62939 64618 66402 67653 67987 67378 65969 64222 62803
55136 62803 62029 61745 61670 61490 60754 59396 58200 58089 58933 59726 59822 59377 58789 58485 59155 61129 63438 64414
55118 64414 63519 61850 60598 59804 59003 58301 58150 58549 59100 59620 60080 60055 58894 56751 55018 55229 57524
55101 57524 60589 63199 65245 66905 67508 66215 63625 61609 61271 61938 62402 62149 60976 58607 55755 54650
55085 54650 57070 61973 66187 67524 66434 64580 62794 60971 59270 58469 58907 59591 58948 56674 54360
55070 54360 53958 55993 59754 64573 69829 74009 75390 74093 72232 71380 70986 70006 68983 69332 71318 73954
55054 73954 76547 79338 82796 87084 92005 96772 100056 100948 99871 98152 97004 97176 98904 101430 103071
55039 103071 102639 100690 98757 97583 96709 95613 94576 94414 95629 97824 99843 100840 101239 102137 103693 104846
$$ packed form
55151E7476j199j513k23J919K788K148J543J679J784J251L34o09j409j747j419
55136F2803p74k84p5j80p36j358j196j11Q44P93R6m45n88l04O70J974K309R76
55118F4414q95j669j252p94q01p02j51L99N51N20M60k5j161k143j733K11K295
55101E7524L065K610K046J660O03j293k590k016l38O67M64k53j173k369k852j105
55085E4650K420M903M214J337j090j854j786j823j701q01M38O84o43k274k314
55070E4360m02K035L761M819N256M180J381j297j861q52l94r80j023L49J986K636
55054G3954K593K791L458M288M921M767L284Q92j077j719j148J72J728K526J641
55039A03071m32j949j933j174q74j096j037j62J215K195K019R97L99Q98J556J153
$$ plain form
55023 104846 104828 104110 103552 103504 104060 105143 105869 105052 103044 101882 102719 104278 104879 104711 104832 105229 105487 106300
55005 106300 108302 110204 110282 109374 110092 112910 115133 114364 111216 107771 104881 102019 98821 95759 93689
54990 93689 93288 94520 96352 97514 97657 97279 96632 95528 94251 93657 94091 95065 96239 97815 99538 100231
54974 100231 99087 96912 95417 95512 96838 98747 101101 103911 106515 107673 106777 104774 103381 103383 104185 105071
54958 105071 106062 107214 107952 107833 107335 107169 107395 107884 109002 110907 112730 113482 113334 113027 112453 111057 109407
54941 109407 109049 110602 112919 114305 113900 111991 109763 108686 109386 111053 112487 113397 114100 114490 114243 113655
54925 113655 113207 112607 111258 109397 107748 106424 105317 105185 106951 110087 113087 115483 117995 120731 122757
54910 122757 123712 124416 125530 126792 127901 128867 129277 128616 127666 128105 130124 131872 132076 131861 132962 135253
$$ packed form
55023A04846j8p18n58m8N56J083P26q17k008j162Q37J559O01j68J21L97K58Q13
55005A06300K002J902P8r08P18K818K223p69l148l445k890k862l198l062k070
54990I3689m01J232J832J162J43l78o47j104j277n94M34R74J174J576J723O93
54974A00231j144k175j495R5J326J909K354K810K604J158q96k003j393KQ02Q86
54958A05071R91J152P38j19m98j66K26M89J118J905J823P52j48l07n74j396j650
54941A09407l58J553K317J386m05j909k228j077P00J667J434R10P03L90k47n88
54925A13655m48o00j349j861j649j324j107j32J766L136L000K396K512K736K026
54910A22757R55P04J114J262J109R66M10o61r50M39K019J748K04k15J101K291
$$ plain form
54894 135253 137302 138605 140067 142524 145773 149093 152249 155941 161313 168751 177307 185867 194649 204767
54880 204767 216461 228812 241269 254335 268490 283382 298173 311527 321132 324793 322669 317260
54868 317260 310474 301811 290054 275601 260241 245627 232811 222209 213038 203656 193599 184558
54856 184558 178292 174217 170195 165212 160182 156396 154178 153020 152296 151846 152201 153958 156755 159562 162267
54841 162267 166036 171497 177726 184065 191877 202985 216881 231056 243930 255953 267702 278399
54829 278399 286830 292582 295673 295742 292394 285909 276962 265913 252928 238687 224438 211155 198977
54816 198977 187675 177451 168860 161879 155540 148844 141762 134993 129101 124438 121478 120165 119000 115973
54802 115973 110887 105850 102838 101575 100491 99035 98076 98337 99406 100303 100433 99892 99263 99026 98953 98323 97063
$$ packed form
54894A35253K049J303J462K457L249L320L156L692N372P438Q556Q560Q782J0118
54880B04767J1694J2351J2457J3066J4155J4892J4791J3354R605L661k124n409
54868C17260o786q663j1757j4453j5360j4614j2816j0602r171r382j0057r041
54856A84558o266m075m022m983n030l786k218j158p24m50L55J757K797K807K705
54841A62267L769N461O229O339P812J1108J3896J4175J2874J2023J1749J0697
54829B78399Q431N752L091O9l348o485q947j1049j2985j4241j4249j3283j2178
54816A98977j1302j0224q591o981o339o696p082o769n892m663k960j313j165l027
54802A15973n086n037l012j263j084j456r59K61J069Q97J30n41o29k37p3o30j260
$$ plain form
54785 97063 96245 96810 98035 98027 95804 92243 88847 86251 84426 83716 84647 86618 87746 86746 84431 82524
54769 82524 81350 79867 77842 76432 76085 75474 73701 72218 72962 75616 78593 81916 86813 92693 97111
54754 97111 99255 101154 104406 107751 109215 108984 108635 108816 109297 110296 112118 114062 115125 115553 116639 119298
54738 119298 123500 128509 132993 135882 138092 142360 150080 159241 166996 173500 181375 191833 203348 214257
54724 214257 224837 236331 249375 263916 279421 294537 307453 317240 324119 328127 328489 324847 318351
54711 318351 310812 303172 295306 287006 278686 271187 264947 259276 252730 244759 236819 231059 227932 225961
54697 225961 224111 223378 225350 229872 235089 239609 243784 248778 255053 262252 270236 279564 290726 303379
54683 303379 316859 331321 347651 366021 385030 402690 417926 430689 441027 448599 452839 453021
$$ packed form
54785I7063q18N65J225qk223l561l396k596j825p10R31J971J128j000k315j907
54769H2524j174j483k025j410l47o11j773j483P44K654K977L323M897N880M418
54754I7111K144J899L252L345J464k31l49J81M81R99J822J944J063M28J086K659
54738A19298M202N009M484K889K210M268P720R161P755O504P875J0458J1515J0909
54724B14257J0580J1494J3044J4541J5505J5116J2916R787O879M008L62l642o496
54711C18351p539p640p866q300q320p499o240n671o546p971p940n760l127j971
54697B25961j850p33J972M522N217M520M175M994O275P199P984R328J1162J2653
54683C03379J3480J4462J6330J8370J9009J7660J5236J2763J0338P572M240J82
$$ plain form
54671 453021 448319 438561 424927 409258 392444 374073 353838 332711 312257 293193 275375 259070
54659 259070 245499 235609 228697 222798 216398 209368 202383 196141 191329 188408 186717 184413 180259 175172
54645 175172 171066 168400 165974 163115 160790 160239 161547 164040 167029 169571 170441 169246 167019 165041 163614
54630 163614 162491 161920 162495 164375 167134 169942 171668 171598 170588 170617 172479 174723 175676 175635 176049 177351 178927
54613 178927 180661 183092 186223 189468 192742 196518 200680 204401 207254 209675 212255 215347 219216 223653
54599 223653 227494 229516 229967 230373 231668 233391 234824 236026 237416 239166 241398 244344 247966 251879 255842
54584 255842 259794 263330 266016 268556 272896 280469 290795 302387 314722 328646 344827 362422 379639
54571 379639 395512 410829 427076 444478 461203 474434 481987 483029 477900 467779 454295 439030
$$ packed form
54671D53021m702r758j3634j5669j6814j8371k0235k1127k0454j9064j7818j6305
54659B59070j3571r890o912n899o400p030o985o242m812k921j691k304m154n087
54645A75172m106k666k426k859k325n51J308K493K989K542Q70j195k227j978j427
54630A63614j123n71N75J880K759K808J726p0j010K9J862K244R53m1M14J302J576
54613A78927J734K431L131L245L274L776M162L721K853K421K580L092L869M437
54599B23653L841K022M51M06J295J723J433J202J390J750K232K946L622L913L963
54584B55842L952L536K686K540M340P573J0326J1592J2335J3924J6181J7595J7217
54571C79639J5873J5317J6247J7402J6725J3231P553J042n129j0121j3484j5265
$$ plain form
54559 439030 423182 407526 392270 377014 361417 346037 331849 318856 306081 293312 281818
54548 281818 272665 265298 258692 252977 248720 245328 241627 237654 234367 231649 228091 222993 217399 212631
54534 212631 208673 204370 198591 191027 182526 174747 168885 164652 161074 157937 155502 153086 149305 144098
54520 144098 139277 136452 135287 134388 133142 131969 131227 130634 129680 128249 126879 126372 126862 127411 126995 125768
54504 125768 124781 124432 123940 122512 120374 118376 117111 116667 116791 117094 117430 118118 119441 120995 122040 122495
54488 122495 122978 123828 124632 124859 124630 124761 126221 129295 133059 136166 138550 141678 146497 151990 156813 161459
54472 161459 167196 173448 178222 181158 184183 188670 193725 198048 201937 206478 212017 218421 225771 233797
54458 233797 241478 248061 253671 258117 260012 258067 252541 244578 234961 224412 214240 205469 197862 190796
$$ packed form
54559D39030j5848j5656j5256j5256j5597j5380j4188j2993j2775j2769j1494
54548B81818r153p367o606n715m257l392l701l973l287k718l558n098n594m768
54534B12631l958m303n779p564q501p779n862m233l578l137k435k416l781n207
54520A44098m821k825j165q99j246j173p42n93r54j431j370n07M90N49m16j227
54504A25768r87l49m92j428k138j998j265m44J24L03L36O88J323J554J045M55
54488A22495M83Q50Q04K27k29J31J460L074L764L107K384L128M819N493M823M646
54472A61459N737O252M774K936L025M487N055M323L889M541N539O404P350Q026
54458B33797P681O583N610M446J895j945n526p963r617j0549j0172q771p607p066
$$ plain form
54444 190796 184488 179255 174241 168319 161942 156734 153309 150721 148150 145915 144564 144067 144240 145012 145774
54429 145774 145358 143366 140944 139545 139348 139481 139411 139266 138911 137744 135811 134387 134710 136452 138200 139296
54413 139296 140383 142082 144092 145997 147969 149995 151342 151827 152897 156010 160207 162771 162465 160905 160405
54398 160405 161580 163463 164898 165218 164370 163026 162011 161319 160281 158846 157786 157382 156936 156122 155709 156271
54382 156271 157063 157020 156073 154707 152990 151052 149785 149922 150701 150533 148904 146761 145078 143835 142558 141193
54366 141193 140219 140130 140999 142498 144352 146552 148748 149760 148582 146006 144283 144700 146228 147041 146742 146595
54350 146595 148186 152299 158409 164760 169597 172854 175967 179721 183211 185491 187148 189377 192473 196209
54336 196209 200726 205880 210513 213716 216225 219237 222345 224013 223750 222391 220407 217521 214101 211453
$$ packed form
54444A90796o308n233n014n922o377n208l425k588k571k235j351m97J73P72P62
54429A45774m16j992k422j399j97J33p0j45l55j167j933j424L23J742J748J096
54413A39296J087J699K010J905J972K026J347M85J070L113M197K564l06j560n00
54398A60405J175J883J435L20q48j344j015o92j038j435j060m04m46q14m13N62
54382A56271P92m3r47j366j717j938j267J37P79j68j629k143j683j243j277j365
54366A41193r74q9Q69J499J854K200K196J012j178k576j723M17J528Q13k99j47
54350A46595J591M113O110O351M837L257L113L754L490K280J657K229L096L736
54336A96209M517N154M633L203K509L012L108J668k63j359j984k886l420k648
$$ plain form
54322 211453 210127 208891 206020 201147 195603 191337 189441 189209 188724 186773 183912 181251 178787 175826 172491
54307 172491 169630 167435 165236 162676 160119 157883 155981 154575 153838 153463 153202 153708 155833 159135 162121
54292 162121 163937 164801 164954 164470 164068 164694 165972 166498 166145 166801 170144 175788 182234 188520 194113 198206
54276 198206 200277 200882 200993 200863 200065 198298 195609 192219 188537 185031 181822 178837 176457 175307 175112
54261 175112 174457 172112 168028 162916 157646 153273 150566 148876 146452 142572 138545 135890 134479 133322
54247 133322 132186 131214 129700 126759 123003 120291 119741 120824 122247 122891 122077 119937 117489 115555 113752
54232 113752 111407 109110 108134 108409 108373 107078 105242 103858 103030 102718 103442 105349 107444 108681 109200 109713
54216 109713 110327 110915 112021 114238 117012 119171 120451 121429 122017 121312 119178 116812 115258 114494 114583 116548
$$ packed form
54322B11453j326j236k871m873n544m266j896k32m85j951k861k661k464k961l335
54307A72491k861k195k199k560k557k236j902j406p37l75k61N06K125L302K986
54292A62121J816Q64J53m84m02O26J278N26l53O56L343N644O446O286N593M093
54276A98206K071O05J11j30p98j767k689l390l682l506l209k985k380j150j95
54261A75112o55k345m084n112n270m373k707j690k424l880m027k655j411j157
54247A33322j136r72j514k941l756k712n50J083J423O44q14k140k448j934j803
54232A13752k345k297r76K75l6j295j836j384q28l12P24J907K095J237N19N13
54216A09713O14N88J106K217K774K159J280R78N88p05k134k366j554p64Q9J965
$$ plain form
54200 116548 120895 125995 129357 130448 131055 132675 134606 135111 133725 131767 130904 131623 132909 133147 131558
54185 131558 129008 127219 127116 128222 129703 131420 133599 135930 137585 137942 136911 134745 132037 129810 129082
54170 129082 130092 132044 133652 133902 132570 130275 128011 126405 125549 125536 126704 129026 131628 133583 135013
54155 135013 136804 139101 140650 139898 136524 131779 127640 125698 126454 129134 132188 134240 134886 134789 134947 135654
54139 135654 136036 134848 131931 128619 126343 125002 123328 120951 119421 120560 123946 126832 126903 124666 122491
54124 122491 121520 120540 118214 115410 114241 115309 117125 118260 118790 119339 119908 120318 120850 121556 121691 120747 119446
54107 119446 118770 118448 117415 115415 113086 110650 107693 104312 101484 99977 99659 100186 101766 104782 108902
54092 108902 112767 114634 113686 110986 108595 107234 105403 101568 96571 92809 91483 91947 93435 95763 98249
$$ packed form
54200A16548M347N100L362J091O07J620J931N05j386j958q63P19J286K38j589
54185A31558k550j789j03J106J481J717K179K331J655L57j031k166k708k227p28
54170A29082J010J952J608K50j332k295k264j606q56j3J168K322K602J955J430
54155A35013J791K297J549p52l374m745m139j942P56K680L054K052O46r7J58P07
54139A35654L82j188k917l312k276j341j674k377j530J139L386K886P1k237k175
54124A22491r71r80k326k804j169J068J816J135N30N49N69M10N32P06J35r44j301
54107A19446o76l22j033k000k329k436k957l381k828j507l18N27J580L016M120
54092A08902L865J867r48k700k391j361j831l835m997l762j326M64J488K328K486
$$ plain form
54077 98249 99578 99356 98491 97522 95873 93500 91762 91508 91446 89933 87637 86856 88394 90547 91335 90614 89577
54060 89577 88987 88440 87025 84424 81459 79641 80058 82620 86351 90209 93622 96639 99724 103067 105993
54045 105993 107507 107539 107067 106762 106246 105104 103922 103555 103882 104108 103948 103701 103360 102560 101504 101198 102491
54028 102491 105217 108393 111056 112979 114769 117064 119414 120455 119662 118420 118537 120015 121233 121233 120753 120750
54012 120750 120937 120514 119750 119953 121858 124628 126673 127199 126723 126098 125483 124698 124368 125819 129398 133587 136518
53995 136518 138076 139654 142103 144835 146940 148233 148964 149436 150327 152526 156024 159627 162496 165445 169883
53980 169883 175900 182254 188127 193844 199736 205254 209819 214008 219202 226175 234494 243282 252205 261558
53966 261558 271520 281445 290029 296326 300625 304149 307853 311692 315178 318200 320996 323583 325769 327632
$$ packed form
54077I8249J329k22q65r69j649k373j738k54o2j513k296p81J538K153P88p21j037
54060H9577n90n47j415k601k965j818M17K562L731L858L413L017L085L343K926
54045A05993J514L2m72l05n16j142j182l67L27K26j60k47l41q00j056l06J293
54028A02491K726L176K663J923J790K295K350J041p93j242J17J478J218%m80l
54012A20750J87m23p64K03J905K770K045N26m76o25o15p85l30J451L579M189K931
53995A36518J558J578K449K732K105J293P31M72Q91K199L498L603K869K949M438
53980A69883O017O354N873N717N892N518M565M189N194O973Q319Q788Q923R353
53966B61558R962R925Q584O297M299L524L704L839L486L022K796K587K186J863
$$ plain form
53952 327632 329377 330627 330445 328449 325458 322548 319684 315864 310525 304285 298129 292296 286381 280292
53938 280292 274724 270464 267311 263950 259130 252994 247069 242885 240775 239986 239522 238655 237041 234956 233279
53923 233279 232719 232936 232807 231656 229852 228112 226518 224458 221413 217635 214080 211619 210230 209033 207232
53908 207232 204844 202353 199994 197765 195962 195105 195263 195832 196044 195467 194178 192834 192347 192874 193231 192024
53892 192024 189493 187580 187941 190420 193633 196421 198423 199866 201320 203334 206008 209106 212663 216960
53878 216960 221874 226956 232327 238636 245752 252384 257719 262592 268169 274116 279156 283016 286666 290799
53864 290799 295240 299866 304901 309912 313660 315732 317781 322276 330108 339878 349493 358060 366179 374679
53850 374679 383508 392020 400113 408407 417038 424868 430639 434728 438969 444550 450707 455759 458920 460572
$$ packed form
53952C27632J745J250j82j996k991k910k864l820n339o240o156n833n915o089
53938B80292n568m260l153l361m820o136n925m184k110p89m64q67j614k085j677
53923B33279n60K17j29j151j804j740j594k060l045l778l555k461j389j197j801
53908B07232k388k491k359k229j803q57J58N69K12n77j289j344m87N27L57j207
53892A92024k531j913L61K479L213K788K002J443J454K014K674L098L557M297
53878B16960M914N082N371O309P116O632N335M873N577N947N040L860L650M133
53864B90799M441M626N035N011L748K072K049M495P832R770R615Q567Q119Q500
53850C74679Q829Q512Q093Q294Q631P830N771M089M241N581O157N052L161J652
$$ plain form
53836 460572 460990 459456 455037 448202 441236 436496 434042 431455 426369 418786 410440 402369 394129 385312
53822 385312 376620 368866 361760 354505 346996 339512 331610 322473 312446 303102 295299 288075 280303 272779
53808 272779 267508 264981 263248 260046 254967 249050 243070 237135 231460 226504 222298 218455 214928 212024
53794 212024 209529 206538 202534 198049 193884 190156 186602 183399 181112 179890 179010 177218 173591 168423
53780 168423 163398 160408 159900 160663 161375 161873 162717 164131 165859 167594 168936 169331 168727 168137 168948 171567
53764 171567 175002 177684 178523 177489 175554 173963 173346 173664 174907 177250 180426 183720 187020 191050 195963
53749 195963 200483 203310 204748 205989 207426 208852 210932 215014 221325 228612 235831 243257 251472 260122
53735 260122 268269 275534 282446 289791 297670 305062 310627 314285 317536 321615 325859 328761 330181 331317
$$ packed form
53836D60572M18j534m419o835o966m740k454k587n086p583q346q071q240q817
53822C85312q692p754p106p255p509p484p902r137j0027r344p803p224p772p524
53808B72779n271k527j733l202n079n917n980n935n675m956m206l843l527k904
53794B12024k495k991m004m485m165l728l554l203k287j222q80j792l627n168
53780A68423n025k990n08P63P12M98Q44J414J728J735J342L95o04n90Q11K619
53764A71567L435K682Q39j034j935j591o17L18J243K343L176L294L300M030M913
53749A95963M520K827J438J241J437J426K080M082O311P287P219P426Q215Q650
53735B60122Q147P265O912P345P879P392N565L658L251M079M244K902J420J136
$$ plain form
53721 331317 332822 334294 335615 337262 338950 339383 337967 335696 333721 332007 329935 327298 324165 320641
53707 320641 317299 314838 312782 309590 304664 299107 293865 288424 282336 276619 272229 268214 263073 257248
53693 257248 252610 249930 248411 247312 246396 245001 242397 239129 236448 234278 231268 227067 223003 220155
53679 220155 218279 217156 217334 218684 219641 219044 217694 217003 217029 216946 216557 216080 215129 213325 211483 210774 210898
53662 210898 210425 209046 208238 209441 212650 217057 222019 226930 231193 234989 239337 244615 249655 253096 255158
53647 255158 257121 259420 261330 262514 263713 265481 267229 268351 269661 272733 277929 283885 289049 293056
53633 293056 296393 299428 302297 305393 309358 314538 320612 326754 332202 336940 341772 347226 352339 355282
53619 355282 355674 355544 357086 359965 361922 361804 360747 360275 360626 361549 363381 366155 368379 368110 365207 361524
$$ packed form
53721C31317J505J472J321J647J688M33j416k271j975j714k072k637l133l524
53707C20641l342k461k056l192m926n557n242n441o088n717m390m015n141n825
53693B57248m638k680j519j099r16j395k604l268k681k170l010m201m064k848
53679B20155j876j123J78J350R57n97j350o91K6q3l89m77r51j804j842p09J24
53662B10898m73j379q08J203L209M407M962M911M263L796M348N278N040L441K062
53647B55158J963K299J910J184J199J768J748J122J310L072N196N956N164M007
53633B93056L337L035K869L096L965N180O074O142N448M738M832N454N113K943
53619C55282L92j30J542K879J957j18j057m72L51R23J832K774K224k69k903l683
$$ plain form
53603 361524 358876 357606 357123 356829 356227 354980 353453 352635 352963 353521 352936 350880 348237 346043 344770 344623
53587 344623 345781 347952 350001 350510 348892 345873 342934 341350 341678 343806 347235 351363 355629 359492 362340
53572 362340 363737 363998 364299 365815 368671 372022 375114 377814 380080 381611 382542 384045 387547 393279 399995
53557 399995 406087 410784 414505 418510 424065 431392 439346 446558 452923 459547 467277 475754 484049 491685
53543 491685 498834 506037 513985 523104 532876 541882 549014 554628 560191 566729 573788 580005 584653 588609
53529 588609 593612 600444 608218 615747 623140 631259 639844 647285 652457 655795 658132 659447 659506 658980 659002
53514 659002 659986 661545 663072 663770 662711 659861 656707 654879 654335 653771 652540 651195 650253 649516 648697 647782
53498 647782 646621 645099 643868 643973 645456 647109 647885 647841 647558 647547 648380 650347 652602 653711 653690 654498 657798
$$ packed form
53603C61524k648j270m83k94o02j247j527q18L28N58n85k056k643k194j273j47
53587C44623J158K171K049N09j618l019k939j584L28K128L429M128M266L863K848
53572C62340J397K61L01J516K856L351L092K700K266J531R31J503L502N732O716
53557C99995O092M697L721M005N555P327P954P212O365O624P730Q477Q295P636
53543D91685P149P203P948R119R772R006P132N614N563O538P059O217M648L956
53529E88609N003O832P774P529P393Q119Q585P441N172L338K337J315N9n26K2
53514F59002R84J559J527O98j059k850l154j828n44n64j231j345r42p37q19r15
53498F47782j161j522j231J05J483J653P76m4k83j1Q33J967K255J109k1Q08L300
$$ plain form
53481 657798 663106 668936 674771 680794 686448 690785 694125 698167 704245 712190 720936 729603 737974 746504
53467 746504 755826 765900 775935 785726 796613 810248 826646 844520 863380 884078 907020 931152
53455 931152 955426 980419 1007455 1036557 1066169 1094928 1123039 1151843 1182518 1215388 1250182
53444 1250182 1286678 1324990 1365286 1407361 1450654 1494770 1539696 1585447 1631819 1678794 1726845
53433 1726845 1776279 1826294 1875440 1923304 1971166 2020341 2070283 2119212 2166493 2213344 2261001
53422 2261001 2309324 2357810 2406761 2456245 2504815 2550897 2595124 2639577 2684649 2728424 2769581
53411 2769581 2809030 2847670 2884090 2916089 2943618 2968711 2992978 3016374 3038014 3056892 3072051
53400 3072051 3083302 3091765 3098692 3103764 3105445 3102848 3096269 3086058 3072138 3054769 3034713 3012345
$$ packed form
53481F57798N308N830N835O023N654M337L340M042O078P945Q746Q667Q371Q530
53467G46504R322J0074J0035R791J0887J3635J6398J7874J8860K0698K2942K4132
53455I31152K4274K4993K7036K9102K9612K8759K8111K8804L0675L2870L4794
53444A250182L6496L8312M0296M2075M3293M4116M4926M5751M6372M6975M8051
53433A726845M9434N0015M9146M7864M7862M9175M9942M8929M7281M6851M7657
53422B261001M8323M8486M8951M9484M8570M6082M4227M4453M5072M3775M1157
53411B769581L9449L8640L6420L1999K7529K5093K4267K3396K1640J8878J5159
53400C072051J1251Q463O927N072J681k597o579j0211j3920j7369k0056k2368
$$ plain form
53388 3012345 2987524 2960449 2931634 2900737 2866456 2828238 2787391 2745926 2704804 2663786 2622544
53377 2622544 2581388 2541070 2502133 2464338 2426747 2388724 2350758 2313946 2279016 2246496 2217470
53366 2217470 2192931 2172240 2153412 2135360 2118970 2105500 2094970 2086830 2081304 2079043 2079908 2083063
53354 2083063 2088056 2095133 2104679 2116988 2132461 2151412 2173748 2199313 2228450 2261744 2299201 2340160
53342 2340160 2384038 2430784 2480431 2532545 2586424 2641920 2699849 2761318 2826690 2895620 2968143
53331 2968143 3044990 3126158 3209761 3293494 3377290 3463521 3554319 3649581 3747871 3848135 3949800
53320 3949800 4052047 4154123 4256036 4358059 4459582 4559164 4655761 4749371 4840383 4928622
53310 4928622 5013120 5092703 5166709 5235125 5297882 5354198 5402975 5443724 5476618 5501727 5518923
$$ packed form
53388C012345k4821k7075k8815l0897l4281l8218m0847m1465m1122m1018m1242
53377B622544m1156m0318l8937l7795l7591l8023l7966l6812l4930l2520k9026
53366B217470k4539k0691j8828j8052j6390j3470j0530q140n526k261Q65L155
53354B083063M993P077R546J2309J5473J8951K2336K5565K9137L3294L7457M0959
53342B340160M3878M6746M9647N2114N3879N5496N7929O1469O5372O8930P2523
53331B968143P6847Q1168Q3603Q3733Q3796Q6231R0798R5262R8290J00264J01665
53320C949800J02247J02076J01913J02023J01523R9582R6597R3610R1012Q8239
53310D928622Q4498P9583P4006O8416O2757N6316M8777M0749L2894K5109J7196
$$ plain form
53299 5518923 5528620 5531762 5528699 5518766 5501329 5476524 5444493 5404652 5356450 5300257 5236745 5165852
53287 5165852 5087203 5001282 4909460 4813115 4713472 4612134 4510989 4411390 4313822 4218243 4124398
53276 4124398 4031902 3940421 3849720 3759348 3668755 3578153 3488873 3402304 3318701 3237604 3159149
53265 3159149 3084363 3014264 2949210 2888989 2833083 2780994 2732627 2688129 2647051 2608130 2570448
53254 2570448 2534372 2500728 2469486 2440058 2412429 2387073 2363966 2342749 2323781 2308012 2295645
53243 2295645 2285867 2278080 2272474 2269127 2267534 2267475 2269561 2274201 2280648 2287872 2296160 2307188 2322470 2342024
53229 2342024 2364534 2388593 2413865 2441175 2471584 2505509 2542774 2583058 2625806 2669958 2714484
53218 2714484 2759186 2804273 2849044 2891824 2931648 2969396 3006614 3043497 3078559 3110041 3137121
$$ packed form
53299E518923R697L142l063r933j7437k4805l2031l9841m8202n6193o3512p0893
53287E165852p8649q5921r1822r6345r9643j01338j01145r9599r7568r5579r3845
53276D124398r2496r1481r0701r0372r0593r0602q9280q6569q3603q1097p8455
53265C159149p4786p0099o5054o0221n5906n2089m8367m4498m1078l8921l7682
53254B570448l6076l3644l1242k9428k7629k5356k3107k1217j8968j5769j2367
53243B295645r778p787n606l347j593n9K086M640O447P224Q288J1028J5282J9554
53229B342024K2510K4059K5272K7310L0409L3925L7265M0284M2748M4152M4526
53218B714484M4702M5087M4771M2780L9824L7748L7218L6883L5062L1482K7080
$$ plain form
53207 3137121 3159899 3178872 3194638 3207645 3217808 3224525 3227406 3226895 3223763 3217785 3207346 3190856
53195 3190856 3168428 3141713 3112166 3080066 3045251 3007912 2968154 2925453 2879273 2829834 2777689
53184 2777689 2722991 2666027 2608236 2551661 2497166 2443832 2390330 2336397 2282825 2230477 2179534
53173 2179534 2129554 2080299 2032686 1988430 1948168 1910238 1872224 1833523 1795476 1759028 1723489
53162 1723489 1688013 1653217 1620537 1590712 1563678 1539394 1517783 1497995 1478518 1458183 1436734
53151 1436734 1414525 1392131 1370193 1349216 1329238 1309790 1290205 1270011 1249260 1228624 1209036
53140 1209036 1190973 1174079 1157480 1140427 1122777 1105116 1088406 1073113 1058516 1043100 1025806
53129 1025806 1006747 986670 966141 945503 925313 906383 889250 873684 858769 843531 827668
$$ packed form
53207C137121K2778J8973J5766J3007J0163O717K881n11l132n978j0439j6490
53195C190856k2428k6715k9547l2100l4815l7339l9758m2701m6180m9439n2145
53184B777689n4698n6964n7791n6575n4495n3334n3502n3933n3572n2348n0943
53173B179534m9980m9255m7613m4256m0262l7930l8014l8701l8047l6448l5539
53162A723489l5476l4796l2680k9825k7034k4284k1611j9788j9477k0335k1449
53151A436734k2209k2394k1938k0977j9978j9448j9585k0194k0751k0636j9588
53140A209036j8063j6894j6599j7053j7650j7661j6710j5293j4597j5416j7294
53129A025806j9059k0077k0529k0638k0190j8930j7133j5566j4915j5238j5863
$$ plain form
53118 827668 811668 796202 781521 767552 754283 741717 729662 717973 706904 696709 687030 677237
53106 677237 667391 658245 650117 642314 633894 624500 614253 603322 591964 580617 569629 559206 549763
53093 549763 541863 535507 529909 524319 518644 512939 506729 499396 491050 482527 474610 467577 461333 455594
53079 455594 450040 444641 439863 436388 434580 434238 434697 435062 434612 433162 430885 427746 423437 418009 412209
53064 412209 406942 402671 399495 397345 395714 393608 390347 386301 382329 378567 374345 369392 364636 361388
53050 361388 359809 358504 355811 351431 346542 342318 338712 335024 331179 327730 324792 321926 319278 317862
53036 317862 318119 318912 318727 317388 315793 314308 312383 309760 307184 305529 304650 303427 300852 297126 293878
53021 293878 293157 295702 300128 304079 306222 306973 307566 308980 311759 316162 321936 328103 333341 336769 338391
$$ packed form
53118H27668j6000j5466j4681j3969j3269j2566j2055j1689j1069j0195r679r793
53106F77237r846r146q128p803q420r394j0247j0931j1358j1347j0988j0423r443
53093E49763p900o356n598n590n675n705o210p333q346q523p917p033o244n739
53079D55594n554n399m778l475j808l42M59L65m50j450k277l139m309n428n800
53064D12209n267m271l176k150j631k106l261m046l972l762m222m953m756l248
53050C61388j579j305k693m380m889m224l606l688l845l449k938k866k648j416
53036C17862K57P93j85j339j595j485j925k623k576j655q79j223k575l726l248
53021B93878p21K545M426L951K143P51N93J414K779M403N774O167N238L428J622
$$ plain form
53006 338391 338835 338648 337790 335854 332783 329226 326118 323997 322676 321302 318629 313723 306791 299199 292377
52991 292377 286819 282285 278560 275525 272774 269717 266097 262066 257825 253520 249322 245239 241040 236802
52977 236802 233262 230887 228776 225367 220385 215294 211563 209289 207965 207633 208407 209349 208912 206507 202969
52962 202969 199444 196490 194279 192904 192087 191104 189511 187738 186607 186397 186685 186898 186696 185911 184597 183338
52946 183338 183184 184936 188412 192489 195769 197200 196311 193307 189172 185486 183662 183994 185445 186506 186445
52931 186445 185789 185677 186825 189083 191760 194201 196047 197120 197218 196182 194278 192428 191718 192419 193565 193752
52915 193752 192416 190252 188486 187887 188326 189036 189329 189357 190081 192173 194931 196809 197192 197143 198060 199917 201308
52898 201308 201101 199651 198349 198276 199366 200815 202224 204097 207025 210636 213976 216775 219561 222295 223958
$$ packed form
53006C38391M44j87q58j936l071l557l108k121j321j374k673m906o932p592o822
52991B92377n558m534l725l035k751l057l620m031m241m305m198m083m199m238
52977B36802l540k375k111l409m982n091l731k274j324l32P74R42m37k405l538
52962B02969l525k954k211j375q17r83j593j773j131k10K88K13k02p85j314j259
52946A83338j54J752L476M077L280J431q89l004m135l686j824L32J451J061o1
52931A86445o56j12J148K258K677K441J846J073R8j036j904j850p10P01J146J87
52915A93752j336k164j766n99M39P10K93K8P24K092K758J878L83m9R17J857J391
52898B01308k07j450j302p3J090J449J409J873K928L611L340K799K786K734J663
$$ plain form
52883 223958 224134 224165 225709 228688 231770 234499 237664 241573 245345 248398 251536 255769 260800 265446 269186
52868 269186 272541 276131 279956 283646 287044 290434 294355 299235 305121 311663 318191 323811 327806 330265
52854 330265 332060 333858 335483 336551 337239 337772 337662 336348 334240 332096 329621 325977 321688 318561 317356
52839 317356 316826 315588 313632 311351 308452 304897 301785 300023 298877 297072 294654 292584 291120 289973
52825 289973 289603 290894 293594 296384 298494 300067 300945 300512 299085 298178 298707 299734 299607 297715 294704 291618
52809 291618 289380 288605 289291 290907 293038 295628 298313 300006 299685 297509 294830 293172 293350 295352 298658
52794 298658 302539 306171 308787 310022 310101 309365 307619 304488 300691 298305 299002 302378 306655 310685 314333
52779 314333 317217 318351 317543 316142 315628 315933 315752 314249 311954 310209 310138 311981 314913 317440 318199 316662
$$ packed form
52883B23958J76L1J544K979L082K729L165L909L772L053L138M233N031M646L740
52868B69186L355L590L825L690L398L390L921M880N886O542O528N620L995K459
52854C30265J795J798J625J068O88N33j10j314k108k144k475l644m289l127j205
52839C17356n30j238j956k281k899l555l112j762j146j805k418k070j464j147
52825B89973l70J291K700K790K110J573Q78m33j427r07N29J027j27j892l011l086
52809B91618k238p75O86J616K131K590K685J693l21k176k679j658J78K002L306
52794B98658L881L632K616J235P9p36j746l131l797k386O97L376M277M030L648
52779C14333K884J134q08j401n14L05j81j503k295j745p1J843K932K527P59j537
$$ plain form
52763 316662 313294 309257 305885 303933 303099 302484 301687 301212 301586 302294 302039 300141 297510 296028 296921 299721
52747 299721 302785 304775 305643 306417 308278 311731 316235 320414 322863 323049 321512 319235 317005 315153 313467
52732 313467 311317 308296 304786 301441 298141 294174 289477 284768 280239 275260 270040 266269 264893 264156
52718 264156 261371 256218 250812 246769 243774 241214 239547 239259 239447 238311 234759 229282 223667 219755 217828
52703 217828 216252 213424 209835 207087 205104 201883 196470 190592 186488 184285 182564 180492 178218 175888
52689 175888 173584 171926 171613 172374 173196 173452 173126 172055 169723 165887 160925 155682 151366 149265 149747 151525
52673 151525 152518 151622 149372 146982 145212 144144 143538 143137 142818 142562 142228 141594 140840 140750 142042 144415 146542
52656 146542 147054 145575 142948 140642 139736 140124 140652 140158 138499 136602 135602 135846 136616 136949 136721 136659 137087
$$ packed form
52763C16662l368m037l372j952q34o15p97m75L74P08k55j898k631j482Q93K800
52747B99721L064J990Q68P74J861L453M504M179K449J86j537k277k230j852j686
52732C13467k150l021l510l345l300l967m697m709m529m979n220l771j376p37
52718B64156k785n153n406m043k995k560j667k88J88j136l552n477n615l912j927
52703B17828j576k828l589k748j983l221n413n878m104k203j721k072k274k330
52689A75888k304j658l13P61Q22K56l26j071k332l836m962n243m316k101M82J778
52673A51525R93q96k250k390j770j068o06m01l19k56l34o34p54r0J292K373K127
52656A46542N12j479k627k306r06L88N28m94j659j897j000K44P70L33k28o2M28
$$ plain form
52639 137087 137208 136213 134697 134066 134660 135426 135480 135031 134641 134636 135590 138136 141607 143957 144040 143141 143202 144214 144565
52620 144565 143494 141842 140483 139364 138477 138734 141136 145393 149800 152496 152862 151799 150629 149858 149313
52605 149313 149310 150710 153511 156324 157948 158758 159720 160842 161636 162495 164319 167024 169651 171836 174110 176872
52589 176872 180128 184075 188657 192606 194236 193447 191764 190277 188867 187642 187500 188438 188688 186655 182804
52574 182804 178795 175672 173757 173225 173529 173033 170623 167260 164700 163117 161318 159000 157243 156612 156226
52559 156226 155178 153753 152597 151588 150219 148519 146852 145227 143350 141173 138986 137141 135963 135619
52545 135619 135894 136339 136855 137779 139199 140703 142169 144290 147697 151797 155093 156608 156529 155611 154545 153955
52529 153955 154386 155996 158492 161387 163995 165326 164742 163052 162262 163644 166386 168674 169803 170595 171976
$$ packed form
52639A37087J21r95j516o31N94P66N4m49l90nR54K546L471K350Q3q99O1J012L51
52620A44565j071j652j359j119q87K57K402M257M407K696L66j063j170p71n45
52605A49313lJ400K801K813J624Q10R62J122P94Q59J824K705K627K185K274K762
52589A76872L256L947M582L949J630p89j683j487j410j225j42R38K50k033l851
52574A82804m009l123j915n32L04m96k410l363k560j583j799k318j757o31l86
52559A56226j048j425j156j009j369j700j667j625j877k177k187j845j178l44
52545A35619K75M45N16R24J420J504J466K121L407M100L296J515p9r18j066n90
52529A53955M31J610K496K895K608J331n84j690p90J382K742K288J129P92J381
$$ plain form
52514 171976 173983 176260 178784 181687 184876 188291 192130 196336 200075 202262 202670 202174 201853 202125 202773
52499 202773 203496 204229 205074 206178 207664 209506 211362 212622 212846 212308 211964 212672 214381 216249 217626 218694
52483 218694 219960 221240 221554 220243 218041 216753 217723 220813 224974 229476 234067 238063 240170 239835 238412
52468 238412 238217 240296 243507 245834 246204 245063 243633 242911 243154 244043 245231 246558 247723 248217 248017 247891
52452 247891 248343 248523 247089 244138 241301 239752 239071 238448 238014 238355 239538 241313 243500 245376 245492 243286
52436 243286 240450 239428 240625 242210 242746 242926 244346 247478 251376 254780 256994 258076 258671 259464 260502
52421 260502 261181 261074 260627 260774 261943 263524 264426 264221 263699 264049 265481 267052 268006 268690 269720 270746 270806
52404 270806 269718 268437 267993 268567 269567 270143 269711 268495 267597 268116 270199 273093 275768 277139 276367 273851
$$ packed form
52514A71976K007K277K524K903L189L415L839M206L739K187M08m96l21K72O48
52499B02773P23P33Q45J104J486J842J856J260K24n38l44P08J709J868J377J068
52483B18694J266J280L14j311k202j288R70L090M161M502M591L996K107l35j423
52468B38412j95K079L211K327L70j141j430p22K43Q89J188J327J165M94k00j26
52452B47891M52J80j434k951k837j549o81o23m34L41J183J775K187J876J16k206
52436B43286k836j022J197J585N36J80J420L132L898L404K214J082N95P93J038
52421B60502O79j07m47J47J169J581R02k05n22L50J432J571R54O84J030J026O0
52404B70806j088j281m44N74J000N76m32j216q98N19K083K894K675J371p72k516
$$ plain form
52388 273851 271564 271382 273109 275063 276385 277656 279250 280463 280682 280288 279869 279495 279287 279668 280377 280212
52372 280212 278619 276740 275960 276076 275870 274922 273788 272747 271492 270011 268905 268700 269448 270945 272792 274416
52356 274416 275524 276357 277023 276981 275938 274807 274811 275831 276674 276945 277487 278833 280457 282049 284352 287854 291509
52339 291509 293963 295562 297926 301542 304871 306204 305575 304286 303240 302526 302266 302786 303801 304349 304112 304192
52323 304192 305766 308405 310676 312259 314312 317454 320527 322075 322214 322119 322281 322388 322603 323751 326090 328835
52307 328835 331129 332728 333603 333712 333652 334773 338021 342961 348316 353070 356788 359497 361906 365308 370493
$$ packed form
52388B73851k287j82J727J954J322J271J594J213K19l94m19l74k08L81P09j65
52372B80212j593j879p80J16k06r48j134j041j255j481j106k05P48J497J847J624
52356B74416J108Q33O66m2j043j131MJ020Q43K71N42J346J624J592K303L502L655
52339B91509K454J599K364L616L329J333o29j289j046p14k60N20J015N48k37Q0
52323C04192J574K639K271J583K053L142L073J548J39r5J62J07K15J148K339K745
52307C28835K294J599Q75J09o0J121L248M940N355M754L718K709K409L402N185
$$ [...]
##END NTUPLES=NMR SPECTRUM
##END=
