
##TITLE=AC1117_Cauca2_5835426_EAq6SDhmyq
##JCAMPDX= 6.0         $$ Bruker NMR JCAMP-DX V2.0
##DATA TYPE= NMR SPECTRUM
##DATA CLASS= NTUPLES
##ORIGIN= BRUKER
##OWNER= Administrator
$$ 1.72 TOPSPIN		Version 2.1
$$ 2012-03-28 11:08:06.593 -0500  Administrator@TOPSPIN
$$ Compression mode = diff/dup
##.OBSERVE FREQUENCY= 400.13188235
##.OBSERVE NUCLEUS= ^1H
##.ACQUISITION MODE= SIMULTANEOUS (DQD)
##.ACQUISITION SCHEME= undefined
##.AVERAGES= 64
##.DIGITISER RES= 22
##SPECTROMETER/DATA SYSTEM= spect
##.PULSE SEQUENCE= noesygpps1d.comp
##.SOLVENT NAME= COFFEE_meoh
##.SHIFT REFERENCE= INTERNAL, COFFEE_meoh, 1, 14.9682
##AUDIT TRAIL= $$ (NUMBER, WHEN, WHO, WHERE, PROCESS, VERSION, WHAT)
$$ ##TITLE= Audit trail, TOPSPIN		Version 2.1
$$ ##JCAMPDX= 5.01
$$ ##ORIGIN= Bruker BioSpin GmbH
$$ ##OWNER= Administrator
$$ $$ C:\Bruker\TOPSPIN/data/COFFEE/nmr/AC1117_Cauca2_5835426_EAq6SDhmyq/22/pdata/1/auditp.txt
$$ ##AUDIT TRAIL=  $$ (NUMBER, WHEN, WHO, WHERE, PROCESS, VERSION, WHAT)
(   1,<2012-03-28 04:14:45.906 -0500>,<Administrator>,<TOPSPIN>,<go>,<TOPSPIN 2.1>,
      <created by zg
	started at 2012-03-28 04:03:14.125 -0500,
	POWCHK enabled, PULCHK disabled,
       configuration hash MD5:
       1A 1E CE 29 27 FD 77 03 67 4E F0 E3 C4 B2 CB 90
       data hash MD5: 64K
       14 8B DC B3 F3 25 7A 8B 5C 84 8C EC 2B F1 79 07>)
(   2,<2012-03-28 04:14:50.968 -0500>,<Administrator>,<TOPSPIN>,<proc1d>,<TOPSPIN 2.1>,
      <Start of raw data processing
       efp LB = 0.3 FT_mod = 6 PKNL = 1 PHC0 = 0 PHC1 = 0 SI = 128K 
       data hash MD5: 128K
       E1 0A F1 18 8E C2 7A 5F 5D 1F 41 5A 4B 1A 0C A0>)
(   3,<2012-03-28 04:14:52.328 -0500>,<Administrator>,<TOPSPIN>,<proc1d>,<TOPSPIN 2.1>,
      <pk PHC0 = 36.17249 PHC1 = 0 
       data hash MD5: 128K
       F7 65 EE 38 14 17 6B 5D A7 34 4F F5 84 22 F4 8E>)
(   4,<2012-03-28 04:14:52.984 -0500>,<Administrator>,<TOPSPIN>,<proc1d>,<TOPSPIN 2.1>,
      <abs ABSG = 1 
       data hash MD5: 128K
       BD 0F FA 44 55 B0 A9 E7 99 07 A2 DA CF 9D 48 B0>)
(   5,<2012-03-28 04:14:53.078 -0500>,<Administrator>,<TOPSPIN>,<proc1d>,<TOPSPIN 2.1>,
      <abs ABSG = 2 
       data hash MD5: 128K
       21 50 66 75 5E D5 E3 5A 14 A4 56 A7 F7 02 DD BB>)
(   6,<2012-03-28 04:14:53.156 -0500>,<Administrator>,<TOPSPIN>,<proc1d>,<TOPSPIN 2.1>,
      <abs ABSG = 3 
       data hash MD5: 128K
       C5 9B 0A 98 0E FE 7E 0D B1 31 7E 63 9F 95 C4 FC>)
(   7,<2012-03-28 04:14:53.250 -0500>,<Administrator>,<TOPSPIN>,<proc1d>,<TOPSPIN 2.1>,
      <abs ABSG = 4 
       data hash MD5: 128K
       5E 4D 7B DA B9 8B A1 11 70 90 87 FB 64 A2 3C D6>)
(   8,<2012-03-28 04:14:53.343 -0500>,<Administrator>,<TOPSPIN>,<proc1d>,<TOPSPIN 2.1>,
      <abs ABSG = 5 
       data hash MD5: 128K
       7D D4 D7 6D 73 FF CE CB 80 06 40 B3 37 9C A2 14>)
(   9,<2012-03-28 04:14:54.765 -0500>,<Administrator>,<TOPSPIN>,<audit>,<TOPSPIN 2.1>,
      <user comment:
       ICON-NMR User ID: COFFEE
       data hash MD5: 128K
$$ [...]
##$TP07= 0
##$TPNAME0= <>
##$TPNAME1= <>
##$TPNAME2= <>
##$TPNAME3= <>
##$TPNAME4= <>
##$TPNAME5= <>
##$TPNAME6= <>
##$TPNAME7= <>
##$TPOAL= (0..7)
0.5 0.5 0.5 0.5 0.5 0.5 0.5 0.5
##$TPOFFS= (0..7)
0 0 0 0 0 0 0 0
##$TUNHIN= 0
##$TUNHOUT= 0
##$TUNXOUT= 0
##$USERA1= <user>
##$USERA2= <user>
##$USERA3= <user>
##$USERA4= <user>
##$USERA5= <user>
##$V9= 5
##$VALIST= <valist>
##$VCLIST= <CCCCCCCCCCCCCCC>
##$VD= 0
##$VDLIST= <DDDDDDDDDDDDDDD>
##$VPLIST= <PPPPPPPPPPPPPPP>
##$VTLIST= <TTTTTTTTTTTTTTT>
##$WBST= 2048
##$WBSW= 25
##$XGAIN= (0..3)
0 0 0 0
##$XL= 0
##$YL= 0
##$YMAX_a= 13671904
##$YMIN_a= -6066541
##$ZGOPTNS= <>
##$ZL1= 120
##$ZL2= 120
##$ZL3= 120
##$ZL4= 120
##$ABSF1= 14.9682
##$ABSF2= -5.584331
##$ABSG= 5
##$ABSL= 3
##$ALPHA= 0
##$AQORDER= 0
##$ASSFAC= 0
##$ASSFACI= 0
##$ASSFACX= 0
##$ASSWID= 0
##$AUNMP= <proc_prof1d_extract.lims>
##$AXLEFT= 0
##$AXNAME= <>
##$AXNUC= <1H>
##$AXRIGHT= 0
##$AXTYPE= 0
##$AXUNIT= <>
##$AZFE= 0.1
##$AZFW= 0.1
##$BCFW= 0
##$BC_mod= 0
##$BYTORDP= 0
##$COROFFS= 0
##$CY= 15
##$DATMOD= 1
##$DC= 0
##$DFILT= <>
##$DTYPP= 0
##$F1P= 0
##$F2P= 0
##$FCOR= 0.5
##$FTSIZE= 131072
##$FT_mod= 6
##$GAMMA= 0
##$GB= 0
##$INTBC= 1
##$INTSCL= 1
##$ISEN= 128
##$LB= 0.3
##$LEV0= 0
##$LPBIN= 0
##$MAXI= 10000
##$MC2= 0
##$MEAN= 0
##$ME_mod= 0
##$MI= 0
##$NCOEF= 0
##$NC_proc= -3
##$NLEV= 6
##$NOISF1= 0
##$NOISF2= 0
##$NSP= 0
##$NTH_PI= 0
##$NZP= 0
##$OFFSET= 14.9682
##$PC= 1
##$PHC0= 36.17249
##$PHC1= 0
##$PH_mod= 1
##$PKNL= yes
##$PPARMOD= 0
##$PPDIAG= 0
##$PPIPTYP= 0
##$PPMPNUM= 2147483647
##$PPRESOL= 1
##$PSCAL= 4
##$PSIGN= 0
##$PYNMP= <proc.py>
##$REVERSE= no
##$SF= 400.13000496456
##$SI= 131072
##$SIGF1= 0
##$SIGF2= 0
##$SINO= 400
##$SIOLD= 131072
##$SPECTYP= <>
##$SREGLST= <1H.CDCl3>
##$SSB= 0
##$STSI= 131072
##$STSR= 0
##$SW_p= 8223.68421052632
##$SYMM= 0
##$S_DEV= 0
##$TDeff= 65536
##$TDoff= 0
##$TI= <>
##$TILT= no
##$TM1= 0
##$TM2= 0
##$TOPLEV= 0
##$USERP1= <user>
##$USERP2= <user>
##$USERP3= <user>
##$USERP4= <user>
##$USERP5= <user>
##$WDW= 1
##$XDIM= 131072
##$YMAX_p= 472752004
##$YMIN_p= -296169330
##$CURPLOT= <Network HP LaserJet P1505>
##$CURPRIN= <$Network HP LaserJet P1505>
##$DFORMAT= <normdp>
##$LAYOUT= <+/1D_H.xwp>
##$LFORMAT= <normlp>
##$PFORMAT= <normpl>
##$SURQMSG= 1
$$ End of Bruker specific parameters
$$ ---------------------------------
##NTUPLES= NMR SPECTRUM
##VAR_NAME=  FREQUENCY,     SPECTRUM/REAL,   SPECTRUM/IMAG
##SYMBOL=    X,             R,               I
##VAR_TYPE=  INDEPENDENT,   DEPENDENT,       DEPENDENT
##VAR_FORM=  AFFN,          ASDF,            ASDF
##VAR_DIM=   131072,        131072,          131072
##UNITS=     HZ,            ARBITRARY UNITS, ARBITRARY UNITS
##FACTOR=    0.0627417313425165, 1,          1
##FIRST=     8223.62146879498, -4781,        -103819
##LAST=      0,             -1698,           -106416
##MIN=       0,             -296169330,      0
##MAX=       8223.62146879498, 472752004,    0
$$ Real data points
##PAGE= N=1
##DATA TABLE= (X++(R..R)), XYDATA
$$ [...]
62966C863558J4293P95j1242k3570l7754n2748o5852p5495q2245q7266r0988r3359
$$ 3863558 3877851 3878646 3867404 3843834 3806080 3753332 3687480 3611985 3529740 3442474 3351486 3258127
62954C258127r4338r3383q9359q1934p2769o4338n7610n1630m5181l7927k9906
$$ 3258127 3163789 3070406 2981047 2899113 2826344 2762006 2704396 2652766 2607585 2569658 2539752
62943B539752k1084j2076m404Q05M107P147J0952J5176J8795K1241K2919K4669
$$ 2539752 2518668 2506592 2502188 2502993 2507100 2514247 2525199 2540375 2559170 2580411 2603330 2627999
62931B627999K6407K6604K3954J9649J6766J6799J7757J6533J2278O337k83p888
$$ 2627999 2654406 2681010 2704964 2724613 2741379 2758178 2775935 2792468 2804746 2811083 2810800 2802912
62919B802912j6671k5831l4502m2567n0198n7273o3605o9229p4102p7895q0186
$$ 2802912 2786241 2760410 2725908 2683341 2633143 2575870 2512265 2443036 2368934 2291039 2210853
62908B210853q0635p9017p5473p0818o6260o2688o0232n8271n5695n1621m6290
$$ 2210853 2130218 2051201 1975728 1904910 1838650 1775962 1715730 1657459 1601764 1550143 1503853
62897A503853m1068l7197l4747l2964l1174k9073k6686k4389k2451k0341j7315
$$ 1503853 1462785 1425588 1390841 1357877 1326703 1297630 1270944 1246555 1224104 1203763 1186448
62886A186448j3980j2145j2430j3223j2953j2111j1766j1425j0232r138r675j1215
$$ 1186448 1172468 1160323 1147893 1134670 1121717 1109606 1097840 1086415 1076183 1067045 1057370 1046155
62874A046155j1786j1201j1008j1424j1033r840r852j1694j3071j2070r921q868
$$ 1046155 1034369 1023168 1012160 1000736 989703 979863 970011 958317 945246 933176 923255 914387
62862I14387q956q661p402n896m867m678n333n802m512j598O31P00PL71J162P93
$$ 914387 905431 896770 889368 883472 878605 873927 868594 862792 858280 856682 857313 858013 858020 858391 859553 860346
62846H60346k50l23L65K69m34l8J420J825M59o62rJ174J221P59J261K174J662
$$ 860346 860096 859773 860138 860407 859973 859935 861355 863180 863639 862977 862968 864142 865363 866122 867383 869557 871219
62829H71219k96j538o28J310K232J624N62j03o89j717k706k605j360l39p66k157
$$ 871219 870923 869385 868757 870067 872299 873923 874485 874382 873693 871976 869270 866665 865305 864966 864200 862043
62813H62043k969k571j958k431m008n303m820k589o06j141m081o637o449m405
$$ 862043 859074 856503 854545 852114 848106 842803 837983 835394 834788 833647 829566 822929 816480 812075
62799H12075l138l344l400k558k275l401m143k701n05m69k538l505j557J187J806
$$ 812075 808937 805593 802193 799635 797360 793959 789816 787115 786610 786141 783603 780098 778541 779728 781534
62784G81534M40n77k82J16k28l84P20K597M018M717N302N894N892N050L938L098
$$ 781534 781974 781397 781115 781231 781003 780619 781339 783936 787954 792671 797973 803867 809759 814809 818747 821845
62768H21845K397J741J820L338N539O474N223L286L003M828O909P449O642N861
$$ 821845 824242 825983 827803 831141 836680 843154 848377 851663 854666 859494 866403 873852 880494 886355
62754H86355N751N894N933O117O759P895R485J1221J2218J1736J0452J0123J1579
$$ 886355 892106 898000 903933 910050 916809 924704 934189 945410 957628 969364 979816 989939 1001518
62741A001518J3754J5274J6288J8011K0975K4443K7355K9163K9974L0461L1517
$$ 1001518 1015272 1030546 1046834 1064845 1085820 1110263 1137618 1166781 1196755 1227216 1258733
62730A258733L3636L6712M0655M5682N1539N7022O1107O4278O8111P3591Q0329
$$ 1258733 1292369 1329081 1369736 1415418 1466957 1523979 1585086 1649364 1717475 1791066 1871395
62719A871395Q7100R2681R6701J00324J05583J13029J20334J24286J23996J21242
$$ 1871395 1958495 2051176 2147877 2248201 2353784 2466813 2587147 2711433 2835429 2956671
62709B956671J17690J12930J05373R4124P9560O2775M4788K5950O090j4530l4749
$$ 2956671 3074361 3187291 3292664 3386788 3466348 3529123 3573911 3599861 3605951 3591421 3556672
62698C556672n3502p0696q6295r9231j08564j15203j20906j25650j27638j26075
$$ 3556672 3503170 3432474 3346179 3246948 3138384 3023181 2902275 2776625 2648987 2522912
62688B522912j22333j17968j13200j07955j02701r7416r1169q3850p7012p1789
$$ 2522912 2400579 2282611 2169411 2061456 1958755 1861339 1770170 1686320 1609308 1537519
62678A537519o7100o1330n4907m9668m6108m2768l8402l3560k9676k7280k5461
$$ 1537519 1470419 1409089 1354182 1304514 1258406 1215638 1177236 1143676 1114000 1086720 1061259
62667A061259k2900j9325j5896j3809j2742j1274q765n932l454j109J397L776
$$ 1061259 1038359 1019034 1003138 989329 976587 965313 956548 950616 947162 946053 947450 951226
62655I51226N825P757R422J0294J0657J1642J3513J5398J7350K0932K6542L1868
$$ 951226 957051 964808 974230 984524 995181 1006823 1020336 1035734 1053084 1074016 1100558 1132426
62643A132426L4802L6412L9054M2712M5620M7718N0728N4944N8689O1446O4976
$$ 1132426 1167228 1203640 1242694 1285406 1331026 1378744 1429472 1484416 1543105 1604551 1669527
62632A669527P0097P4478P5227P2455O8637O5177O1095N4858M6265L6204K5330
$$ 1669527 1739624 1814102 1889329 1961784 2030421 2095598 2156693 2211551 2257816 2294020 2319350
62621B319350J3491M08j3293k6021l6459m4652n1639n8250o4606p0450p5304p8456
$$ 2319350 2332841 2333249 2319956 2293935 2257476 2212824 2161185 2102935 2038329 1967879 1892575 1814119
62609A814119p9454p8660p6808p4082p0202o5375o0466n6114n2231m8550m5227
$$ 1814119 1734665 1656005 1579197 1505115 1434913 1369538 1309072 1252958 1200727 1152177 1106950
62598A106950m2574m0358l7638l3508k8312k3945k2201k2598k2591k0495j7353
$$ 1106950 1064376 1024018 986380 952872 924560 900615 878414 855816 833225 812730 795377
62587G95377j5271j4738j4662j4306j3827j3203j2123j0944j0437j0407r757q160
$$ 795377 780106 765368 750706 736400 722573 709370 697247 686303 675866 665459 655702 647542
62575F47542o531n486m448k895j490j178j849k573k727k235j156K78J465J911
$$ 647542 641011 635525 631077 628182 626692 625514 623665 621092 618365 616130 614974 615252 616717 618628
62561F18628J945K455L947O036P850Q700Q396P310O259O199P583R875J1872J2880
$$ 618628 620573 623028 626975 633011 640861 649561 657957 665267 671526 677725 685308 695183 707055 719935
62547G19935J3485J4847J7340K0308K3033K5329K7240K8931L0989L3924L7156
$$ 719935 733420 748267 765607 785915 808948 834277 861517 890448 921437 955361 992517
62536I92517L9494M1019M3285M7005N0844N3543N6022N9844O4407O7418O7706
$$ 992517 1032011 1073030 1116315 1163320 1214164 1267707 1323729 1383573 1447980 1515398 1583104
62525A583104O5877O2329N6569M8738M0187L1682K2372J1355n65j1578k0859k9063
$$ 1583104 1648981 1711310 1767879 1816617 1856804 1888486 1910858 1922213 1921648 1910070 1889211 1860148
62513A860148l7061m4688n0898n4984n7455n9328o0654o0484n8636n6384n4701
$$ 1860148 1823087 1778399 1727501 1672517 1615062 1555734 1495080 1434596 1375960 1319576 1264875
62502A264875n2653m8856m3803l9331l6056l2954k9510k6681k5304k4711k3586
$$ 1264875 1212222 1163366 1119563 1080232 1044176 1011222 981712 955031 929727 905016 881430
62491H81430k1431j8848j6970j6700j7811j8722j7976j5931j4214j3596j3323
$$ 881430 859999 841151 824181 807481 789670 770948 752972 737041 722827 709231 695908
62480F95908j2469j0948r123p449o419n991n121k976m85O94O73J309L464N821
$$ 695908 683439 672491 663368 655919 649500 643509 638388 635412 634927 635621 636294 637603 641067 646888
62466F46888O980P361Q265J0193J2736J5165J6659J6874J6790J7891K0181K2144
$$ 646888 653868 661229 669494 679687 692423 707588 724247 741121 757911 775802 795983 818127
62454H18127K3144K4423K7015L0135L2666L4992L7992M1048M2392M1175L8213
$$ 818127 841271 865694 892709 922844 955510 990502 1028494 1069542 1111934 1153109 1191322
62443A191322L4954L2252K9747K6021J9888J1956M252k021p493j3116j8776k3987
$$ 1191322 1226276 1258528 1288275 1314296 1334184 1346140 1350392 1348371 1340878 1327762 1308986 1284999
62431A284999k8747l2862l5403l5860l5003l3757l2155l0208k8731k8111k7219
$$ 1284999 1256252 1223390 1187987 1152127 1117124 1083367 1051212 1021004 992273 964162 936943
62420I36943k4952k2070k0054j8704j6554j3339j0507r113q672q337p935p329
$$ 936943 911991 889921 869867 851163 834609 821270 810763 801650 792978 784641 776706 769377
62408G69377n864l224l19J425J526Q13L36L14L18L67J247L322N586O702O783P116
$$ 769377 763513 760289 759970 761395 762921 763734 764070 764384 764702 765069 766316 769638 775224 781926 788709 795825
62392G95825Q149R044R435J0252J2012J3445J2967J0780Q506P249O878O736O089
$$ 795825 803974 813018 822453 832705 844717 858162 871129 881909 890415 897664 904542 911278 917367
62379I17367M196P90l506p536j0263j1182j0817j0870j2717j5529j7119j7051
$$ 917367 921563 922353 918847 911311 901048 889866 879049 868179 855462 839933 822814 805763
62367H05763j7151j8285j8481j5861j1721q718p213n694m034l715m901n478l612
$$ 805763 788612 770327 751846 735985 724264 715546 708333 702639 698605 694890 689989 684511 680899
62354F80899K84M429P174P518N659L389K758L991N704O982Q032Q903R162R039
$$ 680899 681183 685612 692786 700304 705963 709352 712110 716101 721805 728787 736819 745722 754884 763923
62340G63923R388J0168J0437J0163J0493J1754J2768J2802J2628J2752J2245J0451
$$ 763923 773311 783479 793916 804079 814572 826326 839094 851896 864524 877276 889521 899972
62328H99972Q458P335O182L684O88o79j17N78L37R7R15K418L911N725Q340J1131
$$ 899972 908430 915765 921947 925631 926319 925640 925523 926101 926438 926535 927450 929868 933779 939504 947844 958975
62312I58975J3160J4792J7378K1544K6685L1954L6785M0544M3082M5973N1711
$$ 958975 972135 986927 1004305 1025849 1052534 1084488 1121273 1161817 1204899 1250872 1302583
62301A302583O0522O8990P3305P3489P2947P4043P5659P5297P1979O6343N9219
$$ 1302583 1363105 1432095 1505400 1578889 1651836 1725879 1801538 1876835 1948814 2015157 2074376
62290B074376N1136M2410L2860K1941R864k043j2642k1909l0162l7391m3982n0819
$$ 2074376 2125512 2167922 2200782 2222723 2232587 2230544 2217902 2195993 2165831 2128440 2084458 2033639
62278B033639n7559o2066o3010o2048o1720o2042o1068n8292n5190n2497m9264
$$ 2033639 1976080 1914014 1851004 1788956 1727236 1665194 1604126 1545834 1490644 1438147 1388883
62267A388883m5128m1443l9244l7718l5668l3163l0750k8364k5999k4252k3008
$$ 1388883 1343755 1302312 1263068 1225350 1189682 1156519 1125769 1097405 1071406 1047154 1024146
62256A024146k0655j6073j0749p438o973p604p307n597l115o27J160J659Q89l17
$$ 1024146 1003491 987418 976669 969231 962258 954654 947347 941750 938635 938008 939168 940827 941716 941399
62242I41399r33n56M24J259J580J768K390L231L267J951J61o10J91J843L368M347
$$ 941399 940466 939910 940334 941593 943173 944941 947331 950562 953829 955780 955941 955331 955522 957365 960733 965080
62226I65080M879N200N551O031O511O977P859R555J1633J3051J3498J3912J5213
$$ 965080 969959 975159 980710 986741 993252 1000229 1008088 1017643 1029276 1042327 1055825 1069737 1084950
62213A084950J7027J8332J9088K0297K2505K5185K7952L1316L5565L9784M3081
$$ 1084950 1101977 1120309 1139397 1159694 1182199 1207384 1235336 1266652 1302217 1342001 1385082
62202A385082M6208N0739N6761O2710O7469P1416P5068P7869P8839P7442P3396
$$ 1385082 1431290 1482029 1538790 1601500 1668969 1740385 1815453 1893322 1972161 2049603 2122999
62191B122999O6553N7571M7688L7169K5095J1451j750j2641k1853l1295m1246
$$ 2122999 2189552 2247123 2294811 2331980 2357075 2368526 2366776 2354135 2332282 2300987 2259741
62180B259741n0079n6542o0805o3410o4653o5143o5598o5723o4215o0311n4676
$$ 2259741 2209662 2153120 2092315 2028905 1964252 1899109 1833511 1767788 1703573 1643262 1588586
62169A588586m8615m3062l8390l4459l0701k6677k2544j8501j4256r773o027l901
$$ 1588586 1539971 1496909 1458519 1424060 1393359 1366682 1344138 1325637 1311381 1301608 1295581 1291680
62157A291680k647p19J974M030M786N108N744O309O492O910P944Q860Q909Q437
$$ 1291680 1289033 1288314 1290288 1294318 1299104 1304212 1309956 1316265 1322757 1329667 1337611 1346471 1355380 1363817
62143A363817Q224Q429Q967J0029J1459J2373J2372J2536J4259J7435K0722K3358
$$ 1363817 1372041 1380470 1389437 1399466 1410925 1423298 1435670 1448206 1462465 1479900 1500622 1523980
62131A523980K5790K8591L1615L4429L6961L9264M0956M1373M0298L8249L5702
$$ 1523980 1549770 1578361 1609976 1644405 1681366 1720630 1761586 1802959 1843257 1881506 1917208
62120A917208L2330K7621K2463J9071J8601J9532J9524J8502J8655K1524K6408
$$ 1917208 1949538 1977159 1999622 2018693 2037294 2056826 2076350 2094852 2113507 2135031 2161439
62109B161439L1851L7293M2618M7171N0107N1159N0557M8653M5853M2243L7123
$$ 2161439 2193290 2230583 2273201 2320372 2370479 2421638 2472195 2520848 2566701 2608944 2646067
62098B646067K9794K1098J3107O873J464m151r493j3693j7149k0761k4200k6296
$$ 2646067 2675861 2696959 2710066 2716939 2718403 2714252 2704759 2691066 2673917 2653156 2628956 2602660
62086B602660k6842k6853k6981k6703k5175k2158j7983j3295r057o296n324n187
$$ 2602660 2575818 2548965 2521984 2495281 2470106 2447948 2429965 2416670 2407613 2401317 2395993 2390806
62074B390806m181j335K457N221O240P051R334J2343J3920J3872J4468J7088K0243
$$ 2390806 2386625 2385290 2387747 2392968 2399208 2406259 2415593 2427936 2441856 2455728 2470196 2487284 2507527
62061B507527K2076K3119K4959K7361K8870K9631L1442L4838L7989L9149L8912
$$ 2507527 2529603 2552722 2577681 2605042 2633912 2663543 2694985 2729823 2767812 2806961 2845873
62050B845873L9235M1069M3691M5993M7727M9556N2062N4918N7246N8710N9621
$$ 2845873 2885108 2926177 2969868 3015861 3063588 3113144 3165206 3220124 3277370 3336080 3395701
62039C395701N9781N8123N4347N0176M7917M8118M9716N2049N5349N9149O1572
$$ 3395701 3455482 3513605 3567952 3618128 3666045 3714163 3763879 3815928 3871277 3930426 3991998
62028C991998O1002N7764N3794N1094N0661N2296N5078N8318O2152O6846P1706
$$ 3991998 4053000 4110764 4164558 4215652 4266313 4318609 4373687 4432005 4494157 4561003 4632709
62017D632709P5332P6962P6915P5772P3841P1588O9766O8788O8454O8449O8489
$$ 4632709 4708041 4785003 4861918 4937690 5011531 5083119 5152885 5221673 5290127 5358576 5427065
62006E427065O7954O6263O3826O1856O0683N8950N5039M8750M1123L3211K5706
$$ 5427065 5495019 5561282 5625108 5686964 5747647 5806597 5861636 5910386 5951509 5984720 6010426
61995F010426J9268J4274J0245O075R82m962j1080j6543k0795k3885k6397k8786
$$ 6010426 6029694 6043968 6054213 6060288 6061270 6056308 6045228 6028685 6007890 5984005 5957608 5928822
61983E928822l0975l2649l3705l4122l3721l2326k9951k6716k2999j9874j8648
$$ 5928822 5897847 5865198 5831493 5797371 5763650 5731324 5701373 5674657 5651658 5631784 5613136
61972E613136j9371k0315j9772j8023j6609j5942j4906j2973j1293j0999j1464
$$ 5613136 5593765 5573450 5553678 5535655 5519046 5503104 5488198 5475225 5463932 5452933 5441469
61961E441469j1291j0409r979j0417j0685r809q285p416p741q522q530p079m515
$$ 5441469 5430178 5419769 5409790 5399373 5388688 5378879 5370594 5363178 5355437 5346915 5338385 5331306 5326791
61948E326791j937k85M70J093K046K993L505L817M472N372N636M463J665k688
$$ 5326791 5324854 5324569 5325039 5326132 5328178 5331171 5334676 5338493 5342965 5348337 5353973 5358436 5360101 5357413
61934E357413q729j6347k4439l1293l6168m0059m4427m9309n3399n5874n7221
$$ 5357413 5348684 5332337 5307898 5276605 5240437 5200378 5155951 5106642 5053243 4997369 4940148
61923D940148n8122n8458n8041n7311n6501n4932n2270m9595m7801m5730m1873
$$ 4940148 4882026 4823568 4765527 4708216 4651715 4596783 4544513 4494918 4447117 4401387 4359514
61912D359514l7534l5871l7422l8974l7813l4832l2086k9542k6335k3483k2640
$$ 4359514 4321980 4286109 4248687 4209713 4171900 4137068 4104982 4075440 4049105 4025622 4002982
61901D002982k3128k2715k0925j9214j8051j6252j3457j0914r246p456m917k549
$$ 4002982 3979854 3957139 3936214 3917000 3898949 3882697 3869240 3858326 3849080 3841624 3836707 3834158
61889C834158j097K92K723N959R069J1671J3876J5978J8744K2879K7665L1369
$$ 3834158 3833061 3833353 3836076 3842035 3851104 3862775 3876651 3892629 3911373 3934252 3961917 3993286
61877C993286L3667L6283M0414M4834M7731M9219N0798N3336N6903O1633O7254
$$ 3993286 4026953 4063236 4103650 4148484 4196215 4245434 4296232 4349568 4406471 4468104 4535358
61866D535358P2394P5870P8464Q2266Q8498R6962J07116J18445J30106J41580
$$ 4535358 4607752 4683622 4762086 4844352 4932850 5029812 5136928 5255373 5385479 5527059
61856E527059J53726J68156J85518K05304K27184K51392K77747L05445L34286
$$ 5527059 5680785 5848941 6034459 6239763 6466947 6718339 6996086 7301531 7635817
61847G635817L65405M00289M39311M81420N24943N68671O12314O55676O97232
$$ 7635817 8001222 8401511 8840822 9322242 9847185 10415856 11028170 11683846 12381078
61838A2381078P33846P62042P78528P78802P56225P04117O19106N02081L56861
$$ 12381078 13114924 13876966 14655494 15434296 16190521 16894638 17513744 18015825 18372686
61829A8372686J89771J0543j68398l35375m82408o05029p00409p66925q05471
$$ 18372686 18562457 18573000 18404602 18069227 17586819 16981790 16281381 15514456 14708985
61820A4708985q20190q16989q00809p74155p38227o95139o48332o00785n53628
$$ 14708985 13888795 13071806 12270997 11496842 10758615 10063476 9415144 8814359 8260731
61811H260731n07160m62436m21021l83520l49332l17738k88426k60972k34804
$$ 8260731 7753571 7291135 6870114 6486594 6137262 5819524 5531098 5270126 5035322
61802E035322k09913j87112j67180j50144j35329j21786j08700r5871q3779p2934
$$ 5035322 4825409 4638297 4471117 4320973 4185644 4063858 3955158 3859287 3775508 3702574
61792C702574o3264n4494m6712l9979l3785k7682k2340j8939j7523j6804j5931
$$ 3702574 3639310 3584816 3538104 3498125 3464340 3436658 3414318 3395379 3377856 3361052 3345121
61781C345121j5452j6083j7204j7386j6076j4040j2186j0435p995m441k20M014
$$ 3345121 3329669 3313586 3296382 3278996 3262920 3248880 3236694 3226259 3218264 3213823 3213603 3217617
61769C217617Q214J2749J7415K1243K3532K4520K4610K3500K0908J7775J5737
$$ 3217617 3225831 3238580 3255995 3277238 3300770 3325290 3349900 3373400 3394308 3412083 3427820
61758C427820J5277J5390J5317J5818J8141K2279K6976L1176L4989L9257M4729
$$ 3427820 3443097 3458487 3473804 3489622 3507763 3530042 3557018 3588194 3623183 3662440 3707169
61747C707169N1674N9844O8602P7315Q5846R4486J03324J12023J20554J29815
$$ 3707169 3758843 3818687 3887289 3964604 4050450 4144936 4248260 4360283 4480837 4610652
61737D610652J40785J53122J65481J77519J90608K05835K22153K37690K52378
$$ 4610652 4751437 4904559 5070040 5247559 5438167 5644002 5866155 6103845 6356223
61728F356223K68022K86032L06465L29246L54820L83260M14194M48088M86359
$$ 6356223 6624245 6910277 7216742 7545988 7900808 8284068 8698262 9146350 9632709
61719I632709N29596N77071O28784O86517P51559Q22555Q97001R74029J054114
$$ 9632709 10162305 10739376 11368160 12054677 12806236 13628791 14525792 15499821 16553935
61710A6553935J136326J217185J291896J355366J401816J424305J414766J364249
$$ 16553935 17690261 18907446 20199342 21554708 22956524 24380829 25795595 27159844
61702B7159844J264001J107937Q95114O30949L27542L323l19580o20316q83180
$$ 27159844 28423845 29531782 30426896 31057845 31385387 31388710 31069130 30448814 29565634
61693B9565634j098113j260219j370459j435026j461407j454980j420454j364922
$$ 29565634 28467521 27207302 25836843 24401817 22940410 21485430 20064976 18700054
61685A8700054j296663j221071j140152j056086r72751q93179q17773p46146o79075
$$ 18700054 17403391 16182320 15042168 13986082 13013331 12120152 11302379 10556233 9877158
61676I877158o17667n61922n11238m65412m24298l87264l53600l22843k94506
$$ 9877158 9259491 8697569 8186331 7720919 7296621 6909357 6555757 6232914 5938408
61667E938408k68326k44854k24740k07360j91285j76191j62955j51748j41678
$$ 5938408 5670082 5425228 5200488 4993128 4801843 4625652 4462697 4310949 4169271
61658D169271j32641j25775j21295j17490j12736j07046j00817r3679q5893p9348
$$ 4169271 4036630 3910855 3789560 3672070 3559334 3452288 3351471 3257792 3171899 3092551
61648C092551p5460p3015o9711o5114o0563n6714n2933m8957m5728m4108m3750
$$ 3092551 3017091 2944076 2874365 2809251 2748688 2691974 2639041 2590084 2544356 2500248 2456498
61637B456498m3544m2688m1097l9066l6747l4107l1591l0404l1261l2927l3173
$$ 2456498 2412954 2370266 2329169 2290103 2253356 2219249 2187658 2157254 2125993 2093066 2059893
61626B059893l1348k8922k7222k6044k5027k4719k5242k5275k3745k1448j9715
$$ 2059893 2028545 1999623 1972401 1946357 1921330 1896611 1871369 1846094 1822349 1800901 1781186
61615A781186j8479j7126j6158j6318j6774j6087j4546j3729j4019j4354j4320
$$ 1781186 1762707 1745581 1729423 1713105 1696331 1680244 1665698 1651969 1637950 1623596 1609276
61604A609276j4541j4842j3999j1881j0127r809r869q817o868n315m616m148l307
$$ 1609276 1594735 1579893 1565894 1554013 1543886 1534077 1524208 1515391 1508523 1503208 1498592 1494444 1491137
61591A491137k001m23J023J839J977J964K114K203K245K932M590O221O437N184
$$ 1491137 1489136 1488713 1489736 1491575 1493552 1495516 1497630 1499833 1502078 1505010 1509600 1515821 1522258 1527442
61577A527442L801L403L846M269M061L148J849P97P32J976L981N570N803M789
$$ 1527442 1531243 1534646 1538492 1542761 1546822 1549970 1551819 1552616 1553348 1555324 1559305 1564875 1570678 1575467
61563A575467L601L111K826J285k133o088q524q987r016j0136j2115j3744j4692
$$ 1575467 1579068 1582179 1585005 1586290 1584157 1578069 1569545 1560558 1551542 1541406 1529291 1515547 1500855
61550A500855j5703j7129j8207j8091j6782j4717j2208r782q413q476q964q578
$$ 1500855 1485152 1468023 1449816 1431725 1414943 1400226 1388018 1378236 1369823 1361347 1352383 1343805
61538A343805p273n826m276j989O88K283K178J611J989L187M335N403O905Q573
$$ 1343805 1336532 1330706 1326430 1324441 1325129 1327412 1329590 1331201 1333190 1336377 1340712 1346115 1353020 1361593
61524A361593R544R891J0857J3377J6937K0159K2143K3072K3819K5074K6741K8314
$$ 1361593 1371137 1381028 1391885 1405262 1422199 1442358 1464501 1487573 1511392 1536466 1563207 1591521
61512A591521K9809L1897L4800L7681L9711M1312M3390M5710M7057M7073M6812
$$ 1591521 1621330 1653227 1688027 1725708 1765419 1806731 1850121 1895831 1942888 1989961 2036773
61501B036773M7025M6987M5765M3943M2926M2828M2141L9822L6760L4628L3774
$$ 2036773 2083798 2130785 2176550 2220493 2263419 2306247 2348388 2388210 2424970 2459598 2493372
61490B493372L2928L0867K7741K4675K2407K0557J8011J3985Q885M115Q13j251
$$ 2493372 2526300 2557167 2584908 2609583 2631990 2652547 2670558 2684543 2693428 2697543 2698356 2697105
61478B697105l198n548p700r019r703j0158j0092q832o266k762J443O130J0590
$$ 2697105 2693907 2688359 2680659 2671640 2661937 2651779 2641687 2632855 2626589 2623827 2625270 2631400 2641990
61465B641990J4228J7649K2235K8459L5291M1614M7509N3848O1248O9797P9308
$$ 2641990 2656218 2673867 2696102 2724561 2759852 2801466 2848975 2902823 2964071 3033868 3113176
61454C113176Q9381R9645J10290J21993J35002J48733J62592J76786J91985K08510
$$ 3113176 3202557 3302202 3412492 3534485 3669487 3818220 3980812 4157598 4349583 4558093
61444D558093K26134K44193K61569K77051K90202L01393L10357L14934L11926
$$ 4558093 4784227 5028420 5289989 5567040 5857242 6158635 6468992 6783926 7095852
61435G095852K99157K76398K44489K04211J56348J02636M6441p847n6654r8769
$$ 7095852 7395009 7671407 7915896 8120107 8276455 8379091 8425532 8417685 8361031 8262262
61425H262262j34901j65613j90064k07016k16596k20370k19858k15409k06734
$$ 8262262 8127361 7961748 7771684 7564668 7348072 7127702 6907844 6692435 6485701
61416F485701j94139j78944j62601j45623j27716j09080r0966p4400n8782m2699
$$ 6485701 6291562 6112618 5950017 5804394 5676678 5567598 5476632 5402232 5343450 5300751
61406E300751k6067j0413L247J5694K8089M0212N0948N9859O7327P3679P9100
$$ 5300751 5274684 5264271 5267518 5283212 5311301 5351513 5402461 5462320 5529647 5603326 5682426
61395E682426Q4004Q8451R1376R1569Q9475Q7088Q5780Q5144Q4167Q2620Q0827
$$ 5682426 5766430 5854881 5946257 6037826 6127301 6214389 6300169 6385313 6469480 6552100 6632927
61384F632927P8823P6442P3676P0400O6212O1208N6461N2851M9584M4841L7969
$$ 6632927 6711750 6788192 6861868 6932268 6998480 7059688 7116149 7169000 7218584 7263425 7301394
61373G301394L0279K3384J7545J2111O764J621l517r101j5049k0688k5430k9051
$$ 7301394 7331673 7355057 7372602 7384713 7391477 7393098 7389581 7380480 7365431 7344743 7319313 7290262
61361G290262l1463l2935l4381l6495l8474l8454l5689l1474k7624k4807k2844
$$ 7290262 7258799 7225864 7191483 7154988 7116514 7078060 7042371 7010897 6983273 6958466 6935622
61350F935622k1615k0900k0020j8692j7709j7965j9192k0575k2025k3753k4926
$$ 6935622 6914007 6893107 6873087 6854395 6836686 6818721 6799529 6778954 6756929 6733176 6708250
61339F708250k4153k1352j7894j4440r726k076Q500K0423L2470M5105N9899P7842
$$ 6708250 6684097 6662745 6644851 6630411 6620685 6618609 6627109 6647532 6680002 6725107 6785006 6862848
61327F862848R8464J20662J43990J68516J93574K17749K40471K62480K84053L03691
$$ 6862848 6961312 7081974 7225964 7394480 7588054 7805803 8046274 8308754 8592807 8896498
61317H896498L19423L30350L35897L34588L24856L06333K79032K42209J95754
$$ 8896498 9215921 9546271 9882168 10216756 10541612 10847945 11126977 11369186 11564940
61308A1564940J42028Q4722K6403l1171q5343j33556j75719k13291k46267k73429
$$ 11564940 11706968 11791690 11818093 11786922 11701579 11568023 11392304 11179013 10932746 10659317
61298A0659317k95340l13954l28844l36816l36547l30963l23678l15319l04914
$$ 10659317 10363977 10050023 9721179 9384363 9047816 8716853 8393175 8077856 7772942
61289G772942k92558k78712k62734k44201k24570k05622j87246j68415j49367
$$ 7772942 7480384 7201672 6938938 6694737 6470167 6264545 6077299 5908884 5759517
61280E759517j31292j14661r9217q4787p0878n6401m1060k6197j3111j477R524
$$ 5759517 5628225 5513564 5414347 5329560 5258682 5202281 5161221 5135024 5121913 5120436 5129960
61269E129960J9740K8856L7410M5592N2282N6795O0323O3982O6665O6724O4682
$$ 5129960 5149700 5178556 5215966 5261558 5313840 5370635 5430958 5494940 5561605 5628329 5693011
61258E693011O2205N9251N4589M8646M3455L9697L5788L0290K3628J7133J1552
$$ 5693011 5755216 5814467 5869056 5917702 5961157 6000854 6036642 6066932 6090560 6107693 6119245
61247F119245O624J240n861j4580k3071k9831l5547m1654m7784n2332n5094n7605
$$ 6119245 6125869 6127109 6121248 6106668 6083597 6053766 6018219 5976565 5928781 5876449 5821355 5763750
61235E763750o0891o4415o7354o9539p0956p1417p0942o9694o7583o4528o0719
$$ 5763750 5702859 5638444 5571090 5501551 5430595 5359178 5288236 5218542 5150959 5086431 5025712
61224E025712n6104n0368m4141l9169l6162l3620l0153k6769k5144k4753k3851
$$ 5025712 4969608 4919240 4875099 4835930 4799768 4766148 4735995 4709226 4684082 4659329 4635478
61213D635478k2566k2646k4409k6134k6509k5643k3614k0050j5404j0884o766
$$ 4635478 4612912 4590266 4565857 4539723 4513214 4487571 4463957 4443907 4428503 4417619 4410853
61202D410853k229K991Q293J3618J9634K6509L3936M2365N2560O3963P5094Q5620
$$ 4410853 4408624 4411615 4419908 4433526 4453160 4479669 4513605 4555970 4608530 4672493 4747587 4833207
61190D833207R6392J07468J17729J26474J33562J37916J37724J32385J22529J07913
$$ 4833207 4929599 5037067 5154796 5281270 5414832 5552748 5690472 5822857 5945386 6053299
61180F053299Q7139N9778K7120r294m8032q6273j20165j47432j68251j83302j92765
$$ 6053299 6140438 6200216 6227336 6218042 6170010 6083737 5963572 5816140 5647889 5464587 5271822
61169E271822j97486j99007j97703j92773j84622j75305j65885j55423j43373
$$ 5271822 5074336 4875329 4677626 4484853 4300231 4124926 3959041 3803618 3660245
61160C660245j30874j18684j06051r2996q1693p3839o8244o2615n6321m9878m3184
$$ 3660245 3529371 3410687 3304636 3211640 3129947 3056108 2987864 2925249 2868928 2819050 2775866
61149B775866l6084k9510k4206j9182j3132o638j330K693O919J2080J7086K0382
$$ 2775866 2739782 2710272 2686066 2666884 2653752 2647114 2645784 2648477 2655396 2667476 2684562 2704944
61137B704944K1353K0346J8041J4939J1167O834K590p73l255n480p667r692j2025
$$ 2704944 2726297 2746643 2764684 2779623 2790790 2797624 2800214 2799441 2796186 2790706 2783039 2773347 2761322
61124B761322j5378j9176k1924k3384k4867k6927k8482k8927k9399l0860l2560
$$ 2761322 2745944 2726768 2704844 2681460 2656593 2629666 2601184 2572257 2542858 2511998 2479438
61113B479438l3621l4571l5943l6863l6687l6781l8680m1450m2821m2400m1857
$$ 2479438 2445817 2411246 2375303 2338440 2301753 2264972 2226292 2184842 2142021 2099621 2057764
61102B057764m2150m2436m1709m0009l7765l5311l3247l2079l1173k9189k6068
$$ 2057764 2015614 1973178 1931469 1891460 1853695 1818384 1785137 1753058 1721885 1692696 1666628
61091A666628k3722k4020k6577k9182l0305l0503l1173l2362l2605l0939k8300
$$ 1666628 1642906 1618886 1592309 1563127 1532822 1502319 1471146 1438784 1406179 1375240 1346940
61080A346940k6258k4997k3391k0717j7332j3923j0999r011p862o566m333j783
$$ 1346940 1320682 1295685 1272294 1251577 1234245 1220322 1209323 1200312 1192450 1185884 1181551 1179768
61068A179768N2J552L876O824R029J0294J1850J4051J5660J5964J5811J5886J5710
$$ 1179768 1179820 1181372 1185248 1192072 1201101 1211395 1223245 1237296 1252956 1268920 1284731 1300617 1316327
61055A316327J5079J4823J5199J5113J3962J2791J2606J2840J2384J0899Q305
$$ 1316327 1331406 1346229 1361428 1376541 1390503 1403294 1415900 1428740 1441124 1452023 1460328
61044A460328M516N06j949k607l399n621q170r672j0619j1875j2728j2247j1367
$$ 1460328 1464844 1465350 1463401 1460794 1457395 1451774 1443604 1433932 1423313 1411438 1398710 1386463 1375096
61031A375096j1544j2300j1893r927p748o681p019q218r031q204o050m495m518
$$ 1375096 1363552 1351252 1339359 1329432 1321684 1315003 1307984 1299766 1290735 1282531 1276481 1271986 1267468
61018A267468m597k973l56J103P51k35q44j093j189j070p01JJ192K554L319L330
$$ 1267468 1262871 1259898 1259542 1260645 1261396 1261161 1260317 1259224 1258035 1256965 1256264 1256265 1257457 1260011 1263330 1266660
61002A266660L290L491L367K820K761L667M840N872P336R259J0395J0192J0047
$$ 1266660 1269950 1273441 1276808 1279628 1282389 1286056 1290896 1296768 1304104 1313363 1323758 1333950 1343997
60989A343997J1335J3612J5779J7745J9714K1230K2185K3440K5429K7527K9712
$$ 1343997 1355332 1368944 1384723 1402468 1422182 1443412 1465597 1489037 1514466 1541993 1571705
60978A571705L3105L7688M1434M3075M3885M5362M7221M9229N2672N7995O3145
$$ 1571705 1604810 1642498 1683932 1727007 1770892 1816254 1863475 1912704 1965376 2023371 2086516
60967B086516O6460O9188P2967P6970Q0133Q4082R0871R9418J07106J13560J20078
$$ 2086516 2152976 2222164 2295131 2372101 2452234 2536316 2627187 2726605 2833711 2947271 3067349
60956C067349J26837J33498J41162J50831J61176J70552J79728J89964K00164
$$ 3067349 3194186 3327684 3468846 3619677 3780853 3951405 4131133 4321097 4521261
60947D521261K08974K18053K29925K44490K60939K81045L06491L34869L62876
$$ 4521261 4730235 4948288 5178213 5422703 5683642 5964687 6271178 6606047 6968923
60938F968923L91989M26580M68294N17292N77479O54663P50626Q64330R97168
$$ 6968923 7360912 7787492 8255786 8773078 9350557 10005220 10755846 11620176 12617344
60929A2617344J150192J318246J495490J685882J899039K137770K402626K703530
$$ 12617344 13767536 15085782 16581272 18267154 20166193 22303963 24706589 27410119
60921B7410119L034001L311273L367246L052282K376680J537351P86122K71537
$$ 27410119 30444120 33755393 37122639 40174921 42551601 44088952 44875074 45146611
60913D5146611N766n3256N4826K50155L61260J87312l52375j138824j936531k553772
$$ 45146611 45152377 45099121 45153947 45404102 45765362 45952674 45600299 44461475 42524944 39971172
60903C9971172k927084l086622l085288k969379k782482k562327k330002k093456
$$ 39971172 37044088 33957466 30872178 27902799 25120317 22557990 20227988 18134532
60895A8134532j861210j644447j447844j268089j103007r55819q29462p22365
$$ 18134532 16273322 14628875 13181031 11912942 10809935 9854116 9024654 8302289
60887H302289o31471n55085m91318m37220l90937l52183l19674k90562k63192
$$ 8302289 7670818 7115733 6624415 6187195 5796258 5444075 5124401 4833839 4570647
60878D570647k38232k16382j96925j79202j63842j51764j42965j36526j30999
$$ 4570647 4332415 4116033 3919108 3739906 3576064 3424300 3281335 3144809 3013810
60869C013810j25026j18431j12263j07025j01832r6206r1224q7445q3206p6933
$$ 3013810 2888784 2770353 2658090 2551065 2449233 2353027 2261803 2174358 2091152 2014219
60859B014219o9915o4633o1302n8303n5075n2152m9113m5124m1228l9467l9618
$$ 2014219 1944304 1879671 1818369 1760066 1704991 1652839 1603726 1558602 1517374 1477907 1438289
60848A438289l9122l6564l3134l0294k7888k5173k2150j9375j7410j6654j6729
$$ 1438289 1399167 1362603 1329469 1299175 1271287 1246114 1223964 1204589 1187179 1170525 1153796
60837A153796j6252j4359j2097j1043j1000j0518r152p525n615k918j49J208J204
$$ 1153796 1137544 1123185 1111088 1100045 1089045 1078527 1069375 1061850 1056235 1053317 1053168 1054376 1055580
60824A055580J400K361K945K524K125K705L677L916L138J747K17r25j375j621
$$ 1055580 1056980 1059341 1062286 1064810 1066935 1069640 1073317 1077233 1080371 1082118 1082335 1081410 1080035 1078414
60810A078414k559m278n967o976p228o745n688m797m727m968m402k876j347n54
$$ 1078414 1075855 1071577 1065610 1058634 1051406 1044661 1038973 1034176 1029449 1024481 1020079 1017203 1015856 1015302
60796A015302l99n52o01K31K505N730Q964J2006J5003J7283J7944J7382J6974
$$ 1015302 1014903 1014351 1013750 1013981 1016486 1022216 1031180 1043186 1058189 1075472 1093416 1110798 1127772
60783A127772J7176J7305J7099J7125J7420J7198J6204J5202J4653J4001J2632
$$ 1127772 1144948 1162253 1179352 1196477 1213897 1231095 1247299 1262501 1277154 1291155 1303787
60772A303787J0562P970N064K689J854K249K375J649J249K184L657M281M025L797
$$ 1303787 1314349 1322319 1327383 1330072 1331926 1334175 1336550 1338199 1339448 1341632 1345289 1349570 1353595 1357392
60758A357392L642K616M41j764k814k961l483m995o779p967q818j0165j1913j2969
$$ 1357392 1361034 1363650 1364091 1362327 1359513 1356552 1353069 1348074 1341295 1333328 1324510 1314345 1302432 1289463
60744A289463j2852j2467j2879j3987j4816j4455j2377q834n529m745o776q987
$$ 1289463 1276611 1264144 1251265 1237278 1222462 1208007 1195630 1186796 1181267 1176522 1169746 1160759
60732A160759q561n569k313l20O70J415K289L606N416P042P865Q488R999J2257
$$ 1160759 1152198 1146629 1144316 1143996 1144666 1146081 1148370 1151976 1157392 1164434 1172299 1180787 1190786 1203043
60718A203043J3984J4531J4432J4410J4960J6697J9663K2292K2609K0839J9444
$$ 1203043 1217027 1231558 1245990 1260400 1275360 1292057 1311720 1334012 1356621 1377460 1396904
60707A396904K0056K1564K1851K0301J7746J4946J2180R915Q758Q702Q973Q723
$$ 1396904 1416960 1438524 1460375 1480676 1498422 1513368 1525548 1535463 1544221 1552923 1561896 1570619
60695A570619P606N759L625J890J237J686K169J347p66k518k651k114k664m141
$$ 1570619 1578225 1583984 1587609 1589499 1590736 1592422 1594591 1595938 1595172 1592654 1590003 1587889 1585225 1581084
60681A581084m781m406n144q048j0987j1533j0480j0450j1955j3004j2284j0736
$$ 1581084 1576303 1571897 1566753 1558705 1547718 1536185 1525705 1515255 1503300 1490296 1478012 1467276
60669A467276r881j0115j0910j1449j0929r226p313o143n374m006j911K67K192
$$ 1467276 1457395 1447280 1436370 1424921 1413992 1404766 1397453 1391310 1385936 1381930 1380019 1380286 1382478
60656A382478L657L923K646J091R40K102L018K953K531K206J660O98o00k531n253
$$ 1382478 1386135 1390058 1392704 1393795 1394735 1396837 1399855 1402808 1405339 1407545 1409205 1409903 1409303 1406772 1401519
60641A401519p703q396p241n429l741k237j195q91p67m05q73l392o985r541j0912
$$ 1401519 1393816 1385420 1378179 1372750 1369009 1366772 1365577 1364686 1363919 1363514 1362641 1359249 1352264 1342723 1331811
60626A331811j2738j5186j6417j5758j4958j5430j6324j6366j5737j5116j4489
$$ 1331811 1319073 1303887 1287470 1271712 1256754 1241324 1225000 1208634 1192897 1177781 1163292
60615A163292j3883j3649j3255j1484q755p387q379r581q468n299k159j13J234
$$ 1163292 1149409 1135760 1122505 1111021 1102266 1094879 1086500 1076919 1068451 1063152 1060993 1060880 1062114
60602A062114K354L355M294N093N743O937R316J1663J1629R060O841P205Q991
$$ 1062114 1064468 1067823 1072117 1077210 1082953 1089890 1099206 1110869 1122498 1131558 1138399 1145604 1154595
60589A154595J0039J0458J1517J2668J2127R731P184N664M960M726M979N423N660
$$ 1154595 1164634 1175092 1186609 1199277 1211404 1221135 1228319 1233983 1238943 1243669 1248648 1254071 1259731
60576A259731N994O879P830Q071Q026Q912J0924J2977J4187J4663J4875J5199
$$ 1259731 1265725 1272604 1280434 1288505 1296531 1305443 1316367 1329344 1343531 1358194 1373069 1388268
60564A388268J5967J7125J7943J7842J7357J7462J8166J8598J8248J7338J6072
$$ 1388268 1404235 1421360 1439303 1457145 1474502 1491964 1510130 1528728 1546976 1564314 1580386
60553A580386J4443J2743J1458J0622R770Q479O500L488p14n562j0036j3404j5706
$$ 1580386 1594829 1607572 1619030 1629652 1639422 1647901 1654401 1657889 1657175 1651613 1641577 1628173 1612467
60540A612467j7687k0348k3997k7515k9100k8037k5251k2025j8942j6283j4366
$$ 1612467 1594780 1574432 1550435 1522920 1493820 1465783 1440532 1418507 1399565 1383282 1368916
60529A368916j2924j1066q551o154m267k216K70K089K404K167K836M328N506N969
$$ 1368916 1355992 1344926 1336375 1330221 1325954 1323738 1324008 1326097 1328501 1330668 1333504 1337832 1343338 1349307
60515A349307O067N740M778L761L505L890M332M974O211P529Q089Q100Q367Q793
$$ 1349307 1355374 1361114 1365892 1369653 1373158 1377048 1381380 1386354 1392565 1400094 1408183 1416283 1424650 1433443
60501A433443Q690Q234Q302R000R652J0025J0325J0229R266P995P386P275O874
$$ 1433443 1442133 1450367 1458669 1467669 1477321 1487346 1497671 1507900 1517166 1525161 1532547 1539822 1546696
60488A546696O718Q268J1556J4921J7457K0062K3578K7532L1389L5511M0045M4146
$$ 1546696 1553414 1561682 1573238 1588159 1605616 1625678 1649256 1676788 1708177 1743688 1783733 1827879
60476A827879M7103M8977M9367M6935M1159L3267K4338J3783J287j0931j9640
$$ 1827879 1874982 1923959 1973326 2020261 2061420 2094687 2119025 2132808 2134095 2123164 2103524
60465B103524k4003k5776k6412k5649k3080j9405j5398j0863n476J03M842Q614
$$ 2103524 2079521 2053745 2027333 2001684 1978604 1959199 1943801 1932938 1927462 1927565 1932407 1941021
60453A941021J2121J5673J8742K0808K2264K4173K7355L1790L6914M2234M7725
$$ 1941021 1953142 1968815 1987557 2008365 2030629 2054802 2082157 2113947 2150861 2193095 2240820
60442B240820N3834O1181P0106Q0240R0625J00585J10438J21099J32875J45030
$$ 2240820 2294654 2355835 2425941 2506181 2596806 2697391 2807829 2928928 3061803 3206833
60432C206833J56742J68206J80397J93997K09123K26189K46416K70831K98898
$$ 3206833 3363575 3531781 3712178 3906175 4115298 4341487 4587903 4858734 5157632
60423E157632L28611L57733L83916M02986M08080L92080L51487K87509K03679
$$ 5157632 5486243 5843976 6227892 6630878 7038958 7431038 7782525 8070034 8273713
60414H273713J03929o298j18335k21655l07620l71952m14327m36871m43013m36448
$$ 8273713 8377642 8371344 8253009 8031354 7723734 7351782 6937455 6500584 6057571 5621123
60404E621123m20208l96736l68680l38969l09691k81419k53957k27451k02541
$$ 5621123 5200915 4804179 4435499 4096530 3786839 3505420 3251463 3024012 2821471
60395B821471j79933j60172j43423j29013j15554j02167q9465p8759p0358o3300
$$ 2821471 2641538 2481366 2337943 2208930 2093376 1991209 1901744 1822985 1752627 1689327
60385A689327n6804n1177m6844m3203l9269l5181l2103l0502k9245k6804k2891
$$ 1689327 1632523 1581346 1534502 1491299 1452030 1416849 1384746 1354244 1324999 1298195 1275304
60374A275304j8604j5356j3983j4292j5082j5038j4115j3550j4081j4705j4037
$$ 1275304 1256700 1241344 1227361 1213069 1197987 1182949 1168834 1155284 1141203 1126498 1112461
60363A112461j2268j0668r584q190o277m849m592m884m812m196l156j613K22J684
$$ 1112461 1100193 1089525 1079941 1071751 1065474 1060625 1056033 1051149 1046337 1042141 1038985 1037372 1037594 1039278
60349A039278K613L575M609M749L660K700L236M619N075M150L044K834L562M911
$$ 1039278 1041891 1045466 1050075 1054824 1058484 1061184 1064420 1069039 1074114 1078264 1081308 1084142 1087704 1092615
60335A092615O445P237O545N239N344P559J0105J0704R118O970N525M590L484
$$ 1092615 1099060 1106297 1112842 1118081 1123425 1130984 1141089 1151793 1160911 1167881 1173406 1177996 1181480
60322A181480K238J350Q70L70l16q91j300k030l262m174l907k860k263k497k734
$$ 1181480 1183718 1185068 1185938 1186308 1185992 1185101 1183801 1181771 1178509 1174335 1170428 1167568 1165305 1162808 1160074
60307A160074k270j320l19N09P04j24j031j21K865N532N717M543M980P729J0269
$$ 1160074 1157804 1156484 1156165 1156674 1157378 1157254 1156223 1156102 1158967 1164499 1170216 1174759 1179739 1187468 1197737
60292A197737J0202Q150O748P589R813J1372J1144R880R103R271R436Q764P656
$$ 1197737 1207939 1216089 1222837 1230426 1240239 1251611 1262755 1272635 1281738 1291009 1300445 1309209 1316865
60279A316865O766N676L433J27k908m412m133k707j187m09k79R1J090J935J885
$$ 1316865 1323631 1329307 1332740 1332867 1329959 1325547 1321414 1318707 1317520 1317111 1316832 1316923 1318013 1319948 1321833
60264A321833J367J154R97K05r24j462j384j536k228k984l579m122m166l030j079
$$ 1321833 1323200 1324354 1325351 1325556 1324632 1323170 1321786 1320250 1318022 1315038 1311459 1307337 1303171 1300141 1299062
60249A299062L77O74K32n52j661k544k261r17K43N95P60J085Q48k65j241j256
$$ 1299062 1299439 1300113 1300345 1299793 1298132 1295588 1293327 1292410 1292653 1293248 1294008 1295093 1295941 1295676 1294435 1293179
60233A293179j061j599k091q94J947M373M640L171J803J814L015M482N831P529
$$ 1293179 1292118 1290519 1288428 1287534 1289481 1293854 1298494 1301665 1303468 1305282 1308297 1312779 1318610 1326139
60219A326139J0009J2927J5628J7954J9951K1123K0994K0205J9988K0362K0069
$$ 1326139 1336148 1349075 1364703 1382657 1402608 1423731 1444725 1464930 1484918 1505280 1525349
60208A525349J8612J7138J6697J6844J6857J7222J8658K0447K1159K0909K1610
$$ 1525349 1543961 1561099 1577796 1594640 1611497 1628719 1647377 1667824 1688983 1709892 1731502
60197A731502K4795K9922L4993L8358L9966M1333M4317M9480N5711O1521O6459
$$ 1731502 1756297 1786219 1821212 1859570 1899536 1940869 1985186 2034666 2090377 2151898 2218357
60186B218357P1002P5739Q1171Q7830R5793J04293J12490J20433J28681J37315
$$ 2218357 2289359 2365098 2446269 2534099 2629892 2734185 2846675 2967108 3095789 3233104
60176C233104J45940J54384J62427J69089J73248J75177J76427J77696J77510
$$ 3233104 3379044 3533428 3695855 3864944 4038192 4213369 4389796 4567492 4745002
60167D745002J73569J64975J52625J37958J21908J04915Q7127O8400M8541K7954
$$ 4745002 4918571 5083546 5236171 5374129 5496037 5600952 5688079 5756479 5805020 5832974
60157E832974P909j0031k4890l6407m4415m8564m8996m6873m3516l8932l1852
$$ 5832974 5840883 5830852 5805962 5769555 5725140 5676576 5627580 5580707 5537191 5498259 5466407
60146E466407k1484q564N767K1371L8476N6207P2959Q8376J03649J19382J34237
$$ 5466407 5444923 5436359 5442126 5463497 5501973 5558180 5631139 5719515 5823164 5942546 6076783
60135F076783J46563J56477J65028J71662J73966J70163J60707J47001J29779
$$ 6076783 6223346 6379823 6544851 6716513 6890479 7060642 7221349 7368350 7498129
60126G498129J09615Q7852O5570M2042J5930j1809l7731n9208p6774r2315j05918
$$ 7498129 7607744 7695596 7761166 7803208 7819138 7807329 7769598 7710390 7633616 7541301 7435383
60115G435383j15685j20141j19527j14865j06913r6252q3425o8572n1493l2425
$$ 7435383 7319698 7199557 7080030 6965165 6858252 6762000 6678575 6610003 6558510 6526085
60105F526085j2245Q298K9068M9843O9519Q6427R9394J08395J14172J17193J16912
$$ 6526085 6513840 6522138 6551206 6601049 6670568 6756995 6856389 6964784 7078956 7196149 7313061
60094G313061J12263J03209R1452P9125O6925N4262M1051K8487J7889R771M452
$$ 7313061 7425324 7528533 7619985 7699110 7766035 7820297 7861348 7889835 7907724 7917495 7921947
60083G921947K742N297J1774K1420L4158N0422P0074R2146J15626J40022J65178
$$ 7921947 7924689 7929986 7941760 7963180 7997338 8047760 8117834 8209980 8325606 8465628 8630806
60072H630806J91134K18254K46955K77121L07989L38902L69837M00965M31768
$$ 8630806 8821940 9040194 9287149 9564270 9872259 10211161 10580998 10981963 11413731
60063A1413731M60849M86612N07951N24195N34560N37920N33061N19026M95190
$$ 11413731 11874580 12361192 12869143 13393338 13927898 14465818 14998879 15517905 16013095
60054A6013095M61439M18445L67453L09449K44752J73926R8874K2282n4103j29839
$$ 16013095 16474534 16892979 17260432 17569881 17814633 17988559 18087433 18109715 18055612 17925773
60044A7925773k04035k73868l35586l86773m26840m55508m71837m75344m67352
$$ 17925773 17721738 17447870 17112284 16725511 16298671 15843163 15371326 14895982 14428630
60035A4428630m50227m25394l93044l53961l10690k66089k21279j76054j31034
$$ 14428630 13978403 13553009 13159965 12806004 12495314 12229225 12007946 11831892 11700858
60026A1700858q8187m8961j3107J9843M8669P1026Q5615R2928R4007Q9178P8244
$$ 11700858 11612671 11563710 11550603 11570446 11619115 11690141 11775756 11868684 11962691 12051869 12130113
60015A2130113O1450M0118J6394p930l2555n8140q4372j09412j31985j53100j74251
$$ 12130113 12191563 12231681 12248075 12240145 12207590 12149450 12065078 11955666 11823681 11670581 11496330
60004A1496330j94437k10790k22314k31143k39210k45232k46341k41687k32884
$$ 11496330 11301893 11091103 10868789 10637646 10398436 10153204 9906863 9665176 9432292
59995I432292k21383k07140j90031j71110j51583j31243j08798q3651n6725k9546
$$ 9432292 9210909 9003769 8813738 8642628 8491045 8359802 8251004 8167353 8110628 8081082
59985H081082k953K3037M8459P3006R6292J17914J36999J52207J62680J68607
$$ 8081082 8078129 8101166 8149625 8222631 8318923 8436837 8573836 8726043 8888723 9057330
59975I057330J70300J67069J57870J42834J23171R9492P1419L9381N692k7166
$$ 9057330 9227630 9394699 9552569 9695403 9818574 9918066 9989485 10028866 10034558 10007392
59965A0007392n8682q9726j20155j48052j71282j88805k00346k05820k05545k00325
$$ 10007392 9948710 9858984 9738829 9590777 9419495 9230690 9030344 8824524 8618979 8418654
59955H418654j90663j76494j58321j38058j17625r6940p4379m9460k3892O84K4926
$$ 8418654 8227991 8051497 7893176 7755118 7637493 7540553 7466174 7416714 7392822 7393506 7418432
59944G418432N0578P7790J05051J31509J57665J83424K07041K26881K42949K55601
$$ 7418432 7469010 7546800 7651851 7783360 7941025 8124449 8331490 8558371 8801320 9056921
59934I056921K63628K64869K58235K44007K22652J94690J61481J24887Q6038M5416
$$ 9056921 9320549 9585418 9843653 10087660 10310312 10505002 10666483 10791370 10877408 10922824
59924A0922824M107l6107p4008j09273j41194j68044j88159k00957k06625k05455
$$ 10922824 10926931 10890824 10816816 10707543 10566349 10398305 10210146 10009189 9802564 9597109
59914I597109j97777j84081j64968j41468j15316q8160o0486l1972k982K5153
$$ 9597109 9399332 9215251 9050283 8908815 8793499 8705339 8644853 8612881 8609899 8635052
59904H635052N1440P5797R8145J17803J34275J47824J58814J67214J72971J76163
$$ 8635052 8686492 8762289 8860434 8978237 9112512 9260336 9419150 9586364 9759335 9935498
59894I935498J76413J73018J66113J56860J46102J33680J19665J05416R2742Q2631
$$ 9935498 10111911 10284929 10451042 10607902 10754004 10887684 11007349 11112765 11205507 11288138
59884A1288138P5297P0760O8832O9440P3697Q3853J01204J24712J52517J84156
$$ 11288138 11363435 11434195 11503027 11572467 11646164 11730017 11831221 11955933 12108450 12292606
59874A2292606K20127K59766L00962L42080L83044M24036M63618M98462N24716
$$ 12292606 12512733 12772499 13073461 13415541 13798585 14222621 14686239 15184701 15709417
59865A5709417N39558N41579N29749N02273M57135L93916L14470K21724J18778
$$ 15709417 16248975 16790554 17320303 17822576 18279711 18673627 18988097 19209821 19328599
59856A9328599R759r9543k03041k96198l76003m40077m87014n17285n32705n34873
$$ 19328599 19338358 19238815 19035774 18739576 18363573 17923496 17436482 16919197 16386492 15851619
59846A5851619n24888n04333m75610m41097m02548l61132l17416k71371k23221
$$ 15851619 15326731 14822398 14346788 13905691 13503143 13142011 12824595 12553224 12330003
59837A2330003j74315j26532q0773l6621O391M7705Q5907J19480J47268J68620
$$ 12330003 12155688 12029156 11948383 11911762 11918153 11965858 12051765 12171245 12318513 12487133
59827A2487133J83068J89706J87055J73878J49883J15380P0825J7526m1526j02442
$$ 12487133 12670201 12859907 13046962 13220840 13370723 13486103 13556928 13574454 13532928 13430486
59817A3430486j62233k19432k73031l21364l62008l92489m11524m20159m21371
$$ 13430486 13268253 13048821 12775790 12454426 12092418 11699929 11288405 10868246 10446875
59808A0446875m17701m09486l95891l77170l54893l30338l04019k76750k49832
$$ 10446875 10029174 9619688 9223797 8846627 8491734 8161396 7857377 7580627 7330795
59799G330795k23845j98470j73948j51560j32048j14650r8497q4103p2607o4255
$$ 7330795 7106950 6908480 6734532 6582972 6450924 6336274 6237777 6153674 6081067 6016812
59789F016812n8499n4940n3121n1951n0475m8976m8125m7228m4724m0644l7211
$$ 6016812 5958313 5903373 5850252 5798301 5747826 5698850 5650725 5603497 5558773 5518129 5480918
59778E480918l6266l7181l8359l9885m3191m8195n2446n3951n3806n4826n7923
$$ 5480918 5444652 5407471 5369112 5329227 5286036 5237841 5185395 5131444 5077638 5022812 4964889
59767D964889o0983o1465n9100n5403n1256m5949l8624k9860k1394j4542r324
$$ 4964889 4903906 4842441 4783341 4727938 4676682 4630733 4592109 4562249 4540855 4526313 4516989
59756D516989m960p49L774R306J6762K6476L7541M8298N7630O5698P3445Q1493
$$ 4516989 4512029 4511280 4515054 4524360 4541122 4567598 4605139 4653437 4711067 4776765 4850210 4931703
59744D931703Q9463R6112J00064J00686R8540R4981R1035Q6559Q0504P2323O3092
$$ 4931703 5021166 5117278 5217342 5318028 5416568 5511549 5602584 5689143 5769647 5841970 5905062
59733E905062N4992M9383M5788M3255M2280M4405M9966N7608O6459P7572R2214
$$ 5905062 5960054 6009437 6055225 6098480 6140760 6185165 6235131 6292739 6359198 6436770 6528984
59722F528984J09930J29537J51130J75408K01724K28840K57408K89451L25097
$$ 6528984 6638914 6768451 6919581 7094989 7296713 7525553 7782961 8072412 8397509
59713H397509L61719L97033M31080M64054M93745N16098N26477N18858M85765
$$ 8397509 8759228 9156261 9587341 10051395 10545140 11061238 11587715 12106573 12592338
59704A2592338M22111L29595K16464R3707k7508j36390k24177k86855l25510l43728
$$ 12592338 13014449 13344044 13560508 13654215 13626707 13490317 13266140 12979285 12653775 12310047
59694A2310047l45281l33762l12575k84421k51408k15732j79340j42878j05969
$$ 12310047 11964766 11631004 11318429 11034008 10782600 10566868 10387528 10244650 10138681
59685A0138681o8665l1768M232L9247P2499J02819J30761J59055J89841K22204
$$ 10138681 10070016 10038248 10042480 10081727 10154226 10257045 10387806 10546861 10736702 10958906
59675A0958906K53640K83550L14132L47699L84068M21144M57755M95380N36737
$$ 10958906 11212546 11496096 11810228 12157927 12541995 12963139 13420894 13916274 14453011
59666A4453011N82980O32701O83765P35414P87966Q41098Q93558R44438R93527
$$ 14453011 15035991 15668692 16352457 17087871 17875837 18716935 19610493 20554931 21548458
59657B1548458J039771J080102J110441J127800J131315J121789J100781J069955
$$ 21548458 22588229 23668331 24778772 25906572 27037887 28159676 29260457 30330412
59649C0330412J031137R87014R41607Q99609Q64878Q39452Q23355Q14556Q09097
$$ 30330412 31361549 32348563 33290170 34189779 35054657 35894109 36717464 37532020 38341117
59640C8341117Q02134P89415P67727P34300O86825O24478N48351M60512L63211
$$ 38341117 39143251 39932666 40700393 41434693 42121518 42745996 43294347 43754859 44118070
59631D4118070K59478J53952N2396l9602j17451j77870k19206k41405k45098k30600
$$ 44118070 44377548 44531500 44583896 44544294 44426843 44248973 44029767 43788362 43543264 43312664
59621D3312664j98031j48168q2727l926Q5878J84245K88934L98334N11126O25299
$$ 43312664 43114633 42966465 42883738 42879812 42965690 43149935 43438869 43837203 44348329 44973628
59611D4973628P37543Q43669R39168J019177J078208J110381J109911J071218
$$ 44973628 45711171 46554840 47494008 48513185 49591393 50701774 51811685 52882903
59603E2882903R89118Q59847O82663M60769K01376q4271l81063o71787r40491
$$ 52882903 53872021 54731868 55414531 55875300 56076676 55992405 55611342 54939555 53999064
59594E3999064j175069j367332j512273j608575j659339j670767j649479j601522
$$ 53999064 52823995 51456663 49944390 48335815 46676476 45005709 43356230 41754708
59586D1754708j533461j453002j368142j286809j217673j169846j149962j158699
$$ 41754708 40221247 38768245 37400103 36113294 34895621 33725775 32575813 31417114
59578C1417114j189584j230623j268028j290937j294766j280302j249807j204842
$$ 31417114 30227530 28996907 27728879 26437942 25143176 23862874 22613067 21408225
59570B1408225j147684j082622j014099r44397q74270q04949p38084o74445o14270
$$ 21408225 20260541 19177919 18163820 17219423 16345153 15540204 14802120 14127675 13513405
59561A3513405n58425n07694m61336m17942l77556l41334l09187k79620k52077
$$ 13513405 12954980 12447286 11985950 11568008 11190452 10849118 10539931 10260311 10008234
59552A0008234k27633k06757j88165j70853j55784j44427j36793j32091j30284
$$ 10008234 9780601 9573844 9385679 9214826 9059042 8914615 8777822 8645731 8515447
59543H515447j31452j34230j36591j38144j40321j43917j47443j48460j45936
$$ 8515447 8383995 8249765 8113174 7975030 7834709 7690792 7543349 7394889 7248953
59534G248953j40856j34891j28969j22805j15354j05672r3773q0848o8527n7645
$$ 7248953 7108097 6973206 6844237 6721432 6606078 6500406 6406633 6325785 6257258 6199613
59524F199613m7760l7879k7525j7088p361R92P854J4037K0983K9334L7827M4444
$$ 6199613 6151853 6113974 6086449 6069361 6062000 6062992 6070846 6084883 6105866 6135200 6173027 6217471
59512F217471M8816N2609N7243O2216O6317O9521P2838P7041Q2543Q9822R8742
$$ 6217471 6266287 6318896 6376139 6438355 6504672 6574193 6647031 6724072 6806615 6896437 6995179
59501F995179J07891J15978J23785J33629J46753J62289J78813J95848K13636
$$ 6995179 7103070 7219048 7342833 7476462 7623215 7785504 7964317 8160165 8373801
59492H373801K32304K51740K71624K91389L10565L29149L47079L63512L77409
$$ 8373801 8606105 8857845 9129469 9420858 9731423 10060572 10407651 10771163 11148572
59483A1148572L88633L97501M03201M03784L98057L86658L70938L51313L26933
$$ 11148572 11537205 11934706 12337907 12741691 13139748 13526406 13897344 14248657 14575590
59474A4575590K96395K59014K16429J72865J32634R6883O3718L1643J669k4205
$$ 14575590 14871985 15130999 15347428 15520293 15652927 15749810 15813528 15845171 15846840 15822635
59464A5822635m5048o0547o9812p1871o6656n4427l4968q578K2755N6659R2570
$$ 15822635 15777587 15717040 15647228 15575357 15508701 15454274 15419306 15410728 15433483 15490142 15582712
59453A5582712J31149J71188K08395K37792K56380K62735K55082K31175J90207
$$ 15582712 15713861 15885049 16093444 16331236 16587616 16850351 17105433 17336608 17526815
59444A7526815J33938O5552j1918r5591j81771k65979l44281m13982m72826n18183
$$ 17526815 17660753 17726305 17714387 17618796 17437025 17171046 16826765 16412783 15939957 15421774
59434A5421774n47864n61704n61781n50900n31112n03632m69761m31573l91630
$$ 15421774 14873910 14312206 13750425 13199525 12668413 12164781 11695020 11263447 10871817
59425A0871817l51914l12901k73874k34323j94981j57293j22010q8632n6171k4240
$$ 10871817 10519903 10207002 9933128 9698805 9503824 9346531 9224521 9135889 9079718 9055478
59415I055478O768L6455O5216R3947J22822J50780J76655K00517K23052K43796
$$ 9055478 9062246 9098701 9163917 9257864 9380686 9531466 9708121 9908638 10131690 10375486
59405A0375486K60956K73011K79455K79675K72377K56722K32994K01408J61257
$$ 10375486 10636442 10909453 11188908 11468583 11740960 11997682 12230676 12432084 12593341
59396A2593341J12307N6224m144o6257j27766j85980k38654k84872l24089l55147
$$ 12593341 12705648 12761872 12757728 12691471 12563705 12377725 12139071 11854199 11530110 11174963
59386A1174963l77322l91593l99437m00962l95667l84619l70278l54227l36400
$$ 11174963 10797641 10406048 10006611 9605649 9209982 8825363 8455085 8100858 7764458
59377G764458l16496k95049k73217k52348k33407k15896j97947j78614j59343
$$ 7764458 7447962 7152913 6879696 6627348 6393941 6178045 5980098 5801484 5642141
59368E642141j42007j26443j11536r7677q5847p4977o2801m9320l7014k7340j9152
$$ 5642141 5500134 5373691 5262155 5164478 5078631 5003654 4940853 4891533 4854519 4827179 4808027
59357D808027j0952k587N648J3723K1282K8147L5314M3160M8802M8299M2268L6248
$$ 4808027 4797075 4794488 4800136 4813859 4835141 4863288 4898602 4941762 4990564 5038863 5081131 5117379
59345E117379L4248L4787L5088L6209M1451N1619O4567P8035R0328R9321J03568
$$ 5117379 5151627 5186414 5221502 5257711 5299162 5350781 5415348 5493383 5583711 5683032 5786600
59334E786600J04355J04888J07552J13153J21996J33980J48174J63846J81629
$$ 5786600 5890955 5995843 6103395 6216548 6338544 6472524 6620698 6784544 6966173
59325F966173K02340K25177K48514K72200K97681L26113L57436L91141M26792
$$ 6966173 7168513 7393690 7642204 7914404 8212085 8538198 8895634 9286775 9713567
59316I713567M64045N03038N44592N89230O36276O84406P32369P78465Q20137
$$ 9713567 10177612 10680650 11225242 11814472 12450748 13135154 13867523 14645988 15466125
59307A5466125Q54894Q80897Q95843Q96563Q81261Q51599Q11328P63373P09243
$$ 15466125 16321019 17201916 18097759 18994322 19875583 20727182 21538510 22301883 23011126
59298B3011126O50470N89021N26708M65271M06411L50193K93922K34293J70548
$$ 23011126 23661596 24250617 24777325 25242596 25649007 25999200 26293122 26527415 26697963
59289B6697963J04008L4513m0889j25109k17932l16248m16209n14332o06974o90050
$$ 26697963 26801971 26836484 26795595 26670486 26452554 26136306 25720097 25205765 24598791 23908741
59279B3908741p60062q15582q57144q85286q99291q98633q85130q62055q31336
$$ 23908741 23148679 22333097 21475953 20590667 19691376 18792743 17907613 17045558 16214222
59270A6214222p93498p50435p05799o61507o16091n68173n19614m73248m29233
$$ 16214222 15420724 14670289 13964490 13302983 12686892 12118719 11599105 11125857 10696624
59261A0696624l86229l44977l07759k74799k43952k14121j86498j62014j39764
$$ 10696624 10310395 9965418 9657659 9382860 9138908 8924787 8738289 8576275 8436511
59252H436511j18735r9211q1525o5000m9148l4773k2871j2987l592O194J5632
$$ 8436511 8317776 8218565 8137040 8072040 8022892 7988119 7965248 7952261 7948669 7954863 7970495
59241G970495K2989K7108K8649K9429L0333L0478K8988K6628K4612K2672J9827
$$ 7970495 7993484 8020592 8049241 8078670 8109003 8139481 8168469 8195097 8219709 8242381 8262208
59230H262208J6564J4648J5014J7403K1945K9196L8520M8243N8080O9710Q4102
$$ 8262208 8278772 8293420 8308434 8325837 8347782 8376978 8415498 8463741 8521821 8591531 8675633
59219H675633R9534J13172J23613J31020J35904J38913J41181J43538J45426J45316
$$ 8675633 8775167 8888339 9011952 9142972 9278876 9417789 9558970 9702508 9847934 9993250
59209I993250J42090J35345J24527J08725Q7785O3190L7208J1080j5450m2602
$$ 9993250 10135340 10270685 10395212 10503937 10591722 10654912 10692120 10703200 10687750 10645148
59199A0645148o9030r2457j11504j26082j36130j41076j41043j37623j32833j27809
$$ 10645148 10576118 10483661 10372157 10246075 10109945 9968869 9827826 9690203 9557370 9429561
59189I429561j22870j18001j12758j06546r9692r3511q8666q4346p9774p5520
$$ 9429561 9306691 9188690 9075932 8969386 8869694 8776183 8687517 8603171 8523397 8447877
59179H447877p2308o9334o4924n8438n0500m1857l2839k3418j2879M4J5944L4282
$$ 8447877 8375569 8306235 8241311 8182873 8132373 8090516 8057677 8034259 8021380 8021424 8037368 8071650
59167H071650N4699P7693J03129J29412J55653J83589K15604K51578K89366L27635
$$ 8071650 8126349 8204042 8307171 8436583 8592236 8775825 8991429 9243007 9532373 9860008
59157I860008L66307M04637M40817M73295N00722N20503N29117N24035N03997
$$ 9860008 10226315 10630952 11071769 11545064 12045786 12566289 13095406 13619441 14123438
59148A4123438M67620M13500L42076K56083J58921N3654n6348j66927k73373l70516
$$ 14123438 14591058 15004558 15346634 15602717 15761638 15815292 15758944 15592017 15318644 14948128
59138A4948128m53363n19038n67698o00352o16754o17171o05016n85045n59281
$$ 14948128 14494765 13975727 13408029 12807677 12190923 11573752 10968736 10383691 9824410
59129I824410n27433m91167m54692m20453l87160l53452l20804k91042k63383
$$ 9824410 9296977 8805810 8351118 7930665 7543505 7190053 6869249 6578207 6314824
59120F314824k36172k09972j86713j66812j49214j33454j19732j07294r4696q1727
$$ 6314824 6078652 5868680 5681967 5515155 5365941 5232487 5112755 5005461 4910765 4829038
59110D829038o9589n8914m8955l9105l0122k2974j7141j0843l092N240J2761J9443
$$ 4829038 4759449 4700535 4651580 4612475 4582353 4559379 4542238 4531395 4528303 4533543 4546304 4565747
59098D565747K6335L3565L9868M4614M9167N5054O1677O7120P0740P3550P6361
$$ 4565747 4592082 4625647 4665515 4710129 4759296 4814350 4876027 4943147 5013887 5087437 5163798
59087E163798P8989Q1227Q3085Q3866Q2364P8375P3055O7466O1586N4783M6480
$$ 5163798 5242787 5324014 5407099 5490965 5573329 5651704 5724759 5792225 5853811 5908594 5955074
59076E955074L6483K5643J5981Q960L759j442o690j0150j0788r463p160l683J332
$$ 5955074 5991557 6017200 6033181 6042141 6045900 6044458 6037768 6027618 6016830 6007367 6000207 5996524 5997856
59063E997856P492J4399K2242L1175M1020N1862O3859P6294Q8015R8971J10123
$$ 5997856 6005348 6019747 6041989 6073164 6114184 6166046 6229905 6306199 6394214 6493185 6603308
59052F603308J21667J32768J43224J53828J64661J74653J83547J92760K03452
$$ 6603308 6724975 6857743 7000967 7154795 7319456 7494109 7677656 7870416 8073868
59043H073868K14963K25969K36008K45049K52822K59378K65110K69173K68897
$$ 8073868 8288831 8514800 8750808 8995857 9248679 9508057 9773167 10042340 10311237
59034A0311237K61861K47690K26843J98491J60937J13827N9036m92o1873j22483
$$ 10311237 10573098 10820788 11047631 11246122 11407059 11520886 11579922 11579430 11517557 11395074
59024A1395074j79825k31811k77108l15126l45503l67633l81125l86813l86503
$$ 11395074 11215249 10983438 10706330 10391204 10045701 9678068 9296943 8910130 8523627
59015H523627l81402l71754l58442l43547l28198l11342k92292k73068k55978
$$ 8523627 8142225 7770471 7412029 7068482 6740284 6428942 6136650 5863582 5607604
59006E607604k40177k23361k06145j91482j79783j68076j54668j41507j30658
$$ 5607604 5367427 5144066 4937921 4746439 4566656 4398580 4243912 4102405 3971747
58997C971747j21280j11749j02416r4376q7334q0491p4084o8552o3438n8422n4124
$$ 3971747 3850467 3738718 3636302 3541926 3454592 3374101 3300017 3231465 3168027 3109605 3055481
58986C055481n0722m7164m2944l9153l6546l4041l0671k7593k6539k7214k7680
$$ 3055481 3004759 2957595 2914651 2875498 2838952 2804911 2774240 2746647 2720108 2692894 2665214
58975B665214k6637k4242k1517j9783j9650j9674j7270j1854n918k012kJ712L742
$$ 2665214 2638577 2614335 2592818 2573035 2553385 2533711 2516441 2504587 2498669 2496657 2496655 2498367 2502109
58962B502109N637O917O887M753J249j231j394o76q56j499j336o05j74N29K597
$$ 2502109 2507746 2514663 2521550 2526303 2527552 2526321 2524927 2524251 2523395 2521896 2520560 2519955 2519781 2520310 2522907
58947B522907N532P869R316J0623J1821J2261J1966J1443J0473Q308M933J115
$$ 2522907 2528439 2536308 2545624 2556247 2568068 2580329 2592295 2603738 2614211 2622519 2627452 2628567
58935B628567k368m880n968o008o082o552o695o211n772n410l981j263J177K349
$$ 2628567 2626199 2621319 2615351 2609343 2603261 2596709 2590014 2583803 2578031 2572621 2568640 2567377 2568554 2570903
58921B570903L341N134O960Q421J1073J5664J9780K0924K0447K1489K4279K6532
$$ 2570903 2574244 2579378 2586338 2594759 2605832 2621496 2641276 2662200 2682647 2704136 2728415 2754947
58909B754947K7613K9034L1190L2908L4332L7208M1569M4866M5413M4691M5245
$$ 2754947 2782560 2811594 2842784 2875692 2910024 2947232 2988801 3033667 3079080 3123771 3169016
58898C169016M7914N1737N5245N7334N8212N9687O3216O7766P1157P3404P6722
$$ 3169016 3216930 3268667 3323912 3381246 3439458 3499145 3562361 3630127 3701284 3774688 3851410
58887C851410Q1991Q7374R1124R3878R7247J01705J06962J13048J19875J26643
$$ 3851410 3933401 4020775 4111899 4205777 4303024 4404729 4511691 4624739 4744614 4871257
58877D871257J32723J38608J45279J53141J62172J72402J83758J95893K08604
$$ 4871257 5003980 5142588 5287867 5441008 5603180 5775582 5959340 6155233 6363837
58868F363837K22109K36559K51704K67306K83580L01031L20067L40782L62976
$$ 6363837 6585946 6822505 7074209 7341515 7625095 7926126 8246193 8586975 8949951
58859H949951L86502M11761M39498M69834N01798N34245N67003O00898O37055
$$ 8949951 9336453 9748214 10187712 10657546 11159344 11693589 12260592 12861490 13498545
58850A3498545O76256P18280P61451Q03486Q43063Q79861R12703R38769R55012
$$ 13498545 14174801 14893081 15654532 16458018 17301081 18180942 19093645 20032414 20987426
58841B0987426R59336R49754R23683Q78900Q14228P28623O21089M92669L47466
$$ 20987426 21946762 22896516 23820199 24699099 25513327 26241950 26863039 27355708 27703174
58832B7703174J90716K7135j37860k97147m44094n74812o87034p78320q47359
$$ 27703174 27893890 27921025 27783165 27486018 27041924 26467112 25780078 25001758 24154399
58823B4154399q95839r26613r40869r39158r24274r00449q70033q33221p91118
$$ 24154399 23258560 22331947 21391078 20451920 19527646 18627197 17757164 16923943 16132825
58814A6132825p46782p03049o61063o21000n82525n44707n07358m72444m42326
$$ 16132825 15386043 14682994 14021931 13400931 12818406 12273699 11766341 11293897 10851571
58805A0851571m16550l92246l67765l43938l21631l00197k79057k58794k39765
$$ 10851571 10435021 10042775 9675010 9331072 9009441 8709244 8430187 8171393 7931628
58796G931628k21188k02572j84815j68796j53796j38379j22284j06684r2720q0219
$$ 7931628 7710440 7507868 7323053 7154257 7000461 6862082 6739798 6633114 6540394 6460175
58786F460175o7890n4783m1473k9329j8602q065L186J4738K6206L8128N0532O2200
$$ 6460175 6392285 6337502 6296029 6266700 6248098 6240033 6243219 6257957 6284163 6322291 6372823 6435023
58774F435023P2770Q4093R7644J11739J23509J32880J42456J54165J68070J83798
$$ 6435023 6507793 6591886 6689530 6801269 6924778 7057658 7200114 7354279 7522349 7706147
58764G706147K00798K17517K32712K47547K64373K83603L03911L25312L49571
$$ 7706147 7906945 8124462 8357174 8604721 8869094 9152697 9456608 9781920 10131491
58755A0131491L77368M07329M38320M70572N04202N38623N73949O11197O50652
$$ 10131491 10508859 10916188 11354508 11825080 12329282 12867905 13441854 14053051 14703703
58746A4703703O91520P33339P75744Q16663Q52726Q81801R03161R14808R12779
$$ 14703703 15395223 16128562 16904306 17720969 18573695 19455496 20358657 21273465 22186244
58737B2186244Q93739Q56326P99356P20884O20181M99110L60775K08366M6321
$$ 22186244 23079983 23936309 24735665 25456549 26076730 26575840 26936615 27144981 27191302
58728B7191302j18872k80088m31094n66755o83450p79921q56386r12610r48351
$$ 27191302 27072430 26792342 26361248 25794493 25111043 24331122 23474736 22562126 21613775
58719B1613775r65754r68982r60766r41268r11367q74961q36572p97983p58553
$$ 21613775 20648021 19679039 18718273 17777005 16865638 15990677 15154105 14356122 13597569
58710A3597569p17667o75731o33799n93379n55799n20937m87361m54423m23230
$$ 13597569 12879902 12204171 11570372 10976993 10421194 9900257 9412896 8958473 8535243
58701H535243l94882l68755l43583l19429k97630k78982k62594k46451k29194
$$ 8535243 8140361 7771606 7428023 7108594 6810964 6531982 6269388 6022937 5793743
58692E793743k11577j95789j82784j70935j58363j45688j34897j26128j17651
$$ 5793743 5582166 5386377 5203593 5032658 4874295 4728607 4593710 4467582 4349931
58683D349931j08824j00878r4503q8693q2613p6774p1644o6752o1969n8338n6750
$$ 4349931 4241107 4140229 4045726 3957033 3874420 3797646 3726002 3659250 3597281 3538943 3482193
58672C482193n6788n7249n6871n4558n0321m6156m4497m5428m6727m6662m5376
$$ 3482193 3425405 3368156 3311285 3256727 3206406 3160250 3115753 3070325 3023598 2976936 2931560
58661B931560m3678m2354m2690m5655n0043n3303n4565n5088n5573n5140n3525
$$ 2931560 2887882 2845528 2802838 2757183 2707140 2653837 2599272 2544184 2488611 2433471 2379946
58650B379946n2023n1302n0279m8163m5883m4406m3194m1451l9362l7193l4500
$$ 2379946 2327923 2276621 2226342 2178179 2132296 2087890 2044696 2003245 1963883 1926690 1892190
58639A892190l1248k8521k7201k6948k6958k6795k6115k4795k3545k3179k3299
$$ 1892190 1860942 1832421 1805220 1778272 1751314 1724519 1698404 1673609 1650064 1626885 1603586
58628A603586k2997k2542k2613k2250j9826j5982j2996j1232q917n815m103m632
$$ 1603586 1580589 1558047 1535434 1513184 1493358 1477376 1464380 1453148 1444231 1438416 1434313 1429681
58616A429681n187l769j010J843M891Q109J0366J1367J2315J3334J2721J0185
$$ 1429681 1424494 1420725 1419715 1421558 1426449 1434558 1444924 1456291 1468606 1481940 1494661 1504846
58604A504846Q093P726O890L511q46l603n157p424j0018j0829r492p686o442n229
$$ 1504846 1512939 1520665 1527555 1531066 1530220 1526617 1521460 1514036 1504018 1493189 1483697 1476011 1469569 1464340
58590A464340l388q94J853L953M628M858O934J1294J5421J7325J8340K0681K3971
$$ 1464340 1460952 1460058 1461911 1465864 1470492 1475350 1482284 1493578 1508999 1526324 1544664 1565345 1589316
58577A589316K6380K7777K9380L1319L2990L5126L9182M4737M9559N2397N4289
$$ 1589316 1615696 1643473 1672853 1704172 1737162 1772288 1811470 1856207 1905766 1958163 2012452
58566B012452N7062O1471O6697P1051P3735P6184Q0790Q7974R5968J03991J13580
$$ 2012452 2069514 2130985 2197682 2268733 2342468 2418652 2499442 2587416 2683384 2787375 2900955
58555B900955J25656J38338J49477J59682J70944J83566J96489K09487K22950
$$ 2900955 3026611 3164949 3314426 3474108 3645052 3828618 4025107 4234594 4457544
58546D457544K36238K48123K58230K66346K70906K69797K62066K47475K25046
$$ 4457544 4693782 4941905 5200135 5466481 5737387 6007184 6269250 6516725 6741771
58537F741771J93736J54207J08540N8666O243m6353r6198j40813j78316k07310
$$ 6741771 6935507 7089714 7198254 7256920 7263163 7216810 7120612 6979799 6801483 6594173
58527F594173k27575k40410k47465k49729k47883k42598k33981k21936k07616
$$ 6594173 6366598 6126188 5878723 5628994 5381111 5138513 4904532 4682596 4474980
58518D474980j93214j79629j65767j50866j36073j22901j11682j02396r5294q9677
$$ 4474980 4281766 4102137 3936370 3785504 3649431 3526530 3414848 3312452 3217158 3127481
58508C127481q3772p7046p1071o6954o3618n9807n5996n2917m9993m6744m3996
$$ 3127481 3043709 2966663 2895592 2828638 2765020 2705213 2649217 2596300 2546307 2499563 2455567
58497B455567m2154m0052l7274l5825l7388m0381m1949m1690m1354m1735m1960
$$ 2455567 2413413 2373361 2336087 2300262 2262874 2222493 2180544 2138854 2097500 2055765 2013805
58486B013805m1419m0617m0312m0712m1173m0177l6671l1848k8279k6754k5581
$$ 2013805 1972386 1931769 1891457 1850745 1809572 1769395 1732724 1700876 1672597 1645843 1620262
58475A620262k3560k1604k0650k0093j9302j8595j7692j5509j2606j1264j1801
$$ 1620262 1596702 1575098 1554448 1534355 1515053 1496458 1478766 1463257 1450651 1439387 1427586
58464A427586j1465q684n821n717p952j0452j2505j4133j4833j4899j5742j7122
$$ 1427586 1416121 1407437 1401616 1395899 1387947 1377495 1364990 1350857 1336024 1321125 1305383 1288261
58452A288261j6699j4117j2426j3202j3668j1512r158r698j1517j1020q291n994
$$ 1288261 1271562 1257445 1245019 1231817 1218149 1206637 1197479 1187781 1176264 1165244 1156953 1150959
58440A150959m657l082j810k162l163l103k864m089n411m274j329O78J281J941
$$ 1150959 1146302 1143220 1141410 1139248 1136085 1132982 1130118 1126029 1120618 1116344 1115015 1115693 1116974 1118915
58426A118915K505J803Q33J452K582J619r45k174j555j370k315k533j388o84j453
$$ 1118915 1121420 1123223 1124056 1125508 1128090 1129709 1128764 1126590 1125035 1123665 1121350 1118817 1117429 1116745 1115292
58411A115292k411k315j557j014j149k270l962m663l387j204M22J393J756P30
$$ 1115292 1112881 1110566 1109009 1107995 1106846 1104576 1100614 1095951 1092564 1091360 1091782 1093175 1094931 1095661
58397A095661j083r18K139M790M095J872J202J256l38k360k027l77o44k426k411
$$ 1095661 1094578 1093660 1095799 1100589 1104684 1106556 1107758 1109014 1108676 1106316 1104289 1103912 1103268 1100842 1098431
58382A098431j67J607K164L377N559O957P418Q289Q846P080M010K992M574O022
$$ 1098431 1098264 1099871 1102035 1105412 1110971 1117928 1125346 1133635 1142481 1149561 1153571 1156563 1161137 1167159
58368A167159N988N557M676J837k250m730m943n012n790n839m753l847l212j578
$$ 1167159 1173147 1178704 1183380 1185217 1182967 1178237 1173294 1168282 1162492 1156653 1151900 1148053 1144841 1143263
58354A143263O39J716K118M056P438R848J0691J1789J3827J5702J7288J9327K0750
$$ 1143263 1143902 1145618 1147736 1151792 1159230 1169078 1179769 1191558 1205385 1221087 1238375 1257702 1278452
58341A278452J9873J7836J7091J6892J4501J0416P763O719M289k9l274m200m839
$$ 1278452 1298325 1316161 1333252 1350144 1364645 1375061 1382824 1389543 1393832 1393803 1390529 1386329 1381490
58328A381490o007n870m051k904l453l915l279k728k719k221j425j717k583k160
$$ 1381490 1375483 1369613 1365562 1362658 1359205 1355290 1352011 1349283 1346564 1344343 1342918 1341201 1338618 1336458
58314A336458q65o90j141L9K306L074K831M614Q294J0450J0308J0735J2623J3583
$$ 1336458 1335593 1334903 1333762 1333801 1336107 1339181 1342012 1346626 1354920 1365370 1375678 1386413 1399036 1412619
58300A412619J3029J3429J5316J6051J4862J4354J5732J7021J7181J7499J7949
$$ 1412619 1425648 1439077 1454393 1470444 1485306 1499660 1515392 1532413 1549594 1567093 1585042
58289A585042J6798J4632J4102J4877J3861J1044R903J1009J0715P484M219K928
$$ 1585042 1601840 1616472 1630574 1645451 1659312 1670356 1680259 1691268 1701983 1709467 1713686 1716614
58277A716614K357K231M404Q251J0245R633R418J0478J0244Q603R147J2834J6072
$$ 1716614 1718971 1721202 1725606 1733857 1744102 1753735 1763153 1773631 1783875 1792478 1801625 1814459 1830531
58264A830531J7101J8535K1635K3817K4030K4949K7642K9531K9770L1053L3942
$$ 1830531 1847632 1866167 1887802 1911619 1935649 1960598 1988240 2017771 2047541 2078594 2112536
58253B112536L5092L3389L2154L3066L3480L1938L0646L0337K8595K5227K3422
$$ 2112536 2147628 2181017 2213171 2246237 2279717 2311655 2342301 2372638 2401233 2426460 2449882
58242B449882K3493K1855J8254J7354K0671K3634K3551K3781K7018L0915L3521
$$ 2449882 2473375 2495230 2513484 2530838 2551509 2575143 2598694 2622475 2649493 2680408 2713929
58231B713929L6679M1065M4064M5337M8207N3102N6308N7350O0357O5790O8692
$$ 2713929 2750608 2791673 2835737 2881074 2929281 2982383 3038691 3096041 3156398 3222188 3290880
58220C290880O7866O8529P2747P5728P5216P6005Q1129Q7007R1416R7702J06755
$$ 3290880 3358746 3427275 3500022 3575750 3650966 3726971 3808100 3895107 3986523 4084225 4190980
58209D190980J13573J16388J20496J28322J34683J36857J40195J48337J57047
$$ 4190980 4304553 4420941 4541437 4669759 4804442 4941299 5081494 5229831 5386878
58200E386878J63308J71351J83884J96565K07021K19947K37373K53516K65376
$$ 5386878 5550186 5721537 5905421 6101986 6309007 6528954 6766327 7019843 7285219
58191G285219K78556K96377L13587L27363L43685L65771L87119M03595M21161
$$ 7285219 7563775 7860152 8173739 8501102 8844787 9210558 9597677 10001272 10422433
58182A0422433M43957M66440M85632N09026N41315N75305O05374O37583O76742
$$ 10422433 10866390 11332830 11818462 12327488 12868803 13444108 14049482 14687065 15363807
58173A5363807P16212P50937P87610Q31227Q75096R15718R63345J025243J092517
$$ 15363807 16080019 16830956 17618566 18449793 19324889 20240607 21203952 22229195 23321712
58164B3321712J156589J224249J302857J385988J468464J559884J667443J781338
$$ 23321712 24478301 25702550 27005407 28391395 29859859 31419743 33087186 34868524
58156C4868524J893808K015885K157758K310012K463434K629280K819672L026867
$$ 34868524 36762332 38778217 40935975 43245987 45709421 48338701 51158373 54185240
58148E4185240L243571L484037L762621M074183M421768M840328N364629N998290
$$ 54185240 57428811 60912848 64675469 68749652 73171420 78011748 83376377 89374667
58140H9374667O744827P641197Q726040J0004801J1481898J3186381J5116236
$$ 89374667 96119494 103760691 112486731 122491532 133973430 147159811 162276047
58133A62276047J7198987J9365674K1622366K4000868K6525668K9295487L2368072
$$ 162276047 179475034 198840708 220463074 244463942 270989610 300285097 332653169
58126C32653169L5181933L6066910L2820969K4319598J1709425k102084j4200728
$$ 332653169 367835102 403902012 436722981 461042579 472752004 470649920 456449192
58119D56449192k3025291k8428368l0980250l1421544l0472218k8725500k6550719
$$ 456449192 433423901 404995533 374015283 342593739 312121521 283396021 256845302
58112B56845302k4135106k1622013j9155326j6811730j4579599j2434034j0385090
$$ 256845302 232710196 211088183 191932857 175121127 160541528 148107494 137722404
58105A37722404q438732o581687m878903l570542k979764l242464m119342n117663
$$ 137722404 129283672 122701985 117823082 114252540 111272776 108030312 103910970 98793307
58097I8793307n827924o144170o185227o078176n863840n555388n190346m802965
$$ 98793307 92965383 86821213 80635986 74557810 68693970 63138582 57948236 53145271
58089E3145271m399498l987426l595778l245621k927626k627535k350852k106012
$$ 53145271 48745773 44758347 41162569 37916948 34989322 32361787 30010935 27904923
58081B7904923j885630j682546j505671j362549j242193j131251j032691r53485
$$ 27904923 26019293 24336747 22831076 21468527 20226334 19095083 18062392 17108907
58073A7108907q87535q25587p69581p22986o78549o29503n82328n44959n12311
$$ 17108907 16221372 15395785 14626204 13903218 13224669 12595166 12012838 11467879 10955568
58064A0955568m76332m40841m13339l90780l66484l43621l29153l20759l11391
$$ 10955568 10479236 10038395 9625056 9234276 8867792 8524171 8195018 7874259 7562868
58055G562868l01057k93205k85073k72126k57170k45335k34763k21214k06887
$$ 7562868 7261811 6968606 6683533 6411407 6154237 5908902 5674139 5452925 5246038
58046E246038j95999j86540j74921j63927j57723j53694j47276j40183j35999
$$ 5246038 5050039 4863499 4688578 4524651 4366928 4213234 4065958 3925775 3789776
58037C789776j32447j25937j19092j15703j12758j05556r6602r1275q8434q3285
$$ 3789776 3657329 3531392 3412300 3296597 3183839 3078283 2981681 2890406 2801972 2718687
58027B718687p6232p1099o7574o2845n8074n6134n5475n2929m9927m9646n0695
$$ 2718687 2642455 2571356 2503782 2440937 2382863 2326729 2271254 2218325 2168398 2118752 2068057
58016B068057m9953m8719m9620n0240m6579m0455l6952l6464l5488l3395l2280
$$ 2068057 2018104 1969385 1919765 1869525 1822946 1782491 1745539 1709075 1673587 1640192 1607912
58005A607912l1755k9735k7095k6207k6196k4617k2366k1974k2583k1339j8362
$$ 1607912 1576157 1546422 1519327 1493120 1466924 1442307 1419941 1397967 1375384 1354045 1335683
57994A335683j5892j4097j1885j0250j0752j2256j2862j3092j3861j3661j1352
$$ 1335683 1319791 1305694 1293809 1283559 1272807 1260551 1247689 1234597 1220736 1207075 1195723
57983A195723r045q662q544p090o377q147r808q730o988p104o902l816p06j425
$$ 1195723 1186678 1178016 1169472 1162382 1156005 1147858 1138050 1129320 1122332 1115228 1108326 1104510 1103804 1102379
57969A102379l818l331q76o59k431k575j258j935m589n778m993n098o636p105
$$ 1102379 1098561 1095230 1094354 1093695 1091264 1088689 1087431 1085496 1080907 1075129 1070136 1065038 1058402 1051297
57955A051297n957n280n443m659k971k446l487m748o185q509j0412j0250r408
$$ 1051297 1045340 1040060 1034617 1029958 1026987 1024541 1021054 1016306 1010121 1001612 991200 980950 971542
57942I71542j0049j0791q979n975n325o655o299l564j444j339j811k537m808p806
$$ 971542 961493 950702 941723 935748 930423 923768 917469 913905 912461 911122 909311 906774 901966 894160
57928H94160q713p094n356m709m359m423n696o629m642o93J439N98p48j006j106
$$ 894160 885447 878353 872997 868288 863929 859506 853810 847181 842539 841846 843285 843883 843135 842129 841023
57913H41023j374p90K00k78k074k909k053r40p4J204K025O80j907l083k902l771
$$ 841023 839649 838859 839059 838781 836707 833798 831745 830805 830731 831935 833960 834640 832733 829650 826748 822977
57897H22977n589n582l582l107n843q929r350p581n318k873n10M89o4l63P95K582
$$ 822977 817388 811806 808224 805117 799274 790345 780995 773414 768096 765223 764713 765202 765138 764775 765570 768152
57881G68152M139N654O627N657K951O74k24j171l030m544m953n712q044j0713
$$ 768152 772291 777945 784572 790229 793180 793854 793630 792459 789429 784885 779932 774220 766176 755463
57867G55463j1715j0792r085p641p160p909r115r452q546p015n152k991j463j667
$$ 755463 743748 732956 723871 716230 709070 701161 692046 682594 674048 667033 661881 658890 657427 655760
57853F55760k904l162j675N49K605M459N966O827P365P865P639O444N837P046
$$ 655760 652856 649694 648019 648568 651173 655632 661598 668425 675790 683655 691294 697738 703575 710621
57839G10621Q465P935O576P193R368R626O639K935Q11l76j969l875n607p156q049
$$ 710621 719086 727021 733597 740790 750158 759784 766423 769358 770169 769793 767824 763949 758342 751186 743137
57824G43137p634o761o939p721p342o098o161p730q470p441o392o169n045k070
$$ 743137 735503 728742 721803 714082 706740 700642 694481 686751 678281 670840 664448 658279 653234 651164
57810F51164Q33J873J968K635L603M269N308P025Q021P367O447O878Q070Q383
$$ 651164 651997 653870 655838 658473 662076 666345 671653 678678 686699 694066 700513 707391 715461 723844
57796G23844P428N810L842J832M38k58r61j782k079k282l907o869q715p883n889
$$ 723844 731272 737082 740924 742756 743194 742936 741975 740193 738114 735832 731925 725056 716341 708458 702569
57781G02569m944n079n135m985n139n455n733o433p451p500o112n025n950q055
$$ 702569 697625 692546 687411 682426 677287 671832 666099 659666 652215 644715 638603 633578 627628 619573
57767F19573r185q718p695o900o385o376p206q601j0020j1320j2422j2857j2417
$$ 619573 610388 601670 593975 587075 580690 574314 567108 558507 548487 537167 524745 511888 499471
57754D99471j1561j0506q761o293m175l125k345r15M32L21j012j709n03K000M200
$$ 499471 487910 477404 468643 462350 458175 455050 452705 451790 452222 452543 451531 449822 449319 451319 455519
57739D55519M944M214K993K468K990L797L971L438K939L230M374N644O141N760
$$ 455519 460463 464677 467670 470138 473128 476925 480896 484334 487273 490503 494877 500521 506662 512422
57725E12422N306N427N827N920N681N194M057K083j9j639l242n276o936p421p602
$$ 512422 517728 523155 528982 534902 540583 545777 549834 551917 551898 550259 547017 541741 534805 527384 519782
57710E19782q619r577q679o323m775m751m648l471k270j949j660l30J695L426
$$ 519782 511163 501586 492907 486584 481809 477058 472410 468939 466669 464720 463060 462730 464425 467851
57696D67851M443M849N120O093P771Q392O358K962J065J194J407J165K271N158
$$ 467851 472294 477143 482263 488356 496127 504519 510877 513839 514904 516098 517505 518670 520941 526099
57682E26099P269O787N341N173N826N684M893M581M710M847N720P894R906R903
$$ 526099 533368 540155 545496 550669 556495 562179 567072 571653 576363 581210 586930 594824 604730 614633
57668F14633Q311P046O776O870P370R009J1411J3064J3280J2985J3570J5705J9065
$$ 614633 622944 629990 636766 643636 651006 660015 671426 684490 697770 710755 724325 740030 759095
57655G59095K2323K3789K2922K1035J9876J9962K0783K1929K3287K4778K6571
$$ 759095 781418 805207 828129 849164 869040 889002 909785 931714 955001 979779 1006350
57644A006350K8950L1515L3341L4406L5714L7551L8915L9567M1063M4535M8706
$$ 1006350 1035300 1066815 1100156 1134562 1170276 1207827 1246742 1286309 1327372 1371907 1420613
57633A420613N1688N3662N6165N9585O3031O6177O9659P4022P9663Q7369R7468
$$ 1420613 1472301 1525963 1582128 1641713 1704744 1770921 1840580 1914602 1994265 2081634 2179102
57622B179102J08719J19509J30006J42048J56963J74567J93946K14036K33519
$$ 2179102 2287821 2407330 2537336 2679384 2836347 3010914 3204860 3418896 3652415
57613C652415K51381K67646K82720K96072L06190L11179L08005K91494K56127
$$ 3652415 3903796 4171442 4454162 4750234 5056424 5367603 5675608 5967102 6223229
57604F223229K00151J27867M7913l0408r9814j56185j98676k28867k49141k61181
$$ 6223229 6423380 6551247 6599160 6568752 6468938 6312753 6114077 5885210 5636069 5374888
57594E374888k65523k62405k53166k40554k27090k13197j97746j80506j62996
$$ 5374888 5109365 4846960 4593794 4353240 4126150 3912953 3715207 3534701 3371705
57585C371705j46615j31142j15857j01114q7872p6359o6146n6948m8437l9915
$$ 3371705 3225090 3093948 2978091 2876977 2789105 2712746 2646600 2589652 2541215 2501300
57575B501300l1167k3148j6688j0996m520L011J0458J7023K3016K9000L5211M1964
$$ 2501300 2470133 2446985 2430297 2419301 2414781 2417792 2428250 2445273 2468289 2497289 2532500 2574464
57563B574464M9645N8089O6721P5442Q4727R4692J04835J14998J25829J37689
$$ 2574464 2624109 2682198 2748919 2824361 2909088 3003780 3108615 3223613 3349442 3487131
57553C487131J49542J59627J67101J72331J75457J75166J69495J57474J39255
$$ 3487131 3636673 3796300 3963401 4135732 4311189 4486355 4655850 4813324 4952579
57544D952579J14788Q3555M6264N870l4121p1876j06854j37840j62829j80828
$$ 4952579 5067367 5150922 5197186 5203056 5168935 5097059 4990205 4852365 4689536 4508708
57534D508708j92561j99246k01708k00708j97024j90931j82485j72348j61465
$$ 4508708 4316147 4116901 3915193 3714485 3517461 3326530 3144045 2971697 2810232
57525B810232j50129j38519j27790j18974j10979j01755r1657q3391p7991p3153
$$ 2810232 2660103 2521584 2393794 2274820 2163841 2062086 1970429 1887038 1809047 1735894
57515A735894o6786o0021n4957n1251m7087m2192l7708l3831k9781k5734k2819
$$ 1735894 1669108 1609087 1554130 1502879 1455792 1413600 1375892 1342061 1312280 1286546 1263727
57504A263727k1163j9515j6996j4082j1690j0182r276q173n956k592O69K602L412
$$ 1263727 1242564 1223049 1206053 1191971 1180281 1170099 1160823 1152650 1146694 1144102 1144771 1147373 1150785
57491A150785M310O059Q547J1243J3391J4290J4165J4320J5860J8712K2340K6420
$$ 1150785 1155095 1161154 1169701 1180944 1194335 1208625 1222790 1237110 1252970 1271682 1294022 1320442
57479A320442L0223L2460L2828L2950L4606L7755M1300M4973M9177N3718N8092
$$ 1320442 1350665 1383125 1415953 1448903 1483509 1521264 1562564 1607537 1656714 1710432 1768524
57468A768524O2634O8103P4433Q1071Q8094R5841J03746J10761J16690J22198
$$ 1768524 1831158 1899261 1973694 2054765 2142859 2238700 2342446 2453207 2569897 2692095
57458B692095J27714J33140J38023J41073J40214J34324J24241J10883R3165O9470
$$ 2692095 2819809 2952949 3090972 3232045 3372259 3506583 3630824 3741707 3834872 3904342
57448C904342M0615R687k0756m9677p6191r9231j18567j34369j45649j51018j51224
$$ 3904342 3944957 3954644 3933888 3884211 3808020 3708789 3590222 3455853 3310204 3159186 3007962
57437C007962j48988j45708j40214j31623j21514j11976j02950r3149q2816p3850
$$ 3007962 2858974 2713266 2573052 2441429 2319915 2207939 2104989 2011840 1929024 1855174
57427A855174o7330o2139n6246m8777m0625l3376k7693k2761j7451j1768o584
$$ 1855174 1787844 1725705 1669459 1620682 1580057 1546681 1518988 1496227 1478776 1467008 1460424
57416A460424k050K770Q511J4544J9976K4863K9848L5108M0470M6282N3264O1340
$$ 1460424 1458374 1461144 1469655 1484199 1504175 1529038 1558886 1593994 1634464 1680746 1734010 1795350
57404A795350O9271P5906Q1470Q7233R4050J01684J09442J16787J22998J26905
$$ 1795350 1864621 1940527 2021997 2109230 2203280 2304964 2414406 2531193 2654191 2781096
57394B781096J27667J25470J20696J12661J00043Q2376O0239L4219N002k5522
$$ 2781096 2908763 3034233 3154929 3267590 3367633 3450009 3510248 3544467 3549469 3523947
57384C523947n4678q0981j04377j24304j39126j48341j53625j56518j56491j52688
$$ 3523947 3469269 3388288 3283911 3159607 3020481 2872140 2718515 2561997 2405506 2252818
57374B252818j46171j38748j30699j21529j12159j04228r7678r0959q3485p6086
$$ 2252818 2106647 1967899 1837200 1715671 1603512 1499284 1401606 1310647 1227162 1151076
57364A151076o9172o2379n6185n1970m9927m8339m5539m1484l7105l3201l0310
$$ 1151076 1081904 1019525 963340 911370 861443 813104 767565 726081 688976 655775 625465
57353F25465k8496k6987k4967k2843k1662k1250k0354j8684j7351j6870j6313
$$ 625465 596969 569982 545015 522172 500510 479260 458906 440222 422871 406001 389688
57342C89688j5003j3644j2910j2256j1096j0077j0043j0635j0917j0645r939q467
$$ 389688 374685 361041 348131 335875 324779 314702 304659 294024 283107 272462 262523 254056
57330B54056o204m390m422n877o822o116m454k990j894p65K75O06R0o28q74o48
$$ 254056 247852 243462 239040 233163 226341 220225 215771 212781 210887 210122 210397 211003 211093 210465 209591 208943
57314B08943m22m19m66m72o08q72q28r9J130K313L062L188K618J695J336K230
$$ 208943 208521 208102 207636 207164 206556 205684 204856 204757 205887 208200 211262 214450 217068 218763 220099 222329
57298B22329L927N183N328M908M938N824P132Q278R135R839J0167R582Q095O641
$$ 222329 226256 231439 236767 241675 246613 252437 259569 267847 276982 286821 296988 306570 314665 321306
57284C21306O066O220O740Q161J0916J3599J3980J1976R920R361R467R397J0042
$$ 321306 327372 333592 340332 348493 359409 373008 386988 398964 408884 418245 427712 437109 447151
57271D47151J1814J2769J1295R230R587J1944J3071J1877J0774J1526J2549J1690
$$ 447151 458965 471734 483029 492259 501846 513790 526861 538738 549512 561038 573587 585277
57259E85277R539Q284Q680R699J0374J0592J0566J0642J1369J2958J4833J6163
$$ 585277 594816 603100 611780 621479 631853 642445 653011 663653 675022 687980 702813 718976
57247G18976J6564J5976J4526J2958J2648J4343J7042J8773J8623J7665J7722
$$ 718976 735540 751516 766042 779000 791648 805991 823033 841806 860429 878094 895816
57236H95816J9260K0800K0736J9574J9576K1998K5478K7877K8834K9542L0755
$$ 895816 915076 935876 956612 976186 995762 1017760 1043238 1071115 1099949 1129491 1160246
57225A160246L2352L4430L7204L9726M0356L8996L7664L8098L9714M0522L9367
$$ 1160246 1192598 1227028 1264232 1303958 1344314 1383310 1420974 1459072 1498786 1539308 1578675
57214A578675L6631L3267K9859K6337K2141J6827J0571L940k806r722j6650k3154
$$ 1578675 1615306 1648573 1678432 1704769 1726910 1743737 1754308 1758248 1755442 1745720 1729070 1705916
57202A705916k8888l3386l5723l5173l2309k8732k5583k2915k0539j8581j6980
$$ 1705916 1677028 1643642 1607919 1572746 1540437 1511705 1486122 1463207 1442668 1424087 1407107
57191A407107j5320j3520j2100j1230j0125p936n033k740j785j343Q0K844N660
$$ 1407107 1391787 1378267 1366167 1354937 1344812 1336876 1331843 1329103 1327318 1325975 1326055 1328899 1334559
57178A334559P130P421P753Q549R117R259R803J1070J2141J2519J3224J4947J6244
$$ 1334559 1341689 1349110 1356863 1365412 1374529 1383788 1393591 1404661 1416802 1429321 1442545 1457492 1473736
57165A473736J5199J2279R977R941J1790J4366J6730J8116J8430J8642J9602K0567
$$ 1473736 1488935 1501214 1511191 1521132 1532922 1547288 1564018 1582134 1600564 1619206 1638808 1659375
57153A659375K0208J8814J8104J8937K0558K2013K2919K3023K2514K2755K5137
$$ 1659375 1679583 1698397 1716501 1735438 1755996 1778009 1800928 1823951 1846465 1869220 1894357
57142A894357K8999L2232L4116L6080L9348M3470M7619N1793N6063O0015O3696
$$ 1894357 1923356 1955588 1989704 2025784 2065132 2108602 2156221 2208014 2264077 2324092 2387788
57131B387788O7946P3016P7902Q1691Q4533Q6582Q7080Q5373Q2168P8826P5803
$$ 2387788 2455734 2528750 2606652 2688343 2772876 2859458 2946538 3031911 3114079 3192905 3268708
57120C268708P2457O8036O2429N6124M9878M4426M0378L8232L8002L8628L8591
$$ 3268708 3341165 3409201 3471630 3527754 3577632 3622058 3662436 3700668 3738670 3777298 3815889
57109C815889L7800L8114M1118M5898N0088N2541N3854N4870N6140N8433O2115
$$ 3815889 3853689 3891803 3932921 3978819 4028907 4081448 4135302 4190172 4246312 4304745 4366860
57098D366860O6043O8607P0060P2412P6725Q1729Q5408Q6804Q5927Q3075P8818
$$ 4366860 4432903 4501510 4571570 4643982 4720707 4802436 4887844 4974648 5060575 5143650 5222468
57087E222468P4012O9123O3725N6795M7566L6323K4324J2368m27j5324l1532m6727
$$ 5222468 5296480 5365603 5429328 5486123 5533689 5570012 5594336 5606704 5606277 5590953 5559421 5512694
57075E512694o0252p3748q7767j00289j09995j18890j29788j43273j59148j78781
$$ 5512694 5452442 5378694 5290927 5190638 5080643 4961753 4831965 4688692 4529544 4350763
57065D350763k03513k32494k64531l00368l40747l84167m29403m78484n34479
$$ 4350763 4147250 3914756 3650225 3349857 3009110 2624943 2195540 1717056 1182577
57056A182577E84446h5176p51535q46750r55508j077640j215481j371070j543051
$$ 1182577 584446 -85176 -836711 -1683461 -2638969 -3716609 -4932090 -6303160 -7846211
57047g846211j730355j936422k165517k417743k692351k993208l326116l694271
$$ -7846211 -9576566 -11512988 -13678505 -16096248 -18788599 -21781807 -25107923 -28802194
57039b8802194m102252m561300n084488n680062o355368p122228p990044q956801
$$ -28802194 -32904446 -37465746 -42550234 -48230296 -54585664 -61707892 -69697936 -78654737
57031g8654737j0011529j1135717j2292106j3423656j4478231j5423082j6221887
$$ -78654737 -88666266 -99801983 -112094089 -125517745 -139995976 -155419058 -171640945
57024a71640945j6826228j7226133j7467938j7514312j7043471j5485409j2403553
$$ -171640945 -188467173 -205693306 -223161244 -240675556 -257719027 -273204436 -285607989
57017b85607989p904505k656836K500861O973709J0522406J3127828J4854013
$$ -285607989 -293512494 -296169330 -293668469 -286694760 -276172354 -263044526 -248190513
57010b48190513J5817445J6192022J6177700J5946867J5608222J5200817J4714042
$$ -248190513 -232373068 -216181046 -200003346 -184056479 -168448257 -153247440 -138533398
57003a38533398J4122055J3410458J2581452J1649469J0642452R601846Q570834
$$ -138533398 -124411343 -111000885 -98419433 -86769964 -76127512 -66525666 -57954832
56996e7954832P581590O655635N809818N054319M388504L805808L301196K869733
$$ -57954832 -50373242 -43717607 -37907789 -32853470 -28464966 -24659158 -21357962 -18488229
56988a8488229K502109K188127J922291J700708J515060J355116J215206J093336
$$ -18488229 -15986120 -13797993 -11875702 -10174994 -8659934 -7304818 -6089612 -4996276
56980d996276R86000Q88736Q00168P20837O49489c66663A59720M76765M33603
$$ -4996276 -4010276 -3121540 -2321372 -1600535 -951046 -366663 159720 636485 1070088
56971A070088L94322L59724L31601L08218K86074K64489K44680K26139K07878
$$ 1070088 1464410 1824134 2155735 2463953 2750027 3014516 3259196 3485335 3693213
56962C693213J91539J79082J68715J57001J43837J31728J21331J11309J01430
$$ 3693213 3884752 4063834 4232549 4389550 4533387 4665115 4786446 4897755 4999185
56953D999185R2409Q3661P4253O5115N8241N5712O0750P4806Q9290Q5552N1093
$$ 4999185 5091594 5175255 5249508 5314623 5372864 5428576 5489326 5564132 5653422 5738974 5790067
56942E790067n270o0715r9961j24167j40869j53929j64790j75623j86876j95865
$$ 5790067 5784797 5724082 5624121 5499954 5359085 5205156 5040366 4864743 4677867 4482002
56932D482002k00740k02648k02327j98372j90713j82150j74349j65515j54095
$$ 4482002 4281262 4078614 3876287 3677915 3487202 3305052 3130703 2965188 2811093
56923B811093j41676j30262j19536j09121j00853r6408r4606r3147r1303q9215
$$ 2811093 2669417 2539155 2419619 2310498 2209645 2113237 2018631 1925484 1834181 1744966
56913A744966q6452q2998p9969p7733p4772o9857o3697n7141m9597m0816l2662
$$ 1744966 1658514 1575516 1495547 1417814 1343042 1273185 1209488 1152347 1102750 1061934 1029272
56902A029272k7225k4342k2386k0275j7372j2956p660m277n238r796j5154j9587
$$ 1029272 1002047 977705 955319 935044 917672 904716 897056 892779 887541 877745 862591 843004
56890H43004k3024k5343k5956k5101k4050k3754k4047k4175k3520k1917j9738
$$ 843004 819980 794637 768681 743580 719530 695776 671729 647554 624034 602117 582379
56879E82379j7500j5073j1755p507l496p46J160L314N752P212O460L208k175r161
$$ 582379 564879 549806 538051 530544 527048 526302 527462 530776 536528 543740 550200 553408 551233 542072
56865E42072j6958k4294k9738l2570l3399l3606l3873l3447l1179k7209k3117
$$ 542072 525114 500820 471082 438512 405113 371507 337634 304187 273008 245799 222682
56854B22682k0286j8506j6427j3334j0169q537q651q747p034l870j174J62J111
$$ 222682 202396 183890 167463 154129 143960 135423 126772 118025 110991 107121 105947 106109 107220
56841A07220K779N101P649J0443J3123J4584J4454J4047J4826J6667J8415J9383
$$ 107220 109999 115100 122749 133192 146315 160899 175353 189400 204226 220893 239308 258691
56829B58691J9490J8922J8462J9129K0440K0193J7063J2176O928Q48o560j3309
$$ 258691 278181 297103 315565 334694 355134 375327 392390 404566 411494 412342 405782 392473
56817C92473j6712j6900j6250j5771j4391j1605q453n629k658O17L562O221R675
$$ 392473 375761 358861 342611 326840 312449 300844 292391 286762 284104 284721 288283 294504 304179
56804C04179J4377J9433K3921K7822L1341L4269L5947L5032K9775J9970Q343j479
$$ 304179 318556 337989 361910 389732 421073 455342 491289 526321 556096 576066 584409 582930
56792E82930q300j3377j7575k0209k0463j8245j3700p553j665K493N789J0097
$$ 582930 574630 561253 543678 523469 503006 484761 471061 463508 461843 464336 470125 480222
56780D80222J5280J9680K3363K8324L5120M1800M6846N0579N2632N0400M1780
$$ 480222 495502 515182 538545 566869 601989 643789 690635 741214 793846 844246 886026
56769H86026K7905J1878l859j7742k8197l4170l6044l5087l2645l0136k8655k7845
$$ 886026 913931 925809 921950 904208 876011 841841 805797 770710 738065 707929 679274 651429
56757F51429k6064k2194j6435r250r95P144J3478J7750K1375K5161K8187K9369
$$ 651429 625365 603171 586736 577486 576491 583635 597113 614863 636238 661399 689586 718955
56745G18955K8563K5374J8607Q048m296j5656k4353k9897l2630l3790l4496l4267
$$ 718955 747518 772892 791499 799547 795251 779595 755242 725345 692715 658925 624429 590162
56733E90162l1895k7918k4277k1180j6776j0751n673l236j529K000O747J0293
$$ 590162 558267 530349 506072 484892 468116 457365 451692 448456 446927 448927 455674 465967
56721D65967J2005J2947J3299J2057Q787M009j725p662j2556j5825j8245k0327
$$ 465967 477972 490919 504218 516275 525062 529071 527346 519684 507128 491303 473058 452731
56709D52731k1077j9829j8092j7846j8805j9108j7968j5998j3618j0935q666p446
$$ 452731 431654 411825 393733 375887 357082 337974 320006 304008 290390 279455 270789 263343
56697B63343o647n398m296m402n078m630k888j369r71j220j750k813m031m192
$$ 263343 256696 251298 247002 242600 237522 232892 230004 228635 227664 226444 224694 221881 217850 213658
56683B13658k757n34J404K541K600J521lr09r60q69j241k032k889l279k543o62
$$ 213658 210901 210367 211771 214312 216912 218433 218430 217521 216561 215692 214451 212419 209530 206251 203708 203046
56667B03046J193J714R27j78j097k073l108l815m099m113l577k188n81K1p28j887
$$ 203046 204239 205953 206880 206702 205605 203532 200424 196609 192510 188397 184820 182632 182051 182072 181344 179457
56651A79457k399j988r11M20J540K152K340K267J888J272Q86J018J342J444J378
$$ 179457 177058 175070 174159 174579 176119 178271 180611 182878 184766 186038 186924 187942 189284 190728 192106
56636A92106J209N39q55k393l368l775l895l563k620j595j224j629k445l212l176
$$ 192106 193315 193854 192999 190606 187238 183463 179568 176005 173385 171790 170566 168937 166492 163280 160104
56621A60104j610J007K857K726J422M94L63N65J017J898K858L414L602L497K835
$$ 160104 158494 159501 162358 165084 166506 167000 167363 167928 168945 170843 173701 177115 180717 184214 187049
56606A87049J828J419J781J610P0j698k335k297k587k582j135R07J431j30k485
$$ 187049 188877 190296 192077 193687 193757 192059 189724 187427 184840 182258 181123 182030 183461 183331 180846
56591A80846m658o605p949p998o921n412l411p55J469K042J707K077K884K542
$$ 180846 176188 169583 161634 153636 146715 141303 137892 137137 138606 140648 142355 144432 147316 149858
56577A49858J225Q19J654J898O93o40j214j883k885k687p35Q66L31r03l06J902
$$ 149858 151083 151902 153556 155454 156147 155507 154293 152410 149525 146838 146103 146969 147300 146397 146091 147993
56561A47993L237K572J314J093J924K834L177K910K256J477Q66Q33J698L047L656
$$ 147993 151230 153802 155116 156209 158133 160967 164144 167054 169310 170787 171653 172486 174184 177231 180887
56546A80887K795J395J010J741K309K174K142K572K473J134n38j100k30J352K829
$$ 180887 183682 185077 186087 187828 190137 192311 194453 197025 199498 200632 200094 198994 198764 200116 202945
56531B02945L545L214K427K256K790K810J468n07j736j661o30P59J887K442K823
$$ 202945 206490 209704 212131 214387 217177 219987 221455 220948 219212 217551 216921 217680 219567 222009 224832
56516B24832L507L913K955R70j84M45J709K294K500L122L790L857L969N148O803
$$ 224832 228339 232252 235207 236177 235993 236438 238147 240441 242941 246063 249853 253710 257679 262827 269630
56501B69630P194N841M166L627M275N370O528P611Q019O829L896O02j028k99J328
$$ 269630 276824 282665 286831 290458 294733 300103 306631 314242 322261 329090 332986 333588 332560 332261 333589
56486C33589J884J120M47Q65J917K734L032K713J552j34j259j229q37j322k842
$$ 333589 335473 336593 337040 337905 339822 342556 345588 348301 349853 349719 348460 347231 346394 345072 342230
56471C42230m405m889l763j375J008J888Q97p67j681j695j760k516l496l707k804
$$ 342230 337825 332936 329173 327798 328806 330694 331591 330824 329143 327448 325688 323172 319676 315969 313165
56456C13165j530q89r04o85P8L92o05k122k646j874o21P88K557L967L565J271
$$ 313165 311635 310746 309842 309157 309235 309627 309022 306900 304254 302380 301759 302547 305104 309071 312636 313907
56440C13907j054j772j184n81o50j340k353l028k551r09Q25J571J087l12k018
$$ 313907 312853 311081 309897 309316 308666 307326 304973 301945 299394 298485 299310 300881 301968 301656 299638
56425B99638l061k721j530n84J97J972M735O505N620K828L22n82j09R24J928K708
$$ 299638 296577 293856 292326 291742 291939 293911 298646 305151 310771 313599 313921 313339 313230 314154 316082 318790
56409C18790L312L644L443L058L708N892Q085Q443P546P659R236J0193R147P312
$$ 318790 322102 325746 329189 332247 335955 341847 349932 358375 365921 373580 382816 393009 402156 409468
56395D09468O267N708M690L516K958K675J777K76j057j632j258k84P6j262l473
$$ 409468 415735 421443 426133 429649 432607 435282 437059 437335 436278 434646 433388 433104 433180 431918 428445
56380D28445m404l548k861l881n756p085p914q587q346o780n186m717m416k923
$$ 428445 424041 420493 417632 413751 407995 400910 392996 384409 376063 369283 364097 359380 354964 352041
56366C52041j038o07j696k774l085l012k525j159O98J977K407K508K404J770P36
$$ 352041 351003 350396 348700 345926 342841 339829 337304 336145 336843 338820 341227 343735 346139 347909 348645
56351C48645j98r16j462j607j422j652k594l287k842j733q07M5J070J565J001
$$ 348645 348447 347531 346069 344462 343040 341388 338794 335507 332665 330932 330125 330170 331240 332805 333806
56336C33806L01M96R84O95J55N13J242P70r53k378k613k082j139J94J035Q0k392
$$ 333806 334107 334603 335587 336282 336437 336950 338192 338962 338009 335631 333018 330936 329797 329991 331026 331106 328714
56319C28714m283l955j795O14K041K207J737J589K085K758L449M729O483P274
$$ 328714 324431 320476 318681 319295 321336 323543 325280 326869 328954 331712 335161 339890 346373 353647
56305C53647O274M804M504M844M285L142L244M933O407O265N104M185L859L762
$$ 353647 359921 364725 369229 374073 378358 381500 384744 389677 396084 402349 407453 411638 415497 419259
56291D19259L634L507L562L892M172M042M055N192O857O782M120J223P71K308
$$ 419259 422893 426400 429962 433854 438026 442068 446123 451315 458172 464954 469074 470297 471068 473376
56277D73376L469L537L562L802L494K955L509N129O230O119N965O859Q393R498
$$ 473376 476845 480382 483944 487746 491240 494195 497704 502833 509063 515182 521147 528006 536399 545897
56263E45897R557Q711P954Q631J0635J1736J0324Q170Q464J1455J4133J4358J3194
$$ 545897 555454 564165 572119 580750 591385 603121 613445 621615 630079 641534 655667 670025 683219
56250F83219J2768J3625J4892J5645J5534J4961J4868J5531J5809J4670J2980
$$ 683219 695987 709612 724504 740149 755683 770644 785512 801043 816852 831522 844502
56239H44502J2392J2920J3226J2936J2859J3007J2303J0526Q903Q473R090J0194
$$ 844502 856894 869814 883040 895976 908835 921842 934145 944671 953574 962047 971137 981331
56227I81331J1346J2081J2375J3025J4518J6112J7406J9852K4741L0368L3609
$$ 981331 992677 1004758 1017133 1030158 1044676 1060788 1078194 1098046 1122787 1153155 1186764
56216A186764L4119L4680L7305M1172M4824M8349N2697N8309O4962P1818P7685
$$ 1186764 1220883 1255563 1292868 1334040 1378864 1427213 1479910 1538219 1603181 1674999 1752684
56205A752684Q2300Q7150R3759J01749J09975J18656J28519J38713J47841J56426
$$ 1752684 1834984 1922134 2015893 2117642 2227617 2346273 2474792 2613505 2761346 2917772
56195B917772J66049J76416J85674J93107J99108K02917K03083J99815J94196
$$ 2917772 3083821 3260237 3445911 3639018 3838126 4041043 4244126 4443941 4638137
56186D638137J85326J71256J52578J32052J10530Q6533O0209L4449J1180j0474
$$ 4638137 4823463 4994719 5147297 5279349 5389879 5476412 5536621 5571070 5582250 5571776
56176E571776l1477n1043o8286q3203r5234j03408j08489j12628j16479j19257
$$ 5571776 5540299 5489256 5420970 5337767 5242533 5139125 5030636 4918008 4801529 4682272
56166D682272j21713j25836j31184j35002j36600j38236j40808j42404j42235
$$ 4682272 4560559 4434723 4303539 4168537 4031937 3893701 3752893 3610489 3468254
56157C468254j42111j42528j41085j36758j32050j28670j24607j18038j10741
$$ 3468254 3326143 3183615 3042530 2905772 2773722 2645052 2520445 2402407 2291666
56148B291666j04784r8859r1085q2806p6297p0914o4762n8380n3484m9627m5170
$$ 2291666 2186882 2088023 1996938 1914132 1837835 1766921 1702159 1643779 1590295 1540668 1495498
56137A495498m0456l7029l4531l1201k6928k3323k1026j8959j6277j3461j1496
$$ 1495498 1455042 1418013 1383482 1352281 1325353 1302030 1281004 1262045 1245768 1232307 1220811
56126A220811j0816j0831j0157q050n649m480l812j512K265M792M885M694O322
$$ 1220811 1209995 1199164 1189007 1180957 1175308 1170828 1167016 1165504 1167769 1172561 1177446 1182140 1188462
56113A188462R085J1439J3233J4685J5449J6057J8034K1282K3637K4268K4983
$$ 1188462 1197547 1208986 1222219 1236904 1252353 1268410 1286444 1307726 1331363 1355631 1380614
56102A380614K6990K9100L0538L2543L5494L7362L7031L6333L6815L7399L7173
$$ 1380614 1407604 1436704 1467242 1499785 1535279 1572641 1609672 1646005 1682820 1720219 1757392
56091A757392L7520L9224M0565M0852M2735M8109N4534N8967O2516O8335P6944
$$ 1757392 1794912 1834136 1874701 1915553 1958288 2006397 2060931 2119898 2182414 2250749 2327693
56080B327693Q6909R8169J11441J25839J39794J52795J63808J69918J69158J63054
$$ 2327693 2414602 2512771 2624212 2750051 2889845 3042640 3206448 3376366 3545524 3708578
56070C708578J54182J43249J30745J18946J09590J01585R3188Q4040P2870N6413
$$ 3708578 3862760 4006009 4136754 4255700 4365290 4466875 4560063 4644103 4716973 4773386
56060D773386L3711Q906j3211l1948m8570o2909p5514q9732j07559j25995j41352
$$ 4773386 4807097 4816003 4802792 4770844 4722274 4659365 4583851 4494119 4386560 4260565 4119213
56049D119213j54345j66712j75817j77407j71791j62633j51477j37920j23458
$$ 4119213 3964868 3798156 3622339 3444932 3273141 3110508 2959031 2821111 2697653
56040B697653j10390r8227q5331p2796o2630n3645m3454l3128k5585k0702j6191
$$ 2697653 2587263 2489036 2403705 2330909 2268279 2214634 2171180 2138052 2112467 2091765 2075574
56029B075574j1952r341p494m600j641o46o15N80J791N62j798j871J63J187O96
$$ 2075574 2063622 2054281 2046787 2042187 2040546 2039900 2039285 2039865 2041656 2042218 2040420 2038549 2038712 2039899 2040595
56014B040595J091K899M232M633N530P052Q082R039J1210J4056J6249J8277K0904
$$ 2040595 2041686 2044585 2048817 2053450 2058980 2066032 2074114 2083153 2094363 2108419 2124668 2142945 2163849
56001B163849K2837K3118K3906K7185L0974L2502L2843L4325L6011L6142L6407
$$ 2163849 2186686 2209804 2233710 2260895 2291869 2324371 2357214 2391539 2427550 2463692 2500099
55990B500099L9032M2218M3420M4471M8241N3010N5666N7682O1955O6469O7368
$$ 2500099 2539131 2581349 2624769 2669240 2717481 2770491 2826157 2883839 2945794 3012263 3079631
55979C079631O5987O6419O8407O9120O9683P3129P8061Q1215Q4234R0864R9469
$$ 3079631 3145618 3212037 3280444 3349564 3419247 3492376 3570437 3651652 3735886 3826750 3926219
55968C926219J05547J09598J15262J21766J25953J29649J37052J46857J55034
$$ 3926219 4031766 4141364 4256626 4378392 4504345 4633994 4771046 4917903 5072937
55959E072937J63240J75875J90899K02674K12062K24372K39100K51455K62519
$$ 5072937 5236177 5412052 5602951 5805625 6017687 6242059 6481159 6732614 6995133
55950F995133K77574K95529L10471L22964L39085L58767L75969L90300M07518
$$ 6995133 7272707 7568236 7878707 8201671 8540756 8899523 9275492 9665792 10073310
55941A0073310M28487M48469M67640M91365N19806N48045N76470O09910O46866
$$ 10073310 10501797 10950266 11417906 11909271 12429077 12977122 13553592 14163502 14810368
55932A4810368O81107P13449P49962P89563Q26486Q64158R12482R71586J032617
$$ 14810368 15491475 16204924 16954886 17744449 18570935 19435093 20347575 21319161 22351778
55923B2351778J094391J164095J241884J320846J402523J495771J599930J706606
$$ 22351778 23446169 24610264 25852148 27172994 28575517 30071288 31671218 33377824
55915C3377824J818077J945219K086896K231620K380487K547217K734637K933900
$$ 33377824 35195901 37141120 39228016 41459636 43840123 46387340 49121977 52055877
55907E2055877L148681L396228L683584M009250M390336M859655N434018O115815
$$ 52055877 55204558 58600786 62284370 66293620 70683956 75543611 80977629 87093444
55899H7093444O926894P905849R070197J0418848J1969308J3743650J5719025
$$ 87093444 94020338 101926187 110996384 121415232 133384540 147128190 162847215
55892A62847215J7853091K0163165K2712224K5513967K8520783L1625125L4384564
$$ 162847215 180700306 200863471 223575695 249089662 277610445 309235570 343620134
55885C43620134L5598160L3462694K6682859J5698098K729915r508093j9213577
$$ 343620134 379218294 412680988 439363847 455061945 457791860 448283767 429070190
55878D29070190k5882127k9804075l1510791l1566866l0504441k8731757k6514050
$$ 429070190 403188063 373383988 341873197 310306331 279801890 251070133 224556083
55871B24556083k4060641k1572459j9191760j6971592j4926540j3077273j1433938
$$ 224556083 200495442 178922983 159731223 142759631 127833091 114755818 103321880
55864A03321880r981594q706395p609336o681241n891293n212369m634588m145821
$$ 103321880 93340286 84633891 77024555 70343314 64452021 59239652 54605064 50459243
55856E0459243l722882l351125l031210k758137k513416k285620k079987j900316
$$ 50459243 46736361 43385236 40354026 37595889 35082473 32796853 30716866 28816550
55848B8816550j738898j591278j463865j359021j267163j180405j100705j028856
$$ 28816550 27077652 25486374 24022509 22663488 21396325 20215920 19115215 18086359
55840A8086359r58890q89156q26428p73439p23788o73919o28718n90722n54901
$$ 18086359 17127469 16238313 15411885 14638446 13914658 13240739 12612021 12021299 11466398
55831A1466398n18666m86387m59571m32887m04281l79138l60163l42436l22600
$$ 11466398 10947732 10461345 10001774 9568887 9164606 8785468 8425305 8082869 7760269
55822G760269l03914k88434k72966k56450k42819k33043k22566k09803j98849
$$ 7760269 7456355 7167921 6894955 6638505 6395686 6162643 5940077 5730274 5531425
55813E531425j90825j81098j68308j57630j51492j45292j36065j27433j22144
$$ 5531425 5340600 5159502 4991194 4833564 4682072 4536780 4400715 4273282 4151138
55804D151138j17425j11733j08727j10386j13114j14592j17692j23553j27424
$$ 4151138 4033713 3921980 3813253 3702867 3589753 3475161 3357469 3233916 3106492
55795C106492j25655j20910j16451j11036j03396r6142r1177q6162p9133p2052
$$ 3106492 2980837 2859927 2743476 2632440 2529044 2432902 2341725 2255563 2176430 2104378
55785B104378o6625o1327n5406n1066m8947m6240m1713l7817l5570l2523k8050
$$ 2104378 2037753 1976426 1921020 1869954 1821007 1774767 1733054 1695237 1659667 1627144 1599094
55774A599094k5302k5326k4665k1511j8883j8813j8671j6245j3571j2742j2726
$$ 1599094 1573792 1548466 1523801 1502290 1483407 1464594 1445923 1429678 1416107 1403365 1390639
55763A390639j2966j5245j9261k1470k1018k1679k5110k7769k7570k7840l0920
$$ 1390639 1377673 1362428 1343167 1321697 1300679 1279000 1253890 1226121 1198551 1170711 1139791
55752A139791l3440l2130k9300k8047k6874k3670k0545j9826j9213j5816j1540
$$ 1139791 1106351 1074221 1044921 1016874 990000 966330 945785 925959 906746 890930 879390
55741H79390r636r135p358n131m752n190l842j140N49Q61P75J6j637k488j516
$$ 879390 869754 860619 853261 848130 843378 838188 834346 833206 833755 834616 835391 835407 833770 831282 829766
55726H29766p09j907l621l894l730m560m937l291j551k497n430p960j0078j3032
$$ 829766 829057 827150 823529 819635 815905 811345 806408 803117 801566 799069 793639 785679 775601 762569
55712G62569j5929j6956j6525j6063j5055j2246q445n277k610J10J428l48m303
$$ 762569 746640 729684 713159 697096 682041 669795 661350 656073 653463 653573 655001 654653 650350
55699F50350q352j2184j6273j9532k0522j9826j8912j7975j6881j6528j6976j6201
$$ 650350 641998 629814 613541 594009 573487 553661 534749 516774 499893 483365 466389 450188
55687D50188j3080r856r101j0007j0291r905r960r691p651m786l268l160k897
$$ 450188 437108 427252 418151 408144 397853 387948 377988 368297 360646 355860 352592 349432 346535
55674C46535k193j835j537n79J33q18k742l628l084k511k780l570m431m888m206
$$ 346535 344342 342507 340970 340391 340524 339706 336964 333336 330252 327741 324961 321391 316960 312072 307866
55659C07866k486j285j866l721n759p535q307o859l711j547j693k090n98J691
$$ 307866 305380 304095 302229 298508 292749 285214 276907 270048 266337 264790 263097 261007 260409 262100
55645B62100K590K316K469L145L456L479L399K238l68k581k881k546l356m519
$$ 262100 264690 267006 269475 272620 276076 279555 282954 285192 284824 282243 279362 276816 273460 268941
55631B68941m432l759l871l748j627J432K914K963L889O077P510P315O884P274
$$ 268941 264509 260750 256879 253131 251504 252936 255850 258813 262702 268779 276289 283604 290488 297762
55617B97762P916Q164P994P049M866K070j91j823l312m293m252l957m376m783
$$ 297762 305678 313842 321836 328885 333751 335821 335630 333807 330495 326202 321950 317993 313617 308834
55603C08834l898k277j579j887j746o46L88N18r1r51j351k92K307M850N762N213
$$ 308834 304936 302659 301080 299193 297447 296801 297189 297707 297616 296665 295314 295022 297329 302179 307941 313154
55587C13154M105K531O63l05P2J10j563l468l480k447k896m892o037n379m729
$$ 313154 317259 319790 320453 320148 320220 320330 318767 315299 311819 309372 306476 301584 295547 290168 285439
55572B85439n752p997j0127j1347j1189r442o782m516l578m233o131q049q513
$$ 285439 279687 271690 261563 250216 239027 229585 222803 218287 214709 210476 204345 196296 187783
55559A87783p603o959p168o807n148l851m123m276k512k57K4j118j288l85l73
$$ 187783 180180 173221 166053 159246 154098 150247 146124 141848 139336 139079 139103 137985 136697 136312 135939
55544A35939j572k313j998j678j632j142n70j080k118j815m2J196P94j51m28j61
$$ 135939 134367 132054 130056 128378 126746 125604 125034 123954 121836 120021 119979 121175 121969 121818 121390 121229
55528A21229Q1J3o31j586j591N8J990K478J944J825J929J139N5L40J918L363M515
$$ 121229 121310 121323 120692 119106 117515 117573 119563 122041 123985 125810 127739 128878 128933 129273 131191 134554 139069
55511A39069O119P375O779N084M568N393N709N335O001P590P398M071m86m024
$$ 139069 145188 152563 159342 164426 168994 174387 180096 185431 191432 199022 206420 210491 210005 205981
55497B05981o146o929o126m732m754o288p129o223n077m886m749l927l353l545
$$ 205981 199835 192906 186780 182048 177294 171006 163877 157654 152577 147691 142942 139015 135662 132117
55483A32117l363k276j690k448l032j912R9J433K020K422K280J304M49N93J148
$$ 132117 128754 126478 124788 122340 119308 117396 117495 118928 120948 123370 125650 126954 127403 127996 129144
55468A29144J186P85K02r61k441k620n86K229L791L900L680L670L623L358K786
$$ 129144 130330 131115 131317 130356 127915 125295 124709 126938 130729 134629 138309 141979 145602 148960 151746
55453A51746J750O38K02J51r66l689o628q316q812q680p789o279n334n711o468
$$ 151746 153496 154134 154336 154487 153521 149832 143204 134888 126076 117396 109607 103328 97994 92283 85815
55438H5815o408n768n351n022m373l921m224m568l956k825k385k705k819k555
$$ 85815 79407 73639 68288 63266 58893 54972 50748 46180 42224 39399 37014 34309 31490 28935
55424B8935k829l859m320k867l6K034J856K24p85l38L71J84l24j42K52j14n57
$$ 28935 26106 22247 17927 15060 15024 17058 18914 19138 18353 18015 18386 18570 18246 18104 18356 18242 17685
55407A7685L56K022K185L57j328j299n19l70n81m59m92j215j830j330q2Q41J049
$$ 17685 18041 20063 22248 22605 21277 19978 19459 19089 18508 18049 17557 16342 14512 13182 13100 13941 14990
55390A4990P02j2m99J0J069J150K1n41N03J604R97n06r01q7M22J50N6N76R66O49
$$ 14990 15692 15680 15181 15191 16260 17410 17431 16890 17393 18997 19994 19488 18587 18500 18922 19072 19128 19704 20670 21319
55370B1319j69j142j897j710k21J625K459K198J887K005K078J868J743J668R73
$$ 21319 21150 20008 18111 16401 16180 17805 20264 22462 24349 26354 28432 30300 32043 33711 34684
55355C4684m49j570j481o13q3j16J51J202K054J319q06k397k026m53O09P04N80
$$ 34684 34235 32665 31184 30571 30488 30372 30523 31725 33779 35098 34292 31895 29869 29416 30025 30729 31309
55338C1309M91l6p91p96J1L41p29k560l980m394l615j680O03K019K409K696L138
$$ 31309 31800 31764 30973 30177 30188 30529 29800 27240 23260 18866 15251 13571 14174 16193 18602 21298 24436
55321B4436K872J697P92P51M90p53j735j118Q5j43j755k747k144j146j142j987
$$ 24436 27308 29005 29797 30548 31038 30285 28550 27432 27517 27374 25619 22872 20728 19582 18440 16453
55305A6453k589k203p72J214K761K901J648K14j00P18J321M39j601l126l120k379
$$ 16453 13864 11661 10889 12103 14864 17765 19413 19627 19527 20245 21566 22005 20404 17278 14158 11779
55289A1779k130k146j288M65J835K008J320J53j343k342j795k64L50m30p61O61
$$ 11779 9649 7503 6215 6680 8515 10523 11843 11996 10653 8311 6516 6252 6602 6172 5411 6072
55273F072K413K306L07j837k869k701j607j34Q19R41J007J546J840J172K01q6
$$ 6072 8485 10791 11098 9261 6392 3691 2084 1950 2769 3710 4717 6263 8103 9275 9476 9390
55257I390Jm28j228j538j266r62p16l79l42q82D87k39J237J697R36L99J051K097
$$ 9390 9391 8963 7735 6197 4931 3969 3253 2874 2532 1650 487 248 1485 3182 4118 4517 5568 7665
55239G665K163R25p27j635j351m94%N9M66J433K021J539O45K27K6n94j158p27
$$ 7665 9828 10753 10026 8391 7040 6546 6546 6605 7071 8504 10525 12064 12709 12936 12962 12368 11210 10483
55221A0483M47J165J055R52J495K342K907K966K444J371J70n67q32j281k418l913
$$ 10483 10930 12095 13150 14102 15597 17939 20846 23812 26256 27627 27797 27230 26398 25117 22699 18786
55205A8786m670l685j143J219J549j24j920k312j549n97J97Q08R71Q18J185K355
$$ 18786 14116 10431 9288 10507 12056 11932 10012 7700 6151 5554 5751 6559 7530 8348 9533 11888
55189A1888L271K843J387j16j350k223k067n84J050J383N50j96m13n66o34K0J313
$$ 11888 15159 18002 19389 19273 17923 15700 13633 13049 14099 15482 16032 15836 15423 14857 14223 14243 15556
55172A5556K299K455K195J982J737J181K33r37j779j667p97k94p08j027N8K325
$$ 15556 17855 20310 22505 24487 26224 27405 27638 26701 24922 23255 22458 22164 21456 20429 20487 22812
55156B2812M201M340K464o07l027k897k69K472L123J952N74l87j216j584q42N80
$$ 22812 27013 31353 33817 33210 30183 27286 27017 29489 32612 34564 35138 34751 33535 31951 31109 31689
55140C1689J506J537J052J73j002j592q01P78J961K567K885K309L22j787k140
$$ 31689 33195 34732 35784 35957 34955 33363 32562 33340 35301 37868 40753 43062 43384 41597 39457
55125C9457j084p23j660k220j225L16Q49O8j371k496k160k8K250K477P96m88l51
$$ 39457 38373 37650 35990 33770 32545 32861 33710 33778 32407 29911 27751 27723 29973 32450 33246 32758 32407
55108C2407k96j468k554j968m85q0j114k209k318j626p66k82n33j238j334p7J779
$$ 32407 32111 30643 28089 26121 25636 25556 24442 22233 19915 18289 17523 17241 16708 15470 14136 14059 15838
55091A5838K580J516n80k159k319j248L58K001L265L346J658q08j850o42R43Q17
$$ 15838 18418 19934 19354 17195 14876 13628 13986 15987 19252 22598 24256 23448 21598 20956 21899 22716
55075B2716l99n21P01J342N70LJ088K850L405K509J498J353J742J623L64j412
$$ 22716 22317 21796 22497 23839 24409 24412 25500 28350 31755 34264 35762 37115 38857 40480 40844 39432
55059C9432k035n90J619K388J395N06J051K198K549K079J683J721J938K187K530
$$ 39432 37397 36807 38426 40814 42209 42715 43766 45964 48513 50592 52275 53996 55934 58121 60651
55044F0651K962L323L152J757p33k597k124p7R51l1j114l38J657K845K484J499
$$ 60651 63613 66936 70088 71845 71112 68515 66391 66314 67265 67234 66120 65782 67439 70284 72768 74267
55028G4267R37J089J520J313l3j542j554r1Q05j10j501j532m96J4l84p87p47n62
$$ 74267 75204 76293 77813 79126 79093 77551 75997 75906 76711 76601 75100 73568 73072 73086 72702 71915 71168 70606
55010G0606k00O19J426J416P58L28J94l76j381j780j103l83p86j994k562j792
$$ 70606 70406 71025 72451 73867 74625 74953 75147 74771 73390 71610 70507 70124 69338 67344 64782 62990
54994F2990p08q65k313l250k155J41J427J027M78R83J607R12p33j752j544o73
$$ 62990 62282 61417 59104 55854 53699 53840 55267 56294 56772 57755 59362 60274 59541 57789 56245 55572
54978E5572N65K280L754L599J474j216k748k522r80J022K460K451R69r84k139
$$ 55572 56137 58417 62171 65770 67244 66028 63280 60758 59778 60800 63260 65711 66680 65696 63557
54963F3557j857l46J625L146L730L527K865J697j82k409l914l692j580J528M096
$$ 63557 61700 61354 62979 66125 69855 73382 76247 77944 77762 75353 71439 67747 66167 67695 71791
54948G1791M776L324P72j432k430k098o41J460L226L571K264K95q84o32M53J233
$$ 71791 76567 79891 80663 79231 76801 74703 74062 75522 78748 82319 84583 84878 83994 83362 83815 85048
54932H5048J104L50m88j244j983k522k492j822q37L7N12N38M82Q66J569J682P26
$$ 85048 86152 86502 86014 84770 82787 80265 77773 75951 75114 75151 75663 76201 76683 77549 79118 80800 81526
54915H1526l94m79K96P97Q52J391K509K843J502m95j538j308m89N56J795K767
$$ 81526 81132 80653 80949 81746 82598 83989 86498 89341 90843 90348 88810 87502 87013 87569 89364 92131
54899I2131K906K515K476L066L677L736L360K989K809K730K767L255M494O129
$$ 92131 95037 97552 100028 103094 106771 110507 113867 116856 119665 122395 125162 128417 132911 139040
54885A39040P223P364P392Q441J0444J2315J3375J3771J3648J2999J2241J1666
$$ 139040 146263 153627 161019 169460 179904 192219 205594 219365 233013 246012 258253 269919
54873B69919J0228O386O24m432p138q579j0252j1599j1414j0459j0653j2175j3212
$$ 269919 280147 286533 287157 282725 275587 267008 256756 245157 233743 223284 212631 200456 187244
54860A87244j2570j0975r628q662p520n869l870k023q43l87j89P8K43L27Q75K068
$$ 187244 174674 163699 154071 145409 137889 132020 128150 126127 125284 124897 124708 124786 125029 125356 126231 128299
54844A28299L200L750M213N042N683N769O327Q293J0570J1340J0911J1281J2898
$$ 128299 131499 135249 139462 144504 150187 155956 162283 170576 181146 192486 203397 214678 227576
54831B27576J3767J2198Q738M754O98l373o871r338j1109j2562j3365j3224j2579
$$ 227576 241343 253541 262279 267033 267731 264358 257487 248149 237040 224478 211113 197889 185310
54818A85310j1972j1437j0985j0802j0383q570n368k774k521l743m259l604l247
$$ 185310 173338 161901 150916 140114 129731 121161 115793 113019 110498 106755 102496 98892 95645
54805I5645l838l980k410o8J058N57q0L68J357J556O91k01k52J18j73j435k825
$$ 95645 91807 87827 85417 85349 86407 86964 86884 87252 88609 90165 90856 90655 90403 90521 90348 88913 86088
54788H6088l325k758j731r24o49q74j261j316q16k03k54j103j829j314L78J836
$$ 86088 82763 80005 78274 77350 76701 75827 74566 73250 72434 72231 71977 70874 69045 67731 68109 69945
54772F9945J667p6k092l156k956j836l01J025J539J125L18k20k03K90R90J444
$$ 69945 71612 71536 69444 66288 63332 61496 61195 62220 63759 64884 65202 64982 64779 65069 66059 67503
54756F7503J258O56L57P11J182J052K89n47r29n13Q79K907M589N084M495L597
$$ 67503 68761 69417 69774 70485 71667 72719 73008 72461 71532 71019 71898 74805 79394 84478 88973 92570
54740I2570L002K923L357L979M235M188M789O555Q421Q872Q102P735Q457R195
$$ 92570 95572 98495 101852 105831 110066 114254 119043 125598 134019 142891 150993 158728 167185 176380
54726A76380R054Q778R480J0968J2345J3487J4767J5684J5042J2404Q432L763
$$ 176380 185434 194212 203692 214660 227005 240492 255259 270943 285985 298389 306821 310584
54714C10584j344o048q867r259q544q449r160r585r080q064p011n835m378k861
$$ 310584 309240 303192 294325 285066 276522 268073 258913 249328 240248 232184 225173 219338 214960 212099
54700B12099j565o42l74r66j771j474M05K686L847L801L794M787O655Q791J0827
$$ 212099 210534 209892 209518 208552 206781 205307 205712 208398 212245 216046 219840 224627 231282 240073 250900
54685B50900J2686J4397J5929J7008J7197J6482J5492J4776J4135J2998J1052
$$ 250900 263586 277983 293912 310920 328117 344599 360091 374867 389002 402000 413052
54674D13052Q103L977q11n025q273j1870j6809k1466k3037k1164j8362j6723j5983
$$ 413052 421155 425132 424321 419296 411023 399153 382344 360878 337841 316677 298315 281592 265609
54661B65609j5271j4718j4346j3186j0888q881q396q532p789o489n919n887n073
$$ 265609 250338 235620 221274 208088 197200 188319 179923 171391 163602 157113 151194 145307 140234
54648A40234l476k435k236j655l56Q2j463l603l951k020N00J914K038J558R38
$$ 140234 136758 134323 132087 130432 130076 130158 128695 125092 121141 119121 119621 121535 123573 125131 126069
54633A26069K76k36l54k21l49r03j254o61P11J835J945J327Q78J195K119K893
$$ 126069 126345 126109 125755 125534 125185 124282 123028 122367 123078 124913 126858 128185 129063 130258 132377 135270
54617A35270K849K136J656J948K564K958L465M471N281N043M375M445M756L827
$$ 135270 138119 140255 141911 143859 146423 149381 152846 157317 162598 167641 172016 176461 181217 185044
54603A85044K161K055L789M482K282n71r39Q07J920J517J097J501J964K028K222
$$ 185044 187205 189260 193049 197531 199813 199242 198303 199110 201030 202547 203644 205145 207109 209137 211359
54588B11359K663K825K806L277M180M930N675O809P610P228O754Q198J1297J3503
$$ 211359 214022 216847 219653 222930 227110 232040 237715 244524 252134 259362 266116 274314 285611 299114
54574B99114J3533J2891J3234J4190J4642J4426J3864J2867J1315R119N499k10
$$ 299114 312647 325538 338772 352962 367604 382030 395894 408761 420076 429195 434694 434484
54562D34484o588j0809j2166j3025j5252j7511j7630j5924j4325j3427j2311j0563
$$ 434484 427896 417087 404921 391896 376644 359133 341503 325579 311254 297827 285516 274953
54550B74953q673o899n339m755n826p737q844q663q049p549o724n217l490k298
$$ 274953 266280 259381 254042 249287 243461 235724 226880 218217 210168 202619 195895 190678 187188 184890
54536A84890k085k885m260n457o115o608p158p097n767l733k240j685j413r14
$$ 184890 182805 179920 175660 170203 164088 157480 150322 143225 137458 133725 131485 129800 128387 127473
54522A27473m06l62j108k697m491n101l674j195K69k21j691k589k294j187rO86
$$ 127473 127067 126705 125597 122900 118409 113308 109634 108439 108708 108487 106796 104207 101913 100726 100717 101403
54506A01403Q88J148J777K145J286p25k639l348k860j856r13l27p8L36J478K999
$$ 101403 102291 103439 105216 107361 108647 107922 105283 101935 99075 97219 96306 95979 95901 96237 97715 100714
54490A00714L644K706J021m4k29k74m21k1J111J974J635O57M25J359K691L858
$$ 100714 104358 107064 108085 108041 107812 107538 107117 107096 108207 110181 111816 112473 112898 114257 116948 120806
54474A20806N056O215O428N113L065J660J566K736M976P568Q953Q106O108N117
$$ 120806 125862 132077 138505 143618 146683 148343 149909 152645 157621 165189 174142 182248 188356 193473
54460A93473N730O452N950M601L372K381J338M04l33j600m079p122r300j0154
$$ 193473 199203 205655 211605 216206 219578 221959 223297 223701 223368 221768 217689 210567 201267 191113
54446A91113j0505j0933j0795r183o373l751k371k091k175k271k328j900m64J391
$$ 191113 180608 169675 158880 149697 143324 139573 137202 135111 132936 130665 128337 126437 125973 127364
54432A27364K015O60j303k034j605j550k312k507j100R26J834J299O10J087K748
$$ 127364 129379 130039 128736 126702 125097 123547 121235 118728 117628 118554 120388 121687 122297 123384 126132
54417A26132M276M132K120K0k7K034L879L368P66j949l278l165k317j369n91N4
$$ 126132 130408 134540 136660 136680 136653 138687 142566 145934 146700 144751 141473 138308 135991 134622 134031 134085
54401A34085O32Q46K30j140k450k871k254j051J31Q16R62J021J356J663J407P22
$$ 134085 134717 135563 135793 134653 132203 129332 127078 126027 126158 126974 127936 128957 130313 131976 133383 134105
54385A34105K30J17J35L19P57P61m69k223k746j823j401k784m542m450k570r46
$$ 134105 134335 134452 134587 134906 135663 136424 135955 133732 130986 129163 127762 124978 120436 115986 113416 112470
54369A12470p84j343j416o76O00K170L762M848M849L617J767M19K19N09R1j198
$$ 112470 111686 110343 108927 108251 108851 111021 114783 119631 124480 128097 129864 130283 130502 131011 131102 129904
54353A29904k327k579k265j602o7K378M477N104M807M869N414N493M770L941L629
$$ 129904 127577 124998 122733 121131 121064 123442 127919 133023 137830 142699 148113 153606 158376 162317 165946
54338A65946L698L773L742L658L602L673L872M122M394M429L423Q97k000l208
$$ 165946 169644 173417 177159 180817 184419 188092 191964 196086 200480 204909 208332 209229 207229 204021
54324B04021k411j781l162n539o466n250l339k076j571j592k156l125m105m896
$$ 204021 201610 199829 196667 191128 184662 179412 176073 173997 172426 170834 168678 165553 161448 156552
54310A56552n341m926l309j107O22J472J641J154J39n43l6J237K024J911J552
$$ 156552 151211 146285 142976 141869 142491 143963 145604 146758 146897 146354 146318 147555 149579 151490 153042
54295A53042J257O07l76p59m3Q55P50j43l12J212L583M929M344K756J626J346
$$ 153042 154299 154906 154530 153771 153728 154583 155333 155190 154878 156090 159673 164602 168946 171702 173328 174674
54279A74674J417J679K160K022K92k068k596o48J310R14j083k394k425k206k221
$$ 174674 176091 177770 179930 181952 182244 180176 177580 176932 178242 179156 178073 175679 173254 171048 168827
54264A68827k307k955m699o668p466p118o400n021k579o69j463m129n300l489
$$ 168827 166520 163565 158866 152198 144732 137614 131214 126193 123614 122945 121482 117353 112053 108564
54250A08564o50J146K093K759K368N58j227j862k450m194n770m922k016J58l8
$$ 108564 107914 109060 111153 113912 116280 116838 115611 113749 111299 107105 101335 96413 94397 94555 94517
54235I4517j359j770r25l9j30r93j668j504o13O43K101L330L289J364j419l293
$$ 94517 93158 91388 90463 90424 90294 89301 87633 86129 85516 86159 88260 91590 94879 96243 94824 91531
54219I1531l783l806l859l366k058o14N58J902L484M278L513J773J94n56j56J345
$$ 91531 87748 83942 80083 76717 74659 74045 74603 76505 79989 84267 87780 89553 89747 89191 89035 90380
54203I0380K797K548N92j071j022j13K93L45P09R46M46p5K79P50J34p92q4K157
$$ 90380 93177 95725 96317 95246 94224 94111 94404 94749 95458 96404 96850 96775 97054 97804 97938 97146 97062 99219
54185I9219L442K144m06j808j314k2P52N32l06r94r85m71j09j65k37K07J157J926
$$ 99219 102661 104805 104399 102591 101277 101255 102007 102539 102233 101239 100254 99783 99674 99509 99272 99479 100636 102562
54167A02562J622J03j447j522p9J345J755J940K806L504K652Q32J55J336K711
$$ 102562 104184 104287 102840 101318 101239 102584 104339 106279 109085 112589 115241 116073 116228 117564 120275
54152A20275K648J534O96M23Pq31j541j568r57j67L17J69p19k119l475m067l519
$$ 120275 122923 124457 125153 125576 125583 124752 123211 121643 120686 120519 120836 121005 120286 118167 114692 110625 107106
54135A07106k247j245j116j503j726j654j624j717j726j629j605j637j582j537
$$ 107106 104859 103614 102498 100995 99269 97615 95991 94274 92548 90919 89314 87677 86095 84558
54121H4558j636j623j199o56n43o51j48J162K403K766K472K244K308K357K052
$$ 84558 82922 81299 80100 79444 78901 78250 78102 79264 81667 84433 86905 89149 91457 93814 95866
54106I5866J173l29j985k919k791k263j972j482j25J429J593J09j371j606j620
$$ 95866 97039 96710 94725 91806 89015 86752 84780 83298 83173 84602 86195 86304 84933 83327 81707
54091H1707k990n011n127k356J217K923K349R55p5n31m59j23l26j616l137l313
$$ 81707 78717 73706 68579 66223 67440 70363 72712 73667 73592 73061 72602 72479 72153 70537 67400 64087
54075F4087j803J40J313J621J448R70M63L22M28J97m03o43j54N54R96J244J224
$$ 64087 62284 62424 63737 65358 66806 67776 68239 68561 68989 69186 68783 68140 67986 68540 69536 70780 72004
54058G2004M99o61j042j42Q59P33j9j04N46R17O62M89R26J675K234K250J466N9
$$ 72004 72503 71842 70800 70658 71517 72250 72231 72127 72673 73590 74252 74741 75667 77342 79576 81826 83292 83351
54040H3351j065j157o91p48j432j851j597j161q41j85R95J969J954J014k91j612
$$ 83351 82286 81129 80438 79690 78258 76407 74810 73649 72808 72623 73618 75587 77541 78555 78264 76652
54024G6652k648k747j337J249L812N193N191M496L785K926J382n32j352oK619
$$ 76652 74004 71257 69920 71169 74981 80174 85365 89861 93646 96572 97954 97422 96070 96064 98683
54009I8683M313L779J678m03j377j027J93J266J095m69k253k715j343J132L581
$$ 98683 102996 106775 108453 108050 106673 105646 105839 107105 108200 107731 105478 102763 101420 102552 106133
53994A06133N240N750N030L504K194K089L132M191M248L448K658K307K233K390
$$ 106133 111373 117123 122153 125657 127851 129940 133072 137263 141511 144959 147617 149924 152157 154547
53980A54547K976L776M250M485N187O352O836O008N035N595P668R512R717Q479
$$ 154547 157523 161299 165549 170034 175221 181573 188409 194417 199452 205047 212715 222227 231944 240423
53966B40423O933N947N674N750N751N606N513N380M787L746K874K386J590J1j618
$$ 240423 247356 253303 258977 264727 270478 276084 281597 286977 291764 295510 298384 300770 302360 302371 300753
53951C00753k317k329k630l360l797l780l991m745n432n440m920m441m412m926
$$ 300753 298436 296107 293477 290117 286320 282540 278549 273804 268372 262932 258012 253571 249159 244233
53937B44233n646n828m984l520k321j863k164l033l782l289j375L08K9j643k521
$$ 244233 238587 232759 227775 224255 221934 220071 217907 214874 211092 207803 206428 206736 206765 205122 202601
53922B02601j756p04o91j352j609j035J40J323J487M2j855k190p90K78l22j321
$$ 202601 200845 200141 199450 198098 196489 195454 195594 196917 198404 198446 196591 194401 193611 193889 193567 192246
53906A92246j063j12j72j369k311k316k105k427l126l503k723l48K742M477L799
$$ 192246 191183 191071 190899 189530 187219 184903 182798 180371 177245 173742 171019 170671 173413 177890 181689
53891A81689K267K168L417L908K746J456J568K635L351L391L199K954K695K874
$$ 181689 183956 186124 189541 193449 196195 197651 199219 201854 205205 208596 211795 214749 217444 220318
53877B20318L737M693N039N041N425O095O199N460M540M080M030M121M287M394
$$ 220318 224055 228748 233787 238828 244253 250348 256547 262007 266547 270627 274657 278778 283065 287459
53863B87459M262M289N367P506R145Q660O262L605J755O61N11K104N216P899Q526
$$ 287459 291721 296010 301377 308883 318028 326688 332950 336555 338310 338971 339482 341586 346802 354701 363227
53848C63227P825P638Q256Q310P058N387M323L839L461L067K620J968J260P47
$$ 363227 371052 378690 386946 395256 402314 407701 412024 415863 419324 422391 425011 426979 428239 428986
53834D28986k0j767l908m755l995l743n866r242j1050j0223q251o869o488o848
$$ 428986 428966 427199 423291 418536 414541 410798 404932 395690 384640 374417 366166 359297 352809 345961
53820C45961p829r030r593r070p986p242p322q098q941q971p875o503o066o550
$$ 345961 338132 329102 319509 310439 302453 295211 287889 279791 270850 261879 254004 247501 241435 234885
53806B34885o625n428l816l353m405n587n139k717L6R51l83k060k049p05k42j862
$$ 234885 228260 222832 219016 215663 211258 205671 200532 197815 197851 198802 198419 196359 194310 193605 193363 191501
53790A91501m291n491m924l588k451j609p31J82N83j92k121m220n393n482m916
$$ 191501 187210 181719 176795 173207 170756 169147 168416 168598 169181 168989 166868 162648 157255 151773 146857
53775A46857l632j344J097J940P93m86o1J573K563K161R79m22j663j741J15K708
$$ 146857 143225 141881 142978 144918 145711 145225 145164 146737 149300 151461 152440 152018 150355 148614 148729 151437
53759A51437L726K761J808K192K695J912Q46J367L113L995L417K982L672M204
$$ 151437 155163 157924 159732 161924 164619 166531 167377 168744 171857 175852 179269 182251 185923 190127
53745A90127L094J123M63J960M313N843O272O574P493Q537Q549P309O123O372
$$ 190127 193221 194344 194807 196767 201080 206923 213195 219769 227262 235799 244348 251657 257780 264152
53731B64152P619Q044O777M956M084M209M407M370M505M747M390L211K015J621
$$ 264152 271771 279815 286592 291548 295632 299841 304248 308618 313123 317870 322260 325471 327486 329107
53717C29107J732J266l47k439l769l801l200k904k970k819k441k624l741n122
$$ 329107 330839 332105 331758 329319 325550 321749 318549 315645 312675 309856 307415 304791 301050 295928
53703B95928o026o560o989o949o216n548n670n957n352m268m023m501m040k063
$$ 295928 289902 283342 276353 269404 263188 257640 251970 246013 240661 236393 232370 227869 223829 221766
53689B21766k16j31j418k871m318n945o722n151j473K143L576K262r00m115n480
$$ 221766 221550 221419 220001 217130 212812 206867 200145 194994 193521 195664 199240 201502 200602 196487 191007
53674A91007m355k037k42R00K381M158M900M075K821K092J213o62k683l132j713
$$ 191007 186652 184615 184373 185273 187654 191812 196712 200787 203608 205700 206913 206251 203568 200436 198723
53659A98723K56J700K799L930M749M806M396M104L845L028J691Q77J527L236M590
$$ 198723 198979 200679 203478 207408 212157 216963 221359 225463 229308 232336 234027 234904 236431 239667 244257
53644B44257M769M440M718N576N859M885L469K940L514M119L798K779K091K343
$$ 244257 249026 253466 258184 263760 269619 274504 277973 280913 284427 288546 292344 295123 297214 299557
53630B99557L179L747L567K778J834J168J233K465M689O651O679M244P26j603
$$ 299557 302736 306483 310050 312828 314662 315830 317063 319528 324217 330868 337547 341791 342517 340914
53616C40914j403P85L052L579K044j41j310j311j335j894j870k23K138L394L289
$$ 340914 339511 340296 343348 346927 348971 348830 347520 346209 344874 342980 341110 340887 343025 346419 349708
53601C49708L166L592L395J631q07k420k984l208l327l183l187l904m801m542
$$ 349708 352874 356466 359861 361492 360685 358265 355281 352073 348746 345563 342376 338472 333671 329129
53587C29129k750n24R32J373J143N49no9K52K09o52j836k446j944k48K363N014
$$ 329129 326379 325855 326787 328160 329303 329852 329847 329778 330030 330239 329587 327751 325305 323361 323113 325476 330490
53570C30490O360N612L470J826K309M828P377P690N549L064K258K979L957N032
$$ 330490 336850 342462 345932 347758 350067 354895 362272 369962 375511 378575 380833 383812 387769 392801
53556C92801O709Q103P472N195L978N213P029P223O328O130O683O885O905P750
$$ 392801 399510 407613 415085 420280 424258 429471 436500 443723 450051 456181 462864 469749 476654 484404
53542D84404Q977R064P938P046O910O612N977O287Q133J0177J0784R734P855O064
$$ 484404 493381 502445 510383 517429 524339 530951 536928 543215 551348 561525 572309 582043 589898 595962
53528E95962N177N359N496M428L004L195M883N474L660J468J195K086J887L57
$$ 595962 601139 606498 611994 616422 619426 622621 627504 632978 636638 638106 639301 641387 643274 643631
53514F43631q81j124j109j161p91j22j5n95j046j036j064j227r56k62k5n70r48
$$ 643631 642750 641626 640517 639356 638565 638443 638428 637833 636787 635751 634687 633460 632504 632242 632217 631647 630699
53497F30699k33J158J996J526j03k050l067k215K29K840M309M393L627K599J810
$$ 630699 630466 631624 633620 635146 635043 632993 629926 627711 627940 630780 635089 639482 643109 645708 647518
53482F47518J665K192K943L541M138N092O275O990O701N838N668P043R247J0628
$$ 647518 649183 651375 654318 657859 661997 667089 673364 680354 687055 692893 698561 705604 714851 725479
53468G25479J0614J0590J2134J4789J6465J6037J4742J4680J6472J8878K0393
$$ 725479 736093 746683 758817 773606 790071 806108 820850 835530 852002 870880 891273
53457H91273K0840K1343K3021K5827K8708L0732L1739L1965L1545L0833L0745
$$ 891273 912113 933456 956477 982304 1011012 1041744 1073483 1105448 1136993 1167826 1198571
53446A198571L2184L5025L8103M0286M1398M2073M2921M3850M4283M4121M4258
$$ 1198571 1230755 1265780 1303883 1344169 1385567 1427640 1470561 1514411 1558694 1602815 1647073
53435A647073M5604M7702M9104M9264M9183M9701N0153M9564M8359M7723M7801
$$ 1647073 1692677 1740379 1789483 1838747 1887930 1937631 1987784 2037348 2085707 2133430 2181231
53424B181231M7712M7178M6837M7007M7218M7162M6999M6560M5209M2948M0819
$$ 2181231 2228943 2276121 2322958 2369965 2417183 2464345 2511344 2557904 2603113 2646061 2686880
53413B686880L9732L9426L8954L7630L5273L2109K8747K5838K3421K1058J8670
$$ 2686880 2726612 2766038 2804992 2842622 2877895 2910004 2938751 2964589 2988010 3009068 3027738
53402C027738J6745J5551J4615J3156J0564O459R51n052j0357j4515j7782k0269
$$ 3027738 3044483 3060034 3074649 3087805 3098369 3104828 3105779 3100727 3090370 3075855 3058073 3037804
53390C037804k1867k3104k4901k7267k9155l0159l1314l3681l6806l9351m0601
$$ 3037804 3015937 2992833 2967932 2940665 2911510 2881351 2850037 2816356 2779550 2740199 2699598
53379B699598m0764m0449m0419m1177m2083m1517l8747l5122l2508l1064k9483
$$ 2699598 2658834 2618385 2577966 2536789 2494706 2453189 2414442 2379320 2346812 2315748 2286265
53368B286265k7116k4689k3025k1984k0902j9315j7038j4068j0638p034l382J70
$$ 2286265 2259149 2234460 2211435 2189451 2168549 2149234 2132196 2118128 2107490 2100456 2097074 2097244
53356B097244L219N523P475R748J2534J5540J8515K1345K3894K6335K9439L3814
$$ 2097244 2100463 2105986 2113461 2123209 2135743 2151283 2169798 2191143 2215037 2241372 2270811 2304625
53344B304625L8841M3033M5521M6743M7686M9064N1239N4325N8003O1602O4687
$$ 2304625 2343466 2386499 2432020 2478763 2526449 2575513 2626752 2681077 2739080 2800682 2865369
53333B865369O7390P0197P3602P7709Q1771Q4388Q5021Q5139Q7067R1362R6168
$$ 2865369 2932759 3002956 3076558 3154267 3236038 3320426 3405447 3490586 3577653 3669015 3765183
53322C765183R9459J01034J01790J01934J00979R9096R7235R5804R4183R1854
$$ 3765183 3864642 3965676 4067466 4169400 4270379 4369475 4466710 4562514 4656697 4748551
53312D748551Q9250Q6848Q4022P9581P3295O6152N9051N1944M4529L7140L0370
$$ 4748551 4837801 4924649 5008671 5088252 5161547 5227699 5286750 5338694 5383223 5420363 5450733
53301E450733K4165J7898J1199M088l621j2163k1014k8987l5581m1637m8214n5476
$$ 5450733 5474898 5492796 5503995 5508083 5504462 5492299 5471285 5442298 5406717 5365080 5316866 5261390
53289E261390o3027p0730p8385q5168r0308r4030r7022r9229j00080r9690r8793
$$ 5261390 5198363 5127633 5049248 4964080 4873772 4779742 4682720 4583491 4483411 4383721 4284928
53278D284928r7581r5798r4035r3539r4205r4123r1983q8851q6414q4376q1168
$$ 4284928 4187347 4091549 3997514 3903975 3809770 3715647 3623664 3534813 3448399 3364023 3282855
53267C282855p6757p3037p1126o9699o6692o1774n6345n1707m8077m5149m2830
$$ 3282855 3206098 3133061 3061935 2992236 2925544 2863770 2807425 2755718 2707641 2662492 2619662
53256B619662m1178l9968l8652l6714l4056l0936k7599k4114k0633j7469j4696
$$ 2619662 2578484 2538516 2499864 2463150 2429094 2398158 2370559 2346445 2325812 2308343 2293647
53245B293647j2013r382p515o979p018o098l688o93K008M537P126R295J0788J2442
$$ 2293647 2281634 2272252 2264737 2257758 2250740 2244642 2240954 2240261 2242269 2246806 2253932 2263227 2274015 2286457
53231B286457J5159J8484K1400K3998K7096L0470L2958L4478L6372L9331M2256
$$ 2286457 2301616 2320100 2341500 2365498 2392594 2423064 2456022 2490500 2526872 2566203 2608459
53220B608459M4002M4836M5229M4451M1845L8675L7069L7425L8170L7877L6243
$$ 2608459 2652461 2697297 2742526 2786977 2828822 2867497 2904566 2941991 2980161 3018038 3054281
53209C054281L3200K8704K3678J9601J6583J3156Q642M319J253j754o525j2577
$$ 3054281 3087481 3116185 3139863 3159464 3176047 3189203 3197845 3202164 3203417 3201663 3195138 3182561
53197C182561j7477j9998k1460k3720k7024l0431l3447l6475l9947m3625m6861
$$ 3182561 3165084 3145086 3123626 3099906 3072882 3042451 3009004 2972529 2932582 2888957 2842096
53186B842096m9342n1429n3539n5307n5867n5279n5004n6100n7368n6465n2936
$$ 2842096 2792754 2741325 2687786 2632479 2576612 2521333 2466329 2410229 2352861 2296396 2243460
53175B243460m9062m7214m7377m7863m7655m6944m5814m3731m0691l7944l6848
$$ 2243460 2194398 2147184 2099807 2051944 2004289 1957345 1911531 1867800 1827109 1789165 1752317
53164A752317l7177l7091l4988l1288k8126k7151k7714k7624k5724k3186k1893
$$ 1752317 1715140 1678049 1643061 1611773 1583647 1556496 1528782 1501158 1475434 1452248 1430355
53153A430355k2016k2059k1083j9864j9526j9961k0358k0644k1294k1984k1636
$$ 1430355 1408339 1386280 1365197 1345333 1325807 1305846 1285488 1264844 1243550 1221566 1199930
53142A199930k0085j8634j8294j8321j7409j5783j4962j5567j6510j6621j6058
$$ 1199930 1179845 1161211 1142917 1124596 1107187 1091404 1076442 1060875 1044365 1027744 1011686
53131A011686j5596j5456j5580j6415j8273k0184k0503j8853j6646j5346j4963
$$ 1011686 996090 980634 965054 948639 930366 910182 889679 870826 854180 838834 823871
53120H23871j4670j4193j3786j3316j2388j1417j1594j3281j5070j5169j3512
$$ 823871 809201 795008 781222 767906 755518 744101 732507 719226 704156 688987 675475
53109F75475j1727j0972j0616r468p761p051q163j0044j0966j0513r843j0144
$$ 675475 663748 652776 642160 632692 624931 617880 609717 599673 588707 578194 568351 558207
53097E58207j1210j1747j0910r236p927p357o737n456m266m488o095p446p101
$$ 558207 546997 535250 524340 515104 507177 499820 493083 487627 483361 478873 472778 465332 458231
53084D58231n348l530k540k494l307m670n699n534m339l071k244j652j411k245
$$ 458231 452883 449353 446813 444319 441012 436342 430643 425109 420770 417699 415455 413803 412392 410147
53070D10147m280o295o926o125m777l299j511J78N64q74k914l674k613j042n22
$$ 410147 405867 399572 392646 386521 381744 378445 376934 377112 377676 376802 373888 370214 367601 366559 366037
53055C66037j225k073k345k532l437m790n409m711l486k883l082l375l196k537
$$ 366037 364812 362739 360394 357862 354425 349635 344226 339515 336029 333146 330064 326689 323493 320956
53041C20956j611o79j85m63j200j697j806k128l109m345n048m827l819k423j171
$$ 320956 319345 318666 318481 318018 316818 315121 313315 311187 308078 303733 298685 293858 290039 287616 286445
53026B86445m16P3P66J316N89j557l186k127J220M083M527L437K943L782M939
$$ 286445 286029 286102 286868 288184 288773 287216 284030 281903 283123 287206 291733 295170 298113 301895 306834
53011C06834N227M419L108K071J614J151j58k111l336l062k324k580l621l960
$$ 306834 312061 316480 319588 321659 323273 324424 324266 322155 318819 315757 313433 310853 307232 303272
52997C03272l057j914j524j794k338l146m063m547m499m571n159n844o270o654
$$ 303272 300215 298301 296777 294983 292645 289499 285436 280889 276390 271819 266660 260816 254546 247892
52983B47892o898o230m561l146k877k875k120j554k781n104n959m380k172j185
$$ 247892 240994 234764 230203 227057 224180 221305 219185 217631 214850 209746 203787 199407 197235 196050
52969A96050j182j190j330k033k735k615j835r06L44J987K952K268O77l79r89
$$ 196050 194868 193678 192348 190315 187580 184965 183130 182224 182568 184555 187507 189775 190452 190073 189084
52954A89084k361m322n026l500j053M53N36k31j202j681r61O65J809J549M72n38
$$ 189084 186723 182401 177375 173875 172822 173275 173811 173580 172378 170697 169736 170401 172210 173759 174231 173693
52938A73693j545k673k963j441J160L072L620L421K797J461q1m56O42J724J498
$$ 173693 172148 169475 166512 165071 166231 169303 172923 176344 179141 180602 180521 180065 180707 182431 183929
52923A83929N41rl96j572k980k663R0L390M672L411J249j15l75r6L87J054J686
$$ 183929 184470 184461 184065 182493 179513 176850 176940 180330 185002 188413 189662 189547 189172 189076 189463 190517 192203
52906A92203J880J524P80k97j599k422j795K87K527L666L689L253K570J681J146
$$ 192203 194083 195607 196387 196090 194491 192069 190274 190561 193088 196754 200443 203696 206266 207947 209093
52891B09093J447J939J566N42J86R22J794K170K560L180L080J762N20Q92K528
$$ 209093 210540 212479 214045 214587 214773 215695 217489 219659 222219 225399 228479 230241 230761 231653 234181
52876B34181L866M352M553M549L819K720K587L842N212N324M303L238K840L092
$$ 234181 238047 242399 246952 251501 255320 258040 260627 264469 269681 275005 279308 282546 285386 288478
52862B88478L619L987M067M344N330O532O674N239L160J548N09l59j091j637k373
$$ 288478 292097 296084 300151 304495 309825 316357 323031 328270 331430 332978 333487 333128 332037 330400 328027
52847C28027l510m412m380l780l522l630l298k394j857k222k636j979m17Q69J203
$$ 328027 324517 320105 315725 311945 308423 304793 301495 299101 297244 295022 292386 290407 289990 290859 292062
52832B92062Q85K69q03k284l308k967j479nP18R55J095R02J28p15q17j96K66k6
$$ 292062 292947 293216 292413 290129 286821 283854 282375 282370 283088 284043 285138 286040 286168 285453 284636 284440 284706 284680
52814B84680p37j138q64j4J072J939K189J803J174P22N20K78m09j566k467k005
$$ 284680 283943 282805 281941 281927 282999 284938 287127 288930 290104 290826 291346 291624 291215 289649 287182 285177
52798B85177Q1K583L813L154J308o20j720j397R1J325J018k08m18R49K195J801
$$ 285177 285258 287841 291654 294808 296116 295496 293776 292379 292470 293795 294813 294605 294187 295136 297331 299132
52782B99132O07M76J560K250J605N06J38L52J61o73j160k89J550K687J836m59
$$ 299132 299739 300215 301775 304025 305630 306136 306274 306626 306787 306114 304954 304665 306215 308902 310738 310279
52766C10279k484l316l533l854l893k953j403m91q88k010k772k575j691r41q36
$$ 310279 307795 304479 300946 297092 293199 290246 288843 288352 287464 285454 282682 280107 278416 277475 276639
52751B76639r23k95R37J460N33o80n20R90K282K406K013K083K606K805K082N68
$$ 276639 275716 275421 276358 277818 278351 277671 277151 278141 280423 282829 284842 286925 289531 292336 294418 294986
52735B94986q65j207n04k17j628l971n169m434l182l020l866m615m804m823m999
$$ 294986 294121 292914 292410 292193 290565 286594 281425 276991 273809 270789 266923 262308 257504 252681 247682
52720B47682n260n348m948l814k285j281j413k349l408m231m475l658k069j228
$$ 247682 242422 237074 232126 228312 226027 224746 223333 220984 217576 213345 208870 205212 203143 201915
52706B01915k215l822l754j732k6k90j317j034K82M40j255k826k412q06k16j372
$$ 201915 199700 195878 192124 190392 190366 190076 188759 187725 188007 188447 187192 184366 181954 181148 180932 179560
52690A79560l093m254m837n028m529l286k027j443j389j422j537j817j840j185
$$ 179560 176467 172213 167376 162348 157819 154533 152506 151063 149674 148252 146715 144898 143058 141873
52676A41873k49J10l04q94j202j380j792k482l072k902j570L47J399P55p24j560
$$ 141873 141624 141734 141430 140536 139334 137954 136162 133680 130608 127706 126136 126483 127882 128637 127913 126353
52660A26353j549j611j982j710l08J238J736J237M96j97q77j182q19m21p74j387
$$ 126353 124804 123193 121211 119501 119193 120431 122167 123404 123900 123703 122826 121644 120825 120404 119630 118243
52644A18243r61M97J181k03k593l848l321k122j192l66N25R17N81M89J542K974
$$ 118243 117282 117779 118960 118757 116164 112316 108995 106873 105681 105315 105840 106757 107338 107827 109369 112343
52628A12343L160J907P25O24P80Lj280j501L7K286L475K558l2k559l237j859o
$$ 112343 115503 117410 118135 118759 119539 119542 118262 116761 116798 119084 122559 125117 125085 122526 119289 117430 117424
52611A17424Q56J008J620K741L197K334Q44k88o85j57J617M268O249N974L452
$$ 117424 118280 119288 120908 123649 126846 129180 130024 129736 129051 128894 130511 134779 141028 147002 150454
52596A50454L93j271q72P58K233K805K708K432K056J520J157J258J315N02j054
$$ 150454 150847 149576 148704 149462 151695 154500 157208 159640 161696 163216 164373 165631 166946 167448 166394
52581A66394k263k517k343k316k082j079M10J567J990J747Q22p12k155k587j998
$$ 166394 164131 161614 159271 156955 154873 153794 154204 155771 157761 159508 160330 159618 157463 154876 152878
52566A52878j365j435j868j898j491j313j651j911j478o58k54m85q41j005j179
$$ 152878 151513 150078 148210 146312 144821 143508 141857 139946 138468 137810 137556 137071 136230 135225 134046
52551A34046j231m73J159K376J931K77j042j346j145p43K09J593K380J882O34
$$ 134046 132815 132342 133501 135877 137808 138085 137043 135697 134552 133809 134018 135611 137991 139873 140507
52536A40507l66o24m0J293K708L077K018M56m11k99K64O15K42p70j247J20K759
$$ 140507 140141 139517 139477 140770 143478 146555 148573 149029 148618 148319 148583 149198 149440 148670 147423 147543 150302
52519A50302M191L024J013Q33K576L896L305J612J51p34r63l3J950L540L439K135
$$ 150302 154493 157517 158530 159363 161939 165835 169140 170752 170903 170169 169206 169173 171123 174663 178102 180237
52503A80237J071O53J64n04l62R51K135J827P21Q21K701M595M676L168J560O44
$$ 180237 181308 181961 182125 181621 181259 182210 184345 186172 186893 187714 190415 195010 199686 202854 204414 205058
52487B05058L16O35J674K601K319J131M49O80P56J80l4P43J448J079M43O04P19
$$ 205058 205374 206009 207683 210284 212603 213734 214183 214863 215619 215799 215765 216508 217956 219035 219478 220082 220801
52470B20801n91k403k217M04K960L315K119J194R76P30K43M1L62R81J677K201
$$ 220801 220210 217807 215590 215994 218954 222269 224388 225582 226558 227288 227531 227572 227934 228915 230592 232793
52454B32793K021Q52p82k063k668k520j332O90K108J440o97j799n07J502J535
$$ 232793 234814 235666 234884 232821 230153 227633 226301 226991 229099 230539 229842 228043 227536 229038 230573
52439B30573p33k994l255j950p49k48K52J195K035K146J704J264R02K08q70j590
$$ 230573 229840 226846 223591 221641 220892 220644 220896 222091 224126 226272 227976 229240 230142 230350 229480 227890
52423B27890r86J012L247M383M293M024M273M475L767K239N78j012k524l209k208
$$ 227890 226904 227916 231163 235546 239839 243863 248136 252611 256378 258617 259195 258183 255659 252450 250242
52408B50242j37J185R62J21n15j417k866l585k263L29K114K271J778J536J263
$$ 250242 250105 251290 252252 252373 251858 250441 247575 243990 241727 242056 244170 246441 248219 249755 251018
52393B51018M20p94j758k064j592n04O69J396J706J989K292K312K050J852J691
$$ 251018 251438 250644 248886 246822 245230 244726 245395 246791 248497 250486 252778 255090 257140 258992 260683
52378B60683J087j3p99m32R30K268K728K317J623R54l0j706l524m186l022q95
$$ 260683 261770 261757 260958 260526 261456 263724 266452 268769 270392 271346 271316 269610 266086 261900 258878 257983
52362B57983O58J004Q14J165K375L636L514J274k061m252l839j322J688L883M590
$$ 257983 258641 259645 260459 261624 263999 267635 271149 272423 270362 266110 262271 260949 262637 266520 271110
52347B71110L628J636k9n31l52k04K60J666L328L623K009k36j380o82J285L000
$$ 271110 274738 276374 276345 275814 275462 275258 275518 277184 280512 284135 286144 285908 284528 283846 285131 288131
52331B88131K956J198k72L92K401L178J576q55k142k085j545p19Q23K735L576
$$ 288131 291087 292285 292013 292405 294806 297984 299560 298705 296563 294478 292933 292214 293037 295772 299348
52316B99348K196p04k702j625K210O004P113N369K541J36j302j465k73J324J943
$$ 299348 301544 300840 298138 296513 298723 304727 311840 317209 319750 319886 318584 317119 316846 318170 320113
$$ [...]
##END NTUPLES=NMR SPECTRUM
##END=
