
##TITLE=AC1117_Cauca2_5835426_EAq6SDhmyq
##JCAMPDX= 6.0         $$ Bruker NMR JCAMP-DX V2.0
##DATA TYPE= NMR SPECTRUM
##DATA CLASS= NTUPLES
##ORIGIN= BRUKER
##OWNER= Administrator
$$ 1.72 TOPSPIN		Version 2.1
$$ 2012-03-28 11:07:58.843 -0500  Administrator@TOPSPIN
$$ Compression mode = diff/dup
##.OBSERVE FREQUENCY= 400.13188235
##.OBSERVE NUCLEUS= ^1H
##.ACQUISITION MODE= SIMULTANEOUS (DQD)
##.ACQUISITION SCHEME= undefined
##.AVERAGES= 8
##.DIGITISER RES= 22
##SPECTROMETER/DATA SYSTEM= spect
##.PULSE SEQUENCE= zg30
##.SOLVENT NAME= COFFEE_meoh
##.SHIFT REFERENCE= INTERNAL, COFFEE_meoh, 1, 14.98061
##AUDIT TRAIL= $$ (NUMBER, WHEN, WHO, WHERE, PROCESS, VERSION, WHAT)
$$ ##TITLE= Audit trail, TOPSPIN		Version 2.1
$$ ##JCAMPDX= 5.01
$$ ##ORIGIN= Bruker BioSpin GmbH
$$ ##OWNER= Administrator
$$ $$ C:\Bruker\TOPSPIN/data/COFFEE/nmr/AC1117_Cauca2_5835426_EAq6SDhmyq/20/pdata/1/auditp.txt
$$ ##AUDIT TRAIL=  $$ (NUMBER, WHEN, WHO, WHERE, PROCESS, VERSION, WHAT)
(   1,<2012-03-28 04:01:07.828 -0500>,<Administrator>,<TOPSPIN>,<go>,<TOPSPIN 2.1>,
      <created by zg
	started at 2012-03-28 04:00:01.312 -0500,
	POWCHK enabled, PULCHK disabled,
       configuration hash MD5:
       1A 1E CE 29 27 FD 77 03 67 4E F0 E3 C4 B2 CB 90
       data hash MD5: 64K
       62 19 45 00 69 67 68 A1 FE 21 34 A8 0F 7D A5 DF>)
(   2,<2012-03-28 04:01:11.578 -0500>,<Administrator>,<TOPSPIN>,<proc1d>,<TOPSPIN 2.1>,
      <Start of raw data processing
       efp LB = 0 FT_mod = 6 PKNL = 1 PHC0 = 0 PHC1 = 0 SI = 32K 
       data hash MD5: 32K
       E7 9B 1F 9F 82 28 09 EE 82 97 14 D9 D3 A2 DD 53>)
(   3,<2012-03-28 04:01:11.906 -0500>,<Administrator>,<TOPSPIN>,<proc1d>,<TOPSPIN 2.1>,
      <pk PHC0 = 214.2114 PHC1 = 0 
       data hash MD5: 32K
       35 FA DB 3B 34 9D 75 B3 9E EE C7 27 8C 42 85 D8>)
(   4,<2012-03-28 04:01:11.968 -0500>,<Administrator>,<TOPSPIN>,<proc1d>,<TOPSPIN 2.1>,
      <abs ABSG = 1 
       data hash MD5: 32K
       C2 26 0A 9A EE 58 2C 4A 8F 5C AF 25 36 56 B5 DB>)
(   5,<2012-03-28 04:01:12.000 -0500>,<Administrator>,<TOPSPIN>,<proc1d>,<TOPSPIN 2.1>,
      <abs ABSG = 2 
       data hash MD5: 32K
       7B EC 28 22 D7 2F 69 DA 88 7F 6F 19 E6 96 E6 C3>)
(   6,<2012-03-28 04:01:12.031 -0500>,<Administrator>,<TOPSPIN>,<proc1d>,<TOPSPIN 2.1>,
      <abs ABSG = 3 
       data hash MD5: 32K
       EA AB 44 F6 90 73 10 41 14 D8 A2 BD D8 16 C4 F9>)
(   7,<2012-03-28 04:01:12.062 -0500>,<Administrator>,<TOPSPIN>,<proc1d>,<TOPSPIN 2.1>,
      <abs ABSG = 4 
       data hash MD5: 32K
       AE 62 89 10 58 CC CA EB F2 ED 27 2F B8 9E FC BB>)
(   8,<2012-03-28 04:01:12.093 -0500>,<Administrator>,<TOPSPIN>,<proc1d>,<TOPSPIN 2.1>,
      <abs ABSG = 5 
       data hash MD5: 32K
       60 87 48 AE 3E AC 30 29 F4 B6 8D 73 8D 45 EA 28>)
(   9,<2012-03-28 04:01:17.000 -0500>,<Administrator>,<TOPSPIN>,<audit>,<TOPSPIN 2.1>,
      <user comment:
       ICON-NMR User ID: COFFEE
       data hash MD5: 32K
       60 87 48 AE 3E AC 30 29 F4 B6 8D 73 8D 45 EA 28>)
$$ [...]
##$TP= (0..7)
150 150 150 150 150 150 150 150
##$TP07= 0
##$TPNAME0= <>
##$TPNAME1= <>
##$TPNAME2= <>
##$TPNAME3= <>
##$TPNAME4= <>
##$TPNAME5= <>
##$TPNAME6= <>
##$TPNAME7= <>
##$TPOAL= (0..7)
0.5 0.5 0.5 0.5 0.5 0.5 0.5 0.5
##$TPOFFS= (0..7)
0 0 0 0 0 0 0 0
##$TUNHIN= 0
##$TUNHOUT= 0
##$TUNXOUT= 0
##$USERA1= <user>
##$USERA2= <user>
##$USERA3= <user>
##$USERA4= <user>
##$USERA5= <user>
##$V9= 5
##$VALIST= <valist>
##$VCLIST= <CCCCCCCCCCCCCCC>
##$VD= 0
##$VDLIST= <DDDDDDDDDDDDDDD>
##$VPLIST= <PPPPPPPPPPPPPPP>
##$VTLIST= <TTTTTTTTTTTTTTT>
##$WBST= 2048
##$WBSW= 25
##$XGAIN= (0..3)
0 0 0 0
##$XL= 0
##$YL= 0
##$YMAX_a= 537810
##$YMIN_a= -648407
##$ZGOPTNS= <>
##$ZL1= 120
##$ZL2= 120
##$ZL3= 120
##$ZL4= 120
##$ABSF1= 14.98061
##$ABSF2= -5.57192
##$ABSG= 5
##$ABSL= 3
##$ALPHA= 0
##$AQORDER= 0
##$ASSFAC= 0
##$ASSFACI= 0
##$ASSFACX= 0
##$ASSWID= 0
##$AUNMP= <proc_prof1d_extract_pilot.lims>
##$AXLEFT= 0
##$AXNAME= <>
##$AXNUC= <1H>
##$AXRIGHT= 0
##$AXTYPE= 0
##$AXUNIT= <>
##$AZFE= 0.1
##$AZFW= 0.1
##$BCFW= 0
##$BC_mod= 0
##$BYTORDP= 0
##$COROFFS= 0
##$CY= 15
##$DATMOD= 1
##$DC= 0
##$DFILT= <>
##$DTYPP= 0
##$F1P= 0
##$F2P= 0
##$FCOR= 0.5
##$FTSIZE= 32768
##$FT_mod= 6
##$GAMMA= 0
##$GB= 0
##$INTBC= 1
##$INTSCL= 1
##$ISEN= 128
##$LB= 0
##$LEV0= 0
##$LPBIN= 0
##$MAXI= 10000
##$MC2= 0
##$MEAN= 0
##$ME_mod= 0
##$MI= 0
##$NCOEF= 0
##$NC_proc= -8
##$NLEV= 6
##$NOISF1= 0
##$NOISF2= 0
##$NSP= 0
##$NTH_PI= 0
##$NZP= 0
##$OFFSET= 14.98061
##$PC= 1
##$PHC0= 214.2114
##$PHC1= 0
##$PH_mod= 1
##$PKNL= yes
##$PPARMOD= 0
##$PPDIAG= 0
##$PPIPTYP= 0
##$PPMPNUM= 2147483647
##$PPRESOL= 1
##$PSCAL= 4
##$PSIGN= 0
##$PYNMP= <proc.py>
##$REVERSE= no
##$SF= 400.13
##$SI= 32768
##$SIGF1= 0
##$SIGF2= 0
##$SINO= 400
##$SIOLD= 32768
##$SPECTYP= <>
##$SREGLST= <1H.CDCl3>
##$SSB= 0
##$STSI= 32768
##$STSR= 0
##$SW_p= 8223.68421052632
##$SYMM= 0
##$S_DEV= 0
##$TDeff= 65536
##$TDoff= 0
##$TI= <>
##$TILT= no
##$TM1= 0
##$TM2= 0
##$TOPLEV= 0
##$USERP1= <user>
##$USERP2= <user>
##$USERP3= <user>
##$USERP4= <user>
##$USERP5= <user>
##$WDW= 1
##$XDIM= 32768
##$YMAX_p= 468315199
##$YMIN_p= -712869
##$CURPLOT= <Network HP LaserJet P1505>
##$CURPRIN= <$Network HP LaserJet P1505>
##$DFORMAT= <normdp>
##$LAYOUT= <+/1D_H.xwp>
##$LFORMAT= <normlp>
##$PFORMAT= <normpl>
##$SURQMSG= 1
$$ End of Bruker specific parameters
$$ ---------------------------------
##NTUPLES= NMR SPECTRUM
##VAR_NAME=  FREQUENCY,     SPECTRUM/REAL,   SPECTRUM/IMAG
##SYMBOL=    X,             R,               I
##VAR_TYPE=  INDEPENDENT,   DEPENDENT,       DEPENDENT
##VAR_FORM=  AFFN,          ASDF,            ASDF
##VAR_DIM=   32768,         32768,           32768
##UNITS=     HZ,            ARBITRARY UNITS, ARBITRARY UNITS
##FACTOR=    0.250966925370066, 1,           1
##FIRST=     8223.43324360095, 91371,        -184432
##LAST=      0,             -246546,         2416
##MIN=       0,             -712869,         0
##MAX=       8223.43324360095, 468315199,    0
$$ Real data points
##PAGE= N=1
##DATA TABLE= (X++(R..R)), XYDATA
$$ [...]
19461a25250M5044j42533L4845O7175D8266f2521E0780a7748A11230i9540A54421
19449C2111O7707l5179a63710l5025H3994a82589b684j27510j34559N226l802
19438b63329j34263C97760a38102L7326k38539d2637j7003j14540B7272J63700
19428A90972c3073j72011o6427i2577C4455a85145K5685j49327P7757c7268j53156
19417a90424B73541n1682A7878J2357a47200C97923b89522g2605A07597R2101
19407A99698a38072a5351j54217c281j9603G0660b45430a0069I6331h7913Q916
19396g8997K2841E3340a92481r0069a19220b226k87365q0838a52629O6468j03073
19385a89234A31613b76161A37690J63855b0051A10321a51520I5305a33969A17245
$$ y = [-125250, -80206, -222739, -187894, -120719, 48266, -62521, 50780, -17748, 111230, -99540, 154421, 32111, 99818, 64639, -163710, -198735, 83994, -182589, -2684, -130194, -264753, -259527, -263329, -397592, 397760, -138102, -100776, -339315, -42637, -59640, -174180, 27272, 190972, -33073, -205084, -271511, -92577, 34455, -185145, -159460, -308787, -231030, -37268, -190424, 273541, 221859, 17878, 30235, -147200, 397923, -289522, -72605, 107597, 199698, -138072, -15351, -169568, -3281, -22884, 70660, -245430, -10069, 96331, -87913, -78997, -56156, 53340, -192481, -282550, -119220, -2226, -289591, -370429, -152629, -86161, -189234, 131613, -276161, 137690, 301545, -20051, 110321, -151520, 95305, -133969, 117245]
19374b16225j87502J96292j86098C2247K688G112J75823a48848H2701K1137a59454
19362H3052j035h3775B4406k770f9113J9863o0845j78852A00917C040b25361f1783
19349D05c27118i9300A35747B0657d37203a40479B2174J40807b85148O7611k29384
19338d46921e7292B256f3662b4143k18222F7008P024a80490b6119A15358a04688
19326a55977o2038E3826a10218K027k39819P5436A5604b12664o0312J27437k14694
19315c60233b0542l92283K00964d2934j31732O3653C8793f4177H6757d6201j07006
19304a53207e8984m2385l66307J75654J35750q6827G1132a57944P8903K1148A74834
19292B52642b9162D4545f1289A33126o5407B7156a92799j05760a08758c3307n2816
$$ y = [-216225, -403727, -207435, -393533, 32247, 34935, 7112, 182935, -148848, 82701, 103838, -159454, 83052, 82017, -83775, 24406, 21636, -69113, -49250, -110095, -288947, 100917, 3040, -225361, -61783, 405, -327118, -99300, 135747, 20657, -437203, -140479, 22174, 162981, -285148, -217537, -446921, -57292, 2256, -63662, -24143, -242365, 67008, 74032, -180490, -26119, 115358, -104688, -155977, -218015, 53826, -110218, -108191, -348010, -272574, 15604, -212664, -272976, -145539, -360233, -20542, -412825, -211861, -42934, -174666, -111013, 38793, -64177, 86757, -46201, -153207, -58984, -101369, -467676, -292022, -156272, -243099, 71132, -157944, -79041, -57893, 174834, 252642, -29162, 44545, -61289, 133126, 67719, 27156, -192799, -298559, -108758, -33307, -86123]
19281h6123j93395f4955j54989j82649g0061A4994a02507l11198E3467a07380
19270b74020f9550p874p5338A35877m7984a80394b9576l6133g794A07667a40777
19258c07667B4464J61618C6356K30417d1954F892K16097c5856j50322H4588f8763
19246A31725a51856A02704h5983F744J51188b5569E4063k1144b05924j28200k8549
19235c62673A76330a67282A11915b8504m7422h52A50480c4664G5465a88343A01277
19223A8951d6127q7953A4549a03751l1168N2464L6148r7416K4663E6099b9289
19211B96697a72818c7947a0909j72927C1695i9168E679c68103a5944k12237P7020
19200a51161l30049A84796a74871Q2497F719e36371e328B5428c62716i4594C2514
$$ y = [-86123, -279518, -64955, -219944, -402593, -70061, 14994, -102507, -413705, 53467, -107380, -274020, -69550, -77424, -152762, 135877, 87893, -180394, -29576, -65709, -7794, 107667, -140777, -307667, 24464, 186082, 36356, 266773, -41954, 6892, 222989, -35856, -186178, 84588, -68763, 131725, -151856, 102704, -85983, 6744, 157932, -25569, 54063, 32919, -205924, -334124, -362673, 176330, -167282, 111915, -28504, -75926, -852, 150480, -34664, 75465, -188343, 101277, 18951, -46127, -134080, 14549, -103751, -134919, -82455, -46307, -143723, -119060, 56099, -29289, 296697, -172818, -37947, -10909, -183836, 31695, -99168, 5679, -368103, -15944, -228181, -151161, -481210, 184796, -174871, -92374, 6719, -536371, -5328, 25428, -362716, -94594, 32514]
19188H6931b17046f7961B82750a07660j8988K4092o697k09719H1002a8318k50218
19177b68536J07473C54303h4471n8204A68463g0352p5483j53553n7263i7920C44464
19165d4194j9778j22148n5759J4072N5388d2550E2860b06228L4331d4381k29460
19154b73841A04359A3635J26972f4874o6448k7388a9785A9953d7641r8699o7079
19143b13419B56267a61668d4070k8866l53274a36057M8747E3777K8807Q7924b85997
19131a17769j09759H2620a53558j300c899G6468a27290o8139A97816a93824E1904
19119b35004e2261A69444n9922i3972o4096H6378h9880i589l01310I515J1622
19108B1137M1241K41222r8611J51652A41394a20442d36j22356B05747b08854k27046
$$ y = [86931, -217046, -67961, 282750, -107660, -126648, -102556, -109253, -318972, 81002, -18318, -268536, -161063, 354303, -84471, -142675, 168463, -70352, -145835, -299388, -356651, -97920, 344464, -44194, -63972, -186120, -241879, -227807, -172419, -42550, 52860, -206228, -171897, -44381, -273841, 104359, 13635, 140607, -64874, -131322, -158710, -19785, 19953, -47641, -146340, -213419, 256267, -161668, -44070, -72936, -426210, -136057, -87310, 53777, 82584, 170508, -285997, -117769, -227528, 82620, -153558, -154858, -3899, 76468, -127290, -195429, 197816, -193824, 51904, -235004, -52261, 169444, 109522, -93972, -158068, 86378, -89880, -9589, -310899, 9515, 21137, 62378, 303600, 204989, 356641, 141394, -120442, -436, -122792, 205747, -208854, -435900]
19097d35900a53919C2480J1587b42997F4050a82088M1812N5720B26925b15544
19086i8210k64945I658a39651k16638A38509a87139N1044N520e6224j14476h881
19074b08290h1459L3538o6743A20753E3484n659b32156H1383b30260A18443b12189
19062b70424b6108A09357c40526j0616J23011h167k3188k87342B33163m7903A6660
19050G7610k5023b62543E0729a30762A59138a36737M0249r6712e6945K2265m0365
19039g5045j2826c0920B60283a512p9447D4701a09715A9049c9285k16800E7346
19027a04926B7457c25379C0311H490a2425E8080K6849L11963a33879r3780a9722
19015a00420A34604m9371c64858a68063D49943e8609B20524B9160c3836j37218
$$ y = [-435900, -153919, 32480, 44067, -242997, 64050, -182088, -140276, -84556, 226925, -215544, -98210, -363155, 9658, -139651, -356289, 138509, -187139, -136095, -130575, -56224, -170700, -8881, -208290, -81459, -47921, -114664, 120753, 53484, 47825, -232156, 81383, -230260, 118443, -212189, -270424, -26108, 109357, -340526, -351142, -228131, -8167, -31355, -318697, 233163, 185260, 16660, 77610, 52587, -262543, 50729, -130762, 159138, -136737, -96488, -193200, -56945, -34680, -75045, -87871, -30920, 260283, -1512, -80959, 44701, -109715, 19049, -39285, -256085, 57346, -104926, 27457, -325379, 30311, 8490, -12425, 58080, 84929, 396892, -133879, -227659, -19722, -100420, 134604, 85233, -364858, -168063, 449943, -58609, 220524, 29160, -33836, -171054]
19005a71054e1034A69361J26539c18147a5438j31267f6457B3156a7964m03113
18995d21077a65815j5918B8535c3578E5090a02618A37615B8130L9993d14093I4829
18983F9431e7679K616D2524c988F5362O8627N98A482J56093c17665h2071B22007
18970c46357L445a59423e2480C84856b43882g3540A29426a98779C5391I619K03119
18959B12738p032p5393L32289K30609B56803N9039i3309A10885b40794E6795b27951
18947b2460k74203P6692G3664b0252B36307f6933m6938I5517m7467b060j28933
18936a30993k54031a9060B56255a77421A35146c32356C32219C1983a18319o9402
18926a87721K6197k4666B45926b5144A09007b51112A51344a47153B17562a89757
$$ y = [-171054, -51034, 169361, 295900, -318147, -15438, -146705, -66457, 23156, -17964, -421077, -165815, -181733, 28535, -33578, 55090, -102618, 137615, 28130, 68123, -414093, 94829, 69431, -57679, -55063, 42524, -3988, 65362, 133989, 134587, 1482, 157575, -317665, -82071, 222007, -346357, -342912, -159423, -52480, 384856, -243882, -73540, 129426, -198779, 35391, 9619, 212738, 205706, 130313, 462602, 693211, 256803, 315842, -93309, 110885, -240794, 56795, -227951, -22460, -296663, -219971, 73664, -20252, 236307, -66933, -113871, 95517, 48050, -2060, -130993, -385024, -19060, 256255, -177421, 135146, -332356, 332219, 31983, -118319, -187721, -161524, -186190, 245926, -25144, 109007, -251112, 151344, -147153, 217562, -189757]
18915I9163a27924G3868g4194A86122l2064a98402Q0029E2774b23131A66851C3971
18903b41202B9345a00022H9613a2961A49466J1545a20825E0160L37932A45367
18892D11780B05309e0580q2567B47940E3932O1406e6424A35057J79953a06498
18881b40380R7028C18852a76258M452F2617B4353K71517a71299e4130k28441q4217
18870c66788F5483a56442f9744A34193b18800A50841B3003a14538B38521E8821
18859B1725L2183J23643b31089B6754i7560K6376q9471C00132b29581h2964n2225
18848a35189N1066j39336L6986F9036a28419q9853H5265b28949g4189l5426e3598
18836B3025b06506G2679b2007q1862j16421h695B54963f4131G0348J82831h1610
$$ y = [99163, -127924, 73868, -74194, 186122, 154058, -198402, -118373, 52774, -223131, 166851, 33971, -241202, 29345, -100022, 89613, -12961, 149466, 161011, -120825, 50160, 388092, 145367, 411780, 205309, -50580, -133147, 247940, 53932, 115338, -56424, 135057, 315010, -106498, -240380, -143352, 318852, -176258, -171806, 62617, 24353, 295870, -171299, -54130, -282571, -366788, 65483, -156442, -69744, 134193, -218800, 150841, 23003, -114538, 238521, 58821, 21725, 53908, 177551, -231089, 26754, -97560, -71184, -160655, 300132, -229581, -82964, -135189, -84123, -223459, -186473, 69036, -128419, -218272, 85265, -228949, -74189, -109615, -53598, 23025, -206506, 72679, -22007, -103869, -220290, -8695, 254963, -64131, 70348, 253179, -81610]
18824B11146D9465d8331F4311b73576d8472j30187O2180j53860O7514f1143K6300
18813c4843B7736d73692C51091c6298n9288l3558A00150m1675j0492A2921K47951
18802B60872B2926j1082a14043j23812A23493N1723l2615J90948n4565D9927J79312
18791B29239a0450l18139j91402C9094c37188Q9955i1273d0279o7378k70912j21007
18780d99576a95386e2110j38637A39798A9391K87637c40338J09199G0289b71267
18769A4412a94690d8714j3534B92250l310R4158b51372A83591d88494a88618E2844
18757E3943b11371m0372J12446A2832a42012c521A7950M6390J59436A05160b65838
18745e480j89199I3039Q3992p2658J90760A08553K294e8468m8192o5093P6186
$$ y = [211146, 49465, -48331, 64311, -273576, -48472, -178659, -116479, -270339, -202825, -61143, -34843, 27736, -473692, 351091, -36298, -95586, -129144, 100150, 58475, 47983, 12921, 260872, 22926, 11844, -114043, -237855, 123493, 175216, 142601, 333549, 278984, 49927, 229239, -10450, -328589, -519991, 39094, -337188, -247233, -91273, -40279, -107657, -378569, -499576, -195386, -52110, -190747, 139798, 19391, 307028, -340338, -231139, 70289, -271267, 14412, -194690, -48714, -62248, 292250, 288940, 383098, -251372, 183591, -488494, -188618, 52844, 53943, -211371, -251743, -139297, 12832, -142012, -3521, 17950, 64340, 223776, 105160, -265838, -5480, -194679, 93039, 177031, 104373, 295133, 108553, 110847, -58468, -106660, -171753, -95567]
18734i5567H1596h9720j57195B39743a56351h327n6844A08046C4156N6043a7818
18722b07666A8310b2587L993o7530B85061b61422G8641J98772D0842f6950q1868
18711a48818D328b04317f6302L0676q5041B2546a52681e4428p9958d8196j13035
18700a61231E6209d6008A4343J35270b9054B0250a63044O770a0719H9779D727
18688A22649R3543K4556p4605a13491e5143k47361R2968r9251c0997A16848l0693
18677H6155J44542c9530G057P1024b48059J3472J2904A9474b48300A8549c01259
18665b56568h3482n4792j45627i442p8144B4680a10623a0601j61824K4837L385
18654a44203r9960j16694A93837a43868B13052D3874c61324h4427N178p3528A38114
$$ y = [-95567, 81596, -89720, -246915, 239743, -156351, -8327, -65171, 108046, 34156, 90199, -17818, -207666, 18310, -22587, -18594, -86124, 285061, -261422, 78641, 277413, 40842, -66950, -148818, 4328, -204317, -66302, -35626, -120667, 22546, -152681, -54428, -134386, -48196, -161231, 56209, -46008, 14343, 149613, -29054, 20250, -163044, -156274, -10719, 89779, 4727, 122649, 216192, 240748, 166143, -113491, -55143, -302504, -209536, -308787, -30997, 116848, 86155, 230697, -39530, 7057, 78081, -248059, -234587, -221683, 19474, -248300, 18549, -301259, -256568, -83482, -138274, -283901, -9442, -87586, 24680, -110623, -10601, -172425, -147588, -144203, -244163, -360857, 193837, -143868, 213052, 43874, -361324, -84427, -79249, -152777, 138114]
18642A2199O8206h7872b1305C0409b34966Q2102m7917A42098a01518L9932A70287
18630f3474B3936i4626L6892l4067D5378J2852a00276B14498A1568b32218F8550
18618b7948E619L97067h1551j82618G35c9215j28898A13073J5355N6637h8390
18606b20297G5717K80842E9451b19345H383a46364m4164A94581d28306F121J341
18595G462j994K13838a87639P1972d1348H7216a79183B03822g8331j92920n8000
18584c29251h2772b281j76686F4395d48258h9071k5811g073o8226B95008A16556
18572a7982k15272J10511m2383B1910d43342h4861A25778h009j73211C4811J10137
18561A44948g619B0615b95064a08059R842n8359B00596I422b10023Q6613M6998
$$ y = [12199, 80405, -87872, -21305, 30409, -234966, -152864, -200781, 142098, -101518, -61586, 170287, -63474, 23936, -94626, -57734, -91801, 45378, 58230, -100276, 214498, 11568, -232218, 68550, -27948, 5619, 402686, -81551, -264169, 735, -39215, -168113, 113073, 128428, 185065, -88390, -220297, 75717, 356559, 59451, -219345, 8383, -146364, -190528, 194581, -428306, 6121, 7462, 5468, 219306, -187639, -115667, -41348, 87216, -179183, 203822, -78331, -271251, -329251, -82772, -2281, -178967, 64395, -448258, -89071, -114882, -7073, -75299, 295008, 116556, -17982, -233254, -122743, -165126, 21910, -443342, -84861, 125778, -8009, -181220, 34811, 144948, -7619, 20615, -295064, -108059, -98217, -156576, 200596, 9422, -210023, -123410, -76412]
18550g6412I815a26849B7751J23647m2466a55338O9668j95951L8741e5908a4990
18538B33252A8671J25503b31369p5658C1164a52850j24339E819a77256A43010
18527c67325a44259A14522b06126H6434g0307j06696r1677j44213D06205b086
18516C0666f00466e6324j74139A72523H5629b85868h2102D76166c2338B18535
18505a16114i74j17671J2748o3218g7438B4686O7034K7682a31988p6187A35937
18493a33913D238a54935C60456h9752J3145A46555b415k03505Q4795h426j47145
18482a55571C73519c63755i6667d2198j53508C38550h7340p5822d1776j17687
18472a59463M8175j31058j39249C3420J32283a41957A71544m3442b3424m7222
$$ y = [-76412, 9815, -126849, 27751, 151398, 108932, -155338, -85670, -281621, -242880, -55908, -14990, 233252, 18671, 144174, -231369, -307027, 31164, -152850, -277189, 5819, -177256, 143010, -367325, -144259, 114522, -206126, 86434, -70307, -177003, -268680, -412893, 406205, -2086, 30666, -600466, -56324, -230463, 172523, 85629, -285868, -82102, 476166, -32338, 218535, -116114, -974, -118645, -105897, -169115, -77438, 24686, 91720, 119402, -131988, -208175, 135937, -133913, 4238, -154935, 360456, -89752, -76607, 146555, -2415, -205920, -121125, -8426, -155571, 373519, -363755, -96667, -42198, -195706, 338550, -87340, -163162, -41776, -159463, -111288, -242346, -381595, 33420, 165703, -141957, 171544, 128102, -23424, -70646]
18462g0646j84933I6809b82106f4009n8882H8429k830c5386m20547a98414e432
18450B00476b33769B51404q282e7461A04547R6618c9609j50380c3250B46984D7897
18438h981B46904j07295j5066N5159B5568Q134R3152J9071d5539j747k33080i9323
18425E5706M1394D272b21080a9748C599a37865A79948a08045H6911h5121k733
18414h7854j33841e7397B55910E0275c22258J56739M4202A83345H4216a56768
18403a85442C170K4131J02520n3447e3833A06034a99854L1421C79560c42653a5142
18391I0540b20875J01481N9014E2744a73562B01821a32416c786F7729a54108H8609
18379h4678J5757B72179L016j24605a06015K1210l5966B22610a25151B11108a57739
$$ y = [-70646, -255579, 96809, -282106, -64009, -122891, 88429, 85599, -35386, -455933, -198414, -5432, 200476, -233769, 251404, 243122, -57461, 104547, 201165, -39609, -189989, -33250, 246984, 47897, -8981, 246904, 139609, 124543, 179702, 25568, 33702, 126854, 145925, -45539, -47286, -280366, -99323, 55706, 97100, 4272, -221080, -19748, 3599, -137865, 179948, -108045, 86911, -85121, -87854, -221695, -57397, 255910, 50275, -322258, -165519, -121317, 183345, 84216, -156768, -185442, 3170, 27301, 129821, 76374, -53833, 106034, -199854, -168433, 379560, -342653, -15142, 90540, -220875, -119394, -60380, 52744, -173562, 201821, -132416, -3786, 67729, -154108, 88609, -84678, -68921, 272179, 275195, 150590, -106015, -84805, -120771, 222610, -125151, 211108, -157739]
18367a30637j19248b2934k22546D5683c70842A97260K8327a00737B57437g8081
18356i7800I5783b53810B24547C7373b0176I0443O6302C3231b74747A25890h6624
18344a27822A59920R5098G9297c68684A10017A4689f2466k34266R6839i8329B23238
18332H4538J23383c06233F3494a02025A28362A8223j163J17487a22322m0033j87438
18321c49793e7459A95857a06476Q741l85617a17871j81349B7091n774J76809o5273
18310A32853e11652A47952B5948g5633C8147b2364R879j86501j16744A31388a9022
18298b63872J04679L94j31772B01359b35133a10141j36492h9447J6923C27645
18287b88649L7998J16462F4150K28715O3150A28463e9480A3608Q064f6372A18898
$$ y = [-130637, -249885, -22934, -245480, 45683, -370842, 197260, 225587, -100737, 257437, -78081, -97800, 95783, -253810, 224547, 37373, -20176, 90443, 156745, 33231, -274747, 125890, -86624, -127822, 159920, 255018, 79297, -368684, 110017, 14689, -62466, -296732, -199893, -98329, 223238, 84538, 207921, -306233, 63494, -102025, 128362, 18223, 17060, 134547, -122322, -162355, -349793, -57459, 195857, -106476, -97735, -483352, -117871, -299220, 27091, 21317, 198126, 132853, -511652, 147952, 25948, -75633, 38147, -22364, -12485, -198986, -315730, 131388, -19022, -263872, -159193, -158799, -290571, 201359, -235133, -110141, -246633, -89447, -72524, 327645, -288649, -250651, -134189, 64150, 292865, 356015, 128463, -59480, 13608, 21672, -66372, 118898]
18275i3243C01947i7354C78638a70609J6549a8459p9160C18806A00553c78100
18264b94247b2249j96773J4567C3063i5584M2477j11234L2924P230m4569e7739
18252b2264p4992M5010C9986a97794N7692e1881m9940A36050d4045E0200J39015
18241A89215C4427J09029D1378a1246j76313q7328D8115J65572i8944a5640k00489
18230b16129A18298K82810a49060I5928g9457q917j8681Q96c578B47751b13910
18218a67911r7370C96421a02403J8379r897n7524f5203A4428J81700a13209H027
18206B34377A4270c29102A81264l1428d25182g3078b944k94457J47328p5704b0841
18194I1699M6485a94564P9770D2498a81506n3394q4353B2843N0287L38241a56651
$$ y = [-93243, 301947, -97354, 378638, -170609, -154060, -18459, -97619, 318806, 100553, -378100, -294247, -22249, -219022, -204455, 33063, -95584, -53107, -164341, -131417, -124187, -168756, -57739, -22264, -97256, -52246, 39986, -197794, -140102, -51881, -101821, 136050, -44045, 50200, 189215, 34427, 143456, 41378, -11246, -187559, -274887, 48115, 213687, -98944, -15640, -216129, 118298, 401108, -149060, 95928, -79457, -88374, -107055, -106159, -3578, 247751, -213910, -167911, -265281, 396421, -102403, -84024, -93921, -151445, -65203, 14428, 196128, -113209, 8027, 234377, 14270, -329102, 181264, 149836, -425182, -73078, -2944, -297401, -150073, -225777, -20841, 91699, 138184, -194564, -114794, 42498, -181506, -234900, -319253, 22843, 73130, 411371, -156651]
18182a19867A05882k5277K20088A11764b39837C52253A15100K02342a04326A20808
18171D6266P6550d9263A630a13555K325k40791A23010J33961k1844C5465b48853
18159d0614k41842k4441a13713F7829Q1357B4241L8547K0165K5261D8962a85322
18147a49884D2979b03884f5249c2048k270k22412H0620c9338A58522k0768R0602
18136B28356a54654C647c4946k5580j77609B06648f995G2076f4954B03978N3251
18125B57229p3430b72911A54256b89825a7506a971E6970J49227q1041E013g154
18113c9701j55970A19695a99141l1747j29399a1228A53097d31973c70j63109n3956
18102b17435C460N1851b8849A92254A2773f5124j37172A02775d5334c052j40545
$$ y = [-119867, 105882, 80605, 300693, 111764, -239837, 352253, 115100, 317442, -104326, 120808, 46266, 122816, -49263, 1630, -113555, -111230, -352021, 123010, 256971, 235127, 35465, -248853, -40614, -282456, -306897, -113713, 67829, 149186, 24241, 62788, 82953, 108214, 48962, -185322, -149884, 42979, -203884, -65249, -32048, -34318, -256730, 80620, -39338, 158522, 137754, 228356, -154654, 3647, -34946, -60526, -238135, 206648, -6995, 72076, -64954, 203978, 257229, 183799, -272911, 154256, -289825, -17506, -1971, 56970, 206197, 125156, 5013, -7154, -39701, -195671, 119695, -199141, -230888, -360287, -11228, 153097, -431973, -370, -163479, -217435, 3460, 55311, -28849, 192254, 12773, -65124, -202296, 102775, -45334, -3052, -143597]
18091a43597A5607b00716B6846c09805G0224J47141b1715A74900h2498j06658
18081a89156N6335c6607h477j93133P3769J9038c2078m1777B15201d7478l009
18070e0487C45382D0775a70212K2873c9753A20857N2145a8534j23075L406j170
18059a39373A0568J51856Q956p8175e8360G6703J29029q1046b76645d6430j870
18048d8300k06155e6278n0823j79647g7283l5095O945j5611A71912a01424B51280
18036I5424C4662a46378F1330J25753P5414a3856A98645b20428B56259K34629
18026D90888k39813r9589J3729a29241K6595C7969a4346A28286a26674b699j79554
18015a82253C45094e0960p4296A9753J15658a54505j65455A15341m841a57315
$$ y = [-143597, 15607, -200716, 26846, -309805, 70224, 217365, -21715, 174900, -82498, -189156, -132821, -36607, -8477, -201610, -127841, -108803, -32078, -73855, 215201, -47478, -50487, 345382, 40775, -170212, -147339, -39753, 120857, 173002, -18534, -141609, -138203, -139373, 10568, 162424, 171380, 93205, -58360, 76703, 205732, 124686, -276645, -46430, -48300, -254455, -56278, -107101, -286748, -77283, -112378, -105433, -121044, 171912, -101424, 251280, 95424, 34662, -146378, 61330, 187083, 262497, -13856, 198645, -220428, 256259, 490888, 251075, 151486, 165215, -129241, -102646, 37969, -14346, 128286, -126674, -2699, -182253, 345094, -50960, -125256, 19753, 135411, -154505, -319960, 115341, 110500, -157315]
18004d6761m7269C4650b36074A83866H1737m393i8157D6442J14985b33223I1910
17992a36904A67458i0305C40437A14580i2601M2046A85887b50585A49397b99322
17981c11499g2369A07267H30R2299m0406Q1365d0842k4780D7266b39008B4324
17969e7854m38557H6370J41655c47548g4466n5871r0228D3097L91078a42986B48650
17957b33972A73613K14555i9476B65917b6640l86782b5159A41238K73212a07497
17946B21332a10825n9513j13590J01732B46662b00500O0284o8461L7149l0604
17936b02132C33281d1915q4963m6382c8468D0343L8343b74894p141B16728B7311
17924I8253B7980I369c26607B69805a96676A44257a46793m7559j08836a05524
$$ y = [-46761, -94030, 34650, -236074, 183866, 81737, 77344, -98157, 46442, 161427, -233223, 91910, -136904, 167458, -90305, 340437, 114580, -92601, -50555, 185887, -250585, 149397, -299322, -311499, -72369, 107267, 830, 93129, 52723, 134088, -40842, -65622, 47266, -239008, 24324, -57854, -496411, 86370, 228025, -347548, -74466, -130337, -220565, 43097, 434175, -142986, 248650, -233972, 173613, 388168, -99476, 265917, -26640, -413422, -25159, 141238, 414450, -107497, 221332, -110825, -170338, -283928, -182196, 246662, -200500, -140216, -208677, -171528, -202132, 333281, -41915, -126878, -173260, -38468, 40343, 78686, -274894, -282035, 216728, 27311, 98253, 27980, 9369, -326607, 269805, -196676, 144257, -146793, -194352, -303188, -105524]
17913F5257J57071j05504M2916c04895A01278N1310J84966k7256g5182H1783C9208
17901C61877m5920a40360H9466d17633b5938n9548A01190e19923b0506I7343L4260
17890A31603F4638J0674j0859N213c7873B3693K2250J07109J2819j4903M5247
17879A96215e20B35758K98176a02322o2426A0568i8901K6149m6390N2720l03905
17868c70327J04316H1616J90082a45478j80037e4112E6357e7615A32970h2681
17857e6701B0717L36752d739j5941F8888c3389l6804B4846M1536k5721j9074b58137
17844B30139a53796M6460C3625K4778a78093g0448A0518P7394M9976D3476L0675
17833G4151c91308A47140n146b21646d6551I4836J87816c1270C04012A0241b22210
$$ y = [65257, 222328, 116824, 159740, -304895, 101278, 152588, 337554, 310298, -75182, 81783, 39208, 361877, 315957, -140360, 89466, -417633, -25938, -85486, 101190, -519923, -20506, 97343, 131603, 64638, 75312, 64453, 69666, -37873, 23693, 45943, 153052, 165871, 150968, 196215, -520, 235758, 533934, -102322, -164748, 10568, -98901, -72752, -119142, -66422, -370327, -266011, 81616, 271698, -145478, -325515, -54112, 56357, -57615, 132970, -82681, -56701, 20717, 357469, -4739, -20680, 68888, -33389, -70193, 24846, 66382, 40661, 21587, -258137, 230139, -153796, -107336, 33625, 58403, -178093, -70448, 10518, 87912, 137888, 43476, 74151, -391308, 147140, 141994, -221646, -46551, 94836, 282652, -31270, 304012, 10241, -222210]
17821a51339d0298B0987b5291A8599a95806r2938D95211j41532j29886c2639B57185
17809b82674F3946a15887D4251J68919O443h6416m6016j40883a21562C09228e7918
17797C2689M5368J51948p5673M6808h0077A65583h2328F4814L57207a42179O3493
17786g8686D4933C872a90017C4431i7149p6787k56833a13332D45639A02299J52158
17775B54457j07147K35415a10336a6599A82949M1578o2328d464C01363f6317B59295
17763A24747a6381B27084b1810A10919R7954a82107D735L00264j24523c36922
17752C73665f9489j8281F0886J37819a1986i65B61526a76572G2336L06544c4491
17740a59134D9712J46583L3604h093D1924K5213C3110f7852H7665J77004B8714
$$ y = [-151339, -40298, 20987, -25291, 18599, -195806, -288744, 495211, 353679, 223793, -32639, 257185, -282674, 63946, -115887, 44251, 213170, 219613, -86416, -132432, -273315, -121562, 309228, -57918, 32689, 78057, 230005, 154332, 201140, -80077, 165583, -82328, 64814, 422021, -142179, -78686, 44933, 3872, -190017, 34431, -97149, -173936, -430769, -113332, 445639, 102299, 254457, 147310, 382725, -110336, -16599, 182949, 224527, 162199, -4464, 301363, -66317, 259295, 124747, -16381, 227084, -21810, 110919, 208873, -182107, 4735, 304999, 180476, -336922, 373665, -69489, -87770, 60886, 198705, -11986, -965, 261526, -176572, 72336, 378880, -34491, -159134, 49712, 196295, 229899, -8093, 41924, 67137, 33110, -67852, 87665, 264669, 28714]
17728A36321R1107k4103q7893A2415a92881C4613c6495F8936a07196A27912a43386
17716c48877C97980a31225B360K01765m4173H466f3117A66404J8583d5343g434
17704A20881J15381A12063L32785A08880D3204a66641A44551Q3029a72234a9488
17693A02585C836L08240A00415a25816A65611J30122j6290I1546B1724a08575
17682a5253G7717a59138B98892j32095J61555A45303F6604K56415A3616J78068
17672A91684Q7467m7295G2783K150j856b34068A06507f4930A36597D3304J09608
17661A52912d2205G6040l1103M5863K13521a7042B60921j11351m7527i543k43897
17650b53440A65222B2286R4689J10665O0210j25087a57494A38850a66886g5568
$$ y = [136321, 227428, 203325, 115432, 12415, -192881, 34613, -36495, 68936, -107196, 127912, -143386, -348877, 397980, -131225, 2360, 204125, 159952, 8466, -63117, 166404, 184987, -45343, -7434, 120881, 236262, 112063, 444848, 108880, 43204, -166641, 144551, 227580, -172234, -19488, 102585, 3836, 312076, 100415, -125816, 165611, 295733, 279443, 91546, 21724, -108575, -15253, 77717, -159138, 298892, 166797, 328352, 145303, 66604, 323019, 13616, 191684, 279151, 231856, 72783, 74933, 73077, -234068, 106507, -64930, 136597, 43304, 152912, -42205, 76040, 44937, 90800, 304321, -17042, 260921, 149570, 102043, -9543, -253440, 165222, 22286, 116975, 227640, 287850, 162763, -157494, 138850, -166886, -75568]
17639a1902k22750A36691a20409p4035A94724b63067L7417D47331a27796A7368
17628A33251D5816J20663L9411j9289n4284m8066c12670A92914A1805O0796O73
17617G3274r995O1924m8190h408F2063b79060A14349B5528Q6122J7963n5033R1507
17605A66087Q066e945E32832E5034B7000a64554e9073B81764D3387i5576B06417
17593a70872B91999p9941J49223G279L29735A24212D5852M1717D0519J29561b69117
17581A48714F1407h5124m7840c4030A7981L35768J76422F5817J63690l532P5095
17570C01070A23414b14576A59796l4942N2926f1605E4250i8924A55498J28487
17560B83985j38964P7337q2572g9834j09018A92288M1976E3393f601A50343n2025
$$ y = [-11902, -234652, 136691, -120409, -194444, 194724, -263067, -225650, 447331, -127796, 17368, 133251, 45816, 166479, 205890, 186601, 132317, 84251, -312670, 192914, 11805, 72601, 73274, 63279, 125203, 77013, -8408, 62063, -279060, 114349, 25528, 111650, 129613, 74580, 166087, 174153, -5945, 532832, 55034, 27000, -164554, -59073, 281764, 43387, -95576, 206417, -170872, 291999, 212058, 361281, 7279, 337014, 124212, 45852, 87569, 40519, 170080, -269117, 148714, 61407, -85124, -132964, -34030, 17981, 353749, 530171, 65817, 229507, 225975, 301070, 123414, -214576, 159796, 124854, 177780, -61605, 54250, -98924, 155498, 283985, 145021, 222358, 139786, -79834, -188852, 192288, 234264, 53393, -6601, 150343, 98318]
17549I8318l9636J64815K52161B09752L66141A82187a28933C10056k3986H0765
17538B27K95190a07334A21238A8054e6589C66866A22287K00269j40613M22489
17528F04432B41476A01312c1077A75657K95123j54626n5897J64216P748j05760
17518C26461H8437b7566H4899J63057K80948o5788J86799k96297K51256L21420
17508I26294j25215j42256K03012Q6728l02419A99370o4478M72200m6371A82524
17497A52518M32056j75738K35486J65473n2976Q9032j23459R0080l06505J59438
17487F65405k99942r4502L11312B72075K5676F9776M1160r270J3069J52736j31577
17476A35894P06724B11776K52743p0042k6549J54580A91579J65405J13711A55573
$$ y = [98318, 58682, 223497, 475658, 209752, 575893, 182187, -128933, 310056, 286070, 80765, 227, 295417, -107334, 121238, 18054, -56589, 366866, 122287, 322556, 181943, 604432, 241476, 101312, -31077, 175657, 470780, 316154, 260257, 424473, 432221, 326461, 88437, -27566, 84899, 247956, 528904, 463116, 649915, 353618, 604874, 926294, 801079, 658823, 861835, 948563, 646144, 199370, 134892, 607092, 560721, 182524, 152518, 584574, 408836, 644322, 809795, 756819, 845851, 722392, 812472, 505967, 665405, 365463, 270961, 582273, 272075, 297751, 69776, 110936, 101666, 114735, 267471, 135894, 842618, 211776, 464519, 394477, 367928, 522508, 191579, 356984, 470695, 155573]
17465B23269a73470A45061J32165a62170B71306K10948A3268M5908L18277n9260
17455C18193A03546O91L34059m3378n1410j23869k5640K51570A97115j6463N6307
17444B36959K12865e9476J9321D0468O4711d0126C03338o9767O4257J53654A70959
17432A83722K18463J01821j13889A59332J43676r7042k3902q988J23563M36464
17422G33103e6645E5440N93003k76572n9108r6346F6924M14237R1539o0969B22742
17410C37818B9716L03375M01795k79286k26596K00352L2641A16109M77646j14707
17400D79048A31865M32501B03871o6010K13647J17750b18207C89779j70592J34197
17390C53384q4933k8243L8093l9445M301A0470M26934p9720K4983b34131A60140
$$ y = [223269, -173470, 145061, 277226, -162170, 271306, 482254, 13268, 59176, 377453, 318193, 103546, 104237, 438296, 394918, 343508, 219639, 193999, 445569, 197115, 180652, 236959, 449824, -59476, -40155, 40468, 105179, -40126, 303338, 233571, 297828, 451482, 170959, 183722, 402185, 504006, 390117, 159332, 303008, 205966, 182064, 173076, 296639, 733103, -56645, 55440, 648443, 371871, 312763, 216417, 66924, 481161, 572700, 511731, 222742, 337818, 29716, 333091, 734886, 455600, 229004, 429356, 461997, 116109, 593755, 479048, 131865, 564366, 203871, 137861, 351508, 469258, -218207, 389779, 219187, 353384, 268451, 240208, 278301, 238856, 243157, 10470, 437404, 357684, 382667, -234131, 160140]
17378C17113L3653q0990n1868I0029Q2197Q2825E8861K73936A345K40877Q4160
17367C26382j20153q987h7180I6127j091J1031J74882E5247K77787j30722J6443
17356B18755K58650Q7914H0882P6231K29507j57987g0142B50526G6321i359D46026
17344A68761R6132H6548J00002Q3730H4843M77926b1188j16942C10606a20177
17333A60392J26686p92Q2377j05211n4958J06302B0134J55243a6925B63573Q8652
17322C52225C2201K71731J00053J71072D1768L60841j63677J34295H4394L76012
17312D60406A65973K32081H5512O1896E2205p540J57914j71M2965A06301K38298
17301C44599D5849L31966f4701C62788l1801G5312P8693D3684a03669B07901O4661
$$ y = [317113, 350766, 269776, 217908, 90029, 172226, 255051, 58861, 332797, 1345, 242222, 326382, 206229, 197242, -87180, 96127, 95036, 106067, 280949, 55247, 333034, 202312, 218755, 477405, 565319, 80882, 157113, 386620, 228633, -70142, 250526, 76321, -9359, 446026, 168761, 264893, 86548, 186550, 270280, 84843, 562769, -21188, -138130, 310606, -120177, 160392, 287078, 286286, 368663, 263452, 208494, 314796, 20134, 175377, -16925, 263573, 352225, 32201, 303932, 403985, 575057, 41768, 402609, 238932, 373227, 84394, 460406, 165973, 398054, 85512, 147408, 52205, 44665, 202579, 202408, 245373, 106301, 344599, 45849, 377815, -64701, 362788, 330987, 75312, 154005, 43684, -103669, 207901, 272562]
17290B72562L6812N1391H7172J33046A01331M48541o6277R0860k66626A25968
17279C30869H8800j0580j7993K27787j08829O7844K45021E0052J91493E9915a8879
17267B80989i5275B79136n3847J66895A36511h0407E64888k19158N7983j5707
17257C88006A29619J79575I9986L78228c98520C77660o9578I0789L39170f51D27094
17245A49727M00952k30030j23772A7040N89559B76873e7279D62506k23461L3877
17235B72922K3451j16005M0330k4742o9790D4529N2784M2270L18407I0909L14082
17224D04991j73019K53670j82181j16627J30711A36226J13414q126M0631J95677
17214D77822j97958m205G5479K09352j18750m4759J33972K09648j56661L39455
$$ y = [272562, 309374, 360765, 87172, 220218, 101331, 549872, 483595, 574455, 307829, 125968, 330869, 88800, 78220, 60227, 288014, 179185, 247029, 492050, 50052, 241545, 59915, -18879, 280989, -95275, 279136, 225289, 392184, 136511, -80407, 564888, 345730, 403713, 388006, 129619, 309194, 99986, 478214, -398520, 377660, 308082, 90789, 429959, -651, 427094, 149727, 550679, 320649, 196877, 17040, 606599, 276873, -57279, 462506, 239045, 272922, 296373, 180368, 220698, 195956, 126166, 44529, 97313, 139583, 457990, 90909, 404991, 231972, 485642, 303461, 186834, 317545, 136226, 249640, 241514, 282145, 477822, 279864, 275659, 75479, 284831, 166081, 121322, 255294, 464942, 308281, 647736]
17204F47736k74133J81863r1380B26826K62742O3026B22318K39833L29425A85263
17193E05099o9443K30048B0396L43987d9574A07973l8993M00540p1249K95640
17183F93911e5241C98219L2949j41137J22054J39483m6538N5291J29996l08068
17173C82249M21513C75858n380K407P5789m5305k3291J54458K03382A85218L20076
17162E05294J35347j65365o748P5840A82067O19668C18405A10077L39066N3941
17152E03084B04286K32584J9459K81962l53816k7585j9326L07394G6995M10560
17142D87555I7256K93177J05575J76954j62151o6768P3076J43832B16556J59960
17132C76516K08186m4480j48967K44424o0910k54041K09422k51619k8858j06467
$$ y = [647736, 373603, 555466, 464086, 226826, 489568, 552594, 222318, 462151, 791576, 185263, 505099, 435656, 665704, 20396, 364383, -49574, 107973, 68980, 469520, 398271, 693911, -55241, 398219, 431168, 290031, 412085, 551568, 505030, 560321, 690317, 382249, 803762, 375858, 370478, 372885, 448674, 403369, 380078, 534536, 737918, 185218, 505294, 640641, 475276, 468528, 544368, 182067, 801735, 318405, 110077, 449143, 503084, 204286, 436870, 456329, 738291, 384475, 356890, 337564, 644958, 76995, 487555, 97256, 390433, 496008, 672962, 510811, 444043, 517119, 660951, 216556, 376516, 584702, 540222, 391255, 635679, 574769, 320728, 530150, 278531, 249673, 143206]
17122A43206J47160L03339k94978K47619A82301O19344C23793J96133q6267j03972
17112C29687L81403C47044O2339r8101L37558k62076o2491M07155l43885j27435
17102B60108K76758k23708K11811n8499K24481J58742k74018B44028L26864J86967
17092G57859p7953j11262K2600J57338M3166l00338K14115j30153J78645n1030
17082G02987r3786J99784k47889j54487Q7242L47982j47465j52791Q356J5886
17072E65819K13948j21054q0632k0679J41356N165J03829L428k13963r6844L52814
17061H53187j75182L8130k55420M19286j36582l01626O9607L74542k51589j59419
17051D74934L12185k87645M6541o333J40585j90669K97545o713k0586J18357j96285
$$ y = [143206, 290366, 593705, 298727, 546346, 182301, 801645, 323793, 519926, 433659, 329687, 711090, 347044, 409383, 311282, 648840, 386764, 324273, 731428, 387543, 260108, 536866, 313158, 524969, 466470, 690951, 849693, 575675, 244028, 570892, 757859, 679906, 568644, 591244, 748582, 791748, 491410, 705525, 575372, 754017, 702987, 609201, 808985, 561096, 406609, 493851, 841833, 694368, 541577, 549933, 565819, 779767, 658713, 578081, 557402, 698758, 703923, 807752, 811180, 597217, 500373, 853187, 678005, 716135, 460715, 880001, 743419, 441793, 511400, 885942, 634353, 474934, 787119, 499474, 546015, 539682, 680267, 489598, 787143, 780430, 759844, 878201, 681916]
17040F81916Q023m8171J84218q1868J55229o5883R2108J14058k37305j44083K05321
17029H63563j99637j9149J19435J36048k25688J22275j49887L71858K0235q2993
17019I56060k11117O3536J04012j78653j03129M05409j90613n3440l3022J98182
17009I57225J18688n36566L93719l9814K49748j93709k56948M28202L2842k32782
16999I20605J200Q5645k35438L84982r1360Q0100E03624L52078J01241O1672L09566
16988A328181l03677j5749K85029M4350o26414N28754j34007j24035j9887J04682
16978A067227J66382l24962L2961R6809K42960r2576r2383J35182l16432O54115
16968A569283j60640p6227L94613k60050j34953k73739K87047k0927R6531K1387
$$ y = [681916, 689939, 641768, 825986, 744118, 899347, 833464, 925572, 1039630, 802325, 658242, 863563, 663926, 644777, 764212, 900260, 674572, 796847, 646960, 1018818, 1039053, 956060, 744943, 808479, 912491, 733838, 630709, 1036118, 845505, 792065, 759043, 957225, 1075913, 539347, 933066, 893252, 1143000, 949291, 692343, 1120545, 1153387, 920605, 921805, 1007450, 772012, 1156994, 1065634, 1145734, 503624, 855702, 956943, 1018615, 1328181, 1024504, 1008755, 1293784, 1338134, 711720, 1240474, 1106467, 982432, 962545, 1067227, 1233609, 908647, 941608, 1038417, 1281377, 1188801, 1096418, 1231600, 915168, 1569283, 1408643, 1332416, 1727029, 1466979, 1332026, 1058287, 1345334, 1324407, 1420938, 1442325]
16958A442325k02409r4745N19252k71571M1455k27510P4163K11302j01122j20607
16948A270533K11472j93934M30387l69109j13888K80985N8234q9380J91981M4477
16938A721758j34078o4364j40178N8622K2171K00935K8325k29325K75695Q321
16928A747882n8487J72845n64355M27330k9259J52021j53421J753O7226L1027
16918A794562J03441N7970k55517j6316L26424l58261J93565L19363K6557n25521
16908A666267M97362k89515K0763J04618J92732M9845j27463o4579L63745k66328
16898B147447N1142J55939J05520o7705m07243N50789m60481L20295j5046J24850
16888B505507J999k07309K27668J16768J48470k97531j63062M40881m3560l76235
$$ y = [1442325, 1239916, 1145171, 1664423, 1392852, 1434307, 1206797, 1280960, 1492262, 1391140, 1270533, 1482005, 1288071, 1718458, 1349349, 1235461, 1516446, 1574680, 1485300, 1677281, 1721758, 1587680, 1523316, 1383138, 1441760, 1463931, 1664866, 1693191, 1463866, 1739561, 1747882, 1689395, 1862240, 1297885, 1725215, 1695956, 1847977, 1694556, 1696309, 1763535, 1794562, 1898003, 1955973, 1700456, 1684140, 2010564, 1652303, 1845868, 2165231, 2191788, 1666267, 2163629, 1874114, 1894877, 1999495, 2192227, 2242072, 2114609, 2050030, 2413775, 2147447, 2198589, 2354528, 2460048, 2392343, 1985100, 2535889, 2075408, 2395703, 2380657, 2505507, 2507506, 2300197, 2527865, 2644633, 2793103, 2495572, 2332510, 2773391, 2729831, 2353596]
16878B353596P26969m56908K77827j40713j65003K73640k45784J89143Q4347M27783
16868C324897j38600o06379M96619K14507p5680j98173M10749J79865r9065m88508
16858C020232K71175L19609N4420j12512q303J09414m8809K57747j09140j38381
16848C615452N76151m99579L84034J95839j53560K35886p2551J6438M9750K24099
16838D571959l8852m3538Q064j49286N17242P4868M6391l57350K11630O43904
16828E485032j79636j67667J57090Q5273O0610J72848M39909k35769J10424J02740
16818F030854K11044j50072L28585J98229m0378k0143J39097J99521J81851r304
16808G069284K62983k12693N11801K62775K16388r4902J44604L26160R3646J18773
$$ y = [2353596, 3080565, 2623657, 2901484, 2760771, 2595768, 2869408, 2623624, 2812767, 2897114, 3324897, 3186297, 2579918, 3076537, 3291044, 3215364, 3017191, 3427940, 3607805, 3508740, 3020232, 3291407, 3611016, 3665436, 3552924, 3544621, 3654035, 3605226, 3862973, 3753833, 3615452, 4191603, 3692024, 4076058, 4271897, 4118337, 4354223, 4281672, 4298110, 4347860, 4571959, 4533107, 4489569, 4497633, 4348347, 4865589, 4940457, 4986848, 4629498, 4841128, 5485032, 5305396, 5137729, 5294819, 5380092, 5440702, 5613550, 6053459, 5817690, 5928114, 6030854, 6241898, 6091826, 6420411, 6618640, 6578262, 6558119, 6697216, 6896737, 7078588, 7069284, 7332267, 7119574, 7631375, 7894150, 8110538, 8015636, 8160240, 8486400, 8580046, 8698819]
16798H698819K51496m6590L80985J58926L17754O8584L58303K74649J86976n8770
16788A0591132N86883N4739K17397M96787J33409L31825M35067J74062K17079
16779A3238380M83267J73995K36049O48120M19148N56551N29010K02121L59677
16770A6846318P54374L23605N07654O14986P68855K71776O00901P76228N81032
16761B2045729Q55718L86915Q83706M70974Q63714Q67842J099689Q42442J112831
16752B9429560Q08234J156947J138965J497337O77557J404167J355961J545831
16744C9014559J207408J805478J704327J663172J593549K059652K304126J835429
16736E3187700K166660K302510K993643K357805K833320K710363K948446L419683
$$ y = [8698819, 8950315, 8903725, 9284710, 9443636, 9761390, 9829974, 10188277, 10462926, 10649902, 10591132, 11178015, 11232754, 11450151, 11946938, 12080347, 12412172, 12847239, 13021301, 13238380, 13721647, 13895642, 14131691, 14779811, 15198959, 15755510, 16284520, 16486641, 16846318, 17600692, 17924297, 18431951, 19046937, 19815792, 20087568, 20688469, 21464697, 22045729, 22901447, 23288362, 24172068, 24643042, 25506756, 26374598, 27474287, 28316729, 29429560, 30237794, 31394741, 32533706, 34031043, 34708600, 36112767, 37468728, 39014559, 40221967, 42027445, 43731772, 45394944, 46988493, 49048145, 51352271, 53187700, 55354360, 57656870, 60650513, 63008318, 65841638, 68552001, 71500447, 74920130]
16728G4920130K579588L740021L311358L405125L969876L300695M182212L625002
16720A03034007L736870M358205L755141L573197L710710L985331K998742L339354
16712A32491557K654832K983758K151679J920625J283735J083441L32528L39051
16704A45241206q26905n77396j557635k025305k275745k787683k775547l053009
16696A29361981l931772l497039l634522m063528l584129m626851l392758m012932
16688I8618450m037216l195763m258281l279280l745110k866874l490576k971962
16680G0773388l220735k800141k691559k579784k367197k470586k022151k426217
16672E0195018j755496k031522j823439j908002j258491j967913j722574q92845
$$ y = [74920130, 77499718, 81239739, 84551097, 87956222, 91926098, 95226793, 99409005, 103034007, 106770877, 111129082, 114884223, 118457420, 122168130, 126153461, 129152203, 132491557, 135146389, 138130147, 140281826, 142202451, 143486186, 144569627, 144902155, 145241206, 144414301, 143836905, 142279270, 140253965, 137978220, 135190537, 132414990, 129361981, 125430209, 121933170, 118298648, 114235120, 110650991, 106024140, 102631382, 98618450, 94581234, 91385471, 87127190, 83847910, 80102800, 77235926, 73745350, 70773388, 67552653, 64752512, 62060953, 59481169, 57113972, 54643386, 52621235, 50195018, 48439522, 46408000, 44584561, 42676559, 41418068, 39450155, 37727581, 36834736]
16664C6834736j751532j088713j639950q60614j197965j013758j128216l89970
16656B7764018j129168j374502n76099n24916q11927j089781l96116o89205r56924
16647B0215380j51945q41916o26567l57007m96423o76227k34118o48075l97180
16638A5785922j07246n05783m33910m46760l84191o86567m33130j94054j26592
16629A2467689k16505m37668k57228k1250n95991k60143K20599m15225l86763
16620A0097515k85412K65021p78289j21245j72074J43185n77763n7172k08174
16611H305592M6700p8782m76619Q7991j26079l47984k19637k46930q0346K26134
16601G090040m72372J73338n2009k88685l97889p319L71k16177M5894K10060l55689
$$ y = [36834736, 35083204, 33994491, 32354541, 31493927, 30295962, 29282204, 28153988, 27764018, 26634850, 25260348, 24684249, 24159333, 23347406, 22257625, 21861509, 21172304, 20215380, 20063435, 19221519, 18594952, 18237945, 17741522, 17065295, 16831177, 16183102, 15785922, 15678676, 15172893, 14738983, 14292223, 13908032, 13221465, 12788335, 12594281, 12467689, 12251184, 11813516, 11556288, 11535038, 10939047, 10678904, 10899503, 10484278, 10097515, 9812103, 10077124, 9298835, 9177590, 9005516, 9148701, 8570938, 8513766, 8305592, 8352292, 8273510, 7796891, 7884882, 7758803, 7410819, 7191182, 6944252, 6863906, 7090040, 6617668, 6791006, 6738997, 6450312, 6052423, 6045104, 6045475, 5829298, 5875192, 6085252, 5729563]
16590E729563J89761m15687J31455k40459m63394J19807J66759j95266n486l84964
16580D632089k60698L00099K72304l07958l84998O3245j30255M9697O966j07143
16570D133348p707J15196j68649j35067m0489j48963J4989M1368j42991l2903
16560C628132j64659m8415l02620M81076l10263k0095J95539k00592J99518l75419
16550C082202M4137k32774N0253J9166K85949o5812l90547Q6869K697p084k67765
16539B607291L93014l94198K37004j72845n1626j29111K1615l6391k04142J4873
16529B285484R1514j02584K04640k57979o593K11686j9041J07552n05766l2408
16519A976505K38060j43421O8692P4223j17918K12557k15764P8213m1577k85025
$$ y = [5729563, 5919324, 5503637, 5635092, 5394633, 4931239, 5051046, 5217805, 5022539, 5017053, 4632089, 4371391, 4671490, 4943794, 4635836, 4250838, 4314083, 4183828, 4233525, 4240491, 4133348, 4125641, 4240837, 4072188, 3937121, 3896632, 3747669, 3762658, 3804026, 3661035, 3628132, 3463473, 3415058, 3112438, 3593514, 3283251, 3263156, 3458695, 3258103, 3457621, 3082202, 3126339, 2893565, 2943818, 2962984, 3248933, 3183121, 2792574, 2879443, 2882140, 2875056, 2607291, 3000305, 2606107, 2843111, 2670266, 2618640, 2489529, 2511144, 2474753, 2270611, 2285484, 2376998, 2274414, 2479054, 2221075, 2214482, 2426168, 2407127, 2514679, 2008913, 1976505, 2214565, 2071144, 2139836, 2214059, 2096141, 2308698, 2092934, 2171147, 2129570, 1844545]
16509A844545M57286k50135k43510M07907k14146N4716Q8810k07128K77623k41041
16499A974927r9505O4545l81505O0219j05431K75525j72083M79867k94330j55790
16489A646439j27186j4603J80349j12437j51247j05779L88499k50945M9812L01864
16479A804766k71867k40946M57140m55039j3393K66512p393p5758k5747j54657
16469A283618K2697J67020l76510M77745j72968L438j34130J3224j22730M70669
16459A632073l85852l32131M86733P2586j46916J0509j58191n5630L72227o01810
16449H93598K57026Q1221k42649O05683k20848m89792q2318k7035N23958k47580
16439A051264K23907k20948j37240J44478K95527l56571q6762K93472o5933j60541
$$ y = [1844545, 2301831, 2051696, 1808186, 2216093, 2001947, 2056663, 2145473, 1938345, 2215968, 1974927, 1875422, 1939967, 1558462, 1618681, 1513250, 1788775, 1616692, 2096559, 1802229, 1646439, 1519253, 1504650, 1684999, 1572562, 1421315, 1315536, 1704035, 1453090, 1502902, 1804766, 1532899, 1291953, 1749093, 1294054, 1280661, 1547173, 1539780, 1464022, 1438275, 1283618, 1306315, 1473335, 1096825, 1574570, 1401602, 1405040, 1270910, 1284134, 1161404, 1632073, 1246221, 914090, 1400823, 1473409, 1326493, 1337002, 1178811, 1123181, 1495408, 893598, 1150624, 1231845, 989196, 1594879, 1374031, 884239, 801921, 774886, 1298844, 1051264, 1275171, 1054223, 916983, 1061461, 1356988, 1000417, 913655, 1207127, 1141194, 980653]
16429I80653m1376K65265j29464k59247M63480l91085J59600k74277o7551L41462
16419A047460J74507l09193o9110j54882J04519k12913J49411L05722k4686k34443
16409G76392l0390K1539L6371n0990K050L7133L3600J75603k79583N13434j87982
16398A047177k7411q7038M02727n67047q4324O3720P1845K73308l45473p7522
16388F69962J59808l26265M7859L78220r0536j03707L04959l99663J08064K03505
16378I52206j03983l36860K00222j06676n8832L78002l85699K3161j7752r9266
16368D44523K97987j21169q1642Q0590j88287L35206j89749N3814j37960N10512
16358A003825l94300L15482J9523l71282J32756k3259n7510L1302J31444l12786
$$ y = [980653, 939277, 1204542, 1075078, 815831, 1279311, 888226, 1047826, 773549, 705998, 1047460, 1221967, 912774, 843664, 688782, 793301, 580388, 729799, 1035521, 1010835, 776392, 746002, 767541, 803912, 752922, 754972, 792105, 825705, 1001308, 721725, 1235159, 1047177, 1019766, 932728, 1335455, 768408, 684084, 747804, 819649, 1092957, 747484, 669962, 829770, 503505, 551364, 929584, 839048, 735341, 1040300, 640637, 748701, 952206, 848223, 511363, 711585, 604909, 546077, 924079, 538380, 561541, 543789, 444523, 742510, 621341, 539699, 620289, 432002, 767208, 577459, 631273, 493313, 1003825, 609525, 925007, 944530, 573248, 706004, 682745, 625235, 656537, 787981, 475195]
16348D75195J43736j62425P555K57089j60105k12180K26604J47871j3577m7407
16338F62356K08142B31200L52352K72516k22256k15725n419K09145j999q2073
16328E37741J70399j20050J92519j54434j18844l6027M01324C72932K25339p3734
16318E24537J89997k33405j66558J98607P8221J719J10712j63670J38646j14890
16308E63916m9396L35564j208m04940p6709l8084N20486j88699j71226P6764K75355
16297H41823C67690J09113J51849j16303l291R8220j48680J13256j71131O7292
16287D68015K51840k7963J35963l81885m8335m1676J55065j48167j41025M04688
16277F26520K9317j56487m9720o50a0136C99111A89546K50189Q6905J1292K00288
$$ y = [475195, 618931, 456506, 464061, 721150, 561045, 348865, 575469, 723340, 709763, 662356, 870498, 231200, 583552, 856068, 633812, 418087, 412668, 621813, 619814, 537741, 708140, 588090, 780609, 626175, 507331, 471304, 872628, 372932, 598271, 524537, 714534, 481129, 314571, 513178, 591399, 593118, 703830, 540160, 678806, 563916, 514520, 850084, 848876, 443936, 367227, 329143, 849629, 660930, 489704, 566468, 841823, 367690, 476803, 628652, 512349, 509058, 607278, 458598, 571854, 400723, 468015, 719855, 691892, 827855, 445970, 397635, 355959, 511024, 362857, 221832, 626520, 655837, 499350, 449630, 448980, -10136, 399111, 189546, 439735, 526640, 537932, 738220]
16266G38220e0426K4031C19775L12897k4671B48878J72241R4225L7819j55989
16256C97174a5848D16378Q1421k10562c1135D35343f284B49880J51563A49765
16245D91079j35136R4721B05808I6677L28116L6325L55500B84504A12552J75413
16235B87965A20516J87090j35938K13470A30354M2419J58937n8346L47475k17186
16225D03653A3032J69170J04013a09865B12325J50105A47544l1608L4676J21548
16215B72160J10616d2904E60715k64063p9726M06095G7573J91498Q1808J37007
16205D87886j35209p9350K02077j45436J13458J15444j6417A82052B4722N51109
16195E75831A34262K82495O2766K37816F7249K63773M0968J97653k71781j32364
$$ y = [738220, -50426, -26395, 319775, 632672, 608001, 248878, 421119, 515344, 553163, 397174, -15848, 416378, 497799, 287237, -31135, 435343, -6284, 249880, 401443, 149765, 491079, 355943, 450664, 205808, 96677, 424793, 461118, 816618, 284504, 112552, 287965, 120516, 307606, 171668, 385138, 130354, 172773, 331710, 273364, 620839, 403653, 13032, 182202, 286215, -109865, 212325, 362430, 147544, 115936, 150612, 272160, 382776, -42904, 560715, 296652, 216926, 623021, 77573, 269071, 350879, 487886, 352677, 273327, 475404, 329968, 443426, 558870, 542453, 182052, 24722, 575831, 134262, 416757, 479523, 717339, 67249, 331022, 371990, 569643, 297862, 165498]
16185A65498P0247J74727P4153j54149J74796A48959L1010j6234M8229a24753
16174C70499A02156P9805B9521J47475J97444n7583j26934a20531b2906B19417
16163A23697J61308J87327o8257J06396A06500O1378L2820k4617l3940M7466J94110
16152C83717j76482L75836B18114F1018O14561h8024B23099q2950M5186D2933
16141B38976p167J0041l9517L9676P1659c6478F44318A50110J68886a05418C51749
16129A64709L2624j0345h6127D08101j9407j80760E2954J39831J24141K5578a37017
16117H1544K0585b61481H160L92269j03380o7982B6681K09683j07590m9592O9156
16106A48338j8682l9516h5299B51442I9190K11003a8098A08105N8660G9351K86635
$$ y = [165498, 235745, 410472, 484625, 330476, 505272, 148959, 179969, 163735, 211964, -124753, 370499, 102156, 181961, 29521, 176996, 374440, 316857, 189923, -120531, -22906, 219417, 123697, 285005, 472332, 404075, 510471, 106500, 167878, 200698, 176081, 142141, 189607, 383717, 207235, 583071, 218114, 61018, 675579, -88024, 223099, 140149, 185335, 42933, 238976, 231809, 241850, 202333, 242009, 313668, -36478, 644318, 150110, 318996, -105418, 351749, 164709, 197333, 186988, -86127, 408101, 388694, 207934, 52954, 192785, 316926, 342504, -137017, 81544, 102129, -261481, 8160, 400429, 297049, 229067, 26681, 236364, 128774, 79182, 148338, 129656, 90140, -85299, 251442, 99190, 310193, -18098, 108105, 166765, 79351, 365986]
16095C65986A42355J69356q7455E7825O8196j7751J13743E2504J02451B9193M9256
16084G8449a2463B43854o4400q4819b5778k68436A88001a73219B10438l3115p6522
16073A00801D7375D798M2404L6569J11207F2390d8665B67704a12251A03722g1574
16061a52728R214c3552l551A25990c01555A85156F3459P6909a64580B26088j01641
16050A24447b410C74816I6699P8573c87977A9701R4140b594A31324f5018C36615
16038d9628B41137o2693a39471c1172l3276A38026D9683a10585H8127j0035a74863
16026I3283C2840d6246A74575d22309a9729B21501a34087C0503g6312R391A82530
16014B06624c42604C035J48822c2263j31224I4L1981a178A06305a35521B89132
$$ y = [365986, 142355, 311711, 224256, 57825, 126021, 108270, 222013, 52504, 154955, 29193, 78449, -12463, 243854, 179454, 94635, -25778, -294214, 188001, -173219, 210438, 177323, 100801, 47375, 4798, 47202, 83771, 194978, 62390, -48665, 267704, -112251, 103722, -71574, -152728, -143514, -33552, -37103, 125990, -301555, 185156, 63459, 140368, -164580, 226088, 124447, -2410, 374816, 96699, 175272, -387977, 19701, 113841, -2594, 131324, -65018, 336615, -49628, 241137, 178444, -139471, -31172, -64448, 138026, 49683, -110585, 88127, 78092, -174863, 93283, 32840, -46246, 174575, -422309, -19729, 221501, -134087, 30503, -76312, -66921, 182530, 206624, -342604, 3035, 151857, -32263, -163487, 94, 32075, -1178, 106305, -135521, 289132]
16002c40804A29512j0597M2016B0010h3387o4316j5935c1558H7744K59283a8780
15990I0655J57800A8760a38667A57104J621j2165n6830J5887a06615H6969J21
15979H7090B3912J17800N0176b6135D10815b2874E56599B45763O76521k90157
15969F32127K69750k72015k36353J41420k28917K0529a81988L3987A96315a86622
15958B79622C417J2583O1977a7346q0623R290o8929A18337e340k50447M4230A17080
15945f8528A72430p2066B9334F962K53973a29926A8830J18255f1868J2113C35245
15933B59375D3971a21873j12719G1472b62452A10255b66749A43123c45741B2980
15922A28655F386a98337C8070a17762B56910A21334a38907m4171f6121k75069
$$ y = [-340804, 129512, 118915, 160931, 20010, -83387, -147703, -163638, -31558, 87744, 347027, -18780, 90655, 248455, 18760, -138667, 157104, 158725, 146560, 89730, 105617, -106615, 86969, 87090, 23912, 141712, 191888, -26135, 410815, -22874, 556599, 245763, 922284, 632127, 901877, 629862, 393509, 534929, 306012, 326541, -181988, -148001, 196315, -186622, 279622, 3417, 16000, 77977, -17346, -97969, -88679, -157608, 118337, -5340, -255787, -211557, 117080, -68528, 172430, 100364, 29334, 6962, 260935, -129926, 18830, 137085, -61868, -49755, 335245, 259375, 43971, -121873, -234592, 71472, -262452, 110255, -266749, 143123, -345741, 22980, 128655, 6386, -198337, 38070, -117762, 256910, 121334, -138907, -183078, -66121, -341190]
15912c41190J61442D8839K82720I5765q34j4554Q1721a41522A72762b25855R6536
15901a29319E6946J89230i3624A59719J17766j6935a35396B6713b1656k67755
15891b89411a23029a8670j90994A01146a61318O0587k42785E8326J39159c43096
15880A62999a64145d2179A07249c6573B41587b92047E465f587H8516b64229i1137
15868b07065e3231D54023h8340B20387a19051A29145c4623k30618H4458c03045
15857b07479M4873I1491a4550l46851F7042b24349J11013l6131r6314C690N7363
15846F1053b9842B57525P548I8334c44484J38047C1812L3718K0211g2672D0034
15834A30550h1520G6372e9491P408D7115f7710A12746a65432A66698K23468a36346
$$ y = [-341190, -179748, 48839, 331559, 95765, 94931, 80377, 162098, -141522, 172762, -225855, -129319, 56946, 246176, -93624, 159719, 277485, 260550, -135396, 26713, -21656, -289411, -123029, -18670, -209664, 101146, -161318, -100731, -343516, 58326, 197485, -343096, 162999, -164145, -42179, 107249, -36573, 241587, -292047, 5465, -6587, 88516, -264229, -91137, -207065, -53231, 454023, -88340, 220387, -119051, 129145, -34623, -265241, 84458, -303045, -207479, -162606, 91491, -14550, -361401, 67042, -224349, -113336, -149467, -245781, 3690, 61053, -29842, 257525, 265073, 98334, -344484, -206437, 31812, 65530, 85741, -72672, 40034, 130550, -81520, 76372, -59491, -52083, 47115, -67710, 112746, -165432, 166698, 390166, -136346]
15822B43845b24152K4249H0480g397A94023l5129i0889C0332c6849B8678e8332
15810a20811E1129b96116F9012a56129k31068J70669N2017E3643P9194I885P0043
15799G9928b69123A2213i8078J4791j84646A0578d0878D933J37588j2890a39763
15787e4842A30683m8215h7925A57231a56716l4239B2713a22083C7978J69595h3365
15775g1868n755b3446A28068f8376l21976a00440k46569e4893B808L1127c56121
15763A05026b3595A13273e1461j31530k3395e9130E74N1439a55981o8729p5651
15752c00361e4749k23813H3106k4387f9053K7577j93185A3477b31386A32767m7715
15741H5052K17615a16869A14177b88726f7009A05775A3670j385Q9609M9546F9381
$$ y = [243845, -224152, -199903, 80480, -7397, 194023, 158894, -90889, 30332, -36849, 28678, -58332, -120811, 51129, -296116, 69012, -156129, -387197, -216528, -164511, 53643, 132837, 9885, 79928, -269123, 12213, -98078, -83287, -267933, 10578, -40878, 4933, 142521, 129631, -139763, -54842, 130683, 82468, -87925, 157231, -156716, -190955, 22713, -122083, 37978, 207573, -83365, -71868, -77623, -23446, 128068, -68376, -390352, -100440, -347009, -54893, 2808, 33935, -356121, 105026, -23595, 113273, -51461, -182991, -206386, -59130, 574, 52013, -155981, -224710, -300361, -54749, -278562, 83106, 58719, -69053, -41476, -234661, 13477, -231386, 132767, 85052, 302667, -116869, 114177, -288726, -67009, 105775, 13670, 12285, 101894, 151440, 69381]
15729E0573a9498A35043J968l0222j7247a34189L7481q0936A48911c08437J46088
15718a62349B82786a73206B56427Q850q6338a71562j34361a52877j11474f0869
15707f4691J7866E6026a67576A62199o1141a98636e1208q5985a917A750K05420
15696B07170b46374k64788C66694d12286F90575A3025c015j29495n8202A85285
15685i4760f025j99587g195m74820d7669j24204k8722P6556K921A35902C327J78385
15673A81712K9338K8560j12206b67412F3609K74588b53466h6055k89868D59863
15662h1836E3218J83217b03049M745a100j9442l17426A10437m7126L93394A67161
15650f698o8425i258p3521o091J6092m5547q656C34067j60453M0437O5005a91286
$$ y = [50573, -19498, 135043, 137011, 106789, 89542, -134189, -96708, -177644, 148911, -308437, -162349, 282786, -173206, 256427, 265277, 178939, -171562, -305923, -152877, -264351, -60869, -64691, -46825, 56026, -167576, 162199, 101058, -198636, -51208, -137193, -1917, 1750, 207170, -246374, -511162, 366694, -412286, 690575, 13025, -3015, -132510, -190712, 185285, -94760, -6025, -205612, -7195, -482015, -47669, -171873, -200595, -124039, -121118, 135902, 3327, 181712, 211050, 239610, 127404, -267412, 63609, 338197, -253466, -86055, -375923, 459863, -81836, 53218, 236435, -203049, -198304, -1100, -20542, -337968, 110437, 63311, 456705, 167161, -6698, -75123, -9258, -82779, -88870, -72778, -118325, -126981, 334067, 173614, 214051, 279056, -191286]
15637A17805Q9465G4901b39962D5576b79192F7593a00487j25621A97737f7860
15626b4419q893j23283j51913M5092A31682a82567B0359l918L67106E032J80481
15615A85513b54773B87208A26941k9078a22021o1521b1863k37384H8129l6231
15605E1898A7209J64823i9420M4782o0950c6388n9096j71479a5003j31981B17130
15593a00620I822a13046j22798A0391a89309k86222f2097A17483a48030D9329
15582A27712a3854k39615H6323J91618b17111C7929b56008C26249g8158G5225
15571E6104e5559C7165K78a02759Q307A14020l8067h209k01603F8181J42229b04506
15558C07353b11588N6131d6782A85598A1582R3450b62810h1787o6137J1690b9965
$$ y = [117805, 207270, 74901, -239962, 45576, -279192, 67593, -100487, -226108, 197737, -67860, -24419, -33312, -156595, -308508, -263416, 131682, -182567, 20359, 16441, 383547, 5032, 185513, -254773, 287208, 126941, 97863, -122021, -183542, -21863, -259247, 88129, 51898, 17209, 182032, -99420, -54638, -115588, -36388, -95484, -266963, -15003, -146984, 217130, -100620, 9822, -113046, -235844, 10391, -189309, -475531, -62097, 117483, -148030, 49329, 127712, -13854, -253469, 86323, 277941, -217111, 37929, -256008, 326249, -78158, 75225, 56104, -55559, 37165, 37443, -102759, -94452, 114020, 75953, -8209, -209812, 68181, 210410, -204506, 307353, -211588, -155457, -46782, 185598, 11582, 105032, -262810, -81787, -147924, -136234, -29965]
15546A57237j9347a31358B32236D0331O0333c5096M366m9522E0057c48815j4256
15535c63071C01362a40667j10466F7460R8477c65247B031R2737a60960H9293b22841
15523A04483b1045A91321f9932j43516B17237G7179b72365d1830p7554k2750A39127
15511b55264B47275h3728K3319C66372A39395J60097D1469M7881d308j48638C608
15499F4713J68629I5647N3162b6533A87053a52659J622b7520C98082b29735G4768
15487E3221R518J90282O1609g9597F6545K9684J11805o2429a1537j62509c1104
15475A58078G7951J09177a42254I3912b04746B7520J9981L79452e6508A66493
15464B57307Q4895A48038o6617O5059L17170l7574n8132L82250k85045c19274
$$ y = [157237, 137890, -131358, 232236, 40331, 100664, -35096, -30730, -80252, 50057, -348815, -363071, 301362, -140667, -251133, 67460, 165937, -365247, 2031, 94768, -160960, 89293, -222841, 104483, -21045, 191321, -69932, -213448, 217237, 77179, -272365, -41830, -119384, -142134, 139127, -255264, 247275, -83728, -60409, 366372, 139395, 299492, 41469, 89350, -4308, -152946, 3608, 64713, 233342, 95647, 148809, -26533, 187053, -152659, -151037, -27520, 398082, -229735, 74768, 53221, 62739, 253021, 314630, -79597, 66545, 96229, 208034, 145605, -11537, -174046, -31104, 158078, 77951, 187128, -142254, 93912, -204746, 27520, 47501, 426953, -56508, 166493, 257307, 342202, 148038, 81421, 146480, 463650, 426076, 367944, 750194, 465149, -319274]
15453B63581a6420D16393j24964a3267j35576C03711j25712e489I1219N5918L3135
15442A80272h4941G1668d301A02823j7434b6142A17738J74431A31498a02640c0440
15430a0964C09247A45227J78035J42893M0880L08354j14259J3816k95726m271
15420D14949q4030m7333B0924b0237j02614j48387f788C2897A4928a24952A10434
15408d9152E05057b18449e7994I0139K68124A74190a00695d8859j94780B51108
15397a79793F3048a92503h0294m3753H3483J90728j9320b09721a0420B4211c594
15385A46499b19612I4761J28306A01595l4046a6940A10708a10645E1842h395j80543
15374a88938P3549A66059F5251a07664G0811N2793R0316b2057m9707A2673Q0943
$$ y = [263581, -16420, 416393, 291429, -13267, -148843, 303711, 177999, -5489, 91219, 147137, 180272, -84941, 71668, -4301, 102823, 85389, -26142, 117738, 292169, 131498, -102640, -30440, -10964, 309247, 145227, 323262, 466155, 507035, 815389, 701130, 714946, 419220, 414949, 330919, 283586, 20924, -20237, -122851, -271238, -6788, 32897, 14928, -124952, 110434, -49152, 505057, -218449, -57994, 90139, 358263, 174190, -100695, -48859, -243639, 251108, -179793, 63048, -192503, -80294, -124047, 83483, 274211, 254891, -209721, -10420, 24211, -3594, 146499, -219612, 94761, 223067, 101595, 67549, -16940, 110708, -110645, 51842, -8395, -188938, -115389, 166059, 65251, -107664, 70811, 123604, 213920, -22057, -71764, 12673, 93616]
15363I3616C6551a68489A76482c689I653J63173R2906Q0096g1825c5122J1704
15352b3418A73315a48214C7749K46629K4598B6131a35318A4789J74767p232g2593
15340d6030A85116A5834N7155a12150a4846I892L41612b20749C7363J24711J5779
15329A77853J51130K40168A19398K33779A68670C8169J86247a17043C3978b3525
15318b93526N6906C39942j46552A1300a02914A52398Q284J71715n3177J00773
15308C79993A3621L9632L09836j40809f5121A57458A8447b4305D8003K56180h6937
15296D099K86321Q7283O826r1A8220M3275c0869A65156m5438b21757A19973e1463
15283c5405C25075c3057F8576b89709E3871I836a18231d8953K069C16471a80895
$$ y = [93616, 36551, -168489, 176482, -3689, 9653, 172826, 265732, 345828, -71825, -35122, -23418, 173315, -148214, 37749, 284378, 308976, 26131, -135318, 14789, 189556, 182324, -72593, -46030, 185116, 15834, 72989, -112150, -14846, 9892, 351504, -220749, 37363, 162074, 177853, 328983, 569151, 119398, 353177, 168670, 38169, 224416, -117043, 33978, -23525, -293526, -236620, 339942, 193390, 11300, -102914, 152398, 160682, 332397, 279220, 379993, 13621, 53253, 363089, 222280, -65121, 157458, 18447, -24305, 48003, 304183, -86937, 4099, 290420, 377703, 384529, 384438, 18220, 61495, -30869, 165156, 119718, -221757, 119973, -51463, -35405, 325075, -33057, 68576, -289709, 53871, 9836, -118231, -48953, -46884, 316471, -180895]
15271i2395B17834A2419K85466b3026F2784a5232A37446j0415a23933A81012b40024
15259A77969B2282D643b86880I8351g4608F1519k9967e7849E9192K59026A38483
15247H9477c27673B19798j3840c946B88578o0224J0692M2657a07753k0345B63513
15235g4490D11557q6696B3296M03449J69279K35675N43974J73353m59657K07998
15225A297367E19650O5874j26000A93766J40298J23374b8405F3259f0220a9552
15214B90896a041B59517a69881d2577B39085j07705K48013B3713K56735b26094
15203d399A65761C4207b24328k4150q719C11369G9112f7388j03031l6195B42904
15191A22274O5765N0581m9352l1063a28562C58163D1775E234P79O08648E0127
$$ y = [-92395, 217834, 12419, 297885, -23026, 62784, -15232, 137446, 127031, -123933, 181012, -240024, 177969, 22282, 4643, -286880, 98351, -74608, 61519, 31552, -57849, 59192, 318218, 138483, 89477, -327673, 219798, 205958, -3946, 288578, 228354, 239046, 281703, -107753, -128098, 263513, -74490, 411557, 324861, 23296, 426745, 596024, 831699, 1375673, 1549026, 1089369, 1297367, 519650, 585524, 459524, 193766, 334064, 457438, -28405, 63259, -60220, -19552, 290896, -1041, 259517, -169881, -42577, 239085, 131380, 379393, 23713, 280448, -226094, -4399, 165761, 34207, -224328, -248478, -257197, 311369, 79112, -67388, -170419, -206614, 242904, 122274, 188039, 238620, 189268, 158205, -128562, 358163, 41775, 5234, 6013, 614661, 50127]
15179c04702C13675A10387n035L0504d89E4638e7902F3821a2981A65156J01549
15168B66705q0767h1409C39512c1347k76026B74037b76505A2926J47039n3455
15158A06510m2109K58788a213j392C2118J16666b02535D1367a38287F790f5054
15146F3810b9461B61896c4651E6080k1397i0526E4199J07005l6500a56691A31726
15134A4606a07377A48641R6261o8252J5321R1884j15739P0643h7855G2763c0165
15122A45853D077K92340m6692R9266b6496C25033Q107A8306a56182g504D8554
15110A81818Q1445A22444m7970K40399L1061j22784J95503j96417j4613K20499
15100D28122j57392r6141p0529Q5640K09181j80387g8166J9519B68233J1747A10836
$$ y = [-304702, 313675, 110387, 105352, 135856, -489, 54638, -57902, 63821, -12981, 165156, 266705, 185938, -81409, 339512, -31347, -307373, 274037, -276505, 12926, 159965, 106510, 64401, 323189, -1213, -2605, 32118, 148784, -202535, 41367, -138287, 6790, -65054, 63810, -29461, 261896, -34651, 56080, 34683, -90526, 54199, 161204, 124704, -156691, 131726, 14606, -107377, 148641, 244902, 176650, 191971, 283855, 168116, 238759, -87855, 72763, -30165, 145853, 4077, 296417, 249725, 348991, -26496, 325033, 333140, 18306, -156182, -7504, 48554, 181818, 263263, 122444, 74474, 314873, 345934, 223150, 418653, 222236, 207623, 428122, 270730, 174589, 104060, 189700, 398881, 218494, -78166, -58647, 268233, 279980, 110836]
15088A95871J08275j01007n4743b42429K5108L7963C9040b75975B34842G1748
15077B81367K34226i1456B9418a6291A60825D4723J9462K59069m3300l6218q2711
15066A61025O7284e8920r504E61636A78908k2392a64771I1289K80875r9414C6641
15054A42514L5354f2676A69001p5950Q0511m1302m8681J76554A0627K2839a2509
15042A93997J77258l8379c9734g51A47242a99847C71126E9533O2668J53501J89563
15031D65265A17661K0676K01641A42429J47271D5529J03435L140J50519L1847
15021C34470C9112O07897B70406J47658J98819A17129M98323A3902L32541K28480
15011E74923B06756M43523k01107L06979J03029D14371j0766N5540J72616k68346
$$ y = [195871, 304146, 203139, 148396, -242429, -217321, -179358, 39040, -275975, 234842, 71748, 281367, 515593, -91456, 29418, -16291, 160825, 44723, 64185, 323254, 279954, 243736, 161025, 228309, -58920, -68424, 561636, 178908, 156516, -164771, 91289, 372164, 272750, 36641, 142514, 177868, -62676, 169001, 93051, 173562, 132260, 83579, 260133, 10627, 33466, -12509, 193997, 371255, 332876, -39734, -751, 147242, -199847, 371126, 59533, 122201, 275702, 465265, 117661, 138337, 339978, 142429, 289700, 45529, 148964, 152104, 302623, 334470, 39112, 647009, 270406, 418064, 616883, 117129, 615452, 13902, 346443, 574923, 206756, 650279, 449172, 756151, 859180, 414371, 403605, 459145, 631761, 363415]
15001C63415L21297k81460J16026o6303j38570M0228o9283J84268k07309L17661
14991E79970k18755N154J88119j59955j55852K50549j35265k4066C3811N63173
14981E96984k56405r8575L45775B73610J60996Q7803L82517B63521O3468K50888
14971E77877k70783J08955O6564Q3098j26752L81864l35886L30477m2741m0339
14961G32334o561C08616M82005k66930J2586J27135p9755N1177j07282K743k32844
14950B97451O4350j52387L42180q6206l4631j51187L38035q9144B38801J06080
14940C44881K2817j33446K36587j64828Q3493Q5352k3814A69837K73803L5450
14930D79090j8909J79821j24922j47769K37887r8149Q8419p1950k16442M4852
$$ y = [363415, 684712, 403252, 519278, 452975, 314405, 354633, 285350, 469618, 262309, 579970, 361215, 366369, 554488, 394533, 238681, 489230, 353965, 329899, 33811, 596984, 340579, 242004, 587779, 273610, 434606, 522409, 904926, 263521, 326989, 577877, 307094, 416049, 482613, 565711, 438959, 820823, 484937, 815414, 772673, 732334, 725773, 308616, 790621, 523691, 536277, 663412, 583657, 634834, 527552, 530295, 297451, 361801, 209414, 551594, 465388, 430757, 279570, 617605, 528461, 238801, 344881, 367698, 234252, 470839, 306011, 389504, 474856, 451042, 169837, 443640, 479090, 460181, 640002, 515080, 367311, 605198, 507049, 595468, 523518, 307076, 351928]
14920C51928K60848J8137C13661L93173J17305k72837J12023K47462K95618K62846
14910A469251k46534J56665N4995K39741m97343j05635L88537L21109k70688J64131
14900A674229k1473J26039M20291p57843m05599j70635J61169l80750n4680J39818
14890G30566j35509j135k58439j14179M01959r9521K6675n5005k40566Q5817J34586
14879D75249N9596k17710A41140L09707N953L06552k06390l948l3694J41133J17727
14868G78180n8518K49295p8263K6974l63917O8943n0817K90682r7348J14285m11051
14857D68445p3482K5767P4815p4562L17324o5025j42360M3465K79336k78077k32085
14846C43561M30976k58651J11266k55941L05496k52289N3299l7661N5010K41587
$$ y = [351928, 612776, 630913, 313661, 706834, 824139, 551302, 663325, 910787, 1206405, 1469251, 1222717, 1379382, 1434377, 1674118, 1176775, 1071140, 1459677, 1780786, 1510098, 1674229, 1652756, 1778795, 2199086, 1441243, 1035644, 865009, 1026178, 645428, 590748, 730566, 595057, 593922, 335483, 221304, 623263, 523742, 550417, 495412, 254846, 340663, 475249, 534845, 317135, 141140, 450847, 456800, 763352, 556962, 553014, 519320, 660453, 778180, 719662, 968957, 890694, 917668, 553751, 622694, 571877, 862559, 765211, 879496, 468445, 394963, 420730, 495545, 420983, 738307, 673282, 530922, 574387, 853723, 575646, 343561, 774537, 515886, 627152, 371211, 676707, 424418, 477717, 440056, 495066, 736653]
14836G36653k05812j15621p4665K95157j44858K687J68282j68194J22750n5582
14826E60797J70590K79341o8338J04573J34930n4910o514j88267k59334j47773
14816E25095M38282C98648K26940j53151o5066k3648k4889K10659K62782m14505
14806D17770L36654k09597J09842j48650L75985q1331l10916Q6531J72447k05154
14796E43581K91965p7229k12465n7778K80388P9748j25493l1364m4000N56672
14786A204025k43472j1933J34920D83488j28755A62365K75580L12523j20765q5038
14776E44665K36310k99504K40971m8615k3860L5305k20122K64046k1999k0377
14766F86820M2474j91339o1308m0446M89820l21860L2248j61502M46189L94387
$$ y = [736653, 530841, 415220, 340555, 635712, 490854, 493541, 661823, 493629, 616379, 560797, 731387, 1010728, 942390, 1046963, 1181893, 1126983, 1120469, 932202, 672868, 525095, 963377, 398648, 625588, 472437, 407371, 383723, 358834, 569493, 832275, 417770, 754424, 544827, 654669, 506019, 882004, 800673, 489757, 576288, 748735, 543581, 835546, 758317, 545852, 488074, 768462, 848210, 722717, 691353, 647353, 1204025, 960553, 948620, 1083540, 483488, 354733, 162365, 437945, 750468, 629703, 544665, 780975, 481471, 722442, 673827, 649967, 685272, 465150, 729196, 707197, 686820, 729294, 537955, 476647, 436201, 926021, 604161, 636409, 474907, 921096, 1315483]
14756A315483m21793j73954j30737J31004K28134D51239K36811N68249E51318
14746D30322K00997m2003j06776M6097K59515j42452j06501R9127k1805N0855
14736F67376j10870K51255J48836p7576j37162j64266K44408j63290J43391C34825
14725E98204Q6321N127q3630J36514J7368o237M9666l0179L5854j7777O5633L51215
14713A208079k68477K05055J85866j35750Q5L18960l33809K077k8927m12121N72298
14702A313336n08154j56117N25374j44494k91139J68204k48630j12011O06590
14693A152959m91676J78417J71600J70288k94836M98633j82230m44429L57947
14684A116673M35700q4928L87801j10886p7511k89371k50027J44454l88092L57525
$$ y = [1315483, 893690, 719736, 588999, 720003, 948137, 451239, 688050, 1256299, 551318, 430322, 631319, 589316, 482540, 528637, 788152, 645700, 539199, 638326, 616521, 667376, 556506, 807761, 956597, 879021, 741859, 577593, 822001, 658711, 802102, 334825, 598204, 684525, 689652, 606022, 742536, 759904, 753667, 803333, 773154, 809008, 791231, 856864, 1208079, 939602, 1144657, 1330523, 1194773, 1194858, 1513818, 1180009, 1182086, 1153159, 741038, 1313336, 805182, 649065, 1174439, 1029945, 738806, 907010, 658380, 546369, 1152959, 661283, 839700, 1011300, 1181588, 886752, 1385385, 1203155, 758726, 1116673, 1552373, 1467445, 1855246, 1744360, 1666849, 1377478, 1127451, 1271905, 883813, 1241338]
14674A241338k22590K46426l43019R4169k91386J97410K27986j32119j28879J55452
14664A044788p9694J7413j41205K59125N2540N1039n62617N97714k46716R51K11929
14653A205267k31355J7316R9483j03592L42392k27114n1915M6641J42372k5358
14643A214137o1521k05719K42297j58776N10784n72465M64412k30561L6644K50881
14633A490113j65899R1654k71020M37039l64164K48617k91824M82040k14690l18552
14623A123314L0694L16324m42676L00973l08368K4785O45507l45466j82161L54687
14613A517613m68391K62399k49984K71563j21190O03N26316k59274j37185Q8638
14603A431108k00875J95236L54140n07882L37047o5700p2064K23532n8302J17517
$$ y = [1241338, 1018748, 1265174, 922155, 1016324, 724938, 922348, 1150334, 1018215, 889336, 1044788, 965094, 982507, 841302, 1100427, 1152967, 1204006, 641389, 1239103, 992387, 993338, 1205267, 973912, 991228, 1090711, 987119, 1329511, 1102397, 1050482, 1097123, 1239495, 1214137, 1152616, 946897, 1189194, 1030418, 1541202, 968737, 1433149, 1202588, 1239232, 1490113, 1324214, 1415868, 1144848, 1581887, 1217723, 1466340, 1174516, 1656556, 1441866, 1123314, 1154008, 1470332, 1027656, 1328629, 1020261, 1045046, 1690553, 1345087, 1162926, 1517613, 1049222, 1311621, 1061637, 1333200, 1212010, 1212613, 1738929, 1479655, 1342470, 1431108, 1230233, 1425469, 1779609, 1271727, 1608774, 1543074, 1471010, 1694542, 1636240, 1753757]
14593A753757k62895m8540j23102K51883n6882O3279k0272M02422k08990J70649
14583A921309j9307j50009m2861K64533k53133j10950J99834J67484n0633l16680
14573A609587J77900L16863r570o11320O04307j95001P6385O915N8502K1814j71175
14562A885207o5144K32688J76000r8165M9759l4046L9863k46330M65268m36278
14552A968822L25780N3656J79425J86333j30492K93301k43721J14382M68670q814
14542C207342L27126K39332N18772O5062M93948Q05377J055300Q32214K614510
14533A0158983M142718O739580Q969790J559765j1999655p979017l782890k138943
14525E670331Q457r17083j121324n92757l05734o41297N82820k09794k21336P6577
$$ y = [1753757, 1490862, 1442322, 1319220, 1571103, 1514221, 1577500, 1557228, 1959650, 1750660, 1921309, 1902002, 1751993, 1709132, 1973665, 1720532, 1609582, 1809416, 1976900, 1926267, 1609587, 1787487, 2104350, 2094780, 1483460, 2087767, 1892766, 1969151, 1976066, 2034568, 2056382, 1885207, 1820063, 2052751, 2228751, 2130586, 2180345, 2146299, 2186162, 1939832, 2405100, 1968822, 2294602, 2348258, 2527683, 2714016, 2583524, 2876825, 2633104, 2747486, 3216156, 3207342, 3534468, 3773800, 4292572, 4357634, 4851582, 5656959, 6712259, 7544473, 10158983, 14301701, 21041281, 30011071, 31570836, 19571181, 11592164, 7809274, 5670331, 5678788, 4761705, 3640381, 3047624, 2741890, 2100593, 2683413, 2473619, 2252283, 2328860]
14515B328860J02518J39437l57235Q4190j04235J15122J00368o9613N92705l20908
14505B611209r7935r4496L11748j07578l63429L36361M6790M00570l12660L25184
14495C055764l90282J58469K94316J67127k8307l45011K76706j86050P4872R7686
14485C175290J05192k53065K46402K81739l44835K28800j30221j83256O22803
14476C748849m51180N1023K87413J68386k8727p6293j00588J32056P0021M4597
14466C845557q1067R0773j1891M22977m32791N89467P144l39729j28525L87744
14456D349659m2791K47613J89883l13839M03065j21859j78526J44091K62246j06076
14446D833466P9205N5952J74187j85338K70678k13151M95921k25286R8394j04066
$$ y = [2328860, 2431378, 2570815, 2213580, 2297770, 2193535, 2308657, 2409025, 2339412, 2932117, 2611209, 2513274, 2418778, 2730526, 2622948, 2259519, 2595880, 2642670, 3043240, 2730580, 3055764, 2665482, 2823951, 3118267, 3285394, 3257087, 2912076, 3188782, 3002732, 3077604, 3175290, 3280482, 3027417, 3273819, 3555558, 3210723, 3439523, 3309302, 3126046, 3748849, 3297669, 3348692, 3636105, 3804491, 3775764, 3699471, 3598883, 3730939, 3800960, 3845557, 3764490, 3855263, 3843372, 4266349, 3833558, 4423025, 4430169, 4090440, 3961915, 4349659, 4306868, 4554481, 4744364, 4430525, 4833590, 4711731, 4533205, 4677296, 4939542, 4833466, 4912671, 4968623, 5142810, 4957472, 5228150, 5014999, 5510920, 5285634, 5384028, 5279962]
14436E279962P0879M49334o9307N9239j25263L46480l66191K81989M3452j09216
14426E861358O23882l77769M81533O9482k24981n96K07451L14829J40466J39937
14416G235592l01147M31226J41376j43402J31135J42970j93264L79423J98245
14407H022154K0490J43802L38157l40238N37739J62686L0600L59555k24570J99943
14397I250318J36773L16241l61218J57671J39756M46595k35825M59238L39631
14388A0649180l9735R2905N89311m58140N75901j87182J97565N17702M76092l12828
14378A2100771K47565q5299K48593O54628M886J19880K53946K75191N10850p0946
14368A4260065L02535M45416R2323N34486J08498L63334M35996J65920Q02054
$$ y = [5279962, 5350841, 5800175, 5730868, 5790107, 5664844, 6011324, 5645133, 5927122, 5970574, 5861358, 6485240, 6107471, 6589004, 6658486, 6433505, 6432909, 6640360, 6955189, 7095655, 7235592, 6934445, 7365671, 7507047, 7363645, 7494780, 7637750, 7444486, 7823909, 8022154, 8042644, 8186446, 8524603, 8184365, 8722104, 8884790, 8915390, 9274945, 9050375, 9250318, 9387091, 9703332, 9342114, 9499785, 9639541, 10086136, 9850311, 10309549, 10649180, 10609445, 10702350, 11291661, 10833521, 11409422, 11222240, 11419805, 11937507, 12413599, 12100771, 12348336, 12263037, 12511630, 13166258, 13171144, 13291024, 13544970, 13820161, 14331011, 14260065, 14562600, 15008016, 15100339, 15634825, 15743323, 16106657, 16542653, 16708573, 17510627]
14359A7510627k24116M14986N94480Q7264K93578M87568K78439N296P42866P47638
14349B0938626J88860R31003K38273K21257M96823Q48112K67733N54749N12171
14340B5197607M09051Q58960N33655N61746R41203M92975L85978J167493J002265
14331C1550933L24896J030523Q84195J078986J065785Q27414R66385O22917J579634
14322C9931668P30161J571576R85157J219272J757825J372693J340613J511544
14314E0420509J649625K176582J601945J356385K396980K128125J770945K308755
14306F5809851K280680K686290K208767K884423K950024K525072L505515L172741
14298H8023363L669916L542721M269820L949353M328948M770166M679463N129370
$$ y = [17510627, 17286511, 17701497, 18295977, 18383241, 18676819, 19164387, 19442826, 19448122, 20190988, 20938626, 21127486, 22058489, 22296762, 22518019, 23014842, 23862954, 24130687, 24685436, 25197607, 25606658, 26465618, 26999273, 27561019, 28502222, 28995197, 29381175, 30548668, 31550933, 31875829, 32906352, 33790547, 34869533, 35935318, 36762732, 37729117, 38352034, 39931668, 40661829, 42233405, 43218562, 44437834, 46195659, 47568352, 48908965, 50420509, 52070134, 54246716, 55848661, 57205046, 59602026, 61730151, 63501096, 65809851, 68090531, 70776821, 72985588, 75870011, 78820035, 81345107, 84850622, 88023363, 91693279, 95236000, 99505820, 103455173, 107784121, 112554287, 117233750, 122363120]
14290A22363120O101191N753372O128347O783955P225998P822976P805884Q562079
14282A78546922R162223R300737J0220230J0654369J1010956J1640007J2866117
14275B53401561J2954985J3561491J3966794J4516657J3933748J4342489J3857316
14268C50535041J3345103J3291928J2393124J1836323J1259524J0142200R317716
14261D32120959Q647078P809613P657384O389341K725173Q03595K162056j762617
14253D66552582o253691m504142p009887q815643j2027591j3009760j3441783
14246D01490085j3829593j4570249j3841493j4431878j4670185j4486813j4118718
14239C01541156j3334958j3063658j2062107j2258898j1370618j1262218j0501225
$$ y = [122363120, 128464311, 134217683, 140346030, 147129985, 154355983, 162178959, 169984843, 178546922, 187709145, 197009882, 207230112, 217884481, 228895437, 240535444, 253401561, 266356546, 279918037, 293884831, 308401488, 322335236, 336677725, 350535041, 363880144, 377172072, 389565196, 401401519, 412661043, 422803243, 432120959, 440768037, 448577650, 456235034, 462624375, 465349548, 466153143, 468315199, 466552582, 460298891, 455794749, 448784862, 439969219, 427941628, 414931868, 401490085, 387660492, 373090243, 359248750, 344816872, 330146687, 315659874, 301541156, 288206198, 275142540, 263080433, 250821535, 239450917, 228188699, 217687474]
14232B17687474j0561136j0196706r961167r017083q238777q145577p736516p241182
14224A46589330o500948o249445n996999n717429n145001n373591m394631m100717
14216A03110569m482823l668859l829587l705171l145486l412982l311191k598789
14208G4955681k737800k216113k762203j792743k495704k479685j513015j938798
14200E7019620j861405j397296j527456j693387j724046j669331j286656q33189
14192D5026854j497584j093304j214441j473285r46124r00327j099335q30498
14184C5971956p22800j144911r75432r76192n08402m51342j291841o98911q94761
14175B8307364k05257j025287m86130o30779l91716p54568m92500n08409k06033
$$ y = [217687474, 207126338, 196929632, 186968465, 177951382, 169712605, 161567028, 153830512, 146589330, 140088382, 133838937, 127841938, 122124509, 116979508, 111605917, 107211286, 103110569, 98627746, 94958887, 91129300, 87424129, 84278643, 80865661, 77554470, 74955681, 72217881, 70001768, 67239565, 65446822, 62951118, 60471433, 58958418, 57019620, 55158215, 53760919, 52233463, 50540076, 48816030, 47146699, 45860043, 45026854, 43529270, 42435966, 41221525, 39748240, 38802116, 37901789, 36802454, 35971956, 35249156, 34104245, 33128813, 32152621, 31644219, 31192877, 29901036, 29202125, 28307364, 28102107, 27076820, 26590690, 25959911, 25568195, 24813627, 24321127, 23812718, 23606685]
14166B3606685p43868l77832j130510p9754n26986O7920o56662l97408o67272
14157A9094313j25213l87152k67325n14236k58141k88286j53655o06349m43455
14148A6050501o6713m73681O1219m62306N812o71774M1773k78924k30057n96223
14138A3379627L9656k23018J28949k97860m86580q3769m14885n8399j21754K05714
14128A2067681o34048n8422l66334O7196l59539o5059j2142j31955m66043m8181
14118I993154k39525r3536j48310j01292q9851R227k20907k08040k8250j08130
14108H764540k0781l09777j08524P2369j37586k63360k88936L23310l27679J9517
14098G723093n06249k06886K34374j283k14167l3424Q590j94397J1933j02475
$$ y = [23606685, 22862817, 22484985, 21354475, 21274721, 20747735, 20815655, 20158993, 19761585, 19094313, 18969100, 18581948, 18314623, 17800387, 17542246, 17253960, 17100305, 16493956, 16050501, 15983788, 15510107, 15571326, 15109020, 15114832, 14443058, 14484831, 14205907, 13975850, 13379627, 13419283, 13196265, 13325214, 13027354, 12540774, 12457005, 12042120, 11983721, 11861967, 12067681, 11433633, 11375211, 11008877, 11076073, 10716534, 10651475, 10639333, 10507378, 10041335, 9993154, 9753629, 9660093, 9511783, 9410491, 9320640, 9329867, 9108960, 8900920, 8872670, 8764540, 8743759, 8433982, 8325458, 8397827, 8260241, 7996881, 7707945, 8031255, 7703576, 7723093, 7216844, 7009958, 7244332, 7243049, 7028882, 6995458, 7004048, 6809651, 6821584, 6719109]
14088F719109J60040n8363o6312k44277n150m06569J84646l11524N3521p87j19002
14077E905332O171j50300L06791m91131j60162J02452j41308M8410k4304N9172
14067E461123n02163m7041K73639j69517J35243j61471K6117N6722l00698J18961
14057D890915j6866k29683J10508k31565n22236N41927l37573L10037k64259n9028
14047D192177L51618K834J67144n60840j90293J1721J71101L10977l66759K2415
14037D112095k76031r0559l1837J62323K9810l3359n2031k33525k7195N1782J40699
14026C752172m30303Q458K08951N6972M1286r2993j31340q0894N0003k04953K08619
14015C385978K15291l52367J30722K41227o26251K79192l39943k87350K92241
$$ y = [6719109, 6879149, 6820786, 6754474, 6510197, 6505047, 6098478, 6283124, 5971600, 6025121, 6024334, 5905332, 5911503, 5761203, 6067994, 5576863, 5416701, 5519153, 5377845, 5426255, 5401951, 5461123, 4958960, 4911919, 5185558, 5016041, 5151284, 4989813, 5015930, 5072652, 4771954, 4890915, 4874049, 4644366, 4754874, 4523309, 4001073, 4543000, 4205427, 4515464, 4251205, 4192177, 4543795, 4546629, 4713773, 4152933, 3962640, 3974361, 4145462, 4456439, 4089680, 4112095, 3836064, 3745505, 3713668, 3875991, 3905801, 3872442, 3820411, 3586886, 3559691, 3611473, 3752172, 3321869, 3330327, 3539278, 3596250, 3637536, 3544543, 3413203, 3332309, 3382312, 3177359, 3385978, 3601269, 3248902, 3379624, 3620851, 2994600, 3273792, 2933849, 2646499, 2938740]
14006B938740q7629p1602n5687j86238K48158J27785l09626O1497J41377k52470
13996B554305j14204j6755O6731o5982J46046L32814l27644j95333J08750j57283
13986B331445N471K37339p0003o5032M29330k72822l6320O06605N38531k67918
13976C436626O37564J008070J311491L365933N862431J0142530P001799r339710
13968B3426734p689369n060741l122063j409952r88362n95940l69206l96735J7860
13959C812226m69771k00080l3791j89510R0673j47931n67119J7625L67284o5462
13949B614144k39762J30024l9200L92768m26363n42973J77401L1659J19571J08816
13939B326085j68515j54840J11285k33989L1053P1860K18648k97206M01235j10907
$$ y = [2938740, 2851111, 2779509, 2723822, 2537584, 2785742, 2913527, 2603901, 2665398, 2806775, 2554305, 2440101, 2423346, 2490077, 2424095, 2570141, 2902955, 2575311, 2379978, 2488728, 2331445, 2336916, 2574255, 2504252, 2439220, 2868550, 2595728, 2559408, 3166013, 3704544, 3436626, 4074190, 5082260, 6393751, 9759684, 15622115, 25764645, 32766444, 23426734, 15737365, 10676624, 7554561, 6144609, 5156247, 4560307, 4191101, 3794366, 3812226, 3342455, 3142375, 3108584, 2919074, 3009747, 2861816, 2294697, 2312322, 2679606, 2614144, 2374382, 2504406, 2465206, 2857974, 2431611, 1888638, 2066039, 2097698, 2217269, 2326085, 2157570, 2002730, 2114015, 1880026, 1911079, 1982939, 2201587, 1904381, 2305616, 2194709]
13929B194709k87395k9129Q9447J87994j1761r2056l55394J63661L18583m00103
13919A778556k78531L19845k7287q8254m3208J80070k92236K10523k38294j93119
13909A328065K52470j05385k7308M96117l48899J9008r0399L48509l92833L37440
13899A816785o06171K07239L6036K13787o6668p5565M2547k08327q221O4555J49369
13888A565366J05040l48027K38029m3867J46468J06303n44940Q5808O8513M050
13878A382743j77114r7090M83816k31642J92680J00459l59185J38577n1967l76972
13868A004305M52163n50176N40896j13617k31723K92099k87351L38407m42480
13859A002523L04212j30161J31535n9213m1507m1014J7177J11618O0944k33281
$$ y = [2194709, 1907314, 1878185, 1967632, 2155626, 2143865, 2051809, 1696415, 1860076, 2178659, 1778556, 1500025, 1819870, 1792583, 1704329, 1661121, 1841191, 1548955, 1759478, 1521184, 1328065, 1580535, 1475150, 1447842, 1943959, 1595060, 1614068, 1523669, 1872178, 1479345, 1816785, 1210614, 1417853, 1453889, 1667676, 1601008, 1525443, 1567990, 1359663, 1351442, 1415997, 1565366, 1670406, 1322379, 1560408, 1516541, 1663009, 1769312, 1224372, 1310180, 1378693, 1382743, 1205629, 1108539, 1592355, 1360713, 1553393, 1653852, 1294667, 1433244, 1381277, 1004305, 1456468, 906292, 1447188, 1333571, 1101848, 1393947, 1106596, 1445003, 1002523, 1306735, 1176574, 1308109, 1248896, 1207389, 1166375, 1183552, 1295170, 1356114, 1122833]
13849A122833p1014J38391K95063j36235k25888l4260k6690j09729N01873j84152
13839A270192m90422M43504j19453k2218n8615o7667j30761j4217K29409j22357
13829I17395K01579l8934P0238l17094L2287M19089j10655m61375J41141K36049
13819A089720j04327m2580k04294K62383p1022M0576n983K61257m10556J4136
13809H29310J99340j04097j28654J83181J53785j71892j10067M45763m10994J00743
13799I86418q3096p6920l7667J14811n7137j8707p7304r2432K96419l44361J83449
13788G93473o3169J47954R6715Q1153j59977K67736l08144k40712M62272p5829
13778A001472m35112L63392k17190J2159j15832M20509k62325p600L79302l96994
$$ y = [1122833, 1051819, 1190210, 1485273, 1349038, 1123150, 1088890, 1062200, 952471, 1454344, 1270192, 779770, 1223274, 1103821, 1081603, 1022988, 955321, 824560, 810343, 1039752, 917395, 1118974, 1080040, 1150278, 833184, 865471, 1284560, 1173905, 712530, 853671, 1089720, 985393, 942813, 738519, 1000902, 929880, 970456, 964473, 1225730, 815174, 829310, 1028650, 924553, 795899, 979080, 1132865, 960973, 850906, 1296669, 885675, 986418, 903322, 826402, 788735, 903546, 846409, 827702, 750398, 657966, 954385, 610024, 793473, 730304, 878258, 974973, 1056126, 896149, 1163885, 855741, 615029, 1077301, 1001472, 566360, 929752, 712562, 724721, 608889, 1029398, 767073, 759473, 1138775, 741781]
13768G41781k60042O37304D83875M73402n3045J39743j14781j05435j75420N9419
13758G07758J02060j05803j20L67822m99250L47261l86032J51517J67328R6431
13748I48972D22029M23122Q99j38084L3484q951P8461O5347k69951R6735J5935
13737G19026l112N5574m0397K73693l51440j33882K78796J88721j83651l47799
13727D55529O6709O5437j38662O0960K57542l39093J79939L17669m36217J69212
13717F59025K07831B59281K19335J39826j68871M66600k95242J4141P0111l10314
13707C94867L09528J37518l23291K19413k78586J77331A52238N38429P1049j19337
13697F42379M8381j72976P2871O572J42170k78043M11681B69426K06583Q8320
$$ y = [741781, 481739, 1119043, 483875, 957277, 904232, 1043975, 929194, 823759, 648339, 707758, 809818, 704015, 703895, 1071717, 572467, 919728, 533696, 685213, 852541, 948972, 422029, 845151, 846050, 707966, 741450, 732499, 810960, 876307, 606356, 703091, 719026, 715914, 771488, 731091, 1004784, 653344, 519462, 798258, 986979, 803328, 455529, 522238, 587675, 449013, 509973, 767515, 428422, 608361, 926030, 489813, 659025, 866856, 259281, 478616, 618442, 449571, 916171, 620929, 635070, 705181, 394867, 704395, 841913, 518622, 738035, 459449, 636780, 152238, 690667, 761716, 642379, 690760, 517784, 590655, 597227, 739397, 461354, 873035, 269426, 476009, 564329]
13687E64329k13212L59593B78054K54842L7982j46298j26760L30768j48520n6648
13677D23420M33928C88702J53348l8574K42407C16777K94904J37645C07252N95256
13667I02508j72904l61190J04523J3021J02653j76143J22927B16457L05357J91469
13657G13283k44155K6876J57126l8225n3715I5971L17210O4080L32056B22169
13646F09062j75545j00993K17672q5955A35362J75434J5M42909k93913L02550
13636G62357l12610J11654j89452j28637K26351A39508P0866L97759k5258j79401
13626D03474q2186L28572l14402A61389L75294k5493j81617J00493J26135A65785
13615C33026J0157M72385B96620J30795A26859M77102j98978J99544h3973F93809
$$ y = [564329, 351117, 710710, 278054, 532896, 570878, 424580, 297820, 628588, 480068, 423420, 857348, 388702, 542050, 503476, 745883, 316777, 611681, 749326, 307252, 902508, 729604, 368414, 472937, 485958, 588611, 412468, 535395, 216457, 521814, 713283, 469128, 496004, 653130, 614905, 561190, 95971, 413181, 477261, 809317, 222169, 609062, 433517, 332524, 550196, 464241, 135362, 310796, 310811, 753720, 459807, 762357, 449747, 561401, 371949, 243312, 469663, 139508, 210374, 608133, 582875, 403474, 321288, 649860, 335458, 161389, 536683, 511190, 329573, 430066, 556201, 165785, 333026, 343183, 815568, 296620, 427415, 126859, 603961, 404983, 604527, -83973, 693809]
13604F39447j08865A51207K90452j21822Q3859j03935P2091J48317C3411J37908
13594A71319N55860l05955j88249J71886A05264M32070R7726k84754r0187K29233
13584D89352J13577m5104A07243M03607A47212L52812J73660j97813j01612L43
13574C74602K51928B60214J24492n8905k7104j10873K19700l2953j78005R5162
13564B91728P6027p667A40326M04624o4139j14383N88658A39735M07140j03961
13554D42914B01477J16529O0339E8608J58331M4862J88578r3432j10616L6750
13544B83081J10112R6359j8016A61534K86665q6047j69145L68445A68548J83116
13534C51664J18253j57974H029a4218E746M19747L3109k21776J03859r1928K90490
$$ y = [639447, 530582, 151207, 441659, 319837, 403696, 299761, 371852, 520169, 33411, 171319, 727179, 421224, 232975, 404861, 105264, 537334, 635060, 350306, 260119, 489352, 602929, 557825, 107243, 510850, 147212, 500024, 673684, 475871, 374259, 374602, 626530, 260214, 384706, 325801, 298697, 187824, 407524, 374571, 196566, 291728, 367755, 360088, 140326, 544950, 480811, 366428, 955086, 139735, 546875, 442914, 201477, 318006, 378345, 58608, 216939, 261801, 450379, 356947, 246331, 283081, 393193, 489552, 471536, 161534, 448199, 362152, 193007, 561452, 168548, 351664, 469917, 311943, 8029, -14218, 5746, 425493, 458602, 236826, 340685, 248757, 539247]
13523E39247r3691A3315K92051J67277k13991O2643j33116E4949b929C76223l758
13512C72465J32290R7343k52090A33604M13070B15713l291J68473B5479K26418
13502B51897J58911B02000B4182N70957B21931B039K10460A03221J66261P8187
13492C47669c3800C21421J41510p9733B8990L4196a22567B05002L74279k38230
13482C41051R8191j84023q0790K08098J54051B56712K52356B46872r033a3900
13471A39684J50550P277J06666j20692I0964R979J38445J08485L0473a8215D16295
13459C45699Q6827B09259K08252b0601C00523L7976q3249J22400J02901B32236
13448B88977j42413f5979C58567j08777K50448B43850Q5516r2151O0658a1018
$$ y = [539247, 445556, 13315, 305366, 472643, 258652, 321295, 188179, 54949, -2929, 376223, 372465, 504755, 602098, 350008, 133604, 546674, 215713, 212422, 380895, 25479, 251897, 410808, 202000, 24182, 595139, 221931, 2039, 212499, 103221, 269482, 347669, -33800, 321421, 462931, 383198, 28990, 63186, -122567, 205002, 579281, 341051, 439242, 255219, 174429, 382527, 536578, 256712, 509068, 246872, 237839, -13900, 139684, 290234, 297511, 404177, 283485, 90964, 100943, 239388, 347873, 378346, -18215, 416295, 345699, 432526, 209259, 417511, -20601, 300523, 338499, 255250, 377650, 480551, 232236, 288977, 146564, -65979, 358567, 249790, 500238, 243850, 329366, 237215, 297873, -11018]
13437C71568A30142J69815a05766B89558R1615j67637C6308K22624j13107F3570
13426A84765K61476j63924E1183J57291g0864B05379J68144A06270J52332P1471
13416C30073H8393h04B90766j36307G6105M36588A62703j8144N14786H2063f8015
13404A13015L31342D1143c348B755L37405E167K77511j30877F2002K92119K33597
13393E87718B57881C356K02950B159J30933P6495m9223K54375a3070B50084H593
13381C99752j58127o3713K14612A89377i305A92107F0440K35831G8340A1723e1346
13369A97582r1759J38267I216J24410P3840G1422N88375I6843K48591q4688K38106
13358D98852A63924M2708G4846J89035J75443A84821L10244c3625a6008E02485
$$ y = [371568, 130142, 299957, -105766, 289558, 381173, 213536, 36308, 258932, 145825, 63570, 184765, 446241, 282317, 51183, 208474, -70864, 205379, 373523, 106270, 258602, 330073, 88393, -804, 290766, 154459, 76105, 512693, 162703, 144559, 659345, 82063, -68015, 113015, 444357, 41143, -3348, 2755, 340160, 5167, 282678, 151801, 62002, 354121, 587718, 257881, 3356, 206306, 2159, 133092, 209587, 160364, 414739, -13070, 250084, 8593, 399752, 241625, 177912, 392524, 189377, -9305, 192107, 60440, 296271, 78340, 11723, -51346, 197582, 105823, 244090, 9216, 133626, 207466, 71422, 659797, 96843, 345434, 260746, 498852, 163924, 206632, 74846, 263881, 439324, 184821, 495065, -33625, -16008, 502485]
13347b8913B1445R1613l6212K72179J0840A58469L5734J01713o3899o2598K95535
13336D64954A97277l153J75922C4999L9554L25252A49804L62622q2778r8723o9432
13325B61493N8603l3921L402g032A49038Q3187J85489B08383G6935B7545K75026
13314C02571L91580A58288K50376N8302j02278p7499D9400M92837B57688q5600
13304A72088R9989K43994j68794r6648r624r0985J61964j24107M9702q8995J45386
13293B93970j02383K18522j86628J75796K76339A35588e2904F2282K83138j22631
13283B22789l4975K25353a08918B50443b83434i325B81935G7760Q775K77373I0040
13271A58061f8188B22751H4673a07356E30686D1500M6865r996N6417J78928p8888
$$ y = [-28913, 21445, 113058, 76846, 349025, 359865, 158469, 194203, 295916, 232017, 169419, 464954, 197277, 194124, 370046, 34999, 74553, 399805, 149804, 512426, 429648, 330925, 261493, 320096, 286175, 289577, -7032, 149038, 232225, 417714, 208383, 76935, 27545, 302571, 694151, 158288, 408664, 466966, 364688, 287189, 49400, 542237, 257688, 172088, 272077, 516071, 347277, 250629, 241005, 150020, 311984, 187877, 237579, 148584, 293970, 191587, 410109, 223481, 399277, 675616, 135588, -52904, 62282, 345420, 222789, 187814, 413167, -108918, 250443, -283434, -9325, 281935, 77760, 86535, 363908, 90040, 158061, -68188, 222751, 84673, -107356, 530686, 41500, 88365, 78369, 134786, 313714, 234826]
13260B34826b89913B48417R7576j10450e4803B5410J59829c9415A55023C4872
13249A29459K05314E4677f5631A71883q2854R9274R0928K20260F6806g4505B55017
13237A32689j4542J35342J07088C309L99001j87246J56670j56302E926M28051
13227D33977C5106J4726i6061A46895K23748h587B17489J02050p8753D7073K6272
13216G3345b0306k08260R1047C64335A64742a8967A58689j4931n5800J02031P4714
13205B64703J16482D0332a45845A11982b33098R5777C6016K11517k353H2760P6638
13194A59398J7764a7066B93650E7353a29956e078A72484L60347k31920C7722A7379
13182a58430C35515B7406a67994q378f0865n5240A70169c3138B21691c8381A43719
$$ y = [234826, -289913, 248417, 345993, 235543, -54803, 25410, 185239, -39415, 155023, 34872, 129459, 334773, 54677, -65631, 171883, 89029, 188303, 279231, 499491, 66806, -74505, 255017, 132689, 118147, 253489, 360577, 3309, 402310, 215064, 371734, 215432, 5926, 433977, 35106, 49832, -96061, 146895, 370643, -8587, 217489, 319539, 240786, 47073, 73345, -20306, -228566, -137519, 364335, 164742, -18967, 158689, 143758, 87958, 189989, 264703, 381185, 40332, -145845, 111982, -233098, -137321, 36016, 247533, 245180, 82760, 159398, 177162, -17066, 293650, 57353, -129956, -5078, 172484, 532831, 300911, 37722, 17379, -158430, 335515, 27406, -167994, -176372, -60865, -116105, 170169, -33138, 221691, -38381, 143719]
13170a55219b8379j52700C17754b10649D22026a66968A52418J76958F5549d6820
13159A51211D297J48602J23374c5247A40378o6007j8628J49203b42351c1810A32692
13147E6895M5854a21120n3591A16553M00K75807a29037G3648J9210K31536c60166
13135A90925m1582a32860C3141D698J48732f0692A80891o9223C5334M2650M1477
13124A19461g2944B40996l4775b00477P0690D20238j5977I8344F470h8964P15
13113h8249L6211B16625J30105A42169P8410q3309b04523A57298b8623D09713
13102B83719A11124d4739A1735a38927c2064a4267B0031M69572D2648i3019G4696
13090H3598f1502A56934d6470j54533B45304b37883A18447a10766B1505e7588
$$ y = [-155219, -28379, -181079, 317754, -210649, 422026, -166968, 152418, 329376, 65549, -46820, 151211, 4297, 152899, 276273, -35247, 140378, 74371, 55743, 204946, -242351, -31810, 132692, 56895, 102749, -121120, -174711, 116553, 116953, 392760, -129037, 73648, 92858, 324394, -360166, 190925, 149343, -132860, 33141, 4698, 153430, -60692, 180891, 111668, 35334, 77984, 119461, -72944, 240996, 206221, -200477, -129787, 420238, 404261, 98344, 6470, -88964, -88249, -52038, 216625, 346730, 142169, 220579, 137270, -204523, 157298, -28623, 409713, 283719, 111124, -44739, 11735, -138927, -32064, -14267, 20031, 489603, 42648, -93019, 74696, 83598, -61502, 156934, -46470, -201003, 245304, -237883, 118447, -110766, 21505, -57588]
13079C03455d41803B3207L04225o458B4648b80612E5087a67263d0124B27415i935
13067H3865a23743A27600A8953P9859P2419j5602d5317C08484J17119j48099I4018
13055C04293A08795c025o8257A36658J04637a30603A78452M9943n2245o6582a35535
13043A29979C0464D379L76775A71651J24273d45505d5244j41412B95826a33220
13032a73335C40768A32433b4705B14698G6911n365J84063M930c1222G7142K44736
13021C21878R5805H6604l4696c0501l3261A35398F3719Q2636K48438a23393A6467
13009C78657i2914B54017K73168A67921L2959L9450j15104R801a7948o9591D3505
12997B7372b32792D3697J9164a54176O2726a595H9941D508J80299Q0243L9876
$$ y = [303455, -441803, 23207, 327432, 320974, 24648, -280612, 55087, -167263, -40124, 227415, -9935, 83865, -123743, 127600, 18953, 98812, 171231, 155629, -45317, 308484, 425603, 277504, 94018, 304293, 108795, -3025, -71282, 136658, 241295, -130603, 178452, 228395, 176150, 109568, -135535, 129979, 30464, 4379, 381154, 171651, 295924, -445505, -45244, -186656, 295826, -133220, -173335, 340768, 132433, -24705, 214698, 76911, 71546, 255609, 260539, -31222, 77142, 321878, 417683, 86604, 51908, -30501, -63762, 135398, 63719, 146355, 394793, -123393, 16467, 378657, -92914, 254017, 527185, 167921, 200880, 240330, 125226, 135027, -17948, -87539, 43505, 27372, -232792, 43697, 62861, -154176, -91450, -1595, 89941, 4508, 184807, 265050, 304926]
12986C04926B3398J7339K60666h479B19488l2058g7131G1957J6534C4115b77113
12974a24889F0938A2692J25898b00987G1353K3265i1429A39442m0126l1240a88213
12962C20306c0326B60926H9929d9835A94534b443A63500l225J10634m8338B249
12950a33664C441N9014J44938b04239C2171b4793j0898C39231r4750H7534c6323
12938D0001c2190A13186n3907J54076n4921b46170C61906j52663a8393p6706G9485
12926a3075A85301i4570r005K8042L0235C27379H6523g6910j31293D8506i7497
12914B33401j13535d334B8704A0783R0193N988e5688p2417c9125G1899K18180
12903B90079j44422D9643K7371a33168A87577b5864j91174B4643K49697i9854
$$ y = [304926, 23398, 40737, 301403, -8479, 219488, 187430, -77131, 71957, 88491, 34115, -277113, -124889, 60938, 12692, 138590, -200987, 71353, 94618, -91429, 139442, 99316, 68076, -188213, 320306, -30326, 260926, 89929, -49835, 194534, -2443, 163500, 160275, 270909, 222571, 2249, -133664, 3441, 62455, 207393, -204239, 32171, -24793, -35691, 339231, 244481, 87534, -36323, 40001, -32190, 113186, 59279, 213355, 158434, -246170, 361906, 209243, -18393, -95099, 79485, -13075, 185301, -94570, -103575, -75533, -45298, 327379, 86523, -76910, -208203, 48506, -97497, 233401, 119866, -4334, 28704, 10783, 100976, 106964, -55688, -128105, -39125, 71899, 290079, 145657, 49643, 77014, -133168, 187577, -25864, -217038, 24643, 274340, -99854]
12892a06836B1270b284k75994b7856J630A95773h2404a5144A46775b75981C37188
12880b23281Q9964A51807B2584d0154I8518L53399d6715A16259a75866e829B7133
12868d9924q8929f1417k49587B22670a76788i866F3587A7407J15226e7243l96363
12857d53606D6261L9532i4076E8001b65051g5660A38386k3705E2504K26681D0530
12845b6692L225G5791E994a85850A99891b91646a27310l9503e5618q0455G1995
12833F5441a58934B00279a82483o9993a3716p7528A50394i2499C6300a13311C38624
12821B95663A09233a11221B9640b06040c0309A16501a61799A16554J5146a8160
12810C43395a12953J5456n1892A3869b63085c284p6280B31057p7249h7519G3745
$$ y = [-106836, 21270, -2284, -278278, -27856, -26226, 195773, -82404, -15144, 146775, -275981, 337188, -223281, -133317, 151807, 22584, -40154, 98518, 451917, -46715, 116259, -175866, -5829, 27133, -49924, -138853, -61417, -311004, 222670, -176788, -9866, 63587, 17407, 132633, -57243, -453606, 46261, 85793, -94076, 58001, -265051, -75660, 138386, 114681, 52504, 279185, 40530, -26692, -23467, 75791, 5994, -185850, 199891, -291646, -127310, -166813, -55618, -136073, 71995, 65441, -158934, 200279, -182483, -252476, -13716, -91244, 150394, -92499, 36300, -113311, 338624, 295663, 109233, -111221, 29640, -206040, -30309, 116501, -161799, 116554, 131700, -18160, 343395, -112953, -97497, -149389, 13869, -263085, -3284, -79564, 231057, 153808, -87519, 73745]
12798C1541K43626E5391j101K03780A09314a1410m39168A69960B9918L03545h5497
12786E6600O989a23505D4028b75374G4783a67504I9789A0681e24116a74868C38061
12774a55414M283B35444q2475J40183d09813a73113j31593A4823M3972f915B76162
12762D6383J31475J10890n4127a29072F0758a02265L738m7698C4466K95109A15270
12750c80665a18674D9403N3548a05400E0759J48781n4868d11300A24535a37854
12739D2965m221H374b93144J14643B10899P2156J1639I2820P2185K8360d89146
12727A92118a68394B00691d6811C00433J17119l3808j53202g5758B80531I1789
12716C3220J01134N2720C0608J38217c5242m2098A92612I1093K0395E0339j2147
$$ y = [31541, 275167, 55391, 54290, 258070, 109314, -11410, -450578, 169960, 29918, 333463, -85497, 56600, 63589, -123505, 44028, -275374, 74783, -167504, 99789, 10681, -524116, -174868, 338061, -155414, -151131, 235444, 152969, 293152, -409813, -173113, -304706, 14823, 58795, -6915, 276162, 46383, 177858, 288748, 234621, -129072, 60758, -102265, -98527, -146225, 34466, 329575, 115270, -380665, -118674, 49403, 102951, -105400, 50759, 199540, 144672, -411300, 124535, -137854, 42965, 38744, 8374, -293144, -178501, 210899, 283055, 294694, 92820, 165005, 193365, -489146, 192118, -168394, 200691, -46811, 300433, 417552, 383744, 230542, -75758, 280531, 91789, 33220, 134354, 187074, 30608, 168825, -35242, -77340, 192612, 91093, 111488, 50339, 38192]
12705C8192J05329e31431D70351a53151F5666P0942a5090B59969a77576f618A77781
12693A22750K26301a67236A94693J8626c6563D1768b30798B063K2087J29147D5067
12681a81415A52945E7365A3086e3050A42677b9475a859l38931D2695P0989k0642
12670I3042b8548C4506R4669E1562L80887G1868J02960K90275H3268K62823A5365
12658A03526G489h6577B41070O4127O121c1796G5320e1370a7609F4750J56821
12647B21571a3470k259A57289J00297c4991k10249L5765G2482K54431o9287I7884
12635A7885a327l5660H3939b1041C3279j1796K93553E6995g5901k10565J14492
12624a71974k4454d627A26118A9377K36848d7174H8270n435j4894J28043f4469
$$ y = [38192, 143521, -531431, 470351, -153151, 65666, 136608, -15090, 259969, -177576, -6618, 177781, 122750, 349051, -167236, 194693, 213319, -36563, 41768, -230798, 2063, 24150, 153297, 45067, -181415, 152945, 57365, 13086, -53050, 142677, -29475, -1859, -340790, 42695, 113684, 93042, -28548, 34506, 129175, 51562, 432449, 71868, 174828, 465103, 83268, 346091, 15365, 103526, 7489, -86577, 241070, 305197, 311318, -31796, 75320, -51370, -17609, 64750, 221571, -13470, -15729, 157289, 257586, -34991, -245240, -209475, 72482, 326913, 257626, 97884, 17885, -1327, -36987, 83939, -21041, 33279, 21483, 315036, 56995, -75901, -286466, -171974, -196428, -4627, 126118, 19377, 256225, -47174, 88270, 82835, 67941, 195984, -64469]
12612D46609a04388L7655B21582c5434F1427K60034n2086b9311D7916R1982J99342
12601C39240A49435c7612o8095A02857K07273b27169a0917F1121b6386A76375
12590b55254A10094N2296a04270B27378c688A40922a38496b8860k57467f7256
12579b74394B86843j22380p130k4273D2732a60881d2471A9516g114A22544c77074
12567I9893b81196B27764o3382J94783k7942C4585K11873q5934C1729a72282C00411
12555g5443j84998a22735G3028b4981A76352m2164o4022a02128f795j68581c1683
12543A77267o5547b2786G6915R592a45354M0038D8834c6178m2772A82671b55209
12531a3855j02570E940f9779k04367d4161A37213D9866L10699A6831b38750a04006
$$ y = [446609, -104388, -66733, 221582, -35434, 61427, 321461, 269375, -29311, 47916, 139898, 339240, 149435, -37612, -105707, 102857, 310130, -227169, -10917, 61121, -26386, 176375, -255254, 110094, 162390, -104270, 227378, -3688, 140922, -138496, -28860, -286327, -67256, -274394, 286843, 164463, 157333, 133060, 42732, -160881, -42471, 19516, -7114, 122544, -377074, 99893, -281196, 227764, 164382, 359165, 331223, 34585, 246458, 160524, 31729, -172282, 300411, -75443, -260441, -122735, 73028, -24981, 176352, 134188, 70166, -102128, -6795, -175376, -31683, 177267, 111720, -22786, 76915, 86507, -145354, -105316, 48834, -36178, -78950, 182671, -255209, -13855, -116425, 5940, -69779, -274146, -44161, 137213, 49866, 360565, 16831, -238750, -104006]
12519C259b61261i7770j82662e8085j52912f5009A6566J11708J245D0665n104
12508C5561d4470C47600G2591l1599b25761a7708k68475a1696p1947L9446G7535
12496a21760N1440B20768B4474b644C08772r1982d6186C33534A06834j5256J09982
12485B01560E7194J24477a39768M6615C6841J64349G3350a66763F2936L6120i847
12473E3002a46479b7820B557J10542a00615B16085b38410A47159k4342g2413K8230
12462d4183k37756G9109A8936h0266k17842d3561H9499O4620h9355j57563B03549
12450A37033C149K79456b05605A05310a6040l43225a23813l5524i204j0552I7704
12438a5717k9032F2009g4259A42899a11964k34846f6307F6308J41508M1060A00938
$$ y = [3259, -261261, -97770, -280432, -58085, -210997, -65009, 16566, 128274, 129519, 40665, 35561, -44470, 347600, 72591, 40992, -225761, -17708, -286183, -11696, -83643, -44197, 77535, -121760, -70320, 220768, 24474, -2644, 308772, 216790, -46186, 333534, 106834, 91578, 201560, 57194, 181671, -139768, -93153, 36841, 201190, 73350, -166763, 62936, 99056, -9847, 53002, -146479, -27820, 2557, 113099, -100615, 216085, -238410, 147159, 122817, -72413, -44183, -281939, 79109, 18936, -80266, -298108, -43561, 89499, 154119, -89355, -246918, 203549, 137033, 3149, 282605, -205605, 105310, -16040, -359265, -123813, -159337, -9204, -19756, 97704, -15717, -44749, 62009, -74259, 142899, -111964, -346810, -66307, 66308, 207816, 248876, 100938]
12426B12257f452r7491k55451A4854f7804A25867a51257B04575b54167Q6154E2079
12414b19137e0275I4407k8073a32937q091j63146A01043m6866b3042j2888H6168
12402A84168b89001A5970Q666a62039k0171Q5559j18536I4170g6535l56m4107
12391a20998A54548b90158G0440R0885e2704D8033J18377a70325A37782b8423
12380A30194J9819A514O6048K71570i8862A05249D2714c08066a939r9120D5739
12368A91308a2391o2167A59694J25312n3298l0176b20525e7998a4595j78183D7271
12356a655A02362B2465a67636B0778g9959J2730A32745J26934b1393l0792l88311
12345d40496h4427B09772h7703A24457a57610L8357A57222M9933N8233c27715
$$ y = [212257, -6452, -103943, -359394, 14854, -67804, 125867, -151257, 204575, -254167, -168013, 52079, -219137, -50275, 94407, 66334, -132937, -141028, -304174, 101043, 54177, -23042, -35930, 86168, 184168, -289001, 15970, 24636, -162039, -182210, -96651, -215187, 94170, -76535, -76891, -120998, 154548, -290158, 70440, 161325, -52704, 48033, 166410, -170325, 137782, -28423, 130194, 150013, 1514, 67562, 339132, -98862, 105249, 42714, -308066, -1939, -101059, 45739, 191308, -12391, -74558, 159694, 285006, 231708, 201532, -220525, -57998, -14595, -192778, 47271, -1655, 102362, 22465, -167636, 20778, -79959, -67229, 132745, 259679, -21393, -52185, -440496, -84427, 209772, -87703, 124457, -157610, -119253, 157222, 207155, 265388, -327715]
12334a4931j26034C7718K06994b63420J15417A08313e7543D7952Q314J51193a06433
12322C11696j37154P4144c60388a28647B49875O759G7230K58304Q28A28087K9334
12311A57421E972K21686c9177B01406N9976A22039K29987F2363d4595F8952K02089
12300B71041J35154A1378J92519a94737C77526L5970c7794j70169H6758j9167
12290F7591h4562B00286m4151c5430A25359h3882j58671A20038L2204M9936k3858
12279A78320H8245J38326N3556A15440J01241K25669k07804p4717O1581j508b09517
12267c6623C27787f1760j68679C66289K11626k55842j21414o0161g5730C3219
12256a13832B51617K5400j6216D4781J6468b8720I8292a4400I6769d1603A6305
$$ y = [-14931, -140965, 37718, 244712, -263420, -148003, 108313, -57543, 47952, 56266, 207459, -106433, 311696, 174542, 248686, -360388, -128647, 249875, 256634, 77230, 335534, 336362, 128087, 157421, 5972, 227658, -39177, 201406, 261382, 122039, 352026, 62363, -44595, 68952, 271041, 406195, 11378, 203897, -194737, 377526, 413496, -37794, -207963, 86758, 67591, -84562, 200286, 156135, -35430, 125359, -83882, -242553, 120038, 152242, 202178, 178320, 88245, 226571, 280127, 115440, 216681, 442350, 234546, 159829, 221410, 219902, -209517, -36623, 327787, -61760, -230439, 366289, 577915, 322073, 200659, 140498, -75730, 33219, -113832, 251617, 277017, 260801, 44781, 61249, -28720, 98292, -14400, 96769, -41603, 16305]
12244d6537A94605n8582C9083P3836J27926a23113m7605H8287L63263e8179M077
12233e4102j9243k3970G5214a94393D32910a73017N4728B02352P2745A29020i3750
12221H9111c5774D17068H6001a7393l38624H6325D0488a3344B86202b86164a5088
12209A27313J0153J90212A04301a93980H3746C499L78800B6195b48899C8968b5589
12197I6244L42762A55998h2809A35477J08890o3003E2969L35050p6527A32286
12186a21069j5238A01703L31263j23578j40214N1208r2562L4795J51195j24378
12176A89432J17064G4130J2129L80630j97922I5718M1507L40314k05741h4368
12165B8528h2144a443q7416B38313F8071g887l5723H9389a33899C63281D3550
$$ y = [-46537, 194605, 136023, 39083, 112919, 240845, -123113, -170718, 88287, 451550, -58179, -54102, -73345, -97315, 75214, -194393, 432910, -173017, -118289, 202352, 275097, 129020, -93750, 89111, -35774, 417068, 86001, -17393, -356017, 86325, 40488, -13344, 286202, -286164, -15088, 127313, 137466, 327678, 104301, -193980, 83746, 3499, 382299, 26195, -248899, 38968, -25589, 96244, 439006, 155998, -82809, 135477, 244367, 181364, 52969, 388019, 311492, 132286, -121069, -136307, 101703, 432966, 309388, 169174, 220382, 127820, 162615, 313810, 189432, 306496, 74130, 86259, 466889, 268967, 95718, 137225, 477539, 271798, -84368, 28528, -82144, -1443, -88859, 238313, 68071, -7887, -43610, 89389, -133899, 363281, 43550]
12153a84012b3759B07828P3875m6648F0800L00361H2996K66663A06601j5802L40167
12142D30966g4199k48739I3147O7411E7091P9228L3181o204J3623o4409J2149
12131A24659K30939G3785K45435g3499A50876f5406P515B10176n3550n3226e9635
12119f8840H8945f4163A46741a77697C73722G1757N6890c12945D14388L2015B09459
12107d718o690A26700Q3223C8278P2024c4961C0717K42040j11787K63511A64100
12095a82715I4797K46151a3834k38409a4819H2770N78004C17117a51469A92344
12084B78653j15563g0770G0331J6475K51018A65113m7974b06584A2216L6770P1301
12073A20287d862m4020A02809K06404F384L66473F567a22333m7595A11201R4514
$$ y = [-184012, -23759, 207828, 281703, 235055, 60800, 361161, 82996, 349659, 106601, 90799, 430966, -74199, -322938, 93147, 160558, 57091, 136319, 169500, 163296, 176919, 112510, 124659, 355598, 73785, 319220, -73499, 150876, -65406, -57891, 210176, 156626, 103400, -59635, -68840, 88945, -64163, 146741, -177697, 373722, 71757, 128647, -312945, 414388, 446403, 209459, -4718, -11408, 126700, 209923, 38278, 110302, -34961, 30717, 272757, 160970, 424481, 164100, -182715, 94797, 340948, -13834, -252243, -14819, 82770, 660774, 317117, -151469, 192344, 278653, 163090, -70770, 70331, 86806, 337824, 165113, 117139, -206584, 12216, 48986, 120287, -4862, -48882, 102809, 309213, 6384, 372857, 6567, -122333, -169928, 111201, 205715]
12062B05715A0133M8133i3894I0144a1535l9683C02646J85961A67011a3467B8864
12050a280r2471H5217b6002A55604p2126a02358j93185a13732M0352o4179A45054
12038a75888N6353A0921R0134L2476o4597R6117k2182J66956a67060C767a6322
12026A13882J59569I1220J00381G5282q267e1668k73624B86562e5498j4906A16074
12014a77592B64657a08790e109A94000G7622K41502i6784B03740G6513c4899j9355
12003e4254P230A85960p7894K0898a25236H7057K3529L36779E1014b04542A36130
11991A95369f7968i374B73890b00317Q0071j06963R7580k43103d4328k63147B82542
11979A36140F0954K27356e3772C20633c89363O2176J44581A80442p6849d95171
$$ y = [205715, 10133, 58266, -93894, 90144, -11535, -51218, 302646, 488607, 167011, -13467, 28864, -1280, -93751, 85217, -26002, 155604, 83478, -102358, -295543, -113732, -73380, -137559, 145054, -175888, -119535, 10921, 101055, 133531, 68934, 165051, 142869, 309825, -167060, 3767, -16322, 113882, 273451, 91220, 191601, 75282, 67015, -51668, -325292, 286562, -55498, -70404, 116074, -177592, 264657, -108790, -5109, 194000, 77622, 319124, -96784, 203740, 76513, -34899, -54254, -47024, 185960, 108066, 128964, -125236, 87057, 110586, 447365, 51014, -204542, 136130, 195369, -67968, -9374, 273890, -200317, -120246, -227209, -129629, -372732, -44328, -307475, 282542, 136140, 60954, 288310, -53772, 320633, -389363, -327187, -182606, 180442, 103593, -495171]
11968b22578B78419l1277D0559O8949P5490J1910C3435L96610f6859r8197B8333
11956a76747h392H7497c3484I0626J21370d8036B13351d7363l31778a53487D9580
11944f4485k7731A81152J8141a00340p7329A81969i1629E1852d7790B43417o9999
11933A73418a70671L4622Q156B25972a23505f1326J0412p3818B42521b0727j66978
11922a87705A22116C9653a39342A54532N4747l6219l3399i4887M3892j02583A58474
11910b2484A77404n1352L0490a29060K5946D77871D9899b4607C9541a10616A85017
11898H7937C1052a50753C00172A11687a501j01002j07450A59672E281P1966b09484
11886h3274D33210a08122A5543K37621O5607g8679l5946I6535l0503J09847a89513
$$ y = [-222578, 278419, 247142, 40559, 109508, 184998, 196908, 33435, 430045, -66859, -165056, 28333, -176747, -8392, 87497, -33484, 90626, 211996, -48036, 213351, -47363, -379141, -153487, 49580, -64485, -92216, 181152, 199293, -100340, -177669, 181969, -91629, 51852, -47790, 243417, 173418, -170671, -136049, -127893, 225972, -123505, -61326, -50914, -124732, 242521, -20727, -187705, 122116, 39653, -139342, 154532, 209279, 173060, 139661, -94887, -50995, -153578, 158474, -22484, 177404, 126052, 156542, -129060, -103114, 477871, 49899, -24607, 39541, -110616, 185017, 87937, 31052, -150753, 300172, 111687, -1501, -102503, -209953, 159672, 5281, 77247, -209484, -83274, 433210, -108122, 15543, 253164, 318771, -78679, -114625, 96535, 66032, 175879, -189513]
11874b10753N0338J8087B43202a14967j06743H8241b24669a06005b4130j03841
11864a27971E0360R0112c1933o3435j26555o9157A29084K89165A28281c73957
11853D2691b97311d2512C1335c64312a30719D072J0484g4707c3290A21892a0935
11841G3148d98408K33866A05362N2740b20316O8312a7062j48940A8520a6528j77722
11830a94250B42776f112F0782a47108K4653J7078B22602A9513b68767A38579b73435
11818B997b94028C09781j34128C6656a74117I7544c08966d0118k9985a5958A81785
11806i033D90650c17949f6930H54f2518a2301j79690M3924N5887C98063j98033
11795B00030E6965L7387A94b27599A21154c00309A09682a89359A12025K64338
$$ y = [-210753, -160415, -142328, 243202, -114967, -221710, 88241, -224669, -106005, -24130, -127971, 50360, 140472, -31933, -95368, -221923, -291080, 129084, 418249, 128281, -373957, 42691, -297311, -42512, 31335, -364312, -130719, 4072, 14556, -74707, -33290, 121892, -10935, 73148, -498408, -264542, 105362, 158102, -220316, -152004, -17062, -166002, 18520, -16528, -194250, 242776, -6112, 60782, -147108, -122455, -105377, 222602, 19513, -268767, 138579, -273435, 2997, -294028, 309781, 175653, 36656, -174117, 97544, -308966, -40118, -70103, -15958, 181785, -9033, 490650, -317949, -66930, 854, -62518, -12301, -191991, -148067, -92180, 398063, 200030, 56965, 94352, 194, -227599, 121154, -300309, 109682, -189359, 112025, 376363]
11785C76363B0476Q2544J87842a96435D4301J41623a73514A85332a11229p6851
11775a88080h7431A09950h6181j85700C0397c0137m12230I1107L562j9471b91280
11763i7253A13414r236i335j31120e453C6721b52612b1785d749D6855e9691A65474
11750A90511G4408i2217A76244c115B5899b70918a30738H7226a32482G7547R9032
11739A76579L9585e459B32297c26156g0430A39108a56556B11295a72309N4095
11729a18214d0443C2962h6553k1756B60538L0125b36374n1319A60531M8330o9597
11718A39264k4978E6807J75043e0157k6168o9410A41189R2863I9350a41666j66292
11707c07958P4592j8185G7564L1664N7690B9061e149A15999b64947A25459a39044
$$ y = [376363, 20476, 103020, 290862, -196435, 44301, 185924, -173514, 185332, -111229, -188080, -87431, 109950, -86181, -271881, 30397, -30137, -442367, 91107, 94669, 75198, -291280, -97253, 113414, 104178, -9335, -140455, -5453, 36721, -252612, -21785, -4749, 46855, -59691, 165474, 190511, 74408, -92217, 176244, -3115, 25899, -270918, -130738, 87226, -132482, 77547, 176579, 216164, -5459, 232297, -326156, -70430, 139108, -156556, 211295, -172309, -118214, -40443, 32962, -86553, -108309, 260538, 290663, -236374, -287693, 160531, 208861, 139264, 114286, 56807, 231850, -50157, -76325, -145735, 141189, 234052, 99350, -141666, -307958, -233366, -251551, 77564, 109228, 166918, 29061, -5149, 115999, -264947, 125459, -139044]
11695B27923B6003P5509j1748h6406c2751G8822e0517A51329e9897j43441C30544
11683D0181J70111f3971I9183h7389D10335A94950O7592n4936q3215A823J76048
11672A77871e66j08187M1329A67373D4581a06399p111L6909A4971b35875I7913
11660C1045Q9366E5580P3032J50292c61989C37083e9948A0176a65865C6250c62035
11648F1319C0244a7623k75115I0448b40848C23867F7083a239k05889A7413a8493
11636B57675I9214J73730b87872R8734j16181C885d80840a9359A24931g8226A8417
11624b33936A42525a56915M732r0872F2379b3030n6516E03295A12332n063a56354
11612e4188B31838a59555L6683B56386d7137A41656n3321b00443j1312A42513
$$ y = [227923, 26003, 101512, 89764, -86406, -32751, 78822, -50517, 151329, -59897, -203338, 330544, 40181, 210292, -63971, 99183, -87389, 410335, 194950, 262542, 207606, 124391, 1823, 177871, -566, -108753, -67424, 167373, 44581, -106399, -113510, -76601, 14971, -235875, 97913, 31045, 120411, 55580, 128612, 278904, -361989, 337083, -59948, 10176, -165865, 36250, -362035, 61319, 30244, -17623, -292738, 90448, -240848, 323867, 67083, -1239, -207128, 17413, -18493, 257675, 99214, 272944, -287872, -189138, -305319, 3885, -480840, -19359, 124931, -78226, 18417, -233936, 142525, -156915, -152183, -243055, 62379, -23030, -79546, 503295, 112332, 107269, -156354, -54188, 231838, -159555, -122872, 256386, -47137, 141656, 88335, -200443, -211755, 142513]
11601b7318j05171O63J9554A11957k5474Q155J1002H276a39603a0045n3622a8774
11588H0186j1309K45893q742p7976g6999k84381B34037A5821L04127M7094F5385
11576b63820I7727P7732q1400A9252J09028h3025k15287D4749N6473l4827L00009
11565C66404C3708M465c11686h3460A37386c30360A74849J4363a59130B7122P5850
11554A02972f6669A96209M0827h7004C90269A6411O5185b31936J12856m8658D8910
11542H6311M37751h7244M065M642C18961b7707R241j03710A38987a13451C96360
11530c47535b7546j83771B74355a55811A91111C5468K08775D6414c45107B813
11519a54808L1350G6307a27387A91091H0363C814j491f0129r976A11719J41210
$$ y = [-27318, -132489, -131826, -112272, 111957, 86483, 94638, 105640, 8276, -139603, -10045, -63667, -18774, 80186, 68877, 314770, 306028, 228052, -76999, -361380, 234037, 15821, 319948, 367042, 65385, -263820, 97727, 175459, 94059, 19252, 128280, -83025, -298312, 44749, 101222, 66395, 366404, 33708, 38173, -311686, -83460, 137386, -330360, 174849, 189212, -159130, 27122, 102972, -66669, 196209, 237036, -87004, 390269, 16411, 81596, -231936, -119080, -167738, 48910, 86311, 524062, -87244, -83179, -78537, 318961, -27707, -18466, -122176, 138987, -113451, 396360, -347535, -27546, -211317, 274355, -155811, 191111, 35468, 244243, 46414, -345107, 2813, -154808, -123458, 76307, -127387, 191091, 80363, 3814, 2323, -60129, -70105, 111719, 252929]
11508B52929r4894N7728j3813n9391F7641J37707J4760R5511a03414a2008j18875
11497a30883B19604E7113d1220A47492a61944I4331K5629a2967B69042j29807
11487A39235L07370H7481K53914J55679A64901M0271j1574K67592A15198L3053
11477A48251K20917j35594d7503B28970L2060I6894D959K27913p4482J07743j06187
11466A59946l3109j2811h533C18103a3724n539B88566F332K62144f5140d118H2578
11453B08143E3723b527B74688h6334A07110k0974J83963J42749B0958J51948a47812
11441A92464H7243c46030d2894A27712J20442J1247a80064A66076J72217C5191
11430A9206J79062j8736K0664j9476n3773n8734d6989A00248m9668b14459b1511
$$ y = [252929, 158035, 215763, 201950, 142559, 67641, 205348, 220108, 315619, -103414, -12008, -130883, 219604, 57113, -41220, 147492, -161944, 94331, 119960, -12967, 269042, 139235, 446605, 87481, 341395, 497074, 164901, 205172, 193598, 461190, 115198, 148251, 369168, 233574, -47503, 228970, 261030, 96894, 4959, 232872, 158390, 266133, 159946, 126837, 114026, -8533, 318103, -13724, -19263, 288566, 6332, 268476, -65140, -4118, 82578, 208143, 53723, -2527, 274688, -86334, 107110, 86136, 270099, 412848, 20958, 172906, -147812, 192464, 87243, -346030, -42894, 127712, 248154, 259401, -180064, 166076, 338293, 35191, 19206, 198268, 179532, 200196, 180720, 126947, 68213, -46989, 100248, 50580, -214459, -21511]
11418b10243Q1509M6419j66633d6815j4782k38739A5726a98913L3805G4486R7707
11407A72193E5099a30540G8917M2511L8884b04668a6909k83740J25108d354B1115
11395d1179B32517a43900f9427B42959B931b14757o334E2671c503j74628B80110
11383I4750m0749a44989j5761A52693P8460f1782d858A69660K00337A62046D2393
11371A23902c96963A63287f1462j54574F6740K43050G9955h3543A05458a33730
11360G9891b82951M7668A3336a09073B98734H0716a44251C9044r700J06998a89330
11348a06197j88883a39289j31493H88J421K4210e7261A23759d77886A38280a05307
11336h3207B97365a22723j4941a3803A05354a1565B3677d758B0300a5714j47852
$$ y = [-210243, -128734, -82315, -248948, -46815, -61597, -300336, 15726, -198913, -165108, 74486, 172193, 55099, -130540, 78917, 121428, 160312, -204668, -16909, -300649, -175541, -4354, 21115, -41179, 232517, -143900, -69427, 242959, 2931, -214757, -221091, 52671, -3503, -178131, 280110, 94750, 54001, -144989, -160750, 152693, 231153, -61782, -4858, 169660, 369997, 162046, 42393, 123902, -396963, 163287, -61462, -216036, 66740, 309790, 79955, -83543, 105458, -133730, 79891, -282951, -235283, 13336, -109073, 298734, 80716, -144251, 39044, 29344, 136342, -189330, -106197, -295080, -139289, -270782, 888, 2309, 26519, -57261, 123759, -477886, 138280, -105307, -83207, 297365, -122723, -137664, -13803, 105354, -11565, 23677, -4758, 20300, -15714, -163566]
11325a63566B51214a81840f8817H8714a5780A48898J25766b27419d5355h389H7908
11313A41708c21374A62013c45161a8163E1832J49742b100l5925n1531q0227A02224
11301a45875A66319p6534m217j0882K01530A35406d6704B07858a57018j1634H1658
11289a96536A60870C3829j465a65743B11357H5037a49329G155i4026m9297A9487
11277h6973o305D6295K93541a8269k37535J07036l6333E1459b09412c6434G3622
11265b9994B27587c983n4172j49428C8405b23633A0484K3485b59048B04773b87285
11253A28807P0463c06034C5854J01228j6239a58566f8275D47205n1829c5533B30196
11241c9690k09013c8484f688j80500i0392E8227a10745A32100a10455B75103b98952
$$ y = [-163566, 251214, -181840, -68817, 88714, -15780, 148898, 274664, -227419, -45355, -8389, 87908, 141708, -321374, 162013, -345161, -18163, 51832, 201574, -2100, -38025, -89556, -169783, 102224, -145875, 166319, 89785, 85568, 74686, 276216, 135406, -46704, 207858, -157018, -168652, 81658, -196536, 160870, 33829, 32364, -165743, 211357, 85037, -149329, 7155, -94026, -143323, 19487, -86973, -93278, 46295, 339836, -18269, -255804, -148768, -185101, 51459, -209412, -36434, 73622, -29994, 227587, -3983, -58155, -207583, 38405, -223633, 10484, 33969, -259048, 204773, -287285, 128807, 199270, -306034, 35854, 137082, 120843, -158566, -68275, 447205, 395376, -35533, 230196, -39690, -248703, -38484, -6688, -187188, -90392, 58227, -110745, 132100, -110455, 275103, -298952]
11229a65239e9112j82371j26782J46020A7276J46343a45314d8336f763F2645M7620
11218A10265b63195M0326A14883i1153n0548b9304I8250a8768F8890b78509B17472
11206B56301h7027B18689c8313A15056N4436a99976O6939A8881h0468j30781J02772
11195a08477A42750b725k25153c5754A84298c6668B13418J1743E9575c8840G5189
11183d17170F0980g7867m7312A39272a69434O7724q3299G9919a35196k40776A77503
11171a82071I7276j207K06503a34031l1823b8562j54506I9192c42420A44333n7999
11160H6334C5562a31833J5278j30774K4550b9361l48669h6922J6681B02418b41627
11148h0969A64194a12180H2869e1697A18124a31239l38252E0784e4138G7230C1863
$$ y = [-165239, -59112, -241483, -368265, -222245, 17276, 163619, -145314, -48336, -6763, 62645, 110265, -263195, -222869, 114883, -91153, -141701, -29304, 98250, -18768, 68890, -278509, 217472, 256301, -87027, 218689, -38313, 115056, 169492, -199976, -133037, 18881, -80468, -211249, -108477, 142750, -2725, -227878, -35754, 184298, -36668, 213418, 225161, 59575, -38840, 75189, -417170, 60980, -77867, -125179, 139272, -169434, -101710, -185009, 79919, -135196, -375972, 177503, -182071, 97276, 96069, 302572, -134031, -165854, -28562, -183068, 99192, -342420, 144333, 86334, 35562, -131833, -116555, -247329, -222779, -29361, -378030, -86922, -70241, 202418, -241627, -80969, 164194, -112180, 82869, -51697, 118124, -131239, -469491, 50784, -54138, 77230, 31863]
11136b86602c2461C5537f321A9261a11165A527a75171J4941g1283n1844i946j79200
11124a89146c8871k23112c5760r1178A34583c5393A88855J55214a74984B65337
11113i286p316j14030N6369A3770M3863a83641B06720R0631a45014A42969J38048
11102B81017a33331A22424b19747C5468b38731f9368E955K35284a08172d5326
11091e5715D6412p833J70384H7954J15660a39192B7481e1671B55305K71850B05700
11079A37577J42168P7849j03633k4751f7919H0530L5271K96997c1630B08500q621
11068A99879H3714N15183B70736l3464R9104a70259A10244J02772B2791K58992
11058B81783p8753K4579c5900D78089j69440j5358C964L08285L3026M5940j27508
$$ y = [-286602, -32461, 35537, -6321, 19261, -111165, 1527, -175171, -160230, -71283, -123127, -9946, -189146, -38871, -261983, -35760, -126938, 134583, -35393, 188855, 344069, -174984, 265337, -9286, -16602, -130632, -74263, 13770, 57633, -183641, 206720, 297351, -145014, 142969, 281017, -133331, 122424, -219747, 35468, -238731, -69368, 5955, 241239, -108172, -45326, -55715, 46412, 38579, 208963, 87954, 203614, -139192, 27481, -51671, 255305, 527155, 205700, 137577, 279745, 357594, 253961, 229210, -67919, 80530, 115801, 412798, -31630, 208500, 199879, 83714, 598897, 270736, 237272, 336376, -170259, 110244, 213016, 22791, 281783, 203030, 227609, -35900, 478089, 308649, 293291, 3964, 312249, 345275, 391215, 263707]
11047B63707Q1424P0083Q73J01199k21663J59998R6102B46631J2722L53126O7119
11036F79598k9546J57013k60825j66593L39131j11693J65419o2709k1000O093
11026F94888K08199P2194k27891K49954k85042l1794K14354M7127k01182l1453
11016G09354r0301J22687j15994Q1690N6214k03092L6240k66780M8412L24823
11006G03253r5381j75553O8253K61702j53227J22769l05302L07479j79266k4067
10996E30660M1324J22294J78841k06458r2090Q8913M6339A66640R73392m33957
10986G06075m8375j82177J37820j77829J31448k80896L69798M05807m94130K89842
10976H57383m10281j77791M52823L0132k67737L66358k4052J02918m3959J67298
$$ y = [263707, 345131, 415214, 416087, 517286, 295623, 455621, 551723, 246631, 259353, 612479, 679598, 650052, 807065, 546240, 379647, 718778, 607085, 772504, 709795, 688795, 694888, 903087, 975281, 747390, 997344, 712302, 680508, 894862, 941989, 740807, 709354, 619053, 741740, 625746, 707436, 763650, 560558, 596798, 330018, 378430, 703253, 607872, 432319, 500572, 762274, 609047, 731816, 426514, 733993, 554727, 530660, 571984, 694278, 873119, 666661, 574571, 663484, 709823, 166640, 1140032, 706075, 657700, 475523, 613343, 435514, 566962, 286066, 655864, 1061671, 567541, 857383, 447102, 269311, 722134, 752266, 484529, 850887, 826835, 929753, 885794, 1053092]
10966A053092l29875N2088J14610l0671M96890j72805m2122K79477M12640j02078
10956A731246P8198O74022j31121K69542p8817P752o02674L77462l27622L2968
10946B030956k11262k74512K03533n24397L49288j14233q5661J03757j13249K06521
10936A570741j49285k87727n4368l2792k10749n9033q0405j96280k8256l5023
10926D36823k10617Q2166J72961I3023k7828N8907n8917J2918A2267J01487P9139
10915A92893q9509L08754F1097J45837P343o276c6248A05362a11584C43607a81574
10903f1713G4106J59754b40086i1495H1154a57764a5997A0772h0635d0314D4339
10891b08609A10972e0397n6218q5832d7950D0535d23809a08232M4673A8785a05568
$$ y = [1053092, 723217, 775305, 889915, 859244, 1356134, 1183329, 1141207, 1420684, 1833324, 1731246, 1809444, 2483466, 2352345, 2621887, 2543070, 2550822, 1948148, 2325610, 1997988, 2030956, 1819694, 1545182, 1748715, 1224318, 1573606, 1459373, 1373712, 1477469, 1364220, 1570741, 1421456, 1133729, 1079361, 1046569, 835820, 776787, 696382, 500102, 471846, 436823, 226206, 308372, 481333, 93023, 65195, 124102, 65185, 78103, 12267, 113754, 192893, 103384, 412138, 61097, 206934, 214277, 208001, -36248, 105362, -111584, 343607, -181574, -61713, 74106, 233860, -240086, -91495, 81154, -157764, -15997, 10772, -80635, -40314, 44339, -208609, 110972, -50397, -106615, -192447, -47950, 40535, -423809, -108232, -63559, 18785, -105568]
10879a9306j1502p9170M6187k8156I2681J70197D812b12699m871J03766k28179
10868c41983J45867A94222J14575A27359m1168h4085A4460J14953M5503a1268
10857b15219B0346e9826K1161j1668m2521j5646B22162a1196l30407e460k34062
10846b39522L5504A0030a98738k38073m3947A23660F1567a82996M1468a8397A43230
10834I6988L3251F3963B3666a18137k6917l9961A415P8434b1982G9148c77123
10822a04647B9770J3844a17170c5149A17257n8435J47233c1426F134L0741O0791
10811I7666K83361H0772c32736i7432K0665b6485A27402a00434M2599j12028A1146
10799H1704c1404k43041H0562c19881a4609j72995F4884h9543c4802c618A48833
$$ y = [-19306, -30808, -109978, -63791, -91947, 92681, 262878, 4812, -212699, -217570, -113804, -341983, -196116, 194222, 308797, 127359, 86191, -84085, 14460, 129413, 174916, -11268, -215219, 20346, -59826, -38665, -50333, -92854, -108500, 222162, -11196, -341603, -5460, -239522, -204018, 10030, -198738, -436811, -480758, 123660, 61567, -182996, -141528, -18397, 143230, 96988, 130239, 63963, 23666, -118137, -145054, -185015, 1415, 79849, -21982, 79148, -377123, -104647, 29770, 43614, -117170, -35149, 117257, 58822, 206055, -31426, 6134, 36875, 97666, 381027, 80772, -332736, -97432, -76767, -26485, 127402, -100434, -57835, -169863, 11146, 81704, -31404, -274445, 80562, -319881, -14609, -187604, 64884, -89543, -34802, -3618, 148833]
10787a81358a1802o1496H4034b5698p1182A14343M4966A3013J7974o489a80004
10775A06797a50243I2064b32157h3807r7574D5178f5049A7398c06236C00747a78544
10763b38121j88523e4916k22067i473j14711L7548F0714J31812n6516e03750I2437
10751A71931g6647G801J60982c35016b4908j02985j3239N0532I5088d14187a63495
10739i269A58731K7797N0897h9831c9565l53489A84744m0275J3518b53705d5279
10727F560L3902A1833K38707a02185C76499b03069c7687k26630i9351j42126D16808
10715b54573O422a7237j01474K2300j61018A54565a33982A3690c5650A92532c73892
10703H1181a72097c7728A17337M219Q447b20184k61235a18630A83615q0273a98291
$$ y = [-181358, -11802, -73298, 84034, -25698, -96880, 114343, 159309, 13013, 30987, 24498, -180004, 106797, -150243, 92064, -232157, -83807, -181381, 45178, -65049, 17398, -306236, 300747, -178544, -238121, -426644, -54916, -276983, -9473, -124184, -86636, 60714, 192526, 136010, -503750, 92437, 171931, -76647, 7801, 168783, -335016, -24908, -127893, -141132, -90600, 95088, -414187, -163495, -9269, 158731, 186528, 237425, -89831, -39565, -393054, 184744, 144469, 157987, -253705, -45279, 6560, 40462, 11833, 250540, -102185, 376499, -203069, -37687, -264317, -99351, -241477, 416808, -254573, -248151, -17237, -118711, -96411, -257429, 154565, -133982, 13690, -35650, 192532, -373892, 81181, -172097, -37728, 117337, 121556, 130003, -220184, -481419, -118630, 183615, 103342, -198291]
10691B32634e3290K4671l10736a36150j38526J15090m05553A7778h3749c1617
10680b76421a26770A41859a13656b177k61910D3559D61i4097j0115A06168f3577
10668C2786c42019A28235c2575j31183C9849b98954n3933B33273a13915q8226
10658b02141j07053A51635O8546I3266B3877f9316L303A10732J08210b65386O7088
10647a98298k25237h8567J6095B9486J98934E3379c206p5966A13367Q5888q4652
10636A14603k7612M2246b21353b2547q0433c6148k71343g2728k31002c5202F3519
10624a20533F7853o39c53877e005p5790q2725N4708j44889d4288k90733J14947
10613b20074a3381A30941h358k25984j31393F36243a87367d5609F166b01602j54272
$$ y = [232634, -53290, -28619, -339355, -136150, -274676, -159586, -565139, 17778, -83749, -31617, -276421, -126770, 141859, -113656, -2177, -264087, 43559, 461, -94097, -104212, 106168, -63577, 32786, -342019, 128235, -32575, -163758, 39849, -298954, -352887, 233273, -113915, -202141, -309194, 151635, 220181, 93266, 23877, -69316, -66013, 110732, 218942, -265386, -198298, -423535, -88567, -72472, 29486, 228420, 53379, -3206, -79172, 113367, 199255, 114603, 86991, 129237, -221353, -22547, -102980, -36148, -307491, -72728, -303730, -35202, 63519, -120533, 67853, 67214, -353877, -5005, -80795, -163520, -108812, -253701, -44288, -335021, -220074, -13381, 130941, -8358, -234342, -365735, 636243, -187367, -45609, 6166, -201602, -355874]
10602c55874g014k91949h9299j63480A77057a20665A9168a99895L2337L543G0432
10590H5613d5704B73054o3429a08772H3678a19568A48608n5599a37150L990O847
10579a26313B1639J97479A0350c95299h4102k25457C6543a9131A54730d3245b1071
10567A13004k2107L9341o1434K1140a26118q0139B27674h0779b9407A00521M629
10556A05150a70892I3293b50340d899q9823A89429b23521B46530g6800k99347
10546c76147a3566l5186F3707e8331C2679A3596g2751P786m3374A15127b37568
10534B27525b6452A8377b25900b1364A36992n0469A8119J3522P572P9050N2262
10523A70525a55166d7646A97822b10402d9476j75186m6697e7908j31062A42894
$$ y = [-355874, -7014, -298963, -89299, -252779, 177057, -120665, 19168, -199895, -167558, -164015, 70432, 85613, -45704, 273054, 209625, -108772, 83678, -119568, 148608, 93009, -137150, -133160, -126313, 21639, 219118, 10350, -395299, -84102, -309559, 36543, -19131, 154730, -43245, -21071, 113004, 90897, 130238, 68804, 89944, -126118, -206257, 227674, -80779, -29407, 100521, 105150, -170892, 93293, -250340, -4899, -94722, 189429, -223521, 246530, -76800, -376147, -13566, -48752, 63707, -58331, 32679, 13596, -72751, -64965, -108339, 115127, -237568, 227525, -26452, 18377, -225900, -21364, 136992, 86523, 18119, 31641, 39213, 118263, 170525, -155166, -47646, 197822, -210402, -49476, -224662, -271359, -57908, -188970, 142894]
10512i5988c0062m33551a32233B60518a16646j15531B67431L1994A7425b29639
10501C9479a28513L558A275b5132n0549A98722a73908Q1537B29169I517e6797
10489d90343D5873F918J3549d0296j09942L7304A0380b20049k5853d1987A65028
10477i5196D7470b64721N4978A03243b55594d6366p8007C4799a47912N6503c740
10465b28005A39090A4801a03982E60688A3021K88402J0365j32249L9211i4806
10454d04832A01223d856k31897b495k38964A58486k8707b03362A81757q002f6763
10442E5225a02420D6096b66823m9847A48163d7424E7099a5719D439J02608J04367
10431B11414b6282j67263I2799K10619a40905C3391a59775a2939k49961m272O9709
$$ y = [-95988, -30062, -463613, -132233, 260518, -116646, -232177, 267431, 299425, 17425, -229639, 39479, -128513, -124955, 1275, -25132, -75681, 198722, -173908, -92371, 229169, 9517, -56797, -490343, 45873, 6918, 20467, -40296, -150238, -112934, 10380, -220049, -245902, -41987, 165028, -95196, 47470, -264721, -209743, 103243, -255594, -46366, -124373, 34799, -147912, -91409, -3740, -228005, 139090, 14801, -103982, 560688, 13021, 301423, 311788, 179539, 218750, -94806, -404832, 101223, -4856, -236753, -2495, -241459, 158486, 129779, -203362, 181757, 173755, -66763, 55225, -102420, 46096, -266823, -316670, 148163, -47424, 57099, -15719, 4439, 107047, 211414, -26282, -193545, 92799, 303418, -140905, 33391, -159775, -12939, -262900, -267172, -197463]
10420a97463l9338L3534N8607p6340a00247q90J8807A61639a32323B25717C4801
10408c11974a6794B9031E623g107o7531j558l33419F9733P604C7402d29073f2859
10395c38198B2688N6318a43962d8513D7578a5666A65961b60277I7384b72383a326
10383A69127J7696O4971a08104A34963a15237j82185b1947A32092g1048k47378
10373c18426A63251d6574b407l698o742C10312A15250J71240A11111C0930L5188
10362F6118K55810B2718K90197N3770a75945C6298d9535C43753A17497L03539
10352D21036k0667j8366i127E39291j44885O8742M3565J33629k71166A22907K46930
10341C69837q4919m6419i259C85279J0945A72109F4407K75356l8204n371L18070
$$ y = [-197463, -236801, -203267, -144660, -221000, -100247, -101137, -82330, 161639, -132323, 225717, 34801, -311974, -16794, 29031, 5623, -7107, -74638, -76196, -409615, 69733, 77337, 37402, -429073, -62859, -338198, 22688, 79006, -143962, -48513, 47578, -15666, 165961, -260277, 97384, -272383, -1326, 169127, 186823, 251794, -108104, 134963, -115237, -297422, -21947, 132092, -71048, -318426, 163251, -46574, -2407, -6105, -12847, 310312, 115250, 286490, 111111, 30930, 66118, 321928, 22718, 312915, 366685, -175945, 36298, -49535, 343753, 117497, 421036, 400369, 382003, -9127, 539291, 394406, 463148, 506713, 640342, 369176, 122907, 369837, 284918, 238499, -9259, 385279, 396224, 172109, 64407, 339763, 301559, 296188, 614258]
10330F14258C02775R6908j31863j25110K04342j1911A12140J73370J78071q5050
10320C78531j88337J49540j46610a89765F4559K8663L5549a25366C09443p1679
10310B37764d2064C38241A13569a95620B68482A12336l3497b33121C75260k9795
10300C45465b26502B20210J9949e3002A14061K00162A09871J43940I6081a66777
10289G1464h27j8365k0222l243j01816A05624L920a43671A344a22059P432j21061
10277b35688G0463N0915a08441j34537P8403o9086Q4568o9946I8861J45543C3207
10265c19095a40318L4284q2511e9811p460j90460B31814b07590A53438h2629j7422
10254a00051m4117A16899i5451F9509b4461j2396B12246D3534N9716b76012R0339
$$ y = [614258, 302775, 399683, 267820, 142710, 347052, 335141, 112140, 285510, 463581, 378531, 190194, 339734, 193124, -189765, 64559, 93222, 128771, -125366, 309443, 237764, -42064, 338241, 113569, -195620, 268482, 112336, 78839, -233121, 375260, 345465, -226502, 220210, 240159, -53002, 114061, 314223, 109871, 253811, 96081, -166777, 71464, -827, -19192, -39414, -42657, -144473, 105624, 109544, -143671, 1344, -122059, -114627, -235688, 70463, 121378, -108441, -242978, -164575, -233661, -149093, -219039, 98861, 244404, 33207, -319095, -140318, -106034, -188545, -59811, -67271, -257731, 231814, -207590, 153438, -82629, -100051, -144168, 116899, -95451, 69509, -24461, -36857, 212246, 43534, 103250, -276012, -185673]
10243a85673L4709B51583B04a62909B14888q9466J27434G0039K48683I1383J7092
10232A08475J37368h076j0625j23015H8775K3711J48311C748K3014K67538E8552
10220a28090A6815a16247e7343A28660a88325N009a1317m7316C36010c5972J3012
10209b2960B0147b56095C6508a4541E3631M1156B6384Q9612h5869m6705e1389
10197B053a00878j66587f3311E3304c02520b4755j23521O3644p7255B16647c91764
10185B68637f2608q0891L3585C0469O9712A1839a9309j34154K6545l7725A17062
10173a32686j4333c9042I1237B3531a74027k50443B967b74883A62004a37712j09445
10162b47157o1458i7558A42735h6707c893o4491j36074A60917a29309E3529f3472
$$ y = [-185673, -150964, 251583, 204, -162909, 214888, 125422, 252856, 70039, 318722, 91383, 108475, 245843, -8076, -18701, -141716, 88775, 112486, 260797, 3748, 26762, 294300, 58552, -128090, 16815, -116247, -57343, 128660, -188325, -183316, -11317, -58633, 336010, -35972, -22960, 20147, -256095, 36508, -14541, 53631, 94787, 26384, 115996, -85869, -132574, -51389, 2053, -100878, -267465, -63311, 53304, -302520, -24755, -148276, -84632, -161887, 216647, -391764, 268637, -62608, -143499, -109914, 30469, 100181, 11839, -19309, -153463, -126918, -164643, 117062, -132686, -147019, -39042, 91237, 23531, -174027, -424470, 2967, -274883, 162004, -137712, -247157, -308615, -97558, 142735, -86707, -3893, -68384, -204458, 160917, -129309, 53529, -63472]
10150B17254b26968h8280J9058K21j23349J876l3608Q7802n0030a2581l1054A94128
10137a30991j53939Q0016i0858K0633l41159f3587K4423C3735a21848l8192g223
10125a40532f6719A94703c71295i7683j26565o752A3480b34981A08345b63592
10114d3968j55577f6268D6749a13802A04666b93323a31759A45793d683l25082
10104c29765A06176c95513G6747b5688l78161c7100j324H2672i5091p9621b9510
10092B05574O1029a5969l275k43198J3239b5314A74617a28796j1987j64908k566
10081c08257O3143D7799a32605C8939J16634h0010B02383a10429A86177a09391
10070D07084a75324A8085J20949c999A87125c16625I0448b81673K4420D877K43177
$$ y = [217254, -226968, -88280, -69222, -69001, -192350, -190474, -224082, -136280, -186310, -12581, -43635, 194128, -130991, -284930, -204914, -90858, -70225, -411384, -63587, -39164, 33735, -121848, -160040, -7223, -140532, -66719, 194703, -371295, -97683, -224248, -231000, 13480, -234981, 108345, -263592, -43968, -199545, -66268, 46749, -113802, 104666, -293323, -131759, 145793, -4683, -329765, 106176, -395513, 76747, -25688, -403849, -37100, -38424, 82672, -95091, -174712, -29510, 205574, 266603, -15969, -19244, -262442, -249203, -25314, 174617, -128796, -140783, -305691, -308257, -245114, 47799, -132605, 38939, 155573, -80010, 202383, -110429, 186177, -109391, 407084, -175324, 18085, 139034, -3999, 187125, -316625, 90448, -281673, -257253, 4877, 248054]
10059B48054G5025h8464j01803N9383B10341o0420b78835h89r5343o3880L3080
10048a27032A1130d01739e5973C6914g808A5575c56116J40357A0416b2368j97562
10037b19930L9309B9979d1342a56j35193j18971h0068l82168A45267b99646J00156
10026a99490d8865l53233m9460l7399D2510j0977J27678N9084I5309a02606j22273
10015b24879J04949c3179j68325L7107I0996N7985c70334A13424j9355D4818a17535
10003H5086a50815M6597A63143B6170a91782N0398j9101A18235f4967B5074K43293
9992B68367e0737I0382b01985c0491A80976a73188k44880F9566K58192G0498b25551
9980d46193B4434i0212C7293J43865r0054P4715g2684o0012j25075A35766D3914
$$ y = [248054, 75025, -88464, -190267, -130884, 210341, 149921, -278835, -889, -96232, -160112, -127032, 11130, -401739, -55973, 36914, -7808, 15575, -356116, -215759, 10416, -22368, -219930, -180621, 29979, -41342, -156, -135349, -254320, -80068, -462236, 145267, -299646, -199490, -48865, -402098, -451558, -488957, 42510, 31533, 159211, 218295, 95309, -102606, -224879, -119930, -33179, -201504, -164397, 90996, 148981, -370334, 113424, 94069, 44818, -117535, 85086, -150815, -104218, 163143, 26170, -191782, -141384, -160485, 118235, -64967, 25074, 268367, -50737, 90382, -201985, -30491, 180976, -173188, -418068, 69566, 327758, 70498, -225551, -446193, 24434, -90212, 37293, 181158, 91104, 165819, -72684, -132696, -257771, 135766, 43914]
9968B0704J40931b97354m4611G7017j476J51031a27349L2671E9331b34656b8468
9956A2565b41931b7927j60951N3719J6286A58858A3661J1764b32201F7482Q088
9945G5570a25608p0999A96726e9299A21762a33435i508D9391c11463E6284a85321
9933i854j54421A25514b00180A61337N3244b73751j41222A10326m9009j4769e4711
9921i5364j3021J1011B9192a23137k8439m6985R790G6815g7198j25784F0346d5615
9908E6284b91996C07486b24869d4679p9122k6552k12243a7691m55456a80350j15422
9897b95772A3006a89690M195F3536b0752C5987b14938j49620Q5883I162b05315
9885d13456a23311j65786A21509a73560N2853j23495j66067A70384a66286l399
$$ y = [20704, 161635, -297354, -341965, 77017, 75541, 226572, -127349, -94678, 59331, -234656, -28468, 12565, -241931, -27927, -188878, -135159, -118873, 158858, 13661, 25425, -232201, 67482, 75570, -125608, -196607, 196726, -59299, 121762, -133435, -9508, 49391, -311463, 56284, -185321, -9854, -164275, 125514, -200180, 161337, 214581, -273751, -414973, 110326, 61317, 46548, -54711, -95364, -108385, -97374, 29192, -123137, -151576, -198561, -188771, 76815, -77198, -202982, 60346, -45615, 56284, -291996, 307486, -224869, -44679, -123801, -150353, -362596, -17691, -473147, -180350, -295772, 13006, -189690, -185495, 63536, -20752, 35987, -214938, -364558, -278675, 9162, -205315, -413456, -123311, -289097, 121509, -173560, -120707, -244202, -410269, 170384, -166286, -169685]
9875a69685B26981A7059d6179k4848C1203c51302F9540J98790a70774J2900B93424
9863h6902A30843N9026M940G8375a53225k21188A2804a92754A09053a17271c5464
9851A55866g4126H1435a67619A76703p5603g9045b3437j41473A35251a90093A11734
9839I598d55600A06206a1497k38524E519K04315D0624e03285b08050F8543e2048
9827A71454A6501C969a26880N7869L3978j11971P0283F3611a21796D2703a60051
9815G0623d1319D5191c91938a83140A48820D97h3839r2254o5058j6937i7448k62732
9803c60180A40691a81426j9036o9649k255G1152a29534m8137p6752o7734d1737
9791E9806c0968A82889a71811A49946a46188j30951C58445E3430J75735a19918
$$ y = [-169685, 226981, 17059, -46179, -71027, 31203, -351302, 69540, 268330, -170774, -157874, 293424, -86902, 130843, 189869, 194809, 78375, -153225, -374413, 12804, -192754, 109053, -117271, -35464, 155866, -74126, 81435, -167619, 176703, 101100, -79045, -23437, -164910, 135251, -190093, 111734, 9598, -455600, 106206, -11497, -250021, 5519, 209834, 40624, -503285, -208050, 68543, -52048, 171454, 16501, 3969, -126880, -69011, -35033, -147004, -76721, 63611, -121796, 42703, -160051, 70623, -41319, 45191, -391938, -183140, 148820, 497, -83839, -176093, -241151, -258088, -97448, -360180, 140691, -181426, -200462, -270111, -272366, 71152, -129534, -177671, -254423, -322157, -41737, 59806, -30968, 182889, -171811, 149946, -146188, -277139, 358445, 53430, 229165, -119918]
9780G7096a5872q3521k29496b5862j24891n5211c3439q4241q0816j04118L1310
9769b71304J30443j07421J6482R8265a6241A32266a35838l8932h6659c5511j6094
9758e1605I5962a70177B86102b63562I8506b61951f3158j74449a15602J2565j0819
9747a13856c498j5186m8794A59769j9597a28963a9235r8287A77639o5565a8532
9735i1346H5828e9103n3481j14296e3279D5106h4480k1677M818A01193a2759j18552
9723a31311q9944L7934B7879b13031J02563b3091j50606M4566d9044k14270B69564
9711b05622A01622a21503k18460R0634A346Q6473a95323b6112p0948B81956a98607
9699a93199C1224J74578f6530H7677i6222J4911k46302a08477j39046O4035Q3301
$$ y = [77096, -15872, -99393, -328889, -25862, -150753, -205964, -33439, -117680, -198496, -302614, -271304, -140861, -248282, -231800, -133535, -16241, 132266, -135838, -174770, -86659, -35511, -51605, 95962, -170177, 286102, -263562, 98506, -261951, -63158, -237607, -115602, -103037, -113856, -3498, -18684, -67478, 159769, 140172, -128963, -19235, -117522, 177639, 112074, -18532, -91346, 85828, -59103, -112584, -226880, -53279, 45106, -84480, -106157, -101339, 101193, -12759, -131311, -221255, -183321, 27879, -213031, -110468, -23091, -173697, -129131, -49044, -263314, 269564, -205622, 101622, -121503, -339963, -249329, 1346, 87819, -195323, -26112, -97060, 281956, -198607, -193199, 31224, 205802, -66530, 87677, -96222, -81311, -327613, -108477, -247523, -183488, -100187]
9688a00187k7675m5874J0024b8002A0334a16320r0298O1943r718k51128d2811
9676A8201E380P298K32369H0043d13221a921m6591j57581B9365h1790K6802j53814
9664b08802B72469a66792j9181i0384A86688b23287P9531K5334j73111i9184C13651
9652a1467k33365j49217a02734E1967B3839a48907j17902M7498A8983a67808C7861
9640D6897a02318j374d9259H7170B0341Q4650f9840k3197C05233j09992q6970
9629A08271b19354j56124b1800l35722H7500K68770a65401P4223l56323b20552
9618b44955A35897a36508F2991b19723Q1710d5856j38261g2513B3209a21029c4636
9606a95390A39866J8924d12498b02676b4032G0959d5826j70825b1159r5936K4562
$$ y = [-100187, -127862, -173736, -163712, -28002, 10334, -116320, -206618, -144675, -154393, -405521, -42811, 18201, 5380, 12678, 245047, 80043, -413221, -1921, -48512, -206093, 29365, -81790, -54988, -208802, 272469, -166792, -185973, -90384, 186688, -223287, -143756, -118422, -291533, -99184, 313651, -11467, -244832, -394049, -102734, 51967, 23839, -148907, -266809, -219311, 18983, -167808, 37861, 46897, -102318, -103692, -49259, 87170, 20341, 104991, -69840, -93037, 305233, 195241, 108271, -219354, -375478, -21800, -357522, 87500, 356270, -165401, -91178, -447501, -220552, -244955, 135897, -136508, 62991, -219723, -138013, -45856, -184117, -72513, 23209, -121029, -34636, -195390, 139866, 158790, -412498, -202676, -24032, 70959, -45826, -216651, -21159, -117095, -92533]
9595i2533f021r4817d7796j23628b6397A81270a20096B23891i1371J6656F3377
9583H8972b30096b6512l18801a37440A9558d0474j79591Q8094l1632k20306F7170
9571a39107j26000C17486j26145d5618A78015i3862G9263b95094c8153l40134
9561c78287B43819D4348a00095F9684c40522b0411F7793f0525l59647a01377I1827
9549B14185c2613q0235L4443A23546a93075f5116o2520o3161A69098B993a76636
9537d8782A75700a50529O8922A7836b04954C0737J55270a81573l3754A49694c98263
9525c08485A11090c73871M4548B23526a46486N5150j36273A7308a87560B07641
9514a62363D9840a56692A41096a525B91226b9892A04294l2179J79653a06749j97877
$$ y = [-92533, -6021, -100838, -47796, -171424, -26397, 181270, -120096, 223891, -91371, -74715, 63377, 88972, -230096, -26512, -345313, -137440, 19558, -40474, -220065, -131971, -163603, -383909, 67170, -139107, -265107, 317486, 191341, -45618, 178015, -93862, 79263, -295094, -38153, -378287, 243819, 44348, -100095, 69684, -340522, -20411, 67793, -60525, -420172, -101377, 91827, 214185, -32613, -112848, -78405, 123546, -193075, -65116, -127636, -190797, 169098, 2993, -176636, -48782, 175700, -150529, -81607, 17836, -204954, 30737, 186007, -181573, -215327, 149694, -398263, -308485, 111090, -373871, -329323, 223526, -146486, -91336, -227609, 17308, -187560, 207641, -162363, 49840, -156692, 141096, -1525, 291226, -29892, 104294, 72115, 251768, -106749, -304626]
9503c04626n4114b0834j13711O6739k31317a47677j55348A49977K5664i4563K0649
9492g3914I3477l1698b0615A92307c97276e9198I3111J67947a69657Q0157A72083
9480A521a61521C6392b76720c6145k72695A43031B7524J81599a52830j49607a35521
9468a65755M6947o7515g9958q8108D3201L16987B6947b43358k4466A43507O9730
9457B13237f6054E636J32701g2384B20291a81493H2975a93044j14514a43194F6622
9445C5724b6557l33656A64451B4179d9070D455f2261A68502l8224a94501O6957
9434a27544l77962f3195q9697c4129D9200c04137a10142C380i8132A88748i1381
9422a16640L458I1069a50915P2442A34288g9259c3441n9908k50302Q891a00342
$$ y = [-304626, -358740, -20834, -134545, -67806, -299123, -147677, -303025, 149977, 175641, -94563, -73914, 93477, 61779, -20615, 192307, -397276, -59198, 93111, 261058, -169657, -89500, 172083, 1521, -161521, 36392, -276720, -36145, -308840, 143031, 27524, 209123, -152830, -302437, -135521, -165755, -118808, -186323, -79958, -168066, 43201, 360188, 26947, -243358, -267824, 143507, 213237, -66054, 5636, 138337, -72384, 220291, -181493, 82975, -193044, -307558, -143194, 66622, 35724, -26557, -360213, 164451, 24179, -49070, 4455, -62261, 168502, 130278, -194501, -127544, -505506, -63195, -152892, -34129, 49200, -304137, -110142, 3380, -98132, 188748, -91381, -116640, -113182, 91069, -150915, -78473, 134288, -79259, -33441, -93349, -343651, -334760, -100342]
9410C6775a54129p2582A60840b49982A51168b7505m1967l16296F7037R9308N7327
9399B23672m6632a39648j13711a7511j89994h6328j7183k40311b4439B5385Q2088
9388A07473e6924A39349M8914b80448d2953k82581e5997j25784d701J902A40864
9376c7728k48338f5967j52391g1674j22571e6237j74651j27999D1072d38869O3755
9365c75114h4273o0300b5899J2753J450j59555l9468f9670a8143A22495b3039
9353d09828d8445A6790L1669J08856a64007g0448j05304A10463K9983a36265B26740
9341A02844b27554j07524F5735a96280A60294e4981j7974b0022d683j97288A045
9329a84302p75j69377J35992Q9000k0195A46961d2981j08642F8665N9409k0966
$$ y = [36775, -154129, -226711, 160840, -249982, 151168, -27505, -69472, -385768, 67037, 166345, 223672, 177040, -139648, -253359, -17511, -207505, -86328, -103511, -343822, -24439, 25385, 107473, -56924, 139349, 188263, -280448, -42953, -325534, -55997, -181781, -4701, -2799, 140864, -37728, -286066, -65967, -218358, -71674, -194245, -56237, -230888, -358887, 41072, -438869, -375114, -84273, -144573, -25899, -13146, -11696, -171251, -210719, -69670, -18143, 122495, -23039, -409828, -48445, 16790, 48459, 157315, -164007, -70448, -175752, 110463, 140446, -136265, 226740, 102844, -227554, -335078, 65735, -196280, 160294, -54981, -72955, -20022, -4683, -201971, 1045, -184302, -185077, -354454, -218462, -129462, -149657, 146961, -42981, -151623, 68665, 128074, 107108]
9318A07108J12412b36344A77376J34400b92903Q6785L6001I5492R6528b46032
9307b12701J0355c6691f722k67024A5779h4623j80597n2103a10487K3104E0147
9295a45584o7847i2387J0862j24627B34033O5545a33333e5066C00152A5874K25683
9284B41557c41962F9220J62539B9064d34183e0A65662o8094c54231A27268m8644
9273G8624a02165A0322f6393A51a5983l57065b7455j17378r1216R7418r3192j47067
9261c78890I7209J24938c3988r0558F8838a7602j8320A92775a52458H2161a7038
9249I109Q9660a74409N1316O149k770G150b75533a04842l144a9704j3373B53311
9236A7588O2463a03136I0916b43592A13894a73953f3583J1459k27909J10741I2959
$$ y = [107108, 219520, -236344, 177376, 311776, -292903, -206118, -170117, 95492, 192020, -246032, -212701, -202346, -36691, -6722, -273746, 15779, -84623, -265220, -317323, -110487, -87383, 50147, -145584, -213431, -92387, -81525, -206152, 234033, 299578, -133333, -55066, 300152, 15874, 241557, -341962, 69220, 231759, 29064, -434183, -50, 165662, 97568, -354231, 127268, 78624, -102165, 10322, -66393, 151, -15983, -373048, -27455, -144833, -236049, -138631, -231823, -378890, 97209, 222147, -33988, -124546, 68838, -17602, -35922, 192775, -152458, 82161, -17038, 9109, 98769, -174409, -123093, -116944, -119714, 7150, -275533, -104842, -107986, -19704, -33077, 253311, 17588, 80051, -103136, 90916, -243592, 113894, -173953, -63583, -52124, -280033, -169292, 92959]
9224a92699D9966J0234c23985i1607A2713J03428a57184K3358C34120a22454k31512
9213c53966j56558a8711n30687A86319D7941a69998L9919C5680a19475B52418
9202A28751E0790K4709c91407A25184b49456A82785a18473B01035b86811j89419
9192d76230b9201l8977F1051e86704g3757q5166j64362A9524f1546j78210A9405
9180c15707m9107a56655m2759J3102A45412c10050a31747j54224C2438b48635
9169A06016a05414b0873E4372N304a17476I7342e675B9594f496j24357C8779f7461
9156e7707B22059l6387b81729a37368A17486a08574A16999f3917p7001j59878
9146c00796A40137a65023R981D2000J24573c84379H6027h9551C6487a73833m2338
$$ y = [-192699, 49966, 60200, -323985, -91607, 12713, 116141, -157184, -133826, 334120, -122454, -353966, -510524, -18711, -549398, 186319, 47941, -169998, -130079, 35680, -119475, 252418, 128751, 50790, 75499, -391407, 125184, -249456, 182785, -118473, 201035, -286811, -476230, -29201, -68178, 61051, -586704, -73757, -158923, -323285, 19524, -61546, -239756, 19405, -315707, -364814, -156655, -199414, -186312, 145412, -310050, -131747, -285971, 32438, -248635, 106016, -105414, -20873, 54372, 59676, -117476, 97342, -5675, 29594, -6496, -130853, 38779, -67461, -57707, 222059, 185672, -281729, -137368, 117486, -108574, 116999, -63917, -140918, -300796, 140137, -165023, -155042, 42000, 166573, -384379, 86027, -89551, 36487, -173833, -216171]
9135b16171B54253l309r1795G2701M5072d09550J31553F079b14045h2753F8611
9123F1907g8427j53517C9439Q7333a78328k4935k46527J12301A8311e0669A81060
9111C8498J08133i7639o2679l59172A11241l4258d6199L735E690b11793M2489
9100a69304A98038p2210j8786c9285k02507f282B0450a7414m2372H9822l065a88316
9087b88692D7994K2645K00396c45215G8159j3591c1451k11525B9502P5078l5676
9076F8904g4082a902r7113J8944A06584b63075n7830B35958J50062a96816d2212
9064c7893j66748e7547k08157J11599O0707A87194q9890k213m6794a45067A30778
9052a27406o8632n5981A39380Q5576f2878j27929E3410d42474a61833P8670k29631
$$ y = [-216171, 254253, 250944, 159149, 72701, 117773, -409550, -277997, 6079, -214045, -82753, 68611, 61907, -78427, -231944, 39439, 126772, -178328, -203263, -449790, -337489, 18311, -50669, 181060, 38498, 146631, -97639, -160318, -519490, 111241, 76983, -46199, -42464, 5690, -211793, -169304, 198038, 125828, 107042, -39285, -241792, -6282, 20450, -17414, -59786, 89822, 86757, -188316, -288692, 47994, 70639, 271035, -345215, 78159, 64568, -31451, -242976, 29502, 104580, 68904, -74082, -1902, -99015, -80071, 106584, -263075, -320905, 235958, 386020, -196816, -42212, -37893, -204641, -57547, -265704, -154105, -93398, 187194, 97304, 95091, 48297, -145067, 130778, -127406, -196038, -252019, 139380, 224956, -62878, -190807, 53410, -442474, -161833, -83163, -312794]
9041c12794K0650A47797a98976N0205K2080j47352g6108j40597f0920A61852p8284
9030H3568d88641b37989F1087c2874B24878b61163M6017F3221a47305A6637J3804
9019C0441q531b86242B88822a0222E03372d4065D8619a11328d922l6391k68100
9008c09413c6607H082J0506Q5686c7289j89237G543L0739J08897a62809B25453
8996c3760r6790E36933A9708b19885D9395J06048D1646J15646M6099a93245R2239
8985a01006A50209h0906C7288a50402r3693D5533D985K2066a76202j28444a46945
8973a6227K672A53169b58787K2732a5951A21653B1488b81206M6264G1153i0578
8961c04884B0421d109k16505J8521L9168j1149B21458r8395d3134b0142j00822
$$ y = [-312794, -292144, 147797, -198976, -148771, -126691, -274043, -76108, -216705, -60920, 161852, 83568, -488641, -237989, 61087, -32874, 224878, -261163, -215146, 63221, -147305, 16637, 30441, 21910, -286242, 288822, -10222, 503372, -44065, 48619, -111328, -4922, -41313, -309413, -36607, 8082, 18588, 104274, -37289, -226526, 7543, 38282, 147179, -162809, 225453, -33760, -130550, 536933, 19708, -219885, 49395, 155443, 41646, 157292, 203391, -193245, -101006, 150209, -80906, 37288, -150402, -244095, 45533, 4985, 27051, -176202, -304646, -146945, -16227, -13555, 153169, -258787, -236055, -15951, 121653, 21488, -281206, -234942, 71153, -90578, -304884, 20421, -4109, -220614, -202093, -162925, -174074, 221458, 123063, -43134, -20142, -120964]
8950a20964j843m5332C23117D6906G772a35368k84236d6847F6813k9697A3719
8938A7459a73792l47508c2081D1028d00481A97667a5649k97300I7878B1915M244
8927B6159b35317C80139E9467b75673J34355K4083B55542b52869K6512d2922G1464
8915f0809A17991a5779k53071B72605J45520l9408O6199J5278K31230J52515J652841
8904B496780J833960K843799l396389A834839p04287n35380j08980j26140H6164
8894C01868J97095b62225a10359p0971D74284C7618c1349C7002L1997L23186o1214
8883C30971F5130f1200j56668i2787B10819a31540E9477d9445B21698d553l42661
8872c47214B48497A02419a57893L9991A95067A7606b00704C1214i2601A47125
$$ y = [-120964, -122807, -168139, 323117, 46906, 7772, -135368, -419604, -46847, 66813, 37116, 13719, 17459, -173792, -521300, -32081, 41028, -400481, 197667, -15649, -312949, 97878, 21915, 26159, -235317, 380139, 59467, -275673, -141318, -117235, 255542, -252869, -226357, -42922, 71464, -60809, 117991, -15779, -268850, 272605, 418125, 378717, 444916, 460194, 691424, 843939, 2496780, 4330740, 7174539, 3778150, 1834839, 1130552, 595172, 486192, 360052, 86164, 301868, 498963, -262225, -110359, -181330, 474284, 37618, -31349, 37002, 68999, 392185, 330971, 65130, -61200, -217868, -92787, 210819, -131540, 59477, -49445, 221698, -4553, -347214, 248497, 102419, -157893, -117902, 195067, 17606, -200704, 31214, -92601, 147125]
8861a04366M4892C4411a65394K2098E0662b29578d022A3605a86184m9359A11515
8849b34698A63872a81222c1124h66A0464a78903A33800a02302A71390a67434j69918
8838c37352J14550p675a10735k74288f8602B8980b70419E8986a56650j36085A35101
8826A72069F7646f9992j08422L9140K2644q9956q971i543A06650l9590g1817l3961
$$ y = [-104366, -59474, 34411, -165394, -143296, 50662, -229578, -4022, 13605, -186184, -235543, 111515, -234698, 163872, -181222, -31124, -866, 10464, -178903, 133800, -102302, 171390, -167434, -337352, -222802, -230477, -110735, -385023, -68602, 28980, -270419, 58986, -156650, -292735, 135101, 172069, 67646, -69992, -178414, -139274, -116630, -206586, -215557, -9543, 106650, 67060, -71817, -105778]
$$ [...]
##END NTUPLES=NMR SPECTRUM
##END=
