
##TITLE=AC1118_Huila-la_5874822_9FENfQ32JU
##JCAMPDX= 6.0         $$ Bruker NMR JCAMP-DX V2.0
##DATA TYPE= NMR SPECTRUM
##DATA CLASS= NTUPLES
##ORIGIN= BRUKER
##OWNER= Administrator
$$ 1.72 TOPSPIN		Version 2.1
$$ 2012-03-31 19:31:19.453 -0500  Administrator@TOPSPIN
$$ Compression mode = diff/dup
##.OBSERVE FREQUENCY= 400.13188235
##.OBSERVE NUCLEUS= ^1H
##.ACQUISITION MODE= SIMULTANEOUS (DQD)
##.ACQUISITION SCHEME= undefined
##.AVERAGES= 8
##.DIGITISER RES= 22
##SPECTROMETER/DATA SYSTEM= spect
##.PULSE SEQUENCE= zg30
##.SOLVENT NAME= COFFEE_meoh
##.SHIFT REFERENCE= INTERNAL, COFFEE_meoh, 1, 14.98061
##AUDIT TRAIL= $$ (NUMBER, WHEN, WHO, WHERE, PROCESS, VERSION, WHAT)
$$ ##TITLE= Audit trail, TOPSPIN		Version 2.1
$$ ##JCAMPDX= 5.01
$$ ##ORIGIN= Bruker BioSpin GmbH
$$ ##OWNER= Administrator
$$ $$ C:\Bruker\TOPSPIN/data/COFFEE/nmr/AC1118_Huila-la_5874822_9FENfQ32JU/10/pdata/1/auditp.txt
$$ ##AUDIT TRAIL=  $$ (NUMBER, WHEN, WHO, WHERE, PROCESS, VERSION, WHAT)
(   1,<2012-03-31 19:31:10.109 -0500>,<Administrator>,<TOPSPIN>,<go>,<TOPSPIN 2.1>,
      <created by zg
	started at 2012-03-31 19:30:03.421 -0500,
	POWCHK enabled, PULCHK disabled,
       configuration hash MD5:
       1A 1E CE 29 27 FD 77 03 67 4E F0 E3 C4 B2 CB 90
       data hash MD5: 64K
       5B A6 7D 43 4D FB B9 DC 83 7D 7E A8 01 C6 F2 1E>)
(   2,<2012-03-31 19:31:14.562 -0500>,<Administrator>,<TOPSPIN>,<proc1d>,<TOPSPIN 2.1>,
      <Start of raw data processing
       efp LB = 0 FT_mod = 6 PKNL = 1 PHC0 = 0 PHC1 = 0 SI = 32K 
       data hash MD5: 32K
       CE BA D8 5D AA 82 BD 81 85 B5 ED F4 AF 5D 30 FA>)
(   3,<2012-03-31 19:31:15.140 -0500>,<Administrator>,<TOPSPIN>,<proc1d>,<TOPSPIN 2.1>,
      <pk PHC0 = 214.8267 PHC1 = 0 
       data hash MD5: 32K
       95 95 08 3B 36 9D D0 D5 21 80 52 3C 57 F9 35 09>)
(   4,<2012-03-31 19:31:15.234 -0500>,<Administrator>,<TOPSPIN>,<proc1d>,<TOPSPIN 2.1>,
      <abs ABSG = 1 
       data hash MD5: 32K
       DE E8 0E FD 68 7D 82 84 F8 5E 19 8C 95 8D 13 6B>)
(   5,<2012-03-31 19:31:15.281 -0500>,<Administrator>,<TOPSPIN>,<proc1d>,<TOPSPIN 2.1>,
      <abs ABSG = 2 
       data hash MD5: 32K
       55 58 46 B9 77 21 04 B1 29 5C 37 95 FF A7 64 04>)
(   6,<2012-03-31 19:31:15.312 -0500>,<Administrator>,<TOPSPIN>,<proc1d>,<TOPSPIN 2.1>,
      <abs ABSG = 3 
       data hash MD5: 32K
       80 6F C8 F9 C9 45 B4 FA 7E C8 40 AC 49 C8 F6 95>)
(   7,<2012-03-31 19:31:15.343 -0500>,<Administrator>,<TOPSPIN>,<proc1d>,<TOPSPIN 2.1>,
      <abs ABSG = 4 
       data hash MD5: 32K
       7A 16 ED E1 E4 3E 9E 9B 0D 47 0B CE 22 C6 55 0C>)
(   8,<2012-03-31 19:31:15.375 -0500>,<Administrator>,<TOPSPIN>,<proc1d>,<TOPSPIN 2.1>,
      <abs ABSG = 5 
       data hash MD5: 32K
       36 84 98 02 62 11 DA 80 B6 F9 FD CD 67 66 B9 9F>)
$$ ##END=
$$ 
$$ $$ hash MD5
$$ $$ 6F C8 5A 08 CA 71 4A CD 73 38 EA 2B 6D 12 13 59
##$RELAX= 
##$RELAX= 
##$RELAX= 
##$RELAX= 
##$RELAX= 
##$RELAX= 
##$RELAX= 
$$ Bruker specific parameters
$$ --------------------------
$$ [...]
##$TP= (0..7)
150 150 150 150 150 150 150 150
##$TP07= 0
##$TPNAME0= <>
##$TPNAME1= <>
##$TPNAME2= <>
##$TPNAME3= <>
##$TPNAME4= <>
##$TPNAME5= <>
##$TPNAME6= <>
##$TPNAME7= <>
##$TPOAL= (0..7)
0.5 0.5 0.5 0.5 0.5 0.5 0.5 0.5
##$TPOFFS= (0..7)
0 0 0 0 0 0 0 0
##$TUNHIN= 0
##$TUNHOUT= 0
##$TUNXOUT= 0
##$USERA1= <user>
##$USERA2= <user>
##$USERA3= <user>
##$USERA4= <user>
##$USERA5= <user>
##$V9= 5
##$VALIST= <valist>
##$VCLIST= <CCCCCCCCCCCCCCC>
##$VD= 0
##$VDLIST= <DDDDDDDDDDDDDDD>
##$VPLIST= <PPPPPPPPPPPPPPP>
##$VTLIST= <TTTTTTTTTTTTTTT>
##$WBST= 2048
##$WBSW= 25
##$XGAIN= (0..3)
0 0 0 0
##$XL= 0
##$YL= 0
##$YMAX_a= 538758
##$YMIN_a= -647963
##$ZGOPTNS= <>
##$ZL1= 120
##$ZL2= 120
##$ZL3= 120
##$ZL4= 120
##$ABSF1= 14.98061
##$ABSF2= -5.57192
##$ABSG= 5
##$ABSL= 3
##$ALPHA= 0
##$AQORDER= 0
##$ASSFAC= 0
##$ASSFACI= 0
##$ASSFACX= 0
##$ASSWID= 0
##$AUNMP= <proc_prof1d_extract_pilot.lims>
##$AXLEFT= 0
##$AXNAME= <>
##$AXNUC= <1H>
##$AXRIGHT= 0
##$AXTYPE= 0
##$AXUNIT= <>
##$AZFE= 0.1
##$AZFW= 0.1
##$BCFW= 0
##$BC_mod= 0
##$BYTORDP= 0
##$COROFFS= 0
##$CY= 15
##$DATMOD= 1
##$DC= 0
##$DFILT= <>
##$DTYPP= 0
##$F1P= 0
##$F2P= 0
##$FCOR= 0.5
##$FTSIZE= 32768
##$FT_mod= 6
##$GAMMA= 0
##$GB= 0
##$INTBC= 1
##$INTSCL= 1
##$ISEN= 128
##$LB= 0
##$LEV0= 0
##$LPBIN= 0
##$MAXI= 10000
##$MC2= 0
##$MEAN= 0
##$ME_mod= 0
##$MI= 0
##$NCOEF= 0
##$NC_proc= -8
##$NLEV= 6
##$NOISF1= 0
##$NOISF2= 0
##$NSP= 0
##$NTH_PI= 0
##$NZP= 0
##$OFFSET= 14.98061
##$PC= 1
##$PHC0= 214.8267
##$PHC1= 0
##$PH_mod= 1
##$PKNL= yes
##$PPARMOD= 0
##$PPDIAG= 0
##$PPIPTYP= 0
##$PPMPNUM= 2147483647
##$PPRESOL= 1
##$PSCAL= 4
##$PSIGN= 0
##$PYNMP= <proc.py>
##$REVERSE= no
##$SF= 400.13
##$SI= 32768
##$SIGF1= 0
##$SIGF2= 0
##$SINO= 400
##$SIOLD= 32768
##$SPECTYP= <>
##$SREGLST= <1H.CDCl3>
##$SSB= 0
##$STSI= 32768
##$STSR= 0
##$SW_p= 8223.68421052632
##$SYMM= 0
##$S_DEV= 0
##$TDeff= 65536
##$TDoff= 0
##$TI= <>
##$TILT= no
##$TM1= 0
##$TM2= 0
##$TOPLEV= 0
##$USERP1= <user>
##$USERP2= <user>
##$USERP3= <user>
##$USERP4= <user>
##$USERP5= <user>
##$WDW= 1
##$XDIM= 32768
##$YMAX_p= 472193165
##$YMIN_p= -759569
##$CURPLOT= <Network HP LaserJet P1505>
##$CURPRIN= <$Network HP LaserJet P1505>
##$DFORMAT= <normdp>
##$LAYOUT= <+/1D_H.xwp>
##$LFORMAT= <normlp>
##$PFORMAT= <normpl>
##$SURQMSG= 1
$$ End of Bruker specific parameters
$$ ---------------------------------
##NTUPLES= NMR SPECTRUM
##VAR_NAME=  FREQUENCY,     SPECTRUM/REAL,   SPECTRUM/IMAG
##SYMBOL=    X,             R,               I
##VAR_TYPE=  INDEPENDENT,   DEPENDENT,       DEPENDENT
##VAR_FORM=  AFFN,          ASDF,            ASDF
##VAR_DIM=   32768,         32768,           32768
##UNITS=     HZ,            ARBITRARY UNITS, ARBITRARY UNITS
##FACTOR=    0.250966925370066, 1,           1
##FIRST=     8223.43324360095, -104523,      35515
##LAST=      0,             31571,           7491
##MIN=       0,             -759569,         0
##MAX=       8223.43324360095, 472193165,    0
$$ Real data points
##PAGE= N=1
##DATA TABLE= (X++(R..R)), XYDATA
$$ [...]
19477d4160j99421P165H1774a03632A12571L7474K29635B0126J48004a92485I509
$$ -44160 -243581 -236416 81774 -103632 112571 150045 379680 20126 168130 -192485 9509
19465C3895a24732B9533a34141b444F9385f6573F3687A6208K610e07516a36189
$$ 33895 -124732 29533 -134141 -2444 69385 -66573 63687 16208 18818 -507516 -136189
19453i1301n9567B680c09617a13287C6424Q7319d45127J89742Q0538k6625b8227
$$ -91301 -150868 2680 -309617 -113287 36424 123743 -445127 -255385 -174847 -201472 -28227
19441a65825B12664a55141A08356O8311o4551C2336l575b7741j39732A6252b12808
$$ -165825 212664 -155141 108356 176667 112116 32336 28761 -27741 -167473 16252 -212808
19429a87305l8922a02252l53302K09069a07062A60750f4981A70571b79384J31599
$$ -187305 -226227 -102252 -455554 -246485 -107062 160750 -64981 170571 -279384 -147785
19419a47785A11402h4545j31376h3061I6290h2165L8445j34405P9887A54908o2242
$$ -147785 111402 -84545 -215921 -83061 96290 -82165 -43720 -178125 -98238 154908 92666
19408I2666a2967l28804G9904l3516e9972A97679e6476K5812r145l3678k02418
$$ 92666 -12967 -341771 79904 46388 -59972 197679 -56476 -30664 -39809 -73487 -275905
19397b75905a31495A43514a95491B05361O174H3722J76709q4519g5008q3040a7198
$$ -275905 -131495 143514 -195491 205361 211535 83722 260431 175912 -75008 -158048 -17198
19385B66973A0781h9506J0242j68038e5212j38712J2127A05379c4758C5810M4711
$$ 266973 10781 -89506 -79264 -247302 -55212 -193924 -181797 105379 -34758 35810 80521
19374H0521e6466k0682j12454K2570L795j80185d120C24299a50996A83452J49632
$$ 80521 -56466 -77148 -189602 -167032 -163237 -343422 -4120 324299 -150996 183452 333084
19363C33084a54550M9253p3987C33676i3992a3705l3800l7997k04007N5888A69812
$$ 333084 -154550 -105297 -179284 333676 -93992 -13705 -47505 -85502 -289509 -233621 169812
19351b03129q766A72472E783k436K40370D8455c21366a7947k4221l9074E3289
$$ -203129 -211895 172472 5783 3347 243717 48455 -321366 -17947 -42168 -81242 53289
19339A67284d64592N7029c5901j34769K1412n3296e3228o2952R310o1108n6429
$$ 167284 -464592 -407563 -35901 -170670 -149258 -202554 -53228 -116180 -106870 -167978 -224407
19328b24407J10637E2639a11499k49313k7694a5675m134A4668h8318A09691f3838
$$ -224407 -113770 52639 -111499 -360812 -388506 -15675 -19809 14668 -88318 109691 -63838
19316b44569R1838l32752J10844P6349e7582j27116c730j11360j26875L9013B98759
$$ -244569 -152731 -485483 -374639 -298290 -57582 -184698 -3730 -115090 -241965 -202952 298759
19304B9567c47555B03176a95912l6304j58823A3767L55449b03305g3766C10081
$$ 29567 -347555 203176 -195912 -232216 -391039 13767 369216 -203305 -73766 310081
19293D48b65804J19509a9672E0535c54396E8052e5457j68120h079p3781j40380
$$ 448 -265804 -146295 -19672 50535 -354396 58052 -55457 -223577 -8079 -81860 -222240
19282b22240E678b77177O2797G4175a26042d3436j27786k4355E9135K13084c2481
$$ -222240 5678 -277177 -214380 74175 -126042 -43436 -171222 -195577 59135 272219 -32481
19270c39751B79023g3818C2470a25585l42595a51131O0142B91443a64995O0111
$$ -339751 279023 -73818 32470 -125585 -468180 -151131 -90989 291443 -164995 -104884
19260a04884j94465b6357j8888j4492q2716c5331j04710c0461j949B8219a55158
$$ -104884 -299349 -26357 -45245 -59737 -142453 -35331 -140041 -30461 -32410 28219 -155158
19248a49909k15762a24315Q42I7085m8070a39276O7121G8883j4798g3487J7509
$$ -149909 -365671 -124315 -123473 97085 49015 -139276 -72155 78883 64085 -73487 -55978
19237e5978k15062J30208b4575A86376l9807D5298j7420R4998l7085a94336d1376
$$ -55978 -271040 -140832 -24575 186376 146569 45298 27878 122876 85791 -194336 -41376
19225i6363r3790l4927J02720l5176O4105A15993a00363C18916c41209A29992
$$ -96363 -190153 -225080 -122360 -157536 -93431 115993 -100363 318916 -341209 129992
19214F7348a72941j70491e9618A3867L8138N9486h6990H9256h9586l04640H2135
$$ 67348 -172941 -343432 -59618 13867 52005 111491 -86990 89256 -89586 -394226 82135
19202F8034b75937a31324m0480g7553b692l1022k8477r5597K8679A89590e8242
$$ 68034 -275937 -131324 -171804 -77553 -2692 -33714 -62191 -157788 -129109 189590 -58242
19190a10535a1372F7876a02814C9987f2717m041A94257F2749d4381C8310b24577
$$ -110535 -11372 67876 -102814 39987 -62717 -66758 194257 62749 -44381 38310 -224577
19178c3307r7345b3837l21711I7322b05327C9633i9389n6154j59066a29846A13287
$$ -33307 -130652 -23837 -345548 97322 -205327 39633 -99389 -155543 -314609 -129846 113287
19166b09361R0226j49840h6460B07909a94509d1652C7506b30004B13767a58505
$$ -209361 -119135 -268975 -86460 207909 -194509 -41652 37506 -230004 213767 -158505
19155a87040q7239f1379j75413B34852A03572g4193A71593d2941K0066n3963l3828
$$ -187040 -274279 -61379 -236792 234852 103572 -74193 171593 -42941 -22875 -76838 -110666
19144a10666k0989b5103j45083K6093C90934g8505L5295A35502d27810C9848K29252
$$ -110666 -131655 -25103 -170186 -144093 390934 -78505 -43210 135502 -427810 39848 269100
19133B69100b03974i8478j22046A63389J7825a01771m6598r8723j67805a65306
$$ 269100 -203974 -98478 -220524 163389 181214 -101771 -148369 -247092 -414897 -165306
19122A28734d7260A95924a02955F681K9546a22288A05338O7932b94010J03459
$$ 128734 -47260 195924 -102955 6681 36227 -122288 105338 173270 -294010 -190551
19112a90551E1708a18945j38190J23854I5204J69663c13343a41678k3307C934
$$ -190551 51708 -118945 -257135 -133281 95204 264867 -313343 -141678 -164985 3934
19101d35881a13645n9323H638J52244G3707b54943b6247j5018B18205f1340k1873
$$ -435881 -113645 -172968 8638 160882 73707 -254943 -26247 -41265 218205 -61340 -83213
19090h3213J7447j00214M9854M5773j76959G7053d72419b8882I4126J72575A26319
$$ -83213 -65766 -165980 -116126 -70353 -247312 77053 -472419 -28882 94126 266701 126319
19078A05476p07e5694A24514d5553l04435J35689m5196E4759M6857a53866j06250
$$ 105476 104769 -55694 124514 -45553 -349988 -214299 -259495 54759 101616 -153866 -260116
19067b60116q9100a51724A45971C4505J28665b3545C93827j89590J28875a15168
$$ -260116 -349216 -151724 145971 34505 163170 -23545 393827 204237 333112 -115168
19056e4288m5515B58392a84985h8504j07700O9634j36573g2475F4541c17005R3531
$$ -54288 -99803 258392 -184985 -88504 -196204 -126570 -263143 -72475 64541 -317005 -223474
19045b23474B57001a27113A47299c7602G3921a44963L2376K9145J1798A23890
$$ -223474 257001 -127113 147299 -37602 73921 -144963 -112587 -83442 -71644 123890
19034a59710B65171B1290b25018A19194M1243b16722e0916o3351JE457J32919
$$ -159710 265171 21290 -225018 119194 160437 -216722 -50916 -114267 -114266 5457 138376
19023A38376d8397i490A4673a04839L9328m9510A20290E3645J08381m8189R867
$$ 138376 -48397 -9490 14673 -104839 -65511 -115021 120290 53645 162026 113837 123704
19012A23704E4064b1058B44102a9872l32013J67023J6434d1569r1842A55388a52955
$$ 123704 54064 -21058 244102 -19872 -351885 -184862 -168428 -41569 -133411 155388 -152955
19000A48609a11953L650B6632J91746q5557b31497H6654J65092H6497l1418b4972
$$ 148609 -111953 -108303 26632 218378 132821 -231497 86654 251746 86497 55079 -24972
18988A10164B5463d59338B8499c8974G3394g8233j07012p516R4214A7380K22573
$$ 110164 25463 -459338 28499 -38974 73394 -78233 -185245 -192761 -98547 17380 239953
18977B39953i9453A59970J05819b59245J23734B06344A3761i5501j0905F3491
$$ 239953 -99453 159970 265789 -259245 -135511 206344 13761 -95501 -106406 63491
18966d29168J54600d7615r713J3309A57957f2613A01577J29830l8962L10612D4460
$$ -429168 -274568 -47615 -57328 -44019 157957 -62613 101577 231407 192445 503057 44460
18954A67760M6501F4394a02195b0554j23772L1036j14996Q1535N6936j47618A24155
$$ 167760 214261 64394 -102195 -20554 -144326 -113290 -228286 -146751 -89815 -237433 124155
18942A32505j157e8268C6053b15468o5562N248A49138B4501g4302J4403m52754
$$ 132505 131348 -58268 36053 -215468 -281030 -275782 149138 24501 -74302 -59899 -512653
18931e12653A22466c57927l3356h2694K0825k03897R5484a3157b724p2660k92274
$$ -512653 122466 -357927 -391283 -82694 -61869 -265766 -170282 -13157 -2724 -75384 -367658
18920c67658g8973D25535a56101N5751b5106k44855C69368b36646j87669d0238
$$ -367658 -78973 425535 -156101 -100350 -25106 -269961 369368 -236646 -424315 -40238
18909a26794C36599B6980M4306c07658b6763B39626E0717Q2436h544j06291A20944
$$ -126794 336599 26980 71286 -307658 -26763 239626 50717 133153 -8544 -114835 120944
18897A00453f7497D12814a407D19707j1171j03905G8322b04875A73664D8687a860
$$ 100453 -67497 412814 -1407 419707 408536 304631 78322 -204875 173664 48687 -1860
18885c59248i4526B8023b04464D9601b70485A45649k0050b17245B76902b80092
$$ -359248 -94526 28023 -204464 49601 -270485 145649 125599 -217245 276902 -280092
18874b90410o4624f420j84438m1755b8757j42458j04846A72778a06359C895b14963
$$ -290410 -355034 -6420 -190858 -232613 -28757 -171215 -276061 172778 -106359 3895 -214963
18862I6135R5278m7908J25926a94205E585P0232f6942B18874c30877c4719l5137
$$ 96135 191413 143505 269431 -194205 5585 75817 -66942 218874 -330877 -34719 -69856
18851f9856j07519A56879j1125b7157j39207I226a90892a5361k39905J14943j53544
$$ -69856 -177375 156879 145754 -27157 -166364 9226 -190892 -15361 -255266 -140323 -293867
18840b93867f2509A50774j6552A7334M8023O5578J61876a73178M5253C54884D1239
$$ -293867 -62509 150774 134222 17334 65357 130935 292811 -173178 -127925 354884 41239
18828A92228L3616a28207k8897A78760c05868M8121a18791m9709n677g8000j63842
$$ 192228 225844 -128207 -157104 178760 -305868 -257747 -118791 -168500 -174177 -78000 -241842
18817b41842j690f1028j5580L3623A12752c18911G6761P1838a05372L9118b3441
$$ -241842 -243532 -61028 -76608 -42985 112752 -318911 76761 148599 -105372 -66254 -23441
18805A44554c46062a19607N289J1275B7502K8502P9892j4629O7894L10317r6713
$$ 144554 -346062 -119607 -114318 -103043 27502 56004 135896 121267 189161 499478 402765
18794D02765C9235L31204E0864j6869K6825c8720j8636k67104B89407g5778j56081
$$ 402765 39235 370439 50864 33995 60820 -38720 -57356 -324460 289407 -75778 -231859
18783b31859A75420B5623Q5869b51233c2750A77417h9256j38437g9341c7528j83297
$$ -231859 175420 25623 111492 -251233 -32750 177417 -89256 -227693 -79341 -37528 -220825
18772b20825A14846C9632b06913j3516e8288o5595k06960a2189B7113b25682F5682
$$ -220825 114846 39632 -206913 -220429 -58288 -123883 -330843 -12189 27113 -225682 65682
18760b3300r3420m5278d1350j09804I0690a80033D0189a08731I1086a04229B16983
$$ -23300 -116720 -161998 -41350 -151154 90690 -180033 40189 -108731 91086 -104229 216983
18748a06249B58429b29938F910a42552H4467O0995g4568A35405c4077A89095e8726
$$ -106249 258429 -229938 6910 -142552 84467 145462 -74568 135405 -34077 189095 -58726
18736A06200O3884n4009a47799m8546l1190Q6866a1040B67358c30478C33897A08000
$$ 106200 170084 116075 -147799 -196345 -227535 -140669 -11040 267358 -330478 333897 108000
18724a37004d9841k7529A07172p053K02680a69680P9482E05d09936i1579o3654
$$ -137004 -49841 -77370 107172 100119 302799 -169680 -90198 505 -409936 -91579 -155233
18713a55233j04218B6629J3799i2666j02846r074o2501E2972J29435c03751J38392
$$ -155233 -259451 26629 40428 -92666 -195512 -204586 -267087 52972 182407 -303751 -165359
18702a65359K3288Q160B52758c27209a4037j4723J3403p8369I2340l9438K01839
$$ -165359 -142071 -133911 252758 -327209 -14037 -28760 -15357 -93726 92340 52902 254741
18691B54741a54683j4740D9734J37521K36874d44921a98086L8179k32503J37153
$$ 254741 -154683 -169423 49734 187255 424129 -444921 -198086 -159907 -392410 -255257
18681b55257B2633L1912e91322a36873D5449J01345g2212C78063b28884G8539
$$ -255257 22633 54545 -591322 -136873 45449 146794 -72212 378063 -228884 78539
18670A95917b11520h2951k03226R2574M9067D31868c58146a44194B06644f315
$$ 195917 -211520 -82951 -286177 -193603 -144536 431868 -358146 -144194 206644 -6315
18659c59493C6523c78441J30328G7249a0650j22683A08826b92208a8431j21477
$$ -359493 36523 -378441 -248113 77249 -10650 -133333 108826 -292208 -18431 -139908
18649a39908k01490a63144C6795c18329A55554m5529b69536i6612c7903A87421
$$ -139908 -341398 -163144 36795 -318329 155554 110025 -269536 -96612 -37903 187421
18638f8552l4310j55483F5706j9974K18037f5432l10872i7215D1574a32406K5218
$$ -68552 -102862 -258345 65706 45732 263769 -65432 -376304 -97215 41574 -132406 -107188
18627a07188B63879a55550M0863g440m4171p7228n3043h9349o1277A07845a91645
$$ -107188 263879 -155550 -114687 -7440 -51611 -128839 -181882 -89349 -150626 107845 -191645
18615b31070b7981E961K21115G6038L6287d6671J5303B7867a20060k16764A41446
$$ -231070 -27981 5961 227076 76038 112325 -46671 -31368 27867 -120060 -336824 141446
18603b66593G1894O1023J9045J29796i4518B7301b56030j4485B13790g7216q5474
$$ -266593 71894 132917 151962 281758 -94518 27301 -256030 -270515 213790 -77216 -162690
18592a62690F3831b4103q725j2497j81671b9538m1088l04170a36521A85265d2836
$$ -162690 63831 -24103 -32828 -45325 -226996 -29538 -70626 -374796 -136521 185265 -42836
18580a54655k8688E6897J23558Q6086q0209E3649c50492O8842b1742k91286B8495
$$ -154655 -183343 56897 180455 266541 186332 53649 -350492 -281650 -21742 -313028 28495
18568a67068j33500a05127A04579b00054p515A56892b13936Q192K3084k07611
$$ -167068 -300568 -105127 104579 -200054 -207569 156892 -213936 -205744 -182660 -390271
18558c90271A13781a36726H7247a52228M6403k9088g174k7334I7064c6220A01496
$$ -390271 113781 -136726 87247 -152228 -105825 -134913 -7174 -34508 97064 -36220 101496
18546B66864a0762j43726J6500f7446c2843C57485e9152p1181A21199a76284A48485
$$ 266864 -10762 -154488 -137988 -67446 -32843 357485 -59152 -130333 121199 -176284 148485
18534b175j71416B3384L805e9196j50581j32715b2369n4559C46919d4523A257
$$ -2175 -173591 23384 27189 -59196 -209777 -342492 -22369 -76928 346919 -44523 1257
18522B20039a12723m04502a16256E9583c1096o2726B57256n2214b26685i3885
$$ 220039 -112723 -517225 -116256 59583 -31096 -93822 257256 205042 -226685 -93885
18511a05626b2368A23754n5549R0631d9540q8442c5400j06503j24150A35586J22326
$$ -105626 -22368 123754 68205 158836 -49540 -137982 -35400 -141903 -266053 135586 257912
18500B57912C487b405l96641a61383B25394b40914h9762l5711m3421e329l9551
$$ 257912 3487 -2405 -399046 -161383 225394 -240914 -89762 -125473 -168894 -5329 -44880
18489d4880b511H4330A2053b94179e0923q4451k1623d2843q0203K3060H9417a95410
$$ -44880 -2511 84330 12053 -294179 -50923 -135374 -156997 -42843 -123046 -99986 89417 -195410
18476a23416A07530a16251n8103e5831d141F7581a0084j77692A30012B9416d27667
$$ -123416 107530 -116251 -174354 -55831 -4141 67581 -10084 -187776 130012 29416 -427667
18464d61075h873j19189A32169b53217F6330b62271B7597a57840A12056k2170
$$ -461075 -8873 -128062 132169 -253217 66330 -262271 27597 -157840 112056 89886
18454H9886J45686c66439p0181K09535P2139C3078a2113j85634A27392m2886K6948
$$ 89886 235572 -366439 -436620 -227085 -154946 33078 -12113 -197747 127392 84506 111454
18443A11454E1687f478C59791b99324a12693j99827d662B11592h1302p4759D7423
$$ 111454 51687 -6478 359791 -299324 -112693 -312520 -4662 211592 -81302 -156061 47423
18431a88282M3071A80914G5029K22230d46558a65093k51458J56911p937D22590
$$ -188282 -145211 180914 75029 297259 -446558 -165093 -416551 -259640 -267577 422590
18420c53135A50788J61304b46375c7815A16284i1060B10350d31652A22217f483
$$ -353135 150788 312092 -246375 -37815 116284 -91060 210350 -431652 122217 -6483
18409c7884B43288B3409a49310e7453F1949d4188B28299e78023e6718l43982J94941
$$ -37884 243288 23409 -149310 -57453 61949 -44188 228299 -578023 -56718 -400700 -205759
18398b05759Q8384m2254c893k07144r214E8370e6535E7003a19624q9438C0183
$$ -205759 -117375 -159629 -3893 -211037 -220251 58370 -56535 57003 -119624 -209062 30183
18386d3958m3781E5840K6766a96681A35637a68633F3044k7979a34634n2381D5766
$$ -43958 -87739 55840 82606 -196681 135637 -168633 63044 35065 -134634 -187015 45766
18374B37216j14337c76537J27171e914C3985b46201L3506H8706j1877c41642b9705
$$ 237216 122879 -376537 -249366 -5914 33985 -246201 -212695 88706 76829 -341642 -29705
18362E47801d5094G67N0502J69689l2185g7411m8196G5427J75120M5457A5142
$$ 547801 -45094 767 51269 220958 188773 -77411 -125607 75427 250547 296004 15142
18350b90060I4317N0929i9572C21581b68916J17584A63677b33989B3632d07412
$$ -290060 94317 145246 -99572 321581 -268916 -151332 163677 -233989 23632 -407412
18339a53912A68643I157L895h3937j588C46847B8516a38100q4432R7172F4745
$$ -153912 168643 9157 13052 -83937 -85525 346847 28516 -138100 -222532 -125360 64745
18327A08660a64202q6878H183O0889q878b37543c9969j17674c9832B9469J0087
$$ 108660 -164202 -251080 8183 69072 60194 -237543 -39969 -157643 -39832 29469 39556
18316C9556a65905B56661h2716k27398a09301A12411D6729a01579I4036A1003
$$ 39556 -165905 256661 -82716 -310114 -109301 112411 46729 -101579 94036 11003
18305A52342a52906e1791o2267I2672i4264o6701A18809c6633j36H1844b3780
$$ 152342 -152906 -51791 -114058 92672 -94264 -160965 118809 -36633 -36769 81844 -23780
18293B74955F3309e2409J862J9101c530n567F5384a66901I88a52059D7240a0361
$$ 274955 63309 -52409 -50547 -31446 -3530 -9097 65384 -166901 988 -152059 47240 -10361
18280D9841a72651A73121C2266N1002b81420A83660d3549H5503b29132D1666b74421
$$ 49841 -172651 173121 32266 83268 -281420 183660 -43549 85503 -229132 41666 -274421
18268f3321a7147k21422G0633d19059g412j00150o263A46136E1277F468c77052
$$ -63321 -17147 -238569 70633 -419059 -7412 -107562 -113825 146136 51277 6468 -377052
18256i93l16296J36673j95036a86169a0467B20524a27300r0625P9366M8074A59155
$$ -993 -317289 -180616 -375652 -186169 -10467 220524 -127300 -217925 -138559 -90485 159155
18244B74720C7687J89091A06755K86384E8966g9670H5183h5868D1690g8448I3009
$$ 274720 37687 226778 106755 393139 58966 -79670 85183 -85868 41690 -78448 93009
18232A25922b8915r7871R274m3595B58316b53028A60696n016b51269C09859c9457
$$ 125922 -28915 -126786 -117512 -161107 258316 -253028 160696 155680 -251269 309859 -39457
18220e26278b5994B35889o6685d34878B14332j03842C2630a54541A09540f1584
$$ -526278 -25994 235889 169204 -434878 214332 110490 32630 -154541 109540 -61584
18209a10266H5750k0197j6117b01667n587i2617A0664f1593b624j29315J2102
$$ -110266 85750 65553 49436 -201667 -207254 -92617 10664 -61593 -2624 -131939 -119837
18198a19837M632C7373b19023D091M3428A3602b36525F8519c25089I4739N6667
$$ -119837 -115205 37373 -219023 4091 47519 13602 -236525 68519 -325089 94739 151406
18187A51406a01437L9073A5237b40686Q2784H94a38511k00644C1086a66198G5082
$$ 151406 -101437 -62364 15237 -240686 -157902 894 -138511 -339155 31086 -166198 75082
18175a25942J7527d1816o9102A09011f54950b2462p3730k4365D1991a66360e6958
$$ -125942 -108415 -41816 -110918 109011 -654950 -22462 -96192 -120557 41991 -166360 -56958
18163B34414j12784J26299a10672m1513a477C6a84044n0394A69574j527a01302
$$ 234414 121630 247929 -110672 -152185 -1477 36 -184044 -234438 169574 168047 -101302
18151a46543M6910F1867K28379F1514K72567i695j23639b8491k70069g4205j8246
$$ -146543 -99633 61867 290246 61514 334081 -9695 -133334 -28491 -298560 -74205 -92451
18140i2451o5678A96768a67466A12765L7109n0134a251A72601a17163b8352g440
$$ -92451 -158129 196768 -167466 112765 149874 99740 -1251 172601 -117163 -28352 -7440
18128A23323b1364F4396A1410d17276a52939A5912a08087a7667j38726k1493A35966
$$ 123323 -21364 64396 11410 -417276 -152939 15912 -108087 -17667 -156393 -177886 135966
18116a81082A74629J0627A0287b65967A2202Q6660b56723P8965Q6736O963A14473
$$ -181082 174629 185256 10287 -265967 12202 98862 -256723 -177758 -91022 -84059 114473
18104A54200M0261c366j25377C47477A04948a4854j66532A54469a28969B64047
$$ 154200 194461 -3366 -128743 347477 104948 -14854 -181386 154469 -128969 264047
18093a10509b2844A88671a6199j00331J0604b9029r7449f2142J6768A37189b35197
$$ -110509 -22844 188671 -16199 -116530 -105926 -29029 -126478 -62142 -45374 137189 -235197
18081g8142k24053f7659B11283c7494H733a84081h8403J7258o5997A03320J72264
$$ -78142 -302195 -67659 211283 -37494 8733 -184081 -88403 -71145 -137142 103320 275584
18070B75584F7244B7210L51870A17771b71278i5477o6207A03627g5956k99155
$$ 275584 67244 27210 379080 117771 -271278 -95477 -161684 103627 -75956 -375111
18060c75111J08588c2939p7366n9804B914a47750g3207j57312A18510c0533l90164
$$ -375111 -266523 -32939 -110305 -170109 2914 -147750 -73207 -230519 118510 -30533 -420697
18049d20697c9878k00540E8860d1091c739o9040B29655p6723R4412i77D8125a13407
$$ -420697 -39878 -240418 58860 -41091 -3739 -72779 229655 152932 247344 -977 48125 -113407
18036E9588b4946g472E755J62017n8444A2557e5310C756L28688j46012B3910d619
$$ 59588 -24946 -7472 5755 167772 109328 12557 -55310 3756 332444 186432 23910 -4619
18023A89001A7718k913a11101d1050j52551A04534b44260A64478i1547p1573C61995
$$ 189001 17718 14805 -111101 -41050 -193601 104534 -244260 164478 -91547 -163120 361995
18011a95110B27026A10988d6302J8933d793j9492A9742L5255a89784M1476N0770
$$ -195110 227026 110988 -46302 -27369 -4793 -24285 19742 54997 -189784 -148308 -97538
18000i7538B30117C2947a32019n7625a2898n9300D4860f6578o8650A279a50811
$$ -97538 230117 32947 -132019 -189644 -12898 -72198 44860 -66578 -135228 1279 -150811
17988B03908A2021b9129A56192g4355I0298d23099d2590B16541A0296P5353K6649
$$ 203908 12021 -29129 156192 -74355 90298 -423099 -42590 216541 10296 85649 112298
17977A12298B5508c15427C81579c1951A24769d25098A84973e9816k64993D0108
$$ 112298 25508 -315427 381579 -31951 124769 -425098 184973 -59816 -324809 40108
17966A76837J22901F3919j5064K9485K37378A15391b65107f277D8818e2451j95702
$$ 176837 299738 63919 48855 78340 315718 115391 -265107 -6277 48818 -52451 -248153
17955b48153N5111D81508c1215G0965e7150K3368j75103B49094m1649a32659a3864
$$ -248153 -193042 481508 -31215 70965 -57150 -33782 -208885 249094 207445 -132659 -13864
17943a90104i3409e207B27536K0854j06191d1977A66262f7130A39975a14622I9666
$$ -190104 -93409 -5207 227536 248390 142199 -41977 166262 -67130 139975 -114622 99666
17931c4169A22467m5096e2838k57402G1127a05238A18723E0710J10688J09590
$$ -34169 122467 77371 -52838 -310240 71127 -105238 118723 50710 161398 270988
17921B70988a93388E3323L714J36525h3804n7105o7481B20484Q967P8632p9918
$$ 270988 -193388 53323 57037 193562 -83804 -140909 -208390 220484 229451 308083 228165
17910B28165a1954n919j30031p7623j26901C4834f5507C70178G0818e8597p8868
$$ 228165 -11954 -17873 -147904 -225527 -352428 34834 -65507 370178 70818 -58597 -137465
17899a37465A2593J19048b01186L0369L1783D0092b02791G8120L2251j4419K48098
$$ -137465 12593 131641 -201186 -170817 -139034 40092 -202791 78120 110371 95952 344050
17888C44050A20943N7642E8527J21346a01090D6320J17410m5138E6001K8830C6455
$$ 344050 120943 178585 58527 179873 -101090 46320 163730 118592 56001 84831 36455
17876H7260N3867c46179J12843J13823I7963b84406J02051L3959A97782d0002
$$ 87260 141127 -346179 -233336 -119513 97963 -284406 -182355 -148396 197782 -40002
17865A18932J64969H5746d95j449r2597b671E0258a50480j90700D9466j2604d6493
$$ 118932 283901 85746 -495 -1944 -94541 -2671 50258 -150480 -341180 49466 36862 -46493
17852f1601P699B17039b02387r6902A80861d4543A60137G4656h2393A73000K07434
$$ -61601 -53902 217039 -202387 -299289 180861 -44543 160137 74656 -82393 173000 380434
17841C80434G1412g1477r9590D7757J11555a74002C0191K48525p4681F5007a3000
$$ 380434 71412 -71477 -171067 47757 159312 -174002 30191 278716 204035 65007 -13000
17829e3608H0910A1192J06902c47321h8607A71087J59884b332A36287f4835j9497
$$ -53608 80910 11192 118094 -347321 -88607 171087 330971 -2332 136287 -64835 -84332
17818h4332f515B47579G975J15468J55029c25162J46184k5137j26803A5500b61594
$$ -84332 -6515 247579 7975 123443 278472 -325162 -178978 -204115 -330918 15500 -261594
17806c8224D60187b14416B29530a34108A31170b09206R8736j18887C01220a57124
$$ -38224 460187 -214416 229530 -134108 131170 -209206 -110470 -229357 301220 -157124
17795a5708B84902I0734J01358J04874j34786a66014A49837a87706A13559j7651
$$ -15708 284902 90734 192092 296966 162180 -166014 149837 -187706 113559 95908
17785I5908m4718e5304J1004f366E9258K9449a0156I6622l1324M0584a51296P2674
$$ 95908 51190 -55304 -44300 -6366 59258 88707 -10156 96622 65298 105882 -151296 -78622
17773g8622k03724H005L5014i5165B47972F2186c8281C19532M7199c882l08796
$$ -78622 -282346 8005 43019 -95165 247972 62186 -38281 319532 366731 -3882 -312678
17762c12678C41042h1422j71130F6891K25992a6557k89579f4897F2740K0907K0422
$$ -312678 341042 -81422 -252552 66891 292883 -16557 -306136 -64897 62740 83647 104069
17751A04069a7445E6148M9734R9403n0580K60596b74011N1939I0171K63090D8909
$$ 104069 -17445 56148 105882 205285 154705 415301 -274011 -222072 90171 353261 48909
17739a01414C74835I6234B4488J14899a44844A25185m9340d24257A98865a82521
$$ -101414 374835 96234 24488 139387 -144844 125185 75845 -424257 198865 -182521
17728F5296L12904I237a91591A13200J51565b4163L129A36571F0962J91439k0852
$$ 65296 378200 9237 -191591 113200 264765 -24163 -21034 136571 60962 252401 231549
17717B31549a30568B60677j02384a301j8097F8962e0307A5449K1679e5013B98965
$$ 231549 -130568 260677 158293 -1301 -19398 68962 -50307 15449 37128 -55013 298965
17705A51951A5140K80392a24195e0220C88946H2192J93603a40762A20632E3807
$$ 151951 15140 295532 -124195 -50220 388946 82192 275795 -140762 120632 53807
17694C828P9521J45119d1282D5872a70378g0404B31791h5057M1073B62038J62209
$$ 3828 83349 228468 -41282 45872 -170378 -70404 231791 -85057 -43984 262038 424247
17683D24247E5291a37670A66193h5972C65038f580o7951E1851J84679J3420N6386
$$ 424247 55291 -137670 166193 -85972 365038 -6580 -74531 51851 236530 249950 306336
17672C06336I0907d0999D195J7166J49232h55F6041M0239K68479e4930j19069
$$ 306336 90907 -40999 4195 21361 170593 -855 66041 106280 374759 -54930 -173999
17661a73999A79847P8017M2236j10542e2379E3930R4623A7974a54888H7167A333
$$ -173999 179847 257864 300100 189558 -52379 53930 148553 17974 -154888 87167 1333
17649i2627A45878a73729B24735a50885C01908a50307B51556g8581j07753B7536
$$ -92627 145878 -173729 224735 -150885 301908 -150307 251556 -78581 -186334 27536
17638D5344K00376A13349J03412E5851k4134J01613L2340L9236D1981b06734C68370
$$ 45344 245720 113349 216761 55851 31717 133330 165670 204906 41981 -206734 368370
17626b98702i509A77643a8441o172F2555R5276d525A16457d31259D9722K39768
$$ -298702 -9509 177643 -18441 -24613 62555 157831 -4525 116457 -431259 49722 289490
17615B89490C8518J16307c5264D11432b14142C6216a22008f0614a2636C2459J15442
$$ 289490 38518 154825 -35264 411432 -214142 36216 -122008 -60614 -12636 32459 147901
17604A47901a78390D7034J56924r0723P5110o2960d15546A72912E8133a22861
$$ 147901 -178390 47034 203958 113235 188345 125385 -415546 172912 58133 -122861
17593A91518B2366K25045J31085f0486B12912a49024A0047a03422B49013I6956
$$ 191518 22366 247411 378496 -60486 212912 -149024 10047 -103422 249013 96956
17582E6407J16661K5158e6934A34356l1178C9395K6928K8572i9598A76228E1706
$$ 56407 173068 198226 -56934 134356 103178 39395 66323 94895 -99598 176228 51706
17570E8290O9495F2834Q0615L8616J80819A53229C6491M168i8978B21420R3661
$$ 58290 127785 62834 143449 182065 362884 153229 36491 40659 -98978 221420 315081
17559C15081a36883B64857A25317o505c5319D63898j04270d7566A80837J07554
$$ 315081 -136883 264857 125317 118812 -35319 463898 359628 -47566 180837 288391
17549B88391D3327J41057J881r2517J13019p5908O3797a25929C99207A38642P2708
$$ 288391 43327 184384 186265 93748 206767 130859 194656 -125929 399207 138642 211350
17538B11350o7491C1951J27867a0760C56195G7587J47871K82724k50312J38142
$$ 211350 143859 31951 159818 -10760 356195 77587 225458 508182 257870 396012
17528C96012O5756f3619B49134p1783P5251K76059A41867J03207m2207q7152K29395
$$ 396012 461768 -63619 249134 177351 252602 528661 141867 245074 202867 115715 345110
17517C45110M7901l271j24881Q1098Q7591J25969R6472n1564J68143L78536l96110
$$ 345110 393011 389740 264859 345957 433548 559517 655989 604425 772568 1151104 754994
17506G54994M08625C67772Q6243m7923J31671j58473k7841j54016J78243K76382
$$ 754994 1163619 367772 454015 406092 537763 379290 351449 197433 375676 652058
17496F52058r392l4747K03495o3985J9836J4316l24683j23556J30030Q1328L6078
$$ 652058 642666 607919 811414 747429 767265 781581 456898 333342 463372 544700 580778
17485E80778g1054B40862A17250N72919A27615M31885j01243B27669O0611K7659
$$ 580778 -71054 240862 117250 690169 127615 559500 458257 227669 288280 315939
17475C15939K15439L2032j97425m8994k497K38082B05016M6410p6061J43294a73475
$$ 315939 531378 563410 365985 316991 314494 552576 205016 251426 175365 318659 -173475
17463A14315L27140E4772P6689P2163J64341m1475G4671l0624d5185F9327K03987
$$ 114315 441455 54772 131461 203624 367965 326490 74671 44047 -45185 69327 273314
17452B73314j7624j13590L66357A54389Q6035r7853k394n0535p950Q9891L21147
$$ 273314 255690 142100 508457 154389 240424 142571 140177 89642 81692 171583 492730
17441D92730q094k32441g542C79944J3233C6940K44505k199J74459J79823k41524
$$ 492730 484636 252195 -7542 379944 393177 36940 281445 279246 453705 633528 392004
17430C92004j02995J1044R9982B9600K25434K2069K02817K46079r6328B17221
$$ 392004 289009 300053 400035 29600 255034 277103 479920 725999 629671 217221
17419C98168N4475j84576A29955J21894P2567j11588L2735L26173o274k37852
$$ 398168 452643 268067 129955 251849 324416 212828 245563 571736 565462 327610
17409C27610j44430K62386k4118A73226N48264l16241n3273A5531K75753j11984
$$ 327610 183180 445566 421448 173226 721490 405249 351976 15531 291284 179300
17399A79300L61689n3230j8091A38020m2622P0293M14838B24182K6522k6563a19322
$$ 179300 540989 487759 469668 138020 95398 165691 580529 224182 250704 224141 -119322
17387a0300A87801K64314O09A13964N6759B645J54962p5144J71856A04565K92293
$$ -10300 187801 452115 452724 113964 170723 2645 157607 82463 254319 104565 396858
17376C96858j31356F107L97486Q5948B12983K38465j14342A43574d1802A13547
$$ 396858 265502 6107 403593 489541 212983 451448 337106 143574 -41802 113547
17365B85661G9718K21714R9834j83493J52063J14220k19035A19750E8171J80046
$$ 285661 79718 301432 401266 217773 369836 484056 265021 119750 58171 238217
17355B38217R8357A20349J16038M0097c4838A91000M6222M8732A27606l1940A5485
$$ 238217 336574 120349 236387 276484 -34838 191000 237222 285954 127606 95666 15485
17343I2216L74733J4690I5786j1493L28230C4465L38042L0488j52197L7636m3450
$$ 92216 466949 481639 95786 84293 412523 34465 372507 402995 250798 288434 244984
17332B44984g9419e059B86075J18859J22236A80023F4094b4140C2763M32850j7896
$$ 244984 -79419 -5059 286075 404934 527170 180023 64094 -24140 32763 465613 447717
17321D47717q016n8042j89378c9455C0049L75710p5003b9737A67041M0182q8559
$$ 447717 439701 381659 192281 -39455 30049 405759 330756 -29737 167041 207223 118664
17310A18664m3543J19304I7067K68278J8715A91938R769k6508R3802N0211R2396
$$ 118664 75121 194425 97067 365345 384060 191938 201707 175199 269001 319212 411608
17299D11608m2995a30217B89094q3469j7040Q7259L28573j68074j70275L9313
$$ 411608 368613 -130217 289094 205625 188585 275844 604417 436343 266068 305381
17289C05381r4899r3613J7383J27714J37377j08205a48941H0104L31280j83003
$$ 305381 210482 116869 134252 261966 399343 291138 -148941 80104 411384 228381
17279B28381K03964k16044J16839L0096n23l2515J79033j43110j09793J63971
$$ 228381 432345 216301 333140 363236 362713 330198 509231 366121 256328 420299
17269D20299j6306A82546c2493l8211A15753J84130C3309M94296j25249P6663
$$ 420299 403993 182546 -32493 -70704 115753 299883 33309 527605 402356 479019
17259D79019l128k31667m4176J16141J6233j1724a8674D08758A45306Q1496K12864
$$ 479019 475891 244224 200048 316189 332422 320698 -18674 408758 145306 226802 439666
17248D39666j59268H9339L25718J69921A82J25632e607D99982A26066L67077j38543
$$ 439666 280398 89339 415057 584978 182 125814 -5607 499982 126066 493143 354600
17237C54600A73143J11298J5959J32628B09598K99202A65043Q2958L3136n1756
$$ 354600 173143 284441 300400 433028 209598 508800 165043 248001 281137 229381
17227B29381J84540G0183L02810L97970B01319K3055K11315b619B32377N2256
$$ 229381 413921 70183 372993 770963 201319 224374 435689 -2619 232377 284633
17217B84633J88310A35102N24518A61963j0139J17034N43821I4938L5936L64933
$$ 284633 472943 135102 659620 161963 151824 268858 812679 94938 130874 495807
17207D95807A21555j8400L46415N2103K19315B27637J17423j24315K15892a44856
$$ 495807 121555 103155 449570 501673 720988 227637 345060 220745 436637 -144856
17196D61408j62426J58227l763j96981K57798j64771J55670L18190B20608J91461
$$ 461408 298982 457209 453446 256465 514263 349492 505162 823352 220608 412069
17186D12069j63697K30139k30809J33555J55726k62743L11785n9605l3232J23568
$$ 412069 248372 478511 247702 381257 536983 274240 586025 526420 493188 616756
17176F16756q5400B58067K54656k25311N871R4037q9355p9722J39312j10802D6945
$$ 616756 531356 258067 512723 287412 293283 387320 297965 218243 357555 246753 46945
17164E87644k42503A49917P11697C79073o7675O6501n2354G1187L26174J75179
$$ 587644 345141 149917 861614 379073 311398 377899 325545 71187 397361 572540
17154E72540B11486J18684K29826j07906c9649E22871j93676J20288K33824L9887
$$ 572540 211486 330170 559996 452090 -39649 522871 329195 449483 683307 723194
17144G23194C48896J63354j88867K07389k35513K19865j9657a9207H32102l94792
$$ 723194 348896 512250 323383 530772 295259 515124 495467 -19207 832102 437310
17134D37310j01847J7867L52337k39928K85903k70818j29524j6991L32091j18037
$$ 437310 335463 353330 705667 465739 751642 480824 351300 334309 666400 548363
17124E48363o6049j10437J20351N7762L16207L6512C24383L09135o8013B38195
$$ 548363 482314 371877 492228 549990 866197 902709 324383 633518 565505 238195
17113E10252B37249L05268r8133K0712J87275k46280K03721j0540j82273K83591
$$ 510252 237249 542517 444384 465096 652371 406091 609812 599272 416999 700590
17103G00590B88086M58793j79277L48788k36837j577l21650J91660J78282l58006
$$ 700590 288086 746879 567602 916390 679553 677976 356326 547986 726268 368262
17093C68262Q0694L26372N1608j63055j73317J49608k43686K25317j06016J56699
$$ 368262 448956 775328 826936 663881 490564 640172 396486 621803 515787 672486
17083F72486J99803m15588K74256p2854p5170j2522O084L17598k54448K349j22426
$$ 672486 872289 456701 730957 658103 582933 570411 576495 894093 639645 641994 519568
17072E19568M9522k13599L00157l7516o2009j02846N18967J76795C43294L62023
$$ 519568 569090 355491 655648 618132 556123 453277 972244 1149039 343294 705317
17062G05317n0690j39300J02154K28886k95183j35692N1016J55540j00881L41973
$$ 705317 654627 515327 617481 846367 551184 415492 466508 622048 521167 863140
17052H63140j93753p2149K95496k49241K96192q2313J70025l59586K622J12455
$$ 863140 669387 597238 892734 643493 939685 857372 1027397 667811 670433 782888
17042G82888J51948k74389K50222j77494K36020M5582n7200k91501k3933j31270
$$ 782888 934836 660447 910669 733175 969195 1014777 957577 666076 642143 510873
17032E10873L96699j54038K02310J4089r1152K6832m23610M44328k31801R3307
$$ 510873 907572 753534 955844 969933 878781 905613 482003 926331 694530 787837
17022G87837k70661L71322q0985l10769K06675L1317K69061k19527L58183k04295
$$ 787837 517176 888498 807513 496744 703419 734736 1003797 784270 1142453 938158
17012I38158o6484M54587l75424k23718J92693L4616j16386k7041N55791l89894
$$ 938158 871674 1326261 950837 727119 919812 954428 838042 811001 1366792 976898
17002I76898R4172q7803Q4100q2204R5280l20974M16362k00101J61651o3272j77511
$$ 976898 1071070 983267 1067367 985163 1080443 759469 1175831 975730 1137381 1074109 896598
16991H96598J31821k41971L51259j47614K58067k87278K08208n7754q1546J32102
$$ 896598 1028419 786448 1137707 990093 1248160 960882 1169090 1111336 1029790 1161892
16981A161892p7788N22107m78001K69362k11052k25742J35627l0579L49647J25376
$$ 1161892 1084104 1606211 1128210 1397572 1186520 960778 1096405 1065826 1415473 1540849
16971A540849j78569l07262M20696k79186k02049K67073P9270R2891k14748K4550
$$ 1540849 1362280 1055018 1475714 1196528 994479 1261552 1340822 1433713 1218965 1243515
16961A243515K55001j9209r0789m8259k59509L51701J08997j67148j60316K6620
$$ 1243515 1498516 1479307 1388518 1340259 1080750 1432451 1541448 1374300 1213984 1240604
16951A240604J5007K97802o143l2164J53953o2466k30466K35709k8645L15273
$$ 1240604 1255611 1553413 1547270 1515106 1669059 1606593 1376127 1611836 1583191 1898464
16941A898464k02507L00271o87223J86101K0004j45743N51756l49309O3366k9167
$$ 1898464 1695957 1996228 1309005 1495106 1515110 1369367 1921123 1571814 1635180 1606013
16931A606013N9163J65797k25684P8758J04296J76445n9239j61926K36962j45126
$$ 1606013 1665176 1830973 1605289 1684047 1788343 1964788 1905549 1743623 1980585 1835459
16921A835459j84951K95287r6996j12739M34177j48350j6608J04788j75856J40674
$$ 1835459 1650508 1945795 1848799 1736060 2170237 2021887 2005279 2110067 1934211 2074885
16911B074885j68038M43163j32330K5281j88J2565O4280Q9197j33390K47228p4343
$$ 2074885 1906847 2350010 2217680 2242961 2242773 2255338 2319618 2408815 2275425 2522653 2448310
16900B448310l26694L24799J57260j37061m83084K82076P65L02029m50220L53695
$$ 2448310 2121616 2446415 2603675 2466614 1983530 2265606 2266371 2568400 2118180 2471875
16890B471875k43823J54567K79595j07363o5743J29496k22671L90314j06495J17829
$$ 2471875 2228052 2382619 2662214 2554851 2489108 2618604 2395933 2786247 2679752 2797581
16880B797581k42260L15703l91657L62560N18301m42817L07206r3032k02112n1261
$$ 2797581 2555321 2871024 2479367 2841927 3360228 2917411 3224617 3131585 2929473 2878212
16870B878212N79582l21182K40904K09455k89025q7093J87024k3941J33778o145
$$ 2878212 3457794 3136612 3377516 3586971 3297946 3210853 3397877 3373936 3507714 3501569
16860C501569r7728L22460j40809J83461L2981k80481K17027L27519j1381k05405
$$ 3501569 3403841 3726301 3585492 3768953 3801934 3521453 3738480 4065999 4054618 3849213
16850C849213J10902Q0893J82620Q6703j20174K39817j63867L36977J15048q4808
$$ 3849213 3960115 4041008 4223628 4310331 4190157 4429974 4266107 4603084 4718132 4633324
16840D633324R0427m4495o6713M67711k020j35940J65220L41041k81850J59083
$$ 4633324 4723751 4679256 4612543 5080254 5078234 4942294 5107514 5448555 5166705 5325788
16830E325788j13536L11972M79407k60816O4070R6207K70199p2485K21213j8898
$$ 5325788 5212252 5524224 6003631 5742815 5806885 5903092 6173291 6100806 6322019 6303121
16820F303121J28984J41553L60926k626j88721J66004J80192l010R3008N24181
$$ 6303121 6432105 6573658 6934584 6931958 6743237 6909241 7089433 7086423 7179431 7703612
16810G703612M5586K18925P8337r2484J92625M00530J5970J16794N35761k57002
$$ 7703612 7749198 7968123 8046460 7953976 8146601 8547131 8563101 8679895 9215656 8958654
16800H958654J31338N90592j99961M86270O7712L51825J06212N71821J23196p8477
$$ 8958654 9089992 9680584 9480623 9966893 10034605 10386430 10492642 11064463 11187659 11109182
16790A1109182M31477M16734K21594Q8268J49942N06848j0509Q71191K84967M7172
$$ 11109182 11540659 11957393 12178987 12267255 12417197 12924045 12913536 13784727 14069694 14116866
16780A4116866O45581L07552k29373L07388O39536O54498P9736R21299J04229
$$ 14116866 14762447 15069999 14840626 15148014 15787550 16442048 16521784 17443083 17547312
16771A7547312J227011j14735P39030P79966J27834O99203P96135P83361K40764
$$ 17547312 18774323 18659588 19398618 20178584 20306418 21005621 21801756 22585117 22825881
16762B2825881J028118O06645Q77744P94642Q57085R87478Q51723Q09190R52239
$$ 22825881 23853999 24460644 25338388 26133030 26990115 27977593 28829316 29638506 30590745
16753C0590745R08654J186638Q81559J483889J176991J386169J540208J491647
$$ 30590745 31499399 32686037 33567596 35051485 36228476 37614645 39154853 40646500
16745D0646500J529319J499883J705963J412513K215489J933868J945815J575157
$$ 40646500 42175819 43675702 45381665 46794178 49009667 50943535 52889350 54464507
16737E4464507K572560K367474K375357K305546K695764K743681K814726L222624
$$ 54464507 57037067 59404541 61779898 64085444 66781208 69524889 72339615 75562239
16729G5562239K968922K933536L130694L464237L198700L462294L838705L458761
$$ 75562239 78531161 81464697 84595391 88059628 91258328 94720622 98559327 102018088
16721A02018088L826433L392288L560251L420950L321049L489591K876204K916898
$$ 102018088 105844521 109236809 112797060 116218010 119539059 123028650 125904854 128821752
16713A28821752K864190K040671K086821J651743J437751P15281J92535J83482
$$ 128821752 131685942 133726613 135813434 137465177 138902928 139618209 139810744 139994226
16705A39994226m90153o53932j317966j880221k386543k285557k586833l090890
$$ 139994226 139504073 138850141 137532175 135651954 133265411 130979854 128393021 125302131
16697A25302131l214860l475304l333558l898312l498868m096534l688233l738810
$$ 125302131 122087271 118611967 115278409 111380097 107881229 103784695 100096462 96357652
16689I6357652l420882l474547l793393k996217l560221l369743l003782l090210
$$ 96357652 92936770 89462223 85668830 82672613 79112392 75742649 72738867 69648657
16681F9648657k734114k541707k779010k400691k758537j835597k418648j952252
$$ 69648657 66914543 64372836 61593826 59193135 56434598 54599001 52180353 50228101
16673E0228101k228996j592678k006387j129066k052404j676715j585678j219503
$$ 50228101 47999105 46406427 44400040 43270974 41218570 39541855 37956177 36736674
16665C6736674j228298j369745j324114r68205j399291o15919q77693j169520
$$ 36736674 35508376 34138631 32814517 31846312 30447021 29831102 28953409 27783889
16657B7783889q25201j222203m56399j170439n25776p99846l21003j086954n28314
$$ 27783889 26958688 25736485 25280086 24109647 23583871 22784025 22463022 21376068 20847754
16648B0847754n81339o77919k63933p88181m57920n48466m81403k96560n25522
$$ 20847754 20266415 19588496 19324563 18536382 18078462 17529996 17048593 16752033 16226511
16639A6226511o58055l50346k52008m49321m82720m09005k49621k89692l72870
$$ 16226511 15568456 15218110 14966102 14516781 14034061 13625056 13375435 13085743 12712873
16630A2712873l13762k18319n44772p1528k19994l60177K2256p18750J88537j64997
$$ 12712873 12399111 12180792 11636020 11564492 11344498 10984321 11006577 10287827 10476364 10311367
16620A0311367k30535l63130l18196k923l07618k20693j11143M0904k76992p7594
$$ 10311367 10080832 9717702 9399506 9396583 9088965 8868272 8757129 8798033 8521041 8443447
16610H443447k94607j51698l02971J64384j38913m31208J18217j99604k21395
$$ 8443447 8148840 7997142 7694171 7858555 7719642 7288434 7406651 7207047 6985652
16601F985652j69085l82351k31700K77269m1274j00616k10081j4727j00036m41161
$$ 6985652 6816567 6434216 6202516 6479785 6438511 6337895 6127814 6113087 6013051 5571890
16591E571890J45146l19248K6753n7296q0760m9698j40794P3087m7142k20747
$$ 5571890 5717036 5397788 5424541 5367245 5286485 5236787 5095993 5169080 5121938 4901191
16581D901191j53319n4618K46710n25755J99988Q5475l67918l58826L23093k59347
$$ 4901191 4747872 4693254 4939964 4414209 4614197 4699672 4331754 3972928 4296021 4036674
16571D036674L40736l00684j30018j95731N09724l50571j65370M704k26025L84780
$$ 4036674 4377410 4076726 3946708 3750977 4260701 3910130 3744760 3749464 3523439 3908219
16561C908219o6833j32060j2910O4839m81503M28706l73926K30940O5030o58179
$$ 3908219 3841386 3709326 3696416 3761255 3279752 3708458 3334532 3565472 3630502 2972323
16551B972323J27496j19237J58117j70925j60345M23975j67778O3280j76665l52088
$$ 2972323 3099819 2980582 3138699 2967774 2807429 3231404 3063626 3126906 2950241 2598153
16541B598153l3564N43491n04532l7655J14444k4167j10851J49486P8603r5488
$$ 2598153 2564589 3108080 2603548 2565893 2680337 2656170 2545319 2694805 2773408 2677920
16531B677920J26367n58355J69653M8346K826J05039M58465r18771J08370J35142
$$ 2677920 2804287 2245932 2415585 2463931 2466757 2571796 3030261 2111490 2219860 2355002
16521B355002j58801o8168O22627m02751k74490K74634k43970J13116k10569j67666
$$ 2355002 2196201 2128033 2750660 2347909 2073419 2348053 2104083 2217199 2006630 1838964
16511A838964J95099p647J1436q8121J81122l34328n0705L33440k25989j77590
$$ 1838964 2034063 2026416 2037852 1949731 2130853 1796525 1745820 2079260 1853271 1675681
16501A675681L79361l54820J46266N1411j10449k39512K03067J8378J09514j35649
$$ 1675681 2055042 1700222 1846488 1897899 1787450 1547938 1751005 1769383 1878897 1743248
16491A743248R87o18311M68218k03503J28892p2575J75168j53521N67567l99973
$$ 1743248 1744235 1125924 1594142 1390639 1519531 1446956 1622124 1468603 2036170 1636197
16481A636197o1307n21900O00513J06762k39116R4178r4750q4974J32364j02678
$$ 1636197 1574890 1052990 1653503 1760265 1521149 1615327 1520577 1435603 1567967 1465289
16471A465289q3306J04383j97038J35857j50598K5894J37175l33251K23403Q2074
$$ 1465289 1381983 1486366 1289328 1425185 1274587 1300481 1437656 1104405 1327808 1409882
16461A409882J38746j12738o21598K60064R2480O3848k2703K68709k61150j14703
$$ 1409882 1548628 1435890 814292 1074356 1166836 1230684 1207981 1476690 1215540 1100837
16451A100837J75334k05573J49898q3629m9261J98455j22039l19109L88738M1568
$$ 1100837 1276171 1070598 1220496 1136867 1087606 1286061 1164022 844913 1233651 1275219
16441A275219j58270p8189k06979K76983n4747J01873j09513J46554j59096j36086
$$ 1275219 1116949 1038760 831781 1108764 1054017 1155890 1046377 1192931 1033835 897749
16431H97749k32384N6663M67797k54531K22952j24195R8773l16889M1226K36763
$$ 897749 665365 722028 1189825 935294 1158246 1034051 1132824 815935 857161 1093924
16421A093924j27057M4535N4312j2584n1493J99424k43873k05088L46837j34658
$$ 1093924 966867 1011402 1065714 1053130 1001637 1201061 957188 752100 1098937 964279
16411I64279j03177J66479J09219J34065l38732k42341J83751l5750p6622L93287
$$ 964279 861102 1027581 1136800 1270865 932133 689792 873543 837793 761171 1154458
16401A154458l00062M43439F30569K54403r5876K1936j7534l83782N86284m44188
$$ 1154458 854396 1297835 630569 884972 789096 811032 793498 409716 996000 551812
16391E51812K51639q1509P1777K17976D26757N35348m66063K76021K03241m19419
$$ 551812 803451 721942 793719 1011695 426757 962105 496042 772063 975304 555885
16381E55885J97974Q971j4010L814K32618D16287J22874J19220J42582l62116
$$ 555885 753859 762830 748820 752634 985252 416287 539161 658381 800963 438847
16371D38847M60707j63295q7310J91987j62616j76101j3087q7947L32810n9059
$$ 438847 899554 736259 648949 840936 678320 502219 489132 401185 733995 674936
16361F74936m5943j48012L17671j43725K84744j84838K31230j36503j24915J59850
$$ 674936 628993 480981 798652 654927 939671 754833 986063 849560 724645 884495
16351H84495j38020j98975m2686L36302l83882M17412q5009l85197J74150L8162
$$ 884495 746475 547500 504814 841116 457234 874646 789637 404440 578590 616752
16341F16752J23803J22342j96618k41020l3657A19436N65686Q6041l46727K99879
$$ 616752 740555 862897 666279 425259 391602 119436 685122 771163 424436 724315
16331G24315k06775J04013B71201M67224n5890M0196k71938K9198K02198J20121
$$ 724315 517540 621553 271201 738425 682535 722731 450793 479991 682189 802310
16321H02310j91584l3469j71724J49202K17544C64200J96775o6199B29787J94202
$$ 802310 610726 577257 405533 554735 772279 364200 560975 494776 229787 423989
16311D23989i990A26324O81113A66087M65900j90189j43903K24448B37663J19058
$$ 423989 -9990 126324 807437 166087 631987 441798 297895 522343 237663 356721
16301C56721L84993j42531B97851K42169j03087n9713J11038j70473M44390k52423
$$ 356721 741714 599183 297851 540020 436933 377220 488258 317785 762175 509752
16291E09752q8839L45050A80950J01625L63479k59963J35727Q0641j72099j46529
$$ 509752 420913 765963 180950 282575 646054 386091 521818 602459 430360 283831
16281B83831o3069L13717P153N3388k55747N0893j16422J51961o9400K5652Q414
$$ 283831 220762 534479 541632 595020 339273 390166 273744 425705 356305 381957 390371
16270C90371l3127L69616l09857P342A88558N4284J20886n7539J19435K96386
$$ 390371 357244 726860 417003 424345 188558 242842 363728 306189 425624 722010
16260G22010C30074R166a4555D18260J04726k48060K46415L08941A97620K22798
$$ 722010 330074 339240 -14555 418260 522986 274926 521341 830282 197620 420418
16250D20418A80861J38019Q1080p4919j49604O41546B61269J57924r067n0099
$$ 420418 180861 318880 399960 325041 175437 816983 261269 419193 410126 360027
16240C60027J81354r7617L318I9785M81422A53653J49619J9928R8772J71061M9758
$$ 360027 541381 443764 447082 99785 581207 153653 303272 323200 421972 593033 642791
16229F42791p1736l1235j87027A74393K96925q9504j6553P9965B10251J48971
$$ 642791 571055 539820 352793 174393 471318 381814 365261 445226 210251 359222
16219C59222r565k5385J50271k28303J51Q6387J0920j27752J61266K6776D6218
$$ 359222 349657 324272 474543 246240 246391 332778 343698 215946 377212 403988 46218
16207C27337j20407q8173E7170K61125j9148A19367K6003K29936p0719A41154
$$ 327337 206930 118757 57170 318295 299147 119367 145370 375306 304587 141154
16196g2764C11497A45923A2369N3702K30352g3486E6918A6726L25739j48311q7291
$$ -72764 311497 145923 12369 66071 296423 -73486 56918 16726 342465 194154 106863
16185A06863J34707J84951k09775h1233C60350J45608f058A25918B8251M49879
$$ 106863 241570 426521 216746 -81233 360350 505958 -6058 125918 28251 478130
16175D78130A69799k237J76875A52258J72366n9445A03004B6309K67297F7282
$$ 478130 169799 167562 344437 152258 324624 265179 103004 26309 293606 67282
16164C16074H5087K86432I4718J43994Q2163B169J51299k6518L21846a5353C74525
$$ 316074 85087 371519 94718 238712 320875 2169 153468 126950 448796 -15353 374525
16152A73153K32904A98350o412A3072R4076g1760k9103A93820k2428f9744K1141
$$ 173153 406057 198350 191938 13072 107148 -71760 -100863 193820 171392 -69744 -48603
16141d8603B80598R5562j84870o7938k4717p392i8574C05414A18587i3061I4356
$$ -48603 280598 376160 191290 123352 98635 91243 -98574 305414 118587 -93061 94356
16129A4296K34076n4201a5896B35209a50979C25987a30504C17613o3184F019a6645
$$ 14296 248372 194171 -15896 235209 -150979 325987 -130504 317613 254429 6019 -16645
16117G0797K18086I5094B7144K31868p8002J67194I9053a01184j3929A34155J31500
$$ 70797 288883 95094 27144 259012 181010 348204 99053 -101184 -115113 134155 265655
16106B65655A9792a18966C54190I179L2659L02128f56n1162A63099L04109h3503
$$ 265655 19792 -118966 354190 9179 41838 343966 -656 -51818 163099 467208 -83503
16094B68123D0006K69227E9784L7720A9348J86932C8688M02392i8720k31523A71887
$$ 268123 40006 309233 59784 97504 19348 206280 38688 441080 -98720 -330243 171887
16082D2397a10888H5829h510m38K062B7631N4970K987k8453O9412j6737h0200
$$ 42397 -110888 85829 -8510 -8948 -6886 27631 82601 85588 57135 126547 109810 -80200
16069i5431A18527a1309E6071a43662A01650b72100A60706J75820o6043C1885
$$ -95431 118527 -11309 56071 -143662 101650 -272100 160706 336526 270483 31885
16058a634F0923L2879g6120E6214N9766Q6724i9944L1929C7064N5370j9578l0636
$$ -1634 60923 93802 -76120 56214 115980 202704 -99944 -68015 37064 92434 72856 42220
16046D2220a09864d8594D7704a82015A55612C6359j5257b23568M252C86562A8909
$$ 42220 -109864 -48594 47704 -182015 155612 36359 21102 -223568 -219316 386562 18909
16034B61345F3880N8244E4394k0082A2518N5268J06675a91126R3605A72218G1388
$$ 261345 63880 122124 54394 34312 12518 67786 174461 -191126 -97521 172218 71388
16022A00538J74758h8920j64630g8487C8552b72003f0717A16410a22816j23908
$$ 100538 275296 -88920 -253550 -78487 38552 -272003 -60717 116410 -122816 -246724
16012b46724A1311J25073j2526J20352m5845Q9215g5247C318a11511K2906G5710
$$ -246724 11311 136384 123858 244210 198365 287580 -75247 3318 -111511 -88605 75710
16000H4589J80709b59260A0016c7570o3390A76623K47710A39408J67768b3073
$$ 84589 265298 -259260 10016 -37570 -100960 176623 424333 139408 307176 -23073
15989a45522f833j94752C61118f6799K7371A8392c84150A46095R3345K4502b0444
$$ -145522 -6833 -201585 361118 -66799 -39428 18392 -384150 146095 239440 263942 -20444
15977D21774A16085a8190A45301K26626J0304j58692L98907K4165K67795j67545
$$ 421774 116085 -18190 145301 371927 382231 223539 622446 646611 914406 746861
15967G46861J59724m34403o6757j08400N0414K7645p8462L9874G6784a43870a9916
$$ 746861 906585 472182 405425 297025 347439 375084 296622 336496 76784 -143870 -19916
15955a94204F4380Q4159l1979o364f3653J5418A70378l5908b39536Q869d2952
$$ -194204 64380 148539 116560 110196 -63653 -48235 170378 134470 -239536 -230667 -42952
15943B77987l1935a3795d586A59144h8580A95638E7543b6104A09218a29989G7275
$$ 277987 246052 -13795 -4586 159144 -88580 195638 57543 -26104 109218 -129989 77275
15931A55640p3876b70162a26798G5296i0939l8607F404b36161A33981a86906h5384
$$ 155640 81764 -270162 -126798 75296 -90939 -129546 6404 -236161 133981 -186906 -85384
15919C0706O4014i2929A43961a32461A44753J69217f157A01508l8400a22328B11810
$$ 30706 94720 -92929 143961 -132461 144753 313970 -6157 101508 63108 -122328 211810
15907f9747l71143a70106N7604J2094C7647N9192H722a20010b2094r8593F5281
$$ -69747 -440890 -170106 -112502 -100408 37647 96839 8722 -120010 -22094 -120687 65281
15895b55421G4000j6860d540j69816A96241a04353c7176L834C19301F7788J42257
$$ -255421 74000 57140 -4540 -174356 196241 -104353 -37176 -33342 319301 67788 210045
15884B10045a70058I8714C6319J00655L2628d99634a41149C55901g6942A78961
$$ 210045 -170058 98714 36319 136974 169602 -499634 -141149 355901 -76942 178961
15873A7073a49573L375F1384k8408f0708J8354k6449C21384b73539M6311L6928
$$ 17073 -149573 -146198 61384 32976 -60708 -42354 -68803 321384 -273539 -227228 -190300
15862a90300F8155g6679j79388J16036p6276C92498A24206a12420F4088P9126
$$ -190300 68155 -76679 -256067 -140031 -216307 392498 124206 -112420 64088 143214
15852A43214a44036B7178J88404J67634e894A73684G5588O2074B572g3535A26254
$$ 143214 -144036 27178 215582 383216 -5894 173684 75588 137662 2572 -73535 126254
15840I5142k5591a64070A50476e1101B05685n2992J36750h704H711c65018I2779
$$ 95142 69551 -164070 150476 -51101 205685 152693 289443 -8704 8711 -365018 92779
15828b28104g1039n3649m1337P3086j8185o1216N4161k30602J6462l138I3788
$$ -228104 -71039 -124688 -166025 -92939 -111124 -172340 -118179 -348781 -332319 -335457 93788
15816c5743q8460F9139M4172a99692D7895K2683J46228h4782o6964F8261b1110
$$ -35743 -124203 69139 113311 -199692 47895 70578 216806 -84782 -151746 68261 -21110
15804E1662c50266H984C726N4719c98802a32997d8293A27890O8510e7097p1938
$$ 51662 -350266 8984 3726 58445 -398802 -132997 -48293 127890 196400 -57097 -129035
15793a29035C39899g9673B3115P7015J21920a23315C7770a34410b8657C13933
$$ -129035 339899 -79673 23115 100130 222050 -123315 37770 -134410 -28657 313933
15782c08533A37215a6963A24007A2011a90699A20168i4181E0715K82492A25748
$$ -308533 137215 -16963 124007 12011 -190699 120168 -94181 50715 333207 125748
15771a51677D1000c8657m7241h679j25140B95234E2094A5640b23594h9608l06476
$$ -151677 41000 -38657 -85898 -8679 -133819 295234 52094 15640 -223594 -89608 -396084
15760c96084a43992B11790l2607a45327J9332O2592F0168d19550C00182C7028
$$ -396084 -143992 211790 179183 -145327 -125995 -63403 60168 -419550 300182 37028
15749a57857e7417k2135E8708b34095J4865B65669d966C48J23648b8427C41611
$$ -157857 -57417 -79552 58708 -234095 -219230 265669 -4966 348 123996 -28427 341611
15737A4699J24929a88916A38651e8056j20828N8441B09652O49a45907C50979B1479
$$ 14699 139628 -188916 138651 -58056 -178884 -120443 209652 210301 -145907 350979 21479
15725b55356d0918j69717G672M8402K8360b12515N8076M2838B96714G3301e2830
$$ -255356 -40918 -210635 7672 56074 84434 -212515 -154439 -111601 296714 73301 -52830
15713a49568l21551A96978a73842B27350a33096n876c0750j72944h0090H1801
$$ -149568 -471119 196978 -173842 227350 -133096 -138972 -30750 -203694 -80090 81801
15702H5192a04992C68792j23888A11236R5435R1285M1445a47015k49678a00223
$$ 85192 -104992 368792 244904 111236 206671 297956 339401 -147015 -396693 -100223
15691B44124P0664j28684a43790N8072J2254j50276A4127l051N9953a1410j84674
$$ 244124 314788 186104 -143790 -85718 -73464 -223740 14127 11076 71029 -11410 -196084
15680a96084G0916N4920n1212a12776B14925i2239m6576a1671C7307a54256C5077
$$ -196084 70916 125836 74624 -112776 214925 -92239 -138815 -11671 37307 -154256 35077
15668a87913j78215J18257J6345B81534A06607O7457A0617D769a38378E2650J51662
$$ -187913 -366128 -247871 -231526 281534 106607 174064 10617 4769 -138378 52650 204312
15657B04312e400q7797C44415A13276Q3415b01124J9589B7974K7175B2233J33329
$$ 204312 -5400 -93197 344415 113276 196691 -201124 -181535 27974 55149 22233 155562
15646A55562N5400H4970b02860A44445a66344b8432k50420B99014a67244j23640
$$ 155562 210962 84970 -202860 144445 -166344 -28432 -278852 299014 -167244 -290884
15636b90884C0610L60667C2135K01293b46710D7485b12957A11080e0144j9592
$$ -290884 30610 391277 32135 233428 -246710 47485 -212957 111080 -50144 -69736
15626f9736l2642k22955a2447k63759R4001n7631Q7608j53230G4672M9282a11274
$$ -69736 -102378 -325333 -12447 -276206 -182205 -239836 -152228 -305458 74672 123954 -111274
15614d8596F1313c45431P9278B6736b45979h3371A71188a43209B4512F262a22905
$$ -48596 61313 -345431 -266153 26736 -245979 -83371 171188 -143209 24512 6262 -122905
15602a89615D3545a90901c0020n5874j37436J01795h766B83355j35069a42670
$$ -189615 43545 -190901 -30020 -85894 -223330 -121535 -8766 283355 148286 -142670
15591h2580c6743p2907p9413I6159a30796B5000j719d6802C07226a41211j6086
$$ -82580 -36743 -109650 -189063 96159 -130796 25000 23281 -46802 307226 -141211 -157297
15580a57297P0454B530a96142n4865A56078F2460c57552i672A92390b01940b7810
$$ -157297 -86843 2530 -196142 -251007 156078 62460 -357552 -9672 192390 -201940 -27810
15568a24798e33l9821C26291b61783J12890B7526Q6975J62934I6724O9652a63874
$$ -124798 -533 -40354 326291 -261783 -148893 27526 114501 277435 96724 166376 -163874
15556A59867Q7750E764a20177A87873d1534n9655A71833i0961F4260J72257A01647
$$ 159867 247617 5764 -120177 187873 -41534 -101189 171833 -90961 64260 236517 101647
15544a68225j64685J42385j69638a03490B1857b10680a2638A16071c178j42390
$$ -168225 -332910 -190525 -360163 -103490 21857 -210680 -12638 116071 -3178 -145568
15534a45568k37940a06198A15232D1348J28521i5287D1203J35771C5499e42q0766
$$ -145568 -383508 -106198 115232 41348 169869 -95287 41203 176974 35499 -542 -81308
15523h1308C7884a32226l7004r2374b4081A3953a38585N2333n9520j82030A66868
$$ -81308 37884 -132226 -169230 -261604 -24081 13953 -138585 -86252 -145772 -327802 166868
15511a50743A08074a09415e1945D32266A70216F4426M611l4191a25748K6721L7669
$$ -150743 108074 -109415 -51945 432266 170216 64426 69037 34846 -125748 -99027 -61358
15500f1358l0878A66580F3649e76E8439K17065a11320C11407F0069O0652a95319
$$ -61358 -92236 166580 63649 -576 58439 275504 -111320 311407 60069 120721 -195319
15488B99480J77446a07124F7022J76326A13644a03242E9115b1667C6695K12430
$$ 299480 476926 -107124 67022 243348 113644 -103242 59115 -21667 36695 249125
15478B49125e4102A88614q4603b49414C08070f3001B50543I0160K08837j34215
$$ 249125 -54102 188614 104011 -249414 308070 -63001 250543 90160 298997 164782
15468A64782J6253H5533a0704B47868J11320r2576o914c3607B64231N22680C46145
$$ 164782 181035 85533 -10704 247868 359188 266612 259698 -33607 264231 786911 346145
15456A66972L04729B28696J95564F6336a4476A4597D815e06862B94888j27010
$$ 166972 471701 228696 424260 66336 -14476 14597 4815 -506862 294888 167878
15446A67878l4342L5703n0284D1745L1359M1044e1665D70207k31078c79668a00037
$$ 167878 133536 169239 118955 41745 73104 114148 -51665 470207 239129 -379668 -100037
15434I3750i4989A14805k6537p502M5759A8351N15975M7830j32862K78557k41765
$$ 93750 -94989 114805 88268 80766 126525 18351 534326 582156 449294 727851 486086
15423D86086K72877j28877j72041A69661J36299A15282f4681m16319A50709J51691
$$ 486086 758963 630086 458045 169661 305960 115282 -64681 -481000 150709 302400
15413C02400i1811B7082N7498J04431D9104J96427g3370j40504N9212Q949F9112
$$ 302400 -91811 27082 84580 189011 49104 245531 -73370 -213874 -154662 -145713 69112
15401A46420e9577j52146A17375E6546i665p2413C48454C3463J19990J67896A42441
$$ 146420 -59577 -211723 117375 56546 -9665 -82078 348454 33463 153453 321349 142441
15389A48359b39585H2031K5139M3685k7290f6438L612B37034g9783H864b72102
$$ 148359 -239585 82031 107170 150855 123565 -66438 -62826 237034 -79783 8864 -272102
15377a17685C2667J01475j4322K67614j19052g5055k32674F8481d7004a1221A19386
$$ -117685 32667 134142 119820 387434 268382 -75055 -307729 68481 -47004 -11221 119386
15365a2843F7248a42748A99684i7582L1281J2520B48028L31567H4419a27122A28374
$$ -12843 67248 -142748 199684 -97582 -66301 -53781 248028 579595 84419 -127122 128374
15353I0373a41347B59737p0752d3130D2465O1999M36944A29528a20865A87101
$$ 90373 -141347 259737 188985 -43130 42465 104464 541408 129528 -120865 187101
15342C77227l6031m1197c3442j2715A83129h1678E6208P5623A6098K62176B4483
$$ 377227 341196 299999 -33442 -46157 183129 -81678 56208 131831 16098 278274 24483
15330B00403k0123J64596M9904p1065L7346J1055j02698F8861K65756B6982Q1079
$$ 200403 180280 344876 394780 323715 361061 372116 269418 68861 334617 26982 108061
15319A08061B4605g1489K5437A51352J25158j08530C3750O25242F1420R6365N3735
$$ 108061 24605 -71489 -46052 151352 276510 167980 33750 658992 61420 157785 211520
15308B11520G6353K52759a34019A76527a84725Q0153D8790L67661c7546A10383
$$ 211520 76353 329112 -134019 176527 -184725 -104572 48790 416451 -37546 110383
15297A05979M7926m5307K41330A02296k8503k661g2658B8538J76529a8819B44346
$$ 105979 153905 108598 349928 102296 73793 71132 -72658 28538 205067 -18819 244346
15285A13494J39060G6968a51838M9657m8303C01605a73086F9507A8933J68586
$$ 113494 252554 76968 -151838 -102181 -150484 301605 -173086 69507 18933 187519
15275A87519H3444b4504D1901b84873h4061p6357C5237g1057A23675Q473e239
$$ 187519 83444 -24504 41901 -284873 -84061 -160418 35237 -71057 123675 132148 -5239
15263g4817k5792M1736A00569L55537c7147o3520k9088F2311j5172k0504a26785
$$ -74817 -100609 -58873 100569 456106 -37147 -100667 -129755 62311 47139 26635 -126785
15251C5761P5417a8421j03459D58663B06650J93692A51254n2346K54921a86094
$$ 35761 111178 -18421 -121880 458663 206650 400342 151254 98908 353829 -186094
15240a7990A35888A2539K58204G1106B354J85733K82987A52499M12299J27493
$$ -17990 135888 12539 270743 71106 2354 188087 471074 152499 564798 692291
15230F92291O0345K2621N91988m02346K93749k12849E09612j0452A63905a89819
$$ 692291 752636 775257 1367245 964899 1258648 1045799 509612 499160 163905 -189819
15219a89281L4397O0768Q395B88433j01451m6176I077J0924a32816A38549k330
$$ -189281 -154884 -94116 -85721 288433 186982 140806 9077 20001 -132816 138549 136219
15208A36219L39957A53113j9273e3480C9036R0447E1372J1348a9133k3138B19848
$$ 136219 476176 153113 133840 -53480 39036 129483 51372 62720 -19133 -42271 219848
15196g6715A33406b1689q0491E1953a9456N522j89547a1813A28709F135d0184
$$ -76715 133406 -21689 -102180 51953 -19456 -13934 -203481 -11813 128709 6135 -40184
15184B48086D8769P0423N5672q4192b59027A64700a50810E1702J81830a80544
$$ 248086 48769 119192 174864 90672 -259027 164700 -150810 51702 233532 -180544
15173A37068b57931B65759i1131b843B98972k5625R4828e1227o071C16566j32390
$$ 137068 -257931 265759 -91131 -2843 298972 273347 368175 -51227 -57298 316566 184176
15162A84176D0468C534N027i3742L2267B92965E7468J74700b08911c2511C21358
$$ 184176 40468 3534 8561 -93742 -61475 292965 57468 232168 -208911 -32511 321358
15150a51419C58419a15213b7351C39427A08375D894g3568K2264D02243a66692
$$ -151419 358419 -115213 -27351 339427 108375 4894 -73568 -51304 402243 -166692
15139B167i2515A82245i8993J3014C62586j47289O7921n4458j14042b55558A02532
$$ 2167 -92515 182245 -98993 -85979 362586 215297 283218 228760 114718 -255558 102532
15127A56382n6915R6127F4410A8266G032J76056E7579A2708K83219a21371A11941
$$ 156382 99467 195594 64410 18266 7032 183088 57579 12708 295927 -121371 111941
15115A99568a01084D28459c7911A62239J02344M8193K316l3112o3048K12124A61174
$$ 199568 -101084 428459 -37911 162239 264583 312776 315092 281980 218932 431056 161174
15103C43672C9935N6605J23093p6107F4525j2777a14789B87877I3741f5825I3615
$$ 343672 39935 96540 219633 143526 64525 51748 -114789 287877 93741 -65825 93615
15091D3160c1227H5200P7624J58400I5168J24308b2605G9453O5242Q4549l1542
$$ 43160 -31227 85200 162824 321224 95168 219476 -22605 79453 144695 229244 197702
15080A97702a08749A02369J27260P240d8287A30618E7456L9264K8381J34082K9394
$$ 197702 -108749 102369 229629 236869 -48287 130618 57456 96720 125101 259183 288577
15069B88577J7428A52474c8281A94068J716N4291j03035e7836A77263g8254D44059
$$ 288577 306005 152474 -38281 194068 195784 250075 147040 -57836 177263 -78254 444059
15057A96338E8359J72807J57660j18521E391L28578j00475d3636J3503A21174
$$ 196338 58359 231166 388826 270305 5391 333969 233494 -43636 -30133 121174
15046B04315p5125N2962H4502K18382k4421K03714d2382D57603h0374A86108L8795
$$ 204315 129190 182152 84502 302884 278463 482177 -42382 457603 -80374 186108 224903
15035B24903M43728C27094j02446k0137r4598J24192L05251M3711C6767J67969
$$ 224903 668631 327094 224648 204511 109913 234105 539356 583067 36767 204736
15025B04736k739Q1114A41481M15652j02771l7590j40232L51058B71737L49651
$$ 204736 201997 283111 141481 557133 454362 416772 276540 627598 271737 621388
15015F21388J63285q5959l01483J35522R1858j42838J91924A61660J09331Q0882
$$ 621388 784673 698714 397231 532753 624611 481773 673697 161660 270991 351873
15005C51873J12059p1408q0669O6808j70153m3042K07304J72779B7868N08357
$$ 351873 463932 392524 311855 378663 208510 165468 372772 545551 27868 536225
14995E36225A86736l9328M53361j67839P1249j89198A00444L5283J216J62133
$$ 536225 186736 147408 600769 432930 504179 314981 100444 135727 136943 299076
14985B99076K63134k49925K00027K19854C47912P1845L1408K15727E5541M42160
$$ 299076 562210 312285 512312 732166 347912 419757 451165 666892 55541 497701
14975D97701R0590B65422R3205K24437j25077A72384N44946k12616k38737M99809
$$ 497701 588291 265422 358627 583064 457987 172384 717330 504714 265977 765786
14965G65786J05087k34205o3719k01754J94359p4386J26545l2775p5456J9145
$$ 765786 870873 636668 572949 371195 565554 491168 617713 584938 509482 528627
14955E28627J02519j43871K55268C43056J68190j17426J69136k54187c8325C26473
$$ 528627 631146 487275 742543 343056 511246 393820 562956 308769 -38325 326473
14944C17726A31159L94824r2488J0895Q1579A41589L84133o4919j97381J85898
$$ 317726 131159 525983 433495 444390 525969 141589 525722 460803 263422 449320
14934D49320j96365J38786K04346I2765K83438K6947J06303j34111J14283Q6853
$$ 449320 252955 391741 596087 92765 376203 403150 509453 375342 489625 576478
14924E76478j82709K388O1408M8795j28917Q5460N0718K61683j38274J52991J71332
$$ 576478 393769 396157 457565 506360 377443 462903 513621 775304 637030 790021 961353
14913I61353J25434N7270K25930J42015j77837N19965o50023J41302J28122R6209
$$ 961353 1086787 1144057 1369987 1512002 1334165 1854130 1204107 1345409 1473531 1569740
14903A569740Q2983P80L67909r9577j97156K52686p45956j75738j29260Q9495
$$ 1569740 1652723 1653503 2021412 1921835 1724679 1977365 1231409 1055671 926411 1015906
14893A015906j70236k94495J20322k98444J3520j8663j28115K91799B22492L94993
$$ 1015906 845670 551175 671497 373053 386573 367910 239795 531594 222492 617485
14883F17485B91507K01787J47778k87781J05367J83004l9857j12508R3527k16370
$$ 617485 291507 493294 641072 353291 458658 641662 601805 489297 582824 366454
14873C66454m8482M61145R5359j48758j20741M14130n5417r6119C17754O21311
$$ 366454 317972 779117 874476 725718 604977 1019107 963690 867571 317754 939065
14863I39065J1858m7939l69715K44237j70314p8238J55047j83917J16859j74619
$$ 939065 950923 902984 533269 777506 607192 528954 684001 500084 616943 442324
14853D42324J60767r8182K6700o5610N87539j39027j86786j07244m347j13685
$$ 442324 603091 504909 531609 465999 1053538 914511 727725 620481 616134 502449
14843E02449k32575M6301J65170m6503Q2525j12225J93349R7233A90159J32848
$$ 502449 269874 316175 481345 434842 517367 405142 598491 695724 190159 323007
14833C23007J55630K54983k35078q5645K17804L71305k75117J11895K33077J53520
$$ 323007 478637 733620 498542 412897 630701 1002006 726889 838784 1071861 1225381
14823A225381j94888l20130L39592q2545D78707M7378K77885j78149O5778J22239
$$ 1225381 1030493 710363 1049955 967410 478707 526085 803970 625821 691599 813838
14813H13838j45619J7885j66881L3746L59627m11802L28634j13752P6133K03294
$$ 813838 668219 686104 519223 552969 912596 500794 829428 715676 791809 995103
14803I95103k74493p5564L6322k37569K31085K75210k34589K22843k32951L3299
$$ 995103 720610 645046 681368 443799 674884 950094 715505 938348 705397 738696
14793G38696j6375k82123J09151J01934K29218L0870m404K00691k86813J06053
$$ 738696 722321 440198 549349 651283 880501 911371 906967 1107658 820845 926898
14783I26898k21662K16494l3460l28121Q0697j05183B65608A22348M96209j05443
$$ 926898 705236 921730 888270 560149 640846 535663 265608 122348 618557 513114
14773E13114N6645J01423j25923n9234J74656L07044j28582j09638J59245l05158
$$ 513114 569759 671182 545259 486025 660681 967725 839143 729505 888750 583592
14763E83592j81239K72053j31987M76066j2925j86876o03K61523l49088R6738
$$ 583592 402353 674406 542419 1018485 1005560 818684 818081 1079604 730516 827254
14753H27254j44660J76366j99494n3742l3054k2547J45613J0436p0512J01197
$$ 827254 682594 858960 659466 605724 572670 550123 695736 706172 635660 736857
14743G36857l6284Q5439q3229K80778l63258L11797j60260l27831N14377D01781
$$ 736857 700573 786012 702783 983561 620303 932100 771840 444009 958386 401781
14732D34538L40213k336k4743p8736j57678L97966C97665N73012q9311N8007L5223
$$ 434538 774751 772415 747672 668936 511258 909224 397665 970677 881366 939373 974596
14721I74596r2920n0900J44271l68612M17714k36964O9122P0396L91985j05267
$$ 974596 881676 830776 975047 606435 1024149 787185 856307 926703 1318688 1213421
14711A213421N9258N21652m79199N02101l36195N7141o99794K18786J51743L2245
$$ 1213421 1272679 1794331 1315132 1817233 1481038 1538179 838385 1057171 1208914 1241159
14701A241159l61981M0679q7295k95828K76585P342J02305K4274N3000l63417
$$ 1241159 879178 919857 832562 536734 813319 820661 922966 947240 1000240 636823
14691F36823N46744n9478O0848j15844L38226K11321j95019N10239l24445j78561
$$ 636823 1183567 1124089 1184937 1069093 1407319 1618640 1423621 1933860 1609415 1430854
14681A430854m6371j81643j30263L64449k62894l81605M94019o06369N98621n90513
$$ 1430854 1384483 1202840 1072577 1437026 1174132 792527 1286546 680177 1278798 688285
14671F88285K7706K41029J67152k3669k1870D01120L04630L26938j46448j655
$$ 688285 715991 957020 1124172 1100503 1078633 401120 705750 1032688 886240 884585
14661H84585j1847k07445K22166L72045l81681L65498j84604J66601k17825r581
$$ 884585 872738 665293 887459 1259504 877823 1243321 1058717 1225318 1007493 997912
14651I97912L1533J70650p2474k07998K16520L7884m16347K81334J64068l3571
$$ 997912 1029445 1200095 1127621 919623 1136143 1174027 757680 1039014 1203082 1169511
14641A169511l912k12504L79125J15557K5833o7881j47165r1685o0619J31188
$$ 1169511 1165599 953095 1332220 1447777 1473610 1405729 1258564 1166879 1106260 1237448
14631A237448J31622j22541K04582m22729j20474M69246j57079L9288k313Q5664
$$ 1237448 1369070 1246529 1451111 1028382 907908 1377154 1220075 1259363 1257050 1342714
14621A342714l9697J69691j19508j59895J75513j41784L06385j58536m04140K29943
$$ 1342714 1303017 1472708 1353200 1193305 1368818 1227034 1533419 1374883 970743 1200686
14611A200686J37203k99293L40272l20627K65567K77423R4665l90025K76072l75039
$$ 1200686 1337889 1038596 1378868 1058241 1323808 1601231 1695896 1305871 1581943 1206904
14601A206904o0113L0L54852J93j9211N7997n6992K32933n74882K42351K08909
$$ 1206904 1146791 1146821 1501673 1501866 1482655 1540652 1483660 1716593 1141711 1384062 1592971
14590A592971J33102j6613l07711N57455j89832o1464m62516M22595K9490J0958
$$ 1592971 1726073 1709460 1401749 1959204 1769372 1707908 1245392 1667987 1697477 1708435
14580A708435K1944j97899N8454L11979j18866q737L6038L7053j10680J33637
$$ 1708435 1730379 1532480 1590934 1902913 1784047 1775310 1811348 1848401 1737721 1871358
14570A871358J30929N1611J7285j69077o2116K51750k82689R6394j12459L22697
$$ 1871358 2002287 2053898 2071183 1902106 1839990 2091740 1809051 1905445 1792986 2115683
14560B115683l3970Q0868j07395K64539j6232j00207L42457q6553J36607O08102
$$ 2115683 2081713 2162581 2055186 2319725 2303493 2203286 2545743 2459190 2595797 3203899
14550C203899m39493J75581R9153L5217l01104L86634R158J12193J19568O10278
$$ 3203899 2764406 2939987 3039140 3074357 2773253 3159887 3169045 3281238 3400806 4011084
14540D011084N38223j76383R90523N77320J439188J540751J904018L839199O007020
$$ 4011084 4549307 4372924 5363447 5940767 7379955 8920706 10824724 14663923 20670943
14531B0670943Q378032k356571q216283o555238m410544k289944k50927J30839
$$ 20670943 29048975 26692404 18476121 11920883 7510339 5220395 4969468 5100307
14523E100307r11460q18846m87373j7674l8101j40622O8311n62748N08482m09690
$$ 5100307 4188847 3370001 2882628 2864954 2826853 2686231 2754542 2191794 2700276 2290586
14513B290586J15757M776P7559k02713M43900n60413L2844K73688K96203O164
$$ 2290586 2406343 2411119 2488678 2285965 2729865 2169452 2202296 2475984 2772187 2778351
14503B778351n9863m29296J24110K58215K83752k32113J36164j35218J19961Q0542
$$ 2778351 2718488 2289192 2413302 2671517 2955269 2723156 2859320 2724102 2844063 2924605
14493B924605J21025J07828l76594K78686Q2473K34006k51412K15092m01962M77278
$$ 2924605 3045630 3153458 2776864 3055550 3138023 3372029 3120617 3335709 2933747 3411025
14483C411025Q5682j42365K45055m46804P1311L02268j16103k06126M20447j40390
$$ 3411025 3496707 3354342 3599397 3152593 3223904 3526172 3410069 3203943 3624390 3484000
14473C484000N4211L85404j24936j67704K3797M16958P1440r8197k9291k04977
$$ 3484000 3538211 3923615 3798679 3630975 3654772 4071730 4143170 4044973 4015682 3810705
14463C810705K20226n838j69753O10706j23493L89283m25200j74446J94526J00410
$$ 3810705 4030931 4025093 3855340 4466046 4342553 4731836 4306636 4132190 4326716 4427126
14453D427126m00272J35480N10763R5704K5649j80610K65264j24269N41823r3740
$$ 4427126 4026854 4162334 4673097 4768801 4794450 4613840 4879104 4754835 5296658 5202918
14443E202918Q6155J38449L1914k06687J45033K1200L317L8811o2806L22610Q6073
$$ 5202918 5289073 5427522 5459436 5252749 5397782 5418982 5422299 5461110 5398304 5720914 5806987
14432E806987l5263Q7047O8129j73741M53389J69250J81917j44640K2923m012
$$ 5806987 5771724 5858771 5926900 5753159 6206548 6375798 6557715 6413075 6435998 6431986
14422F431986L02444p2219m7317O700O77527n41559M18788k14220M46726J88878
$$ 6431986 6734430 6662211 6614894 6621594 7299121 6757562 7176350 6962130 7408856 7597734
14412G597734j20056L22935k70119M96365R305K99337J26745P890M14865J28627
$$ 7597734 7477678 7800613 7530494 8026859 8036164 8335501 8462246 8470136 8885001 9013628
14402I013628L25600j21466J59879m13490K29596K0120M38562J76925j81204K38788
$$ 9013628 9339228 9217762 9377641 8964151 9193747 9213867 9652429 9829354 9648150 9886938
14392I886938L24018n544J79191O14680l63310K15427L23201J67598l9275K66196
$$ 9886938 10210956 10205412 10384603 10999283 10635973 10851400 11174601 11342199 11302924 11569120
14382A1569120L07917L5028K43291O2360L14717M35392L3890K18434N8772N33048
$$ 11569120 11877037 11912065 12155356 12217716 12532433 12967825 13001715 13220149 13278921 13811969
14372A3811969J76679M74781n1196J51636P18669J23522M56282J16652K16078
$$ 13811969 13988648 14463429 14412233 14563869 15282538 15406060 15862342 15978994 16195072
14363A6195072M63808L51854L86304J45343P7635J98569M48142R35484L19800
$$ 16195072 16658880 17010734 17397038 17542381 17620016 17818585 18266727 19202211 19522011
14354A9522011j10543M66720P04322P470J006817N8640N50333P78981K43347N24356
$$ 19522011 19411468 19878188 20582510 20589980 21596797 21655437 22205770 22984751 23228098 23752454
14344B3752454O85592M38389P7821R37430N19944Q65243P93354M36596N46517
$$ 23752454 24438046 24876435 24954256 25891686 26411630 27276873 28070227 28506823 29053340
14335B9053340P96127P16873P94682Q60200R08472P58231R03340J067918R18346
$$ 29053340 29849467 30566340 31361022 32221222 33129694 33887925 34791265 35859183 36777529
14326C6777529R42506J414369Q79553J141103J270585J114336J361448J177257
$$ 36777529 37720035 39134404 40013957 41155060 42425645 43539981 44901429 46078686
14318D6078686J777629J285425J315304J658678J761574J764195K163458J568448
$$ 46078686 47856315 49141740 50457044 52115722 53877296 55641491 57804949 59373397
14310E9373397K129065K021516K470094K239095K688148K570174K630007K552827
$$ 59373397 61502462 63523978 65994072 68233167 70921315 73491489 76121496 78674323
14302G8674323L142409L323120L190186L220924L829958L745300M086811M507674
$$ 78674323 81816732 85139852 88330038 91550962 95380920 99126220 103213031 107720705
14294A07720705M598426M504954N391079N351426N765559N950696O511684O592848
$$ 107720705 112319131 116824085 122215164 127566590 133332149 139282845 145794529 152387377
14286A52387377P121536P576551P908044Q392863Q749804R355989R681001J0490340
$$ 152387377 159508913 167085464 174993508 183386371 192136175 201492164 211173165 221663505
14278B21663505J0816384J1270352J2361534J2285321J3561993J3542216J3442301
$$ 221663505 232479889 243750241 256111775 268397096 281959089 295501305 308943606
14271C08943606J3665331J3920547J4234889J3620848J3750370J3227975J2621549
$$ 308943606 322608937 336529484 350764373 364385221 378135591 391363566 403985115
14264D03985115J1760237J0929845J0495236Q990001O734384N007957L851042
$$ 403985115 415745352 426675197 437170433 446160434 452894818 457902775 461753817
14257D61753817L766013L877142K796193k678613o656341m306664q221240r793282
$$ 461753817 465519830 469396972 472193165 469514552 462858211 458551547 450330307 440537025
14249D40537025j1777728j2535357j3290892j3846132j4270136j4998875j5257651
$$ 440537025 428759297 416223940 402933048 389086916 374816780 359817905 344560254
14242C44560254j4340432j4414997j4337529j4563931j4048857j4128671j3465890
$$ 344560254 330219822 315804825 301467296 286903365 272854508 258725837 245259947
14235B45259947j2575725j1747788j1079996j0871341r690684r355384q375208
$$ 245259947 232684222 220936434 209856438 198985097 189294413 179939029 171563821
14228A71563821q651835p500055p255219o950408n881472o353136n369190n482513
$$ 171563821 162911986 155411931 148156712 141206304 135324832 128971696 123602506 118119993
14220A18119993n315050m209253m469479m096991m077774l634100l575396l469760
$$ 118119993 112804943 108595690 104126211 100029220 95951446 92317346 88741950 85272190
14212H5272190l308862l213133k690120k760983k527831k642291k115048k394016
$$ 85272190 81963328 78750195 76060075 73299092 70771261 68128970 66013922 63619906
14204F3619906j826346k239998j993073j660287j897406j363650j508459j490464
$$ 63619906 61793560 59553562 57560489 55900202 54002796 52639146 51130687 49640223
14196D9640223j725171j595892j246942j245910j039053r24020j072739j510049
$$ 49640223 47915052 46319160 45072218 43826308 42787255 41863235 40790496 39280447
14188C9280447j451042m58523o06837j519977q41030q13653j041776r67247q66725
$$ 39280447 37829405 37370882 36764045 35244068 34403038 33589385 32547609 31580362 30713637
14179C0713637k63946q94740o24970r28507m01226o36475o30816r50932m08041
$$ 30713637 30449691 29554951 28929981 28001474 27600248 26963773 26332957 25382025 24973984
14170B4973984q53145k45414l08898n05813r35478k49753l45825j99472j037579
$$ 24973984 24120839 23875425 23566527 23060714 22125236 21875483 21529658 21330186 20292607
14161B0292607R0729o36873l71559m23909k45099n23289k11503n56334j35102
$$ 20292607 20383336 19746463 19374904 18950995 18705896 18182607 17971104 17414770 17279668
14152A7279668j20250o69932J66233l33156o00706m11009k47181r2515k43633
$$ 17279668 17159418 16489486 16655719 16322563 15721857 15310848 15063667 14971152 14727519
14143A4727519j99975l14254k12430n28782j32227q4493k40274m65238o0083K15431
$$ 14727519 14527544 14213290 14000860 13472078 13339851 13255358 13015084 12549846 12489763 12705194
14133A2705194o28542p6871l33977J18254l15489j80840r0511K94926o44023J51878
$$ 12705194 12076652 11999781 11665804 11784058 11468569 11287729 11197218 11492144 10848121 10999999
14123A0999999n16427J9926o7959l05462n5121q6744k13274j87428j64274n2012
$$ 10999999 10483572 10503498 10435539 10130077 10074956 9988212 9774938 9587510 9423236 9371224
14113I371224j38224P7616n01721R9825l39161O8409m48917K20040q1380n80090
$$ 9371224 9233000 9310616 8808895 8908720 8569559 8637968 8189051 8409091 8327711 7747621
14103G747621M53624l39246k77509K82607l58245M7144k2629j28674l49474k31232
$$ 7747621 8201245 7861999 7584490 7867097 7508852 7555996 7533367 7404693 7055219 6823987
14093F823987J84330k5582l11797O0759J59097m22346o641o0909r7480K07685
$$ 6823987 7008317 6982735 6670938 6731697 6890794 6468448 6461807 6400898 6303418 6511103
14083F511103m946K9589l14961K2628l13800L3448P8389j89529k61946P6115j37632
$$ 6511103 6506157 6535746 6220785 6243413 5929613 5963061 6041450 5851921 5589975 5666090 5528458
14072E528458P6184k5614l9204k49268k76401L25365k43269J00630k75095P6409
$$ 5528458 5604642 5579028 5539824 5290556 5014155 5339520 5096251 5196881 4921786 4998195
14062D998195r7367J60620j75272j7876M4358p4552j19457l74977M37303n92108
$$ 4998195 4900828 5061448 4886176 4868300 4912658 4838106 4718649 4343672 4780975 4188867
14052D188867K11861J07834p6778k6796K0169j46257J88671R6642O4497j21411
$$ 4188867 4400728 4508562 4431784 4404988 4425157 4278900 4467571 4564213 4628710 4507299
14042D507299k07408O1586r4654j11594l35824l3861n1091R789J05167L10533
$$ 4507299 4299891 4361477 4266823 4155229 3819405 3785544 3734453 3744242 3849409 4159942
14032D159942j52553o81967K55298k01355L26261j54542m76678L93460L44238
$$ 4159942 4007389 3325422 3580720 3379365 3705626 3551084 3074406 3467866 3812104
14023C812104m16221j18879j32254M10502l23737J77302j21175r5689p8458K54895
$$ 3812104 3395883 3277004 3144750 3555252 3231515 3408817 3287642 3191953 3113495 3368390
14013C368390l48327Q2023Q5176m1001j67238K29940l10472K29735l44790O5657
$$ 3368390 3020063 3102086 3187262 3146261 2979023 3208963 2898491 3128226 2783436 2849093
14003B849093j19577j2080q053L4764r5828J1000J94426j48320k78580M8345L00657
$$ 2849093 2729516 2717436 2709383 2744147 2648319 2659319 2853745 2705425 2426845 2475190 2775847
13992B775847k88875K36910m17745M22180k49053J59727K0247n7695J49578L8131
$$ 2775847 2486972 2723882 2306137 2728317 2479264 2638991 2659238 2601543 2751121 2789252
13982B789252o9208L97803q2721J76448M40171L15551O98785J075387K037904
$$ 2789252 2720044 3117847 3035126 3211574 3651745 3967296 4666081 5741468 7779372
13973G779372K769836N585695R777327K197953o291596o736272m786956k474032
$$ 7779372 10549208 16134903 25912230 28110183 21818587 15082315 10295359 7821327
13965G821327k005790n62103r67421k93780j17507l40655k64015K33925o16203
$$ 7821327 5815537 5253434 4286013 3992233 3874726 3534071 3270056 3503981 2887778
13956B887778j15357J52871m19330L8629L8797j12960p7754j81379J50985o6799
$$ 2887778 2772421 2925292 2505962 2544591 2583388 2470428 2392674 2211295 2362280 2295481
13946B295481j8670l37007L17386Q9924p5302j51937Q7895J68670j31487M9953
$$ 2295481 2276811 1939804 2257190 2347114 2271812 2119875 2207770 2376440 2244953 2294906
13936B294906m46141L02663k90408K2711L62741l42611J57975L04574k35291j97306
$$ 2294906 1848765 2151428 1861020 1883731 2246472 1903861 2061836 2366410 2131119 1933813
13926A933813K4264n2299j02506K48871j14799j33785K82029l37463n0498M13306
$$ 1933813 1958077 1905778 1803272 2052143 1937344 1803559 2085588 1748125 1697627 2110933
13916B110933j92944r5415l2579k57147K64193o5928J74911m00383k1004L66149
$$ 2110933 1917989 1822574 1789995 1532848 1797041 1731113 1906024 1505641 1484637 1850786
13906A850786j0823l17328R4002l05242j14665M35608j56007K48426j32091j62914
$$ 1850786 1839963 1522635 1616637 1311395 1196730 1632338 1476331 1724757 1592666 1429752
13896A429752J47294r9263J92687m11416J37720M9238j8249k0971K79714l86260
$$ 1429752 1577046 1477783 1670470 1259054 1396774 1446012 1427763 1406792 1686506 1300246
13886A300246J21091J14145j0810m6995K12057l40557L26494k21680k85085M33050
$$ 1300246 1421337 1535482 1524672 1477677 1689734 1349177 1675671 1453991 1168906 1601956
13876A601956n4233k64092K42424k07680n5469M82005l96294L8914j87753p3059
$$ 1601956 1547723 1283631 1526055 1318375 1262906 1744911 1348617 1387531 1199778 1126719
13866A126719K93398k93261K83694k3463k77035J72596J39009k95121J188K96143
$$ 1126719 1420117 1126856 1410550 1387087 1110052 1282648 1421657 1126536 1127724 1423867
13856A423867j11777j88253K22932j33590j33948m1048P7745J2287m3185K34923
$$ 1423867 1312090 1123837 1346769 1213179 1079231 1038183 1115928 1128215 1085030 1319953
13846A319953L403J48750m89271N98018j78053k60013J84071p5136k04867k92115
$$ 1319953 1323356 1472106 982835 1580853 1402800 1142787 1326858 1251722 1046855 754740
13836G54740K48131L27396l82871J94854R0223J14038m68253J25480J17496l87329
$$ 754740 1002871 1330267 947396 1142250 1232473 1346511 878258 1003738 1121234 733905
13826G33905O06339k93854j20596K70738l10258j00382M24801J14102m60698K6059
$$ 733905 1340244 1046390 925794 1196532 886274 785892 1210693 1324795 864097 890156
13816H90156L11437M7281E60973L90510j12843j1768Q7108L87549k14885l78441
$$ 890156 1201593 1248874 560973 951483 838640 826872 913980 1301529 1086644 708203
13806G08203M46273n07191M16371C81741N59695Q7252J20231k84811J43709k4243
$$ 708203 1154476 647285 1063656 381741 941436 1028688 1148919 864108 1007817 983574
13796I83574K9860j16269L7038j12484j25782L50074k77301j48711M43603k19744
$$ 983574 1013434 897165 934203 821719 695937 1046011 768710 619999 1063602 843858
13786H43858k63142L28645K34961m62544m0369K81645k01603K81774R2627m57579
$$ 843858 580716 909361 1144322 681778 641409 923054 721451 1003225 1095852 638273
13776F38273L05747l06995j32900L26228j95584j15318L26744J63202m82359K86652
$$ 638273 944020 637025 504125 830353 634769 519451 846195 1009397 527038 813690
13766H13690L7519j59273J89610j73966Q8173l9790K05997k27531j68761K30514
$$ 813690 851209 691936 881546 707580 795753 755963 961960 734429 565668 796182
13756G96182j39613Q3292m6707j941L27852m40726J01804J5991J0223K01256j11280
$$ 796182 656569 739861 693154 691213 1019065 578339 680143 696134 706357 907613 796333
13745G96333k46285N19330r794k30845C93263L88856k12317M632J14640j20752
$$ 796333 550048 1069378 1059584 828739 393263 782119 569802 574434 689074 568322
13735E68322K7951k07215L47757J29404j87967k26509J41564o9587L98399k53288
$$ 568322 596273 389058 736815 866219 678252 451743 593307 523720 922119 668831
13725F68831J49227R9519l21271K09345j5224l55331K72207k97714J82551m8619
$$ 668831 818058 917577 596306 805651 790427 435096 707303 409589 592140 543521
13715E43521J62339J04187J00177m13567k5256L90974l49443j09511K06239k5603
$$ 543521 705860 810047 910224 496657 471401 862375 512932 403421 609660 584057
13705E84057L45515m11781q5701K26541j06578K17128l33194J26060q0975K00083
$$ 584057 929572 517791 432090 658631 552053 769181 435987 562047 481072 681155
13695F81155J2468J32974l26112K12688n1041B66994M52263A81161J68269K96792
$$ 681155 693623 826597 500485 713173 662132 266994 719257 181161 349430 646222
13685F46222J13295p3870k8457j6817k06357K40417k71451J52342n7354j36352
$$ 646222 759517 685647 657190 640373 434016 674433 402982 555324 497970 361618
13675C61618J08492j16866K11354j92927J85364N8730L93419k64702l26527K01283
$$ 361618 470110 353244 564598 371671 557035 615765 1009184 744482 417955 619238
13665F19238L5745B02962K78352Q441j22406K68661j61254k01291J97562K4337
$$ 619238 654983 202962 481314 489755 367349 636010 474756 273465 471027 495364
13655D95364r9837l7506L3570J00888K37822K8016k66428L29498J23900q9755
$$ 495364 395527 358021 391591 492479 730301 758317 491889 821387 945287 855532
13645H55532l74726K22897B53543L12229l3860J61593k52733k19255M05309k42007
$$ 855532 480806 703703 253543 565772 531912 693505 440772 221517 626826 384819
13635C84819K30552j99852P129J78271j65269K72504C39045J94402J46673B13636
$$ 384819 615371 415519 422648 600919 435650 708154 339045 533447 680120 213636
13624C24764Q0706k01002K63264J10373B34859J62241K24965j88939P9246m8734
$$ 324764 405470 204468 467732 578105 234859 397100 622065 433126 512372 463638
13614D63638J05160l0053k21995J77460B19910M34299Q0213l22521Q8568r0221
$$ 463638 568798 538745 316750 494210 219910 654209 734422 411901 500469 410248
13604D10248A94174K59410P0488O3560k52657Q5647A86473C8693L64019j44986
$$ 410248 194174 453584 524072 587632 334975 420622 186473 38693 402712 257726
13594B57726L38067A75237M24980A95851J46274n5486J82685j00163C3641O45824
$$ 257726 595793 175237 600217 195851 342125 286639 469324 369161 33641 679465
13584F79465k52114j05849q4932C8373N43033a54216B14503J72502L12874k74829
$$ 679465 427351 321502 236570 38373 581406 -154216 214503 387005 699879 425050
13574D25050A9101N31613J1231j22660L7581M9964A29206M23823j70840o6675
$$ 425050 19101 550714 561945 439285 476866 526830 129206 553029 382189 315514
13564C15514H2597L07365q5926k1130J31696E5667L27936j7237j71482D4304N19749
$$ 315514 82597 389962 304036 282906 414602 55667 383603 366366 194884 44304 564053
13553E64053j58053L4804j16817j24693R1245m1470L20711k50396p284K27561
$$ 564053 406000 440804 323987 199294 290539 249069 569780 319384 312100 539661
13543E39661j20616q3048K272K1925J34566j95685m7903P1941l4813f7504A83271
$$ 539661 419045 335997 338269 360194 494760 299075 251172 323113 288300 -67504 183271
13531C57141j3975M80851m10963A38949K16006j01111n1699l4579P8409N2324
$$ 357141 343166 824017 413054 138949 354955 253844 202145 167566 245975 298299
13521B98299A31988L55498B36537c18236E15704k06319P1959A05292K34601K18692
$$ 298299 131988 487486 236537 -318236 515704 309385 381344 105292 339893 558585
13511E58585k1407j81481K04238B32364k5653p441J85616A79981K97882k20468
$$ 558585 537178 355697 559935 232364 206711 199270 384886 179981 477863 257395
13501B57395G2857R7203n5477M4341O6316J02436E4358L79931r169A52694L54709
$$ 257395 72857 170060 114583 158924 225240 327676 54358 434289 425120 152694 507403
13490E07403n5938j79752D7022L51301A33373M98774j12297A41425L79001B09573
$$ 507403 451465 271713 47022 398323 133373 632147 519850 141425 520426 209573
13479C4715L27274R182M0433K03107B31617J34850J78974m374g7798G9732L77309
$$ 34715 361989 371171 411604 614711 231617 366467 545441 541067 -77798 79732 457041
13468D57041A23234J88221J3505J14534J13703k30711A57851a35623C79554l3712
$$ 457041 123234 311455 324960 439494 553197 322486 157851 -135623 379554 345842
13458C45842E9840J48169L89529B49213A990K02272P3390G5076L74480l8467e2960
$$ 345842 59840 208009 597538 249213 1990 204262 277652 75076 449556 411089 -52960
13446A91710J35394o7217K13153A53033Q4953k1897O7725j06830b365D46345j03283
$$ 191710 327104 259887 473040 153033 237986 216089 283814 176984 -2365 446345 343062
13435C43062p6390K0777J65589c6185j4254B56182j8606n5845d7139E5657M01085
$$ 343062 266672 287449 453038 -36185 -50439 256182 237576 181731 -47139 55657 456742
13424D56742k13810d545B70916q8652P6088j20476H016d7508F3916L1357K29869
$$ 456742 242932 -4545 270916 182264 258352 137876 8016 -47508 63916 95273 325142
13413C25142j50191e8596D81446H8929K94925r3433q1955K87198j80431G2508
$$ 325142 174951 -58596 481446 88929 383854 290421 208466 495664 315233 72508
13402A35817m4261q737a95458B78658j25810M58661A31731A2557c7529A80137
$$ 135817 91556 82819 -195458 278658 152848 611509 131731 12557 -37529 180137
13391A56246P0420D7695M18944A32035K50162j8423r517j37778a13201A68247
$$ 156246 226666 47695 466639 132035 382197 363774 354257 216479 -113201 168247
13380A32522n1643J42802P6698j1665J39436A22612M31627A11368b2959l2433
$$ 132522 80879 223681 300379 288714 428150 122612 554239 111368 -22959 -55392
13370e5392B40405K3908M8471j37695M62784e2502C30366J43972E4487f8110A39157
$$ -55392 240405 264313 312784 175089 637873 -52502 330366 474338 54487 -68110 139157
13358B41455N2018B5900P2342J84659M9289L852j20007n8070M5906n6681K88358
$$ 241455 293473 25900 98242 282901 332190 336042 216035 157965 203871 147190 435548
13347D35548p9536j09515M25876a0297A97273M24503a0987F8899K31361O6957
$$ 435548 356012 246497 672373 -10297 197273 621776 -10987 68899 300260 367217
13337C67217j15176I067K21539q3804L62796A86984K64746A09899C6739M93211
$$ 367217 252041 9067 230606 146802 509598 186984 451730 109899 36739 529950
13327E29950J96258k81633j96352J8551a10487E10061j9578A3259K19694L8428
$$ 529950 726208 444575 248223 266774 -110487 510061 490483 13259 232953 271381
13317B71381A27488C8525N10401m6561j90682G8079K39480A38268P761J45358
$$ 271381 127488 38525 548926 502365 311683 78079 317559 138268 146029 291387
13307B91387A30282L1907a9211C62417E253M4426K02923h6430D13878A28573L7126
$$ 291387 130282 162189 -19211 362417 5253 49679 252602 -86430 413878 128573 165699
13296A65699K15052A05839Q303g6999D72714o2887q0111J00486A33881K02433
$$ 165699 380751 105839 114142 -76999 472714 409827 329716 430202 133881 336314
13286C36314K46196A67383g8768A97862J44748J12095j13549a840A46474p1107
$$ 336314 582510 167383 -78768 197862 342610 454705 341156 -1840 146474 75367
13276G5367K9970a29328A45291E7034i1569C94509D5669K38307D7189J8154L5978
$$ 75367 105337 -129328 145291 57034 -91569 394509 45669 283976 47189 65343 101321
13265A01321a07083d5373A5484K12356q3520B8777J09067J92578K76033A88612
$$ 101321 -107083 -45373 15484 227840 144320 28777 137844 330422 606455 188612
13254F030L32188H7604k6816L5553J3060E058J49272J03702P491i8896A98999
$$ 6030 338218 87604 60788 96341 109401 5058 154330 258032 265523 -98896 198999
13242B41194D8459J15102L7853F9704f2233G1515K67169g4648B8926J08854M9408
$$ 241194 48459 163561 201414 69704 -62233 71515 338684 -74648 28926 137780 187188
13231A87188G6349g3277A75749j0278K20876G5398J8774d8644B77987C2009Q1728
$$ 187188 76349 -73277 175749 165471 386347 75398 94172 -48644 277987 32009 113737
13220A13737J07536j00193J43726l2512D2826J3535e1130A48613O7542L3630A5465
$$ 113737 221273 121080 264806 232294 42826 56361 -51130 148613 216155 249785 15465
13208c5529D00752a1049G8871A0862O8506J56587N3117l5529H994a63101A22766
$$ -35529 400752 -11049 78871 10862 79368 235955 289072 253543 8994 -163101 122766
13196D46308a55125E871j240K91175E9854a30438F911Q0378J59267G9539C7184
$$ 446308 -155125 5871 4631 295806 59854 -130438 6911 87289 246556 79539 37184
13184H3320C8304b3287p1475E9352J29195L59233a18277b1308I1192J45761A12757
$$ 83320 38304 -23287 -94762 59352 188547 547780 -118277 -21308 91192 236953 112757
13172a23858G0168g0D28662b44794D16965J04743a00664B15380b33567A05792
$$ -123858 70168 -70 428662 -244794 416965 521708 -100664 215380 -233567 105792
13161A43982j6191n6284J36641A0472L37144d8305B61123l7126A4233K62828q7303
$$ 143982 127791 71507 208148 10472 347616 -48305 261123 223997 14233 277061 189758
13150A89758J36891b11297a2794j07367A88905P0338A16631a5163A00761J37917
$$ 189758 326649 -211297 -12794 -120161 188905 259243 116631 -15163 100761 238678
13140B38678b8813B22532p3421J71174j31189D3944d6839q2336A68524J3871J04935
$$ 238678 -28813 222532 149111 320285 189096 43944 -46839 -129175 168524 182395 287330
13129B87330E8158A051R1545d85162D843K44100G270J71711J4047N0463E0128
$$ 287330 58158 1051 92596 -485162 4843 248943 7270 178981 193028 243491 50128
13117C3012L86645H8840e3333n6187C28426k7069c3865l2024C8765K19649d1751
$$ 33012 419657 88840 -53333 -109520 328426 301357 -33865 -65889 38765 258414 -41751
13105A17647L5075J85573f1826C51581A25732R3789A7702b07318j47207I8889
$$ 117647 152722 338295 -61826 351581 125732 219521 17702 -207318 -354525 98889
13094A79526H6961f8561a390B50521a00646A95365b5626j02046a0496j99503A47707
$$ 179526 86961 -68561 -1390 250521 -100646 195365 -25626 -127672 -10496 -209999 147707
13082d1625a8281j59998A8549N1255d4183A12706f2239k17050c3934A33195J37495
$$ -41625 -18281 -178279 18549 69804 -44183 112706 -62239 -279289 -33934 133195 270690
13071B70690F8171b22874A10736D9488C521N8830J6033J60821a47271L1807A6872
$$ 270690 68171 -222874 110736 49488 3521 62351 78384 239205 -147271 -115464 16872
13059h5388d2260A39017a16673A31991K92334j58049n2419c8298D27505A15936
$$ -85388 -42260 139017 -116673 131991 424325 266276 213857 -38298 427505 115936
13048G0514a373H3835R9965b24100B31609o8845J11482r1367R4184A10923o106
$$ 70514 -1373 83835 183800 -224100 231609 162764 274246 182879 277063 110923 104817
13037A04817K14873d7210H6678J62474l9109Q956C8135P8409n1258J50859L44637
$$ 104817 319690 -47210 86678 249152 210043 218999 38135 116544 65286 216145 560782
13026E60782C5897P5645K16132A53973a67357N5617G7356J57184k7307l4228a02564
$$ 560782 35897 111542 327674 153973 -167357 -111740 77356 234540 207233 173005 -102564
13014B02210e0072B41272J06725A39520J02504R0974b84218e4415H2351Q7041
$$ 202210 -50072 241272 347997 139520 242024 332998 -284218 -54415 82351 169392
13004A69392H4153K35233a40960p6135C90304A84083K8484a88917G4412B2349
$$ 169392 84153 319386 -140960 -217095 390304 184083 212567 -188917 74412 22349
12993D15614B03333p4329P3234i0561B70073a22027A41600a59688A32090J51685
$$ 415614 203333 129004 202238 -90561 270073 -122027 141600 -159688 132090 283775
12983B83775i1550G4477P4624B4821J12781c20957d9238n5830A8331K89197J72379
$$ 283775 -91550 74477 149101 24821 137602 -320957 -49238 -105068 18331 307528 479907
12972D79907k03627q0459a56393A63995E6163k5424f2858K3879C63243a27655
$$ 479907 276280 195821 -156393 163995 56163 30739 -62858 -38979 363243 -127655
12961c366D1727a43502H4127K75655I0207j9102f7904C07193a43669H7707a5172
$$ -3366 41727 -143502 84127 359782 90207 71105 -67904 307193 -143669 87707 -15172
12949a46789K7934E92487A64554d4511r9021b1995A84506j6559C0669L7716j3817
$$ -146789 -118855 592487 164554 -44511 -143532 -21995 184506 167947 30669 68385 54568
12938E4568L10323j73968d96k2862k22174B8986E489M94048j98159C8528c8875
$$ 54568 364891 190923 -496 -23358 -245532 28986 5489 499537 301378 38528 -38875
12926a32934B2390a5276d597A40517K5507a52037C8569J17034g5643j8743A36229
$$ -132934 22390 -15276 -4597 140517 166024 -152037 38569 155603 -75643 -94386 136229
12914a61989I3882K2171i4657A05342a80518A35484b4340F3903Q3047o9838b4030
$$ -161989 93882 116053 -94657 105342 -180518 135484 -24340 63903 146950 77112 -24030
12902A58592N3107b65757G6226K36612c82472a59030B11462q3651a30284A4301
$$ 158592 211699 -265757 76226 312838 -382472 -159030 211462 127811 -130284 14301
12891b30444g4660A01922i0817a9633A88576K2289b206j02350H9032m3533h6640
$$ -230444 -74660 101922 -90817 -19633 188576 210865 -2206 -104556 89032 45499 -86640
12879b2491E5185K73411h6060J6815G5504a70617F0140O4222C5662M0051J10825
$$ -22491 55185 328596 -86060 -69245 75504 -170617 60140 124362 35662 75713 186538
12868A86538h0854D62295g417k2472m2537A9039K42164J9470r4367f4165J7395
$$ 186538 -80854 462295 -7417 -29889 -72426 19039 261203 280673 186306 -64165 -46770
12857d6770j59842B02677b30047r8048B5024b81829A59004l3153M4338a9506I6882
$$ -46770 -206612 202677 -230047 -328095 25024 -281829 159004 125851 170189 -19506 96882
12845E9679L84726a26690D0562K10344C3383b04511C3439b19148D2646J45285
$$ 59679 444405 -126690 40562 250906 33383 -204511 33439 -219148 42646 187931
12835A87931a07533C21812I0365M4974O6429A9570K7296a07770C2069a37933O7435
$$ 187931 -107533 321812 90365 135339 201768 19570 46866 -107770 32069 -137933 -70498
12824g0498B61750f0922A3343B33M6376A3939J5015h0092a1048l8429J9968B37
$$ -70498 261750 -60922 13343 233 46609 13939 28954 -80092 -11048 -49477 -29509 237
12811A2651a71081A84261b29730B40398j9156H2727C645J66425g8178k15314J03455
$$ 12651 -171081 184261 -229730 240398 221242 82727 3645 170070 -78178 -293492 -190037
12800a90037C4157b562B47640J6498g2255c3921F1178J72156K113A2365a47588
$$ -190037 34157 -2562 247640 264138 -72255 -33921 61178 233334 235447 12365 -147588
12788c35530A71910M54519F8197a44250I0569b3388r1129A46669R0966C7177c45636
$$ -335530 171910 626429 68197 -144250 90569 -23388 -114517 146669 237635 37177 -345636
12776a51545A72441g4190L1996A93546D2220a69942c2270k37226D04618A79172
$$ -151545 172441 -74190 -42194 193546 42220 -169942 -32270 -269496 404618 179172
12765D2812K73444r9003b94496f8100A3854a64491B17967h9949I5312a47111L0291
$$ 42812 316256 217253 -294496 -68100 13854 -164491 217967 -89949 95312 -147111 -116820
12754a16820I1104J47268J02303r3896K1677e9884C304b07607A8703J32253e9017
$$ -116820 91104 238372 340675 246779 268456 -59884 3304 -207607 18703 150956 -59017
12742h6168k41499A00477j9678i9021M1244A02128c21460R2321C8129c34168a05603
$$ -86168 -327667 100477 80799 -99021 -57777 102128 -321460 -229139 38129 -334168 -105603
12730h024k2669m2870j14496f5650B0549a49902A88883j8158o0174O3232m3908
$$ -8024 -30693 -73563 -188059 -65650 20549 -149902 188883 170725 110551 173783 129875
12719A29875a59986j85574J03691B73166a34680O5857C0001A147J79689a10563
$$ 129875 -159986 -345560 -241869 273166 -134680 -68823 30001 1147 180836 -110563
12708A30069c960r8333G8399a5928G5365a67319A6102d9612r1258F9061O1613
$$ 130069 -3960 -102293 78399 -15928 75365 -167319 16102 -49612 -140870 69061 130674
12697A30674R4779k2684p8674K20545k1089A59578J94102B417J92958R4604b04228
$$ 130674 225453 202769 124095 344640 323551 159578 353680 2417 195375 289979 -204228
12685a9903B51285d19989g8422I3503b13767a5171B16118I5697B4791N5501e5342
$$ -19903 251285 -419989 -78422 93503 -213767 -15171 216118 95697 24791 80292 -55342
12673a5555B82190a30746E071J52784G1347k624N8163o433a19279j80816I7869
$$ -15555 282190 -130746 5071 157855 71347 68723 126886 120453 -119279 -300095 97869
12661B57004Q644d7211K0218k0746a0127A04304H727P7808p425d4764D4735a03097
$$ 257004 265648 -47211 -26993 -47739 -10127 104304 8727 86535 79110 -44764 44735 -103097
12648C24304g4177J7782A55261M2860m4720N9772h3621B56916N1714C1377j4911
$$ 324304 -74177 -56395 155261 198121 153401 213173 -83621 256916 308630 31377 16466
12637A6466J14910i3151c9987A18916N632J46622q7509E4124K0497p082K4435
$$ 16466 131376 -93151 -39987 118916 124548 271170 183661 54124 74621 67539 91974
12626I1974b86465C2055J34921D7058R2280o584a9467J902F10173A00928L4886
$$ 91974 -286465 32055 166976 47058 139338 132754 -19467 -17565 610173 100928 135814
12615A35814F2432j3788N43496B52424a21618E4891D275h153D38299A75079O1814
$$ 135814 62432 48644 592140 252424 -121618 54891 4275 -8153 438299 175079 236893
12604B36893P5344A23019F0869R9308h2079B32688M1702e6048k5355A81235a41154
$$ 236893 312237 123019 60869 160177 -82079 232688 274390 -56048 -81403 181235 -141154
12592B4302c2117A88065h7700p198A18994a40065E08147A64112n2762l4178a50348
$$ 24302 -32117 188065 -87700 -94898 118994 -140065 508147 164112 111350 77172 -150348
12580i5870A91639O4308A0705l583a35294A55679h9341B59101D3035a83977A49318
$$ -95870 191639 255947 10705 7122 -135294 155679 -89341 259101 43035 -183977 149318
12568B28718e9054A88319a91566C52376i2613A85521a31154A04205C7718M09164
$$ 228718 -59054 188319 -191566 352376 -92613 185521 -131154 104205 37718 446882
12558D46882a9833E244J92265a69849P3002k64313a69331A89630c1139E8532P0699
$$ 446882 -19833 5244 197509 -169849 -96847 -361160 -169331 189630 -31139 58532 129231
12547A29231a43496B85376a93613G0805j6242b20303g9577j62541A52445b6596
$$ 129231 -143496 285376 -193613 70805 54563 -220303 -79577 -242118 152445 -26596
12536A31334Q0673g3550j36357f5128B41203c94457E2959a87897j19561l9857
$$ 131334 212007 -73550 -209907 -65128 241203 -394457 52959 -187897 -307458 -347315
12526c47315B16025E5672P5233d6207j21886M1865J4986c1036p5663q1432N1307
$$ -347315 216025 55672 130905 -46207 -168093 -126228 -111242 -31036 -106699 -188131 -136824
12515a36824L7482A71738q4073B006a79854Q5505G9712H342a75988P8436G425
$$ -136824 -99342 171738 87665 2006 -179854 -94349 79712 8342 -175988 -97552 7425
12503B84333k6997F9962f2994J9342j32722E1338J1151c61276A86961H1141a57235
$$ 284333 257336 69962 -62994 -43652 -176374 51338 62489 -361276 186961 81141 -157235
12491f3325j49504A37601C3008O5540a49798C15795a41461j35622i5286d1659
$$ -63325 -212829 137601 33008 98548 -149798 315795 -141461 -277083 -95286 -41659
12480a1952B09680n5548K03905q6280f3612I8183R7642J70047b94505F7788b08336
$$ -11952 209680 154132 358037 271757 -63612 98183 195825 365872 -294505 67788 -208336
12468C1543L3170K0683K98349F687K26278h7150k82694a9786O341H2018c7713
$$ 31543 64713 85396 383745 6687 232965 -87150 -369844 -19786 -13445 82018 -37713
12456B8229j938c76199I9536l4875J70069L2883d5789a5236n8215B07099a67667
$$ 28229 26291 -376199 99536 64661 234730 267613 -45789 -15236 -73451 207099 -167667
12444a88209B4357J45174a67642B4986M76485b10063A00735C4890a73000G5068
$$ -188209 24357 169531 -167642 24986 501471 -210063 100735 34890 -173000 75068
12433b74239I6364d3339n2077a8688K992j16026p9598I0898b39290E00971E341
$$ -274239 96364 -43339 -95416 -18688 -15696 -131722 -211320 90898 -239290 500971 5341
12421D2086O7892c23643i7697B09967r3875E0454e3193r4719b7521l7842I2189
$$ 42086 109978 -323643 -97697 209967 116092 50454 -53193 -147912 -27521 -65363 92189
12409a79820M6257k72174h4390j39741A25034a41004G0977B5014a32949C0708
$$ -179820 -133563 -405737 -84390 -224131 125034 -141004 70977 25014 -132949 30708
12398a0047B73373b06700b608I8245c11402h6783j49996C3234c6315C8524e8316
$$ -10047 273373 -206700 -2608 98245 -311402 -86783 -236779 33234 -36315 38524 -58316
12386B13963r0520j2062f4473A36293g1946F5481k2312h3382G5633M4543i4180
$$ 213963 123443 111381 -64473 136293 -71946 65481 43169 -83382 75633 120176 -94180
12374a52034l8803ek16822B59977a9154H5505b87702C016g2620B22111a64263
$$ -152034 -190837 -5 -216827 259977 -19154 85505 -287702 3016 -72620 222111 -164263
12362A03525M625i5869D06337B2983f7921j92519A85773b4454B16773a54150b8283
$$ 103525 108150 -95869 406337 22983 -67921 -260440 185773 -24454 216773 -154150 -28283
12350c29628A49930H294b6368A35659a99984H1254f1126j08104d4314E9265a80956
$$ -329628 149930 8294 -26368 135659 -199984 81254 -61126 -169230 -44314 59265 -180956
12338b82383B09371b2907j18347o0210R4740A10644a32164A50012a06007e0044
$$ -282383 209371 -22907 -141254 -201464 -106724 110644 -132164 150012 -106007 -50044
12327a28285B03443A8365K86445c0707B92460b30497C39953a10758A2182L95539
$$ -128285 203443 18365 304810 -30707 292460 -230497 339953 -110758 12182 407721
12317D07721Q6974k40435n8986J54927f5531A84625N5846j6962G0281K50606j55626
$$ 407721 494695 254260 195274 350201 -65531 184625 240471 223509 70281 320887 165261
12306A65261E7046K00638K360d9450A7263K99428D6857K47029A5158K45114a91128
$$ 165261 57046 257684 260044 -49450 17263 316691 46857 293886 15158 260272 -191128
12294d6910A68899o9410e0061D3193a23614r4530B67929o1631M5020A17900N5427
$$ -46910 168899 99489 -50061 43193 -123614 -218144 267929 206298 251318 117900 173327
12283A73327K76415k10775l4891E3748P3595a40200D7853B0624J65104a58223
$$ 173327 449742 238967 204076 53748 127343 -140200 47853 20624 185728 -158223
12272A25738a25779A15987J65585l1233h1434B98486q642A10315g3251B85679
$$ 125738 -125779 115987 281572 250339 -81434 298486 289844 110315 -73251 285679
12261C43358j66090J65696N366j09167I2097K6834O5866p39b51514d501C42737
$$ 343358 177268 342964 348330 239163 92097 118931 184797 184058 -251514 -4501 342737
12249D73689j85704c3126A24675e6011A88536I2865J97149F5231b12798A55599
$$ 473689 287985 -33126 124675 -56011 188536 92865 290014 65231 -212798 155599
12238G3715B1305K66793k0411G9065a66925B24767J21236A8758K64976r0513J82048
$$ 73715 21305 288098 267687 79065 -166925 224767 346003 18758 283734 193221 375269
12227C75269f6102A44394G559K72988a06967c970j65687g5359B62756E9226J14708
$$ 375269 -66102 144394 7559 280547 -106967 -3970 -169657 -75359 262756 59226 173934
12216A73934D1181K44476D4835R9452e5455A11138M2116c4390q7165a0H8525M53707
$$ 173934 41181 285657 44835 144287 -55455 111138 153254 -34390 -121555 -10 88525 542232
12204E42232k65545K27580e1417A38666j0878b02067B333J54543J56258m0819
$$ 542232 276687 504267 -51417 138666 127788 -202067 2333 156876 313134 272315
12194B72315b57335D24517C7108b4957H339O3143h9565C32749j28560L5658m8586
$$ 272315 -257335 424517 37108 -24957 8339 71482 -89565 332749 204189 239847 191261
12183A91261g0944B20786J29793j00653k679B0560K40784l2550B2211K40738E8901
$$ 191261 -70944 220786 350579 249926 247247 20560 261344 228794 22211 262949 58901
12171c3880C013a04610B61250L0683H2944a89412C00691b62680B49246l2156A05372
$$ -33880 3013 -104610 261250 291933 82944 -189412 300691 -262680 249246 217090 105372
12159D22946k04483c4256H8033E813M28091j35846O6246j62928a9232C88123j5417
$$ 422946 218463 -34256 88033 5813 433904 298058 364304 201376 -19232 388123 372706
12148C72706A73213l2184E0054L4844f6678B28381m7406p375J92502A63144A9011
$$ 372706 173213 141029 50054 84898 -66678 228381 180975 173600 366102 163144 19011
12136a942B91908h06B69228a46678H1779b61220F0581J4640l65M0979l075O9382
$$ -1942 291908 -806 269228 -146678 81779 -261220 60581 75221 74856 115835 112760 182142
12124A82142C6681j1825N8484l2419c2220A09748c8024B5864J94479b0759H4998
$$ 182142 36681 24856 83340 50921 -32220 109748 -38024 25864 220343 -20759 84998
12112e5279n6166o170B69091a43607B6700b67479E03418B51063a12916G0704k8093
$$ -55279 -111445 -117615 269091 -143607 26700 -267479 503418 251063 -112916 70704 42611
12101D2611N2831a69908G9089b4107B16551A02850l700b54588C124J8597M4399
$$ 42611 95442 -169908 79089 -24107 216551 102850 99150 -254588 3124 21721 66120
12090F6120R8633b05022a3635l01320h6435j08880B77637A14364a62716I5290
$$ 66120 164753 -205022 -13635 -314955 -86435 -195315 277637 114364 -162716 95290
12079A7752K50835I2705c00527E38902k67020L07124B03686b36826A81370H8785
$$ 17752 268587 92705 -300527 538902 271882 579006 203686 -236826 181370 88785
12068e6596C79859A24017J20047j6919l7302f1335B19314e7025n1410B68310N5796
$$ -56596 379859 124017 244064 227145 189843 -61335 219314 -57025 -108435 268310 324106
12057C24106a33812E6836L12566E7611K05822r300R6338A50423a70292E4560K58143
$$ 324106 -133812 56836 369402 57611 263433 254133 350471 150423 -170292 54560 312703
12046C12703b20553a0642m8093K5365B74543k5533D9600A9625J35929O9734K5771
$$ 312703 -220553 -10642 -58735 -33370 274543 249010 49600 19625 155554 225288 251059
12035B51059i2831A96231a28956l4448B87711k6231G2295J19402c40972g5895
$$ 251059 -92831 196231 -128956 -163404 287711 261480 72295 191697 -340972 -75895
12024A22643j2940m8486K16575b72950e512A07778C5500J37007h0685j2368A20101
$$ 122643 109703 61217 277792 -272950 -5512 107778 35500 172507 -80685 -93053 120101
12012a27028M5914C90248G8840L1321a00785I2629O9024K3565p591J9694j707
$$ -127028 -81114 390248 78840 110161 -100785 92629 161653 185218 177627 197321 195614
12001A95614E2388d5373m5585m2526b9306A45885Q5021J6076D7347a49118F8351
$$ 195614 52388 -45373 -90958 -133484 -29306 145885 230906 246982 47347 -149118 68351
11989A57989D4557b68476G5618d4747j88948d0623B41582l6159c83908e6457C1434
$$ 157989 44557 -268476 75618 -44747 -233695 -40623 241582 205423 -383908 -56457 31434
11977i799m1l338k2722j48612g8105G2663a55873M9691M4632B84941c48358B11906
$$ -9799 -9840 -13178 -35900 -184512 -78105 72663 -155873 -106182 -61550 284941 -348358 211906
11964A4546e5160l7374r2203Q2205E6960e6569H7963A387a0318C5047J70574a66614
$$ 14546 -55160 -92534 -184737 -102532 56960 -56569 87963 1387 -10318 35047 205621 -166614
11951D86025A48910c72866a01686j32289A37435H516c08090A53569J3635a4275
$$ 486025 148910 -372866 -101686 -233975 137435 8516 -308090 153569 167204 -14275
11940a51210A06171c4088A04105a28683j2818j76144L3880B52377a22098j7203
$$ -151210 106171 -34088 104105 -128683 -141501 -317645 -283765 252377 -122098 -139301
11930a39301p9099B94295p1228c44040B0532L69781A51562b24820A35557a21751
$$ -139301 -218400 294295 223067 -344040 20532 390313 151562 -224820 135557 -121751
11919D1862N3412J40057q3967c40459B75821c05521A46910a1841j72421L4197
$$ 41862 95274 235331 151364 -340459 275821 -305521 146910 -11841 -184262 -150065
11909a50065j38548a20236E8127L16695D7527a21660a6257G4666a28371d3757
$$ -150065 -288613 -120236 58127 374822 47527 -121660 -16257 74666 -128371 -43757
11898B32521J36002a63147A07359I011f974C36206I4382J91965E8279L4496b08284
$$ 232521 368523 -163147 107359 9011 -6974 336206 94382 286347 58279 92775 -208284
11886i2945D9682d9764l9058j14162f0560G0746b42752f7353j21056f2499a2596
$$ -92945 49682 -49764 -88822 -202984 -60560 70746 -242752 -67353 -188409 -62499 -12596
11874e62687G4792J13063c92002J89242C4502P5537n2113K7220K36475a57036
$$ -562687 74792 187855 -392002 -202760 34502 110039 57926 85146 321621 -157036
11863b9398J4023l5012F7403d9756B23842p4597a05000I5289d1902l4404n3014
$$ -29398 -15375 -50387 67403 -49756 223842 149245 -105000 95289 -41902 -76306 -129320
11852a29320d0477A13743a67660A41738a65654H2085A5079a0079j60911b185m0481
$$ -129320 -40477 113743 -167660 141738 -165654 82085 15079 -10079 -170990 -2185 -42666
11841d2666j30620B20486G832L8882M58548c9092B09462I4343b10585B9563b5697
$$ -42666 -173286 220486 7832 46714 505262 -39092 209462 94343 -210585 29563 -25697
11829F1631b1191F0358c28083R6344f080r0570c9386j81343a06597B4741J56338
$$ 61631 -21191 60358 -328083 -231739 -6080 -96650 -39386 -220729 -106597 24741 181079
11818A81079c10524J12343N1753d5010E1520a26267f618A64618b94169f074C00831
$$ 181079 -310524 -198181 -146428 -45010 51520 -126267 -6618 164618 -294169 -6074 300831
11806F6667f5252k05896c5240A16849j003a04212j0164o79p6562o0011i4925j69186
$$ 66667 -65252 -271148 -35240 116849 115846 -104212 -114376 -115055 -191617 -251628 -94925 -264111
11794b64111B8634b62214J27637k22097p7844A01635b6393m9738G1314J13780
$$ -264111 28634 -262214 -134577 -356674 -434518 101635 -26393 -76131 71314 185094
11784A85094J0878a06320j78445A81236d2326F8329J8283a79755A12596L9575
$$ 185094 195972 -106320 -284765 181236 -42326 68329 86612 -179755 112596 152171
11774A52171c31893a08735B1982A230c9110A3780N5003J00902a32624p6221a4965
$$ 152171 -331893 -108735 21982 1230 -39110 13780 68783 169685 -132624 -208845 -14965
11762h7053B0295a08223H0441b3113q3965L7164A01895a65511f2146D915J25728
$$ -87053 20295 -108223 80441 -23113 -107078 -69914 101895 -165511 -62146 4915 130643
11751A30643g8758A41076m0138a83179G6537K01032b48289D9015K1903h8600G2507
$$ 130643 -78758 141076 100938 -183179 76537 277569 -248289 49015 70918 -88600 72507
11739b24712P3925B32789h470p7735a6662k25181b2790A35102e0764B11009b92529
$$ -224712 -150787 232789 -8470 -86205 -16662 -241843 -22790 135102 -50764 211009 -292529
11727a74682h5146c0323B0687O5552a11029A29240A0836h9214D8319g8279p6513
$$ -174682 -85146 -30323 20687 86239 -111029 129240 10836 -89214 48319 -78279 -154792
11716a54792f4338A06665D1924c0820B30059h4167B60576d63978A33862D9785
$$ -154792 -64338 106665 41924 -30820 230059 -84167 260576 -463978 133862 49785
11705d3393q4265q4814A48633a48023q6803D6632K21973R1037b2570I8003k4170
$$ -43393 -127658 -212472 148633 -148023 -234826 46632 268605 359642 -22570 98003 73833
11694G3833J14017a4789o527b019r4756j0116A04721N2274f3493p6150A25803
$$ 73833 187850 -14789 -21316 -2019 -96775 -106891 104721 156995 -63493 -139643 125803
11682E7080K1123b88365B69681A21992a05226o5750E891e397r6893A17290J81679
$$ 57080 78203 -288365 269681 121992 -105226 -170976 5891 -5397 -102290 117290 298969
11671B98969D694J13839f0894I6951a9073C82968b18623N2871c6288k7448p1289
$$ 298969 4694 118533 -60894 96951 -19073 382968 -218623 -165752 -36288 -63736 -135025
11660a35025M2941K8165D57492j99200j17515f0909G8021a71384I8653b92730
$$ -135025 -92084 -63919 457492 258292 140777 -60909 78021 -171384 98653 -292730
11649I154a73431A6907J38070a02231j02745A44910A0240L8042J30103j5632a28411
$$ 9154 -173431 16907 154977 -102231 -204976 144910 10240 48282 178385 162753 -128411
11637a42147O5599F5837c63880c2369l33827B87864F8185K03566a01770e0725
$$ -142147 -76548 65837 -363880 -32369 -366196 287864 68185 271751 -101770 -50725
11626b24835D4495e8782A26643J12891d186j28138D7922O7495a90174A48548a58359
$$ -224835 44495 -58782 126643 239534 -4186 -132324 47922 115417 -190174 148548 -158359
11614d7675e747A51168B6560K8900c17974i959A07267M3352p5085L3209e0636
$$ -47675 -5747 151168 26560 55460 -317974 -9959 107267 150619 75534 108743 -50636
11602B33927A01614J3571m9973J15716J95368d8215o2270O908A36347o755i8299
$$ 233927 101614 115185 65212 180928 376296 -48215 -110485 -103577 136347 129592 -98299
11590c34024A51269b08285k8855A07376l2063c41683a16448A62613m0664k6986
$$ -334024 151269 -208285 -237140 107376 75313 -341683 -116448 162613 121949 94963
11580I4963a37266P412F163N4907N1278m9977g37j55441C42921e6934C0705J45522
$$ 94963 -137266 -129854 6163 61070 112348 62371 -737 -156178 342921 -56934 30705 176227
11568A76227o0956b35832A28769Q5171e8168E8310K35863O3259b9563C48556j12021
$$ 176227 115271 -235832 128769 213940 -58168 58310 294173 357432 -29563 348556 236535
11557B36535j13856R4562a12392D1087C407a90474K7703D196L0377b78232C51591
$$ 236535 122679 217241 -112392 41087 3407 -190474 -162771 4196 34573 -278232 351591
11545a6126A00288a85825A76229i9825B13921r2757J50840b77605H792b40056
$$ -16126 100288 -185825 176229 -99825 213921 121164 272004 -277605 8792 -240056
11534A1921K86684d2372G1675a61129j6789Q3908B14179b57766R4728l9429A22660
$$ 11921 298605 -42372 71675 -161129 -177918 -94010 214179 -257766 -163038 -202467 122660
11522b3314D52722a0632j63773l130Q5552K7397B08147J0379J39834A36993D0532
$$ -23314 452722 -10632 -174405 -177535 -91983 -64586 208147 218526 358360 136993 40532
11510A53210G4392K01465a08677j14941f1177A45017h3013A6500K74747A4043
$$ 153210 74392 275857 -108677 -223618 -61177 145017 -83013 16500 291247 14043
11499c20071e4333A62424A3432L64684c8554D01833j66561o7137l1423a751A66372
$$ -320071 -54333 162424 13432 378116 -38554 401833 235272 168135 136712 -1751 166372
11487H8857N7493R7628i4583D7823l063D754a2947q2866B5673I10L91531C9010
$$ 88857 146350 243978 -94583 47823 44760 4754 -12947 -95813 25673 910 392441 39010
11474A28249E7303J64684J25605o0962D1171d5029G1978J71300e91B63599C6354
$$ 128249 57303 221987 347592 286630 41171 -45029 71978 243278 -591 263599 36354
11462B78227a78296A54111a60211f2974B67898d1846C76318P780F4130J1015c42126
$$ 278227 -178296 154111 -160211 -62974 267898 -41846 376318 384098 64130 75145 -342126
11450A59786J20012b01962A52184l7955b44402C46846r3843H7324K46710K04135
$$ 159786 279798 -201962 152184 114229 -244402 346846 253003 87324 334034 538169
11440E38169b13879C0129f6392B06659a18994d0270E3490a19730B22784B5314
$$ 538169 -213879 30129 -66392 206659 -118994 -40270 53490 -119730 222784 25314
11429b6010A61890c20131g4946j70605A95162J2976a31459G9636e9628E9053d0081
$$ -26010 161890 -320131 -74946 -245551 195162 208138 -131459 79636 -59628 59053 -40081
11417A06526b7932n6345K9047B0145L4883O1551J97375B0865N465b51688J18845
$$ 106526 -27932 -84277 -55230 20145 55028 116579 313954 20865 26330 -251688 -132843
11406a32843f5194A14896P3084H8150g5109G4471Q6158f2683j17051Q2957J17
$$ -132843 -65194 114896 187980 88150 -75109 74471 160629 -62683 -179734 -96777 -96660
11395i6660B40640D5036a01486p4363G2148b69736F5403a6524A78359b21280l5498
$$ -96660 240640 45036 -101486 -175849 72148 -269736 65403 -16524 178359 -221280 -256778
11384b56778J12620j2238O5207B58156a3758j30527k2051A85664d5661j48088
$$ -256778 -144158 -156396 -91189 258156 -13758 -144285 -166336 185664 -45661 -193749
11374a93749L6107B33435d8217j51250B96060d079B0050L88917A59154D738L0965
$$ -193749 -157642 233435 -48217 -199467 296060 -4079 20050 408967 159154 4738 35703
11363C5703h647n334A66533a45888r1588o2647j01044A45516b28852g7650A6413
$$ 35703 -8647 -13981 166533 -145888 -237476 -300123 -401167 145516 -228852 -77650 16413
11351b65418E8854J81682b7168A66844b36968A46607h2103C7297k44h9504p8089
$$ -265418 58854 240536 -27168 166844 -236968 146607 -82103 37297 37053 -89504 -167593
11340a67593N0329B60801A08875C4456c2435k23170e6935B8973d2844q6235L182
$$ -167593 -117264 260801 108875 34456 -32435 -255605 -56935 28973 -42844 -129079 -125897
11329a25897A17158J03669r6689H801O1030d0390A6474b47462D02499d6853A23208
$$ -125897 117158 220827 124138 8801 69831 -40390 16474 -247462 402499 -46853 123208
11317a29639C2599m789a07744n4158A27745a40687e2290j89129a16835l58822
$$ -129639 32599 27810 -107744 -161902 127745 -140687 -52290 -241419 -116835 -475657
11307d75657J85368A29920A9803a21915j52809J27504k4028P2361C4715a18566
$$ -475657 -290289 129920 19803 -121915 -274724 -147220 -171248 -98887 34715 -118566
11296i3937R175l4672j19736i6180k79046A07138K08822e3756k55551A81306a42541
$$ -93937 -84762 -119434 -239170 -96180 -375226 107138 315960 -53756 -309307 181306 -142541
11284d4467l58086P2908F8745a28827A60482b74056A65915f6589o2319l9677A08528
$$ -44467 -402553 -329645 68745 -128827 160482 -274056 165915 -66589 -128908 -168585 108528
11272A7098J76348K63674I7245L23820b71152m2565D4483k0590e02539B1947b07576
$$ 17098 193446 457120 97245 421065 -271152 -313717 44483 23893 -502539 21947 -207576
11260a15066K6692B6967c9929A29611C0498c61070A67148n3773N277J10269b33425
$$ -115066 -88374 26967 -39929 129611 30498 -361070 167148 113375 118652 228921 -233425
11248a92754B26410E2510a36424B75460j08300b65515D1697a11660A2757b08678
$$ -192754 226410 52510 -136424 275460 167160 -265515 41697 -111660 12757 -208678
11237A14476a4750j06652A34807e8428k06175p688f5825A4218K05266b8893j68855
$$ 114476 -14750 -121402 134807 -58428 -264603 -272291 -65825 14218 219484 -28893 -197748
11226a97748C18961d3798J293l1343A3842M6754H594O7542k529l2997p565c21068
$$ -197748 318961 -43798 -42505 -73848 13842 60596 8594 76136 73607 40610 33045 -321068
11213A56231C5198b34169A44584D7660e526l5075J7676l2639B3142J29581b4294
$$ 156231 35198 -234169 144584 47660 -5526 -40601 -22925 -55564 23142 152723 -24294
11201a96343k36447a20476A48041L6840a59248k49658J87165g3364j09360L8633
$$ -196343 -432790 -120476 148041 184881 -159248 -408906 -221741 -73364 -182724 -144091
11191a44091j08835j4105h4443A4715a16285q5031c7266r2060L7542j10760a2829
$$ -144091 -252926 -267031 -84443 14715 -116285 -201316 -37266 -129326 -91784 -202544 -12829
11179D64258A60234C5971b45375r1854a5128j52059C01766c0201F3288f6676p8651
$$ 464258 160234 35971 -245375 -337229 -15128 -167187 301766 -30201 63288 -66676 -145327
11168a45327O9313b8549j02642b071r8348A44371i413C2313K1349o712M143R5393
$$ -145327 -76014 -28549 -131191 -2071 -100419 144371 -9413 32313 53662 46950 51093 146486
11156A46486n3797a51273P4067j78529a17425B50910C745b46366I192L865a79370
$$ 146486 92689 -151273 -77206 -255735 -117425 250910 3745 -246366 9192 13057 -179370
11144B52545B2870d17628B60813b77618f7796p0577L187A04169L585a94813g7542
$$ 252545 22870 -417628 260813 -277618 -67796 -138373 -135186 104169 107754 -194813 -77542
11132A25807e8148A49362a41797A32389a95224Q2422a129C1486b1514G4462d7282
$$ 125807 -58148 149362 -141797 132389 -195224 -112802 -1129 31486 -21514 74462 -47282
11120e9970C8573a55012p2019e8403H9211k0917J0755J52696c487k40584L2406
$$ -59970 38573 -155012 -227031 -58403 89211 68294 79049 231745 -3487 -244071 -211665
11109b11665R0109A59246e0020k8671A02536C0994L5674R972d7234A73a23937
$$ -211665 -121556 159246 -50020 -78691 102536 30994 66668 76640 -47234 173 -123937
11097C8294O0801A9214a86853O1922q2389B16449f6334C06509j26990Q6427c20018
$$ 38294 99095 19214 -186853 -124931 -207320 216449 -66334 306509 179519 265946 -320018
11085A66159A703K86515E0760K09634r6432B4220M6217K98579a33168B35328F4447
$$ 166159 1703 288218 50760 260394 163962 24220 70437 369016 -133168 235328 64447
11073c31512A25876K83739n5533A41152J64696j20390o9934J05330Q379j0887
$$ -331512 125876 409615 354082 141152 305848 185458 115524 220854 229233 218346
11063B18346O6627I6740J71070c0164d486C99606p2648j31638c6569D92482j02970
$$ 218346 284973 96740 267810 -30164 -4486 399606 326958 195320 -36569 492482 389512
11052C89512j50665b6867A65837l2947R6341A01776L66979q2840j00266K08905
$$ 389512 238847 -26867 165837 132890 229231 101776 468755 385915 285649 494554
11042D94554K24223k70966L13661n1099C23585l0271L29708L8446m4237j16640
$$ 494554 718777 447811 761472 710373 323585 293314 623022 661468 617231 500591
11032E00591J59281J47508J05875l33735p9214L50701C98154K52999L03992k61953
$$ 500591 659872 807380 913255 579520 500306 851007 398154 651153 955145 693192
11022F93192k04657L3175n0447K82389j29555J8095k23161L7J05095j27964K544
$$ 693192 488535 521710 471263 753652 624097 642192 419031 419068 524163 396199 398743
11011C98743L53655O8082j31730o5797J41501k0402p14j4839k12535j38237K13932
$$ 398743 752398 820480 688750 622953 764454 744052 743338 728499 515964 377727 591659
11000E91659R2309j73062j24714J02846R276J29728k90599N8490M6246J77397
$$ 591659 683968 510906 386192 489038 498314 628042 337443 395933 442179 619576
10990F19576B47088N46869j82763j81808K28990k18440k9171J96761j76236J21387
$$ 619576 247088 793957 611194 429386 658376 439936 410765 607526 431290 552677
10980E52677B32833L77471k63273M42586j03970K3751A49093L11455n3427N62891
$$ 552677 232833 610304 347031 789617 685647 709398 149093 460548 407121 970012
10970I70012k14511K46221l17793K18994j41869Q2715N8576l80822M54621J22743
$$ 970012 755501 1001722 683929 902923 761054 843769 902345 521523 976144 1098887
10960A098887j36562N12274q0392K87656J66615q2070O99K64711J70582k03422
$$ 1098887 962325 1474599 1394207 1681863 1848478 1766408 1767107 2031818 2202400 1998978
10950A998978J26479k31960j42647k41598L9113m2104R5694q1528m15276K687
$$ 1998978 2125457 1893497 1750850 1509252 1548365 1506261 1601955 1520427 1105151 1107838
10940A107838M76836J4698j15260m39374J65202L3197P5595o08604k76741N6909
$$ 1107838 1584674 1599372 1484112 1044738 1209940 1243137 1318732 710128 433387 490296
10930D90296J73194j05984j05492j14904J42772E7903b40868A98759i9677D16166
$$ 490296 663490 557506 452014 337110 479882 57903 -240868 198759 -99677 416166
10919a7315j36732I2835K29996O2976a65991G0067b4801k327D33824c7536j93820
$$ -17315 -154047 92835 322831 385807 -165991 70067 -24801 -27128 433824 -37536 -231356
10908b31356H3281J03183a09731H5758O9920Q8720F5218J08732i2889b2555k09607
$$ -231356 83281 186464 -109731 85758 155678 244398 65218 173950 -92889 -22555 -232162
10897b32162A10800b04401A33616h5166H1994b51044O7030j15648D6994J07335
$$ -232162 110800 -204401 133616 -85166 81994 -251044 -184014 -299662 46994 154329
10887A54329D728a50956j2666g4080J9498C86896b51663a2938J099F5431a99227
$$ 154329 4728 -150956 -163622 -74080 -54582 386896 -251663 -12938 -11839 65431 -199227
10875H5603L4576a60314l1076G1026B3881c87483b4873l99793a33097A80887c31150
$$ 85603 120179 -160314 -191390 71026 23881 -387483 -24873 -424666 -133097 180887 -331150
10863A6541b90478f7972n2405d0244A89395D8278b56626G2392a87478e5046l64935
$$ 16541 -290478 -67972 -120377 -40244 189395 48278 -256626 72392 -187478 -55046 -419981
10852d19981a95007A32252a69600b0114B16656a60107R937B36224A12581c9735
$$ -419981 -195007 132252 -169600 -20114 216656 -160107 -150170 236224 112581 -39735
10841b9243n7027m7720r5750N8572K0187j04726J6753J7204E5148L45139a16938
$$ -29243 -86270 -133990 -229740 -171168 -150981 -255707 -238954 -221750 55148 400287 -116938
10829b02814B92676i5928G5166b171A34202B3870J01254J78801j50161J38920
$$ -202814 292676 -95928 75166 -2171 134202 23870 125124 303925 153764 292684
10819B92684A22557a89703A35594b48F1919i9868L6646m0256C9751b91066I631
$$ 292684 122557 -189703 135594 -248 61919 -99868 -63222 -103478 39751 -291066 9631
10807A94196c6972l355J7960j09537A93199o7994D7353a56008n4B9485a8327A26009
$$ 194196 -36972 -40327 -22367 -131904 193199 125205 47353 -156008 -156062 29485 -18327 126009
10794H1598a52314A12135J49852b04936F7180f0073r7799n4584R9379d7111k8269
$$ 81598 -152314 112135 261987 -204936 67180 -60073 -157872 -212456 -113077 -47111 -75380
10783g5380b0361A58332a73943E6828K433a92373D8087f5658j35964g4793l23910
$$ -75380 -20361 158332 -173943 56828 59261 -192373 48087 -65658 -201622 -74793 -398703
10772c98703D951R019b59446A26379d59670a43836k87369B65323a63422b2239
$$ -398703 4951 13970 -259446 126379 -459670 -143836 -431205 265323 -163422 -22239
10761a3309B85754G5271f2556j23946A24636a49372H4345b26893A08412a67750
$$ -13309 285754 75271 -62556 -186502 124636 -149372 84345 -226893 108412 -167750
10750a41607B62324d1699C00292F4080J19958F4360K2550j2549b19793N2026h0788
$$ -141607 262324 -41699 300292 64080 184038 64360 86910 74361 -219793 -167767 -80788
10738A03553p605a35872B28234E4106a42578K2847b2156L39l79841B24913b740
$$ 103553 95948 -135872 228234 54106 -142578 -119731 -22156 -21817 -401658 224913 -2740
10726A29850a24689k574H3518c06058J6371I9105a28557N1781D145a83902A7083
$$ 129850 -124689 -127263 83518 -306058 -289687 99105 -128557 -76776 4145 -183902 17083
10714A08478g7386B33942E64a27957A14255m5421a92832B51665o9568e350C7046
$$ 108478 -77386 233942 564 -127957 114255 68834 -192832 251665 182097 -5350 37046
10702I0445a79846k8322B77942f6845k36188e3167A62011b9760j77182i4827m4020
$$ 90445 -179846 -208168 277942 -66845 -303033 -53167 162011 -29760 -206942 -94827 -138847
10691a38847A0856b66922J9148h315k36462O4575D2799a22233L6782p0338L7496
$$ -138847 10856 -266922 -247774 -8315 -244777 -180202 42799 -122233 -85451 -155789 -118293
10680a18293D89635d24426B00221r3018j8999c87860I8326a01234G4065j122a00346
$$ -118293 489635 -424426 200221 107203 88204 -387860 98326 -101234 74065 72943 -100346
10668a55027F964c36742A0355a09865d739l96827i6625j2021N1914a56A58538
$$ -155027 6964 -336742 10355 -109865 -4739 -401566 -96625 -108646 -56732 -156 158538
10656d27012A85921d3384j5961r2082L4964H0527A4128K5463a94228C9377b24849
$$ -427012 185921 -43384 -59345 -151427 -116463 80527 14128 39591 -194228 39377 -224849
10644a20766q5771B04646H0227K00401a83045f3604j57530c2892A60277L1270
$$ -120766 -206537 204646 80227 280628 -183045 -63604 -221134 -32892 160277 191547
10634A91547b52902A07922b33386J15709A68538e5005k78900G4230a22393B38414
$$ 191547 -252902 107922 -233386 -117677 168538 -55005 -333905 74230 -122393 238414
10623D5897c13024A84859d0629C7701f0099C91801a39398A60653m2927a57006
$$ 45897 -313024 184859 -40629 37701 -60099 391801 -139398 160653 117726 -157006
10612G694f9185B5052b04114I2268a75276d7473A35260P2004D2983d20403i9938
$$ 7694 -69185 25052 -204114 92268 -175276 -47473 135260 207264 42983 -420403 -99938
10600a48096k0221j36125G0218j5979a60229l28093I3501b2096j45249B66364
$$ -148096 -168317 -304442 70218 54239 -160229 -488322 93501 -22096 -167345 266364
10589c4216j33289H1594b32860b0244A66430j6896e4099A6400a11996j88948J7776
$$ -34216 -167505 81594 -232860 -20244 166430 149534 -54099 16400 -111996 -300944 -283168
10578b83168I1374j1485a11587B06580J9449c68923p443c0127r9341d8039A49588
$$ -283168 91374 79889 -111587 206580 226029 -368923 -376366 -30127 -129468 -48039 149588
10566D1439i8961A76931b84234J03628f1482A90830a38784A3399b14581i168C8956
$$ 41439 -98961 176931 -284234 -180606 -61482 190830 -138784 13399 -214581 -9168 38956
10554I856f2346n2780E3337O6499a70329A51367m3956h5040A70403d4663m2087
$$ 9856 -62346 -115126 53337 119836 -170329 151367 107411 -85040 170403 -44663 -86750
10543h6750l28819A9200c75223b2410j73109A23688A8301J69094a38285c4100
$$ -86750 -415569 19200 -375223 -22410 -195519 123688 18301 187395 -138285 -34100
10532h4330k5140b9306a4269C2788d23873b2059r890r5184j04181H3831d68951
$$ -84330 -109470 -29306 -14269 32788 -423873 -22059 -31949 -127133 -231314 83831 -468951
10520C51176a29877d2451I1204c61336d715A77506b51298C64536I902J93625h7997
$$ 351176 -129877 -42451 91204 -361336 -4715 177506 -251298 364536 9902 203527 -87997
10508h3736H8132B5990J23263h411k85997A91910b56300i7198q7518A88282b26668
$$ -83736 88132 25990 149253 -8411 -294408 191910 -256300 -97198 -184716 188282 -226668
10496a76675F8452j077b62430o2320J14818O0028A16326b37324J06048B19251
$$ -176675 68452 67375 -262430 -324750 -209932 -149904 116326 -237324 -131276 219251
10485a70210m5650C84579D327J67745a97621h6124b0755A79011D0419a26563A28606
$$ -170210 -215860 384579 4327 172072 -197621 -86124 -20755 179011 40419 -126563 128606
10473i7117F8323J86967D761K4620a58049J2762B32207a134A77205J6187j155
$$ -97117 68323 255290 4761 29381 -158049 -145287 232207 -1134 177205 193392 192237
10462A92237C5832M60296j16108b9022B36580j17466J51968j33784a94454L8677
$$ 192237 35832 496128 380020 -29022 236580 119114 271082 137298 -194454 -155777
10452a55777A7011M3698R3758a69058M7796l6880c4159k6896C58920h4348J4452
$$ -155777 17011 60709 154467 -169058 -121262 -158142 -34159 -61055 358920 -84348 -69896
10441f9896P34C30312c29565D07651E9839k7391J02028h2706G6781b6416I3617
$$ -69896 -69162 330312 -329565 407651 59839 32448 134476 -82706 76781 -26416 93617
10429a92064n1699G869a9337j73695P6047E829b73442J3417A1183c0498m02016
$$ -192064 -243763 7869 -19337 -193032 -116985 5829 -273442 -260025 11183 -30498 -432514
10418d32514f8670k8645c1940j6102a4547G1656g2575C7193b16004B41005f4285
$$ -432514 -68670 -97315 -31940 -48042 -14547 71656 -72575 37193 -216004 241005 -64285
10406b906C569R5591K64033j67798f8330I2781a25980B9372a09168A79465b29530
$$ -2906 3569 99160 363193 195395 -68330 92781 -125980 29372 -109168 179465 -229530
10394a04794A6846f7929k10539g3541k35237m8011A51241b12690B17465J2183
$$ -104794 16846 -67929 -278468 -73541 -308778 -356789 151241 -212690 217465 229648
10384B29648n9215N3016b00023h5957A14912b3582B00904b185A7207J95841C6770
$$ 229648 170433 223449 -200023 -85957 114912 -23582 200904 -2185 17207 213048 36770
10372A15771J49081a78480k3346B69705k7974j10194e5914A07934D3409J61238
$$ 115771 264852 -178480 -201826 269705 241731 131537 -55914 107934 43409 204647
10362B04647J02087c1877j8603B54326G3095K42740F4965J37201J20660A53863
$$ 204647 306734 -31877 -50480 254326 73095 315835 64965 202166 322826 153863
10351D09335l6716j55017i1364C56522A49057L72198A56279m8754L71550A38764
$$ 409335 372619 217602 -91364 356522 149057 521255 156279 107525 479075 138764
10340C21162p9724k6627p8574K02933K0861j0206G6609J30577K174J79260K67453
$$ 321162 241438 214811 136237 339170 360031 349825 76609 207186 209360 388620 656073
10329F56073H5074l3880B5033K06519I8334a1623B00939K5998e4290B27255A00152
$$ 656073 85074 51194 25033 231552 98334 -11623 200939 226937 -54290 227255 100152
10317C11234a54442D8248J60250N6353i9896J9987A35765C0264h7642E6399R3118
$$ 311234 -154442 48248 208498 264851 -99896 -79909 135765 30264 -87642 56399 149517
10306A49517J51496B4059a10687B77692k3829M8945l6054J42809j07870J2340
$$ 149517 301013 24059 -110687 277692 253863 302808 266754 409563 301693 314033
10296C14033C0514g4327H1356a66460c6156B23085a61536k04609D2320N5525j5568
$$ 314033 30514 -74327 81356 -166460 -36156 223085 -161536 -366145 42320 97845 82277
10285H2277b26726B14119B6571c28337C8951a20959M0772A55180J70612a17935
$$ 82277 -226726 214119 26571 -328337 38951 -120959 -80187 155180 325792 -117935
10274B957b57866F9606a92915M6365O7737Q951b2240A93683b48551p2094J40952
$$ 2957 -257866 69606 -192915 -146550 -78813 -69862 -22240 193683 -248551 -320645 -179693
10263a79693A70781H2001J43562J50537a25543G5687C6355e698k8501A45842K646
$$ -179693 170781 82001 225563 376100 -125543 75687 36355 -5698 -34199 145842 148488
10252A48488N1892i0734I0538a44307j3246A00716h1568j75717a1694D3293c25026
$$ 148488 200380 -90734 90538 -144307 -157553 100716 -81568 -257285 -11694 43293 -325026
10240B79689l6491M8106K49020B56262a4059A41469m5862A6825J53461c5143A58073
$$ 279689 243198 291304 540324 256262 -14059 141469 95607 16825 170286 -35143 158073
10228C06484b63163J21565j42432A17324d5593F4793g9046A88022c7393j43255
$$ 306484 -263163 -141598 -284030 117324 -45593 64793 -79046 188022 -37393 -180648
10218a80648J0179F8325b001j20246N0642j40702c3303B5371a41292j44121C15430
$$ -180648 -170469 68325 -2001 -122247 -71605 -212307 -33303 25371 -141292 -285413 315430
10206a30045G8104b53220D309a77652A19957a12536L079B99613a15992A13285
$$ -130045 78104 -253220 4309 -177652 119957 -112536 -109457 299613 -115992 113285
10195f8206j845p0723B04955c17429r0073G2283b59687N7381j0834D4398d2268
$$ -68206 -70051 -140774 204955 -317429 -407502 72283 -259687 -202306 -213140 44398 -42268
10183c05915A85864c11215N9248A7439f94545B01255i4723l08616b4267j49923
$$ -305915 185864 -311215 -251967 17439 -694545 201255 -94723 -403339 -24267 -174190
10173a74190N0812k42781A18536a3413n1894j57269g3661j69479J17124n9720
$$ -174190 -123378 -366159 118536 -13413 -65307 -222576 -73661 -243140 -126016 -185736
10163a85736A65436a87537A97181q6239b0354n8490E0350L1953a16588A65457
$$ -185736 165436 -187537 197181 110942 -20354 -78844 50350 82303 -116588 165457
10152G4875h2648k1515A5653a9447k07673i7760j18584A8533b72921N6320A43811
$$ 74875 -82648 -104163 15653 -19447 -227120 -97760 -216344 18533 -272921 -216601 143811
10140b03888A14477i8596k6100k16700c91A41587h586j02388j49773B1936O6093
$$ -203888 114477 -98596 -124696 -341396 -391 141587 -8586 -110974 -260747 21936 88029
10129H8029J2095D4596Q9875b38968j6640A98357o6211c17919E2579g2320l75980
$$ 88029 100124 44596 134471 -238968 -255608 198357 132146 -317919 52579 -72320 -448300
10118d48300A39968a91759C02714h0593k3459F3975a86385m1598A94885A0143
$$ -448300 139968 -191759 302714 -80593 -104052 63975 -186385 -227983 194885 10143
10107b30603R9726F1350a01386J9161n1397M7545c4059C18666l0617p9096b732
$$ -230603 -130877 61350 -101386 -82225 -133622 -86077 -34059 318666 288049 208953 -2732
10095G6471a43049n1166A7015d5181j07903b5586k57859g4693A7587J41227a39107
$$ 76471 -143049 -194215 17015 -45181 -153084 -25586 -283445 -74693 17587 158814 -139107
10083b74118B18409a518k08400a3743C9511a83144D4217L68244a25303o2244d6631
$$ -274118 218409 -1518 -209918 -13743 39511 -183144 44217 412461 -125303 -187547 -46631
10071a99875q8593e98q9732j47706j83820C7156J86075a81618A19620J21242b08468
$$ -199875 -288468 -598 -90330 -238036 -421856 37156 223231 -181618 119620 240862 -208468
10059i2710l6033D7506b91561A01028b64468k2954a00978D0630b43828A4128R1364
$$ -92710 -128743 47506 -291561 101028 -264468 -287422 -100978 40630 -243828 14128 105492
10048A05492f0842o0536j32480C4851L4888P7394a79201B48206B9844J7815a33556
$$ 105492 -60842 -121378 -253858 34851 69739 147133 -179201 248206 29844 47659 -133556
10036a31532j80063a28535k74824a00397K1389k60270Q7836H2276b96357O684
$$ -131532 -311595 -128535 -403359 -100397 -79008 -339278 -251442 82276 -296357 -289673
10026b89673n0122G1466J3071l4614f9718C3809c57438I3868j0441i7413E643
$$ -289673 -339795 71466 84537 49923 -69718 33809 -357438 93868 83427 -97413 5643
10014i0339k2691B4942O5669c33329l2948B86203c57155d2947C7044c74408E1558
$$ -90339 -113030 24942 90611 -333329 -366277 286203 -357155 -42947 37044 -374408 51558
10002A60413d24703C89743A25185J11380a62304m8939p8522c8505E0096k1551
$$ 160413 -424703 389743 125185 236565 -162304 -211243 -289765 -38505 50096 28545
9992B8545a25586M1619C20490b53209g6403F2512b14054P1904o8549p646A45686
$$ 28545 -125586 -83967 320490 -253209 -76403 62512 -214054 -142150 -210699 -218345 145686
9980a32103A35750a8270H2294a13056B39495B3837e0230j53128h4192k51828F9429
$$ -132103 135750 -18270 82294 -113056 239495 23837 -50230 -203358 -84192 -336020 69429
9968B34943f0361B97472a20439C2348f7910I5906b5672j38704h0570k7562H334
$$ 234943 -60361 297472 -120439 32348 -67910 95906 -25672 -164376 -80570 -108132 8334
9956a97528I6258a98848R7511k23241c6573B96375a61009L8179c4746j90059C9157
$$ -197528 96258 -198848 -101337 -324578 -36573 296375 -161009 -122830 -34746 -224805 39157
9944h9781e452A2410b73870f3867A35822b44801k21476K30222O5260C2280L283
$$ -89781 -5452 12410 -273870 -63867 135822 -244801 -466277 -236055 -170795 32280 35563
9933C5563c8026E3760h6789B1816J22094A8063b11085k92724A63934c5712p6428
$$ 35563 -38026 53760 -86789 21816 143910 18063 -211085 -503809 163934 -35712 -112140
9922a12140A03316a72n2540k55967a37214j8207r1524C5058K88665E9583A2448
$$ -112140 103316 -172 -52712 -308679 -137214 -155421 -246945 35058 323723 59583 12448
9910c08614a02496j83436H1573a87274p039j43583b2866B9590g6400j29878e7047
$$ -308614 -102496 -285932 81573 -187274 -194313 -337896 -22866 29590 -76400 -206278 -57047
9898b3757k13498n9848a35048c0391l0357D7324a63654L9232a3107k44586A24514
$$ -23757 -237255 -297103 -135048 -30391 -60748 47324 -163654 -124422 -13107 -257693 124514
9886i4345k65783A26291h0796k15667h5992q753b6651A71208b68042a31644m8639
$$ -94345 -360128 126291 -80796 -296463 -85992 -94745 -26651 171208 -268042 -131644 -180283
9875a80283n8828n5561B63438a39782b310k65435A19661h5062G2693h9497L1259
$$ -180283 -239111 -294672 263438 -139782 -2310 -267745 119661 -85062 72693 -89497 -58238
9864e8238D8550j3501f1443B11615D1520b13993C535c73330J55908J07085k36438
$$ -58238 48550 35049 -61443 211615 41520 -213993 3535 -373330 -217422 -110337 -346775
9853c46775A36124L7275o4828a97156C4399b75126B9415L5501a66045B10600P4725
$$ -346775 136124 173399 108571 -197156 34399 -275126 29415 64916 -166045 210600 285325
9842B85325e9435k58059J04257o0371a5175C89404j30981b68560n0312a06540
$$ 285325 -59435 -317494 -213237 -273608 -15175 389404 258423 -268560 -318872 -106540
9831A57935D5596J50632a66041N309F1175L6368m5662b78945M2904g2765k10705
$$ 157935 45596 196228 -166041 -160732 61175 97543 51881 -278945 -236041 -72765 -283470
9820b83470C5604P177q563a65780A41049b94315Q9178k6220O4278d0453j70441
$$ -283470 35604 42781 34218 -165780 141049 -294315 -205137 -231357 -167079 -40453 -210894
9809b10894l3815O7858f592A96816k7481B3843a25267k45143g7778L08b8691j17424
$$ -210894 -244709 -176851 -6592 196816 169335 23843 -125267 -370410 -77778 -77470 -28691 -146115
9797a46115A04910a60278B50310c6409l44329A40414L5656b0848F787R7505a7862
$$ -146115 104910 -160278 250310 -36409 -380738 140414 176070 -20848 6787 104292 -17862
9785A47901P5700A308b52390a02555A15229b0133k62971G1866j6237K06707a59684
$$ 147901 223601 1308 -252390 -102555 115229 -20133 -283104 71866 55629 262336 -159684
9773i5879d4958k44238J00173e4066o2429q5140f8450E6882L8331i397p1078P819
$$ -95879 -44958 -289196 -189023 -54066 -116495 -201635 -68450 56882 95213 -9397 -80475 -72656
9761g2656B01454b66092c0070j73214E7891K7334a96619O7723A05709J00314h6630
$$ -72656 201454 -266092 -30070 -203284 57891 85225 -196619 -128896 105709 206023 -86630
9749d2888p7874A50244a06709m7050A9868b90325E5074A4709K9903h0859k9294
$$ -42888 -120762 150244 -106709 -153759 19868 -290325 55074 14709 44612 -80859 -110153
9738a10153k23042J12159b6491j50721c2693h297j49837f5100p0333L3778j03534
$$ -110153 -333195 -221036 -26491 -177212 -32693 -8297 -158134 -65100 -135433 -101655 -205189
9727b05189g3676j17854h5524K6009D0775h6224A32399n1452d4744E5331q339
$$ -205189 -73676 -191530 -85524 -59515 40775 -86224 132399 80947 -44744 55331 46992
9716D6992c66556a22993k18672B27082b38423e2103j40219p5408N6122F0391c01191
$$ 46992 -366556 -122993 -341665 227082 -238423 -52103 -192322 -267730 -211608 60391 -301191
9704a11120C08074h1704A8979M2387a56301A13251g330j96525e1651j38776J7055
$$ -111120 308074 -81704 18979 61366 -156301 113251 -7330 -203855 -51651 -190427 -173372
9693a73372b8847k22653L3544C49540d6059B58352d5134E4536a86096g241r5948
$$ -173372 -28847 -251500 -217956 349540 -46059 258352 -45134 54536 -186096 -7241 -103189
9682a03189L0395j08620p0237A04261C6192h3100B24310b46801J00201B36995
$$ -103189 -72794 -181414 -251651 104261 36192 -83100 224310 -246801 -146600 236995
9671A86467c6153n8595b7348l37895a80991C5273J93570d6885D608b49195B49986
$$ 186467 -36153 -94748 -27348 -365243 -180991 35273 228843 -46885 4608 -249195 249986
9659f413B359b01814e6817b559l8796j45416O2457j9219l01210a00329A9894N6466
$$ -6413 2359 -201814 -56817 -2559 -41355 -186771 -124314 -143533 -444743 -100329 19894 76360
9647G6360e97110A3514d09440i5740A61796d1927j80048L9747r5156G6807K14960
$$ 76360 -597110 13514 -409440 -95740 161796 -41927 -221975 -182228 -277384 76807 291767
9636B91767a08089j4826B30338a40023j8269A23545E0212J11868R641a94188F546
$$ 291767 -108089 -122915 230338 -140023 -158292 123545 50212 162080 171721 -194188 6546
9624d8879B65480A00275J28739c4235k79985A13600b37293I4155a04186j50930
$$ -48879 265480 100275 229014 -34235 -314220 113600 -237293 94155 -104186 -255116
9614b55116D0370c02265F24L779c75055a47222d5729G3227a80663e35j361C03040
$$ -255116 40370 -302265 624 4403 -375055 -147222 -45729 73227 -180663 -535 -1896 303040
9601i7271B62444b12275P2969d6173k5316j47993I0884i4116j03872k7427J11995
$$ -97271 262444 -212275 -139306 -46173 -71489 -219482 90884 -94116 -197988 -225415 -113420
9590a13420q2054B2671a54613k46828A58381b35568K1576J00367D6904a355C8374
$$ -113420 -195474 22671 -154613 -401441 158381 -235568 -213992 -113625 46904 -1355 38374
9578A89521d9392q4324a4690r3756j34229i2694b817k51585K0776B210K24355
$$ 189521 -49392 -133716 -14690 -108446 -242675 -92694 -2817 -254402 -233626 2210 226565
9567B26565c37966e738F0271a69522A19413b93824m2552k8557Q0747F5335a37423
$$ 226565 -337966 -5738 60271 -169522 119413 -293824 -336376 -364933 -284186 65335 -137423
9555i1719n9514m5583q7350J39821o9643p775a2661j62180i438B50226b53006
$$ -91719 -151233 -196816 -284166 -144345 -213988 -221763 -12661 -174841 -9438 250226 -253006
9543g0227D974c02573e0125A313J46074c68736B20114j07269O7833e5698K0201
$$ -70227 4974 -302573 -50125 1313 147387 -368736 220114 112845 180678 -55698 -35497
9532c5497B45562a27396j1011j10759I9483M5882D3045K07172a5063A1101c0463
$$ -35497 245562 -127396 -138407 -249166 99483 145365 43045 250217 -15063 11101 -30463
9520i6315L852j40180a8914A05224i6994b9078A73014c08643d985n7243j59495
$$ -96315 -92463 -232643 -18914 105224 -96994 -29078 173014 -308643 -4985 -62228 -221723
9509b21723K0955D15141A83158b40894D2788a86661B00600F6825A0776a21465
$$ -221723 -200768 415141 183158 -240894 42788 -186661 200600 66825 10776 -121465
9498a33751G6069L59929h4776H109J01492e9549o1829A6727b3635J0000I0118
$$ -133751 76069 435998 -84776 8109 109601 -59549 -121378 16727 -23635 -13635 90118
9486d52647a36241j5432A26482B1236a12164j16018A23405a16673b3412k51544
$$ -452647 -136241 -151673 126482 21236 -112164 -228182 123405 -116673 -23412 -274956
9476b74956C8451c41307J47235f3904J299j37939C36442e4946G7413a83931A33285
$$ -274956 38451 -341307 -194072 -63904 -62605 -200544 336442 -54946 77413 -183931 133285
9464F0170j3016j1651J9281K684c7143H99J1296f5467j91760B04569I1129E00
$$ 60170 47154 35503 54784 57468 -37143 899 12195 -65467 -257227 204569 91129 500
9451E3822a09619B63444a10066K8504j91996c9794r5802k42781A33743h0160j83299
$$ 53822 -109619 263444 -110066 -81562 -273558 -39794 -135596 -378377 133743 -80160 -263459
9440b63459j14967C560g1948j66173G1710a11488C8121g6317r692j25895c2066
$$ -263459 -378426 3560 -71948 -238121 71710 -111488 38121 -76317 -86009 -211904 -32066
9428A08901b08290B6253a44285j329a3437G3765a19956r059C5409e2960r9157
$$ 108901 -208290 26253 -144285 -145614 -13437 73765 -119956 -129015 35409 -52960 -152117
9417a52117A77980a06683b5332k56880J1763A73129o025E1418e2073b2399Q870
$$ -152117 177980 -106683 -25332 -282212 -270449 173129 167104 51418 -52073 -22399 -13529
9406a3529A02109K41718d0622n8111B81783r6740a95357B5161a82496b814q1033
$$ -13529 102109 343827 -40622 -98733 281783 185043 -195357 25161 -182496 -2814 -83847
9395h3847n8647M4489d7306C3639b22640k1724A1868a24870f1367j71052c5038
$$ -83847 -142494 -98005 -47306 33639 -222640 -244364 11868 -124870 -61367 -232419 -35038
9383a98819Q5403a413F985d2343C2236a07397G0334g366j57835Q1787p5769R687
$$ -198819 -113416 -1413 6985 -42343 32236 -107397 70334 -7366 -165201 -83414 -159183 -149496
9371a49496k46605C39082c46381i1692j44556K5997g9235G0706j4515J83239a84710
$$ -149496 -396101 339082 -346381 -91692 -236248 -210251 -79235 70706 56191 239430 -184710
9359A95917a57793J334Q309C8055a51195I1107J34264e6911B9541f7410A8496
$$ 195917 -157793 -156459 -148150 38055 -151195 91107 225371 -56911 29541 -67410 18496
9347a28211I1659h1993k19423A22074a46082j85811A22234a90121r8050G8099
$$ -128211 91659 -81993 -301416 122074 -146082 -331893 122234 -190121 -288171 78099
9336a69528E3565e9197a5101C0434J35909l9716a22381N1674H9038g8033K8174
$$ -169528 53565 -59197 -15101 30434 166343 126627 -122381 -70707 89038 -78033 -49859
9325d9859m3740A97857i7346P633G6633K65013a30520A35833j8106L7578o2658
$$ -49859 -93599 197857 -97346 -89713 76633 341646 -130520 135833 117727 155305 92647
9314I2647c49522g0802n4591B71376A29986a2617A11316e7014A5138c2354j50665
$$ 92647 -349522 -70802 -125393 271376 129986 -12617 111316 -57014 15138 -32354 -183019
9303a83019c4982D6345a62662e880j06439m1351j80513a2001B31521e6834C0007
$$ -183019 -34982 46345 -162662 -5880 -112319 -153670 -334183 -12001 231521 -56834 30007
9291B36231f5850l20389B94469a6065j16308d7696j64630A33376g9296o6426C83850
$$ 236231 -65850 -386239 294469 -16065 -132373 -47696 -212326 133376 -79296 -145722 383850
9279A30626b7964j57347m4957A21431a01689B0623i8510A75938b4171j31395K8728
$$ 130626 -27964 -185311 -230268 121431 -101689 20623 -98510 175938 -24171 -155566 -126838
9268a26838j05906E2436J10169E6460o129a85915B35303d2052j84922L3727e097
$$ -126838 -232744 52436 162605 56460 50331 -185915 235303 -42052 -226974 -193247 -5097
9256a71316f3425A97747b2746I1073b30491f8969A02804l641e0212D7795N0480
$$ -171316 -63425 197747 -22746 91073 -230491 -68969 102804 99163 -50212 47795 98275
9245I8275a92037A51641b16296C0468a11157K9923B79140d52729c6266j82617
$$ 98275 -192037 151641 -216296 30468 -111157 -81234 279140 -452729 -36266 -218883
9235b18883A94903b26669L4638j58981J51467E9927B1412F716Q925N1664b41364
$$ -218883 194903 -226669 -192031 -351012 -199545 59927 21412 6716 15641 67305 -241364
9223d11981a92395A66173a72439n2853A87789B7446O4208d4311G0450J00182n280
$$ -411981 -192395 166173 -172439 -225292 187789 27446 91654 -44311 70450 170632 165352
9212A65352l1992c64941a02880A40424c06951c3549A54359b24913d8299k0557
$$ 165352 133360 -364941 -102880 140424 -306951 -33549 154359 -224913 -48299 -68856
9202f8856l8214L0255o06m6777j21123O1488A20816c83007a25672k50170a33194
$$ -68856 -107070 -76815 -77421 -124198 -245321 -183833 120816 -383007 -125672 -375842 -133194
9190b27158J12886l03250a42436k05239C3015b71350i592A73277K27314a19317
$$ -227158 -114272 -417522 -142436 -347675 33015 -271350 -9592 173277 400591 -119317
9179F1181e1876q8933c560G8370k8155e4348h092C0547J48121a32504d9241g114
$$ 61181 -51876 -140809 -3560 78370 50215 -54348 -8092 30547 178668 -132504 -49241 -7114
9166d74925K24255I5214h4404A68575c45830a18336e7174k00810J25929E610a03641
$$ -474925 -250670 95214 -84404 168575 -345830 -118336 -57174 -257984 -132055 5610 -103641
9154F6901a19214l58486B56838b69302e7225p316j35166Q4849d2214m6814J509
$$ 66901 -119214 -477700 256838 -269302 -57225 -64541 -199707 -114858 -42214 -89028 -87519
9143h7519J6377I1221a77974K1786j3445C12924I964a12815k89400A23447b72975
$$ -87519 -71142 91221 -177974 -156188 -169633 312924 9964 -112815 -402215 123447 -272975
9131a79655A87425b62645a7675k47697E8861c63056d6636q563k91125a20249m4455
$$ -179655 187425 -262645 -17675 -265372 58861 -363056 -46636 -55199 -346324 -120249 -164704
9120a64704H839a39156b7533j88531G1524L2355c2164k42410J07311J712f7869
$$ -164704 8839 -139156 -27533 -216064 71524 103879 -32164 -274574 -167263 -165551 -67869
9108b66596c0078j15512C855Q4805a41647j56111a17756j89631B94261I5480Q1963
$$ -266596 -30078 -145590 3855 88660 -141647 -297758 -117756 -307387 294261 95480 177443
9097A77443a9201m94999E8765K46353a99062C24647A36044a09216p5547L4487
$$ 177443 -19201 -514200 58765 305118 -199062 324647 136044 -109216 -184763 -150276
9087a50276i931m0871A8351i4777D0450b07087R3996a0952D19883e648A10412
$$ -150276 -9931 -50802 18351 -94777 40450 -207087 -113091 -10952 419883 -5648 110412
9075A4395c50946A73732L3034F5656a56060A97580h0346j812m5526d3166Q633
$$ 14395 -350946 173732 206766 65656 -156060 197580 -80346 -82158 -127684 -43166 -34533
9064c4533B48110h8979j187A0097b08228b3459k31109R7886k09540a07092q9163
$$ -34533 248110 -88979 -90166 10097 -208228 -23459 -254568 -156682 -366222 -107092 -196255
9053a96255d6219A0008J22942e7283l0242B0860J13491n8052J76000a9449o6154
$$ -196255 -46219 10008 132950 -57283 -87525 20860 134351 76299 252299 -19449 -85603
9042h5603p8972K5676M3739I6710d0285o7100A67128D9562K02895d32210M3848
$$ -85603 -164575 -138899 -95160 96710 -40285 -107385 167128 49562 252457 -432210 -388362
9031c88362a17480H9764B6174a00601A08020C0952d95093C3194K35536a64909
$$ -388362 -117480 89764 26174 -100601 108020 30952 -495093 33194 268730 -164909
9020b41616A35514b75515b763G591P7124K9700f5690j31321R6560j4480A29144
$$ -241616 135514 -275515 -2763 7591 84715 114415 -65690 -197011 -100451 -114931 129144
9008h0248B35852a39163A08599a0294M374k72703d5639l57999a54371f1296r2426
$$ -80248 235852 -139163 108599 -10294 -5920 -278623 -45639 -403638 -154371 -61296 -153722
8997a53722A88667I0612e1613C96909b49268B6533d18202B971J62867O861g0606
$$ -153722 188667 90612 -51613 396909 -249268 26533 -418202 2971 165838 172699 -70606
8985B44556b45473i6105c0614a1794k93094a00704A65960b01299K3967A5858K11257
$$ 244556 -245473 -96105 -30614 -11794 -304888 -100704 165960 -201299 -177332 15858 227115
8974B27115c2989j35564B25514b3631q051k53744E563a96943p274D09614H1944
$$ 227115 -32989 -168553 225514 -23631 -31682 -285426 5563 -196943 -204217 409614 81944
8962B41083b49894B40822A10160h0853k37174i1415F6942A9954J55394B9842K29747
$$ 241083 -249894 240822 110160 -80853 -318027 -91415 66942 19954 175348 29842 259589
8951B59589J4316A6035a29308j82211B8502a11449l5974E9707b28745A21380L07494
$$ 259589 273905 16035 -129308 -311519 28502 -111449 -147423 59707 -228745 121380 428874
8940D28874A07917b10918K8118j6409A96738E4352b83728r8050d834n5158A98015
$$ 428874 107917 -210918 -182800 -199209 196738 54352 -283728 -381778 -4834 -59992 198015
8928f8672A45967e2283I879b24884b6853m2041B58252A5950c00224I8183J20615
$$ -68672 145967 -52283 9879 -224884 -26853 -68894 258252 15950 -300224 98183 218798
8917B18798E5007O9892Q8944c2486A99927G3000K06186E7842M18276J81051M8177
$$ 218798 55007 124899 213843 -32486 199927 73000 279186 57842 476118 657169 705346
8906G05346L04350R49096M34489K054643j596017A345837m37135l02840A31114
$$ 705346 1009696 1958792 2393281 4447924 2851907 1345837 908702 605862 131114
8896F58672C1228a21521F5550b76519i2645p35a3214B17427d69779c3772H0259
$$ 658672 31228 -121521 65550 -276519 -92645 -93380 -13214 217427 -469779 -33772 80259
8884a88744F2094A4593b78114R9893B52378F452a10948k1702p3929N1432f3282
$$ -188744 62094 14593 -278114 -178221 252378 6452 -110948 -132650 -206579 -155147 -63282
8872d4848o8247A1488J22383c47117a50112A56696a7030j66508C7097i7284j39144
$$ -44848 -113095 11488 133871 -347117 -150112 156696 -17030 -183538 37097 -97284 -236428
$$ [...]
##END NTUPLES=NMR SPECTRUM
##END=
