
##TITLE=AC1118_Huila-la_5874822_9FENfQ32JU
##JCAMPDX= 6.0         $$ Bruker NMR JCAMP-DX V2.0
##DATA TYPE= NMR SPECTRUM
##DATA CLASS= NTUPLES
##ORIGIN= BRUKER
##OWNER= Administrator
$$ 1.72 TOPSPIN		Version 2.1
$$ 2012-03-31 19:44:55.546 -0500  Administrator@TOPSPIN
$$ Compression mode = diff/dup
##.OBSERVE FREQUENCY= 400.13188235
##.OBSERVE NUCLEUS= ^1H
##.ACQUISITION MODE= SIMULTANEOUS (DQD)
##.ACQUISITION SCHEME= undefined
##.AVERAGES= 64
##.DIGITISER RES= 22
##SPECTROMETER/DATA SYSTEM= spect
##.PULSE SEQUENCE= noesygpps1d.comp
##.SOLVENT NAME= COFFEE_meoh
##.SHIFT REFERENCE= INTERNAL, COFFEE_meoh, 1, 14.96831
##AUDIT TRAIL= $$ (NUMBER, WHEN, WHO, WHERE, PROCESS, VERSION, WHAT)
$$ ##TITLE= Audit trail, TOPSPIN		Version 2.1
$$ ##JCAMPDX= 5.01
$$ ##ORIGIN= Bruker BioSpin GmbH
$$ ##OWNER= Administrator
$$ $$ C:\Bruker\TOPSPIN/data/COFFEE/nmr/AC1118_Huila-la_5874822_9FENfQ32JU/12/pdata/1/auditp.txt
$$ ##AUDIT TRAIL=  $$ (NUMBER, WHEN, WHO, WHERE, PROCESS, VERSION, WHAT)
(   1,<2012-03-31 19:44:50.078 -0500>,<Administrator>,<TOPSPIN>,<go>,<TOPSPIN 2.1>,
      <created by zg
	started at 2012-03-31 19:33:18.281 -0500,
	POWCHK enabled, PULCHK disabled,
       configuration hash MD5:
       1A 1E CE 29 27 FD 77 03 67 4E F0 E3 C4 B2 CB 90
       data hash MD5: 64K
       39 29 FF 39 AD BE B7 95 B9 A8 4E 1E E0 A9 73 92>)
(   2,<2012-03-31 19:44:53.390 -0500>,<Administrator>,<TOPSPIN>,<proc1d>,<TOPSPIN 2.1>,
      <Start of raw data processing
       efp LB = 0.3 FT_mod = 6 PKNL = 1 PHC0 = 0 PHC1 = 0 SI = 128K 
       data hash MD5: 128K
       9C 2D 28 05 B6 AD 4A 49 C7 92 5B 65 7B F3 C2 94>)
(   3,<2012-03-31 19:44:54.671 -0500>,<Administrator>,<TOPSPIN>,<proc1d>,<TOPSPIN 2.1>,
      <pk PHC0 = 36.57898 PHC1 = 0 
       data hash MD5: 128K
       C1 88 AB D5 F0 C7 C3 19 B8 66 DE E5 E2 4C 84 82>)
(   4,<2012-03-31 19:44:55.187 -0500>,<Administrator>,<TOPSPIN>,<proc1d>,<TOPSPIN 2.1>,
      <abs ABSG = 1 
       data hash MD5: 128K
       5E 87 98 12 A9 3A EB E1 5B 9E E2 0C 74 11 54 20>)
(   5,<2012-03-31 19:44:55.281 -0500>,<Administrator>,<TOPSPIN>,<proc1d>,<TOPSPIN 2.1>,
      <abs ABSG = 2 
       data hash MD5: 128K
       30 D2 D2 BC 04 E8 66 35 C0 C0 1F 13 AE 71 6C 0D>)
(   6,<2012-03-31 19:44:55.328 -0500>,<Administrator>,<TOPSPIN>,<proc1d>,<TOPSPIN 2.1>,
      <abs ABSG = 3 
       data hash MD5: 128K
       48 74 18 E1 66 EE 8B 05 8B DF 5C 8A FA BD FE 33>)
(   7,<2012-03-31 19:44:55.406 -0500>,<Administrator>,<TOPSPIN>,<proc1d>,<TOPSPIN 2.1>,
      <abs ABSG = 4 
       data hash MD5: 128K
       19 57 37 89 48 D8 7F C2 CB 74 82 5C 9F 4E 37 5C>)
(   8,<2012-03-31 19:44:55.453 -0500>,<Administrator>,<TOPSPIN>,<proc1d>,<TOPSPIN 2.1>,
      <abs ABSG = 5 
       data hash MD5: 128K
       C3 D2 72 7E 9E 7A 98 4C 5E 61 1E EF EA 06 78 60>)
$$ ##END=
$$ 
$$ $$ hash MD5
$$ $$ 66 9E 57 12 B2 C0 3D AA DC 0A 1D 07 2B DF 5F 5A
##$RELAX= 
##$RELAX= 
##$RELAX= 
##$RELAX= 
##$RELAX= 
##$RELAX= 
##$RELAX= 
##$RELAX= 
$$ Bruker specific parameters
$$ [...]
##$TP07= 0
##$TPNAME0= <>
##$TPNAME1= <>
##$TPNAME2= <>
##$TPNAME3= <>
##$TPNAME4= <>
##$TPNAME5= <>
##$TPNAME6= <>
##$TPNAME7= <>
##$TPOAL= (0..7)
0.5 0.5 0.5 0.5 0.5 0.5 0.5 0.5
##$TPOFFS= (0..7)
0 0 0 0 0 0 0 0
##$TUNHIN= 0
##$TUNHOUT= 0
##$TUNXOUT= 0
##$USERA1= <user>
##$USERA2= <user>
##$USERA3= <user>
##$USERA4= <user>
##$USERA5= <user>
##$V9= 5
##$VALIST= <valist>
##$VCLIST= <CCCCCCCCCCCCCCC>
##$VD= 0
##$VDLIST= <DDDDDDDDDDDDDDD>
##$VPLIST= <PPPPPPPPPPPPPPP>
##$VTLIST= <TTTTTTTTTTTTTTT>
##$WBST= 2048
##$WBSW= 25
##$XGAIN= (0..3)
0 0 0 0
##$XL= 0
##$YL= 0
##$YMAX_a= 12930196
##$YMIN_a= -6505333
##$ZGOPTNS= <>
##$ZL1= 120
##$ZL2= 120
##$ZL3= 120
##$ZL4= 120
##$ABSF1= 14.96831
##$ABSF2= -5.58422
##$ABSG= 5
##$ABSL= 3
##$ALPHA= 0
##$AQORDER= 0
##$ASSFAC= 0
##$ASSFACI= 0
##$ASSFACX= 0
##$ASSWID= 0
##$AUNMP= <proc_prof1d_extract.lims>
##$AXLEFT= 0
##$AXNAME= <>
##$AXNUC= <1H>
##$AXRIGHT= 0
##$AXTYPE= 0
##$AXUNIT= <>
##$AZFE= 0.1
##$AZFW= 0.1
##$BCFW= 0
##$BC_mod= 0
##$BYTORDP= 0
##$COROFFS= 0
##$CY= 15
##$DATMOD= 1
##$DC= 0
##$DFILT= <>
##$DTYPP= 0
##$F1P= 0
##$F2P= 0
##$FCOR= 0.5
##$FTSIZE= 131072
##$FT_mod= 6
##$GAMMA= 0
##$GB= 0
##$INTBC= 1
##$INTSCL= 1
##$ISEN= 128
##$LB= 0.3
##$LEV0= 0
##$LPBIN= 0
##$MAXI= 10000
##$MC2= 0
##$MEAN= 0
##$ME_mod= 0
##$MI= 0
##$NCOEF= 0
##$NC_proc= -3
##$NLEV= 6
##$NOISF1= 0
##$NOISF2= 0
##$NSP= 0
##$NTH_PI= 0
##$NZP= 0
##$OFFSET= 14.96831
##$PC= 1
##$PHC0= 36.57898
##$PHC1= 0
##$PH_mod= 1
##$PKNL= yes
##$PPARMOD= 0
##$PPDIAG= 0
##$PPIPTYP= 0
##$PPMPNUM= 2147483647
##$PPRESOL= 1
##$PSCAL= 4
##$PSIGN= 0
##$PYNMP= <proc.py>
##$REVERSE= no
##$SF= 400.130004923876
##$SI= 131072
##$SIGF1= 0
##$SIGF2= 0
##$SINO= 400
##$SIOLD= 131072
##$SPECTYP= <>
##$SREGLST= <1H.CDCl3>
##$SSB= 0
##$STSI= 131072
##$STSR= 0
##$SW_p= 8223.68421052632
##$SYMM= 0
##$S_DEV= 0
##$TDeff= 65536
##$TDoff= 0
##$TI= <>
##$TILT= no
##$TM1= 0
##$TM2= 0
##$TOPLEV= 0
##$USERP1= <user>
##$USERP2= <user>
##$USERP3= <user>
##$USERP4= <user>
##$USERP5= <user>
##$WDW= 1
##$XDIM= 131072
##$YMAX_p= 420597581
##$YMIN_p= -515443954
##$CURPLOT= <Network HP LaserJet P1505>
##$CURPRIN= <$Network HP LaserJet P1505>
##$DFORMAT= <normdp>
##$LAYOUT= <+/1D_H.xwp>
##$LFORMAT= <normlp>
##$PFORMAT= <normpl>
##$SURQMSG= 1
$$ End of Bruker specific parameters
$$ ---------------------------------
##NTUPLES= NMR SPECTRUM
##VAR_NAME=  FREQUENCY,     SPECTRUM/REAL,   SPECTRUM/IMAG
##SYMBOL=    X,             R,               I
##VAR_TYPE=  INDEPENDENT,   DEPENDENT,       DEPENDENT
##VAR_FORM=  AFFN,          ASDF,            ASDF
##VAR_DIM=   131072,        131072,          131072
##UNITS=     HZ,            ARBITRARY UNITS, ARBITRARY UNITS
##FACTOR=    0.0627417313425165, 1,          1
##FIRST=     8223.62146879498, -5548,        -90855
##LAST=      0,             -1202,           -92208
##MIN=       0,             -515443954,      0
##MAX=       8223.62146879498, 420597581,    0
$$ Real data points
##PAGE= N=1
##DATA TABLE= (X++(R..R)), XYDATA
$$ [...]
61689B4297839j399828j399680j374077j328380j267549j196427j119936j041879
$$ 24297839 22898011 21498331 20124254 18795874 17528325 16331898 15211962 14170083
61681A4170083r63846q86374q11131p40892o77433o20403n68395n20303m75678
$$ 14170083 13206237 12319863 11508732 10767840 10090407 9470004 8901609 8381306 7905628
61672G905628m34597l97419l64071l33702l05581k79895k56988k36257k16855
$$ 7905628 7471031 7073612 6709541 6375839 6070258 5790363 5533375 5297118 5080263
61663E080263j99045j83642j70364j58108j46669j36770j28359j20458j12836
$$ 5080263 4881218 4697576 4527212 4369104 4222435 4085665 3957306 3836848 3724012
61654C724012j06213j00375r3902q6592q0418p6842p4440p0775o5661o0945n7757
$$ 3724012 3617799 3517424 3423522 3336930 3256512 3179670 3105230 3034455 2968794 2907849 2850092
61643B850092n5612n3919n2611n1074m8247m4357m1345m0554m0829l9925l7319
$$ 2850092 2794480 2740561 2687950 2636876 2588629 2544272 2502927 2462373 2421544 2381619 2344300
61632B344300l4570l3009l2207l1058k9522k8454k8050k7424k5839k3651k1624
$$ 2344300 2309730 2276721 2244514 2213456 2183934 2155480 2127430 2100006 2074167 2050516 2028892
61621B028892j9871j8144j6724j6267j6627j6517j4766j1651q696p127o755o474
$$ 2028892 2009021 1990877 1974153 1957886 1941259 1924742 1909976 1898325 1889629 1882502 1875747 1869273
61609A869273n804n590o854r259j1427j2766j4040j5738j6919j6500j4924j3452
$$ 1869273 1863469 1857879 1851025 1841766 1830339 1817573 1803533 1787795 1770876 1754376 1739452 1726000
61597A726000j2371j1107r720q845q288p170n705n350o632q050p853n931l314
$$ 1726000 1713629 1702522 1692802 1683957 1675669 1668499 1662794 1657444 1650812 1642762 1634909 1628978 1625664
61584A625664r07N22K75j168j790q4K936M903M894L979L359L199L279L578L865
$$ 1625664 1624757 1625279 1625554 1624386 1622596 1622512 1625448 1630351 1635245 1639224 1642583 1645782 1649061 1652639 1656504
61569A656504L723L376L754N170O545O437M614K213M91k63o78j398k389l170l598
$$ 1656504 1660227 1663603 1667357 1672527 1679072 1685509 1690123 1692336 1692827 1692564 1691886 1690488 1688099 1684929 1681331
61554A681331m112n106o439p760q834r332q843p704p295q676j1045j2327j1304
$$ 1681331 1677219 1672113 1665674 1657914 1649080 1639748 1630905 1623201 1615906 1607230 1596185 1583858 1572554
61541A572554q630n840m024l414l464l174j940k69R50J808L205N205O701P153
$$ 1572554 1563924 1558084 1554060 1550646 1547182 1544008 1542068 1541799 1542749 1544557 1547762 1552967 1559668 1566821
61527A566821P650R367J1752J3339J3936J4795J6739J9186K1328K3298K5698K8470
$$ 1566821 1574471 1583838 1595590 1608929 1622865 1637660 1654399 1673585 1694913 1718211 1743909 1772379
61515A772379L0895L2484L3552L4909L7148M0150M3230M5905M8369N0936N3100
$$ 1772379 1803274 1835758 1869310 1904219 1941367 1981517 2024747 2070652 2119021 2169957 2223057
61504B223057N3671N2090M9223M6561M4860M3722M2262L9957L7061L4400L2551
$$ 2223057 2276728 2328818 2378041 2424602 2469462 2513184 2555446 2595403 2632464 2666864 2699415
61493B699415L1069K8868K5677K2632K0959K0318J9126J6440J2836R404O507L798
$$ 2699415 2730484 2759352 2785029 2807661 2828620 2848938 2868064 2884504 2897340 2906744 2913251 2917049
61481B917049R46k039m891p150q380q515p912o906n494l476o88K828O638J0001
$$ 2917049 2917995 2915956 2911065 2903915 2895535 2887020 2879108 2872202 2866708 2863232 2862544 2865372 2872010 2882011
61467B882011J2667J5512J9634K4776K9613L3940L9498M7664N7285O5949P2998
$$ 2882011 2894678 2910190 2929824 2954600 2984213 3018153 3057651 3105315 3162600 3228549 3301547
61456C301547Q0000Q8379R7933J07998J18757J30632J43096J55057J66207J77359
$$ 3301547 3381547 3469926 3567859 3675857 3794614 3925246 4068342 4223399 4389606 4566965
61446D566965J89538K03120K17864K33327K48957K63804K76364K85108K89228
$$ 4566965 4756503 4959623 5177487 5410814 5659771 5923575 6199939 6485047 6774275
61437F774275K88591K82761K70467K50329K21836J85515J42896R6870N1150Q188
$$ 6774275 7062866 7345627 7616094 7866423 8088259 8273774 8416670 8513540 8564690 8572878
61427H572878l2139p0768j06780j37741j62492j81853j96283k04550k05624k00728
$$ 8572878 8540739 8469971 8363191 8225450 8062958 7881105 7684822 7480272 7274648 7073920
61417G073920j92271j81617j68864j54185j38312j21961j05669q9944p4908o0051
$$ 7073920 6881649 6700032 6531168 6376983 6238671 6116710 6011041 5921097 5846189 5786138
61407E786138m4948k9945j5659k159J0807K3239L4991M5957N5683O3427O9248
$$ 5786138 5741190 5711245 5695586 5693427 5704234 5727473 5762464 5808421 5864104 5927531 5996779
61396E996779P4291P9211Q3114Q4940Q5153Q4835Q3933Q1908P9523P8088P6981
$$ 5996779 6071070 6150281 6233395 6318335 6403488 6488323 6572256 6654164 6733687 6811775 6888756
61385F888756P3956O8452O2833N9524N8314N7412N5910N3842N0884M6478M0977
$$ 6888756 6962712 7031164 7093997 7153521 7211835 7269247 7325157 7378999 7429883 7476361 7517338
61374G517338L5422L0316K5477K0973J7087J3264Q082P76p622j5022j9925k2386
$$ 7517338 7552760 7583076 7608553 7629526 7646613 7659877 7667959 7668735 7661113 7646091 7626166 7603780
61362G603780k3799k5868k9304l3096l5271l4718l2208k9493k7494k5737k3409
$$ 7603780 7579981 7554113 7524809 7491713 7456442 7421724 7389516 7360023 7332529 7306792 7283383
61351G283383k0467j7505j4980j3037j1805j1298j1188j1236j1906j3757j6107
$$ 7283383 7262916 7245411 7230431 7217394 7205589 7194291 7183103 7171867 7159961 7146204 7130097
61340G130097j7094j5550j2085p875l046K936J0066J8080K7610L9806N4702P1040
$$ 7130097 7113003 7097453 7085368 7077493 7074447 7077383 7087449 7105529 7133139 7172945 7227647 7298687
61328G298687Q7893J05554J24427J43958J63306J82521K02251K22505K42246K60263
$$ 7298687 7386580 7492134 7616561 7760519 7923825 8106346 8308597 8531102 8773348 9033611
61318I033611K76004K89333K99534L04825L03147K93334K75320K49303K15482
$$ 9033611 9309615 9598948 9898482 10203307 10506454 10799788 11075108 11324411 11539893
61309A1539893J74851J29404Q0992L0632k0422o9867j15681j57605j96046k30148
$$ 11539893 11714744 11844148 11925140 11955772 11935350 11865483 11749802 11592197 11396151 11166003
61299A1166003k58452k81081k99353l13328l21789l24934l24877l22567l16352
$$ 11166003 10907551 10626470 10327117 10013789 9692000 9367066 9042189 8719622 8403270
61290H403270l05079k90697k75837k60254k42111k22054k03377j87846j73484
$$ 8403270 8098191 7807494 7531657 7271403 7029292 6807238 6603861 6416015 6242531
61281F242531j57340j39000j20471j03581q8390p3712n8575m3290k9174j6987
$$ 6242531 6085191 5946191 5825720 5722139 5633749 5560037 5501462 5458172 5428998 5412011
61271E412011n821N789J7807K8564L6866M3299M9040N4103N7560N9175N9962O0874
$$ 5412011 5406190 5411979 5429786 5458350 5495216 5538515 5587555 5641658 5699218 5758393 5818355 5879229
61259E879229O1339N9603N4783M8299M2704L8966L5528L0547K4390J8984J5021
$$ 5879229 5940568 6000171 6054954 6103253 6145957 6184923 6220451 6250998 6275388 6294372 6309393
61248F309393J1006N386j464q067j3859j9477k5380l1180l6479m1656m7261n3098
$$ 6309393 6320399 6325785 6324321 6316254 6302395 6282918 6257538 6226358 6189879 6148223 6100962 6047864
61236F047864n8386o2643o5930o8265o9494o9904p0304p0908p0644o8331o4382
$$ 6047864 5989478 5926835 5860905 5792640 5723146 5653242 5582938 5512030 5441386 5373055 5308673
61225E308673o0399n7181n3984n0068m5948m2559l9828l6926l3580l0484k8442
$$ 5308673 5248274 5191093 5137109 5087041 5041093 4998534 4958706 4921780 4888200 4857716 4829274
61214D829274k7576k7336k6988k6246k5488k5165k4958k3935k1577j8145j3902
$$ 4829274 4801698 4774362 4747374 4721128 4695640 4670475 4645517 4621582 4600005 4581860 4567958
61203D567958q766k908L070Q962J5197K1876K8491L5164M3027N2496O2241P1014
$$ 4567958 4559192 4556284 4559354 4568316 4583513 4605389 4633880 4669044 4712071 4764567 4826808 4897822
61191D897822P9584Q9356R9662J08184J13899J17941J21235J22600J19705J10900
$$ 4897822 4977406 5066762 5166424 5274608 5388507 5506448 5627683 5750283 5869988 5980888
61181E980888R5795P5014M9854K1704q480l9763p0504r8854j23822j45191j62572
$$ 5980888 6076683 6151697 6201551 6223255 6214775 6175012 6104508 6005654 5881832 5736641 5574069
61170E574069j75396j83647j87703j87684j83890j77505j69693j60377j49274
$$ 5574069 5398673 5215026 5027323 4839639 4655749 4478244 4308551 4148174 3998900
61161C998900j37691j27492j18444j08740r8341q9416q2771p6257o8120n9771
$$ 3998900 3861209 3733717 3615273 3506533 3408192 3318776 3236005 3159748 3091628 3031857
61151C031857n3383m8460m2850l6004k9156k3121j7969j4140j1744r109m197K478
$$ 3031857 2978474 2930014 2887164 2851160 2822004 2798883 2780914 2766774 2755030 2745921 2741724 2744202
61139B744202Q208J1464J3098J4006J3674J1791R421P333M574J47m744p766q465
$$ 2744202 2752410 2763874 2776972 2790978 2804652 2816443 2825864 2833197 2837771 2837918 2833174 2825408 2816943
61126B816943q886j1032j4672j8080k0252k1731k3524k5839k8171l0222l2179
$$ 2816943 2808057 2797025 2782353 2764273 2744021 2722290 2698766 2672927 2644756 2614534 2582355
61115B582355l4019l5148l5085l4292l3900l4731l6725l9131m1004m1784m1666
$$ 2582355 2548336 2513188 2478103 2443811 2409911 2375180 2338455 2299324 2258320 2216536 2174870
61104B174870m1252m0767l9938l8834l8105l8001l7683l6230l3956l2048l1169
$$ 2174870 2133618 2092851 2052913 2014079 1975974 1937973 1900290 1864060 1830104 1798056 1766887
61093A766887l1044l1115l0891k9956k8392k7072k6723k6842k6445k5691k5640
$$ 1766887 1735843 1704728 1673837 1643881 1615489 1588417 1561694 1534852 1508407 1482716 1457076
61082A457076k6292k6037k3692k0091j6942j4731j2701j0428q411p076o068m934
$$ 1457076 1430784 1404747 1381055 1360964 1344022 1329291 1316590 1306162 1297751 1290675 1284607 1279673
61070A279673l891l307k715j021K131N736Q514J0197J1244J1735J1441J0820J0887
$$ 1279673 1275782 1272475 1269760 1268739 1270870 1276606 1285120 1295317 1306561 1318296 1329737 1340557 1351444
61057A351444J1772J2386J2067J1657J2220J3474J4355J4466J4032J2917J0876
$$ 1351444 1363216 1375602 1387669 1399326 1411546 1425020 1439375 1453841 1467873 1480790 1491666
61046A491666Q521O923O232N658M802M053L578K844J381o86l064n531p588q544
$$ 1491666 1500187 1507110 1513342 1519000 1523802 1527855 1531433 1534277 1535658 1534972 1531908 1526377 1518789 1510245
61032A510245q237p294o530o378o670o633n523l841l358n039p486q542p946o981
$$ 1510245 1502008 1494714 1488184 1481806 1475136 1468503 1462980 1459139 1455781 1450742 1443256 1434714 1426768 1419787
61018A419787n979m132j813r29k169l767m035l546l565l794l171j869p60L06J956
$$ 1419787 1413808 1409676 1407863 1406934 1404765 1400998 1396963 1393417 1389852 1386058 1382887 1381018 1380258 1380564 1382520
61003A382520L551L689K490J757K724M787O771Q214R108R486R900J1338J3871
$$ 1382520 1386071 1389760 1392250 1394007 1396731 1401518 1408289 1416503 1425611 1435097 1444997 1456335 1470206
60990A470206J6037J6369J5293J4752J6023J8615K1318K3577K5328K6219K6074
$$ 1470206 1486243 1502612 1517905 1532657 1548680 1567295 1588613 1612190 1637518 1663737 1689811
60979A689811K6062K8062L2183L5888L6721L5529L5613L8834M3766M7796M9857
$$ 1689811 1715873 1743935 1776118 1812006 1848727 1884256 1919869 1958703 2002469 2050265 2100122
60968B100122N0800N2254N5584O0926O6618P0559P2624P4847P8782Q3976Q9630
$$ 2100122 2150922 2203176 2258760 2319686 2386304 2456863 2529487 2604334 2683116 2767092 2856722
60957B856722R6092J03434J10071J14708J18803J25145J34266J44000J52499J60011
$$ 2856722 2952814 3056248 3166319 3281027 3399830 3524975 3659241 3803241 3955740 4115751
60947D115751J67845J77192J89234K04764K23185K43069K64120K87478L13783
$$ 4115751 4283596 4460788 4650022 4854786 5077971 5321040 5585160 5872638 6186421
60938F186421L42226L71987M03465M37613M75327N18063N67630O24356O86628
$$ 6186421 6528647 6900634 7304099 7741712 8217039 8735102 9302732 9927088 10613716
60929A0613716P53470Q26760R09990J006090J117974J249818J405152J584158
$$ 10613716 11367186 12193946 13103936 14110026 15228000 16477818 17882970 19467128
60921A9467128J785444K008265K243337K452765K563082K495350K219933J788307
$$ 19467128 21252572 23260837 25504174 27956939 30520021 33015371 35235304 37023611
60913C7023611J308040Q81909N65575L69654K79462K56903K30845J11553j61904
$$ 37023611 38331651 39213560 39779135 40148789 40428251 40685154 40915999 41027552 40865648
60904D0865648n79452j064560j521802j885364k135124k282634k349567k354446
$$ 40865648 40286196 39221636 37699834 35814470 33679346 31396712 29047145 26692699
60896B6692699k308960k219678k091970j933523j755285j569542j387304j216889
$$ 26692699 24383739 22164061 20072091 18138568 16383283 14813741 13426437 12209548
60888A2209548j063554r29469q14118p15679o32385n62361n02624m49637m01665
$$ 12209548 11145994 10216525 9402407 8686728 8054343 7491982 6989358 6539721 6138056
60879F138056l59800l25614k98299k75025k53634k33766k15588j98976j84167
$$ 6138056 5778256 5452642 5154343 4879318 4625684 4391918 4176330 3977354 3793187
60870C793187j71769j61537j52297j43588j36138j30010j23594j15700j07531
$$ 3793187 3621418 3459881 3307584 3163996 3027858 2897848 2774254 2658554 2551023
60861B551023j01093r6257r1018q4461p7889p2839o9359o6686o4415o2127n8831
$$ 2551023 2449930 2353673 2262655 2178194 2100305 2027466 1958107 1891421 1827006 1764879 1706048
60850A706048n3891m8183m3518m0757l9028l6901l3960l0963k8662k6868k4783
$$ 1706048 1652157 1603974 1560456 1519699 1480671 1443770 1409810 1378847 1350185 1323317 1298534
60839A298534k2040j9050j6355j3988j1756r873q875q798q886q333p136n913m806
$$ 1298534 1276494 1257444 1241089 1227101 1215345 1205472 1196597 1187799 1178913 1170580 1163444 1157531 1152725
60826A152725l068j69K976M685M555M090M702N823N880M720L776L894M264L808
$$ 1152725 1149657 1149488 1152464 1157149 1161704 1165794 1170496 1176319 1182199 1186919 1190695 1194589 1198853 1202661
60812A202661K596J264pj293k296k657k503k183j923k064k954m148m423l241j465
$$ 1202661 1205257 1206521 1206514 1205221 1202925 1200268 1197765 1195582 1193659 1191595 1188641 1184493 1180070 1176829 1175364
60797A175364l8J182K427K907K034J074J986M716P203Q149Q395R302J1024J2809
$$ 1175364 1175326 1176508 1178935 1181842 1183876 1184950 1186936 1191652 1198855 1207004 1215399 1224701 1235725 1248534
60783A248534J3987J4239J3770J3574J4458J5691J5650J4220J3052J2867J2106
$$ 1248534 1262521 1276760 1290530 1304104 1318562 1334253 1349903 1364123 1377175 1390042 1402148
60772A402148R531O723O050P009O811M541K554L029M974N897N206M345M221M126
$$ 1402148 1411679 1418402 1424452 1431461 1438272 1442813 1445367 1448396 1453370 1459267 1464473 1468818 1473039 1477165
60758A477165L351K444K194K331K044J307Q10P16K59j235l605o246q650j0276
$$ 1477165 1480516 1482960 1485154 1487485 1489529 1490836 1491646 1492362 1492621 1491386 1487781 1481535 1472885 1462609
60744A462609j0587r867r422j0218j1611j2279j2120j2224j2959j3295j2495j1291
$$ 1462609 1452022 1442155 1432733 1422515 1410904 1398625 1386505 1374281 1361322 1348027 1335532 1324241
60732A324241j0644j0155q776o440m004j985m29K98P2K48K731P195J0695J1160
$$ 1324241 1313597 1303442 1294666 1288226 1284222 1282237 1281808 1282106 1282178 1282426 1285157 1292352 1303047 1314207
60718A314207J0223J1111J4245J6591J5578J2363J0494J2154J6337K0220K1713
$$ 1314207 1324430 1335541 1349786 1366377 1381955 1394318 1404812 1416966 1433303 1453523 1475236
60707A475236K0844J9212J8259J7969J7375J6124J4957J4466J4133J3131J1592
$$ 1475236 1496080 1515292 1533551 1551520 1568895 1585019 1599976 1614442 1628575 1641706 1653298
60696A653298J0325R479Q403O805N321M548M103L155J566J33l52K3L23l76k150
$$ 1653298 1663623 1673102 1681505 1688310 1693631 1698179 1702282 1705437 1707003 1707136 1706784 1706807 1707130 1706754 1704604
60681A704604m210n726o486o718o551o084n756o111p203q591r870j0777j0923
$$ 1704604 1700394 1694668 1688182 1681464 1674913 1668829 1663073 1656962 1649759 1641168 1631298 1620521 1609598
60668A609598j0114r028q693r120r237q568p959p920p309m966k049j023k191k903
$$ 1609598 1599484 1590456 1581763 1572643 1563406 1554838 1546879 1538959 1531650 1526684 1524635 1523612 1521421 1518518
60654A518518r45K460M258L382J669J147J690J841R77k03r50j394k131l447n123
$$ 1518518 1517573 1520033 1524291 1527673 1529342 1530489 1532179 1534020 1534997 1534794 1533844 1532450 1530319 1526872 1521749
60639A521749o581p031o019m144k791k608k672j840o09o84k632n071o599p476
$$ 1521749 1515168 1508137 1502118 1497974 1495183 1492575 1489903 1488063 1487454 1486770 1484138 1479067 1472468 1464992
60625A464992q695j0173j1049j1270j1739j2837j3816j3987j3750j4000j4927
$$ 1464992 1456297 1446124 1435075 1423805 1412066 1399229 1385413 1371426 1357676 1343676 1328749
60614A328749j5774j5588j4046j1784r985r419r762r990r318p562m846j590J235
$$ 1328749 1312975 1297387 1283341 1271557 1261572 1252153 1242391 1232401 1223083 1215521 1210675 1209085 1210320
60601A210320K581K397J863K133L126L811L646L300L863N416O750O702N661N116
$$ 1210320 1212901 1215298 1217161 1219294 1222420 1226231 1229877 1233177 1237040 1242456 1249206 1255908 1261569 1266685
60587A266685N678O271N756M632M127M232L820K604J647J766K627L772N330P068
$$ 1266685 1272363 1278634 1284390 1289022 1293149 1297381 1301201 1303805 1305452 1307218 1309845 1313617 1318947 1326015
60573A326015P951P604P249Q082R517J0202J0153J0559J1714J2690J3093J3791
$$ 1326015 1333966 1341570 1348819 1356901 1366418 1376620 1386773 1397332 1409046 1421736 1434829 1448620
60561A448620J5501J7664J9195J9534J8679J7090J5878J6119J7421J8016J6903
$$ 1448620 1464121 1481785 1500980 1520514 1539193 1556283 1572161 1588280 1605701 1623717 1640620
60550A640620J4993J3440J1844R258O137L745J983o00m462q187j0484j1844j3458
$$ 1640620 1655613 1669053 1680897 1690155 1696292 1700037 1702020 1701420 1696958 1688771 1678287 1666443 1652985
60537A652985j5404j6812j7210j6921j6558j6721j7674j8648j7952j4764j0499
$$ 1652985 1637581 1620769 1603559 1586638 1570080 1553359 1535685 1517037 1499085 1484321 1473822
60526A473822p470o282n498l873j969j126j549j945q83J641L894L881J536q99
$$ 1473822 1466352 1460070 1454572 1450699 1448730 1447604 1446055 1444110 1443227 1444868 1448762 1452643 1454179 1453280
60512A453280j277J11J400J956K884M729O277O328N385M714M708N127O079P626
$$ 1453280 1452003 1452114 1453514 1455470 1458354 1463083 1469360 1475688 1481073 1485787 1490495 1495622 1501701 1509327
60498A509327R076R668R545R318R256R708J1327J3703J4714J2900R999R245J1313
$$ 1509327 1518403 1528071 1537616 1546934 1556190 1565898 1577225 1590928 1605642 1618542 1628541 1637786 1649099
60485A649099J3771J4701J4882J5858J7705J9827K2416K5688K8537K9381K7890
$$ 1649099 1662870 1677571 1692453 1708311 1726016 1745843 1768259 1793947 1822484 1851865 1879755
60474A879755K4950K1272J7063J2686Q708N227J774k119o530j1016j4551j5974
$$ 1879755 1904705 1925977 1943040 1955726 1964434 1969661 1971435 1969316 1962786 1951770 1937219 1921245
60462A921245j4921j2008p927k915K488O985R647J1105J2848J5629J9113K2681
$$ 1921245 1906324 1894316 1886389 1883474 1885962 1892947 1902594 1913699 1926547 1942176 1961289 1983970
60450A983970K5859K8352L0492L3397L7854M3199M8215N2995N8932O6698P5297
$$ 1983970 2009829 2038181 2068673 2102070 2139924 2183123 2231338 2284333 2343265 2409963 2485260
60439B485260Q3511R1509J00358J10439J21050J31469J41905J53095J65189J77324
$$ 2485260 2568771 2660280 2760638 2871077 2992127 3123596 3265501 3418596 3583785 3761109
60429C761109J88614J99565K12013K27290K44706K61929K76225K84691K83907
$$ 3761109 3949723 4149288 4361301 4588591 4833297 5095226 5371451 5656142 5940049
60420E940049K70600K42967K00983J45696P9448O799o6079j33895j93754k43948
$$ 5940049 6210649 6453616 6654599 6800295 6879743 6886542 6820463 6686568 6492814 6248866
60410F248866k82437l07681l20459l23484l19146l08524k92672k73603k53357
$$ 6248866 5966429 5658748 5338289 5014805 4695659 4387135 4094463 3820860 3567503
60401C567503k32824k12306j92633j74763j58428j42336j26049j10915r8572q8990
$$ 3567503 3334679 3122373 2929740 2754977 2596549 2454213 2328164 2217249 2118677 2029687
60391B029687q0704p2661o5106n8620n3042m7799m2897l8980l6393l4510l2265
$$ 2029687 1948983 1876322 1811216 1752596 1699554 1651755 1608858 1569878 1533485 1498975 1466710
60380A466710k9271k6157k3641k1458j8703j5358j2846j2474j3620j4223j3070
$$ 1466710 1437439 1411282 1387641 1366183 1347480 1332122 1319276 1306802 1293182 1278959 1265889
60369A265889j0940r370q953r170r236q605p161n523m858n688p041p341o182m600
$$ 1265889 1254949 1245579 1236626 1227456 1218220 1209615 1202454 1196931 1192073 1186385 1179344 1172003 1165821 1161221
60355A161221l495k498p91J486L382M555N665P069P943P497O549O723Q130R156
$$ 1161221 1157726 1155228 1154437 1155923 1159305 1163860 1169525 1176594 1184537 1192034 1198583 1205306 1213436 1222592
60341A222592Q881Q383Q678Q786P363N333M831N873O372N600N416P127R321J0113
$$ 1222592 1231473 1239856 1248534 1257320 1264683 1270016 1274847 1280720 1287092 1292692 1298108 1305235 1314556 1324669
60327A324669R747R364Q725P273O155O750P840O778L457O84J91O07J79o80q55
$$ 1324669 1334416 1343780 1352505 1359778 1365933 1372683 1380523 1387301 1390758 1391442 1391633 1392240 1392419 1391739 1390884
60312A390884p05r90r89L51K109K231N62p61j86J531K970M009N282O685P716Q655
$$ 1390884 1390179 1389189 1388200 1388551 1390660 1392891 1393453 1392692 1392506 1394037 1397007 1401016 1406298 1412983 1420699 1429354
60296A429354J0072J1305J0842Q644O852P273R035J0064J0231J1451J4515J7616
$$ 1429354 1439426 1450731 1461573 1470217 1477069 1484342 1493377 1503441 1513672 1525123 1539638 1557254
60284A557254J8763J8239J7395J6198J3651J0140P513O723O821O663O250N803
$$ 1557254 1576017 1594256 1611651 1627849 1641500 1651640 1659153 1665876 1672697 1679360 1685610 1691413
60272A691413M861L245K024K527M685P142Q643Q721P455N362L242J465o59m029
$$ 1691413 1696274 1699519 1701543 1704070 1708755 1715897 1724540 1733261 1740716 1746078 1749320 1750785 1750126 1746097
60258A746097q273j1691j2945j2319j1124j0231r601q998q611q707q997q782p732
$$ 1746097 1737824 1726133 1713188 1700869 1689745 1679514 1669913 1660915 1652304 1643597 1634600 1625818 1618086
60245A618086o147m397k506n29J140K283L355M732N813N636M479L871M689N982
$$ 1618086 1611939 1607542 1605036 1604507 1605647 1607930 1611285 1616017 1621830 1627466 1631945 1635816 1640505 1646487
60231A646487O237N220L899K967K322J943K478M466P332R686J0677J0779J1004
$$ 1646487 1652724 1657944 1661843 1664810 1667132 1669075 1671553 1676019 1683351 1693037 1703714 1714493 1725497
60218A725497J1565J1820J1564J1650J2756J4132J4521J4179J4803J7122J9542
$$ 1725497 1737062 1748882 1760446 1772096 1784852 1798984 1813505 1827684 1842487 1859609 1879151
60207A879151K0059J8810J7934J9046K1818K5033K8148L1380L4717L7616L9734
$$ 1879151 1899210 1918020 1935954 1955000 1976818 2001851 2029999 2061379 2096096 2133712 2173446
60196B173446M1603M4208M7958N2298N6516O0616O5223P0735P6959Q3499R0144
$$ 2173446 2215049 2259257 2307215 2359513 2416029 2476645 2541868 2612603 2689562 2773061 2863205
60185B863205R6818J03422J09872J16200J22518J28998J35758J42653J49331J55662
$$ 2863205 2960023 3063445 3173317 3289517 3412035 3541033 3676791 3819444 3968775 4124437
60175D124437J61682J66863J69889J69815J67112J62793J56778J48185J37198
$$ 4124437 4286119 4452982 4622871 4792686 4959798 5122591 5279369 5427554 5564752
60166E564752J25408J13728J01021Q5588O7449M8513L0927J5924L653o596j5694
$$ 5564752 5690160 5803888 5904909 5990497 6057946 6106459 6137386 6153310 6156963 6150367 6134673
60155F134673k3463k8398k9280k6827k2945j8494j2624m377N938J7439L0043M4393
$$ 6134673 6111210 6082812 6053532 6026705 6003760 5985266 5972642 5968265 5974203 5991642 6021685 6066078
60143F066078O0469P6832R1614J04110J15144J25786J35914J44139J49004J49980
$$ 6066078 6126547 6203379 6294993 6399103 6514247 6640033 6775947 6920086 7069090 7219070
60133G219070J47607J42959J36781J28557J16559R9609P8898N7277L6487J5902
$$ 7219070 7366677 7509636 7646417 7774974 7891533 7991142 8070040 8127317 8163804 8179706
60123H179706n614k7387m7285o3809p6926q7012r3901r7123r6636r3040q7199
$$ 8179706 8174092 8146705 8099420 8035611 7958685 7871673 7777772 7680649 7584013 7490973 7403774
60112G403774p9464o9250n5759l9341k1639m040J3433L1209M8826O5163P9477
$$ 7403774 7324310 7255060 7199301 7159960 7138321 7134281 7147714 7178923 7227749 7292912 7372389
60101G372389R1350J00025J04858J06233J05104J01655R5419Q6709P6866O6883
$$ 7372389 7463739 7563764 7668622 7774855 7879959 7981614 8077033 8163742 8240608 8307491
60091H307491N6717M6310L6510K8515K3193K1302K3640L0261M0131N2120O5938
$$ 8307491 8364208 8410518 8447028 8475543 8498736 8520038 8543678 8573939 8614070 8666190 8732128
60080H732128Q1635R8825J17148J37128J59621J84543K10873K37937K65929K94991
$$ 8732128 8813763 8912588 9029736 9166864 9326485 9511028 9721901 9959838 10225767 10520758
60070A0520758L24350L52765L79403M04081M27014M48523M68515M85755M97869
$$ 10520758 10845108 11197873 11577276 11981357 12408371 12856894 13325409 13811164 14309033
60061A4309033N02714M99792M89896M73423M49629M17779L78306L32145K79436
$$ 14309033 14811747 15311539 15801435 16274858 16724487 17142266 17520572 17852717 18132153
60052A8132153K19912J54540Q5895J6398n3008j21861j88463k49980l04089l49799
$$ 18132153 18352065 18506605 18592500 18608898 18555890 18434029 18245566 17995586 17691497 17341698
60042A7341698l86627m13665m29741m34329m28202m13320l91835l64855l32400
$$ 17341698 16955071 16541406 16111665 15677336 15249134 14835814 14443979 14079124 13746724
60033A3746724k94969k54764k14590j75677j37522j00030o4774l3586o786J6217
$$ 13746724 13451755 13196991 12982401 12806724 12669202 12569172 12504398 12470812 12464026 12480243
60023A2480243L5063M8215N4595N4590M9194L8920K4064N617j4682l5377n6092
$$ 12480243 12515306 12563521 12618116 12672706 12721900 12760820 12784884 12790501 12775819 12740442 12684350
60012A2684350p7154r8549j19449j38859j56585j73185j88899k02991k14394k22624
$$ 12684350 12607196 12508647 12389198 12250339 12093754 11920569 11731670 11528679 11314285 11091661
60002A1091661k27748k29709k28314k23666k15935k04797j89947j72437j54438
$$ 11091661 10863913 10634204 10405890 10182224 9966289 9761492 9571545 9399108 9244670
59993I244670j37078j19104r8578p5315n0821k6294j911K1978M4382O4771Q3619
$$ 9244670 9107592 8988488 8889910 8814595 8763774 8737480 8735569 8757547 8801929 8866700 8950319
59982H950319J01219J16780J29197J37957J42640J42413J36925J27111J14124
$$ 8950319 9051538 9168318 9297515 9435472 9578112 9720525 9857450 9984561 10098685
59973A0098685R7858P7569N3671K7864J425k5600n3367q1077j07054j29475j47049
$$ 10098685 10196543 10274112 10327783 10355647 10357072 10331472 10278105 10197028 10089974 9960499 9813450
59962I813450j59566j67792j72361j72864j68623j60015j48277j34198j17920
$$ 9813450 9653884 9486092 9313731 9140867 8972244 8812229 8663952 8529754 8411834
59953H411834r9796q0326n9267l6042j1277J3219L6324N8476Q0427J02290J24172
$$ 8411834 8312038 8231712 8172445 8136403 8125126 8138345 8174669 8233145 8313572 8415862 8540034
59942H540034J46362J68045J87065K01983K13499K22711K28663K28837K21787
$$ 8540034 8686396 8854441 9041506 9243489 9456988 9679699 9908362 10137199 10358986
59933A0358986K08244J89823J67498J41457J11885P9654M6179J2367k1927n6582
$$ 10358986 10567230 10757053 10924551 11066008 11177893 11257547 11303726 11316093 11294166 11237584
59923A1237584q9571j17806j39730j55818j66392j70802j69374j64035j55599
$$ 11237584 11148013 11030207 10890477 10734659 10568267 10397465 10228091 10064056 9908457
59914I908457j42334j23009r9815p6125n2605k7918k346K2094M4721O6607Q7737
$$ 9908457 9766123 9643114 9543299 9467174 9414569 9386651 9384305 9406399 9451120 9517727 9605464
59903I605464J06453J22167J36184J48896J58444J63490J65408J66284J66128
$$ 9605464 9711917 9834084 9970268 10119164 10277608 10441098 10606506 10772790 10938918
59894A0938918J63570J58194J50771J41997J32517J23668J16907J12489J09533
$$ 10938918 11102488 11260682 11411453 11553450 11685967 11809635 11926542 12039031 12148564
59885A2148564J07411J06736J09127J16237J28586J45213J64837J87226K12835
$$ 12148564 12255975 12362711 12471838 12588075 12716661 12861874 13026711 13213937 13426772
59876A3426772K41462K72341L05326L40299L75306M06959M33297M54576M70432
$$ 13426772 13668234 13940575 14245901 14586200 14961506 15368465 15801762 16256338 16726770
59867A6726770M78013M74054M57116M26412L80285L18272K43685J61740P5361
$$ 16726770 17204783 17678837 18135953 18562365 18942650 19260922 19504607 19666347 19741708
59858A9741708j4955j07112j95587k74543l41407l96467m40054m71103m88167
$$ 19741708 19726753 19619641 19424054 19149511 18808104 18411637 17971583 17500480 17012313
59849A7012313m91208m82337m64731m40610m10555l75101l36147k95671k53750
$$ 17012313 16521105 16038768 15574037 15133427 14722872 14347771 14011624 13715953 13462203
59840A3462203k09476j63886j20239q0716m4209q337K7315O0905R0415J14599
$$ 13462203 13252727 13088841 12968602 12887886 12843677 12835340 12862655 12923560 13013975 13128574
59830A3128574J32304J42271J43957J37707J23679J01235O9796K9923j6759o8236
$$ 13128574 13260878 13403149 13547106 13684813 13808492 13909727 13979523 14009446 13992687 13924451
59820A3924451j22193j75778k26158k71653l11918l46617l74288l93005m02181
$$ 13924451 13802258 13626480 13400322 13128669 12816751 12470134 12095846 11702841 11300660
59811A1300660m03340l99058l91223l80236l65525l46689l24441l00534k76626
$$ 11300660 10897320 10498262 10107039 9726803 9361278 9014589 8690148 8389614 8112988
59802H112988k53272k30127k06906j83844j61398j40182j21201j05524r3410q4162
$$ 8112988 7859716 7629589 7422683 7238839 7077441 6937259 6816058 6710534 6617124 6532962
59792F532962p7018p1709o7853o4417o0341n5580n1004m7363m4554m1981l9341
$$ 6532962 6455944 6384235 6316382 6251965 6191624 6136044 6085040 6037677 5993123 5951142 5911801
59781E911801l7060l5959l6496l8377m0879m3343m5263m6453m7484m9437n2438
$$ 5911801 5874741 5838782 5802286 5763909 5723030 5679687 5634424 5587971 5540487 5491050 5438612
59770E438612n4724n4127n0506m5739m1222l6442l0498k3886j7979j3250q777
$$ 5438612 5383888 5329761 5279255 5233516 5192294 5155852 5125354 5101468 5083489 5070239 5061462
59759E061462l272L846J2056K0098K6890L2387L7291M2176M7401N3557O0945O8564
$$ 5061462 5058190 5062036 5074092 5094190 5121080 5153467 5190758 5232934 5280335 5333892 5394837 5463401
59747E463401P4951Q0246Q5957R2152R6448R6919R4578R1599Q8299Q3630P7777
$$ 5463401 5538352 5618598 5704555 5796707 5893155 5990074 6084652 6176251 6264550 6348180 6425957
59736F425957P2322O8134O4921O2833O2858O5322O9478P4861Q1884R0785J01236
$$ 6425957 6498279 6566413 6631334 6694167 6757025 6822347 6891825 6966686 7048570 7139355 7240591
59725G240591J13270J27452J43701J61104J79466J99860K22948K47775K73154
$$ 7240591 7353861 7481313 7625014 7786118 7965584 8165444 8388392 8636167 8909321
59716H909321K99474L27911L58166L88021M15102M38106M55769M64941M60288
$$ 8909321 9208795 9536706 9894872 10282893 10697995 11136101 11591870 12056811 12517099
59707A2517099M36289L90180L23559K41806J52029O1152k5046j02003j66083k14761
$$ 12517099 12953388 13343568 13667127 13908933 14060962 14122114 14097068 13995065 13828982 13614221
59697A3614221k47482k65975k72749k68999k54847k31697k03032j71883j38709
$$ 13614221 13366739 13100764 12828015 12559016 12304169 12072472 11869440 11697557 11558848
59688A1558848j03024o6092l0235L963L7818P1928J05227J37050J68338K00085
$$ 11558848 11455824 11389732 11359497 11363460 11401278 11473206 11578433 11715483 11883821 12083906
59678A2083906K32065K63971K96505L30313L64899L99673M35251M72580N11430
$$ 12083906 12315971 12579942 12876447 13206760 13571659 13971332 14406583 14879163 15390593
59669A5390593N50963N91411O34062O79600P27339P76022Q24721Q73010R20642
$$ 15390593 15941556 16532967 17167029 17846629 18573968 19349990 20174711 21047721 21968363
59660B1968363R66895J009765J046266J074050J092428J101294J099654J086448
$$ 21968363 22935258 23945023 24991289 26065339 27157767 28259061 29358715 30445163
59652C0445163J062766J032173R98575R64594R32168R03580Q80746Q63749Q50841
$$ 30445163 31507929 32540102 33538677 34503271 35435439 36339019 37219765 38083514 38934355
59643C8934355Q39832Q28730Q14983P95045P65583P24970O72962O09119N32690
$$ 38934355 39774187 40602917 41417900 42212945 42978528 43703498 44376460 44985579 45518269
59634D5518269M44704L49455K52911J59767P2745n602p1738j22270j55418j70769
$$ 45518269 45962973 46312428 46565339 46725106 46797851 46792249 46720511 46598241 46442823 46272054
59624D6272054j68386j48889j13990o5958o462O3478J42500K28559L19773M14979
$$ 46272054 46103668 45954779 45840789 45774831 45768369 45831847 45974347 46202906 46522679 46937658
59614D6937658N12859O10745P04721P90779Q65209R23573R59951R67982R42653
$$ 46937658 47450517 48061262 48765983 49556762 50421971 51345544 52305495 53273477 54216130
59605E4216130Q80463P78336O34140M49474K31303j0103k64331n21127p68935
$$ 54216130 55096593 55874929 56509069 56958543 57189846 57179743 56915412 56394285 55625350
59596E5625350r95805j192768j355234j480753j567225j614495j626519j610128
$$ 55625350 54629545 53436777 52081543 50600790 49033565 47419070 45792551 44182423
59588D4182423j571909j517447j453235j387573j328782j282914j253054j239635
$$ 44182423 42610514 41093067 39639832 38252259 36923477 35640563 34387509 33147874
59580C3147874j240365j250086j261738j268517j265994j252787j229441j196874
$$ 33147874 31907509 30657423 29395685 28127168 26861174 25608387 24378946 23182072
59572B3182072j155884j107598j053311r93706r29153q61401p94067p30426o71154
$$ 23182072 22026188 20918590 19865279 18871573 17942420 17081019 16286952 15556526 14885372
59563A4885372o15227n62559n14307m70558m29388l89139l50728l16640k88137
$$ 14885372 14270145 13707586 13193279 12722721 12293333 11904194 11553466 11236826 10948689
59554A0948689k64169k42715k22420k03184j85993j72193j62278j55351j50189
$$ 10948689 10684520 10441805 10219385 10016201 9830208 9658015 9495737 9340386 9190197
59545I190197j46731j45755j47102j49103j50175j50296j50271j50060j48662
$$ 9190197 9043466 8897711 8750609 8601506 8451331 8301035 8150764 8000704 7852042
59536G852042j45412j40675j35063j28459j20055j09241r6542q3743p2678o3514
$$ 7852042 7706630 7565955 7430892 7302433 7182378 7073137 6976595 6892852 6820174 6756660
59526F756660n4550m4172l2644k1341j0760l78R725J8543K5782L2490L9479M6165
$$ 6756660 6702110 6657938 6625294 6603953 6593193 6592815 6602540 6621083 6646865 6679355 6718834 6764999
59514F764999N1739N6523O1286O6001P0378P4906Q0250Q6194R2254R8919J07046
$$ 6764999 6816738 6873261 6934547 7000548 7070926 7145832 7226082 7312276 7404530 7503449 7610495
59503G610495J16337J25742J35215J45814J58043J71447J85874K01775K18908
$$ 7610495 7726832 7852574 7987789 8133603 8291646 8463093 8648967 8850742 9069650
59494I069650K36037K52514K69061K86406L04137L21620L38958L56120L71782
$$ 9069650 9305687 9558201 9827262 10113668 10417805 10739425 11078383 11434503 11806285
59485A1806285L84003L91903L95982L97112L95574L90784L81570L67072L47666
$$ 11806285 12190288 12582191 12978173 13375285 13770859 14161643 14543213 14910285 15257951
59476A5257951L24450K97732K66923K32476J97044J63656J33160J04422P6875
$$ 15257951 15582401 15880133 16147056 16379532 16576576 16740232 16873392 16977814 17054689
59467A7054689N1852L1341J6080N316j855n126k896O305K2203M2631O4959Q7362
$$ 17054689 17106541 17137882 17153962 17159278 17157423 17152297 17149401 17155706 17177909 17220540 17285499 17372861
59455A7372861J08658J27357J41245J47700J44278J29413J02892O5665J9120l5268
$$ 17372861 17481519 17608876 17750121 17897821 18042099 18171512 18274404 18340069 18359189 18323921
59445A8323921r5852j60859k28405k95825l59201m14503m59484m93705n16790
$$ 18323921 18228069 18067210 17838805 17542980 17183779 16769276 16309792 15816087 15299297
59436A5299297n27903n27430n17861n01911m80483m53490m21938l87938l52886
$$ 15299297 14771394 14243964 13726103 13224192 12743709 12290219 11868281 11480343 11127457
59427A1127457l16783k79480k41835k05336j70982j38667j07443p6473m5838j6178
$$ 11127457 10810674 10531194 10289359 10084023 9913041 9774374 9666931 9590458 9544620 9528442
59417I528442J2243L9559O5538Q9775J13015J36912J61718J85296K05519K22718
$$ 9528442 9540685 9580244 9645782 9735557 9848572 9985484 10147202 10332498 10538017 10760735
59407A0760735K38346K51927K61018K63959K60916K52009K35961K11467J78800
$$ 10760735 10999081 11251008 11512026 11775985 12036901 12288910 12524871 12736338 12915138
59398A2915138J39340R4157M3898j0193o5976j21234j74541k24957k70829l09294
$$ 12915138 13054478 13148635 13192533 13182340 13116364 12995130 12820589 12595632 12324803 12015509
59388A2015509l37837l56556l68224l75629l79372l78553l72674l62052l47295
$$ 12015509 11677672 11321116 10952892 10577263 10197891 9819338 9446664 9084612 8737317
59379H737317l29551l10731k92151k73315k53236k32570k13047j95043j77370
$$ 8737317 8407766 8097035 7804884 7531569 7278333 7045763 6832716 6637673 6460303
59370F460303j59480j42210j26068j10578r5845q3124p2793o3180n2534m1005
$$ 6460303 6300823 6158613 6032545 5921967 5826122 5742998 5670205 5607025 5554491 5513486
59360E513486k9597j8430p462K177R480J5615K2823L1373L9404M5841N1478N6536
$$ 5513486 5483889 5465459 5457997 5460174 5469654 5485269 5508092 5539465 5578869 5624710 5676188 5732724
59348E732724N9129N7742N4178N2312N4353N9609O6689P5308Q5581R6931J08420
$$ 5732724 5791853 5849595 5903773 5956085 6010438 6070047 6136736 6212044 6297625 6394556 6502976
59337F502976J19351J28888J36164J41762J48405J58799J73062J89362K06852
$$ 6502976 6622327 6751215 6887379 7029141 7177546 7336345 7509407 7698769 7905621
59328G905621K26459K48719K72619K97356L23812L53031L84300M16107M48416
$$ 7905621 8132080 8380799 8653418 8950774 9274586 9627617 10011917 10428024 10876440
59319A0876440M82559N19121N57302N96324O36122O76263P15115P50362P79708
$$ 10876440 11358999 11878120 12435422 13031746 13667868 14344131 15059246 15809608 16589316
59310A6589316Q00929Q12313Q13466Q05041P87286P59496P21319O74175O20964
$$ 16589316 17390245 18202558 19016024 19821065 20608351 21367847 22089166 22763341 23384305
59301B3384305N64664N07399M50155L92960L35570K78262K21577J64987J06351
$$ 23384305 23948969 24456368 24906523 25299483 25635053 25913315 26134892 26299879 26406230
59292B6406230M3431k4132r4742j66710k39573l13299l86671m57126n22330n81379
$$ 26406230 26449661 26425529 26330787 26164077 25924504 25611205 25224534 24767408 24245078 23663699
59282B3663699o34183o80208p18441p48253p69484p81764p84795p79414p67348
$$ 23663699 23029516 22349308 21630867 20882614 20113130 19331366 18546571 17767157 16999809
59273A6999809p49548p25789o96412o63299o28158n90955n51309n10588m71141
$$ 16999809 16250261 15524472 14828060 14164761 13536603 12945648 12394339 11883751 11412610
59264A1412610m33844l97839l62522l28406k96074k65495k36531k09179j83318
$$ 11412610 10978766 10580927 10218405 9889999 9593925 9328430 9091899 8882720 8699402
59255H699402j59060j37062j17495r9100q0535o2325m6013l1660j7910m418P781
$$ 8699402 8540342 8403280 8285785 8186685 8106150 8043825 7997812 7966152 7948242 7943824 7951605
59244G951605J8641K9890M2642N5783O7594P7599Q6052R3040R8858J04018J08058
$$ 7951605 7970246 8000136 8042778 8098561 8166155 8243754 8329806 8422846 8521704 8625722 8733780
59233H733780J09737J09123J07916J06872J04739J01000R7756R7006R7524R6643
$$ 8733780 8843517 8952640 9060556 9167428 9272167 9373167 9470923 9567929 9665453 9762096
59223I762096R4116R2125R2122R3884R7253J02572J09169J15085J18713J19564
$$ 9762096 9856212 9948337 10040459 10134343 10231596 10334168 10443337 10558422 10677135 10796699
59213A0796699J17594J13060J06807R9272Q9401P5936N9432M1308K1326j800k7130
$$ 10796699 10914293 11027353 11134160 11233432 11322833 11398769 11458201 11499509 11520835 11519035 11491905
59202A1491905n1141p1417q8753j04614j18327j28149j33594j35095j32488j25672
$$ 11491905 11440764 11369347 11280594 11175980 11057653 10929504 10795910 10660815 10528327 10402655
59192A0402655j16211j06484r7092q6389p2831n7008m1105k7020j5287n389L341
$$ 10402655 10286444 10179960 10082868 9996479 9923648 9866640 9825535 9798515 9783228 9777839 9781180
59181I781180J1178J8149K4438L0332L5827M0669M4966M9431N4895O1890P0758
$$ 9781180 9792358 9810507 9834945 9865277 9901104 9941773 9986739 10036170 10091065 10152955 10223713
59170A0223713Q1780R5037J10333J27468J46454J67604J91459K18224K46892K75405
$$ 10223713 10305493 10400530 10510863 10638331 10784785 10952389 11143848 11362072 11608964 11884369
59160A1884369L02366L28059L52842L74984L91365M00001M00216L90214L66595
$$ 11884369 12186735 12514794 12867636 13242620 13633985 14033986 14434202 14824416 15191011
59151A5191011L27280K73614K08517J34027N1825l5227j23993k12563k98981l78948
$$ 15191011 15518291 15791905 16000422 16134449 16186274 16151047 16027054 15814491 15515510 15136562
59141A5136562m46969n00051n38809n64892n79055n82035n75512n61298n40686
$$ 15136562 14689593 14189542 13650733 13085841 12506786 11924751 11349239 10787941 10247255
59132A0247255n15263m87074m57160m25166l91393l58180l27964l00902k75661
$$ 10247255 9731992 9244918 8787758 8362592 7971199 7613019 7285055 6984153 6708492
59123F708492k51833k29962k09763j90186j71337j54575j40256j26801j12777
$$ 6708492 6456659 6226697 6016934 5826748 5655411 5500836 5360580 5233779 5121002
59114E121002r8734q6165p5607o6662n8876n1568m3596l4596k5990j9352j4004
$$ 5121002 5022268 4936103 4860496 4793834 4734958 4683390 4639794 4605198 4579208 4559856 4545852
59103D545852p640O19R194J6414K2506K8494L4382L9648M4785N0924N8144O5289
$$ 4545852 4538212 4538831 4548025 4564439 4586945 4615439 4649821 4689469 4734254 4785178 4843322 4908611
59091D908611P1524P7187Q2788Q8151R2925R7315J01754J06193J10181J13380
$$ 4908611 4980135 5057322 5140110 5228261 5321186 5418501 5520255 5626448 5736629 5850009
59081E850009J15677J16957J17118J16178J14011J10198J04500R7406Q9687Q1463
$$ 5850009 5965686 6082643 6199761 6315939 6429950 6540148 6644648 6742054 6831741 6913204
59071F913204P2299O2522N3793M7537M3096L8319L2288K6710K4043K4795K7433
$$ 6913204 6985503 7048025 7101818 7149355 7192451 7230770 7263058 7289768 7313811 7338606 7366039
59060G366039L0693L5044M1712N0991O2022P3701Q5449R7313J09763J23074J36738
$$ 7366039 7396732 7431776 7473488 7524479 7586501 7660202 7745651 7842964 7952727 8075801 8212539
59049H212539J49739J61736J73680J86754K00815K14301K25585K34145K40398
$$ 8212539 8362278 8524014 8697694 8884448 9085263 9299564 9525149 9759294 9999692
59040I999692K44644K46023K42457K31905K13954J89808J60509J25775Q5317M0677
$$ 9999692 10244336 10490359 10732816 10964721 11178675 11368483 11528992 11654767 11740084 11780761
59030A1780761n233n0253r3468j33702j69006j98391k22924k44117k61943k75415
$$ 11780761 11775528 11725275 11631807 11498105 11329099 11130708 10907784 10663667 10401724 10126309
59020A0126309k84531k90357k93474k93626k91105k87322k83480k79477k74656
$$ 10126309 9841778 9551421 9257947 8964321 8673216 8385894 8102414 7822937 7548281
59011G548281k68901k62301k54397k44744k34030k23684k14223k04700j94077
$$ 7548281 7279380 7017079 6762682 6517938 6283908 6060224 5846001 5641301 5447224
59002E447224j82631j71597j61798j53076j44826j36594j28067j18983j09447
$$ 5447224 5264593 5092996 4931198 4778122 4633296 4496702 4368635 4249652 4140205
58993D140205j00316r2771q7276q2988p8496p3265o8094o4002o0982n8182n5133
$$ 4140205 4039889 3947118 3859842 3776854 3698358 3625093 3556999 3492997 3432015 3373833 3318700
58982C318700n2392n0844n0684n1140n0933m9097m5752m2078l9175l6875l4155
$$ 3318700 3266308 3215464 3164780 3113640 3062707 3013610 2967858 2925780 2886605 2849730 2815575
58971B815575l0739k7510k5020k2310j8101j2744q158n833n497n703n164l476
$$ 2815575 2784836 2757326 2732306 2709996 2691895 2679151 2670993 2665160 2659663 2653960 2648796 2645320
58959B645320j176P94J947K610L124L065J988P19Q50K718M839N781N813O068O898
$$ 2645320 2644144 2644938 2646885 2649495 2652619 2655684 2657672 2658391 2659241 2661959 2666798 2672579 2678392 2684460 2691358
58944B691358P786Q373Q641Q438P784P552Q830J1307J3109J2757J0810R044Q386
$$ 2691358 2699144 2707517 2716158 2724596 2732380 2739932 2748762 2760069 2773178 2785935 2796745 2805789 2814175
58931B814175Q351Q425R176J1392J4592J7234J8569J9483K1071K2950K3919K3858
$$ 2814175 2822526 2830951 2840127 2851519 2866111 2883345 2901914 2921397 2942468 2965418 2989337 3013195
58919C013195K3979K5130K6866K8517L0225L2315L4440L6139L7716L9673M1690
$$ 3013195 3037174 3062304 3089170 3117687 3147912 3180227 3214667 3250806 3288522 3328195 3369885
58908C369885M3083M4110M5827M8577N1446N3530N5032N6760N9088O1919O5257
$$ 3369885 3412968 3457078 3502905 3551482 3602928 3656458 3711490 3768250 3827338 3889257 3954514
58897C954514O9134P3089P6284P8441Q0342Q3042Q6721R0653R4458R8850J04605
$$ 3954514 4023648 4096737 4173021 4251462 4331804 4414846 4501567 4592220 4686678 4785528 4890133
58886D890133J11125J16894J21596J26927J34672J44516J54575J63787J72884
$$ 4890133 5001258 5118152 5239748 5366675 5501347 5645863 5800438 5964225 6137109
58877F137109J82933J93899K05160K16826K29796K44559K60601K77190K94409
$$ 6137109 6320042 6513941 6719101 6935927 7165723 7410282 7670883 7948073 8242482
58868H242482L13051L33586L55713L78928M03097M28201M54018M80713N09359
$$ 8242482 8555533 8889119 9244832 9623760 10026857 10455058 10909076 11389789 11899148
58859A1899148N40875N74344O07412O38979O70771P05345P42835P80465Q15143
$$ 11899148 12440023 13014367 13621779 14260758 14931529 15636874 16379709 17160174 17975317
58850A7975317Q45750Q72736Q95983R13500R21903R17974Q99640Q65519Q13984
$$ 17975317 18821067 19693803 20589786 21503286 22425189 23343163 24242803 25108322 25922306
58841B5922306P43264O52624N42990M16383K75721J25604k7687j78194l22065
$$ 25922306 26665570 27318194 27861184 28277567 28553288 28678892 28651205 28473011 28150946
58832B8150946m56693n78692o84083p70439q37672q86515r17472r31707r31785
$$ 28150946 27694253 27115561 26431478 25661039 24823367 23936852 23019380 22087673 21155888
58823B1155888r20459q99198q68849q31346p89913p47463p05326o63637o22509
$$ 21155888 20235429 19336231 18467382 17636036 16846123 16098660 15393334 14729697 14107188
58814A4107188n82656n45032n10100m77499m46580m17256l90090l65420l42586
$$ 14107188 13524532 12979500 12469400 11991901 11545321 11128065 10737975 10372555 10029969
58805A0029969l20391k98297k76989k57560k40133k23384k05685j86829j68494
$$ 10029969 9709578 9411281 9134292 8876732 8636599 8413215 8207530 8020701 7852207
58796G852207j52647j39534j27479j14671j00836q7020p4045o1522m8451l4522
$$ 7852207 7699560 7560026 7432547 7317876 7217040 7130020 7055975 6994453 6946002 6911480
58786F911480k0640q040L071J3787K5394L8199N1573O4786P7603R0111J02545
$$ 6911480 6890840 6882800 6885871 6899658 6925052 6963251 7014824 7079610 7157213 7247324 7349869
58775G349869J15273J28632J42601J56758J70686J84391J98513K14120K32047
$$ 7349869 7465142 7593774 7736375 7893133 8063819 8248210 8446723 8660843 8892890
58766H892890K51997K72516K92363L12029L33354L57484L83694M10568M37791
$$ 8892890 9144887 9417403 9709766 10021795 10355149 10712633 11096327 11506895 11944686
58757A1944686M66015M95270N24719N54450N86375O22111O60221O96990P30283
$$ 11944686 12410701 12905971 13430690 13985140 14571515 15193626 15853847 16550837 17281120
58748A7281120P61450P92630Q23019Q48861Q66382Q73336Q67891Q47622Q10249
$$ 17281120 18042570 18835200 19658219 20507080 21373462 22246798 23114689 23962311 24772560
58739B4772560P54429O79514N85360M72900L44321K02624N1954j01596k50953
$$ 24772560 25526989 26206503 26791863 27264763 27609084 27811708 27863662 27762066 27511113
58730B7511113l90850n19014o34188p34136q16408q79952r24906r51788r62159
$$ 27511113 27120263 26601249 25967061 25232925 24416517 23536565 22611659 21659871 20697712
58721B0697712r59252r46270r24387q93815q56492q16107p75406p34976o94873
$$ 20697712 19738460 18792190 17867803 16973988 16117496 15301389 14525983 13791007 13096134
58712A3096134o55856o18351n81516n44543n08335m74887m45191m18324l92743
$$ 13096134 12440278 11821927 11240411 10695868 10187533 9712646 9267455 8849131 8456388
58703H456388l67993l44859l23788l03763k83347k62700k43619k27236k12761
$$ 8456388 8088395 7743536 7419748 7115985 6832638 6569938 6326319 6099083 5886322
58694E886322j98907j85586j73280j61882j51251j41939j34006j25922j16313
$$ 5886322 5687415 5501829 5328549 5166667 5015416 4873477 4739471 4613549 4497236
58685D497236j06182r7642r0980q4842p8988p4613p1735o8556o4111n9650n6578
$$ 4497236 4391054 4293412 4202432 4117590 4038602 3963989 3892254 3823698 3759587 3699937 3643359
58674C643359n4583n2650n0414m7693m4222m0682l8580l8139l7718l6348l5374
$$ 3643359 3588776 3536126 3485712 3438019 3393797 3353115 3314535 3276396 3238678 3202330 3166956
58663C166956l6413l8990m1575m3761m5842m7304m7418m6716m6316m6284m6048
$$ 3166956 3130543 3091553 3049978 3006217 2960375 2913071 2865653 2818937 2772621 2726337 2680289
58652B680289m5812m6036m5981m4348m1299l8351l6321l4725l3238l2346l2118
$$ 2680289 2634477 2588441 2542460 2498112 2456813 2418462 2382141 2347416 2314178 2281832 2249714
58641B249714l1581k9939k7648k5763k4749k4308k4042k3900k4052k4418k4446
$$ 2249714 2218133 2188194 2160546 2134783 2110034 2085726 2061684 2037784 2013732 1989314 1964868
58630A964868k3676k2519k1912k1924k1448j9684j7283j5250j3488j1254q589
$$ 1964868 1941192 1918673 1896761 1874837 1853389 1833705 1816422 1801172 1787684 1776430 1767841
58619A767841o251m491k791p48J481L539N023N570N308M949M832M356L032J580
$$ 1767841 1761590 1757099 1754308 1753560 1755041 1758580 1763603 1769173 1774481 1779430 1784262 1788618 1791650 1793230
58605A793230J035J193J006K12n57j127j992l016k973r37K479N538O833O399N769
$$ 1793230 1794265 1795458 1796464 1796676 1796119 1794992 1793000 1789984 1787011 1786074 1788553 1794091 1800924 1807323 1813092
58590A813092O638R133J1866J4081J6814K0888K4814K6393K6013K6380K8897L2201
$$ 1813092 1819730 1828863 1840729 1854810 1871624 1892512 1917326 1943719 1969732 1996112 2025009 2057210
58578B057210L4788L7242M0752M4875M8172N0377N2616N5886O0283O5565P1554
$$ 2057210 2091998 2129240 2169992 2214867 2263039 2313416 2366032 2421918 2482201 2547766 2619320
58567B619320P7889Q3944Q9292R4219R9707J06662J14877J23181J31166J40215
$$ 2619320 2697209 2781153 2870445 2964664 3064371 3171033 3285910 3409091 3540257 3680472
58557C680472J51612J63993J74412J82393J91048K03038K16885K28992K38141
$$ 3680472 3832084 3996077 4170489 4352882 4543930 4746968 4963853 5192845 5430986
58548E430986K45859K52546K55722K52763K43625K29521K10016J83029J47469
$$ 5430986 5676845 5929391 6185113 6437876 6681501 6911022 7121038 7304067 7451536
58539G451536J04776N7870R523l8087q3211j24591j61299j92151k15645k31013
$$ 7451536 7556312 7614182 7623705 7585618 7502407 7377816 7216517 7024366 6808721 6577708
58529F577708k39143k42011k41288k37791k31935k23933k13571k00668j86031
$$ 6577708 6338565 6096554 5855266 5617475 5385540 5161607 4948036 4747368 4561337
58520D561337j71286j57387j43914j30377j17466j06288r6839q8261q0402p4052
$$ 4561337 4390051 4232664 4088750 3958373 3840907 3734619 3637780 3549519 3469117 3395065
58510C395065o9554o6153o3180o0971n9994n9619n8571n6431n3979n2000n0417
$$ 3395065 3325511 3259358 3196178 3135207 3075213 3015594 2957023 2900592 2846613 2794613 2744196
58499B744196m8801m7185m5914m4916m3843m2857m2587m2961m2758m1021l8494
$$ 2744196 2695395 2648210 2602296 2557380 2513537 2470680 2428093 2385132 2342374 2301353 2262859
58488B262859l6831l6502l6367l5336l3509l1480k9507k7858k7024k6835k6095
$$ 2262859 2226028 2189526 2153159 2117823 2084314 2052834 2023327 1995469 1968445 1941610 1915515
58477A915515k4002k1320j9293j7888j6190j4189j2938j2813j2704j1360q875
$$ 1915515 1891513 1870193 1850900 1833012 1816822 1802633 1789695 1776882 1764178 1752818 1743943
58466A743943o468n243n436o493p492p634o705n199m123m458o412r017j0848j1345
$$ 1743943 1737475 1732232 1726796 1720303 1712811 1705177 1698472 1693273 1689150 1684692 1678280 1669263 1658415 1647070
58452A647070j1091j0794j0622j0731j1413j2155j1588r268o858o370p686q915
$$ 1647070 1635979 1625185 1614563 1603832 1592419 1580264 1568676 1559408 1552550 1546180 1538494 1529579
58440A529579q793p630o193m909m091l718l070j606j68n4r20j148l43M1q41j738
$$ 1529579 1520786 1513156 1506963 1502054 1497963 1494245 1491175 1489569 1489401 1489347 1488427 1487279 1486936 1486977 1486136 1484398
58424A484398j278j32j9j260k578k944k532k021j815j941k176k159j796j417j376
$$ 1484398 1483120 1482988 1482969 1481709 1479131 1476187 1473655 1471634 1469819 1467878 1465702 1463543 1461747 1460330 1458954
58409A458954j605j725j410o08J85j8j639l454l447j201J463K780L104L919N498
$$ 1458954 1457349 1455624 1454214 1453606 1453791 1453773 1452134 1448680 1445233 1444032 1445495 1448275 1451379 1455298 1460796
58394A460796O835P438P865Q415Q390P171N152L225J843R46L44k40j010j665j569
$$ 1460796 1467631 1475069 1482934 1491349 1499739 1506910 1512062 1515287 1517130 1518076 1518420 1518180 1517170 1515505 1513936
58379A513936q31n99j600k813k620j237q17k668n321o187m540k030n98p55j716
$$ 1513936 1513105 1512506 1510906 1508093 1505473 1504236 1503419 1500751 1495430 1489243 1484703 1482673 1482075 1481320 1479604
58364A479604k304j747l50O48N33K30J031K578L402L477M517P217R826J0523R897
$$ 1479604 1477300 1475553 1475203 1475851 1476384 1476614 1477645 1480223 1483625 1487102 1491619 1498836 1508662 1519185 1529082
58349A529082R847J1015J2566J3759J4417J4478J4290J4737J5961J6640J5753
$$ 1529082 1538929 1549944 1562510 1576269 1590686 1605164 1619454 1634191 1650152 1666792 1682545
58338A682545J4340J4041J4541J4278J3188J2695J2995J2488J0347P860O400N626
$$ 1682545 1696885 1710926 1725467 1739745 1752933 1765628 1778623 1791111 1801458 1809318 1815718 1821344
58326A821344M593L341K369J523M18o51j092q31j74P02J627K226K286K083K107
$$ 1821344 1825937 1829278 1831647 1833170 1833588 1832937 1831845 1831014 1830840 1831542 1833169 1835395 1837681 1839764 1841871
58311A841871K826M608P301R852J1152J1332J1468J1932J1982J1327J1102J2544
$$ 1841871 1844697 1849305 1856606 1866458 1877610 1888942 1900410 1912342 1924324 1935651 1946753 1959297
58299A959297J5219J7256J7180J5302J3388J3052J4173J5130J4807J3931J3859
$$ 1959297 1974516 1991772 2008952 2024254 2037642 2050694 2064867 2079997 2094804 2108735 2122594
58288B122594J4555J4717J3730J2318J1363J1012J1103J1587J2365J3386J4797
$$ 2122594 2137149 2151866 2165596 2177914 2189277 2200289 2211392 2222979 2235344 2248730 2263527
58277B263527J6464J7678J8128J8704K0267K2096K2869K2827K3512K5554K8149
$$ 2263527 2279991 2297669 2315797 2334501 2354768 2376864 2399733 2422560 2446072 2471626 2499775
58266B499775L0502L2255L2733L1669L0610L1545L3835L4585L2604K9926K8755
$$ 2499775 2530277 2562532 2595265 2626934 2657544 2689089 2722924 2757509 2790113 2820039 2848794
58255B848794K8969K9684L1139L3516L5588L6208L6047L6353L6983L7069L6732
$$ 2848794 2877763 2907447 2938586 2972102 3007690 3043898 3079945 3116298 3153281 3190350 3227082
58244C227082L6820L7489L8231L8835L9498M0540M2597M6315N1096N5029N6921
$$ 3227082 3263902 3301391 3339622 3378457 3417955 3458495 3501092 3547407 3598503 3653532 3710453
58233C710453N7712N9127O1670O4634O7322O9465P1034P2265P3451P4398P4726
$$ 3710453 3768165 3827292 3888962 3953596 4020918 4090383 4161417 4233682 4307133 4381531 4456257
58222D456257P4825P5718P7878Q1134Q5593R1260R6877J00909J04032J08695J15655
$$ 4456257 4531082 4606800 4684678 4765812 4851405 4942665 5039542 5140451 5244483 5353178 5468833
58211E468833J22784J28107J32271J37068J43261J50895J59993J69612J77759
$$ 5468833 5591617 5719724 5851995 5989063 6132324 6283219 6443212 6612824 6790583
58202F790583J83745J89545J97536K07769K18360K27786K35996K44259K54280
$$ 6790583 6974328 7163873 7361409 7569178 7787538 8015324 8251320 8495579 8749859
58193H749859K66549K79436K91233L02845L16541L32305L47961L62966L79190
$$ 8749859 9016408 9295844 9587077 9889922 10206463 10538768 10886729 11249695 11628885
58184A1628885L97402M16165M35160M56289M80181N04805N29238N55706N86032
$$ 11628885 12026287 12442452 12877612 13333901 13814082 14318887 14848125 15403831 15989863
58175A5989863O19189O54292O92872P35819P81127Q27165Q75434R27703R83528
$$ 15989863 16609052 17263344 17956216 18692035 19473162 20300327 21175761 22103464 23086992
58166B3086992J043084J109201J183489J263094J344150J425879J509309J595888
$$ 23086992 24130076 25239277 26422766 27685860 29030010 30455889 31965198 33561086
58158C3561086J690399J801306J934446K089847K267573K471574K703119K955602
$$ 33561086 35251485 37052791 38987237 41077084 43344657 45816231 48519350 51474952
58150E1474952L222182L505095L811818M145693M506774M899222N332554N819416
$$ 51474952 54697134 58202229 62014047 66159740 70666514 75565736 80898290 86717706
58142H6717706O377203P025651P773596Q610123R514098J0468689J1466811J2523155
$$ 86717706 93094909 100120560 107894156 116504279 126018377 136487066 147953877 160477032
58134A60477032J3703166J5135561J6976289J9346837K2269669K5555593K8629011
$$ 160477032 174180198 189315759 206292048 225638885 247908554 273464147 302093158
58127C02093158L0462270K9865231K6097537J9373288J0816227J889870o231422
$$ 302093158 332555428 362420659 388518196 407891484 418707711 420597581 414366159
58120D14366159j2932814j8055633k1676562k3962317k5109269k5312705k4750304
$$ 414366159 401433345 383377712 361701150 337738833 312629564 287316859 262566555
58113B62566555k3585196k1975148k0071581j8012833j5920910j3896679j2008467
$$ 262566555 238981359 217006211 196934630 178921797 163000887 149104208 137095741
58106A37095741j0286554q736433p357689o144550n075516m128734l328440k764967
$$ 137095741 126809187 118072754 110715065 104570515 99494999 95366265 92037825 89272858
58098H9272858k535354k643954k968793l337807l637846l851470m009386m130555
$$ 89272858 86737504 84093550 81124757 77786950 74149104 70297634 66288248 62157693
58090F2157693m204893m208955m124141l947557l695872l398335l082670k768045
$$ 62157693 57952800 53743845 49619704 45672147 41976275 38577940 35495270 32727225
58082C2727225k468977k197838j960397j754216j575084j421607j291756j180058
$$ 32727225 30258248 28060410 26100013 24345797 22770713 21349106 20057350 18877292
58074A8877292j081754r96380r24230q62323q06587p55226p07456o61597o17100
$$ 18877292 17795538 16799158 15874928 15012605 14206018 13450792 12743336 12081739 11464639
58065A1464639n75899n39257n05186m71144m37307m05248l75576l48753l26018
$$ 11464639 10888740 10349483 9844297 9373153 8935846 8530598 8155022 7806269 7480251
58056G480251l07414k90675k74052k58349k44591k31749k18733k06478j95878
$$ 7480251 7172837 6882162 6608110 6349761 6105170 5873421 5654688 5448210 5252332
58047E252332j85578j74097j62516j52653j44006j34804j25035j16280j09274
$$ 5252332 5066754 4892657 4730141 4577488 4433482 4298678 4173643 4057363 3948089
58038C948089j03591r8914r4905r0517q5116p9635p5317p1988o8821o5953o3992
$$ 3948089 3844498 3745584 3650679 3560162 3475046 3395411 3320094 3248106 3179285 3113332 3049340
58027C049340o2649o1126n9240n7155n4717n1929m9281m6944m4527m2197m0677
$$ 3049340 2986691 2925565 2866325 2809170 2754453 2702524 2653243 2606299 2561772 2519575 2478898
58016B478898l9577l7412l4237l2333l2869l3697l2254k9168k6925k6192k5644
$$ 2478898 2439321 2401909 2367672 2335339 2302470 2268773 2236519 2207351 2180426 2154234 2128590
58005B128590k4632k3750k3021k1557j9267j7318j6603j6661j6456j5623j4885
$$ 2128590 2103958 2080208 2057187 2035630 2016363 1999045 1982442 1965781 1949325 1933702 1918817
57994A918817j5404j7291j8848j8197j5721j3634j2916j2362j1175j0502j1141
$$ 1918817 1903413 1886122 1867274 1849077 1833356 1819722 1806806 1794444 1783269 1772767 1761626
57983A761626j1667j0569q824q397r068q656n931j848J661L063J987l58k141k960
$$ 1761626 1749959 1739390 1730566 1722169 1713101 1704445 1698514 1696666 1698327 1701390 1703377 1703019 1700878 1697918
57969A697918l903n073m951l311k647m713p454p863o395n846o798p301o640o379
$$ 1697918 1694015 1688942 1683991 1680680 1678033 1673320 1665866 1658003 1651608 1645762 1638964 1631663 1625023 1618644
57955A618644p342q283q217p890q111q431q288q032q118q496r198j0403j1563
$$ 1618644 1611302 1603019 1594802 1586912 1578801 1570370 1562082 1554050 1545932 1537436 1528238 1517835 1506272
57942A506272j1582j0186q154o121m308l327l830n117n455m228k614j749j311
$$ 1506272 1494690 1484504 1476350 1470229 1465921 1462594 1458764 1453647 1448192 1443964 1441350 1439601 1438290
57929A438290n37L22K63j184l264m443l742j865n19k50R2J124J519J23j708j883
$$ 1438290 1437753 1438075 1438338 1437154 1433890 1429447 1425705 1423840 1423321 1423071 1423163 1424287 1425806 1425929 1424221 1422338
57913A422338p79n30j700k987l900n166o384n986m124l128m200n889o801p518
$$ 1422338 1421559 1421029 1419329 1416342 1412442 1407276 1400892 1394906 1390782 1387654 1383454 1377565 1370764 1363246
57899A363246q583q825p419n750n390n691n223m305m191m726m774m192l534k466
$$ 1363246 1354663 1345838 1338419 1332669 1327279 1321588 1316365 1312060 1307869 1303143 1298369 1294177 1290643 1288177
57885A288177l77J784K228R14k36J67J623K961L576L257K075P71K43L06j56j515
$$ 1288177 1287800 1289584 1291812 1292726 1292490 1292657 1294280 1297241 1300817 1304074 1306149 1306920 1307163 1307469 1307313 1305798
57869A305798k886l618m342n854p619q226p179n618m996n328n030k812M70K462
$$ 1305798 1302912 1299294 1294952 1289098 1281479 1273253 1266074 1260456 1255460 1250132 1245102 1242290 1242760 1245222
57855A245222J969K71o54m35l5J88Q37K031K938L093L248M273N939P284P744P405
$$ 1245222 1247191 1247462 1246808 1246373 1246338 1246526 1247363 1249394 1252332 1255425 1258673 1262946 1268885 1276169 1283913 1291318
57839A291318O588N618M803M175L505K790K354K118J156j352m835p641q674q314
$$ 1291318 1297906 1303524 1308327 1312502 1316007 1318797 1321151 1323269 1324425 1323073 1318238 1310597 1301923 1293609
57825A293609p577o966o397n738m981m079l137k550k486k405j725q77r73k139
$$ 1293609 1286032 1279066 1272669 1266931 1261950 1257871 1254734 1252184 1249698 1247293 1245568 1244691 1243718 1241579
57811A241579l006k287k87J828L638N472P181P986P664O987O659O484N938M956
$$ 1241579 1238573 1236286 1235999 1237827 1241465 1246937 1254118 1262104 1269768 1276755 1283414 1289898 1295836 1300792
57797A300792L769K438R90k87j096j435j502j449j524k054l044m117n081o296
$$ 1300792 1304561 1306999 1307989 1307702 1306606 1305171 1303669 1302220 1300696 1298642 1295598 1291481 1286400 1280104
57783A280104q021r638r947q411n977m452m932o683p826p289n844m903m829n064
$$ 1280104 1272083 1262445 1252498 1244087 1238110 1233658 1228726 1222043 1214217 1206928 1201084 1196181 1191352 1186288
57769A186288n470o299o994o416m716l703m557o217o994o819o729o923o819o668
$$ 1186288 1180818 1174519 1167525 1161109 1156393 1152690 1148133 1141916 1134922 1128103 1121374 1114451 1107632 1100964
57755A100964p390q734r017p234m399k244j414j365j283n70R45K724L921M479
$$ 1100964 1093574 1084840 1075823 1068589 1064190 1061946 1060532 1059167 1057884 1057314 1058259 1060983 1064904 1069383
57741A069383N294O748P749O941M537K166J039Q82O92n2j071j724j643j025k95
$$ 1069383 1074677 1081425 1089174 1096115 1100652 1102818 1103857 1104739 1105431 1105379 1104308 1102584 1100941 1099916 1099621
57726A099621N95K219M630O621O807N423M160L938L723K243K33k98J050K184J136
$$ 1099621 1100216 1102435 1107065 1113686 1120493 1125916 1130076 1134014 1137737 1139980 1140213 1139915 1140965 1143149 1144285
57711A144285j366k936k610j720j739k481k949k930k805k372r71J270L244M058
$$ 1144285 1142919 1139983 1137373 1135653 1133914 1131433 1128484 1125554 1122749 1120377 1119406 1120676 1123920 1127978
57697A127978L855L312K924K987L624M501M978M943M945N280N508N331N363O241
$$ 1127978 1131833 1135145 1138069 1141056 1144680 1149181 1154159 1159102 1164047 1169327 1174835 1180166 1185529 1191770
57683A191770P444P915P639P547P866P694O618N677N923O865P446P858R171J1235
$$ 1191770 1199214 1207129 1214768 1222315 1230181 1237875 1244493 1250170 1256093 1262958 1270404 1278262 1287433 1298668
57669A298668J2452J2023J1268J1880J3660J4897J4586J3328J2364J2581J4283
$$ 1298668 1311120 1323143 1334411 1346291 1359951 1374848 1389434 1402762 1415126 1427707 1441990
57658A441990J6947J9193J9963J9928K0758K2676K3920K3324K2309K3135K5899
$$ 1441990 1458937 1478130 1498093 1518021 1538779 1561455 1585375 1608699 1631008 1654143 1680042
57647A680042K8685L0437L2136L4925L8432M1621M4281M6928M9837N2905N6031
$$ 1680042 1708727 1739164 1771300 1806225 1844657 1886278 1930559 1977487 2027324 2080229 2136260
57636B136260N9081O1977O5284P0052P6391Q2708Q7316R0528R4420J00649J09265
$$ 2136260 2195341 2257318 2322602 2392654 2469045 2551753 2639069 2729597 2824017 2924666 3033931
57625C033931J19370J29955J40094J49432J58764J69319J81120J92848K03615
$$ 3033931 3153301 3283256 3423350 3572782 3731546 3900865 4081985 4274833 4478448
57616D478448K13955K24392K33846K40143K41619K37452K27079K10255J87254
$$ 4478448 4692403 4916795 5150641 5390784 5632403 5869855 6096934 6307189 6494443
57607F494443J57958J21029P5391K2915l1434q2452j27062j63827j91783k10962
$$ 6494443 6652401 6773430 6848821 6871736 6840302 6757850 6630788 6466961 6275178 6064216
57597F064216k23078k30159k32580k29539k21285k09590j95856j80186j62788
$$ 6064216 5841138 5610979 5378399 5148860 4927575 4717985 4522129 4341943 4179155
57588D179155j45182j28975j14352j00696q8182p7584o8839o0906n2935m4642
$$ 4179155 4033973 3904998 3790646 3689950 3601768 3524184 3455345 3394439 3341504 3296862
57578C296862l5671k5808j5828o935R25Q958J7412K4870L0476L5549M2005N0164
$$ 3296862 3261191 3235383 3219555 3212620 3213545 3222503 3239915 3264785 3295261 3330810 3372815 3422979
57566C422979N9233O8850P8792Q7980R5612J02788J11299J20984J30120J38307
$$ 3422979 3482212 3551062 3629854 3717834 3813446 3916234 4027533 4148517 4278637 4416944
57556D416944J46838J55699J62275J64073J61208J55008J45484J31375J11669
$$ 4416944 4563782 4719481 4881756 5045829 5207037 5362045 5507529 5638904 5750573
57547E750573Q5955N4438J8961j6896n0222q0670j08810j33624j53362j68177
$$ 5750573 5836528 5890966 5909927 5893031 5842809 5762139 5653329 5519705 5366343 5198166
57537E198166j79744j88388j92646j92045j88433j83668j77497j68778j57809
$$ 5198166 5018422 4830034 4637388 4445343 4256910 4073242 3895745 3726967 3569158
57528C569158j46313j35717j26334j17845j09851j02077r4500q7220q0102p2900
$$ 3569158 3422845 3287128 3160794 3042949 2933098 2831021 2736521 2649301 2569199 2496299
57518B496299o5881n9837n5242n1703m8306m4265l9370l4347l0649k9080k8569
$$ 2496299 2430418 2370581 2315339 2263636 2215330 2171065 2131695 2097348 2066699 2037619 2009050
57507B009050k7086k3847j9816j5980j2322q857o545o163o980p363o370m121j220
$$ 2009050 1981964 1958117 1938301 1922321 1909999 1901142 1894597 1888434 1881454 1874091 1867721 1863600 1862380
57494A862380J593L729N440P839J1520J5558J8579K0461K2180K4162K5749K6352
$$ 1862380 1863973 1867702 1873142 1880981 1892501 1908059 1926638 1947099 1969279 1993441 2019190 2045542
57482B045542K6559K7874L1581L7614M4269M9372N2326N4661N8064O2234O5605
$$ 2045542 2072101 2099975 2131556 2169170 2213439 2262811 2315137 2369798 2427862 2490096 2555701
57471B555701O7896P0832P6031Q3148R0575R7314J03519J09590J15514J21042
$$ 2555701 2623597 2694429 2770460 2853608 2944183 3041497 3145016 3254606 3370120 3491162
57461C491162J25988J30069J32614J32687J29524J22897J12999R9934Q3360O2747
$$ 3491162 3617150 3747219 3879833 4012520 4142044 4264941 4377940 4477874 4561234 4623981
57451D623981L8141J0828j6792m2198o3985q2296r7981j11372j21925j28939j32341
$$ 4623981 4662122 4672950 4656158 4613960 4549975 4467679 4369698 4258326 4136401 4007462 3875121
57440C875121j32808j31265j28278j23732j17155j08569r8916q9365q0452p2233
$$ 3875121 3742313 3611048 3482770 3359038 3241883 3133314 3034398 2945033 2864581 2792348
57430B792348o4872n8352n1888m4529l6520k9203k3368j8434j3413p882j755M916
$$ 2792348 2727476 2669124 2617236 2572707 2536187 2506984 2483616 2465182 2451769 2443887 2442132 2447048
57418B447048J1433J6674K0462K4041K8585L3973L9517M5022N0440N5484O0439
$$ 2447048 2458481 2475155 2495617 2519658 2548243 2582216 2621733 2666755 2717195 2772679 2833118
57407B833118O6361P3401Q0006Q5097R0016R6479J03486J08358J10515J11778
$$ 2833118 2899479 2972880 3052886 3137983 3227999 3324478 3427964 3536322 3646837 3758615
57397C758615J12675J10910J04455R3931Q0448O2903L9662J2032j5957m1270o3834
$$ 3758615 3871290 3982200 4086655 4180586 4261034 4323937 4363599 4375631 4359674 4318404 4254570
57386D254570q4730j03858j20040j32582j41807j48145j51266j50498j46142j39995
$$ 4254570 4169840 4065982 3945942 3813360 3671553 3523408 3372142 3221644 3075502 2935507
57376B935507j33987j28431j22107j14159j05218r6535q8728q1753p5303o8717
$$ 2935507 2801520 2673089 2550982 2436823 2331605 2235070 2146342 2064589 1989286 1920569
57366A920569o1345n3746m7819m4638m2684l9394l4296k9251k5604k2513j8732
$$ 1920569 1859224 1805478 1757659 1713021 1670337 1630943 1596647 1567396 1541792 1519279 1500547
57355A500547j4847j2646j2775j4041j4804j4263j2417r738p160n869o369p800
$$ 1500547 1485700 1473054 1460279 1446238 1431434 1417171 1404754 1395016 1387856 1381987 1375618 1367818
57343A367818q594p986o793o523p644q922q691o659m168k621k103j819j362r69
$$ 1367818 1359224 1351238 1344445 1337922 1330278 1321356 1312665 1306006 1301838 1299217 1297114 1295295 1293933 1292964
57329A292964p55m83o7L52R73K281M176N835O856P743Q764R128Q272P211P375
$$ 1292964 1292209 1291726 1291659 1292011 1292984 1295265 1299441 1305276 1312132 1319875 1328639 1337767 1346039 1353250 1360625
57314A360625Q456Q955Q784R628J2092J4058J3237J0320Q213Q457R782J0219R447
$$ 1360625 1369081 1378036 1386820 1396448 1408540 1422598 1435835 1446155 1454368 1462825 1472607 1482826 1492273
57301A492273Q627Q674R336R780R627R288R319R606R513Q871Q424Q966J0393J1872
$$ 1492273 1500900 1509574 1518910 1528690 1538317 1547605 1556924 1566530 1576043 1584914 1593338 1602304 1612697 1624569
57287A624569J2687J2649J2041J1598J2322J4697J8072K1045K2472K2122K0692
$$ 1624569 1637256 1649905 1661946 1673544 1685866 1700563 1718635 1739680 1762152 1784274 1804966
57276A804966J9365J9011J9445J9643J8837J7224J5592J4672J4881J6117J7550
$$ 1804966 1824331 1843342 1862787 1882430 1901267 1918491 1934083 1948755 1963636 1979753 1997303
57265A997303J8282J8379J8635J9241J9641J9996K1477K4355K7113K8483K9312
$$ 1997303 2015585 2033964 2052599 2071840 2091481 2111477 2132954 2157309 2184422 2212905 2242217
57254B242217L1034L3262L4580L4995L5858L7484L8718L8872L8598L8539L8526
$$ 2242217 2273251 2306513 2341093 2376088 2411946 2449430 2488148 2527020 2565618 2604157 2642683
57243B642683L8468L8808L9771M1113M2778M4764M6491M7644M9471N3530N8922
$$ 2642683 2681151 2719959 2759730 2800843 2843621 2888385 2934876 2982520 3031991 3085521 3144443
57232C144443O2671O3484O3261O3952O4875O4529O3420O3156O3758O3787O2711
$$ 3144443 3207114 3270598 3333859 3397811 3462686 3527215 3590635 3653791 3717549 3781336 3844047
57221C844047O1366O0337N9320N8096N6831N5388N3438N1310M9629M8012M5173
$$ 3844047 3905413 3965750 4025070 4083166 4139997 4195385 4248823 4300133 4349762 4397774 4442947
57210D442947M0542L4937K9344K3940J8771J4573J2260J1815J2250J2583J2635
$$ 4442947 4483489 4518426 4547770 4571710 4590481 4605054 4617314 4629129 4641379 4653962 4666597
57199D666597J2904J3852J5408J7243J9474K2735K7370L2813L8164M3142M8080
$$ 4666597 4679501 4693353 4708761 4726004 4745478 4768213 4795583 4828396 4866560 4909702 4957782
57188D957782N3067N7681O1566O4749O7057O7695O6045O2813N9758N7797N5775
$$ 4957782 5010849 5068530 5130096 5194845 5261902 5329597 5395642 5458455 5518213 5576010 5631785
57177E631785N1991M6911M3475M3969M7270N0018N0337M9381M9412N1400N4868
$$ 5631785 5683776 5730687 5774162 5818131 5865401 5915419 5965756 6015137 6064549 6115949 6170817
57166F170817N9033O3347O7407P1035P4130P6137P6024P3277O8652O3625N9304
$$ 6170817 6229850 6293197 6360604 6431639 6505769 6581906 6657930 6731207 6799859 6863484 6922788
57155F922788N6111N4031N2696N1574N0469M9780M9812N0095M9914M9491N0192
$$ 6922788 6978899 7032930 7085626 7137200 7187669 7237449 7287261 7337356 7387270 7436761 7486953
57144G486953N3265N8508O4322O9070P2340P4843P7179P8886P8688P5608O9924
$$ 7486953 7540218 7598726 7663048 7732118 7804458 7879301 7956480 8035366 8114054 8189662 8259586
57133H259586O3366N8266N5812N4819N2808M8711M3997M0735L9275L8439L7154
$$ 8259586 8322952 8381218 8437030 8491849 8544657 8593368 8637365 8678100 8717375 8755814 8792968
57122H792968L4913L1354K6576K1551J7049J2417O613Lo265j2338j9355k6925
$$ 8792968 8827881 8859235 8885811 8907362 8924411 8936828 8943441 8943444 8937179 8924841 8905486 8878561
57110H878561l2807l5718l7020l8821m1608m4495m6729m8143m9006n0136n2483
$$ 8878561 8845754 8810036 8773016 8734195 8692587 8648092 8601363 8553220 8504214 8454078 8401595
57099H401595n6027n9691o2782o5780o9570p4808q2160r2033j03951j17448j33757
$$ 8401595 8345568 8285877 8223095 8157315 8087745 8012937 7930777 7838744 7734793 7617345 7483588
57088G483588j54792j79724k04290k24826k41895k58744k77188k96386l14962
$$ 7483588 7328796 7149072 6944782 6719956 6478061 6219317 5942129 5645743 5330781
57079E330781l32858l51186l71132l93274m17703m44765m75184n08964n44796
$$ 5330781 4997923 4646737 4275605 3882331 3464628 3019863 2544679 2035715 1490919
57070A490919n81735B88388c75098p09526p58091q11043q71939r41721j018220
$$ 1490919 909184 288388 -375098 -1084624 -1842715 -2653758 -3525697 -4467418 -5485638
57061e485638j100720j192127j295292j409997j535245j672218j823047j988805
$$ -5485638 -6586358 -7778485 -9073777 -10483774 -12019019 -13691237 -15514284 -17503089
57053a7503089k170640k371258k593770k840813l116068l424386l769054m151696
$$ -17503089 -19673729 -22044987 -24638757 -27479570 -30595638 -34020024 -37789078 -41940774
57045d1940774m576826n054115n594370o206402o900215p689712q586760r591460
$$ -41940774 -46517600 -51571715 -57166085 -63372487 -70272702 -77962414 -86549174 -96140634
57037i6140634j0689634j1862649j3107320j4455959j5974813j7723793j9695534
$$ -96140634 -106830268 -118692917 -131800237 -146256196 -162231009 -179954802 -199650336
57030a99650336k1780937k3787007k5488358k6688123k7283623k7312065k6913320
$$ -199650336 -221431273 -245218280 -270706638 -297394761 -324678384 -351990449 -378903769
57023c78903769k6192243k5084587k3365875k0806671j7325103j3011897q058509
$$ -378903769 -405096012 -430180599 -453546474 -474353145 -491678248 -504690145 -512748654
57016e12748654k695300K823849Q233877J3294700J7825682K1713343K4898483
$$ -512748654 -515443954 -512620105 -504386228 -491091528 -473265846 -451552503 -426654020
57009d26654020K7356005K9073315L0040709L0267106K9806103K8759528K7252955
$$ -426654020 -399298015 -370224700 -340183991 -309916885 -280110782 -251351254 -224098299
57002b24098299K5411421K3353902K1193279J9027568J6930817J4954795J3134703
$$ -224098299 -198686878 -175332976 -154139697 -135112129 -118181312 -103226517 -90091814
56995i0091814J1489506J0021856Q724653P587959O598939N740178M993937M347289
$$ -90091814 -78602308 -68580452 -59855799 -52267840 -45668901 -39928723 -34934786 -30587497
56987c0587497L790434L312032K899693K543630K236641J971434J741088J541384
$$ -30587497 -26797063 -23485031 -20585338 -18041708 -15805067 -13833633 -12092545 -10551161
56979a0551161J369847J222505J093774R79315Q77071P85560P02850O27217N57471
$$ -10551161 -9181314 -7958809 -6865035 -5885720 -5008649 -4223089 -3520239 -2893022 -2335551
56970b335551M92579M31752L74553L20277K68076K18562e5515H1472J05897P8593
$$ -2335551 -1842972 -1411220 -1036667 -716390 -448314 -229752 -55515 81472 187369 265962
56960B65962N4027L2434J3592k979j6427k5062k8575k8274k4785j7082m446J1712
$$ 265962 319989 352423 366015 363036 346609 321547 292972 264698 239913 222831 218385 230097
56948B30097K9105M7065O6663Q7976J07702J20044J20224J07354Q4400N6199K7692
$$ 230097 259202 306267 372930 460906 568608 688652 808876 916230 1000630 1056829 1084521
56937A084521K843j6443l0600m0878m7402m9354m6706m0616l2092k1586j0211
$$ 1084521 1087364 1070921 1040321 999443 952041 902687 855981 815365 783273 761687 751476
56926G51476nP828J3901J9189K3372K5357K4635K1617J7248J2836R386O619L422
$$ 751476 751471 759299 773200 792389 815761 841118 865753 887370 904618 917454 926840 933459 936881
56913I36881k50k991l964m016l961l076n55K689N167O963R303J2650J6682K1447
$$ 936881 936631 933640 929676 925660 921699 918623 918068 920757 925924 932887 942190 954840 971522 992969
56899I92969K6815L1164L2492L0774K7734K4383K0485J6444J3649J2333J0818
$$ 992969 1019784 1050948 1083440 1114214 1141948 1166331 1186816 1203260 1216909 1229242 1240060
56888A240060P856M347J870P63N75J213K379K910K108J207K146N115Q463J0815
$$ 1240060 1247916 1252263 1254133 1254896 1255471 1256684 1259063 1261973 1264081 1265288 1267434 1272549 1281012 1291827
56874A291827J2173J3099J3977J5098J6345J6530J4051Q749K330l449q328j2864
$$ 1291827 1304000 1317099 1331076 1346174 1362519 1379049 1393100 1401849 1404179 1400730 1392402 1379538
56862A379538j6967j9884k1293k1622k1412k0868j9996j8880j7744j6891j6336
$$ 1379538 1362571 1342687 1321394 1299772 1278360 1257492 1237496 1218616 1200872 1183981 1167645
56851A167645j5486j3628j1049r109q609q629p679n631l493j619O06L132M684
$$ 1167645 1152159 1138531 1127482 1118373 1109764 1101135 1093456 1087825 1084332 1082713 1083319 1086451 1091135
56838A091135M540L890M463O442Q639J0317J1912J4087J6979K0428K4319K8544
$$ 1091135 1095675 1099565 1104028 1110470 1119109 1129426 1141338 1155425 1172404 1192832 1217151 1245695
56826A245695L2912L6933L9499L9326L6464L2890L0643K9470K7329K3296J8878
$$ 1245695 1278607 1315540 1355039 1394365 1430829 1463719 1494362 1523832 1551161 1574457 1593335
56815A593335J6102J5291J5203J4677J3413J1725J0277R772J0381J1481J2429
$$ 1593335 1609437 1624728 1639931 1654608 1668021 1679746 1690023 1699795 1710176 1721657 1734086
56804A734086J3456J5490J9025K3306K6527K6985K4393K0099J5666J1305O240
$$ 1734086 1747542 1763032 1782057 1805363 1831890 1858875 1883268 1903367 1919033 1930338 1936578
56793A936578N48m426p876j0719j4021j6898j7173j4042r092m415n61L412Q449
$$ 1936578 1937126 1932700 1924824 1914105 1900084 1883186 1866013 1851971 1842879 1838464 1837903 1841315 1849764
56780A849764J4587K1151K7443L3261L8903M4406M8675M9740M6135L7994K6713
$$ 1849764 1864351 1885502 1912945 1946206 1985109 2029515 2078190 2127930 2174065 2212059 2238772
56769B238772J3873Q41j0913j9926k5674k9179l2039l4701l6037l4900l1738k8128
$$ 2238772 2252645 2253486 2242573 2222647 2196973 2167794 2135755 2101054 2065017 2030117 1998379 1970251
56757A970251k4879k1172j5758q542o69O647J2955J8484K3506K7684K9861K8623
$$ 1970251 1945372 1924200 1908442 1899900 1899231 1905878 1918833 1937317 1960823 1988507 2018368 2046991
56745B046991K3378J4833M542n824j4698k0900k4339k6151k7608k8941k9571k9187
$$ 2046991 2070369 2085202 2089744 2083920 2069222 2048322 2023983 1997832 1970224 1941283 1911712 1882525
56733A882525k7961k5830k2535j8518j4991j2532j0245o912k641J302M158O331
$$ 1882525 1854564 1828734 1806199 1787681 1772690 1760158 1749913 1743001 1740360 1741662 1745820 1752151
56721A752151Q314R532Q651M807j636r235j6123k0822k2948k3360k3378k3739
$$ 1752151 1760465 1769997 1778648 1783455 1781819 1772584 1756461 1735639 1712691 1689331 1665953 1642214
56709A642214k4192k3981k2705k0754j9012j8065j7531j6300j3681j0265p400
$$ 1642214 1618022 1594041 1571336 1550582 1531570 1513505 1495974 1479674 1465993 1455728 1448328
56698A448328n773m821l727k566k076k515l276l685l639l276k458j058M48J211
$$ 1448328 1442555 1437734 1434007 1431441 1429365 1426850 1423574 1419889 1416250 1412974 1410516 1409458 1409906 1411117
56684A411117Q53k20j355k131k314j795q23j7K06j6l86r60j856k704k917k483
$$ 1411117 1411970 1411750 1410395 1408264 1405950 1404155 1403332 1403315 1403521 1403505 1403119 1402159 1400303 1397599 1394682 1392199
56668A392199j981j788j745j671j630j518j074o50j276l312n541o404n751m678
$$ 1392199 1390218 1388430 1386685 1385014 1383384 1381866 1380792 1380142 1378866 1375554 1370013 1363609 1357858 1353180
56654A353180l938l473l248l389l380k360n84M19j54j127q35Q14K568L480L468
$$ 1353180 1349242 1345769 1342521 1339132 1335752 1333392 1332808 1333227 1333073 1331946 1331111 1331925 1334493 1337973 1341441
56639A341441K685J469O82J119K426L387L425L065K881K709K245J704J439J273
$$ 1341441 1344126 1345595 1346277 1347396 1349822 1353209 1356634 1359699 1362580 1365289 1367534 1369238 1370677 1371950
56625A371950P11l41j355j711j318q15j013k006k949k983k163j305j085j660k865
$$ 1371950 1372661 1372320 1370965 1369254 1367936 1367121 1366108 1364102 1361153 1358170 1356007 1354702 1353617 1351957 1349092
56610A349092m174m646l728k248j866l179m886n309m272l025k590k744k632j924
$$ 1349092 1344918 1340272 1336544 1334296 1332430 1329251 1324365 1319056 1314784 1311759 1309169 1306425 1303793 1301869
56596A301869j181j147j830k367j918o12N32O64j09q76p21N45K202L096K622J393
$$ 1301869 1300688 1299541 1297711 1295344 1293426 1292814 1293346 1294010 1293901 1293025 1292304 1292849 1295051 1298147 1300769 1302162
56580A302162P85J691L677N334N367L512O37j941l357l524k905k190k096k808
$$ 1302162 1302947 1304638 1308315 1313649 1319016 1322528 1323165 1321224 1317867 1314343 1311438 1309248 1307152 1304344
56566A304344l542l264k039j049r76j134p80l34n09r73j019r18j357j964j820
$$ 1304344 1300802 1297538 1295499 1294450 1293474 1292340 1291560 1291226 1290717 1289744 1288725 1287807 1286450 1284486 1282666
56551A282666j140r89j447j659j660k331l259k679k79J804J850O78k78j161k298
$$ 1282666 1281526 1280537 1279090 1277431 1275771 1273440 1270181 1267502 1267223 1269027 1270877 1271555 1271277 1270116 1267818
56536A267818k409m73J695J378r86k233j007N33L4k056l758m137l529k526j741
$$ 1267818 1265409 1264936 1266631 1268009 1267023 1264790 1263783 1264316 1264350 1262294 1258536 1254399 1250870 1248344 1246603
56521A246603j618j630o12J349K479J730N46R77K812M026L605K499J892J892K079
$$ 1246603 1244985 1243355 1242743 1244092 1246571 1248301 1248847 1249824 1252636 1256662 1260267 1262766 1264658 1266550 1268629
56506A268629K235K173J768J543K412M371O136O544N823M978M409L798L011K468
$$ 1268629 1270864 1273037 1274805 1276348 1278760 1283131 1289267 1295811 1301634 1306612 1311021 1314819 1317830 1320298
56492A320298K584L271M014M180L453K256J517J593J681Q80l80q42m08n17k031
$$ 1320298 1322882 1326153 1330167 1334347 1337800 1340056 1341573 1343166 1344847 1345727 1345347 1344505 1344097 1343580 1341549
56477A341549l737l967l054k897m261n822o131n321m355l585k849k289k100j964
$$ 1341549 1337812 1333845 1330791 1327894 1323633 1317811 1311680 1306359 1302004 1298419 1295570 1293281 1291181 1289217
56463A289217j564j413k243l670m333l493j836o83r02k572m900o402n901l767
$$ 1289217 1287653 1286240 1283997 1280327 1275994 1272501 1270665 1269982 1269080 1266508 1261608 1255206 1249305 1245538
56449A245538j689r32j280j833k144k202j969j536j265j231r32k22k5j245l202
$$ 1245538 1243849 1242917 1241637 1239804 1237660 1235458 1233489 1231953 1230688 1229457 1228525 1228303 1228278 1227033 1223831
56434A223831m141l499k654k981l884l508j107K038M055M349L797L436L320K736
$$ 1223831 1219690 1216191 1213537 1210556 1206672 1203164 1202057 1204095 1208150 1212499 1216296 1219732 1223052 1225788
56420A225788J306l73j228p10Q32K536L539L374K349J616K306M225N767N515L779
$$ 1225788 1227094 1226721 1225493 1224783 1225615 1228151 1231690 1235064 1237413 1239029 1241335 1245560 1251327 1256842 1260621
56405A260621K208J981K802L696M283M993O172P344P485O021L526J350N83J283
$$ 1260621 1262829 1264810 1267612 1271308 1275591 1280584 1286756 1294100 1301585 1307606 1311132 1312482 1313065 1314348
56391A314348K588L378K970J543K1p46p97q05r97q38j20K89n86k494m272n239
$$ 1314348 1316936 1320314 1323284 1324827 1324848 1324102 1323305 1322500 1321503 1320665 1320545 1320834 1320248 1317754 1313482 1308243
56375A308243n498n198m485m128n006o611p226o196m986n122n891n350l166j155
$$ 1308243 1302745 1297547 1293062 1288934 1283928 1277317 1270091 1263895 1258909 1253787 1247896 1242546 1239380 1238225
56361A238225r43k095l049l091k823k942l238k986k133j484j492j420m54O52K92
$$ 1238225 1237282 1235187 1232138 1229047 1226224 1223282 1220044 1217058 1214925 1213441 1211949 1210529 1210075 1210727 1211019
56346A211019j506k722k125j049j379k881l923l942l448k296N2K666L607K584
$$ 1211019 1209513 1206791 1204666 1203617 1202238 1199357 1195434 1191492 1188044 1185748 1185800 1188466 1192073 1194657
56332A194657J401J249J238K85j098j872j904j372K8K066L313K776J355M89J87
$$ 1194657 1196058 1197307 1198545 1198830 1197732 1195860 1193956 1192584 1192612 1194678 1197991 1200767 1202122 1202611 1202798
56317A202798k85n95K05J765K631K215J351Q73Q16R84J278J390J213J469K870
$$ 1202798 1202513 1201918 1202123 1203888 1206519 1208734 1210085 1210958 1211774 1212758 1214036 1215426 1216639 1218108 1220978
56302A220978M652N185M123K751K045J637J146J182K206L474M054M213M788N703
$$ 1220978 1225630 1230815 1234938 1237689 1239734 1241371 1242517 1243699 1245905 1249379 1253433 1257646 1262434 1268137
56288A268137N995N115L432J684M26pN50K092M447P004Q543P995N782L730L245
$$ 1268137 1274132 1279247 1282679 1284363 1284789 1284782 1285332 1287424 1291871 1298875 1307418 1315413 1321195 1324925 1328170
56273A328170M028M984N704O422P113P527P729P855P724P369P546Q766J0190J0645
$$ 1328170 1332198 1337182 1342886 1349308 1356421 1363948 1371677 1379532 1387256 1394625 1402171 1410937 1421127 1431772
56259A431772J0430J0904J2333J3561J3926J4035J4233J3826J2629J1885J2462
$$ 1431772 1442202 1453106 1465439 1479000 1492926 1506961 1521194 1535020 1547649 1559534 1571996
56248A571996J3341J3201J2542J2774J3850J4412J3845J2679J1273R749Q983R856
$$ 1571996 1585337 1598538 1611080 1623854 1637704 1652116 1665961 1678640 1689913 1699662 1708645 1718501
56236A718501J1334J1261R437Q124Q795J0174J0559J0368J1019J2666J4616J6908
$$ 1718501 1729835 1741096 1750533 1758657 1767452 1777626 1788185 1798553 1809572 1822238 1836854 1853762
56224A853762J9800K2559K4367K5814K7987L0699L3147L5673L9098M2818M5555
$$ 1853762 1873562 1896121 1920488 1946302 1974289 2004988 2038135 2073808 2112906 2155724 2201279
56213B201279M7717N1008N5755O0645O5327P0975P7769Q4118Q9352R5173J03006
$$ 2201279 2248996 2300004 2355759 2416404 2481731 2552706 2630475 2714593 2803945 2899118 3002124
56202C002124J11667J19301J26207J34062J43358J53383J63957J75238J86210
$$ 3002124 3113791 3233092 3359299 3493361 3636719 3790102 3954059 4129297 4315507
56193D315507J95053K01186K05583K08951K10714K09883K05880J98301J86790
$$ 4315507 4510560 4711746 4917329 5126280 5336994 5546877 5752757 5951058 6137848
56184F137848J71496J53033J31842J08178Q2862N7365L2767R064j4172l6687n7399
$$ 6137848 6309344 6462377 6594219 6702397 6785259 6842624 6875391 6884455 6870283 6833596 6776197
56173F776197p5372r0674j04002j15478j24317j30095j33934j37626j41706j45272
$$ 6776197 6700825 6610151 6506149 6390671 6266354 6136259 6002325 5864699 5722993 5577721
56163E577721j47673j49392j51013j52460j53601j54621j55274j54803j53084
$$ 5577721 5430048 5280656 5129643 4977183 4823582 4668961 4513687 4358884 4205800
56154D205800j50887j48348j44422j38661j32310j26547j20671j13468j05469
$$ 4205800 4054913 3906565 3762143 3623482 3491172 3364625 3243954 3130486 3025017
56145C025017r8306r2366q6651q0639p4825o9433o3962n8103n2108m6293m1075
$$ 3025017 2926711 2834345 2747694 2667055 2592230 2522797 2458835 2400732 2348624 2302331 2261256
56134B261256l7264l5158l3623l1195k7977k5224k3172k0727j7441j4392j2552
$$ 2261256 2223992 2188834 2155211 2124016 2096039 2070815 2047643 2026916 2009475 1995083 1982531
56123A982531j1369r679p256m801k866j291M43K494M369N594O716Q912J2174J4783
$$ 1982531 1971162 1961483 1954227 1949426 1946560 1945269 1945712 1948206 1952575 1958169 1964885 1973797 1985971 2000754
56109B000754J5458J5215J5967J8026K0293K2258K4139K5451K5238K3889K3023
$$ 2000754 2016212 2031427 2047394 2065420 2085713 2107971 2132110 2157561 2182799 2206688 2229711
56098B229711K3392K4290K5200K6422K7740K8057K7041K5829K5504K6043K7234
$$ 2229711 2253103 2277393 2302593 2329015 2356755 2384812 2411853 2437682 2463186 2489229 2516463
56087B516463K9410L2686L6513M0575M5106N0162N5693O2470P1403Q1614R1052
$$ 2516463 2545873 2578559 2615072 2655647 2700753 2750915 2806608 2869078 2940481 3022095 3113147
56076C113147R9466J08775J19397J28391J32885J33520J32439J29443J22760J12892
$$ 3113147 3212613 3321388 3440785 3569176 3702061 3835581 3968020 4097463 4220223 4333115
56066D333115J03002R5267Q8956Q2397P4945O6295N5527M2060K6745J1196l477
$$ 4333115 4436117 4531384 4620340 4702737 4777682 4843977 4899504 4941564 4968309 4979505 4976028
56055D976028j6691k7887l7068m5767n6594p1105q7984j03646j14862j20851j22861
$$ 4976028 4959337 4931450 4894382 4848615 4792021 4720916 4632932 4529286 4414424 4293573 4170712
56044D170712j22254j19594j15254j09812j03439r5636q6148p5773o5829n7078
$$ 4170712 4048458 3928864 3813610 3703798 3600359 3504723 3418575 3342802 3276973 3219895
56034C219895m9346m1835l3776k5215j7341j1514p915n693m276l640l270k153
$$ 3219895 3170549 3128714 3094938 3069723 3052382 3040868 3032953 3027260 3022984 3019344 3016074 3013921
56022C013921k08J495K558M049O659R226J0357J0603J1651J3889J6149J7615J8646
$$ 3013921 3013713 3015208 3017766 3021815 3028474 3037700 3048057 3058660 3070311 3084200 3100349 3117964 3136610
56009C136610J9706K0694K1572K2730K4414K6351K8309L0513L3306L6628L9942
$$ 3136610 3156316 3177010 3198582 3221312 3245726 3272077 3300386 3330899 3364205 3400833 3440775
55998C440775M2683M4802M6776M8845N0495N1257N1857N3504N6020N7942N8834
$$ 3440775 3483458 3528260 3575036 3623881 3674376 3725633 3777490 3830994 3887014 3944956 4003790
55987D003790O0140O2947O6330O9035P1417P4219P6605P7465P7964Q0596Q5667
$$ 4003790 4063930 4126877 4193207 4262242 4333659 4407878 4484483 4561948 4639912 4720508 4806175
55976D806175R0824R4452R7693J02400J08628J15153J21214J26751J31752J36456
$$ 4806175 4896999 4991451 5089144 5191544 5300172 5415325 5536539 5663290 5795042 5931498
55966E931498J41802J48816J57655J67534J77337J86221J94289K02836K13106
$$ 5931498 6073300 6222116 6379771 6547305 6724642 6910863 7105152 7307988 7521094
55957G521094K24502K34875K43138K50685K59424K69311K79044K88598K99541
$$ 7521094 7745596 7980471 8223609 8474294 8733718 9003029 9282073 9570671 9870212
55948I870212L12741L27177L41641L56543L73158L91668M10983M30373M50431
$$ 9870212 10182953 10510130 10851771 11208314 11581472 11973140 12384123 12814496 13264927
55939A3264927M72222M96085N21756N49269N79234O12169O48051O86751P28569
$$ 13264927 13737149 14233234 14754990 15304259 15883493 16495662 17143713 17830464 18559033
55930A8559033P73839Q22061Q72239R24508R80878J043461J112155J185029J260828
$$ 18559033 19332872 20154933 21027172 21951680 22932558 23976019 25088174 26273203 27534031
55921B7534031J339909J422717J509336J601745J705023J824593J963068K121312
$$ 27534031 28873940 30296657 31805993 33407738 35112761 36937354 38900422 41021734
55913D1021734K301181K504703K731114K977822L244962L536763L858002M211229
$$ 41021734 43322915 45827618 48558732 51536554 54781516 58318279 62176281 66387510
55905F6387510M597945N020222N480450N982027O531615P140177P823089Q601866
$$ 66387510 70985455 76005677 81486127 87468154 93999769 101139946 108963035 117564901
55897A17564901R503705J0554823J1776333J3192984J4842580J6764496J8974663
$$ 117564901 127068606 137623429 149399762 162592746 177435326 194199822 213174485
55890B13174485K1448706K4088202K6615181K8438477K8680205K6503206K1593942
$$ 213174485 234623191 258711393 285326574 313765051 342445256 368948462 390542404
55883C90542404J4430914O104997k164152r458538j5318157j9664933k2644328
$$ 390542404 404973318 411078315 408914163 399455625 384137468 364472535 341828207
55876C41828207k4478882k5365807k5439636k4800235k3563464k1883750j9938633
$$ 341828207 317349325 291983518 266543882 241743647 218180183 196296433 176357800
55869A76357800j7899228j5905924j4053744j2390003j0925247r649051q540790
$$ 176357800 158458572 142552648 128498904 116108901 105183654 95534603 86993813
55862H6993813p575684o730691n988819n338389m770148m276215l849509l481627
$$ 86993813 79418129 72687438 66698619 61360230 56590082 52313867 48464358 44982731
55854D4982731l162175k881395k632266k409246k207284k023389j856993j707003
$$ 44982731 41820556 38939161 36306895 33897649 31690365 29666976 27809983 26102980
55846B6102980j570223j444075j328742j224827j130918j045454r69011r02220
$$ 26102980 24532757 23088682 21759940 20535113 19404195 18358741 17389730 16487510
55838A6487510q42905p87777p36225o90193o50900o17308n87315n58835n30290
$$ 16487510 15644605 14856828 14120603 13430410 12779510 12162202 11574887 11016052 10485762
55829A0485762n01432m73396m47115m22405l99143l77959l58751l39991l20678
$$ 10485762 9984330 9510934 9063819 8641414 8242271 7864312 7505561 7165570 6844892
55820F844892l01518k83040k64274k44875k26776k11671j98199j84004j69441
$$ 6844892 6543374 6260334 5996060 5751185 5524409 5312738 5114539 4930535 4761094
55811D761094j56914j47102j38202j28612j18330j07865r7728q9042q2835p8507
$$ 4761094 4604180 4457078 4318876 4190264 4071934 3964069 3866341 3777299 3694464 3615957
55801C615957p4467p0351o7347o6271o6630o7644o8920o9921o9819o8224o5456
$$ 3615957 3541490 3471139 3403792 3337521 3270891 3203247 3134327 3064406 2994587 2926363 2860907
55790B860907o2157n9174n7417n6922n6450n4804n2206m9566m6885m3468l9390
$$ 2860907 2798750 2739576 2682159 2625237 2568787 2513983 2461777 2412211 2365326 2321858 2282468
55779B282468l5632l2737l0175k7061k2895j7952j3392j0573r709r717r876j0718
$$ 2282468 2246836 2214099 2183924 2156863 2133968 2116016 2102624 2092051 2082342 2072625 2062749 2052031
55767B052031j2644j4754j6112j7268j9194k1565k3504k5351k8046l1128l2980
$$ 2052031 2039387 2024633 2008521 1991253 1972059 1950494 1926990 1901639 1873593 1842465 1809485
55756A809485l3071l2565l2546l2815l2579l1469k9647k7520k5408k3153k0394
$$ 1809485 1776414 1743849 1711303 1678488 1645909 1614440 1584793 1557273 1531865 1508712 1488318
55745A488318j7550j5662j4816j3733j1737r951r303q620o257k780k53M42j28
$$ 1488318 1470768 1455106 1440290 1426557 1414820 1404869 1395566 1386946 1380689 1377909 1377656 1378098 1377970
55732A377970j640l954n864o070n333n740p784j0013j1425j2156j1810r476n991
$$ 1377970 1376330 1372376 1366512 1360442 1355109 1349369 1341585 1331572 1320147 1307991 1296181 1286705 1280714
55719A280714l988m732o773q477j0109j2207j3818j3993j3687j4536j6422j7792
$$ 1280714 1276726 1271994 1265221 1256744 1246635 1234428 1220610 1206617 1192930 1178394 1161972 1144180
55707A144180j7837j7082j6167j5268j4598j4375j4190j3206j1218r102p948p992
$$ 1144180 1126343 1109261 1093094 1077826 1063228 1048853 1034663 1021457 1010239 1001137 993189 985197
55695I85197q598r205j0119j1938j4236j5498j4847j3279j2482j2921j3798j4343
$$ 985197 976599 967394 957275 945337 931101 915603 900756 887477 874995 862074 848276 833933
55683H33933j4110j2491r397o275n053n892p117p507p380p251o782n575l888k183
$$ 833933 819823 807332 797935 791660 786607 780715 773598 766091 758711 751460 744678 739103 735215 733032
55669G33032q84p60k246m120m375k945k020k832l758k818p02L01n84k123l104
$$ 733032 732148 731388 729142 725022 720647 717702 715682 712850 709092 706274 705572 705873 705289 703166 700062
55654G00062l327k926k197j943k623l155j962O54K431J937L78j45O99J443J086
$$ 700062 696735 693809 691612 689669 687046 683891 681929 682583 685014 686951 687329 687184 687883 689326 690412
55639F90412K72J26O78R65L77p20j610j909j453p8J972L818M734N030N569O468
$$ 690412 690684 690810 691488 692453 692830 692110 690500 688591 687138 687060 689032 692850 697584 702614 708183 714651
55623G14651O845O064M639L739L993M945N491M906L635K708K244J053j569m291
$$ 714651 721496 727560 732199 735938 739931 744876 750367 755273 758908 761616 763860 764913 763344 759053
55609G59053n105m007l086l693m799m738l566k765l117l783l524k292j282j390
$$ 759053 753948 749941 746855 743162 738363 733625 730059 727294 724177 720394 716870 714578 713296 711906
55595G11906j867j024J436L544L321J301l08o53j001k320l722l989l456l346l977
$$ 711906 710039 709015 710451 713995 717316 718617 718309 717656 716655 714335 710613 706624 703168 699822 695845
55580F95845m590m573m143m052m964o814q522q935q199p571p620p527o643n710
$$ 695845 691255 686682 682539 678487 673523 666709 658187 649252 641053 633482 625862 618335 611692 605982
55566F05982n645o008n798n245n565o989q242q249p432o812o509n814m533l580
$$ 605982 600337 594329 588531 583286 577721 570732 562490 554241 546809 539997 533488 527674 523141 519561
55552E19561l956n397o479o060m342k429j254j002j209j093k87N24K87o55n21
$$ 519561 515605 510208 503729 497669 493327 490898 489644 488642 487433 486340 486053 486577 486864 486209 485688
55537D85688J416L200K487k97k690l634m150m644l979j980o80j605l383l626k082
$$ 485688 487104 490304 492791 492494 489804 486170 482020 477376 473397 471417 470737 469132 465749 462123 460041
55522D60041l86M82Q65J058P96N8p82j550k218k443j982j235n52N81K633M629
$$ 460041 459655 460137 461002 462060 462856 462914 462132 460582 458364 455921 453939 452704 452152 452733 455366 459995
55506D59995N012L969L490M638N805M739J689o61n11P63M12k197n054o404o692
$$ 459995 465007 468976 472466 477104 482909 487648 489337 488676 488165 488928 489340 487143 482089 475685 468993
55491D68993o908o534m717k549j998k833k797j092M58M04l39n26o59j513k260
$$ 468993 462085 455551 450834 448285 446287 443454 440657 439565 440023 440427 440088 439562 438903 437390 435130
55476D35130j796n47O48K142M107M933L273P94L03J638K028M75q50j06J753K952
$$ 435130 433334 432787 433435 435577 439684 444617 447890 448684 448987 450625 452653 453128 452278 452172 453925 456877
55460D56877L258L136K230J85k074l271l386l292l370l377l332l607m390n522
$$ 456877 460135 463271 465501 465686 463612 460341 456955 453663 450293 446916 443584 439977 435587 430065
55446D30065o660p300o998o018n283n357n829o042n886n507m752l574k624k689
$$ 430065 423405 416105 409107 403089 397806 392449 386620 380578 374692 369185 364433 360859 358235 355546
55432C55546l525l873k854j007L77P17N32M27K40l72j023j017n01k54k98R5P22
$$ 355546 352021 348148 345294 344287 344664 345381 345913 346340 346580 346208 345185 344168 343667 343413 343115 343210 343932
55415C43932J48k008l725k894k52J510J039o62k211l130l241k420j418j486k610
$$ 343932 344080 342072 338347 335453 335201 336711 337750 337088 334877 331747 328506 326086 324668 323182 320572
55400C20572l281k543j158k01L47Q69J010K98p43j078m36N23R82N93l10p71p6
$$ 320572 317291 314748 313590 313389 313736 314605 315615 315913 315170 314092 313656 314179 315161 315754 315444 314673 314597
55383C14597J236J842J405R91J288J433M34j124j858j540j093r37n02N16J421
$$ 314597 315833 317675 319080 320071 321359 322792 323226 322102 320244 318704 317611 316674 316172 316688 318109
55368C18109J352K25j353k646l173k858k034j107k19O17J231J453J330R13O6j055
$$ 318109 319461 319686 318333 315687 312514 309656 307622 306515 306296 306913 308144 309597 310927 311840 311906 310851
55352C10851j599p62J111K685L050K442J530N59m45j132r89K6J246J705Q06j068
$$ 310851 309252 308490 309601 312286 315336 317778 319308 319867 319422 318290 317301 317327 318573 320278 321084 320016
55336C20016k543k302n85Q02L97j214k287k210j927k097j997r04N41J370J876
$$ 320016 317473 315171 314586 315388 315785 314571 312284 310074 308147 306050 304053 303149 303690 305060 306936
55321C06936K820L576K633j2k472l362l139k514j084J292L017K243o63l390m154
$$ 306936 309756 313332 315965 315953 313481 310119 306980 304466 303382 304674 307691 309934 309271 305881 301727
55306C01727l028j243k39q96k631l554k548q03j22k71L29J667J926N33o04Q6J465
$$ 301727 298699 297456 297217 296321 293690 290136 287588 286785 286663 286392 286721 288388 290314 290847 290243 290329 291794
55289B91794J401j86j527j642j345j613k144j900o21P60J162O79L94Q08J074L99
$$ 291794 293195 293009 291482 289840 288495 286882 284738 282838 282217 282977 284139 284818 285212 286020 287094 287493
55273B87493l83J78J798K567J528k49j630k964m767o057n395k950m64O03K06n68
$$ 287493 287110 287288 289086 291653 293181 292932 291302 288338 283571 277514 272119 269169 268705 269308 269514 268946
55257B68946l96J123K717K540N51j172j220p63j469k627k228k53J191J053O77
$$ 268946 268550 269673 272390 274930 275481 274309 273089 272326 270857 268230 266002 265749 266940 267993 268670
55242B68670J306K075J550Lj184j532j508j015O58L115M448L340R35m15RO42j9
$$ 268670 269976 272051 273601 273604 272420 270888 269380 268365 269023 272138 276586 279926 280861 280446 280455 281097 281078
55225B81078j532k526k621k207j043J320L753M025J716q17j390n67j42l54l05
$$ 281078 279546 277020 274399 272192 271149 272469 276222 280247 281963 281146 279756 279189 279047 278693 278388
55210B78388k24j131k455k136L38K770L039J739R33J258J478N39j175k602l255
$$ 278388 278164 277033 274578 272442 272780 275550 278589 280328 281261 282519 283997 284536 283361 280759 277504
55195B77504l262k699j316P77K492K411M59j599k057j312j186k269l056k072K2
$$ 277504 274242 271543 270227 271004 273496 275907 276366 274767 272710 271398 270212 267943 264887 262815 262837
55180B62837J215N92o61o95Q88K444K033j91j840j100R30J744P65k99l60k67p14
$$ 262837 264052 264644 263983 263288 264176 266620 268653 268462 266622 265522 266452 268196 268961 268662 268302 268035 267321
55163B67321o88N96J773J067r02j853j011K50P04N30J84m35j099r20L89J813K165
$$ 267321 266633 267229 269002 270069 269167 267314 266303 266553 267257 267787 267971 267536 266437 265517 265906 267719 269884
55146B69884J346J44o05m66K05L15o88j602p63J356K253O57j836l110l012k419
$$ 269884 271230 271374 270769 270303 270508 270823 270135 268533 267770 269126 271379 272036 270200 267090 264078 261659
55130B61659j403J92J435J479J141J606K167J265o83j663j173p67j221j423o98
$$ 261659 260256 260448 261883 263362 264503 266109 268276 269541 268858 267195 266022 265255 264034 262611 261913
55115B61913q9l15m24K21L61j084k819k886j539n36l48K0Q43J189O60j9k62j98
$$ 261913 261824 261509 261085 261306 261667 260583 257764 254878 253339 252803 252455 252475 253318 254507 255167 255148 254886 254688
55097B54688O0M90M53p00k195k306o88R52J027o6q25m69O29J652J938J314K93
$$ 254688 254748 255238 255691 254991 252796 250490 249802 250754 251781 251715 250890 250421 251050 252702 254640 255954 256247
55080B56247l84n49n11l33J13M41O1q01j228r30n49n29n92m92k14O23K319L840
$$ 256247 255863 255314 254803 254470 254583 255024 255085 254284 253056 252126 251577 251048 250456 249964 249750 250373 252692 256532
55062B56532L467J275m85k31R99J483J263J369J769J701J293J277J506J236N56
$$ 256532 259999 261274 260789 260558 261557 263040 264303 265672 267441 269142 270435 271712 273218 274454 275010
55047B75010J85J94K13O36J976L217K551N0k090k537k446l198l962k949k97J886
$$ 275010 275195 275389 275602 276238 278214 281431 283982 284032 281942 279405 276959 273761 269799 266850 266553 268439
55031B68439K215J543J395J875J829P51l21j92P70J048J67m84M33K167K762J623
$$ 268439 270654 272197 273592 275467 277296 278047 277726 277534 278304 279352 279519 279035 279468 281635 284397 286020
55015B86020J88p9O47J216R90K01o74j250j267p30M9P05J002Q52M65M34J121J877
$$ 286020 286208 286129 286776 287992 288982 289183 288509 287259 285992 285262 285311 286016 287018 287870 288335 288769 289890 291767
54997B91767J475l97k595l821l976l776l450k504p71R06J283q1k284l670l132
$$ 291767 293242 292845 290250 286429 282453 278677 275227 272723 271952 272858 274141 274060 271776 268106 264974
54982B64974j049J019J627O13q52j219K14K608M064L233P44j241j171L59J482
$$ 264974 263925 264944 266571 267184 266332 265113 265327 267935 271999 275232 275976 274735 273564 273923 275405
54967B75405J265N99Q03J833K354J498j3q19o46n01j142k024k088j116J93J129
$$ 275405 276670 277269 278072 279905 282259 283757 283744 282925 282279 281778 280636 278612 276524 275408 275601 276730
54951B76730J375Q11l31j206r98mO56N88O69J543K332J784K62n07J33P57j68k021
$$ 276730 278105 278916 278585 277379 276381 276377 277033 277621 278290 279833 282165 283949 284211 283704 283837 284594 284426 282405
54933B82405k744j512L95J423J458J213Q59J18p93j323j508j803k017j511n75
$$ 282405 279661 278149 278544 279967 281425 282638 283497 283615 282822 281499 279991 278188 276171 274660 274085
54918B74085n25j814k952k167L93K838L571K483N30j081j440l84J379K937L853
$$ 274085 273560 271746 268794 266627 267020 269858 273429 275912 276442 275361 273921 273537 274916 277853 281706
54903B81706M152M046M023M503M948M076J755l9N74K740L821K860J552J547K405
$$ 281706 285858 289904 293927 298430 303378 307454 309209 309170 309744 312484 316305 319165 320717 322264 324669
54888C24669K916L167M148O090Q227R935J1130J1778J1649J0677R186P667O398
$$ 324669 327585 330752 334900 340990 349217 359152 370282 382060 393709 404386 413572 421239 427637
54875D27637N148L292N68k329m440n810p341r207j0293r725q278p469p766q400
$$ 427637 432785 436077 436645 434316 429876 424066 416725 407518 397225 387500 379222 371753 363987 355587
54861C55587q635q468q149p631o588m813k603q05r1n9L73J414J985J381O32J236
$$ 355587 346952 338484 330335 322704 316116 311303 308700 307895 307804 307745 308118 309532 311517 312898 313530 314766
54845C14766L069M595N005N139O125P938R599J0202R586Q420P697P701P487N954
$$ 314766 317835 322430 327435 332574 338699 346637 356236 366438 376024 384444 392141 399842 407329 413283
54831D13283L362J098j12r50k283m079n903p752r681j1227j1816j1500j0753r923
$$ 413283 416645 417743 417631 416681 414398 410319 404416 396664 386983 375756 363940 352440 341687 331764
54817C31764r314r297r596q977o669l821k528l235m163l633k053r26o72l65O97
$$ 331764 322450 313153 303557 294580 287911 284090 281562 278327 274164 270531 268478 267552 266880 266515 267212
54802B67212J961K286J162q04k334k498j587q50j099j841k036j411n14J78N16
$$ 267212 269173 271459 272621 271817 269483 266985 265398 264548 263449 261608 259572 258161 257647 257825 258341
54787B58341K74o78j772k090j495p19k05L07Q26O63m94j764k087j502r02r65j767
$$ 258341 258615 257937 256165 254075 252580 251861 251656 251963 252789 253452 252958 251194 249107 247605 246703 245738 243971
54770B43971k830l046j373J495L039J708q32j626k68R26M78l88r0Q56R77L26L57
$$ 243971 241141 238095 236722 238217 241256 242964 242132 240506 240238 241164 241642 241254 241164 242020 242997 243323 243680
54753B43680J727L473M357M196L659L380L409L343K897K337K204K561K915K930
$$ 243680 245407 248880 253237 257433 261092 264472 267881 271224 274121 276458 278662 281223 284138 287068
54739B87068K751K502K093J827K572M686P151Q375P792O304N410O145Q469J1203
$$ 287068 289819 292321 294414 296241 298813 303499 310650 319025 326817 333121 338531 344676 353145 364348
54725C64348J2789J2572J1222R677Q098O091L582R35j355k740k865k291k376l771
$$ 364348 377137 389709 400931 410608 418706 424797 428379 429314 427959 425219 422354 420063 417687 413916
54711D13916n483o220o146o264o415n356k966j011j013k331l144k704j708q41
$$ 413916 408433 402213 396067 389803 383388 378032 375066 374055 373042 370711 367567 364863 363155 362314
54697C62314M0J193K238K593K434K598L480M436M780N057O498R071J1159J1777
$$ 362314 362354 363547 365785 368378 370812 373410 376890 381326 386106 391163 397661 406732 417891 429668
54683D29668J2073J3454J5047J4720J2377J0225R371Q103M655P0l301n076o757
$$ 429668 441741 455195 470242 484962 497339 507564 516935 525038 529693 529763 526462 521386 514629
54670E14629r046j1074j2279j3253j4333j4801j4084j2699j1389j0224r136q530
$$ 514629 505583 494509 482230 468977 454644 439843 425759 413060 401671 391447 382311 373781
54658C73781q662r092r327r381r133p927n632l352k299k403k978m013n610o623
$$ 373781 365119 356027 346700 337319 328186 320259 314627 311275 308976 306573 303595 299582 293972 287349
54644B87349n463k312Q07K424K886K889K212O83o94p68J69Q20N08l82j220j530
$$ 287349 281886 279574 280381 282805 285691 288580 290792 291475 290781 290013 290182 291002 291510 291128 289908 288378
54628B88378r07N49J909K241J733J335J456J728J931K225K360J617Rj210q59N90
$$ 288378 287471 288020 289929 292170 293903 295238 296694 298422 300353 302578 304938 306555 306564 305354 304495 305085
54612C05085J452Q73K4Q83L831O845P515N733L715L251L825L952L331K627J893
$$ 305085 306537 307410 307434 308317 312148 318993 326508 332241 335956 339207 343032 346984 350315 352942 354835
54597C54835P35k10L98K396L745L005J115m3J61J147K343L234K885R20j157r54
$$ 354835 355570 355360 355758 358154 361899 364904 366019 365976 366137 367284 369627 372861 375746 376666 375509 374555
54581C74555K102N858P633O847N198M750O144Q383R943J0135R622R594J0418J1083
$$ 374555 376657 382515 390148 396995 402193 406943 413087 421470 431413 441548 451170 460764 471182 482265
54567D82265J0111O998K812o65k444l035l775n567q186j0504j1260j0123q373
$$ 482265 492376 499374 502186 501521 499077 496042 492267 486700 478514 468010 456750 446627 438254
54554D38254q050r825j1939j2053r961p575o339n719m626l183k298k214k393k390
$$ 438254 430204 420379 408440 396387 386426 378851 372512 366793 362167 358984 356686 354472 352079 349689
54540C49689k261k253k620l426m123l826k546j552j869k886l300l047l284m456
$$ 349689 347428 345175 342555 339129 335006 331180 328634 327082 325213 322327 319027 315980 312696 308240
54526C08240n499n188l744k666l286n480p574p693n619l050j684j374q56J38N89
$$ 308240 302741 297553 293809 291143 287857 282377 274803 267110 261491 258441 256757 255383 254527 254665 255254
54511B55254n9j010j390j387j516j572j156o95j000j973k619k414j899j696j548
$$ 255254 255195 254185 252795 251408 249892 248320 247164 246469 245469 243496 240877 238463 236564 234868 233320
54496B33320q14M54J511J913K002K286K702K792K353J696J300J427J904K087J334
$$ 233320 232506 232960 234471 236384 238386 240672 243374 246166 248519 250215 251515 252942 254846 256933 258267
54481B58267j32j044l00J632L152L383L052L348M427N382N263L837J726J32O0
$$ 258267 258135 257091 256791 258423 261575 264958 268010 271358 275785 281167 286430 290267 291993 292125 292185
54466B92185J518L551N236O246O425N553L932K527J947J609O02j004k307k809
$$ 292185 293703 297254 302490 308736 315161 320714 324646 327173 329120 330729 331331 330327 328020 325211
54452C25211k877l147m001n491p092p659o355l863k029j974k907l292k886k917
$$ 325211 322334 319187 315186 309695 302603 294944 288589 284726 282697 280723 277816 274524 271638 268721
54438B68721m103n222m499k050J75J081J718K989L525J592j679l162j915k00J15
$$ 268721 264618 259396 254897 252847 253022 254103 255821 258810 262335 263927 262248 259086 257171 256971 257086
54423B57086p5O10J485J205J25n52q29j271j269J36K177L007K130O69m41j053
$$ 257086 257011 257621 259106 260311 260436 259884 259055 257784 256515 256651 258828 261835 263965 264634 264193 263140
54407B63140r73p3J051J861K788L962L902J527j322j771n1R26N7o63P4Q44L18
$$ 263140 262167 262094 263145 265006 267794 271756 275658 277185 275863 274092 274041 274967 275024 274361 274435 275279 275597
54390B75597m16J5R08R87M60j00j250l258m627m003k359j456j117l4J475J650
$$ 275597 275181 275196 276104 277091 277551 277451 276201 272943 268316 264313 261954 260498 259381 259347 260822 262472
54374B62472p4k382l841l911k491j09J645J437mp16j07N61K33p76j726k268k093
$$ 262472 262398 260016 256175 252264 249773 249664 251309 252746 252742 252026 251919 252480 252713 251937 250211 247943 245850
54357B45850q86R78K582L473L774L376K152R72J185K749L930L505K316J957K722
$$ 245850 244964 245942 248524 251997 255771 259147 261299 262271 263456 266205 270135 273640 275956 277913 280635
54342B80635L552L608L064K454J864J058K05J73J618L874N293N015L851K947K294
$$ 280635 284187 287795 290859 293313 295177 296235 296440 296613 298231 302105 307398 312413 316264 319211 321505
54327C21505J329L60J57M13r3j596k768k526j583j602l278n688p228o973n387
$$ 321505 322834 323194 323351 323764 323671 322075 319307 316781 315198 313596 310318 304630 297402 290429 285042
54312B85042l747k728j821n77J62p95k982m408l886k268r90l62J71Q86J565J920
$$ 285042 281295 278567 276746 276169 276331 275536 272554 268146 264260 261992 261002 260640 260811 261697 263262 265182
54296B65182J731R12r6n54m03m35r98j176mJ942L078K814K193K402L316L838L347
$$ 265182 266913 267825 267729 267175 266772 266337 265339 264163 264159 266101 269179 271993 274186 276588 279904 283742 287089
54279B87089K340J709J643J491P98P0O6M54M4j359k225j346M2m67l028m907m004
$$ 287089 289429 291138 292781 294272 295070 295140 295206 295660 295704 294345 292120 290774 290816 290349 287321 282414 278410
54262B78410j768j259l032m703m556l678l794m570m522l541k805k694k506k093
$$ 278410 276642 275383 272351 267648 263092 259414 255620 251050 246528 242987 240182 237488 234982 232889
54248B32889k090k350j859o82k70j063j440j25J739K312J567O22k95j504k376
$$ 232889 230799 228449 226590 225908 225638 224575 223135 223010 224749 227061 228628 229250 228955 227451 225075
54233B25075k186j894l017m941n381l560j111M11R73Q59N0n85M47K866M235L121
$$ 225075 222889 220995 217978 213037 207656 204096 202985 203396 204369 205228 205278 204693 205140 208006 212241 215362
54217B15362J019J3J45L92O54J015N61j033j921l50K278K904J057q19j142q94
$$ 215362 216381 216394 216539 216931 217585 218600 219161 218128 216207 215857 218135 221039 222096 221277 220135 219241
54201B19241j130j240n15N00J262K091K693J617j298l510k693m0J314M76p25r61
$$ 219241 218111 216871 216356 216856 218118 220209 222902 224519 223221 219711 217018 216978 218292 218768 218043 217082
54185B17082q52r42m87Q08J618Q41m91n34Q85K277K482J594K12r66j122O4J556
$$ 217082 216230 215288 214801 215609 217227 218068 217577 217043 217928 220205 222687 224281 224493 223527 222405 222469 224025
54168B24025J790O08m57j28J107J811J346K53o35q92n51J83J171K344L350L428
$$ 224025 225815 226423 225966 225838 226945 228756 230102 230355 229720 228828 228277 228460 229631 231975 235325 238753
54152B38753K092j5j600k099k028j853j363m84M9m79j735k723k687j331J149L543
$$ 238753 240845 240830 239230 237131 235103 233250 231887 231403 231452 230973 229238 226515 223828 222497 223646 227189
54136B27189L913J479k092m178l728j769J01P39m13k761m243l071j19J725R86
$$ 227189 231102 232581 230489 226311 222583 220814 220915 221654 221241 218480 214237 211166 211047 212772 213758
54121B13758p73j265k44Q98J316J351J423J300M85j118k921l810k989r30R21J687
$$ 213758 212985 211720 211476 212374 213690 215041 216464 217764 218249 217131 214210 210400 207411 206481 207402 209089
54105B09089J832K048K137J596O83M7l98j291k588l304k696j221r9j46j073j698
$$ 209089 210921 212969 215106 216702 217385 217432 217034 215743 213155 209851 207155 205934 205835 205689 204616 202918
54089B02918j096K50O98o65k631l108j606K37Q26M12K19N00M56j37l46M38J305
$$ 202918 201822 202072 202770 202105 199474 196366 194760 194997 195823 196235 196454 196954 197410 197273 196927 197365 198670
54072A98670R06n85j579j072K02R39P63J18o70j479j936j698j024n19l89m76o88
$$ 198670 199576 198991 197412 196340 196542 197481 198244 198362 197692 196213 194277 192579 191555 191036 190647 190171 189483
54055A89483p97j38J645L652M402L436J503o05k441l223k168J88K127K620K127
$$ 189483 188686 188548 190193 193845 198247 201683 203186 202581 200140 196917 194749 194937 197064 199684 201811
54040B01811J280J07r09o10R43J648K0k270k213N04K963K567j77k715l190j724
$$ 201811 203091 203198 202289 201679 202622 204270 204290 202020 199807 200311 203274 205841 205664 202949 199759 198035
54024A98035J40Q65K24n06Q5J984L876M541L692J761m60k034k438j993j244k51
$$ 198035 198175 199040 199264 198758 198843 200827 204703 209244 212936 214697 214237 212203 209765 207772 206528 206277
54008B06277J056K146K354J833J272Q88N32M66R39J229M63n73M6K539M536L914
$$ 206277 207333 209479 211833 213666 214938 215826 216358 216824 217763 218992 219455 218882 218928 221467 226003 229917
53992B29917J452l33k13J012K171K840K996K659K167K151K834L721M094L798L440
$$ 229917 231369 231036 230823 231835 234006 236846 239842 242501 244668 246819 249653 253374 257468 261266 264706
53977B64706L923N530P454Q541Q553Q372Q724R211Q990P981O898O326O330O757
$$ 264706 268629 274159 281613 290154 298707 307079 315803 325014 334004 341985 348883 355209 361539 368296
53963C68296P411P855P611O646N373M077K629R58m21o48N67K313L100K327R00
$$ 368296 375707 383562 391173 397819 403192 407269 409898 410856 410435 409787 410354 412667 415767 418094 418994
53948D18994Pm40j485l315m768n035m892n446o359o501n928n917o928p725p051
$$ 418994 419001 418561 417076 413761 408993 403958 399066 393620 387261 380760 374832 368915 361987 354262 347211
53933C47211n193l328k048j295j095j400j484n44J001J596L43j906l498l697l057
$$ 347211 342018 338690 336642 335347 334252 332852 331368 330824 331825 333421 333764 331858 328360 324663 321606
53918C21606k463k154j725p90M50J304J386J108J085J121M72p43j194p8J463J607
$$ 321606 319143 316989 315264 314474 314924 316228 317614 318722 319807 320928 321400 320657 319463 319385 320848 322455
53902C22455K77p80m65K87M8j100j900j708j069o87o11m43J57J166K016J890O90
$$ 322455 322732 321952 321487 321774 321822 320722 318822 317114 316045 315358 314747 314304 314461 315627 317643 319533 320223
53885C20223m40j42J543L053K977J457p8k20J450M188O679Q077Q582Q848Q811
$$ 320223 319783 319641 321184 324237 327214 328671 328593 328373 329823 334011 340690 348767 357349 366197 375008
53870C75008P734N495L324K732L849N288N580M537L124K254J935J757J933L301
$$ 375008 382742 388237 391561 394293 398142 403430 409010 413547 416671 418925 420860 422617 424550 427851
53856D27851N873P951P620N183L203L661N729P012O502N403N192N767N868M809
$$ 427851 433724 441675 449295 454478 457681 461342 467071 474083 480585 485988 491180 496947 502815 507624
53842E07624L186K041J665J470R35M05O52J595J980P07j744l742m297l877l453
$$ 507624 510810 512851 514516 515986 516921 517326 517978 519573 521553 522260 520516 516774 512477 508600 505147
53827E05147l429l788m579n654o391o510o871q564j1107j2544j1690r512p765
$$ 505147 501718 497930 493351 487697 481306 474796 467925 459361 448254 435710 424020 414508 406743
53814D06743p021o765o713o966p159o640n584m935m971m911m357m129m963o128
$$ 406743 399722 392957 386244 379278 372119 365479 359895 354960 349989 345078 340721 336592 331629 325501
53800C25501o351n660n295n732n850m545k529j773l135n025m964k386O22J667
$$ 325501 319150 313490 308195 302463 296613 292068 289539 287766 284631 279606 274642 272256 272878 274545
53786B74545O28p25j230j354j790k228k118j683j437j394j463j987k981l490k662
$$ 274545 275173 274448 273218 271864 270074 267846 265728 264045 262608 261214 259751 257764 254783 251293 248631
53771B48631j106k27l91o38q3J217K668L712M012L718L380L178K597J399L48R5
$$ 248631 247525 247298 246907 246269 246186 247403 250071 253783 257795 261513 264893 268071 270668 272067 272415 272510
53755B72510J57j8L05J924L691L648K011J137K157L482L333K174J740K845M890
$$ 272510 272667 272649 272954 274878 278569 282217 284228 285365 287522 291004 294337 296511 298251 301096 305986
53740C05986O585O652M959L333L793N602N899L915K505M068O990P992O514M559
$$ 305986 312571 319223 324182 327515 331308 336910 342809 346724 349229 353297 360287 368279 374793 379352
53726C79352L313K350J557J422J615J311R51J682L004L014J264m64p97m87q17
$$ 379352 382665 385015 386572 387994 389609 390920 391871 393553 396557 399571 400835 400371 399574 399087 398270
53711C98270j794k695l172l026k077r62r25k176l432l707l430l145k447j201n81
$$ 398270 396476 393781 390609 387583 385506 384544 383619 381443 378011 374304 370874 367729 365282 364081 363500
53696C63500j497k830k760j399o01j301k321k107n98J016J684J222M1j289k271
$$ 363500 362003 359173 356413 355014 354413 353112 350791 348684 348086 349102 350786 352008 352049 350760 348489
53681C48489k576k154j468j327k113l100l137k078j067j085j842k338k033j106
$$ 348489 345913 343759 342291 340964 338851 335751 332614 330536 329469 328384 326542 324204 322171 321065
53667C21065j26J12r46k762l757k929j076J88L05K0J56Q04J607K115J960J309
$$ 321065 320939 321051 320105 317343 313586 310657 309581 309769 310074 310094 310250 311054 312661 314776 316736 318045
53651C18045J079K040L698M624L991K382J031Q19J890L707N274N817N434M898
$$ 318045 319124 321164 324862 329486 333477 335859 336890 337709 339599 343306 348580 354397 359831 364729
53637C64729M707M711M600M298L821L191K665K741L599M794N592N588M953M227
$$ 364729 369436 374147 378747 383045 386866 390057 392722 395463 399062 403856 409448 415036 419989 424216
53623D24216L849L663L081J898P89N20Q14O46l37j366j745j856k382l074k967
$$ 424216 428065 431728 434809 436707 437496 438016 438830 439476 439139 437773 436028 434172 431790 428716 425749
53608D25749j784n12k75r76j385o58N29O99n34j732j295L83J207k7k130l051k342
$$ 425749 423965 423453 423178 422202 420817 420159 420688 421387 420853 419121 417826 418209 419416 419389 417259 414208 411866
53591D11866j259q28p49l96Q0J83M4K66R48J450J145P4j107j537o16J410L337
$$ 411866 410607 409779 409030 408634 408714 408897 408941 409207 410155 411605 412750 412824 411717 410180 409564 410974 414311
53574D14311L992L455K810K621K358J666J200J405J379K93n36J103M793P120N840
$$ 414311 418303 421758 424568 427189 429547 431213 432413 433818 435197 435490 434954 436057 440850 447970 453810
53559D53810K927J914L351M801M757M370M904N642N363M508M417N179N653N310
$$ 453810 456737 458651 462002 466803 471560 475930 480834 486476 491839 496347 500764 505943 511596 516906
53545E16906M853M997N541N927N906N438M567L736L718M755N966O172N289M593
$$ 516906 521759 526756 532297 538224 544130 549568 554135 557871 561589 566344 572310 578482 583771 588364
53531E88364N240O744P336O029L957L108L996N266N673N534N655N748M907L239
$$ 588364 593604 600348 607684 613713 617670 620778 624774 630040 635713 641247 646902 652650 657557 660796
53517F60796J854J340J327J689K909M699N397L937J653Q10J547J769L11j160l79
$$ 660796 662650 663990 665317 667006 669915 674614 680011 683948 685601 686411 687958 689727 690038 688878 688499
53502F88499K258L895K579o44l119l193j089J891M233M836L844K875L573N711
$$ 688499 690757 694652 697231 696587 693468 690275 689186 691077 695310 700146 703990 706865 710438 716149
53488G16149P433P547O721N990N123L507J879J750L193M571M777M503M773N451
$$ 716149 723582 731129 737850 743840 748963 752470 754349 756099 759292 763863 768640 773143 777916 783367
53474G83367O014O765Q090R315R604R471J0075J1252J1783J1561J1908J3363J4748
$$ 783367 789381 796146 804236 813551 823155 832626 842701 853953 865736 877297 889205 902568 917316
53461I17316J5244J5877J7773K0040K0996K0781K1135K2761K4469K5058K4801
$$ 917316 932560 948437 966210 986250 1007246 1028027 1049162 1071923 1096392 1121450 1146251
53450A146251K4694K5251K6554K8517L0501L1404L0849K9933L0275L2504L5847
$$ 1146251 1170945 1196196 1222750 1251267 1281768 1313172 1344021 1373954 1404229 1436733 1472580
53439A472580L8788L9994L9337L8275L8632M0484M1899M1388L9900L9583M0964
$$ 1472580 1511368 1551362 1590699 1628974 1667606 1708090 1749989 1791377 1831277 1870860 1911824
53428A911824M2421M2297M0618L8603L7257L6742L6570L6156L5402L4846L4894
$$ 1911824 1954245 1996542 2037160 2075763 2113020 2149762 2186332 2222488 2257890 2292736 2327630
53417B327630L5134L4861L4191L3937L4250L4127L2559K9704K6627K4325K3138
$$ 2327630 2362764 2397625 2431816 2465753 2500003 2534130 2566689 2596393 2623020 2647345 2670483
53406B670483K2627K1653J9168J5255J1117P736N066K774J067N7j194m004q455
$$ 2670483 2693110 2714763 2733931 2749186 2760303 2768039 2773105 2775879 2776946 2777003 2775809 2771805 2763350
53393B763350j3106j6404j7922j8279j8477j9433k1533k4307k6815k8581k9870
$$ 2763350 2750244 2733840 2715918 2697639 2679162 2659729 2638196 2613889 2587074 2558493 2528623
53382B528623l1021l1871l2067l1627l0915l0211k9471k8518k7333k6170k5342
$$ 2528623 2497602 2465731 2433664 2402037 2371122 2340911 2311440 2282922 2255589 2229419 2204077
53371B204077k4796k4002k2445k0161j7602j5197j3223j1855j0772q969n728j888
$$ 2204077 2179281 2155279 2132834 2112673 2095071 2079874 2066651 2054796 2044024 2035055 2029327 2027439
53359B027439O39R95M29Q90L057O246R620J2796J5592J7926K0001K2123K4371
$$ 2027439 2028078 2029073 2029502 2030392 2033449 2039695 2049315 2062111 2077703 2095629 2115630 2137753 2162124
53346B162124K6777K9494L2321L4449L5423L6151L8107M1485M5027M7802N0225
$$ 2162124 2188901 2218395 2250716 2285165 2320588 2356739 2394846 2436331 2481358 2529160 2579385
53335B579385N2861N5240N6683N7780O0035O4013O8511P1712P2889P2860P3048
$$ 2579385 2632246 2687486 2744169 2801949 2861984 2925997 2994508 3066220 3139109 3211969 3285017
53324C285017P4120P5537P6510P7159P8186P9367P9277P7123P4135P2306P2021
$$ 3285017 3359137 3434674 3511184 3588343 3666529 3745896 3825173 3902296 3976431 4048737 4120758
53313D120758P1809P0213O7003O2611N7434N1883M6301M0411L3725K6766K0974
$$ 4120758 4192567 4262780 4329783 4392394 4449828 4501711 4548012 4588423 4622148 4648914 4669888
53302D669888J6810J2702O744j086r084j5831k1210k5837l0468l5811m1951m7803
$$ 4669888 4686698 4699400 4706144 4705058 4695974 4680143 4658933 4633096 4602628 4566817 4524866 4477063
53290D477063n1896n4005n5541n8188o2455o7434p1426p2985p2142p0676p0452
$$ 4477063 4425167 4371162 4315621 4257433 4194978 4127544 4056118 3983133 3910991 3840315 3769863
53279C769863p1474p2258p1989p1152o9988o7864o4863o2602o2236o2714o2239
$$ 3769863 3698389 3626131 3554142 3482990 3413002 3345138 3280275 3217673 3155437 3092723 3030484
53268C030484o0724n9196n7487n4320m9676m5297m2470m0766l9347l8015l6390
$$ 3030484 2969760 2910564 2853077 2798757 2749081 2703784 2661314 2620548 2581201 2543186 2506796
53257B506796l3564k9600k6170k4575k4107k3385k2369k1711k0897j8811j5751
$$ 2506796 2473232 2443632 2417462 2392887 2368780 2345395 2323026 2301315 2280418 2261607 2245856
53246B245856j3221j1699j0089p642n058l208j934o91N60J703K845L927M742N811
$$ 2245856 2232635 2220936 2210847 2203205 2198147 2194939 2193005 2192314 2192874 2194577 2197422 2201349 2206091 2211902
53232B211902Q266J2204J6164J8987K1304K4118K6857K8212K8402K8981L0489
$$ 2211902 2220168 2232372 2248536 2267523 2288827 2312945 2339802 2368014 2396416 2425397 2455886
53221B455886L1808L2075L1911L2163L2605L2497L1590K9856K7045K3345J9879
$$ 2455886 2487694 2519769 2551680 2583843 2616448 2648945 2680535 2710391 2737436 2760781 2780660
53210B780660J7589J6081J4353J2265J0353Q465N752K113j513m565p644j1237
$$ 2780660 2798249 2814330 2828683 2840948 2851301 2859766 2865518 2867631 2866118 2861553 2853909 2842672
53198B842672j4510j6341j7138j8658k1958k6287l0087l2599l4079l5061l5872
$$ 2842672 2828162 2811821 2794683 2776025 2754067 2727780 2697693 2665094 2631015 2595954 2560082
53187B560082l6685l7568l8337l8671l8578l8568l9122l9929m0043l9057l7894
$$ 2560082 2523397 2485829 2447492 2408821 2370243 2331675 2292553 2252624 2212581 2173524 2135630
53176B135630l7841l8851l9457l8721l7439l6714l6045l4066l0961k8593k7889
$$ 2135630 2097789 2058938 2019481 1980760 1943321 1906607 1870562 1836496 1805535 1776942 1749053
53165A749053k7520k6131k4639k4810k6155k6081k3302j9621j7624j7656j8017
$$ 1749053 1721533 1695402 1670763 1645953 1619798 1593717 1570415 1550794 1533170 1515514 1497497
53154A497497j7477j6564j6409j7163j7894j7802j7231j7322j8665k0443k1250
$$ 1497497 1480020 1463456 1447047 1429884 1411990 1394188 1376957 1359635 1340970 1320527 1299277
53143A299277k0631j9406j8473j7843j7090j6284j6047j6798j8219j9422j9574
$$ 1299277 1278646 1259240 1240767 1222924 1205834 1189550 1173503 1156705 1138486 1119064 1099490
53132A099490j8536j7019j5926j5638j6049j7001j8085j8227j6466j3461j1365
$$ 1099490 1080954 1063935 1048009 1032371 1016322 999321 981236 963009 946543 933082 921717
53121I21717j1635j3490j5143j5904j6367j6973j7339j6963j5948j4842j4093
$$ 921717 910082 896592 881449 865545 849178 832205 814866 797903 781955 767113 753020
53110G53020j3673j3111j2111j1248j1406j2315j2360j0596q227p146p494p768
$$ 753020 739347 726236 714125 702877 691471 679156 666796 656200 647973 640827 633333 625565
53098F25565p116o324o418p341q286q588q100p258o854p099p019n624l579k614
$$ 625565 618449 612125 605707 598366 590080 581492 573392 566134 559280 552181 545162 539538 535959 533345
53084E33345l220m158m495m834n798o601o117m585l169k339j799j540j894k623
$$ 533345 530125 525967 521472 516638 510840 504239 498122 493537 490368 488029 486230 484690 482796 480173
53070D80173k980k751k522k742l077k990k537k303k642l164l137k414j785k056
$$ 480173 477193 474442 471920 469178 466101 463111 460574 458271 455629 452465 449328 446914 445129 443073
53056D43073l029l872m353m859n270m841l572k654k943l744l832k943j604k24
$$ 443073 440044 436172 431819 426960 421690 416849 413277 410623 407680 403936 400104 397161 395557 395333
53042C95333Q22R14n1j176j712k055k577k318k92K374L306J906Rp42o59p18q45
$$ 395333 396155 397069 397018 395842 394130 392075 389498 387180 386888 389262 392568 394474 394483 393741 393082 392364 391519
53025C91519l48Q26J989K454J927P26j84L5J034J580J102K23l82q05j376k204
$$ 391519 391171 391997 393986 396440 398367 399093 398909 398944 399978 401558 402660 402883 402501 401696 400320 398116
53009C98116l430m955n797m810k550j205j992l665m525m626m996n646n770n284
$$ 398116 394686 389731 383934 379124 376574 375369 373377 369712 365187 360561 355565 349919 344149 338865
52995C38865m718m076l089k305k497l107k681j044K05l17k231m190n135m620k775
$$ 338865 334147 330071 326982 324677 322180 319073 316392 315348 315553 315236 313005 308815 303680 299060 296285
52980B96285n56P14N83k36r52j436j634j177j28O70N64m1m64q46j743l032l969
$$ 296285 295729 296443 297026 296790 295838 294402 292768 291591 291463 292133 292697 292656 292192 291346 289603 286571 282602
52963B82602m148l696k742j408l00k15j124k059k284k146k341k786k640j360O41
$$ 282602 278454 274758 272016 270608 270308 270093 268969 266910 264626 262480 260139 257353 254713 253353 253994
52948B53994K341K902K157O65o46j111p06J87J228K091K141Q73j039j792l21K102
$$ 253994 256335 259237 261394 262059 261413 260302 259596 259783 261011 263102 265243 266116 265077 263285 262964 265066
52932B65066L068J893M15N65J986K780K014M84o94j257j410j171n66N6L19K30
$$ 265066 268134 270027 270442 271007 272993 275773 277787 278271 277577 276320 274910 273739 273173 273229 273548 273778
52916B73778K9r2k2K21L81K22K6L32J051J288N30m02j92J293K724K835J822R94
$$ 273778 273807 273715 273693 273914 274295 274517 274543 274875 275926 277214 277744 277342 277150 278443 281167 284002 285824 286818
52898B86818J201J972K255J775J338J736K707L307L104K604K443K674K932K931
$$ 286818 288019 289991 292246 294021 295359 297095 299802 303109 306213 308817 311260 313934 316866 319797
52884C19797K620K212K190K912L968M413L976L646M421N777O166N017L490K912
$$ 319797 322417 324629 326819 329731 333699 338112 342088 345734 350155 355932 362098 367115 370605 373517
52870C73517L100K885J954J300J664K245J642k16j883k282j971k031k389k116
$$ 373517 376617 379502 381456 382756 384420 386665 388307 388091 386208 383926 381955 379924 377535 375419
52856C75419j085k74l14p06p91o81p03p57q64j674l487n300n701m510k751j240
$$ 375419 374334 374060 373746 373040 372249 371568 370865 370108 369244 367570 364083 358783 353082 348572 345821 344581
52840C44581r1O24Q41J035J797K669K518J350N34P45Q67j91j581j646l36Q02Q75
$$ 344581 344490 345114 345955 346990 348787 351456 353974 355324 355858 356603 357470 357279 355698 354052 353716 354518 355393
52823C55393N91Q73J549J787J121k94j868k753k296p15R95K023K353K393K449
$$ 355393 355984 356857 358406 360193 361314 361020 359152 356399 354103 353388 354383 356406 358759 361152 363601
52808C63601K611K757K515J632L87p30j706k730l257k340k72J086M72j091j612
$$ 363601 366212 368969 371484 373116 373503 372773 371067 368337 365080 362740 362468 363554 364026 362935 361323
52793C61323o09P40J510J902K232K308K043J732J406P94J84M15J519K304J947
$$ 361323 360714 361454 362964 364866 367098 369406 371449 373181 374587 375381 375565 375980 377499 379803 381750
52778C81750J196J177J726J813J171N28M80R51J588J881J216l59j625j488n50
$$ 381750 382946 384123 385849 387662 388833 389361 389841 390792 392380 394261 395477 395118 393493 392005 391455
52763C91455l80j317k175k136j586q78K79J691K326J911J578J993K141J099k34
$$ 391455 391075 389758 387583 385447 383861 382983 383262 384953 387279 389190 390768 392761 394902 396001 395767
52748C95767o50p95j938l422l436k124j614k802m165m313l874l911m154l958l643
$$ 395767 395117 394322 392384 388962 385526 383402 381788 378986 374821 370508 366634 362723 358569 354611 350968
52733C50968l704l793l610l791m731n454m958l809l164l031k938l328m603n431
$$ 350968 347264 343471 339861 336070 331339 325885 320927 317118 313954 310923 307985 304657 300054 294623
52719B94623m115j418qq67k183k238j462j003r88j194j870k741k565r66M00j29
$$ 294623 290508 289090 289082 288215 286032 283794 282332 281329 280341 279147 277277 274536 271971 271005 271405 271276
52703B71276j918l114l219l148l275l117k602k259k090j642j147j301j872j886
$$ 271276 269358 266244 263025 259877 256602 253485 250883 248624 246534 244892 243745 242444 240572 238686
52689B38686j237q73j171j599k250l939o002n861k459J373J952m85k216j095R97
$$ 238686 237449 236576 235405 233806 231556 227617 221615 215754 213295 214668 216620 216135 213919 212824 213821
52674B13821J368J02r77j438k417m109m941l693j142R79J847J686Q95j22p44o58
$$ 213821 215189 215291 214314 212876 210459 206350 201409 197716 196574 197553 199400 201086 201981 201859 201115 200457
52658B00457n75j529l319m371l449j021J291K206J511j40j775k738l086l156k788
$$ 200457 199882 198353 195034 190663 187214 186193 187484 189690 191201 191061 189286 186548 183462 180306 177518
52643A77518j590q0L99m96j275n94P61J067L89M98J997L277K872J464N65M06L94
$$ 177518 175928 175848 176247 175751 174476 173882 174643 175710 176099 176597 178594 181871 184743 186207 186772 187178 187572
52626A87572P67K154L830M002K250M19M07J996L525M003L659K916J885R22O93
$$ 187572 188339 190493 194323 198325 200575 200994 201401 203397 206922 210925 214584 217500 219385 220307 221000
52611B21000J289J935K060K128K789L638L653K683J596R01K35m73l91Q50J973
$$ 221000 222289 224224 226284 228412 231201 234839 238492 241175 242771 243672 243907 243434 243043 243893 245866
52596B45866J310j110l592m697m262k899j445q75j538k444k324j468j392k441
$$ 245866 247176 246066 242474 237777 233515 230616 229171 228296 226758 224314 221990 220522 219130 216689
52582B16689l094k230p75j70k73oO66P04l33j655k233j734o13J47k66j501k186
$$ 216689 213595 211365 210590 210420 210147 210141 210807 211511 211178 209523 207290 205556 204943 205090 204824 203323 201137
52565B01137j654q22o18m85M15J284P08q73j540q06k88j001j824j410k72J97l23
$$ 201137 199483 198661 198043 197558 197973 199257 199965 199092 197552 196746 196458 195457 193633 192223 191951 192148 191825
52548A91825j091j455j058L09K129L082K554J625J638K323K397J540O78M87P07
$$ 191825 190734 189279 188221 188530 190659 193741 196295 197920 199558 201881 204278 205818 206496 206983 207690
52533B07690Q76P88K84n19p87K56J965K662J621n1r15p99m18p8N78J807L326M575
$$ 207690 208566 209354 209638 209119 208332 208588 210553 213215 214836 214785 213870 213071 212653 212575 213153 214960 218286 222861
52515B22861N042M453K892Q44r50j728j100M72J749J829J285J545K901L845K959
$$ 222861 227903 232356 235248 236092 235142 233414 232314 232786 234535 236364 237649 239194 242095 245940 248899
52500B48899R82N1J015K413K430J078j54l09J94N76P47J048J529J888J837J294
$$ 248899 249881 249932 250947 253360 255790 256868 256714 256405 256599 257175 257922 258970 260499 262387 264224 265518
52484B65518M51m4N59K173L575L627K646J974K280K861K702J661N15K21J227K898
$$ 265518 265969 265925 266484 268657 272232 275859 278505 280479 282759 285620 288322 289983 290498 290719 291946 294844
52468B94844L681K516K35j110n66P03J022J20j007j458j087l20J42j49o48k24
$$ 294844 298525 301041 301276 300166 299600 300303 301325 301445 300438 298980 297893 297573 297715 297566 296918 296694
52452B96694J212K115J129j081k680k856k223j457o34J55N72N25J94m28j290j802
$$ 296694 297906 300021 301150 300069 297389 294533 292310 290853 290219 290374 290946 291471 291665 291237 289947 288145
52436B88145j413n32M8M05J150J993J940J014L71M13K50m09l43J154K660K348
$$ 288145 286732 286200 286248 286653 287803 289796 291736 292750 293121 293534 293784 293375 293032 294186 296846 299194
52420B99194O38l77K87J566K086J645Q33J27l48o20p22m59M45J725K434J991J021
$$ 299194 299832 299455 299742 301308 303394 305039 305872 305999 305651 305031 304309 303850 304295 306020 308454 310445 311466
52403C11466N42O84R38J334K254L113K536L66j539j417J01Q90K56k48P69K352
$$ 311466 312008 312692 313630 314964 317218 320331 322867 323233 321694 320277 320378 321268 321524 321276 322045 324397
52387C24397K436P83n92j49J191J609J044R81J969K733K075M16j089j873j766
$$ 324397 326833 327616 327024 326875 328066 329675 330719 331700 333669 336402 338477 338893 337804 335931 334165
52372C34165n41J335K336J501j4k56Q99J672J018j9N4J169K048J855Q28m19j529
$$ 334165 333624 334959 337295 338796 338782 338526 339425 341097 342115 342096 342150 343319 345367 347222 348050 347631 346102
52355C46102k244k119o86J895M460N508M485K273K65p42n78O29K227K971K130
$$ 346102 343858 341739 341053 342948 347408 352916 357401 359674 359939 359197 358619 359248 361475 364446 366576
52340C66576M47o30n30L05J422K517K922K155J131J450L186M540M169K723J423
$$ 366576 367023 366393 365863 366168 367590 370107 373029 375184 376315 377765 380951 385491 389660 392383 393806
52325C93806L50r01j890j890j113k33P28J902K405J217q83j753o88O13N00l31
$$ 393806 394156 393255 391365 389475 388362 388129 388857 390759 393164 394381 393498 391745 391057 391670 392170 391839
52309C91839N5K178M653O036O141N547M797M368M640N400N758N118L951L130K705
$$ 391839 391894 394072 398725 404761 410902 416449 421246 425614 430254 435654 441412 446530 450481 453611 456316
52294D56316K068J268J261K442L733M031L958M968O868P576N867L198J866K218
$$ 456316 458384 459652 460913 463355 467088 471119 475077 480045 486913 494489 500356 503554 505420 507638
52280E07638K731K431J937K079K663L072L338L944M961N878O180N803N187M967
$$ 507638 510369 512800 514737 516816 519479 522551 525889 529833 534794 540672 546852 552655 557842 562809
52266E62809N387N985O192O306P325R457J1382J1640J0524R752J0293J1283J1477
$$ 562809 568196 574181 580373 586679 594004 603461 614843 626483 637007 646759 657052 668335 679812
52253F79812J1069J1469J3358J5682J6717J5939J4674J4847J7016J9705K0975
$$ 679812 690881 702350 715708 731390 748107 764046 778720 793567 810583 830288 851263
52242H51263K0639K0498K2015K4397K5645K5232K4651K5201K6283K6496K5694
$$ 851263 871902 892400 914415 938812 964457 989689 1014340 1039541 1065824 1092320 1118014
52231A118014K5034K5340K6218K6715K6227K4706K2674K1063K0580K0947K1130
$$ 1118014 1143048 1168388 1194606 1221321 1247548 1272254 1294928 1315991 1336571 1357518 1378648
52220A378648K0418J8964J7233J5389J3425J1480R749Q266O970N866M939M029
$$ 1378648 1399066 1418030 1435263 1450652 1464077 1475557 1485306 1493572 1500542 1506408 1511347 1515376
52208A515376K933J645M85m5K46Q43R66N48M02R86J554J241O48J284L406N560
$$ 1515376 1518309 1519954 1520439 1520394 1520640 1521483 1522449 1522997 1523399 1524385 1525939 1527180 1527828 1529112 1532518 1538078
52192A538078O648P412R107J1307J2202J0995R152Q984J1285J4625J6868J7226
$$ 1538078 1544726 1552138 1561245 1572552 1584754 1595749 1604901 1613885 1625170 1639795 1656663 1673889
52180A673889J6675J6522J6893J7032J6617J6059J5555J4730J3488J2441J1985
$$ 1673889 1690564 1707086 1723979 1741011 1757628 1773687 1789242 1803972 1817460 1829901 1841886
52169A841886J1467R838O899L513Q93k23o5J07j059l601o086p220p223p271q118
$$ 1841886 1853353 1863191 1870090 1873603 1874496 1874273 1874208 1874315 1873256 1869655 1863569 1856349 1849126 1841855 1833737
52154A833737r693j1723j3921j5771j6709j6618j5901j5140j4740j4690j4454
$$ 1833737 1824044 1812321 1798400 1782629 1765920 1749302 1733401 1718261 1703521 1688831 1674377
52143A674377j3509j2130j1249j1291j1645j1534j0759r325p113m527k674k131
$$ 1674377 1660868 1648738 1637489 1626198 1614553 1603019 1592260 1582935 1575822 1571295 1568621 1566490
52131A566490k133j774j373j655k258k230j665j533j993k213j896j727j969j803
$$ 1566490 1564357 1562583 1561210 1559555 1557297 1555067 1553402 1551869 1549876 1547663 1545767 1544040 1542071 1540268
52117A540268o28Q18J298M09j314l141m609n586o248o641o306m848k884j806k302
$$ 1540268 1539640 1540458 1541756 1542165 1540851 1537710 1533101 1527515 1521267 1514626 1508320 1503472 1500588 1498782 1496480
52102A496480l703m924n526n633n475n334n494n865o004n688n166m682m250l986
$$ 1496480 1492777 1487853 1482327 1476694 1471219 1465885 1460391 1454526 1448522 1442834 1437668 1432986 1428736 1424750
52088A424750m114m425m298l605l161l696m703m747l097p69K80q22k825l731l253
$$ 1424750 1420636 1416211 1411913 1408308 1405147 1401451 1396748 1392001 1388904 1388135 1388415 1387593 1384768 1381037 1377784
52073A377784l077m317n634m922k253Q5M35o46j536j227L09K286L284K294l3j836
$$ 1377784 1374707 1370390 1364756 1359834 1357581 1357666 1358101 1357455 1355919 1354692 1355001 1357287 1360571 1362865 1362832 1360996
52057A360996j988p78J250L994P046R460J0754J1239J1178J0787J1270J4126J8702
$$ 1360996 1359008 1358230 1359480 1363474 1370520 1379980 1390734 1401973 1413151 1423938 1435208 1449334 1468036
52044A468036K2087K2548K1686K1967K3523K4909K5785K6869K8016K8398K8274
$$ 1468036 1490123 1512671 1534357 1556324 1579847 1604756 1630541 1657410 1685426 1713824 1742098
52033A742098K8641K9199K8574K6769K5515K5575K5398K3382K0204J7762J6640
$$ 1742098 1770739 1799938 1828512 1855281 1880796 1906371 1931769 1955151 1975355 1993117 2009757
52022B009757J5761J4145J2000J0174R175Q794Q136O025J927l237p404q952q116
$$ 2009757 2025518 2039663 2051663 2061837 2071012 2079806 2087942 2093967 2095894 2092657 2085253 2076301 2068185
52009B068185o758o576p698r082r933j0233j0186r849r334q753p928o810o046
$$ 2068185 2061427 2054851 2047153 2038071 2028138 2017905 2007719 1997870 1988536 1979783 1971855 1965045 1958999
51996A958999o205o348m687j092K308L782M027M559N293N140M161L493L531L738
$$ 1958999 1952794 1946446 1941759 1940667 1942975 1946757 1950784 1955343 1960636 1965776 1969937 1973430 1976961 1980699
51982A980699M055N086O671P648P306O245N470N241M969L792J465j035k343k603
$$ 1980699 1984754 1989840 1996511 2004159 2011465 2017710 2023180 2028421 2033390 2037182 2038647 2037612 2035269 2032666
51968B032666l622o358r368j1066j2249j4428j6645j6565j4490j3521j5291j8120
$$ 2032666 2029044 2022686 2013318 2002252 1990003 1975575 1958930 1942365 1927875 1914354 1899063 1880943
51956A880943k0191k1991k4284k5953k5935k5528k6624k8668k9476k8556k7636
$$ 1880943 1860752 1838761 1814477 1788524 1762589 1737061 1710437 1681769 1652293 1623737 1596101
51945A596101k8015k9100k9715k9592k9221k9058k9231k9533k9731l0051l0958
$$ 1596101 1568086 1538986 1509271 1479679 1450458 1421400 1392169 1362636 1332905 1302854 1271896
51934A271896l2112l2310l1107k9704k9332k9443k8646k6956k5782k5828k6204
$$ 1271896 1239784 1207474 1176367 1146663 1117331 1087888 1059242 1032286 1006504 980676 954472
51923I54472k5702k4038k1778j9909j9379k0230k1259k1353k0951k1127k1393
$$ 954472 928770 904732 882954 863045 843666 823436 802177 780824 759873 738746 717353
51912G17353j9940j6339j2612j0877j1101j1913j2477j2519j1432q926o153m821
$$ 717353 697413 681074 668462 657585 646484 634571 622094 609575 598143 589217 583064 578243
51900E78243n198o093o747p485q307q291p079n877o013p204q124q079p151n349
$$ 578243 573045 566952 560205 552720 544413 536122 529043 523166 517153 509949 501825 493746 486595 481246
51886D81246k976j397j921l821m907m300l387l562m433m825m398l432k233j550
$$ 481246 478270 476873 474952 471131 466224 461924 458537 454975 450542 445717 441319 437887 435654 434104
51872D34104k388m330n276m072k286j983k941l715m231n169n733m577k652k302
$$ 434104 431716 427386 422110 418038 415752 413769 410828 407113 402882 397713 391980 387403 384751 382449
51858C82449l505l609j487O12L18j928m252n670n833m354j897l99q17j901k226
$$ 382449 378944 375335 373848 374460 374778 372850 368598 362928 357095 352741 350844 350445 349628 347727 345501
51843C45501j968j655r35O3k8j468k220r77K53r46l365l792j787R0L77J44K50
$$ 345501 343533 341878 340943 341006 340978 339510 337290 336313 336566 335620 332255 328463 326676 326766 327143 327287 327537
51826C27537j02j395k550k524j544l04O63N87q96k472k165p4J562J467Q15J034
$$ 327537 327435 326040 323490 320966 319422 319118 319781 320368 319472 317000 314835 314761 316323 317790 318605 319639
51810C19639J757J880J262M81o1r8N51J356J393O80K29M66P40O60O70R20R83J186
$$ 319639 321396 323276 324538 325019 324958 324860 325411 326767 328160 328840 329069 329535 330275 330935 331605 332525 333508 334694
51792C34694K559M780N780M453K292J177R05K65o70j002q78j221j988k099j052
$$ 334694 337253 342033 347813 352266 354558 355735 356640 356905 356235 355233 354355 353134 351146 349047 347995
51777C47995M92J581J721R34k83j400k532m009m979l775m72K279K365J016R22
$$ 347995 348487 350068 351789 352723 352440 351040 348508 344499 339520 335745 335273 337552 339917 340933 341855
51762C41855K447L590L196K178J537J013J16q75j512j698j338m29L83L18l33n38
$$ 341855 344302 347892 351088 353266 354803 355816 355932 355057 353545 351847 350509 350080 350463 350781 350448 349910
51746C49910k44n62j856k803k078p8J644K104J471L77p22j705k580k984k209k17
$$ 349910 349666 349104 347248 344445 342367 342289 343933 346037 347508 347885 347163 345458 342878 339894 337685 337468
51730C37468J651J926R52N25J444K576K777K475K528K600J789L40n51l71K27N33
$$ 337468 339119 341045 341997 342522 343966 346542 349319 351794 354322 356922 358711 359051 358500 358129 358356 358889
51714C58889N14M34M25N02N17J76m06l99Q44K654L590L146K223J729J582J474
$$ 358889 359403 359837 360262 360764 361281 361457 361051 360652 361496 364150 367740 370886 373109 374838 376420 377894
51698C77894J739K728L816L960L043J968J465J493J888K800M199N579O512P097
$$ 377894 379633 382361 386177 390137 393180 395148 396613 398106 399994 402794 406993 412572 419084 426181
51684D26181P435P190O249N396N617O816P785P514O135M586L726L771M111L766
$$ 426181 433616 440806 447055 452451 458068 464884 472669 480183 486318 490904 494630 498401 502512 506278
51670E06278K478J237J215K199K768K083P56k64p78r59o75N9N19n0j380k412k486
$$ 506278 508756 509993 511208 513407 516175 518258 519014 518750 517972 517013 516338 516397 516916 516866 515486 513074 510588
51653E10588j793q56n9L30J15o85j780k621k572j441P2R45J012R90J237J284R66
$$ 510588 508795 507939 507880 508210 508325 507640 505860 503239 500667 499226 499298 500243 501255 502245 503482 504766 505732
51636E05732J088K096K980K565J369R74J759K566K525K151K330L273M601N765
$$ 505732 506820 508916 511896 514461 515830 516804 518563 521129 523654 525805 528135 531408 536009 541774
51622E41774O165N685N208N666O419N631K700n98k063j407q8N77M01r7l66j73
$$ 541774 547939 553624 558832 564498 570917 576548 579248 578650 576587 575180 575092 575669 576070 575973 575607 575434
51606E75434K80O15P35P77O15p2j137j988k463l056m012m904n425n900o574p168
$$ 575434 575714 576329 577064 577841 578456 578384 577247 575259 572796 569740 565728 560824 555399 549499 542925 535757
51590E35757p581q249r176r422q430p103o566o448n493l473j435l04l69j754m154
$$ 535757 528176 519927 510751 501329 492899 485796 479230 472782 467289 463816 462381 462077 461708 459954 455800
51575D55800o155o316n051m159m175l691j897l28r11l223m982m761l127j386l91
$$ 455800 449645 443329 438278 434119 429944 426253 424356 424028 423117 419894 414912 410151 407024 405638 405247
51560D05247l88j163k041k455k516k557k337j492n79o23j479j719o25O44O79j05
$$ 405247 404859 403696 401655 399200 396684 394127 391790 390298 389719 389096 387617 385898 385273 385917 386596 386491
51544C86491oJ654L728M803M615L726K623J651J367K184L693M817M793L840K830
$$ 386491 386485 388139 391867 396670 401285 405011 407634 409285 410652 412836 416529 421346 426139 429979 432809
51529D32809K503K969L809M545N047N485N925O152O079O048O372O636N957M133
$$ 432809 435312 438281 442090 446635 451682 457167 463092 469244 475323 481371 487743 494379 500336 504469
51515E04469K158J205J264J155o1j966l186k799j252O4J34p71j513j339n31J73
$$ 504469 506627 507832 509096 510251 510190 508224 505038 502239 500987 501051 501185 500414 498901 497562 497031 497204
51499D97204N01O43O85M97J35j27k21k15K55J801M115N684N389M042L435L943
$$ 497204 497705 498348 499033 499530 499665 499538 499317 499102 499357 501158 505273 510957 516346 520388 523823 527766
51483E27766M113K852J124O49J538K109J055j036k600k955k717k494j887j53K291
$$ 527766 531879 534731 535855 536504 538042 540151 541206 540170 537570 534615 531898 529404 527517 527364 529655
51468E29655L796L336K004J849L233M346L683K076J366J712J533J0j688k131j578
$$ 529655 533451 536787 538791 540640 543873 548219 551902 553978 555344 557056 558589 558599 556911 554780 553202
51453E53202j393k108k977l279l177l193l467l837m275m790n062m612l531k646
$$ 553202 551809 549701 546724 543445 540268 537075 533608 529771 525496 520706 515644 511032 507501 504855
51439E04855k674l261l424k899k508k830l178k550j194l63n56r45o83O6O94R75
$$ 504855 502181 498920 495496 492597 490089 487259 484081 481531 480337 479974 479418 478473 477790 477856 478550 479525
51423D79525Q49J88o22m63J253L456M386L625K578K828M486O292P034O815O917
$$ 479525 480374 480562 479940 479477 480730 484186 488572 492197 494775 497603 502089 508381 515415 522230 529147
51408E29147Q241R963J0254Q598O637O187P047P628P223O574O374O309N843M950
$$ 529147 537388 547351 557605 566203 572840 579027 586074 593702 600925 607499 613873 620182 626025 630975
51394F30975L805K443J106L04J47J50J7R1N96R91O02l55r46o21K60R82J275J421
$$ 630975 634780 637223 638329 638633 638780 638930 638947 639038 639634 640625 641227 640872 639926 639305 639565 640547 641822 643243
51376F43243J711J902J445K74q91j430j720k593m062n154n212m689m458m812n477
$$ 643243 644954 646856 648301 648575 647684 646254 644534 641941 637879 632725 627513 622824 618366 613554 608077
51361F08077o140o661p024p377p823p984p181n317l280k127k046k399k532k255
$$ 608077 601937 595276 588252 580875 573052 565068 557887 552570 549290 547163 545117 542718 540186 537931
51347E37931j741j219p67k85K56O53P43P28Q30Q64O25N23J040J644J229j92j227
$$ 537931 536190 534971 534204 533919 534175 534828 535571 536299 537129 537993 538618 539141 540181 541825 543054 542862 541635
51330E41635j068n21n09o22k60k83k026n116p740q980r472r742r353q182p193
$$ 541635 540567 540046 539537 538915 538655 538372 536346 531230 523490 514510 505038 495296 485943 477761 470568
51315D70568p119p400p338p442q522r919r931q119o070n554o547p627p796p253
$$ 470568 463449 456049 448711 441269 432747 422828 412897 404778 398708 393154 386607 378980 371184 363931
51301C63931o507n489l924k224j380j904l179m055l807k500q43J55k10j544k460
$$ 363931 357424 351935 348011 345787 344407 342503 339324 335269 331462 328962 328119 328274 328064 326520 324060
51286C24060j998p63r0k60k99M02J165J143O00L70M66J11q89j635j287k00N51
$$ 324060 322062 321299 321209 320949 320650 321052 322217 323360 323960 324330 324796 324907 324018 322383 321096 320896 321447
51269C21447N04K40N09J412K496L327L698L559L135L033L803N212O309O405N682
$$ 321447 321951 322191 322700 324112 326608 329935 333633 337192 340327 343360 347163 352375 358684 365089 370771
51254C70771M698L724K957K939L916M943M524K430J51r19j136j801l236m551n101
$$ 370771 375469 379193 382150 385089 389005 393948 398472 400902 401053 400134 398998 397197 393961 389410 384309
51239C84309n220n345n274m723l916l217k692k570l496n452o998o652m923l842
$$ 384309 379089 373744 368470 363747 359831 356614 353922 351352 347856 342404 335406 328754 323831 319989
51225C19989m302n058m763l823l417l650l796l638l391k696j108N43O28j080k853
$$ 319989 315687 310629 305866 302043 298626 294976 291180 287542 284151 281455 280347 280890 281518 280438 277585
51210B77585l020j702j71O50O08R8j49K66N96l36k236l201k134k66O34N55P32
$$ 277585 274565 272863 272692 273342 273950 274048 273899 274165 274761 274425 272189 268988 266854 266588 267222 267777 268509
51193B68509J524K191K270J911J213L59J1L46J74j463l087k174J031L099J630
$$ 268509 270033 272224 274494 276405 277618 277977 277988 278334 278508 277045 273958 271784 272815 275914 277544
51178B77544j708l499k599n13J215K288K841K738J866K89j782l514l416q70K477
$$ 277544 275836 272337 269738 269225 270440 272728 275569 278307 280173 280462 278680 275166 271750 270880 273357
51163B73357L961K773P15q8N94J464J449N41o18j398j558j350j232j291j106l24
$$ 273357 277318 280091 280806 280718 281312 282776 284225 284766 284148 282750 281192 279842 278610 277319 276213 275889
51147B75889Q66J917K438K367J850J131M37j68p10j051j028q40r77j424j332O6
$$ 275889 276755 278672 281110 283477 285327 286458 286895 286727 286017 284966 283938 283098 282121 280697 279365 279431
51131B79431K240L640L264J614l2q98j056q77n94l40j94j11L9L52P91J098P71
$$ 279431 281671 285311 288575 290189 290157 289259 288203 287326 286732 286392 286198 286087 286126 286478 287269 288367 289138
51114B89138n10k233l229k922j964j123r7J607L024K488K44j315p72L33j28j679
$$ 289138 288628 286395 283166 280244 278280 277157 277060 278667 281691 284179 284423 283108 282336 282669 282541 280862
51098B80862k110q88J94k93j848l412m623n093m036j682J35N6r05p36P46J746
$$ 280862 278752 277864 278058 277765 275917 272505 267882 262789 258753 257071 257206 257262 256357 255621 256367 258113
51082B58113R09j135k793l140k331j073%P81J628K676L391L191K300J477J047
$$ 258113 259022 257887 255094 251954 249623 248550 248550 249331 250959 253635 257026 260217 262517 263994 265041
51067B65041P87O96J089J822K171J836J475J758K321K205J114l17j409k052k390
$$ 265041 265828 266524 267613 269435 271606 273442 274917 276675 278996 281201 282315 281998 280589 278537 276147
51052B76147k455k327k344k635k666j704J54J807K202J315p5j194j523o68J235
$$ 276147 273692 271365 269021 266386 263720 262016 262170 263977 266179 267494 267419 266225 264702 264034 265269
51037B65269K949K863Q39j150j003R91K341J334q17j324Q98M040N612N123L937
$$ 265269 268218 271081 271920 270770 269767 270758 273099 274433 273616 272292 273190 277230 282842 287965 291902
51022B91902L082K201Q40l62m35N11J446J673J313P91N04P33J263J308N52kR01
$$ 291902 294984 297185 298025 297663 297228 297739 299185 300858 302171 302962 303466 304199 305462 306770 307322 307320 308221
$$ [...]
##END NTUPLES=NMR SPECTRUM
##END=
