
##TITLE=AC1124_Huila-Iquira_5906410_u8hJxQCO1t
##JCAMPDX= 6.0         $$ Bruker NMR JCAMP-DX V2.0
##DATA TYPE= NMR SPECTRUM
##DATA CLASS= NTUPLES
##ORIGIN= BRUKER
##OWNER= Administrator
$$ 1.72 TOPSPIN		Version 2.1
$$ 2012-04-10 10:15:21.734 -0500  Administrator@TOPSPIN
$$ Compression mode = diff/dup
##.OBSERVE FREQUENCY= 400.13188235
##.OBSERVE NUCLEUS= ^1H
##.ACQUISITION MODE= SIMULTANEOUS (DQD)
##.ACQUISITION SCHEME= undefined
##.AVERAGES= 64
##.DIGITISER RES= 22
##SPECTROMETER/DATA SYSTEM= spect
##.PULSE SEQUENCE= noesygpps1d.comp
##.SOLVENT NAME= COFFEE_meoh
##.SHIFT REFERENCE= INTERNAL, COFFEE_meoh, 1, 14.96869
##AUDIT TRAIL= $$ (NUMBER, WHEN, WHO, WHERE, PROCESS, VERSION, WHAT)
$$ ##TITLE= Audit trail, TOPSPIN		Version 2.1
$$ ##JCAMPDX= 5.01
$$ ##ORIGIN= Bruker BioSpin GmbH
$$ ##OWNER= Administrator
$$ $$ C:\Bruker\TOPSPIN/data/COFFEE/nmr/AC1124_Huila-Iquira_5906410_u8hJxQCO1t/12/pdata/1/auditp.txt
$$ ##AUDIT TRAIL=  $$ (NUMBER, WHEN, WHO, WHERE, PROCESS, VERSION, WHAT)
(   1,<2012-04-04 12:44:18.218 -0500>,<Administrator>,<TOPSPIN>,<go>,<TOPSPIN 2.1>,
      <created by zg
	started at 2012-04-04 12:32:46.562 -0500,
	POWCHK enabled, PULCHK disabled,
       configuration hash MD5:
       1A 1E CE 29 27 FD 77 03 67 4E F0 E3 C4 B2 CB 90
       data hash MD5: 64K
       E6 E3 16 D0 DC 5C D9 44 DD 49 04 7C 6C 03 ED 64>)
(   2,<2012-04-04 12:44:21.187 -0500>,<Administrator>,<TOPSPIN>,<proc1d>,<TOPSPIN 2.1>,
      <Start of raw data processing
       efp LB = 0.3 FT_mod = 6 PKNL = 1 PHC0 = 0 PHC1 = 0 SI = 128K 
       data hash MD5: 128K
       FB 9F 10 A7 D6 2D DF 53 7D D1 62 57 10 3E BA A7>)
(   3,<2012-04-04 12:44:22.359 -0500>,<Administrator>,<TOPSPIN>,<proc1d>,<TOPSPIN 2.1>,
      <pk PHC0 = 34.69482 PHC1 = 0 
       data hash MD5: 128K
       F1 12 28 FA 2F 5E 02 8D A4 D0 2E E0 5E 2E F0 01>)
(   4,<2012-04-04 12:44:22.828 -0500>,<Administrator>,<TOPSPIN>,<proc1d>,<TOPSPIN 2.1>,
      <abs ABSG = 1 
       data hash MD5: 128K
       FE 8C 0C 7A C6 0A FF 81 86 C1 8C E0 73 85 D7 F6>)
(   5,<2012-04-04 12:44:22.890 -0500>,<Administrator>,<TOPSPIN>,<proc1d>,<TOPSPIN 2.1>,
      <abs ABSG = 2 
       data hash MD5: 128K
       95 42 AA DA 9D 5D 25 86 C9 5A AB E2 98 89 56 BE>)
(   6,<2012-04-04 12:44:22.953 -0500>,<Administrator>,<TOPSPIN>,<proc1d>,<TOPSPIN 2.1>,
      <abs ABSG = 3 
       data hash MD5: 128K
       B9 BC F1 6A 7B 56 A6 D9 63 C7 EC D8 AE 9B C6 A4>)
(   7,<2012-04-04 12:44:23.000 -0500>,<Administrator>,<TOPSPIN>,<proc1d>,<TOPSPIN 2.1>,
      <abs ABSG = 4 
       data hash MD5: 128K
       94 7F 1A 58 5C 87 5A D7 4A B8 35 47 E3 06 9F 1F>)
(   8,<2012-04-04 12:44:23.062 -0500>,<Administrator>,<TOPSPIN>,<proc1d>,<TOPSPIN 2.1>,
      <abs ABSG = 5 
       data hash MD5: 128K
       7D 27 05 2F F9 2F 26 C4 9B 48 4C C0 D9 C9 CB 5E>)
(   9,<2012-04-04 12:44:23.281 -0500>,<Administrator>,<TOPSPIN>,<audit>,<TOPSPIN 2.1>,
      <user comment:
       ICON-NMR User ID: COFFEE
       data hash MD5: 128K
$$ [...]
##$TP07= 0
##$TPNAME0= <>
##$TPNAME1= <>
##$TPNAME2= <>
##$TPNAME3= <>
##$TPNAME4= <>
##$TPNAME5= <>
##$TPNAME6= <>
##$TPNAME7= <>
##$TPOAL= (0..7)
0.5 0.5 0.5 0.5 0.5 0.5 0.5 0.5
##$TPOFFS= (0..7)
0 0 0 0 0 0 0 0
##$TUNHIN= 0
##$TUNHOUT= 0
##$TUNXOUT= 0
##$USERA1= <user>
##$USERA2= <user>
##$USERA3= <user>
##$USERA4= <user>
##$USERA5= <user>
##$V9= 5
##$VALIST= <valist>
##$VCLIST= <CCCCCCCCCCCCCCC>
##$VD= 0
##$VDLIST= <DDDDDDDDDDDDDDD>
##$VPLIST= <PPPPPPPPPPPPPPP>
##$VTLIST= <TTTTTTTTTTTTTTT>
##$WBST= 2048
##$WBSW= 25
##$XGAIN= (0..3)
0 0 0 0
##$XL= 0
##$YL= 0
##$YMAX_a= 13612564
##$YMIN_a= -6104819
##$ZGOPTNS= <>
##$ZL1= 120
##$ZL2= 120
##$ZL3= 120
##$ZL4= 120
##$ABSF1= 14.96869
##$ABSF2= -5.58384
##$ABSG= 5
##$ABSL= 3
##$ALPHA= 0
##$AQORDER= 0
##$ASSFAC= 0
##$ASSFACI= 0
##$ASSFACX= 0
##$ASSWID= 0
##$AUNMP= <proc_prof1d_extract.lims>
##$AXLEFT= 0
##$AXNAME= <>
##$AXNUC= <1H>
##$AXRIGHT= 0
##$AXTYPE= 0
##$AXUNIT= <>
##$AZFE= 0.1
##$AZFW= 0.1
##$BCFW= 0
##$BC_mod= 0
##$BYTORDP= 0
##$COROFFS= 0
##$CY= 15
##$DATMOD= 1
##$DC= 0
##$DFILT= <>
##$DTYPP= 0
##$F1P= 0
##$F2P= 0
##$FCOR= 0.5
##$FTSIZE= 131072
##$FT_mod= 6
##$GAMMA= 0
##$GB= 0
##$INTBC= 1
##$INTSCL= 1
##$ISEN= 128
##$LB= 0.3
##$LEV0= 0
##$LPBIN= 0
##$MAXI= 10000
##$MC2= 0
##$MEAN= 0
##$ME_mod= 0
##$MI= 0
##$NCOEF= 0
##$NC_proc= -3
##$NLEV= 6
##$NOISF1= 0
##$NOISF2= 0
##$NSP= 0
##$NTH_PI= 0
##$NZP= 0
##$OFFSET= 14.96869
##$PC= 1
##$PHC0= 34.69482
##$PHC1= 0
##$PH_mod= 1
##$PKNL= yes
##$PPARMOD= 0
##$PPDIAG= 0
##$PPIPTYP= 0
##$PPMPNUM= 2147483647
##$PPRESOL= 1
##$PSCAL= 4
##$PSIGN= 0
##$PYNMP= <proc.py>
##$REVERSE= no
##$SF= 400.130004768492
##$SI= 131072
##$SIGF1= 0
##$SIGF2= 0
##$SINO= 400
##$SIOLD= 131072
##$SPECTYP= <>
##$SREGLST= <1H.CDCl3>
##$SSB= 0
##$STSI= 131072
##$STSR= 0
##$SW_p= 8223.68421052632
##$SYMM= 0
##$S_DEV= 0
##$TDeff= 65536
##$TDoff= 0
##$TI= <>
##$TILT= no
##$TM1= 0
##$TM2= 0
##$TOPLEV= 0
##$USERP1= <user>
##$USERP2= <user>
##$USERP3= <user>
##$USERP4= <user>
##$USERP5= <user>
##$WDW= 1
##$XDIM= 131072
##$YMAX_p= 494200964
##$YMIN_p= -412418425
##$CURPLOT= <Network HP LaserJet P1505>
##$CURPRIN= <$Network HP LaserJet P1505>
##$DFORMAT= <normdp>
##$LAYOUT= <+/1D_H.xwp>
##$LFORMAT= <normlp>
##$PFORMAT= <normpl>
##$SURQMSG= 1
$$ End of Bruker specific parameters
$$ ---------------------------------
##NTUPLES= NMR SPECTRUM
##VAR_NAME=  FREQUENCY,     SPECTRUM/REAL,   SPECTRUM/IMAG
##SYMBOL=    X,             R,               I
##VAR_TYPE=  INDEPENDENT,   DEPENDENT,       DEPENDENT
##VAR_FORM=  AFFN,          ASDF,            ASDF
##VAR_DIM=   131072,        131072,          131072
##UNITS=     HZ,            ARBITRARY UNITS, ARBITRARY UNITS
##FACTOR=    0.0627417313425165, 1,          1
##FIRST=     8223.62146879498, 1052,         -86687
##LAST=      0,             2729,            -88711
##MIN=       0,             -412418425,      0
##MAX=       8223.62146879498, 494200964,    0
$$ Real data points
##PAGE= N=1
##DATA TABLE= (X++(R..R)), XYDATA
$$ [...]
60638A557488r992j0403r545o660l424j529p70k39K75O93J062J032J38j101j710
$$ 1557488 1547496 1537093 1527548 1520888 1517464 1515935 1515165 1514926 1515201 1515894 1516956 1517988 1518126 1517025 1515315
60623A515315k003l245n444p215q220r830j2711j5435j6441j5985j5274j4812
$$ 1515315 1513312 1510067 1504623 1497408 1489188 1479358 1466647 1451212 1434771 1418786 1403512 1388700
60611A388700j4401j3715j2275r857p395o307o541o524n429m071l073j929o72
$$ 1388700 1374299 1360584 1348309 1338452 1331057 1324750 1318209 1311685 1306256 1302185 1299112 1297183 1296511
60598A296511p50k786m927m987l305j925j642j381j74J641L056L340K495J450
$$ 1296511 1295761 1292975 1288048 1283061 1279756 1277831 1276189 1274808 1274634 1276275 1279331 1282671 1285166 1286616
60584A286616J328K001K020P03m99J75K384M309N163N583N885N575M769M574N463
$$ 1286616 1287944 1289945 1291965 1292668 1292169 1292344 1294728 1299037 1304200 1309783 1315668 1321243 1326012 1330586 1336049
60569A336049O548P080P702R400J2025J4728J7258J9891K2459K4402K5672K6697
$$ 1336049 1342597 1349677 1357379 1366779 1378804 1393532 1410790 1430681 1453140 1477542 1503214 1529911
60557A529911K7430K7413K6980K7365K8939L0144K9111K5964K2518J9886J7522
$$ 1529911 1557341 1584754 1611734 1639099 1668038 1698182 1727293 1753257 1775775 1795661 1813183
60546A813183J4791J2158J0082P651L526k092p474j1430j4509j7907k1873k5465
$$ 1813183 1827974 1840132 1850214 1857865 1861391 1859299 1851825 1840395 1825886 1807979 1786106 1760641
60534A760641k7460k7095k4386k0352j6707j4800j4482j4284j2967j0778q946
$$ 1760641 1733181 1706086 1681700 1661348 1644641 1629841 1615359 1601075 1588108 1577330 1568384
60523A568384q133p889p601p302p114o529n036l118j812j393j319j366j796k258
$$ 1568384 1560251 1552362 1544761 1537459 1530345 1523816 1518780 1515662 1513850 1512457 1511138 1509772 1507976 1505718
60509A505718j660L76K740M154M621N005N775O713P407P636P576P787Q451Q651
$$ 1505718 1504058 1504434 1507174 1511328 1515949 1520954 1526729 1533442 1540849 1548485 1556061 1563848 1572299 1580950
60495A580950P418N578N245O928Q569Q401P415P728R680J2053J4248J6529J8755
$$ 1580950 1588368 1593946 1599191 1606119 1614688 1623089 1630504 1638232 1647912 1659965 1674213 1690742 1709497
60482A709497K0686K3119K6963L1450L5141L8491M3282M9143N2742N1392M5745
$$ 1709497 1730183 1753302 1780265 1811715 1846856 1885347 1928629 1977772 2030514 2081906 2127651
60471B127651L7902K8493J7111M542p080j6014k1727k4369k4503k3182k1258j8603
$$ 2127651 2165553 2194046 2211157 2215699 2208619 2192605 2170878 2146509 2122006 2098824 2077566 2058963
60459B058963j4604r350l646K089Q191J4941K1865K8092L3005L6377L8133L8445
$$ 2058963 2044359 2035009 2031363 2033452 2041643 2056584 2078449 2106541 2139546 2175923 2214056 2252501
60447B252501L8052L8310M0609M5584N2903O1794P1680Q2219R3126J04413J16884
$$ 2252501 2290553 2328863 2369472 2415056 2467959 2529753 2601433 2683652 2776778 2881191 2998075
60436B998075J31911J50393J72001J95490K19726K44391K69881K96763L25317
$$ 2998075 3129986 3280379 3452380 3647870 3867596 4111987 4381868 4678631 5003948
60427E003948L55475L86925M18887M49356M74172M86682M78829M43748L78670
$$ 5003948 5359423 5746348 6165235 6614591 7088763 7575445 8054274 8498022 8876692
60418H876692K86004J71961M4703q6055k08981l13038l90979m41191m66420m71459
$$ 8876692 9162696 9334657 9379360 9293305 9084324 8771286 8380307 7939116 7472696 7001237
60408G001237m61861m43097m19377l93105l65779l38805l12921k87662k62385
$$ 7001237 6539376 6096279 5676902 5283797 4918018 4579213 4266292 3978630 3716245
60399C716245k37578k14372j93064j73085j54454j38221j25088j14163j03720
$$ 3716245 3478667 3264295 3071231 2898146 2743692 2605471 2480383 2366220 2262500
60390B262500r3148q3625p6637p1976o7769o2478n6368n0592m5680m1698l9158
$$ 2262500 2169352 2085727 2009090 1937114 1869345 1806867 1750499 1699907 1654227 1612529 1573371
60379A573371l8250l7454l4647k9976k6111k4949k5418k5343k4135k2481k0485
$$ 1573371 1535121 1497667 1463020 1433044 1406933 1381984 1356566 1331223 1307088 1284607 1264122
60368A264122j7624j4107j1128r701r750j0129r383p196n069m593m958l815j004
$$ 1264122 1246498 1232391 1221263 1211562 1201812 1191683 1182300 1175104 1170035 1165442 1160484 1156669 1155665
60355A155665O34o75k808k700m77J528K539L649N146O141O666P812R491J0137
$$ 1155665 1156299 1155624 1152816 1150116 1149639 1151167 1153706 1157355 1162501 1168642 1175308 1183120 1192611 1202748
60341A202748R059P472O763P065P856Q701R185R127Q917Q698P629N252L142L474
$$ 1202748 1211807 1219279 1226042 1233107 1240963 1249664 1258849 1267976 1276893 1285591 1293220 1298472 1301614 1305088
60327A305088O103Q672R595R180P877N499K577N33k41q76j951k519k024j649k636
$$ 1305088 1311191 1319863 1329458 1338638 1346515 1352014 1354591 1355124 1354883 1354007 1352056 1349537 1347513 1345864 1343228
60312A343228m367n229m511k657m59J256J796J305P67R45J912L710O469R383J0696
$$ 1343228 1338861 1333632 1329121 1326464 1326005 1327261 1329057 1330362 1331129 1332074 1333986 1337696 1344165 1353548 1364244
60297A364244R493O831M615L933M865P034R673J1741J2667J2796J2830J3201J3991
$$ 1364244 1373737 1380568 1385183 1389116 1393981 1401015 1410688 1422429 1435096 1447892 1460722 1473923 1487914
60284A487914J4907J5256J4503J2857J0907Q871O832N242M340L521K397J890K940
$$ 1487914 1502821 1518077 1532580 1545437 1556344 1565215 1572047 1577289 1581629 1585150 1587547 1589437 1592377
60271A592377M659N588O366Q846J2565J4657J4030J3098J3899J4768J2819Q128
$$ 1592377 1597036 1602624 1608990 1617836 1630401 1645058 1659088 1672186 1686085 1700853 1713672 1721800
60259A721800L193p03m397q493j2162j4465j5300j4920j3703j2599j2558j3153
$$ 1721800 1724993 1724290 1719893 1711400 1699238 1684773 1669473 1654553 1640850 1628251 1615693 1602540
60247A602540j2767j0624p963o528o500o506n452l581j659Q5J737L012L608L992
$$ 1602540 1589773 1579149 1571186 1564658 1558158 1551652 1546200 1542619 1540960 1541045 1542782 1545794 1549402 1553394
60233A553394M805N593N284M161L866M936N834N419M762N112N666N279N049O700
$$ 1553394 1558199 1563792 1569076 1573237 1577103 1582039 1587873 1593292 1598054 1603166 1608832 1614111 1619160 1625860
60219A625860R279J0081Q606P036O788P271Q154J0114J2623J3736J3116J3045
$$ 1625860 1635139 1645220 1653826 1660862 1667650 1674921 1683075 1693189 1705812 1719548 1732664 1745709
60207A745709J5187J8430K1111K3391K6039K8823L1554L5045L9485M3504M6329
$$ 1745709 1760896 1779326 1800437 1823828 1849867 1878690 1910244 1945289 1984774 2028278 2074607
60196B074607M9320N3791N8837O3113O7352P3120Q0172Q7019R3389J00244J08004
$$ 2074607 2123927 2177718 2236555 2299668 2367020 2440140 2520312 2607331 2700720 2800964 2908968
60185B908968J16470J25908J36549J47486J57661J67388J77388J86858J94130
$$ 2908968 3025438 3151346 3287895 3435381 3593042 3760430 3937818 4124676 4318806
60176D318806J98874K01811K02568J99585J92348J82127J70209J56769J41747
$$ 4318806 4517680 4719491 4922059 5121644 5313992 5496119 5666328 5823097 5964844
60167E964844J25503J08106Q9091O8594M8040K9056J2103l401j7756l0105l8849
$$ 5964844 6090347 6198453 6287544 6356138 6404178 6433234 6445337 6441936 6424180 6394075 6355226
60156F355226m3031m3248m0944l6798l0270k0862r083M167J8609L4470N1725O9838
$$ 6355226 6312195 6268947 6228003 6191205 6160935 6140073 6130990 6135157 6153766 6188236 6239961 6309799
60144F309799Q7935J05228J21682J38136J54799J69697J79945J84933J86821J87133
$$ 6309799 6397734 6502962 6624644 6762780 6917579 7087276 7267221 7452154 7638975 7826108
60134G826108J84199J75145J59338J38735J15532R0780O4873L8209J1264j5260
$$ 7826108 8010307 8185452 8344790 8483525 8599057 8689837 8754710 8792919 8804183 8788923
60124H788923m0465o3716q4636j02491j16219j25335j30035j30144j25082j15255
$$ 8788923 8748458 8684742 8600106 8497615 8381396 8256061 8126026 7995882 7870800 7755545
60114G755545j02227q6871o8588m7205k4315j737K0184M1625O1946Q0586R8012
$$ 7755545 7653318 7566447 7497859 7450654 7426339 7424602 7444786 7486411 7548357 7628943 7726955
60103G726955J14088J26484J32662J32904J29494J23190J12627R7476Q0237O3969
$$ 7726955 7841043 7967527 8100189 8233093 8362587 8485777 8598404 8695880 8776117 8840086
60093H840086M9459L5675K2404J1288M222J461K023N778J4106K7716M4623O1853
$$ 8840086 8889545 8925220 8947624 8958912 8963134 8964595 8966618 8972396 8986502 9014218 9058841 9120694
60081I120694P8948R8221J21156J46302J71542J97046K24761K55939K90265L26742
$$ 9120694 9199642 9297863 9419019 9565321 9736863 9933909 10158670 10414609 10704874 11031616
60071A1031616L64452M02817M41586M80053N16339N48362N75526N97818O13255
$$ 11031616 11396068 11798885 12240471 12720524 13236863 13785225 14360751 14958569 15571824
60062A5571824O18363O12052N96773N74502N43530N01022M47084L84465L15541
$$ 15571824 16190187 16802239 17399012 17973514 18517044 19018066 19465150 19849615 20165156
60053B0165156K41599J63908Q3501N85q4077j67667k46484l17636l78569m26601
$$ 20165156 20406755 20570663 20654164 20654749 20570672 20403005 20156521 19838885 19460316 19033715
60043A9033715m60875m83414m96059m97500m85602m61672m29787l92564l50326
$$ 19033715 18572840 18089426 17593367 17095867 16610265 16148593 15718806 15326242 14975916
60034A4975916l04097k56476k09019j61146j12469o4617k0192J8570M9823P2366
$$ 14975916 14671819 14415343 14206324 14045178 13932709 13868092 13847900 13866470 13916293 13988659
60024A3988659Q6531R3712R4651Q9017P6638N8202L4772P702k1102m9908p8161
$$ 13988659 14075190 14168902 14263553 14352570 14429208 14487410 14522182 14529884 14508782 14458874 14380713
60013A4380713j06061j33366j59406j83815k06511k27383k46472k63637k77427
$$ 14380713 14274652 14141286 13981880 13798065 13591554 13364171 13117699 12854062 12576635
60004A2576635k85760k88520k87874k84782k77200k63573k46087k27917k08904
$$ 12576635 12290875 12002355 11714481 11429699 11152499 10888926 10642839 10414922 10206018
59995A0206018j86892j62089j36623j10561q1850n0350j8624J1557M0608O8600
$$ 10206018 10019126 9857037 9720414 9609853 9528003 9477653 9459029 9470586 9511194 9579794
59985I579794R4265J17215J38388J57317J71325J78533J79480J74864J63783J45520
$$ 9579794 9674059 9791274 9929662 10086979 10258304 10436837 10616317 10791181 10954964 11100484
59975A1100484J21351R3377O2838L0336l530l8319p3271j06421j35595j60446
$$ 11100484 11221835 11315212 11378050 11408386 11404856 11366537 11293266 11186845 11051250 10890804
59965A0890804j81874j99384k10969k15926k15683k11300k02241j88348j71087
$$ 10890804 10708930 10509546 10298577 10082651 9866968 9655668 9453427 9265079 9093992
59956I093992j51898j31028j08695q5595o1462l5003o181K3062N1354P9440J08250
$$ 9093992 8942094 8811066 8702371 8616776 8555314 8520311 8514130 8537192 8588546 8667986 8776236
59945H776236J37053J64725J91335K17243K41611K62661K78354K86343K84794
$$ 8776236 8913289 9078014 9269349 9486592 9728203 9990864 10269218 10555561 10840355
59936A0840355K74187K57030K34990K07515J73995J35888R5747N5320J5331k3977
$$ 10840355 11114542 11371572 11606562 11814077 11988072 12123960 12219707 12275027 12290358 12266381
59926A2266381o2769j00905j36651j67047j89927k04625k10897k08911k00372
$$ 12266381 12203612 12102707 11966056 11799009 11609082 11404457 11193560 10984649 10784277
59917A0784277j87540j70647j48243j20657r0966o1761l3031m204K3944N0492
$$ 10784277 10596737 10426090 10277847 10157190 10066224 10004463 9971432 9967228 9991172 10041664
59907A0041664P5413R8146J17245J32788J47004J60808J71751J77168J77510J74640
$$ 10041664 10117077 10215223 10332468 10465256 10612260 10773068 10944819 11121987 11299497 11474137
59897A1474137J68744J59307J47653J35856J24020J10954R7016Q4187P3891O6487
$$ 11474137 11642881 11802188 11949841 12085697 12209717 12320671 12417687 12501874 12575765 12642252
59887A2642252O2583O2967O7655P6558R0675J11066J37070J67120K01038K39900
$$ 12642252 12704835 12767802 12835457 12912015 13002690 13113756 13250826 13417946 13618984 13858884
59877A3858884K83850L31466L81313M32725M84748N35239N81215O19479O47099
$$ 13858884 14142734 14474200 14855513 15288238 15772986 16308225 16889440 17508919 18156018
59868A8156018O61762O61452O43478O04574N42805M59103L56735K40220J15219
$$ 18156018 18817780 19479232 20122710 20727284 21270089 21729192 22085927 22326147 22441366
59859B2441366j1661j34225k47587l47548m30409m94385n40240n69643n83694
$$ 22441366 22429705 22295480 22047893 21700345 21269936 20775551 20235311 19665668 19081974
59850A9081974n83726n72127n51086n21358m83484m39314l91208l40616k88487
$$ 19081974 18498248 17926121 17375035 16853677 16370193 15930879 15539671 15199055 14910568
59841A4910568k36067j84058j31959p9600k8500J9689O5119J08529J48683J82685
$$ 14910568 14674501 14490443 14358484 14278884 14250384 14270073 14335192 14443721 14592404 14775089
59831A4775089K08379K24901K31183K25437K06291J73462J27582P0305M322o7519
$$ 14775089 14983468 15208369 15439552 15664989 15871280 16044742 16172324 16242629 16246951 16179432
59821A6179432j42537k16972k85497l43676l90618m27973m56670m75934m85096
$$ 16179432 16036895 15819923 15534426 15190750 14800132 14372159 13915489 13439555 12954459
59812A2954459m84951m77187m63492m45258m23435l98725l72242l45312l18071
$$ 12954459 12469508 11992321 11528829 11083571 10660136 10261411 9889169 9543857 9225786
59803I225786k89433k59557k31223k07309j87690j70311j54676j42229j33380
$$ 9225786 8936353 8676796 8445573 8238264 8050574 7880263 7725587 7583358 7449978
59794G449978j26298j19175j12211j06546j02242r7969r2136q3878p3562o2653
$$ 7449978 7323680 7204505 7092294 6985748 6883506 6785537 6693401 6609523 6535961 6473308
59784F473308n2929m5597m1183l9804m1168m4665m9933n6968o5232p3176p9180
$$ 6473308 6420379 6374782 6333599 6293795 6252627 6207962 6158029 6101061 6035829 5962653 5883473
59773E883473q2493q2926q0319p5011o8252o1308n4400m6849l7844k6939j4775
$$ 5883473 5800980 5718054 5637735 5562724 5494472 5433164 5378764 5331915 5294071 5267132 5252357
59762E252357l606M168Q806J3401K0432K9342L8474M7903N8739P0684Q2006R1380
$$ 5252357 5248751 5252919 5261725 5275126 5295558 5324900 5363374 5411277 5470016 5540700 5622706 5714086
59750E714086R8271J02142J02822J01336R8965R5727R0895Q4410P6585O7121N6132
$$ 5714086 5812357 5914499 6017321 6118657 6217622 6313349 6404244 6488654 6565239 6632360 6688492
59739F688492M5651L8354L4825L3533L3503L5477M0401M8154N8193P0359Q4787
$$ 6688492 6734143 6772497 6807322 6840855 6874358 6909835 6950236 6998390 7056583 7126942 7211729
59728G211729J01690J21283J43413J67605J94036K23874K57748K94685L33641
$$ 7211729 7313419 7434702 7578115 7745720 7939756 8163630 8421378 8716063 9049704
59719I049704L75214M20313M67528N13394N54757N89057O11976O16388N94165
$$ 9049704 9424918 9845231 10312759 10826153 11380910 11969967 12581943 13198331 13792496
59710A3792496N38829M47984L26082J85724M4334q2550j85871k62743l13911l42165
$$ 13792496 14331325 14779309 15105391 15291115 15335449 15252899 15067028 14804285 14490374 14148209
59700A4148209l51709l47398l33720l13905k89494k61098k30019j98433j67376
$$ 14148209 13796500 13449102 13115382 12801477 12511983 12250885 12020866 11822433 11655057
59691A1655057j35615j01753o6589l2040J540L5101O8526J00696J31941J64277
$$ 11655057 11519442 11417689 11351100 11319060 11320600 11355701 11424227 11524923 11656864 11821141
59681A1821141J98559K33227K66735K99821L34481L71899M12337M56102N03399
$$ 11821141 12019700 12252927 12519662 12819483 13153964 13525863 13938200 14394302 14897701
59672A4897701N53610O05642O58953P13886P71067Q30582Q91556R52488J011944
$$ 14897701 15451311 16056953 16715906 17429792 18200859 19031441 19922997 20875485 21887429
59663B1887429J068494J119653J161571J190518J204377J202308J184082J151345
$$ 21887429 22955923 24075576 25237147 26427665 27632042 28834350 30018432 31169777
59655C1169777J109081J064239J022422R86807R59908R44701R43165R54547R75520
$$ 31169777 32278858 33343097 34365519 35352326 36312234 37256935 38200100 39154647 40130167
59646D0130167J001481J027368J047900J057733J051610J024822R74349Q99677
$$ 40130167 41131648 42159016 43206916 44264649 45316259 46341081 47315430 48215107
59638D8215107Q02355O85167N52326M10132K66543J29851P609r4228j72236k25517
$$ 48215107 49017462 49702629 50254955 50665087 50931630 51061481 51069090 50974862 50802626 50577109
59628E0577109k54147k57992k37620j95483j34981n8493L2790J37502K53792L80152
$$ 50577109 50322962 50064970 49827350 49631867 49496886 49438393 49471183 49608685 49862477 50242629
59618E0242629N15354O57231Q02086R45370J082237J207397J314548J395641J440507
$$ 50242629 50757983 51415214 52217300 53162670 54244907 55452304 56766852 58162493 59603000
59609E9603000J438197J379663J259205J074010Q24631N18031J69632j99099n65487
$$ 59603000 61041197 62420860 63680065 64754075 65578706 66096737 66266369 66067270 65501783
59600F5501783r08639j210621j458260j645018j770749j839832j859790j840130
$$ 65501783 64593144 63382523 61924263 60279245 58508496 56668664 54808874 52968744
59592E2968744j790637j720657j640330j561065j493411j445274j422720j429791
$$ 52968744 51178107 49457450 47817120 46256055 44762644 43317370 41894650 40464859
59584D0464859j464340j514909j564799j600090j613251j601486j565626j510787
$$ 40464859 39000519 37485610 35920811 34320721 32707470 31105984 29540358 28029571
59576B8029571j444583j372705j297187j218853j139390j060631r83817r10203
$$ 28029571 26584988 25212283 23915096 22696243 21556853 20496222 19512405 18602202
59568A8602202q41020p76362p15474o58215o04794n54262n05198m58036m14891
$$ 18602202 17761182 16984820 16269346 15611131 15006337 14452075 13946877 13488841 13073950
59559A3073950l76718l42300l10285k80647k53997k31022k12658j99115j88850
$$ 13073950 12697232 12354932 12044647 11764000 11510003 11278981 11066323 10867208 10678358
59550A0678358j80393j74853j74280j77721j81730j85052j89548j95513j99462
$$ 10678358 10497965 10323112 10148832 9971111 9789381 9604329 9414781 9219268 9019806
59541I019806j98572j94713j91531j89232j84759j76086j64225j51434j39131
$$ 9019806 8821234 8626521 8434990 8245758 8060999 7884913 7720688 7569254 7430123
59532G430123j27418j15469j02568q9166p6415o4471n2276l9328k6421j4247k757
$$ 7430123 7302705 7187236 7084668 6995502 6919087 6854616 6802340 6763012 6736591 6722344 6719587
59521F719587P670J6005K2311K8106L4182L9740M4605N0310N7493O3977O7465
$$ 6719587 6727257 6743262 6765573 6793679 6827861 6867601 6912206 6962516 7020009 7083986 7151451
59510G151451O9028P2046P8433Q7653R8808J11701J25919J40541J55251J70706
$$ 7151451 7220479 7292525 7370958 7458611 7557419 7669120 7795039 7935580 8090831 8261537
59500H261537J87461K05127K23006K41306K61455K84887L11278L38335L64052
$$ 8261537 8448998 8654125 8877131 9118437 9379892 9664779 9976057 10314392 10678444
59491A0678444L88696M13523M37920M59352M76254M89288M99235N05111N05135
$$ 10678444 11067140 11480663 11918583 12377935 12854189 13343477 13842712 14347823 14852958
59482A4852958M98344M84612M64388M39266M11684L83040L52663L19084K81656
$$ 14852958 15351302 15835914 16300302 16739568 17151252 17534292 17886955 18206039 18487695
59473A8487695K41067J99678J61519J30149J05872Q6599P1985O4807O7287P8035
$$ 18487695 18728762 18928440 19089959 19220108 19325980 19412579 19484564 19549371 19616658 19694693
59463A9694693R3896J13078J34624J56257J74562J86315J88040J75477J45739
$$ 19694693 19788589 19901667 20036291 20192548 20367110 20553425 20741465 20916942 21062681
59454B1062681R9878M1761k5368j00035j80717k64389l46987m24497m93705n52520
$$ 21062681 21162559 21204320 21178952 21078917 20898200 20633811 20286824 19862327 19368622 18816102
59444A8816102n99520o33058o51756o56400o50203o36155o14886n86030n50851
$$ 18816102 18216582 17583524 16931768 16275368 15625165 14989010 14374124 13788094 13237243
59435A3237243n12220m72576m32984l93774l54980l16444k78311k41387k06444
$$ 13237243 12725023 12252447 11819463 11425689 11070709 10754265 10475954 10234567 10028123
59426A0028123j73443j41802j10905q0096m8959j7916J2292M2013P2417J03450
$$ 10028123 9854680 9712878 9601973 9521877 9472918 9455002 9467294 9509307 9581724 9685174
59416I685174J33500J61953J90462K20472K50761K78939L04341L27630L48216
$$ 9685174 9818674 9980627 10171089 10391561 10642322 10921261 11225602 11553232 11901448
59407A1901448L63746L71948L71547L61481L40551L08062K64120K09328J44985
$$ 11901448 12265194 12637142 13008689 13370170 13710721 14018783 14282903 14492231 14637216
59398A4637216P3348k663p9814j54368k22483k81756l31919l73407m05876m28757
$$ 14637216 14710564 14707901 14628087 14473719 14251236 13969480 13637561 13264154 12858278 12429521
59388A2429521m42550m48610m48210m42506m32682m19255m01787l80218l56098
$$ 12429521 11986971 11538361 11090151 10647645 10214963 9795708 9393921 9013703 8657605
59379H657605l31712l08405k86284k65016k44219k23645k03578j84495j66049
$$ 8657605 8325893 8017488 7731204 7466188 7221969 6998324 6794746 6610251 6444202
59370F444202j47364j28879j12547r9217q7004p3618n9306m6053l4639k4153j3955
$$ 6444202 6296838 6167959 6055412 5956195 5869191 5795573 5736267 5690214 5655575 5631422 5617467
59359E617467m361M628J3710K2978L1496L8762M5874N4488O4657P3884P8583P6949
$$ 5617467 5613106 5617734 5631444 5654422 5685918 5724680 5770554 5825042 5889699 5963583 6042166 6119115
59347F119115P0801O4575O2453O6329P5710Q8538J02466J16706J32742J51882
$$ 6119115 6189916 6254491 6316944 6383273 6458983 6547521 6649987 6766693 6899435 7051317
59337G051317J72074J88824K00003K08351K18620K33677K54165K80108L11139
$$ 7051317 7223391 7412215 7612218 7820569 8039189 8272866 8527031 8807139 9118278
59328I118278L46181L84398M25918M70782N18088N67161O18488O72371P27441
$$ 9118278 9464459 9848857 10274775 10745557 11263645 11830806 12449294 13121665 13849106
59319A3849106P81557Q33054Q79981R19227R47707R63652R65531R50985R18817
$$ 13849106 14630663 15463717 16343698 17262925 18210632 19174284 20139815 21090800 22009617
59310B2009617Q71469Q13926P50455O83659O15979N50065M87324M27203L68185
$$ 22009617 22881086 23695012 24445467 25129126 25745105 26295170 26782494 27209697 27577882
59301B7577882L08801K47861J84523J18145M7824k7202j06149j86471k65603l41930
$$ 27577882 27886683 28134544 28319067 28437212 28485036 28457834 28351685 28165214 27899611 27557681
59291B7557681m13368m76553n29078n71768o07237o36934o61139o81150o99492
$$ 27557681 27144313 26667760 26138682 25566914 24959677 24322743 23661604 22980454 22280962
59282B2280962p17627p34775p49074p58889p62842p59686p48784p30603p06664
$$ 22280962 21563335 20828560 20079486 19320597 18557755 17798069 17049285 16318682 15612018
59273A5612018o78954o48844o16500n81746n45409n08836m72237m35116l98446
$$ 15612018 14933064 14284220 13667720 13085974 12540565 12031729 11559492 11124376 10725930
59264A0725930l64605l34365l05708k76698k47932k20974j96079j72897j51837
$$ 10725930 10361325 10026960 9721252 9444554 9196622 8975648 8779569 8606672 8454835
59255H454835j33024j15213r7333p9959o3786m8013l2036j7127m382P790K1729
$$ 8454835 8321811 8206598 8109265 8029306 7965520 7917507 7885471 7868344 7863962 7871752 7893481
59244G893481L7044N1512O4651P7955R1918J05373J17701J29521J40958J51075
$$ 7893481 7930525 7982037 8046688 8124643 8216561 8321934 8439635 8569156 8710114 8861189
59234H861189J59225J65316J68904J69580J68267J66447J64188J60567J55969
$$ 8861189 9020414 9185730 9354634 9524214 9692481 9858928 10023116 10183683 10339652
59225A0339652J52118J49714J47681J45155J42885J42383J44686J49920J56844
$$ 10339652 10491770 10641484 10789165 10934320 11077205 11219588 11364274 11514194 11671038
59216A1671038J62870J65708J65079J61998J56640J47788J33709J12483Q2376
$$ 11671038 11833908 11999616 12164695 12326693 12483333 12631121 12764830 12877313 12959689
59207A2959689M3730K90m2877q2666j18087j48078j71165j87069j96745k00721
$$ 12959689 13003419 13003709 12960832 12878166 12760079 12612001 12440836 12253767 12057022 11856301
59197A1856301j98983j92441j82807j70633j54941j35225j12735q9426o6541m4329
$$ 11856301 11657318 11464877 11282070 11111437 10956496 10821271 10708536 10619110 10552569 10508240
59187A0508240k2483q73J9673L7863N3815O9457Q6028J02016J14980J24607J32609
$$ 10508240 10485757 10484884 10504557 10542420 10596235 10665692 10751720 10853736 10968716 11093323 11225932
59176A1225932J40418J48581J57884J69354J83380K00113K20231K44232K71674
$$ 11225932 11366350 11514931 11672815 11842169 12025549 12225662 12445893 12690125 12961799
59167A2961799L02267L36521L73800M10968M44671M73641M96563N09098N05815
$$ 12961799 13264066 13600587 13974387 14385355 14830026 15303667 15800230 16309328 16815143
59158A6815143M84453M45769L89948L16201K25714J22141R162j09710k28755l40487
$$ 16815143 17299596 17745365 18135313 18451514 18677228 18799369 18808531 18698821 18470066 18129579
59148A8129579m39436n23686n92468o44518o79229o97302o99775o88261o66420
$$ 18129579 17690143 17166457 16573989 15929471 15250242 14552940 13853165 13164904 12498484
59139A2498484o39034o09069n77114n43422n08536m72329m35088l99537l68881
$$ 12498484 11859450 11250381 10673267 10129845 9621309 9148980 8713892 8314355 7945474
59130G945474l42562l16948k90761k66669k46480k28182k09578j91978j77712
$$ 7945474 7602912 7285964 6995203 6728534 6482054 6253872 6044294 5852316 5674604
59121E674604j65947j53680j39834j26166j14577j05211r6956q8586p9586p0481
$$ 5674604 5508657 5354977 5215143 5088977 4974400 4869189 4772233 4683647 4604061 4533580
59111D533580o2251n5172m8708m2302l5460k7304j7398o952K081R191J5475K1796
$$ 4533580 4471329 4416157 4367449 4325147 4289687 4262383 4244985 4238033 4240114 4249305 4264780 4286576
59099D286576K8286L5419M3789N2670O0481O6864P2827P8901Q4918R1358R8942
$$ 4286576 4314862 4350281 4394070 4446740 4507221 4574085 4646912 4725813 4810731 4902089 5001031
59088E001031J06860J13557J19346J25905J33067J38702J42330J46152J51457
$$ 5001031 5107891 5221448 5340794 5466699 5599766 5738468 5880798 6026950 6178407
59079F178407J56420J58695J58136J55753J51789J46152J39145J30666J20160
$$ 6178407 6334827 6493522 6651658 6807411 6959200 7105352 7244497 7375163 7495323
59070G495323J08197R6600Q6208P6217O6365N7940N1864M7679M5275M5701M9316
$$ 7495323 7603520 7700120 7786328 7862545 7928910 7986850 8038714 8086393 8131668 8177369 8226685
59059H226685N5207O3385P5356R1145J07968J23610J39319J57482J78027J99042
$$ 8226685 8281892 8345277 8420633 8511778 8619746 8743356 8882675 9040157 9218184 9417226
59049I417226K19606K40007K59754K77301K91319L00910L04748L00901K87346
$$ 9417226 9636832 9876839 10136593 10413894 10705213 11006123 11310871 11611772 11899118
59040A1899118K62530K26371J81007J29607P4197J5858m2860r7515j44462j82587
$$ 11899118 12161648 12388019 12569026 12698633 12772830 12788688 12745828 12648313 12503851 12321264
59030A2321264k12003k32806k45863k53033k55669k54217k49953k45241k41258
$$ 12321264 12109261 11876455 11630592 11377559 11121890 10867673 10617720 10372479 10131221
59021A0131221k37222k32880k29942k29829k31717k34153k37069k40616k43403
$$ 10131221 9893999 9661119 9431177 9201348 8969631 8735478 8498409 8257793 8014390
59012H014390k43652k41452k38404k35424k31801k26178k18011k08436j99578
$$ 8014390 7770738 7529286 7290882 7055458 6823657 6597479 6379468 6171032 5971454
59003E971454j92161j84251j73679j61277j49884j40508j31608j22113j12686
$$ 5971454 5779293 5595042 5421363 5260086 5110202 4969694 4838086 4715973 4603287
58994D603287j03758r4901q6642q0357p5800p1437o7872o7963p2381p7901q1502
$$ 4603287 4499529 4404628 4317986 4237629 4161829 4090392 4022520 3954557 3882176 3804275 3722773
58983C722773q3480q5102q5943q5284q3658q1211p6890p0899o5490o1645n7544
$$ 3722773 3639293 3554191 3468248 3382964 3299306 3218095 3141205 3070306 3004816 2943171 2885627
58972B885627n2093m7003m3347l9028l2456k5986k2443k0563j7210j2408q741
$$ 2885627 2833534 2786531 2743184 2704156 2671700 2645714 2623271 2602708 2585498 2573090 2564349
58961B564349p158o522o343o890p408o980o415o917p684p144n528l924j921J247
$$ 2564349 2557191 2550669 2544326 2537436 2530028 2523048 2516633 2509716 2502032 2494888 2489360 2485436 2483515 2484762
58947B484762M371N711N925O987Q961J0357J0925J1553J2078J1718J1032J1114
$$ 2484762 2489133 2494844 2500769 2507756 2516717 2527074 2537999 2549552 2561630 2573348 2584380 2595494
58935B595494J1511J1371J1666J3656J6085J6901J7033J9177K3074K5435K4850
$$ 2595494 2607005 2618376 2630042 2643698 2659783 2676684 2693717 2712894 2735968 2761403 2786253
58924B786253K3525K3580K4498K5257K6348K8344L0530L2211L3795L5766L7973
$$ 2786253 2809778 2833358 2857856 2883113 2909461 2937805 2968335 3000546 3034341 3070107 3108080
58913C108080M0569M4165M8348N1551N3118N4286N6457N9648O3260O7223P1571
$$ 3108080 3148649 3192814 3241162 3292713 3345831 3400117 3456574 3516222 3579482 3646705 3718276
58902C718276P5679P8837Q1203Q3679Q6836R0097R2019R1784R0538R0584R2954
$$ 3718276 3793955 3872792 3953995 4037674 4124510 4214607 4306626 4398410 4488948 4579532 4672486
58891D672486R6509R9869J03197J07425J12890J19727J28440J38910J49828J60361
$$ 4672486 4768995 4868864 4972061 5079486 5192376 5312103 5440543 5579453 5729281 5889642
58881E889642J71464J84288J98230K12120K26468K42860K61534K81113L00416
$$ 5889642 6061106 6245394 6443624 6655744 6882212 7125072 7386606 7667719 7968135
58872G968135L19465L39165L61077L86819M16377M47677M79050N11470N47125
$$ 7968135 8287600 8626765 8987842 9374661 9791038 10238715 10717765 11229235 11776360
58863A1776360N86552O28765O73593P22082P74658Q30164Q86802R43153R98458
$$ 11776360 12362912 12991677 13665270 14387352 15162010 15992174 16878976 17822129 18820587
58854A8820587J052542J104959J153374J193378J220360J230691J220669J185739
$$ 18820587 19873129 20978088 22131462 23324840 24545200 25775891 26996560 28182299
58846B8182299J122047J027901R03047P48237N67059L67118J57806n2623k57037
$$ 28182299 29304346 30332247 31235294 31983531 32550590 32917708 33075514 33022891 32765854
58837C2765854m48142o19113p65132q83605r73932j037999j079479j101391j105284
$$ 32765854 32317712 31698599 30933467 30049862 29075930 28037931 26958452 25857061 24751777
58828B4751777j093328j069262j036032r94529r46161q94697q43622p93421p43442
$$ 24751777 23658449 22589187 21553155 20558626 19612465 18717768 17874146 17080725 16337283
58819A6337283o94794o49270o07066n67882n32990n03716m78850m55635m32514
$$ 16337283 15642489 14993219 14386153 13818271 13285281 12781565 12302715 11847080 11414566
58810A1414566m09182l85245l60790l37201l15471k94837k74492k55055k36699
$$ 11414566 11005384 10620139 10259349 9922148 9606677 9311840 9037348 8782293 8545594
58801H545594k17873j97991j79203j63073j47669j30822j14070j00088q8055p5212
$$ 8545594 8327721 8129730 7950527 7787454 7639785 7508963 7394893 7294805 7206750 7131538
58791G131538o1474m8688l6521k3032q674M285J6022K9062M4042N9027P3110Q7418
$$ 7131538 7070064 7021376 6984855 6961823 6953149 6957434 6973456 7002518 7046560 7105587 7178697 7266115
58779G266115J02373J17179J32215J48859J66558J83091J98119K13831K31671
$$ 7266115 7368488 7485667 7617882 7766741 7933299 8116390 8314509 8528340 8760011
58770H760011K50974K71142K92660L15558L39243L64104L91251M20579M51265
$$ 8760011 9010985 9282127 9574787 9890345 10229588 10593692 10984943 11405522 11856787
58761A1856787M84014N20587N61189O04561O50441O99774P52716Q08465Q66537
$$ 11856787 12340801 12861388 13422577 14027138 14677579 15377353 16130069 16938534 17805071
58752A7805071R25972R83945J037394J085095J125594J154136J164586J153513
$$ 17805071 18731043 19714988 20752382 21837477 22963071 24117207 25281793 26435306
58744B6435306J119412J059079R68534Q47094O97278N21696L24251J14094r6154
$$ 26435306 27554718 28613797 29582331 30429425 31126703 31648399 31972650 32086744 31990590
58735C1990590k96842m82810o49197p90517r04724r93820j059227j100274j118395
$$ 31990590 31693748 31210938 30561741 29771224 28866500 27872680 26813453 25713179 24594784
58726B4594784j118875j106774j084346j053617j017915r79107r36490q90258
$$ 24594784 23475909 22369135 21284789 20231172 19213257 18234150 17297660 16407402
58718A6407402q43310p98033p53989p10315o67915o27745n89359n52622n18572
$$ 16407402 15564092 14766059 14012070 13301755 12633840 12006095 11416736 10864114 10345542
58709A0345542m87379m57654m28814m01853l76895l52530l28638l07084k88372
$$ 10345542 9858163 9400509 8971695 8569842 8192947 7840417 7511779 7204695 6916323
58700F916323k70214k50980k32119k15630k01143j87185j73499j60709j49159
$$ 6916323 6646109 6395129 6163010 5947380 5746237 5559052 5385553 5224844 5075685
58691E075685j39058j30297j21597j11604j01261r3058q7606q3059p8202p3735
$$ 5075685 4936627 4806330 4684733 4573129 4471868 4378810 4291204 4208145 4129943 4056208
58681D056208p0006o6094o1801n8179n5477n2850n0492m9600m9847m9528m8523
$$ 4056208 3986202 3920108 3858307 3800128 3744651 3691801 3641309 3591709 3541862 3492334 3443811
58670C443811m8325m8853m8289m6657m6317m8117n0124n1101n2151n3929n5282
$$ 3443811 3395486 3346633 3298344 3251687 3205370 3157253 3107129 3056028 3003877 2949948 2894666
58659B894666n5665n6065n6576n6016n4689n4330n4696n3563n0821m8825m7792
$$ 2894666 2839001 2782936 2726360 2670344 2615655 2561325 2506629 2453066 2402245 2353420 2305628
58648B305628m5140m0629l7784l8196l8691l6562l3548l1889l0377k7467k4846
$$ 2305628 2260488 2219859 2182075 2143879 2105188 2068626 2035078 2003189 1972812 1945345 1920499
58637A920499k4388k4582k3353k1837k1954k2655k1937k0495k0112k0255j9361
$$ 1920499 1896111 1871529 1848176 1826339 1804385 1781730 1759793 1739298 1719186 1698931 1679570
58626A679570j7761j6354j4127j0103o251n242o379o753n568m617n075o285p355
$$ 1679570 1661809 1645455 1631328 1621225 1614974 1609732 1603353 1596600 1591032 1586415 1581340 1575055 1567700
58613A567700p859p290n553l647k640k538k905l615m204l822k628j762j285O4
$$ 1567700 1559841 1552551 1546998 1543351 1540711 1538173 1535268 1531653 1527449 1523627 1520999 1519237 1517952 1518016
58599A518016K284L504L015K686M016N986P235Q199R633J1019J2020J3554J6019
$$ 1518016 1520300 1523804 1526819 1529505 1533521 1539507 1546742 1554941 1564574 1575593 1587613 1601167 1617186
58586A617186J8463K0822K4728L0530L5758L8278L9167M0862M4250M8896N4182
$$ 1617186 1635649 1656471 1681199 1711729 1747487 1785765 1824932 1865794 1910044 1958940 2013122
58575B013122N8923O1933O4134O8060P4233Q0429Q5486R1081R8597J07151J16150
$$ 2013122 2072045 2133978 2198112 2266172 2340405 2420834 2506320 2597401 2695998 2803149 2919299
58564B919299J26782J39364J52236J64953J79562J96969K15209K33099K52138
$$ 2919299 3046081 3185445 3337681 3502634 3682196 3879165 4094374 4327473 4579611
58555D579611K72765K92333L09241L25300L41054L52424L55305L49944L37016
$$ 4579611 4852376 5144709 5453950 5779250 6120304 6472728 6828033 7177977 7514993
58546G514993L12750K72733K18421J55524Q7712J6347n4937j20036j74848k18759
$$ 7514993 7827743 8100476 8318897 8474421 8562133 8578480 8523543 8403507 8228659 8009900
58536H009900k52068k74893k88531k95257k96528k92912k85259k74590k61528
$$ 8009900 7757832 7482939 7194408 6899151 6602623 6309711 6024452 5749862 5488334
58527E488334k46890k31658k15751j98502j81056j65843j52796j38999j23458
$$ 5488334 5241444 5009786 4794035 4595533 4414477 4248634 4095838 3956839 3833381
58518C833381j09118r8472r0388q3291p7984p4927p2124o8574o6507o7075o7075
$$ 3833381 3724263 3625791 3535403 3452112 3374128 3299201 3227077 3158503 3091996 3024921 2957846
58507B957846o3553n8702n6358n6203n5435n3962n3748n4635n4755n3948n3389
$$ 2957846 2894293 2835591 2779233 2723030 2667595 2613633 2559885 2505250 2450495 2396547 2343158
58496B343158n2848n1424m9834m9172m8620m6870m4430m2241l9683l6267l3350
$$ 2343158 2290310 2238886 2189052 2139880 2091260 2044390 1999960 1957719 1918036 1881769 1848419
58485A848419l1826l0180k7176k4234k2829k2014k0844k0458k1182k0687j7851
$$ 1848419 1816593 1786413 1759237 1735003 1712174 1690160 1669316 1648858 1627676 1606989 1589138
58474A589138j5267j4798j4107j1069q040p662p918o061m185n682q823r463q165
$$ 1589138 1573871 1559073 1544966 1533897 1525857 1518195 1510277 1504216 1500031 1494349 1485526 1476063 1467898
58461A467898q976j2335j4734j4816j4814j5971j6946j6878j6450j5891j4959
$$ 1467898 1458922 1446587 1431853 1417037 1402223 1386252 1369306 1352428 1335978 1320087 1305128
58450A305128j4333j4448j4005j2202j0852j1496j2350j1086q603o790m988k226
$$ 1305128 1290795 1276347 1262342 1250140 1239288 1227792 1215442 1204356 1195753 1188963 1183975 1181749
58438A181749m94j745l917l976k888l311m556m260l102l272m015l250j973k463
$$ 1181749 1181255 1179510 1175593 1171617 1168729 1165418 1160862 1156602 1153500 1150228 1146213 1142963 1140990 1138527
58424A138527l683l086j500j613k987l166k408k692l236j578J778M014M338L931
$$ 1138527 1134844 1131758 1130258 1128645 1125658 1122492 1120084 1117392 1114156 1112578 1114356 1118370 1122708 1126639
58410A126639L028J723J761L492L485m82m635m386j633j315l021k316J179L477
$$ 1126639 1129667 1131390 1133151 1136643 1140128 1139646 1135011 1130625 1128992 1127677 1124656 1122340 1123519 1126996
58396A126996L154K595K786K477K036K817L216N73l506m997l929l926n865p347
$$ 1126996 1130150 1132745 1135531 1138008 1140044 1142861 1146077 1146650 1143144 1138147 1134218 1130292 1124427 1117080
58382A117080p788q852j0103r383p193o094o220n846n424o441p526o438m539m495
$$ 1117080 1109292 1100440 1090337 1080954 1073761 1067667 1061447 1055601 1050177 1043736 1036210 1029772 1025233 1020738
58368A020738n208m165k727l460m285j492L234N192M395M367N043L854K424M606
$$ 1020738 1015530 1011365 1008638 1005178 1000893 999401 1002635 1007827 1012222 1016589 1021632 1025486 1027910 1032516
58354A032516Q879J0229Q969R927J3325J4470J2701J2626J5678J7988J7759J7527
$$ 1032516 1041395 1051624 1060593 1070520 1083845 1098315 1111016 1123642 1139320 1157308 1175067 1192594
58342A192594J7949J6334J2630J0331J0185R361P541P498Q939Q260N123K833J891
$$ 1192594 1210543 1226877 1239507 1249838 1260023 1269384 1276925 1284423 1293362 1301622 1306745 1309578 1311469
58329A311469j96k567j578J785K428l49k174j984l305o231o178k359K52n34q89
$$ 1311469 1311273 1308706 1307128 1308913 1311341 1310992 1308818 1306834 1303529 1297298 1291120 1288761 1289013 1288479 1287590
58314A287590J651M542N987P603R498R269P590Q291J1323J2230R977Q615R899
$$ 1287590 1289241 1293783 1299770 1307373 1316871 1326140 1333730 1342021 1353344 1365574 1375551 1384166 1394065
58301A394065J0971J0489J0237R738O453K197J853M809N380K725K113N170P256
$$ 1394065 1405036 1415525 1425762 1435500 1441953 1444150 1446003 1450812 1456192 1458917 1461030 1466200 1473456
58288A473456O252N529O340N526K890K695N767Q008Q423J0393J3595J3525J0680
$$ 1473456 1479708 1485237 1491577 1497103 1499993 1502688 1508455 1516463 1524886 1535279 1548874 1562399 1573079
58275A573079J1019J5268J7240J5057J4398J7800K0364J9390J8783K0554K1145
$$ 1573079 1584098 1599366 1616606 1631663 1646061 1663861 1684225 1703615 1722398 1742952 1764097
58264A764097J9541J9913K2907K3450K0466J9390K1805K2265J8792J6820J8975
$$ 1764097 1783638 1803551 1826458 1849908 1870374 1889764 1911569 1933834 1952626 1969446 1988421
58253A988421K0642J9345J8842K0429K0191J8197K0014K5499K7155K3449K2418
$$ 1988421 2009063 2028408 2047250 2067679 2087870 2106067 2126081 2151580 2178735 2202184 2224602
58242B224602K7598L2019L1242L0682L4415L8053L8594M0164M4123M4709M0511
$$ 2224602 2252200 2284219 2315461 2346143 2380558 2418611 2457205 2497369 2541492 2586201 2626712
58231B626712L9078M3923M8129M6899M5082M6249M6043M2771M2556M7300M9587
$$ 2626712 2665790 2709713 2757842 2804741 2849823 2896072 2942115 2984886 3027442 3074742 3124329
58220C124329M6426M5694N1897N8008N8858N9857O4789O7924O6472O7751P5519
$$ 3124329 3170755 3216449 3268346 3326354 3385212 3445069 3509858 3577782 3644254 3712005 3787524
58209C787524Q2047Q2363Q3228Q9426R4618R4820R7070J05394J12166J13011J15953
$$ 3787524 3869571 3951934 4035162 4124588 4219206 4314026 4411096 4516490 4628656 4741667 4857620
58198D857620J25906J34866J37806J43143J56353J68530J72897J77365J88931
$$ 4857620 4983526 5118392 5256198 5399341 5555694 5724224 5897121 6074486 6263417
58189F263417K01141K09112K21027K42003K62712K76866K93498L18856L43477
$$ 6263417 6464558 6673670 6894697 7136700 7399412 7676278 7969776 8288632 8632109
58180H632109L60778L80409M08872M35690M53945M74978N06881N38692N62988
$$ 8632109 8992887 9373296 9782168 10217858 10671803 11146781 11653662 12192354 12755342
58171A2755342N93109O39474O90143P34410P83770Q48734R17037R76744J038547
$$ 12755342 13348451 13987925 14678068 15412478 16196248 17044982 17962019 18938763 19977310
58162A9977310J112519J186372J250929J323203J418789J525770J631650J749638
$$ 19977310 21089829 22276201 23527130 24850333 26269122 27794892 29426542 31176180
58154C1176180J890423K035949K171454K315269K486047K671538K862722L085026
$$ 31176180 33066603 35102552 37274006 39589275 42075322 44746860 47609582 50694608
58146E0694608L359530L669504M004716M399932M887991N459186O113268O900747
$$ 50694608 54054138 57723642 61728358 66128290 71016281 76475467 82588735 89489482
58138H9489482P861242Q982661J0286129J1880966J3851723J6156103J8713211
$$ 89489482 97350724 106333385 116619514 128500480 142352203 158508306 177221517
58131A77221517K1498140K4466160K7565138L0993397L5113216L9486259M1912869
$$ 177221517 198719657 223185817 250750955 281744352 316857568 356343827 398256696
58124C98256696L9149746K9363452J4040677k722460j6862749k6376878l1347814
$$ 398256696 437406442 466769894 480810571 478088111 461225362 434848484 403500670
58117D03500670l2832666l2015513k9945382k7434175k4950520k2658765k0579948
$$ 403500670 370668004 338652491 308707109 281272934 256322414 233663649 213083701
58110B13083701j8690808j6937232j5264960j3663147j2148584j0720332r362058
$$ 213083701 194392893 177455661 162190701 148527554 136378970 125658638 116296580
58103A16296580q073643o866824n734796m651359l604409k618518j729131r20792
$$ 116296580 108222937 101356113 95621317 90969958 87365549 84747031 83017900 82097108
58095H2097108j14479P08526J331786J337994M47895j152652k893734m245813
$$ 82097108 81982629 82691155 84022941 85360935 85808830 84656178 81762444 77516631
58087G7516631n023242n314655n263202m983512m590469m183692l800982l437866
$$ 77516631 72493389 67178734 61915532 56932020 52341551 48157859 44356877 40919011
58079D0919011l100900k805224k542827k295961k068794j873251j699674j532788
$$ 40919011 37818111 35012887 32470060 30174099 28105305 26232054 24532380 22999592
58071B2999592j381067j260353j163011j071554r88497r24941q72844q15913p56733
$$ 22999592 21618525 20358172 19195161 18123607 17135110 16210169 15337325 14521412 13764679
58062A3764679p07680o65628o19818n74461n39949n11123m76571m40409m13285
$$ 13764679 13056999 12391371 11771553 11197092 10657143 10146020 9669449 9229040 8815755
58053H815755l90911l62895l34350l17463l09038k96784k81056k70778k64307
$$ 8815755 8424844 8061949 7727599 7410136 7101098 6804314 6523258 6252480 5988173
58044E988173k53518k41032k34982k31968k22780k09786k01762j96755j86631
$$ 5988173 5734655 5493623 5258641 5026673 4803893 4594107 4392345 4195590 4008959
58035D008959j73379j64618j57979j46134j32412j25379j22366j14341j03040
$$ 4008959 3835580 3670962 3512983 3366849 3234437 3109058 2986692 2872351 2769311
58026B769311r7552r7359r4150q7448q3689q2488p8004p1435o8473o7031o0792
$$ 2769311 2671759 2574400 2480250 2392802 2309113 2226625 2148621 2077186 2008713 1941682 1880890
58015A880890n2210m8742m8847m4978l7912l4903l5757l3803k8900k6815k7237
$$ 1880890 1828680 1779938 1731091 1686113 1648201 1613298 1577541 1543738 1514838 1488023 1460786
58004A460786k4825k0674k0519k2855k0840j5120j2990j5641j7464j7171j8499
$$ 1460786 1435961 1415287 1394768 1371913 1351073 1335953 1322963 1307322 1289858 1272687 1254188
57993A254188k0652j9073j5232j4976j7657j7200j3322j1431j2020j0455o829
$$ 1254188 1233536 1214463 1199231 1184255 1166598 1149398 1136076 1124645 1112625 1102170 1095341
57982A095341n860p303o363l357l138n344m858j701p53k028r64J922J608j376
$$ 1095341 1089481 1082178 1075815 1072458 1069320 1063976 1059118 1057417 1056664 1054636 1053672 1055594 1057202 1055826
57968A055826j429J359R36l571o273n070m264n519n475l833m778q645j0679r701
$$ 1055826 1054397 1055756 1056692 1053121 1046848 1041778 1037514 1031995 1026520 1022687 1017909 1009264 998585 988884
57954I88884r775j1937j2468j0794j0870j3227j3771j1863j1527j3170j2463r056
$$ 988884 979109 967172 954704 943910 933040 919813 906042 894179 882652 869482 857019 847963
57942H47963p917j0048j0190o334l232l575l542m76K337K087R53R01L03j163m09
$$ 847963 840046 829998 819808 813474 810242 806667 803125 802649 804986 807073 808026 808927 809230 808067 807658
57927H07658L167N586M985M656O583P825O297M429M062L165P33m17J068K078M74
$$ 807658 810825 816411 821396 826052 832635 840460 846757 851186 855248 858413 859146 858729 859797 861875 862349
57912H62349j327j358j929n012q157q449o949o149o269o573p214p585o111l370
$$ 862349 861022 859664 857735 852723 844566 836117 829168 823019 816750 810177 802963 795378 789267 785897
57898G85897k179l083l493k498k436m223n444m794m258n036n305l936k514j915
$$ 785897 783718 780635 777142 774644 772208 767985 762541 757747 753489 748453 743148 739212 736698 734783
57884G34783p96R56J377O02J490M307N258K511p07j509j556l200n331o058o093
$$ 734783 733987 734943 736320 736922 738412 742719 747977 750488 749781 748272 746716 743516 738185 732127 726034
57869G26034o648p005o703p185q834r330p288m823m268m893m922m198l075j200
$$ 726034 719386 712381 705678 698493 689659 680329 673041 668218 663950 659057 654135 649937 646862 645662
57855F45662R53J944K016L154N370O250N356N407P569R288Q805P913Q023P174
$$ 645662 646615 648559 650575 653729 659099 665349 670705 676112 683681 692969 701774 709687 717710 724884
57841G24884L792J08j197r62j249j656q92J22l05j793k945l796n068o432p376
$$ 724884 728676 728784 727587 726625 725376 723720 722828 722950 722645 720852 717907 714111 709043 702611 695235
57826F95235q403r704j0177r166p718o847o072m707l085j675o79p76k236l115
$$ 695235 686832 677128 666951 657785 650067 643220 637148 632441 629356 627681 627002 626226 623990 620875
57812F20875j075K676M373L254K756N036P914Q904Q875R524J0034Q748O070L610
$$ 620875 619800 622476 626849 630103 632859 637895 645809 654713 663588 673112 683146 691894 697964 701574
57798G01574K167J908K719L275J855j048l193m181n760p968q480o945o315q174
$$ 701574 703741 705649 708368 711643 713498 712450 709257 705076 699316 691348 682868 675923 669608 661434
57784F61434j0268j0642j0694j1767j2163j0270p788o900o817n938n083n676o702
$$ 661434 651166 640524 629830 618063 605900 595630 587842 580942 574125 568187 563104 557428 550726
57771E50726o409n401n416o390p037p093p014o751o425o788p703p920p466q114
$$ 550726 544317 538916 533500 527110 520073 512980 505966 499215 492790 486002 478299 470379 462913 454799
57757D54799j0170j1331j0229q611q135p689n947l996l194k755j659p12n12K12
$$ 454799 444629 433298 423069 414458 406323 398634 392687 388691 385497 382742 381083 380371 379859 380071
57743C80071K010L002K108J480K967M770M602L829N061P600Q738Q173P714P769
$$ 380071 382081 385083 387191 388671 391638 396408 401010 404839 409900 417500 426238 434411 442125 449894
57729D49894P236O056N047L904K032N04Q40K513L815M185L854K413j71k448l447
$$ 449894 457130 463186 468233 472137 474169 474673 475513 478026 481841 486026 489880 492293 492122 489674 486227
57714D86227m348o175p631p493p225q501r850q821o048l997k884j004J808M058
$$ 486227 481879 475704 468073 460580 453355 444854 435004 426183 420135 416138 413254 412250 414058 418116
57700D18116N260N863N392L430J639J875L081K970K033K688N025O680O731O569
$$ 418116 423376 429239 434631 438061 439700 441575 444656 447626 449659 452347 457372 464052 470783 477352
57686D77352O925P034O852P298Q116Q167P834Q407R121P803M815L331M894P513
$$ 477352 484277 491311 498163 505461 513577 521744 529578 537985 547106 554909 559724 563055 567949 575462
57672E75462R095J0067J1302J1911J0860R222R143J1396J4919J8024J9561J9655
$$ 575462 584557 594624 605926 617837 628697 637919 647062 658458 673377 691401 710962 730617
57660G30617J9714K0916K2736K3826K4154K5035K7093K9482L1307L2638L3945
$$ 730617 750331 771247 793983 817809 841963 866998 894091 923573 954880 987518 1021463
57649A021463L5447L7176L9042M0957M3340M6865N1220N5173N8581O2956O8929
$$ 1021463 1056910 1094086 1133128 1174085 1217425 1264290 1315510 1370683 1429264 1492220 1561149
57638A561149P4828P9385Q4147R1063R9269J06947J14981J25670J38639J51318
$$ 1561149 1635977 1715362 1799509 1890572 1989841 2096788 2211769 2337439 2476078 2627396
57628B627396J63230J76482J91935K08194K24887K43484K63648K81682K94219
$$ 2627396 2790626 2967108 3159043 3367237 3592124 3835608 4099256 4380938 4675157
57619D675157L01170L03401K99469K86595K63645K31719J92891J49677J05269
$$ 4675157 4976327 5279728 5579197 5865792 6129437 6361156 6554047 6703724 6808993
57610F808993O3260K6979j595k3895m5778p4540j13521j59716k06085k44935k70136
$$ 6808993 6872253 6899232 6897637 6873742 6827964 6753424 6639903 6480187 6274102 6029167 5759031
57599E759031k79270k75175k63867k49745k33715k15936j98092j81695j65898
$$ 5759031 5479761 5204586 4940719 4690974 4457259 4241323 4043231 3861536 3695638
57590C695638j48917j30924j14171j00430q9263p8675o7051n4513m2507l1925
$$ 3695638 3546721 3415797 3301626 3201196 3111933 3033258 2966207 2911694 2869187 2837262
57580B837262k2111j2174k519O100J4368K3664L4002M4318N4660O6188P9070R2206
$$ 2837262 2815151 2802977 2800458 2806558 2820926 2844590 2878592 2922910 2977570 3043758 3122828 3215034
57568C215034J05256J19009J33502J47845J62273J78127J94853K09113K18184
$$ 3215034 3320290 3439299 3572801 3720646 3882919 4061046 4255899 4465012 4683196
57559D683196K22467K23228K19398K08240J88137J59284J22491P8796L0023k1032
$$ 4683196 4905663 5128891 5348289 5556529 5744666 5903950 6026441 6105237 6135260 6114228
57549F114228p0819j15415j51885j79805k00480k14636k22202k24454k24226k22944
$$ 6114228 6043409 5927994 5776109 5596304 5395824 5181188 4958986 4734532 4510306 4287362
57539D287362k19220k11577k00970j89410j77746j66273j55885j46832j37640
$$ 4287362 4068142 3856565 3655595 3466185 3288439 3122166 2966281 2819449 2681809
57530B681809j27294j17253j09325j02614r4883q6234p8913p3728o9212o4345
$$ 2681809 2554515 2437262 2327937 2225323 2130440 2044206 1965293 1891565 1822353 1758008
57520A758008n9744n5589n0780m5138m0408l7734l5657l2205k7834k4647k3189
$$ 1758008 1698264 1642675 1591895 1546757 1506349 1468615 1432958 1400753 1372919 1348272 1325083
57509A325083k1694j8585j4405j0814q606p240n847m069k009M1J740K873L722
$$ 1325083 1303389 1284804 1270399 1259585 1250979 1243739 1237892 1233823 1231814 1231855 1233595 1236468 1240190
57496A240190N096P731J1649J6225K0645K4156K6243K7224K8506L1451L5771L9728
$$ 1240190 1245286 1253017 1264666 1280891 1301536 1325692 1351935 1379159 1407665 1439116 1474887 1514615
57484A514615M2296M4516M8152N3541N9416O4696O9706P5536Q2681R0603R8483
$$ 1514615 1556911 1601427 1649579 1703120 1762536 1827232 1896938 1972474 2055155 2145758 2244241
57473B244241J06177J14302J23483J33633J44110J54337J63997J72689J79640
$$ 2244241 2350418 2464720 2588203 2721836 2865946 3020283 3184280 3356969 3536609
57464C536609J83642J83110J76563J63437J44156J19013Q7647N0495J0390k8518
$$ 3536609 3720251 3903361 4079924 4243361 4387517 4506530 4594177 4644672 4655062 4626544
57454D626544o3455r3684j18717j37476j49798j57341j61886j63598j61757j56466
$$ 4626544 4563089 4469405 4350688 4213212 4063414 3906073 3744187 3580589 3418832 3262366
57444C262366j48755j39656j30071j21051j13015j05032r5850q5670p6028o7986
$$ 3262366 3113611 2973955 2843884 2722833 2609818 2504786 2408936 2323266 2247238 2179252
57434B179252o1080n4191m6796l9206l1910k4906j7662r891k253M153R123J3580
$$ 2179252 2118172 2063981 2017185 1977979 1946069 1921163 1903501 1893610 1891357 1895510 1904633 1918213
57422A918213J8219K2724K6819L1380L7701M6024N5431O4925P4019Q2597R0885
$$ 1918213 1936432 1959156 1985975 2017355 2055056 2101080 2156511 2221436 2295455 2378052 2468937
57411B468937R9309J08000J16736J25646J35196J44887J52840J57560J59293J58418
$$ 2468937 2568246 2676246 2792982 2918628 3053824 3198711 3351551 3509111 3668404 3826822
57401C826822J53253J40992J20549R3164O0553K4225j3529m9920q3569j14498
$$ 3826822 3980075 4121067 4241616 4334780 4395333 4419558 4406029 4356109 4272540 4158042
57391D158042j41627j61967j73517j77803j78287j77157j74727j70951j65898
$$ 4158042 4016415 3854448 3680931 3503128 3324841 3147684 2972957 2802006 2636108
57382B636108j59093j50020j39413j28965j19630j11042j02728r4925q7973q1712
$$ 2636108 2477015 2326995 2187582 2058617 1938987 1827945 1725217 1630292 1542319 1460607
57372A460607p5879p0497o5536o0642n5624n0796m6514m2733l9351l6615l4653
$$ 1460607 1384728 1314231 1248695 1188053 1132429 1081633 1035119 992386 953035 916420 881767
57361H81767l2814l0189k6787k3686k1755k0717j9866j9183j9076j9253j8793
$$ 881767 848953 818764 791977 768291 746536 725819 705953 686770 667694 648441 629648
57350F29648j7516j6325j5811j5273j3959j2410j1504j0646q456n287l475m381
$$ 629648 612132 595807 579996 564723 550764 538354 526850 516204 507748 502461 498986 494605
57338D94605o385o865n319l435k569k380j919r80n3L16j57j314k332k108l04K064
$$ 494605 488220 481355 476036 472601 470032 467652 465733 464753 464700 465016 464859 463545 461213 459105 458801 460865
57322D60865L346K734J008j61J65J272J637P24l66j69J611M160O715Q991J0529
$$ 460865 464211 466945 467953 467792 467957 469229 470866 471590 471224 471055 472666 476826 483541 492532 503061
57307E03061J0516Q809O793O332P623Q623P298M229K157K743M695N749N604N737
$$ 503061 513577 522386 529179 535511 543134 551757 559055 563284 565441 568184 572879 578628 584232 589969
57293E89969O803P725P520O780O697P543Q631R153Q767P934P895R449J1656J2731
$$ 589969 596772 604497 612017 618797 625494 633037 641668 650821 659588 667522 675417 684866 696522 709253
57279G09253J2415J2202J2894J3519J3326J3223J4044J4926J4906J4828J5877
$$ 709253 721668 733870 746764 760283 773609 786832 800876 815802 830708 845536 861413
57268H61413J7296J7570J7055J7412J8777J9636J9343J8700J8051J6811J5250
$$ 861413 878709 896279 913334 930746 949523 969159 988502 1007202 1025253 1042064 1057314
57257A057314J4689J5319J5570J4487J3366J3979J6259J8538J9454J8997J8364
$$ 1057314 1072003 1087322 1102892 1117379 1130745 1144724 1160983 1179521 1198975 1217972 1236336
57246A236336J9098K1714K5006K7281K8204K8663K9128K9310K9156K8966K8610
$$ 1236336 1255434 1277148 1302154 1329435 1357639 1386302 1415430 1444740 1473896 1502862 1531472
57235A531472K8007K8160L0190L3403L6077L8228M1460M5724M8434M7945M6034
$$ 1531472 1559479 1587639 1617829 1651232 1687309 1725537 1766997 1812721 1861155 1909100 1955134
57224A955134M5536M6804M7853M7060M4501M1214L8150L5478L2360K7726K1491
$$ 1955134 2000670 2047474 2095327 2142387 2186888 2228102 2266252 2301730 2334090 2361816 2383307
57213B383307J4552P734J525l540p356j0785j4388j7054j7501j6642j6387j6464
$$ 2383307 2397859 2405593 2407118 2403578 2396222 2385437 2371049 2353995 2336494 2319852 2303465 2287001
57201B287001j4860j1372q084o001m037j919j085j618j189J473M568O217P015
$$ 2287001 2272141 2260769 2252685 2246684 2242647 2240728 2239643 2238025 2236836 2238309 2242877 2249094 2256109
57188B256109Q020Q694Q720R569J2266J5593J8361K1367K5233K8587L0487L2536
$$ 2256109 2264129 2272823 2281543 2291112 2303378 2318971 2337332 2358699 2383932 2412519 2443006 2475542
57176B475542L6272M0497M3597M6530N0761N4995N6788N6240N5336N4787N4039
$$ 2475542 2511814 2552311 2595908 2642438 2693199 2748194 2804982 2861222 2916558 2971345 3025384
57165C025384N3374N3506N3617N2093M8602M3883L8309L2260K6720K1986J7075
$$ 3025384 3078758 3132264 3185881 3237974 3286576 3330459 3368768 3401028 3427748 3449734 3466809
57154C466809J1756P525N045K659p91l774m683m347l804j956J978N888P501P741
$$ 3466809 3478565 3486090 3491135 3493794 3493003 3489229 3484546 3480199 3476395 3474439 3476417 3482305 3489806 3497547
57140C497547Q755J0486J1864J3356J5585J7454J8294J9587K2043K3519K2732
$$ 3497547 3506302 3516788 3528652 3542008 3557593 3575047 3593341 3612928 3634971 3658490 3681222
57129C681222K2093K3495K4301K1298J5852J1136P124K557j125k568m545j0069
$$ 3681222 3703315 3726810 3751111 3772409 3788261 3799397 3806521 3809078 3807953 3805385 3800840 3790771
57117C790771j6831k0561k1573k2875k4271k3936k3361k4748k5784k3374k0429
$$ 3790771 3773940 3753379 3731806 3708931 3684660 3660724 3637363 3612615 3586831 3563457 3543028
57106C543028k2269k7879l1780l3128l5722m0083m3101m5033m9307n5339n8895
$$ 3543028 3520759 3492880 3461100 3427972 3392250 3352167 3309066 3264033 3214726 3159387 3100492
57095C100492n9853o2389o7096p0197p1096p3677p9306q5584r2571j03145j16226
$$ 3100492 3040639 2978250 2911154 2840957 2769861 2696184 2616878 2531294 2438723 2335578 2219352
57084B219352j26564j32256j36012j38773j39029j38514j41291j47054j52911
$$ 2219352 2092788 1960532 1824520 1685747 1546718 1408204 1266913 1119859 966948
57075I66948j61512j79072k05241A87539g4537k94014l28288l59029l85738m13930
$$ 966948 805436 626364 421123 187539 -74537 -368551 -696839 -1055868 -1441606 -1855536
57065a855536m44643m73571n01905n37326n82518o33426o90329p59372q41427
$$ -1855536 -2300179 -2773750 -3275655 -3812981 -4395499 -5028925 -5719254 -6478626 -7320053
57056g320053r31083j028510j140361j267509j404751j554060j724232j915807
$$ -7320053 -8251136 -9279646 -10420007 -11687516 -13092267 -14646327 -16370559 -18286366
57048a8286366k121336k342439k590747k870568l178512l522199l919517m376677
$$ -18286366 -20407702 -22750141 -25340888 -28211456 -31389968 -34912167 -38831684 -43208361
57040d3208361m888438n463193o124216o882535p734689q690121r768671j0964827
$$ -43208361 -48096799 -53559992 -59684208 -66566743 -74301432 -82991553 -92760224 -103725051
57032a03725051j2248785j3606107j5029414j6461650j7806018j9008176k0050047
$$ -103725051 -115973836 -129579943 -144609357 -161071007 -178877025 -197885201 -217935248
57025b17935248k0828906k1162284k1034963k0762786k0713640k0802720k0370621
$$ -217935248 -238764154 -259926438 -280961401 -301724187 -322437827 -343240547 -363611168
57018c63611168j8635228j5236365j0371056m564608J576641P492595J2754739
$$ -363611168 -382246396 -397482761 -407853817 -412418425 -410841784 -403349189 -390594450
57011c90594450J7118054K0477031K2782868K4042312K4374430K3998992K3146509
$$ -390594450 -373476396 -352999365 -330216497 -306174185 -281799755 -257800763 -234654254
57004b34654254K1999846K0703869J9371661J8061146J6778102J5518385J4289433
$$ -234654254 -212654408 -191950539 -172578878 -154517732 -137739630 -122221245 -107931812
56997a07931812J3092052J1913881J0753320R629274Q560486P555132O625760
$$ -107931812 -94839760 -82925879 -72172559 -62543285 -53982799 -46427667 -39801907
56990c9801907N792659N063568M426527L868700L386250K971190K606312K280624
$$ -39801907 -34009248 -28945680 -24519153 -20650453 -17264203 -14293013 -11686701 -9406077
56982i406077J995655J750841J536392J345617J180535e57066C58213Q03037P09163
$$ -9406077 -7410422 -5659581 -4123189 -2777572 -1597037 -557066 358213 1161250 1870413
56973A870413O35212N72513N15007M65977M26946L91413L55112L21451K91355
$$ 1870413 2505625 3078138 3593145 4059122 4486068 4877481 5232593 5554044 5845399
56964E845399K58367K19482J81042J48449J19465R2639P2531O0946N1915M0917
$$ 5845399 6103766 6323248 6504290 6652739 6772204 6864843 6937374 6998320 7050235 7091152
56954G091152L0764K3515J5229L959n508j0127j3859j9628k3951k4302k3629k2994
$$ 7091152 7121916 7145431 7160660 7164619 7159111 7148984 7135125 7115497 7091546 7067244 7043615 7020621
56942G020621j8289r289k768j124J811N537p318n5049j35188k26300l06510l63321
$$ 7020621 7002332 6993043 6990275 6989151 6990962 6996499 6989181 6934132 6798944 6572644 6266134 5902813
56930E902813l91829l94204l79741l58143l32901l04638k76824k52927k31642
$$ 5902813 5510984 5116780 4737039 4378896 4045995 3741357 3464533 3211606 2979964
56921B979964k10717j92421j80022j71845j64000j56091j49222j41381j29969
$$ 2979964 2769247 2576826 2396804 2224959 2060959 1904868 1755646 1614265 1484296
56912A484296j16581j04492r3790q3195p4029o7848o2590n5535m7798m1734l6244
$$ 1484296 1367715 1263223 1169433 1086238 1012209 944361 881771 826236 778438 736704 700460
56901G00460k8986k0945j4549r193k866L386O532N713K078l853j1468j8429k2755
$$ 700460 671474 650529 635980 626787 623921 627307 633839 639552 641630 637777 626309 607880 585125
56888E85125k4993k5994k4752k1004j7363j5981j5485j3873j1856j0553q688n053
$$ 585125 560132 534138 509386 488382 471019 455038 439553 425680 413824 403271 394583 389530
56876C89530j079J914N278R905J3696J5253J6809J9860K0997J6195O636l525j2568
$$ 389530 388451 390365 395643 405548 419244 434497 451306 471166 492163 508358 514994 511469 498901
56863D98901k0520k5881k7587k8204l0715l3718l3719l0658k7236k4363k1166
$$ 498901 478381 452500 424913 396709 365994 332276 298557 267899 240663 216300 195134
56852A95134j8118j6370j5055j2649r857q154p005n539n013o349p199n078j521
$$ 195134 177016 160646 145591 132942 123085 114931 107926 102387 97374 91025 83826 78748 77227
56839G7227M69J302L255N839O944P235R209J2810J5815J7843K0388K3726K7061
$$ 77227 77696 78998 82253 88092 95036 102271 111480 124290 140105 157948 178336 202062 229123
56826B29123L0713L4898L7472L6279L2476K8327K3292J5992Q400L905K417J498
$$ 229123 259836 294734 332206 368485 400961 429288 452580 468572 476972 480877 483294 484792
56814D84792J127K932N664O213M807M747O954R174J0639J3288J7782K2340K6278
$$ 484792 485919 488851 494515 500728 505535 510282 517236 526410 537049 550337 568119 590459 616737
56801F16737L1183L7615M3640M7105M6655M0589K8053J1856k967j3863k1573k6522
$$ 616737 647920 685535 729175 776280 822935 863524 891577 903433 900466 886603 865030 838508
56789H38508k7712k5368k1497j7199j2057o442j575K847Q402J5044K1145K6572
$$ 838508 810796 785428 763931 746732 734675 728233 726658 729505 737907 752951 774096 800668
56777H00668L3058M1359N0451N9390O7155P0801O6706N4103L5316J3081r789k9162
$$ 800668 833726 875085 925536 984926 1052081 1122882 1189588 1243691 1279007 1292088 1282299 1253137
56765A253137m1690m8139n1519n2305m8981m2772l7445l3989k9517k2346j4398
$$ 1253137 1211447 1163308 1111789 1059484 1010503 967731 930286 896297 866780 844434 830036
56754H30036p497r54N962J2485J8590K5555L3034L8460M0502L9956L6185K6299
$$ 830036 822539 821585 827547 840032 858622 884177 917211 955671 996173 1036129 1072314 1098613
56742A098613R900q286k2585l1045l4682l4905l3482l2507l2293l1031k8021k5107
$$ 1098613 1108513 1100227 1077642 1046597 1011915 977010 943528 911021 878728 847697 819676 794569
56730G94569k3597k1998j8527j3740q918l830J959P168J0307J1917J3525J5131
$$ 794569 770972 748974 730447 716707 707789 703959 705918 713086 723393 735310 748835 763966
56718G63966J4994J1316L518p094j7316k3924k6271k6244k5643k4942k4405k4386
$$ 763966 778960 790276 793794 786700 769384 745460 719189 692945 667302 642360 617955 593569
56706E93569k4191k2653k0157j8251j7062j5330j3145j2144j2466j2232j0820
$$ 593569 569378 546725 526568 508317 491255 475925 462780 450636 438170 425938 415118
56695D15118r954j0476j0691r389p974p937q361p694o141m610l006j187n4j49
$$ 415118 405164 394688 383997 374608 366634 358697 350336 342642 336501 331891 328885 327698 327644 327495
56681C27495n33l56k20p24j085n76K3k99j171j569j246n43J78M19o8m88L6O35
$$ 327495 326962 326606 326386 325662 324577 324001 324024 323725 322554 320985 319739 319196 319374 319793 319725 319237 319273 319908
56663C19908l30k277k629n81J593J826O75l83q95p26M38J806J723K57m74M82J552
$$ 319908 319578 317301 314672 314091 315684 317510 318185 317802 316907 316181 316619 318425 320148 320405 319931 320413 321965
56646C21965J441J003J126J168P89J048K232K877K456K595M079N130M501L806
$$ 321965 323406 324409 325535 326703 327492 328540 330772 333649 336105 338700 342779 347909 352410 356216
56632C56216M628N692N237M087L833L825K611P72l07j162l149n570o342m859k264
$$ 356216 360844 366536 371773 375860 379693 383518 386129 386901 386594 385432 382283 376713 370371 365512 363248
56617C63248K68J804J304r93k809k281l43Q81R92R41R23N20k6l15p62j525j612
$$ 363248 363516 365320 366624 365631 362822 360541 360198 361079 362071 363012 363935 364455 364429 364114 363352 361827 360215
56600C60215m69O87O23j10n40r53j612j439J26J376N76j418k666k998l347l602
$$ 360215 359746 360433 361056 360946 360406 359453 357841 356402 356528 357904 358480 357062 354396 351398 348051 344449
56584C44449l232k746k496j288J605M352M794L583K794K633K039J383J860K959
$$ 344449 341217 338471 335975 334687 336292 340644 345438 349021 351815 354448 356487 357870 359730 362689
56570C62689L194K726K762K982K226J120J340K483K336K72j976l071l351l326
$$ 362689 365883 368609 371371 374353 376579 377699 379039 381522 383858 384130 382154 379083 375732 372406
56556C72406k958k665l263m543n396n291m468l140j787j570k890m173l673j869
$$ 372406 369448 366783 363520 358977 353581 348290 343822 340682 338895 337325 334435 330262 326589 324720
56542C24720n55l36o40j168j621j012Q04J972J009p61j192m70P3Q60K891M789
$$ 324720 324165 323829 323189 322021 320400 319388 320192 322164 323173 322412 321220 320750 320823 321683 324574 329363
56526C29363M315K305J763L182L959K640P86J42O64J884L749N488N816M819L898
$$ 329363 333678 335983 337746 340928 344887 347527 348313 348455 349119 351003 354752 360240 366056 370875 374773
56511C74773L591L259K828K935L515M154N440P864R864R548P920P761R488J0942
$$ 374773 378364 381623 384451 387386 390901 395055 400495 408359 418223 427771 435691 443452 452940 463882
56497D63882J1084J0954J0854R743P974P558Q836R533Q167N972M548L765K958
$$ 463882 474966 485920 496774 506517 514491 522049 530885 540418 548585 554557 559105 562870 565828
56484E65828K127J226nj159j850l131n999q755q782o830o283p790q289o315m629
$$ 565828 567955 569181 569176 568017 566167 563036 557037 548282 539500 532670 526387 518597 510308 503993 499364
56469D99364n709p929q415p171n993n358m798m740n796p169p521o633n155l635
$$ 499364 493655 485726 477311 470140 464147 458789 453991 449251 443455 436286 428765 422132 416977 413342
56455D13342k667k860l791m134l348k180j234m32p0p35j960k649k913l615m303
$$ 413342 410675 407815 404024 399890 396542 394362 393128 392696 392626 391891 389931 387282 384369 380754 376451
56440C76451l734k348j631j184N05K330J319k250m260k730o28q12j701m73K484
$$ 376451 372717 370369 368738 367554 368059 370389 371708 369458 365198 362468 361840 361028 359327 358854 361338
56425C61338M974O317O645N180J986m53q1J839K936L117L523L892L531L396M678
$$ 361338 366312 372629 379274 384454 386440 385987 385906 387745 390681 393798 397321 401213 404744 408140 412818
56410D12818O422O922O328N769N099L805L037M219O414P300O380N226M969N222
$$ 412818 419240 426162 432490 438259 443358 447163 450200 454419 460833 468133 474513 479739 484708 489930
56396D89930N144M267K665J270J193J976J722o4j323l13J883L077K641J183o84
$$ 489930 495074 499341 502006 503276 504469 506445 508167 508103 506780 506467 508350 511427 514068 515251 514567
56381E14567j799n29K754M956L772M20k700n049o739o538l804q34l97k039l303
$$ 514567 512768 512239 514993 519949 523721 524141 521441 516392 509653 503115 499311 498477 498080 496041 492738
56366D92738l525l769m077l528k521k451l397m235m534m456l518j513J20j31j575
$$ 492738 489213 485444 481367 477839 475318 472867 469470 465235 460701 456245 452727 451214 451334 451203 449628
56351D49628k616l345m642n636m709k466j196j578k159j949j375p69Q0Q82J143
$$ 449628 447012 443667 439025 433389 428680 426214 425018 423440 421281 419332 417957 417188 417268 418150 419293
56336D19293J251J647J436k59k100j798N89K641K816J820Q03L9m07k34N31J524
$$ 419293 420544 422191 423627 423368 421268 419470 420059 422700 425516 427336 428139 428178 427771 427537 428068 429592
56320D29592K550L312L283K721K874M034M542L257J688J862L256L984M048M934
$$ 429592 432142 435454 438737 441458 444332 448366 452908 456165 457853 459715 462971 466955 471003 475937
56306D75937O562P110N923M426M028M627N278N098L751K067J597K584L432L199
$$ 475937 482499 489609 495532 499958 503986 508613 513891 518989 522740 524807 526404 528988 532420 535619
56292E35619L080L915M099K132l57p06R13K346L075M131N316N409M630M264M245
$$ 535619 538699 542614 546713 548845 548488 547782 548695 551041 554116 558247 563563 568972 573602 577866 582111
56277E82111L845M016O243R405J0854J0366J0088J0626J0417R276R319J1459J3686
$$ 582111 585956 589972 596215 605620 616474 626840 636928 647554 657971 667247 676566 688025 701711
56264G01711J4035J3054J2261J1986J1756J1409J1062J1038J2032J4154J5950
$$ 701711 715746 728800 741061 753047 764803 776212 787274 798312 810344 824498 840448
56253H40448J5791J4027J2392J1425J0185Q215O229M894M397M902O074O722O180
$$ 840448 856239 870266 882658 894083 904268 912483 918712 923606 928003 932905 938979 945701 951881
56240I51881N384N215M900L687K818L878O311Q625J0750J3013J4298J3834J3497
$$ 951881 957265 962480 967380 971067 973885 977763 984074 992699 1003449 1016462 1030760 1044594 1058091
56227A058091J5409J8520K0581K2174K5406K9627L2226L3150L5014L8857M3250
$$ 1058091 1073500 1092020 1112601 1134775 1160181 1189808 1222034 1255184 1290198 1329055 1372305
56216A372305M7424N1889N6070N8755O0989O5182P1354P7399Q3013Q9944R8490
$$ 1372305 1419729 1471618 1527688 1586443 1647432 1712614 1783968 1861367 1944380 2034324 2132814
56205B132814J07181J16035J26478J37950J48236J57613J69002J83541J99366
$$ 2132814 2239995 2356030 2482508 2620458 2768694 2926307 3095309 3278850 3478216
56196C478216K15169K31255K46582K58563K66724K73017K77644K77904K72215
$$ 3478216 3693385 3924640 4171222 4429785 4696509 4969526 5247170 5525074 5797289
56187E797289K61856K47677K28450K03539J74377J42283J07667P2080L8166O928
$$ 5797289 6059145 6306822 6535272 6738811 6913188 7055471 7163138 7235218 7273384 7280312
56177G280312k2195m8555p0656q9092j05516j18887j26946j31391j36928j44640
$$ 7280312 7258117 7209562 7138906 7049814 6944298 6825411 6698465 6567074 6430146 6285506
56167F285506j51098j54864j58807j64566j69855j73376j77447j83218j87590
$$ 6285506 6134408 5979544 5820737 5656171 5486316 5312940 5135493 4952275 4764685
56158D764685j87855j85712j83917j82319j79720j76379j72212j65639j56527
$$ 4764685 4576830 4391118 4207201 4024882 3845162 3668783 3496571 3330932 3174405
56149C174405j47375j39531j31293j21696j12856j06353j00443r3148q5134p7559
$$ 3174405 3027030 2887499 2756206 2634510 2521654 2415301 2314858 2221710 2136576 2059017
56139B059017p0008o2597n7131n4204n1799m8470m5034m1822l7555l2380k8589
$$ 2059017 1989009 1926412 1869281 1815077 1763278 1714808 1669774 1627952 1590397 1558017 1529428
56128A529428k6810k4944k2213k0382j9616j7325j2872r139p465n397j595J579
$$ 1529428 1502618 1477674 1455461 1435079 1415463 1398138 1385266 1376127 1368662 1363265 1361670 1363249
56116A363249K735M174P297R734R861R873J1483J2877J2921J3973J7274J9788
$$ 1363249 1365984 1370158 1377455 1387189 1397050 1406923 1418406 1431283 1444204 1458177 1475451 1495239
56104A495239J8996J6781J5437J3978J1542J0180J0834J0894R069Q261J0188J1850
$$ 1495239 1514235 1531016 1546453 1560431 1571973 1582153 1592987 1603881 1612950 1621211 1631399 1643249
56092A643249J1138J1020J3980J7176J7857J8877K3845L0886L6480M1579M8789
$$ 1643249 1654387 1665407 1679387 1696563 1714420 1733297 1757142 1788028 1824508 1866087 1914876
56081A914876N7231O5232P4570Q6855R9249J08932J18409J31134J45035J55432
$$ 1914876 1972107 2037339 2111909 2198764 2298013 2406945 2525354 2656488 2801523 2956955
56071B956955J61233J63319J60191J50630J37909J26334J16301J06930R9720R4697
$$ 2956955 3118188 3281507 3441698 3592328 3730237 3856571 3972872 4079802 4179522 4274219
56061D274219Q6825P1822N2150L2345J2577p737k4646l4782m2067n2517o5714
$$ 4274219 4361044 4432866 4485016 4517361 4529938 4522201 4497555 4462773 4420706 4368189 4302475
56050D302475p7964r0286j05824j22128j33581j39380j42252j41541j34721j23852
$$ 4302475 4224511 4134225 4028401 3906273 3772692 3633312 3491060 3349519 3214798 3090946
56040C090946j13512j03818r2056p9529p0119o3640n7002n0439m6385m3934m0542
$$ 3090946 2977434 2873616 2781560 2702031 2631912 2568272 2511270 2460831 2414446 2370512 2329970
56029B329970l7308l6363l5224l0251k3537j9886j8992j7180j4536j3471j2515
$$ 2329970 2292662 2256299 2221075 2190824 2167287 2147401 2128409 2111229 2096693 2083222 2070707
56018B070707q673l847j937j603J000M643N552N139P503J1333J2313J1590J3842
$$ 2070707 2062034 2058187 2056250 2054647 2055647 2060290 2065842 2070981 2078484 2089817 2102130 2113720 2127562
56005B127562J8484K0978K1414K3716K7583K9297K9413L1725L5715L7637L7904
$$ 2127562 2146046 2167024 2188438 2212154 2239737 2269034 2298447 2330172 2365887 2403524 2441428
55994B441428L9737M1992M1060L8366L8260M0222M0698M0435M2060M3126M0120
$$ 2441428 2481165 2523157 2564217 2602583 2640843 2681065 2721763 2762198 2804258 2847384 2887504
55983B887504L6610L8458M3560M5688M5630M8707N3967N6287N6720O0128O4958
$$ 2887504 2924114 2962572 3006132 3051820 3097450 3146157 3200124 3256411 3313131 3373259 3438217
55972C438217O6246O6506P2166Q1165Q5763Q5893Q8167R3345R6762R9249J05488
$$ 3438217 3504463 3570969 3643135 3724300 3810063 3895956 3984123 4077468 4174230 4273479 4378967
55961D378967J13232J16723J18827J26878J38411J44631J46125J51066J59630
$$ 4378967 4492199 4608922 4727749 4854627 4993038 5137669 5283794 5434860 5594490
55952E594490J64926J67929J76280J89275J99505K08266K23504K43622K59967
$$ 5594490 5759416 5927345 6103625 6292900 6492405 6700671 6924175 7167797 7427764
55943G427764K74232K95909L23201L44754L60302L80825M07966M32435M53486
$$ 7427764 7701996 7997905 8321106 8665860 9026162 9406987 9814953 10247388 10700874
55934A0700874M80249N12758N41862N69088O05937O52222O96495P39134P92643
$$ 10700874 11181123 11693881 12235743 12804831 13410768 14062990 14759485 15498619 16291262
55925A6291262Q57415R20257R78673J042909J112953J179072J246495J332340
$$ 16291262 17148677 18068934 19047607 20090516 21203469 22382541 23629036 24961376
55917B4961376J436278J542432J651609J780652J927940K073100K214439K372022
$$ 24961376 26397654 27940086 29591695 31372347 33300287 35373387 37587826 39959848
55909C9959848K550913K739008K944718L195674L495658L826881M199505M651139
$$ 39959848 42510761 45249769 48194487 51390161 54885819 58712700 62912205 67563344
55901F7563344N193787N815596O538969P415086Q458440R662402J1086242J2836388
$$ 67563344 72757131 78572727 85111696 92526782 100985222 110647624 121733866 134570254
55893A34570254J4947666J7386953K0191247K3472873K7263892L1507902L6156814
$$ 134570254 149517920 166904873 187096120 210568993 237832885 269340787 305497601
55886C05497601M0820492M3977653M2916718L5315036K1377455M296009j1644560
$$ 305497601 346318093 390295746 433212464 468527500 489904955 494200964 482556404
55879D82556404k3509724l0610663l3728632l4037476l2617851l0355785k7849601
$$ 482556404 459046680 428436017 394707385 360669909 328052058 297696273 269846672
55872B69846672k5379355k3037871k0866056j8869697j7017537j5294380j3720988
$$ 269846672 244467317 221429446 200563390 181693693 164676156 149381776 135660788
55865A35660788j2302705j1009246r824159q765088p836658p009037o261354n604250
$$ 135660788 123358083 112348837 102524678 93759590 85922932 78913895 72652541 67048291
55857F7048291n041637m548651m104951l715394l381522l084399k811149k569776
$$ 67048291 62006654 57458003 53353052 49637658 46256136 43171737 40360588 37790812
55849C7790812k363641k177923k003552j848855j715961j590293j464680j350283
$$ 37790812 35427171 33249248 31245696 29396841 27680880 26090587 24625907 23275624
55841B3275624j252966j161434j069202r86232r18208q55076p90702p34132o90988
$$ 23275624 22022658 20861224 19792022 18805790 17887582 17032506 16241804 15507672 14816684
55832A4816684o52272o11801n77059n52926n31378n06638m84573m68107m48969
$$ 14816684 14164412 13552611 12975552 12422626 11891248 11384610 10900037 10431930 9982961
55823I982961m22862l97944l79772l62152l40881l22382l10603k98936k82973
$$ 9982961 9560099 9162155 8782383 8420231 8079350 7756968 7446365 7147429 6864456
55814F864456k68150k57427k44625k27329k13246k06207j98704j85917j74642
$$ 6864456 6596306 6338879 6094254 5866925 5653679 5447472 5248768 5062851 4888209
55805D888209j70471j68243j63044j58843j58284j55318j46138j36742j31741
$$ 4888209 4717738 4549495 4386451 4227608 4069324 3914006 3767868 3631126 3499385
55796C499385j26116j15744j05842j01265r8350r3854r1873r4229r4043q7111
$$ 3499385 3373269 3257525 3151683 3050418 2952068 2858214 2766341 2672112 2578069 2490958
55786B490958q0027p8696p7929p1262o2479n8116n6163n1286m4633l9907l5736
$$ 2490958 2410931 2332235 2254306 2183044 2120565 2062449 2006286 1955000 1910367 1870460 1834724
55775A834724k9959k5853k6440k8000k6264k3805k4670k6960k7244k7084k8916
$$ 1834724 1804765 1778912 1752472 1724472 1698208 1674403 1649733 1622773 1595529 1568445 1539529
55764A539529l0436k9149k7722k9183l1548l2254l2799l4197l3398k9207k5962
$$ 1539529 1509093 1479944 1452222 1423039 1391491 1359237 1326438 1292241 1258843 1229636 1203674
55753A203674k6237k5929k1831j7842j7715j7914j4096r025p194o810m033o65
$$ 1203674 1177437 1151508 1129677 1111835 1094120 1076206 1062110 1053085 1045891 1039081 1035048 1034383
55741A034383n95k473k461j008q91j635j569k304n833j0048j1928j2321j3259
$$ 1034383 1033788 1031315 1028854 1027846 1026955 1025320 1023751 1021447 1015614 1005566 993638 981317 968058
55728I68058j3915j3319j3432j5304j6017j3542j0631r970r741q112p303q831
$$ 968058 954143 940824 927392 912088 896071 882529 871898 861928 852187 844075 836772 827941
55716H27941r622p784p232j1157j5779j6435j5366j7175k0629k1598k0548k0446
$$ 827941 818319 810535 803303 792146 776367 759932 744566 727391 706762 685164 664616 644170
55704F44170k0129j6527j1282q861r553r976r088q586q803q930r822j2271j4275
$$ 644170 624041 607514 596232 587371 577818 567842 558754 550168 541365 532435 522613 510342 496067
55691D96067j3909j2743j2583j1587p868m035l468m735m540l589m454o049n492
$$ 496067 482158 469415 456832 445245 437377 433342 429874 425139 420599 417010 412556 406507 401015
55678D01015l608l403m674m967m384m697n036l235l07P58k89j417k166l347m229
$$ 401015 397407 394004 389330 384363 379979 375282 370246 367011 366704 367462 367173 365756 363590 360243 356014
55663C56014l833l529m790o049n311l933m094m707l711k265k383k620n61K296
$$ 356014 352181 348652 343862 337813 332502 328569 324475 319768 316057 313792 311409 308789 308228 310524
55649C10524K810J719K176M228N457N767O893Q041O761L612J624J587J830J994
$$ 310524 313334 315053 317229 321457 326914 332681 339574 347615 354376 357988 359612 361199 363029 365023
55635C65023L047M199L775K700L315N210N855M921M329M525M162L145K632K409
$$ 365023 368070 372269 376044 378744 382059 387269 393124 398045 402374 406899 411061 414206 416838 419247
55621D19247J335J7O6J329K517L638M976M965K306r61j795o11j16p48o74M49J102
$$ 419247 420582 420599 420665 421994 424511 428149 433125 438090 440396 439435 437640 437029 436913 436165 435491 435940 437042
55604D37042Q39O02N54L02N72K125L865M355M044L836L150J755J395K772L329
$$ 437042 437881 438483 439037 439339 439911 442036 445901 450256 454300 458136 461286 463041 464436 467208 470537
55589D70537J196j107o50O55r52m834p276p535p982r373j0447j1352j3105j4461
$$ 470537 471733 470626 469976 470631 469679 464845 457569 450034 442052 432679 422232 410880 397775 383314
55575C83314j3488j1444j1029j1687j0915r224r298j0864j1149r886r290r299
$$ 383314 369826 358382 347353 335666 324751 315527 306229 295365 284216 274330 265040 255741
55563B55741p635m701l674n208o425n733m467l203o74K540L321M40l399n145m504
$$ 255741 248106 243405 239731 234523 228098 222365 217898 214695 214021 216561 219882 220322 216923 211778 207274
55548B07274k808j336j161k330l174k542j995l216m578l593j497j492l319l842
$$ 207274 204466 203130 201969 199639 196465 193923 191928 188712 184134 180541 179044 177552 174233 170391
55534A70391k444j449j488r86j70r57k537j811J110K391M27k078l024l514m229
$$ 170391 167947 166498 165010 164024 163854 162897 160360 158549 159659 162050 162477 160399 157375 153861 149632
55519A49632l512j009O25l29k110k609k111j448l34J063J554J157J290J965J594
$$ 149632 146120 145111 145736 145407 143297 140688 138577 137129 136795 137858 139412 140569 141859 143824 145418
55504A45418L63N01K326L257J961L14j0J70q4k32l14j586l655l992j840K60L70
$$ 145418 145781 146282 148608 151865 153826 154140 154130 154300 154216 153984 153670 152084 148429 144437 142597 142857 143227
55487A43227k20J71R40J153J560K672L066J538q17k187k148r96J180L672N138
$$ 143227 143007 143178 144118 145271 146831 149503 152569 154107 153290 151103 148955 147959 149139 152811 157949
55472A57949N300N137M880L856K562K548L726M323M005M392N772O132M437K227
$$ 157949 163249 168386 173266 177122 179684 182232 185958 190281 194286 198678 204450 210582 215019 217246
55458B17246Q58l03j786k726k771k974l730m031l693l854m549m365l328l372m889
$$ 217246 218104 217801 216015 213289 210518 207544 203814 199783 196090 192236 187687 183322 179994 176622 171733
55443A71733n708m733l895m914o682p299o550n125l552k900m107n819n372k801
$$ 171733 166025 161292 157397 152483 145801 138502 131952 126827 123275 120375 116268 110449 105077 102276
55429A02276j014j176j109M52J451J11k118l234l539l809l296j718p74j576k679
$$ 102276 101262 100086 98977 99429 100880 100991 98873 95639 92100 88291 84995 83277 82503 80927 78248
55414G8248k615k252k750l297k802j857j316q63n12j322l090l780k791k230l097
$$ 78248 75633 73381 70631 67334 64532 62675 61359 60496 59984 58662 55572 51792 49001 46771 43674
55399D3674l052k77L019L671J986M53p3l17l56o6m67k227l849l457j357P73K112
$$ 43674 40622 40345 43364 47035 49021 49474 49401 49084 48728 48662 48195 45968 42119 38662 37305 38078 40190
55382D0190K576J989Q86O84J544J631o9j925k224j586j236q49P4N57j69r83p65
$$ 40190 42766 44755 45641 46325 47869 49500 49431 47506 45282 43696 42460 41611 41685 42242 42073 41090 40325
55365D0325l07n91r01l84J90nk06K95O55K96L17J410K309K092J897K627L093K427
$$ 40325 40018 39427 38526 38142 38332 38327 38121 38416 39071 39367 39684 41094 43403 45495 47392 50019 53112 55539
55347E5539J979K790L421K576J529J576J502J67q60r9P79k15j761j758j281k425
$$ 55539 57518 60308 63729 66305 67834 69410 70912 71079 70219 70120 70899 70684 68923 67165 65884 63459
55331F3459m090l762k004j161j010L01J950J402q14j436L51J954J791J121Q77
$$ 63459 59369 55607 53603 52442 51432 51733 53683 55085 54271 52835 53186 55140 56931 58052 58929
55316E8929Q7j622k750k276j098l92l37p92j560j875j208l91l34l49M94J241N92
$$ 58929 59016 57394 54644 52368 51270 50878 50541 49749 48189 46314 45106 44715 44381 44032 44526 45767 46359
55299D6359l97J86J632J562p1r39k18N30M60M99R07O62k25m35jo25k526l585k597
$$ 46359 45962 46148 47780 49342 49271 48332 48114 48644 49104 49603 50510 51172 50947 50512 50511 49886 47360 43775 41178
55280D1178j122q94j430j463r37m01J53P21P50J03m74n00l84n41p80r95j347j542
$$ 41178 40056 39162 37732 36269 35332 34931 35084 35805 36555 36658 36184 35684 35300 34759 33979 32984 31637 30095
55262C0095q78O78K329L417L769L243J906M46n00j079j440j020K85J137N00m98
$$ 30095 29217 29895 32224 35641 39410 42653 44559 45005 44505 43426 41986 40966 41251 42388 42888 42390
55246D2390j71J069J600J337J411J614P05j050j944j485p86l51L39J100J245J404
$$ 42390 42219 43288 44888 46225 47636 49250 49955 48905 46961 45476 44690 44339 44678 45778 47023 48427
55230D8427K717M061K896p03l545l612k255j280m88O49J333J087R22J328J006
$$ 48427 51144 55205 58101 57398 53853 50241 47986 46706 46218 46867 48200 49287 50209 51537 52543
55215E2543o71j853q11J124J384j06j127n18O53J125J010J022J262J196M80m22
$$ 52543 51872 50019 49208 50332 51716 51610 50483 49965 50618 51743 52753 53775 55037 56233 56713 56291
55199E6291m96N59J462O63j384k386j110R51J594O36l93o20p23j476k403k262
$$ 56291 55795 56354 57816 58479 57095 54709 53599 54550 56144 56780 56387 55767 55044 53568 51165 48903
55183D8903o35J355K126J399M52L59O39K96m89p76n96q98j759k017j078R6L81
$$ 48903 48268 49623 51749 53148 53600 53959 54598 54894 54405 53629 53033 52135 50376 48359 47281 47377 47758
55166D7758Ro5L38M89r1r64j218m67O89J268J002O00O97J059J113R06R54J508
$$ 47758 47767 47702 48040 48529 48438 47474 46256 45789 46478 47746 48748 49348 50045 51104 52217 53123 54077 55585
55148E5585K290K705K059K23j690k028n31J232J847J501R01Oj160j595n40J090
$$ 55585 57875 60580 62639 62862 61172 59144 58613 59845 61692 63193 64094 64100 62940 61345 60805 61895
55132F1895J749J122l6j165j930j873j238j190k082k511j383L20J332K229L860
$$ 61895 63644 64766 64730 63565 61635 59762 58524 57334 55252 52741 51358 51678 53010 55239 59099
55117E9099M905L542O91r29o07j25p06j772k592l004k569j102R4k84j115k66J753
$$ 59099 64004 67546 68237 67308 66701 66576 65870 64098 61506 58502 55933 54831 54925 54641 53526 53260 55013
55100E5013K244N44r83o99K24K44l63p63p96j97J454L144K884N77j511j967j790
$$ 55013 57257 57801 56818 56119 56343 56587 56224 55461 54665 54468 55922 59066 61950 62527 61016 59049 57259
55083E7259j965j823j006p48j694k415j687n07k02j77P01J864K051J419J004R60
$$ 57259 55294 53471 52465 51717 50023 47608 45921 45414 45212 45035 45736 47600 49651 51070 52074 53034
55067E3034Q70R63J510J763R06m29q69n0J274K401K960K731J984J578J911K376
$$ 53034 53904 54867 56377 58140 59046 58617 57748 57698 58972 61373 64333 67064 69048 70626 72537 74913
55051G4913K411K333K534K671K291J547O76k79p88QJ626J965j93l229m425l008
$$ 74913 77324 79657 82191 84862 87153 88700 89376 89097 88309 88317 89943 91908 91715 88486 84061 81053
55035H1053m85J494K480K783K604J847M91q31r80L54J756J563J31o05J93J473
$$ 81053 80568 82062 84542 87325 89929 91776 92267 91436 90456 90810 92566 94129 94260 93655 93848 95321
55019I5321K251K717K927K227P65r4J74K98n30r95K91K331K947J641j84j306j602
$$ 95321 97572 100289 103216 105443 106208 106114 106288 106586 106056 105061 105352 107683 110630 112271 112087 110781 109179
55002A09179j362q66m83m13m65n29o84o46L5Q60N60j028k447k688k482k629k429
$$ 109179 107817 106951 106468 106055 105590 105061 104377 103731 103766 104626 105186 104158 101711 99023 96541 93912 91483
54985I1483j016Q23J581J060K15l88p35o04Q9O74N52K59P58J916K587J981L99
$$ 91483 90467 91290 92871 93931 94146 93758 93023 92419 92508 93182 93734 93993 94751 96667 99254 101235 101634
54968A01634j080j247K28K010K177N41j038j193p28r51j558j371k18J224K611
$$ 101634 100554 99307 99535 101545 103722 104263 103225 102032 101304 100353 98795 97424 97206 98430 101041
54953A01041L826M310L648K324R75l41j411j438m24J16q22j929j283Q98K757L339
$$ 101041 104867 109177 112825 115149 116124 115783 114372 112934 112510 112626 111804 109875 108592 109490 112247 115586
54937A15586L050K231J016J70L78P86rj712k628k221j627j529j268n10r4m69p14
$$ 115586 118636 120867 121883 122053 122431 123217 123208 121496 118868 116647 115020 113491 112223 111713 111619 111150 110436
54920A10436K2J167J767K002K647L620M045L523K517J552P83L52N85J440K090
$$ 110436 110458 111625 113392 115394 118041 121661 125706 129229 131746 133298 134081 134433 135018 136458 138548
54905A38548J617K73l68J067M109O797P625O818N678N300O117Q001J0182J1461
$$ 138548 140165 140438 140070 141137 145246 152043 159668 166486 172164 177464 183581 191582 201764 213225
54891B13225J1245J0433J0747J2973J5955J7674J7336J6242J6054J6419J5055
$$ 213225 224470 234903 245650 258623 274578 292252 309588 325830 341884 358303 373358
54880C73358J0601M423j138n460r439j3253j5891j6763j6327j5059j3126j1203
$$ 373358 383959 388382 387244 381784 372345 359092 343201 326438 310111 295052 281926 270723
54868B70723j0246j0165r915r194q692q504p683n857l963k845k283j824j299k02
$$ 270723 260477 250312 240397 231203 222511 214007 206324 200467 196504 193659 191376 189552 188253 188051
54854A88051J946M243M914L782K656K877M013N554P863J0624J2398J2792J3214
$$ 188051 189997 194240 199154 202936 205592 208469 212482 218036 225899 236523 248921 261713 274927
54841B74927J4279J4510J2992J1174J0149Q232L524k675p471j0127j1825j2868
$$ 274927 289206 303716 316708 327882 338031 346263 349787 347112 339641 329514 317689 304821
54829C04821j2715j2052j2164j2592j1774r922q983r747j0904j1043r924p884
$$ 304821 292106 280054 267890 255298 243524 233602 224619 214872 203968 192925 183001 175117
54817A75117n685m749n803p311p002m893l043k424j946p66K68L2j368k956l712
$$ 175117 169432 164683 158880 151569 144567 139674 136631 134207 132261 131495 131763 131795 130427 127471 123759
54802A23759k966j026O34R35N86P57R89P9j479k012j409j148j521j102L99J084
$$ 123759 120793 119767 120401 121336 121922 122679 123668 123747 122268 120256 118847 117699 116178 115076 115475 116559
54786A16559k82k256k853k168j550j361r75k53K69K77j56r67j978k655k501j476
$$ 116559 116277 114021 111168 109000 107450 106089 105114 104861 105130 105407 105251 104284 102306 99651 97150 95674
54770I5674J28J743K478J714Q3q78m05O21R07L62J47J313L581N372N172L073P24
$$ 95674 95802 97545 100023 101737 101820 100942 100537 101158 102065 102427 102574 103887 107468 112840 118012 121085 121809
54753A21809m34m13J30J080K483L718M189M357M988N794N998N908O574Q060R358
$$ 121809 121375 120962 121092 122172 124655 128373 132562 136919 141907 147701 153699 159607 166181 174241 183599
54738A83599J0012J0623J1664J2915J4164J5445J6591J7447J8368J9344J9050
$$ 183599 193611 204234 215898 228813 242977 258422 275013 292460 310828 330172 349222
54727C49222J6174J1635P789N376K843r14m880p604r127j0243j1031j1044j0165
$$ 349222 365396 377031 384820 390196 393039 392125 387245 379641 370514 360271 349240 338196 328031
54714C28031q559o486m722m367n574p055p413o420m664k722j039O5Q01J831L364
$$ 328031 319472 312986 308264 303897 298323 291268 283855 277435 272771 270049 269010 269075 269876 271707 275071
54699B75071M853N783O273O718P462Q941J1439J4449J6958J8560J9813K1348K3225
$$ 275071 279924 285707 291980 298698 306160 315101 326540 340989 357947 376507 396320 417668 440893
54686D40893K5131K6525K6608K4889K1805J8134J3926Q863L458j233n067q897
$$ 440893 466024 492549 519157 544046 565851 583985 597911 606774 610232 608999 603932 595035
54674E95035j3052j6812j9542k1314k2238k2259k1750k1250k0488j8903j7240
$$ 595035 581983 565171 545629 524315 502077 479818 458068 436818 416330 397427 380187
54663C80187j7036j8123j8247j6024j2858j0861j0178r667r095r021r102q143
$$ 380187 363151 345028 326781 310757 297899 287038 276860 267193 258098 249077 239975 231832
54651B31832n888l583k467k466k626k273j515r31r80j531j918j553n89J2p73k885
$$ 231832 225944 222361 219894 217428 214802 212529 211014 210083 209103 207572 205654 204101 203512 203524 202751 199866
54635A99866m800m788k850q61l78r11r04J71J558K491K790K534K089K127K684
$$ 199866 195066 190278 187428 186567 186189 185278 184374 184545 186103 188594 191384 193918 196007 198134 200818
54620B00818K660J318k39l62P50J474J351J552K672L710L699L001K497K632L555
$$ 200818 203478 204796 204557 204195 204945 206419 207770 209322 211994 215704 219403 222404 224901 227533 231088
54605B31088N059O155N977N258N564O962P934P861P806Q312Q319P208O199O480
$$ 231088 236147 242302 248279 253537 259101 266063 273997 281858 289664 297976 306295 313503 319702 326182
54591C26182P279P123N998N114N274O495Q411J0210J0947J0791J1176J3103J6059
$$ 326182 333461 340584 346582 351696 356970 363465 371876 382086 393033 403824 415000 428103 444162
54578D44162J9131K2032K4398K5514K5713K6708K9206L1229L0325K6514K1627
$$ 444162 463293 485325 509723 535237 560950 587658 616864 648093 678418 704932 726559
54567G26559J6431J0081K186o120j3316j8738k2583k5434k7717k9198k9192k7651
$$ 726559 742990 753071 755257 749137 735821 717083 694500 669066 641349 612151 582959 555308
54555E55308k5461k3374k1269j9056j7312j6445j5972j5394j4866j4261j2620
$$ 555308 529847 506473 485204 466148 448836 432391 416419 401025 386159 371898 359278
54544C59278r682o974o001o125n686m644m445n487o468o444o069o270o800o735
$$ 359278 349596 342622 336621 330496 324810 320166 315721 310234 303766 297322 291253 284983 278183 271448
54530B71448n790m668m353n223o573p069o037m236l108l458m959o524o922n684
$$ 271448 265658 260990 256637 251414 244841 237772 231735 227499 224391 220933 215974 209450 202528 196844
54516A96844l813l019l760m725m671l871l043j959k96R94P22o42j601j862k364
$$ 196844 193031 190012 186252 181527 176856 172985 169942 167983 167687 168681 169403 168761 167160 165298 162934
54501A62934l174l076j647j22N85J344L191N233N428L234L34j262j126k61K75
$$ 162934 159760 156684 155037 154915 155500 156844 160035 165268 170696 173930 174264 173002 171876 171615 171890
54486A71890K82L08R85K391L795M190L384K489K889M621O181O219N044M104M362
$$ 171890 172172 172480 173465 175856 179651 183841 187225 189714 192603 197224 203405 209624 214668 218772 223134
54471B23134N789Q003J0558J2681J3581J3198J2193J1247J0868J1558J3166J4256
$$ 223134 228923 236926 247484 260165 273746 286944 299137 310384 321252 332810 345976 360232
54459C60232J3226J0212O857M023R20l036o801q989r773j0566j2298j4578j6274
$$ 360232 373458 383670 390527 394550 395470 392434 385633 376644 366871 356305 344007 329429 313155
54446C13155j6435j5022j3001j1415j0386r491q734q232p280n223l159l053m759
$$ 313155 296720 281698 268697 257282 246896 237405 228671 220439 213159 207936 204777 201724 196965
54433A96965n741m379j885k9J198K399L034K543J697J194J37k163m012l122J52
$$ 196965 191224 186845 184960 184931 186129 188528 191562 194105 195802 196996 197133 194970 190958 187836 187988
54418A87988L362N183N993N758L870J193n8Q67K320K868L164M384O053O549N012
$$ 187988 191350 196533 202526 208284 212154 213347 213289 214156 216476 219344 222508 226892 232945 239494 244506
54403B44506K084p25k027j535l41J30l92j151j681k147k535k546k441k887l807
$$ 244506 246590 245865 243838 242303 241962 242092 241700 240549 238868 236721 234186 231640 229199 226312 222505
54388B22505m331m062l529l140k743k547l226m553m997l618j588q24j585k406
$$ 222505 218174 214112 210583 207443 204700 202153 198927 194374 189377 185759 184171 183347 181762 179356
54374A79356k175j290o78n67o74j021j845k742k646j099Q44J580P69m40r38p01
$$ 179356 177181 175891 175213 174646 173972 172951 171106 168364 165718 164619 165463 167043 167812 167372 166434 165733
54358A65733j30P24J700K089J451N03K54O96J123J533K684M695O489O969O260
$$ 165733 165603 166327 168027 170116 171567 172070 172324 173020 174143 175676 178360 183055 189544 196513 202773
54343B02773N438N321N635N305L617J165o08r63n73l68k78M06J831L403M584N200
$$ 202773 208211 213532 219167 224472 228089 229254 228646 227683 227110 226742 226464 226870 228701 232104 236688 241888
54327B41888N123M170K304l49l396n861o554n249l124j539p64m44o81j855l670
$$ 241888 247011 251181 253485 253136 249740 243879 237325 232076 228952 227413 226649 226205 225524 223669 219999
54312B19999n164n626n060m023l390l736m502m335k925j700j962k985l129k181
$$ 219999 214835 209209 204149 200126 196736 193000 188498 184163 181238 179538 177576 174591 171462 169281
54298A69281j337j202j243j080j026j073o14M75J375J397Q56N34P66J332J808
$$ 169281 167944 166742 165499 164419 163393 162320 161706 162181 163556 164953 165809 166343 167109 168441 170249
54283A70249J953J991K405L176L543L005K097J621J588J598J672J886J688P56
$$ 170249 172202 174193 176598 179774 183317 186322 188419 190040 191628 193226 194898 196784 198472 199228
54269A99228m9J95P47J81j150j377r2P48m20k630m045m541n301o641p645p600
$$ 199228 199179 199374 200121 200302 199152 197775 197683 198431 198011 195381 191336 186795 181494 174853 167208 159608
54253A59608o641m975k664m26M16n36j856j827o95m06j936l843m164k882j418
$$ 159608 152967 147992 145328 144902 145318 144782 142926 141099 140404 139998 138062 134219 130055 127173 125755
54238A25755k54J285K950L138J268r44j709j494j885l026l589k729q47J163K318
$$ 125755 125501 126786 129736 132874 134142 133198 131489 129995 128110 125084 121495 118766 117919 119082 121400
54223A21400J773k46k071k282j340n31k5O86J058M2j748k201l94K292M012M235
$$ 121400 123173 122927 120856 118574 117234 116703 116678 117364 118422 118464 116716 114515 114121 116413 120425 124660
54207A24660L425K255J623K199L296L194J329n64l72J675L068J902q23k320j388
$$ 124660 128085 130340 131963 134162 137458 140652 141981 141417 141045 142720 145788 147690 146867 144547 143159
54192A43159O7l80k268k959j620m06r68j890j232K61O39P8J56P08J48j309j504
$$ 143159 143226 142846 140578 137619 135999 135593 134625 132735 131503 131764 132403 132481 132637 133345 133493 132184 130680
54175A30680K22J908J898Q28J1l70n26k05O08J292J583J854K044J524M10l50n07
$$ 130680 130902 132810 134708 135536 135547 135177 134651 134446 135054 136346 137929 139783 141827 143351 143761 143411 142904
54158A42904p44j041m26J186K380K200J314O61K28j62k29n6l10j036j432j361
$$ 142904 142160 141119 140693 141879 144259 146459 147773 148434 148662 148500 148271 148215 147905 146869 145437 144076
54142A44076j733k802l344k220L19L175N031M460J196k325k807j87K098J665j81
$$ 144076 142343 139541 136197 133977 134296 137471 142502 146962 148158 145833 143026 142839 144937 146602 146421
54127A46421j356j995k863l061j673m8q0j364k252k612l328l923l199j751j441
$$ 146421 145065 143070 140207 137146 135473 135425 135345 133981 131729 129117 125789 121866 118667 116916 115475
54112A15475k422k872j784j72P86J031P20k85j470j600l30J146J608J222Q76R23
$$ 115475 113053 110181 108397 108225 109011 110042 110762 110477 109007 107407 107077 108223 109831 111053 111929 112852
54096A12852J113J340J735K197K181J196n05j900k206j856j960k752l264k732
$$ 112852 113965 115305 117040 119237 121418 122614 122109 120209 118003 116147 114187 111435 108171 105439
54082A05439j565n56J09N41O43M87N47R59J161P52J32k33m40n73l00L09M31l10
$$ 105439 103874 103318 103427 103968 104611 105098 105645 106604 107765 108517 108649 108416 107976 107403 107103 107412 107843 107533
54064A07533j058r49l83k82p71j367j782j785j037J29N73j87j186j525j674k200
$$ 107533 106475 105526 105143 104861 104090 102723 100941 99156 98119 98248 98821 98634 97448 95923 94249 92049
54048I2049k280r19J069J889J146N2l69kJ056K423K933J674m09j191J61K396L855
$$ 92049 89769 88850 89919 91808 92954 93006 92637 92635 93691 96114 99047 100721 100312 99121 99282 101678 105533
54031A05533L983L073J613K56l43k1P25J096M12j351l076l167j336Q45J684J027
$$ 105533 109516 112589 114202 114458 114115 114094 114819 115915 116327 114976 111900 108733 107397 108242 109926 110953
54015A10953k90j626k378j773l5J127N98m05q0J230J753J078L44L6l50m83P80
$$ 110953 110663 109037 106659 104886 104851 105978 106576 106171 106091 107321 109074 110152 110496 110532 110182 109699 110479
53998A10479L092M263K978M73j242j528q18N16K110L386M224N073N821N452L555
$$ 110479 113571 117834 120812 121285 120043 118515 117697 118213 120323 123709 127933 133006 138827 144279 147834
53983A47834J472R82K347M222N145M636L278K264K553L965N299N570M999M559
$$ 147834 149306 150288 152635 156857 162002 166638 169916 172180 174733 178698 183997 189567 194566 199125
53969A99125M955O132P483Q305Q309P876P663P923Q457R002R346R134Q016O088
$$ 199125 204080 210212 217695 226000 234309 242185 249848 257771 266228 275230 284576 293710 301726 307814
53955C07814L906K057R24P43J479K735L943M600M247K708N78j016j603j851k420
$$ 307814 311720 313777 314701 315444 316923 319658 323601 328201 332448 335156 335734 334718 333115 331264 328844
53940C28844l046l345l894n442p464q490p778n893l869k607k808m433o241o730
$$ 328844 325798 322453 318559 313117 305653 297163 289385 283492 279623 277016 274208 269775 263534 256804
53926B56804n723m357l571l358l441l779m162m012k973j325K49J138J164P01K62
$$ 256804 251081 246724 243153 239795 236354 232575 228413 224401 221428 220103 220352 221490 222654 223355 223617
53911B23617k33j259k501k668j155Q20J644J304R79J101R79J43r60j587j264P6
$$ 223617 223384 222125 219624 216956 215801 216621 218265 219569 220548 221649 222628 222771 221811 220224 218960 219036
53895B19036J832K837K510J529Q50N49L47M91J092J424J096J144K529M259M724
$$ 219036 220868 223705 226215 227744 228594 229143 229490 229981 231073 232497 233593 234737 237266 241525 246249
53880B46249M326M868O603P822P479O426N757N564N583N714N587M947M409M559
$$ 246249 250575 255443 262046 269868 277347 283773 289530 295094 300677 306391 311978 316925 321334 325893
53866C25893M587L437J931J694K259J711K90M21K549M037L446K964M618O829P204
$$ 325893 330480 333917 335848 337542 339801 341512 341802 342223 344772 348809 352255 355219 359837 366666 373870
53851C73870O535P075Q407Q213O337N022N295N898O029O513P621P986O744M957
$$ 373870 380405 387480 395887 404100 410437 415459 420754 426652 432681 439194 446815 454801 461545 466502
53837D66502L800K748Q41j300k195j757j488k388l736m368m394m867o058o953
$$ 466502 470302 473050 473891 472591 470396 468639 467151 464763 461027 456659 452265 447398 441340 434387
53823D34387o809o285o375o787o575o043o640q721j0778j1436j1117j0925j0933
$$ 434387 427578 421293 414918 408131 401556 395513 388873 380152 369374 357938 346821 335896 324963
53810C24963j0449r260p650n881m438m129n003n775n402m572m628n495n972n728
$$ 324963 314514 305254 297604 291723 287285 283156 278153 272378 266976 262404 257776 252281 246309 240581
53796B40581n539n620n120l673k274k058k956m019m460m008k889j896j961l161
$$ 240581 235042 229422 224302 220629 218355 216297 213341 209322 204862 200854 197965 196069 194108 190947
53782A90947m442m683l754k295r12R5N58M63N4m24r35j369j225j33J358K084J593
$$ 190947 186505 181822 178068 175773 174861 174956 175514 175977 176031 175607 174672 173303 172078 171945 173303 175387 176980
53765A76980Q05Q75J742K288J870J050O73P54N99k68j604k608k461j003R82K477
$$ 176980 177785 178660 180402 182690 184560 185610 186283 187037 187636 187368 185764 183156 180695 179692 180674 183151
53749A83151L289L889M277L969L360L805N573O904O265M603L860M116L924L092
$$ 183151 186440 190329 194606 198575 201935 205740 211313 218217 224482 229085 232945 237061 240985 244077
53735B44077L014M180N352N764O290P581Q566P886N760L459J871J340J938K979
$$ 244077 247091 251271 256623 262387 268677 276258 284824 292710 298470 301929 303800 305140 307078 310057
53721C10057L126J963P51Q51J945K631K159Q24o71j549j266l85m44k207m556n819
$$ 310057 313183 315146 315897 316748 318693 321324 323483 324307 323636 322087 320821 320436 319992 317785 313229 307410
53705C07410n638m780l800k922k685l574n165o350o322m917k497j28P15n57k935
$$ 307410 301772 296992 293192 290270 287585 284011 278846 272496 266174 261257 258760 258632 259347 258790 255855
53690B55855m851n461m613k538l66J69j245k552j773L21J382P40k40p07j248k021
$$ 255855 251004 245543 240930 238392 238026 238195 236950 234398 232625 232946 234328 235068 234828 234121 232873 230852
53674B30852j922m72R47R01m9j82Q99J859J584O39L67R19R42n33k535l226k427
$$ 230852 228930 228458 229405 230306 230257 230075 230974 232833 234417 235056 235423 236342 237284 236751 234216 230990 228563
53657B28563j790k154k158m96J703K374J607J261J796J638M8j455j404m46J78
$$ 228563 226773 224619 222461 221965 223668 226042 227649 228910 230706 232344 232392 230937 229533 229087 229265
53642B29265P48K145L762M112L145K377K645L129K941K430K277K272J887J542
$$ 229265 230013 232158 235920 240032 243177 245554 248199 251328 254269 256699 258976 261248 263135 264677
53628B64677K235L939N210M875L566K931L511M097L446K078J674K921M594N071
$$ 264677 266912 270851 276061 280936 284502 287433 290944 295041 298487 300565 302239 305160 309754 314825
53614C14825M176L053K529K274J637O84J6j73k89o16q22m69K77O50k2j714l535
$$ 314825 319001 322054 324583 326857 328494 329178 329194 329021 328732 328116 327294 326825 327102 327752 327730 326016 322481
53597C22481m140k719J14K592L304K303O04j008k265k954k834k041j101n16n29
$$ 322481 318341 315622 315736 318328 321632 323935 324539 323531 321266 318312 315478 313437 312336 311820 311291
53582C11291j001j182j63J818K987J993n5o62R24K859L226K229J412J678K722
$$ 311291 310290 309108 308945 310763 313750 315743 315688 315026 315950 318809 322035 324264 325676 327354 330076
53567C30076L698L795K763J345O51Q87J342J766K699M105M869M441L811M036M663
$$ 330076 333774 337569 340332 341677 342328 343215 344557 346323 349022 353127 357996 362437 366248 370284 374947
53552C74947M658M017L394K931K528K565L231L824L876M228N535O458N197K529
$$ 374947 379605 383622 387016 389947 392475 395040 398271 402095 405971 410199 415734 422192 427389 429918
53538D29918J350L047O013Q162R116R222Q236O239M653M688N477N114L388K162
$$ 429918 431268 434315 440328 448490 457606 466828 475064 481303 485956 490644 496121 501235 504623 506785
53524E06785K900M839O136O083N503N207M843L726K305K053L581N459N552L379
$$ 506785 509685 514524 520660 526743 532246 537453 542296 546022 548327 550380 553961 559420 564972 568351
53510E68351N67j044j157o56r4P82K072L007K730J539O97Q96J536J886K184K854
$$ 568351 568918 567874 566717 566061 565967 566749 568821 571828 574558 576097 576794 577690 579226 581112 583296 586150
53494E86150L223K315O52q6O35J652K233L202N088O580O266M974M767O047P043
$$ 586150 589373 591688 592340 592254 592889 594541 596774 599976 605064 611644 617910 622884 627651 633698 640741
53479F40741O128L508P43m93N82L177N258N424M409M026N026O749Q442R796J0553
$$ 640741 646869 650377 651120 650627 651209 654386 659644 665068 669477 673503 678529 685278 693720 703516 714069
53464G14069J0681J0810J1289J1309J0222R384J0883J4291J6710J6559J5522J5809
$$ 714069 724750 735560 746849 758158 768380 777764 788647 802938 819648 836207 851729 867538
53452H67538J7174J8111J8620J9894K1823K2837K2299K1617K2361K4308K6097
$$ 867538 884712 902823 921443 941337 963160 985997 1008296 1029913 1052274 1076582 1102679
53441A102679K7167K8194K9648L0875L1100L0982L2179L5122L7991L8625L7088
$$ 1102679 1129846 1158040 1187688 1218563 1249663 1280645 1312824 1347946 1385937 1424562 1461650
53430A461650L5428L5072L5489L5598L5467L5909L6976L7775L7650L6919L6182
$$ 1461650 1497078 1532150 1567639 1603237 1638704 1674613 1711589 1749364 1787014 1823933 1860115
53419A860115L5345L3793L1569K9958L0314L2416L4518L5198L4491L3018L0907
$$ 1860115 1895460 1929253 1960822 1990780 2021094 2053510 2088028 2123226 2157717 2190735 2221642
53408B221642K8357K6330K5649K5716K5246K3942K2333K0368J7516J4276J1949
$$ 2221642 2249999 2276329 2301978 2327694 2352940 2376882 2399215 2419583 2437099 2451375 2463324
53397B463324J0574Q589N197J721m45k036m805q889j2669j4896j5828j6274j6779
$$ 2463324 2473898 2482487 2487684 2489405 2488960 2486924 2482119 2473230 2460561 2445665 2429837 2413563 2396784
53384B396784j7908k0218k3321k5703k6218k5490k5227k6240k7723k8583k8758
$$ 2396784 2378876 2358658 2335337 2309634 2283416 2257926 2232699 2206459 2178736 2150153 2121395
53373B121395k8844k8920k8496k7488k6329k5103k3391k1344j9979j9739j9528
$$ 2121395 2092551 2063631 2035135 2007647 1981318 1956215 1932824 1911480 1891501 1871762 1852234
53362A852234j8017j5373j2838j1037r528p709n245j991J492L749L923L245L716
$$ 1852234 1834217 1818844 1806006 1794969 1785441 1777732 1772487 1770496 1771988 1775737 1779660 1782905 1786621
53349A786621N517P132Q007R338J1805J4425J6507J9050K2876K6761K9083L0434
$$ 1786621 1792138 1799270 1807277 1816615 1828420 1842845 1859352 1878402 1901278 1928039 1957122 1987556
53337A987556L2770L6381L9476M0897M1707M3535M6496M9376N1261N2295N3261
$$ 1987556 2020326 2056707 2096183 2137080 2178787 2222322 2268818 2318194 2369455 2421750 2475011
53326B475011N4867N7335O0382O3564O6625O9342P1230P1827P1366P0830P1078
$$ 2475011 2529878 2587213 2647595 2711159 2777784 2847126 2918356 2990183 3061549 3132379 3203457
53315C203457P2045P2893P2827P1669O9729O7308O4549O1763N9594N8438N7541
$$ 3203457 3275502 3348395 3421222 3492891 3562620 3629928 3694477 3756240 3815834 3874272 3931813
53304C931813N5077M9589M1491L2999K6337K1914J8198J3448P490J593l388q290
$$ 3931813 3986890 4036479 4077970 4110969 4137306 4159220 4177418 4190866 4198356 4199949 4196561 4188271
53292D188271j4668k2765l0959l7254m1099m3676m6592n0370n4044n6327n7098
$$ 4188271 4173603 4150838 4119879 4082625 4041526 3997850 3951258 3900888 3846844 3790517 3733419
53281C733419n7499n8431n9478n9647n8778n7530n6345n5241n4617n5250n7076
$$ 3733419 3675920 3617489 3558011 3498364 3439586 3382056 3325711 3270470 3215853 3160603 3103527
53270C103527n8615n8306n6115n3335n0981m8902m6578m4217m2560m1728m0874
$$ 3103527 3044912 2986606 2930491 2877156 2826175 2777273 2730695 2686478 2643918 2602190 2561316
53259B561316l9290l7331l5674l4016l1459k8181k5628k4662k4511k4067k3331
$$ 2561316 2522026 2484695 2449021 2415005 2383546 2355365 2329737 2305075 2280564 2256497 2233166
53248B233166k2732k1976k0619j9205j8679j8928j8858j7697j5430j2403r377
$$ 2233166 2210434 2188458 2167839 2148634 2129955 2111027 2092169 2074472 2059042 2046639 2037262
53237B037262p453o722n486k302J631L685L440L262N066Q175J1050J3425J5678
$$ 2037262 2029809 2023087 2017601 2015299 2016930 2020615 2024055 2027317 2032383 2040558 2051608 2065033 2080711
53224B080711J7475J8450J9406K1452K4385K6971K8587K9621L0373L0440K9469
$$ 2080711 2098186 2116636 2136042 2157494 2181879 2208850 2237437 2267058 2297431 2327871 2357340
53213B357340K7886K6635K6263K6461K6456K5754K4386K2372J9498J5863J2205
$$ 2357340 2385226 2411861 2438124 2464585 2491041 2516795 2541181 2563553 2583051 2598914 2611119
53202B611119R094O232L185L41j730l510n937q836j1095j2492j4129j6766j9831
$$ 2611119 2620213 2626445 2629630 2629971 2628241 2624731 2618794 2609958 2598863 2586371 2572242 2555476 2535645
53189B535645k2474k4648k6757k8841l0530l1354l1168l0692l1173l2713l3568
$$ 2535645 2513171 2488523 2461766 2432925 2402395 2371041 2339873 2309181 2278008 2245295 2211727
53178B211727l2470l0904l1330l3363l4064l2188k9826k9078k9309k8982k8228
$$ 2211727 2179257 2148353 2117023 2083660 2049596 2017408 1987582 1958504 1929195 1900213 1871985
53167A871985k8024k8319k8483k8442k8027k6401k3579k1311k0968k1548k1255
$$ 1871985 1843961 1815642 1787159 1758717 1730690 1704289 1680710 1659399 1638431 1616883 1595628
53156A595628j9973j8562j6843j4337j2178j2120j3876j5431j5961j6558j7915
$$ 1595628 1575655 1557093 1540250 1525913 1513735 1501615 1487739 1472308 1456347 1439789 1421874
53145A421874j9113j9293j9048j9415k0420k1258k1341k0839k0487k0789k1048
$$ 1421874 1402761 1383468 1364420 1345005 1324585 1303327 1281986 1261147 1240660 1219871 1198823
53134A198823j9700j6469j3561j3531j6160j8813j9743j9688j9938k0344k0049
$$ 1198823 1179123 1162654 1149093 1135562 1119402 1100589 1080846 1061158 1041220 1020876 1000827
53123A000827j9199j8912j9830k1361k2312k1946k0526j8938j7751j6748j5569
$$ 1000827 981628 962716 942886 921525 899213 877267 856741 837803 820052 803304 787735
53112G87735j4568j4564j5708j6966j6902j5036j2481j0929j0830j0921j0117
$$ 787735 773167 758603 742895 725929 709027 693991 681510 670581 659751 648830 638713
53101F38713r198r493j0365r900q280q185j0787j3394j2981j0383q658q513q031
$$ 638713 629515 620022 609657 599757 591477 583292 572505 559111 546130 535747 527089 518576 510545
53088E10545o473n361n390m985l196j853l155o326q499q274o925o147n980n333
$$ 510545 504072 498711 493321 488336 485140 483287 480132 473806 465307 457033 450108 443961 437981 432648
53074D32648l758j973r72j086k014l195l846l221j499j71n99k257l334l109k463
$$ 432648 428890 426917 425945 424859 422845 419650 415804 412583 411084 410913 410314 408057 404723 401614 399151
53059C99151j976j154j47m14k405m134l726k101j354j504j089j79k87j486k110
$$ 399151 397175 396021 395874 395460 393055 388921 385195 383094 381740 380236 379147 378968 378681 377195 375085
53044C75085j602j359k079k341q70J407K710K587J672L67j215k740l955m975n710
$$ 375085 373483 372124 370045 367704 366834 368241 370951 373538 375210 375577 374362 371622 367667 362692 356982
53029C56982n675m910m237m151m229m169m469n295n578m326k263j087j370k110
$$ 356982 351307 346397 342160 338009 333780 329611 325142 319847 314269 309943 307680 306593 305223 303113
53015C03113k400k587l426m702n305m598l177k053j497j216j386k492l981m216
$$ 303113 300713 298126 294700 289998 284693 280095 276918 274865 273368 272152 270766 268274 264293 260077
53001B60077k563o00j54q78j021j57M32n1p70p34j80L4l96j167j877k284k460
$$ 260077 257514 256914 256760 255882 254861 254704 255136 255085 254315 253581 253401 253435 253039 251872 249995 247711 245251
52984B45251k736l142l119k296j188m44J70R61J102m91l139m761m343k894j790
$$ 245251 242515 239373 236254 233958 232770 232326 232496 233457 234559 234068 230929 226168 221825 218931 217141
52969B17141j478j928k880l281j930P00K402J799N4o33N90K858M758N278M205
$$ 217141 215663 213735 210855 207574 205644 206344 208746 210545 210599 209966 210556 213414 218172 223450 227655
52954B27655K166L2j782l014k980j324P95J580O68p40j823k749l361k911j540
$$ 227655 229821 229853 228071 225057 222077 220753 221548 223128 223796 223056 221233 218484 215123 212212 210672
52939B10672m36%O90J877K243R28r06j503m80J373L086L593K193j19j141j51J050
$$ 210672 210236 210236 210926 212803 215046 215974 215068 213565 213085 214458 217544 221137 223330 223211 222070 221919 222969
52922B22969Q32KK21J465K492K803K738K418J986K078K926L706L801L687L637
$$ 222969 223801 223803 224024 225489 227981 230784 233522 235940 237926 240004 242930 246636 250437 254124 257761
52907B57761K837J095L6Q32K078J883J092K025M648O444O090M927M588N085N700
$$ 257761 260598 261693 261729 262561 264639 266522 267614 269639 274287 280731 286821 291748 296336 301421 307121
52892C07121N954N237L078M46o00P09K741L371K143K08j135j481j398j588j799
$$ 307121 313075 318312 321390 321836 321236 321945 324686 328057 330200 330408 329273 327792 326394 324806 323007
52877C23007j041N81J215l92k727l323k184j408j713j630m01N94J80p31p13J89
$$ 323007 321966 322547 323762 323370 320643 317320 315136 313728 312015 310385 309984 310578 310758 310027 309314 309503
52861C09503J171K026K627K235O10j065j568j251j193j452j318p00q9M83J219
$$ 309503 310674 312700 315327 317562 318172 317107 315539 314288 313095 311643 310325 309625 309536 310019 311238
52846C11238J625R79l33j042p19j91p7K25J439K987L426K161K36p77l56P20J468
$$ 311238 312863 313842 313509 312467 311748 311557 311480 311705 313144 316131 319557 321718 321954 321177 320821 321541 323009
52829C23009J653J618J569J447J295J327J556J784J872J849J756J692J797J893
$$ 323009 324662 326280 327849 329296 330591 331918 333474 335258 337130 338979 340735 342427 344224 346117
52815C46117J394J15j083j151k34O17R80J386J964J905P71n64r64m31K12N21N13
$$ 346117 347511 347626 346543 345392 345158 345775 346755 348141 350105 352010 352781 352217 351253 350822 351034 351555 352068
52798C52068N9r51j985k197j466n19L7L00N85Q75J041J295K077L500N011N730
$$ 352068 352127 351176 349191 346994 345528 345009 345046 345346 345931 346806 347847 349142 351219 354719 359730 365460
52782C65460N159L608J956J100J583L389N680O952O112L677J421O05Q75J091Q07
$$ 365460 370619 374227 376183 377283 378866 382255 387935 394887 400999 404676 406097 406702 407577 408668 409475
52767D09475M68L79J45p78k268l551l886l276k421k047k295k848l456m067m505
$$ 409475 409943 410322 410467 409689 407421 403870 399984 396708 394287 392240 389945 387097 383641 379574 375069
52752C75069m460l955l473l453l881m492n039n228m814m002l419l350l326k914
$$ 375069 370609 366654 363181 359728 355847 351355 346316 341088 336274 332272 328853 325503 322177 319263
52738C19263k508k727l320l425k973k939l824m636m094k474j387j700k546k628
$$ 319263 316755 314028 310708 307283 304310 301371 297547 292911 288817 286343 284956 283256 280710 278082
52724B78082j925j446j736k325k608k485k046j293n46n96j826l451m204l673k509
$$ 278082 276157 274711 272975 270650 268042 265557 263511 262218 261672 261076 259250 255799 251595 247922 245413
52709B45413j514j074j404k569m036m763m213k979k046j708j555j319j282j751
$$ 245413 243899 242825 241421 238852 234816 230053 225840 222861 220815 219107 217552 216233 214951 213200
52695B13200k489k887k627k076j899k331k954l297l358l317k979k045r04m81j083
$$ 213200 210711 207824 205197 203121 201222 198891 195937 192640 189282 185965 182986 180941 180037 179556 178473
52680A78473j962k352k441k878l691m269m078k954j003J128K189J488l2p58m92
$$ 178473 176511 174159 171718 168840 165149 160880 156802 153848 152845 153973 156162 157650 157618 156860 156368
52665A56368m93j262j524k47J405J437k04j593j400k69O06R96J176R73J74o23
$$ 156368 155875 154613 153089 152842 154247 155684 155480 153887 152487 152218 152824 153820 154996 155969 156143 155520
52649A55520n12M01Q55j87k241l610l055j165K08Q8m85K0J375J978J398J120K244
$$ 155520 155008 155409 156264 156077 153836 150226 147171 146006 146214 146302 145817 145837 147212 149190 150588 151708 153952
52632A53952L713L805K511J243Q90J226J843K449K542J930J398J793K651K868
$$ 153952 157665 161470 163981 165224 166114 167340 169183 171632 174174 176104 177502 179295 181946 184814
52618A84814K453K277K165Q58j746l906m207l177k036j134n46r42k557m049l872
$$ 184814 187267 189544 191709 192567 190821 186915 182708 179531 177495 176361 175815 174873 172316 168267 164395
52603A64395k392j427j841k703k865k354j884j698j404p37j26k42r61j172j70
$$ 164395 162003 160576 158735 156032 153167 150813 148929 147231 145827 145090 144964 144722 143761 142589 142419
52588A42419J005O35j253k607j986l65M55J62l49o68r87j076n55J08J39r5N53
$$ 142419 143424 144059 142806 140199 138213 137848 138303 138465 138116 137448 136461 135385 134830 134938 135077 134982 135535
52571A35535K087L079K600J436Q34Q52N18q45k825m120l489r88J613K298Q79q68
$$ 135535 137622 140701 143301 144737 145571 146423 146941 146096 143271 139151 135662 134674 136287 138585 139464 138596
52555A38596j268m66J08n00j823k459j432O17J733P12j256j665L80L127M298L534
$$ 138596 137328 136862 136970 136470 134647 132188 130756 131373 133106 133818 132562 130897 131277 134404 138702 142236
52539A42236K207J430J056M87k48n10J12J173J685J023n03k037k780k194j20K725
$$ 142236 144443 145873 146929 147416 147168 146658 146770 147943 149628 150651 150148 148111 145331 143137 143017 145742
52523A45742M808N051L979K924K322J618P30M04Q22J072O38M24J391K846L183
$$ 145742 150550 155601 159580 162504 164826 166444 167174 167578 168400 169472 170110 170534 171925 174771 177954
52508A77954J995N21J02R66K423L535L614K784K155K652L666L578J893O2k88P68
$$ 177954 179949 180470 180572 181538 183961 187496 191110 193894 196049 198701 202367 205945 207838 207900 207612 208380
52492B08380J851K081J699J213Q23O90J020J620J924J715J393J296J272J243J642
$$ 208380 210231 212312 214011 215224 216047 216737 217757 219377 221301 223016 224409 225705 226977 228220 229862
52477B29862K727L775L720K486J138O34R79J649K345L010L567L851L732L211K621
$$ 229862 232589 236364 240084 242570 243708 244342 245321 246970 249315 252325 255892 259743 263475 266686 269307
52462B69307K493K888K965J828j80j673j846j230o42j92K01J18o76j383r69L07
$$ 269307 271800 274688 277653 279481 279301 277628 275782 274552 273910 273718 273919 274037 273361 271978 271009 271316
52446B71316J074N79m54r23o14l2M87Q56O99n01k428l644k950r50N11N59J62L49
$$ 271316 272390 272969 272515 271592 270978 270946 271433 272289 272988 272487 270059 266415 263465 262515 263026 263585 263747 264096
52428B64096M90o09k470l232k121k95R31J401J295N30l49j6J807L511L722L103
$$ 264096 264586 263977 261507 258275 256154 255859 256790 258191 259486 260016 259667 259651 261458 264969 268691 271794
52412B71794K755K000l07k888k888J71L304L696J821jp21q68n95Q00L324N429
$$ 271794 274549 276549 276242 273354 270466 270637 273941 277637 279458 279457 278736 277868 277273 278073 281397 286826
52396B86826N422L241M48j393j943j760j230l31P32J344J244R96J222J697J693
$$ 286826 292248 295489 295937 294544 292601 290841 289611 289280 290012 291356 292600 293596 294818 296515 298208
52381B98208J088N66P22J307J520Q13o00j921k458k113j209o0J003J501J301J056
$$ 298208 299296 299862 300584 301891 303411 304224 303624 301703 299245 297132 295923 295863 296866 298367 299668 300724
52365C00724J337J513M81j461k722k662k334k478k283j118p0l50j297j419o19
$$ 300724 302061 303574 304055 302594 299872 297210 294876 292398 290115 288997 288927 288577 287280 285861 285242
52350B85242J81Q92K016L095L099K201J611J726J928J956J972J447k79k259k559
$$ 285242 285423 286315 288331 291426 294525 296726 298337 300063 301991 303947 305919 307366 307087 304828 302269
52335C02269r91M20J00j272k169j951p09J218K831K731O66j915l350l101j444
$$ 302269 301278 301698 301798 300526 298357 296406 295697 296915 299746 302477 303143 301228 297878 294777 293333
52320B93333R85K997L364K140P13P9OP7M38J127J834K656L919M960M467K632J401
$$ 293333 294318 297315 300679 302819 303532 303611 303617 303694 304132 305259 307093 309749 313668 318628 323095 325727 327128
52303C27128J838K581K054P60J92N85J121J511K006K446K586K935M072N534O334
$$ 327128 328966 331547 333601 334361 334553 335138 336259 337770 339776 342222 344808 347743 351815 357349 363683
52288C63683O283N983N851N898N991N757M760L498L424N086P007P417O484N613
$$ 363683 369966 375949 381800 387698 393689 399446 404206 407704 411128 416214 423221 430638 437122 442735
52274D42735N210M576L692L567M534N486N334M434M010M587N543O116O466P338
$$ 442735 447945 452521 456213 459780 464314 469800 475134 479568 483578 488165 493708 499824 506290 513628
52260E13628Q635Q997P601N831N878P671Q906Q583Q605J0688J3336J3829J2178
$$ 513628 522263 531260 538861 544692 550570 558241 567147 575730 584335 595023 608359 622188 634366
52247F34366J1018J1936J3862J5097J5271J4907J4596J5002J6536J8558J9810
$$ 634366 645384 657320 671182 686279 701550 716457 731053 746055 762591 781149 800959
52236H00959J9994K0105K0961K2322K3615K4573K4866K4129K2881K2543K3851
$$ 800959 820953 841058 862019 884341 907956 932529 957395 981524 1004405 1026948 1050799
52225A050799K5940K7535K8399K8910K8848K7587K5321K3256K2361K2557K3267
$$ 1050799 1076739 1104274 1132673 1161583 1190431 1218018 1243339 1266595 1288956 1311513 1334780
52214A334780K4231K5345K6012K5343K3113K0135J7456J5434J3831J2509J1556
$$ 1334780 1359011 1384356 1410368 1435711 1458824 1478959 1496415 1511849 1525680 1538189 1549745
52203A549745J0823R892Q618P358O561O341O406O222N411M311L770M003M089L333
$$ 1549745 1560568 1570460 1579078 1586436 1592997 1599338 1605744 1611966 1617377 1621688 1625458 1629461 1633550 1636883
52189A636883K613L229M705N261M480M019N127P101Q866J0583J2577J4020J4131
$$ 1636883 1639496 1642725 1647430 1652691 1657171 1661190 1666317 1673418 1682284 1692867 1705444 1719464 1733595
52176A733595J3725J4139J5304J6270J7038J8291J9775K0459K0223J9896J9621
$$ 1733595 1747320 1761459 1776763 1793033 1810071 1828362 1848137 1868596 1888819 1908715 1928336
52165A928336J8572J6499J4304J2789J1849J1135J0527R667Q035N760L573J714
$$ 1928336 1946908 1963407 1977711 1990500 2002349 2013484 2024011 2033678 2041713 2047473 2051046 2052760
52153B052760j27j652k038j731k747o069r799j1314j0722j0613j2411j4606j5147
$$ 2052760 2052633 2050981 2048943 2047212 2044465 2038396 2028597 2017283 2006561 1995948 1983537 1968931 1953784
52140A953784j4197j3483j3806j4454j4687j4389j3402j1572r775r451j0414j0479
$$ 1953784 1939587 1926104 1912298 1897844 1883157 1868768 1855366 1843794 1834019 1824568 1814154 1803675
52128A803675q399o006n822p388p891o068l538k163k087k871m684p287r263r491
$$ 1803675 1795276 1789270 1783448 1776060 1768169 1762101 1758563 1756400 1754313 1751442 1746758 1739471 1730208 1720717
52114A720717q478p334o271m994l648k570j893k037l582n883p007o193n275o342
$$ 1720717 1712239 1704905 1698634 1693640 1689992 1687422 1685529 1683492 1679910 1674027 1667020 1660827 1655552 1649210
52100A649210q827j0372j0014r059q937r503r465p666m201r08l75l442p888j0332
$$ 1649210 1640383 1630011 1619997 1610938 1602001 1592498 1583033 1575367 1571166 1570258 1569883 1566441 1558553 1548221
52086A548221r364o302l420k075k165k708l084l825n622p620p921o121l953k868
$$ 1548221 1538857 1532555 1529135 1527060 1524895 1522187 1519103 1515278 1509656 1502036 1494115 1487994 1484041 1481173
52072A481173k566k644l741n657o282m386j997j853l518m364l499k424k333l061
$$ 1481173 1478607 1475963 1472222 1466565 1460283 1455897 1453900 1452047 1448529 1444165 1440666 1438242 1435909 1432848
52058A432848m318n782o193m563k119j068j518j612l66J659M122O895Q514P432
$$ 1432848 1428530 1422748 1416555 1411992 1409873 1408805 1407287 1405675 1405309 1406968 1411090 1417985 1426499 1433931
52044A433931N095N005Q168J1989J4354J6091J8283J9917J9938J9579K0782K3660
$$ 1433931 1439026 1444031 1452199 1464188 1478542 1494633 1512916 1532833 1552771 1572350 1593132 1616792
52032A616792K7050L0168L2443L3186L2829L3180L4974L6457L5771L3548L1665
$$ 1616792 1643842 1674010 1706453 1739639 1772468 1805648 1840622 1877079 1912850 1946398 1978063
52021A978063L0562K9440K8171K7356K6976K6484K5731K4524K1887J7191J1687
$$ 1978063 2008625 2038065 2066236 2093592 2120568 2147052 2172783 2197307 2219194 2236385 2248072
52010B248072P563N603M871M335L656K509M61k272m804o589p823q771r342r519
$$ 2248072 2255635 2261238 2266109 2270444 2274100 2276609 2277070 2274798 2269994 2263405 2255582 2246811 2237469 2227950
51996B227950r633r904r968r310q237q060r774j2387j3196j0534n804k167j428
$$ 2227950 2218317 2208413 2198445 2189135 2180898 2172838 2163064 2150677 2137481 2126947 2121143 2118976 2117548
51983B117548k841m510m857l083L68L595M832M449M332N212N954N650M872M298
$$ 2117548 2114707 2110197 2105340 2102257 2102625 2106220 2111052 2115501 2119833 2125045 2130999 2136649 2141521 2145819
51969B145819L653K815K643L575M466L862J771o59k530l536l705l625m277n902
$$ 2145819 2149472 2152287 2154930 2158505 2162971 2166833 2168604 2167945 2165415 2161879 2158174 2154549 2150272 2144370
51955B144370p610q665r534j1001j2935j4592j5685j6545j7575j8973k0693k2487
$$ 2144370 2136760 2128095 2118561 2107560 2094625 2080033 2064348 2047803 2030228 2011255 1990562 1968075
51943A968075k4307k6475k8925l0716l1286l1773l3598l6014l6771l5361l3760
$$ 1968075 1943768 1917293 1888368 1857652 1826366 1794593 1760995 1724981 1688210 1652849 1619089
51932A619089l3597l4522l5846l7768l9983m0982m0026l8273l6856l5371l3421
$$ 1619089 1585492 1550970 1515124 1477356 1437373 1396391 1356365 1318092 1281236 1245865 1212444
51921A212444l1936l1588l1436l0642l0036l0395l0586k9271k7216k6060k5704
$$ 1212444 1180508 1148920 1117484 1086842 1056806 1026411 995825 966554 939338 913278 887574
51910H87574k4834k3238k1823k1000k0630k0813k1203k0326j7385j3977j2356
$$ 887574 862740 839502 817679 796679 776049 755236 734033 713707 696322 682345 669989
51899F69989j2545j2971j3143j3711j4340j3631j1244q375o207n187n538o881
$$ 669989 657444 644473 631330 617619 603279 589648 578404 570029 563822 558635 553097 546216
51887E46216p737p025n852o140p726q544p603o002m930m405m228m457m701m327
$$ 546216 538479 531454 525602 519462 511736 503192 495589 489587 484657 480252 476024 471567 466866 462539
51873D62539l717l920m846n207m488l633l393l302k783k141j920k185k778l447
$$ 462539 458822 454902 450056 444849 440361 436728 433335 430033 427250 425109 423189 421004 418226 414779
51859D14779l610k773j385n04o38j586l127m908n935n316l461j643n83k80p60
$$ 414779 411169 408396 407011 406507 405869 404283 401156 396248 390313 384997 381536 379893 379310 379030 378270
51844C78270j825k633k805l321m930o324n756l842k702k677k223j056p45j773
$$ 378270 376445 373812 371007 367686 362756 356432 350676 346834 344132 341455 339232 338176 337431 335658
51830C35658k521k112j905k933l966l570k433j958j928j194K31J284J452J023
$$ 335658 333137 331025 329120 326187 322221 318651 316218 314260 312332 311138 311369 312653 314105 315128
51816C15128K68o30j260j425j453j500j203m76Q1K00M71J288K029J974J342P63
$$ 315128 315396 314766 313506 312081 310628 309128 307925 307449 307530 307730 308201 309489 311518 313492 314834 315597
51800C15597M19L14N77J020J079P26O76J164J457J116Q65J449K499L165L237K975
$$ 315597 316016 316330 316907 317927 319006 319732 320408 321572 323029 324145 325010 326459 328958 332123 335360 338335
51784C38335K564K250K363K694K704K652L350M428M235K290L99K14R40Q40j12
$$ 338335 340899 343149 345512 348206 350910 353562 356912 361340 365575 367865 368264 368478 369418 370258 370146
51769C70146o72n83o44j004j001o34p38j571k278j993p12Q66J777J365J85j00
$$ 370146 369474 368891 368247 367243 366242 365608 364870 363299 361021 359028 358316 359182 360959 362324 362509 362409
51753C62409J325K888K190r16l823l962j461J247J937N75r86j163l31O8j71J90
$$ 362409 363734 366622 368812 367896 364073 360111 358650 359897 361834 362409 361423 360260 359929 359997 359826 360016
51737C60016J559K450J580k15j449k222l385m375l793j847l45j71m32k65M5J41
$$ 360016 361575 364025 365605 365390 363941 361719 358334 353959 350166 348319 347974 347803 347371 347106 347151 347292
51721C47292L57R09J456J898K442K694J927O42M12J588K529J953O94J84M27P12
$$ 347292 347649 348558 350014 351912 354354 357048 358975 359617 360029 361617 364146 366099 366793 366977 367404 368116
51705C68116J263K622M140M590L932L037K098Q05j46M91K242K836J132j158j604
$$ 368116 369379 372001 376141 380731 384663 387700 389798 390603 390457 390948 393190 396026 397158 396000 394396
51690C94396Q7K379M149N315N768N159L948L455M292N458N612M863M720O332R183
$$ 394396 394483 396862 401011 406326 412094 417253 421201 424656 428948 434406 440018 444881 449601 455933 465116
51675D65116J1611J2356J1560J0369R802J0032J0538J0637R777P694M646J458
$$ 465116 476727 489083 500643 511012 520814 530846 541384 552021 561798 569492 574138 575596
51663E75596r43k132k340k148k199k963m435n982o752o341n149m042l679l923
$$ 575596 574653 572521 570181 568033 565834 562871 558436 552454 545702 539361 534212 530170 526491 522568
51649E22568l935l087j790j104j456k289l079l891m718n096n121n722o977p137
$$ 522568 518633 515546 513756 512652 511196 508907 505828 501937 497219 492123 487002 481280 474303 467166
51635D67166m896j907j074k551l507k170Q6J428K178L383M503M395L543L450M355
$$ 467166 462270 460363 459289 456738 453231 451061 451147 452575 454753 458136 462639 467034 470577 474027 478382
51620D78382N162N248N029M808M252K986R28j744m337n788n783n110m268k642
$$ 478382 483544 488792 493821 498629 502881 505867 506795 505051 500714 494926 489143 484033 479765 477123
51606D77123J3K300K764J899J176R02O19Q21K282M073M332K953J643J212P53l01
$$ 477123 477136 479436 482200 484099 485275 486177 486796 487617 489899 493972 498304 501257 502900 504112 504865 504564
51590E04564j201j448j682k360l048l477l999m564m645m454m799n469n449n019
$$ 504564 503363 501915 500233 497873 494825 491348 487349 482785 478140 473686 468887 463418 457969 452950
51576D52950n703p484q192o743m976m813n404m849l360k685l280m086m666n627
$$ 452950 447247 439763 431571 424828 419852 415039 409635 404786 401426 398741 395461 391375 386709 381082
51562C81082o936p348n930l230p07N41M29k89r07j484k361l038k501q03O80J090
$$ 381082 374146 366798 360868 357638 356931 357472 357901 357612 356705 355221 352860 349822 347321 346518 347198 348288
51546C48288J085J415J581Q45l64j028r58p52p64p03j5J551L212L272J063j408
$$ 348288 349373 350788 352369 353214 352850 351822 350864 350112 349348 348645 348630 350181 353393 356665 357728 356320
51530C56320j466N84J939J768K461N246P542O875M907M610N417M639K518K120
$$ 356320 354854 355438 357377 359145 361606 366852 374394 381269 386176 390786 396203 400842 403360 405480
51516D05480M427P015P980Q051Q069P321N583M365M691N504N539N096M660L412
$$ 405480 409907 416922 424902 432953 441022 448343 453926 458291 462982 468486 474025 479121 483781 487193
51502D87193N57k949n391o174n766m704l638l272l300k310R7K155K065M49p51
$$ 487193 487750 484801 479410 473236 467470 462766 459128 455856 452556 450246 450343 452498 454563 455012 454261
51487D54261j025j272j445j38L049O291P512O766N792N784O342O559O339O294
$$ 454261 453236 451964 450519 450381 453430 459721 467233 473999 479791 485575 491917 498476 504815 511109
51473E11109O615O599N540L728K181J381Q50N2p77j061p79m65m39n03l90j30J82
$$ 511109 517724 524323 529863 533591 535772 537153 538003 538055 537278 536217 535438 534973 534534 534031 533641 533511 533693
51456E33693P08J661K875L844M256M217L811K734P29j698l429l719k771j411m36
$$ 533693 534401 536062 538937 542781 547037 551254 555065 557799 558528 556830 553401 549682 546911 545500 545064
51441E45064k74p35j098r28q42j896m079o149p143p280p069o410n207m011l327
$$ 545064 544790 544055 542957 542029 541187 539291 535212 529063 521920 514640 507571 501161 495954 491943 488616
51426D88616k873k308k102k764l721l863k898j391J09J225J518J116J080K126
$$ 488616 485743 483435 481333 478569 474848 470985 468087 466696 466805 468030 469548 470664 471744 473870
51412D73870L372L452K509J911K270L151M456O473Q421Q661O962N160M846N526
$$ 473870 477242 480694 483203 485114 487384 490535 494991 501464 509885 518546 525508 530668 535514 541040
51398E41040N901N806N994O765P715Q332Q143O876N075L972M030M227L516K315
$$ 541040 546941 552747 558741 565506 573221 581553 589696 596572 601647 605619 609649 613876 617392 619707
51384F19707J761J912J736O84n93j142o82K51O23m47k667m417m318k943k137k488
$$ 619707 621468 623380 625116 625800 625207 624065 623383 623634 624257 623810 621143 616726 612408 609465 607328 604840
51368F04840k493p38J877L042J844k86j478j413j035j094j639k520l607m597n253
$$ 604840 602347 601609 603486 606528 608372 608086 606608 605195 604160 603066 601427 598907 595300 590703 585450
51353E85450n879o927q151q841q911q862q574p237n048l807m793o699p023n167
$$ 585450 579571 572644 564493 555652 546741 537879 529305 522068 517020 513213 508420 501721 494698 489531
51339D89531k959k194k736l322l128k080m12J342K295J856M88m65L3J614K712
$$ 489531 486572 484378 481642 478320 475192 473112 472700 474042 476337 478193 478681 478216 478249 479863 482575
51324D82575K122L82p63l38P69Q60q36l657o174p142o428n303n254o245o973p050
$$ 482575 484697 485079 484316 483978 484747 485607 484771 481114 474940 467798 461370 456067 450813 444568 437595 430545
51308D30545p627r205j0309r563p882o997o831o187n272n441o706p643p672p335
$$ 430545 422918 413713 403404 393841 385959 378962 372131 365944 360672 355231 348525 340882 333210 325875
51294C25875o354l820p17K38j650l649l343j829j535k560l235l119l169l407k701
$$ 325875 319521 315701 314984 315222 313572 309923 306580 304751 303216 300656 297421 294302 291133 287726 285025
51279B85025r72J70m24j901k602k031j062p21j155j700j668j001j32O92J515K150
$$ 285025 284053 284223 283799 281898 279296 277265 276203 275482 274327 272627 270959 269958 269826 270518 272033 274183
51263B74183K128J477J049J616K994M301M806M339L247K178J515J021M05J87J185
$$ 274183 276311 277788 278837 280453 283447 287748 292554 296893 300140 302318 303833 304854 305259 305446 306631
51248C06631L189M974N768N782N276M347L820M791O546O532L688M42j14J826L342
$$ 306631 309820 314794 320562 326344 331620 335967 339787 344578 351124 357656 361344 361786 361672 363498 366840
51233C66840K634O13j167k377l404m268m759m910m973n192n594n730n044l881
$$ 366840 369474 370087 368920 366543 363139 358871 354112 349202 344229 339037 333443 327713 322669 318788
51219C18788l577m849o688p597p321o438m965k743o66o0r43k131k960l590l840
$$ 318788 315211 310362 303674 296077 288756 282318 277353 274610 273944 273884 272941 270810 267850 264260 260420
51204B60420l348k799l259m113l491j290J91m90j799j710p68q78k131k702j595
$$ 260420 257072 254273 251014 246901 243410 242120 242311 241821 240022 238312 237544 236666 234535 231833 230238
51189B30238J65J116Q91J60j33N82J920K715K376J652J500J701J500R31M90Q7
$$ 230238 230403 231519 232410 232570 232437 233019 234939 237654 240030 241682 243182 244883 246383 247314 247804 247891
51173B47891m37l23J033K428J989m4j526j550j427k103k653k263j697j528p92
$$ 247891 247454 247131 248164 250592 252581 252537 251011 249461 248034 245931 243278 241015 239318 237790 236998
51158B36998R89K103J073n95l88J379K202J300L82N77J090J260J517J685O76j274
$$ 236998 237987 240090 241163 240568 240180 241559 243761 245061 245443 246020 247110 248370 249887 251572 252248 250974
51142B50974k157j074M04R59J578L292M770M105J703n22j753k143j325P59K303
$$ 250974 248817 247743 248147 249106 250684 253976 258746 262851 264554 264032 262279 260136 258811 259570 261873
51127B61873J433q35j722o69J00q02k170k616k575k781k619j308M79J408J152
$$ 261873 263306 262471 260749 260080 260180 259378 257208 254592 252017 249236 246617 245309 245788 247196 248348
51112B48348K87p02j466j509p43J10L02r4n50p92q19o90n95o56n40J48R63R74
$$ 248348 248635 247933 246467 244958 244215 244325 244627 244533 243983 243191 242372 241682 241087 240431 239891 240039 241002 241976
51094B41976J88l43j40Pn23j106r47m49n38j252j833j918j877k075k378k285j421
$$ 241976 242164 241821 241681 241688 241165 240059 239112 238663 238125 236873 235040 233122 231245 229170 226792 224507 223086
51077B23086n6Q80O50l67j164j431j622j729j084L31J471J633J352J325J368J101
$$ 223086 223030 223910 224560 224193 223029 221598 219976 218247 217163 217494 218965 220598 221950 223275 224643 225744
51061B25744Q02P49N24j81o19J92K130M058M936M386K679P34l78m10MN00J376
$$ 225744 226546 227295 227819 227638 227019 227211 229341 233399 238335 242721 245400 246134 245756 245346 245350 245850 247226
51044B47226K452K656J484j30j190j912k639k567r88J098K139K177K361K659J960
$$ 247226 249678 252334 253818 253688 252498 250586 247947 245380 244392 245490 247629 249806 252167 254826 256786
51029B56786L16o93k69L47k76j724k327j118J363L679M656M276L640L590L424
$$ 256786 257102 256409 256140 256487 256211 254487 252160 251042 252405 256084 260740 265016 268656 272246 275670
51014B75670J735j378l817l695j405R98J881J110l66j296p77R30K289J870J54
$$ 275670 277405 276027 272210 268515 267110 268108 269989 271099 270733 269437 268660 269590 271879 273749 273903
50999B73903p17N01K363K390K45j862k215j713k056k959k737j087N20J226J759
$$ 273903 273186 273687 276050 278440 278685 276823 274608 272895 270839 267880 265143 264056 264576 265802 267561
50984B67561K540K608J373J32N02K288L924M323L470J945Q45J333L262M858M849
$$ 267561 270101 272709 274082 274214 274716 277004 280928 285251 288721 290666 291511 292844 296106 300964 305813
50969C05813M054L942M322L950K740J880J976K409K418J706K50j334j662q3J997
$$ 305813 309867 313809 318131 322081 324821 326701 328677 331086 333504 335210 335460 334126 332464 332381 334378
50954C34378K693K192K207L077L444K866K713L731M608M124L195L321M130M100
$$ 334378 337071 339263 341470 344547 347991 350857 353570 357301 361909 366033 369228 372549 376679 380779
50940C80779L190L127N005P885J0066J0993J1356J1828J2336J2561J2678J3171
$$ 380779 383969 387096 392101 399986 410052 421045 432401 444229 456565 469126 481804 494975
50928D94975J4056J4852J5495J6641J8532K0185K0574K0325K1140K3536K6175
$$ 494975 509031 523883 539378 556019 574551 594736 615310 635635 656775 680311 706486
50917G06486K7733K8590L0000L2331L4887L7274M0165M4515N0257N6168O1166
$$ 706486 734219 762809 792809 825140 860027 897301 937466 981981 1032238 1088406 1149572
50906A149572O5501P0263P5748Q0917Q4779Q7604R0234R2760R4699R5998R6958
$$ 1149572 1215073 1285336 1361084 1442001 1526780 1614384 1704618 1797378 1892077 1988075 2085033
50895B085033R7235R5845R2204Q6414P8681O9386N9792N1606M5353L9762L3231
$$ 2085033 2182268 2278113 2370317 2456731 2535412 2604798 2664590 2716196 2761549 2801311 2834542
50884B834542K5458J7405J0199M462K71k741n077o808p365o245m075k811m427
$$ 2834542 2860000 2877405 2887604 2892066 2892337 2889596 2884519 2877711 2870346 2864101 2860026 2857215 2852788
50871B852788r204j5510k1685k7731l4506m1817m8559n4686o1405o8849p5191
$$ 2852788 2843584 2828074 2806389 2778658 2744152 2702335 2653776 2599090 2537685 2468836 2393645
50860B393645p9127q1749q4545q6776q6641q4196q1163p8348p5129p1304o7532
$$ 2393645 2314518 2232769 2148224 2061448 1974807 1890611 1809448 1731100 1655971 1584667 1517135
50849A517135o3911n9866n5593n1929m8584m4339l9267l5009l2250k9690k6289
$$ 1517135 1453224 1393358 1337765 1285836 1237252 1192913 1153646 1118637 1086387 1056697 1030408
50838A030408k2859k0415j8438j6008j3437j1462r734p455m894l077k228j501
$$ 1030408 1007549 987134 968696 952688 939251 927789 918055 910600 905706 902629 900401 898900
50826H98900r6J969L998N210N542N995P641J0131J2063J2958J3845J5460J7103
$$ 898900 898804 900773 904771 909981 915523 921518 929159 939290 951353 964311 978156 993616 1010719
50813A010719J8020J8709J9907K1317K2530K4290K7444L1202L3937L5495L7425
$$ 1010719 1028739 1047448 1067355 1088672 1111202 1135492 1162936 1194138 1228075 1263570 1300995
50802A300995M0914M5665N0866N6099O1067O5523P0042P6021Q4177R3542J02641
$$ 1300995 1341909 1387574 1438440 1494539 1555606 1621129 1691171 1767192 1851369 1944911 2047552
50791B047552J11387J20945J31826J43007J53363J63259J73777J84786J94816
$$ 2047552 2158939 2279884 2411710 2554717 2708080 2871339 3045116 3229902 3424718
50782C424718K02958K09576K14677K16810K14588K08282J98751J85658J68362
$$ 3424718 3627676 3837252 4051929 4268739 4483327 4691609 4890360 5076018 5244380
50773E244380J47956J26603J05044Q2659O0115L9924K3675J0435j140j0559j6429
$$ 5244380 5392336 5518939 5623983 5706642 5766757 5806681 5830356 5840791 5839651 5829092 5812663
50762E812663j8484j7614j4801j1073p738n757n478p595j3488k3802l7544n3269
$$ 5812663 5794179 5776565 5761764 5750691 5742953 5737196 5731718 5724123 5710635 5686833 5649289 5596020
50750E596020p0322q8135j05653j22534j39840j58030j75072j88076j96228k00684
$$ 5596020 5525698 5437563 5331910 5209376 5069536 4911506 4736434 4548358 4352130 4151446
50740D151446k02109k00127j95031j88270j80768j72115j61926j50901j40079
$$ 4151446 3949337 3749210 3554179 3365909 3185141 3013026 2851100 2700199 2560120
50731B560120j29762j19679j09584r9405q9288p9667p0894o2838n5413m9261m5111
$$ 2560120 2430358 2310679 2201095 2101690 2012402 1932735 1861841 1799003 1743590 1694329 1649218
50720A649218m2359l9229l4668k9342k4581k1033j8809j7981j8133j7948j6241
$$ 1649218 1606859 1567630 1532962 1503620 1479039 1458006 1439197 1421216 1403083 1385135 1368894
50709A368894j3411j1132j0441j0761j0899j0425r674q884p935o662m895k358
$$ 1368894 1355483 1344351 1333910 1323149 1312250 1301825 1292151 1283267 1275332 1268670 1263775 1261417
50697A261417Q87M013O197P759R648J1883J3569J4765J6989K1145K6069L0156
$$ 1261417 1262304 1266317 1272514 1280273 1289921 1301804 1315373 1330138 1347127 1368272 1394341 1424497
50685A424497L3304L6169L8635M0645M3519M8457N4377N9316O3654O9591P7450
$$ 1424497 1457801 1493970 1532605 1573250 1616769 1665226 1719603 1778919 1842573 1912164 1989614
50674A989614Q5027R1073R6975J04011J11245J17606J23884J30815J36689J38986
$$ 1989614 2074641 2165714 2262689 2366700 2477945 2595551 2719435 2850250 2986939 3125925
50664C125925J37578J34377J30291J24174J14785J02498Q8832P4904O0405M4057
$$ 3125925 3263503 3397880 3528171 3652345 3767130 3869628 3958460 4033364 4093769 4137826
50654D137826K5464O455j0273k3715l4564m2870m7549m8650m7994m6544m3145
$$ 4137826 4163290 4169745 4159472 4135757 4101193 4058323 4010774 3962124 3914130 3867586 3824441
50643C824441l7156l0467k5281k1651j9034j8559k1466k6676l2453l9582n0241
$$ 3824441 3787285 3756818 3731537 3709886 3690852 3672293 3650827 3624151 3591698 3552116 3501875
50632C501875o4163p8328r0363j00057j07616j12710j15571j17075j17310j15448
$$ 3501875 3437712 3359384 3269021 3168964 3061348 2948638 2833067 2715992 2598682 2483234
50622B483234j11326j05759r9339r2302q5338p8931p2193o4052n5579m9018m4466
$$ 2483234 2371908 2266149 2166810 2074508 1989170 1910239 1838046 1773994 1718415 1669397 1624931
50611A624931l9667l3537k7818k4291k2115j9006j3909p582j564K761N019O331
$$ 1624931 1585264 1551727 1523909 1499618 1477503 1458497 1444588 1437006 1435442 1438203 1443222 1449553
50599A449553Q239J0941J3547J5855J8525K1376K3287K4227K5704K8515L1621
$$ 1449553 1457792 1468733 1482280 1498135 1516660 1538036 1561323 1585550 1611254 1639769 1671390
50588A671390L4131L6802M0459M4339M7391N0232N4374O0115O6425P2454P8021
$$ 1671390 1705521 1742323 1782782 1827121 1874512 1924744 1979118 2039233 2105658 2178112 2256133
50577B256133Q2865Q6496Q8883R0569R1995R3038R3242R2305R0305Q7393Q3191
$$ 2256133 2338998 2425494 2514377 2604946 2696941 2789979 2883221 2975526 3065831 3153224 3236415
50566C236415P6997O8989O0660N3242M6191L8337L0057K2825J6788J0610L935
$$ 3236415 3313412 3382401 3443061 3496303 3542494 3580831 3610888 3633713 3650501 3661111 3665046
50555C665046j637m776n977o188n265k983l55J257J744J862J876J343k16l036
$$ 3665046 3663409 3658633 3652656 3646468 3641203 3638220 3637865 3639122 3640866 3642728 3644604 3645947 3645731 3642695
50541C642695p102j1949j7055k2723k9847l8549m8004n7813o8238p8570q6701
$$ 3642695 3635593 3623644 3606589 3583866 3554019 3515470 3467466 3409653 3341415 3262845 3176144
50530C176144r1290r3241r4084r4107r3184r2089r1481r0400q7425q2852p8224
$$ 3176144 3084854 2991613 2897529 2803422 2710238 2618149 2526668 2436268 2348843 2265991 2187767
50519B187767p4108o9784o4878n9851n4919m9750m4308l8879l3244k6932k0466
$$ 2187767 2113659 2043875 1978997 1919146 1864227 1814477 1770169 1731290 1698046 1671114 1650648
50508A650648j5259j1964r728p339m356q75L018P133J0992J4209J6773J8896K0868
$$ 1650648 1635389 1623425 1613697 1606358 1602002 1601127 1604145 1611278 1622270 1636479 1653252 1672148 1693016
50495A693016K3138K6138K9774L3408L6380L8522M0081M1400M2630M3731M4704
$$ 1693016 1716154 1742292 1772066 1805474 1841854 1880376 1920457 1961857 2004487 2048218 2092922
50484B092922M5716M6742M7259M6767M5629M4838M4947M5872M7700N0772N4688
$$ 2092922 2138638 2185380 2232639 2279406 2325035 2369873 2414820 2460692 2508392 2559164 2613852
50473B613852N8398O1830O6308P2587P9468Q5568R1572R9322J09090J19299J28690
$$ 2613852 2672250 2734080 2800388 2872975 2952443 3038011 3129583 3228905 3337995 3457294 3585984
50462C585984J37210J44673J50184J53583J56187J59131J61533J61188J56622
$$ 3585984 3723194 3867867 4018051 4171634 4327821 4486952 4648485 4809673 4966295
50453D966295J47879J35647J20414J02573Q2759O1741L9946J7384n880k9143n1281
$$ 4966295 5114174 5249821 5370235 5472808 5555567 5617308 5657254 5674638 5668758 5639615 5588334
50442E588334p1500q9495j04574j15225j20248j20123j16626j11018j03249r2953
$$ 5588334 5516834 5427339 5322765 5207540 5087292 4967169 4850543 4739525 4636276 4543323
50432D543323q0396o6134n0493l4094j8582n866L580J1020J7571K2273K2554J6580
$$ 4543323 4462927 4396793 4346300 4312206 4293624 4287758 4291338 4302358 4319929 4342202 4364756 4381336
50420D381336M679j1517l0497n0942p1155q9457j05100j18021j27747j33526j35776
$$ 4381336 4386015 4374498 4344001 4293059 4221904 4132447 4027347 3909326 3781579 3648053 3512277
50409C512277j36314j36486j35796j33031j28160j22187j15475j07368r7714q7869
$$ 3512277 3375963 3239477 3103681 2970650 2842490 2720303 2604828 2497460 2399746 2311877
50399B311877p9520p2790o6114n8258n0004m3234l8278l3108k5840j7373j0322
$$ 2311877 2232357 2159567 2093453 2035195 1985191 1941957 1903679 1870571 1844731 1827358 1817036
50388A817036n597j558L214P944J1400J4158J7615K1619K4765K6857K9324L2909
$$ 1817036 1811439 1809881 1813095 1821039 1832439 1846597 1864212 1885831 1910596 1937453 1966777 1999686
50376A999686L6280L7750L7513L7371L8567M0578M1917M1739M0519L9276L8282
$$ 1999686 2035966 2073716 2111229 2148600 2187167 2227745 2269662 2311401 2351920 2391196 2429478
50365B429478L6797L4190L0970K8258K6358K4362K1337J7549J4316J2824J3191
$$ 2429478 2466275 2500465 2531435 2559693 2586051 2610413 2631750 2649299 2663615 2676439 2689630
50354B689630J4621J6339J8202K0464K3115K5877K8754L2175L6308M0655M4460
$$ 2689630 2704251 2720590 2738792 2759256 2782371 2808248 2837002 2869177 2905485 2946140 2990600
50343B990600M7354M9424N0953N2190N2891N1930M8011M1175L3120K5444J7848
$$ 2990600 3037954 3087378 3138331 3190521 3243412 3295342 3343353 3384528 3417648 3443092 3460940
50332C460940Q645l200j7039l1346m4965n7504o8880p8743q6357r1173r3309r3113
$$ 3460940 3469585 3466385 3449346 3418000 3373035 3315531 3246651 3167908 3081551 2990378 2897069 2803956
50320B803956r0386q4719p6703o7939n9581n1623m3843l6405k9031k0794j1718
$$ 2803956 2713570 2628851 2552148 2484209 2424628 2373005 2329162 2292757 2263726 2242932 2231214
50309B231214l523K447P038J1522J4790J4256R301J886o255j5015k4136l2181
$$ 2231214 2227691 2230138 2237176 2248698 2263488 2277744 2287045 2288931 2282676 2267661 2243525 2211344
50297B211344l8292m3303m7885n1032n1846n1581n2025n2692n1533m8154m4439
$$ 2211344 2173052 2129749 2081864 2030832 1978986 1927405 1875380 1822688 1771155 1723001 1678562
50286A678562m1789l9519l6537l3136l0194k7700k5095k2357j9892j7735j5687
$$ 1678562 1636773 1597254 1560717 1527581 1497387 1469687 1444592 1422235 1402343 1384608 1368921
50275A368921j3801j2014r735o578l167l28K261N555R318J2040J2981J3295J4509
$$ 1368921 1355120 1343106 1333371 1326793 1323626 1323298 1325559 1331114 1340432 1352472 1365453 1378748 1393257
50262A393257J6717J8914K0571K2024K3615K5115K5989K5879K4939K3909K3584
$$ 1393257 1409974 1428888 1449459 1471483 1495098 1520213 1546202 1572081 1597020 1620929 1644513
50251A644513K4039K4786K5594K6453K6519K4430K0315J6440J4670J4246J3231
$$ 1644513 1668552 1693338 1718932 1745385 1771904 1796334 1816649 1833089 1847759 1862005 1875236
50240A875236J1314R606Q245O093K711j027m396p376r685j0840j1393j2511j4091
$$ 1875236 1886550 1896156 1904401 1910494 1913205 1912178 1907782 1900406 1890721 1879881 1868488 1855977 1841886
50227A841886j4909j4991j5938j8282k0365k0837k0515k0673k1173k1527k2117
$$ 1841886 1826977 1811986 1796048 1777766 1757401 1736564 1716049 1695376 1674203 1652676 1630559
50216A630559k2908k2585k0692j9183j9860k1498k1706k0668k0522k1575k1708
$$ 1630559 1607651 1585066 1564374 1545191 1525331 1503833 1482127 1461459 1440937 1419362 1397654
50205A397654j9686j6794j4684j3467j2550j1834j1327j0675r517p675m959j700
$$ 1397654 1377968 1361174 1346490 1333023 1320473 1308639 1297312 1286637 1277120 1269445 1264486 1262786
50193A262786Q68J892K304L552N234N597M278K793K199K112K237K981L916L637
$$ 1262786 1263654 1265546 1267850 1271402 1276636 1282233 1286511 1289304 1291503 1293615 1295852 1298833 1302749 1306386
50179A306386K022Q80J247J631K20k570m992o220o333n364m045m382p538j1549
$$ 1306386 1308408 1309288 1310535 1312166 1312386 1309816 1304824 1298604 1292271 1286907 1282862 1278480 1270942 1259393
50165A259393j3036j1097q043o309o120o328o037m892k889o04J095K054K981M264
$$ 1259393 1246357 1235260 1227217 1220908 1214788 1208460 1202423 1197531 1194642 1194038 1195133 1197187 1200168 1204432
50151A204432N233N143M301L724L874M332M549M457M216L732K720J206k49j057
$$ 1204432 1209665 1214808 1219109 1222833 1226707 1231039 1235588 1240045 1244261 1247993 1250713 1251919 1251670 1250613
50137A250613j350k044l947o762r185j0105r708r237r570j0291j0441r954r768
$$ 1250613 1249263 1247219 1243272 1236510 1227325 1217220 1207512 1198275 1188705 1178414 1167973 1158019 1148251
50124A148251j0377j0985j0550r259q366q702r891j0933j1177j0738j0299j0402
$$ 1148251 1137874 1126889 1116339 1107080 1098714 1090012 1080121 1069188 1058011 1047273 1036974 1026572
50112A026572j0678j0078q243o171n053m867m837m819n293o241o956o983o400
$$ 1026572 1015894 1005816 997573 991402 986349 981482 976645 971826 966533 960292 953336 946353 939953
50099I39953n404m461m614o376q470r032q215q062r414j0566r840p906o458n722
$$ 939953 934549 930088 925474 919098 910628 901596 893381 885319 875905 865339 855499 847593 841135 835413
50085H35413m873m004m148n517p046p601o796m822k405p30m66q49o51J15L06m83
$$ 835413 830540 826536 822388 816871 809825 802224 795428 790606 788201 787471 787005 786156 785505 785620 785926 785443
50069G85443j168n86J041K477K990L110L959N774P289P008N291M393N868Q588
$$ 785443 784275 783689 784730 787207 790197 793307 797266 803040 810329 817337 822628 827021 832889 841477
50055H41477J0215J0140R845J0680J2481J4374J5677J5743J4192J1794J0112R698
$$ 841477 851692 861832 871677 882357 894838 909212 924889 940632 954824 966618 976730 986428
50043I86428R550Q882Q326Q535Q623P336N082L374K697K359K359L550N644O735
$$ 986428 995978 1004860 1013186 1021721 1030344 1037680 1042762 1046136 1048833 1051192 1053551 1057101 1062745 1069480
50029A069480N853M615N030O671P570P245P082P878Q750Q896Q861R329R953J0275
$$ 1069480 1075333 1079948 1084978 1091649 1099219 1106464 1113546 1121424 1130174 1139070 1147931 1157260 1167213 1177488
50015A177488J0744J1786J2746J2901J2864J3702J5134J5838J5386J4647J4401
$$ 1177488 1188232 1200018 1212764 1225665 1238529 1252231 1267365 1283203 1298589 1313236 1327637
50004A327637J4676J5452J6743J7925J8132J7604J7572J8444J9244J9241J8826
$$ 1327637 1342313 1357765 1374508 1392433 1410565 1428169 1445741 1464185 1483429 1502670 1521496
49993A521496J8362J7477J6362J6274J7586J8455J7059J4309J2492J1780J0121
$$ 1521496 1539858 1557335 1573697 1589971 1607557 1626012 1643071 1657380 1669872 1681652 1691773
49982A691773O652L137J293L67j352l919n972o952p607q628r974j1569j3483j5204
$$ 1691773 1698425 1701562 1702855 1703222 1701870 1697951 1691979 1685027 1677420 1668792 1658818 1647249 1633766 1618562
49968A618562j5748j5032j4363j4936j6316j6977j5974j3610j0895q943q519r343
$$ 1618562 1602814 1587782 1573419 1558483 1542167 1525190 1509216 1495606 1484711 1475768 1467249 1457906
49956A457906r942q996o815m773l461k293j034m01p29j050l60J012K134K822L355
$$ 1457906 1447964 1438968 1432153 1427380 1423919 1421626 1420592 1420191 1419462 1418412 1418052 1419064 1421198 1424020 1427375
49941A427375L605L481L627M463M990L930J749R9n73j317k453k812j746l60J63
$$ 1427375 1430980 1434461 1438088 1442551 1447541 1451471 1453220 1453319 1452746 1451429 1448976 1446164 1444418 1444058 1444221
49926A444221K42Q28J627J472nk057l696m380m213m106n095o897p802o684m500
$$ 1444221 1444463 1445291 1446918 1448390 1448385 1446328 1442632 1438252 1434039 1429933 1424838 1417941 1410139 1403455 1398955
49911A398955k977k508k370k460l582o042r038j1580j3391j4854j6624j9262k2696
$$ 1398955 1395978 1393470 1391100 1388640 1385058 1379016 1369978 1358398 1345007 1330153 1313529 1294267 1271571
49898A271571k6019k8208k8851k8026k6070k3918k3003k3835k5109k5128k3809
$$ 1271571 1245552 1217344 1188493 1160467 1134397 1110479 1087476 1063641 1038532 1013404 989595
49887I89595k2408k1557k0744j9514j8048j6489j4811j3469j3101j3411j3434
$$ 989595 967187 945630 924886 905372 887324 870835 856024 842555 829454 816043 802609
49876H02609j3002j2745j2439j0838p840n289m657n040m764l928l775m290m149
$$ 802609 789607 776862 764423 753585 745745 740456 735799 730759 725995 722067 718292 714002 709853
49863G09853k975j936j863k171k084j743j569j476j304j137p42L38J674J959J022
$$ 709853 706878 704942 703079 700908 698824 697081 695512 694036 692732 691595 690853 691191 692865 694824 695846
$$ [...]
##END NTUPLES=NMR SPECTRUM
##END=
