
##TITLE=AC1124_Huila-Iquira_5906410_u8hJxQCO1t
##JCAMPDX= 6.0         $$ Bruker NMR JCAMP-DX V2.0
##DATA TYPE= NMR SPECTRUM
##DATA CLASS= NTUPLES
##ORIGIN= BRUKER
##OWNER= Administrator
$$ 1.72 TOPSPIN		Version 2.1
$$ 2012-04-10 10:15:14.656 -0500  Administrator@TOPSPIN
$$ Compression mode = diff/dup
##.OBSERVE FREQUENCY= 400.13188235
##.OBSERVE NUCLEUS= ^1H
##.ACQUISITION MODE= SIMULTANEOUS (DQD)
##.ACQUISITION SCHEME= undefined
##.AVERAGES= 8
##.DIGITISER RES= 22
##SPECTROMETER/DATA SYSTEM= spect
##.PULSE SEQUENCE= zg30
##.SOLVENT NAME= COFFEE_meoh
##.SHIFT REFERENCE= INTERNAL, COFFEE_meoh, 1, 14.98061
##AUDIT TRAIL= $$ (NUMBER, WHEN, WHO, WHERE, PROCESS, VERSION, WHAT)
$$ ##TITLE= Audit trail, TOPSPIN		Version 2.1
$$ ##JCAMPDX= 5.01
$$ ##ORIGIN= Bruker BioSpin GmbH
$$ ##OWNER= Administrator
$$ $$ C:\Bruker\TOPSPIN/data/COFFEE/nmr/AC1124_Huila-Iquira_5906410_u8hJxQCO1t/10/pdata/1/auditp.txt
$$ ##AUDIT TRAIL=  $$ (NUMBER, WHEN, WHO, WHERE, PROCESS, VERSION, WHAT)
(   1,<2012-04-04 12:30:41.296 -0500>,<Administrator>,<TOPSPIN>,<go>,<TOPSPIN 2.1>,
      <created by zg
	started at 2012-04-04 12:29:34.687 -0500,
	POWCHK enabled, PULCHK disabled,
       configuration hash MD5:
       1A 1E CE 29 27 FD 77 03 67 4E F0 E3 C4 B2 CB 90
       data hash MD5: 64K
       9E D8 F2 26 5E 09 D4 79 A5 0F 78 C0 DB E5 13 E3>)
(   2,<2012-04-04 12:30:44.593 -0500>,<Administrator>,<TOPSPIN>,<proc1d>,<TOPSPIN 2.1>,
      <Start of raw data processing
       efp LB = 0 FT_mod = 6 PKNL = 1 PHC0 = 0 PHC1 = 0 SI = 32K 
       data hash MD5: 32K
       2B 6B 53 89 F3 1E F0 62 3D 9E 17 2B 31 6B A4 E7>)
(   3,<2012-04-04 12:30:44.953 -0500>,<Administrator>,<TOPSPIN>,<proc1d>,<TOPSPIN 2.1>,
      <pk PHC0 = 212.9974 PHC1 = 0 
       data hash MD5: 32K
       A7 71 6C 60 73 66 70 02 CE 01 76 70 49 9B 55 9C>)
(   4,<2012-04-04 12:30:45.187 -0500>,<Administrator>,<TOPSPIN>,<proc1d>,<TOPSPIN 2.1>,
      <abs ABSG = 1 
       data hash MD5: 32K
       1E 48 CC F0 63 38 A2 15 33 C8 0F 22 C7 2C 61 C1>)
(   5,<2012-04-04 12:30:45.218 -0500>,<Administrator>,<TOPSPIN>,<proc1d>,<TOPSPIN 2.1>,
      <abs ABSG = 2 
       data hash MD5: 32K
       70 B8 88 F0 CC 50 3D 62 E6 5C 7C 4B 00 02 7A 35>)
(   6,<2012-04-04 12:30:45.250 -0500>,<Administrator>,<TOPSPIN>,<proc1d>,<TOPSPIN 2.1>,
      <abs ABSG = 3 
       data hash MD5: 32K
       B5 CD 54 63 09 B3 98 A3 F5 57 84 6E 6C C3 E1 AA>)
(   7,<2012-04-04 12:30:45.281 -0500>,<Administrator>,<TOPSPIN>,<proc1d>,<TOPSPIN 2.1>,
      <abs ABSG = 4 
       data hash MD5: 32K
       FC 88 B1 85 0E 78 66 4F 66 5C B3 E3 EC E7 B7 2E>)
(   8,<2012-04-04 12:30:45.312 -0500>,<Administrator>,<TOPSPIN>,<proc1d>,<TOPSPIN 2.1>,
      <abs ABSG = 5 
       data hash MD5: 32K
       07 B4 F9 A9 A2 A5 E8 95 62 AF 66 62 84 1B 29 CD>)
(   9,<2012-04-04 12:30:49.484 -0500>,<Administrator>,<TOPSPIN>,<audit>,<TOPSPIN 2.1>,
      <user comment:
       ICON-NMR User ID: COFFEE
       data hash MD5: 32K
       07 B4 F9 A9 A2 A5 E8 95 62 AF 66 62 84 1B 29 CD>)
$$ [...]
##$TP= (0..7)
150 150 150 150 150 150 150 150
##$TP07= 0
##$TPNAME0= <>
##$TPNAME1= <>
##$TPNAME2= <>
##$TPNAME3= <>
##$TPNAME4= <>
##$TPNAME5= <>
##$TPNAME6= <>
##$TPNAME7= <>
##$TPOAL= (0..7)
0.5 0.5 0.5 0.5 0.5 0.5 0.5 0.5
##$TPOFFS= (0..7)
0 0 0 0 0 0 0 0
##$TUNHIN= 0
##$TUNHOUT= 0
##$TUNXOUT= 0
##$USERA1= <user>
##$USERA2= <user>
##$USERA3= <user>
##$USERA4= <user>
##$USERA5= <user>
##$V9= 5
##$VALIST= <valist>
##$VCLIST= <CCCCCCCCCCCCCCC>
##$VD= 0
##$VDLIST= <DDDDDDDDDDDDDDD>
##$VPLIST= <PPPPPPPPPPPPPPP>
##$VTLIST= <TTTTTTTTTTTTTTT>
##$WBST= 2048
##$WBSW= 25
##$XGAIN= (0..3)
0 0 0 0
##$XL= 0
##$YL= 0
##$YMAX_a= 532805
##$YMIN_a= -652393
##$ZGOPTNS= <>
##$ZL1= 120
##$ZL2= 120
##$ZL3= 120
##$ZL4= 120
##$ABSF1= 14.98061
##$ABSF2= -5.57192
##$ABSG= 5
##$ABSL= 3
##$ALPHA= 0
##$AQORDER= 0
##$ASSFAC= 0
##$ASSFACI= 0
##$ASSFACX= 0
##$ASSWID= 0
##$AUNMP= <proc_prof1d_extract_pilot.lims>
##$AXLEFT= 0
##$AXNAME= <>
##$AXNUC= <1H>
##$AXRIGHT= 0
##$AXTYPE= 0
##$AXUNIT= <>
##$AZFE= 0.1
##$AZFW= 0.1
##$BCFW= 0
##$BC_mod= 0
##$BYTORDP= 0
##$COROFFS= 0
##$CY= 15
##$DATMOD= 1
##$DC= 0
##$DFILT= <>
##$DTYPP= 0
##$F1P= 0
##$F2P= 0
##$FCOR= 0.5
##$FTSIZE= 32768
##$FT_mod= 6
##$GAMMA= 0
##$GB= 0
##$INTBC= 1
##$INTSCL= 1
##$ISEN= 128
##$LB= 0
##$LEV0= 0
##$LPBIN= 0
##$MAXI= 10000
##$MC2= 0
##$MEAN= 0
##$ME_mod= 0
##$MI= 0
##$NCOEF= 0
##$NC_proc= -8
##$NLEV= 6
##$NOISF1= 0
##$NOISF2= 0
##$NSP= 0
##$NTH_PI= 0
##$NZP= 0
##$OFFSET= 14.98061
##$PC= 1
##$PHC0= 212.9974
##$PHC1= 0
##$PH_mod= 1
##$PKNL= yes
##$PPARMOD= 0
##$PPDIAG= 0
##$PPIPTYP= 0
##$PPMPNUM= 2147483647
##$PPRESOL= 1
##$PSCAL= 4
##$PSIGN= 0
##$PYNMP= <proc.py>
##$REVERSE= no
##$SF= 400.13
##$SI= 32768
##$SIGF1= 0
##$SIGF2= 0
##$SINO= 400
##$SIOLD= 32768
##$SPECTYP= <>
##$SREGLST= <1H.CDCl3>
##$SSB= 0
##$STSI= 32768
##$STSR= 0
##$SW_p= 8223.68421052632
##$SYMM= 0
##$S_DEV= 0
##$TDeff= 65536
##$TDoff= 0
##$TI= <>
##$TILT= no
##$TM1= 0
##$TM2= 0
##$TOPLEV= 0
##$USERP1= <user>
##$USERP2= <user>
##$USERP3= <user>
##$USERP4= <user>
##$USERP5= <user>
##$WDW= 1
##$XDIM= 32768
##$YMAX_p= 468695299
##$YMIN_p= -688538
##$CURPLOT= <Network HP LaserJet P1505>
##$CURPRIN= <$Network HP LaserJet P1505>
##$DFORMAT= <normdp>
##$LAYOUT= <+/1D_H.xwp>
##$LFORMAT= <normlp>
##$PFORMAT= <normpl>
##$SURQMSG= 1
$$ End of Bruker specific parameters
$$ ---------------------------------
##NTUPLES= NMR SPECTRUM
##VAR_NAME=  FREQUENCY,     SPECTRUM/REAL,   SPECTRUM/IMAG
##SYMBOL=    X,             R,               I
##VAR_TYPE=  INDEPENDENT,   DEPENDENT,       DEPENDENT
##VAR_FORM=  AFFN,          ASDF,            ASDF
##VAR_DIM=   32768,         32768,           32768
##UNITS=     HZ,            ARBITRARY UNITS, ARBITRARY UNITS
##FACTOR=    0.250966925370066, 1,           1
##FIRST=     8223.43324360095, 131182,       44687
##LAST=      0,             -5367,           -224139
##MIN=       0,             -688538,         0
##MAX=       8223.43324360095, 468695299,    0
$$ Real data points
##PAGE= N=1
##DATA TABLE= (X++(R..R)), XYDATA
$$ [...]
19470a52998E917a1091j39007A03525g7390A2524K91461a82791O9918l17497a20429
$$ -152998 5917 -11091 -150098 103525 -77390 12524 303985 -182791 -112873 -430370 -120429
19458A37145K1793b03167P10h087A7472e558j9926j14572A30179d1825p3980D3481
$$ 137145 158938 -203167 -202457 -8087 17472 -5558 -25484 -140056 130179 -41825 -115805 43481
19445d0436l9008D804N5389j0115b43519j52400j15917a08592D44a03946m1070
$$ -40436 -79444 4804 60193 50078 -243519 -395919 -511836 -108592 444 -103946 -145016
19434a45016d4091n8021p5905O2391j95704a24815L1509C6734A3039a41506G7184
$$ -145016 -44091 -102112 -178017 -115626 -311330 -124815 -93306 36734 13039 -141506 77184
19422b46220H1102K5457d1875r6801C6044a34516N9447A80146a40548B4785a99326
$$ -246220 81102 106559 -41875 -138676 36044 -134516 -75069 180146 -140548 24785 -199326
19410E8772d46167A45221L1961d17320J86063J14322A9262J68g2301j69229B38400
$$ 58772 -446167 145221 177182 -417320 -231257 -116935 19262 19430 -72301 -241530 238400
19398b15447C0775e3934e844k25894M367a9375r5288A37174a79348o7860g998
$$ -215447 30775 -53934 -5844 -231738 -227371 -19375 -114663 137174 -179348 -247208 -7998
19386c7831l92454F3604K6259L7730n1517i9724l24277b06657a5784F3072e2852
$$ -37831 -430285 63604 89863 127593 76076 -99724 -424001 -206657 -15784 63072 -52852
19374a15330D98840a21711A07483a1255A11487n3630c30675B92286d02489a79525
$$ -115330 498840 -121711 107483 -11255 111487 57857 -330675 292286 -402489 -179525
19363c54401A25971G149c14044l2589G636d43921G5505K4643b83490a22121j15156
$$ -354401 125971 7149 -314044 -346633 7636 -443921 75505 100148 -283490 -122121 -237277
19352b37277m4861A12730b90675E4619a22039A16705i6812E0306k3320h3512A34636
$$ -237277 -282138 112730 -290675 54619 -122039 116705 -96812 50306 26986 -83512 134636
19340a26489o3337e3194j12951P430A00220M7003b27124B7846d3332A30668i1638
$$ -126489 -189826 -53194 -166145 -158715 100220 147223 -227124 27846 -43332 130668 -91638
19328B4445D478a14214A52930a10718k41146a61674k92674a4958E4382a16943
$$ 24445 4478 -114214 152930 -110718 -351864 -161674 -454348 -14958 54382 -116943
19317a66381J9883q0639a04615L4855A77201a44143k36909B07118a75023A37992
$$ -166381 -146498 -227137 -104615 -69760 177201 -144143 -381052 207118 -175023 137992
19306D65771B05439g2383I8806d5143j78339Q7229b2415m8405H6168a1205j67046
$$ 465771 205439 -72383 98806 -45143 -223482 -136253 -22415 -70820 86168 -11205 -178251
19295a78251J7277k09783a1077j58638A02053A6855c37559a46616b7360m45367
$$ -178251 -160974 -370757 -11077 -169715 102053 16855 -337559 -146616 -27360 -472727
19285d72727a14949L0524j37423J08594o4203l6109c3536j47175P1336j50556
$$ -472727 -114949 -84425 -221848 -113254 -177457 -213566 -33536 -180711 -109375 -259931
19275b59931J00599f3600I8086g4962p2615B5211a58396m3267E5839K38569I2430
$$ -259931 -159332 -63600 98086 -74962 -147577 25211 -158396 -201663 55839 294408 92430
19263a40170f7953E4488L16129e5653j34034B18507b99868I7104L5580E9522J79239
$$ -140170 -67953 54488 370617 -55653 -189687 218507 -299868 97104 132684 59522 238761
19252B38761e8076I0716Q85d5694j29452j28863H4411c42662c7348B0005p976
$$ 238761 -58076 90716 91601 -45694 -175146 -304009 84411 -342662 -37348 20005 12029
19241A2029f6622C386J08712f8361A08069h9966B29717d14496C89414d51371i8599
$$ 12029 -66622 3386 112098 -68361 108069 -89966 229717 -414496 389414 -451371 -98599
19229a33134c8639l0625A87820C4834A1308L10009b7848C4548b17506a07181k3044
$$ -133134 -38639 -69264 187820 34834 11308 321317 -27848 34548 -217506 -107181 -130225
19218a30225B9992J8605a97005H1661K37524a72527O3062j48040j16005A08580
$$ -130225 29992 48597 -197005 81661 319185 -172527 -109465 -257505 -373510 108580
19207F7839j2398a85739A12635d03376E5867J11801a58718C17956L5931d2425
$$ 67839 55441 -185739 112635 -403376 55867 167668 -158718 317956 353887 -42425
19196a98072L722e0092k786m7924k53493C18660a11048H1864O559b2755A86621
$$ -198072 -194350 -50092 -52878 -100802 -354295 318660 -111048 81864 88423 -22755 186621
19184b35106k8264O3671m1943A422c13663P5986j7946a07766j84582i4080j13121
$$ -235106 -263370 -199699 -241642 1422 -313663 -237677 -255623 -107766 -292348 -94080 -207201
19173b07201E7407b45829d3352l25851c8677C773f4339a4409n8450E575a85490
$$ -207201 57407 -245829 -43352 -369203 -38677 3773 -64339 -14409 -72859 5575 -185490
19161c59547A26348b15106Q4279r8270K2482E4072K79768a50241a1838F4252A6804
$$ -359547 126348 -215106 -130827 -229097 -206615 54072 333840 -150241 -11838 64252 16804
19149a19334m1389k28610f4153p7938A58036a03418h876q711A92067B800i4886
$$ -119334 -160723 -389333 -64153 -142091 158036 -103418 -8876 -17587 192067 2800 -94886
19137B29966a99952B80399c07240A29681a12062j16259B24874h3323c3705B3594
$$ 229966 -199952 280399 -307240 129681 -112062 -228321 224874 -83323 -33705 23594
19126b905I7148a22209A67440j6791a71893k4623j62777B63032b61802B60J17114
$$ -2905 97148 -122209 167440 150649 -171893 -196516 -359293 263032 -261802 260 117374
19115A17374b06103h0416m559q9352B5555K4600g3479l29278f5691I5641J6553
$$ 117374 -206103 -80416 -84975 -174327 25555 50155 -73479 -402757 -65691 95641 112194
19104A12194c1962M49j19862j29815E0243c26312C10900B5580c35050F2145O246
$$ 112194 -31962 -31513 -151375 -281190 50243 -326312 310900 25580 -335050 62145 68391
19093F8391L257l9J97930j25040b49271A12244f6397B56185j01516c48826J34797
$$ 68391 71648 71609 269539 144499 -249271 112244 -66397 256185 154669 -348826 -214029
19082b14029e5135B148b4872l14442H188d5386p7573j48654L6293F3108b5162
$$ -214029 -55135 2148 -24872 -339314 8188 -45386 -122959 -271613 -235320 63108 -25162
19070a23114j01414B60750A6796b30169g2001q3051e8213n6734b5986j52495k7569
$$ -123114 -224528 260750 16796 -230169 -72001 -155052 -58213 -114947 -25986 -178481 -206050
19059b06050A3956K3562b15841B33079g5416j01561M3082A56198O0584a01909
$$ -206050 13956 37518 -215841 233079 -75416 -176977 -133895 156198 216782 -101909
19048A43432J85355a68941a6001j74346j65911d2751A19774f6315C0691Q5053
$$ 143432 328787 -168941 -16001 -190347 -356258 -42751 119774 -66315 30691 115744
19038A15744b0912j36886a4074l3161l3783j409A99559d475j52952g459B44308
$$ 115744 -20912 -157798 -14074 -47235 -81018 -82427 199559 -4475 -157427 -7459 244308
19026a46128B765M9343L4474C5589J69996b38977R9673C8120J78049F7783c5900
$$ -146128 2765 52108 86582 35589 205585 -238977 -139304 38120 216169 67783 -35900
19014b41871B2595c6478H9183i7635H5594b98390a22318r9941q997B3701K91239
$$ -241871 22595 -36478 89183 -97635 85594 -298390 -122318 -222259 -231256 23701 314940
19003C14940a49293O9020C0165c1561l27749i7196c3543D39e1394j72302B2428
$$ 314940 -149293 -80273 30165 -31561 -359310 -97196 -33543 439 -51394 -223696 22428
18991e9528B43136O7589b80820J26185D05958d3418G8385b14896J4776i6003o8006
$$ -59528 243136 310725 -280820 -154635 405958 -43418 78385 -214896 -200120 -96003 -164009
18980a64009G0734J42800b14505A82513j1605C6094J97142a30041d3819K0383
$$ -164009 70734 213534 -214505 182513 170908 36094 233236 -130041 -43819 -23436
18970b3436h08o0388l3266B5554K9467b75509b8774l6312E6057M6229N1461J92282
$$ -23436 -808 -61196 -94462 25554 55021 -275509 -28774 -65086 56057 102286 153747 346029
18958C46029p2562K68364P3393j24003A2158M0843e5296k25807A81069a28108
$$ 346029 273467 541831 615224 491221 12158 53001 -55296 -281103 181069 -128108
18947A12536a26887A09972a96537i0121k59647a11049c8710k22760f871k30199
$$ 112536 -126887 109972 -196537 -90121 -349768 -111049 -38710 -261470 -6871 -237070
18937b37070j46053B02267G7277a08926J9729l04000J79313C0454f4011m564k96781
$$ -237070 -383123 202267 77277 -108926 -89197 -393197 -213884 30454 -64011 -68575 -365356
18926c65356f3429J3142k29681J11621k46932b00427I8009K9576K30946a68682
$$ -365356 -63429 -50287 -279968 -168347 -415279 -200427 98009 127585 358531 -168682
18915a683l03211a7994j8279A59559e4187p4563D3510g1217l2216B02653o7471
$$ -1683 -304894 -17994 -36273 159559 -54187 -128750 43510 -71217 -103433 202653 135182
18904A35182B8959a75445K8020j8339A03881L0531i6027B94045A22284K79889
$$ 135182 28959 -175445 -147425 -165764 103881 134412 -96027 294045 122284 402173
18894D02173j25372p7701j0546n4976Q1086N2508a95685A09808a68954L6496B50070
$$ 402173 276801 199100 188554 133578 214664 267172 -195685 109808 -168954 -132458 250070
18882G2223e45901a42700E0304h5737A55644a49078d0021J4126r1845k1668H8110
$$ 72223 -545901 -142700 50304 -85737 155644 -149078 -40021 -25895 -117740 -139408 88110
18870E5150a94620o4176a09758K8508j2301b296k20671G6566k7151c14048j33081
$$ 55150 -194620 -258796 -109758 -81250 -93551 -2296 -222967 76566 49415 -314048 -447129
18859d47129a87548f1677F7070h5876A03475b06126i3743j90556L0321C55010
$$ -447129 -187548 -61677 67070 -85876 103475 -206126 -93743 -284299 -253978 355010
18848A1299a72925A12213b31522A90921g428A13842m3111k4912g4898B183M7297
$$ 11299 -172925 112213 -231522 190921 -7428 113842 70731 45819 -74898 2183 49480
18837D9480J39553C2119A2501a92040c8519B2785a03743A3502e7117B06307c61083
$$ 49480 189033 32119 12501 -192040 -38519 22785 -103743 13502 -57117 206307 -361083
18825A98379b72593B68812e0694n5843A62610k1382D2221b62365N0954A49519
$$ 198379 -272593 268812 -50694 -106537 162610 141228 42221 -262365 -211411 149519
18814b71419d4310j89081L6095h9355E9002O968b59908d1637r2518J0288e1071
$$ -271419 -44310 -233391 -197296 -89355 59002 65970 -259908 -41637 -134155 -123867 -51071
18802a25544b8881D8281L77592a72957L4377D4436L71247A26574a92290G0722
$$ -125544 -28881 48281 425873 -172957 -138580 44436 415683 126574 -192290 70722
18791A93345b00085o4272o48g2296o3595A54777L0052a07461B30084b06790h3407
$$ 193345 -200085 -264357 -265005 -72296 -135891 154777 184829 -107461 230084 -206790 -83407
18779D02980a26724j05975J08444d5730k87357C1642a88577H6025e9127D7384
$$ 402980 -126724 -232699 -124255 -45730 -333087 31642 -188577 86025 -59127 47384
18768A29536a8745H7058A0695d3525B08247a8625C03713g9112A60580a33873j26538
$$ 129536 -18745 87058 10695 -43525 208247 -18625 303713 -79112 160580 -133873 -260411
18757b60411A99197C9650a70040K5611M3566I6609J93515c57350N6263I9332J193
$$ -260411 199197 39650 -170040 -144429 -100863 96609 290124 -357350 -301087 99332 100525
18746A00525a02526b4173m2514j24049B7478d2401j6440l14726H8211d17152J51954
$$ 100525 -102526 -24173 -66687 -190736 27478 -42401 -58841 -373567 88211 -417152 -265198
18735b65198j7952I2370a56268A01185h5833I0778a54199K9645D4685a13313j78401
$$ -265198 -283150 92370 -156268 101185 -85833 90778 -154199 -124554 44685 -113313 -291714
18724b91714m6952F8560K7071g0446k24216f424A16274h9467p6651C3981J41725
$$ -291714 -338666 68560 95631 -70446 -294662 -6424 116274 -89467 -166118 33981 175706
18713A75706A3189c03631h655B1386b91186l3652C3617N7669d2140j19840j11420
$$ 175706 13189 -303631 -8655 21386 -291186 -324838 33617 91286 -42140 -161980 -273400
18702b73400F1815Q1010a35414j63002J47023J7356L5325A64192i502j88134B24007
$$ -273400 61815 142825 -135414 -298416 -151393 -134037 -98712 164192 -9502 -197636 224007
18690A10505b66239g2227j31557J1259A9577n025K04748n3545B0219g9446j79573
$$ 110505 -266239 -72227 -203784 -192525 19577 14552 219300 165755 20219 -79446 -259019
18679b59019A31739k9073b18550p0723C48733a23731j263e3524A07159i6762j42791
$$ -259019 131739 102666 -218550 -289273 348733 -123731 -124994 -53524 107159 -96762 -239553
18668b39553J19060N3952j01215i659r1998B41532g3852m1710A47855h4596C8340
$$ -239553 -120493 -66541 -167756 -9659 -101657 241532 -73852 -115562 147855 -84596 38340
18656c01674C0688a18696d2519k51883a32941r830d8855H5764M3473a19853n3033
$$ -301674 30688 -118696 -42519 -294402 -132941 -142771 -48855 85764 129237 -119853 -172886
18645a72886J183D9710b94298A18503c62122i2311B16677d1893j40667A22637
$$ -172886 -171703 49710 -294298 118503 -362122 -92311 216677 -41893 -182560 122637
18634b65294d9286k98072E8088h5077A29800q678a93178A65914d2413B62181a75421
$$ -265294 -49286 -347358 58088 -85077 129800 121122 -193178 165914 -42413 262181 -175421
18622A46600N8476K7249c44183h4422C3305c37317H8789a49667I9345K5479k034
$$ 146600 205076 232325 -344183 -84422 33305 -337317 88789 -149667 99345 124824 122790
18611A22790a70796k158A88684Q9993q823q6275a93488k04122a997A84813c48572
$$ 122790 -170796 -172954 188684 278677 269854 183579 -193488 -397610 -1997 184813 -348572
18599d10420a42883A41539d5314o7584D4140J3288P0672f07755B18865b22864
$$ -410420 -142883 141539 -45314 -112898 44140 57428 128100 -607755 218865 -222864
18588a98510o3054J21629N5771c0055A90859c82644J22431d3290J6290j53112
$$ -198510 -261564 -139935 -84164 -30055 190859 -382644 -260213 -43290 -27000 -180112
18578a80112c1094j25462B40966h2829j99292J19545P7726n4128E59821a86946
$$ -180112 -31094 -156556 240966 -82829 -282121 -162576 -84850 -138978 559821 -186946
18567a76213M9309r6539d1761j56219P2556q3708A075J36153h0387A32447E0847
$$ -176213 -126904 -223443 -41761 -197980 -125424 -209132 1075 137228 -80387 132447 50847
18555a11618k05291a52336r8412e7029A30907A2716b14177q9800B5135M2799g2887
$$ -111618 -316909 -152336 -250748 -57029 130907 12716 -214177 -303977 25135 67934 -72887
18543b85893j57074g6795A03329d2200F0330b76161R3445b8721G3248a38537p922
$$ -285893 -442967 -76795 103329 -42200 60330 -276161 -182716 -28721 73248 -138537 -146459
18532a46459A53472a66833G5961b5673A0218g6006K3542B3864g0776B01060G3257
$$ -146459 153472 -166833 75961 -25673 10218 -76006 -52464 23864 -70776 201060 73257
18520a7519H2776a61360C935b46639M695B93972a98466Q9607F1357a26962j01837
$$ -17519 82776 -161360 3935 -246639 -241944 293972 -198466 -108859 61357 -126962 -228799
18509b28799j23300B575J79590a60609P6867o8684k586B8806e0036A5073a03629
$$ -228799 -352099 2575 182165 -160609 -83742 -152426 -155012 28806 -50036 15073 -103629
18497a06727C2816h392o983k19125j99355i699n0203j69965A05700J15926d30201
$$ -106727 32816 -8392 -15375 -234500 -433855 -9699 -59902 -229867 105700 221626 -430201
18485a01450o5142g9633C5367a06069j15631C80249a98784A13429a85497G1614
$$ -101450 -166592 -79633 35367 -106069 -221700 380249 -198784 113429 -185497 71614
18474f26520b64911f3970C13914H7849h2180H7688k1431b11947C0059K42476M224
$$ -626520 -264911 -63970 313914 87849 -82180 87688 66257 -211947 30059 272535 276759
18463B76759b20196A00795Q7455a43106F2109b8242j14870A29280A6078G736M1474
$$ 276759 -220196 100795 188250 -143106 62109 -28242 -143112 129280 16078 7736 49210
18452D9210b81954h2931j03308A34154e8177B08321I213E20e45l8319j57824M9010
$$ 49210 -281954 -82931 -186239 134154 -58177 208321 9213 520 -545 -38864 -196688 -147678
18440a47678f8125A7974n746c17321F8020O9134b7768G4053J5756c29976J34223
$$ -147678 -68125 17974 12228 -317321 68020 137154 -27768 74053 89809 -329976 -195753
18429a95753j8817C54495b63173Q4507g8761A8782M524c02443K9336d3730B86679
$$ -195753 -214570 354495 -263173 -178666 -78761 18782 23306 -302443 -273107 -43730 286679
18417a60663a3509K900r6625k34789a03813p2539B0402a61344g4403k34812I2638
$$ -160663 -13509 -10609 -107234 -342023 -103813 -176352 20402 -161344 -74403 -309215 92638
18405a10229A37282c16548A5875a8871k32234B00943a72024E0370M4531b09938
$$ -110229 137282 -316548 15875 -18871 -251105 200943 -172024 50370 94901 -209938
18394H0457i5461r3768A97371a95821A0454L23165n1657n6620c870A4089J47892
$$ 80457 -95461 -189229 197371 -195821 10454 333619 281962 225342 -3870 14089 161981
18383A61981d9170K263l0974k7495j53805F1735J2002a3294k63331A12955C9227
$$ 161981 -49170 -46907 -77881 -105376 -259181 61735 73737 -13294 -276625 112955 39227
18371a51691c0178A09418b52A4671b60981D1601L5715H803J30082a17114j27151
$$ -151691 -30178 109418 -252 14671 -260981 41601 77316 8803 138885 -117114 -244265
18360b44265I314a59187I809J28261K7018b6016r004J1795j90289C07582a21802
$$ -244265 9314 -159187 9809 138070 165088 -26016 -35020 -23225 -213514 307582 -121802
18348a54566j29990J6811J11665N9904C936J71019J11702a23116q6458A94600
$$ -154566 -284556 -267745 -156080 -96176 3936 174955 286657 -123116 -209574 194600
18337E2878b0955R354A553c5846B2763J59464i0752C9792l617c03113h4468c7589
$$ 52878 -20955 -11601 1553 -35846 22763 182227 -90752 39792 36175 -303113 -84468 -37589
18324E1423b64439D1732c0523m3273C4181b3677k04544f2007A4414J32437J98937
$$ 51423 -264439 41732 -30523 -73796 34181 -23677 -228221 -62007 14414 146851 345788
18313C45788C6944J94492a87116C96146A10935K43548a76854A61352N6275h3378
$$ 345788 36944 231436 -187116 396146 110935 354483 -176854 161352 217627 -83378
18302d5276p0945m8020B33124b65645H7721j3704i8369A29876N0397G3216P4114
$$ -45276 -116221 -164241 233124 -265645 87721 74017 -98369 129876 180273 73216 147330
18291A47330a17647A12410i3312k7519A58099a04132C9116d77843K33105B69952
$$ 147330 -117647 112410 -93312 -120831 158099 -104132 39116 -477843 -244738 269952
18280h1605j5383A06686D8296a51229O8728B64051b38924A27789j6179a4835j69280
$$ -81605 -96988 106686 48296 -151229 -82501 264051 -238924 127789 111610 -14835 -184115
18269a84115G353J37344i3509k17764g38A11907a37315I1505c191l53224B7433
$$ -184115 7353 144697 -93509 -311273 -738 111907 -137315 91505 -3191 -356415 27433
18257B80641A07591i6615A46190b43206n2960J29288f6704F2978C0981J26068
$$ 280641 107591 -96615 146190 -243206 -296166 -166878 -66704 62978 30981 157049
18247A57049b2481j1308A8648g3647A79635c41635J30680B21730A3776R2249l4892
$$ 157049 -22481 -33789 18648 -73647 179635 -341635 -210955 221730 13776 106025 71133
18236G1133a74251j21236R897G8123P971a39980K0395G4650k4772g5750B93886
$$ 71133 -174251 -295487 -285590 78123 86094 -139980 -119585 74650 49878 -75750 293886
18224a68743A8619c835D8748a22864j15868A84885a29923H9058a62774B5131R0958
$$ -168743 18619 -3835 48748 -122864 -238732 184885 -129923 89058 -162774 25131 116089
18213A16089b4357r9597j74951f386H6419f0723B07657a24939A16699b67923E9692
$$ 116089 -24357 -123954 -298905 -6386 86419 -60723 207657 -124939 116699 -267923 59692
18201A62688a47305c4730j65910L5195j21137F4796J77206G0528L2648L02944
$$ 162688 -147305 -34730 -200640 -165445 -286582 64796 242002 70528 103176 406120
18191D06120H3287e2934n4768I5941b16865B59370a75197B21425E3660J82024
$$ 406120 83287 -52934 -107702 95941 -216865 259370 -175197 221425 53660 235684
18181B35684b22567B47372H2372A049e292A41458C7512c13722H596K3504J49313
$$ 235684 -222567 247372 82372 1049 -5292 141458 37512 -313722 8596 32100 181413
18170A81413o7086a30356B36326e4021B1935O5366e0515I2657l9967R8855A8078
$$ 181413 114327 -130356 236326 -54021 21935 87301 -50515 92657 52690 151545 18078
18158e398l12482a07681L691J6345A99766M0010i8568A03920J25028n5113m3448
$$ -5398 -317880 -107681 -103990 -87645 199766 239776 -98568 103920 228948 173835 130387
18147A30387a6116j5759m819B51828a6476j11373C562a7507A34438J00117d8641
$$ 130387 -16116 -31875 -36694 251828 -16476 -127849 3562 -17507 134438 234555 -48641
18135a84969A12769a24860l39942A24330d9055A18261k4490P227b008a42A73774
$$ -184969 112769 -124860 -464802 124330 -49055 118261 93771 100998 -2008 -142 173774
18123A31440B0987a35391I9348b46209H0167J59247a13118B76561j1139b24833
$$ 131440 20987 -135391 99348 -246209 80167 239414 -113118 276561 265422 -224833
18112c2611r0531A87222J8172K747a16814F994J00649a1544j78056j26562I1453
$$ -32611 -123142 187222 205394 208141 -116814 6994 107643 -11544 -189600 -316162 91453
18100b50035n9528j8538A53194E0283O5738E4425J75347a62327N2557I8203e8274
$$ -250035 -309563 -328101 153194 50283 116021 54425 229772 -162327 -109770 98203 -58274
18088a97240n8543Q0621H8179L1561a8598j36034A86791a16282j33613Q8175I6556
$$ -197240 -255783 -175162 88179 119740 -18598 -154632 186791 -116282 -249895 -161720 96556
18076G676I79a51971P0086J5920H1545k6955e7561P048B42525a35301c6779A31402
$$ 7676 979 -151971 -81885 -65965 81545 54590 -57561 -50513 242525 -135301 -36779 131402
18063c8502l733P233R907j11852m33634E6531j1486g8963j6649k58672J21658
$$ -38502 -42235 -35002 -25095 -136947 -570581 56531 45045 -78963 -95612 -354284 -232626
18052b32626j37485a51309C63562A74829c21895B74854d1646o3642C9959a32765
$$ -232626 -370111 -151309 363562 174829 -321895 274854 -41646 -105288 39959 -132765
18041a05688M1049p0175A36279F0117k7480j3180F004d7616A91650G825J12977
$$ -105688 -64639 -134814 136279 60117 32637 19457 6004 -47616 191650 7825 120802
18030A20802c01209f9821B24496d9555l1112p8944A468J90121a66100h0450j0132
$$ 120802 -301209 -69821 224496 -49555 -80667 -159611 1468 191589 -166100 -80450 -90582
18019i0582j84930L1054C7069K71502E3226B5398a02298A5429L17654e0670k32776
$$ -90582 -275512 -244458 37069 308571 53226 25398 -102298 15429 333083 -50670 -283446
18008b83446F7906C1952i2652J1438c0248j38236B81354a68824E1039P7561c2573
$$ -283446 67906 31952 -92652 -81214 -30248 -168484 281354 -168824 51039 128600 -32573
17996e5507J4836D5271d9107G3113B9884b08355j27524A42458a81393Q5098c3078
$$ -55507 -40671 45271 -49107 73113 29884 -208355 -335879 142458 -181393 -96295 -33078
17984G0321J01516e0911A18884m0905L54921H0650b33812B47653p9596j3051D8655
$$ 70321 171837 -50911 118884 77979 432900 80650 -233812 247653 168057 155006 48655
17972d2030j33782C9361J61747G0933a93368K8802l6694R090A83984G3302a63435
$$ -42030 -175812 39361 201108 70933 -193368 -164566 -201260 -192170 183984 73302 -163435
17960e5550D4h7081B22730r2570g3285F3733b50623H4778D809J09766k155k4742
$$ -55550 44 -87081 222730 130160 -73285 63733 -250623 84778 4809 114575 112420 87678
17948H7678b0153k9428q0307B17023K27397C0943j3980Q601a84155B1680a76017
$$ 87678 -20153 -49581 -129888 217023 444420 30943 16963 25564 -184155 21680 -176017
17936A58728g2468J18B32125E4335c64360A03749b84682B44491C98J97542n8274
$$ 158728 -72468 -72350 232125 54335 -364360 103749 -284682 244491 398 197940 139666
17925A39666c0844E7739a03007b7202F3259a15135A64232K78130k18906i3836
$$ 139666 -30844 57739 -103007 -27202 63259 -115135 164232 442362 223456 -93836
17914d396j51408G9744j3989a15365A66642b47113d6333C10108q6923i3960A19141
$$ -4396 -155804 79744 65755 -115365 166642 -247113 -46333 310108 223185 -93960 119141
17902C233K40405E393K24995c50711J46352A51349g4048A1735J47104R2882a1216
$$ 3233 243638 5393 230388 -350711 -204359 151349 -74048 11735 158839 251721 -11216
17890C0572O1949i0548C613L8231b34053a5015B39202q8653D9553J24202m5733
$$ 30572 92521 -90548 3613 41844 -234053 -15015 239202 150549 49553 173755 128022
17879A28022a65484P4001j24887A59148K00840b85575R8286g436j19056C29024
$$ 128022 -165484 -91483 -216370 159148 359988 -285575 -187289 -7436 -126492 329024
17868C55530a08068A34447f64G5583a01495G8320g1845B78885d6701H7413J9731
$$ 355530 -108068 134447 -664 75583 -101495 78320 -71845 278885 -46701 87413 107144
17857A07144a27134D8431j6154K58289a50817J9545F6591Q2219k172j2943D8483
$$ 107144 -127134 48431 32277 290566 -150817 -131272 66591 148810 146638 133695 48483
17845a76744A36249c67657D31415C2293e9215A05010l9951b04949C4905r524J05074
$$ -176744 136249 -367657 431415 32293 -59215 105010 65059 -204949 34905 25381 130455
17834A30455a47616D59352A62257c1603k9117K0249j73432n447A42665a45680
$$ 130455 -147616 459352 162257 -31603 -60720 -40471 -213903 -219350 142665 -145680
17823A77530a98605f8692A87363a0516A52706a54224k1375C56621A15603m2966
$$ 177530 -198605 -68692 187363 -10516 152706 -154224 -175599 356621 115603 72637
17813G2637e1258C24633c18968C67271G3156f2177k37520e7442D6399j7407a61109
$$ 72637 -51258 324633 -318968 367271 73156 -62177 -299697 -57442 46399 28992 -161109
17801d3475l6043C46685G9318M16005H006J42170A5472a9271L11A70190b90145
$$ -43475 -79518 346685 79318 495323 8006 150176 15472 -19271 -18960 170190 -290145
17789D0356N05847I1146O4530C782c167A8982R9401e250k7123n3040A87531f9163
$$ 40356 546203 91146 155676 3782 -3167 18982 118383 -5250 -32373 -85413 187531 -69163
17776A84027c04968h8255A67058c36645H1925d0088r685l2678d0618D35579a8152
$$ 184027 -304968 -88255 167058 -336645 81925 -40088 -49773 -82451 -40618 435579 -18152
17764A35491a6893A33123j8397J44333j12302a5665B3624K18361c5428p546m3590
$$ 135491 -16893 133123 114726 259059 146757 -15665 23624 241985 -35428 -42974 -86564
17753h6564c1783m5242B61974a13197M8555D4718b01802F4196L27220A16097f0483
$$ -86564 -31783 -77025 261974 -113197 -64642 44718 -201802 64196 391416 116097 -60483
17741A07898g2122A34566B6484a63604c2786A28295e6584H6484d4750B72170F0198
$$ 107898 -72122 134566 26484 -163604 -32786 128295 -56584 86484 -44750 272170 60198
17729c2748A1970a29303I1461R8418J45899a26490J351A11483A8337a06121M747
$$ -32748 11970 -129303 91461 189879 335778 -126490 -125139 111483 18337 -106121 -101374
17718a01374R521B94597B5131M6313J67319l3440m3860L3115b8822j59039h319
$$ -101374 -91853 294597 25131 71444 238763 205323 161463 194578 -28822 -187861 -8319
17706A31247J1022J8533J47299r2736o8076j7742a36965B60200G1989b0291j1107
$$ 131247 142269 160802 308101 215365 147289 129547 -136965 260200 71989 -20291 -31398
17695c1398B04106A7412O8788J77725P7903j67951a49144B41256c6230E1385K7294
$$ -31398 204106 17412 86200 263925 341828 173877 -149144 241256 -36230 51385 78679
17684G8679k4984Q24b39831a19209o6596B6149J48118f7642A79980J33849a8976
$$ 78679 53695 54519 -239831 -119209 -185805 26149 174267 -67642 179980 313829 -18976
17672I3207b75035A22130J95924c7488B10432H8612A3584J18948a44504B31307
$$ 93207 -275035 122130 318054 -37488 210432 88612 13584 132532 -144504 231307
17661A52972J10627a0985C55677j6946m6233j36938n2765O10578b39358G3362
$$ 152972 263599 -10985 355677 338731 292498 155560 102795 713373 -239358 73362
17650A63436j2490J27527R1554r9353j04301J92893A60879P8259A01649f083A1047
$$ 163436 150946 278473 370027 270674 166373 359266 160879 239138 101649 -6083 11047
17638A6438L81229a15033j30909B21771B14M1029K43337c47084a29884F38391
$$ 16438 397667 -115033 -245942 221771 214 41243 284580 -347084 -129884 638391
17627I4299K16406b39062J15875H8541R6752J6684L07283A00908D5141J38044
$$ 94299 310705 -239062 -123187 88541 185293 201977 509260 100908 45141 183185
17617A83185J67243A60742a35897N5673C23700H7647J12067k1728A3128K67497
$$ 183185 350428 160742 -135897 -80224 323700 87647 199714 177986 13128 280625
17607B80625b09139E7548g6192I8283P337J42376e7181D54575J30937c9881F5897
$$ 280625 -209139 57548 -76192 98283 105620 247996 -57181 454575 585512 -39881 65897
17595B55772M5278r2524M2584a13853D92783A08367g2339D03297B4473K41416
$$ 255772 301050 208526 251110 -113853 492783 108367 -72339 403297 24473 265889
17585B65889e6697E3039B0061J64326A1947Q8647P3855K2710J77223p5534j10202
$$ 265889 -56697 53039 20061 184387 11947 100594 174449 197159 374382 298848 188646
17574A88646L2171i7101B29885J16566A11117J41324j24420A9862J28095c6448
$$ 188646 220817 -97101 229885 346451 111117 252441 128021 19862 147957 -36448
17563A63027a2248C38799r4082q3913J22861p0835J0198J45640b20814A17946
$$ 163027 -12248 338799 244717 160804 283665 212830 223028 368668 -220814 117946
17552A57709m1069J61804k0869I6704K0794f1624q8516j15946A44845K67878A01184
$$ 157709 116640 278444 257575 96704 117498 -61624 -150140 -266086 144845 412723 101184
17540B51420q1060k6359L92781j22119A63304F1683J90660Q4872J96665a0112
$$ 251420 170360 144001 536782 414663 163304 61683 252343 337215 533880 -10112
17529D22625a28607C04903L8743j26399J54937C9497O4387K77284j73944M1803
$$ 422625 -128607 304903 343646 217247 372184 39497 103884 381168 207224 249027
17519B49027I44P34882B54954P6970N60574k66963j88991B16105O40601k45108
$$ 249027 944 735826 254954 331924 892498 625535 436544 216105 856706 611598
17509F11598L49266j42253k03484L38372l24435k13502J2866A52572L42840j38896
$$ 611598 960864 818611 615127 953499 629064 415562 428428 152572 495412 356516
17499C56516K3487J72975j21304K30392n4977L56933p1312L13714l57874B96489
$$ 356516 380003 552978 431674 662066 607089 964022 892710 1206424 848550 296489
17488H08299C76715K19760A50146J53558K51941j55430Q4503P3638A84914Q4411
$$ 808299 376715 596475 150146 303704 555645 400215 484718 558356 184914 269325
17478B69325o5368L46988k30376C7500L92634j16023H9777c3300E90713A29149
$$ 269325 203957 550945 320569 37500 430134 314111 89777 -33300 590713 129149
17467B00928J1016D0176K28854r2147F9474L60076j99869R2002j24768r2837K47759
$$ 200928 211944 40176 269030 176883 69474 429550 229681 321683 196915 104078 351837
17456C51837a6026k4930D70785j15015j69838L1678J36046r0609N1871J67727
$$ 351837 -16026 -40956 470785 355770 185932 217610 353656 263047 314918 482645
17446D82645e2604C29926j14799f2740B8917J34025K17497q303A63777a8194C39720
$$ 482645 -52604 329926 215127 -62740 28917 162942 380439 372136 163777 -18194 339720
17434C26258O7490j21956J43844q5319j5370J72243B41381K50893H3080K19084
$$ 326258 393748 271792 415636 330317 314947 487190 241381 492274 83080 302164
17424C02164J03972J5223k01478L04669j74873K45572K98843C20538P8510r9050
$$ 302164 406136 421359 219881 524550 349677 595249 894092 320538 399048 299998
17414B99998J75869A05195a8392F1001J04926L93754K3784A39521L14320q2038
$$ 299998 475867 105195 -18392 61001 165927 559681 583465 139521 453841 371803
17404C71803Q5935L5988B00055G1353M23594j09489o8832j8175J44337l5736J80891
$$ 371803 457738 493726 200055 71353 494947 385458 316626 298451 442788 407052 587943
17393E87943A99677a4051C26864A29436m7166J36850n3861L40169j43679j58172
$$ 587943 199677 -14051 326864 129436 82270 219120 165259 505428 361749 203577
17383B03577m1345l482K12213A43464R6220K37598A66686q282a7165C36868Q9781
$$ 203577 162232 158750 370963 143464 239684 477282 166686 158404 -17165 336868 426649
17372D26649j41011A36922L7297j9686J61259I4442M2438J79815O4605H7254K01603
$$ 426649 285638 136922 174219 154533 315792 94442 136880 316695 381300 87254 288857
17361B88857I7700K21048J49487q3728J60833R3154E3855N6174L49744k23719
$$ 288857 97700 318748 468235 384507 545340 638494 53855 110029 459773 236054
17351B36054r9439l5913J99236j37155N767j4319a87975C37447M06927F1156a08719
$$ 236054 136615 100702 299938 162783 168550 154231 -187975 337447 744374 61156 -108719
17339B13458J48505L791l9522c4423B45773J88725o9008N4915A0517N08374A31150
$$ 213458 361963 365754 326232 -34423 245773 434498 365490 420405 10517 518891 131150
17327C02050K23984A89651J80588A04932J61673p2532B2766M44465F2347M50204
$$ 302050 526034 189651 370239 104932 266605 194073 22766 467231 62347 512551
17317E12551A14211a39635D15675k4954J3155j80928o42e2783C39663A41195n6878
$$ 512551 114211 -139635 415675 390721 403876 222948 222306 -52783 339663 141195 84317
17306H4317O2111K43906j53884L83026A32147J52507j6633K38719B00885L9975
$$ 84317 146428 390334 236450 619476 132147 284654 268021 506740 200885 240860
17296B40860l9109R7384p8178J96454q4847J64598l43c1016G50637A31484K2022
$$ 240860 201751 299135 220957 417411 332564 497162 496819 -31016 750637 131484 153506
17285A53506J3067K78685j13123K1373j68764L43993q0822j54612O2368J35983
$$ 153506 166573 445258 332135 353508 184744 528737 447915 293303 355671 491654
17275D91654E8438K94289j4722J32951C0293K23278J38965j00256n8899k2127
$$ 491654 58438 352727 338005 470956 30293 253571 392536 292280 233381 211254
17265B11254L01796k56406N9265Q6600a03269D43801n4803O3364j91196L51687
$$ 211254 513050 256644 315909 402509 -103269 443801 388998 452362 261166 612853
17255F12853k69063L7322H1751N9532B8304M39213A81398L7003K58666L3217j15190
$$ 612853 343790 381112 81751 141283 28304 467517 181398 218401 477067 510284 395094
17244C95094A52535L69973B2010L77955j69787P6495A17837O61104i2706E08066
$$ 395094 152535 522508 22010 399965 230178 306673 117837 778941 -92706 508066
17233G97301B64815J39218J477N009A01713A315M00984J25931J98091A6070L89694
$$ 797301 264815 404033 405510 410519 101713 1315 402299 528230 726321 16070 405764
17222D05764j4805O3698K56699A30491M14658j5614B31131J17032J90657j82922
$$ 405764 390959 454657 711356 130491 545149 529535 231131 348163 538820 355898
17212C55898R7467J6160j29569o0784K27018m2936j0678j57694A29504M71346
$$ 355898 453365 469525 339956 279172 506190 463254 452576 294882 129504 600850
17202F00850A70139K81748j58588j9093K49455L6200j40394C4383M92780J15381
$$ 600850 170139 451887 293299 274206 523661 559861 419467 34383 527163 642544
17192F42544j11792O7495k08360J98866j27689J47252Q2389N7897k78496j8914
$$ 642544 530752 598247 389887 588753 461064 608316 690705 748602 470106 451192
17182D51192P1746j09587J27483j74738k413o3270E8256K71918J50730j27963
$$ 451192 522938 413351 540834 366096 363683 300413 58256 330174 480904 352941
17172C52941J3090O1444j67750K52262j56920n961J79114j57754K13934B74022
$$ 352941 366031 427475 259725 511987 355067 349106 528220 370466 584400 274022
17161D38438o6828O6391M2601M3056j5753j24756O3264J32324K50742m08674M98177
$$ 438438 371610 438001 480602 523658 507905 383149 446413 578737 829479 420805 918982
17150I18982m41844j70724N1072Q9667j02184j26081J06145L17867q895j48605
$$ 918982 477138 306414 357486 447153 344969 218888 325033 642900 634005 485400
17140D85400J85043O8860P5468j43121C35644J13867R8596k01755J03868J35872
$$ 485400 670443 739303 814771 671650 335644 449511 548107 346352 450220 586092
17130E86092m3667P5696L57136C38869K88709k01881J92879j9670L4735L8519
$$ 586092 542425 618121 975257 338869 627578 425697 618576 598906 633641 672160
17120F72160l22055j26684K64670o7483k4438a4564G94039l72713J96347q4102
$$ 672160 350105 223421 488091 420608 396170 -14564 794039 421326 617673 533571
17110E33571j46993K39265B08929J38281K81879l14062K47039q1958K23733l18130
$$ 533571 386578 625843 208929 347210 629089 315027 562066 480108 703841 385711
17100C85711P7554L68092N0655B34375J88554K02062Q9121j82883K25268J87824
$$ 385711 463265 831357 882012 234375 422929 624991 714112 531229 756497 944321
17090I44321j46003j33350j44933j1750M59953k80389k57313Q3735L53931o3530
$$ 944321 798318 664968 520035 508285 968238 687849 430536 514271 868202 804672
17080H04672j32833k803k9351k00041N28609N6978l88315j8080K09612r4516K22427
$$ 804672 671839 669036 639685 439644 968253 1025231 636916 618836 828448 733932 956359
17069I56359J64529k0547k07733B99671N88988q1402j32672J13939j96077K82696
$$ 956359 1120888 1100341 892608 299671 888659 807257 674585 788524 592447 875143
17059H75143L4740K01694k57126J45333l37139J64934j52296L14440k62982j82945
$$ 875143 909883 1111577 854451 999784 662645 827579 675283 989723 726741 543796
17049E43796J09065J02557J60140p776o4544K75082k77735M0911R7421K5151j71206
$$ 543796 652861 755418 915558 907782 843238 1118320 840585 881496 978917 1004068 832862
17038H32862J19841K1063j16954Q0446J992n8795j10069M86487l08787N4832l76815
$$ 832862 952703 973766 856812 937258 939250 880455 770386 1256873 948086 1002918 626103
17027F26103K40631J93073l23987n5522M79036k96366L52375l70340j90244K65810
$$ 626103 866734 1059807 735820 680298 1159334 862968 1215343 845003 654759 920569
17017I20569L2545K32105n74574L25811K99086J5301O7836j50870l52991M39931
$$ 920569 953114 1185219 610645 936456 1235542 1250843 1318679 1167809 814818 1254749
17007A254749l38513J92545o1421K08896l51977K95173o8476L9822k21711K48211
$$ 1254749 916236 1108781 1047360 1256256 904279 1199452 1130976 1170798 949087 1197298
16997A197298j98206Q490m9799K47974L0589J46494K792F19493Q06068o4370k68077
$$ 1197298 999092 1007582 957783 1205757 1236346 1382840 1385632 619493 1425561 1361191 1093114
16986A093114M44616p29310j13063N97728n1402J8230K06063j80996L35066m39500
$$ 1093114 1537730 808420 695357 1293085 1241683 1259913 1465976 1284980 1620046 1180546
16976A180546L64799n10310K66741j57939J31938k95586K49367k2623M7824L77185
$$ 1180546 1545345 1035035 1301776 1143837 1275775 980189 1229556 1206933 1254757 1631942
16966A631942n63945M73424k35542j7286L06278N702j13747J6171J84925K87154
$$ 1631942 1067997 1541421 1305879 1288593 1594871 1600573 1486826 1502997 1687922 1975076
16956A975076p32870M8793K27426k12399L41529p3537J59j16013L17229m18374
$$ 1975076 1242206 1290999 1518425 1306026 1647555 1574018 1574177 1458164 1775393 1357019
16946A357019M62936m1512p5355K54788j56185J4290m9376j76218J53085P8577
$$ 1357019 1819955 1778443 1703088 1957876 1801691 1815981 1766605 1590387 1743472 1822049
16936A822049m55991M15692m07374P57190k96863K10766j257j27401J00500J6694
$$ 1822049 1366058 1781750 1374376 2131566 1834703 2045469 2044212 1916811 2017311 2034005
16926B034005J10149k74889K7696R3704J59152o5611j08265L14984j47737j48943
$$ 2034005 2144154 1869265 1896961 1990665 2149817 2084206 1975941 2290925 2143188 1994245
16916A994245K39246j82744j20056K81675k64021J41782J13493K86276o4052l24810
$$ 1994245 2233491 2050747 1930691 2212366 1948345 2090127 2203620 2489896 2425844 2101034
16906B101034L73117J50859k68151l18372L90163j3317K0773L97123m40657L20647
$$ 2101034 2474151 2625010 2356859 2038487 2428650 2415333 2436106 2833229 2392572 2713219
16896B713219K91813m24775L68179m27061K41616k11716K51767j6692n3434L86870
$$ 2713219 3005032 2580257 2948436 2521375 2762991 2551275 2803042 2786350 2732916 3119786
16886C119786n57327N14416O5445j22972K40317j53557j38546K88211k46812L67053
$$ 3119786 2562459 3076875 3142320 3019348 3259665 3106108 2967562 3255773 3008961 3376014
16876C376014m4481j45259J94406R0864j5878k38558J23371K33583j12037J26931
$$ 3376014 3331533 3186274 3380680 3471544 3455666 3217108 3340479 3574062 3462025 3588956
16866C588956J88065m00515K04948L26628j39602L27439j15079k30118J9077K64727
$$ 3588956 3777021 3376506 3581454 3908082 3768480 4095919 3980840 3750722 3769799 4034526
16856D034526L34191n8035j54096J84174O4539J65898k9899J07040l2390K01987
$$ 4034526 4368717 4310682 4156586 4340760 4405299 4571197 4541298 4648338 4615948 4817935
16846D817935k71478M27140l41130L59036J04904P8827j25941q7287M39268K29297
$$ 4817935 4546457 4973597 4632467 4991503 5096407 5175234 5049293 4962006 5401274 5630571
16836E630571l21732o0296L58013l679J79694J31975J54703K21186j12396J43500
$$ 5630571 5308839 5248543 5606556 5602877 5782571 5914546 6069249 6290435 6178039 6321539
16826F321539J06685O9803P9480j03942K59913J28362J42466K17163R0144L53807
$$ 6321539 6428224 6498027 6577507 6473565 6733478 6861840 7004306 7221469 7311613 7665420
16816G665420J04997k14801K07651J43433J60808J50824Q7964K83077J1531J56417
$$ 7665420 7770417 7555616 7763267 7906700 8067508 8218332 8306296 8589373 8600904 8757321
16806H757321K10204M28679l2467M07425K10164q1059P3601M31501K09111K11807
$$ 8757321 8967525 9396204 9363737 9771162 9981326 9900267 9973868 10405369 10614480 10826287
16796A0826287J10293L37105k377O43632J48255j73737O60942q6279Q42718M14588
$$ 10826287 10936580 11273685 11271308 11914940 12063195 11889458 12550400 12464121 13306839 13721427
16786A3721427R3043J83947K48181M03608O1284P40081L40823P41120L06597R3612
$$ 13721427 13814470 13998417 14246598 14650206 14711490 15451571 15792394 16533514 16840111 16933723
16776A6933723N91998M40033L16526P5358P80504Q15333L58668M93750N42462
$$ 16933723 17525721 17965754 18282280 18357638 19138142 19953475 20312143 20805893 21348355
16767B1348355N31255M83281J027393N76835P59300O13118P15125J149066N60823
$$ 21348355 21879610 22362891 23390284 23967119 24726419 25339537 26054662 27203728 27764551
16758B7764551R95329P45550O02278J123505J166217J143075J296271P10370J511634
$$ 27764551 28759880 29505430 30107708 31231213 32397430 33540505 34836776 35547146 37058780
16749C7058780J116776J316327J435665J063045J550014J446890J519247J806783
$$ 37058780 38175556 39491883 40927548 41990593 43540607 44987497 46506744 48313527
16741D8313527J610026J665917K069866K157778K150341K215010K058216K652965
$$ 48313527 49923553 51589470 53659336 55817114 57967455 60182465 62240681 64893646
16733F4893646K144340K426179K599130K584309K690455K748010L358647K515297
$$ 64893646 67037986 69464165 72063295 74647604 77338059 80086069 83444716 85960013
16725H5960013K824482K720504L591693K579277K540140L437303K523856L021470
$$ 85960013 88784495 91504999 95096692 97675969 100216109 103653412 106177268 109198738
16717A09198738K487496K679719K295683K235509J762459J831881J439751P15102
$$ 109198738 111686234 114365953 116661636 118897145 120659604 122491485 123931236 124646338
16709A24646338Q20363J146286m3712r5230o49495r51437j113836j106204j611150
$$ 124646338 125466701 126612987 126569275 126474045 125824550 124873113 123759277 122653073 121041923
16700A21041923k045817k002937k236047k584641k560311k487151l291029k587061
$$ 121041923 118996106 116993169 114757122 112172481 109612170 107125019 103833990 101246929
16692A01246929l100748k947650l018563l232547k767061k628911l014965l024514
$$ 101246929 98146181 95198531 92179968 88947421 86180360 83551449 80536484 77511970
16684G7511970k570229k618419k827576k320222k483263k585973k269890k000588
$$ 77511970 74941741 72323322 69495746 67175524 64692261 62106288 59836398 57835810
16676E7835810k397593j413275k030595k393984j638191j844743j373112j746800
$$ 57835810 55438217 54024942 51994347 49600363 47962172 46117429 44744317 42997517
16668D2997517j281475j558425j398010j502723j010992j008848j575194q82462
$$ 42997517 41716042 40157617 38759607 37256884 36245892 35237044 33661850 32779388
16660C2779388j074007p62111j368982o50598j121286p59637r87164o99547j002160
$$ 32779388 31705381 30943270 29574288 28923690 27802404 27042767 26055603 25356056 24353896
16651B4353896m47238o00196n98018n93436o32598r25655n43656n40970n14322
$$ 24353896 23906658 23306462 22708444 22115008 21482410 20556755 20013099 19472129 18957807
16642A8957807m88649q1175q30264n79463j85805o32779j79919l32654m90828
$$ 18957807 18469158 18387983 17557719 16978256 16792451 16159672 15979753 15647099 15156271
16633A5156271l61948l23351k64324l52853m66029k14839m36684R9640o95829
$$ 15156271 14794323 14470972 14206648 13853795 13387766 13172927 12736243 12835883 12140054
16624A2140054j79941l26311K2464l75420l52301k07553l56796j07440p3605k76009
$$ 12140054 11960113 11633802 11656266 11280846 10928545 10720992 10364196 10256756 10183151 9907142
16614I907142N0385m03749j80835k44860j64985k0054j78609j36255l88197L8311
$$ 9907142 9957527 9553778 9372943 9128083 8963098 8943044 8764435 8628180 8239983 8278294
16604H278294k45604o0772O1477m51311o8340J09945l46195n2173m54341j48000
$$ 8278294 8032690 7971918 8033395 7582084 7513744 7623689 7277494 7225321 6770980 6622980
16594F622980J96598P6550j63519n6855l35235L6016l50210J59887j51173j61300
$$ 6622980 6819578 6896128 6732609 6675754 6340519 6376535 6026325 6186212 6035039 5873739
16584E873739k95811l3263j09307k5052j12882j5271j18751j0914J05048n10211
$$ 5873739 5577928 5544665 5435358 5410306 5297424 5282153 5163402 5152488 5257536 4747325
16574D747325J61875j1254m4351k77084K06841q9115q6494J11895l74445J29622
$$ 4747325 4909200 4897946 4853595 4576511 4783352 4694237 4607743 4719638 4345193 4474815
16564D474815k86380O7358K9554k53365K39853k13972O6144m19347m5426Q6309
$$ 4474815 4188435 4255793 4285347 4031982 4271835 4057863 4124007 3704660 3659234 3745543
16554C745543M19748n75492J35722k11651J10774m1225r1693j27263R4239k73006
$$ 3745543 4165291 3589799 3725521 3513870 3624644 3583419 3491726 3364463 3458702 3185696
16544C185696J17361J2303J4056j38769J2734l17879L39037k64401J9588l8919
$$ 3185696 3303057 3315360 3329416 3190647 3203381 2885502 3224539 2960138 2979726 2940807
16534B940807m8498K83478n14576L1514l0555K52311j97342J44417j39899O5237
$$ 2940807 2892309 3175787 2661211 2692725 2662170 2914481 2717139 2861556 2721657 2786894
16524B786894j18506J91231j66336j97009K31147k62854j62435J42406M808P6421
$$ 2786894 2668388 2859619 2693283 2496274 2727421 2464567 2302132 2444538 2449346 2525767
16514B525767k34285J53905J31386k86569l9469K61007m1002k85890J4353L36175
$$ 2525767 2291482 2445387 2576773 2290204 2250735 2511742 2470740 2184850 2199203 2535378
16504B535378m97304J86173n37008M88056l5396k75563p503j17342M02863k14184
$$ 2535378 2038074 2224247 1687239 2175295 2139899 1864336 1856833 1739491 2142354 1928170
16494A928170J3018k6761j97002J67482P5066K34798k32581j65833J86293m01903
$$ 1928170 1941188 1914427 1717425 1884907 1959973 2194771 1962190 1796357 1982650 1580747
16484A580747J67738J68373J03490l70683J24688R040m6448J61143l56357M40848
$$ 1580747 1748485 1916858 2020348 1649665 1774353 1783393 1736945 1898088 1541731 1982579
16474A982579l36598l54045M19147k43356J83792K52991j51949l22659P1503N33204
$$ 1982579 1645981 1291936 1711083 1467727 1651519 1904510 1752561 1429902 1501405 2034609
16464B034609n49499J81355l27184k1340L62477k13069N903n5804m31j76127K21972
$$ 2034609 1485110 1666465 1339281 1317941 1680418 1467349 1473252 1417448 1417017 1240890 1462862
16453A462862l19390K91741P5175K17336n33784M21455l05307Q6459K150k20335
$$ 1462862 1143472 1435213 1510388 1727724 1193940 1615395 1310088 1396547 1398697 1178362
16443A178362L97947k14900j94612L35040F66761N79811k48052L85818j87970
$$ 1178362 1576309 1361409 1166797 1501837 666761 1246572 998520 1384338 1196368
16434A196368j28999K06592k01041K25173J51879l5551l79888m2644m3423L05978
$$ 1196368 1067369 1273961 1072920 1298093 1449972 1414421 1034533 991889 948466 1254444
16424A254444k17143K0186K44651k4283k90830J64735j45753J45762L203P6446
$$ 1254444 1037301 1057487 1302138 1277855 987025 1151760 1006007 1151769 1154972 1231418
16414A231418o8452j38573k90106M29026M2687P9573n13626J39888o1040M9505
$$ 1231418 1162966 1024393 734287 1163313 1206000 1285573 771947 911835 850795 900300
16404I00300L39852k6104n629m7847r8010k39492M7046l5434M9056K50509m14616
$$ 900300 1240152 1214048 1208419 1160572 1062562 823070 870116 834682 883738 1134247 719631
16393G19631N9183M6948K19040j318j78579k34253N46459P4880m10791L1380r3372
$$ 719631 778814 825762 1044802 1043484 864905 630652 1177111 1251991 841200 872580 779208
16382G79208K76983l00678l39899M36149J57358k07621O4590j77692J76569q394
$$ 779208 1056191 755513 415614 851763 1009121 801500 866090 688398 864967 856573
16372H56573K34207m61382J07160j82899J95489L93164l80237n4413k09536K36510
$$ 856573 1090780 629398 736558 553659 749148 1142312 762075 707662 498126 734636
16362G34636k958N0568j9841L17482k55860J93149k98887r0774p2071J81389O7735
$$ 734636 731678 782246 762405 1079887 824027 1017176 718289 627515 555444 736833 804568
16351H04568J23990m53086J28510n7578L87049n8724l28325M7225J40478m4706
$$ 804568 928558 475472 603982 546404 933453 874729 546404 593629 734107 689401
16341F89401j9355j08431R425J38479K15801k85285M81575B84529K21459L2553
$$ 689401 670046 561615 571040 709519 925320 640035 1121610 284529 505988 538541
16331E38541J02537R2804j42200J24950j46023q2641m028k1059J75975m1460J740
$$ 538541 641078 733882 591682 716632 570609 487968 483940 462881 638856 597396 599136
16320E99136k47683M58130k46337K3440j79759M11502B68812R2868O1320J52129
$$ 599136 351453 809583 563246 586686 406927 818429 268812 361680 423000 575129
16310E75129K3153n8766O5474k15946N02541C67574K32025M8983N3643k67249
$$ 575129 598282 539516 604990 389044 891585 367574 599599 648582 702225 434976
16300D34976K61375J52239k81911p7130j13108J5473q9691J94485o6266L1373
$$ 434976 696351 848590 566679 489549 376441 391914 302223 496708 430442 461815
16290D61815K80132k16822o7979O4119B23596N81454q3639j13204k03970L73313
$$ 461815 741947 525125 457146 521265 223596 805050 721411 608207 404237 777550
16280G77550k68058j17503J59851J17838j77926l5739o8471R7415N1423N8849
$$ 777550 509492 391989 551840 669678 491752 456013 387542 484957 536380 595229
16270E95229B32602K88908j73283L41943j90838A56438L35238q5832A19228J89927
$$ 595229 232602 521510 348227 690170 499332 156438 491676 405844 119228 309155
16260C09155J98725J25674j91974J64674A81562P45904m39023k00730J49006J07418
$$ 309155 507880 633554 441580 606254 181562 927466 488443 287713 436719 544137
16250E44137j98157M1244q1637O1986J85407j23542B14300Q9909K68510A89846
$$ 544137 345980 387224 305587 367573 552980 429438 214300 304209 572719 189846
16239A79679L56355q764B42244K36997j22705j56219h9350D23994K37326B87271
$$ 179679 536034 527270 242244 479241 356536 200317 -89350 423994 661320 287271
16228F39235A08369J56833D8976L09730o1301K17469K9059B53461J57744K26853
$$ 639235 108369 265202 48976 358706 297405 514874 543933 253461 411205 638058
16218F38058B48391D2493K37621N9611j02153L76186j12650q1508j97324N3196
$$ 638058 248391 42493 280114 339725 237572 613758 501108 419600 222276 275472
16208B75472A16069J48160h0244E47480j40255j23406H0512K87302J57576B36593
$$ 275472 116069 264229 -80244 547480 407225 283819 80512 367814 525390 236593
16197D09559G4956J48041N1109R044A25810K8246N8868M88227a91840I6150L19101
$$ 409559 74956 222997 274106 283150 125810 154056 212924 701151 -191840 96150 415251
16186D15251j93686N3946j22404j7400M23018a06293A81857K54354a23812C73594
$$ 415251 221565 275511 153107 135707 558725 -106293 181857 436211 -123812 373594
16175A74889q1646P846K46361A13761K24440Q4606j78767F4899N78193j33213
$$ 174889 93243 101089 347450 113761 338201 422807 244040 64899 643092 509879
16165E09879k17752r3434L16553j46830B3372Q7599J82104r5826C8487L09264
$$ 509879 292127 198693 515246 368416 23372 110971 293075 197249 38487 347751
16155C47751G9587K85687c5034C89461n7283j43151J74877j40704J31852R3252
$$ 347751 79587 365274 -35034 389461 332178 189027 363904 223200 355052 448304
16145D48304A38533L29310E9036R991J61412Q2773k2755J96075L7544j35358d6631
$$ 448304 138533 467843 59036 69027 230439 313212 290457 486532 524076 388718 -46631
16133b02872B22985l9716J0878A6613a01635F8391K9936N5598a03083A16350L46385
$$ -202872 222985 183269 194147 16613 -101635 68391 98327 153925 -103083 116350 462735
16122D62735j91723h74B67695J77383b7919C25552k5270j17122n5887K84517j91258
$$ 462735 271012 -874 267695 445078 -27919 325552 300282 183160 127273 411790 220532
16111B20532N9460G7616L2207E4390J2334R7936a08784A98675M0621R293H4079
$$ 220532 279992 77616 109823 54390 66724 164660 -108784 198675 239296 248589 84079
16099C75889A6916M30052c4903m8660F9884b6172C96630H5631P2362j0974R8086
$$ 375889 16916 446968 -34903 -83563 69884 -26172 396630 85631 157993 147019 245105
16088B45105J25730E8249a83653A77554k5473d4074l1646b7473D18343A84085
$$ 245105 370835 58249 -183653 177554 152081 -44074 -75720 -27473 418343 184085
16077B7587a03178n596L8004A3544K60638a67017A61220n444a38834H3965h7628
$$ 27587 -103178 -108774 -70770 13544 274182 -167017 161220 155776 -138834 83965 -87628
16065C97089A92491J34499A04370J75203q2034e4811B34147m0220J80825A02910
$$ 397089 192491 326990 104370 279573 197539 -54811 234147 193927 374752 102910
16054A33928b3882G5615K39994n2674H5475L89128j54191l3543A35916A7779L7929
$$ 133928 -23882 75615 315609 262935 85475 474603 320412 286869 135916 17779 55708
16043E5708a80911K9742e6302C5952J04456a64748P3826B33681H2361a67023D1654
$$ 55708 -180911 -151169 -56302 35952 140408 -164748 -90922 233681 82361 -167023 41654
16031a49532o1697C12267A5944J43409G7999N6312i217B18423O382a77527a3007
$$ -149532 -211229 312267 15944 159353 77999 134311 -9217 218423 224805 -177527 -13007
16019A54567R0871h8041A72365K16938a382r0655l2358b8594A4335J83493j0549
$$ 154567 245438 -88041 172365 389303 -1382 -92037 -124395 -28594 14335 197828 187279
16008A87279f2988M404A66324J519A6207P5050L8565k9217D6827R9062R867a02548
$$ 187279 -62988 -58584 166324 167843 16207 91257 129822 100605 46827 145889 155756 -102548
15995A38434l6923K0702e9052G3821e9177A73156i8359A57857E1350o026g8483
$$ 138434 101511 122213 -59052 73821 -59177 173156 -98359 157857 51350 45324 -78483
15983A44008J65055b73776E7751J55946O9225i7263h816A90551E9256M23356B13992
$$ 144008 309063 -273776 57751 213697 282922 -97263 -8816 190551 59256 482612 213992
15971G22307L5290J03859J82893K4574l62148k19550j10058j52800J5359J01759
$$ 722307 757597 861456 1044349 1068923 706775 487225 377167 224367 239726 341485
15961C41485j18437L736B761R8845k9872a96726N2545G7323K25717f6705M834
$$ 341485 223048 226784 2761 101606 71734 -196726 -144181 77323 303040 -66705 -61871
15950f1871B22248J79262E0677L8413b4489B8819a07836G0225J47830g7202F8523
$$ -61871 222248 401510 50677 89090 -24489 28819 -107836 70225 218055 -77202 68523
15938G4189K2661a45462N480k19357N9529a36074M9885H3960a77253d9830F6855
$$ 74189 96850 -145462 -139982 -359339 -299810 -136074 -86189 83960 -177253 -49830 66855
15926D28039C8451a825A29113b19A50588A2708d35236a28391F8026N8859m8078
$$ 428039 38451 -1825 129113 -219 150588 12708 -435236 -128391 68026 126885 78807
15915G8807f4194A04000J00171c8039A42539O5316a40356A26102a589j51834A18253
$$ 78807 -64194 104000 204171 -38039 142539 207855 -140356 126102 -1589 -153423 118253
15903D36686A22205r301b20884g136j58431m4978n6095H3737J33760c75571C11670
$$ 436686 122205 112904 -220884 -7136 -165567 -210545 -266640 83737 217497 -375571 311670
15891a3317j84514n3914A98698a43022d6780j24756j22642A36213O6317r4306
$$ -13317 -197831 -251745 198698 -143022 -46780 -171536 -294178 136213 202530 108224
15881A08224a27080j19852i885A84174a43214e3809A62871a15460A65429M4226
$$ 108224 -127080 -246932 -9885 184174 -143214 -53809 162871 -115460 165429 209655
15871B09655d1774A43735n6321i2369C9164a97022H3548b23662A37700o0264g5373
$$ 209655 -41774 143735 87414 -92369 39164 -197022 83548 -223662 137700 77436 -75373
15859g9500a8578c111k56175A64236C1298j3222P180J9993g0525k9262a1288j11083
$$ -79500 -18578 -3111 -259286 164236 31298 18076 25256 45249 -70525 -99787 -11288 -122371
15847a22371I1796C1223K31788j10400g9012A50171a77315L4877A31213a26351
$$ -122371 91796 31223 263011 152611 -79012 150171 -177315 -142438 131213 -126351
15836d05153b00340b9813p3992P727C02207a75141C37594f9827K4937D1424Q1671
$$ -405153 -200340 -29813 -103805 -96078 302207 -175141 337594 -69827 -44890 41424 123095
15825A23095b2356k23828B36008j11023a01196q5680N6532E5294c0035k21603
$$ 123095 -22356 -246184 236008 124985 -101196 -186876 -130344 55294 -30035 -251638
15815b51638B13671e437C79917h2867A6805a38379r3182B09322a17596A64838
$$ -251638 213671 -5437 379917 -82867 16805 -138379 -231561 209322 -117596 164838
15804a20173d5857j1376A58164M4811o7752b21843I7695j4546a59153c419E8281
$$ -120173 -45857 -57233 158164 202975 135223 -221843 97695 83149 -159153 -3419 58281
15792a24675b8473A10026O9324b33j8734C50508d41376c1179l42401B72371J53289
$$ -124675 -28473 110026 179350 -233 -18967 350508 -441376 -31179 -373580 272371 425660
15781D25660a63198B20846r0646k1110K19485F0638c3061l9682E231K71916a01139
$$ 425660 -163198 220846 130200 109090 328575 60638 -33061 -72743 5231 277147 -101139
15769a38140n654O4732j39690g1607E3830e6108n5506r2896A17689J34132a9730
$$ -138140 -143794 -79062 -218752 -71607 53830 -56108 -111614 -204510 117689 251821 -19730
15757a05173A03811a53867b9528k87924E000K491J73970c84544A18752J547g2092
$$ -105173 103811 -153867 -29528 -317452 5000 7491 181461 -384544 118752 120299 -72092
15745A91533a7138D35692c1352A81891b4347D28374A14878n5012M925K30683j26643
$$ 191533 -17138 435692 -31352 181891 -24347 428374 114878 59866 64791 295474 168831
15734A68831d7745A37490b12005R7659B67083j01021M5543a09532B13521H6320
$$ 168831 -47745 137490 -212005 -114346 267083 166062 211605 -109532 213521 86320
15723c2946D2786Q9952C404L45781G8702b67320a10558B81406j20167a23526m6921
$$ -32946 42786 132738 3404 349185 78702 -267320 -110558 281406 161239 -123526 -170447
15712a70447N7940L053A71897K51847d2669k56681J516K3882g8696l5028H2362
$$ -170447 -112507 -109454 171897 423744 -42669 -299350 -297834 -273952 -78696 -113724 82362
15700a72702J5847j91178I411O1686k331C0614I741R369b02892A60261b79276
$$ -172702 -156855 -348033 9411 71097 68766 30614 9741 19110 -202892 160261 -279276
15688B88b55783E2146c900l0157j24477O6696K2515A15503D5305a81521f8950
$$ 288 -255783 52146 -3900 -34057 -158534 -91838 -69323 115503 45305 -181521 -68950
15676D7035a62278A23299L2744a63106O2234l9735c3608a5059A0111R6187l3005
$$ 47035 -162278 123299 156043 -163106 -100872 -140607 -33608 -15059 10111 106298 73293
15665G3293k8831b73559B43692h3570b5408A47343B435N1964a99827A3856J71970
$$ 73293 44462 -273559 243692 -83570 -25408 147343 2435 54399 -199827 13856 185826
15654A85826o4585J58832a72342A10117J8956c27602J31976k335Q5908A32092
$$ 185826 121241 280073 -172342 110117 129073 -327602 -195626 -197961 -112053 132092
15643D99029i8177j6546p696A82462e2259o9905B71392b26396b5812j12019I6306
$$ 499029 -98177 -114723 -122419 182462 -52259 -122164 271392 -226396 -25812 -137831 96306
15631a5534j75809A98849m1495f7207L0174D2617a80661C04955c0777P403p6455
$$ -15534 -191343 198849 157354 -67207 -37033 42617 -180661 304955 -30777 -23374 -99829
15620i9829A23055b39758b9762k1147E5231j493A6504a42642A59722o6854K1725
$$ -99829 123055 -239758 -29762 -50909 55231 53738 16504 -142642 159722 92868 114593
15609A14593m3658a2496p4548j9533L4801k13303J38541A18030j6921l2072e9834
$$ 114593 70935 -12496 -87044 -106577 -71776 -285079 -146538 118030 101109 69037 -59834
15597a05567A9841Q2190B9247a0512j55778g2399j3804c6125A53725A4818a66333
$$ -105567 19841 102031 29247 -10512 -166290 -72399 -86203 -36125 153725 14818 -166333
15585a76885B00373f5421K1069r4152B94655a98640O7624A75172c68395a12828
$$ -176885 200373 -65421 -44352 -138504 294655 -198640 -131016 175172 -368395 -112828
15574b83047b7476k6010B62803A19261A4383e1579C48525b27560b7409A09098
$$ -283047 -27476 -53486 262803 119261 14383 -51579 348525 -227560 -27409 109098
15563C0538J12717G299b25295I6180J57661A17737J58605p6322b53485l4435B32409
$$ 30538 143255 7299 -225295 96180 253841 117737 276342 200020 -253485 -287920 232409
15551a30012k0365l5315c7221A16898c3725A08324e4520r0981J6801G5894b6674
$$ -130012 -150377 -185692 -37221 116898 -33725 108324 -54520 -145501 -128700 75894 -26674
15539C17833a00258B75670a66478L0751N8559j15162B18247f7147n3998A68433
$$ 317833 -100258 275670 -166478 -135727 -77168 -192330 218247 -67147 -121145 168433
15528a69523A3997h1826K5063j00834p7408D92966a49118B67441b0739j78421
$$ -169523 13997 -81826 -56763 -157597 -235005 492966 -149118 267441 -20739 -199160
15518a99160b5278C2393J95341a180I0345j2070A4995o095J92310k5529a13243
$$ -199160 -25278 32393 227734 -1180 90345 78275 14995 8900 201210 175681 -113243
15506A03259b0864E2285a61995b340j41215f2697l18141B00573L3434A02744b39116
$$ 103259 -20864 52285 -161995 -2340 -143555 -62697 -380838 200573 234007 102744 -239116
15494C5854P0336J67921e679j55747A5054K65082l2403p8409k366a82548A28913
$$ 35854 106190 274111 -5679 -161426 15054 280136 247733 169324 166958 -182548 128913
15482b06105A38448j266K10143j60897L71630D0740N5158J79056C2046J56544
$$ -206105 138448 137182 347325 186428 558058 40740 95898 274954 32046 188590
15472A88590A3375g2871B02750K948j5582J0676d2948C7908b6078C07332I5544
$$ 188590 13375 -72871 202750 205698 190116 200792 -42948 37908 -26078 307332 95544
15460H8753M16471j74063J63109K59293C50098J91657E5591L22239b28075C8582
$$ 88753 505224 331161 494270 753563 350098 541755 55591 377830 -228075 38582
15449A87413B0016a2740l20745A19493a66801D90047A57103g6573n5356a9964
$$ 187413 20016 -12740 -333485 119493 -166801 490047 157103 -76573 -131929 -19964
15438c3374F1375K1473k1218a329j96086F3157G573b9351B69267b2532C74573
$$ -33374 61375 82848 61630 -1329 -197415 63157 7573 -29351 269267 -22532 374573
15426G21228K51259N8089q4581C33076J79099j26462j0719j06651a08439D92129
$$ 721228 972487 1030576 945995 333076 512175 385713 374994 268343 -108439 492129
15415A81343A8725J45269L3116o5379i1033A11981d5996K2450j83850K5427A35616
$$ 181343 18725 163994 197110 131731 -91033 111981 -45996 -23546 -207396 -181969 135616
15403a54994E6089a04631H9338b04868B34606n3562b8429I4158J6600A3321J59741
$$ -154994 56089 -104631 89338 -204868 234606 181044 -28429 94158 110758 13321 173062
15392A73062b08262i260n6296j8985C89033A42558J39782j2147e0072a8766C15152
$$ 173062 -208262 -9260 -65556 -84541 389033 142558 282340 270193 -50072 -18766 315152
15380a50177G1826K89921b9868B71459A10712N0604J08712b58897C15264B7904
$$ -150177 71826 361747 -29868 271459 110712 161316 270028 -258897 315264 27904
15369e9646o170j70466A7469b37039l6726l6377B57844H7788a8685C61516H0304
$$ -59646 -65816 -236282 17469 -237039 -273765 -310142 257844 87788 -18685 361516 80304
15357C79366J55393A36301n4582P4226K67062G9558L84267A84754L0953D4739
$$ 379366 534759 136301 81719 155945 423007 79558 463825 184754 215707 44739
15346C89380K2008j60639m3652r5719B1299R865N84014k88675I6679N7572C5798
$$ 389380 411388 250749 207097 111378 21299 31164 615178 326503 96679 154251 35798
15334B03389L9654J48244A53355Q116O3453O0699o2308J11681J1908p7636J09539
$$ 203389 243043 391287 153355 161471 224924 285623 223315 334996 346904 269268 378807
15323C78807K0573a29669A22811C3666h20q6739A55288J6428b07498j84965A88225
$$ 378807 399380 -129669 122811 33666 -820 -87559 155288 171716 -207498 -392463 188225
15311I1453J0131K23840b35617a5811A7281L9158d4466A31273B3820K77708E2021
$$ 91453 101584 325424 -235617 -15811 17281 56439 -44466 131273 23820 301528 52021
15299e2026H7695h6636F2025Q8017M9229k6885c3806D5245J31492F0373J49815
$$ -52026 87695 -86636 62025 150042 199271 172386 -33806 45245 176737 60373 210188
15288B10188N9565q1075g0041B56239A22057m9759j3910R5431P8673A4145J7895
$$ 210188 269753 188678 -70041 256239 122057 72298 58388 153819 232492 14145 32040
15277C2040P8673B6127A2435K86944A37782J09689C1449a0212C53264a44700A57401
$$ 32040 110713 26127 12435 299379 137782 247471 31449 -10212 353264 -144700 157401
15265C1123K0207a02219H7581M69829B14388f4133B3594K59545O7827i6841I3674
$$ 31123 51330 -102219 87581 557410 214388 -64133 23594 283139 350966 -96841 93674
15253B42451e1751a511m3407j410F1254f8463H5683O8741j3736q521D3090M61959
$$ 242451 -51751 -1511 -44918 -46328 61254 -68463 85683 154424 140688 132167 43090 505049
15241E05049a68831C24134a23438E23309E8477J5694h4237o809G1797c79836A37326
$$ 505049 -168831 324134 -123438 523309 58477 74171 -84237 -91046 71797 -379836 137326
15229C27048J71787N81727L42748j37758L51481J05373D55948K33210A80331N0116
$$ 327048 498835 1080562 1423310 1285552 1637033 1742406 455948 689158 180331 230447
15219B30447H1917a92236B1327J59303p2930a29907A46299L11165A87729D4453
$$ 230447 81917 -192236 21327 180630 107700 -129907 146299 457464 187729 44453
15208A38678r396b33954P5091J473G07648A60417P4784r8985d081I6767a08916
$$ 138678 129282 -233954 -158863 -157390 707648 160417 235201 136216 -4081 96767 -108916
15196a14536E3455J45513a53466B79708j16955c9283B46419O0726o9324a52468
$$ -114536 53455 198968 -153466 279708 162753 -39283 246419 307145 237821 -152468
15185d8371j74131B00910p9076i7931A11226c0707C715K49029q8078E3945a02293
$$ -48371 -222502 200910 121834 -97931 111226 -30707 3715 252744 164666 53945 -102293
15173c24069A74771P1293H9220k6671P0231n3597K1637i4758F6360P2577a17572
$$ -324069 174771 246064 89220 62549 132780 79183 100820 -94758 66360 138937 -117572
15161a695B33135J44437A63686L1436A7094J99783q3220c1101B26506a50900C16672
$$ -1695 233135 377572 163686 195122 17094 216877 133657 -31101 226506 -150900 316672
15149a3392l7507j32078C9724J74666i5619B06900o1972k1628J85269j32707o2223
$$ -13392 -50899 -182977 39724 214390 -95619 206900 144928 123300 308569 175862 113639
15138A13639O5118p7094N18988B76476A23171c63F5394O4192e2572j16532b0912
$$ 113639 178757 101663 620651 276476 123171 -363 65394 129586 -52572 -169104 -20912
15126B664L75648b02785B74951l2310d7655C67913j41315r5094d5591B66674a47692
$$ 2664 378312 -202785 274951 242641 -47655 367913 226598 131504 -45591 266674 -147692
15114c6844I5220K46492b5621D4188J12960M3931N9965b07684D70206A87042A2214
$$ -36844 95220 341712 -25621 44188 157148 201079 261044 -207684 470206 187042 12214
15102C82030A15741L05947j41375f902B09087o7975P7148j03616n5046f5210A61111
$$ 382030 115741 421688 280313 -6902 209087 141112 218260 114644 59598 -65210 161111
15090B13645q8703J31414a60091A32901O5563F7423J58005G8520b19768A07687
$$ 213645 124942 256356 -160091 132901 198464 67423 225428 78520 -219768 107687
15079a53297j10520B41201n9167a3379A43571Q6446k6673L2354J25719A59201
$$ -153297 -263817 241201 182034 -13379 143571 230017 203344 235698 361417 159201
15068a0996A73998N4555J56875j07685A33333B9537K80865A54525j118J0825d4210
$$ -10996 173998 228553 385428 277743 133333 29537 310402 154525 153407 164232 -44210
15056B48021j09999N2679a9261o5974B37426R0193n2786q0138e3826B58054L16793
$$ 248021 138022 190701 -19261 -85235 237426 327619 274833 194695 -53826 258054 574847
15045E74847j80209G3124J02344n8875q426L44396n8438p0652J39666j29480a7005
$$ 574847 394638 73124 175468 116593 108167 452563 394125 323473 463139 333659 -17005
15033B73931K74504k57777Q6036K52545B51744e8831D46802D2386K46245K716
$$ 273931 548435 290658 376694 629239 251744 -58831 446802 42386 288631 291347
15023B91347J51693j58636j5404J48946J38985k22475P7470P2924j14224K39027
$$ 291347 443040 284404 269000 417946 556931 334456 411926 484850 370626 609653
15013F09653L8981L29292l58603j77045K01951k54048N6060K70402k04069J65852
$$ 609653 648634 977926 619323 442278 644229 390181 446241 716643 512574 678426
15003F78426B94167M74066k59977A13385M69706A10033M66802B57461Q2295J83319
$$ 678426 294167 768233 508256 113385 583091 110033 576835 257461 339756 523075
14993E23075L4445k12922L01719k39766q4071J21482j03330C5223L01752L23040
$$ 523075 557520 344598 646317 406551 322480 443962 340632 35223 336975 660015
14983F60015k40021O3817K1681q729p7961L3103J5004K17580j01619K73050D14796
$$ 660015 419994 483811 505492 496763 418802 451905 466909 684489 582870 855920 414796
14971E3683M10979J2377K96214j40533J92741m12627J03057L18085j6767l6727
$$ 53683 464662 477039 773253 632720 825461 412834 515891 833976 817209 780482
14961G80482p2182J31642B45415J42866N9205J37813K38153j82775R9841j11643
$$ 780482 708300 839942 245415 388281 447486 585299 823452 640677 740518 628875
14951F28875j77177A13965M3205K24289J6566A71283J32972J9862K20988k13571
$$ 628875 451698 113965 157170 381459 398025 171283 304255 324117 545105 331534
14941C31534d278C34461j66033L31974J76212r6154j63108J36282l5323n9271
$$ 331534 -4278 334461 168428 500402 676614 580460 417352 553634 518311 459040
14931D59040L6700J93511G7836K43892L72766M44326j33480m81042A93092J4735
$$ 459040 495740 689251 77836 321728 694494 1138820 1005340 524298 193092 207827
14921B07827J68587K13309q692P6803j5715J08755K49672K13470L30715j04802
$$ 207827 376414 589723 581031 657834 642119 750874 1000546 1214016 1544731 1439929
14911A439929J53222k43182K83630J46375r3080l82133K15291L93763k8850J62965
$$ 1439929 1593151 1349969 1633599 1779974 1686894 1304761 1520052 1913815 1884965 2047930
14901B047930K27581k5431m22637j74350j23003m03988q6145k60229j84963l5379
$$ 2047930 2275511 2250080 1827443 1653093 1530090 1126102 1039957 779728 594765 559386
14891E59386j18839L14983l53930L821j36399O9609O8712j54809J86581M5616
$$ 559386 440547 755530 401600 405421 269022 338631 407343 252534 439115 484731
14881D84731r4102R2444n2065J88913K70374C15523q992J55065L22678r0424p3245
$$ 484731 390629 483073 431008 619921 890295 315523 306531 461596 784274 693850 620605
14870F20605m4079K86136j04584K43989D76394J38414L57964M7118l13658j74311
$$ 620605 576526 862662 758078 1002067 476394 614808 972772 1019890 706232 531921
14860E31921M9359k2422L25169k97667j8802o2926J14424n1914j09015M51115
$$ 531921 581280 558858 884027 586360 567558 504632 619056 567142 458127 909242
14850I09242J4843j14561j11258P9661p4728k78445L08080B46546L66767j54603
$$ 909242 924085 809524 698266 777927 703199 424754 732834 246546 613313 458710
14840D58710j13771J87974j18324p7383J99950K33972C73852M5316J98869J84958
$$ 458710 344939 532913 414589 337206 537156 771128 373852 419168 618037 802995
14830H02995j97697j69483L96435J43512K16121L6077L67634m80959j26310r9213
$$ 802995 605298 435815 832250 975762 1191883 1227960 1595594 1114635 988325 889112
14820H89112K67409m42415p4962K82244j45343J72361D67170K76091C02347M619
$$ 889112 1156521 714106 639144 921388 776045 948406 467170 743261 302347 306966
14810C06966N1884j2406K77735J95046J2888j53114L0158J23215k199C42962L56618
$$ 306966 358850 346444 624179 819225 832113 678999 709157 832372 830173 342962 699580
14799F99580p6311K05782k17280L37810m52350K52454R1046N8050k1179K0056
$$ 699580 623269 829051 611771 949581 497231 749685 840731 898781 877602 897658
14789H97658l4749k4203O8198l91318J6330K55069k25011K62879n2118l41426
$$ 897658 862909 838706 906904 515586 531916 786985 561974 824853 772735 431309
14779D31309L27329j56996p6462k36934M79932j84675K58900j69710j96130L58692
$$ 431309 758638 601642 525180 288246 768178 583503 842403 672693 476563 835255
14769H35255l43343J58519m9879J26063k89551L56905j07939M3448n7639K93749
$$ 835255 491912 650431 600552 726615 437064 793969 686030 729478 671839 965588
14759I65588k98293R46O58597o19167M1081L3358M33918l95287k39777K23567
$$ 965588 667295 668241 1326838 707671 748752 782110 1216028 820741 580964 804531
14749H04531M1388j39178J20549k24605L28432l92409O6367j8699q3233P0898
$$ 804531 845919 706741 827290 602685 931117 538708 605075 586376 503143 574041
14739E74041k6729J06821J68034m0948r7907j70847K85099C91894M25823C77289
$$ 574041 547312 654133 822167 781219 683312 512465 797564 391894 817717 377289
14728H39066C56673M39323p9579M04667l46536n4392M6067J12607K202j32388
$$ 839066 356673 795996 716417 1121084 774548 720156 766223 878830 881032 748644
14718G48644l0435L65480l08149K19733M79168j21374J62066k12529L39995j53041
$$ 748644 718209 1083689 775540 995273 1474441 1353067 1515133 1302604 1642599 1489558
14708A489558M9341N4151k03858m29094j0476K31503k81033L27645J24917l12609
$$ 1489558 1538899 1593050 1389192 960098 949622 1181125 900092 1227737 1352654 1040045
14698A040045m88283O83485k73978K50874k82056p861O53667n20527M58303l94848
$$ 1040045 551762 1235247 961269 1212143 930087 922226 1575893 1055366 1513669 1118821
14688A118821M37494m0987J19933M08303o60963K00978K22360m27744j52860j82977
$$ 1118821 1556315 1515328 1635261 2043564 1382601 1583579 1805939 1378195 1225335 1042358
14678A042358K42903l60456J6745j08491K02982L0268R5599k28938l01288K90796
$$ 1042358 1285261 924805 941550 833059 1036041 1066309 1161908 932970 631682 922478
14668I22478k4861L42128k19320j60731j26930J59049j0984n2549M99540k09703
$$ 922478 897617 1239745 1020425 859694 732764 891813 880829 828280 1327820 1118117
14658A118117k49211L00626j59923K46868j57840j44226J43807J18805m57567
$$ 1118117 868906 1169532 1009609 1256477 1098637 954411 1098218 1217023 759456
14649G59456K73795O2683q620p1713J14743k575j26334K69980r3621K33443k90789
$$ 759456 1033251 1095934 1087314 1015601 1130344 1127769 1001435 1271415 1177794 1411237 1120448
14638A120448L62316l00552L48088J59715j78059l18142p8531K40430j26702k23200
$$ 1120448 1482764 1182212 1530300 1690015 1511956 1193814 1115283 1355713 1229011 1005811
14628A005811L75568k67444K48170k31747J12600j88942K51707p6326K94239j00828
$$ 1005811 1381379 1113935 1362105 1130358 1242958 1054016 1305723 1229397 1523636 1422808
14618A422808j35717K03527m63549O17303k88767j91286J43060K26092m28414
$$ 1422808 1287091 1490618 1027069 1644372 1355605 1164319 1307379 1533471 1105057
14609A105057L10043o9945j6137n8546O2772K80955j64110K73496k1494M903l12316
$$ 1105057 1415100 1345155 1329018 1270472 1333244 1614199 1450089 1723585 1702091 1706994 1394678
14598A394678p8086n2040L06473K00033m25292J8828M43927k51769K00821j46244
$$ 1394678 1316592 1264552 1571025 1771058 1345766 1364594 1808521 1556752 1757573 1611329
14588A611329K362L0791J6576L5251K90477m95397O1297j11320K25193L65162
$$ 1611329 1613691 1644482 1661058 1696309 1986786 1491389 1552686 1441366 1666559 2031721
14578B031721m68825K11389J62019j441o7874P9546j80115K37330k6888j57695
$$ 2031721 1562896 1774285 1936304 1934863 1866989 1946535 1766420 2003750 1976862 1819167
14568A819167q246k97897N84855l52256M25272l97774J49479J86012k09682K14372
$$ 1819167 1810921 1513024 2097879 1745623 2170895 1773121 1922600 2108612 1898930 2113302
14558B113302j17428L6423L72003j50625K61737j7283j87964j010j26656j42370
$$ 2113302 1995874 2032297 2404300 2253675 2515412 2498129 2310165 2309155 2182499 2040129
14548B040129M83205J81812j43467K56962J45989J26790K03373L10617k0932P74810
$$ 2040129 2523334 2705146 2561679 2818641 2964630 3091420 3294793 3605410 3584478 4359288
14538D359288J41526N25139J107436R70325J887430M021043O551440J0724836
$$ 4359288 4500814 5025953 6133389 7103714 8991144 13012187 19563627 30288463
14530C0288463L079076j4223941o629028m366503k002108r98200l98953N00817
$$ 30288463 33367539 19143598 12514570 8148067 6145959 5147759 4748806 5249623
14522E249623k78172j096744n96529l99336m99857K88106k82201j02679M37151
$$ 5249623 4971451 3874707 3278178 2878842 2378985 2667091 2384890 2282211 2719362
14513B719362k97354K96520m17565O9652K31431l4812j82289p9093L33040r5535
$$ 2719362 2422008 2718528 2300963 2370615 2602046 2567234 2384945 2305852 2638892 2543357
14503B543357j90114j23753J01835O58696l34322k25410J61032M78720m22253
$$ 2543357 2353243 2229490 2331325 2990021 2655699 2430289 2591321 3070041 2647788
14494B647788O4141K34256J37615l458k19741j27265J84850J83472j65952K10135
$$ 2647788 2711929 2946185 3083800 3080342 2860601 2733336 2918186 3101658 2935706 3145841
14484C145841q9060L5929K15177k388L5244j83504K66994k8093N2682J58573K76719
$$ 3145841 3056781 3092710 3307887 3305499 3340743 3157239 3424233 3396140 3448822 3607395 3884114
14473C884114k83634N9546k63701N12776m71090M01528J61145p4768j73502J89896
$$ 3884114 3600480 3660026 3396325 3909101 3438011 3839539 4000684 3925916 3752414 3942310
14463C942310J5466L54215j14727M3051M32247m79726Q3923J02445J43419L19862
$$ 3942310 3957776 4311991 4197264 4240315 4672562 4192836 4276759 4379204 4522623 4842485
14453D842485l95285K58249k13925M9242L57964q79k97600J10239J54044j91959
$$ 4842485 4447200 4705449 4491524 4540766 4898730 4897851 4600251 4710490 4864534 4672575
14443D672575O82771m27802K68774j95326L72055k70123O46717j09114k39710
$$ 4672575 5355346 4927544 5196318 5000992 5373047 5102924 5749641 5640527 5400817
14434E400817N61382m16608M49502R717j06120k37290K13373K86540k15288J78732
$$ 5400817 5962199 5545591 5995093 6004810 5898690 5661400 5874773 6161313 5946025 6124757
14424F124757K91748K49872l34548M19458L1210j46204J60355J08419j6138M69361
$$ 6124757 6416505 6666377 6331829 6751287 6782497 6636293 6796648 6905067 6888929 7358290
14414G358290K38776j00816L41968m97169O67329M04552J4604m40769M72138M59430
$$ 7358290 7597066 7496250 7838218 7341049 8008378 8412930 8427534 7986765 8458903 8918333
14404H918333l12638M8876L71708K15515q8430O064j51756n5077K40141K41248
$$ 8918333 8605695 8654571 9026279 9241794 9153364 9159428 9007672 8952595 9192736 9433984
14394I433984K15538K15061J42757J07115L34401K26421K29352k4106K4097J50179
$$ 9433984 9649522 9864583 10007340 10114455 10448856 10675277 10904629 10880523 10904620 11054799
14384A1054799N65242l52714L1M99173j17896M0582K01282N66979l8136N28084
$$ 11054799 11620041 11267327 11267358 11766531 11648635 11689217 11890499 12457478 12419342 12947426
14374A2947426J04234K45915L19792K23775Q4122M57179L77840k3111K90727P00821
$$ 12947426 13051660 13297575 13617367 13841142 13925264 14382443 14760283 14737172 15027899 15728720
14364A5728720k0760P12817m41404L24537M35389O05980N08527j71538M36355
$$ 15728720 15707960 16420777 15979373 16303910 16739299 17345279 17853806 17682268 18118623
14355A8118623L86848O36029N58024L90886J77444O97412M26922J35148Q61953
$$ 18118623 18505471 19141500 19699524 20090410 20267854 20965266 21392188 21527336 22389289
14346B2389289K51323M44777M14544K21230Q24106J52769J006978O37044Q40384
$$ 22389289 22640612 23085389 23499933 23721163 24545269 24698038 25705016 26342060 27182444
14337B7182444P07396L43182Q47119N58195P26775J012819O70678P47882R90021
$$ 27182444 27889840 28233022 29080141 29638336 30365111 31377930 32048608 32796490 33786511
14328C3786511J020757J171854Q97715Q50688Q28412J354913J282781J339239
$$ 33786511 34807268 35979122 36876837 37727525 38555937 39910850 41193631 42532870
14320D2532870R76718J080820J503100J330707J475060J770582J024541K093386
$$ 42532870 43509588 44590408 46093508 47424215 48899275 50669857 51694398 53787784
14312E3787784J375952K347855J398414K479970J762242K348705K211921K656819
$$ 53787784 55163736 57511591 58910005 61389975 63152217 65500922 67712843 70369662
14304G0369662K813269K400423K710831K793868L211202L537502L351840L260258
$$ 70369662 73182931 75583354 78294185 81088053 84299255 87836757 91188597 94448855
14296I4448855M228654L909289M160019M984953M644740N266213M920611O344770
$$ 94448855 98677509 102586798 106746817 111731770 116376510 121642723 126563334 132908104
14288A32908104O020308O197662O857377P519045P420743P986023Q916225Q991864
$$ 132908104 138928412 145126074 151983451 159502496 166923239 174909262 183825487 192817351
14280A92817351R667023R959030J0648211J1614747J2245621J2366633J3369278
$$ 192817351 202484374 212443404 223091615 234706362 246951983 259318616 272687894
14273B72687894J3849007J4249434J4929125J5236726J5222458J5142575J4737789
$$ 272687894 286536901 300786335 315715460 330952186 346174644 361317219 376055008
14266C76055008J4076314J3415078J2069928J1022793R566274Q846328P844484
$$ 376055008 390131322 403546400 415616328 426639121 436205395 445051723 452896207
14259D52896207O639466O126525K785361J53605R4135l628884q395436o903608
$$ 452896207 459535673 465662198 468447559 468601164 468695299 465066415 456670979 449767371
14251D49767371o104674q898441j1649779j1496357j1876687j3664224j3083539
$$ 449767371 443662697 434764256 423114477 411618120 399741433 386077209 372993670
14244C72993670j3703605j4298925j4137632j3788528j2660084j3154994j3125822
$$ 372993670 359290065 344991140 330853508 317064980 304404896 291249902 278124080
14237B78124080j2552730j2218492j1875624j0580845r970533j1152480j1070277
$$ 278124080 265571350 253352858 241477234 230896389 220925856 209773376 198703099
14230A98703099r977341r275308q861798q077564q313959p356396o662636o201632
$$ 198703099 188725758 179450450 170588652 162511088 154197129 146840733 140178097 133976465
14222A33976465o507847n516329n221809n119936m779234m218257m091414m117426
$$ 133976465 127468618 121952289 116730480 111610544 106831310 102613053 98521639 94404213
14214I4404213l836745l347333l652211l248784l121482k496590k717649k706424
$$ 94404213 90567468 87220135 83567924 80319140 77197658 74701068 71983419 69276995
14206F9276995k493893k096204k477610j791394k164730j862331j933550j591942
$$ 69276995 66783102 64686898 62209288 60417894 58253164 56390833 54457283 52865341
14198E2865341j381178j767654j548368j767804r75467j409892q02390r92844
$$ 52865341 51484163 49716509 48168141 46400337 45424870 44014978 43212588 42219744
14190D2219744j693449j026308j145751j327197p01335l09821j537892j004901
$$ 42219744 40526295 39499987 38354236 37027039 36325704 36015883 34477991 33473090
14182C3473090n93867j200729n21397q95480o94352p41187l20334o08917p39242
$$ 33473090 32879223 31678494 31157097 30261617 29567265 28826078 28505744 27896827 27157585
14173B7157585q52148m89161p24118l05084o59766m33506n43546q68649l35939
$$ 27157585 26305437 25816276 25092158 24787074 24127308 23693802 23150256 22281607 21945668
14164B1945668k63885k08195o12024j75983j051443J31661q05694j53969l50680
$$ 21945668 21681783 21473588 20861564 20685581 19634138 19765799 18960105 18806136 18455456
14155A8455456l27634M7570p03134j19948l89442l71674p31277J85233l71488
$$ 18455456 18127822 18175392 17472258 17352310 16962868 16591194 15859917 16045150 15673662
14146A5673662k34727l48213l00754m55631J69974o69163L82972l52103k39170
$$ 15673662 15438935 15090722 14789968 14334337 14504311 13835148 14218120 13866017 13626847
14137A3626847o30973O8095m42097L416k96233l07145j08004j60303j80825M23018
$$ 13626847 12995874 13063969 12621872 12625288 12329055 12021910 11913906 11753603 11572778 11995796
14127A1995796r95351L5525n87892K39671J49486l35822l73590k8723j72882m97128
$$ 11995796 11000445 11035970 10448078 10687749 10837235 10501413 10127823 10099100 9926218 9429090
14117I429090O08924p90707j22996L80119n17301j58360J15197q5381m39316K33355
$$ 9429090 10038014 9247307 9124311 9504430 8987129 8828769 8943966 8858585 8419269 8652624
14107H652624L349n32826J48722j71510J98146l00231Q0109j72308l66105P4729
$$ 8652624 8655973 8123147 8271869 8100359 8298505 7998274 8078383 7906075 7539970 7614699
14097G614699n88573Q7415O1840j45022M31090p39910p1607o5174L27417l12050
$$ 7614699 7026126 7113541 7175381 7030359 7461449 6721539 6649932 6584758 6912175 6600125
14087F600125J81172k99645j21901J00999l4262j90531p7193j39161j46609m0866
$$ 6600125 6781297 6481652 6359751 6460750 6426488 6235957 6158764 6019603 5872994 5832128
14077E832128k0119Q3691k18749k15150K382Q0520j48057K2456L7276m82079K68569
$$ 5832128 5812009 5895700 5676951 5461801 5464183 5544703 5396646 5419102 5456378 4974299 5242868
14066E242868j85230j22683K33180m50287O15798k11566k30175O2097l2469j00168
$$ 5242868 5057638 4934955 5168135 4717848 5333646 5122080 4891905 4954002 4921533 4821365
14056D821365k88427M3944j12994p1305k0578K55286j8747l82334M81408q6064
$$ 4821365 4532938 4576882 4463888 4392583 4372005 4627291 4608544 4226210 4707618 4621554
14046D621554j93366j05993N34392n67266O3961j09855K48671n12127n326j55057
$$ 4621554 4428188 4322195 4856587 4289321 4353282 4243427 4492098 3979971 3974645 3819588
14036C819588o3937L08386m14485p0380P386N60731n13212p4136n398k02310N40168
$$ 3819588 3755651 4064037 3649552 3579172 3586558 4147289 3634077 3559941 3554543 3352233 3892401
14025C892401l42911l5510k68393N3782K44307k70563K04137K9451p2922j01041
$$ 3892401 3549490 3513980 3245587 3299369 3543676 3273113 3477250 3506701 3433779 3332738
14015C332738o847k11855j42538L39138l22238l9006L40775q5714l21938j41158
$$ 3332738 3325891 3114036 2971498 3310636 2988398 2949392 3290167 3204453 2882515 2741357
14005B741357J91815j09133k38251K55877p1937l91608L34165M28314n34719j68106
$$ 2741357 2933172 2824039 2585788 2841665 2769728 2378120 2712285 3140599 2605880 2437774
13995B437774K19583P2396k26119K96640l04981q9865p1723J75438j49777j25339
$$ 2437774 2657357 2729753 2503634 2800274 2495293 2405428 2333705 2509143 2359366 2234027
13985B234027l2994M92314j91199L7758r9758N5535J79344O2392K74892O42128
$$ 2234027 2201033 2693347 2502148 2539906 2440148 2495683 2675027 2737419 3012311 3654439
13975C654439Q86690R39307K742617N839851J0880472J0121324j1373344p733726
$$ 3654439 4541129 5480436 8223053 14062904 24943376 35064700 23691356 15957630
13967A5957630m294855l005141j938341j386098o82111k89912k79060n68093j020
$$ 15957630 11662775 8657634 6719293 5333195 4651084 4361172 4082112 3514019 3512999
13958C512999k28768k08734k40943L37682l54231m1081k94396K85790j86202l6276
$$ 3512999 3284231 3075497 2834554 3172236 2818005 2776924 2482528 2768318 2582116 2545840
13948B545840o7940p9300k47504P7123j73934K32185p6553o3669j13022l1067
$$ 2545840 2477900 2398600 2151096 2228219 2054285 2286470 2209917 2146248 2033226 2002159
13938B002159k47633M68197k28935O9961N8318q5196l4297j84449L54225r9890
$$ 2002159 1754526 2222723 1993788 2063749 2122067 2036871 2002574 1818125 2172350 2072460
13928B072460m88185K41310K82451l92171L69393r7333j75335K58722p1005j80895
$$ 2072460 1584275 1825585 2108036 1715865 2085258 1987925 1812590 2071312 2000307 1819412
13918A819412J02688j36561J51838j78118K98479m06759M8369n8913j1122K858
$$ 1819412 1922100 1785539 1937377 1759259 2057738 1650979 1699348 1640435 1629313 1632171
13908A632171L1854q4338M6074K36073l62254J63107R9974j0089m45775M00767
$$ 1632171 1664025 1579687 1625761 1861834 1499580 1662687 1762661 1752572 1306797 1707564
13898A707564J25708n83114M35113m60657N01627l33585J08313l34903L33730
$$ 1707564 1833272 1250158 1685271 1224614 1726241 1392656 1500969 1166066 1499796
13889A499796k96296O24488j54127j91666p4632Q175m62833L23130l7067M38118
$$ 1499796 1203500 1827988 1673861 1482195 1407563 1415738 952905 1276035 1238968 1677086
13879A677086l75041K18699n6072l4572k49451M69462l98344J12225Q433j20474
$$ 1677086 1302045 1520744 1464672 1430100 1180649 1650111 1251767 1363992 1372425 1251951
13869A251951J55632J05895k79016O5822J35046k20397o556M9796N8511K14558
$$ 1251951 1407583 1513478 1234462 1300284 1435330 1214933 1208377 1258173 1316684 1531242
13859A531242j68535O6441j95612o4052o4481j5661J74135j48953J39113r5896
$$ 1531242 1362707 1429148 1233536 1169484 1105003 1089342 1263477 1114524 1253637 1157741
13849A157741k41974L32259j87035J39381k55057J31768K70158q1256l1709O6384
$$ 1157741 915767 1248026 1060991 1200372 945315 1077083 1347241 1265985 1234276 1300660
13839A300660l53382J91528j37426Q4746p209q6807q994P8459J6889R9024k62638
$$ 1300660 947278 1138806 1001380 1086126 1078917 992110 983116 1061575 1078464 1177488 914850
13828I14850N5320J5887l289j54082O7258J1981j48557N83539n96348K52121J14721
$$ 914850 970170 986057 982768 828686 895944 907925 759368 1342907 746559 998680 1113401
13817A113401q3933k39272J60794L53859l74333D40519N27893j70638L22159j75231
$$ 1113401 1029468 790196 950990 1304849 930516 440519 968412 797774 1119933 944702
13807I44702j0802J42591l81818K20523k03974R7307P7447J80546J17317l46450
$$ 944702 933900 1076491 694673 915196 711222 808529 885976 1066522 1183839 837389
13797H37389K76361k37032k95665K93194R198l12991L62283j50308j49568K09517
$$ 837389 1113750 876718 581053 874247 883445 570454 932737 782429 632861 842378
13787H42378j42970J08172B51248N31811m7469J34114J72575Q9996l08643Q7985
$$ 842378 699408 807580 251248 783059 735590 869704 1042279 1132275 823632 911617
13777I11617m05342J23718J14533L5058j36020M5206p4059J54927j71915q4482
$$ 911617 506275 629993 744526 779584 643564 688770 614711 769638 597723 513241
13767E13241J88886N4024L55420k82311j04618K06180l67505J9065k9578M59424
$$ 513241 702127 756151 1111571 829260 724642 930822 563317 582382 552804 1012228
13757A012228l00171L47190l66022M34934m33112C16129N23580j78777K59935
$$ 1012228 712057 1059247 693225 1128159 695047 316129 839709 660932 920867
13748I20867l17761J22601k0743q7200P3502L14466j97253J30689j24211m206
$$ 920867 603106 725707 704964 617764 691266 1005732 808479 939168 814957 810751
13738H10751j59908m0174K12569j33290J39774k81823O460K11602J5134k50452
$$ 810751 650843 610669 823238 689948 829722 547899 554359 765961 781095 530643
13728E30643m5225k8665K52660r3451K70701l8289k00524j22909O1617J2202J21090
$$ 530643 485418 456753 709413 615962 886663 848374 647850 524941 586558 598760 719850
13717G19850j53993J57629J38504l01479L95073j21660k29519K36538j63680j25594
$$ 719850 565857 723486 861990 560511 955584 833924 604405 840943 677263 551669
13707E51669j79579M14950j73653M4159l697j55156B31937M11607r9329j0940
$$ 551669 372090 787040 613387 657546 653849 498693 231937 643544 544215 533275
13697E33275j15067M54144B80269L94469p9182k68478M85743k54259M58560j79569
$$ 533275 418208 872352 280269 674738 595556 327078 812821 558562 1017122 837553
13687H37553j18801C49659K26229L3085j00092J9318J03369j2669k45662K95707
$$ 837553 718752 349659 575888 608973 508881 528199 631568 618899 373237 668944
13677F68944J27202p4901j64447o9082o1309J99384j43453B28109J58597K73123
$$ 668944 796146 721245 556798 487716 426407 625791 482338 228109 386706 659829
13667F59829j41292J72955l26306J24232K6257n7811o3714L50029r9333p5842
$$ 659829 518537 691492 365186 489418 515675 457864 394150 744179 644846 569004
13657E69004K7099B58913J91285J49979j21014Q1291k39860K3471L86222C38704
$$ 569004 596103 258913 450198 600177 479163 560454 320594 344065 730287 338704
13646E50278K3432o7408j91660M26233k16480Q9140j98804J4293J80869c3638
$$ 550278 573710 506302 314642 740875 524395 613535 414731 429024 609893 -33638
13635D78633N8346j32068K04627j24598a3054D03748p045j55712L06618B17917
$$ 478633 536979 404911 609538 484940 -13054 403748 396703 240991 547609 217917
13624E73236j79618j85119K61297o6490j70820J48700R4452m4928j2121L8327
$$ 573236 393618 208499 469796 403306 232486 381186 475638 430710 418589 456916
13614D56916K26955C11152P2911j41965r7297K25848K46517j23645B20225Q7422
$$ 456916 683871 311152 384063 242098 144801 370649 617166 493521 220225 307647
13604C07647j22417J79204k2384N1617J60738j78067O3065o6270J81542j32710
$$ 307647 185230 364434 342050 393667 554405 376338 439403 373133 554675 421965
13594D21965j51421G9134L6498J53564M8210n2279m736J43404K17636k16580j17366
$$ 421965 270544 79134 115632 269196 317406 265127 260391 403795 621431 404851 287485
13583B87485J12474J46782o0646j617J61762F1022L4354L45062L16751B90557
$$ 287485 399959 546741 486095 484478 646240 61022 95376 440438 757189 290557
13572D15235N3901l0185J47929L9092k39642m6488O4798J58523B72968J40957
$$ 415235 469136 438951 586880 625972 386330 339842 404640 563163 272968 413925
13562D13925n9990j9283L4371j31649Q8063M3518L3951J6360j62676N8585p898
$$ 413925 353935 334652 369023 237374 325437 368955 402906 419266 256590 315175 307277
13551C07277I6450J74735J72035J14291B35220K37376J3238J9405q5222H6723
$$ 307277 96450 271185 443220 557511 235220 472596 485834 505239 420017 86723
13540C99794j09370L9748K0812J48733j57028L9154j26361R830a29661D59805
$$ 399794 290424 330172 350984 499717 342689 381843 255482 265312 -129661 459805
13529A93815K3867K54620m3229m6930q1396J93798k21873J22859L69610k31914
$$ 193815 217682 472302 429073 382143 300747 494545 272672 395531 765141 533227
13519E33227k36277i5626B90854A34536K14620j20463K09277B13827Q8674P4587
$$ 533227 296950 -95626 290854 134536 349156 228693 437970 213827 302501 377088
13509C77088n1433J42351A12362J49252n4541H9941J02853n9571J95049j52470
$$ 377088 325655 468006 112362 261614 207073 89941 192794 133223 328272 175802
13499A75802A3841L95411j94917J60877J5934K7606f891B77216l7805O1453Q5194
$$ 175802 13841 409252 214335 375212 391146 418752 -6891 277216 239411 300864 386058
13488C86058Q8919G3418j9283L00048A70307j2517J62712A32634J47095f9090
$$ 386058 474977 73418 54135 354183 170307 157790 320502 132634 279729 -69090
13477A3271K59681P4139K04999A14731E111M99981A82528L9354J11691A01563
$$ 13271 272952 347091 552090 114731 5111 505092 182528 221882 333573 101563
13466C43032A11027d3251D58206k11607K08647A05025D916K63258J61402A84683
$$ 343032 111027 -43251 458206 246599 455246 105025 4916 268174 429576 184683
13455D61642A24083j1248J28544k5463L08482l5221H886K20438o6202R7195a0222
$$ 461642 124083 112835 241379 215916 524398 489177 8886 229324 163122 260317 -10222
13443H4632J87002H4137N22778A61188J41141n1468B0478J28239J96573q5354
$$ 84632 271634 84137 606915 161188 302329 250861 20478 148717 345290 259936
13433B59936J1057J85731j67577R277j3627J39508j82701o0944J46152n3138j06080
$$ 259936 270993 456724 289147 298424 284797 424305 241604 180660 326812 273674 167594
13422A67594m179l006J8618J23896K2683J22665g1575B93409G9847K18358A03245
$$ 167594 163415 160409 179027 302923 325606 448271 -71575 293409 79847 298205 103245
13410H0915L75675r8149j39247j9713J89166i209B49642m8578n0780a33788A02779
$$ 80915 456590 358441 219194 199481 388647 -9209 249642 201064 150284 -133788 102779
13398a87472B80291i705C84353F5176K95184a04629D2004J86696F0876J827J73260
$$ -187472 280291 -9705 384353 65176 360360 -104629 42004 228700 60876 62703 235963
13387B35963p2385m9789J8117n9053N06043A72512K6145R0311A13551K01290L00726
$$ 235963 163578 113789 131906 72853 578896 172512 198657 288968 113551 314841 615567
13376F15567A78203B2441J12349K9353k8676f335A64549C6722K41464q5937I0094
$$ 615567 178203 22441 134790 164143 135467 -6335 164549 36722 278186 192249 90094
13364D72411A71208D2555M24295j48689A46476P4522J52137A20552J65861M8752
$$ 472411 171208 42555 466850 318161 146476 220998 373135 120552 286413 335165
13354C35165A50064J13599m5429m5507J37709h8524E7557J70767K11687k07834
$$ 335165 150064 263663 218234 172727 310436 -88524 57557 228324 440011 232177
13344B32177n8042Q2971O4522l7452m9738j2816o0669K20234R2837j64136j09654
$$ 232177 174135 257106 321628 284176 234438 221622 160953 381187 474024 309888 200234
13333B00234h5597L8506E12000A35563L67564F1448L14348R3015q8451b8974A69662
$$ 200234 -85597 -47091 512000 135563 503127 61448 375796 468811 380360 -28974 169662
13321A84478J41800A10687J96848e3630B49867q1885M7601p7292B2111L28289
$$ 184478 326278 110687 307535 -53630 249867 167982 215583 138291 22111 350400
13311C50400j61416j4615i3372B21990K1626q6687p0140K00764q7935J58261l0438
$$ 350400 188984 174369 -93372 221990 243616 156929 86789 287553 199618 357879 327441
13300C27441C8712H331J1302L29945r5696n682M2106N0425r5054J7900r7106P6612
$$ 327441 38712 8331 19633 349578 253882 248200 290306 340731 245677 263577 166471 243083
13288B43083D4926J93576o6117L53115k44323A5299J5811K34052A10160K72226
$$ 243083 44926 238502 172385 525500 281177 15299 31110 265162 110160 382386
13278C82386l6297A12255K48460j20115k8800J49638E9796J38515M4043p8508
$$ 382386 346089 112255 360715 240600 211800 361438 59796 198311 242354 163846
13268A63846Q907k3919J85707A55107a23688A51270i921r3734A20636a7184I0101
$$ 163846 172753 148834 334541 155107 -123688 151270 -9921 -103655 120636 -17184 90101
13256B01480m5225J10022N7630f3507a878D86J39028O1423a75002A44115E7964
$$ 201480 156255 266277 323907 -63507 -1878 486 139514 200937 -175002 144115 57964
13244A28645o0777a51006B56329B9106a60002C70941A69495J63805D6490J40445
$$ 128645 67868 -151006 256329 29106 -160002 370941 169495 333300 46490 186935
13234A86935M8310a51418A23225k2738L7124f7615A82371H2010f9027K7108A19593
$$ 186935 235245 -151418 123225 100487 137611 -67615 182371 82010 -69027 -41919 119593
13222B60539C3319n180L23607a98415h0414A3306d7479A2817m322P7345L02948
$$ 260539 33319 28139 351746 -198415 -80414 13306 -47479 12817 8495 85840 388788
13211C88788A32434M13037a20534G5876J23847E6385J52704J75685j20423j3597
$$ 388788 132434 545471 -120534 75876 199723 56385 209089 384774 264351 250754
13201B50754O1809A41299L8176H3017J49077I5267Q8192b2829C6316A1813K05037
$$ 250754 312563 141299 179475 83017 232094 95267 183459 -22829 36316 11813 216850
13190B16850K4702a48856A64408q869o0348D6162J18118J3264D3340K77348P8774
$$ 216850 241552 -148856 164408 155539 95191 46162 164280 177544 43340 320688 399462
13179C99462c18433E7830J58078a86784A37894J88112J76198b04778a01685A79026
$$ 399462 -318433 57830 215908 -186784 137894 326006 502204 -204778 -101685 179026
13168a53401A19500C2345L3076d9439A09704F363G3K32125a23314E0353L22561
$$ -153401 119500 32345 65421 -49439 109704 6363 73 232198 -123314 50353 372914
13157C72914g3801A05416M0338f3402G5011R7094o9935K36427F2114J62422P3863
$$ 372914 -73801 105416 145754 -63402 75011 172105 102170 338597 62114 224536 298399
13146B98399a94338J5676r1182b8763I0365a46085B89812b82027A80627e2886
$$ 298399 -194338 -178662 -269844 -28763 90365 -146085 289812 -282027 180627 -52886
13135b04240F8975a84496B7019J54822g5257q594B38461b5747k73302B19923b51106
$$ -204240 68975 -184496 27019 181841 -75257 -83851 238461 -25747 -299049 219923 -251106
13123B61604L6183j04717F7053j6620M37775o7217H1369L0308a20853A03641R4169
$$ 261604 297787 193070 67053 50433 488208 420991 81369 111677 -120853 103641 197810
13112A97810i1248C77031b3666I6778l8030J43388I9250J48790M4115A14280A6584
$$ 197810 -91248 377031 -23666 96778 58748 202136 99250 248040 292155 114280 16584
13100A8970f8407H0013K59349I4561P0911a58472P4312k60671G8480b1928B05859
$$ 18970 -68407 80013 339362 94561 165472 -158472 -84160 -344831 78480 -21928 205859
13088a22463c162C07265D9993M2058m4907a15471A64995p4987d9538A44096k5854
$$ -122463 -3162 307265 49993 92051 47144 -115471 164995 90008 -49538 144096 118242
13077A18242e6622Q605A10484c2723k174A2041L6363J34130k9316a05201G9247
$$ 118242 -56622 -48017 110484 -32723 -34897 12041 48404 182534 153218 -105201 79247
13065A30323m3564L03647A72229o3227J65918q6186J12939k7741j34243J81288
$$ 130323 86759 390406 172229 109002 274920 188734 301673 273932 139689 320977
13055C20977l5128L8164J48897B3884J04965B4805J53479F47P430P0544o082i6011
$$ 320977 285849 324013 472910 23884 128849 24805 178284 647 8077 78621 72539 -96011
13042A557K05625p8408r945K99600B0053Q4970J55252A00309c2181j68305h7406
$$ 1557 207182 128774 118829 418429 20053 105023 260275 100309 -32181 -200486 -87406
13030b07684C05109j26222M3733e837B86220c13826O1231F0731J48383g3220P852
$$ -207684 305109 178887 222620 -5837 286220 -313826 -252595 60731 209114 -73220 -65368
13019f5368A45781c022A32263J28064D9815f5056q1782O0130B44163I4395B9495
$$ -65368 145781 -3022 132263 260327 49815 -65056 -146838 -86708 244163 94395 29495
13007c8871A10559a09205m1220A11768a9133e339j40351A9801K6233K50879H1188
$$ -38871 110559 -109205 -150425 111768 -19133 -5339 -145690 19801 46034 296913 81188
12995F0483K28378a6841B74146f0000k8606d4289o607A12953K5119F965b29080
$$ 60483 288861 -16841 274146 -60000 -88606 -44289 -50896 112953 138072 6965 -229080
12983c0756k209B70426a94245G0974a04304K7992B07293D5610J38154m8497a7105
$$ -30756 -32965 270426 -194245 70974 -104304 -76312 207293 45610 183764 135267 -17105
12971A3804L47901A35068P9983a82304g182H7739J51257a9377p5765B2871c20479
$$ 13804 361705 135068 215051 -182304 -7182 87739 238996 -19377 -95142 22871 -320479
12959i9019a2967B24186g9126k9048A4874K7614a25852M8997D42093B3090J33916
$$ -99019 -12967 224186 -79126 -108174 14874 42488 -125852 -76855 442093 23090 157006
12948A57006d1412A42796O7239b7805A7988b32929c4872B07954R0728I0405J0888
$$ 157006 -41412 142796 210035 -27805 17988 -232929 -34872 207954 298682 90405 101293
12937A01293K14761a71665K2935E5871b06983A52648a20719A21218i8221A46070
$$ 101293 316054 -171665 -148730 55871 -206983 152648 -120719 121218 -98221 146070
12926B66216H041K6710a88532H532L427a19094F1525J02202A0198g0093C52656
$$ 266216 8041 34751 -188532 8532 11959 -119094 61525 163727 10198 -70093 352656
12914G9991l7552a421n3585i925I3865k0596J0694l6507b1447r9764I3389a52476
$$ 79991 42439 -1421 -55006 -9925 93865 73269 83963 47456 -21447 -121211 93389 -152476
12901c6226A9719J57966a4701H9370J50605d8260A95587c3506k07887c2323k28580
$$ -36226 19719 177685 -14701 89370 239975 -48260 195587 -33506 -241393 -32323 -260903
12890b60903D06847E9086a95345F01663A23475b79160a35619j35365I1358b20481
$$ -260903 406847 59086 -195345 601663 123475 -279160 -135619 -270984 91358 -220481
12879B01761b92661A99432R3702d6423m2571L9502A91949a0865B43842l3675O9772
$$ 201761 -292661 199432 293134 -46423 -88994 -49492 191949 -10865 243842 210167 279939
12868B79939P5625j21661P8531b48734i7398j56431A34919c0589A52121j6188
$$ 279939 355564 233903 312434 -248734 -97398 -253829 134919 -30589 152121 135933
12858A35933k284A6506a38436C62225A30065b12488C4771a48239C33219K11161
$$ 135933 133649 16506 -138436 362225 130065 -212488 34771 -148239 333219 544380
12848E44380G5218J67842b43584A50280i9357B53993n9970H3686K90483c08056
$$ 544380 75218 243060 -243584 150280 -99357 253993 194023 83686 374169 -308056
12837B43517d6449A2090a56149e5624A34820c98703N3247H5321J15333a33762
$$ 243517 -46449 12090 -156149 -55624 134820 -398703 -345456 85321 200654 -133762
12826B26871k2665a90122F2142a80920B91460j0827c7409A1356J09313b36989
$$ 226871 204206 -190122 62142 -180920 291460 280633 -37409 11356 120669 -236989
12815A44600J00752K7722j4110a88074M4182B41658I6257f6309j96012A06025
$$ 144600 245352 273074 258964 -188074 -143892 241658 96257 -66309 -262321 106025
12804a5601B94960k2108f9544K8072B63984G6625a70916a8037p1029c2659k4199
$$ -15601 294960 272852 -69544 -41472 263984 76625 -170916 -18037 -89066 -32659 -56858
12793e6858i100D9758Q4390d7239k5817J9715q6399I4511C6200R5102M3591f689
$$ -56858 -9100 49758 134148 -47239 -73056 -53341 -139740 94511 36200 131302 174893 -6689
12780d0124E1169a57047P428b1638o8597F2197D757K34996k418i9487j09783Q1955
$$ -40124 51169 -157047 -149619 -21638 -90235 62197 4757 239753 237335 -99487 -209270 -127315
12768a27315n9144A18682a43342o7045B69653a13570A46151K04636A7789b46691
$$ -127315 -186459 118682 -143342 -210387 269653 -113570 146151 350787 17789 -246691
12757c8169C8289b33717K1673N0737I7021b04091i6657H74O5883R8544J69217
$$ -38169 38289 -233717 -212044 -161307 97021 -204091 -96657 874 66757 165301 334518
12746C34518H6137R1021b24613q1841A60609p2051J79125D1979Q7341c09768J09724
$$ 334518 86137 177158 -224613 -306454 160609 88558 267683 41979 129320 -309768 -200044
12735b00044k12871g1927A59717b5736C86375a71577l7828C69396a13401b6593
$$ -200044 -412915 -71927 159717 -25736 386375 -171577 -209405 369396 -113401 -26593
12724E5978a31869b0985D2399a43079j51406E00796C4896j2800b34891h6156l14223
$$ 55978 -131869 -20985 42399 -143079 -294485 500796 34896 22096 -234891 -86156 -400379
12713d00379a27248C82859c3584J5084B5013b69481A46819H818a75817A30302
$$ -400379 -127248 382859 -33584 -18500 25013 -269481 146819 8818 -175817 130302
12702B4885c36111a06556C23225M7513e5658I3787a6366B07596b0571C28453m245
$$ 24885 -336111 -106556 323225 370738 -55658 93787 -16366 207596 -20571 328453 324208
12691C24208N3604j27519J87734a11775B62394j05119r154b69916C5212b18765
$$ 324208 377812 250293 438027 -111775 262394 157275 148121 -269916 35212 -218765
12680A79712D4317K16759b45158B07114a35239B25166n6604b9017B05395C6485
$$ 179712 44317 261076 -245158 207114 -135239 225166 168562 -29017 205395 36485
12669g9018k61468E4569Q4419J42934A07530a71856A90314A1657i6693A26836
$$ -79018 -340486 54569 138988 281922 107530 -171856 190314 11657 -96693 126836
12658B22169a52125g2455B5352K8019a47581H6057a80165B47868a93360h6977
$$ 222169 -152125 -72455 25352 53371 -147581 86057 -180165 247868 -193360 -86977
12647a05614c9836H5850J39946c07295A73243b01126B23092a82050H2631J21277
$$ -105614 -39836 85850 225796 -307295 173243 -201126 223092 -182050 82631 203908
12637B03908f5457p0595p6270E7384a08212A00581e4492H8330l7544e5708A6976
$$ 203908 -65457 -136052 -212322 57384 -108212 100581 -54492 88330 50786 -55708 16976
12625a94644J0156A93501h0932l3377H9228b72577R6525B55082p1836E7966r852
$$ -194644 -184488 193501 -80932 -114309 89228 -272577 -176052 255082 183246 57966 48114
12614D8114J36871k2951q333A486K39546f4597A52138J90838A30535b9528G1623
$$ 48114 184985 162034 153701 1486 241032 -64597 152138 342976 130535 -29528 71623
12602A23842D6110J49096f9743B64761b59128B0119P3929J88566j40382D3499
$$ 123842 46110 195206 -69743 264761 -259128 20119 94048 282614 142232 43499
12591H3934a08749A59528G676R4382a32272A06933M9323m9697M032a75213A44027
$$ 83934 -108749 159528 7676 102058 -132272 106933 156256 106559 110591 -175213 144027
12579a64961d2363F9920i619I1554J05301N1790r2537h2067q9705L8774c1955
$$ -164961 -42363 69920 -9619 91554 196855 248645 156108 -82067 -171772 -132998 -31955
12567I1376b07062F623a65941h051A3605K12976h8881C03614b6086A6890L84202
$$ 91376 -207062 6623 -165941 -8051 13605 226581 -88881 303614 -26086 16890 401092
12556D01092b17647A21442b03601D67916A03182b88509A33895a67908A29712E9946
$$ 401092 -217647 121442 -203601 467916 103182 -288509 133895 -167908 129712 59946
12545b8107l5734H7016R7723a35391M7429c7285D8740b26850d7568k0596A60931
$$ -28107 -63841 87016 184739 -135391 -87962 -37285 48740 -226850 -47568 -68164 160931
12533B2151b69091A2250a8726j64553b1978B15837E676i7966k2623k71232b7000
$$ 22151 -269091 12250 -18726 -183279 -21978 215837 5676 -97966 -120589 -391821 -27000
12521B07284b44981d8072D17858f8394J4861B5844L5159l871j904K44097g0408
$$ 207284 -244981 -48072 417858 -68394 -53533 25844 61003 57132 55228 299325 -70408
12509b28990m11850h4215A46616a55143a334C45809b5642o9575A98921b06704
$$ -228990 -640840 -84215 146616 -155143 -1334 345809 -25642 -95217 198921 -206704
12498B3244i835F6343g2374G2579b54256D5076a56030q306D5087b45300P8503
$$ 23244 -9835 66343 -72374 72579 -254256 45076 -156030 -164336 45087 -245300 -166797
12487a66797B72250i8784D0593a89088B66448A05089J7589J17281H5850n927A882
$$ -166797 272250 -98784 40593 -189088 266448 105089 122678 239959 85850 79923 1882
12475g665p5483a6904A08606g7454A03075J57231o5834j5510c4969k3101j72830
$$ -7665 -83148 -16904 108606 -77454 103075 260306 194472 178962 -34969 -58070 -230900
12464b30900l2028A76171J27513a74785b4461r487A84450F2946K55788j12186
$$ -230900 -262928 176171 303684 -174785 -24461 -33948 184450 62946 318734 206548
12454B06548a41496A43591e5049n4136c8630H7826Q0046Q243L9187a99478B30857
$$ 206548 -141496 143591 -55049 -109185 -38630 87826 167872 176115 215302 -199478 230857
12442A29753m6044g2084r0116B0599d05668b7854G2674h5931k27459E9564R6700
$$ 129753 83709 -72084 -162200 20599 -405668 -27854 72674 -85931 -313390 59564 156264
12431A56264c8767l3619K7316j63629D5098i4024J9713A13121c07161f4061A05680
$$ 156264 -38767 -72386 -45070 -208699 45098 -94024 -74311 113121 -307161 -64061 105680
12419A07914f4201D0027N9309a25682K4855A75657A1229b07906G6529J62195e1499
$$ 107914 -64201 40027 99336 -125682 -100827 175657 11229 -207906 76529 238724 -51499
12407C22401D6636b18914B02214J31450b47937n4795l7099a9102A64083a504B22500
$$ 322401 46636 -218914 202214 333664 -247937 -302732 -339831 -19102 164083 -1504 222500
12395A88456F3825b1986l03714A85806j648d2107q5402B12863J82549a84254h0664
$$ 188456 63825 -21986 -325700 185806 184158 -42107 -127509 212863 395412 -184254 -80664
12383i8182A86148G9131a11328I4998e119B9384K14590F0150K75770c9701A23785
$$ -98182 186148 79131 -111328 94998 -5119 29384 243974 60150 335920 -39701 123785
12371I261J35679d9134C5752J52153a80438b2174A08208b34740C75692j21053
$$ 9261 144940 -49134 35752 187905 -180438 -22174 108208 -234740 375692 254639
12361B54639D9172M00799A06765O3767b10299j10616C35040A31991K19094H3133
$$ 254639 49172 449971 106765 170532 -210299 -320915 335040 131991 351085 83133
12350A42205b22038i7350A03219h5417q523q888G5984c8106C9632J75411a58467
$$ 142205 -222038 -97350 103219 -85417 -93940 -102828 75984 -38106 39632 215043 -158467
12338b53070a10803a5130B6660P523N3784m3143J29112a99204A18650b1762A65344
$$ -253070 -110803 -15130 26660 34183 87967 44824 173936 -199204 118650 -21762 165344
12326a9190k97536C54595c8395j70747B14221j06630N7434L1861e5772j43469
$$ -19190 -316726 354595 -38395 -209142 214221 107591 165025 196886 -55772 -199241
12316a99241Q4786C35972k929n8012b01774A64079J18671J03957A22387J3970
$$ -199241 -114455 335972 333043 275031 -201774 164079 282750 386707 122387 136357
12306A36357E3166J04993n9790j9566i5200C86633O145A33496b88480J04072B20260
$$ 136357 53166 158159 98369 78803 -95200 386633 392778 133496 -288480 -184408 220260
12294A70671j065K31440a06410F8833b5427j21920j23754R2211k61864d3960l61
$$ 170671 169606 401046 -106410 68833 -25427 -147347 -271101 -178890 -440754 -43960 -44321
12283d4321A30508f313C7557b74060C82213D6558O8465d2074q9437B63229b87762
$$ -44321 130508 -6313 37557 -274060 382213 46558 115023 -42074 -131511 263229 -287762
12271A57146F5523K50701q7233k5367b8286B33530f3391A65215d3885B07956J5910
$$ 157146 65523 316224 228991 203624 -28286 233530 -63391 165215 -43885 207956 223866
12260B23866A01992D5789J01176l6778C5890c946o725A51502K97490a0204B98929
$$ 223866 101992 45789 146965 110187 35890 -3946 -10671 151502 448992 -10204 298929
12248D30591A13313M66950a93477C5440K64492c0592A75815a79422A08360J548
$$ 430591 113313 580263 -193477 35440 299932 -30592 175815 -179422 108360 109908
12238A09908l3275i3284D29021a37950A96294R9978K31431E8915d4607A6125J80875
$$ 109908 76633 -93284 429021 -137950 196294 296272 527703 58915 -44607 16125 197000
12227A97000J8580a17805j3516B29177A742P7396J92741b7844D07857H8590H550
$$ 197000 215580 -117805 -131321 229177 1742 79138 271879 -27844 407857 88590 8550
12215D5154L0763J78494H4169e0993a9616B84580C0310J83371l0498j0362L54789
$$ 45154 75917 254411 84169 -50993 -19616 284580 30310 213681 183183 172821 527610
12204E27610c6939B28729r3971L87863H8820J2623K29778j3144A16745b01773
$$ 527610 -36939 228729 134758 522621 88820 101443 331221 318077 116745 -201773
12193B80733J12142A06058l9745J56442A1594a04671e434k19406B08361N9444
$$ 280733 392875 106058 66313 222755 11594 -104671 -5434 -224840 208361 267805
12183B67805a27462A30837l9362J14747c78652B46685p6375p7424j97K50737j46045
$$ 267805 -127462 130837 91475 206222 -378652 246685 170310 92886 92689 343426 197381
12172A97381K11996A67445F8144A0904P3261J74270d5494E7586j8090J53393C6878
$$ 197381 409377 167445 68144 10904 84165 258435 -45494 57586 39496 192889 36878
12160h270o8284C04549j44426a9732A57005P3731K6091K9565a6566G8341Q7830
$$ -8270 -76554 304549 160123 -19732 157005 230736 256827 286392 -16566 78341 166171
12149A66171L5175L7145D7228j9259M929J41784g996j56710f5683B65105J62840
$$ 166171 201346 238491 47228 27969 32898 174682 -7996 -164706 -65683 265105 427945
12138D27945a03173f191o8644j50451B45854A4589G030d5482C5127K25143h8328
$$ 427945 -103173 -6191 -74835 -225286 245854 14589 7030 -45482 35127 260270 -88328
12126D4563a52923A45212a71063n625N9764I4699J3029l4224e6038B62155o8873
$$ 44563 -152923 145212 -171063 -176688 -116924 94699 107728 73504 -56038 262155 193282
12115A93282K8080Q5915a30651G3263C6478D045c23934A96713e5302A42573e1239
$$ 193282 221362 307277 -130651 73263 36478 4045 -323934 196713 -55302 142573 -51239
12103A68105m6893l8635P1012p3915Q6521J56650j32847p1504f1261G6293M01739
$$ 168105 121212 82577 153589 79674 166195 322845 189998 118494 -61261 76293 478032
12092D78032A50788a36912D5386f9322A18456D6348R3888q855L1407c26516D34042
$$ 478032 150788 -136912 45386 -69322 118456 46348 140236 131381 162788 -326516 434042
12080A67215J25526Q226E0384b297l62857A44782c79866G4439N7036b44049F2367
$$ 167215 292741 300967 50384 -2297 -365154 144782 -379866 74439 131475 -244049 62367
12068e9971a9800o6237b0355A02022C2816c8929C5800K07466D8804N7093K39722
$$ -59971 -19800 -86037 -20355 102022 32816 -38929 35800 243266 48804 105897 345619
12057C45619p8183l9245L9332c1036E49970k25472q3710n2744e9833A58334K02197
$$ 345619 267436 228191 267523 -31036 549970 324498 240788 188044 -59833 158334 360531
12046C60531j00875f8130j1249J1505c3423A88348j141l1610K50e2839C77993
$$ 360531 259656 -68130 -79379 -67874 -33423 188348 187207 155597 155847 -52839 377993
12034B0239f563C2008J30986a36473n3704d0383j96483B30997C1782d32193H723
$$ 20239 -6563 32008 162994 -136473 -190177 -40383 -236866 230997 31782 -432193 8723
12022c3301k12997A8383b06924O1703B66602e7277G5848I172a6137k17405B31835
$$ -33301 -246298 18383 -206924 -145221 266602 -57277 75848 9172 -16137 -233542 231835
12010B0083J84199g0414G858K15020a21869A6273g6429B877M04861A44517M7750
$$ 20083 204282 -70414 7858 222878 -121869 16273 -76429 2877 407738 144517 192267
11999A92267J43262G0784M33779k19054a89526A28070e9312a5625C9534J1083
$$ 192267 335529 70784 504563 285509 -189526 128070 -59312 -15625 39534 50617
11989E0617a89836L5724b7086p3158D4771c6424A13863a72137A37722J25653a6822
$$ 50617 -189836 -154112 -27086 -100244 44771 -36424 113863 -172137 137722 263375 -16822
11977A04136j1415m1645e9939j09005P1885a2645j87257c2084B4315a03814B58745
$$ 104136 92721 51076 -59939 -168944 -97059 -12645 -199902 -32084 24315 -103814 258745
11965B05803M201b29266D9035Q0878l3289D2997b12820Q5822j03151F0596a40629
$$ 205803 210004 -229266 49035 129913 96624 42997 -212820 -126998 -230149 60596 -140629
11953C13699H6333c92307B4198K02484J55783a18522o0806l3792B62345D0903
$$ 313699 86333 -392307 24198 226682 382465 -118522 -179328 -213120 262345 40903
11942G5144b25575C15364h0211K5978l14621a56469e1136D2944a86896H5285J536
$$ 75144 -225575 315364 -80211 -54233 -368854 -156469 -51136 42944 -186896 85285 86821
11931H6821E331b546A45500b40292B01263c10768J05553q4179b4879C35149A58661
$$ 86821 5331 -2546 145500 -240292 201263 -310768 -205215 -289394 -24879 335149 158661
11919b08021C0228f148A86063O899D3785A5295a41264k9921A2013b73215A0080
$$ -208021 30228 -6148 186063 192962 43785 15295 -141264 -171185 12013 -273215 10080
11907b13424c6922D26111A36722a67253M2997A96748d5477F5314a47647A12287
$$ -213424 -36922 426111 136722 -167253 -124256 196748 -45477 65314 -147647 112287
11896H74P0823c157j23700B80489K52999a43334l3172c1575B44068A17085e6475
$$ 874 71697 -3157 -126857 280489 533488 -143334 -176506 -31575 244068 117085 -56475
11884A24129j0796L2244a89003j50140i3464j2933l4272m9154B6878Q7512b81891
$$ 124129 113333 145577 -189003 -339143 -93464 -106397 -140669 -189823 26878 114390 -281891
11872a25873H2953j1065b45315m1493a08742n078c9983j56616D5639a76869j76174
$$ -125873 82953 71888 -245315 -286808 -108742 -113820 -39983 -196599 45639 -176869 -353043
11861c53043A6407a57203A59494a58838D04675j79109i9153k1837n4600j52807
$$ -353043 16407 -157203 159494 -158838 404675 225566 -99153 -120990 -175590 -328397
11851c28397J30879A22634M6929E8929a08238H3437e2958H564J60828L6866q8920
$$ -328397 -197518 122634 169563 58929 -108238 83437 -52958 8564 169392 206258 117338
11840A17338a23498A48458A0044d76243A32752b2088A45809b41491I872a47518
$$ 117338 -123498 148458 10044 -476243 132752 -22088 145809 -241491 9872 -147518
11829g8982k22D8109h3417K8819j58042B10715a44675E1096a67995j17586j0298
$$ -78982 -79204 48109 -83417 -54598 -212640 210715 -144675 51096 -167995 -285581 -295879
11818b95879A42150g6190k438j23244C87815i8483A4916d14196A56721b13688
$$ -295879 142150 -76190 -78628 -201872 387815 -98483 14916 -414196 156721 -213688
11807a59489e2379p2826A75722c0479j38776j35152p5103f5169A59674E1194g5797
$$ -159489 -52379 -125205 175722 -30479 -169255 -304407 -379510 -65169 159674 51194 -75797
11795i8150c6172A98114P686b33294j2688Q0403F7937a11888r9643k5740a18614
$$ -98150 -36172 198114 205800 -233294 -245982 -165579 67937 -111888 -211531 -237271 -118614
11783a91037E440N9876a49014C604M8469J28366c47266a45862C4297e4990j40310
$$ -191037 5440 65316 -149014 3604 52073 180439 -347266 -145862 34297 -54990 -195300
11772a95300q2317i8824k01252h9909C5078f4684k6144A94798d1616C06938j01076
$$ -195300 -277617 -98824 -300076 -89909 35078 -64684 -90828 194798 -41616 306938 205862
11761B05862B6224A062K92571d7373B6196L667A1068a79038b3125n4396k14521
$$ 205862 26224 1062 293633 -47373 26196 29863 11068 -179038 -23125 -77521 -292042
11750b92042a36518n7882b7135A76a47642c7470j77659g3248m870l2239A80334
$$ -292042 -136518 -194400 -27135 176 -147642 -37470 -215129 -73248 -78118 -110357 180334
11738d08012N8345A798i8202E0027e941k16904A22514b59000J03471A94816g4327
$$ -408012 -349667 1798 -98202 50027 -5941 -222845 122514 -259000 -155529 194816 -74327
11726C9653J14235a02191C4184J64307m6560G1444K72405j63066J42628j34547
$$ 39653 153888 -102191 34184 198491 151931 71444 343849 180783 323411 188864
11716A88864P0728j8125A11032a31815B66591c9199G981a19340A62715J74677
$$ 188864 259592 241467 111032 -131815 266591 -39199 7981 -119340 162715 337392
11706C37392a86904L7485C9724a49645I379a1361F9518a10815q1832D7871L2805
$$ 337392 -186904 -149419 39724 -149645 9379 -11361 69518 -110815 -192647 47871 80676
11695H0676A834K54154b0006k67255a2946E7483a79463A67457J14462J21994j81930
$$ 80676 1834 255988 -20006 -287261 -12946 57483 -179463 167457 281919 403913 221983
11684B21983A05879A3356J19030e45897a17528A24907a61123A72707h8981j77841
$$ 221983 105879 13356 132386 -545897 -117528 124907 -161123 172707 -88981 -266822
11674b66822G9184j6198N0646b3413A38307o1497f4982F4554K05471a24361C57676
$$ -266822 79184 62986 113632 -23413 138307 76810 -64982 64554 270025 -124361 357676
11662A07193h3803B53617a90356p3640A6152f7041m6371d3407j2317A85701a16029
$$ 107193 -83803 253617 -190356 -263996 16152 -67041 -113412 -43407 -55724 185701 -116029
11650a88825A05543K54052q0941A37165g9082D0704c35918G6200c3499l15651
$$ -188825 105543 359595 278654 137165 -79082 40704 -335918 76200 -33499 -349150
11640c49150i3627A65214Q306g8235r6517C80601A13782D1552K36920j18909A7088
$$ -349150 -93627 165214 173520 -78235 -174752 380601 113782 41552 278472 159563 17088
11628f9218C25869G9536g8263c2513G4572a63665M5620B73963b06220f9663j6604
$$ -69218 325869 79536 -78263 -32513 74572 -163665 -118045 273963 -206220 -69663 -86267
11617h6267k05416c0727j71344i1743B9079c17251A61267b63271A9127R0105p651
$$ -86267 -291683 -30727 -202071 -91743 29079 -317251 161267 -263271 19127 109232 101581
11606A01581J00886c5316a3889j1704C93702r7865a18046a4891A00523i8080k77073
$$ 101581 202467 -35316 -13889 -25593 393702 295837 -118046 -14891 100523 -98080 -375153
11595c75153c249F9725d9955H5019b44045d7902j07270B6059J4139b94330A72793
$$ -375153 -3249 69725 -49955 85019 -244045 -47902 -155172 26059 40198 -294330 172793
11583c85869b0029A03572J65789F9787k1359N759J38889E2906L44K36400f4194
$$ -385869 -20029 103572 269361 69787 48428 54187 193076 52906 53250 289650 -64194
11571B3462b20517H6610C711b62187B94472l4595A21738a04518G5092K44149J07358
$$ 23462 -220517 86610 3711 -262187 294472 259877 121738 -104518 75092 319241 426599
11560D26599B7831H790i9168d9500A13664b81222a00280B85748a13426q023C99967
$$ 426599 27831 8790 -99168 -49500 113664 -281222 -100280 285748 -113426 -121449 399967
11548a1698B6477a33175B0490a89986a3621j14150C209Q3544J2190J96299k4923
$$ -11698 26477 -133175 20490 -189986 -13621 -127771 3209 86753 98943 295242 270319
11537B70319c206j31332H6923J13625c4395j5332I4495a27750m41805g909F0433
$$ 270319 -3206 -134538 86923 200548 -34395 -49727 94495 -127750 -569555 -7909 60433
11525E9841K22401q0646q6213l4960c68675f4827a4611j05198e0333G8042K9044
$$ 59841 282242 201596 115383 80423 -368675 -64827 -14611 -119809 -50333 78042 107086
11514A07086b39466B44227a85076g7417I6465a01061a3263A07127O542B0094J02536
$$ 107086 -239466 244227 -185076 -77417 96465 -101061 -13263 107127 113669 20094 122630
11503A22630E2136a97556b6531j61891j71562g2593j7128n0090B74819B4463c1702
$$ 122630 52136 -197556 -26531 -188422 -359984 -72593 -89721 -139811 274819 24463 -31702
11491A39271f2496j03073B42618A17117a53760k22624A782a5836B18193p5376
$$ 139271 -62496 -165569 242618 117117 -153760 -376384 1782 -15836 218193 142817
11481A42817P0917a22272q4751A1656J0755J71323k7888J08792G2704b48983H90
$$ 142817 213734 -122272 -207023 11656 22411 193734 165846 274638 72704 -248983 890
11469b89075C4345J74438a44732N5871B3201b12368C48425A73993d6812B00501
$$ -289075 34345 208783 -144732 -88861 23201 -212368 348425 173993 -46812 200501
11458A01635K90226A65383P6849K54542A04095a34141H6318M1159k4265a14826
$$ 101635 391861 165383 242232 496774 104095 -134141 86318 127477 103212 -114826
11447a84410B41802J61243D1139J93324O7075e9053A22112j6332Q0672b8366r2976
$$ -184410 241802 403045 41139 234463 301538 -59053 122112 105780 186452 -28366 -121342
11436a21342G4463k8930J08304e0908F5776J95071A10690J29269a36670D1187
$$ -121342 74463 45533 153837 -50908 65776 260847 110690 239959 -136670 41187
11425B13163J01035k2041A12594J25564d2103H5025Q5752a1617j70071A63364
$$ 213163 314198 292157 112594 238158 -42103 85025 170777 -11617 -181688 163364
11414A74895q1529f6314m1704A30497K0646d0545j31316H7584K2830K6826a19880
$$ 174895 93366 -66314 -108018 130497 151143 -40545 -171861 87584 110414 137240 -119880
11402B90598g6494O151J0591p8683a9006A08072g8395i649k25013H652L3115f1524
$$ 290598 -76494 -70343 -59752 -138435 -19006 108072 -78395 -9649 -234662 8652 41767 -61524
11389c64382A2746K91601A26529a50934j4373C11412F5231J08379o2483c05653
$$ -364382 12746 304347 126529 -150934 -165307 311412 65231 173610 111127 -305653
11378c0930A02057e7467j2B02213a10965A70683b8106G5301M539b16823A43390
$$ -30930 102057 -57467 -57479 202213 -110965 170683 -28106 75301 79840 -216823 143390
11366i9587r0357l0821a06118a4415F3153J6615h2430j55757A26452M0196a44959
$$ -99587 -189944 -220765 -106118 -14415 63153 79768 -82430 -238187 126452 166648 -144959
11354B1610R3634d9739k97495f5700B1035a46740q0285A4068R1539a8492O818
$$ 21610 115244 -49739 -347234 -65700 21035 -146740 -227025 14068 105607 -18492 -11674
11343a1674j46309A48965a87842b4283j22561j50446c8498p0908C15300d2503
$$ -11674 -157983 148965 -187842 -24283 -146844 -297290 -38498 -109406 315300 -42503
11332c9784B23414a36553j4964B34823b06321C91727b48238f6396p2094A78334
$$ -39784 223414 -136553 -151517 234823 -206321 391727 -248238 -66396 -138490 178334
11321a41944j13460a15920A78152l2737i4673B23796b1073A73946a07945j52638
$$ -141944 -255404 -115920 178152 145415 -94673 223796 -21073 173946 -107945 -260583
11311b60583f5916A47034b68942B48953C1458j3999a72479h0249e28j32723A9464
$$ -260583 -65916 147034 -268942 248953 31458 17459 -172479 -80249 -528 -133251 19464
11299H3728a86058j28142J14987B01871d06371a03598B2690a65202C6075a80307
$$ 83728 -186058 -314200 -199213 201871 -406371 -103598 22690 -165202 36075 -180307
11288e2699j09157A73379a45097k16428B0962R00J54074e7779A74630a08301C75990
$$ -52699 -161856 173379 -145097 -361525 20962 21862 175936 -57779 174630 -108301 375990
11276i0532j83308L0270A51566a09458m8790A02519m2944a23451A31233J42512
$$ -90532 -273840 -243570 151566 -109458 -158248 102519 59575 -123451 131233 273745
11266B73745a53959b6273A62733a68587B3411c3839j34515A64634J55826o4011
$$ 273745 -153959 -26273 162733 -168587 23411 -33839 -168354 164634 320460 256449
11256B56449C091K698b9761A89123g9102j17501k71528A79340E6347P4848A9534
$$ 256449 3091 5789 -29761 189123 -79102 -196603 -468131 179340 56347 131195 19534
11244d7756a3006j97002C68960d80777a97240C77121a36948C6500a272E4792K77350
$$ -47756 -13006 -210008 368960 -480777 -197240 377121 -136948 36500 -1272 54792 332142
11233C32142b70256d6232l3308B59425E7302R2495d431A1314J93919G5592J0164
$$ 332142 -270256 -46232 -79540 259425 57302 149797 -4431 11314 205233 75592 85756
11222H5756c0531A67035g3729k76436a54265g588m844C31423f4089C5340a67443
$$ 85756 -30531 167035 -73729 -350165 -154265 -7588 -12432 331423 -64089 35340 -167443
11210a94563c0358C09398E2571K5940p38a20130I5238J47352r4532a49873q3510
$$ -194563 -30358 309398 52571 78511 77773 -120130 95238 242590 148058 -149873 -233383
11199b33383b6222o5767C25614b20970d5006c739C8779i609o4189r1159m1106
$$ -233383 -26222 -91989 325614 -220970 -45006 -3739 38779 -9609 -73798 -164957 -206063
11188b06063b0627j95246n51f8153A4412a02838j314k08371l1679h2202E1452
$$ -206063 -20627 -215873 -216424 -68153 14412 -102838 -104152 -312523 -344202 -82202 51452
11176a613k17475J8250B49237B1576Q0482m1651a72094E9619d99179J93364I7100
$$ -1613 -219088 -200838 249237 21576 102058 60407 -172094 59619 -499179 -305815 97100
11164a20807b9992A4556b11890i0077a5810r9839C7668a6276k25408B08710A8192
$$ -120807 -29992 14556 -211890 -90077 -15810 -115649 37668 -16276 -241684 208710 18192
11152A5590L45843I6022h8814B9015b15627J02843A62997a24324C8832n992J93575
$$ 15590 361433 96022 -88814 29015 -215627 -112784 162997 -124324 38832 32840 226415
11141B26415h508j56565d0359I4952O1940D9240b64526k94169f6820b3505k95769
$$ 226415 -8508 -165073 -40359 94952 156892 49240 -264526 -558695 -66820 -23505 -319274
11130c19274J09484h8510j7740A33966a6261L490j60353A89130J20429f6148g936
$$ -319274 -209790 -88510 -106250 133966 -16261 -12771 -173124 189130 309559 -66148 -7936
11118B9323K53070g5815B28322a32241k31637k9477J24118B93933b10042A66074
$$ 29323 282393 -75815 228322 -132241 -363878 -393355 -269237 293933 -210042 166074
11107B37671o2160l7609o4958K27403c28590C59418a77724B8877a57749A31742
$$ 237671 175511 137902 72944 300347 -328590 359418 -177724 28877 -157749 131742
11096d63173B03677n0074a37877d001l08j69013f2689A1392J46442J73407c9724
$$ -463173 203677 153603 -137877 -4001 -4309 -173322 -62689 11392 157834 331241 -39724
11084B17100Q3330p7408e2031b5637E920J10186k2380j6674J29576E8165L43969
$$ 217100 300430 223022 -52031 -25637 5920 116106 93726 77052 206628 58165 402134
11073D02134l0801k5254A39380D4247M5337q14N1052b4174C13090a09904B94551
$$ 402134 371333 346079 139380 44247 89584 88770 139822 -24174 313090 -109904 294551
11061A99167o2620a65722H0285b7160A97500L9917M6189P2137L3459A10745l0107
$$ 199167 136547 -165722 80285 -27160 197500 237417 283606 355743 389202 110745 80638
11050H0638M57967j56423j73269b94165B00323J03122j172C2209L57415r0562
$$ 80638 538605 382182 208913 -294165 200323 303445 302273 32209 389624 299062
11040B99062L22950M3320j88996n7663J55800j43731J99356n9036j21297q6943
$$ 299062 622012 665332 476336 418673 574473 430742 630098 571062 449765 362822
11030C62822P57940k73292k97088r438N0300k25270K20879M4987k51779I5144
$$ 362822 1120762 847470 550382 540944 591244 365974 586853 631840 380061 95144
11019G36138k74636J63829A84857J10043L48571J88430k47182j60941K53939M5742
$$ 736138 461502 625331 184857 294900 643471 831901 584719 423778 677717 723459
11009G23459j7524r4856k16657Q0417j12590J40690j890K30525k65186J23533
$$ 723459 705935 611079 394422 474839 362249 502939 501049 731574 466388 589921
10999E89921J1805j20787K29304k85974K67953C09905A27684M49066k08869N6481
$$ 589921 601726 480939 710243 424269 692222 309905 127684 576750 367881 424362
10989D24362M63810j77809k41327j13239J60560B48307O682N12299j60685m6728
$$ 424362 888172 710363 469036 355797 516357 248307 254989 767288 606603 559875
10979E59875m5452J4129J50003k85460J26512O7555J65263l63681m928K39328
$$ 559875 514423 528552 678555 393095 519607 587162 752425 388744 383816 623144
10969F23144K23228j93105K35329k58621K55344K68120l38147L7357J91799L3224
$$ 623144 846372 653267 888596 629975 885319 1153439 815292 852649 1044448 1077672
10959A077672k55362N57848j29447K28568J77003J04950j91173L80812n4080j38958
$$ 1077672 822310 1380158 1250711 1479279 1656282 1761232 1570059 1950871 1896791 1757833
10949A757833o5052m6447K17904m46208l23734M94294j43718M8713r8812k76437
$$ 1757833 1692781 1646334 1864238 1418030 1094296 1588590 1444872 1493585 1394773 1118336
10939A118336N14613j41673M1480j3789k14503L33213l56314o18457L39367m7624
$$ 1118336 1632949 1491276 1532756 1518967 1304464 1637677 1281363 662906 1002273 954649
10929I54649D56683P8582J36569F3570L82422B17600L8519a51838H8229M77105
$$ 954649 456683 535265 671834 63570 445992 217600 256119 -151838 88229 565334
10919E65334H2145J15237J16462j9369r5292n1533b10580E4946L4518k4673b00237
$$ 565334 82145 197382 313844 294475 199183 147650 -210580 54946 89464 64791 -200237
10907b28852b0278k59855a10494k21550A01189e3211j54141C798N2777c3410A33395
$$ -228852 -20278 -280133 -110494 -332044 101189 -53211 -207352 3798 56575 -33410 133395
10895a02284F6736A1220b82207H9024b23721D5910J30525d7050p8539A83757D8708
$$ -102284 66736 11220 -282207 89024 -223721 45910 176435 -47050 -125589 183757 48708
10883B55695h045l19892C7869J66708F5598K35487f2224q9525H9947b61523Q7124
$$ 255695 -8045 -327937 37869 204577 65598 301085 -62224 -151749 89947 -261523 -174399
10872a74399P7696A93428b58127A7907N9275a06972B78181a64320B2080c06082
$$ -174399 -96703 193428 -258127 17907 77182 -106972 278181 -164320 22080 -306082
10861e6461j32354M3343f1620A60554K3488b77177K647h8111A06653a79441f4202
$$ -56461 -188815 -145472 -61620 160554 184042 -277177 -274530 -88111 106653 -179441 -64202
10849I1886m659a05034D1209b33418A64643M0495G4363e6877j50771I6519i6001
$$ 91886 87227 -105034 41209 -233418 164643 205138 74363 -56877 -207648 96519 -96001
10837d9588G6313b47790e040k1694j55303F0182a72308F063a41861C11381a68072
$$ -49588 76313 -247790 -5040 -26734 -182037 60182 -172308 6063 -141861 311381 -168072
10825b9008B89775a9862C00041c098l1856L565I8931l0855a0999C98682a89693
$$ -29008 289775 -19862 300041 -3098 -34954 -31389 98931 68076 -10999 398682 -189693
10813a32455j56135B23290a30466I697a19278a6760B07282d54274C2647b07746
$$ -132455 -288590 223290 -130466 9697 -119278 -16760 207282 -454274 32647 -207746
10802a02406Q921A55585R0587m3566a50408e9517j90322A19271c47672A33623
$$ -102406 -93485 155585 246172 202606 -150408 -59517 -249839 119271 -347672 133623
10791b6818j04638G7106J76826a99649E3443O7636c32342i7223r0694L3107L1400
$$ -26818 -131456 77106 253932 -199649 53443 121079 -332342 -97223 -187917 -154810 -123410
10780a23410m3002K7043n7613K175R3942m2893P1697j21838E0467K82657e08310
$$ -123410 -166412 -139369 -196982 -194807 -100865 -143758 -72061 -193899 50467 333124 -508310
10768d6290C9386h8091j6658k55350g5619b2545E3945b99774h3506m8918n4263
$$ -46290 39386 -88091 -104749 -360099 -75619 -22545 53945 -299774 -83506 -132424 -186687
10757a86687h5006p0492j65852i278j29721c2633A79248a50438I4107a26778M0716
$$ -186687 -85006 -155498 -321350 -9278 -138999 -32633 179248 -150438 94107 -126778 -86062
10746h6062F576b30056K8721Q7134B44288a47606j18752H1287a40809M371o7056
$$ -86062 6576 -230056 -201335 -114201 244288 -147606 -266358 81287 -140809 -136438 -203494
10735b03494k29704A51484l5335b36678j23153C2759H946a66710n0914A21710
$$ -203494 -433198 151484 116149 -236678 -359831 32759 8946 -166710 -217624 121710
10724b41655E4979R6403g5712o27k76060R9800E9031a16340k47918j25573E8985
$$ -241655 54979 151382 -75712 -76339 -352399 -252599 59031 -116340 -364258 -489831 58985
10712a26528N4648G1321b14402k07950B97383e5924A18805R298b51423f2874j57041
$$ -126528 -71880 71321 -214402 -422352 297383 -55924 118805 128103 -251423 -62874 -219915
10701b19915m8424e7318i466j02491j2548B11394a30934G8776c78766B3859P4100
$$ -219915 -268339 -57318 -9466 -111957 -124505 211394 -130934 78776 -378766 23859 97959
10690I7959c25515a11141j56917C24923F9615M8801c00887A3443c61980b2398
$$ 97959 -325515 -111141 -268058 324923 69615 118416 -300887 13443 -361980 -22398
10679b7584E9555a21633b2877n601m5690C3600c70376j14371A250L8964A2175
$$ -27584 59555 -121633 -22877 -28478 -74168 33600 -370376 -484747 1250 40214 12175
10667b28903a3539I0373a18392A71794c63387d2080A30398e8230a9210j4109j94847
$$ -228903 -13539 90373 -118392 171794 -363387 -42080 130398 -58230 -19210 -33319 -228166
10656b28166f0082B27392b36821A95102b84053e0518D6726a81753a5417H7966
$$ -228166 -60082 227392 -236821 195102 -284053 -50518 46726 -181753 -15417 87966
10645H7099B0605b7104r2225L6818j10845p1687A77455H4239o826a38662C52180
$$ 87099 20605 -27104 -119329 -82511 -193356 -265043 177455 84239 77413 -138662 352180
10633A3031J29862M261a23259j63457C85342A17256k933B2339M7923h9794A05581
$$ 13031 142893 147154 -123259 -286716 385342 117256 114323 22339 70262 -89794 105581
10621a2908k3000j6373C3482a84970O5375I0821M2581r210a15553a3625F7132
$$ -12908 -35908 -52281 33482 -184970 -119595 90821 133402 124192 -115553 -13625 67132
10609I8616b68727a9669A31610a79487A30004c3080k05072A3419Q3202k0209h7944
$$ 98616 -268727 -19669 131610 -179487 130004 -33080 -238152 13419 96621 76412 -87944
10597h9311b0682o1507n2900E4558c1876k78676J12434n5569R9414A21647D4688
$$ -89311 -20682 -82189 -135089 54558 -31876 -310552 -198118 -253687 -154273 121647 44688
10585A41092a39476A21615a00469K9622r1349g7502E3599c5998j48041j55412
$$ 141092 -139476 121615 -100469 -70847 -162196 -77502 53599 -35998 -184039 -339451
10575c39451P8697N8787a489D47049b67421c1109l33273a80891B9957N6742b57802
$$ -339451 -260754 -201967 -1489 447049 -267421 -31109 -364382 -180891 29957 86699 -257802
10563h6022A31537d9424r7385A51895A7601a61982E4354b84341h9142q4961B7608
$$ -86022 131537 -49424 -146809 151895 17601 -161982 54354 -284341 -89142 -174103 27608
10551a37583j06295C7267b15213p9137J14457L2727j22158i6006Q523K1028F3314
$$ -137583 -243878 37267 -215213 -294350 -179893 -147166 -269324 -96006 -87483 -66455 63314
10539G8520f5784A0966J66218b91754E9347a07561j33649O3413j6178k0817f1914
$$ 78520 -65784 10966 177184 -291754 59347 -107561 -241210 -177797 -193975 -214792 -61914
10527i7104B54779a44463C3341g258G5502L9372c97649A73615n1002h3220A79854
$$ -97104 254779 -144463 33341 -7258 75502 114874 -397649 173615 122613 -83220 179854
10515i1459A21750b3795E2111f5348B76244p1675A3829P7301a47232c3637j29617
$$ -91459 121750 -23795 52111 -65348 276244 204569 13829 91130 -147232 -33637 -163254
10504a63254o3464c4546q1375A61432J67553a01640m5938j0307O8664Q425k09033
$$ -163254 -226718 -34546 -115921 161432 328985 -101640 -147578 -157885 -89221 -80796 -289829
10493b89829C9839c40845a940k55642Q9063B0224J35254b4323j7755J1948B16974
$$ -289829 39839 -340845 -1940 -257582 -168519 20224 155478 -24323 -42078 -30130 216974
10481a35389o2896G954e0843E7606R480a50638C8100d4495A34207J66335b26783
$$ -135389 -198285 7954 -50843 57606 67086 -150638 38100 -44495 134207 300542 -226783
10469b44137C4590d58744I9713L18892e7654a973A49172N7923g8477D11922J0386
$$ -244137 34590 -458744 99713 418605 -57654 -1973 149172 207095 -78477 411922 422308
10458D22308j45463N1788j09272a36548C06705a87421a7502m0551B72674a21167
$$ 422308 276845 328633 219361 -136548 306705 -187421 -17502 -58053 272674 -121167
10447c45834a71338A22315E6415r985l134c86650f4110A91716a31612F9054e3948
$$ -345834 -171338 122315 56415 46430 43296 -386650 -64110 191716 -131612 69054 -53948
10435c99636H5692i6180G962a10737A33850c39174B9927J63789b18281L1599Q476
$$ -399636 85692 -96180 7962 -110737 133850 -339174 29927 193716 -218281 -186682 -178206
10424a78206A92850r6210M8076b729k96138C10267A1637b74403J36362B2866i8688
$$ -178206 192850 96640 144716 -2729 -298867 310267 11637 -274403 -138041 22866 -98688
10412A44973f749k09812B9525a08469D5773R7717b50353A64544J51576d38968
$$ 144973 -6749 -216561 29525 -108469 45773 143490 -250353 164544 316120 -438968
10401C00312F1227J3229e1211C28862l408J806c4117B66270C4990K1159J20971
$$ 300312 61227 74456 -51211 328862 325454 327260 -34117 266270 34990 56149 177120
10390A77120d29199i9639r4894B1228H678M7133a29874H2196a73575j39904A80369
$$ 177120 -429199 -99639 -194533 21228 8678 55811 -129874 82196 -173575 -313479 180369
10378a10430F3753a77545C49286A15306D1618j1938J26255o7036l3428J77423
$$ -110430 63753 -177545 349286 115306 41618 29680 155935 88899 55471 232894
10368B32894c4781B00122C3316J8903a9601j22216A62567J9888a12627B24773
$$ 232894 -34781 200122 33316 52219 -19601 -141817 162567 182455 -112627 224773
10357B61585E8500B8018a81455C41594E9569O203L68071n9073M14554l62873C3623
$$ 261585 58500 28018 -181455 341594 59569 65772 433843 374770 789324 426451 33623
10345B28792M930J68156l2121A30812O5748R1520c5010A24219N0348O0479G5077
$$ 228792 233722 401878 369757 130812 196560 288080 -35010 124219 174567 235046 75077
10333E9462K21446m7890J54697o1193I5818K82846p0035J75039j58557J62919
$$ 59462 280908 233018 387715 326522 95818 378664 308629 483668 325111 488030
10323D88030D2778O4018j6146k9997q892e7210B75021l9048J00861b9908B15439
$$ 488030 42778 106796 90650 60653 51761 -57210 275021 235973 336834 -29908 215439
10311a11495A1832P6410f2416F0590H941e3697K2911I4475O3376L0341n1348k9792
$$ -111495 11832 88242 -62416 60590 8941 -53697 -30786 94475 157851 188192 136844 107052
10299A07052d7607c075B48600o3200f0612A74602d26321e2944C58319a80015B0939
$$ 107052 -47607 -3075 248600 185400 -60612 174602 -426321 -52944 358319 -180015 20939
10287a7188k02379G8740d017j92838j34577A89058a16467j82242a4534E1279b71035
$$ -17188 -219567 78740 -4017 -196855 -331432 189058 -116467 -298709 -14534 51279 -271035
10275A39722J85650i8537b0591A0286K77472a48100A39199D1726b08188q6780
$$ 139722 325372 -98537 -20591 10286 287758 -148100 139199 41726 -208188 -294968
10265b94968f250k19763b4145k45210E1074C775K0224j0059P5125b07005B49571
$$ -294968 -6250 -226013 -24145 -269355 51074 3775 23999 13940 89065 -207005 249571
10253A70042K07744b3479E4795a24159k52589D2473J58350a3523A81139f6788
$$ 170042 377786 -23479 54795 -124159 -376748 42473 200823 -13523 181139 -66788
10242A92239a47514b7780j19964C36085j48780F6925L01488A33183b8297B33106
$$ 192239 -147514 -27780 -147744 336085 187305 66925 368413 133183 -28297 233106
10231b20541A4371c17325g8311J933j22232B127K33140d281D4251b12242j7309
$$ -220541 14371 -317325 -78311 -76378 -198610 2127 235267 -4281 44251 -212242 -229551
10220b29551a09952k3B36805A5080d0339Lj29180j60388E8932J48433D6167K30916
$$ -229551 -109952 -109975 236805 15080 -40339 -40336 -169516 -329904 58932 207365 46167 277083
10208B77083a56000e731j72551j38318J32992c3608r1227M8477c0631k0783F3029
$$ 277083 -156000 -5731 -178282 -316600 -183608 -33608 -124835 -76358 -30631 -51414 63029
10196b3362k34695a02116k75611a72606A18140m3321e9786j90781j05923a034
$$ -23362 -258057 -102116 -377727 -172606 118140 74819 -59786 -250567 -356490 -1034
10185c15209E1835e3536F2178A9687d2186j0227G363J15739o0889b7667k4427
$$ -315209 51835 -53536 62178 19687 -42186 -52413 7363 123102 62213 -27667 -52094
10174e2094k8494c0912B05772a39101R585N1783B8658a06226n5301k2086G8734
$$ -52094 -80588 -30912 205772 -139101 -129516 -77733 28658 -106226 -161527 -183613 78734
10162a28570C08388A38019b62667a03384E5170Q2274B5007L9311k0326J0477a006
$$ -128570 308388 138019 -262667 -103384 55170 137444 25007 64318 43992 54469 -1006
10150b87697J16310K3337A20470E395R4899a56485C13178b27906a0022E989e7366
$$ -287697 -171387 -148050 120470 5395 100294 -156485 313178 -227906 -10022 5989 -57366
10138b9969j60900h8811l2978N4854C463J1613b48706H9649a73658C76506a29315
$$ -29969 -190869 -88811 -121789 -66935 3463 15076 -248706 89649 -173658 376506 -129315
10126D3128b93740A49825a8351D6093a52662j71901I840h0377j33086P7047k44177
$$ 43128 -293740 149825 -18351 46093 -152662 -324563 9840 -80377 -213463 -136416 -380593
10115c80593E7453a80914e3063k00005a4765B17008d865j38658l16136K05028
$$ -380593 57453 -180914 -53063 -253068 -14765 217008 -4865 -143523 -459659 -254631
10105b54631j0792F6726R6987a6714C65308B6236J13579A4893K47238H3673h0517
$$ -254631 -265423 66726 163713 -16714 365308 26236 139815 14893 262131 83673 -80517
10093c5528A48832b62886M2170d0165l52979D8802J00912l3923O992b72043k3153
$$ -35528 148832 -262886 -220716 -40165 -393144 48802 149714 115791 122783 -272043 -295196
10082b95196a7660o4945C879Q5091b56358J12033k0027E810a96688I1638m2924
$$ -295196 -17660 -82605 3879 88970 -256358 -144325 -164352 5810 -196688 91638 48714
10071D8714O3052A6363a56565A85432q4074M5826a02405d3793A31919f4040a754
$$ 48714 111766 16363 -156565 185432 101358 147184 -102405 -43793 131919 -64040 -1754
10059a15109N0630j86985j02397B9598h1545j77050o234a3972n6069k0108j52349
$$ -115109 -64479 -251464 -353861 29598 -81545 -258595 -264829 -13972 -70041 -90149 -242498
10048b42498J530M8155A63380a03670l2302j18077A34978g7908k5779q9433I1730
$$ -242498 -240968 -192813 163380 -103670 -135972 -254049 134978 -77908 -103687 -193120 91730
10036A38452b84505K7828D6425L4237a42345O244J6291m0594K7329A31112b97549
$$ 138452 -284505 -256677 46425 80662 -142345 -136101 -119810 -160404 -133075 131112 -297549
10024a71073L421r1742e4415E4382M9275b23294g6462B9599a18081o7998A20841
$$ -171073 -167652 -259394 -54415 54382 103657 -223294 -76462 29599 -118081 -186079 120841
10012a84242l4751l365A35429a64148j91010A38249a79015A90985b26374B8333
$$ -184242 -218993 -222358 135429 -164148 -355158 138249 -179015 190985 -226374 28333
10001E9760b92446J8534a08037R762A73379a2273B2753k327c9837j5544B32616
$$ 59760 -292446 -273912 -108037 -98275 173379 -12273 22753 20426 -39837 -55381 232616
9989c62069J31220M3083H1488k9067b00674C90089B1271J58364a00843J3835l01230
$$ -362069 -230849 -187766 81488 52421 -200674 390089 21271 179635 -100843 -87008 -388238
9978c88238I6680J77422i6306a1462k43624B91378H2217D051a99679l8137C5990
$$ -388238 96680 274102 -96306 -11462 -255086 291378 82217 4051 -199679 -237816 35990
9966a78686F8107c85408d3175o5258A0725e0457A64769a22968A58039F6342d2823
$$ -178686 68107 -385408 -43175 -108433 10725 -50457 164769 -122968 158039 66342 -42823
9954d66300B56163A02968i4251H9362A5649O1881a38936j36859C2771G466J6690
$$ -466300 256163 102968 -94251 89362 15649 77530 -138936 -275795 32771 7466 24156
9943B4156d24844A39496D9938R5039J71100b213j43200L6545o6479A6157P2005
$$ 24156 -424844 139496 49938 144977 316077 -2213 -145413 -108868 -175347 16157 88162
9932H8162d4314A40558J38534a37563q3823C4464J27636f596q8169k98114I1311
$$ 88162 -44314 140558 279092 -137563 -221386 34464 162100 -6596 -94765 -392879 91311
9920b37295g8970j32761O8075A41834D8738O0880C0182a12810d6857d564A91323
$$ -237295 -78970 -211731 -143656 141834 48738 109618 30182 -112810 -46857 -4564 191323
9908b61800b2983k78595a47022M7897j05326d8436j63689k8511i6632B73679b43167
$$ -261800 -22983 -301578 -147022 -99125 -204451 -48436 -212125 -240636 -96632 273679 -243167
9896g6962C6289a29423n320o4563j2222q2289j6212i714j71298j00367j15750
$$ -76962 36289 -129423 -134743 -199306 -211528 -293817 -310029 -9714 -181012 -281379 -397129
9885c97129J22716a18234C5336K6271b7787k50237j3668k5522J11913P8837m2643
$$ -397129 -274413 -118234 35336 61607 -27787 -278024 -291692 -317214 -205301 -126464 -169107
9874a69107j6728G376a32431A53923b20285G3365M3599J49121a85740D28139i4770
$$ -169107 -185835 7376 -132431 153923 -220285 73365 116964 266085 -185740 428139 -94770
9862c6563H8951a85816q5045j72759i451A1637a3448m3749A85667a31867k0177
$$ -36563 88951 -185816 -270861 -443620 -9451 11637 -13448 -57197 185667 -131867 -152044
9851a52044L1202j37300a06875j15868G7586O2409b44505N2977o8917A5293c08604
$$ -152044 -120842 -258142 -106875 -222743 77586 139995 -244505 -191528 -260445 15293 -308604
9839C4101i6811j0195b2927o0264C0375a41486j57293c0025A67195a47415N3673
$$ 34101 -96811 -107006 -22927 -83191 30375 -141486 -298779 -30025 167195 -147415 -93742
9828i3742A1749a38230K8663c5277D3178a47722C6842c9378q4425B716c21504
$$ -93742 11749 -138230 -109567 -35277 43178 -147722 36842 -39378 -123803 2716 -321504
9816B62773a09656k31206F9301a31730l7576p1664E1759a60094n1599m4054P1036
$$ 262773 -109656 -340862 69301 -131730 -169306 -240970 51759 -160094 -211693 -255747 -184711
9805a84711h9091G4061J27031a14888E4507b49964m5161f2820k13650M9623E4866
$$ -184711 -89091 74061 201092 -114888 54507 -249964 -295125 -62820 -276470 -226847 54866
9793a44928j43405C1041a06029k7164L9648r6633A28209C0643d6975A12454e0947
$$ -144928 -288333 31041 -106029 -133193 -93545 -190178 128209 30643 -46975 112454 -50947
9781f1440l1028K6319L0598A46958a8261A01790b48721h1394C37924a26728l67303
$$ -61440 -92468 -66149 -35551 146958 -18261 101790 -248721 -81394 337924 -126728 -494031
9770d94031a07797c0470A50818c97974a43611d7360k85479I9034Q7617a17966
$$ -494031 -107797 -30470 150818 -397974 -143611 -47360 -332839 99034 186651 -117966
9759b29451c6824k65311J25447B09678i8794q0012O3168D795a21994F5548c80520
$$ -229451 -36824 -302135 -176688 209678 -98794 -178806 -115638 4795 -121994 65548 -380520
9747f6432j07288c9864H5849e7979c633m04950g0799o9029k08669A33476d9711
$$ -66432 -173720 -39864 85849 -57979 -3633 -408583 -70799 -139828 -348497 133476 -49711
9735b4556B49964h1138k8361k6393M3531D4289a21117d2673k08836O8911c3773
$$ -24556 249964 -81138 -109499 -135892 -92361 44289 -121117 -42673 -251509 -182598 -33773
9723H2680c07682F5326g3754A18957a80724A44357b11426A01868m7024b28319
$$ 82680 -307682 65326 -73754 118957 -180724 144357 -211426 101868 54844 -228319
9712h1657H7461i5297C875i3182j67735C765a90047h798m5547n8698a6094D4078
$$ -81657 87461 -95297 3875 -93182 -260917 3765 -190047 -8798 -54345 -113043 -16094 44078
9699C37103a02238K166j23365a8782r6480l49987c6382j51093j80233A91755b63752
$$ 337103 -102238 -100072 -223437 -18782 -115262 -465249 -36382 -187475 -367708 191755 -263752
9687A46792a45088j8225k2917l4390b4299E2340d49355A47586c55813c9306l01275
$$ 146792 -145088 -163313 -186230 -220620 -24299 52340 -449355 147586 -355813 -39306 -340581
9676c40581g1029l75667a58452F5416E13a36375j47006A7191b96818b4762n3453
$$ -340581 -71029 -446696 -158452 65416 513 -136375 -283381 17191 -296818 -24762 -78215
9665g8215L6114B5422e7697p3224H2993l5290K73935c12100B58889g1197A01998
$$ -78215 -42101 25422 -57697 -130921 82993 47703 321638 -312100 258889 -71197 101998
9653d03167A58939h643j13206r8466f5866j70219G965g6787o8709f7457F37h7556
$$ -403167 158939 -8643 -121849 -220315 -65866 -236085 7965 -76787 -145496 -67457 637 -87556
9640b88596E92789h7774A5366J0177Q5632a05828M8416k24281B18866j3589b13194
$$ -288596 592789 -87774 15366 25543 111175 -105828 -57412 -281693 218866 205277 -213194
9628B5100P4219b02757g2772j84914a03022m1543m2778H1286d4203j46838E6441
$$ 25100 99319 -202757 -72772 -257686 -103022 -144565 -187343 81286 -44203 -191041 56441
9616c1851j4743C47199A71256b27471Q2131a345A1372f9663B8903a57320c5753
$$ -31851 -46594 347199 171256 -227471 -145340 -1345 11372 -69663 28903 -157320 -35753
9604a04531I876g4A12992a07971k06545A35105l8232b29266d3987A76002O6025
$$ -104531 9876 -74 112992 -107971 -314516 135105 96873 -229266 -43987 176002 242027
9593B42027a28564B17709B2620a81865b9307j85142F1961a58834e7369A3986b75324
$$ 242027 -128564 217709 22620 -181865 -29307 -214449 61961 -158834 -57369 13986 -275324
9581a46806a5382j72816g5948k6160l7958R183j09426C84240a67972j68761C0530
$$ -146806 -15382 -188198 -75948 -102108 -140066 -130883 -240309 384240 -167972 -336733 30530
9569a55277B00620a87541A79512c06337B8599a33726A43782g5557K7517A58261
$$ -155277 200620 -187541 179512 -306337 28599 -133726 143782 -75557 -48040 158261
9558B61539I636J13500N1296i4655b7365I7199d04702a0064p0713J1184L2251
$$ 261539 9636 123136 174432 -94655 -27365 97199 -404702 -10064 -80777 -69593 -37342
9547c7342k18055F4427e2215j04045r7545P2376j53476A04862p804i5783D9888
$$ -37342 -255397 64427 -52215 -156260 -253805 -181429 -334905 104862 97058 -95783 49888
9535C43174n1461e2236j91133f7519j26429d4827J813C35390e75607a76985j00202
$$ 343174 291713 -52236 -243369 -67519 -193948 -44827 -43014 335390 -575607 -176985 -277187
9524b77187J33685p3055b2600l29830J20156A1475g8454j86321n3186a22780p9699
$$ -277187 -143502 -216557 -22600 -352430 -232274 11475 -78454 -264775 -317961 -122780 -202479
9513b02479G684P0148a93591j74871d1531o1605M6030j3843j11065h3487A52443
$$ -202479 7684 77832 -193591 -368462 -41531 -103136 -57106 -70949 -182014 -83487 152443
9501a4408j35200o937l02344c4042m6361j54043B9918d5714j0629k34987a24063
$$ -14408 -149608 -156545 -458889 -34042 -80403 -234446 29918 -45714 -56343 -291330 -124063
9489G2710J80320D2987K2184e8713C34285h044a702j1395j52689i906j19423j70173
$$ 72710 253030 42987 65171 -58713 334285 -8044 -1702 -13097 -165786 -9906 -129329 -299502
9477b99502H7147K43969g0198j47619I7131a30935a6375B94992q3248C3396f6846
$$ -299502 87147 331116 -70198 -217817 97131 -130935 -16375 294992 211744 33396 -66846
9465b38757b215I895b91875C8271Q0548a4952P371m3950I3151K61385b01055b5307
$$ -238757 -2215 9895 -291875 38271 118819 -14952 -7581 -51531 93151 354536 -201055 -25307
9452H9157b24031A9104J0629J73026D0756c3096E7201K34571F6298a71632N9804
$$ 89157 -224031 19104 29733 202759 40756 -33096 57201 291772 66298 -171632 -111828
9441a11828e851A5731R327c52109A26375d679k79792J17756c9793A3969f5732
$$ -111828 -5851 15731 25058 -352109 126375 -4679 -284471 -166715 -39793 13969 -65732
9429F4305c45110G0717e3095A8571b38447L020D2809b26174G9687a35849m3624
$$ 64305 -345110 70717 -53095 18571 -238447 -235427 42809 -226174 79687 -135849 -179473
9418a79473L5260c241j18635n750J7648j05588e5692j37811j46261f6562I3115
$$ -179473 -144213 -3241 -121876 -127626 -109978 -215566 -55692 -193503 -339764 -66562 93115
9406h2327k29002a29161n39982a32356M5915M1922A97276F427J20490b5817A17582
$$ -82327 -311329 -129161 -669143 -132356 -86441 -44519 197276 6427 126917 -25817 117582
9394G8624d36197b08869F9018J29539e38043A66234a46539e7691G23L7686i4337
$$ 78624 -436197 -208869 69018 198557 -538043 166234 -146539 -57691 723 38409 -94337
9382A82P3537K41080E36J59896O6266p8557J38481e5569B4239G801a82396N1144
$$ 182 73719 314799 536 160432 226698 148141 286622 -55569 24239 7801 -182396 -131252
9370a31252j57659C10953P856a05093b0690r026m2702k92363a30372j86026A4600
$$ -131252 -288911 310953 318809 -105093 -20690 -29716 -72418 -364781 -130372 -316398 14600
9358i102j6646A76130c01999a28115k90436A1077P2893d0977k19330d6136E4378
$$ -9102 -25748 176130 -301999 -128115 -418551 11077 83970 -40977 -260307 -46136 54378
9346A72870K0937d325j94039E2414b830j12820k4371r7468c7178A48951l0592
$$ 172870 193807 -4325 -198364 52414 -2830 -115650 -140021 -237489 -37178 148951 118359
9335A18359J36350D5336P8851b39763A4274D326L9800K05436d55781a95248b0330
$$ 118359 254709 45336 124187 -239763 14274 4326 44126 249562 -455781 -195248 -20330
9323a59159c3297q3419d3207A72598O1231a72043b9682A00823c41692g6095R396
$$ -159159 -33297 -116716 -43207 172598 233829 -172043 -29682 100823 -341692 -76095 -66699
9312f6699m2923J5269c3768j58976A80349c08605a05300G2502a3283r5260K4050
$$ -66699 -109622 -94353 -33768 -192744 180349 -308605 -105300 72502 -13283 -108543 -84493
9301h4493D1398a59866L5281C9073P99f5693B55822D4227J93589b01738E2247
$$ -84493 41398 -159866 -124585 39073 39872 -65693 255822 44227 237816 -201738 52247
9289A8492b35761A3954J33954f88538I7902A1093J21593e9826j57469F7594B4525
$$ 18492 -235761 13954 147908 -688538 97902 11093 132686 -59826 -217295 67594 24525
9277e6375o2824J5242K3114E8565i4932d4376A30281a6145A32332e8949C7255
$$ -56375 -119199 -103957 -80843 58565 -94932 -44376 130281 -16145 132332 -58949 37255
9265A5424K3771c37417A15723o659g1233l9100j5371j90788j2462C0310J13238
$$ 15424 39195 -337417 115723 109064 -71233 -110333 -125704 -316492 -328954 30310 143548
9254A43548a57343f833k17715J2758c5117A95357b40386J18667F1455O0626a13851
$$ 143548 -157343 -6833 -224548 -211790 -35117 195357 -240386 -121719 61455 122081 -113851
9242a16860e2689j59857L7907L2012c0766B5042a00533M1176b4757j94241C0557
$$ -116860 -52689 -212546 -174639 -142627 -30766 25042 -100533 -59357 -24757 -218998 30557
9230F3928g2541j93857J20128O9119q7686A04485k9767m45a3276G9705K79749
$$ 63928 -72541 -266398 -146270 -77151 -164837 104485 74718 74273 -13276 79705 359454
9219C59454B2389a69680k6418N6373M6903j80127A36446c0633D9548a71391Q3170
$$ 359454 22389 -169680 -196098 -139725 -92822 -272949 136446 -30633 49548 -171391 -88221
9208h8221j18760P2714e3592G3426Q5406o1254a42640A16867c01342a3940A17449
$$ -88221 -206981 -134267 -53592 73426 158832 97578 -142640 116867 -301342 -13940 117449
9196A37085D0919a73039j8732h9514H5061M963a0912G3815b26240j05619B20992
$$ 137085 40919 -173039 -191771 -89514 85061 90024 -10912 73815 -226240 -331859 220992
9184b77809A7119a18675q2622g1992j72195f8497j1852A20554c01539I4800a93960
$$ -277809 17119 -118675 -201297 -71992 -244187 -68497 -80349 120554 -301539 94800 -193960
9172b56090B7571c9296l30220a63903L8476C9399b55470A49974j9417b23708M935
$$ -256090 27571 -39296 -369516 -163903 -125427 39399 -255470 149974 130557 -223708 -218773
9161b18773I0951a83280A20352n672R9829A3309d2303j95520d8114l9600k7354
$$ -218773 90951 -183280 120352 114680 214509 13309 -42303 -237823 -48114 -87714 -115068
9150a15068m9533E0188b6206j13986b8354n9129A95449a36120F531i4884K412
$$ -115068 -164601 50188 -26206 -140192 -28354 -87483 195449 -136120 6531 -94884 -92472
9139i2472J9156j89073f9536A00402c76010D0800Q3911b33887A48897i8629B00075
$$ -92472 -73316 -262389 -69536 100402 -376010 40800 124711 -233887 148897 -98629 200075
9127E9237b13367d469A81538k0172J08200c02443M1471F160L97738B8062J05136
$$ 59237 -213367 -4469 181538 161366 269566 -302443 -260972 6160 403898 28062 133198
9116A33198r267e259m6180B36290a56278g1716n7250G8936a49802N5398c4738
$$ 133198 123931 -5259 -51439 236290 -156278 -71716 -128966 78936 -149802 -94404 -34738
9104B86960A01945P1428n4587K07782k6982b16647B43077e0286D2772d7475A71877
$$ 286960 101945 173373 118786 326568 299586 -216647 243077 -50286 42772 -47475 171877
9092d76889a11088B7233b435j09053j48826g1332a7866p1197o9608J8559f2500
$$ -476889 -111088 27233 -2435 -111488 -260314 -71332 -17866 -89063 -158671 -140112 -62500
9080E8416g3584I003J6627g8946E242a91408b0344B41842a23790E6550c9644k93102
$$ 58416 -73584 9003 25630 -78946 5242 -191408 -20344 241842 -123790 56550 -39644 -332746
9068c32746a60358L1165k38333I1815d573A59394b51449h8520O941a744k64716
$$ -332746 -160358 -129193 -367526 91815 -4573 159394 -251449 -88520 -81579 -1744 -266460
9057b66460K0019C2269a68306l188B78329c30962B53561a34960b5242k71234A05425
$$ -266460 -246441 32269 -168306 -171494 278329 -330962 253561 -134960 -25242 -296476 105425
9045b22970C00726b67494B43133O0023b65755J12455e1460j84327C6822j078c63950
$$ -222970 300726 -267494 243133 303156 -265755 -153300 -51460 -235787 36822 35744 -363950
9033G0424a61734k6310A07519K78348b59709A16459c36471C1540i1810q8453g749
$$ 70424 -161734 -188044 107519 385867 -259709 116459 -336471 31540 -91810 -180263 -7749
9021h4537A81800f0424j04349A9713J95005b33491j86315J93454F8037f1866k1028
$$ -84537 181800 -60424 -164773 19713 214718 -233491 -419806 -226352 68037 -61866 -82894
9010h2894D9047J7732b6881B6757a66404d4038l7240k24709e5476C14832i2307
$$ -82894 49047 66779 -26881 26757 -166404 -44038 -81278 -305987 -55476 314832 -92307
8998a60275K4253j7074A31226A2384L9376r95b93944a33210f636j28967k82668
$$ -160275 -136022 -153096 131226 12384 51760 50765 -293944 -133210 -6636 -135603 -418271
8987d18271N1279d4983b0556A62246a65831k3441C7355Q7208f80275a34211M5415
$$ -418271 -366992 -44983 -20556 162246 -165831 -189272 37355 124563 -680275 -134211 -88796
8976h8796j88366G2770a94448k6789G8399a56227k05944a48304b6138A39949d49545
$$ -88796 -277162 72770 -194448 -221237 78399 -156227 -362171 -148304 -26138 139949 -449545
8964F0202g3289J5050a1838A89290a45047M6665A14891a37231D1688b86866J19933
$$ 60202 -73289 -58239 -11838 189290 -145047 -98382 114891 -137231 41688 -286866 -166933
8953a66933P0317J7204A53747M6507B1734c0120k95856a37703A50826a59596n4584
$$ -166933 -96616 -79412 153747 200254 21734 -30120 -325976 -137703 150826 -159596 -214180
8942b14180A46990m0734B0188p217O987P7988a38834B9740a26915h686k72412
$$ -214180 146990 106256 20188 12971 19958 97946 -138834 29740 -126915 -8686 -281098
8931b81098A92603q1240A4638K9012b15004a5042j44572n2789F6822k7992K30181
$$ -281098 192603 111363 14638 43650 -215004 -15042 -159614 -212403 66822 38830 269011
8920B69011a5742j71917B07524J85282J51893e69089b0809k6238B41974J98439
$$ 269011 -15742 -187659 207524 392806 544699 -569089 -20809 -47047 241974 440413
8910D40413q1052A50451J40159H1298L99473M84296J033699L315601J85488k715115
$$ 440413 359361 150451 290610 81298 480771 965067 1998766 5314367 5499855 2784740
8900B784740j193917p70002k27939j47606j64003m7827D2837K39752a97157D8270
$$ 2784740 1590823 820821 592882 445276 281273 233446 42837 282589 -197157 48270
8889A69704A4693f1418G6637C7775J49484J1951j8243a26877k06442C817b00723
$$ 169704 14693 -61418 76637 37775 187259 199210 180967 -126877 -333319 3817 -200723
8877F8985k1810d9111B09546a23276E446a18242j89472A191a52247C42948c0917
$$ 68985 47175 -49111 209546 -123276 5446 -118242 -307714 1191 -152247 342948 -30917
8865B8906a39232q3662G5511a55667p409H0575a44838B65109a11825j20459A99350
$$ 28906 -139232 -222894 75511 -155667 -163076 80575 -144838 265109 -111825 -232284 199350
$$ [...]
##END NTUPLES=NMR SPECTRUM
##END=
