
##TITLE=AC1125_Huila-palermo_5898794_131kh7hVod
##JCAMPDX= 6.0         $$ Bruker NMR JCAMP-DX V2.0
##DATA TYPE= NMR SPECTRUM
##DATA CLASS= NTUPLES
##ORIGIN= BRUKER
##OWNER= Administrator
$$ 1.72 TOPSPIN		Version 2.1
$$ 2012-04-10 10:27:47.468 -0500  Administrator@TOPSPIN
$$ Compression mode = diff/dup
##.OBSERVE FREQUENCY= 400.13188235
##.OBSERVE NUCLEUS= ^1H
##.ACQUISITION MODE= SIMULTANEOUS (DQD)
##.ACQUISITION SCHEME= undefined
##.AVERAGES= 8
##.DIGITISER RES= 22
##SPECTROMETER/DATA SYSTEM= spect
##.PULSE SEQUENCE= zg30
##.SOLVENT NAME= COFFEE_meoh
##.SHIFT REFERENCE= INTERNAL, COFFEE_meoh, 1, 14.98061
##AUDIT TRAIL= $$ (NUMBER, WHEN, WHO, WHERE, PROCESS, VERSION, WHAT)
$$ ##TITLE= Audit trail, TOPSPIN		Version 2.1
$$ ##JCAMPDX= 5.01
$$ ##ORIGIN= Bruker BioSpin GmbH
$$ ##OWNER= Administrator
$$ $$ C:\Bruker\TOPSPIN/data/COFFEE/nmr/AC1125_Huila-palermo_5898794_131kh7hVod/30/pdata/1/auditp.txt
$$ ##AUDIT TRAIL=  $$ (NUMBER, WHEN, WHO, WHERE, PROCESS, VERSION, WHAT)
(   1,<2012-04-04 08:05:51.234 -0500>,<Administrator>,<TOPSPIN>,<go>,<TOPSPIN 2.1>,
      <created by zg
	started at 2012-04-04 08:04:44.578 -0500,
	POWCHK enabled, PULCHK disabled,
       configuration hash MD5:
       1A 1E CE 29 27 FD 77 03 67 4E F0 E3 C4 B2 CB 90
       data hash MD5: 64K
       66 05 58 63 AE AD 8C 5F 19 BF 6D 5F 2F 84 6B CD>)
(   2,<2012-04-04 08:05:54.187 -0500>,<Administrator>,<TOPSPIN>,<proc1d>,<TOPSPIN 2.1>,
      <Start of raw data processing
       efp LB = 0 FT_mod = 6 PKNL = 1 PHC0 = 0 PHC1 = 0 SI = 32K 
       data hash MD5: 32K
       0B B3 DB 4B 7C 9A 82 77 E0 19 9E 28 1B C1 C8 BA>)
(   3,<2012-04-04 08:05:54.515 -0500>,<Administrator>,<TOPSPIN>,<proc1d>,<TOPSPIN 2.1>,
      <pk PHC0 = 213.2996 PHC1 = 0 
       data hash MD5: 32K
       AD 86 A9 50 E1 3D 0C 8C AF AD 91 1A 9F D1 1F 6A>)
(   4,<2012-04-04 08:05:54.734 -0500>,<Administrator>,<TOPSPIN>,<proc1d>,<TOPSPIN 2.1>,
      <abs ABSG = 1 
       data hash MD5: 32K
       35 59 F1 08 BD CF D1 DB 06 21 2C EE BF 36 00 A3>)
(   5,<2012-04-04 08:05:54.781 -0500>,<Administrator>,<TOPSPIN>,<proc1d>,<TOPSPIN 2.1>,
      <abs ABSG = 2 
       data hash MD5: 32K
       21 4C 0D 23 12 4C 9F B9 75 4C 9B 6E 02 B2 DC C8>)
(   6,<2012-04-04 08:05:54.812 -0500>,<Administrator>,<TOPSPIN>,<proc1d>,<TOPSPIN 2.1>,
      <abs ABSG = 3 
       data hash MD5: 32K
       F2 1F D6 2B 30 78 15 FA E5 8E BA F1 C6 2C 58 13>)
(   7,<2012-04-04 08:05:54.843 -0500>,<Administrator>,<TOPSPIN>,<proc1d>,<TOPSPIN 2.1>,
      <abs ABSG = 4 
       data hash MD5: 32K
       44 F0 29 5D 77 2D 8D 2D 7A E7 8B D3 08 7F 99 71>)
(   8,<2012-04-04 08:05:54.875 -0500>,<Administrator>,<TOPSPIN>,<proc1d>,<TOPSPIN 2.1>,
      <abs ABSG = 5 
       data hash MD5: 32K
       16 F5 D0 C1 DE 0A 2C 1D 6D 19 64 79 9B 3E DA 51>)
(   9,<2012-04-04 08:05:59.140 -0500>,<Administrator>,<TOPSPIN>,<audit>,<TOPSPIN 2.1>,
      <user comment:
       ICON-NMR User ID: COFFEE
       data hash MD5: 32K
       16 F5 D0 C1 DE 0A 2C 1D 6D 19 64 79 9B 3E DA 51>)
$$ [...]
##$TP= (0..7)
150 150 150 150 150 150 150 150
##$TP07= 0
##$TPNAME0= <>
##$TPNAME1= <>
##$TPNAME2= <>
##$TPNAME3= <>
##$TPNAME4= <>
##$TPNAME5= <>
##$TPNAME6= <>
##$TPNAME7= <>
##$TPOAL= (0..7)
0.5 0.5 0.5 0.5 0.5 0.5 0.5 0.5
##$TPOFFS= (0..7)
0 0 0 0 0 0 0 0
##$TUNHIN= 0
##$TUNHOUT= 0
##$TUNXOUT= 0
##$USERA1= <user>
##$USERA2= <user>
##$USERA3= <user>
##$USERA4= <user>
##$USERA5= <user>
##$V9= 5
##$VALIST= <valist>
##$VCLIST= <CCCCCCCCCCCCCCC>
##$VD= 0
##$VDLIST= <DDDDDDDDDDDDDDD>
##$VPLIST= <PPPPPPPPPPPPPPP>
##$VTLIST= <TTTTTTTTTTTTTTT>
##$WBST= 2048
##$WBSW= 25
##$XGAIN= (0..3)
0 0 0 0
##$XL= 0
##$YL= 0
##$YMAX_a= 535126
##$YMIN_a= -653159
##$ZGOPTNS= <>
##$ZL1= 120
##$ZL2= 120
##$ZL3= 120
##$ZL4= 120
##$ABSF1= 14.98061
##$ABSF2= -5.57192
##$ABSG= 5
##$ABSL= 3
##$ALPHA= 0
##$AQORDER= 0
##$ASSFAC= 0
##$ASSFACI= 0
##$ASSFACX= 0
##$ASSWID= 0
##$AUNMP= <proc_prof1d_extract_pilot.lims>
##$AXLEFT= 0
##$AXNAME= <>
##$AXNUC= <1H>
##$AXRIGHT= 0
##$AXTYPE= 0
##$AXUNIT= <>
##$AZFE= 0.1
##$AZFW= 0.1
##$BCFW= 0
##$BC_mod= 0
##$BYTORDP= 0
##$COROFFS= 0
##$CY= 15
##$DATMOD= 1
##$DC= 0
##$DFILT= <>
##$DTYPP= 0
##$F1P= 0
##$F2P= 0
##$FCOR= 0.5
##$FTSIZE= 32768
##$FT_mod= 6
##$GAMMA= 0
##$GB= 0
##$INTBC= 1
##$INTSCL= 1
##$ISEN= 128
##$LB= 0
##$LEV0= 0
##$LPBIN= 0
##$MAXI= 10000
##$MC2= 0
##$MEAN= 0
##$ME_mod= 0
##$MI= 0
##$NCOEF= 0
##$NC_proc= -8
##$NLEV= 6
##$NOISF1= 0
##$NOISF2= 0
##$NSP= 0
##$NTH_PI= 0
##$NZP= 0
##$OFFSET= 14.98061
##$PC= 1
##$PHC0= 213.2996
##$PHC1= 0
##$PH_mod= 1
##$PKNL= yes
##$PPARMOD= 0
##$PPDIAG= 0
##$PPIPTYP= 0
##$PPMPNUM= 2147483647
##$PPRESOL= 1
##$PSCAL= 4
##$PSIGN= 0
##$PYNMP= <proc.py>
##$REVERSE= no
##$SF= 400.13
##$SI= 32768
##$SIGF1= 0
##$SIGF2= 0
##$SINO= 400
##$SIOLD= 32768
##$SPECTYP= <>
##$SREGLST= <1H.CDCl3>
##$SSB= 0
##$STSI= 32768
##$STSR= 0
##$SW_p= 8223.68421052632
##$SYMM= 0
##$S_DEV= 0
##$TDeff= 65536
##$TDoff= 0
##$TI= <>
##$TILT= no
##$TM1= 0
##$TM2= 0
##$TOPLEV= 0
##$USERP1= <user>
##$USERP2= <user>
##$USERP3= <user>
##$USERP4= <user>
##$USERP5= <user>
##$WDW= 1
##$XDIM= 32768
##$YMAX_p= 470110967
##$YMIN_p= -731814
##$CURPLOT= <Network HP LaserJet P1505>
##$CURPRIN= <$Network HP LaserJet P1505>
##$DFORMAT= <normdp>
##$LAYOUT= <+/1D_H.xwp>
##$LFORMAT= <normlp>
##$PFORMAT= <normpl>
##$SURQMSG= 1
$$ End of Bruker specific parameters
$$ ---------------------------------
##NTUPLES= NMR SPECTRUM
##VAR_NAME=  FREQUENCY,     SPECTRUM/REAL,   SPECTRUM/IMAG
##SYMBOL=    X,             R,               I
##VAR_TYPE=  INDEPENDENT,   DEPENDENT,       DEPENDENT
##VAR_FORM=  AFFN,          ASDF,            ASDF
##VAR_DIM=   32768,         32768,           32768
##UNITS=     HZ,            ARBITRARY UNITS, ARBITRARY UNITS
##FACTOR=    0.250966925370066, 1,           1
##FIRST=     8223.43324360095, 7636,         71909
##LAST=      0,             -29286,          -185100
##MIN=       0,             -731814,         0
##MAX=       8223.43324360095, 470110967,    0
$$ Real data points
##PAGE= N=1
##DATA TABLE= (X++(R..R)), XYDATA
$$ [...]
19467g9511A54488L3053D8475A659a08993l2356M5957j06160B616b3654k73812
$$ -79511 154488 187541 48475 1659 -108993 -141349 -95392 -201552 2616 -23654 -297466
19456b97466a42322q3278k58113b1905j46526B87070A5712a66260O3326A05483
$$ -297466 -142322 -225600 -483713 -21905 -168431 287070 15712 -166260 -102934 105483
19445G3829A2948a34088L9280q0041N030g5685A13357F361a50738j72772D1693
$$ 73829 12948 -134088 -94808 -174849 -169819 -75685 113357 6361 -150738 -323510 41693
19433E4838b34956A60595c07960C3248c6849J1952A39069a41495c059o2487B45673
$$ 54838 -234956 160595 -307960 33248 -36849 -24897 139069 -141495 -3059 -65546 245673
19421d61227b14221O6404l29624a11331N0671q9734B72383b59573A66022d3729
$$ -461227 -214221 -147817 -477441 -111331 -60660 -150394 272383 -259573 166022 -43729
19410C293J17354b19116I9597a22577a6267G7102e6803l6037m7087B68413a08578
$$ 3293 120647 -219116 99597 -122577 -16267 77102 -56803 -92840 -139927 268413 -108578
19398A85357K7114F4410J91646a50920j70026a53154A13913c32390J1381a1104
$$ 185357 212471 64410 256056 -150920 -320946 -153154 113913 -332390 -321009 -11104
19387a1870j16229L8795J5977k92543b9186l25677D1147c83937J07413c5428r8096
$$ -11870 -128099 -89304 -73327 -365870 -29186 -354863 41147 -383937 -276524 -35428 -133524
19376a33524H870c61289Q5342a15728A86718o9894j2648a01191B15914l6085a34473
$$ -133524 8870 -361289 -275947 -115728 186718 116824 104176 -101191 215914 179829 -134473
19364h0638r3760j2829g9635r0833j82b6325k51508J13794B71450b77j00002B0692
$$ -80638 -174398 -187227 -79635 -170468 -170650 -26325 -277833 -164039 271450 -277 -100279 20692
19351d48606H3611n020a83591E3976a14370d9075l9195k42213a48620d6432C656
$$ -448606 83611 78591 -183591 53976 -114370 -49075 -88270 -330483 -148620 -46432 3656
19339b57253j8924i1027c379j1789k42655m5826J30873n0624d0405k26905f6099
$$ -257253 -276177 -91027 -3379 -15168 -257823 -303649 -172776 -223400 -40405 -267310 -66099
19327b98768c8548r7624k20747Q8093J14095d0173k2722o5846j36912J07380B74407
$$ -298768 -38548 -136172 -356919 -268826 -154731 -40173 -62895 -128741 -265653 -158273 274407
19315f1305p6357E7339B2623g7344j35121J7823K43A00421b19494J01525K3914
$$ -61305 -137662 57339 22623 -77344 -212465 -194642 -194399 100421 -219494 -117969 -94055
19304i4055j60407c9506j12396f0212K3802k34448A04658f3349k12447A73158
$$ -94055 -254462 -39506 -151902 -60212 -36410 -270858 104658 -63349 -275796 173158
19293b239A258b92998Q9748P5490e3595O473l26043r87P1564F0821J70552p8467
$$ -2239 1258 -292998 -203250 -127760 -53595 -47122 -373165 -374152 -302588 60821 231373 152906
19281A52906a01971n1719k55585N4879h7605j42356i9339o7174N8969B0556a1491
$$ 152906 -101971 -153690 -409275 -354396 -87605 -229961 -99339 -166513 -107544 20556 -11491
19269B53148D6290a48427L8206k59888M8867B70249B1910J52480G9836C7848b2858
$$ 253148 46290 -148427 -110221 -370109 -321242 270249 21910 174390 79836 37848 -22858
19257E0777J05192l8478B1504c07925I0263a70583B20353B5233G109i1613K90
$$ 50777 155969 117491 21504 -307925 90263 -170583 220353 25233 7109 -91613 -91323
19246i1323d3550k43751j27585R8665g4810p7631N7531c4343a5833j72241N0470
$$ -91323 -43550 -287301 -414886 -316221 -74810 -152441 -94910 -34343 -15833 -188074 -137604
19235a37604B0034a36953o451B42925n6437a78284j74964C6349a99614d2674r716
$$ -137604 20034 -136953 -143404 242925 186488 -178284 -353248 36349 -199614 -42674 -52390
19224e2390A40221i3827j85187L1337i8481L2849k17431a6677m02395g5823m9077
$$ -52390 140221 -93827 -279014 -247677 -98481 -65632 -283063 -16677 -419072 -75823 -124900
19213a24900I6944H459e170E8902a36312J7226A0208b36379M9936j58381g009
$$ -124900 96944 8459 -5170 58902 -136312 -119086 10208 -236379 -186443 -344824 -7009
19201A11205M9876b04308f7544m88331h218j17740A36652o5873J23883c7552k11969
$$ 111205 161081 -204308 -67544 -555875 -8218 -125958 136652 70779 194662 -37552 -249521
19190b49521g8779c7484A17242B2548L26951c13286A1264i0991j9350l3179b1065
$$ -249521 -78779 -37484 117242 22548 349499 -313286 11264 -90991 -110341 -143520 -21065
19178a04781D57222j44706b59497a19284j87766j983A09615f0173n8884k36108
$$ -104781 457222 312516 -259497 -119284 -307050 -309033 109615 -60173 -119057 -355165
19168c55165h9576A68580D1635K69446c2621l15027d161j46173k31484b9496L850
$$ -355165 -89576 168580 41635 311081 -32621 -347648 -4161 -150334 -381818 -29496 -25646
19157b5646j18559B66987D5875a68212b4472A31540a01079k23505M4109h7002
$$ -25646 -144205 266987 45875 -168212 -24472 131540 -101079 -324584 -280475 -87002
19146a82083B28525A7080J88867a95037I3547P0662i9431d0278j20275o6370L034
$$ -182083 228525 17080 205947 -195037 93547 164209 -99431 -40278 -160553 -226923 -223889
19135b23889H5672a92508o8990A80010b14214c827m12152A6410b34357g4795A04145
$$ -223889 85672 -192508 -261498 180010 -214214 -3827 -415979 16410 -234357 -74795 104145
19123b43249n5554a16312H1083R5089c6651l53336A37013b34571A28839b18420
$$ -243249 -298803 -116312 81083 176172 -36651 -389987 137013 -234571 128839 -218420
19112E562g8398J9163A19648C9662L186b18920g4769B9019b1951C39641b19188
$$ 5562 -78398 -59235 119648 39662 42848 -218920 -74769 29019 -21951 339641 -219188
19100e5836j78605P7795j48112J17307A21953H928P8480a44320j11730A21588
$$ -55836 -234441 -156646 -304758 -187451 121953 8928 87408 -144320 -256050 121588
19089i0959A64237f7270m5782p7367I360g2255A7115J74925A1759c55460B85012
$$ -90959 164237 -67270 -113052 -190419 9360 -72255 17115 192040 11759 -355460 285012
19077b00583G6983j5952i3147A2039K5756l696g5093B376c98291H4614f9911j61535
$$ -200583 76983 61031 -93147 12039 37795 34099 -75093 2376 -398291 84614 -69911 -231446
19065b31446f4946q2753L104B25371a51745I2384a3048k18524i1082F4851a15191
$$ -231446 -64946 -147699 -144595 225371 -151745 92384 -13048 -231572 -91082 64851 -115191
19053a35589I4276b77718H6353a67518M2752A28352f3416C7164a76080G7501a90720
$$ -135589 94276 -277718 86353 -167518 -124766 128352 -63416 37164 -176080 77501 -190720
19041b77374A86549C9822b5444l3556A71019K9739b82663a16597q4882i9788D13
$$ -277374 186549 39822 -25444 -59000 171019 200758 -282663 -116597 -201479 -99788 413
19029a63742C4529a12292k8839A5755N316i8445l22566a90973P0813K0849j76847
$$ -163742 34529 -112292 -141131 15755 21071 -98445 -421011 -190973 -120160 -99311 -276158
19018b76158A50978f9948j0301B09016j6319a87874K9321j20578l9468g8872j23120
$$ -276158 150978 -69948 -80249 209016 192697 -187874 -158553 -279131 -318599 -78872 -201992
19007b01992A05856c397C0488f3109A3735c02415a00494l88666e4920j59083k95583
$$ -201992 105856 -3397 30488 -63109 13735 -302415 -100494 -489160 -54920 -214003 -509586
18996e09586b45176h3372A89049c7873B70303a733B0815J54981i8162j03486Q5659
$$ -509586 -245176 -83372 189049 -37873 270303 -1733 20815 175796 -98162 -201648 -115989
18985a15989k97448a73777k2217I9728K9149b81221C58435b0533c654A37867e2878
$$ -115989 -413437 -173777 -195994 99728 128877 -281221 358435 -20533 -3654 137867 -52878
18973I4157J39026h3746D3351a26435k29541A63285B8950b37978A78175h0034
$$ 94157 233183 -83746 43351 -126435 -355976 163285 28950 -237978 178175 -80034
18962I1348h7102C0363o632N5100K07521M74045B04176P2994E4049J18568m7569
$$ 91348 -87102 30363 23731 78831 286352 760397 204176 277170 54049 172617 125048
18951A25048R5085b82684A48217j1804k676c96210h5637k3468J1964q5779c0206
$$ 125048 220133 -282684 148217 136413 133737 -396210 -85637 -109105 -97141 -182920 -30206
18939A49349B0540R2229b76968J24591o3448f4594A30101a74089j11721d9668
$$ 149349 20540 112769 -276968 -152377 -215825 -64594 130101 -174089 -285810 -49668
18928E1558h6580p1065B56299r8412B7415c1615j3031D858J87737a66022g9387
$$ 51558 -86580 -157645 256299 157887 27415 -31615 -44646 4858 192595 -166022 -79387
18916A1627a24142A6666i7891j54508A14036a98696A23245K15696K2477b6542
$$ 11627 -124142 16666 -97891 -252399 114036 -198696 123245 338941 361418 -26542
18905B16857a06082j13629b4037A1126P6502d4149H3483C1550N9710L26870A82329
$$ 216857 -106082 -219711 -24037 11126 87628 -44149 83483 31550 91260 418130 182329
18893D74157n7275j58538h2770A75734F4132e3215j08879E2686K34737a25562
$$ 474157 416882 258344 -82770 175734 64132 -53215 -162094 52686 287423 -125562
18882F7338k0277b68130h4435j47088C1152d39695a43305A74086b75753j14004
$$ 67338 47061 -268130 -84435 -231523 31152 -439695 -143305 174086 -275753 -389757
18872c89757L0212J39557A44027b65806I8968D2219b60540I7711n548b87664j72188
$$ -389757 -359545 -219988 144027 -265806 98968 42219 -260540 97711 92163 -287664 -459852
18861d59852c7830A91365g2279l23501D5956k765K13068b97466d5898k65394J53464
$$ -459852 -37830 191365 -72279 -395780 45956 43191 256259 -297466 -45898 -311292 -157828
18850a57828A03685b58753d2969k43826A3536d80255A12273m6422h5887R263j53594
$$ -157828 103685 -258753 -42969 -286795 13536 -480255 112273 65851 -85887 -76624 -230218
18839b30218B6486a63795b7911j47483k8309B40070E9614b47908B0558N03788
$$ -230218 26486 -163795 -27911 -175394 -203703 240070 59614 -247908 20558 524346
18829E24346b7420j52988H4474k441a12260M8222K5108j83112E7366J99467f7595
$$ 524346 -27420 -180408 84474 82033 -112260 -64038 -38930 -222042 57366 256833 -67595
18817A53144n5284b32206P4746D725J26890a77219a9996j01967b5050k00828b4336
$$ 153144 97860 -232206 -157460 4725 131615 -177219 -19996 -121963 -25050 -225878 -24336
18805b94752B58150H2226a99881q5796a20903M419G2820d3164k0165C78870d7547
$$ -294752 258150 82226 -199881 -285677 -120903 -116484 72820 -43164 -63329 378870 -47547
18793A27078M0080j2999N8952o8188A9415c07312A91409J40738a48264j2170f0963
$$ 127078 167158 154159 213111 144923 19415 -307312 191409 332147 -148264 -160434 -60963
18781A08108c34054f86C15646j20206e4031j91967P4267o5641L82C6175a79456
$$ 108108 -334054 -686 315646 195440 -54031 -245998 -171731 -237372 -236990 36175 -179456
18769C7713e7665C20013d0813k74404h9387G4850Q9773b06493i5286D0033d5434
$$ 37713 -57665 320013 -40813 -315217 -89387 74850 164623 -206493 -95286 40033 -45434
18757h3203D792J55339d5314r8429A22159a10235j96751J51513j7456b7698k04641
$$ -83203 4792 160131 -45314 -143743 122159 -110235 -306986 -155473 -172929 -27698 -232339
18746b32339N7580J1048j77458a04055d2604H8915M5734a08183A22587C4674a0029
$$ -232339 -174759 -163711 -341169 -104055 -42604 88915 134649 -108183 122587 34674 -10029
18734g1137I494P8619J09585h1n75677a87289K7395C69158d5565k8924A04113
$$ -71137 9494 88113 197698 -81 -575758 -187289 -159894 369158 -45565 -74489 104113
18722a8434j4569A3455K58977i6548j05404g5779j19420h5023A46327J7052K3384
$$ -18434 -33003 13455 272432 -96548 -201952 -75779 -195199 -85023 146327 163379 186763
18711A86763F9761a47588C15146H5636b07366K1652a342C52426A52081a679G3225
$$ 186763 69761 -147588 315146 85636 -207366 -185714 -1342 352426 152081 -1679 73225
18699a80709f9749F1562a41583e8214A91418a5884f69k15874B2242b97191I7707
$$ -180709 -69749 61562 -141583 -58214 191418 -15884 -669 -216543 22242 -297191 97707
18687A31702a94230B2142a04615g17A72669E572N04619a67339B50856a02717E8015
$$ 131702 -194230 22142 -104615 -717 172669 5572 510191 -167339 250856 -102717 58015
18675i3419A27624l899b29961q3145J04744i6921j19912J07289q2506A9760a72379
$$ -93419 127624 123725 -229961 -313106 -208362 -96921 -216833 -109544 -192050 19760 -172379
18663i8977j04008F2401b48009h0710B83197a66297j22652H8100b00030r908B27434
$$ -98977 -202985 62401 -248009 -80710 283197 -166297 -288949 88100 -200030 -209938 227434
18651f9188K9036j95379A80119d8614j34452a5430A2621e3335m8549A28705i0659
$$ -69188 -40152 -235531 180119 -48614 -183066 -15430 12621 -53335 -101884 128705 -90659
18639A57419G718a07924m6383A61384a62030j41726a20429a7477p1490A25604
$$ 157419 7718 -107924 -154307 161384 -162030 -303756 -120429 -17477 -88967 125604
18628A13114P2316a85827g2991B43273A8385a48188E8015a311A66084d54575c2903
$$ 113114 185430 -185827 -72991 243273 18385 -148188 58015 -1311 166084 -454575 -32903
18616D3414C021a40493B8099R1085l6133a42972l21522b6393j25764P3475H5352
$$ 43414 3021 -140493 28099 119184 83051 -142972 -464494 -26393 -152157 -78682 85352
18604b15479Q6061k10445e4555j4111C60068A09718a20155K7443c4407D1652a557
$$ -215479 -129418 -339863 -54555 -68666 360068 109718 -120155 -92712 -34407 41652 -1557
18592b03181J6149N5044B08991k8964a70877g1237k59809j05934G6468e8814A1511
$$ -203181 -187032 -131988 208991 180027 -170877 -71237 -331046 -436980 76468 -58814 11511
18580a76424C4259a58224k8349n3849a6787A54929J02968A6596N0798k6309a49907
$$ -176424 34259 -158224 -186573 -240422 -16787 154929 257897 16596 67394 41085 -149907
18568c9341A2676J75052c422j0716B7008a40604j0153m43428a09052A05728g0494
$$ -39341 12676 187728 -3422 -14138 27008 -140604 -150757 -594185 -109052 105728 -70494
18556D1084a94233J5266j792g7845K3917K2757A17431c21535D6204a10228o520
$$ 41084 -194233 -178967 -180759 -77845 -53928 -31171 117431 -321535 46204 -110228 -116748
18545a16748b6558A4495a66449B35107L1778b33624E1918b44639A69242p2434
$$ -116748 -26558 14495 -166449 235107 266885 -233624 51918 -244639 169242 96808
18535I6808a90033M8754B23292g8238B63934d8569B68748c33809e4575E5242K12375
$$ 96808 -190033 -141279 223292 -78238 263934 -48569 268748 -333809 -54575 55242 267617
18524B67617b07344L3753e8556b6770k79418p4275J76812J4366b2714M983A57722
$$ 267617 -207344 -173591 -58556 -26770 -306188 -380463 -203651 -189285 -22714 -17731 157722
18512g9508L8925q2030j44522m036B70494A0073c21619j41722F4028b49149M6422
$$ -79508 -40583 -122613 -267135 -271171 270494 10073 -321619 -463341 64028 -249149 -202727
18501b02727g747k11384B28245K06813C8099b29382o5911J39459H6201d3454A98524
$$ -202727 -7747 -219131 228245 435058 38099 -229382 -295293 -155834 86201 -43454 198524
18489f334G1602B8273L9300b63904e063j65690A18995n3331J9179a93585k0189
$$ -6334 71602 28273 67573 -263904 -5063 -170753 118995 65664 84843 -193585 -213774
18478b13774i0016k57452J69994f0515r487I9789b58487A12779P9919a98474b4172
$$ -213774 -90016 -347468 -177474 -60515 -70002 99789 -258487 112779 192698 -198474 -24172
18466A33426J75284r2299N459b10458H5928f9429J9090B10333c8525j53765E192
$$ 133426 308710 216411 221870 -210458 85928 -69429 -50339 210333 -38525 -192290 5192
18454d1352H9327D4517a12893E6379a1903A61255a8963m6433r8791D1845g5351
$$ -41352 89327 44517 -112893 56379 -11903 161255 -18963 -65396 -164187 41845 -75351
18442a81080Q5265D3408L09005c3521p0611A7689M7828A4645f229E6446m813c2745
$$ -181080 -95815 43408 352413 -33521 -104132 17689 65517 14645 -6229 56446 51633 -32745
18429C9145F403a03022B40142H9914a4212k1478a1236A52411b16452a505l80434
$$ 39145 6403 -103022 240142 89914 -14212 -35690 -11236 152411 -216452 -1505 -381939
18418c81939f978C35152a72094A21965d70340i2403A39986j9787c7333B6375c5155
$$ -381939 -6978 335152 -172094 121965 -470340 -92403 139986 120199 -37333 26375 -35155
18406B79483j10980a7355I673J94853b42449k132K5353j27051a36579B09956A5197
$$ 279483 168503 -17355 9673 204526 -242449 -244581 -219228 -346279 -136579 209956 15197
18394f5235j83224N6375A12806o141a06390A20563b41680I6763b44521r791J22442
$$ -65235 -248459 -192084 112806 106665 -106390 120563 -241680 96763 -244521 -254312 -131870
18383a31870J501p2487A20058K10281H753L9103i3545j3747o3215n9686n7045
$$ -131870 -130369 -202856 120058 330339 8753 47856 -93545 -107292 -170507 -230193 -287238
18372b87238J21401j94079J77778B02978D0590M2273a30801k40281f8182H4524
$$ -287238 -165837 -359916 -182138 202978 40590 82863 -130801 -371082 -68182 84524
18361B11849a62658o9314Q6456j99192H844J8718a69557A10457B1996e0025A3828
$$ 211849 -162658 -231972 -145516 -344708 8844 27562 -169557 110457 21996 -50025 13828
18349E1260f799F8805L9760d5383A28603R1666M4200K15814b44276P1982J868
$$ 51260 -6799 68805 108565 -45383 128603 220269 264469 480283 -244276 -172294 -170426
18338a70426b3116C0088J757L2220o682L13262g6460G6883J04137c33065a18665
$$ -170426 -23116 30088 31845 64065 57383 370645 -76460 76883 181020 -333065 -118665
18326c21262a14905L5336q402G0897d48636b10358e4926M978j32739j00119A90513
$$ -321262 -114905 -79569 -87971 70897 -448636 -210358 -54926 -49948 -182687 -282806 190513
18314a39494G2623J12154a95742c8386j83647o3683G3526a76327h689F094Q4726
$$ -139494 72623 184777 -195742 -38386 -222033 -285716 73526 -176327 -8689 6094 90820
18303I0820i918j97159h557E9202d18F9685a1407p4478C3308O8114P3226G4674
$$ 90820 -9918 -207077 -8557 59202 -418 69685 -11407 -85885 33308 101422 174648 74674
18290f6853F5385M7549a05874d525m3893m3659a1726k48752A77752E649b82409
$$ -66853 65385 112934 -105874 -4525 -48418 -92077 -11726 -260478 177752 5649 -282409
18278i5152A74038k9863F538J02280m5241J40774F3497J76731f9033A90313q0553
$$ -95152 174038 144175 6538 108818 63577 204351 63497 240228 -69033 190313 109760
18267A09760b04436A57307h0299l485L0477C08151e4089C8059O8771J43915C4194
$$ 109760 -204436 157307 -80299 -83784 -53307 308151 -54089 38059 106830 250745 34194
18255a81225j67472e7731A56761D1849b03393J5161r5829a15096a6518k38942
$$ -181225 -348697 -57731 156761 41849 -203393 -188232 -284061 -115096 -16518 -255460
18245b55460E8709K13712I684a34894L0357k12615J28824C4022a21256p5799I669
$$ -255460 58709 272421 9684 -134894 -104537 -317152 -188328 34022 -121256 -197055 9669
18233a00687m5973L3577e2159J4528G2450C1868a60695j25649C2562a92000E9192
$$ -100687 -146660 -113083 -52159 -37631 72450 31868 -160695 -286344 32562 -192000 59192
18221B20049i6891A73074q4542A5511b09908h1389b4187j63703F3814J9497g6713
$$ 220049 -96891 173074 88532 15511 -209908 -81389 -24187 -187890 63814 83311 -76713
18209I0158B6037J5773B0319K8185J39278a8794F643c27378p9032Q8982A5835
$$ 90158 26037 41810 20319 48504 187782 -18794 6643 -327378 -406410 -317428 15835
18197B72094b40659L5146d5318A61053o3282J67079c08955H733h7161B04018G5143
$$ 272094 -240659 -205513 -45318 161053 97771 264850 -308955 8733 -87161 204018 75143
18185a3449j49038D2251a72981P0975j15690g8207C2961a22974A49857f3895C21105
$$ -13449 -162487 42251 -172981 -102006 -217696 -78207 32961 -122974 149857 -63895 321105
18173f8053A65183l4529K51214m4880h5916C6143a5340A32902J92248e458F029
$$ -68053 165183 130654 381868 336988 -85916 36143 -15340 132902 325150 -5458 6029
18161a8054G3422h7974A3464a93707I9091i5040C2213a76017o5520A36056k6050
$$ -18054 73422 -87974 13464 -193707 99091 -95040 32213 -176017 -241537 136056 110006
18150A10006B8915a67784N3282A40111b96637d7661A17741b7115F4136b5755G7319
$$ 110006 28915 -167784 -114502 140111 -296637 -47661 117741 -27115 64136 -25755 77319
18138b25126C1362b18056g2252b2737q9041c9883B17999a74580a1282m3591B84604
$$ -225126 31362 -218056 -72252 -22737 -111778 -39883 217999 -174580 -11282 -54873 284604
18126b68164B08719b9991j17842A6517b1011H6908J25513j00424b07041k5311
$$ -268164 208719 -29991 -147833 16517 -21011 86908 212421 111997 -207041 -232352
18116b32352g5969j01004o2382Q9781B51381b42829a11246j9337A48675i9465
$$ -232352 -75969 -176973 -239355 -149574 251381 -242829 -111246 -130583 148675 -99465
18105F8127J95845a50871j9966N573A75663G3334O7567o2267M076B4710K22447
$$ 68127 263972 -150871 -170837 -165264 175663 73334 140901 78634 82710 24710 247157
18094B47157r0764a05637H3621c92385i9021j1302B16252B4775h284k1148j33889
$$ 247157 156393 -105637 83621 -392385 -99021 -110323 216252 24775 -8284 -29432 -163321
18083a63321D2184a56629B57939d44835B14269h8510k8159n2364A47636A7635
$$ -163321 42184 -156629 257939 -444835 214269 -88510 -116669 -169033 147636 17635
18072c6888A11654g3282C7082a71498B07261G9848c60700F3325n446e0685H089
$$ -36888 111654 -73282 37082 -171498 207261 79848 -360700 63325 57879 -50685 8089
18060g3563A34388K0904j2809K63826B4318E933a04554K8743A17000J231k3014
$$ -73563 134388 155292 142483 406309 24318 5933 -104554 -75811 117000 118231 95217
18049I5217B8170b12617R5915C38104E1902P498N2952c28550A26359N9045c2649
$$ 95217 28170 -212617 -116702 338104 51902 59400 112352 -328550 126359 185404 -32649
18037g369j92643P0572j6732A19773c11087a53825l0621f1016F0224a55600P1998
$$ -7369 -200012 -129440 -146172 119773 -311087 -153825 -184446 -61016 60224 -155600 -83602
18026h3602d0491p4087D21051I967Q9465e0853E4930g6603j81437A99468o8860
$$ -83602 -40491 -114578 421051 9967 99432 -50853 54930 -76603 -258040 199468 130608
18015A30608L3946i1109A363J17205A0598e482q7261J4086B58195C7473a23867
$$ 130608 164554 -91109 1363 118568 10598 -5482 -92743 -78657 258195 37473 -123867
18003e6966C22358a9857a109A8916a38295o1576Q5575L2458j30087f9312A62519
$$ -56966 322358 -19857 -1109 18916 -138295 -199871 -114296 -81838 -211925 -69312 162519
17991c91830C35976A26881a36462N7545a246B45709a35655k00859I3871B6048
$$ -391830 335976 126881 -136462 -78917 -1246 245709 -135655 -336514 93871 26048
17980d68165F1666b9775A19945k1942a51822B70276a02550E5255a49037A99486
$$ -468165 61666 -29775 119945 98003 -151822 270276 -102550 55255 -149037 199486
17969A66524a97960E14611I3983j358L56278b79293E7050a55020A51072C9541
$$ 166524 -197960 514611 93983 92625 448903 -279293 57050 -155020 151072 39541
17958g6089F7731O9921E5416N790K11482j18279g8598B73837F3725a59707A78938
$$ -76089 67731 137652 55416 61206 272688 154409 -78598 273837 63725 -159707 178938
17946E7833k1779M9587b55322F2879Q4991A1480a9960A8261O1654b5055A30996
$$ 57833 36054 85641 -255322 62879 147870 11480 -19960 18261 79915 -25055 130996
17934G0069c55578A80170D843K10151E5523a38275f2105J3550A11588A0224c22065
$$ 70069 -355578 180170 4843 214994 55523 -138275 -62105 -48555 111588 10224 -322065
17922i606C24059D1074a55028B0495L0304a19798e7134E6563c82788a45602C00850
$$ -9606 324059 41074 -155028 20495 50799 -119798 -57134 56563 -382788 -145602 300850
17910A76421b92511g0503A96195a45991A77070m385A704b93656B1931a02680c2444
$$ 176421 -292511 -70503 196195 -145991 177070 172685 1704 -293656 21931 -102680 -32444
17898C42552a26103f2465j17016k5025B96005F0246K2004C1009g8531n549i311
$$ 342552 -126103 -62465 -179481 -204506 296005 60246 82250 31009 -78531 -84080 -9311
17886f7089E6645A1134a30235d537k17231A49606a23896A21506K06655a6806B60402
$$ -67089 56645 11134 -130235 -4537 -221768 149606 -123896 121506 328161 -16806 260402
17874C9038a25591A38103n4127Q1045d3751B3829K1306K03370A14481a02438B48103
$$ 39038 -125591 138103 83976 165021 -43751 23829 45135 248505 114481 -102438 248103
17862a40090B18139H4649M3870J18767A18703Q9777l2754e962B51425A00738d2008
$$ -140090 218139 84649 128519 247286 118703 208480 175726 -5962 251425 100738 -42008
17850c30525B17531a3394j95297A34895n3573B6601K21287H3813J05023B4946
$$ -330525 217531 -13394 -208691 134895 81322 26601 247888 83813 188836 24946
17839A78835H8844c6476l815p9852f0046j9537C4376J9990b8080k5135H5881f7424
$$ 178835 88844 -36476 -40291 -120143 -60046 -79583 34376 54366 -28080 -53215 85881 -67424
17826C01892j42001e9490C16263a53118A14572K26538k0722B2154g6662B35645
$$ 301892 159891 -59490 316263 -153118 114572 341110 320388 22154 -76662 235645
17815D5215R6226K50199a80814g3030C4076o233J706J00404b23978D6149b7673
$$ 45215 141441 391640 -180814 -73030 34076 27843 29549 129953 -223978 46149 -27673
17803F6164O5812o0540a76879j0731F9730J34595a26314j16887A24495m9744N2515
$$ 66164 131976 71436 -176879 -187610 69730 204325 -126314 -243201 124495 74751 127266
17792A27266B0236O4706b58384B22352b24399j56213E7864L9197D0015b26489
$$ 127266 20236 84942 -258384 222352 -224399 -380612 57864 97061 40015 -226489
17781B03513p4582J43552H9118D1386R0392a19169A83506j8853a00300G7010A1482
$$ 203513 128931 272483 89118 41386 131778 -119169 183506 164653 -100300 77010 11482
17769B13897n5411b54000b9434H2278J29026g2377e882j02425j56460H8339a87841
$$ 213897 158486 -254000 -29434 82278 211304 -72377 -5882 -108307 -264767 88339 -187841
17757B39778e6275C6776K10133i476q8103D05211G521a20138C27963A61705A2941
$$ 239778 -56275 36776 246909 -9476 -97579 405211 7521 -120138 327963 161705 12941
17745a34909B8478M23426i8794l3999A48892O1708E5143K92506h4118B66864D1466
$$ -134909 28478 451904 -98794 -132793 148892 210600 55143 347649 -84118 266864 41466
17733B59440D5598J09102J64508f7856A43314J99019f2025k1152b8930A669J22828
$$ 259440 45598 154700 319208 -67856 143314 342333 -62025 -83177 -28930 1669 124497
17722A24497e0741k26840A03900k6723J85309p11A05469a2310D14987b00141D1092
$$ 124497 -50741 -277581 103900 77177 262486 261775 105469 -12310 414987 -200141 41092
17710A53391K09541I7784d9458B61810E20J35182a20833F8122K16052D1948f2906
$$ 153391 362932 97784 -49458 261810 520 135702 -120833 68122 284174 41948 -62906
17698f6167K8221C52345G9408c48958K1264B56827e419A04969K79109I333K4090
$$ -66167 -37946 352345 79408 -348958 -327694 256827 -5419 104969 384078 9333 33423
17687C3423J1152K13678G3416J26318j269n569c7173D0174K45902F1298j2676
$$ 33423 44575 258253 73416 199734 198465 192896 -37173 40174 286076 61298 48622
17676D8622i164n9267D40071j68037j29528b14346D16355d8728B46377A05331
$$ 48622 -9164 -68431 440071 272034 142506 -214346 416355 -48728 246377 105331
17665D54073f2641B13701a69101A97716r2461a97025B40159f5854H2889L33358
$$ 454073 -62641 213701 -169101 197716 105255 -197025 240159 -65854 82889 416247
17655D16247a32341D04901a59153A74364o4441e7832D03843a52273A82942q3230
$$ 416247 -132341 404901 -159153 174364 109923 -57832 403843 -152273 182942 99712
17645I9712J80478a9703A06980a90734A09000e27776A11789j4350A4521J23560
$$ 99712 280190 -19703 106980 -190734 109000 -527776 111789 97439 14521 138081
17635A38081K7249J95685a91990E9397K9J9832k0049M3977a10591M1106q5555
$$ 138081 165330 361015 -191990 59397 59426 79258 59209 103186 -110591 -69485 -155040
17624a55040C1225K37954A29382j6898J9065c6072l6701b434B47484p0004a59676
$$ -155040 31225 269179 129382 112484 131549 -36072 -72773 -2434 247484 177480 -159676
17612B06737H4683J19223b61891C04438A6499J96436f2776G9741J8204f6224B56155
$$ 206737 84683 203906 -261891 304438 16499 212935 -62776 79741 97945 -66224 256155
17600B74476M5777j36591d18769F4041b9417B42059f6933F03956c98438A16854
$$ 274476 320253 183662 -418769 64041 -29417 242059 -66933 603956 -398438 116854
17589B18123J13608A40563J09146G0386K14604f8096B39910d40481C58615a54236
$$ 218123 331731 140563 249709 70386 284990 -68096 239910 -440481 358615 -154236
17578G4546K37909I1752J32973M7357h1780B13690B7141e1119E8921A3563K11866
$$ 74546 312455 91752 224725 272082 -81780 213690 27141 -51119 58921 13563 225429
17567B25429O671p3305f9977C50661Q3875A40778a2548B98503A2689L49135c3074
$$ 225429 232100 158795 -69977 350661 434536 140778 -12548 298503 12689 361824 -33074
17555A72941l3583a66482D6175L00600A49116K56334G8463r752J64482n5649J24783
$$ 172941 139358 -166482 46175 346775 149116 405450 78463 68711 233193 177544 302327
17544C02327o3268a42137B24384O6547J25524A73707M8823Q6497A30133a26642
$$ 302327 239059 -142137 224384 290931 416455 173707 222530 309027 130133 -126642
17533E25397E7933J72621I9963a2880C46261j44340q7067j410J03371J96878b0688
$$ 525397 57933 230554 99963 -12880 346261 201921 114854 113444 216815 413693 -20688
17521B18640k8820K06955j34738M2120J45132j86979C8099M32794J80110A99052
$$ 218640 189820 396775 262037 304157 449289 262310 38099 470893 651003 199052
17510G92581A26382O42527n0005O66M01895m60881p8718k32804J95913J11891
$$ 792581 126382 768909 718904 719570 1121465 660584 581866 349062 544975 656866
17500F56866B07103K99621j76484J69183M77538j10396j24487J86525j9982j99715
$$ 656866 207103 506724 330240 499423 976961 866565 742078 928603 908621 708906
17490G08906q0600k17505K33023j58795M4946k02257l8322L20761k12359N1512
$$ 708906 628306 410801 643824 485029 529975 327718 289396 610157 397798 449310
17480D49310j91326J00522j48561L39497k36156J13630A34252O1923j7696H7587
$$ 449310 257984 358506 209945 549442 313286 426916 134252 196175 178479 87587
17469C69068j12427K18379A52440Q9905J62044j6302j44250J7260J90351K12335
$$ 369068 256641 475020 152440 242345 404389 388087 243837 261097 451448 663783
17459F63783k04770n6948j70210A4571M35731A28980L86374B17271P7182L9167
$$ 663783 459013 402065 231855 14571 450302 128980 515354 217271 294453 333620
17449C33620L6288M7576j37847K5908K96250B72988L51656B68807g6995A24876
$$ 333620 369908 417484 279637 305545 601795 272988 624644 268807 -76995 124876
17438g889E73965j41597M6501k5863e7375C90407p7002L06812A34630M0823P0191
$$ -7889 573965 432368 478869 453006 -57375 390407 313405 620217 134630 175453 245644
17427B45644K88557A73543M17745A99403M5005C7461K27015B7951J43481L22768
$$ 245644 534201 173543 591288 199403 244408 37461 264476 27951 171432 494200
17417D94200j12631J25307J13340A88276P4783A24174J34441N7259R7467k1385
$$ 494200 381569 506876 620216 188276 263059 124174 258615 315874 413341 391956
17407C91956K2677j94782L48170B47969R2407j11692K17816o5186J49504j4700
$$ 391956 414633 219851 568021 247969 340376 228684 446500 381314 530818 516118
17397E16118A69116J91047F7685P1893a82835c4543B04448k9374C1061K22331
$$ 516118 169116 360163 67685 139578 -182835 -34543 204448 175074 31061 253392
17387B53392M847K56499B17563k3375m685R1921J83491b30070A21177d7508C09916
$$ 253392 258239 514738 217563 194188 189503 281424 464915 -230070 121177 -47508 309916
17375C48493A62279J67036A56547K27931m9825a33827D73335N750J08103j88151
$$ 348493 162279 329315 156547 384478 334653 -133827 473335 479085 587188 399037
17365C99037k2751a49876C22617N1791J00282H06K63435L95959E0291J43771G8473
$$ 399037 376286 -149876 322617 374408 474690 806 264241 660200 50291 194062 78473
17353D23384K7174A87050L66774k42555A24468O6922J97150j13942F6085P1574
$$ 423384 450558 187050 553824 311269 124468 191390 388540 274598 66085 137659
17343A37659M84696C1342K45998B1108L95981k1941A44657M7965J61070l0539
$$ 137659 622355 31342 277340 21108 417089 395148 144657 192622 353692 323153
17333C23153M6342q4272j08451I683K86981f2517B24944j07745a7334B21703K90496
$$ 323153 369495 285223 176772 9683 296664 -62517 224944 117199 -17334 221703 512199
17322E12199A52025J02107J68437O3587j66877Q513B0774q598a17126A81128R3482
$$ 512199 152025 254132 422569 486156 319279 327792 20774 12176 -117126 181128 274610
17311B74610j10651K28511p424D6940M91771K5568c8780D94822j92900K22007
$$ 274610 163959 392470 385046 46940 538711 564279 -38780 494822 301922 523929
17301E23929B0656L88114p2168l7448J74067A96491K90971A50038J75234A52010
$$ 523929 20656 408770 336602 299154 473221 196491 487462 150038 325272 152010
17290A05865J14393J22819K41865B54079L4127n1606K25202j30134A08848K27640
$$ 105865 220258 343077 584942 254079 288206 236600 461802 331668 108848 336488
17280C36488A21607J08860K94377q2905A459J90841G5056d1698B60809r6433K0742
$$ 336488 121607 230467 524844 441939 1459 192300 75056 -41698 260809 164376 185118
17269A85118J72906M5280l2176j17435P0010j57629J65567j31065l986L48974
$$ 185118 358024 403304 371128 253693 323703 166074 331641 200576 196590 545564
17259E45564B09075J31513J25462j87635p2326K96943B22197J40378j11248K55154
$$ 545564 209075 340588 466050 278415 206089 503032 222197 362575 251327 506481
17249E06481d6981A19509M92678k80210K8034j4676p0487A21158J73877R2767
$$ 506481 -46981 119509 612187 331977 360011 345335 274848 121158 295035 387802
17239C87802J6883K40550C01724K54191A08066J24420M35940k46759L3250j77355
$$ 387802 404685 645235 301724 555915 108066 232486 668426 421667 454917 277562
17229B77562A00191J99683K99340j30499j95383o8016L34495L5453B47768P681
$$ 277562 100191 299874 599214 468715 273332 205316 539811 575264 247768 255449
17219B55449L64251k28381M628J01040M1369O945j7934B37218K43777E235K43152
$$ 255449 619700 391319 395947 496987 538356 545301 527367 237218 480995 5235 248387
17208B48387q5172d1913E65249M8456A82719L44916J59992j44022k53841K69591
$$ 248387 163215 -41913 565249 613705 182719 527635 687627 543605 289764 559355
17198E59355l2126j64022n4599R4865m0116L3142j42678N5501A38356M66736k791
$$ 559355 527229 363207 308608 403473 363357 396499 253821 309322 138356 605092 602301
17187F02301B76680J84541k21909c4715B27875J45946M12379j63856j29730p5184
$$ 602301 276680 461221 239312 -34715 227875 373821 786200 622344 492614 417430
17177D17430R413j76520L18618k57027M45182k32789k60375K10192R2647k31384
$$ 417430 426843 250323 568941 311914 757096 524307 263932 474124 566771 335387
17167C35387A43112N29983k34585l073o6412n9641I5977L91175K24068C34044
$$ 335387 143112 673095 438510 435437 369025 309384 95977 487152 711220 334044
17156B92074J95564R28j10628k8043L99365C39562M59370l97119J05554k40699
$$ 292074 487638 488566 377938 349895 749260 339562 798932 401813 507367 266668
17146B66668J16762K04479L603J39399j36017J65139C50179K04641L930r6863
$$ 266668 383430 587909 591512 730911 594894 760033 350179 554820 558750 461887
17136D61887L6463L4388j43600J0440Q0261j13872J83929J30338j50868J88754
$$ 461887 498350 532738 389138 399578 479839 365967 549896 680234 529366 718120
17126G18120k47809K63849k07781K5803k08236j47529M17907K07362D08837K00722
$$ 718120 470311 734160 526379 552182 343946 196417 614324 821686 408837 609559
17116F09559o1033O1004k8963j1374o6698j3539j34643R2239N0757M03432l22537
$$ 609559 548526 609530 580567 569193 502495 488956 354313 446552 497309 900741 578204
17105E78204m0404j31132L60267j21335j73673J11889r1482J40186O3238k8208
$$ 578204 537800 406668 766935 645600 471927 583816 492334 632520 695758 667550
17095F67550o8254J87187j38988K8292k92000K32230q46q2501J27055M3765p2429
$$ 667550 599296 786483 647495 675787 383787 616017 615171 532670 659725 703490 631061
17084F31061j81803L25821J01543o9995q8073j86556l6567R7301L18765M7105
$$ 631061 449258 775079 876622 806627 718554 531998 495431 592732 911497 958602
17074I58602D66687K06756J57803l83277J40708k0410j25953N51923m66027K81283
$$ 958602 466687 673443 831246 447969 588677 568267 442314 994237 528210 809493
17064H09493j49924P2110K33495C47401L27951j44124M6312o3509L04929K88809
$$ 809493 659569 731679 965174 347401 675352 531228 577540 514031 818960 1107769
17054A107769l59381k03134N90727n8368l45291j64223K53847k57614L57333l42192
$$ 1107769 748388 545254 1135981 1077613 732322 568099 821946 564332 921665 579473
17044E79473J76220K7741J95585j57544M3185J29952l4552D69945n0562N98832
$$ 579473 755693 783434 979019 821475 864660 994612 960060 469945 419383 1018215
17034A018215J36176k75254j99587L91433l3961j0028l1589j93757K03928l84790
$$ 1018215 1154391 879137 679550 1070983 1037022 1026994 995405 801648 1005576 620786
17024F20786L46707l1374O2174k30005K92370J84336j838l48369k06038N68018
$$ 620786 967493 936119 998293 768288 1060658 1244994 1243156 894787 688749 1256767
17014A256767l59628j44836J53221J94995o4689j68901q6334K75158J86712m2145
$$ 1256767 897139 752303 905524 1100519 1035830 866929 780595 1055753 1242465 1200320
17004A200320j3469o1101r3990J54878m40939M19892k84500K16536j52897Q4995
$$ 1200320 1186851 1125750 1031760 1186638 745699 1165591 881091 1097627 944730 1029725
16994A029725J17722L7779j16977K45689k96577J34761O6468l17020m0319J66238
$$ 1029725 1147447 1185226 1068249 1313938 1017361 1152122 1218590 901570 861251 1027489
16984A027489M40105k10802j5313K01389J89486n36415M1603K72959l1909k08418
$$ 1027489 1467594 1256792 1241479 1442868 1632354 1095939 1137542 1410501 1378592 1170174
16974A170174N838J26560L55963m85191J27698K87918l19453j44604k5383M27395
$$ 1170174 1176012 1302572 1658535 1173344 1301042 1588960 1269507 1124903 1099520 1526915
16964A526915J4297J32968k5394l86282M82998p6065k00453l2999o3783j44801
$$ 1526915 1541212 1674180 1648786 1262504 1745502 1669437 1468984 1435985 1372202 1227401
16954A227401M68159m78792K89439K039M9363L1432j68021j18946R3212M80158
$$ 1227401 1695560 1216768 1506207 1508246 1557609 1589041 1421020 1302074 1395286 1875444
16944A875444n44604J13947j55807J98633N28529l80744M3248O2676k28348j58627
$$ 1875444 1330840 1444787 1288980 1487613 2016142 1635398 1678646 1741322 1512974 1354347
16934A354347K90273M15501k75356J35379k56152K20005k66572J83884l7007M10147
$$ 1354347 1644620 2060121 1784765 1920144 1663992 1883997 1617425 1801309 1764302 2174449
16924B174449l11595J90573j750K23642j55877o1706n5522p201k62357M63416
$$ 2174449 1862854 2053427 2051677 2275319 2119442 2057736 2002214 1995013 1732656 2196072
16914B196072J04413m2500k05561N4093N1627J58345j61865J81736j63692J46144
$$ 2196072 2300485 2257985 2052424 2106517 2158144 2316489 2154624 2336360 2172668 2318812
16904B318812l16870L35171j54921L29126R609k92896k988K74384J73272j8319
$$ 2318812 2001942 2337113 2182192 2511318 2520927 2228031 2225043 2499427 2672699 2654380
16894B654380N6897K22523l39959O1825j56456J14383r1789J47486K39644k34293
$$ 2654380 2711277 2933800 2593841 2655666 2499210 2613593 2521804 2669290 2908934 2674641
16884B674641K16454k32593J65717L32135J01604l95464J23155j45593K04208
$$ 2674641 2891095 2658502 2824219 3156354 3257958 2862494 2985649 2840056 3044264
16875C044264J53875O3997r6431L6441k61491J40900L78994n2350j22537K74292
$$ 3044264 3198139 3262136 3165705 3202146 2940655 3081555 3460549 3408199 3285662 3559954
16865C559954j86143N07220l59635q5777J01836j24572K38806j08650N74490l00375
$$ 3559954 3373811 3881031 3521396 3435619 3537455 3412883 3651689 3543039 4117529 3817154
16855C817154Q7705L10121n9052k60654J85117J10725J33801J2435l80550M92490
$$ 3817154 3904859 4214980 4155928 3895274 4080391 4191116 4324917 4337352 3956802 4449292
16845D449292J25624J75823J37737j39081l13371N13970K35875n0678r8098K34968
$$ 4449292 4574916 4750739 4888476 4749395 4436024 4949994 5185869 5135191 5037093 5272061
16835E272061L6699J98306k20306J67461j36534J70660M23388q1381K36716l5519
$$ 5272061 5308760 5507066 5286760 5454221 5317687 5488347 5911735 5830354 6067070 6031551
16825F031551j77843K89953K41949j55539L46222Q7265k7222J12373K50875P0790
$$ 6031551 5853708 6143661 6385610 6230071 6576293 6663558 6636336 6748709 6999584 7070374
16815G070374J78611p1658L60251M8029n1527J96535l5083L95473K21733K51147
$$ 7070374 7248985 7177327 7537578 7585607 7534080 7730615 7695532 8091005 8312738 8563885
16805H563885m06211N45961q1419M83861j15340L51124L33787L15251r7521K52050
$$ 8563885 8157674 8703635 8622216 9106077 8990737 9341861 9675648 9990899 9893378 10145428
16795A0145428J05971Q6739O10008N7011K45907L94481l90297Q81561J41132J48219
$$ 10145428 10251399 10338138 10948146 11005157 11251064 11645545 11255248 12136809 12277941 12426160
16785A2426160M76160J89598L75922K49746L77754L33157N48238K68323K92352
$$ 12426160 12902320 13091918 13467840 13717586 14095340 14428497 14976735 15245058 15537410
16776A5537410N76667R2172L58380L72351P37126J25708N62155P14943L62230
$$ 15537410 16114077 16206249 16564629 16936980 17674106 17799814 18361969 19076912 19439142
16767A9439142Q43203N31283N20851M09056P23991M52892P00278R58360Q49494
$$ 19439142 20282345 20813628 21334479 21743535 22467526 22920418 23620696 24579056 25428550
16758B5428550Q19060N61639P88279J291421P88555Q41131Q59697Q10117J438600
$$ 25428550 26247610 26809249 27597528 28888949 29677504 30518635 31378332 32188449 33627049
16749C3627049R52721J383392J271106Q87031J748408J207777J770570J527176
$$ 33627049 34579770 35963162 37234268 38121299 39869707 41077484 42848054 44375230
16741D4375230K039055J080851K132051J801262J677185K225851K123320K068785
$$ 44375230 46414285 47495136 49627187 51428449 53105634 55331485 57454805 59523590
16733E9523590K453727K533833K356169K568128K712913K984466K452615L218085
$$ 59523590 61977317 64511150 66867319 69435447 72148360 75132826 77585441 80803526
16725H0803526K729801L040422L338402L247410L529344K787636L000114L600366
$$ 80803526 83533327 86573749 89912151 93159561 96688905 99476541 102476655 106077021
16717A06077021L299439K952287L001483K799921K774453K444505K239675J704734
$$ 106077021 109376460 112328747 115330230 118130151 120904604 123349109 125588784 127293518
16709A27293518J791732J845284O66604O10020M63615p3385j41965j222003j365780
$$ 127293518 129085250 130930534 131597138 132207158 132670773 132597388 132455423 131233420 129867640
16700A29867640j173603j686435k300222k004940k925017k834078k627153l303932
$$ 129867640 128694037 127007602 124707380 122702440 119777423 116943345 114316192 111012260
16692A11012260l049250l359477l237323l243994l743447k954542l133947l178152
$$ 111012260 107963010 104603533 101366210 98122216 94378769 91424227 88290280 85112128
16684H5112128l441638l136801k709878k764144k732976k759262k560094k609078
$$ 85112128 81670490 78533689 75823811 73059667 70326691 67567429 65007335 62398257
16676F2398257k486034k301648k273936k245356j737196k038768j946071j772343
$$ 62398257 59912223 57610575 55336639 53091283 51354087 49315319 47369248 45596905
16668D5596905j355215j487242j961399j469731j469662j430622j156447j228887
$$ 45596905 44241690 42754448 40793049 39323318 37853656 36423034 35266587 34037700
16660C4037700j401672q59920j038365r95587q08422q46317j502507l65120p82896
$$ 34037700 32636028 31776108 30737743 29742156 28933734 28087417 26584910 26219790 25436894
16651B5436894j227235r6817q19265n76462j089745m18804m78872q22945p05206
$$ 25436894 24209659 24112842 23293577 22717115 21627370 21208566 20729694 19906749 19201543
16642A9201543n08995m9338m32651j049465q0123n62768o19196j50308o82194
$$ 19201543 18692548 18643210 18210559 17161094 17080971 16518203 15899007 15748699 15066505
16633A5066505j05673n52416l75775j95569m50369j26250k38473n70064M569n86430
$$ 15066505 14960832 14408416 14032641 13837072 13386703 13260453 13021980 12451916 12456485 11870055
16623A1870055j58331l28600k61007o87515M67628l06088j12547l26945l29598
$$ 11870055 11711724 11383124 11122117 10434602 10902230 10596142 10483595 10156650 9827052
16614I827052l23636O3942l8143n75903m67262L09589j76566l05254M3546m39484
$$ 9827052 9503416 9567358 9529215 8953312 8486050 8795639 8619073 8313819 8357365 7917881
16604G917881J8301N3489k82983l35765K74953m73567r3172j84600J83897l29193
$$ 7917881 7936182 7989671 7706688 7370923 7645876 7172309 7079137 6894537 7078434 6749241
16594F749241l46285P1193n32k68184J4058k4176r0699k78910j72045j2294j04050
$$ 6749241 6402956 6474149 6473617 6205433 6219491 6195315 6104616 5825706 5653661 5641367 5537317
16583E537317j25258K10852o34602L00282o1787j75910j33518q4106J00128n6816
$$ 5537317 5412059 5622911 4988309 5288591 5226804 5050894 4917376 4833270 4933398 4876582
16573D876582k62706R1128k86000K50998l88021O988J93703m43384M38854k58409
$$ 4876582 4613876 4705004 4419004 4670002 4281981 4288969 4482672 4039288 4478142 4219733
16563D219733n62665K77804O7355K3585n84022N68913m88549K5297L01546l73296
$$ 4219733 3657068 3934872 4002227 4025812 3441790 4010703 3522154 3547451 3848997 3475701
16553C475701L03573N729m15563J75824n9742j49934P803j58614j88755K03487
$$ 3475701 3779274 3785003 3369440 3545264 3485522 3335588 3343391 3184777 2996022 3199509
16543C199509R80J34588n44538q6044J52416Q2395k55184L09354n3063J11855
$$ 3199509 3200489 3335077 2790539 2704495 2856911 2939306 2684122 2993476 2940413 3052268
16533C052268m23729J74201k09104n0319Q8240m7762J9930P260k12010K69377
$$ 3052268 2628539 2802740 2593636 2543317 2631557 2583795 2603725 2610985 2398975 2668352
16523B668352j48419K23875o1926l33717J87511m76066L33484L78258o20298r8595
$$ 2668352 2519933 2743808 2681882 2348165 2535676 2059610 2393094 2771352 2151054 2052459
16513B052459l5086k41814N35687j64531J08780J92225k57317l40389o6874N6109
$$ 2052459 2017373 1775559 2311246 2146715 2255495 2447720 2190403 1850014 1783140 1839249
16503A839249J08742J6898J27338j67502k33323M95231j37842n6638k3370k68440
$$ 1839249 1947991 1964889 2092227 1924725 1691402 2186633 2048791 1992153 1968783 1700343
16493A700343l52395O08622k90498j0534l2180j78637L33526p9494J6803o7858
$$ 1700343 1347948 1956570 1666072 1655538 1623358 1444721 1778247 1698753 1715556 1647698
16483A647698k397k87595N14932k90647K4670O4329j68245l39697M45686m0391
$$ 1647698 1645301 1357706 1872638 1581991 1606661 1670990 1502745 1163048 1608734 1568343
16473A568343J870r3353K15445j37991o4911K5555k50014K16525o3461k01919
$$ 1568343 1570213 1476860 1692305 1554314 1489403 1514958 1264944 1481469 1418008 1216089
16463A216089l0001L73416j49665k71292M19109n19292L13489j59307N6851K07314
$$ 1216089 1186088 1559504 1409839 1138547 1557656 1038364 1351853 1192546 1249397 1456711
16453A456711l02876Q3684k21318L45173j83853K72222k42081J67504k27650R6322
$$ 1456711 1153835 1237519 1016201 1361374 1177521 1449743 1207662 1375166 1147516 1243838
16443A243838K51358m78470J21596J25996m2074J98236j0492n04225J04908J57325
$$ 1243838 1495196 1016726 1138322 1264318 1222244 1420480 1409988 905763 1010671 1167996
16433A167996J0007K68324K4738p1065k94607l4635r0626k65624L71538Q5645
$$ 1167996 1178003 1446327 1471065 1400000 1105393 1070758 980132 714508 1086046 1171691
16423A171691O5475l16575j72608L20314k11999J35334k34345K44632j22173L44200
$$ 1171691 1237166 920591 747983 1068297 856298 991632 757287 1001919 879746 1223946
16413A223946J9663j48042O6445l34295M10622l35528m1546M9302N2699J68492
$$ 1223946 1243609 1095567 1162012 827717 1238339 902811 861265 910567 963266 1131758
16403A131758k55318K06946j6960m3320o2331m4319k22624j03365L30514J29611
$$ 1131758 876440 1083386 1066426 1023106 960775 916456 693832 590467 920981 1050592
16393A050592P7821j96264k15988J47319K14484n19816N775J3762J78971M3450
$$ 1050592 1128413 932149 716161 863480 1077964 558148 563923 577685 756656 800106
16383H00106k1037j64013J37626K24899k01989q7859L96539L356l68029Q8413
$$ 800106 779069 615056 752682 977581 775592 687733 1084272 1087628 719599 808012
16373H08012j55971j21740K97154C54114M25932K69197l13710J99489j77425Q5907
$$ 808012 652041 530301 827455 354114 780046 1049243 735533 935022 757597 843504
16363H43504K02492D89717K84101n2752j45222j06948J57560N1118O8418r6008
$$ 843504 1045996 489717 773818 721066 575844 468896 626456 677574 745992 649984
16353F49984m8793K71313k631k04576m4110J88825o8364j59298J51497k74884
$$ 649984 601191 872504 869873 665297 621187 810012 741648 582350 733847 458963
16343D58963j00432j5390K71989k5204L45913l12538K79842j11037l95694N6176
$$ 458963 358531 343141 615130 589926 935839 623301 903143 792106 396412 452588
16333D52588j6299j39421J89420M0599k45496K08181o725j44806K49592K9775
$$ 452588 436289 296868 486288 526887 281391 489572 482847 338041 587633 617408
16323F17408K03216j86314Q7754j62644j14897j33316R6326J37002B43409L93844
$$ 617408 820624 634310 722064 559420 444523 311207 407533 544535 243409 637253
16313F37253J0071j44601q4735J88203j39281o1759K35065B60340K78166j02211
$$ 637253 647324 502723 417988 606191 466910 405151 640216 260340 538506 436295
16303D36295q0796L5664o5041K17826q0426l2576K16802q1204j80996K14983j0600
$$ 436295 355499 391163 326122 543948 463522 430946 647748 566544 385548 600531 589931
16292E89931k89470K0609K27324P4647r7143k1642l2395J35172k45694J82931
$$ 589931 300461 321070 548394 623041 525898 504256 471861 607033 361339 544270
16282E44270M7870j43270p7731P8169o2819L2008J57714k16118J24345J56203
$$ 544270 592140 448870 371139 449308 386489 418497 576211 360093 484438 640641
16272F40641k51495D0208Q52371D28142A53445M24588j82194J36572O7157j41994
$$ 640641 389146 40208 892579 428142 153445 578033 395839 532411 599568 457574
16262D57574j38890J81857Q5198j27023q0936A28888P1084P6460O8774J07328
$$ 457574 318684 500541 585739 458716 377780 128888 199972 276432 345206 452534
16252D52534B17000J68583J64343B61114K26671O7428j15722Q7921B63690R8096
$$ 452534 217000 385583 549926 261114 487785 555213 439491 527412 263690 361786
16242C61786j37618n5979K50200Q6539j93446j03709l9156M14156B0759K77953
$$ 361786 224168 168189 418389 504928 311482 207773 168617 582773 20759 298712
16232B98712K12055c0024B28792J90032p6668o3973K69471B65459J19151D5493
$$ 298712 510767 -30024 228792 418824 342156 278183 547654 265459 384610 45493
16221F16270r8950G553K92418I8301C0174L36002i8932D7649h5105B17081K975
$$ 616270 517320 7553 299971 98301 30174 366176 -98932 47649 -85105 217081 220056
16210B20056N00010A53136k8650J02938M350K40309J62433j99086j00194j58065
$$ 220056 720066 153136 124486 227424 231774 472083 634516 435430 335236 177171
16200A77171O1719k7069Q5428a08230C85308j67063R7413a97057B44280o2911
$$ 177171 238890 211821 297249 -108230 385308 218245 315658 -197057 244280 181369
16190A81369L25490k42589D44L12059J05787A81896K84846a2816E13284A11319
$$ 181369 506859 264270 444 312503 418290 181896 466742 -12816 513284 111319
16179D87796A79237c9386B98936j14530J1821n8798J30511M5446j51278E7142
$$ 487796 179237 -39386 298936 184406 196227 137429 267940 313386 162108 57142
16168B92045c155l9572F46556l20785j08396k3716P5418J36891L4388k02788d585
$$ 292045 -3155 -42727 646556 325771 217375 193659 269077 405968 440356 237568 -4585
16156C18436A10979K78527A91477E0153N05808d8410A38388p893J93505l6956
$$ 318436 110979 389506 191477 50153 555961 -48410 138388 130495 324000 287044
16146B87044J8570G8911k0644N65736C0265i0216B55562J18973J28419A67242
$$ 287044 305614 78911 58267 624003 30265 -90216 255562 374535 502954 167242
16135B89457J49321F9658K61081G75J74609p6604J38041r6206J80844J32668k17028
$$ 289457 438778 69658 330739 775 175384 98780 236821 140615 321459 454127 237099
16124B37099m6206K34563a32047C44199B8439e3941D7636L31323b46500B77647
$$ 237099 190893 425456 -132047 344199 28439 -53941 47636 378959 -246500 277647
16113A81536N6464A15773K06873L8517q4444H9475A3594a15757C1658f7383A51888
$$ 181536 238000 115773 322646 361163 276719 89475 13594 -115757 31658 -67383 151888
16101c8162E7546N7839Q5560J30763j65397J11981b37907C86956D9865J31441
$$ -38162 57546 115385 200945 331708 166311 278292 -237907 386956 49865 181306
16091A81306L4766j02014J48372A16916h4305j13628A00330Q1405K60358H4176
$$ 181306 216072 114058 262430 116916 -84305 -197933 100330 181735 442093 84176
16080a77255G3725B0606Q7158Q6925N2580J0352I5311a51371E06352H3791J64098
$$ -177255 73725 20606 107764 194689 247269 257621 95311 -151371 506352 83791 247889
16069B47889N2521j30669H1855K32609a30827A37243p78b3348B99875n3237a20406
$$ 247889 300410 169741 81855 314464 -130827 137243 136465 -23348 299875 246638 -120406
16057A60144L2905a23000c1091n3965m1266L1932p2433P5244M2650E9840o346
$$ 160144 193049 -123000 -31091 -85056 -126322 -94390 -166823 -91579 -48929 59840 53494
16046E3494K99097Q9509a59534B5110b8391A98167E1260R2894f1306A55684a2919
$$ 53494 352591 442100 -159534 25110 -28391 198167 51260 144154 -61306 155684 -12919
16034i051G499i623o5735C15b46465a02268e18j28063A26054M2516i6221c9399
$$ -9051 7499 -9623 -75358 315 -246465 -102268 -518 -128581 126054 168570 -96221 -39399
16021A50156J61748A1089K61573G0990A6477N0775N5413a8304B02880n8650N8281
$$ 150156 311904 11089 272662 70990 16477 67252 122665 -18304 202880 144230 202511
16010B02511h8709A91796J25362c4482H3462J79068a8161n785r5279c1289A08429
$$ 202511 -88709 191796 317158 -34482 83462 262530 -18161 -23946 -119225 -31289 108429
15998C49491c1844A08635e1766A00561l158L0776N8009a9674L336b98A57401m8011
$$ 349491 -31844 108635 -51766 100561 97403 128179 186188 -19674 -16338 -298 157401 109390
15986A09390h7869C7033i3700p9004F4609J43356h7748j02010B0631L3356M90038
$$ 109390 -87869 37033 -93700 -172704 64609 207965 -87748 -189758 20631 53987 544025
15975E44025B31485b7906A62344L60205K13283k5794M46337k89041O3911D25309
$$ 544025 231485 -27906 162344 522549 735832 710038 1156375 867334 931245 425309
15964F22670j64006j32852d8237B06704B5253d2840C40545b6207A65570C3280
$$ 622670 458664 325812 -48237 206704 25253 -42840 340545 -26207 165570 33280
15953A16396d5031A5454d22542c50j20505A64574l3936R5752a89701j04585J04228
$$ 116396 -45031 15454 -422542 -350 -120855 164574 130638 226390 -189701 -294286 -190058
15942a90058A81998a21825B02210F7430h9387J4297E455Q8418l6378n956J16500
$$ -190058 181998 -121825 202210 67430 -89387 -75090 5455 93873 57495 51539 168039
15931A68039B9056a51045B47785c27198B45343B238K26847a00670B89004j12796
$$ 168039 29056 -151045 247785 -327198 245343 2238 229085 -100670 289004 176208
15921A76208b70440A33159J54151a97795A73448a13401l5258N3120m9845l45105
$$ 176208 -270440 133159 287310 -197795 173448 -113401 -148659 -95539 -145384 -490489
15911d90489a24426c9706j31324g3253B33466B1408N3612a65730q9076a08170
$$ -490489 -124426 -39706 -171030 -73253 233466 21408 75020 -165730 -254806 -108170
15900i6807J8720A52466a73100A04874N6545G063i7232c7519C04955n4480a35086
$$ -96807 -78087 152466 -173100 104874 161419 7063 -97232 -37519 304955 250475 -135086
15888a08775j542q7713b6927l3259A20973a64269o9489F9783o526J41510g3961
$$ -108775 -110317 -198030 -26927 -60186 120973 -164269 -233758 69783 63257 204767 -73961
15876a16692A07030b280F1102M1211i4557C6023a55420a7207A06036l1480A5587
$$ -116692 107030 -2280 61102 102313 -94557 36023 -155420 -17207 106036 74556 15587
15864b69326a3846k85126B90690a7720k55590g9827A92088p8993J4377k03F1221
$$ -269326 -13846 -298972 290690 -17720 -273310 -79827 192088 113095 127472 127269 61221
15852C8458a7832k26772P6914N6806b7300H2438M5166e022j20067j81311H1882
$$ 38458 -17832 -244604 -167690 -110884 -27300 82438 127604 -5022 -125089 -306400 81882
15840e6112a0896k06315i2522m1867D48463H1715h4410j75035E7175c136B6233
$$ -56112 -10896 -217211 -92522 -134389 448463 81715 -84410 -259445 57175 -3136 26233
15828c01829I0875J16026a84415B16661l1807a9012k36577h1651q7724H645K45882
$$ -301829 90875 206901 -184415 216661 184854 -19012 -255589 -81651 -169375 8645 254527
15817B54527a14490I636d6348l1249n036j447m2390A089N4976b51780e1247n7241
$$ 254527 -114490 9636 -46348 -77597 -82633 -84080 -126470 1089 56065 -251780 -51247 -108488
15805a08488j06225r2105b6936A28248l420d24606a37922f6018K4352A84116A3107
$$ -108488 -214713 -306818 -26936 128248 124828 -424606 -137922 -66018 -41666 184116 13107
15793D0154a40608C4914R2927b77992f1535G8711A0121K02932b30945D2831e0012
$$ 40154 -140608 34914 127841 -277992 -61535 78711 10121 213053 -230945 42831 -50012
15781C89931b76830P4130G4299C2137m388K10523a29784A59628F137c16004d3139
$$ 389931 -276830 -202700 74299 32137 27749 238272 -129784 159628 6137 -316004 -43139
15769a67547k1405C2416c80289J78570A78246n5385k6144J40576i3551A1820J0866
$$ -167547 -188952 32416 -380289 -201719 178246 122861 96717 237293 -93551 11820 22686
15758B2686g2276K2391B26481a41734N0654l9082B78118f9145i471B227i6861
$$ 22686 -72276 -49885 226481 -141734 -91080 -130162 278118 -69145 -9471 2227 -96861
15746a68474H4229N9389j6163M3424B3719R5454E3279b55772B87544D739L98637
$$ -168474 84229 143618 127455 170879 23719 119173 53279 -255772 287544 4739 403376
15735D03376I2212a0851B8532g132D7461J48972h8753j00760f303F7993a78745
$$ 403376 92212 -10851 28532 -7132 47461 196433 -88753 -189513 -6303 67993 -178745
15723b55510a16423E7459b78836H4772d3613k7319L2840m9897l01728J67223G5323
$$ -255510 -116423 57459 -278836 84772 -43613 -70932 -38092 -87989 -389717 -222494 75323
15711a48597j52646J08086F3968d21o7564A71140a60852A58809f3883k24529N6780
$$ -148597 -301243 -193157 63968 -421 -67985 171140 -160852 158809 -63883 -288412 -231632
15700b31632G4615J9738k2003f0669l29021J08021f0153m3875G0150N8A9727P4740
$$ -231632 74615 94353 72350 -60669 -389690 -281669 -60153 -104028 70150 70208 19727 94467
15688I4467J2858a53046o2733B22528b63074C16330j15786o8048B7433b9962C27422
$$ 94467 107325 -153046 -215779 222528 -263074 316330 200544 132496 27433 -29962 327422
15676c13370f3106l5164B34628I8086M0911a49755B41972k5129g3354C3063d1413
$$ -313370 -63106 -98270 234628 98086 138997 -149755 241972 216843 -73354 33063 -41413
15664g2099A07721a84002O8206G7612a6057j18834f4420A15606J36287c3850A77726
$$ -72099 107721 -184002 -115796 77612 -16057 -134891 -64420 115606 251893 -33850 177726
15652a19899A27010J6143b76283a19003B17853c43466Q2296e1564o1296B1755
$$ -119899 127010 143153 -276283 -119003 217853 -343466 -261170 -51564 -112860 21755
15641d64090A9543b0122C180Q2253b55786J061D1892J9859o342L92162k00258
$$ -464090 19543 -20122 3180 85433 -255786 -254725 41892 61751 55409 447571 247313
15630B47313a37411B64859A07023K59658a04172B08180e4882E13470B08188c16317
$$ 247313 -137411 264859 107023 366681 -104172 208180 -54882 513470 208188 -316317
15619a75893h938H4505J5785a80595E87706A31877O748D7690d13826d0775A39504
$$ -175893 -8938 84505 100290 -180595 587706 131877 138625 47690 -413826 -40775 139504
15607A22138D3979a50787B09749D1051b3724m3260F9500a32840a9934B0176e7221
$$ 122138 43979 -150787 209749 41051 -23724 -66984 69500 -132840 -19934 20176 -57221
15595d30134a38072H6017i3138A4363J13010a86764M4070p3703E975R9661c52152
$$ -430134 -138072 86017 -93138 14363 127373 -186764 -142694 -216397 5975 105636 -352152
15583a07858m2352e2488A70412a31684n0778E2557M8093j1977i8660m2178k00525
$$ -107858 -150210 -52488 170412 -131684 -182462 52557 100650 88673 -98660 -140838 -341363
15572c41363B7220J90666i1460A33559e3230C3369a18381c9453C6630c58227F3275
$$ -341363 27220 217886 -91460 133559 -53230 33369 -118381 -39453 36630 -358227 63275
15560A35939n5313b01270J1825f7917j19310L1743p5927B6396L5236f2338e427
$$ 135939 80626 -201270 -189445 -67917 -187227 -155484 -231411 26396 61632 -62338 -5427
15548A05765Q7906F1028K11843a50276M3006k3369f74B5272K90148a81563B88263
$$ 105765 193671 61028 272871 -150276 -107270 -130639 -674 25272 315420 -181563 288263
15536b31814J7279f0485B7801g0494C9672j817J79969a29918e1074F9367a97004
$$ -231814 -214535 -60485 27801 -70494 39672 37855 217824 -129918 -51074 69367 -197004
15524a5928j4647B84849B7090a11702k32162C07095a94938R3313R774r6443j21716
$$ -15928 -30575 284849 27090 -111702 -343864 307095 -194938 -101625 -91851 -188294 -310010
15513c10010A7271f2173H8763c26878g4593A59003e9836E04841I8690a556A41983
$$ -310010 17271 -62173 88763 -326878 -74593 159003 -59836 504841 98690 -1556 141983
15501A41489k4625j5625A0591c0152A12984K06834H7598j6532a7705j47243H8386
$$ 141489 116864 101239 10591 -30152 112984 319818 87598 71066 -17705 -164948 88386
15489A24921f2599A23426K967b4579E0118a12391F4470M22381c16180A4802M03904
$$ 124921 -62599 123426 126393 -24579 50118 -112391 64470 486851 -316180 14802 418706
15478D18706o5629L5549j35451E2815B3626A306J88773P9773d0900C74439a95861
$$ 418706 353077 388626 253175 52815 23626 1306 190079 269852 -40900 374439 -195861
15466G1217j3438K88834e2914A91141K23062j84041g6671F03645N5060j21648
$$ 71217 57779 346613 -52914 191141 414203 230162 -76671 603645 658705 537057
15456E37057J95042j90244A43724P5358g6359A04151J14365c87534d2501B01164
$$ 537057 732099 541855 143724 219082 -76359 104151 218516 -387534 -42501 201164
15445A16229b8622A84370k878L1509Q5110L5008a77671j14025f4782o677F5355
$$ 116229 -28622 184370 181492 213001 298111 333119 -177671 -291696 -64782 -71459 65355
15433d0034Q945B4712b27650F5778P0031P4108Q8737M40702L12919n7944P1168
$$ -40034 -31089 24712 -227650 65778 135809 209917 298654 739356 1052275 994331 1065499
15422A065499l73280k64995j83356A09819J1503d0231B64505F9891j9900J07939
$$ 1065499 692219 427224 243868 109819 121322 -40231 264505 69891 49991 157930
15412A57930o7543K21035a76992A80400a07627J7315j30004Q6101d6013J8199
$$ 157930 90387 311422 -176992 180400 -107627 -90312 -220316 -134215 -46013 -27814
15402b7814l4908A35144a70772H0467r591J04949g7892l7225k17492F8995P0185
$$ -27814 -62722 135144 -170772 80467 70876 175825 -77892 -115117 -332609 68995 139180
15391A39180c9465A41054c41721c3149j08039A80343b23829G4347e8445l8498
$$ 139180 -39465 141054 -341721 -33149 -141188 180343 -223829 74347 -58445 -96943
15381i6943F9234N8914l6000a17054b1896A2862N1683J49978P1530a96459A42710
$$ -96943 69234 128148 92148 -117054 -21896 12862 64545 214523 286053 -196459 142710
15369A80774K07610D5083b37465C23946h5765A753f9402A16682J28756D8083B1327
$$ 180774 388384 45083 -237465 323946 -85765 1753 -69402 116682 245438 48083 21327
15357A60004L88218A83816J82077c7270A39081K35636a08177c968A05274L506
$$ 160004 548222 183816 365893 -37270 139081 374717 -108177 -3968 105274 108780
15347A08780a74272B83900A23430m320f8836C55367M4503A36790o0411J19744
$$ 108780 -174272 283900 123430 119110 -68836 355367 399870 136790 76379 196123
15337A96123k6377l4000Q8343J81861A12496b5001A21499J72596N8973p1883J50884
$$ 196123 169746 135746 224089 405950 112496 -25001 121499 294095 353068 281185 432069
15326D32069O1159A28884J65551m4859G1755K3247J5420A840J0777K0399J00152
$$ 432069 493228 128884 294435 249576 71755 95002 110422 1840 12617 33016 133168
15315A33168A7219L18816j36089q1090N1780H3743K06058M6721l2356b88548h6586
$$ 133168 17219 336035 199946 118856 170636 83743 289801 336522 304166 -288548 -86586
15303A20415h21D00961j87336m2532E2213h7118A9258L184J91136D9313K70111
$$ 120415 -821 400961 213625 171093 52213 -87118 19258 22442 213578 49313 319424
15292C19424e6667B70230j24476J83363h2317A18376K1993d5294G8880b17511
$$ 319424 -56667 270230 145754 329117 -82317 118376 140369 -45294 78880 -217511
15281B60461j13223l3063a15645E9060H48K74725j27782J95119a56677A2282i3927
$$ 260461 147238 114175 -115645 59060 848 275573 147791 342910 -156677 12282 -93927
15269C89687a56449F5369a73709a6075A97871O8949a14357M3755A2233J22432
$$ 389687 -156449 65369 -173709 -16075 197871 266820 -114357 -70602 12233 134665
15259A34665M7977b67087B75795A37777a70260I1840m4118b47653C3804O8893
$$ 134665 182642 -267087 275795 137777 -170260 91840 47722 -247653 33804 102697
15249A02697Q8095n4857f3586r1204m1192C14949j4600i1407A20253J89420j33877
$$ 102697 190792 135935 -63586 -154790 -195982 314949 300349 -91407 120253 309673 175796
15238A75796E2476N1280K35230A30006E7452e6489B02583c6782A25013K74410
$$ 175796 52476 103756 338986 130006 57452 -56489 202583 -36782 125013 399423
15228C99423K47998R52172l30440K01264j08170m12766C39940A65174O2962j3390
$$ 399423 647421 1599593 1269153 1470417 1362247 949481 339940 165174 228136 214746
15218B14746n2623n9027f866j93703C95053a39508H1003a44358A63134l1868J37604
$$ 214746 162123 103096 -6866 -200569 395053 -139508 81003 -144358 163134 131266 268870
15207B68870j2473a40236H4913l6569P1815b9862o707j12389A84585k3659b5493
$$ 268870 256397 -140236 84913 48344 120159 -29862 -36569 -148958 184585 160926 -25493
15195H826L64957b7478A28686H001a4922H8498J19914a86513A76221f0747B29305
$$ 8826 373783 -27478 128686 8001 -14922 88498 208412 -186513 176221 -60747 229305
15183f4086B82859a79340A98425G6800J20665i979C22001a15447B05325e763C66032
$$ -64086 282859 -179340 198425 76800 197465 -9979 322001 -115447 205325 -5763 366032
15171A34476J28593J85426A44927J73803a4829k63929I0459K2130l3243C0527
$$ 134476 263069 448495 144927 318730 -14829 -278758 90459 112589 79346 30527
15160a55102P4521A49570a52620B5924b88019A5890b405r4971n7998A34613a54320
$$ -155102 -80581 149570 -152620 25924 -288019 15890 -2405 -97376 -155374 134613 -154320
15148F9100L24589d5821E45128C3092J36226E468L306N9150f9287f796j66971
$$ 69100 393689 -45821 545128 33092 169318 5468 8774 67924 -69287 -6796 -173767
15137a73767L0968H9672J465a533j06792B41813C7070c4428k39045A47257J83478
$$ -173767 -142799 89672 91137 -1533 -108325 241813 37070 -34428 -273473 147257 330735
15126C30735a13106L51G2120J33521f342G4583J9656a4036B82754a21511C75885
$$ 330735 -113106 -112755 72120 205641 -6342 74583 94239 -14036 282754 -121511 375885
15114B87616J8254A46672L8181Q993J03042G273J62641E1873h8668B50132L03927
$$ 287616 305870 146672 184853 193846 296888 7273 169914 51873 -88668 250132 554059
15103E54059A80402M35633k14112P1326F478a18450A83228F0094A5641f7057E54246
$$ 554059 180402 616035 401923 473249 6478 -118450 183228 60094 15641 -67057 554246
15091D910L24985b6914A32815J59040j41779p0610L77252A52314J7187K5825J7009
$$ 4910 329895 -26914 132815 291855 150076 79466 456718 152314 169501 195326 212335
15080B12335p738e6273n9094D76436b3425k99239A55919j3411f4579A7772K01990
$$ 212335 204597 -56273 -115367 476436 -23425 -322664 155919 142508 -64579 17772 219762
15069B19762r4410j8566J70698R7122a41357j8831A20963k3538c53342B83043
$$ 219762 125352 106786 277484 374606 -141357 -160188 120963 97425 -353342 283043
15058D62278j90810k0792a77699A63196J09453j23611b23806C4051J99593P8472
$$ 462278 271468 250676 -177699 163196 272649 149038 -223806 34051 233644 312116
15048C12116J70224A16419M8872J12283o609j16480m6054D0487K82986I4927J29638
$$ 312116 482340 116419 165291 277574 270965 154485 108431 40487 323473 94927 224565
15037B24565F5568L40600p3837k2128K34029p7281o6103m9568l4890A48412K78892
$$ 224565 65568 406168 332331 310203 544232 466951 400848 351280 316390 148412 427304
15026D27304b49096C09514J67231j36449J13358q851K2648q1606R3516J08975
$$ 427304 -249096 309514 476745 340296 453654 444803 467451 385845 479361 588336
15016E88336j6434J38489j9043l29102M16673j06752k79667M5676L20716B82772
$$ 588336 571902 710391 691348 362246 778919 672167 392500 438176 758892 282772
15005A38499L01625L61037C67467L9918J6604j12901J68253J12A47682K69978
$$ 138499 440124 801161 367467 407385 423989 311088 479341 479453 147682 417660
14995D17660j21397A16050O82509j99988j45063r4043N7908J4368J25594R109
$$ 417660 296263 116050 798559 598571 453508 359465 417373 431741 557335 566444
14985E66444A17405M67206N187j80724L9738Q7248A12067N86751C5244L86873
$$ 566444 117405 584611 589798 409074 448812 536060 112067 698818 35244 422117
14975D22117K32850B52495K86601q3516J17233Q3863K73469m57963K33314m2124
$$ 422117 654967 252495 539096 455580 572813 656676 930145 472182 705496 663372
14965F63372M04233l66998N3204j40530p9185J5799L85597j65173j98619P5537
$$ 663372 1067605 700607 753811 613281 534096 549895 935492 770319 571700 647237
14955F47237N6985D0669N62169R4981j67163J55369k75768j16989J42976Q2980
$$ 647237 704222 40669 602838 697819 530656 686025 410257 293268 436244 519224
14945E19224k56238J73921A13169L9678J58067O8706k449K12808k83191m4986
$$ 519224 262986 436907 113169 152847 310914 379620 377171 589979 306788 261802
14935B61802L36385p643B46715L06045G9425L21884M03809C62387K83766k14392
$$ 261802 598187 590544 246715 552760 79425 401309 805118 362387 646153 431761
14925D31761J71219j01644J42924B40404N36791j34125K5232p9643K03229p2659
$$ 431761 602980 501336 644260 240404 777195 643070 668302 588659 791888 719229
14915G19229J05280J39296K25492J72834J42342k45011L44117j7390j07424Q1501
$$ 719229 824509 963805 1189297 1362131 1504473 1259462 1603579 1586189 1478765 1560266
14905A560266j5534J14241j19310N37848l1615J62769k35217j89158j19955l58666
$$ 1560266 1544732 1658973 1539663 2077511 2045896 2208665 1973448 1784290 1664335 1305669
14895A305669k38457J53779D65206L01073J0938k57892k19241J96192j02759K0397
$$ 1305669 1067212 1220991 465206 766279 777217 519325 300084 496276 393517 413914
14885D13914J12744j78267j66945M92352j81477c6491E41416P9420k7850k15367
$$ 413914 526658 348391 181446 673798 492321 -36491 541416 620836 592986 377619
14875C77619A16399L38125L014K1734l0885p6172L93821K859j14349J05907j88145
$$ 377619 116399 454524 457538 479272 448387 372215 766036 768895 654546 760453 572308
14864E72308J9374L07813j40128Q3341q0112m7372j78827o592J65722A70922K47705
$$ 572308 591682 899495 759367 842708 762596 715224 536397 529805 695527 170922 418627
14853D18627M2430K9812M22312m9871j04609J25910l10257M12854m10150j7750
$$ 418627 461057 490869 913181 863310 758701 884611 574354 987208 577058 559308
14843E59308j71667R9984A60181K29664j94722J62822J54540P4069A71544N57171
$$ 559308 387641 487625 160181 389845 195123 357945 512485 586554 171544 728715
14833G28715k56989L11184p890j5265N1008l7732K72645k34338M10975E62957
$$ 728715 471726 782910 775020 759755 810763 773031 1045676 811338 1222313 562957
14822I65465K21446k28946j84111J96671k48483j73611j1376J05139r5668n3499
$$ 965465 1186911 957965 773854 970525 722042 548431 537055 642194 546526 493027
14812D93027O1821B34807O46190k79896j05198N03380k74349r5494k00610J49224
$$ 493027 554848 234807 880997 601101 495903 999283 724934 629440 428830 578054
14802E78054O57462k81868j77090l46658J67225J65987j0289J50466k40440J46918
$$ 578054 1235516 953648 776558 429900 597125 763112 752823 903289 662849 809767
14792H09767r1880K52295l39198L74351J34969n9546O2850C12009N92903j85611
$$ 809767 717887 970182 630984 1005335 1140304 1080758 1143608 312009 904912 719301
14782G19301o228n8796j42527J27112P9228k6639k64260L19954j45565B02586
$$ 719301 713073 654277 511750 638862 718090 691451 427191 747145 601580 202586
14771G17479j33614N0956J18347j92501L26098l02921j00J69199j12915j8125
$$ 717479 583865 634821 753168 560667 886765 583844 583744 752943 640028 621903
14761F21903L15520K32844k05814L3202l2875l24896N9766K20002m58307L8527
$$ 621903 937423 1170267 964453 997655 964780 639884 699650 919652 461345 499872
14751D99872M0129l9998J42797O954M509k60272K79354j39935j04505R7499J10381
$$ 499872 540001 500003 642800 649754 654263 393991 673345 533410 428905 526404 636785
14740F36785J96041j19220P4579l22329N97642D50927L1918K96061k91179J67556
$$ 636785 832826 713606 788185 465856 1063498 450927 482845 778906 487727 655283
14730F55283K13503k24280r7039P62892n84797L51600n31231r4211K27315M7592
$$ 655283 868786 644506 547467 1310359 725562 1077162 545931 451720 679035 726627
14720G26627J1360L7493j05153J71540J94425K45333j73955l3013J49279M13173
$$ 726627 737987 775480 670327 841867 1036292 1281625 1107670 1074657 1223936 1637109
14710A637109J01658j69210j02007N4364m19915L24058k08375L651n3193k90320
$$ 1637109 1738767 1569557 1467550 1521914 1101999 1426057 1217682 1221333 1168140 877820
14700H77820J821M8733J53626j90413M2818n4809M28044l39259j05992O96543
$$ 877820 879641 928374 1082000 891587 934405 879596 1307640 968381 862389 1558932
14690A558932q1926k05849l61739N74173j0171J14025J06988N5489k08163J38333
$$ 1558932 1477006 1271157 909418 1483591 1473420 1587445 1694433 1749922 1541759 1680092
14680A680092l05654P7497o82230k204L12595k65421O35582m55759j85664K0474
$$ 1680092 1374438 1451935 769705 767501 1080096 814675 1450257 994498 808834 829308
14670H29308K17804k9619O8955k92358M69540l70556l5962N38117n19385L11557
$$ 829308 1047112 1017493 1086448 794090 1263630 893074 857112 1395229 875844 1187401
14660A187401n05323N47555k09826p4239n1552K12525Q2974m03344L21115Q3492
$$ 1187401 682078 1229633 1019807 945568 894016 1106541 1189515 786171 1107286 1190778
14650A190778n174k19035J07657L22045k38952Q4479l7468j81865l7128J65017
$$ 1190778 1185604 966569 1074226 1396271 1157319 1241798 1204330 1022465 985337 1150354
14640A150354J42541K68498l6974k867O546k79275M47376j72201k82709O585o0112
$$ 1150354 1292895 1561393 1524419 1521552 1528098 1248823 1696199 1523998 1241289 1247874 1187762
14629A187762K38242l64453M16282l45441J58276L9261k00236j36716R4252J69308
$$ 1187762 1426004 1061551 1477833 1132392 1290668 1329929 1129693 992977 1087229 1256537
14619A256537J50129j8731j80764L85782k28011j11189n1710k68228J63908J40530
$$ 1256537 1406666 1387935 1207171 1592953 1364942 1253753 1202043 933815 1097723 1238253
14609A238253j86087N61689k34327J99668l3853p5013j10735J23372q4021j07098
$$ 1238253 1052166 1613855 1379528 1579196 1545343 1470330 1359595 1482967 1398946 1291848
14599A291848N25080k31149j88746j58373K04973N7311K14129r2894j04345J20031
$$ 1291848 1816928 1585779 1397033 1238660 1443633 1500944 1715073 1622179 1517834 1637865
14589A637865K24618l56598Q7951mK06557j86053k05544J88075m0275K49166j99699
$$ 1637865 1862483 1505885 1593836 1593832 1800389 1614336 1408792 1596867 1556592 1805758 1606059
14578A606059Q9438q5763J62930M419R7295k4196R5916k75575K56953L42760o5783
$$ 1606059 1695497 1609734 1772664 1777083 1874378 1850182 1946098 1670523 1927476 2270236 2204453
14567B204453p11940N03722O5318J22858k34257J25026j93460J24335l6198J30559
$$ 2204453 1492513 1996235 2061553 2184411 1950154 2075180 1881720 2006055 1969857 2100416
14557B100416n3922K27025K08158k3724k60083K59922l42621M24167M124m07518
$$ 2100416 2046494 2273519 2481677 2457953 2197870 2457792 2115171 2539338 2543462 2135944
14547B135944O01218o7051M4830N08666l30495O02257j727K40505M7621O76011
$$ 2135944 2737162 2670111 2714941 3223607 2893112 3495369 3493642 3734147 3781768 4457779
14537D457779L43641P10074Q56952J506352L374830N211491R769141M961215p681270
$$ 4457779 4801420 5511494 6368446 7874798 11249628 16461119 26230260 31191475 23510205
14528B3510205p421657m691342l145574k095415p20603k78362k09433j286416
$$ 23510205 16088548 11397206 8251632 6156217 5435614 5157252 4947819 3661403
14520C661403l77373n88233n5107k19319j83355O939j33651o185J33960J45152
$$ 3661403 3284030 2695797 2640690 2421371 2238016 2244955 2111304 2105119 2239079 2384231
14510B384231M9858j71805K35125n6810L13191l9960k35139J4404K57335m8363
$$ 2384231 2434089 2262284 2497409 2440599 2753790 2713830 2478691 2493095 2750430 2702067
14500B702067j33433J90063k40494M83098k76049K85714O4353j65951k31525M44492
$$ 2702067 2568634 2758697 2518203 3001301 2725252 3010966 3075319 2909368 2677843 3122335
14490C122335q5563j73418k32596N86881k8470j5404R7185l57287M21758K15988
$$ 3122335 3036772 2863354 2630758 3217639 3189169 3173765 3270950 2913663 3335421 3551409
14480C551409k93727l045j36497J44579L08623L2119K35312k63681K06709r852
$$ 3551409 3257682 3254637 3118140 3262719 3571342 3603461 3838773 3575092 3781801 3771949
14470C771949l1479m32051L51647J8287K29482J56815k36723j49354N13022J88014
$$ 3771949 3740470 3308419 3660066 3678353 3907835 4064650 3827927 3678573 4191595 4379609
14460D379609n08852M72764j33042Q4029N34467n22230L51897j00980J12062k67921
$$ 4379609 3870757 4343521 4210479 4294508 4828975 4306745 4658642 4557662 4669724 4401803
14450D401803K45088J6835o5644J26493l03831M99706l56395M62024L27423k5248
$$ 4401803 4646891 4663726 4598082 4724575 4420744 4920450 4564055 5026079 5353502 5328254
14440E328254o993k84429o9132M58586J33453J4319j08101K35346J19210J6243
$$ 5328254 5321261 5036832 4967700 5426286 5559739 5574058 5465957 5701303 5820513 5836756
14430E836756k223M4252K33029L5687K11872j48486L63976l52142L27274q3851
$$ 5836756 5834533 5878785 6111814 6147501 6359373 6210887 6574863 6222721 6549995 6466144
14420F466144Q0428N1135J05947N8606N80469k80845J11745J84307J55808p2891
$$ 6466144 6546572 6597707 6703654 6762260 7342729 7061884 7173629 7357936 7513744 7440853
14410G440853K81344J96154p1268J56450L7358P16959j91519n9738O34950O8033
$$ 7440853 7722197 7918351 7847083 8003533 8040891 8757850 8566331 8506593 9141543 9209576
14400I209576K3051k43005j46498N27918l6881K58741J48640p9945N91213k32312
$$ 9209576 9232627 8989622 8843124 9371042 9334161 9592902 9741542 9661597 10252810 10020498
14390A0020498M47128N4984L55887l4344l5815K07838L26867k36315O43860l91760
$$ 10020498 10467626 10522610 10878497 10844153 10808338 11016176 11343043 11106728 11750588 11358828
14380A1358828M86719K11262J0825L29622N39601j23874N52222K0317J75056J98250
$$ 11358828 11845547 12056809 12067634 12397256 12936857 12812983 13365205 13385522 13560578 13758828
14370A3758828N54289k07810N24093M73102N6943K64073K78672L24304M60761
$$ 13758828 14313117 14105307 14629400 15102502 15159445 15423518 15702190 16026494 16487255
14361A6487255K21870J7113L46221N23500M9759N95603K07642N09796K74365L38971
$$ 16487255 16709125 16726238 17072459 17595959 17645718 18241321 18448963 18958759 19233124 19572095
14351A9572095L73017Q19442R9817N93079P64191L34958M08192N74360M76431
$$ 19572095 19945112 20764554 20864371 21457450 22221641 22556599 22964791 23539151 24015582
14342B4015582K46770O09558O46408O13692M61751P22812N78044R91069N87881
$$ 24015582 24262352 24871910 25518318 26132010 26593761 27316573 27894617 28885686 29473567
14333B9473567O34484O42107J049781O44809J074367O66128J234621J083856N18826
$$ 29473567 30108051 30750158 31799939 32444748 33519115 34185243 35419864 36503720 37022546
14324C7022546J155186Q86917J063382J252583J375583J298460J083881J720400
$$ 37022546 38177732 39064649 40128031 41380614 42756197 44054657 45138538 46858938
14316D6858938J389759J385966J914825J563333J604806J810300J554540K281705
$$ 46858938 48248697 49634663 51549488 53112821 54717627 56527927 58082467 60364172
14308F0364172J816300K531736K437617K223534K482828K744823K566525L181492
$$ 60364172 62180472 64712208 67149825 69373359 71856187 74601010 77167535 80349027
14300H0349027L122500K950228L686253L833981L347019M242313M196139M922047
$$ 80349027 83471527 86421755 90108008 93941989 97289008 101531321 105727460 110649507
14292A10649507M704167N370021N089505O144543N750248O663739O564641P347306
$$ 110649507 115353674 120723695 125813200 131957743 137707991 144371730 150936371 158283677
14284A58283677P181160Q073710Q704768R031791R384503R782001J0913932J0878407
$$ 158283677 165464837 173538547 182243315 191275106 200659609 210441610 221355542 232233949
14276B32233949J1521410J2291510J2489886J3359579J3800557J3529119J4594055
$$ 232233949 243755359 256046869 268536755 281896334 295696891 309226010 323820065
14269C23820065J3847468J4099945J4495111J4039014J3410838J2394857J1911337
$$ 323820065 337667533 351767478 366262589 380301603 393712441 406107298 418018635
14262D18018635J1386374J0183007R914809Q856201P067939M005323O78679j645349
$$ 418018635 429405009 439588016 449502825 458359026 465426965 469432288 470110967 468465618
14254D68465618m779038o283662p759268m316610m418284p445462q523735j1408276
$$ 468465618 463686580 457402918 449643650 445327040 440908756 433463294 424939559 413531283
14246D13531283j3085418j3707025j4405778j4689847j3866425j4449037j4686909
$$ 413531283 400445865 386738840 372333062 357643215 343776790 329327753 314640844
14239C14640844j3800023j3845106j3443277j3101451j2481542j2513064j1918238
$$ 314640844 300840821 286995715 273552438 260450987 247969445 235456381 223538143
14232B23538143j1492826j0973971j0323102r119596r037583q101161p991002
$$ 223538143 212045317 201071346 190748244 181628648 172591065 164489904 156498902
14225A56498902p419049o997091o357313n827966n843907n539731m837016m873323
$$ 156498902 149079853 142082762 135725449 129897483 124053576 118513845 113676829 108803506
14217A08803506m241217m260437l845174m123316l587799l249723l238496k815568
$$ 108803506 104562289 100301852 96456678 92333362 88745563 85495840 82257344 79441776
14209G9441776l420846k724582k460477k276238k517483k353386j960230j903068
$$ 79441776 76020930 73296348 70835871 68559633 66042150 63688764 61728534 59825466
14201E9825466k233324j490776k161387j238207j540190j980171j228975j526149
$$ 59825466 57592142 56101366 53939979 52701772 51161582 49181411 47952436 46426287
14193D6426287j287922j017911j059664j300414j121418j005449j544293p13555
$$ 46426287 45138365 44120454 43060790 41760376 40638958 39633509 38089216 37375661
14185C7375661q78615r15480r65286r79563j020566n26503p14876r00605p22272
$$ 37375661 36497046 35581566 34616280 33636717 32616151 32089648 31374772 30474167 29751895
14176B9751895j074517k81625q13599l67531r24891o89854m93616n44734r11046
$$ 29751895 28677378 28395753 27582154 27214623 26289732 25599878 25106262 24561528 23650482
14167B3650482l60230j88125n66745n53702l95956l94610k68477r43226J0607
$$ 23650482 23290252 23102127 22535382 21981680 21585724 21191114 20922637 19979411 19990018
14158A9990018m92082m97560k13000l36086n48024j02927o23074k87891j10127
$$ 19990018 19497936 19000376 18787376 18451290 17903266 17800339 17177265 16889374 16779247
14149A6779247n05236l626n79212k01739N7155n45746l50709j99144k36800L9480
$$ 16779247 16274011 16270385 15691173 15489434 15546589 15000843 14650134 14450990 14214190 14253670
14139A4253670m93054m00623k51110j74425J01641l21445n2129n18110K45921
$$ 14253670 13760616 13359993 13108883 12934458 13036099 12714654 12662525 12144415 12390336
14130A2390336n81249k81946R4846k09971m01392j86437K03555k68680j212l18609
$$ 12390336 11809087 11527141 11621987 11412016 11010624 10824187 11027742 10759062 10757850 10439241
14120A0439241o3282p69194L49659p7579l67992P507j46238j50720j35041k50532
$$ 10439241 10375959 9606765 9956424 9878845 9510853 9518360 9372122 9221402 9086361 8835829
14110H835829j03510j79k80329J33180k58181j14914n902R3151n48798j18077
$$ 8835829 8732319 8732140 8451811 8584991 8326810 8211896 8205994 8299145 7750347 7632270
14100G632270K44347J15111m17518p4521j94701r939l45543K38239l95622M09294
$$ 7632270 7876617 7991728 7574210 7499689 7304988 7295049 6949506 7187745 6792123 7201417
14090G201417l2079n35356K37765l08093J69839k03968p7299p2293l9922k41629
$$ 7201417 7169338 6633982 6871747 6563654 6733493 6529525 6452226 6379933 6340011 6098382
14080F098382n0345Q7498k52898L1643r4556k52244N13373l33816m42800J80504
$$ 6098382 6048037 6135535 5882637 5914280 5819724 5567480 6080853 5747037 5304237 5484741
14070E484741l60964O57245l10341j71429r4751O9672J42000k57905k23541J10361
$$ 5484741 5123777 5781022 5470681 5299252 5204501 5274173 5416173 5158268 4934727 5045088
14060E045088k42661q2742N4397l67138M17752J59439k75894k15823o0582r1645
$$ 5045088 4802427 4719685 4774082 4406944 4824696 4984135 4708241 4492418 4431836 4340191
14050D340191J84349J2545j33687r5125J61015J55033k70342p4714K53812n19062
$$ 4340191 4524540 4537085 4403398 4308273 4469288 4624321 4353979 4279265 4533077 4014015
14040D014015L40459l25884J90159l33579m7977R0875J3248k97868K32025k84791
$$ 4014015 4354474 4028590 4218749 3885170 3837193 3928068 3941316 3643448 3875473 3590682
14030C590682l6330O8453J31611l31262J48143K325r9323q1178m951k13365O2873
$$ 3590682 3554352 3622805 3754416 3423154 3571297 3573622 3474299 3393121 3388170 3174805 3237678
14019C237678J72854k03716J65628J29339L6116j00216K19748l02018k50103Q2076
$$ 3237678 3410532 3206816 3372444 3501783 3537899 3437683 3657431 3355413 3105310 3187386
14009C187386j061m48445Q8028L65152j86780j4630k48791L0204L8076Q8199j04504
$$ 3187386 3186325 2737880 2825908 3191060 3004280 2989650 2740859 2771063 2809139 2897338 2792834
13998B792834p8647N1931m60486O9249J67775L18914m06428K847K39289k18169
$$ 2792834 2714187 2766118 2305632 2374881 2542656 2861570 2455142 2457989 2697278 2479109
13988B479109Q3095j34306K61156J19731k02669k85510L23215p4400K48794p1691
$$ 2479109 2562204 2427898 2689054 2808785 2606116 2320606 2643821 2569421 2818215 2746524
13978B746524K26951M7331M3000J261121M90807J825724M781770R477694Q482526
$$ 2746524 2973475 3020806 3063806 4324927 4815734 6641458 11423228 20900922 29383448
13969B9383448k898773p579769m334685l507940k937759j622866j253313p45467
$$ 29383448 26484675 18904906 14570221 11062281 8124522 6501656 5248343 4502876
13961D502876j92363r47656L97252l88347m7246J82851p79625r9187J18159J69727
$$ 4502876 4310513 3362857 3760109 3371762 3324516 3507367 2727742 2628555 2746714 2916441
13951B916441l61682N8950j43372l04732K61402j10558n495L42949p05180L86899
$$ 2916441 2554759 2613709 2470337 2165605 2427007 2316449 2310954 2653903 1948723 2335622
13941B335622l50364J22754M69141l84828m17991N9515J76125L895O5395M7923
$$ 2335622 1985258 2108012 2577153 2192325 1774334 1833849 2009974 2013869 2079264 2127187
13931B127187j78861K67091j27786N7751r9961j80618j09313J40009J01131k73352
$$ 2127187 1948326 2215417 2087631 2145382 2045421 1864803 1755490 1895499 1996630 1723278
13921A723278j5462K02768j43347L06885k13646o1123k48350O76019p42745J95520
$$ 1723278 1707816 1910584 1767237 2074122 1860476 1799353 1551003 2227022 1484277 1679797
13911A679797K19123J25074k89403J51472n64132M84088j51880j57639L52100
$$ 1679797 1898920 2023994 1734591 1886063 1321931 1806019 1654139 1496500 1848600
13902A848600o5018J58562n68139M0953K92939n5379j38265M1624j2511k22948
$$ 1848600 1783582 1942144 1374005 1414958 1707897 1652518 1514253 1555877 1543366 1320418
13892A320418k333K50185k82206K46856J26739m34219J71151J15765K5391K8862
$$ 1320418 1318085 1568270 1286064 1532920 1659659 1225440 1396591 1512356 1537747 1566609
13882A566609J9007m42417K90267k82537J48315j2309J48875j23848j52299K73327
$$ 1566609 1585616 1143199 1433466 1150929 1299244 1286935 1435810 1311962 1159663 1432990
13872A432990k01175J34556R2104P4221k42613M4918K18353l54476J96435k01537
$$ 1432990 1231815 1366371 1458475 1532696 1290083 1335001 1553354 1198878 1395313 1193776
13862A193776J77946j84067K47068j19869q1676l36389J02884J32497K45381k54409
$$ 1193776 1371722 1187655 1434723 1314854 1233178 896789 999673 1132170 1377551 1123142
13852A123142L62690j60852k744K89681n36528K44569j58432j67855L32156k55259
$$ 1123142 1485832 1324980 1322236 1611917 1075389 1319958 1161526 993671 1325827 1070568
13842A070568J89765J15213m03541K19401m8274q2188J20013J90360n94055M1915
$$ 1070568 1260333 1375546 972005 1191406 1143132 1060944 1180957 1371317 777262 819177
13832H19177M05437L90615o78668j62240J48248J98767m27157J75567J24456J09544
$$ 819177 1224614 1615229 936561 774321 922569 1121336 694179 869746 994202 1103746
13822A103746j23368P5255J09093k77990O0179P4440K37428J19647m31130p1081
$$ 1103746 980378 1055633 1164726 886736 946915 1021355 1258783 1378430 947300 876219
13812H76219J8274L53824l37406K88371j97228j39010O1622n6815m9824P1714
$$ 876219 894493 1248317 910911 1199282 1002054 863044 924666 867851 818027 889741
13802H89741j6516J38419J29321L4584j4753k54956J94599m55157J67638M12312
$$ 889741 873225 1011644 1140965 1175549 1160796 905840 1100439 645282 812920 1225232
13792A225232q7877l23765j64310M10342m42119K88014K37176L4840l55855L30643
$$ 1225232 1137355 813590 649280 1059622 617503 905517 1142693 1177533 821678 1152321
13782A152321k05274P0176k32011k47317M17000j13722K6880L0148j31733J95261
$$ 1152321 947047 1017223 785212 537895 954895 841173 868053 898201 766468 961729
13772I61729k88029k0200L3132k58018O14692m26903J96186K24018k41019l32505
$$ 961729 673700 653500 686632 428614 1043306 616403 812589 1036607 795588 463083
13762D63083K87532j49933j75351K16089o2136L15698J88258l57265p113j91769
$$ 463083 750615 600682 425331 641420 579284 894982 1083240 725975 718862 527093
13752E27093K99973j03848J30231j62828P7822m6036j75641L05660K0058j92212
$$ 527093 827066 723218 853449 690621 768443 722407 546766 852426 872484 680272
13742F80272j33630j03602J20403M29068D60008L02098j11530o2803J49475j52398
$$ 680272 546642 443040 563443 992511 460008 762106 650576 587773 737248 584850
13732E84850R7792K2931o5385k36010K85591L40881m10042k25758L10681P1861
$$ 584850 682642 705573 640188 404178 689769 1030650 620608 394850 705531 777392
13722G77392k9444O3795m6535n3895M1070l52289J10697K51743k27069K13385
$$ 777392 747948 811743 765208 711313 752383 400094 510791 762534 535465 748850
13712G48850L98160k66370K24296D22150L79281l17311J69103N008N860K86670
$$ 748850 1147010 880640 1104936 422150 801431 484120 653223 658231 664091 950761
13702I50761D71698M8835K60559k78374M3300K41584k74409A96321O1652L64223
$$ 950761 471698 520533 781092 502718 546018 787602 513193 196321 257973 622196
13692F22196R4927j82681K97638j69438J81590j49362m343L54002m41646o0997
$$ 622196 717123 534442 832080 662642 844232 694870 690527 1044529 602883 541886
13682E41886k17803O7041L99915C91472J87769q1009r946L36045B56825J30493
$$ 541886 324083 391124 791039 391472 579241 498232 488286 824331 256825 387318
13672C87318K9544J75446J1j80572N4749K42067k98159o365j7566J76817J21636
$$ 387318 416862 592308 592319 411747 466496 708563 410404 404039 386473 563290 684926
13661F84926A69750M24055m2181Q0362j02611r0150J34306Q9742Q3231j30870
$$ 684926 169750 593805 551624 631986 529375 439225 573531 663273 746504 615634
13651F15634j46415k26678M63907k80549m6798a16169C73030L9738A32063L31629
$$ 615634 469219 242541 706448 425899 379101 -116169 373030 412768 132063 463692
13641D63692K09827C11856J40744J23503k50733o9192L60585k64210N9925K11078
$$ 463692 673519 311856 452600 576103 325370 256178 616763 352553 412478 623556
13631F23556l9733B51973R8935K53183J80351B8539P87684k17678p1091j39631
$$ 623556 583823 251973 350908 604091 784442 28539 816223 598545 527454 387823
13621C87823J5896K05755k24423K11614k23062r4555j35265J28207L85116o4733
$$ 387823 403719 609474 385051 596665 373603 279048 143783 271990 657106 592373
13611E92373M4544N5070n8597l3870A09439K1121O04835A52299b5741C55388J33187
$$ 592373 636917 691987 633390 599520 109439 130560 735395 152299 -25741 355388 488575
13600D88575k37076J85240j07073G5095K69243J76116m2234m5344J70357J12367
$$ 488575 251499 436739 329666 75095 344338 520454 478220 432876 603233 715600
13590G15600l56089N4239j80365K0657L80887M9721k45117j18078A27764L40581
$$ 715600 359511 413750 233385 254042 634929 684650 439533 321455 127764 468345
13580D68345N7465j18694A3116J89194P5170M05375R5425l79015P0252J98371
$$ 468345 525810 407116 13116 202310 277480 682855 778280 399265 469517 667888
13570F67888j55419c2106D62128O969J76202C6335J73615p5377L16732p5622J41785
$$ 667888 512469 -32106 462128 469097 645299 36335 209950 134573 451305 375683 517468
13559E17468k24B23474K21769m1296j83973J91936j29345J10921j02049K95468
$$ 517468 517244 223474 445243 403947 219974 411910 282565 393486 291437 586905
13549E86905B52800q6441K46617j11232L57216n9812j53038K27205A95878J23409
$$ 586905 252800 166359 412976 301744 658960 599148 446110 673315 195878 319287
13539C19287G3344L56625J13997J26375k31396A61568J76807j04717J59205H4765
$$ 319287 73344 429969 543966 670341 438945 161568 338375 233658 392863 84765
13528F33335k33104L9636b0435C0099L30633P8071j02850Q0100A86904Q8401j28047
$$ 633335 400231 439867 -20435 30099 360732 438803 335953 416053 186904 275305 147258
13517A47258J30959L98468l01223j3758r794o3632L4783A09137N7267K46839j50942
$$ 147258 278217 676685 375462 361704 351910 288278 323061 109137 166404 413243 262301
13506B62301l6803J60793P4561j4964A39827N8163M14260B62707M2960I8078K73659
$$ 262301 225498 386291 460852 445888 139827 197990 612250 262707 305667 98078 371737
13495C71737B8341K68530m2898L68089B47834B9092K11655a9981C29766D3794
$$ 371737 28341 296871 253973 622062 247834 29092 240747 -19981 329766 43794
13484B0697K34575K7242B2635K45010F5737J23042K2520K71016n4351A87360c654
$$ 20697 255272 282514 22635 267645 65737 188779 211299 482315 427964 187360 -3654
13472B19272M09491k47572j60761H9418L60237j05537a24129C10121K47055c0999
$$ 219272 628763 381191 220430 89418 449655 344118 -124129 310121 557176 -30999
13461D88950B27232R343K80164l3462k31644O0945q0584L448r251K72755B44709
$$ 488950 227232 236575 516739 483277 251633 312578 231994 235442 226191 498946 244709
13449A30753Q6020c394B78992Q7368j50577N9827J34147o8964O3085j3163j70852
$$ 130753 216773 -3394 278992 366360 215783 275610 409757 340793 403878 390715 219863
13438B19863g0088A31689m4038J41534M8256F4346I649M5816J81019p5806J61099
$$ 219863 -70088 131689 87651 229185 277441 64346 9649 55465 236484 160678 321777
13427C21777M1520q1275A16830a64410m9614A71174q0905L8803g3338E4447K32809
$$ 321777 363297 282022 116830 -164410 -214024 171174 90269 129072 -73338 54447 287256
13416B87256I5412L56820j39911H0946L80276A36453L5145C7693L77491a07975
$$ 287256 95412 452232 312321 80946 461222 136453 171598 37693 415184 -107975
13405A30789M23757k63664L0288l2099J04153j57854R6155M3347K30566A82977
$$ 130789 554546 290882 321170 289071 393224 235370 331525 374872 605438 182977
13394B45434k5544B1645N5920L19208j53124o0211L40993J18746E0211L75784
$$ 245434 219890 21645 77565 396773 243649 183438 524431 643177 50211 425995
13384D25995k07002o5594e1474D06595c9530B04794m5611m0122D9183L62747K9985
$$ 425995 218993 153399 -51474 406595 -39530 204794 159183 119061 49183 411930 441915
13373D41915k02075A05062j2672K29487A11578J30550k3976J29255p4800j25282
$$ 441915 239840 105062 92390 321877 111578 242128 218152 347407 272607 147325
13363A47325Q3225j09241L5320Q2524n6999m0205a1392B16218O8745j20022K04484
$$ 147325 230550 121309 156629 239153 182154 141949 -11392 216218 284963 164941 369425
13352C69425K6581n4194M9426h6506D02154A39671L18826j10483j64122B1210
$$ 369425 396006 341812 391238 -86506 402154 139671 458497 348014 183892 21210
13341a08720B85640P8582j55667J15065I7711J12634P9026J70589j55428G6083
$$ -108720 285640 364222 208555 323620 97711 210345 289371 459960 304532 76083
13330A32013K45153q9426M0669j48928K14970A5101K45229j15199D0455g2162
$$ 132013 377166 287740 328409 179481 394451 15101 260330 145131 40455 -72162
13319C32215Q7695A66996J00581O5316g2263B08408J6487N3745l4118Q7357A60304
$$ 332215 419910 166996 267577 332893 -72263 208408 224895 278640 244522 331879 160304
13307E1998a90386B3604L23757j60489K95786A88641K87802q8435j93658a00374
$$ 51998 -190386 23604 347361 186872 482658 188641 476443 388008 194350 -100374
13296D37701A39751J61735L2155a9687C62086n2598q7068b9630D30614F3934c7501
$$ 437701 139751 301486 333641 -19687 362086 309488 222420 -29630 430614 63934 -37501
13284B27953p9670Q9208Q2630o1620I8276l481P5198J88538l3731Q8272l334A55346
$$ 227953 148283 237491 320121 258501 98276 94795 169993 358531 324800 413072 409738 155346
13271H698M08616C507g045A0390J9275K80988j28816E6025L79135m2690G691Q2160
$$ 8698 417314 3507 -7045 10390 29665 310653 181837 56025 435160 392470 7691 89851
13259H9851M0471m0435Q0973c8019A04586J76525N1248a6934C30549f4598H6551
$$ 89851 130322 89887 170860 -38019 104586 281111 332359 -16934 330549 -64598 86551
13247B10202p9761k2642J52129a8439A63087c43098B55905m6782k0813a4540C09863
$$ 210202 130441 107799 259928 -18439 163087 -343098 255905 209123 188310 -14540 309863
13235b24604A63644b5365A60770b00858A49603d8281C26066A42162k0804D3845
$$ -224604 163644 -25365 160770 -200858 149603 -48281 326066 142162 121358 43845
13224A4919J05452K95954b9190A49395o3532O5576a0653C64721p2252N7118j62419
$$ 14919 120371 416325 -29190 149395 85863 151439 -10653 364721 292469 349587 187168
13213A87168H4058A979f4872A84696m3006c9139B61551p7808G3359a59355B8141
$$ 187168 84058 1979 -64872 184696 141690 -39139 261551 183743 73359 -159355 28141
13201D38692j71448H2739Q0809E0151J08536K39250g3539K0435A35872B7720R7317
$$ 438692 267244 82739 163548 50151 158687 397937 -73539 -53104 135872 27720 125037
13190A25037f2094G8234i0160A02129D9484K63294E1961J19462h2759B3205J02510
$$ 125037 -62094 78234 -90160 102129 49484 312778 51961 171423 -82759 23205 125715
13179A25715J38848j01798n0972O3880J80403a0215C37311D2349b21653d004k74485
$$ 125715 264563 162765 111793 175673 356076 -10215 337311 42349 -221653 -4004 -278489
13168b78489A07834J03452J27016A6275K82295j39382d9596m6094b2665p0187
$$ -278489 107834 211286 338302 16275 298570 159188 -49596 -95690 -22665 -92852
13158i2852B6691J35563o0003B8962b6541A76995l8932l9032P9896j1670b03137
$$ -92852 26691 162254 102251 28962 -26541 176995 138063 99031 178927 167257 -203137
13146C8548P800A6142R2017K21544I3577J59870j06707K0937g3387l18639E5291
$$ 38548 46348 16142 108159 329703 93577 253447 146740 167677 -73387 -392026 55291
13134B7126O8520f570F26562a60652d3473J0126B49297a65965f960k864H0165
$$ 27126 95646 -6570 626562 -160652 -43473 -33347 249297 -165965 -6960 -9824 80165
13122a81263B46361m4994N9518a70457A55004K32394A53091l6195a9546B9875
$$ -181263 246361 201367 260885 -170457 155004 387398 153091 116896 -19546 29875
13111g8506q1916B92079b42279G4932a04394r8425A54348K5103E9387e3716A36408
$$ -78506 -160422 292079 -242279 74932 -104394 -202819 154348 179451 59387 -53716 136408
13099h0681c3532H8853a7289p1334H0754J11450a66894e380C16604j00436l2685
$$ -80681 -33532 88853 -17289 -88623 80754 192204 -166894 -5380 316604 216168 183483
13088A83483G1732O1423Q1530B8985J81498G3800J28968l5906c2965j4328A39569
$$ 183483 71732 133155 214685 28985 210483 73800 202768 166862 -32965 -47293 139569
13076A53416i5284A80987k7967G4946l3392a06104b6085B7959a78779Q6162D28353
$$ 153416 -95284 180987 153020 74946 41554 -106104 -26085 27959 -178779 -92617 428353
13064B08257p1252J59832I1465J78009j27899n4175R9652n4516D5317a33859o184
$$ 208257 137005 296837 91465 269474 141575 87400 187052 132536 45317 -133859 -140043
13053a40043O6515j02161e1065j131D0327M29966j41436d064I8007B8215j3868
$$ -140043 -73528 -175689 -51065 -52196 40327 470293 328857 -4064 98007 28215 14347
13042A4347N0416J06637b91507A38647n2683A6808M7342K32090A17993A6460K23277
$$ 14347 64763 171400 -291507 138647 85964 16808 64150 296240 117993 16460 239737
13031B39737H8168K17988a4123j23218N5725A20723e6581B91055H6354K88496
$$ 239737 88168 306156 -14123 -137341 -81616 120723 -56581 291055 86354 374850
13021C74850a33949A05157K88270j13940j32941M3534J26156E980O8351J3731
$$ 374850 -133949 105157 393427 279487 146546 190080 316236 5980 74331 88062
13011H8062A5271J12086b7103A01305a9766B97206A7625P4926J05397i1928G3006
$$ 88062 15271 127357 -27103 101305 -19766 297206 17625 92551 197948 -91928 73006
12999A76132P7822O587B2421J22277b18376B55068a78767e8760m6208B09397J23409
$$ 176132 253954 260541 22421 144698 -218376 255068 -178767 -58760 -104968 209397 332806
12988C32806D3236J60274c01845A26799a46065C26606h3868b8476n2369a9178
$$ 332806 43236 203510 -301845 126799 -146065 326606 -83868 -28476 -80845 -19178
12977B01795a6043j60166G1706h8871E7825K23400j34748C6024d94752a21092
$$ 201795 -16043 -176209 71706 -88871 57825 281225 146477 36024 -494752 -121092
12966a33419O5010G4896K26765c6961B14384j04205c0883j59643M6186C39301
$$ -133419 -68409 74896 301661 -36961 214384 110179 -30883 -190526 -144340 339301
12955a14934B36087h5043L6174a0431B12248C2921a9285j79665P8020J5463B5506
$$ -114934 236087 -85043 -48869 -10431 212248 32921 -19285 -198950 -120930 -105467 25506
12943g7682A5656a74867A20730m9286J05732Q7931f8815A73963c36262a09459
$$ -77682 15656 -174867 120730 71444 177176 265107 -68815 173963 -336262 -109459
12932a2493A53098a97333c6797M56H7690e54989a29384A76157p9111b5103k7534
$$ -12493 153098 -197333 -36797 -36341 87690 -554989 -129384 176157 97046 -25103 -52637
12921e2637p3712C63053r5602i766j68129L6377j22286A0010O4344b6017o1366
$$ -52637 -126349 363053 267451 -9766 -177895 -141518 -263804 10010 74354 -26017 -87383
12910h7383j32241l9369C14561g042H6269C0880J49363R4969A35168K17443j72373
$$ -87383 -219624 -258993 314561 -7042 86269 30880 180243 275212 135168 352611 180238
12899A80238a58997A47805a63250A71809J5391a66472A18016a29225C52895E2759
$$ 180238 -158997 147805 -163250 171809 187200 -166472 118016 -129225 352895 52759
12888A74867E864P763P1728J30040k3877q4030e431B4552N6502c3480P041k51589
$$ 174867 5864 13627 85355 215395 191518 107488 -5431 24552 81054 -33480 -26439 -278028
12876b78028q8761A94915b55855B67945j02244b64162i5195a7148k320g331k08919
$$ -278028 -366789 194915 -255855 267945 165701 -264162 -95195 -17148 -19468 -7331 -216250
12865b16250A4363L19338d6678C9853i1728J5980E14481A26982D5897c9793a9738
$$ -216250 14363 333701 -46678 39853 -91728 -75748 514481 126982 45897 -39793 -19738
12853C02949g0911k2332A18180J58341A2002h110k05940E5481L4099Q2470Q775
$$ 302949 -70911 -93243 118180 276521 12002 -8110 -214050 55481 89580 172050 180825
12842A80825M6034j4367F1884b24708B46561q2503j3016o1626J99508a27558H2348
$$ 180825 226859 212492 61884 -224708 246561 164058 151042 89416 288924 -127558 82348
12830b46935B34915o8829a58010J3411c691j43917B14879F3455a42837H3551J0387
$$ -246935 234915 166086 -158010 -144599 -3691 -147608 214879 63455 -142837 83551 93938
12819I3938J02190r1115J18453a8500G2514i5129p1419A17384Q6632a19497H7982
$$ 93938 196128 105013 223466 -18500 72514 -95129 -166548 117384 204016 -119497 87982
12807b10609f7847A69219a28157j29511C7295f1799b3886B1825K01943n4683n6358
$$ -210609 -67847 169219 -128157 -257668 37295 -61799 -23886 21825 223768 169085 112727
12796A12727g33j98414f236A0851K35131j12620D4549a38914A00943D8353A9203
$$ 112727 -733 -199147 -6236 10851 245982 133362 44549 -138914 100943 48353 19203
12784g9037b8912C0596j2084K05204M4619p9386d0676k6867j76326e9029q0270
$$ -79037 -28912 30596 18512 223716 268335 188949 -40676 -67543 -243869 -59029 -139299
12773a39299M5351A63995b21476B38017a91654C58270D059J08765M6316p6536
$$ -139299 -93948 163995 -221476 238017 -191654 358270 4059 112824 159140 82604
12763H2604a7265j64036O1776L016A9959b86681H7236e5913j94304i0255K7614
$$ 82604 -17265 -181301 -119525 -116509 19959 -286681 87236 -55913 -250217 -90255 -62641
12752f2641A84317e9387A66163b8397k07289R3259B30992A5618J32379a12036
$$ -62641 184317 -59387 166163 -28397 -235686 -142427 230992 15618 147997 -112036
12741B0321c28719A09650f6177D8663c84975A73340R4746b57949b541D6436j2708
$$ 20321 -328719 109650 -66177 48663 -384975 173340 268086 -257949 -2541 46436 33728
12730C3728a39516H3075c6592B63268j28940a8979A19581a67750I1930a23843
$$ 33728 -139516 83075 -36592 263268 134328 -18979 119581 -167750 91930 -123843
12719A63604M3703P628b25976H2238d0374C49914C0229a87016n9635B44782a18395
$$ 163604 207307 214935 -225976 82238 -40374 349914 30229 -187016 -246651 244782 -118395
12707H4306K20863F3071b63676e1843o2095A08654l6892O2904g1848B13748H1457
$$ 84306 305169 63071 -263676 -51843 -113938 108654 71762 134666 -71848 213748 81457
12695A13168L15074H1591A3972a11665B12335k9781D7435N3671J93269I2129f647
$$ 113168 428242 81591 13972 -111665 212335 182554 47435 101106 294375 92129 -6647
12683g7458F103a4107D7483c9181A74590a04905m2737A38184D4924P104a11370
$$ -77458 6103 -14107 47483 -39181 174590 -104905 -147642 138184 44924 52028 -111370
12671A36277A8313b6793H9596H442J79030Q0244b798k69392A20934a17017L2452
$$ 136277 18313 -26793 89596 8442 187472 267716 -2798 -272190 120934 -117017 -84565
12660h4565k310B39772B2949c4825A48902O792M1468G1797a77497Q0347B08408
$$ -84565 -86875 239772 22949 -34825 148902 155694 197162 71797 -177497 -97150 208408
12648A73566C7992a20946B97349j3066D6339L4929M8466h5810G4493d3083l6809
$$ 173566 37992 -120946 297349 284283 46339 81268 129734 -85810 74493 -43083 -79892
12637g9892o1770H8104J71466A10182R5860b9594B51482G1953J35129a40871A44739
$$ -79892 -141662 88104 259570 110182 206042 -29594 251482 71953 207082 -140871 144739
12625e8717B67728e1166A28466i0125C0582b42512A00341d2955B03740N6054E348
$$ -58717 267728 -51166 128466 -90125 30582 -242512 100341 -42955 203740 259794 5348
12613G1193K44206I9871O573b9879C96702j91619p4972K46357G8613C2625d7518
$$ 71193 315399 99871 106444 -29879 396702 205083 130111 376468 78613 32625 -47518
12601A72588m1896b39550E4552J4921R5122b16184m5390A26394O8507b68999B75468
$$ 172588 130692 -239550 54552 69473 164595 -216184 -261574 126394 194901 -268999 275468
12589c4910B75288A5708i8250C26746c7874A17881a30861k7467r8597A85789Q1135
$$ -34910 275288 15708 -98250 326746 -37874 117881 -130861 -158328 -256925 185789 266924
12578B66924f0091A30241l8820l3459L5193a28052a0755B43164C0732a47429B42299
$$ 266924 -60091 130241 91421 57962 93155 -128052 -10755 243164 30732 -147429 242299
12566a45419k17285O8870d354F2225M2971J77789a6252B08126a35369e9045J6737
$$ -145419 -362704 -293834 -4354 62225 105196 282985 -16252 208126 -135369 -59045 -42308
12555d2308A88379Q9462a00670H9637O471l3031N70681B26342f9386D8041j0858
$$ -42308 188379 277841 -100670 89637 96108 63077 633758 226342 -69386 48041 37183
12544C7183J77852d13496i9002B28000j12309c3277j25301A2808b71470i1411
$$ 37183 215035 -413496 -99002 228000 115691 -33277 -158578 12808 -271470 -91411
12533A04616R7564H7869i9226k73536E5155a1003o0821C20501B9626a68805e1694
$$ 104616 202180 87869 -99226 -372762 55155 -11003 -71824 320501 29626 -168805 -51694
12521b41718H9533b29057a07627j2541J0673A87110a64381N4720m0381h913A57651
$$ -241718 89533 -229057 -107627 -120168 -109495 187110 -164381 -109661 -150042 -8913 157651
12509D6489K47830b06904c6241k61219B26214a8700j16628A4451b2465a429B13057
$$ 46489 294319 -206904 -36241 -297460 226214 -18700 -135328 14451 -22465 -1429 213057
12497H258J74278p7494c74205B1836O3883C0249b37762D1557b3835j88803A4054
$$ 8258 182536 105042 -374205 21836 85719 30249 -237762 41557 -23835 -212638 14054
12485A24037a93041B1696K30198e7432D6151J36945b80792A01548c99156a36162
$$ 124037 -193041 21696 251894 -57432 46151 183096 -280792 101548 -399156 -136162
12474a96658B81848H8097k8436A3709b556D42307D6809b2816l996K47l0372j30322
$$ -196658 281848 88097 59661 13709 -2556 442307 46809 -22816 -26812 -26565 -56937 -187259
12462a87259K3083k22056A54554f6726a2822j52926A0222m90c52697J14788j62196
$$ -187259 -164176 -386232 154554 -66726 -12822 -165748 10222 9732 -352697 -237909 -400105
12451d00105A12749f0107F4025a41872c6876A27087K4802o3458b53416P1519A49664
$$ -400105 112749 -60107 64025 -141872 -36876 127087 151889 88431 -253416 -181897 149664
12439B88527b14159O5593B32627a22665D884L8183a64976j59295B35621b54101
$$ 288527 -214159 -148566 232627 -122665 4884 43067 -164976 -324271 235621 -254101
12428A17890a12057A8414b48425I1680c53951c4362E4336e6798B4136L1980O6779
$$ 117890 -112057 18414 -248425 91680 -353951 -34362 54336 -56798 24136 56116 122895
12417A22895K23025f8258E0271h1476k05867c6733F7389K11818g0137j03673B88564
$$ 122895 345920 -68258 50271 -81476 -287343 -36733 67389 279207 -70137 -173810 288564
12405A34760F363c18107i8343l78974B6150L5290M751b45164h8095a3328l21422
$$ 134760 6363 -318107 -98343 -477317 26150 61440 66191 -245164 -88095 -13328 -334750
12394c34750i8370r705c0439l4663K3979B13933A01878b27552J00822f0124A36314
$$ -334750 -98370 -108075 -30439 -65102 -41123 213933 101878 -227552 -126730 -60124 136314
12382a29574N3653B19020a00269d0186A80642o5626P3879Q1685J49555d8140A10048
$$ -129574 -75921 219020 -100269 -40186 180642 115016 188895 270580 420135 -48140 110048
12370i205A83217Q3887j4241j09252R9413r5140L1929N168J2813C9479J36770
$$ -9205 183217 267104 252863 143611 243024 147884 179813 184981 197794 39479 176249
12359A76249M104i0793A43629c6818A21429n6709n860A7929i1402j35470B4840
$$ 176249 180353 -90793 143629 -36818 121429 64720 58860 17929 -91402 -226872 24840
12347A0193K83937d2838l8454r6796k3688A7902i6331C29755f2231k08596A99931
$$ 10193 294130 -42838 -81292 -178088 -201776 17902 -96331 329755 -62231 -270827 199931
12335b84875B99191H4412g4851A85245a37628B30440C1850K15188j09991B9297
$$ -284875 299191 84412 -74851 185245 -137628 230440 31850 247038 137047 29297
12324A17249n2736J05153F2528e2128C79777a0913C46244C0785L32075a3886B3599
$$ 117249 64513 169666 62528 -52128 379777 -10913 346244 30785 362860 -13886 23599
12312A89079J46029j23403k0574b98136a40876K5437F2962J29612p9310h508p360
$$ 189079 335108 211705 191131 -298136 -140876 -115439 62962 192574 113264 -8508 -15868
12301a5868k92805A32299P3350M040l5597q1978J97023j24329b27959b6519j7416
$$ -15868 -308673 132299 205649 209689 174092 92114 289137 164808 -227959 -26519 -43935
12290d3935G8284K57931A16189b42715A12231h0366H2655J87164a15885H8254
$$ -43935 78284 336215 116189 -242715 112231 -80366 82655 269819 -115885 88254
12279C63943i3785A12818c3698B15701K8789I87L64304j06809l3549J2955d3181
$$ 363943 -93785 112818 -33698 215701 244490 987 365291 258482 224933 237888 -43181
12267a56975A40013L24856a0376q1403K433A72539G5492J08373r1445l253g4398
$$ -156975 140013 464869 -10376 -91779 -89346 172539 75492 183865 92420 89167 -74398
12255B81804J43836F7836Q1171K28147O9218A04816L022J48936J85633b0830C576
$$ 281804 425640 67836 149007 377154 446372 104816 107838 256774 442407 -20830 3576
12243A55163Q3697f7365b8666h4j60778B68965h5589A11266J47806r8586G6947
$$ 155163 238860 -67365 -28666 -84 -160862 268965 -85589 111266 259072 160486 76947
12231C46146a39424A62178L5255l9844O7227h545B59670J40914b94008E5568J96784
$$ 346146 -139424 162178 197433 157589 224816 -8545 259670 400584 -294008 55568 252352
12220B52352a39505C53868A25134B7069i8607B80638m8846a90401c7582A76953
$$ 252352 -139505 353868 125134 27069 -98607 280638 231792 -190401 -37582 176953
12209B66161c9326n1641L2002C62794A04467L9540a16428D07935j115n0630i1774
$$ 266161 -39326 -90967 -58965 362794 104467 144007 -116428 407935 406820 356190 -91774
12197E4958N9696P2306J12348Q2097a25882A56539c1834A74851l0755K827J03780
$$ 54958 114654 186960 299308 381405 -125882 156539 -31834 174851 144096 146923 250703
12186B50703q8773o4571J41130G9732J28713J24413A18802L2804O8622G9376g9750
$$ 250703 161930 97359 238489 79732 208445 332858 118802 151606 220228 79376 -79750
12174E0662a00406F8083J06285l9513B5296J80106a14699j1257b5664A72232a83870
$$ 50662 -100406 68083 174368 134855 25296 205402 -114699 -125956 -25664 172232 -183870
12162C02825d098r1240B12151J92365d50294D8492K99950A40420e4533l3462E19094
$$ 302825 -4098 -95338 212151 404516 -450294 48492 348442 140420 -54533 -87995 519094
12150B87688B8121c8820B19477q8986L54736D1356K20869L5019o4647j3164n5303
$$ 287688 28121 -38820 219477 130491 485227 41356 262225 297244 232597 219433 164130
12139A64130A1973b9002I5420c7964A77695C2200M4034j5370a64342A61453J9842
$$ 164130 11973 -29002 95420 -37964 177695 32200 76234 60864 -164342 161453 181295
12128A81295b8946e298B65405j7143c4580k5215C87274I653M2294Q4468k2980
$$ 181295 -28946 -5298 265405 248262 -34580 -59795 387274 9653 51947 136415 113435
12117A13435D0437L11416F8166k1601R7585o9119L7895J88041j47727e3129A73710
$$ 113435 40437 351853 68166 46565 144150 75031 112926 300967 153240 -53129 173710
12105A95603K25176K594c18418G4901a0574D69830f3574L1110o6262D79041B862
$$ 195603 420779 423373 -318418 74901 -10574 469830 -63574 -32464 -98726 479041 2862
12093B2546K94654G6400K5797J5339A2493D481J81395a74805B64683J51206G3619
$$ 22546 317200 76400 102197 117536 12493 4481 185876 -174805 264683 415889 73619
12081A51547p0914a15728a1168D49185I4145K30730A32532O3784l9366l8771O2287
$$ 151547 80633 -115728 -11168 449185 94145 324875 132532 196316 156950 118179 180466
12070A80466p8754J18107m8895n4115L2086m8006M3087K4540g6672F1792c1878
$$ 180466 101712 219819 170924 116809 148895 100889 143976 168516 -76672 61792 -31878
12058B30563G99a92920b6520A86520P0544q7780R4256J58031I9340K82793A54704
$$ 230563 799 -192920 -26520 186520 257064 169284 263540 421571 99340 382133 154704
12046b15111E4121P8057B3709L34555o0699c04067J03313e4579G0643a52999A94188
$$ -215111 54121 132178 23709 358264 297565 -304067 -200754 -54579 70643 -152999 194188
12034G617O525a68453f912j58066A39750o3778a82000A91077a7360A57597N7387
$$ 7617 14142 -168453 -6912 -164978 139750 75972 -182000 191077 -17360 157597 214984
12023B14984B0002a49915b597G6549J77232b28850N3432K1246k17664A75111a60837
$$ 214984 20002 -149915 -2597 76549 253781 -228850 -175418 -154172 -371836 175111 -160837
12011A21824J85731C4825L7627K69230b67002A62498j4679a9272G5103g9915J8132
$$ 121824 307555 34825 72452 341682 -267002 162498 147819 -19272 75103 -79915 -61783
12000f1783Q486A8269a1237B87172j04820a34708A23257o1456a15739D884f6688
$$ -61783 -53297 18269 -11237 287172 182352 -134708 123257 61801 -115739 4884 -66688
11988B30720H7748d1336A26285a66286B10605r6271A9639M03384D9907J94641
$$ 230720 87748 -41336 126285 -166286 210605 114334 19639 423023 49907 244548
11978B44548i7240e090G7203P044b7772k82301n2741h1313k7127j05051A31829
$$ 244548 -97240 -5090 77203 84247 -27772 -310073 -362814 -81313 -108440 -213491 131829
11966a31628f4973G3540K88057A56132a83758C09750F2738a89462I3999d2961
$$ -131628 -64973 73540 361597 156132 -183758 309750 62738 -189462 93999 -42961
11955D7643a27729F413K43482f9248m30439A82757a57499A7628f2144A37935A6920
$$ 47643 -127729 6413 249895 -69248 -499687 182757 -157499 17628 -62144 137935 16920
11943G1103i5370A12685i7973J6905A5992g7235d445o7486F6275D995b24751g3242
$$ 71103 -95370 112685 -97973 -81068 15992 -77235 -4445 -71931 66275 4995 -224751 -73242
11930A86757A8540i0970C6359a58525A24620E5843a37449A82461b22969r2783
$$ 186757 18540 -90970 36359 -158525 124620 55843 -137449 182461 -222969 -315752
11920c15752A46175a84240c2022C6805g2863k06329a28426r5030j53643A86669
$$ -315752 146175 -184240 -32022 36805 -72863 -279192 -128426 -223456 -377099 186669
11909a2150j76327F3178P6464c38022C02086j48547a77958J9556A92034D4616
$$ -12150 -188477 63178 139642 -338022 302086 153539 -177958 -158402 192034 44616
11898G0914a49144C03699d2995l1755C26L3270J58866b14450A4656h4944A32579
$$ 70914 -149144 303699 -42995 -74750 326 33596 192462 -214450 14656 -84944 132579
11886A74467C3018a22146K6371m4439N5722j68708a21515J738A48377b16751B7142
$$ 174467 33018 -122146 -95775 -140214 -84492 -253200 -121515 -119777 148377 -216751 27142
11874e57437a82688l266D9022K9534b78319a17006p0373d9196j00918A8991J2014
$$ -557437 -182688 -185954 49022 78556 -278319 -117006 -187379 -49196 -150114 18991 31005
11863C1005i1974k80914J36823F2765a39263H5232J39410q8192a8931j01441j75471
$$ 31005 -91974 -372888 -236065 62765 -139263 85232 224642 136450 -18931 -120372 -295843
11852b95843B6518f6042C66480i0221D5463b15445a00435C8999a82222g4821m33727
$$ -295843 26518 -66042 366480 -90221 45463 -215445 -100435 38999 -182222 -74821 -508548
11841e08548K50033q4614D7606a93761N1707l1740a0360j19457b7447G3095a71844
$$ -508548 -258515 -343129 47606 -193761 -142054 -173794 -10360 -129817 -27447 73095 -171844
11829c14474C00233d2418A26063l0114b112A37644C4861n66c1637D9485b84084
$$ -314474 300233 -42418 126063 95949 -2112 137644 34861 34295 -31637 49485 -284084
11817A70264C9482c7367m3655A48181K35263a8540r4701j00164R1901d0413A01669
$$ 170264 39482 -37367 -81022 148181 383444 -18540 -113241 -213405 -121504 -40413 101669
11805d9007j40647A03175A0531L9495a242A21949q441c00526b1363B4583a98800
$$ -49007 -189654 103175 10531 50026 -1242 121949 113508 -300526 -21363 24583 -198800
11793b58506B2904a64526b2612A835h0333m7812f2360A21078d1680A58155J7177
$$ -258506 22904 -164526 -22612 1835 -80333 -128145 -62360 121078 -41680 158155 175332
11782A75332b4928A61239g0766a8156j33525B445a76322a3231l34243c3180A15861
$$ 175332 -24928 161239 -70766 -18156 -151681 2445 -176322 -13231 -347474 -33180 115861
11770A48782k0909Q5112A00288a72131D52853b71316C2780L1446R864e8153j39941
$$ 148782 127873 212985 100288 -172131 452853 -271316 32780 64226 74090 -58153 -198094
11759a98094A23271c94503C0956b1317B5619N6968b55477b5744j32795D791R7018
$$ -198094 123271 -394503 30956 -21317 25619 82587 -255477 -25744 -158539 4791 101809
11748A01809L7222b78649j564a23215e9087a2654A92964e0403k57675N9815k1138
$$ 101809 139031 -278649 -280213 -123215 -59087 -12654 192964 -50403 -308078 -248263 -269401
11737b69401A33036P488b17455k9074F8806b13649I2703a08942J7101o9026I8611
$$ -269401 133036 140524 -217455 -246529 68806 -213649 92703 -108942 -91841 -160867 98611
11725b46016A02739h6502F1356J78a41852O7263E8886N5353f3070m0534C61248
$$ -246016 102739 -86502 61356 61534 -141852 -74589 58886 114239 -63070 -103604 361248
11713H6137g7222C5307C674a96203b2264j97557A93353c6772C83264e7568I5211
$$ 86137 -77222 35307 3674 -196203 -22264 -219821 193353 -36772 383264 -57568 95211
11701A85153l0198f1386A13755L7512c5420k15080H0083g2131b506k08061A15419
$$ 185153 154955 -61386 113755 151267 -35420 -250500 80083 -72131 -2506 -210567 115419
11689A44256F0218m383K67846a76560C6454K37971b65095A3646L12455a0775A23310
$$ 144256 60218 55835 323681 -176560 36454 274425 -265095 13646 326101 -10775 123310
11677A31453d9460A12946m9640K35334J3696d3720B49992G5391e2967n357A46142
$$ 131453 -49460 112946 63306 298640 312336 -43720 249992 75391 -52967 -58324 146142
11665A34748a63721A16370b3485B7423K78617h133G0781k198e8338A62174a1706
$$ 134748 -163721 116370 -23485 27423 306040 -8133 70781 68583 -58338 162174 -11706
11653D6993A9836R310g9275i951j24559o2373A7480e3673A30423b01150D19594
$$ 46993 19836 29146 -79275 -9951 -134510 -196883 17480 -53673 130423 -201150 419594
11641e4703A9453J72493a6864l01762A05029j2553b06936c0316H099f1406n4410
$$ -54703 19453 191946 -16864 -318626 105029 92476 -206936 -30316 8099 -61406 -115816
11630a15816I5241j2714C0862K38648N1024a56280A61109E2690k4332l533A0807
$$ -115816 95241 82527 30862 269510 320534 -156280 161109 52690 28358 24825 10807
11618D2091J83899f0553k17470J08041I9957J47242a6457B6449b04287h6933b5582
$$ 42091 225990 -60553 -278023 -169982 99957 247199 -16457 26449 -204287 -86933 -25582
11606e3242o9163b2652p6225C36201F4240e9004j51815Q7694L2996B11392A7043
$$ -53242 -122405 -22652 -98877 336201 64240 -59004 -210819 -123125 -90129 211392 17043
11594E7803A4363K97464a36603B48521g0028B99356b5532a0222A25531h2108H7795
$$ 57803 14363 311827 -136603 248521 -70028 299356 -25532 -10222 125531 -82108 87795
11582A36424L4209J0922l609h8982H4539A5338J16613R7043b4417C66775j74145
$$ 136424 170633 181555 177946 -88982 84539 15338 131951 228994 -24417 366775 192630
11571A92630b60159C7507a72653B86933i975C01966c7299B7617J33022a19073
$$ 192630 -260159 37507 -172653 286933 -9975 301966 -37299 27617 160639 -119073
11560D06912A94833n7338D0135M09642G7034i447j16375B00915K99878A67909
$$ 406912 194833 137495 40135 449777 77034 -9447 -125822 200915 500793 167909
11549I6440M8463E3673c42097a30546j10492C29121b83073O5480A06489K5087
$$ 96440 144903 53673 -342097 -130546 -241038 329121 -283073 -217593 106489 131576
11539A31576J31615D6780K9406K39954A32187J20215a04948d5667B1631a08866
$$ 131576 263191 46780 76186 316140 132187 252402 -104948 -45667 21631 -108866
11528H9428i4071A26971J95477B6434L9403L62016a24772k79850D3219c72756
$$ 89428 -94071 126971 322448 26434 65837 427853 -124772 -404622 43219 -372756
11517A48877L1244e2723A10126g9718K4340j52602A86745j0718o9151J3565k3847
$$ 148877 180121 -52723 110126 -79718 -55378 -207980 186745 176027 106876 120441 96594
11506I6594D792L02642f351l5564C30458i8355A80648G9609K202J47896e6262
$$ 96594 4792 307434 -6351 -41915 330458 -98355 180648 79609 81811 229707 -56262
11494F0361P5191a6773k81835B55576D8489L4619K29629a2305C51074A70795E9107
$$ 60361 135552 -16773 -298608 255576 48489 83108 312737 -12305 351074 170795 59107
11482A88074k7825b8578C65608j51792N2100h6466C07880A36414J02643F7175
$$ 188074 160249 -28578 365608 213816 265916 -86466 307880 136414 239057 67175
11471a69310A39041B9875L61604D3935a03635k1503A88739J00754m2382J59661
$$ -169310 139041 29875 391479 43935 -103635 -125138 188739 289493 247111 406772
11461D06772A84208B6393q76P658J04567J49012q5094l539R8014j05247a0220
$$ 406772 184208 26393 25517 33175 137742 286754 201660 198121 296135 190888 -10220
11449A34776b40397B70645j33159c22903F8425C2962e7762k0147h670A37506j5685
$$ 134776 -240397 270645 137486 -322903 68425 32962 -57762 -77909 -8670 137506 121821
11438A21821b7385C97884j80203A02021m4282i5536m9997I381J0167K69576B6385
$$ 121821 -27385 397884 217681 102021 57739 -95536 -145533 9381 19548 289124 26385
11426D8248a78865A93461J35945b41014c0945C44292m5947A30802B827a33765
$$ 48248 -178865 193461 329406 -241014 -30945 344292 298345 130802 2827 -133765
11415A38757h4454B15058J49377a8163B0755b44795D07167D8203b5181j36226
$$ 138757 -84454 215058 364435 -18163 20755 -244795 407167 48203 -25181 -161407
11405a61407A75218a78994B58414a22639j59827F7b8905j37306B05074a3735A71551
$$ -161407 175218 -178994 258414 -122639 -282466 67 -28905 -166211 205074 -13735 171551
11393a7577m9413C55693e7827D9552b3175I257b68105C0069M6114a60413F1210
$$ -17577 -66990 355693 -57827 49552 -23175 9257 -268105 30069 76183 -160413 61210
11381i6535A23200b19481C0585K1551i5940B35670m9614f0369B06h9153L5905
$$ -96535 123200 -219481 30585 52136 -95940 235670 186056 -60369 206 -89153 -53248
11370e3248A53898e4803k67307J37958f4103p4348f3406k69455B51503b13579
$$ -53248 153898 -54803 -322110 -184152 -64103 -138451 -63406 -332861 251503 -213579
11359h9268j14135G0823j3739b6056q0846F2211b45191J6864B96709e3084A38046
$$ -89268 -203403 70823 57084 -26056 -106902 62211 -245191 -228327 296709 -53084 138046
11347A472J6372N0513b8851I2777a75776A93898O0828c91C87313g3107j17C5516
$$ 1472 17844 68357 -28851 92777 -175776 193898 254726 -391 387313 -73107 -73224 35516
11334c55431h6203F6836a63248f3072I1948q08B3897K12468d80112A69502g9612
$$ -355431 -86203 66836 -163248 -63072 91948 91140 23897 236365 -480112 169502 -79612
11322D92700b54895A11583D585a51392O7946C61912b06196A47706p770D6243a5110
$$ 492700 -254895 111583 4585 -151392 -83446 361912 -206196 147706 139936 46243 -15110
11310e0233l9848p0981G6877a48803N4279H1645K34484j6669c1195j81844k5816
$$ -50233 -90081 -161062 76877 -148803 -94524 81645 316129 299460 -31195 -213039 -238855
11299b38855d6330A04554j2161b41906A61815c5687a6733q2817b8882p8917j3514
$$ -238855 -46330 104554 92393 -241906 161815 -35687 -16733 -99550 -28882 -107799 -121313
11288a21313k3285k19844A05169j5303j9858J26012p1184k8110M1156a48830H9375
$$ -121313 -144598 -364442 105169 89866 70008 196020 124836 96726 137882 -148830 89375
11276B28917b37595O2878D969N2132a59043c6524A98007a82305O7742E1566a83211
$$ 228917 -237595 -174717 4969 57101 -159043 -36524 198007 -182305 -114563 51566 -183211
11264c72709J71199A97788J9731C6078O1038h6274L9324k0374p7997C06631c8661
$$ -372709 -201510 197788 217519 36078 97116 -86274 -46950 -67324 -145321 306631 -38661
11252h9685k17712a40808l3446C6364g926l48743a37421J3831D6440b176k68273
$$ -89685 -307397 -140808 -174254 36364 -7926 -356669 -137421 -123590 46440 -2176 -270449
11241b70449a6992j13538p3709p7868A8435J51068a58636A25405a1696I023f8997
$$ -270449 -16992 -130530 -204239 -282107 18435 169503 -158636 125405 -11696 9023 -68997
11229f3055l1299B6795b81541N1723E1138d6808j39666C9105J95788c99519H0864
$$ -63055 -94354 26795 -281541 -229818 51138 -46808 -186474 39105 234893 -399519 80864
11217A76562a86201B8431a78420b9645l5827j07438C01199c47263J27902d4628
$$ 176562 -186201 28431 -178420 -29645 -65472 -172910 301199 -347263 -219361 -44628
11206a94414A09862d545B13820I8923a50456E3159M2805b03902F4554K0237f5564
$$ -194414 109862 -4545 213820 98923 -150456 53159 95964 -203902 64554 84791 -65564
11194c00788g6796R610F3665a87310B15232r7334e9702k0680c0453k27246G9402
$$ -300788 -76796 -67186 63665 -187310 215232 117898 -59702 -80382 -30453 -257699 79402
11182A81719i6918d7711K1205n317j80569b7610j09997A6247h0438k8709B7549
$$ 181719 -96918 -47711 -26506 -31823 -212392 -27610 -137607 16247 -80438 -109147 27549
11170a25140A7706e2978n159m1989C6582K127b40912F6257b02321R1191A10826
$$ -125140 17706 -52978 -58137 -100126 36582 38709 -240912 66257 -202321 -111130 110826
11158A26742a99926M8789f8787n4305l1806p75I0275a94942A766c32282c9390
$$ 126742 -199926 -151137 -68787 -123092 -154898 -155673 90275 -194942 1766 -332282 -39390
11146a62120j25658B89942b44703f5321A14601h4749j54981R2093l79630B4893
$$ -162120 -287778 289942 -244703 -65321 114601 -84749 -239730 -147637 -527267 24893
11135B17120h3518q8343k32264C873L43269a1226l69036a2690r3639A17960b61812
$$ 217120 -83518 -171861 -404125 3873 347142 -11226 -380262 -12690 -106329 117960 -261812
11123E5239J7942c50199i1851D6937J81907j6973b97343B0304i8691D52a74168
$$ 55239 73181 -350199 -91851 46937 228844 211871 -297343 20304 -98691 452 -174168
11111a82983b5069A86807l3719C2537J50108C1704L6982J03231J07770A19996
$$ -182983 -25069 186807 153088 32537 182645 31704 68686 171917 279687 119996
11100A52392K67230A0744Q8565l948J69534g5772A62660k5075a65161P5636A29978
$$ 152392 419622 10744 99309 95361 264895 -75772 162660 137585 -165161 -89525 129978
11088A02875a6552o1802K5504H9554R3381J40363j7001J10024N6552a2607j44901
$$ 102875 -16552 -78354 -52850 89554 182935 323298 306297 416321 472873 -12607 -157508
11077a57508G5851N5469a81849E5589b4664B95921a4628C21374a81639B98343
$$ -157508 75851 131320 -181849 55589 -24664 295921 -14628 321374 -181639 298343
11066C71895l3645j56753a066B82511j05222k5388o9788K8891L3254J67392J23722
$$ 371895 338250 181497 -1066 282511 177289 151901 82113 111004 144258 311650 435372
11055D35372A60045L43387c6204D65877E7523L75000A1457K23546L412L45131
$$ 435372 160045 503432 -36204 465877 57523 432523 11457 235003 238415 583546
11045E83546B36135K47219L8894B3756N03783q8327r7516P5254N5286K49779A19208
$$ 583546 236135 483354 522248 23756 527539 439212 341696 416950 472236 722015 119208
11033I02632l04281n5839J25576k26123J37546k60206K51088J20293k12701J75226
$$ 902632 598351 542512 668088 441965 579511 319305 570393 690686 477985 653211
11023F53211n4135N6999J94494j71565J72963k88937J06696j4244M2245j37061
$$ 653211 599076 656075 850569 679004 851967 563030 669726 655482 697727 560666
11013E60666J81226B52294M85917n0335p1990K97980l68057Q5381r3875J09255
$$ 560666 741892 252294 738211 687876 615886 913866 545809 631190 537315 646570
11003F46570L6130k63388n4816K41399B44898L59463j80422J87614l7548L41564
$$ 646570 682700 419312 364496 605895 244898 604361 423939 611553 574005 915569
10993I15569m25980K33996k49831j07853l015n6358M4073J43772K52816m9329
$$ 915569 489589 723585 473754 365901 362886 306528 350601 494373 747189 697860
10983F97860B54117L75306q7809P2211m1369j05564L24l3294m0835L78552P522
$$ 697860 254117 629423 541614 613825 572456 466892 467216 433922 393087 771639 779161
10972G79161p295R6373l16427M74159l33338K15132C75551L78551J11515j64925
$$ 779161 771866 868239 551812 1025971 692633 907765 375551 754102 865617 700692
10962G00692L73681l65261K13140L28636K21218k04589K64757R804M57861K2625
$$ 700692 1074373 709112 922252 1250888 1472106 1267517 1532274 1542078 1999939 2022564
10952B022564m1991j34259P9983L42162n23104k86627N0641k15514L60588m76445
$$ 2022564 1980573 1846314 1926297 2268459 1745355 1458728 1509369 1293855 1654443 1177998
10942A177998L20798l3791k26959M39055m49926L04292K35934l38885l34810J89375
$$ 1177998 1498796 1465005 1238046 1677101 1227175 1531467 1767401 1428516 1093706 1283081
10932A283081j57814k05408l36826P8016j06932j14386Q2565B26006M9318L3854
$$ 1283081 1125267 919859 583033 661049 554117 439731 522296 226006 275324 309178
10922C09178C1311K21966P2968F5700K61266c03199F5846O9237o3039l5701R922
$$ 309178 31311 253277 326245 65700 326966 -303199 65846 135083 72044 36343 46265
10911D6265F580a33387C83455a1447n3754C01880a66471O2129A23515a18208j55899
$$ 46265 6580 -133387 383455 -11447 -65201 301880 -166471 -104342 123515 -118208 -274107
10900b74107J20955e481A81250h8656K5210G2795R323C7699a9279j82198p9250
$$ -274107 -153152 -5481 181250 -88656 -63446 72795 82118 37699 -19279 -201477 -280727
10889b80727d4199H7298a95357B0353f9125j72197A09802K11657G4128a0307r7655
$$ -280727 -44199 87298 -195357 20353 -69125 -241322 109802 321459 74128 -10307 -107962
10878a07962j61625a26371a2183G3231M4752a3603A31089b30093J1750d8784q7345
$$ -107962 -269587 -126371 -12183 73231 117983 -13603 131089 -230093 -218343 -48784 -136129
10867a36129N1921Q415F1347a5507k84872e2542n402J2626j16529B75998a1679
$$ -136129 -84208 -75793 61347 -15507 -300379 -52542 -57944 -45318 -161847 275998 -11679
10855c68698h4776j47181A91173a4864r8457r6207l0645B3613J46239b05595a5650
$$ -368698 -84776 -231957 191173 -14864 -113321 -209528 -240173 23613 169852 -205595 -15650
10843A91810a10939k63049A28378J77739B1939c48149a29856A75187H0599m912
$$ 191810 -110939 -373988 128378 306117 21939 -348149 -129856 175187 80599 75687
10833G5687Q1630p026c25907b9676p5535i320A6052a56321a1844o0154G76N3659
$$ 75687 157317 150291 -325907 -29676 -105211 -9320 16052 -156321 -11844 -71998 776 54435
10821E4435O7224l9016a67187A87867b32545n0625A4695d19068a11969A54866
$$ 54435 121659 82643 -167187 187867 -232545 -283170 14695 -419068 -111969 154866
10810G5443l6544J13093F100j044N3929P5853b96213b0676q2046p4347I6521b5876
$$ 75443 38899 151992 6100 5056 58985 134838 -296213 -20676 -102722 -177069 96521 -25876
10797H831b17447Q0862o4027R6075m2649C8430c8089A16021a71149j167P9835
$$ 8831 -217447 -136585 -200612 -104537 -147186 38430 -38089 116021 -171149 -172316 -92481
10786i2481B1224a21068e1920B35707a68992d372H2780e2908p3007q9835E0412
$$ -92481 21224 -121068 -51920 235707 -168992 -4372 82780 -52908 -125915 -215750 50412
10774d02273h0232j03895P9213L7824j86635G3356F289J54260a56370N9339B04425
$$ -402273 -80232 -184127 -104914 -67090 -253725 73356 6289 160549 -156370 -97031 204425
10762a11232b6502D2854c9921k13816a01254A81199b4903B90069G3856b77536
$$ -111232 -26502 42854 -39921 -253737 -101254 181199 -24903 290069 73856 -277536
10751a42487k9658G3662A0737g4073k58688b8409o5080B79669B1208b4057I8372
$$ -142487 -172145 73662 10737 -74073 -332761 -28409 -93489 279669 21208 -24057 98372
10739B1529i5492m8224m0325B36846d568p8736m38212a65720C748b45976D3840
$$ 21529 -95492 -143716 -184041 236846 -4568 -83304 -521516 -165720 3748 -245976 43840
10727A59778b1002p922r0609J2574o4210b3341j83324A73673G8036l2014a89316
$$ 159778 -21002 -28924 -119533 -106959 -171169 -23341 -206665 173673 78036 46022 -189316
10715a93907B3821J4594a31139k6386I9141c58285J73779R478B87232d7470l65
$$ -193907 23821 38415 -131139 -157525 99141 -358285 -184506 -175028 287232 -47470 -47835
10704d7835B73766A02544J472J12041a03701M5753m0252m6368A48404b07411f2405
$$ -47835 273766 102544 104016 216057 -103701 -57948 -98200 -144568 148404 -207411 -62405
10692F8289E850i7962o2258B53971a00149j3264A5907J2515J27028b22351L3478
$$ 68289 5850 -97962 -160220 253971 -100149 -113413 15907 28422 155450 -222351 -188873
10681a88873A3725M15909f8378n7724o8863q3916a5055A34237c08160J00241A93928
$$ -188873 13725 429634 -68378 -126102 -194965 -278881 -15055 134237 -308160 -207919 193928
10669A18676L6369a60514h218H2302O3789a47995o5524c9483E9319a3305A20434
$$ 118676 155045 -160514 -8218 82302 146091 -147995 -213519 -39483 59319 -13305 120434
10657b06012d0419e297q1624j56530J03786a6040j33265O7838m7800p5924f7955
$$ -206012 -40419 -5297 -86921 -243451 -139665 -16040 -149305 -81467 -129267 -205191 -67955
10645a29065p5494a01165j29719C1295i4676H1655J6444C1174a87066A19252c70715
$$ -129065 -204559 -101165 -230884 31295 -94676 81655 98099 31174 -187066 119252 -370715
10633G5990J7413a29003j49912A5427a70940J3816L6046j73023i6204A80303b7127
$$ 75990 93403 -129003 -278915 15427 -170940 -157124 -121078 -294101 -96204 180303 -27127
10621A306a7287n1672O518C9637P3739k7784a41667j52414A97897f9529B59372
$$ 1306 -17287 -68959 -62441 39637 113376 85592 -141667 -294081 197897 -69529 259372
10609C6872p368a67720e9098K5665B53295a21701j47317J19875d6619A35408c00234
$$ 36872 29504 -167720 -59098 -33433 253295 -121701 -269018 -149143 -46619 135408 -300234
10597A29842k9199b38336J05077e363r6785L7340E5354O2288E6397A3845B662
$$ 129842 100643 -238336 -133259 -5363 -102148 -64808 55354 117642 56397 13845 2662
10585C73441b5524n7117d0031l2773l14475c7918F3153a48824N0599C3g0714j77729
$$ 373441 -25524 -82641 -40031 -72804 -387279 -37918 63153 -148824 -98225 33 -70714 -248443
10573b48443J12740e4495k45379J08713A29884O8809a94855F4412J4798a55659
$$ -248443 -135703 -54495 -299874 -191161 129884 198693 -194855 64412 79210 -155659
10562C07290b54016E5310a88884Q8653B58005e6228J4186a8766h491G9874J2309
$$ 307290 -254016 55310 -188884 -100231 258005 -56228 -42042 -18766 -8491 79874 92183
10551I2183a12319K7974j59006d2748I103f8008C15083j15943c00675B21873a55525
$$ 92183 -112319 -84345 -243351 -42748 9103 -68008 315083 199140 -300675 221873 -155525
10539a12455N765A3155P823J93783a01045H2681c40108B05041j00187a00620o6713
$$ -112455 -106690 13155 20978 214761 -101045 82681 -340108 205041 104854 -100620 -167333
10528a67333B35108a07327m4409A77385m1420b30312R6455A83761p1284c16708
$$ -167333 235108 -107327 -151736 177385 135965 -230312 -133857 183761 112477 -316708
10517b96024h8550j63492c0002B81645a9095j38474A73430a77743a3410G3907
$$ -296024 -88550 -252042 -30002 281645 -19095 -157569 173430 -177743 -13410 73907
10506B48491a07384b9803j8070C6973b73215B76005a36469J4734r5762R7983K765
$$ 248491 -107384 -29803 -47873 36973 -273215 276005 -136469 -121735 -217497 -119514 -116749
10495a16749A2705a64284A01008a59271j9000k04749f003B24714b35286l4797
$$ -116749 12705 -164284 101008 -159271 -178271 -383020 -6003 224714 -235286 -270083
10485b70083a34382b2617k40776B18697h2156B14483B5912a04118j25406L4724
$$ -270083 -134382 -22617 -263393 218697 -82156 214483 25912 -104118 -229524 -194800
10475a94800f4124B29876d4531A40893a12273k61183a49990k38450I2255J35237
$$ -194800 -64124 229876 -44531 140893 -112273 -373456 -149990 -388440 92255 227492
10465B27492j1092C5689M03424A72292b2020F14243j78596O6394A4023a6689I3982
$$ 227492 216400 35689 439113 172292 -22020 614243 435647 502041 14023 -16689 93982
10453A91775i3899B38867C9498N3346m2322d05581J08455G0076N9235A6003a76550
$$ 191775 -93899 238867 39498 92844 50522 -405581 -297126 70076 129311 16003 -176550
10441b17836j23356B5217g0550a4056j97861Q0335D2834b06246g007j32026D3105
$$ -217836 -341192 25217 -70550 -14056 -211917 -131582 42834 -206246 -7007 -139033 43105
10429I7713J14502d600G2878a96179j16881I5313J00012e7413p9144q0194d8796
$$ 97713 212215 -4600 72878 -196179 -313060 95313 195325 -57413 -136557 -216751 -48796
10417B13819a8384k34414r3482J1259F4711c8779C25741e0353j93683B09441a53020
$$ 213819 -18384 -252798 -346280 -335021 64711 -38779 325741 -50353 -244036 209441 -153020
10405c7640j76427A4637a85597M9537I8156e5741B89445a70544A53074a90616
$$ -37640 -214067 14637 -185597 -136060 98156 -55741 289445 -170544 153074 -190616
10394B68531a90180j6255i9004B9545c75588J48466B06621j1224D9677a3332j4552
$$ 268531 -190180 -206435 -99004 29545 -375588 -227122 206621 195397 49677 -13332 -27884
10383b7884A91935b5994A58390A5534K91185j16132B8194h2697J4452l7428J4806
$$ -27884 191935 -25994 158390 15534 306719 190587 28194 -82697 -68245 -105673 -90867
10372i0867A68759C1435K94006f2197B94028C3285r764L45012l9569A1357N59486
$$ -90867 168759 31435 325441 -62197 294028 33285 23521 368533 328964 11357 570843
10361E70843F2593m527c25006A28153d6241C57883j59683h0201E3738j748L53860
$$ 570843 62593 58066 -325006 128153 -46241 357883 198200 -80201 53738 51990 405850
10350D05850A71949F6724a525B10159J49084r0761e7668B64712j20874F6667J51175
$$ 405850 171949 66724 -1525 210159 359243 268482 -57668 264712 143838 66667 217842
10339B17842L22119D4875K30119a4877D7981j6831K64090B2540K77894M7270J15703
$$ 217842 539961 44875 274994 -14877 47981 31150 295240 22540 300434 347704 463407
10328D63407J2397l7872j24762n6481j06486N29559C38354A03735M62066k77722
$$ 463407 475804 437932 313170 256689 150203 679762 338354 103735 565801 288079
10318B88079N7909c4376D27875n5671i4298C62987M275E7031a38264O8911j27411
$$ 288079 345988 -34376 427875 372204 -94298 362987 367262 57031 -138264 -69353 -196764
10307a96764A15315J14003I3106N3270O1431q4209b68463C41197A11355K77204
$$ -196764 115315 229318 93106 146376 207807 123598 -268463 341197 111355 388559
10297C88559j88898L5718B9772a0748k41955Q8395b4463a023A33825J49374A27763
$$ 388559 199661 235379 29772 -10748 -252703 -164308 -24463 -1023 133825 283199 127763
10285A81927M3502E9702a33128j36306A22401C9549O2732L8378N336b77246l3562
$$ 181927 225429 59702 -133128 -269434 122401 39549 102281 140659 145995 -277246 -310808
10274c10808c9050A98011g2831D2009c1220F587J9088a5708G4502a77543C00182
$$ -310808 -39050 198011 -72831 42009 -31220 6587 25675 -15708 74502 -177543 300182
10262E2508b0213k81691N2315K0623A28681A9108a1514Q53A1064g4692A03903
$$ 52508 -20213 -301904 -249589 -228966 128681 19108 -11514 -10661 11064 -74692 103903
10250A03001P7593a46836B05533i3482e899j73668K9602c3553A76461C5454a20183
$$ 103001 180594 -146836 205533 -93482 -5899 -179567 -149965 -33553 176461 35454 -120183
10238b4544A53653e3733A12503J37707l9982b64270E2236J87643d7846J4586A09795
$$ -24544 153653 -53733 112503 250210 210228 -264270 52236 239879 -47846 -33260 109795
10226c07417J11208q5357B2244J09828i5733A05032N1759d03132g9985M555A63562
$$ -307417 -196209 -281566 22244 132072 -95733 105032 156791 -403132 -79985 -75430 163562
10214d9946A20134l1853j3319b54707D7992j7699a0428B0705a45270l76853a68042
$$ -49946 120134 88281 74962 -254707 47992 30293 -10428 20705 -145270 -522123 -168042
10202b97701e3760A33098a00112B53773I7128K83a8385j856l46182A07487a83452
$$ -297701 -53760 133098 -100112 253773 97128 97411 -18385 -20241 -366423 107487 -183452
10190C82178a01957a9993n8950m6220A52162F598a78685A73392a2106k39423J1608
$$ 382178 -101957 -19993 -78943 -125163 152162 6598 -178685 173392 -12106 -251529 -239921
10179b39921b7270E4264c10489A96715e9348q4412c5633r1743d0909k53886J14705
$$ -239921 -27270 54264 -310489 196715 -59348 -143760 -35633 -127376 -40909 -294795 -180090
10168a80090A51778B7858H242O0470B5442J01381A8388a95982A4466e9170A43428
$$ -180090 151778 27858 8242 68712 25442 126823 18388 -195982 14466 -59170 143428
10156b16204c9771j12689A67297o3771m5210h5310c1030j60294f0256j28511H0504
$$ -216204 -39771 -152460 167297 103526 58316 -85310 -31030 -191324 -60256 -188767 80504
10144a18203N5343k166j39043M1503E8560b7340D1069a09956L7854K9841B8062
$$ -118203 -62860 -65026 -204069 -162566 58560 -27340 41069 -109956 -72102 -42261 28062
10132B01489k3062a38996c8231m46877a22749K1837A9762c72042a69981m5905
$$ 201489 178427 -138996 -38231 -485108 -122749 -100912 19762 -372042 -169981 -215886
10122b15886N184j11601J43157k48856P4523H7591J31412a4249A09539e7773b2501
$$ -215886 -210702 -322303 -179146 -428002 -353479 87591 219003 -14249 109539 -57773 -22501
10110B79837n1864e0119B1759P0929d6406j40984N5413B78718g346j60893B47060
$$ 279837 227973 -50119 21759 92688 -46406 -187390 -131977 278718 -7346 -168239 247060
10098A30490D403a37591G5823J11820b28029A07449b43659d848r4896j3360a9015
$$ 130490 4403 -137591 75823 187643 -228029 107449 -243659 -4848 -99744 -113104 -19015
10086a09333q7178A39861B9727i7850j8259j55339F1207p890b32145R5230G5302
$$ -109333 -196511 139861 29727 -97850 -116109 -271448 61207 53317 -232145 -136915 75302
10074a18298H7737b03040j24528O1350i6719a494F9460a2783j45067A47883a09946
$$ -118298 87737 -203040 -327568 -266218 -96719 -1494 69460 -12783 -157850 147883 -109946
10062b55328k5188k9764h9620K9006q5749p430A21318P7693b06515N2470l5993
$$ -255328 -280516 -310280 -89620 -60614 -146363 -153793 121318 199011 -206515 -154045 -190038
10051a90038r8814d6306B4186a95692h8619m2323q3237A0552b39982a7854B76608
$$ -190038 -288852 -46306 24186 -195692 -88619 -130942 -214179 10552 -239982 -17854 276608
10039a29155j65952A90740a89756a9581q7631k65597b8454l40843J64399J00300
$$ -129155 -295107 190740 -189756 -19581 -107212 -372809 -28454 -369297 -204898 -104598
10029a04598A11419b4789n5033c2289A10990k3373K76792A39416b55035J03722
$$ -104598 111419 -24789 -79822 -32289 110990 87617 364409 139416 -255035 -151313
10019a51313K0439H7039c26029D4932a12668k32410a54497l494L9609j05298K2997
$$ -151313 -130874 87039 -326029 44932 -112668 -345078 -154497 -157991 -118382 -223680 -200683
10008b00683A87296a43132e775l29540B1770a22039C1512a69106k7402G2157J56450
$$ -200683 187296 -143132 -5775 -335315 21770 -122039 31512 -169106 -196508 72157 228607
9997B28607a64781q0376g6148k19271K2486j9506B10339b69593a23564J2549e0470
$$ 228607 -164781 -245157 -76148 -295419 -272933 -292439 210339 -269593 -123564 -111015 -50470
9985a06810J1508E4756B4050J68390C4921P5541j7968a52655l51670a74408a3383
$$ -106810 -95302 54756 24050 192440 34921 110462 92494 -152655 -504325 -174408 -13383
9973E7376b84722J11251A10293h9867A0109a05741q5186j6406B29157b27627B43572
$$ 57376 -284722 -173471 110293 -89867 10109 -105741 -190927 -207333 229157 -227627 243572
9961D31624b88268a24266b7327D3468a33474f0461l69960a39172J8911G4763a84137
$$ 431624 -288268 -124266 -27327 43468 -133474 -60461 -430421 -139172 -120261 74763 -184137
9949e2911j83174c4425G433J70292f4438b2708A44336c46025a8738A79240b63590
$$ -52911 -236085 -34425 7433 177725 -64438 -22708 144336 -346025 -18738 179240 -263590
9937E9761p426P1637M1811a48818b7611A96771C7582J00997b44843d0446k28012
$$ 59761 52335 123972 165783 -148818 -27611 196771 37582 138579 -244843 -40446 -268458
9926b68458Q6323C6488b74586R6770B4870b20095B55889o2082d3940j54289P5485
$$ -268458 -182135 36488 -274586 -177816 24870 -220095 255889 193807 -43940 -198229 -122744
9915a22744j52381L8559a2031A48609h185A07186d2124c509j79271A14570e0952
$$ -122744 -275125 -236566 -12031 148609 -8185 107186 -42124 -3509 -182780 114570 -50952
9903a59756N7549C2231a43443q9640K4531C63042G4393a02701r8642O8281A06905
$$ -159756 -102207 32231 -143443 -233083 -208552 363042 74393 -102701 -201343 -133062 106905
9891a02414L1692B27128b4087l0092A29355m4867J1785d7873j06244A15995D8908
$$ -102414 -70722 227128 -24087 -54179 129355 84488 96273 -47873 -154117 115995 48908
9879a42452A16635c4225C33272B9602P8662b237m7693l5174A84207A0891a26328
$$ -142452 116635 -34225 333272 29602 108264 -2237 -49930 -85104 184207 10891 -126328
9867A90810a06811A01059a43142B02964A00182a33009Q135r5911A81683b37003
$$ 190810 -106811 101059 -143142 202964 100182 -133009 -124874 -220785 181683 -237003
9856a2993j19685L3202l56816a16221M1108B43693F7147b224k50300B08645b96976
$$ -12993 -132678 -99476 -456292 -116221 -75113 243693 67147 -2224 -252524 208645 -296976
9844a28829e4085J8155A90437e3390B51642c48666j5465a40774J4778A07211i9571
$$ -128829 -54085 -35930 190437 -53390 251642 -348666 -364131 -140774 -125996 107211 -99571
9832g4326j55248d6424I3506A8836a97831b708k86997B7712L655c5895q8332A26626
$$ -74326 -229574 -46424 93506 18836 -197831 -2708 -289705 27712 31367 -35895 -124227 126626
9819b61333a11188d8836l5749A18213c51637a61580j69298A47466c72015D574
$$ -261333 -111188 -48836 -84585 118213 -351637 -161580 -330878 147466 -372015 4574
9808f3612C89351b98237B33519a00389k2118B5871K12196m9952a16885H0033A7988
$$ -63612 389351 -298237 233519 -100389 -122507 25871 238067 188115 -116885 80033 17988
9796i2943H9326b43688j55315a63870B72953a8118j79469k6345a05687B04894
$$ -92943 89326 -243688 -399003 -163870 272953 -18118 -197587 -223932 -105687 204894
9785C153K06741b60766a20118G1585j1158a33069B80351b27047m5302N739E8067
$$ 3153 209894 -260766 -120118 71585 60427 -133069 280351 -227047 -272349 -266610 58067
9773b8672m9939B2847c53392B39548a98054L84j14705i9397j97216a48103E5654
$$ -28672 -78611 22847 -353392 239548 -198054 -197670 -312375 -99397 -296613 -148103 55654
9761i6810K6629C1187c8117j60142M3927a247B46747j09791c41518a38698H7015
$$ -96810 -70181 31187 -38117 -198259 -154332 -1247 246747 136956 -341518 -138698 87015
9749D7266b9994k03758h2077J7147L071K0129j23762q6344m055J1057N6554A88458
$$ 47266 -29994 -233752 -82077 -64930 -61859 -41730 -165492 -251836 -255891 -244834 -188280 188458
9736a78555b540n1138K4384c507C6150c03521d9175j90460A71873f893B303c17718
$$ -178555 -2540 -53678 -29294 -3507 36150 -303521 -49175 -239635 171873 -6893 2303 -317718
9723b31215a8083I23b59140C25115f8850b9278B11513a45710f2141F2550a8817
$$ -231215 -18083 923 -259140 325115 -68850 -29278 211513 -145710 -62141 62550 -18817
9711b44513i703C346b78009J38186o6948j68503k3749a46596a3599j15808a2731
$$ -244513 -9703 3346 -278009 -139823 -206771 -375274 -399023 -146596 -13599 -129407 -12731
9699F7234g3861j31305K0645A0581O1042Q9503D5191f6352I3355e3063C44775
$$ 67234 -73861 -205166 -184521 10581 71623 161126 45191 -66352 93355 -53063 344775
9687A77795D3260a42409D0973a10312k26q3269H782a60997j74822h6101M1624
$$ 177795 43260 -142409 40973 -110312 -110538 -193807 8782 -160997 -335819 -86101 -44477
9676d4477h446n4035r6962a3963o5660k80889J1089A56917b69467a8310j6105
$$ -44477 -8446 -62481 -159443 -13963 -79623 -360512 -349423 156917 -269467 -18310 -34415
9665c4415j13760L1617i81B201d9166G3723a04031j12282B37307a98295b1575
$$ -34415 -148175 -116558 -981 2201 -49166 73723 -104031 -216313 237307 -198295 -21575
9653a12035j9694k56203B30756a15067K835p7166B08911d7179j53992i6359A05899
$$ -112035 -131729 -387932 230756 -115067 -112232 -189398 208911 -47179 -201171 -96359 105899
9641A15230i7128n4376A99988k1972F2965a59102B68033b29563K9538o5225g0699
$$ 115230 -97128 -151504 199988 178016 62965 -159102 268033 -229563 -200025 -265250 -70699
9629E4399b1727B4041J29556b29271H5820h9078A09035d0355j75662f2105C0839
$$ 54399 -21727 24041 153597 -229271 85820 -89078 109035 -40355 -216017 -62105 30839
9617C2621b90383i0542o7886j8873A95477O1386b05596b9504D5142b01968A79359
$$ 32621 -290383 -90542 -158428 -177301 195477 256863 -205596 -29504 45142 -201968 179359
9605A54664c33557k03460I1713a41825c9620A38685g419A3436b75368B182a63449
$$ 154664 -333557 -537017 91713 -141825 -39620 138685 -7419 13436 -275368 2182 -163449
9593d3587j97413c3538k30726L3363A41931a24982A53599i0190c6500j57608F5303
$$ -43587 -241000 -33538 -264264 -230901 141931 -124982 153599 -90190 -36500 -194108 65303
9581a1960m1725o1902A66122b17061A37499e3043j66585B61357A26795b85585
$$ -11960 -53685 -115587 166122 -217061 137499 -53043 -219628 261357 126795 -285585
9570B36776b69934d5366j48086R2716r6808a8258J644G1373g8305J7105b8980
$$ 236776 -269934 -45366 -193452 -100736 -197544 -18258 -16614 71373 -78305 -61200 -28980
9558H2011J33683B5470c8534B41846i3251j44754J04190H8016a9421A2223L9459
$$ 82011 215694 25470 -38534 241846 -93251 -238005 -133815 88016 -19421 12223 51682
9547E1682c8950B35097b92617J18073B6847o204a75116D4892G659i5640j11049
$$ 51682 -38950 235097 -292617 -174544 26847 20643 -175116 44892 7659 -95640 -206689
9536b06689C2508a64056d5197j40544f8550G9901M9817k9486b8795j74441J742
$$ -206689 32508 -164056 -45197 -185741 -68550 79901 129718 100232 -28795 -203236 -201494
9525b01494P1747A1062a36192B66223D2065J21531c8540J3640o5562j39847l9502
$$ -201494 -129747 11062 -136192 266223 42065 163596 -38540 -24900 -90462 -230309 -269811
9514b69811B02896b71995C14021g3013o5659a7746B2303b3442j090C47356b58077
$$ -269811 202896 -271995 314021 -73013 -138672 -17746 22303 -23442 -24532 347356 -258077
9502A48507c23593B13085c5863E7489h1477j43855H4886b87400B35843E752g0722
$$ 148507 -323593 213085 -35863 57489 -81477 -225332 84886 -287400 235843 5752 -70722
9490G3909k4433J0206f9392A92088D5032K4703a02326E632b96657P8582a8532
$$ 73909 49476 59682 -69392 192088 45032 69735 -102326 5632 -296657 -218075 -18532
9478B43150a86323j04911e3181K6474k8745F9212c6270B84137G5595g4974H4409
$$ 243150 -186323 -291234 -53181 -26707 -55452 69212 -36270 284137 75595 -74974 84409
9466b07922F232J16819A6941L2317c67364H729J67418n2834f7163D0827P5463
$$ -207922 6232 123051 16941 49258 -367364 8729 176147 123313 -67163 40827 116290
9455A16290B6206a72750A56170a71318E6183a82751B30662n8638a92178L6276
$$ 116290 26206 -172750 156170 -171318 56183 -182751 230662 172024 -192178 -155902
9445a55902l4081k03640a52639L920A42574i1925q9876C83288c8911p6945B72669
$$ -155902 -189983 -393623 -152639 -148719 142574 -91925 -181801 383288 -38911 -115856 272669
9433b6395j10277j6404d0627H1369c7178j85249a262k10515A34358k4277a2491
$$ -26395 -136672 -153076 -40627 81369 -37178 -222427 -1262 -211777 134358 110081 -12491
9421a67837A12026m1267J48983a45076e1665K0685j58401h6181q0862b1704j78568
$$ -167837 112026 70759 219742 -145076 -51665 -30980 -189381 -86181 -167043 -21704 -200272
9410b00272c4430k74799e4481N733k02159r3521H0447a17140n8195l410a0762
$$ -200272 -34430 -309229 -54481 -48748 -250907 -344428 80447 -117140 -175335 -178745 -10762
9398h3691B39348b42221N8666O2364d8118k4697A80496c13309B01681a31617G9745
$$ -83691 239348 -242221 -183555 -121191 -48118 -72815 180496 -313309 201681 -131617 79745
9386B0313h0079B55972P365a34647p8590p1145e6398j50099a4472j42906j27747
$$ 20313 -80079 255972 263337 -134647 -213237 -284382 -56398 -206497 -14472 -157378 -285125
9375b85125j30724C09970i7930H9880b30747M0974k35140c1179j93938C560a95582
$$ -285125 -415849 309970 -97930 89880 -230747 -189773 -424913 -31179 -225117 3560 -195582
9363A09737a09576L0013F4425b42199A91068a41176c8603j9970k35674B01244
$$ 109737 -109576 -79563 64425 -242199 191068 -141176 -38603 -58573 -294247 201244
9352E3767a84179C9926i2348j6409d3128k7815j77575f0299r7093f8651r1018
$$ 53767 -184179 39926 -92348 -108757 -43128 -70943 -248518 -60299 -157392 -68651 -159669
9341a59669f3768j86267C5537b04372L1662k38923a3589j7184A65283F9164b73177
$$ -159669 -63768 -250035 35537 -204372 -172710 -411633 -13589 -30773 165283 69164 -273177
9329A93812a26776L9839a7526B8476b21874e1749b2668h77B33738c33191A10532
$$ 193812 -126776 -86937 -17526 28476 -221874 -51749 -22668 -877 233738 -333191 110532
9317a40339A89173J5433R996f1235I4850b05994C0630h1526k47097a50428J9186
$$ -140339 189173 204606 214602 -61235 94850 -205994 30630 -81526 -328623 -150428 -131242
9306a31242j40853j53535c713C46791a51424g3813F8325b80717A86907o5517e13518
$$ -131242 -272095 -425630 -3713 346791 -151424 -73813 68325 -280717 186907 121390 -513518
9294d5668l76840J35341J27638C2775a5454L642G6050R328a09568M8534m7535
$$ -45668 -422508 -287167 -159529 32775 -15454 -11812 76050 85378 -109568 -61034 -108569
9283a08569A77372a40894L3480A11261c70312A58323a87796d866j01026k0229
$$ -108569 177372 -140894 -107414 111261 -370312 158323 -187796 -4866 -105892 -126121
9273a26121b9951C0542O3754e3030j5333B64704r2495b089G6338a23313q7914
$$ -126121 -29951 30542 94296 -53030 -68363 264704 172209 -2089 76338 -123313 -211227
9262b11227C5863r219K34541h1946j59880m26666K24067J47069C2954i7881A0059
$$ -211227 35863 26644 261185 -81946 -241826 -668492 -444425 -297356 32954 -97881 10059
9250G7303b0464k86369j1625B67720G9919K25031C7323b31195i9504Q07A7068
$$ 77303 -20464 -306833 -318458 267720 79919 304950 37323 -231195 -99504 -98697 17068
9238i9420c2686B09561b50488J2900B09312m375d47788C2141b57009k04C9880
$$ -99420 -32686 209561 -250488 -237588 209312 204937 -447788 32141 -257009 -257213 39880
9226a97172A78817o0034a27638L4729k64083A83114a68067D7742d25086B0140
$$ -197172 178817 118783 -127638 -92909 -356992 183114 -168067 47742 -425086 20140
9215a26303A6349J8874P540b49794b0113l40042J74257q7863A55529D7381a45161
$$ -126303 16349 35223 42763 -249794 -20113 -360155 -185898 -273761 155529 47381 -145161
9203b8691l3738l65554b13032B14529J42757E9672N9232f9938A0561L9575a10988
$$ -28691 -62429 -427983 -213032 214529 357286 59672 118904 -69938 10561 50136 -110988
9191b02136B4031a11548c8946k73578F5008B0866g302r3278K4266a7210j34000
$$ -202136 24031 -111548 -38946 -312524 65008 20866 -7302 -100580 -76314 -17210 -151210
9180a51210A8635K46581e2503E850c0993A48449a53278k287p7044B61385a45429
$$ -151210 18635 265216 -52503 5850 -30993 148449 -153278 -155565 -232609 261385 -145429
9168I6935m7979L9443Q4027i3783e52j74873p303M7184d1612j20102M9656L7237
$$ 96935 48956 88399 172426 -93783 -552 -175425 -182728 -135544 -41612 -161714 -112058 -74821
9156g4821A69315K06682i8399p21k30156i9492k2256j90618e1037I486J81625
$$ -74821 169315 375997 -98399 -99120 -329276 -99492 -121748 -312366 -51037 9486 191111
9145A91111g5858H413c69313a33682A16409b15500f07k09678J5365B28970a00890
$$ 191111 -75858 8413 -369313 -133682 116409 -215500 -607 -210285 -194920 228970 -100890
9133a98179E1958M07351d6671q8707k97379a31058k4205g4824I6006b18447E710
$$ -198179 51958 459309 -46671 -135378 -432757 -131058 -155263 -74824 96006 -218447 5710
9121b31596R2933C9010j3021P2359L0212k116a89259r050N4106d0981j67816P4400
$$ -231596 -138663 39010 25989 98348 128560 126444 -189259 -198309 -144203 -40981 -208797 -134397
9109a34397H1765E973J56050d35547A9534J30906l2047a30008c9516n6750J7624
$$ -134397 81765 5973 162023 -435547 19534 150440 118393 -130008 -39516 -96266 -78642
9098g8642F5970b82720D8697f8382A1199A501f0966j34456m4835B32378l1803
$$ -78642 65970 -282720 48697 -68382 11199 1501 -60966 -195422 -240257 232378 200575
9087B00575I5988b20764D483N7501k8034b827n0704q5171a6803n49265j0248K78305
$$ 200575 95988 -220764 4483 61984 33950 -2827 -53531 -138702 -16803 -566068 -576316 -298011
9075b98011J29233b8029j99099l4650Q260J25645A13862j7755m6723j2724J28947
$$ -298011 -168778 -28029 -227128 -261778 -253518 -127873 113862 96107 49384 36660 165607
9064A65607o6204c00439Q6317m2461b8159j27277B59362b14365h8961B51925D8349
$$ 165607 99403 -300439 -214122 -256583 -28159 -155436 259362 -214365 -88961 251925 48349
9052A31536B5361J26746b53879a07008A82738b37583k1095p5258A86652R3114
$$ 131536 25361 152107 -253879 -107008 182738 -237583 -258678 -333936 186652 279766
9042B79766a02920L5877A46024a15992r4060M2151B77444l5029b89586Q3105L2175
$$ 279766 -102920 -67043 146024 -115992 -210052 -167901 277444 242415 -289586 -206481 -174306
9031a74306j0744C4939a63138b7937j34041j09622Q0082j76413a24324H1393F204
$$ -174306 -185050 34939 -163138 -27937 -161978 -271600 -191518 -367931 -124324 81393 6204
9019c7574C56f2013D2159c36187P9941C05414b03010k59474a30181K1688n4835
$$ -37574 356 -62013 42159 -336187 -256246 305414 -203010 -462484 -130181 -108493 -163328
9008a63328k36773i0994j41658K5120e0855k26901i5199E5317R9377c58397J57834
$$ -163328 -400101 -90994 -232652 -207532 -50855 -277756 -95199 55317 154694 -358397 -200563
8997b00563k5331a02408b130n2982l66040h8308A19899i6211A52356N6474A7524
$$ -200563 -225894 -102408 -2130 -55112 -421152 -88308 119899 -96211 152356 208830 17524
8985B20889d26309c2243n1322A57221c14075A13222a19797a9839A46746C442P9369
$$ 220889 -426309 -32243 -83565 157221 -314075 113222 -119797 -19839 146746 3442 82811
8974H2811a15134A33745i0973a8529j08430E2467a160o1917B49444I6831m1695
$$ 82811 -115134 133745 -90973 -18529 -126959 52467 -1160 -63077 249444 96831 55136
8963E5136a28930l2207l66194h653k486C6046a65335n4806B5045c70541J62223
$$ 55136 -128930 -161137 -527331 -8653 -11139 36046 -165335 -220141 25045 -370541 -208318
8952b08318i2923c9537j10867A6507J17721g0542k69898B9397a87418i1192F8327
$$ -208318 -92923 -39537 -150404 16507 134228 -70542 -340440 29397 -187418 -91192 68327
8940a36145k70274b14k32780P2004e50j45987E7231O4916E0640a61680d3225F5722
$$ -136145 -406419 -214 -232994 -160990 -550 -146537 57231 122147 50640 -161680 -43225 65722
8927i9678A73059F7245a51999e287E0614a99583Q3309B31733q2940a56796A58124
$$ -99678 173059 67245 -151999 -5287 50614 -199583 -116274 231733 148793 -156796 158124
8915C8574J24508d4870A19437L13110C2530J2744J61585J7376J76025L18949P29142
$$ 38574 163082 -44870 119437 432547 32530 45274 206859 224235 400260 719209 1448351
8904A448351P39477L197855M37901k258811j604125k01816H46495l80935E8896
$$ 1448351 2187828 5385683 5823584 3564773 1960648 1758832 846495 465560 58896
8894D97734a910r1580B81978o9603j12k4534P5091F8759M5837L9916b84732N0670
$$ 497734 -1910 -93490 281978 212375 212263 187729 262820 68759 114596 154512 -284732 -234062
8882b34062E3665c64484B56921r6073F3244a81797j41636A16689a30804M8805
$$ -234062 53665 -364484 256921 160848 63244 -181797 -323433 116689 -130804 -81999
8872h1999A95168p8051g2251k01928b0441A34327n4370b13955c7906A44155G0453
$$ -81999 195168 117117 -72251 -274179 -20441 134327 79957 -213955 -37906 144155 70453
8860A53298b91836A17989b57309k3972R8411M0338j1789b6856k68536A16670a00812
$$ 153298 -291836 117989 -257309 -281281 -182870 -142532 -154321 -26856 -295392 116670 -100812
8848A59728a76347e6900A94618c7346j32132C9351d7073J4370k81155a5142o9709
$$ 159728 -176347 -56900 194618 -37346 -169478 39351 -47073 -32703 -313858 -15142 -84851
8837h4851l03401A4135d57356D3833d4912A45782A8954b22649F6937P3794K78014
$$ -84851 -388252 14135 -457356 43833 -44912 145782 18954 -222649 66937 140731 418745
8826D18745F3273J37192F5991a55552H5094K0579J14165i3424j73216g7383j40726
$$ 418745 63273 200465 65991 -155552 85094 105673 219838 -93424 -266640 -77383 -218109
$$ [...]
##END NTUPLES=NMR SPECTRUM
##END=
