
##TITLE=AC1125_Huila-palermo_5898794_131kh7hVod
##JCAMPDX= 6.0         $$ Bruker NMR JCAMP-DX V2.0
##DATA TYPE= NMR SPECTRUM
##DATA CLASS= NTUPLES
##ORIGIN= BRUKER
##OWNER= Administrator
$$ 1.72 TOPSPIN		Version 2.1
$$ 2012-04-10 10:27:55.437 -0500  Administrator@TOPSPIN
$$ Compression mode = diff/dup
##.OBSERVE FREQUENCY= 400.13188235
##.OBSERVE NUCLEUS= ^1H
##.ACQUISITION MODE= SIMULTANEOUS (DQD)
##.ACQUISITION SCHEME= undefined
##.AVERAGES= 64
##.DIGITISER RES= 22
##SPECTROMETER/DATA SYSTEM= spect
##.PULSE SEQUENCE= noesygpps1d.comp
##.SOLVENT NAME= COFFEE_meoh
##.SHIFT REFERENCE= INTERNAL, COFFEE_meoh, 1, 14.96877
##AUDIT TRAIL= $$ (NUMBER, WHEN, WHO, WHERE, PROCESS, VERSION, WHAT)
$$ ##TITLE= Audit trail, TOPSPIN		Version 2.1
$$ ##JCAMPDX= 5.01
$$ ##ORIGIN= Bruker BioSpin GmbH
$$ ##OWNER= Administrator
$$ $$ C:\Bruker\TOPSPIN/data/COFFEE/nmr/AC1125_Huila-palermo_5898794_131kh7hVod/32/pdata/1/auditp.txt
$$ ##AUDIT TRAIL=  $$ (NUMBER, WHEN, WHO, WHERE, PROCESS, VERSION, WHAT)
(   1,<2012-04-04 08:19:27.890 -0500>,<Administrator>,<TOPSPIN>,<go>,<TOPSPIN 2.1>,
      <created by zg
	started at 2012-04-04 08:07:56.218 -0500,
	POWCHK enabled, PULCHK disabled,
       configuration hash MD5:
       1A 1E CE 29 27 FD 77 03 67 4E F0 E3 C4 B2 CB 90
       data hash MD5: 64K
       F9 6D 16 31 DF A3 C6 F5 C9 D7 0B 58 14 C2 41 A8>)
(   2,<2012-04-04 08:19:30.875 -0500>,<Administrator>,<TOPSPIN>,<proc1d>,<TOPSPIN 2.1>,
      <Start of raw data processing
       efp LB = 0.3 FT_mod = 6 PKNL = 1 PHC0 = 0 PHC1 = 0 SI = 128K 
       data hash MD5: 128K
       6D 41 1D 2D 63 AE 8C 8F 6F ED 26 E2 E2 9C 68 98>)
(   3,<2012-04-04 08:19:32.062 -0500>,<Administrator>,<TOPSPIN>,<proc1d>,<TOPSPIN 2.1>,
      <pk PHC0 = 35.1178 PHC1 = 0 
       data hash MD5: 128K
       72 FE 4F 9A 1A 1C 59 F1 61 C5 1E 6E 89 0B 25 83>)
(   4,<2012-04-04 08:19:32.546 -0500>,<Administrator>,<TOPSPIN>,<proc1d>,<TOPSPIN 2.1>,
      <abs ABSG = 1 
       data hash MD5: 128K
       5A 13 AE BE 10 36 6D 8A C6 2F 6B 3C F9 BC 3D E9>)
(   5,<2012-04-04 08:19:32.625 -0500>,<Administrator>,<TOPSPIN>,<proc1d>,<TOPSPIN 2.1>,
      <abs ABSG = 2 
       data hash MD5: 128K
       2A 67 66 56 6F 28 58 32 F6 10 8E 81 41 AD CD F9>)
(   6,<2012-04-04 08:19:32.671 -0500>,<Administrator>,<TOPSPIN>,<proc1d>,<TOPSPIN 2.1>,
      <abs ABSG = 3 
       data hash MD5: 128K
       40 D0 22 47 14 16 A0 96 E8 49 0A 47 AE 1F E0 3E>)
(   7,<2012-04-04 08:19:32.734 -0500>,<Administrator>,<TOPSPIN>,<proc1d>,<TOPSPIN 2.1>,
      <abs ABSG = 4 
       data hash MD5: 128K
       5F 55 EE 5E C1 77 6B 7A 06 5C ED 23 57 90 3B A8>)
(   8,<2012-04-04 08:19:32.781 -0500>,<Administrator>,<TOPSPIN>,<proc1d>,<TOPSPIN 2.1>,
      <abs ABSG = 5 
       data hash MD5: 128K
       11 56 81 DE A4 90 B8 73 FF 98 EF B4 66 AA 72 66>)
(   9,<2012-04-04 08:19:33.000 -0500>,<Administrator>,<TOPSPIN>,<audit>,<TOPSPIN 2.1>,
      <user comment:
       ICON-NMR User ID: COFFEE
       data hash MD5: 128K
$$ [...]
##$TP07= 0
##$TPNAME0= <>
##$TPNAME1= <>
##$TPNAME2= <>
##$TPNAME3= <>
##$TPNAME4= <>
##$TPNAME5= <>
##$TPNAME6= <>
##$TPNAME7= <>
##$TPOAL= (0..7)
0.5 0.5 0.5 0.5 0.5 0.5 0.5 0.5
##$TPOFFS= (0..7)
0 0 0 0 0 0 0 0
##$TUNHIN= 0
##$TUNHOUT= 0
##$TUNXOUT= 0
##$USERA1= <user>
##$USERA2= <user>
##$USERA3= <user>
##$USERA4= <user>
##$USERA5= <user>
##$V9= 5
##$VALIST= <valist>
##$VCLIST= <CCCCCCCCCCCCCCC>
##$VD= 0
##$VDLIST= <DDDDDDDDDDDDDDD>
##$VPLIST= <PPPPPPPPPPPPPPP>
##$VTLIST= <TTTTTTTTTTTTTTT>
##$WBST= 2048
##$WBSW= 25
##$XGAIN= (0..3)
0 0 0 0
##$XL= 0
##$YL= 0
##$YMAX_a= 13328553
##$YMIN_a= -6278239
##$ZGOPTNS= <>
##$ZL1= 120
##$ZL2= 120
##$ZL3= 120
##$ZL4= 120
##$ABSF1= 14.96877
##$ABSF2= -5.58376
##$ABSG= 5
##$ABSL= 3
##$ALPHA= 0
##$AQORDER= 0
##$ASSFAC= 0
##$ASSFACI= 0
##$ASSFACX= 0
##$ASSWID= 0
##$AUNMP= <proc_prof1d_extract.lims>
##$AXLEFT= 0
##$AXNAME= <>
##$AXNUC= <1H>
##$AXRIGHT= 0
##$AXTYPE= 0
##$AXUNIT= <>
##$AZFE= 0.1
##$AZFW= 0.1
##$BCFW= 0
##$BC_mod= 0
##$BYTORDP= 0
##$COROFFS= 0
##$CY= 15
##$DATMOD= 1
##$DC= 0
##$DFILT= <>
##$DTYPP= 0
##$F1P= 0
##$F2P= 0
##$FCOR= 0.5
##$FTSIZE= 131072
##$FT_mod= 6
##$GAMMA= 0
##$GB= 0
##$INTBC= 1
##$INTSCL= 1
##$ISEN= 128
##$LB= 0.3
##$LEV0= 0
##$LPBIN= 0
##$MAXI= 10000
##$MC2= 0
##$MEAN= 0
##$ME_mod= 0
##$MI= 0
##$NCOEF= 0
##$NC_proc= -3
##$NLEV= 6
##$NOISF1= 0
##$NOISF2= 0
##$NSP= 0
##$NTH_PI= 0
##$NZP= 0
##$OFFSET= 14.96877
##$PC= 1
##$PHC0= 35.1178
##$PHC1= 0
##$PH_mod= 1
##$PKNL= yes
##$PPARMOD= 0
##$PPDIAG= 0
##$PPIPTYP= 0
##$PPMPNUM= 2147483647
##$PPRESOL= 1
##$PSCAL= 4
##$PSIGN= 0
##$PYNMP= <proc.py>
##$REVERSE= no
##$SF= 400.130004739082
##$SI= 131072
##$SIGF1= 0
##$SIGF2= 0
##$SINO= 400
##$SIOLD= 131072
##$SPECTYP= <>
##$SREGLST= <1H.CDCl3>
##$SSB= 0
##$STSI= 131072
##$STSR= 0
##$SW_p= 8223.68421052632
##$SYMM= 0
##$S_DEV= 0
##$TDeff= 65536
##$TDoff= 0
##$TI= <>
##$TILT= no
##$TM1= 0
##$TM2= 0
##$TOPLEV= 0
##$USERP1= <user>
##$USERP2= <user>
##$USERP3= <user>
##$USERP4= <user>
##$USERP5= <user>
##$WDW= 1
##$XDIM= 131072
##$YMAX_p= 445507516
##$YMIN_p= -452619614
##$CURPLOT= <Network HP LaserJet P1505>
##$CURPRIN= <$Network HP LaserJet P1505>
##$DFORMAT= <normdp>
##$LAYOUT= <+/1D_H.xwp>
##$LFORMAT= <normlp>
##$PFORMAT= <normpl>
##$SURQMSG= 1
$$ End of Bruker specific parameters
$$ ---------------------------------
##NTUPLES= NMR SPECTRUM
##VAR_NAME=  FREQUENCY,     SPECTRUM/REAL,   SPECTRUM/IMAG
##SYMBOL=    X,             R,               I
##VAR_TYPE=  INDEPENDENT,   DEPENDENT,       DEPENDENT
##VAR_FORM=  AFFN,          ASDF,            ASDF
##VAR_DIM=   131072,        131072,          131072
##UNITS=     HZ,            ARBITRARY UNITS, ARBITRARY UNITS
##FACTOR=    0.0627417313425165, 1,          1
##FIRST=     8223.62146879498, 1422,         -98880
##LAST=      0,             4161,            -97368
##MIN=       0,             -452619614,      0
##MAX=       8223.62146879498, 445507516,    0
$$ Real data points
##PAGE= N=1
##DATA TABLE= (X++(R..R)), XYDATA
$$ [...]
61717A0729562O81541P50259Q25859R08949R98730J094620J197206J306063J417372
61708A9910161J524737J621290J699592J750053J761165J721654J622168J456366
61700C3067186J223208R30024N93123K34675j21923m55481p49080r91716j179339
61691C2550677j314264j402658j451749j468696j461013j436310j400269j355226
61683B1260492j301857j242124j179443j116097j052138r87380r23040q60516
61675A2597897p99859p40747o84100o31379n82838n37719m95733m56989m20762
61666G247771l85744l51679l19666k90681k64774k41858k22122k05266j90130
61657D775851j75606j61474j48104j35998j25720j17530j10633j03472r5313q7185
$$ y = [10729562, 11411103, 12161362, 12987221, 13896170, 14894900, 15989520, 17186726, 18492789, 19910161, 21434898, 23056188, 24755780, 26505833, 28266998, 29988652, 31610820, 33067186, 34290394, 35220418, 35813541, 36048216, 35926293, 35470812, 34721732, 33730016, 32550677, 31236413, 29833755, 28382006, 26913310, 25452297, 24015987, 22615718, 21260492, 19958635, 18716511, 17537068, 16420971, 15368833, 14381453, 13458413, 12597897, 11798038, 11057291, 10373191, 9741812, 9158974, 8621255, 8125522, 7668533, 7247771, 6862027, 6510348, 6190682, 5900001, 5635227, 5393369, 5171247, 4965981, 4775851, 4600245, 4438771, 4290667, 4154669, 4028949, 3911419, 3800786, 3697314, 3602001, 3514816]
61647C514816q0682p6194p2644o8805o4350n9828n6020n3454n2222n1981n2020
61636B826616n1517n0059m8108m6654m6106m5711m4505m2641m1210m0674m0130
61625B329301l8431l5668l3064l1597l1079l0601k9461k7533k4911k1741j8559
61614B006656j6346j5642j5630j4814j2736j0369q578p128n855n781p769j0585
61602A875423j1842j0956r730r654j0002r343p803o748o905p857q906r474r011
61589A757192p501n955n452n812n946n502n161n276n247m608l822l421l054k175
61575A688260j148p79r70p12M36J711K428L186N002P467Q732P788O047N757P077
61560A740282P804O204L225J135P71J141J312J353J315N75j196l233m602n320
$$ y = [3514816, 3434134, 3357940, 3285296, 3216491, 3152141, 3092313, 3036293, 2982839, 2930617, 2878636, 2826616, 2775099, 2725040, 2676932, 2630278, 2584172, 2538461, 2493956, 2451315, 2410105, 2369431, 2329301, 2290870, 2255202, 2222138, 2190541, 2159462, 2128861, 2099400, 2071867, 2046956, 2025215, 2006656, 1990310, 1974668, 1959038, 1944224, 1931488, 1921119, 1912541, 1905413, 1899558, 1893777, 1886008, 1875423, 1863581, 1852625, 1842895, 1833241, 1823239, 1813896, 1806093, 1799345, 1792440, 1784583, 1775677, 1766203, 1757192, 1749691, 1743736, 1738284, 1732472, 1726526, 1721024, 1715863, 1710587, 1705340, 1700732, 1696910, 1693489, 1690435, 1688260, 1687112, 1686333, 1685363, 1684651, 1685087, 1686798, 1689226, 1692412, 1697414, 1704881, 1713613, 1721401, 1727448, 1733205, 1740282, 1748086, 1754290, 1757515, 1758650, 1759421, 1760562, 1761874, 1763227, 1764542, 1765117, 1763921, 1760688, 1756086, 1750766]
61546A750766n941o528o765o753o916p262p420p343p400p782q288q713q916q617
61532A646122p566n916m069k233n28P04J309J834L029M931P082R463J2315J5045
61518A681522J6568J7075J8388K1793K6267K9750L1612L3102L5650L9518M3946
61507A995191M7950N0973N3146N4910N6196N6343N5137N3488N2508N2174N1522
61496B579538M9962M7911M6228M5462M5428M5115M3287L9716L5555L1918K8360
61485C038480K3570J7407J1359O793L537M64l092o884j0269j2697j3936j4071
61473C040661j3378j2181j0901r927r066p402m236p0L889P185J0513J4630J9563
61460C029280K5109L1530L9229M7997N6998O5539P3867Q3212R4805J08481J22542
$$ y = [1750766, 1744825, 1738297, 1731532, 1724779, 1717863, 1710601, 1703181, 1695838, 1688438, 1680656, 1672368, 1663655, 1654739, 1646122, 1638556, 1632640, 1628571, 1626338, 1625810, 1626514, 1627823, 1629657, 1632686, 1637617, 1644699, 1654162, 1666477, 1681522, 1698090, 1715165, 1733553, 1755346, 1781613, 1811363, 1842975, 1876077, 1911727, 1951245, 1995191, 2043141, 2094114, 2147260, 2202170, 2258366, 2314709, 2369846, 2423334, 2475842, 2528016, 2579538, 2629500, 2677411, 2723639, 2769101, 2814529, 2859644, 2902931, 2942647, 2978202, 3010120, 3038480, 3062050, 3079457, 3090816, 3097609, 3101146, 3101610, 3098518, 3091634, 3081365, 3068668, 3054732, 3040661, 3027283, 3015102, 3004201, 2994274, 2985208, 2977806, 2973570, 2973500, 2977389, 2984574, 2995087, 3009717, 3029280, 3054389, 3085919, 3125148, 3173145, 3230143, 3295682, 3369549, 3452761, 3547566, 3656047, 3778589]
61449C778589J35621J48598J63898J82705K03585K24259K44097K64187K85356
61440E630895L06803L26702L43488L56231L63955L64971L57093L38583L08957
61431H697678K69105K20949J67196J10960N5172K148m6275q8648j24250j53270
61421I110765j76178j93096k04170k10197k12225k10616k05298j96834j86518
61412G315633j75208j62724j48550j32628j15299r7049p8564o0548m3273k6713
61402F275077j1111L119J6112K8492M0372N1070N9999O7201P2805P6726P9233
61391F759095Q0986Q2089Q1922Q0472P9008P8595P8699P8276P7764P8700Q1393
61380G636999Q4033Q4379Q1686P6850P1304O5990O0920N5340M8704M1557L5137
$$ y = [3778589, 3914210, 4062808, 4226706, 4409411, 4612996, 4837255, 5081352, 5345539, 5630895, 5937698, 6264400, 6607888, 6964119, 7328074, 7693045, 8050138, 8388721, 8697678, 8966783, 9187732, 9354928, 9465888, 9521060, 9523208, 9476933, 9388285, 9264035, 9110765, 8934587, 8741491, 8537321, 8327124, 8114899, 7904283, 7698985, 7502151, 7315633, 7140425, 6977701, 6829151, 6696523, 6581224, 6484175, 6405611, 6345063, 6301790, 6275077, 6263966, 6267085, 6283197, 6311689, 6352061, 6403131, 6463130, 6530331, 6603136, 6679862, 6759095, 6840081, 6922170, 7004092, 7084564, 7163572, 7242167, 7320866, 7399142, 7476906, 7555606, 7636999, 7721032, 7805411, 7887097, 7963947, 8035251, 8101241, 8162161, 8217501, 8266205, 8307762, 8342899]
61369H342899K9828K4415J7251Q018j993j1242j9223k6312l2685l7811m0989m2080
61357H210076m1680m0745m0010l9345l7662l4064k9257k5146k2604k0405j7096
61346G862062j3155j0264r113r318j1023j4802j9753k3513k4729k4197k2877k0189
61334G659129j5250q481p45Q287J9693L3840N0359O8997Q9506J11295J34228J59164
61322H310022J86626K15445K43797K71108K97730L23121L45657L63937L76939
61313A0934382L83020L80166L67359L44541L11385K67723K15564J59061J01537
61304A3464738M3661j4527p0995j22572j67954k08426k45356k78017l04508l24254
61294A1771790l38736l49661l57122l60017l57930l51827l43006l32135l19571
$$ y = [8342899, 8372727, 8397142, 8414393, 8422411, 8420418, 8409176, 8389953, 8363641, 8330956, 8293145, 8252156, 8210076, 8168396, 8127651, 8087641, 8048296, 8010634, 7976570, 7947313, 7922167, 7899563, 7879158, 7862062, 7848907, 7838643, 7829530, 7820212, 7809189, 7794387, 7774634, 7751121, 7726392, 7702195, 7679318, 7659129, 7643879, 7635398, 7634653, 7642940, 7662633, 7696473, 7746832, 7815829, 7905335, 8016630, 8150858, 8310022, 8496648, 8712093, 8955890, 9226998, 9524728, 9847849, 10193506, 10557443, 10934382, 11317402, 11697568, 12064927, 12409468, 12720853, 12988576, 13204140, 13363201, 13464738, 13508399, 13493872, 13422877, 13300305, 13132351, 12923925, 12678569, 12400552, 12096044, 11771790, 11433054, 11083393, 10726271, 10366254, 10008324, 9656497, 9313491, 8981356, 8661785]
61285H661785l05721k90539k73529k54879k35839k17140j97857j76977j55496
61276F553808j35487j17337r9448q0847o2543m5858l0680j6143k054J1234K3612
61265E998257L5045M5025N2900N8514O2020O3509O3349O2518O1975O1613O0311
61254F625036N7122N2301M7217M3299M0887L8983L6119L1492K5201J7708R379
61243G024744M52q806j7943k6231l3111l8872m4459n0282n5802o0758o5990p2050
61231F550892p7696q1037q2002q2231q2631q2405q0735p7954p4538p0245o4987
61220E694431n9595n4845n0530m6244m2267l8994l6161l3587l2018l2296l3959
61209E233935l5479l5805l5001l3581l1777k9473k6435k2563j8014j2850o628
$$ y = [8661785, 8356064, 8065525, 7791996, 7537117, 7301278, 7084138, 6886281, 6709304, 6553808, 6418321, 6300984, 6201536, 6120689, 6058146, 6012288, 5981608, 5965465, 5963411, 5974645, 5998257, 6033302, 6078327, 6131227, 6189741, 6251761, 6315270, 6378619, 6441137, 6503112, 6564725, 6625036, 6682158, 6734459, 6781676, 6824975, 6865862, 6904845, 6940964, 6972456, 6997657, 7015365, 7024744, 7025196, 7016390, 6998447, 6972216, 6939105, 6900233, 6855774, 6805492, 6749690, 6688932, 6622942, 6550892, 6473196, 6392159, 6310157, 6227926, 6145295, 6062890, 5982155, 5904201, 5829663, 5759418, 5694431, 5634836, 5579991, 5529461, 5483217, 5440950, 5401956, 5365795, 5332208, 5300190, 5267894, 5233935, 5198456, 5162651, 5127650, 5094069, 5062292, 5032819, 5006384, 4983821, 4965807, 4952957, 4946329]
61198D946329J139J0072J9154K8126L7916M9271O1691P4350Q7351J01353J16304
61187E533056J31191J44663J55348J61990J63897J61010J53103J39349J19086
61178F862693R2508O0361K3754j5047n2644q6485j16345j42814j64959j80889
61168F280133j90368j95370j97694j97359j93852j87804j80622j73080j65055
61159D598929j56359j47257j38251j29649j21267j12510j03079r3557q4974p7643
61149C434383p0802o3528n5602m7395l9382l2006k5527j9531j3083o028J57L636
61137C065292M494M948O788R229J0080Q646O413M797L426J214j945n485r390j3838
61123C094669j8068k0987k2755k4532k6670k8597l0595l3814l7852m0124l8999
$$ y = [4946329, 4947468, 4957540, 4976694, 5004820, 5042736, 5092007, 5153698, 5228048, 5315399, 5416752, 5533056, 5664247, 5808910, 5964258, 6126248, 6290145, 6451155, 6604258, 6743607, 6862693, 6955201, 7015562, 7039316, 7024269, 6971625, 6885140, 6768795, 6625981, 6461022, 6280133, 6089765, 5894395, 5696701, 5499342, 5305490, 5117686, 4937064, 4763984, 4598929, 4442570, 4295313, 4157062, 4027413, 3906146, 3793636, 3690557, 3597000, 3512026, 3434383, 3363581, 3300053, 3244451, 3197056, 3157674, 3125668, 3100141, 3080610, 3067527, 3061499, 3061656, 3065292, 3069786, 3074734, 3081522, 3090751, 3100831, 3109477, 3115890, 3120687, 3124113, 3125327, 3123382, 3117897, 3108507, 3094669, 3076601, 3055614, 3032859, 3008327, 2981657, 2953060, 2922465, 2888651, 2850799, 2810675, 2771676]
61112B771676l6301l5204l6547l8784m0684m2175m2968m2431m1226m1224m3080
61101B331052m5197m5835m5161m4284m3313m1654l9715l8834l9320l9660l8362
61090A869717l6031l4704l5256l6248l5780l3875l2273l2076l2475l1994l0221
61079A498784k7899k5798k3996k2027j9435j6378j3642j1708r986p651n005l017
61067A312242j592L21K659M001M116M977P838J0889J1703J0876J1063J3028J4959
61054A407080J5508J5308J5206J5002J4564J4456J4700J4324J2942J1626J1291
61043A562007J1216R934O970L215Q0j411j378j017j192j348r07j125l711p628
61029A573705r700r075q671j0749j3310j3098j0549r048r988j1454j1893j2359
$$ y = [2771676, 2735375, 2700171, 2663624, 2624840, 2584156, 2541981, 2499013, 2456582, 2415356, 2374132, 2331052, 2285855, 2240020, 2194859, 2150575, 2107262, 2065608, 2025893, 1987059, 1947739, 1908079, 1869717, 1833686, 1798982, 1763726, 1727478, 1691698, 1657823, 1625550, 1593474, 1560999, 1529005, 1498784, 1470885, 1445087, 1421091, 1399064, 1379629, 1363251, 1349609, 1337901, 1327915, 1320264, 1315259, 1312242, 1310650, 1310971, 1313630, 1317631, 1321747, 1326724, 1334562, 1345451, 1357154, 1368030, 1379093, 1392121, 1407080, 1422588, 1437896, 1453102, 1468104, 1482668, 1497124, 1511824, 1526148, 1539090, 1550716, 1562007, 1573223, 1583157, 1590127, 1593342, 1593422, 1592011, 1590633, 1589616, 1588424, 1587076, 1586169, 1585044, 1581333, 1573705, 1564005, 1554930, 1546259, 1535510, 1522200, 1509102, 1498553, 1489505, 1479517, 1468063, 1456170, 1443811]
61017A443811j4089j5894j5724j3704j1926j1442j0977r043o211m375m193m389
61005A321844l724k606k067j897j001P92K392L068L240L434L492L220K966L115
60991A336268L764N213P803J0755J2216J1258R212Q270R308J1651J4212J6088
60979A456018J6718J6439J6561J8042K0369K2355K3757K5359K7695L0451L3241
60968A707005L6280L9915M3664M6166M6609M5997M6259M7782M9048M9479N1157
60957B209361N5949O2091O6219O8329P1708P7820Q4413Q9625R4696J00968J07315
60946C088494J12887J19715J29671J40747J49572J56288J64031J74594J87444
60937D423443K02201K19259K38515K59987K85097L14801L47371L80781M16589
$$ y = [1443811, 1429722, 1413828, 1398104, 1384400, 1372474, 1361032, 1350055, 1341012, 1334801, 1330426, 1326233, 1321844, 1318120, 1315514, 1313447, 1311550, 1310549, 1311341, 1313733, 1316801, 1320041, 1323475, 1326967, 1330187, 1333153, 1336268, 1340032, 1345245, 1353048, 1363803, 1376019, 1387277, 1396489, 1404759, 1414067, 1425718, 1439930, 1456018, 1472736, 1489175, 1505736, 1523778, 1544147, 1566502, 1590259, 1615618, 1643313, 1673764, 1707005, 1743285, 1783200, 1826864, 1873030, 1919639, 1965636, 2011895, 2059677, 2108725, 2158204, 2209361, 2265310, 2327401, 2393620, 2461949, 2533657, 2611477, 2695890, 2785515, 2880211, 2981179, 3088494, 3201381, 3321096, 3450767, 3591514, 3741086, 3897374, 4061405, 4235999, 4423443, 4625644, 4844903, 5083418, 5343405, 5628502, 5943303, 6290674, 6671455, 7088044]
60928G088044M58780N09912N71643O47745P42497Q56797R90115J145175J325269
60919A4335977J528170J750294J996393K271847K556275K792491K913698K881258
60911C3026403K690599K351400J886940J362839Q95012N96180M98142N28998N68573
60902D4405086N20980L37796j238m94595j094853j698371k186084k486609k601690
60893C4700422k578629k469632k314592k142762j973691j815948j671664j542498
60885A8191006j428330j323488j220473j117556j018820r27425q42819p64265
60877I547830o92730o28518n70235n17007m69095m25916l85963l49242l17209
60868E191915k89920k65657k43904k26035k12216k00054j87446j74712j62830
$$ y = [7088044, 7546824, 8056736, 8628379, 9276124, 10018621, 10875418, 11865533, 13010708, 14335977, 15864147, 17614441, 19610834, 21882681, 24438956, 27231447, 30145145, 33026403, 35717002, 38068402, 39955342, 41318181, 42213193, 42809373, 43307515, 43836513, 44405086, 44926066, 45263862, 45262624, 44768029, 43673176, 41974805, 39788721, 37302112, 34700422, 32121793, 29652161, 27337569, 25194807, 23221116, 21405168, 19733504, 18191006, 16762676, 15439188, 14218715, 13101159, 12082339, 11154914, 10312095, 9547830, 8855100, 8226582, 7656347, 7139340, 6670245, 6244329, 5858366, 5509124, 5191915, 4901995, 4636338, 4392434, 4166399, 3954183, 3754129, 3566683, 3391971, 3229141]
60859C229141j51541j40479j30398j21857j13999j05963r8378r2228q7172q2110
60849B105016p6823p2021o8087o4405n9875n4038m7978m3698m1903m0940l8866
60838A496382l5861l3280l1132k8414k5387k3283k1825j9472j6323j4224j3431
60827A233750j1798q286m833l326k817j513K84J086Q76R34J843L073M015M454
60813A217742M499M703N421N806M698K745J937K534K568J182N1J91j39k400m824
60798A246714n046l828l539m233m157l215k984l587l216r30K207M941O970Q325
60784A234422R262J0619J2741J4397J4397J3671J3895J4744J4755J4288J4856
60773A382047J5766J4504J0987Q471R065J0943J1447J0678J0174R867Q523O300
$$ y = [3229141, 3077600, 2937121, 2806723, 2684866, 2570867, 2464904, 2366526, 2274298, 2187126, 2105016, 2028193, 1956172, 1888085, 1823680, 1763805, 1709767, 1661789, 1618091, 1576188, 1535248, 1496382, 1460521, 1427241, 1396109, 1367695, 1342308, 1319025, 1297200, 1277728, 1261405, 1247181, 1233750, 1221952, 1213666, 1208833, 1205507, 1202690, 1201177, 1201461, 1202547, 1203423, 1204357, 1206200, 1209273, 1213288, 1217742, 1222241, 1226944, 1232365, 1238171, 1242869, 1245614, 1247551, 1250085, 1252653, 1253835, 1253886, 1254077, 1253938, 1251538, 1246714, 1241668, 1237840, 1234301, 1230068, 1225911, 1222696, 1219712, 1216125, 1212909, 1211979, 1214186, 1219127, 1226097, 1234422, 1243684, 1254303, 1267044, 1281441, 1295838, 1309509, 1323404, 1338148, 1352903, 1367191, 1382047, 1397813, 1412317, 1423304, 1431775, 1440840, 1451783, 1463230, 1473908, 1484082, 1493949, 1502472, 1508772]
60761A508772M857N226O816Q374Q951Q317P141O590P179Q173Q345O949M040L91
60747A600121k741m542n423o286p155p409p290p949r853j2186j3993j4918j4787
60734A485589j3699j2592j2423j2576j1616r742q774r212r170p227m614l270l078
60721A367596k541j166L89J968M187P262J0527J3078J4431J4839J5286J6645J8628
60708A481129K0230K1210K2034K2357K1112J8535J6402J5480J4504J2603J0954
60697A676550J0631J0594R475P830O771N815M201L065L880N590N908M852M430
60684A759592N133N424M760M399M630L869J463p79j164m48l77j413l005m871o793
60669A770420q194q948r697j0596j0838j0150r581r750r595q010n729m189l380
$$ y = [1508772, 1513629, 1518855, 1525671, 1534045, 1542996, 1551313, 1558454, 1565044, 1572223, 1580396, 1588741, 1595690, 1599730, 1600121, 1597380, 1592838, 1587415, 1581129, 1573974, 1566565, 1559275, 1551326, 1541473, 1529287, 1515294, 1500376, 1485589, 1471890, 1459298, 1446875, 1434299, 1422683, 1412941, 1404167, 1394955, 1385785, 1378558, 1373944, 1370674, 1367596, 1365055, 1363889, 1364278, 1366246, 1370433, 1377695, 1388222, 1401300, 1415731, 1430570, 1445856, 1462501, 1481129, 1501359, 1522569, 1544603, 1566960, 1588072, 1606607, 1623009, 1638489, 1652993, 1665596, 1676550, 1687181, 1697775, 1707250, 1715080, 1721851, 1727666, 1731867, 1734932, 1738812, 1744402, 1750310, 1755162, 1759592, 1764725, 1770149, 1774909, 1779308, 1783938, 1787807, 1789270, 1788491, 1787327, 1786879, 1786502, 1785089, 1782084, 1777213, 1770420, 1762226, 1753278, 1743581, 1732985, 1722147, 1711997, 1702416, 1692666, 1683071, 1675061, 1669332, 1665143, 1661763]
60656A661763k244n68Q71J616J649P24j117k689k821k205k667m536o234o710o719
60641A628113p120p376o732n846n975p072p820p334n915m337l324l454m519m981
60627A546308l354n70L67k046n619p284p176q053j0875j3322j3423j2514j2913
60614A449526j4301j4624j3738j3562j4647j5130j3785j1918j0999j0280q365
60603A308177n808m211l559k475p81J03l87q55P0J834K825K387J334R08J654K928
60587A304144L364K320Q60O21J731K731K726K299J948J067n10j281m7J811J930
60572A325714O01O55L422O758Q149Q026Q528J0153J1576J2205J3026J4659J6277
60559A439749J7135J7958J9915K2921K5819K7754K8614K8459K7347K5666K3991
$$ y = [1661763, 1659519, 1658951, 1659822, 1661438, 1663087, 1663811, 1662694, 1660005, 1657184, 1654979, 1652312, 1647776, 1641542, 1634832, 1628113, 1620993, 1613617, 1606885, 1601039, 1595064, 1587992, 1580172, 1572838, 1566923, 1562586, 1559262, 1555808, 1551289, 1546308, 1542954, 1542384, 1542751, 1540705, 1535086, 1527802, 1520626, 1512573, 1501698, 1488376, 1474953, 1462439, 1449526, 1435225, 1420601, 1406863, 1393301, 1378654, 1363524, 1349739, 1337821, 1326822, 1316542, 1308177, 1302369, 1298158, 1294599, 1292124, 1291343, 1291446, 1291059, 1290204, 1290274, 1292108, 1294933, 1297320, 1298654, 1299562, 1301216, 1304144, 1307508, 1309828, 1310688, 1311309, 1313040, 1315771, 1318497, 1320796, 1322744, 1323811, 1323301, 1322020, 1321973, 1323784, 1325714, 1326315, 1326970, 1330392, 1337150, 1345299, 1353325, 1361853, 1372006, 1383582, 1395787, 1408813, 1423472, 1439749, 1456884, 1474842, 1494757, 1517678, 1543497, 1571251, 1599865, 1628324, 1655671, 1681337, 1705328]
60548A705328K2537K1047J9157J6521J2863Q432M232J079j576n140r918j4306
60536A780256j6549j6821j6889j7879j9020j8829j7017j4835j3679j3721j3995
60525A601022j3486j1918r623p120m949l571l022k742k192j590j677k735m191
60512A532206n251n479m708k972q84N62J094J579K831M400N307N498N633N802
60498A545618N659N763P256R836J1542J1315J0425J0392J0809J0702J0792J2422
60486A662531J4944J6461J7028J8656K1838K4610K6087K8450L3479L9077M1613
60475A944774M0725L9187L8466L6950L2899K6823K0033J2693M505l721j0473j4954
60463B167907j7350j8183j8049j7341j5653j1940o035L92N130P522Q812J0616
$$ y = [1705328, 1727865, 1748912, 1768069, 1784590, 1797453, 1805885, 1810117, 1811196, 1809620, 1804480, 1794562, 1780256, 1763707, 1746886, 1729997, 1712118, 1693098, 1674269, 1657252, 1642417, 1628738, 1615017, 1601022, 1587536, 1575618, 1565995, 1558875, 1553926, 1550355, 1547333, 1544591, 1542399, 1540809, 1539132, 1536397, 1532206, 1526955, 1521476, 1516768, 1513796, 1512912, 1513474, 1514568, 1516147, 1518978, 1523378, 1528685, 1534183, 1539816, 1545618, 1551277, 1557040, 1564296, 1574132, 1585674, 1596989, 1607414, 1617806, 1628615, 1639317, 1650109, 1662531, 1677475, 1693936, 1710964, 1729620, 1751458, 1776068, 1802155, 1830605, 1864084, 1903161, 1944774, 1985499, 2024686, 2063152, 2100102, 2133001, 2159824, 2179857, 2192550, 2197055, 2193334, 2182861, 2167907, 2150557, 2132374, 2114325, 2096984, 2081331, 2069391, 2063356, 2063748, 2068878, 2076400, 2085212, 2095828]
60451B095828J3554J7220K0919K4272K7408L0655L4117L7759M1875M7087N3647
60440B444341O1186O9375P8631Q9755J03099J18305J34789J52347J71308J92126
60430C615262K14718K38347K62441K87398L14007L42044L69737L94483M13362
60421F451799M22765M18234L95441L51546K86144K01945J04945L324r4761j82782
60411H358600k56035l11501l48268l67825l73439l69215l59224l46490l32217
60402E294386l16463k99637k82736k66012k48677k30564k13117j97671j83487
60393C056022j68762j53297j38848j26720j16221j05974r5936q7158p9854p2768
60383A910484o4869n7105n1477m8292m5400m0866l5534l1777l0250k9366k7869
$$ y = [2095828, 2109382, 2126602, 2147521, 2171793, 2199201, 2229856, 2263973, 2301732, 2343607, 2390694, 2444341, 2505527, 2574902, 2653533, 2743288, 2846387, 2964692, 3099481, 3251828, 3423136, 3615262, 3829980, 4068327, 4330768, 4618166, 4932173, 5274217, 5643954, 6038437, 6451799, 6874564, 7292798, 7688239, 8039785, 8325929, 8527874, 8632819, 8636143, 8541382, 8358600, 8102565, 7791064, 7442796, 7074971, 6701532, 6332317, 5973093, 5626603, 5294386, 4977923, 4678286, 4395550, 4129538, 3880861, 3650297, 3437180, 3239509, 3056022, 2887260, 2733963, 2595115, 2468395, 2352174, 2246200, 2150264, 2063106, 1983252, 1910484, 1845615, 1788510, 1737033, 1688741, 1643341, 1602475, 1566941, 1535164, 1504914, 1475548, 1447679]
60372A447679k6162k4781k3273k1434k0143j9788j9111j6913j3908j1522r692
60361A240952p450n087m062m673n305m329j901M78J598J690K155L877N773N837
60347A229553L931K355K871M513N509N951O896P967Q051P685Q390R832J0023Q528
60333A322055P287P675Q725Q991Q404P575O783O488P225Q222P669N356L526L982
60319A419963N562N796L956J222j224k916l580l259k511j626j80J842L283L254
60305A429582K606K757L566L727L032K885M429P082R265R902R136Q117Q149R659
60291A513894J1891J3692J4448J4257J3753J3876J5064J6375J6188J4299J2494
60280A670231J2365J3449J4236J4029J2757J0029O042K905L108O495J0342J2676
$$ y = [1447679, 1421517, 1396736, 1373463, 1352029, 1331886, 1312098, 1292987, 1276074, 1262166, 1250644, 1240952, 1233502, 1228415, 1224353, 1219680, 1214375, 1210046, 1208145, 1208623, 1210221, 1211911, 1214066, 1217943, 1223716, 1229553, 1233484, 1235839, 1238710, 1243223, 1248732, 1254683, 1261579, 1269546, 1277597, 1285282, 1293672, 1303504, 1313527, 1322055, 1329342, 1337017, 1345742, 1354733, 1363137, 1370712, 1377495, 1383983, 1391208, 1399430, 1407099, 1412455, 1415981, 1419963, 1425525, 1431321, 1435277, 1436499, 1435275, 1432359, 1428779, 1425520, 1423009, 1421383, 1421203, 1423045, 1426328, 1429582, 1432188, 1434945, 1438511, 1442238, 1445270, 1448155, 1452584, 1459666, 1468931, 1478833, 1487969, 1496086, 1504235, 1513894, 1525785, 1539477, 1553925, 1568182, 1581935, 1595811, 1610875, 1627250, 1643438, 1657737, 1670231, 1682596, 1696045, 1710281, 1724310, 1737067, 1747096, 1753138, 1756043, 1759151, 1765646, 1775988, 1788664]
60268A788664J4117J5999J8158J9569K0036J9963J9031J6326J1725O269R77l947
60256A946887q510j2185j4371j5342j6104j7144j7859j7558j6582j5845j5402
60245A779985j4262j1808q771o403n205m840m866m976m745l843k452j100k1J037
60231A707730K357L758M641M500L586K913L288M283M662M022L368L799N139O400
60217A764446P112P524P851Q038Q171Q465Q891R322R949J1051J2360J3353J4287
60204A890820J6252J9799K3983K7288K9309L1016L3423L6571M0034M3820M8182
60193B240497N2780N6972O1097O6566P4102Q2501R0066R6820J04294J13262J22867
60182C161824J32200J41635J51922J62722J72787J81206J87889J93031J96637
$$ y = [1788664, 1802781, 1818780, 1836938, 1856507, 1876543, 1896506, 1915537, 1931863, 1943588, 1949857, 1950834, 1946887, 1938377, 1926192, 1911821, 1896479, 1880375, 1863231, 1845372, 1827814, 1811232, 1795387, 1779985, 1765723, 1753915, 1745144, 1738741, 1733536, 1728696, 1723830, 1718854, 1714109, 1710266, 1707814, 1706714, 1706693, 1707730, 1710087, 1713845, 1718486, 1722986, 1726572, 1729485, 1732773, 1737056, 1741718, 1745740, 1749108, 1752907, 1758046, 1764446, 1771558, 1779082, 1786933, 1794971, 1803142, 1811607, 1820498, 1829820, 1839769, 1850820, 1863180, 1876533, 1890820, 1907072, 1926871, 1950854, 1978142, 2007451, 2038467, 2071890, 2108461, 2148495, 2192315, 2240497, 2293277, 2350249, 2411346, 2477912, 2552014, 2634515, 2724581, 2821401, 2925695, 3038957, 3161824, 3294024, 3435659, 3587581, 3750303, 3923090, 4104296, 4292185, 4485216, 4681853]
60173D681853J98441J97994J94755J88246J78238J65051J49929J34515J19240
60164F208262J02668Q3358O2253M2203K5120J0756j686j2156k0362k6468l0387
60153F443561l1402k9203k4395j7463q268K931J5157K8228M3202O0296P7707R3828
60141F654179J09350J25484J41218J54291J64123J71658J76635J77256J72753
60132H046947J64353J53115J38563J20082R8278P4216M8546K2145l395k6830m8108
60121H787912o7440q4142r7054j05722j10566j12115j10454j05222r5996q2960
60111G816241o7225n0163l2330j3469O434K6559M5769O3356P9211R3396J05414
60100H073193J13645J16103J12314J04048R3563Q1689O8434N4764M2227L1014
$$ y = [4681853, 4880294, 5078288, 5273043, 5461289, 5639527, 5804578, 5954507, 6089022, 6208262, 6310930, 6394288, 6456541, 6498744, 6523864, 6534620, 6532934, 6520778, 6500416, 6473948, 6443561, 6412159, 6382956, 6358561, 6341098, 6332830, 6335761, 6350918, 6379146, 6422348, 6482644, 6560351, 6654179, 6763529, 6889013, 7030231, 7184522, 7348645, 7520303, 7696938, 7874194, 8046947, 8211300, 8364415, 8502978, 8623060, 8721338, 8795554, 8844100, 8866245, 8862850, 8836020, 8787912, 8720472, 8636330, 8539276, 8433554, 8322988, 8210873, 8100419, 7995197, 7899201, 7816241, 7749016, 7698853, 7666523, 7653054, 7659488, 7686047, 7731816, 7795172, 7874383, 7967779, 8073193, 8186838, 8302941, 8415255, 8519303, 8612866, 8694555, 8762989, 8817753, 8859980, 8890994]
60090H890994J9944Q835l02m995m433M66Q183J7492K8072M0840N7164P7450J00879
60077I240589J26445J53583J81957K11635K43494K78285L15145L52220L88864
60068A1492217M25833M62883M97865N28900N55939N78989N96235O05349O05559
60059A6349769N96920N78475N49161N09950M63161M09778L49258K82043K10261
60050B0298776J35495N7765k2192j01205j75584k43750l05436l59113m01990m32603
60040A8450163m51847m61067m60288m49084m28351m00410l67623l31426k92421
60031A4807646k50876k07320j63110j20216q0082m2905q577K1906M6573O3894
60021A4066933P3466P5423P0151N8733M2893K3901K098k2180m7800p3536r9050
$$ y = [8890994, 8910938, 8919773, 8919471, 8914476, 8910043, 8910509, 8918692, 8936184, 8964256, 9005096, 9062260, 9139710, 9240589, 9367034, 9520617, 9702574, 9914209, 10157703, 10435988, 10751133, 11103353, 11492217, 11918050, 12380933, 12878798, 13407698, 13963637, 14542626, 15138861, 15744210, 16349769, 16946689, 17525164, 18074325, 18584275, 19047436, 19457214, 19806472, 20088515, 20298776, 20434271, 20492036, 20469844, 20368639, 20193055, 19949305, 19643869, 19284756, 18882766, 18450163, 17998316, 17537249, 17076961, 16627877, 16199526, 15799116, 15431493, 15100067, 14807646, 14556770, 14349450, 14186340, 14066124, 13986042, 13943137, 13934560, 13956466, 14003039, 14066933, 14140399, 14215822, 14285973, 14344706, 14387599, 14411500, 14413598, 14391418, 14343618, 14270082, 14171032]
60010A4171032j24465j49300j72506j93500k12594k30264k46268k59435k68296
60001A2314404k72176k71757k68220k61743k51358k36411k17581j96166j73177
59992A0165815j49404j25394j00499p2969m2211j0516J8734M4429O8275R1983
59982I888243J14881J34496J48645J56730J59488J57765J51309J39072J20841
59973A1171470R8042P2326M4085J3315j8644m9597p8555j06033j32103j55268
59963A0859038j73697j86678j94467j97349j95467j89315j79911j68285j54593
59954I219276j37885j17350r3903o9681m5720k1190M552L0723N7033Q5098J15971
59943I026924J47380J75687J99895K21309K39793K53169K60437K62653K59875
$$ y = [14171032, 14046567, 13897267, 13724761, 13531261, 13318667, 13088403, 12842135, 12582700, 12314404, 12042228, 11770471, 11502251, 11240508, 10989150, 10752739, 10535158, 10338992, 10165815, 10016411, 9891017, 9790518, 9717549, 9675338, 9664822, 9683556, 9727985, 9796260, 9888243, 10003124, 10137620, 10286265, 10442995, 10602483, 10760248, 10911557, 11050629, 11171470, 11269512, 11341838, 11385923, 11399238, 11380594, 11330997, 11252442, 11146409, 11014306, 10859038, 10685341, 10498663, 10304196, 10106847, 9911380, 9722065, 9542154, 9373869, 9219276, 9081391, 8964041, 8870138, 8800457, 8754737, 8733547, 8738099, 8768822, 8825855, 8910953, 9026924, 9174304, 9349991, 9549886, 9771195, 10010988, 10264157, 10524594, 10787247, 11047122]
59934A1047122K49998K31918K07651J79792J48846J14511P7933M0736L135l5228
59924A2266414p3288j08780j39754j64791j82780j93746j98926j98803j92147
59915A0813399j78413j60043j40492j20582r8630p3790m7347k0639O323L3511
59905A0013297N9505Q2601J02731J21350J39248J54832J65136J68773J67601J64715
59895A1339789J61020J54931J45438J34031J22882J12422J01869R1334Q2329P6666
59885A2522711P5587P9449Q7611R9319J15218J37057J65316J98222K33921K72407
59875A3986818L14296L59010M05343M52528M99069N41651N76901O03241O19186
59866A8358043O20949O04275N68251N14995M45859L60650K61026J52237M0541
$$ y = [11047122, 11297120, 11529038, 11736689, 11916481, 12065327, 12179838, 12257771, 12298507, 12301642, 12266414, 12193126, 12084346, 11944592, 11779801, 11597021, 11403275, 11204349, 11005546, 10813399, 10634986, 10474943, 10334451, 10213869, 10115239, 10041449, 9994102, 9973463, 9979786, 10013297, 10072802, 10155403, 10258134, 10379484, 10518732, 10673564, 10838700, 11007473, 11175074, 11339789, 11500809, 11655740, 11801178, 11935209, 12058091, 12170513, 12272382, 12363716, 12446045, 12522711, 12598298, 12677747, 12765358, 12864677, 12979895, 13116952, 13282268, 13480490, 13714411, 13986818, 14301114, 14660124, 15065467, 15517995, 16017064, 16558715, 17135616, 17738857, 18358043, 18978992, 19583267, 20151518, 20666513, 21112372, 21473022, 21734048, 21886285, 21926826]
59857B1926826o9341j73487k67617l48129m13307m62675m96294n15483n22848
59848A8657645n20423n08621m87952m60680m29515l95350l57574l16167k72279
59839A4909084k26812j79704j30953q1636l3471J2227N4807R3615J27352J54235
59829A4698744J72777J82171J81823J70803J48180J13845O8784J4780m5703j09392
59819A5596812j72536k31707k84451l29568l66930l96747m18616m31693m36162
59810A2528402m33918m27195m16934m03230l86765l68679l49210l27800l04677
59801I109994k81250k58523k36137k13572j91623j71969j55615j42188j30724
59792G328393j20766j12681j06862j02581r8066r2028q4711p7044o9209o0951
$$ y = [21926826, 21857485, 21683998, 21416381, 21068252, 20654945, 20192270, 19695976, 19180493, 18657645, 18137222, 17628601, 17140649, 16679969, 16250454, 15855104, 15497530, 15181363, 14909084, 14682272, 14502568, 14371615, 14289979, 14256508, 14268735, 14323542, 14417157, 14544509, 14698744, 14871521, 15053692, 15235515, 15406318, 15554498, 15668343, 15737127, 15751907, 15706204, 15596812, 15424276, 15192569, 14908118, 14578550, 14211620, 13814873, 13396257, 12964564, 12528402, 12094484, 11667289, 11250355, 10847125, 10460360, 10091681, 9742471, 9414671, 9109994, 8828744, 8570221, 8334084, 8120512, 7928889, 7756920, 7601305, 7459117, 7328393, 7207627, 7094946, 6988084, 6885503, 6787437, 6695409, 6610698, 6533654, 6464445, 6403494]
59782F403494n3000m7017m3915m3022m3234m4379m7100n1764n7720o3451o7505
59771E841387o9589p0480p0565o8902o4384n7433m9678m2212l5043k7971k0945
59760E264185j3735o323M37N863J1124J8489K8483L9174M8762N7466O6092P4133
59748E594150Q0565Q5579R0038R3725R5327R4129R0712Q6068Q0718P4687O7651
59737F533349N9329N0398M2844L8634L7961L9441M2101M6468N3495O3268P5286
59726G082574Q9448J05965J24440J44030J64864J88597K16906K49753K85842L24452
59716H976871L65728M09011M52045M92292N27753N55291N69069N62269N30517
59707A3440846M73052L91563K90018J76034O0496m5782j35305k04418k52457k81207
$$ y = [6403494, 6350494, 6303477, 6259562, 6216540, 6173306, 6128927, 6081827, 6030063, 5972343, 5908892, 5841387, 5771798, 5701318, 5630753, 5561851, 5497467, 5440034, 5390356, 5348144, 5313101, 5285130, 5264185, 5250450, 5244127, 5244564, 5250427, 5261551, 5280040, 5308523, 5347697, 5396459, 5453925, 5520017, 5594150, 5674715, 5760294, 5850332, 5944057, 6039384, 6133513, 6224225, 6310293, 6391011, 6465698, 6533349, 6592678, 6643076, 6685920, 6724554, 6762515, 6801956, 6844057, 6890525, 6944020, 7007288, 7082574, 7172022, 7277987, 7402427, 7546457, 7711321, 7899918, 8116824, 8366577, 8652419, 8976871, 9342599, 9751610, 10203655, 10695947, 11223700, 11778991, 12348060, 12910329, 13440846, 13913898, 14305461, 14595479, 14771513, 14832009, 14786227, 14650922, 14446504, 14194047, 13912840]
59697A3912840k94220k95293k87555k73838k56722k37275k14651j88005j58389
59688A1706892j27830r7146o5932l4481m059K5094N4799Q6944J21233J55907J90338
59677A2011759K25670K62809L01101L39751L79683M22620M68626N16010N63989
59668A5492018O14118O68155P25472P83746Q41679Q99717R58166J015606J069241
59659B3067918J115881J152492J176948J188781J188828J178030J157271J128680
59651C2354829J096366J065321J039721J022128J013569J013836J021750J035265
59643D0662785J051016J064089J068836J060264J034725R89901R25068Q41270
59635D8697954P40680O26025N01391L73042K48121J32256K9382n6428j20842j61764
$$ y = [13912840, 13618620, 13323327, 13035772, 12761934, 12505212, 12267937, 12053286, 11865281, 11706892, 11579062, 11481916, 11415984, 11381503, 11377444, 11402538, 11457337, 11544281, 11665514, 11821421, 12011759, 12237429, 12500238, 12801339, 13141090, 13520773, 13943393, 14412019, 14928029, 15492018, 16106136, 16774291, 17499763, 18283509, 19125188, 20024905, 20983071, 21998677, 23067918, 24183799, 25336291, 26513239, 27702020, 28890848, 30068878, 31226149, 32354829, 33451195, 34516516, 35556237, 36578365, 37591934, 38605770, 39627520, 40662785, 41713801, 42777890, 43846726, 44906990, 45941715, 46931616, 47856684, 48697954, 49438634, 50064659, 50566050, 50939092, 51187213, 51319469, 51348851, 51292423, 51171581, 51009817]
59625E1009817j80604j79960j60800j22842o6815M992R0188J87230K94888M11622
59615E1287716N35642O64909P96542R26078J047534J154279J239891J297673J319398
59606F0269662J295599J218569J085418Q98003O61124L82680P5749k41761n51230
59597F5093813q37283j088452j296433j456586j568789j636701j666245j664839
59589E3878485j640770j602220j557054j513662j480532j463681j464841j482510
59581D1673215j513311j551228j587076j611368j618236j606004j575018j526820
59573B9084154j465163j395435j322010j247019j171739j097814j026451r57621
59565A9400902q91005q26998p66188p08445o53286o00732n51290n05313m62764
$$ y = [51009817, 50829213, 50649253, 50488453, 50365611, 50298796, 50303788, 50393976, 50581206, 50876094, 51287716, 51823358, 52488267, 53284809, 54210887, 55258421, 56412700, 57652591, 58950264, 60269662, 61565261, 62783830, 63869248, 64767251, 65428375, 65811055, 65886804, 65645043, 65093813, 64256530, 63168078, 61871645, 60415059, 58846270, 57209569, 55543324, 53878485, 52237715, 50635495, 49078441, 47564779, 46084247, 44620566, 43155725, 41673215, 40159904, 38608676, 37021600, 35410232, 33791996, 32185992, 30610974, 29084154, 27618991, 26223556, 24901546, 23654527, 22482788, 21384974, 20358523, 19400902, 18509897, 17682899, 16916711, 16208266, 15554980, 14954248, 14402958, 13897645, 13434881]
59556A3434881m23237l86006l50491l17081k87200k62067k41641k25079k11919
59547A0730160k02302j96083j92336j89991j88703j88787j90204j91921j92526
59538H997307j91342j88533j84159j77735j69211j59719j50567j41623j31544
59529G502874j19669j06940r4697q3252p2141o1057m9953l8609k6921j5451n005
59518F829179M285J2870K0831K7800L3947M0074M6302N1561N5192N8430O3108
59507G243579O9279P5423Q1129Q8275R8870J12644J27499J41763J55380J69427
59497H363268J85238K03543K23876K45066K66761K89820L14631L39842L63712
59488A0795757L86259M08761M31359M52293M69557M82282M90330M93521M91687
$$ y = [13434881, 13011644, 12625638, 12275147, 11958066, 11670866, 11408799, 11167158, 10942079, 10730160, 10527858, 10331775, 10139439, 9949448, 9760745, 9571958, 9381754, 9189833, 8997307, 8805965, 8617432, 8433273, 8255538, 8086327, 7926608, 7776041, 7634418, 7502874, 7383205, 7276265, 7181568, 7098316, 7026175, 6965118, 6915165, 6876556, 6849635, 6834184, 6829179, 6833464, 6846334, 6867165, 6894965, 6928912, 6968986, 7015288, 7066849, 7122041, 7180471, 7243579, 7312858, 7388281, 7469410, 7557685, 7656555, 7769199, 7896698, 8038461, 8193841, 8363268, 8548506, 8752049, 8975925, 9220991, 9487752, 9777572, 10092203, 10432045, 10795757, 11182016, 11590777, 12022136, 12474429, 12943986, 13426268, 13916598, 14410119, 14901806]
59479A4901806M84855M73147M56857M36562M12666L85051L53822L20150K85678
59470A8510594K51399K18113J87555J61853J41786J26869J17177J13780J17063
59461A9946189J25769J38114J52711J67827J80805J88686J88778J78499J55880
59452B1423258J20636P3800J6212n1232j25701k02561k78192l51218m20244m82191
59442A9722567n34140n75280o05509o23487o28129o21247o06885n88059n65527
59433A4374304n39269n09694m77538m43851m10026l76814l43486l09061k74039
59424A0690526k39837k06786j73938j40716j07562p4822m2242r763K2258N3903
59414I771021Q5888J18453J50852J82393K13352K44258K74473L01996L24754L41867
$$ y = [14901806, 15386661, 15859808, 16316665, 16753227, 17165893, 17550944, 17904766, 18224916, 18510594, 18761993, 18980106, 19167661, 19329514, 19471300, 19598169, 19715346, 19829126, 19946189, 20071958, 20210072, 20362783, 20530610, 20711415, 20900101, 21088879, 21267378, 21423258, 21543894, 21617694, 21633906, 21582674, 21456973, 21254412, 20976220, 20625002, 20204758, 19722567, 19188427, 18613147, 18007638, 17384151, 16756022, 16134775, 15527890, 14939831, 14374304, 13835035, 13325341, 12847803, 12403952, 11993926, 11617112, 11273626, 10964565, 10690526, 10450689, 10243903, 10069965, 9929249, 9821687, 9746865, 9704623, 9694860, 9717118, 9771021, 9856909, 9975362, 10126214, 10308607, 10521959, 10766217, 11040690, 11342686, 11667440, 12009307]
59404A2009307L53413L58909L56473L44050L21137K88530K46616J95220J35441
59395A4609096P0371L319o3612j28645j89338k43570k90630l30320l61911l85063
59385A2689697m00749m10157m13506m11200m05070l96859l86204l71836l54195
59376I139921l35273l16374k97760k79916k63113k46017k26881k06267j86653
59367F781667j69125j52488j35861j19993j05202r0177p4164n8667m5587l4859
59357E795544k5243j6340q311l99Q681J8945K8870L7070M3563M9273N4617N8756
59345F045026O0481O0200O0661O4783P2933Q3480R5805J10937J28545J45334J58152
59334G086337J67706J77493J89624K03518K18628K36602K59797K88706L21793
$$ y = [12009307, 12362720, 12721629, 13078102, 13422152, 13743289, 14031819, 14278435, 14473655, 14609096, 14679467, 14682786, 14619174, 14490529, 14301191, 14057621, 13766991, 13436671, 13074760, 12689697, 12288948, 11878791, 11465285, 11054085, 10649015, 10252156, 9865952, 9494116, 9139921, 8804648, 8488274, 8190514, 7910598, 7647485, 7401468, 7174587, 6968320, 6781667, 6612542, 6460054, 6324193, 6204200, 6098998, 6008821, 5934657, 5875990, 5830403, 5795544, 5770301, 5753961, 5745650, 5745251, 5753932, 5772877, 5801747, 5838817, 5882380, 5931653, 5986270, 6045026, 6105507, 6165707, 6226368, 6291151, 6364084, 6447564, 6543369, 6654306, 6782851, 6928185, 7086337, 7254043, 7431536, 7621160, 7824678, 8043306, 8279908, 8539705, 8828411, 9150204]
59325I150204L57441L95378M36307M80828N28870N79873O32976O86981P40374
59316A3989232P91635Q39297Q81419R15296R38226R48645R46125R30429R01389
59307B2081693Q60037Q09318P52993O93965O33872N73855N14920M57288L99809
59298B7777750L40499K77806K11270J41083O7463r224q7998j67281k45240l19560
59288B7986568l87280m46044m96027n39754n79373o14783o45059o70912o94445
59279B2912891p16681p36438p51660p61029p64085p60664p50878p35387p15324
59270A6220745o91752o65157o35591o03570n70541n37797n05064m71127m35998
59261A1104148m01324l68333l36821l06760k79154k53923k28619k01316j73762
$$ y = [9150204, 9507645, 9903023, 10339330, 10820158, 11349028, 11928901, 12561877, 13248858, 13989232, 14780867, 15620164, 16501583, 17416879, 18355105, 19303750, 20249875, 21180304, 22081693, 22941730, 23751048, 24504041, 25198006, 25831878, 26405733, 26920653, 27377941, 27777750, 28118249, 28396055, 28607325, 28748408, 28815871, 28806647, 28718649, 28551368, 28306128, 27986568, 27599288, 27153244, 26657217, 26117463, 25538090, 24923307, 24278248, 23607336, 22912891, 22196210, 21459772, 20708112, 19947083, 19182998, 18422334, 17671456, 16936069, 16220745, 15528993, 14863836, 14228245, 13624675, 13054134, 12516337, 12011273, 11540146, 11104148, 10702824, 10334491, 9997670, 9690910, 9411756, 9157833, 8929214, 8727898, 8554136]
59252H554136j49358j28658j09243q9753p1293n4445l7623j9726k300J2651K5728
59241G930116L9330N4552P0311Q5135R8575J10784J21596J30420J36937J41825
59231H919581J46355J50890J54123J54563J52482J49455J46349J43009J39788
59222A0256595J37893J37857J39064J41153J44609J49321J54015J57862J61519
59213A1579888J65418J68029J66907J60800J49602J32845J09780Q1052M9248J7250
59203A2780819j3669m3706p2752r9199j21013j37822j50915j60746j65545j63595
59193A1651857j56193j46666j36712j25305j11168r4645p6715n7851l8511j9496
59183A0688595j231J6266L2315M5864N7184O7754P8031Q7099R5298J05094J17942
$$ y = [8554136, 8404778, 8276120, 8166877, 8077124, 8005831, 7951386, 7913763, 7894037, 7891737, 7904388, 7930116, 7969446, 8023998, 8094309, 8179444, 8278019, 8388803, 8510399, 8640819, 8777756, 8919581, 9065936, 9216826, 9370949, 9525512, 9677994, 9827449, 9973798, 10116807, 10256595, 10394488, 10532345, 10671409, 10812562, 10957171, 11106492, 11260507, 11418369, 11579888, 11745306, 11913335, 12080242, 12241042, 12390644, 12523489, 12633269, 12714321, 12763569, 12780819, 12767150, 12723444, 12650692, 12551493, 12430480, 12292658, 12141743, 11980997, 11815452, 11651857, 11495664, 11348998, 11212286, 11086981, 10975813, 10881168, 10804453, 10746602, 10708091, 10688595, 10687364, 10703630, 10735945, 10781809, 10838993, 10906747, 10984778, 11071877, 11167175, 11272269, 11390211]
59172A1390211J32110J45391J58755J75345J96799K22444K51417K83469L17847
59163A3273788L53181L88686M23928M57017M84169N01360N05744M95505M69348
59154A7352726M26538L67011K91535K02326J03303r43j06508k10247l08901l98873
59144A7717967m76812n40180n87695o19830o38531o45968o43678o33127o16311
59135A2315835n95201n71058n44691n16804m87649m57275m26772l98250l72548
59126G945587l47927l22398k96667k73270k53121k34542k15772j97023j79692
59117E625175j64689j51885j40312j28556j15692j02225q9586p8571o8812n9727
59107D525120n1158m2939l4730k6704j9643j3730p730j29Q965J7713K4536K9834
$$ y = [11390211, 11522321, 11667712, 11826467, 12001812, 12198611, 12421055, 12672472, 12955941, 13273788, 13626969, 14015655, 14439583, 14896600, 15380769, 15882129, 16387873, 16883378, 17352726, 17779264, 18146275, 18437810, 18640136, 18743439, 18742496, 18635988, 18425741, 18116840, 17717967, 17241155, 16700975, 16113280, 15493450, 14854919, 14208951, 13565273, 12932146, 12315835, 11720634, 11149576, 10604885, 10088081, 9600432, 9143157, 8716385, 8318135, 7945587, 7597660, 7275262, 6978595, 6705325, 6452204, 6217662, 6001890, 5804867, 5625175, 5460486, 5308601, 5168289, 5039733, 4924041, 4821816, 4732230, 4653659, 4584847, 4525120, 4473962, 4431023, 4396293, 4369589, 4349946, 4336216, 4328486, 4328357, 4337322, 4355035, 4379571, 4409405]
59095D409405L5437M2421N0066N7143O3691P0772P8719Q6481R2985R8491J04247
59084E189858J11221J19367J27653J34631J39485J42767J45731J48881J51581
59075F411175J52948J52368J49306J43639J36319J28615J20541J11229J00964
59066G607104R1309Q2846P4556O6404O0659N9198O0961O3773O7539P3752Q2765
59055H390866R3582J05829J19902J35394J51337J68003J86549K06683K26407K44377
59045A0028929K60803K75511K86755K92730K92819K86410K71779K47442K13920
59036A2457098J73208J27026P6611K3974k7714p5226j16467j50687j77990j98823
59026A2111010k13788k23794k30149k34235k37070k39279k41289k43319k45336
$$ y = [4409405, 4444842, 4487263, 4537329, 4594472, 4658163, 4728935, 4807654, 4894135, 4987120, 5085611, 5189858, 5301079, 5420446, 5548099, 5682730, 5822215, 5964982, 6110713, 6259594, 6411175, 6564123, 6716491, 6865797, 7009436, 7145755, 7274370, 7394911, 7506140, 7607104, 7698413, 7781259, 7855815, 7922219, 7982878, 8042076, 8103037, 8166810, 8234349, 8308101, 8390866, 8484448, 8590277, 8710179, 8845573, 8996910, 9164913, 9351462, 9558145, 9784552, 10028929, 10289732, 10565243, 10851998, 11144728, 11437547, 11723957, 11995736, 12243178, 12457098, 12630306, 12757332, 12833943, 12857917, 12830203, 12754977, 12638510, 12487823, 12309833, 12111010, 11897222, 11673428, 11443279, 11209044, 10971974, 10732695, 10491406, 10248087, 10002751]
59017A0002751k47360k49511k51567k52814k52925k52654k53051k54028k54309
59008G734532k52795k49439k44740k38946k32074k24445k16845k09946k03443
58999E661859j95998j86540j75736j65570j57129j49392j40655j30682j20925
58990D239232j12954j07265j03286r9916r6235r2060q7816q3794p9902p6272p3293
58979C226439p0823o8051o4638o1204n8178n5085n1576m8185m4991m0579l3743
58968B629386k5773j9556j6390j4870j2826r380n109j310P24O12o52j645j963
58955B521248k231k811l146k417l92K327M586N559N673O220P729R379J0450J1358
58941B573532J2471J2953J2087J0954J1300J3072J4532J4574J3684J2747J2301
$$ y = [10002751, 9755391, 9505880, 9254313, 9001499, 8748574, 8495920, 8242869, 7988841, 7734532, 7481737, 7232298, 6987558, 6748612, 6516538, 6292093, 6075248, 5865302, 5661859, 5465861, 5279321, 5103585, 4938015, 4780886, 4631494, 4490839, 4360157, 4239232, 4126278, 4019013, 3915727, 3815811, 3719576, 3627516, 3539700, 3455906, 3376004, 3299732, 3226439, 3155616, 3087565, 3022927, 2961723, 2903545, 2848460, 2796884, 2748699, 2703708, 2663129, 2629386, 2603613, 2584057, 2567667, 2552797, 2539971, 2530591, 2525482, 2524172, 2524896, 2525508, 2524856, 2523211, 2521248, 2519017, 2516206, 2513060, 2510643, 2510251, 2512578, 2517164, 2522723, 2528396, 2534616, 2542345, 2551724, 2562174, 2573532, 2586003, 2598956, 2611043, 2621997, 2633297, 2646369, 2660901, 2675475, 2689159, 2701906, 2714207]
58930B714207J2957J5113J8003K0172K1205K1976K3090K4123K4702K5294K6529
58919B947371K8340L0075L1111L1335L1523L2936L5921L9205M1297M2290M3514
58908C334918M5809M9006N2638N6056N8375N9506O0933O4089O8249P1388P2933
58897C993900P4131P5750P7157P8053P9523Q2631Q7056R1759R6173J00404J05015
58886D941552J10844J18331J26958J36056J45772J56337J66903J76727J87087
58877F266567K00093K15443K30400K43652K57286K73973K93763L14902L36543
58868H632622L59347L84182M11510M41628M74672N10475N48871N89800O33177
58859A2986284O79197P28590P81656Q37110Q93094R49163J005693J061095J111349
$$ y = [2714207, 2727164, 2742277, 2760280, 2780452, 2801657, 2823633, 2846723, 2870846, 2895548, 2920842, 2947371, 2975711, 3005786, 3036897, 3068232, 3099755, 3132691, 3168612, 3207817, 3249114, 3291404, 3334918, 3380727, 3429733, 3482371, 3538427, 3596802, 3656308, 3717241, 3781330, 3849579, 3920967, 3993900, 4068031, 4143781, 4220938, 4298991, 4378514, 4461145, 4548201, 4639960, 4736133, 4836537, 4941552, 5052396, 5170727, 5297685, 5433741, 5579513, 5735850, 5902753, 6079480, 6266567, 6466660, 6682103, 6912503, 7156155, 7413441, 7687414, 7981177, 8296079, 8632622, 8991969, 9376151, 9787661, 10229289, 10703961, 11214436, 11763307, 12353107, 12986284, 13665481, 14394071, 15175727, 16012837, 16905931, 17855094, 18860787, 19921882, 21033231]
58850B1033231J152900J184186J203342J206044J187256J144148J076044R82582
58842C0169733Q63506P20125N56011L76596J88710j77j83294l55196n11148o47017
58832C1177849p60606q52189r23014r74064j006939j024663j030164j024443j007558
58823B2574209r81125r48743r13861q77829q39908p98853p55000p11166o70820
58814A5076904o34865o01037n67062n33248n01112m70668m40765m11335l83471
58805A0533341l57406l32150l07355k83983k62593k42346k22435k03457j86307
58796H135309j70481j54644j38655j23804j10757r8209q4371o9314n4891m2253
58786G087930l0449j7873m338R242K2634L6547N1096O5264P8336R1103J04923
$$ y = [21033231, 22186131, 23370317, 24573659, 25779703, 26966959, 28111107, 29187151, 30169733, 31033239, 31753364, 32309375, 32685971, 32874681, 32874504, 32691210, 32336014, 31824866, 31177849, 30417243, 29565054, 28642040, 27667976, 26661037, 25636374, 24606210, 23581767, 22574209, 21593084, 20644341, 19730480, 18852651, 18012743, 17213890, 16458890, 15747724, 15076904, 14442039, 13841002, 13273940, 12740692, 12239580, 11768912, 11328147, 10916812, 10533341, 10175935, 9843785, 9536430, 9252447, 8989854, 8747508, 8525073, 8321616, 8135309, 7964828, 7810184, 7671529, 7547725, 7436968, 7338759, 7254388, 7185074, 7130183, 7087930, 7057481, 7039608, 7035270, 7044512, 7067146, 7103693, 7154789, 7220053, 7298389, 7389492, 7494415]
58775G494415J20066J35573J50606J65485J81354J98910K17642K36623K56095
58766I156769K77587L01929L27851L53566L79296M07002M37907M71692N08242
58757A2621841N48461N92732O39957O89091P40573P95164Q52075R09265R64946
58748A9354105J017681J065226J104184J130788J141464J132935J102505J048249
58740B8097137R68719Q62733P30392N74488M00734K16478K9052j55066l30147
58731C1394520m90837o32459p52084q49178r24872r80653j018061j039251j046945
58722B3660180j043613j031035j010679r84034r52574r17742q80787q42249q02067
58713A5195400p60803p20276o82039o45595o09271n72749n37525n04840m74415
$$ y = [7494415, 7614481, 7750054, 7900660, 8066145, 8247499, 8446409, 8664051, 8900674, 9156769, 9434356, 9736285, 10064136, 10417702, 10796998, 11204000, 11641907, 12113599, 12621841, 13170302, 13763034, 14402991, 15092082, 15832655, 16627819, 17479894, 18389159, 19354105, 20371786, 21437012, 22541196, 23671984, 24813448, 25946383, 27048888, 28097137, 29065856, 29928589, 30658981, 31233469, 31634203, 31850681, 31879733, 31724667, 31394520, 30903683, 30271224, 29519140, 28669962, 27745090, 26764437, 25746376, 24707125, 23660180, 22616567, 21585532, 20574853, 19590819, 18638245, 17720503, 16839716, 15997467, 15195400, 14434597, 13714321, 13032282, 12386687, 11777416, 11204667, 10667142, 10162302, 9687887]
58704I687887m45486m17902l91684l66466l41964l18431k96239k75600k56781
58695F577334k39861k24088k08318j92359j77234j63805j51777j40231j28680
58686D950981j17517j07822j00541r5340r0694q5842q1752p9112p6187p0673o3373
58675C982128n7873n6147n6285n5316n2730n0225m9177m9348m9591m9139m8389
58664C407908m8318m8828m8574m7332m7309n0181n3802n4467n2121n0432n1444
58653B855100n3246n3585n2791n1711m9731m6777m4814m4983m5171m2868l9014
58642B330409l6541l6102l5700l4005l1815l0218k9118k7907k6500k5380k5106
58631A992017k5630k5946k5055k3372k2230k1731k0529j8078j5560j3901j2572
$$ y = [9687887, 9242401, 8824499, 8432815, 8066349, 7724385, 7405954, 7109715, 6834115, 6577334, 6337473, 6113385, 5905067, 5712708, 5535474, 5371669, 5219892, 5079661, 4950981, 4833464, 4725642, 4625101, 4529761, 4439067, 4353225, 4271473, 4192361, 4116174, 4045501, 3982128, 3924255, 3868108, 3811823, 3756507, 3703777, 3653552, 3604375, 3555027, 3505436, 3456297, 3407908, 3359590, 3310762, 3262188, 3214856, 3167547, 3117366, 3063564, 3009097, 2956976, 2906544, 2855100, 2801854, 2748269, 2695478, 2643767, 2594036, 2547259, 2502445, 2457462, 2412291, 2369423, 2330409, 2293868, 2257766, 2222066, 2188061, 2156246, 2126028, 2096910, 2069003, 2042503, 2017123, 1992017, 1966387, 1940441, 1915386, 1892014, 1869784, 1848053, 1827524, 1809446, 1793886, 1779985, 1767413]
58620A767413j1173j0387j0204q986n857k521j230k109l894n812p284p258n702
58607A684996m480n030o275o559o233o325n936l487J69K415K393J726J753K162
58593A651289K516L252M651O206P490Q721J0292J2369J5041J8250K1674K5032
58581A786783K8137L0532L1970L3505L6825M1829M6367M9176N1592N5272N9853
58570B251841O4352O9333P5812Q3189R0170R6877J04319J12666J21762J32535
58560C202856J46056J61683J77838J94132K11313K29741K49241K69730K90475
58551E133065L09475L25000L36864L44888L47062L40863L25470L01111K67271
58542H031069K23448J70898J12151M9795j2673p0354j19665j60811j95542k23475
$$ y = [1767413, 1756240, 1745853, 1735649, 1726663, 1720806, 1718285, 1717055, 1714946, 1711052, 1705240, 1697956, 1690698, 1684996, 1680516, 1675486, 1669211, 1662652, 1656419, 1650094, 1644158, 1640671, 1640840, 1643255, 1645648, 1647374, 1649127, 1651289, 1653805, 1657057, 1661708, 1667914, 1675404, 1684125, 1694417, 1706786, 1721827, 1740077, 1761751, 1786783, 1814920, 1845452, 1877422, 1910927, 1947752, 1989581, 2035948, 2085124, 2136716, 2191988, 2251841, 2316193, 2385526, 2461338, 2544527, 2634697, 2731574, 2835893, 2948559, 3070321, 3202856, 3348912, 3510595, 3688433, 3882565, 4093878, 4323619, 4572860, 4842590, 5133065, 5442540, 5767540, 6104404, 6449292, 6796354, 7137217, 7462687, 7763798, 8031069, 8254517, 8425415, 8537566, 8587361, 8574688, 8504334, 8384669, 8223858, 8028316, 7804841]
58532G804841k42958k54516k60712k63017k61292k56107k49024k40613k30390
58523E546212k18744k06892j94945j82007j68200j54762j42244j30443j19872
58514D028103j11425j04729r8551r2668q7641q3252p8930p5178p2560o9888o5678
58503C087603o0956n8209n7756n7591n6724n6227n6749n7431n7632n7648n7325
58492B453355n5845n3344n0912m8815m6371m3676m1607m0048l7853l4712l1376
58481A968796k8206k5223k3316k3353k4228k3860k2074k0443j9365j7598j4788
58470A726342j2254j0850j0024r236q558p724o373n203n139n591n502n691p839
58457A626358j1387j3938j4745j5293j6378j7220j7555j8027j8172j6760j4527
$$ y = [7804841, 7561883, 7307367, 7046655, 6783638, 6522346, 6266239, 6017215, 5776602, 5546212, 5327468, 5120576, 4925631, 4743624, 4575424, 4420662, 4278418, 4147975, 4028103, 3916678, 3811949, 3713398, 3620730, 3533089, 3449837, 3370907, 3295729, 3223169, 3153281, 3087603, 3026647, 2968438, 2910682, 2853091, 2796367, 2740140, 2683391, 2625960, 2568328, 2510680, 2453355, 2397510, 2344166, 2293254, 2244439, 2198068, 2154392, 2112785, 2072737, 2034884, 2000172, 1968796, 1940590, 1915367, 1892051, 1868698, 1844470, 1820610, 1798536, 1778093, 1758728, 1741130, 1726342, 1714088, 1703238, 1693214, 1683978, 1675420, 1667696, 1661323, 1656120, 1650981, 1645390, 1639888, 1634197, 1626358, 1614971, 1601033, 1586288, 1570995, 1554617, 1537397, 1519842, 1501815, 1483643, 1466883, 1452356]
58446A452356j3860j5026j5422j3481j0845r532r199q511p322o230n503n331n940
58433A326154o793o891o105n088m074l240l617n640p354o538m234l528n019o309
58419A251724n895m552k769j32K234K056k98j472K75K933M259M562M741M321L026
58404A265013J947J716J623J626K969N692P779P977P354P056O748O215O146O315
58390A336176N348L286J947J678M06k869o223p915q862j0376j1780j2019j1712
58377A277085j1877j2180j1815j0686q942o919n897o823p988o627l238j386k447
58364A180260l780l192j841j228n90P96J785J832K507M502N951N806O086Q370
58350A207264J0690J0571Q969Q506R687J1408J3456J5975J7835J7827J6556J5380
$$ y = [1452356, 1438496, 1423470, 1408048, 1394567, 1383722, 1374190, 1364991, 1356480, 1349158, 1342928, 1337425, 1332094, 1326154, 1319361, 1312470, 1306365, 1301277, 1297203, 1293963, 1290346, 1284706, 1277352, 1270814, 1266580, 1263052, 1258033, 1251724, 1245829, 1241277, 1238508, 1238376, 1240610, 1242666, 1242368, 1240896, 1241171, 1244104, 1248363, 1252925, 1257666, 1261987, 1265013, 1266960, 1268676, 1270299, 1271925, 1274894, 1280586, 1288365, 1296342, 1303696, 1310752, 1317500, 1323715, 1329861, 1336176, 1341524, 1344810, 1346757, 1348435, 1348841, 1345972, 1339749, 1331834, 1322972, 1312596, 1300816, 1288797, 1277085, 1265208, 1253028, 1241213, 1230527, 1221585, 1214666, 1208769, 1201946, 1193958, 1187331, 1184093, 1182707, 1180260, 1176480, 1173288, 1171447, 1170219, 1169629, 1170425, 1172210, 1174042, 1176549, 1181051, 1187002, 1192808, 1198894, 1207264, 1217954, 1228525, 1237494, 1246000, 1255687, 1267095, 1280551, 1296526, 1314361, 1332188, 1348744, 1364124]
58338A364124J4629J4153J4123J3992J2383R352O944O170N445L361R80j49l40
58325A465167o86j478k896n204p164o584l627j148n60j01J521K865K868L182N161
58310A451316P275P779P472P673P926P861Q803J1134J2510J1287R470R683J1168
58297A571357J1311R458O986N058M264M936O191O268N020M252M585M466L449L537
58283A651138N724P998Q547Q216Q218Q225Q281R659J2105J3234J2383J1954J3364
58270A779046J4973J5645J6710J8592J9285J8374J8665K1489K4144K4453K3994
58259A995370K4407K4484K3544K3579K5149K5344K2884K1103K2635K5089K5459
58248B259047K4751K4845K4716K3423K3004K4717K6163K5538K5016K6564K8445
$$ y = [1364124, 1378753, 1392906, 1407029, 1421021, 1433404, 1442756, 1449700, 1455870, 1461315, 1464676, 1465656, 1465507, 1465167, 1464481, 1463003, 1460107, 1454903, 1447739, 1441155, 1437528, 1436380, 1435820, 1435719, 1437240, 1440105, 1442973, 1446155, 1451316, 1458591, 1466370, 1473842, 1481515, 1489441, 1497302, 1506105, 1517239, 1529749, 1541036, 1550506, 1560189, 1571357, 1582668, 1592126, 1599112, 1604170, 1608434, 1613370, 1619561, 1625829, 1630849, 1635101, 1639686, 1644152, 1647601, 1651138, 1656862, 1664860, 1673407, 1681623, 1689841, 1698066, 1706347, 1716006, 1728111, 1741345, 1753728, 1765682, 1779046, 1794019, 1809664, 1826374, 1844966, 1864251, 1882625, 1901290, 1922779, 1946923, 1971376, 1995370, 2019777, 2044261, 2067805, 2091384, 2116533, 2141877, 2164761, 2185864, 2208499, 2233588, 2259047, 2283798, 2308643, 2333359, 2356782, 2379786, 2404503, 2430666, 2456204, 2481220, 2507784, 2536229]
58237B536229K9217L0897L4656L7773L8387L8756M0328M0736L9317M0049M4718
58226B951063M8911M9540N0412N4942N9411N9675N8863O1554O5511O6414O6179
58215C592475O9194P4235P7476P9837Q4361Q9570R2304R4057R7987J02775J05697
58204D559968J08385J13557J19410J23168J26400J31348J36310J40247J46884
58195E705677J58222J69442J76660J83929J95755K08875K19011K29415K44506
58186G491492K61115K74504K86948L01745L15113L23263L31203L45104L62309
58177A0292796L78340L96794M22252M50543M76586N04608N39711N77331O12591
58168A4651552O51481P00094P51363P96099Q38733Q88122R41733R93830J050027
$$ y = [2536229, 2565446, 2596343, 2630999, 2668772, 2707159, 2745915, 2786243, 2826979, 2866296, 2906345, 2951063, 2999974, 3049514, 3099926, 3154868, 3214279, 3273954, 3332817, 3394371, 3459882, 3526296, 3592475, 3661669, 3735904, 3813380, 3893217, 3977578, 4067148, 4159452, 4253509, 4351496, 4454271, 4559968, 4668353, 4781910, 4901320, 5024488, 5150888, 5282236, 5418546, 5558793, 5705677, 5863899, 6033341, 6210001, 6393930, 6589685, 6798560, 7017571, 7246986, 7491492, 7752607, 8027111, 8314059, 8615804, 8930917, 9254180, 9585383, 9930487, 10292796, 10671136, 11067930, 11490182, 11940725, 12417311, 12921919, 13461630, 14038961, 14651552, 15303033, 16003127, 16754490, 17550589, 18389322, 19277444, 20219177, 21213007, 22263034]
58159B2263034J117692J191265J263657J342313J436425J538742J638843J743622
58151C3535593J865204K001037K147529K319969K535185K788238L071421L399908
58143E3664084L789631M227511M697782N222060N839701O570235P435920Q497270
58135I9944194R817217J1413559J3294308J5493508J7993778K0668617K3428817
58128B12053998K6380361K9613686L2730886L4717271L4413977L1093878K4628412
58121D25632469J5416465M458582o608183j5970725k2435344k5838318k6759165
58114C47895781k5989378k4256487k2171876k0166001j8430666j6988933j5809970
58107B04082470j4830492j3938661j3028678j2062852j1040098r938582q739441
$$ y = [22263034, 23380726, 24571991, 25835648, 27177961, 28614386, 30153128, 31791971, 33535593, 35400797, 37401834, 39549363, 41869332, 44404517, 47192755, 50264176, 53664084, 57453715, 61681226, 66379008, 71601068, 77440769, 84011004, 91446924, 99944194, 109761411, 121174970, 134469278, 149962786, 167956564, 188625181, 212053998, 238434359, 268048045, 300778931, 335496202, 369910179, 401004057, 425632469, 441048934, 445507516, 438899333, 422928608, 400493264, 374654946, 347895781, 321906403, 297649916, 275478040, 255312039, 236881373, 219892440, 204082470, 189251978, 175313317, 162284639, 150221787, 139181689, 129243107, 120503666]
58100A20503666p475567o207135m978349l845106k906614k244732j856091j708383
58092H9281689j839106k311483l060957l858265m460085m762384m799574m652235
58084E9537600m392524m079820l756121l440459l142399k874359k642291k437346
58076C2772281k248548k075060j918908j776017j641713j516339j400113j290760
58068A8904823j189634j101086j023085r47709q73183q05699p47238o91849o36451
58059A0888889n85320n40701m98452m56383m18523l87901l62708l42020l27899
58050F968982l19411l11484l01563k91017k79196k63175k44229k27358k13385
58041D518164j98417j81854j67682j57010j46551j35474j26734j20439j12813
$$ y = [120503666, 113028099, 106820964, 101842615, 97997509, 95090895, 92846163, 90990072, 89281689, 87442583, 85131100, 82070143, 78211878, 73751793, 68989409, 64189835, 59537600, 55145076, 51065256, 47309135, 43868676, 40726277, 37851918, 35209627, 32772281, 30523733, 28448673, 26529765, 24753748, 23112035, 21595696, 20195583, 18904823, 17715189, 16614103, 15591018, 14643309, 13770126, 12964427, 12217189, 11525340, 10888889, 10303569, 9762868, 9264416, 8808033, 8389510, 8001609, 7638901, 7296881, 6968982, 6649571, 6338087, 6036524, 5745507, 5466311, 5203136, 4958907, 4731549, 4518164, 4319747, 4137893, 3970211, 3813201, 3666650, 3531176, 3404442, 3284003, 3171190]
58032C171190j03087r4962r0084q6093q1992p9214p6787p1739o5062o1072o0197
58021B300901n8507n4881n2362n1767n0311m7432m5816m5764m4478m1628l9770
58010A768185l8768l5877l1810l0355l1277l0169k6176k3381k3299k2596j9745
57999A454732j7498j7049j5947j3732j3442j5501j6080j3893j2717j4617j6165
57988A288091j4415j1537j0533j0731j0438j0108j0261r773q333p363p158o447
57976A170994n556o094o987n313j735j28j028p22J895L241J525l38n24j401m191
57961A143638n894m716l618n030o561n589l925m138n093m883m839o755r031r333
57947A064233q626r151j0571j1242j1288j1529j1261r743q062p281o524n069m282
$$ y = [3171190, 3068103, 2973141, 2883057, 2796964, 2714972, 2635758, 2558971, 2487232, 2422170, 2361098, 2300901, 2242394, 2187513, 2135151, 2083384, 2033073, 1985641, 1939825, 1894061, 1849583, 1807955, 1768185, 1729417, 1693540, 1661730, 1631375, 1600098, 1569929, 1543753, 1520372, 1497073, 1474477, 1454732, 1437234, 1420185, 1404238, 1390506, 1377064, 1361563, 1345483, 1331590, 1318873, 1304256, 1288091, 1273676, 1262139, 1251606, 1240875, 1230437, 1220329, 1210068, 1200295, 1191962, 1184599, 1177441, 1170994, 1165438, 1159344, 1152357, 1147044, 1145309, 1145181, 1144153, 1143431, 1145326, 1148567, 1150092, 1149754, 1149230, 1147829, 1143638, 1137744, 1133028, 1129410, 1124380, 1117819, 1112230, 1108305, 1104167, 1099074, 1094191, 1089352, 1082597, 1073566, 1064233, 1055607, 1046456, 1035885, 1024643, 1013355, 1001826, 990565, 980822, 972760, 965479, 958955, 953886, 949604]
57934I49604n320o890p319o967o693n954m311k922k646k483j446j18J024K700
57920I00259M879N995N485M779M511L350J077m3J161K475J630n10k155l561n497
57905I23835p023p083o530o512o557o028n573n561n129m333m928p241q724p616
57891H34997n764n586o542o887o654o418n190k302L59P21l12o09k20m11p40J20
57875G88562J581J866R27J82j82j332l445n236n834n690n751o637q229r242q104
57860G33436n116k666k333k973k704j406o0J081K207L070L611M458N672O360O485
57845G49122P374R267J0175Q857P016O611O676N130K434Q01O49M13n09j056q58
57830H12102j133k708m714n941o421o988p782p869o518m627m194n898p852p772
$$ y = [949604, 944284, 937394, 930075, 923108, 916415, 910461, 906150, 903228, 900582, 898099, 896653, 896535, 897559, 900259, 905138, 911133, 916618, 921397, 925908, 929258, 930335, 930292, 931453, 933928, 935558, 935048, 932893, 929332, 923835, 916812, 909729, 903199, 896687, 890130, 884102, 878529, 872968, 867839, 863506, 858578, 851337, 842613, 834997, 829233, 823647, 817105, 810218, 803564, 797146, 791956, 789654, 790013, 790734, 790422, 789813, 789593, 789182, 788442, 788562, 790143, 792009, 792936, 793118, 792936, 791604, 788159, 782923, 777089, 771399, 765648, 759011, 750782, 741540, 733436, 728320, 725654, 723321, 720348, 717644, 716238, 716178, 717259, 719466, 722536, 726147, 730605, 736277, 742637, 749122, 756496, 765763, 775938, 784795, 791811, 798422, 805098, 810228, 812662, 813463, 814112, 814525, 814016, 812960, 812102, 810969, 808261, 803547, 797606, 791185, 784197, 776415, 768546, 762028, 757401, 753207, 747309, 739457, 731685]
57816G31685n772l723k527j802j643k265k273J1L244M147K446J550L250N113M817
57801G36258L845M415N600N334M106L654L666K680J064K94J95n51j864k513k347
57786G63836k220k295k322k858m428o179o991p162p343p001n744n084o555q819
57772F88835q999o601m126l900n865q391r787r361q106p901r142j0019r178p768
57758E79691p448p796p627p508q696j0395j0498q652o505n147m222l337k625k042
57744D87193j482j291j432r04O54J788J384R62K672N860P914Q004P633P647P110
57729E33712N416L416K065J472J604K453L336L408K909K665K535J661J30j021
57715E65761j358j394j602k187l419m965n484m216k417j749k007j903j285p40
$$ y = [731685, 725913, 722190, 719663, 717861, 716218, 713953, 711680, 711691, 714935, 719082, 721528, 723078, 726328, 731441, 736258, 740103, 744518, 750118, 755452, 759558, 763212, 766878, 769558, 770622, 770916, 771111, 770560, 768696, 766183, 763836, 761616, 759321, 756999, 754141, 749713, 743534, 736543, 729381, 722038, 715037, 709293, 704209, 697654, 688835, 679836, 673235, 669109, 665209, 659344, 650953, 641166, 631805, 623699, 615798, 606656, 596637, 587459, 579691, 572243, 564447, 556820, 549312, 540616, 530221, 519723, 511071, 504566, 499419, 495197, 491860, 489235, 487193, 485711, 484420, 482988, 482084, 482738, 484526, 485910, 486872, 489544, 495404, 503318, 511322, 518955, 526602, 533712, 539128, 542544, 544609, 546081, 547685, 550138, 553474, 556882, 559791, 562456, 564991, 566652, 566782, 565761, 564403, 563009, 561407, 559220, 555801, 550836, 545352, 541136, 538719, 536970, 534963, 533060, 531775, 531035]
57701E31035J53J994L618L344J870J621L339N522P159Q591R510Q712O500N024
57687E97992N339O083N930N528N986P008P634P673P538P521P800Q369Q819R052
57673F98272J0045J2526J5137J5573J3563J1085R605R014R381J1440J4667J7133
57661H47441J8260J9793K2806K5566K5888K4323K3351K4382K6722K8936L0125
57650A117593L0488L1230L3251L5640L6709L6787L8313M2304M6589M8993N0612
57639A548509N3996N9302O4484O8757P3560P9975Q7197R4154J01080J08728J17242
57628B456984J26641J37497J50185J64104J78668J94691K13567K34958K56256
57619D113551K74802K89833L01688L09980L13674L12312L05685K92406K70543
$$ y = [531035, 531188, 533182, 536800, 540144, 542014, 543635, 546974, 552496, 559655, 568246, 577756, 586468, 592968, 597992, 603331, 609414, 615344, 620872, 626858, 633866, 641500, 649173, 656711, 664232, 672032, 680401, 689220, 698272, 708317, 720843, 735980, 751553, 765116, 776201, 785806, 794820, 804201, 815641, 830308, 847441, 865701, 885494, 908300, 933866, 959754, 984077, 1007428, 1031810, 1058532, 1087468, 1117593, 1148081, 1179311, 1212562, 1248202, 1284911, 1321698, 1360011, 1402315, 1448904, 1497897, 1548509, 1602505, 1661807, 1726291, 1795048, 1868608, 1948583, 2035780, 2129934, 2231014, 2339742, 2456984, 2583625, 2721122, 2871307, 3035411, 3214079, 3408770, 3622337, 3857295, 4113551, 4388353, 4678186, 4979874, 5289854, 5603528, 5915840, 6221525, 6513931, 6784474]
57610F784474K40332K04854J67130J27616Q5284L9772q749o0423j14327j66670
57600G299293k12102k46895k69843k80917k81088k73432k62296k50451k38017
57591D984252k24400k10057j95971j82494j69345j55967j41763j26661j11609
57582C465985r7669q4734p2002n9489m7937l7316k6776j6158o141L313J3296K4325
57570C058697L5780M7357N9812P3565Q7803J01750J15774J30448J45391J59927
57560D016304J74104J88184K01545K12713K20149K22559K18872K08394J90752
57551E853576J65636J33013R3836N0047M030m1474q3264j18810j47770j71487
57541E737333j90666k04342k11474k12802k10723k07730k04995k01915j97029
$$ y = [6784474, 7024806, 7229660, 7396790, 7524406, 7609690, 7649462, 7640713, 7580290, 7465963, 7299293, 7087191, 6840296, 6570453, 6289536, 6008448, 5735016, 5472720, 5222269, 4984252, 4759852, 4549795, 4353824, 4171330, 4001985, 3846018, 3704255, 3577594, 3465985, 3368316, 3283582, 3211580, 3152091, 3104154, 3066838, 3040062, 3023904, 3017763, 3021076, 3034372, 3058697, 3094477, 3141834, 3201646, 3275211, 3363014, 3464764, 3580538, 3710986, 3856377, 4016304, 4190408, 4378592, 4580137, 4792850, 5012999, 5235558, 5454430, 5662824, 5853576, 6019212, 6152225, 6246061, 6296108, 6300138, 6258664, 6175400, 6056590, 5908820, 5737333, 5546667, 5342325, 5130851, 4918049, 4707326, 4499596, 4294601, 4092686, 3895657]
57532C895657j89889j81662j73404j64501j54059j43073j33526j25625j17804
57523B512114j09475j01719r4990q8180q0706p3633o7884o2898n8036n3640m9801
57512A671152m5685m1174l7571l5381l2919k8618k3424j9389j6989j5301j3779
57501A360922j2185r784o284k813m48J453L944O371P572Q326J0475J3794J6114
57488A397457J6773J7824K1147K6100L0818L4450L7236L9557M1967M5430N0549
57477A759308N6764O2810O7894P2379P7645Q5148R5027J05695J15429J24229J33392
57466B755720J43457J53604J62993J71458J78505J82697J82532J77173J65906
57457D274045J48078J24279R6667O7127L5754K195l2051o3814r0534j11456j26808
$$ y = [3895657, 3705768, 3524106, 3350702, 3186201, 3032142, 2889069, 2755543, 2629918, 2512114, 2402639, 2300920, 2205930, 2117750, 2037044, 1963411, 1895527, 1832629, 1774593, 1720953, 1671152, 1625467, 1584293, 1546722, 1511341, 1478422, 1449804, 1426380, 1406991, 1390002, 1374701, 1360922, 1348737, 1338953, 1332669, 1329856, 1329408, 1330861, 1334805, 1341176, 1348748, 1357074, 1367549, 1381343, 1397457, 1414230, 1432054, 1453201, 1479301, 1510119, 1544569, 1581805, 1621362, 1663329, 1708759, 1759308, 1816072, 1878882, 1946776, 2019155, 2096800, 2181948, 2276975, 2382670, 2498099, 2622328, 2755720, 2899177, 3052781, 3215774, 3387232, 3565737, 3748434, 3930966, 4108139, 4274045, 4422123, 4546402, 4643069, 4710196, 4745950, 4748145, 4716094, 4652280, 4561746, 4450290, 4323482]
57446D323482j37049j43068j46048j46567j44601j40647j36002j31385j26071
57437C072044j19134j11001j02933r5424q8066q0614p3223o5736n7787m9738m2504
57426B185884l6246l0094k3347j6116q628r51O235J1922J6453K1769K9018L6916
57414B192815M3598M9126N5003O2030P0109P9438R0227J01517J11942J21601J31672
57403C109078J42130J51218J57298J59840J58486J52537J41558J25190J02302
57394D399637P2120L6656L87l3273o3923r2105j17018j37332j52684j63091j68074
57383C581300j67968j65149j62310j59835j56110j50128j42684j35189j28421
57374B213506j22358j16377j09711j02294r5030q8616q2578p6149o9695o4302
$$ y = [4323482, 4186433, 4043365, 3897317, 3750750, 3606149, 3465502, 3329500, 3198115, 3072044, 2952910, 2841909, 2738976, 2643552, 2555486, 2474872, 2401649, 2335913, 2278126, 2228388, 2185884, 2149638, 2119544, 2096197, 2080081, 2071453, 2070502, 2076737, 2088659, 2105112, 2126881, 2155899, 2192815, 2236413, 2285539, 2340542, 2402572, 2472681, 2552119, 2642346, 2743863, 2855805, 2977406, 3109078, 3251208, 3402426, 3559724, 3719564, 3878050, 4030587, 4172145, 4297335, 4399637, 4471757, 4508413, 4508800, 4475527, 4411604, 4319499, 4202481, 4065149, 3912465, 3749374, 3581300, 3413332, 3248183, 3085873, 2926038, 2769928, 2619800, 2477116, 2341927, 2213506, 2091148, 1974771, 1865060, 1762766, 1667736, 1579120, 1496542, 1420393, 1350698, 1286396]
57364A286396o0077n5768n0294m4119l8912l5970l4960l4169l2190k9296k6778
57353H43863k5157k3930k2890k2502k2545k1708j9425j7099j6384j6971j7053
57342F18199j5410j2213q490n696n116o531p990p926p004o730o964o273m405k788
57328E14663k507l136l754l950l591k747k096k402l321l680l068k143j192L54
57314D77430K547M285M789M653M617M322L409K919M164O482P723P071O040O044
57300E46495O296N213L077J829K324L339L650L793M793O257P045P245P926R064
57286F18346R320Q146O656N930N736N714O426Q186R928J0548J0535J1031J1858
57273G28360J1947J1238J0711J0654J0350R593R175R602J0507J1583J3018J4416
$$ y = [1286396, 1226319, 1170551, 1120257, 1076138, 1037226, 1001256, 966296, 932127, 899937, 870641, 843863, 818706, 794776, 771886, 749384, 726839, 705131, 685706, 668607, 652223, 635252, 618199, 602789, 590576, 582086, 576390, 571274, 564743, 556753, 548827, 541823, 535093, 528129, 521856, 517451, 514663, 512156, 509020, 505266, 501316, 497725, 494978, 492882, 490480, 487159, 483479, 480411, 478268, 477076, 477430, 479977, 484262, 489051, 493704, 498321, 502643, 506052, 508971, 513135, 519617, 527340, 534411, 540451, 546495, 552791, 558004, 561081, 562910, 565234, 568573, 572223, 576016, 580809, 587066, 594111, 601356, 609282, 618346, 627666, 635812, 642468, 648398, 654134, 659848, 666274, 674460, 684388, 694936, 705471, 716502, 728360, 740307, 751545, 762256, 772910, 783260, 792853, 802028, 811630, 822137, 833720, 846738, 861154]
57261H61154J4468J2582J0127R159J0101J1447J1701J1017J0757J1726J3324J4525
57249A002088J5176J5813J6405J6248J5406J5211J6589J8630J9805K0057K0605
57238A192033K2061K3854K5380K6575K7346K7524K7581K8418L0303L2700L5182
57227A498957L7606L9489M0381M1037M2963M6353M9560N1219N1862N2795N4267
57216B006489N5572N6219N6116N5094N2916M9414M4228L6991K8244J9448J1480
57205B472211L872l780j0437j4688j6555j7246j7560j7650j7881j8558j8847j7285
57193B305596j3725r675o333l285L85M494P942R978J0766J1144J2244J4861J8657
57180B363049K2226K4336K4890K4524K3884K3619K4424K6281K8146K9342L0970
$$ y = [861154, 875622, 888204, 898331, 907490, 917591, 929038, 940739, 951756, 962513, 974239, 987563, 1002088, 1017264, 1033077, 1049482, 1065730, 1081136, 1096347, 1112936, 1131566, 1151371, 1171428, 1192033, 1214094, 1237948, 1263328, 1289903, 1317249, 1344773, 1372354, 1400772, 1431075, 1463775, 1498957, 1536563, 1576052, 1616433, 1657470, 1700433, 1746786, 1796346, 1847565, 1899427, 1952222, 2006489, 2062061, 2118280, 2174396, 2229490, 2282406, 2331820, 2376048, 2413039, 2441283, 2460731, 2472211, 2476083, 2472303, 2461866, 2447178, 2430623, 2413377, 2395817, 2378167, 2360286, 2341728, 2322881, 2305596, 2291871, 2282196, 2275863, 2272578, 2272963, 2277457, 2285399, 2295377, 2306143, 2317287, 2329531, 2344392, 2363049, 2385275, 2409611, 2434501, 2459025, 2482909, 2506528, 2530952, 2557233, 2585379, 2614721, 2645691]
57169B645691L4813M0890M7187N2074N5803N9021O1174O1551O1035O1199O1952
57158C242390O1820O0646O0238O1483O2404O0569N6502N3077N1942N2152N2320
57147C875543N2400N2793N3043N2453N1311N0560N0676N1477N2708N4189N5648
57136D452801N6846N7721N8165N8140N8293N9634O2038O3798O3602O2443O2489
57125E115970O4253O6008O6085O4789O3774O4163O5468O5946O4082O0196N6290
57114E817024N3708N1513M8072M3631L9800L6787L2980K7497K1397J5859J0859
57103F199127O325K896N39k038n463q668j0998j3806j8405k3782k8100l1138l3486
57090F033003l4650l4224l4071l6885m2979n0610n8951o8483p8879q9001r8999
$$ y = [2645691, 2680504, 2721394, 2768581, 2820655, 2876458, 2935479, 2996653, 3058204, 3119239, 3180438, 3242390, 3304210, 3364856, 3425094, 3486577, 3548981, 3609550, 3666052, 3719129, 3771071, 3823223, 3875543, 3927943, 3980736, 4033779, 4086232, 4137543, 4188103, 4238779, 4290256, 4342964, 4397153, 4452801, 4509647, 4567368, 4625533, 4683673, 4741966, 4801600, 4863638, 4927436, 4991038, 5053481, 5115970, 5180223, 5246231, 5312316, 5377105, 5440879, 5505042, 5570510, 5636456, 5700538, 5760734, 5817024, 5870732, 5922245, 5970317, 6013948, 6053748, 6090535, 6123515, 6151012, 6172409, 6188268, 6199127, 6205452, 6208348, 6208887, 6206849, 6201386, 6192718, 6181720, 6167914, 6149509, 6125727, 6097627, 6066489, 6033003, 5998353, 5964129, 5930058, 5893173, 5850194, 5799584, 5740633, 5672150, 5593271, 5504270, 5405271]
57079E405271j10251j23146j37076j52388j69882j88244k04529k17597k28880
57070C873278k39567k49565k59485k71015k84648k99577l16370l37288l63501
57061A252262l94670D25879e0983n30311n89884o55144p28457q11285r02792j003167
57051e272023j114704j238684j375532j529479j708532j917914k158258k432401
57043a8747527k748913l116551l541102m031056m600175n260230o017606o882374
57035e4945534p874728r017030j0325462j1812163j3480307j5301476j7206899
57028a39963599j9122674k1015353k2880975k4668968k6211512k7234895k7467665
57021c08565641k6788322k5304194k3266186k0849988j7994313j4475806j0165410
$$ y = [5405271, 5295020, 5171874, 5034798, 4882410, 4712528, 4524284, 4319755, 4102158, 3873278, 3633711, 3384146, 3124661, 2853646, 2568998, 2269421, 1953051, 1615763, 1252262, 857592, 425879, -50983, -581294, -1171178, -1826322, -2554779, -3366064, -4268856, -5272023, -6386727, -7625411, -9000943, -10530422, -12238954, -14156868, -16315126, -18747527, -21496440, -24612991, -28154093, -32185149, -36785324, -42045554, -48063160, -54945534, -62820262, -71837292, -82162754, -93974917, -107455224, -122756700, -139963599, -159086273, -180101626, -202982601, -227651569, -253863081, -281097976, -308565641, -335353963, -360658157, -383924343, -404774331, -422768644, -437244450, -447409860]
57014d47409860n209754K5446N143840R835487J3879625J7139064J9595446K1354782
57006c65645924K2573994K3369744K3790255K3845505K3539188K2879870K1888601
56999b03758767K0611381J9124155J7521910J5897002J4317873J2821537J1426688
56992i2038221J0153430R025809Q055199P228679O517268N890939N324648M798921
56984c5043328M303003L835971L400888K999600K634317K308963K024571J776205
56976a1759810J557550J365347J196589J045648R08551P86962O83629N96173N19429
56967c099932M51689L94417L47289L07419K72602K41822K13326J85252J57684
56958e28432J31823J07934Q6149O8019N4948c3333G269L8318L9205M0420L8545
$$ y = [-447409860, -452619614, -452594168, -447450328, -437614841, -423735216, -406596152, -387000706, -365645924, -343071930, -319702186, -295911931, -272066426, -248527238, -225647368, -203758767, -183147386, -164023231, -146501321, -130604319, -116286446, -103464909, -92038221, -81884791, -72858982, -64803783, -57575104, -51057836, -45166897, -39842249, -35043328, -30740325, -26904354, -23503466, -20503866, -17869549, -15560586, -13536015, -11759810, -10202260, -8836913, -7640324, -6594676, -5686125, -4899163, -4215534, -3619361, -3099932, -2648243, -2253826, -1906537, -1599118, -1326516, -1084694, -871368, -686116, -528432, -396609, -288675, -202526, -134507, -79559, -33333, 7269, 45587, 84792, 125212, 163757]
56947A63757L3025K5303J6048N757l249q445j0180j0622j0542r797j0512j6865
56935A63678l1117n1482G344h5983j06618j12263j11971j08607j03620r7079q9364
56924h15505q1330p3349o5468n8143n1787m6307m1892l9117l7227l3881k8036
56913a372042k1674j6943j3092q237k666K095O451J2194J9249K5450K9592L2511
56901a307112L5111L7285L9040M1010M3589M6605M9593N1283M9643M4050L6822
56890h33081L0812K6079K0847J5107J0889R126Q672Q652R501J1040J1734J0792
56878f59830R453R276J0434J2509J5667J9953K4274K7224K8503K8882K8952K8257
56866d16446K5606K0146J2424M322k297o737r135r648q544o671m998l865l185
$$ y = [163757, 196782, 222085, 238133, 243890, 240641, 232196, 222016, 211394, 200852, 191055, 180543, 163678, 132561, 81079, 7344, -85983, -192601, -304864, -416835, -525442, -629062, -726141, -815505, -896835, -970184, -1035652, -1093795, -1145582, -1191889, -1233781, -1272898, -1310125, -1344006, -1372042, -1393716, -1410659, -1423751, -1431988, -1434654, -1432559, -1426108, -1413914, -1394665, -1369215, -1339623, -1307112, -1272001, -1234716, -1195676, -1154666, -1111077, -1064472, -1014879, -963596, -913953, -869903, -833081, -802269, -776190, -755343, -740236, -729347, -720221, -711549, -702897, -693396, -682356, -670622, -659830, -650377, -641101, -630667, -618158, -602491, -582538, -558264, -531040, -502537, -473655, -444703, -416446, -390840, -370694, -358270, -353948, -356245, -362982, -372117, -381765, -390309, -396980, -401978, -405843, -409028]
56853d09028l017l392l843l703k679q38J526L763N248O171P274Q587R372R527
56839c75032R812J0325J0217R582R972J2042J4302J5426J6152J7479J8597J8519
56827b12607J8269J9292K0700K0423J8321J6039J4163J1743Q364M803J754l75
56815e9111p55J048L665N078M992M630M608M727N506P931e903I949J9801K4025
56801E3775K8238L1761L4995L8540M1036M0034L5134K8287K0858J2558L647l969
56789C64894q677j0556j0232q083n157l076k043l02L402Q009J1717J4497J8164
56776C72557K4457L3427M3097N0566N4133N4450N2793M8590L9915K6466J0784
56765H11235l878j5825k4798l0754l3501l3134l0593k7675k5837k4550k1707j6563
$$ y = [-409028, -412045, -415437, -419280, -422983, -425662, -426500, -424974, -421211, -415963, -409792, -402518, -393931, -384559, -375032, -365220, -354895, -344678, -335096, -325124, -313082, -298780, -283354, -267202, -249723, -231126, -212607, -194338, -175046, -154346, -133923, -115602, -99563, -85400, -73657, -65293, -60490, -58736, -59111, -59866, -58818, -55153, -50075, -45083, -40453, -35845, -31118, -25612, -17681, -5903, 9949, 29750, 53775, 82013, 113774, 148769, 187309, 228345, 268379, 303513, 331800, 352658, 365216, 368863, 364894, 356217, 345661, 335429, 327346, 322189, 319113, 317070, 316768, 320170, 328179, 339896, 354393, 372557, 397014, 430441, 473538, 524104, 578237, 632687, 685480, 734070, 773985, 800451, 811235, 807357, 791532, 766734, 735980, 702479, 669345, 638752, 611077, 585240, 560690, 538983, 522420]
56753E22420j1025o890l114K424R599J6684K3232K9612L4167L3908K8365K0133
56741F99515J1099P47j0940k1578k8686l2099l2966l2051l0149k8454k7179k5125
56729D42134k1672j8054j5562j3639j0838o767k219K005N614Q686J1333J3047
56717C94068J2473Q788L090k633p698j2626j7153k0096k1109k0848j9491j6939
56705B79826j4451j3850j4780j4916j3408j1907j1582j1412j0361r153q655q295
56693A37056p329o072m913l616k424k167k513j871J0J350J230J160K344L352K238
56678A17835m60k466k396m91K093L610K685Q5j703j409j87O66J222J418L29j738
56662A19093k680j634n10q44j474j103q59j857k502j048R00O09j416k404j768
$$ y = [522420, 511395, 504505, 501391, 503815, 513414, 530098, 553330, 582942, 617109, 651017, 679382, 699515, 710614, 711361, 700421, 678843, 650157, 618058, 585092, 553041, 522892, 494438, 467259, 442134, 420462, 402408, 386846, 373207, 362369, 355602, 353383, 355388, 361002, 369688, 381021, 394068, 406541, 415329, 418419, 415786, 408088, 395462, 378309, 358213, 337104, 316256, 296765, 279826, 265375, 251525, 236745, 221829, 208421, 196514, 184932, 173520, 163159, 154006, 145351, 137056, 129727, 123655, 118742, 115126, 112702, 110535, 108022, 106151, 106161, 107511, 108741, 109901, 112245, 115597, 117835, 117375, 114909, 112513, 112022, 114115, 117725, 120410, 120495, 118792, 117383, 117196, 117862, 119084, 120502, 120831, 119093, 116413, 114779, 114269, 113425, 111951, 110848, 109989, 108132, 105630, 104582, 105482, 106091, 104675, 102271, 100503]
56647A00503j382j889j883q53j48n09j031j032r97j142p74K99J129R24K7o28k85
56630I0329J229K990L305J541p87j812j619j617k177k349j532n7J680L460M839
56615I7423N491N649N419M292K304P97Q68J817K348K471K851L122K467J211K84
56600A38814l39j219k083k341k376k784l019k423j903k755m276m499l104j836
56586A03857k033l333m778n719n643m411k707j253J5J102J121k25j292m20J350
56571G5631J423p81l198l821k385L31L110M429L757K586K560L033K238M26l50
56556H8989N33J498J460J166J449J937K068J839J231K74k66K69R01J03j541j729
56540A00181K03K191K422J594J447K368L355L390K331J168J460L576N673N562
$$ y = [100503, 99121, 97232, 95349, 94496, 94348, 93839, 92808, 91776, 90779, 89637, 88863, 89162, 90291, 91215, 91242, 90614, 90329, 91558, 94548, 97853, 99394, 98607, 96795, 95176, 93559, 91382, 89033, 87501, 87444, 89124, 92584, 97423, 102914, 108563, 113982, 118274, 120578, 121375, 122243, 124060, 126408, 128879, 131730, 134852, 137319, 138530, 138814, 138475, 137256, 135173, 132832, 130456, 127672, 124653, 122230, 120327, 117572, 113296, 108797, 105693, 103857, 101824, 98491, 93713, 87994, 82351, 77940, 75233, 73980, 73995, 75097, 76218, 75993, 74701, 74281, 75631, 77054, 76273, 73075, 69254, 66869, 67200, 70310, 74739, 78496, 81082, 83642, 86675, 88913, 89339, 88989, 89522, 91020, 92480, 93646, 95095, 97032, 99100, 100939, 102170, 102444, 102178, 102447, 103348, 103451, 101910, 100181, 100384, 102575, 104997, 106591, 108038, 110406, 113761, 117151, 119482, 120650, 122110, 125686, 131359, 136921]
56526A36921L425J381O84Q64J324J966K318J839J242J771L079L539K744J898J672
56511A66667J663K012L417N022M622J834q72j189N22K566M058M942N313N593O229
56496B12399O678N958M401L357L019K347J399J633L343M842N049M821M794M034
56482B68074K022Q7n18l62l33m4Q25J081l95k725m149m247l793l307k809k288
56466B47119j530k81Q46P30m01r60n94j051l194m882l646l49J715Q55j569l364
56450B29444l708l153k482j897j016K60J018J86j876l612m168l971l296j754L10
56435B00285J471R88k26j060j394j312n60N36R50N72N39J272J653R89L37Q79K335
56418B08254L840N057N609M900L441K792L232L170J869Q71J406K330K320K263
$$ y = [136921, 140346, 141727, 142411, 143275, 144599, 146565, 148883, 150722, 151964, 153735, 156814, 160353, 163097, 164995, 166667, 168330, 170342, 173759, 178781, 183403, 185237, 184365, 183176, 183698, 186264, 190322, 195264, 200577, 206170, 212399, 219077, 225035, 229436, 232793, 235812, 238159, 239558, 241191, 244534, 249376, 254425, 259246, 264040, 268074, 270096, 270183, 269665, 269303, 268970, 268926, 269751, 270832, 270437, 267712, 263563, 259316, 255523, 252216, 249407, 247119, 245589, 245308, 246154, 246884, 246483, 245523, 244929, 243878, 240684, 235802, 232156, 231807, 233522, 234377, 232808, 229444, 225736, 222583, 220101, 218204, 217188, 217448, 218466, 218652, 216776, 213164, 208996, 205025, 201729, 199975, 200285, 201756, 202744, 202518, 201458, 200064, 198752, 198192, 198728, 199678, 200250, 200789, 202061, 203714, 204703, 205040, 205919, 208254, 212094, 217151, 222760, 227660, 231101, 233893, 237125, 240295, 242164, 243035, 244441, 246771, 249091, 251354]
56404B51354L449M880M629K842J295Q02R81J839L602N456O213N875N153M088K517
56389C04975J209R62J239J135J044J769K692K525J400O27P26J137J509J782J435
56374C26166O7j496k017j410m08P43J849J711p33m395o699o385m501k805k172
56359B97515k434k748k269j234r66k058l306l428k970l238m119m397l687k525
56345B58136j060P56J987J448l88j608j222k48j68j210k330k315r19Q45J788K026
56329B55518K595L504L526K441J821K592L390K800J713J634K114J905J585K610
56315B89748M463N201M600M353N061N400M634L859L991M196L418K280K435M436
56301C48075O922P844O466M177K996L190L229K291J427J552J765J079M94J541
$$ y = [251354, 254803, 259683, 264312, 267154, 268449, 269251, 270232, 272071, 275673, 281129, 287342, 293217, 298370, 302458, 304975, 306184, 307146, 308385, 309520, 310564, 312333, 315025, 317550, 318950, 319577, 320303, 321440, 322949, 324731, 326166, 326233, 324737, 322720, 321310, 320902, 321645, 323494, 325205, 324472, 320077, 313378, 306993, 302492, 299687, 297515, 295081, 292333, 290064, 288830, 287864, 285806, 282500, 279072, 276102, 272864, 268745, 264348, 260661, 258136, 257076, 257832, 259819, 261267, 260879, 259271, 258049, 257801, 257633, 256423, 254093, 251778, 250859, 251704, 253492, 255518, 258113, 261617, 265143, 267584, 269405, 271997, 275387, 278187, 279900, 281534, 283648, 285553, 287138, 289748, 294211, 299412, 304012, 308365, 313426, 318826, 323460, 327319, 331310, 335506, 338924, 341204, 343639, 348075, 354997, 362841, 369307, 373484, 376480, 379670, 382899, 385190, 386617, 388169, 389934, 391013, 391507, 393048]
56287C93048L669M963M816M173L557K728K001K096K713K873K636L069M376N519
56273D42237N862O008O726P967R129R666R530R439J0131J0979J0310P916O137
56260E52037P177J0297J2958J3891J3679J3128J2623J2675J3654J5198J6539J6974
56248G10830J5652J2346Q887P961R468J0187Q439O595O974P927O875M909M809
56235H21859O185O497N919P093J0244J2460J2170J1104J1203J2418J4150J6251
56223I47553J8148J9272K0618K3694K7875L1110L3125L5423L8355M0889M3325
56212A279387M7232N2513N7355O1526O6884P4037Q1233Q7339R3331J00243J08099
56201B109179J17461J29363J43054J56258J68435J81278J95406K09162K21522
$$ y = [393048, 396717, 401680, 406496, 410669, 414226, 416954, 418955, 421051, 423764, 426637, 429273, 432342, 436718, 442237, 448099, 454107, 460833, 468800, 477929, 487595, 497125, 506564, 516695, 527674, 537984, 545900, 552037, 559214, 569511, 582469, 596360, 610039, 623167, 635790, 648465, 662119, 677317, 693856, 710830, 726482, 738828, 747715, 755676, 765144, 775331, 783770, 790365, 797339, 805266, 812141, 817050, 821859, 828044, 834541, 840460, 847553, 857797, 870257, 882427, 893531, 904734, 917152, 931302, 947553, 965701, 984973, 1005591, 1029285, 1057160, 1088270, 1121395, 1156818, 1195173, 1236062, 1279387, 1326619, 1379132, 1436487, 1498013, 1564897, 1638934, 1720167, 1807506, 1900837, 2001080, 2109179, 2226640, 2356003, 2499057, 2655315, 2823750, 3005028, 3200434, 3409596, 3631118]
56192C631118K33506K45589K56146K63540K67581K67980K63605K54283K41273
56183E924621K25015K04387J79011J50349J19955Q8654N7828K9183K729k2634
56173F959098m6166o5668q1181r5321j09132j20759j29173j36000j42441j47726
56163E885531j52224j58567j67445j75324j79012j80008j81667j84184j85211
56154D321889j83756j80859j77380j73424j69130j64302j58141j50594j42878
56145B821425j35585j27625j18249j08697j00546r3857q8012q2965p8459p3542
56135A813888o7874o2252n7019n1616m6317m2418l9798l6418l1387k6462k3428
56124A328899k1976k1219k1036k0653j8197j3347q403n250l111o37J881L851N838
$$ y = [3631118, 3864624, 4110213, 4366359, 4629899, 4897480, 5165460, 5429065, 5683348, 5924621, 6149636, 6354023, 6533034, 6683383, 6803338, 6891992, 6949820, 6979003, 6981732, 6959098, 6912932, 6847264, 6766083, 6670762, 6561630, 6440871, 6311698, 6175698, 6033257, 5885531, 5733307, 5574740, 5407295, 5231971, 5052959, 4872951, 4691284, 4507100, 4321889, 4138133, 3957274, 3779894, 3606470, 3437340, 3273038, 3114897, 2964303, 2821425, 2685840, 2558215, 2439966, 2331269, 2230723, 2136866, 2048854, 1965889, 1887430, 1813888, 1746014, 1683762, 1626743, 1575127, 1528810, 1486392, 1446594, 1410176, 1378789, 1352327, 1328899, 1306923, 1285704, 1264668, 1244015, 1225818, 1212471, 1204068, 1198818, 1195707, 1195070, 1196951, 1200802, 1206640]
56111A206640Q121R708J0341J1536J4074J6389J7017J6812J7090J7457J7063J6367
56099A378615J6103J5957J5483J4825J3657J1206Q076O034N388M946N032P435
56087A502757J1638J4585J5644J8111K3891L0268L4502L8214M4265N2113N9512
56076A845500O6634P5361Q6067R7592J08896J18806J25812J29818J32175J32741
56066B919402J29479J22541J15653J11381J07921J02600R5375Q6566P4587N8823
56056C924328M1797K5589R179p915k2654l2717m0735n0683o2643p4509q6083r7626
56044C525328j06889j11719j13603j14843j14160j08928r9992r0670q2460p4980
56034B507084o8365o2574n6147m8761m2981m0520l9058l5898l2203l0214k8903
$$ y = [1206640, 1214761, 1224469, 1234810, 1246346, 1260420, 1276809, 1293826, 1310638, 1327728, 1345185, 1362248, 1378615, 1394718, 1410675, 1426158, 1440983, 1454640, 1465846, 1473922, 1479956, 1485344, 1490290, 1495322, 1502757, 1514395, 1528980, 1544624, 1562735, 1586626, 1616894, 1651396, 1689610, 1733875, 1785988, 1845500, 1912134, 1987495, 2073562, 2171154, 2280050, 2398856, 2524668, 2654486, 2786661, 2919402, 3048881, 3171422, 3287075, 3398456, 3506377, 3608977, 3704352, 3790918, 3865505, 3924328, 3966125, 3991714, 4000893, 3992978, 3970324, 3937607, 3896872, 3846189, 3783546, 3709037, 3622954, 3525328, 3418439, 3306720, 3193117, 3078274, 2964114, 2855186, 2755194, 2664524, 2582064, 2507084, 2438719, 2376145, 2319998, 2271237, 2228256, 2187736, 2148678, 2112780, 2080577, 2050363, 2021460]
56023B021460k6177k2911k0956j9390j6643j3977j3024j2159r196n324k557J52
56011A859298M174P413P768P702J0574J4788J6489J5907J6093J7419J8249J9103
55999B014977K1135K2505K1293K0123K2684K7398K9806K9603L0083L2033L3518
55988B305158L4574L6928L9928M1518M2232M4090M6869M9380N2450N6523N8938
55977B808588N8071N7406O0577O5402O7964O9371P2814P7197P9996Q3159Q9539
55966C590084R6407R9373J00085J03150J08167J11905J15626J22662J31235J37276
55956D715970J41989J49121J57381J63341J69064J78772J90705K00543K09887
55947F276773K22690K36489K46388K54619K66323K79192K87668K94434L06612
$$ y = [2021460, 1995283, 1972372, 1951416, 1932026, 1915383, 1901406, 1888382, 1876223, 1867027, 1861703, 1859146, 1859298, 1863472, 1870885, 1878653, 1886355, 1896929, 1911717, 1928206, 1944113, 1960206, 1977625, 1995874, 2014977, 2036112, 2058617, 2079910, 2100033, 2122717, 2150115, 2179921, 2209524, 2239607, 2271640, 2305158, 2339732, 2376660, 2416588, 2458106, 2500338, 2544428, 2591297, 2640677, 2693127, 2749650, 2808588, 2866659, 2924065, 2984642, 3050044, 3118008, 3187379, 3260193, 3337390, 3417386, 3500545, 3590084, 3686491, 3785864, 3885949, 3989099, 4097266, 4209171, 4324797, 4447459, 4578694, 4715970, 4857959, 5007080, 5164461, 5327802, 5496866, 5675638, 5866343, 6066886, 6276773, 6499463, 6735952, 6982340, 7236959, 7503282, 7782474, 8070142, 8364576, 8671188]
55938H671188L23341L38556L53566L74780M01085M25895M49913M79226N12477
55929A2330027N43073N72720O09245O52029O93094P31609P73707Q19417Q64181
55920A8589102R11653R69897J036434J102686J171194J251687J342316J432920
55912B7807889J524862J628754J745309J869578K011672K190055K406008K648803
55904D3832930K923622L246915L616321M016468M455398M964610N565205O270108
55896G8891577P117280Q157785R411989J0886913J2635008J4732399J7194574
55889A59027525J9986246K3103596K6489907K9756143L2063426L2415447L0092704
55882C52934994K4842068J6886625P037718l225139j2132587j8409291k1800056
$$ y = [8671188, 8994529, 9333085, 9686651, 10061431, 10462516, 10888411, 11338324, 11817550, 12330027, 12873100, 13445820, 14055065, 14707094, 15400188, 16131797, 16905504, 17724921, 18589102, 19500755, 20470652, 21507086, 22609772, 23780966, 25032653, 26374969, 27807889, 29332751, 30961505, 32706814, 34576392, 36588064, 38778119, 41184127, 43832930, 46756552, 50003467, 53619788, 57636256, 62091654, 67056264, 72621469, 78891577, 86008857, 94166642, 103578631, 114465544, 127100552, 141832951, 159027525, 179013771, 202117367, 228607274, 258363417, 290426843, 322842290, 352934994, 377777062, 394663687, 401701405, 398476266, 386343679, 367934388, 346134332]
55875C46134332k2885098k2497817k1331051j9875287j8448226j7191504j6115254
55868B07790095j5195317j4412002j3719329j3047285j2354528j1643189j0916926
55861A16501519j0161780r375578q582866p810403p071790o379940n748944n177165
55853E6193053m649541m161457l722434l334903k988936k679947k412591k184157
55845C0059087j981571j797949j636584j496809j371359j259213j165658j087693
55837A8262251j013918r40759q74806q17665p62549p07608o58781o17252n77214
55828A1291699n38203n06688m83040m59512m33628m11205l93497l73648l49278
55819G343000l26858l09924k93982k76688k62359k52334k41111k26394k13566
$$ y = [346134332, 323249234, 300751417, 279420366, 259545079, 241096853, 223905349, 207790095, 192594778, 178182776, 164463447, 151416162, 139061634, 127418445, 116501519, 106339739, 96964161, 88381295, 80570892, 73499102, 67119162, 61370218, 56193053, 51543512, 47382055, 43659621, 40324718, 37335782, 34655835, 32243244, 30059087, 28077516, 26279567, 24642983, 23146174, 21774815, 20515602, 19349944, 18262251, 17248333, 16307574, 15432768, 14615103, 13852554, 13144946, 12486165, 11868913, 11291699, 10753496, 10246808, 9763768, 9304256, 8870628, 8459423, 8065926, 7692278, 7343000, 7016142, 6706218, 6412236, 6135548, 5873189, 5620855, 5379744, 5153350, 4939784]
55810D939784k05954j99463j90944j83272j77888j70419j58150j44723j33570
55801C375401j23234j12485j03223r5405q5761p4539o6841o4542o3453o1059o0115
55790B464744o1785o2275n9600n7043n6480n4619m9458m4366m2078m0162l6180
55779A900698l2071k9884k7978k4883k2502k2456k3209k3302k3360k3169k1168
55768A626716j8514j8813k2141k4390k4141k4708k7545k9478k8797k8315k9599
55757A350275k9827k7554k6118k7794k9589k8442k6030k4800k3529k0408j6822
55746A069362j4628j3113j1424j0519j0281q488m984k878l320l353j333J03p58
55733I84386j446m96j119n828j1552j4188j4348j4638j4734j3334j1825j1913
$$ y = [4939784, 4733830, 4534367, 4343423, 4160151, 3982263, 3811844, 3653694, 3508971, 3375401, 3252167, 3139682, 3036459, 2941054, 2855293, 2780754, 2713913, 2649371, 2585918, 2524859, 2464744, 2402959, 2340684, 2281084, 2224041, 2167561, 2112942, 2063484, 2019118, 1977040, 1936878, 1900698, 1868627, 1838743, 1810765, 1785882, 1763380, 1740924, 1717715, 1694413, 1671053, 1647884, 1626716, 1608202, 1589389, 1567248, 1542858, 1518717, 1494009, 1466464, 1436986, 1408189, 1379874, 1350275, 1320448, 1292894, 1266776, 1238982, 1209393, 1180951, 1154921, 1130121, 1106592, 1086184, 1069362, 1054734, 1041621, 1030197, 1019678, 1009397, 1000909, 995925, 993047, 989727, 986374, 985041, 985144, 984386, 982940, 982444, 981325, 975497, 963945, 949757, 935409, 920771, 906037, 892703, 880878, 868965]
55721H68965j2131j0530q441q011q376p629o405o372p440r219j2730j7622k0399
55708G33660j8700j5098j3440j3641j3179j1520r802q051n970m734n279o440p210
55695F00596q814j2049j4891j5482j5200j5851j6098j3862j0332q278p912p543
55683D54284o844o576o367n496m693m688m389k923j863k842m559m716l517k701
55669C92110k494k088j768k101k364k092k763n485q477r299q240p166o397n201
55655C26175l984l518l190k256j490j459q49J159K624J696l1J19J699K410K241
55640C21346L069M913N836N139L860K557R98l73r78j466k299j902J280N659Q067
55625C55706P843O868O177N224M055L523L457K951K296K364K344N52k644m907
$$ y = [868965, 856834, 846304, 837863, 829852, 821476, 813847, 807442, 801070, 793630, 784411, 771681, 754059, 733660, 714960, 699862, 686422, 672781, 659602, 648082, 638280, 630229, 624259, 619525, 614246, 607806, 600596, 591782, 579733, 564842, 549360, 534160, 518309, 502211, 488349, 478017, 469739, 461827, 454284, 447440, 440864, 434497, 429001, 424308, 419620, 415231, 412308, 410445, 407603, 403044, 398328, 394811, 392110, 389616, 387528, 385760, 383659, 381295, 379203, 376440, 370955, 362478, 353179, 344939, 337773, 331376, 326175, 322191, 318673, 315483, 313227, 311737, 310278, 309429, 310588, 313212, 314908, 314877, 314996, 316695, 319105, 321346, 324415, 329328, 335164, 340303, 344163, 346720, 347718, 347345, 346367, 344901, 342602, 340700, 341980, 347639, 355706, 363549, 370417, 376594, 381818, 385873, 389396, 392853, 395804, 398100, 400464, 402808, 403360, 400716, 395809]
55611C95809n029l904k513j019J38K63k56l03K20M52L07N88J442K129K210J759
55595C92293P34o28j214j70J797L256L667L162J766pr73j078k030m607o859o933
55579C82176o141o812q444q755p642p170q041q920r112r272r413q771p811p972
55565B67900r068r203p785o364n887n190l172q75k70j844m201n486m955l621l200
55550A96779m012m487l395j693j056j517j983k209k680l145l016k663k723k627
55536A59573j524j82j61j388k321k228j698j080j67P19J045J322K495M090M490
55521A62985L114R70q60j964j999p76J039K467L323L986M530N040O115P906R413
55506B05289R960J0368J1402J2032J0997R083P981P632O546M114Q95k639n893
$$ y = [395809, 390780, 386876, 384363, 383344, 383482, 383745, 383489, 383186, 383406, 383858, 384165, 384753, 386195, 388324, 390534, 392293, 393027, 392399, 391185, 391015, 392812, 396068, 399735, 402897, 404663, 404656, 403683, 402605, 400575, 395968, 389109, 382176, 376035, 369223, 360779, 352024, 344382, 337212, 329171, 320251, 311139, 301867, 292454, 283683, 275872, 267900, 258832, 249629, 241844, 235480, 229593, 224403, 221231, 220356, 220086, 218242, 214041, 208555, 203600, 199979, 196779, 192767, 188280, 184885, 183192, 182136, 180619, 178636, 176427, 173747, 170602, 167586, 164923, 162200, 159573, 158049, 157867, 157706, 156318, 153997, 151769, 150071, 148991, 148824, 149543, 150588, 151910, 154405, 158495, 162985, 166099, 167069, 166209, 164245, 162246, 161470, 162509, 164976, 168299, 172285, 176815, 181855, 187970, 195876, 205289, 215249, 225617, 237019, 249051, 260048, 269131, 277112, 284744, 291290, 295404, 296299, 293660, 287767]
55493B87767p591p413p234q736j0747j1145j0293r956r931q714o840o283o807
55480A76077o163m042k579k543k156n37O65J37j110j710j702j438p20J68N00O79
55464A53526J808L321L368K014J495K538L007J439o01j060j70P36J258J344N06
55449A74529r67j660j183j081k322l627l662l273l929n324o191o395o591o635
55435A21689n843m347l111k976m124n746o087m061j196l24j870l183k381q13n11
55420G5116j171j430j528k547m058m448l241j423P7R88J123M68m27j032j491k019
55404E2957k276k051j775j601q94M55J156K31j221j326l5R73P27m8m11m59p30
55387D3672j170j238p34j86k63q28q89J08J192Q53r12k394k147m71J291K154J921
$$ y = [287767, 280176, 272763, 265529, 256793, 246046, 234901, 224608, 214652, 204721, 196007, 189167, 182884, 176077, 169914, 165872, 163293, 160750, 158594, 158057, 158722, 158859, 157749, 156039, 154337, 152899, 152179, 152347, 152847, 153526, 155334, 158655, 162023, 164037, 165532, 168070, 171077, 172516, 171915, 170855, 170685, 171421, 172679, 174023, 174529, 173562, 171902, 170719, 169638, 167316, 163689, 160027, 156754, 152825, 147501, 141310, 134915, 128324, 121689, 115846, 111499, 108388, 105412, 101288, 95542, 89455, 85394, 84198, 83874, 82004, 78821, 76440, 75627, 75116, 73945, 72515, 70987, 68440, 64382, 59934, 56693, 55270, 55347, 56335, 57458, 57926, 57499, 56467, 54976, 52957, 50681, 48630, 46855, 45254, 44360, 44815, 45971, 46202, 44981, 43655, 43620, 44593, 45320, 45272, 44861, 44402, 43672, 42502, 41264, 40530, 40344, 40081, 39253, 38364, 38472, 39664, 40517, 39605, 37211, 35064, 34593, 35884, 38038, 39959]
55370C9959J037L62N25J211J583J427J202J110R73R21J142J003k61j925k232q42
55354D7195O44R89Q04R98J168M22j105k509l074k401n21J596K529K114J665J963
55338E2477K053R36o19j068k35N16mj609k969k750r06J039J516P09R5L10N07n7
55320D9941j099k085k785k751j489M86J972K657L008K599M45k613l913k448m32
55305D1493k92j729l042l660l820l193j732o96j080j831j314J76J056R67R12J231
55289B3446J177M53k72n43o42q20q81p38o16o39o63n36k41J00J64k10o01m92j66
55270A7280k59n08j04N89K12j280k058j046M32P50L44O76J883K846K802J792K85
55253B4636p98o16J86j68j903k854j540M97J031K99r3q9o73j375p82Q17J611R92
$$ y = [39959, 40996, 41358, 41883, 43094, 44677, 46104, 47306, 48416, 49389, 50310, 51452, 52455, 52194, 50269, 48037, 47195, 47839, 48828, 49632, 50630, 51798, 52220, 51115, 48606, 45532, 43131, 42610, 44206, 46735, 48849, 50514, 52477, 54530, 55466, 54847, 53779, 53544, 54060, 54056, 52447, 49478, 46728, 45822, 46861, 48377, 49086, 49181, 49491, 49998, 49941, 48842, 46757, 43972, 41221, 39732, 40218, 42190, 44847, 47855, 50454, 50899, 48286, 44373, 41925, 41493, 41201, 39472, 36430, 32770, 28950, 25757, 24025, 23329, 22249, 20418, 19104, 19280, 20336, 21303, 22215, 23446, 24623, 25076, 24804, 24261, 23619, 22799, 21918, 21180, 20564, 19925, 19262, 18726, 18485, 18585, 18749, 18539, 17938, 17446, 17280, 17021, 16513, 16409, 16998, 17210, 15930, 13872, 12826, 13258, 14008, 14352, 15028, 16911, 19757, 22559, 24351, 24636, 23838, 23222, 23408, 23240, 21337, 18483, 16943, 17440, 18471, 18770, 18677, 18588, 17915, 16540, 15758, 16575, 18186, 19178]
55235A9178J54m4J36N74J487K237J822O73K88Q51R73M6r18j185j287j559j407
55218B2019p17m08o55j25J849L654L354J370k01l76qK7QM63J098J273J046J126
55200C4797J769K151J202j054l317m215l445j664K37J503J671Q86n7m55k73J64
55184B9900O89J195J385J140Q90J103J589J683R96k90j623k396k315j720j265
55169C0961j133j027q92j034j365j320q40n98q47r13l74J66J94L58J460L037L880
55152B9713L542K515J363M40J20M30P59N28k8k88j33J14K77L53L14K71M87R34
55134D1711J274J372J191L26j368k641j799Q15K778K611J407O44R5r23j800j685
55118D4008j146j249j877k318k442k107o71J484K267N91j495j369M53J344M58
$$ y = [19178, 19332, 19288, 19424, 19998, 21485, 23722, 25544, 26217, 26505, 27356, 28329, 28375, 27457, 26272, 24985, 23426, 22019, 21302, 20894, 20239, 20114, 21963, 25617, 28971, 30341, 30140, 29764, 29756, 29783, 29791, 30254, 31352, 32625, 33671, 34797, 36566, 38717, 39919, 38865, 35548, 31333, 27888, 26224, 26461, 27964, 29635, 30521, 30464, 30009, 29736, 29900, 30589, 31784, 33169, 34309, 35199, 36302, 37891, 39574, 40570, 40280, 38657, 36261, 33946, 32226, 30961, 29828, 28801, 27909, 26875, 25510, 24190, 23350, 22752, 21905, 20992, 20618, 20784, 20978, 21336, 22796, 25833, 29713, 33255, 35770, 37133, 37573, 37693, 38123, 38882, 39410, 39382, 39094, 38961, 39075, 39352, 39705, 40019, 40290, 40777, 41711, 42985, 44357, 45548, 45874, 44506, 41865, 40066, 40881, 43659, 46270, 47677, 48321, 48416, 47493, 45693, 44008, 42862, 41613, 39736, 37418, 34976, 32869, 32198, 33682, 35949, 36540, 35045, 33676, 34129, 35473, 35931]
55103C5931o64q18k02R32K413L139K047J9j153j454k238l341l116j502n44j230
55087B8219k049j605o66m78p20l30Q52K165K969K777J500R9r8R50J908J855J168
55070C8516N32K60N65J352J612M80j141j500o07j71p55r14K56J597J838J379J160
55053D4459J108P64K87k7k16OJ113K446K326L89j490j525j23J199J810J933J766
55036E6225J579J782K084J677Q78J240L070M303L195Q64l57l4N70Q77J286J575
55020H0814R70k06o32pM30j59r27o40O39J807K156J893J481J123R46J246K013
55003I2947K348J044j767m088l899j406J219K179J362l54k004k644j768j67M91
54988H3493n28k189k949k208l77J693K985K777J298n05j924k698k494j331l77
$$ y = [35931, 35267, 34449, 34247, 35179, 37592, 40731, 42778, 42797, 41644, 40190, 37952, 34611, 31495, 29993, 29449, 28219, 26170, 24565, 23899, 23421, 22701, 22371, 23223, 25388, 28357, 31134, 32634, 32733, 32635, 33585, 35493, 37348, 38516, 39048, 39308, 39873, 41225, 42837, 43317, 42176, 40676, 40069, 39898, 39143, 38229, 38485, 40082, 41920, 43299, 44459, 45567, 46331, 46618, 46591, 46375, 46381, 47494, 49940, 52266, 52655, 51165, 49640, 49517, 50716, 52526, 54459, 56225, 57804, 59586, 61670, 63347, 64225, 65465, 68535, 72838, 76033, 76897, 76540, 76506, 77076, 77953, 79239, 80814, 81784, 81578, 80946, 80939, 81369, 81210, 80283, 79643, 80282, 82089, 84245, 86138, 87619, 88742, 89688, 90934, 92947, 95295, 96339, 94572, 90484, 86585, 85179, 86398, 88577, 89939, 89585, 87581, 84937, 83169, 83002, 83493, 82965, 80776, 77827, 75619, 75242, 76935, 79920, 82697, 83995, 83490, 81566, 78868, 76374, 75043, 74666]
54973G4666j005k723l471k454j230j255j779j296M6Q87P49M60Q44J881K942L143
54957G0405K001K77l82O68K255L003K894K396J118j313l698m123k333k2J250J416
54941G5812J130P52M43L85M23J2j053k151k423j720o43K87J154K152K816K383
54925G9759J066K79Q78J803J456J34k34J079K417K049N88P9J211K444K004L8j494
54908I5556j063O59J627J090N27J440L123L847L528L620M634N488N472N181N202
54893A39931N393N890P195Q748R130Q483Q964J1728J5068J6864J7426J8351J9771
54880B92942K0424J9685J7836J4873J0592N560O93l808q052j1430j3280j4166
54868C31869j5170j6099j5741j3969j2283j1907j2248j1839j0232q474p793q079
$$ y = [74666, 73661, 70938, 67467, 65013, 63783, 62528, 60749, 59453, 59499, 60386, 61135, 61595, 62439, 64320, 67262, 70405, 72406, 72683, 72301, 72969, 75224, 78227, 81121, 83517, 84635, 83322, 79624, 75501, 73168, 73146, 74396, 75812, 76942, 77694, 78137, 78522, 78945, 78957, 77904, 75753, 73330, 71610, 70967, 71254, 72408, 74560, 77376, 79759, 80825, 81104, 81982, 83785, 85241, 85375, 85141, 86220, 88637, 90686, 91274, 91353, 92564, 95008, 97012, 97050, 95556, 94493, 95152, 96779, 97869, 98396, 99836, 102959, 106806, 110334, 113954, 118588, 124076, 129548, 134729, 139931, 145324, 151214, 158409, 167157, 176287, 184770, 193734, 205462, 220530, 237394, 254820, 273171, 292942, 313366, 333051, 350887, 365760, 376352, 381912, 382605, 378797, 370745, 359315, 346035, 331869, 316699, 300600, 284859, 270890, 258607, 246700, 234452, 222613, 212381, 203907, 196114, 188035]
54856A88035p925o225l428p80J187K583L043K149R31J309L568N956P390Q816J0974
54841B17583J2669J2769J2395J3249J4865J5348J4070J1821Q920N054O56l320
54829C36079o766j0053j2477j2812j1388j0187j0603j2285j4146j5269j4870j2705
54817A92518r743p566o858p220q109q929q555o250l080j199j512k981m218m645
54803A11653m170k892j443o21m98n97p80j115j139m10L91K27m90l46P72J295L48
54786A00185j054j736j996k528k892k208p83Q6k66j372k514l400l824l254j422
54771G1022Q32J844Q20j005j598m89R82J670J690J189k87k151k140Q61M436N175
54755H2851L072J326J985L785M525L566J600k17l14K326O305Q399O980L855J896
$$ y = [188035, 180110, 173885, 170457, 169677, 170864, 173447, 176490, 178639, 179570, 180879, 184447, 190403, 197793, 206609, 217583, 230252, 243021, 255416, 268665, 283530, 298878, 312948, 324769, 333689, 338743, 339399, 336079, 329313, 319260, 306783, 293971, 282583, 272396, 261793, 249508, 235362, 220093, 205223, 192518, 182775, 175209, 168351, 161131, 153022, 144093, 135538, 129288, 126208, 125009, 123497, 120516, 116298, 111653, 107483, 104591, 103148, 102527, 102029, 101432, 100652, 99537, 98398, 97988, 98379, 98606, 98116, 97770, 98542, 99837, 100185, 99131, 97395, 95399, 92871, 89979, 87771, 86988, 87074, 86808, 85436, 82922, 79522, 75698, 72444, 71022, 71854, 73698, 74518, 73513, 71915, 71426, 72408, 74078, 75768, 76957, 76670, 74519, 72379, 73240, 77676, 82851, 85923, 87249, 89234, 93019, 97544, 101110, 102710, 102493, 102179, 104505, 110810, 119209, 126189, 130044, 131940]
54740A31940J919K722L182L328L992O075R565J2957J4475J4280J4311J5597J6955
54727B51298J7113J6545J6125J5219J2777R482P069N812M267J479j903m789o753
54714C43741p803q129q480r737j1549j2212j0608p801n922n738o055n533m304
54701B39870l444l301l105k179q46K12J060K405M514O764Q360R171R701J0571
54687B79753J2152J4480J7194J9608K0967K0846J9417J7266J4768J1665P570K800
54675D58486j682n353q661j2185j5595j7867j8326j7229j5581j4527j4583j5216
54663C01681j5429j4899j4065j3123j1723r886q398p722p387o932o581o297n303
54650A73936l631k947m344o128n648l004j002j326k578k629j364j63J08l98j229
$$ y = [131940, 133859, 136581, 139763, 143091, 147083, 153158, 162723, 175680, 190155, 204435, 218746, 234343, 251298, 268411, 284956, 301081, 316300, 329077, 338559, 345628, 351440, 355707, 357186, 355283, 350494, 343741, 335938, 327809, 319329, 309592, 298043, 285831, 275223, 267422, 261500, 255762, 249707, 244174, 239870, 236426, 233125, 230020, 227841, 226995, 227207, 228267, 230672, 235186, 241950, 250310, 259481, 269182, 279753, 291905, 306385, 323579, 343187, 364154, 385000, 404417, 421683, 436451, 448116, 455686, 458486, 456804, 451451, 442790, 430605, 415010, 397143, 378817, 361588, 346007, 331480, 316897, 301681, 286252, 271353, 257288, 244165, 232442, 222556, 214158, 206436, 199049, 192117, 185536, 179239, 173936, 170305, 167358, 163014, 156886, 151238, 148234, 147232, 145906, 143328, 140699, 139335, 139172, 139280, 138882, 137653]
54635A37653j916j891r21M29J176Q75J10%J022K182J894mj745j786p98n26j215
54618A34539j420l39J076J609J392J499K496L802M135K666P6j623r16J699M371
54603A55062N677N389M196L380M117O083P353O647N062M436M833N021M710M512
54589B26478M256L285K110J864K136J503J78oJ459L073M057N476P766R425R403
54574B82463Q868R200R861R768R371R750J0687J0975R821O967K504k345n517o406
54560C65967o797q354j0321j1111j0866j0700j0442r083p042n944o270o792o485
54547B55760n599m644l580k404j614j671k392l100l095k231j266j319k570l976
54533B16299m665m942n413n800n433m419l499k985k627k218j834j688k111l308
$$ y = [137653, 135737, 133846, 132925, 133354, 134530, 135405, 135515, 135515, 136537, 138719, 140613, 140609, 138864, 137078, 136280, 135754, 134539, 133119, 132780, 133856, 135465, 136857, 138356, 140852, 144654, 148789, 151455, 151531, 149908, 148992, 150691, 155062, 160739, 166128, 170324, 173704, 177821, 183904, 191257, 197904, 202966, 207402, 212235, 217256, 221966, 226478, 230734, 234019, 236129, 237993, 240129, 241632, 241810, 241804, 243263, 246336, 250393, 255869, 263635, 273060, 282463, 291331, 300531, 310392, 320160, 329531, 339281, 349968, 360943, 370764, 377731, 380235, 377890, 372373, 365967, 359170, 350816, 340495, 329384, 318518, 307818, 297376, 288293, 281251, 275307, 269037, 262245, 255760, 250161, 245517, 241937, 239533, 237919, 236248, 233856, 230756, 227661, 225430, 224164, 222845, 220275, 216299, 211634, 206692, 201279, 195479, 190046, 185627, 182128, 179143, 176516, 174298, 172464, 170776, 168665, 165357]
54519A65357m812n718n752n513n302m561k951j249n39j127k579m062m373k799
54505A14020m50N57j96r09n62o53k576m834m916k908j138p86q15j04J103J968
54489I6801K000J197L39O63K246L224K048j57j023r4J242K381L782M731L467J67
54473A23014k385k162k07J512K816M496O236P035O973O917O854N971M352L268
54459A74690L557M506M819M042K698J318j48j969l973n449n712m697l090j979
54445A68613k162l455m715m897m066l059k359k029k433l822n003l948o14K081
54431A28132J511j306l056k339r21r65k569m332n067m296k139N55K433K701J901
54416A10243J359J877L043L706L307K553K415K617K001N60k8J340L436M191L178
$$ y = [165357, 160545, 154827, 149075, 143562, 138260, 133699, 130748, 129499, 128960, 127833, 125254, 121192, 116819, 114020, 113570, 114127, 113931, 113022, 112460, 111807, 109231, 104397, 99481, 96573, 95435, 94649, 93834, 93730, 94833, 96801, 98801, 99998, 100337, 101000, 103246, 106470, 108518, 108361, 107338, 107244, 108486, 110867, 114649, 119380, 122847, 123014, 120629, 118467, 118260, 119772, 122588, 127084, 133320, 140355, 147328, 154245, 161099, 167070, 171422, 174690, 178247, 182753, 187572, 191614, 194312, 195630, 195482, 193513, 189540, 184091, 178379, 173682, 170592, 168613, 166451, 162996, 158281, 153384, 149318, 146259, 143900, 141871, 139438, 135616, 130613, 126665, 126051, 128132, 129643, 128337, 125281, 122942, 122021, 121056, 118487, 114155, 109088, 104792, 102653, 103208, 105641, 108342, 110243, 111602, 113479, 116522, 120228, 123535, 126088, 128503, 131120, 133121, 133681, 133653, 134993, 138429, 142620, 145798]
54401A45798J489L7p49k50J633L402L212J267n08j202j726k727l331k711j602
54386A42032j275j843k470k727k931l341l483k515k53K111K786J285q68j872j607
54371A23029j156j001p83m12k39k51j79k98r83j631j229Q6J250J919K604L211
54355A23937K967J903R24K03q28j677q41J636L507L287K305K495L542L794L017
54340A50171K617L528N259O853P611P055N272L309K423K870L861M591M826M648
54326B14894M171L424K306Q33n06j174j404k009l128l975m143m322n165o173o413
54311A87216n674m379k880j564r51r68p69L5M78m64k248l402l405k853k169j261
54295A54742l80j64n64p26k70J09k29q27p89l9P24J135J599K434L159L038K303
$$ y = [145798, 147287, 147324, 146575, 146325, 147958, 151360, 154572, 155839, 155331, 154129, 152403, 149676, 146345, 143634, 142032, 140757, 138914, 136444, 133717, 130786, 127445, 123962, 121447, 121194, 123305, 126091, 127376, 126508, 124636, 123029, 121873, 120872, 120089, 119677, 119438, 119187, 119008, 118710, 117727, 116096, 114867, 114953, 116203, 118122, 120726, 123937, 126904, 128807, 129731, 129934, 129106, 127429, 126588, 128224, 131731, 135018, 137323, 139818, 143360, 147154, 150171, 152788, 156316, 161575, 168428, 176039, 183094, 188366, 191675, 194098, 196968, 200829, 205420, 210246, 214894, 219065, 222489, 224795, 225628, 225122, 223948, 222544, 220535, 217407, 213432, 209289, 204967, 199802, 193629, 187216, 181542, 177163, 174283, 172719, 171768, 170800, 170031, 170066, 170544, 170080, 167832, 164430, 161025, 158172, 156003, 154742, 154362, 154198, 153634, 152908, 152638, 152747, 152518, 151691, 150902, 150863, 151587, 152722, 154321, 156755, 159914, 162952, 165255]
54278A65255K173L399N153N879N117L838K966K181O12j665l363l192j364L16Q7
54263A87392j783l086k215j76P31j69j532k364l285m851o041n572l889k699k890
54248A47571l905m875n395n278m487l424k635k155j600j006j019k002l279l584
54234A02927k283j23J342J308O01O67J730K475J719j68j855k547k485k261k153
54219I8894k017j604j011p88j301k068k244j726j084l69J001K869L862L142J729
54204I7285J206J709K235K397K621K836K253P28o98j050n33j6M2k20n06o08m80
54187A09201m21r11j936k629k023k55J294J375L07l27M70J951K626K035R37k0
54171A11674r80k019k419j450M42J754J306o55k572k871j369O32J801K127K344
$$ y = [165255, 167428, 170827, 175980, 181859, 186976, 190814, 193780, 195961, 196573, 194908, 191545, 188353, 186989, 187305, 187392, 185609, 182523, 180308, 180132, 180863, 180694, 179162, 176798, 173513, 168662, 162621, 157049, 153160, 150461, 147571, 143666, 138791, 133396, 128118, 123631, 120207, 117572, 115417, 113817, 112811, 111792, 109790, 106511, 102927, 100644, 100521, 101863, 103171, 103772, 104439, 106169, 108644, 110363, 110195, 108340, 105793, 103308, 101047, 98894, 96877, 95273, 94262, 93474, 92173, 90105, 87861, 86135, 85051, 84682, 85683, 88552, 92414, 95556, 97285, 98491, 100200, 102435, 104832, 107453, 110289, 112542, 113270, 112572, 111522, 110989, 110973, 111015, 110795, 110289, 109681, 109201, 108780, 107869, 105933, 103304, 101281, 101026, 102320, 103695, 104002, 103675, 104145, 106096, 108722, 110757, 111694, 111674, 110694, 108675, 106256, 104806, 105248, 107002, 108308, 107653, 105081, 102210, 100841, 101473, 103274, 105401, 107745]
54156A07745K483J884O52q3K81R66J049P44Q18J359J869K079K089J955J601Q78
54140A28369m26k114l182k730j439r75j581j689n35L56m36j797j692j49J103J233
54124A12316P38j59j469k234j410J1J2j199j188Q95K758K267J51j815l361m684
54108A01629m630k208R84K214J120k01m44m25r61j417j090n27m86o87n51k78k79
54091I1763k32L18R14P36r6o49n68n00j046k012k815l025k375q53Q41J535P38
54074H2674o12j114m54L42K32o29j148o19L93O61k43j353j423l98O35Q81O06M60
54056G8891O37R61J211R91o4j470j884o56J068J579O61m42q51r05j207j693j919
54039G4908j603p07N61J767K705L659M712N163M426L216K741K934K591J309k3
$$ y = [107745, 110228, 112112, 112764, 112681, 112962, 113928, 114977, 115721, 116539, 117898, 119767, 121846, 123935, 125890, 127491, 128369, 127943, 125829, 122647, 119917, 118478, 117503, 115922, 114233, 113698, 114054, 113618, 111821, 110129, 109980, 111083, 112316, 113054, 112895, 111426, 109192, 107782, 107793, 107805, 106606, 105418, 106313, 109071, 111338, 111489, 109674, 106313, 101629, 96999, 94791, 95775, 97989, 99109, 98908, 98464, 98039, 97078, 95661, 94571, 94044, 93558, 92871, 92320, 92042, 91763, 91531, 91849, 92763, 93499, 93403, 92754, 92186, 91686, 90640, 88628, 85813, 82788, 80413, 79560, 80401, 81936, 82674, 82062, 80948, 80494, 80836, 81068, 80439, 79291, 78672, 79065, 79726, 79483, 78130, 76707, 76309, 76944, 77825, 78431, 78891, 79528, 80489, 81700, 82691, 82627, 81157, 79273, 78617, 79685, 81264, 81925, 81483, 80632, 79727, 78520, 76827, 74908, 73305, 72598, 73159, 74926, 77631, 81290, 86002, 91165, 95591, 98807, 101548, 104482, 107073, 108382, 108359]
54024A08359o92q66n96L12J069K28j991l250k059K34J528J611J321N44j049k293
54008A02410j784l26J5r50j282N1J841K685K597K064J159L14N29J915L112K970
53992A17320J854P33p3n11k73N91J386J868K626L582L360J432j40J103M489O755
53976A46102O200M606M447N697O545O224N779O220P223P885P931P716P512P310
53962B37397P114P002O998P164P685Q457Q716P700N842M680N159O366O482M830
53948C31592K434P10J14K02M83Q19J094Q24n84l020n302o105n331m164l557l301
53932C06908k972l133m647p037q572q194o644n331m697m182l416k872l232m353
53918B37626n127m557k941j605j312j321m42J305K600K304N93j255j837o20J494
$$ y = [108359, 107667, 106801, 106205, 106517, 107586, 107814, 105823, 102573, 100514, 100748, 102276, 103887, 105208, 105752, 104703, 102410, 100626, 100300, 100315, 99365, 98083, 98134, 99975, 102660, 105257, 107321, 108480, 108794, 109323, 111238, 114350, 117320, 119174, 119907, 119834, 119323, 119050, 119641, 121027, 122895, 125521, 129103, 132463, 133895, 133755, 134858, 139347, 146102, 152302, 156908, 161355, 167052, 173597, 179821, 185600, 191820, 199043, 206928, 214859, 222575, 230087, 237397, 244511, 251513, 258511, 265675, 273360, 281817, 290533, 298233, 304075, 308755, 313914, 320280, 326762, 331592, 334026, 334736, 334850, 335052, 335535, 336354, 337448, 338272, 337688, 334668, 329366, 323261, 317930, 313766, 310209, 306908, 303936, 300803, 296156, 289119, 280547, 272353, 265709, 260378, 255681, 251499, 248083, 245211, 241979, 237626, 232499, 227942, 225001, 223396, 222084, 220763, 220321, 221626, 224226, 226530, 227123, 225868, 224031, 223411, 224905]
53903B24905K789K391J235P88J181J358Q59M32P16J330J643J617J462J181R18
53888B44805J114J739K071J755J458J804K253J928J116J019K056L332L863L653
53874B73966L294L132L168L352L652M019M381M633M581M147L656L642M191M687
53860C28501M349L037J485P27J165K141K587K338K510M180O843Q728Q690P286
53846C84567N870N282N718P178R211J0543R923P585N212M231M473M720M087K608
53832D71208R19l59j083j728k734l740l982l644m021n820q061r393r855j0360
53818D07347j0932j0743r770r087r274r649r457q842q146p189n914n044n374o775
53804B91151q271q785p653n238l216l312n148o233m867k209o56r31j962k978m328
$$ y = [224905, 227694, 230085, 231320, 232108, 233289, 234647, 235506, 235938, 236654, 237984, 239627, 241244, 242706, 243887, 244805, 245919, 247658, 249729, 251484, 252942, 254746, 256999, 258927, 260043, 261062, 263118, 266450, 270313, 273966, 277260, 280392, 283560, 286912, 290564, 294583, 298964, 303597, 308178, 312325, 315981, 319623, 323814, 328501, 332850, 335887, 337372, 338099, 339264, 341405, 343992, 346330, 348840, 353020, 359863, 368591, 377281, 384567, 390437, 395719, 401437, 408615, 417826, 428369, 438292, 445877, 451089, 455320, 459793, 464513, 468600, 471208, 472127, 471768, 470685, 468957, 466223, 462483, 458501, 454857, 450836, 445016, 436955, 427562, 417707, 407347, 396415, 385672, 375902, 366815, 357541, 347892, 338435, 329593, 321447, 314258, 308344, 303300, 297926, 291151, 282880, 274095, 266442, 261204, 257988, 254676, 249528, 243295, 238428, 236219, 235563, 234632, 232670, 229692, 225364]
53789B25364o228p906q318p080m646k121q17j236k478l129k755j983j327p08p5
53774A74557K62J04m11j145k062k758k519j136N87J416P53q50k148k216j128L30
53758A61636J456J934J643P47j17l86l01l05J74K059M621N595M078J933J313J990
53742A88070K435K361K644L477M301N036N909O458O200N883O555P701P878O871
53728B61779N620M401K894J870K724N120P058P583P546P307N844L014N93j59l58
53713C22836j450k692k329m29R36J67k193m127l994k146q20j811m246n640n174
53698B86888m443m744n334n163m602m281l666k219p56k91m36l30k42q16j488j209
53682B46868k39K88K03L11Q21J047O02k56j351k560l193k507q82M06P22O30R22
$$ y = [225364, 219136, 211230, 202912, 195832, 191186, 189065, 188248, 187012, 184534, 181405, 178650, 176667, 175340, 174632, 174557, 174819, 174923, 174512, 173367, 171305, 168547, 166028, 164892, 165479, 166895, 167648, 166798, 164650, 162434, 161306, 161636, 163092, 165026, 166669, 167416, 167299, 166913, 166612, 166307, 166481, 168540, 173161, 178756, 182834, 184767, 186080, 188070, 190505, 192866, 195510, 198987, 203288, 208324, 214233, 220691, 226891, 232774, 239329, 247030, 254908, 261779, 267399, 271800, 274694, 276564, 279288, 284408, 291466, 299049, 306595, 313902, 319746, 322760, 323353, 323194, 322836, 321386, 318694, 316365, 315936, 316872, 317039, 314846, 310719, 306725, 304579, 303759, 301948, 297702, 292062, 286888, 282445, 277701, 272367, 267204, 262602, 258321, 254655, 252436, 251680, 251389, 250953, 250623, 250381, 249565, 248077, 246868, 246629, 246917, 247120, 247431, 248252, 249299, 249901, 249645, 248294, 245734, 242541, 240034, 239152, 239558, 240280, 240910, 241832]
53665B41832J716K517K611J570k22j706k244k131j758r78M9K57r88k580k909k023
53649B33013j364j540j649q09O74J999K866L421L642L214J877J03p24N59L179
53634B48461M691L651J329K5M16J564K736L844M449L907K622J944K550L809M916
53619B90914N852O902P877Q023O580L635O57m93L75J359Q75l53p15k02j1l22k61
53602C30692J12l51j856l092l089k299j509r71r90j911l007k805j160K91M38J16
53586C08609K63Q3j497l521l899k313o76m65q85j87J957M150M967M314K968J454
53570C15322j40j363j430l66O46P96Q96K077L722M024K624J287J590K999L876
53555C36560L542K697K315K744L573M075M008M092N107O606P223O440N236M658
$$ y = [241832, 243548, 246065, 248676, 250246, 250024, 248318, 246074, 243943, 242185, 241207, 241256, 241513, 240525, 237945, 235036, 233013, 231649, 230109, 228460, 227651, 228325, 230324, 233190, 236611, 240253, 243467, 245344, 245447, 244723, 245282, 248461, 253152, 256803, 258132, 258157, 258573, 260137, 262873, 266717, 271166, 275073, 277695, 279639, 282189, 285998, 290914, 296766, 303668, 311545, 319568, 326148, 329783, 330440, 329947, 330322, 331681, 332556, 332203, 331488, 331286, 331275, 330953, 330692, 330804, 330453, 328597, 325505, 322416, 320117, 318608, 317637, 316647, 314736, 311729, 308924, 307764, 308055, 308493, 308609, 308872, 308955, 307458, 303937, 300038, 297725, 297049, 296584, 295699, 295512, 297469, 301619, 306586, 310900, 313868, 315322, 315182, 313819, 312389, 312023, 312669, 313465, 314361, 316438, 320160, 324184, 326808, 328095, 329685, 332684, 336560, 340102, 342799, 345114, 347858, 351431, 355506, 359514, 363606, 368713, 375319, 382542, 388982, 394218, 398876]
53541C98876M548M179L515L243L936N520P280Q136P396N513L833L469M700P105
53527D71249R576J0442Q744N627L512L561M859O096O805O693N330L255K019K161
53513E49929K298J410P58K038M559O000N557M565M112L655K403P08m98q81q28
53498E85785r15j412j900j393O20L227M791M567L134J516N39Q18K409M358N443
53483F11587N552N607O081O363N855M884M160M019M572N931P710Q794Q220O186
53469F95521M009L190M470P211R632J0328R806R849J1157J2498J2810J3005J4535
53456H18021J6930J8304J8170J8068J9077K0267K0517K0569K1877K4080K5215
53445A041095K4423K3074K2973K4469K6843K9470L1855L3303L3604L3681L4664
$$ y = [398876, 403424, 407603, 411118, 414361, 418297, 423817, 431097, 439233, 446629, 452142, 455975, 459444, 464144, 471249, 480825, 491267, 500011, 505638, 509150, 512711, 517570, 523666, 530471, 537164, 542494, 545749, 547768, 549929, 552227, 553637, 554395, 556433, 560992, 566992, 572549, 577114, 581226, 584881, 587284, 587992, 587494, 586613, 585785, 584870, 583458, 581558, 580165, 580785, 584012, 588803, 593370, 596504, 598020, 598559, 599377, 601786, 606144, 611587, 617139, 622746, 628827, 635190, 641045, 645929, 650089, 654108, 658680, 664611, 672321, 681115, 689335, 695521, 699530, 702720, 707190, 714401, 724033, 734361, 744167, 754016, 765173, 777671, 790481, 803486, 818021, 834951, 853255, 871425, 889493, 908570, 928837, 949354, 969923, 991800, 1015880, 1041095, 1065518, 1088592, 1111565, 1136034, 1162877, 1192347, 1224202, 1257505, 1291109, 1324790, 1359454]
53434A359454L6431L7879L8477L8674L8865L8858L8628L8633L8996L9136L8738
53423A782769L8318L8228L7740L6157L4292L3664L4309L4660L3880L3118L3663
53412B170798L4864L4998L3823L2873L3101L3460L2458L0178K7805K5747K3391
53401B513496K0514J7777J5553J3306J0659Q172O330M545J999j115m173p402j1342
53388B588319j5254j7594j8263j8944k0600k2065k2089k1555k2238k4128k5696
53377B359893k6580k8153l1070l3729l4157l2480l0519k9595k9577k9601k8743
53366B025689k6321k2557j8971j7063j6530j5745j4128j2825j2467j1615q688
53355A848779m546j551l78N88K528M608N750O541Q219J0740J3144J5166J7329
$$ y = [1359454, 1395885, 1433764, 1472241, 1510915, 1549780, 1588638, 1627266, 1665899, 1704895, 1744031, 1782769, 1821087, 1859315, 1897055, 1933212, 1967504, 2001168, 2035477, 2070137, 2104017, 2137135, 2170798, 2205662, 2240660, 2274483, 2307356, 2340457, 2373917, 2406375, 2436553, 2464358, 2490105, 2513496, 2534010, 2551787, 2567340, 2580646, 2591305, 2599477, 2605807, 2610352, 2612351, 2611236, 2607063, 2599661, 2588319, 2573065, 2555471, 2537208, 2518264, 2497664, 2475599, 2453510, 2431955, 2409717, 2385589, 2359893, 2333313, 2305160, 2274090, 2240361, 2206204, 2173724, 2143205, 2113610, 2084033, 2054432, 2025689, 1999368, 1976811, 1957840, 1940777, 1924247, 1908502, 1894374, 1881549, 1869082, 1857467, 1848779, 1844233, 1842682, 1842304, 1842892, 1845420, 1850028, 1855778, 1862319, 1870538, 1881278, 1894422, 1909588, 1926917]
53342A926917J9770K2192K4747K7816L0941L3112L4251L5440L7495M0230M3291
53331B276202M6653M9992N2524N4146N5883N8613O2005O5271O8222P0897P2811
53320B933219P3553P3705P4233P5166P5680P5442P5038P5059P5374P5351P4214
53309C756034P1302O6771O2027N8647N6589N4128N0026M4910M0035L5350K9794
53298D325613K3144J6432J0362M290k692j0248j7091k2493k6815l0690l4465l8503
53286D196844m3303m8815n3953n7360n8747n9201o0127o1879o3437o3536o2233
53275C564253o1231o2145o4542o6262o5754o3516o0953n8706n6775n5462n5021
53264B893886n4619n2900m9709m6320m3677m1297l8412l5343l2982l1439l0001
$$ y = [1926917, 1946687, 1968879, 1993626, 2021442, 2052383, 2085495, 2119746, 2155186, 2192681, 2232911, 2276202, 2322855, 2372847, 2425371, 2479517, 2535400, 2594013, 2656018, 2721289, 2789511, 2860408, 2933219, 3006772, 3080477, 3154710, 3229876, 3305556, 3380998, 3456036, 3531095, 3606469, 3681820, 3756034, 3827336, 3894107, 3956134, 4014781, 4071370, 4125498, 4175524, 4220434, 4260469, 4295819, 4325613, 4348757, 4365189, 4375551, 4379841, 4377149, 4366901, 4349810, 4327317, 4300502, 4269812, 4235347, 4196844, 4153541, 4104726, 4050773, 3993413, 3934666, 3875465, 3815338, 3753459, 3690022, 3626486, 3564253, 3503022, 3440877, 3376335, 3310073, 3244319, 3180803, 3119850, 3061144, 3004369, 2948907, 2893886, 2839267, 2786367, 2736658, 2690338, 2646661, 2605364, 2566952, 2531609, 2498627, 2467188, 2437187]
53253B437187k8222k6418k5023k4037k3226k2541k2127k2063k2185k2066k1061
53242B178218j8593j4721j0595p969p735q787q861o773l478o01J571M006P075
53229B102757R793J1116J1392J1964J3636J5984J8131J9863K1751K4279K7164
53218B287830K9730L1693L3113L3696L2930L1102K9473K8927K8952K8466K7064
53207B622976K4887K1973J8573J5588J3622J1963R402N888K344p98l792o571q797
53194B727258j0918j3796j7104j9332j9831j9675k0161k1584k3874k7193l1056
53183B502734l3989l4971l4597l4115l3955l3811l3499l3109l2804l2901l3509
53172B131474l3898l3159l1801l1429l2281l2486l0796k8648k7958k8098k6987
$$ y = [2437187, 2408965, 2382547, 2357524, 2333487, 2310261, 2287720, 2265593, 2243530, 2221345, 2199279, 2178218, 2159625, 2144904, 2134309, 2126340, 2118605, 2109818, 2100957, 2094184, 2090706, 2090105, 2091676, 2095682, 2102757, 2112550, 2123666, 2135058, 2147022, 2160658, 2176642, 2194773, 2214636, 2236387, 2260666, 2287830, 2317560, 2349253, 2382366, 2416062, 2448992, 2480094, 2509567, 2538494, 2567446, 2595912, 2622976, 2647863, 2669836, 2688409, 2703997, 2717619, 2729582, 2738984, 2744872, 2747216, 2746418, 2742626, 2736055, 2727258, 2716340, 2702544, 2685440, 2666108, 2646277, 2626602, 2606441, 2584857, 2560983, 2533790, 2502734, 2468745, 2433774, 2399177, 2365062, 2331107, 2297296, 2263797, 2230688, 2197884, 2164983, 2131474, 2097576, 2064417, 2032616, 2001187, 1968906, 1936420, 1905624, 1876976, 1849018, 1820920, 1793933]
53161A793933k4625k3335k4240k5460k4528k1343j7802j5384j4087j3430j3464
53150A576235j4487j6177j7549j7957j7797j7852j8216j8472j8738j9596k0907
53139A378487k1686k1582k1390k1559k1215j9617j7739j7246j8335j9694k0300
53128A158124k0261k0042j9798j9569j9462j9556j9914k0522k0998k0877k0401
53117I36724k0323k0600k0249j9111j8557j9423k0336j9485j7178j5170j4104
53106G32188j3253j2382j2097j2479j2933j3373j4051j4295j3064j0896r645r947
53094E83773j0530j0368r929r650q936p509o352o188o248n681n094n423o197o244
53080D79424n568n176n374n439m893m092l500l247l505m438n621o049n166l592
$$ y = [1793933, 1769308, 1745973, 1721733, 1696273, 1671745, 1650402, 1632600, 1617216, 1603129, 1589699, 1576235, 1561748, 1545571, 1528022, 1510065, 1492268, 1474416, 1456200, 1437728, 1418990, 1399394, 1378487, 1356801, 1335219, 1313829, 1292270, 1271055, 1251438, 1233699, 1216453, 1198118, 1178424, 1158124, 1137863, 1117821, 1098023, 1078454, 1058992, 1039436, 1019522, 999000, 978002, 957125, 936724, 916401, 895801, 875552, 856441, 837884, 818461, 798125, 778640, 761462, 746292, 732188, 718935, 706553, 694456, 681977, 669044, 655671, 641620, 627325, 614261, 603365, 593720, 583773, 573243, 562875, 552946, 543296, 534360, 526851, 520499, 514311, 508063, 502382, 497288, 491865, 485668, 479424, 473856, 468680, 463306, 457867, 452974, 448882, 445382, 442135, 438630, 434192, 428571, 422522, 417356, 413764]
53066D13764k603k926m120n055n008m237l488l037k525j584l09Q32J132p2k624
53051C78140m952n061k561P42K645K561J450K58q22j740j885n38K064M458N109
53036C79868L838J887M68l08r24j557k136k821l668m186l954l392l135l026k556
53021C54398k101k601m040n344n915o253o810p181o815n793m509l352k860l388
53007B87436m409m892m574m005l323k093o24j09r31j968k310k495l206l839l376
52992B45282k013p54l4L84N43K26n35j560k693l435k994j393J71P32O18M12k51
52975B32706j761l225l367k391j696j891k252k009j136L3J078J415P51l75j191
52960B14689j624k012k268k142j877j772j412m07N91P18M43R08J973K304J469
$$ y = [413764, 411161, 408235, 404115, 399060, 394052, 389815, 386327, 383290, 380765, 379181, 378872, 379704, 380836, 380764, 378140, 373188, 368127, 365566, 366308, 368953, 371514, 372964, 373222, 372400, 370660, 368775, 368237, 370301, 374759, 379868, 383706, 385593, 386061, 385753, 384829, 383272, 381136, 378315, 374647, 370461, 366507, 363115, 359980, 356954, 354398, 352297, 349696, 345656, 340312, 334397, 328144, 321334, 314153, 307338, 301545, 297036, 293684, 290824, 287436, 283027, 278135, 273561, 269556, 266233, 264140, 263516, 263407, 262476, 260508, 258198, 255703, 252497, 248658, 245282, 243269, 242515, 242481, 242865, 243408, 243634, 243099, 241539, 238846, 235411, 232417, 231024, 231195, 231927, 232545, 232957, 232706, 230945, 227720, 224353, 221962, 220266, 218375, 216123, 214114, 212978, 213011, 214089, 215504, 216255, 215880, 214689, 213065, 211053, 208785, 206643, 204766, 202994, 201582, 201175, 201766, 202484, 202927, 203835, 205808, 208112, 209581]
52945B09581M52j6j44K6Q61J764J232q94k589k110j18J590K395K687K483J577
52929B18777N30J46K64J58k64o46j117j876k203j236L91J089N78K81J124K184
52913B18180K201J268K87l36n25J00J727L608M873N690O569O850N243K140N1Q90
52897B58816L637N641N736N077N077N706O185O370O628O799O239M858L452K652
52883C32873K218J670J199J207J254L49j480k806k576j605j475k322k790k187
52869C23529j463j666k447k945l285m082m929m606k828p30N85J021Q69J68q39
52854B96352j490j463j185j019p19j81R2q4N7R68J630Q47o78j001L38J704J743
52837B95911J117J126J696J745R60J32q7J28L76O35J030J409J403Q45J09n3P65
$$ y = [209581, 210033, 210017, 209873, 209899, 210760, 212524, 213756, 212862, 210273, 208163, 208045, 209635, 212030, 214717, 217200, 218777, 219307, 219453, 219717, 219875, 219611, 218965, 217848, 215972, 213769, 212533, 212924, 214013, 214591, 214872, 215996, 218180, 220381, 221649, 221936, 221600, 221075, 221175, 222902, 226510, 231383, 237073, 243642, 250492, 255735, 257875, 257926, 258816, 262453, 268094, 273830, 278907, 283984, 289690, 295875, 302245, 308873, 315672, 321911, 326769, 330221, 332873, 335091, 336761, 337960, 339167, 340421, 340770, 339290, 336484, 333908, 332303, 330828, 328506, 325716, 323529, 322066, 320400, 317953, 315008, 311723, 307641, 302712, 298106, 295278, 294548, 295133, 296154, 297023, 297191, 296352, 294862, 293399, 292214, 291195, 290476, 290295, 290387, 290303, 290360, 291328, 292958, 293805, 293127, 292126, 292464, 294168, 295911, 297028, 298154, 299850, 301595, 302555, 302687, 302600, 302728, 303104, 303739, 304769, 306178, 307581, 308426, 308535, 308482, 309247]
52820C09247J964K396J633M03n06j244k243l056k681r65J025K182K214J380Q7
52805C11836r26q38L37J593K170K428L002L677L795L329K752K070R86p6j62P12
52789C36685J124p2k190l406k773j063L71J157K216M437P144Q415P235M921L603
52774C67804L683L851L429L267L919M449L961L081K769K519J253o16j467p46L82
52759D01538P62M75J09k35r01k267m449o744p643o284l863k518k853l706m269
52744C57152m959n801n746m576m028n509p590p498m905k588k905m884n633m025
52730B86505j937j678l041l729k510p90m77j411k184k717m051n665n303k434J44
52715B48722k43k450l243j902q82k006m028m678l512j805o01L9L59M09K33K1j54
$$ y = [309247, 311211, 313607, 315240, 315643, 315137, 313893, 311650, 308594, 305913, 304948, 305973, 308155, 310369, 311749, 311836, 310910, 310072, 310409, 312002, 314172, 316600, 319602, 323279, 327074, 330403, 333155, 335225, 336211, 336135, 335973, 336685, 337809, 337737, 335547, 332141, 329368, 328305, 328676, 329833, 332049, 336486, 343630, 352045, 359280, 364201, 367804, 371487, 375338, 378767, 382034, 385953, 390402, 394363, 397444, 400213, 402732, 403985, 403369, 401902, 401156, 401538, 402300, 402775, 402884, 402649, 401748, 399481, 395032, 388288, 380645, 374361, 370498, 367980, 365127, 361421, 357152, 352193, 346392, 340646, 336070, 332042, 326533, 318943, 311445, 306540, 303952, 301047, 296163, 290530, 286505, 284568, 282890, 279849, 276120, 273610, 272820, 272343, 270932, 268748, 266031, 261980, 256315, 251012, 248578, 248722, 248479, 246029, 242786, 240884, 240002, 237996, 233968, 229290, 225778, 223973, 223372, 223411, 223770, 224179, 224412, 224433, 224279]
52698B24279n11j398k822m193m752m446m120m575n615o293n860m194j732N56J453
52683A75777M99j276k251j982j572k161l474m157l343j625m57p09j860k714k643
52668A46052j854p01N70J376R77m36j597j637j073p50n16J63Q98Q02q8q75j162
52651A40149j307j400j058m08k12p67j390j401q63j46N66J012Q86M37L90Q60J020
52634A36368K41r64j586j132L53K590M911O301O299N467M516L467K260J629K419
52619A73139M233N642N788N005L809K096k08k423l556l285k180j165r56j688k723
52604A81528l096k512j762j733k324k777k796k624k140r69K89J4k371n142o108
52589A45477n190m048l474k669j095M31J081J257J591J752J213M47K35K53m91
$$ y = [224279, 223768, 222370, 219548, 215355, 210603, 206157, 202037, 197462, 191847, 185554, 179694, 175500, 173768, 174324, 175777, 176276, 175000, 172749, 170767, 169195, 167034, 163560, 159403, 156060, 154435, 153978, 153269, 151409, 148695, 146052, 144198, 143497, 144067, 145443, 146420, 145984, 144387, 142750, 141677, 140927, 140411, 140574, 141472, 142274, 142186, 141311, 140149, 138842, 137442, 136384, 135976, 135764, 134997, 133607, 132206, 131343, 131197, 131763, 132775, 133661, 134098, 134488, 135348, 136368, 136609, 135645, 134059, 132927, 133280, 135870, 140781, 147082, 153381, 158848, 163364, 166831, 169091, 170720, 173139, 177372, 183014, 188802, 193807, 197616, 199712, 199504, 197081, 193525, 190240, 188060, 186895, 185939, 184251, 181528, 178432, 175920, 174158, 172425, 170101, 167324, 164528, 161904, 159764, 158795, 159084, 159098, 156727, 151585, 145477, 140287, 136239, 132765, 130096, 129001, 129432, 130513, 131770, 133361, 135113, 136326, 136773, 137008, 137261, 136770]
52574A36770j987k985k533j056K48N86J95R3J044K472K835J507k58r16n72m65
52558A34978j016j583j795j942j980j385k65M53K44m68j195j834j947q26J199
52543A20638K498K090R34N35R72J297J262J479K053K196J436L91OM16Q84O75j70
52526A39592p91l96P39J410Q98p7k72M95J294J565J852K720L497K913Q63j098
52510A55204j324J92J945K616K138J332Q86R43J240J446J535J905K837L860M149
52495A80904L685L331L487L408K506J557J643K347K194P95o07q94l15L56R49J533
52479B06879J759J341Q67J315K773M168M372L365K159J678J787J604P69P5N20
52464B35431K035L564M201L777K486P16p70j202n83K95P56P48N09J61j86l75l02
$$ y = [136770, 134783, 131798, 129265, 128209, 128457, 129043, 129238, 129331, 130375, 132847, 135682, 137189, 136931, 136015, 135443, 134978, 133962, 132379, 130584, 128642, 126662, 125277, 125012, 125465, 125709, 125241, 124046, 122212, 120265, 119439, 120638, 123136, 125226, 126160, 126695, 127667, 128964, 130226, 131705, 133758, 135954, 137390, 137781, 137787, 138203, 139087, 139762, 139592, 138801, 138405, 139144, 140554, 141452, 141375, 141103, 141598, 142892, 144457, 146309, 149029, 152526, 155439, 156302, 155204, 153880, 154072, 156017, 158633, 160771, 162103, 162989, 163932, 165172, 166618, 168153, 170058, 172895, 176755, 180904, 184589, 187920, 191407, 194815, 197321, 198878, 200521, 202868, 205062, 205857, 205250, 204356, 204041, 204397, 205346, 206879, 208638, 209979, 210846, 212161, 214934, 219102, 223474, 226839, 228998, 230676, 232463, 234067, 234836, 234911, 235431, 237466, 241030, 245231, 249008, 251494, 252210, 251440, 250238, 249655, 249950, 250706, 251454, 251963, 252124, 251938, 251563, 251261]
52447B51261M2N10M85p98k950m099k897n33N61j46r07n66n7m15r92p38J3L54M38
52428B38566Q93J442J414J182J607K321K013M28j172j720j412q66k68K63M13K47
52412B45351L10P67J089J039J293K416L725L912K657J004J51L51J073J750K123
52397B69011K094J650R74M25K21J79o9n39p27j06J227K406K434J044r43k273k303
52380B74705j424l68O14J635K544K918K731K517K654K827K453J433K56m84n76
52365B94435k67k8j33m48o81p23o14l38N7L28L23L00N27P95P69O56R43J503J666
52346B99070J215O57M28N09J022K252L655L703J650j041j984n63J429J961R72
52331C14935N1K89J162J564J319J062R65N83M0K43J311J878R11o21j162r19j179
$$ y = [251261, 251303, 251813, 252298, 251500, 248550, 244451, 241554, 241021, 241582, 241436, 240529, 239963, 239906, 239491, 238499, 237761, 237774, 238128, 238566, 239459, 240901, 242315, 243497, 245104, 247425, 249438, 249866, 248694, 246974, 245562, 244696, 244428, 244691, 245104, 245351, 245661, 246428, 247517, 248556, 249849, 252265, 255990, 259902, 262559, 263563, 263714, 264065, 265138, 266888, 269011, 271105, 272755, 273729, 274154, 274375, 274554, 274485, 273946, 273219, 273113, 274340, 276746, 279180, 280224, 279281, 277008, 274705, 273281, 272913, 273527, 275162, 277706, 280624, 283355, 285872, 288526, 291353, 293806, 295239, 295495, 295011, 294435, 294168, 294140, 294007, 293559, 292878, 292155, 291541, 291203, 291260, 291588, 291911, 292211, 292738, 293533, 294302, 294958, 295901, 297404, 299070, 300285, 300942, 301370, 301879, 302901, 305153, 308808, 312511, 314161, 313120, 311136, 310573, 312002, 313963, 314935, 314986, 315275, 316437, 318001, 319320, 320382, 321347, 321930, 321970, 322213, 323524, 325402, 326313, 325692, 324530, 323611, 322432]
52314C22432j840j539k60L65j67k21J214K617K249R20P48K145L645M207M089L810
52298C44414L572L556L679L280K064J088J704L662N379N936N833N710N464M787
52284D00128L869L217L276M110N083N142M092L220L858N542O556O172N395N328
52270D64988N781N852N275M668M698N270N578N125M531M826N838O283N784N645
52256E40142O755P942P838P381Q582J1216J2848J2397J1663J2603J4723J6187
52244F70277J6276J5604J4868J4494J5004J6634J8763K0424K1327K1931K2675
52233H68277K3571K4335K4697K4719K4954K5880K7058K7472K6918K6567K7470
52222A151918K9037K9586K8378K6363K5005K4772K5029K4989K4333K3055K1148
$$ y = [322432, 320592, 319053, 318793, 319158, 318991, 318770, 319984, 322601, 324850, 325770, 326518, 328663, 332308, 336515, 340604, 344414, 347986, 351542, 355221, 358501, 360565, 361653, 363357, 367019, 372398, 378334, 384167, 389877, 395341, 400128, 403997, 407214, 410490, 414600, 419683, 424825, 428917, 432137, 435995, 441537, 448093, 454265, 459660, 464988, 470769, 476621, 481896, 486564, 491262, 496532, 502110, 507235, 511766, 516592, 522430, 528713, 534497, 540142, 546897, 554839, 562677, 570058, 578640, 589856, 602704, 615101, 626764, 639367, 654090, 670277, 686553, 702157, 717025, 731519, 746523, 763157, 781920, 802344, 823671, 845602, 868277, 891848, 916183, 940880, 965599, 990553, 1016433, 1043491, 1070963, 1097881, 1124448, 1151918, 1180955, 1210541, 1238919, 1265282, 1290287, 1315059, 1340088, 1365077, 1389410, 1412465, 1433613]
52211A433613J8725J6284J4390J3147J2238J1416J0619R636Q193O493N124M257
52199A564135L556L031L183L864L885K465M30p04l65R90K668L954M330M255M918
52184A604595O350O939O088O122R500J4928J8649J9269J8792J8726J8010J5792
52172A763760J3740J3771J5238J6247J6413J6475J6175J4577J2107J0352R728
52161A918583Q887O726L876J697N45n29k733o242r762j1554j1325j0750j1603
52148A875816j3813j5996j7505j8793j9903j9966j8716j7409j7310j7912j7762
52137A680731j6765j6388j7300j8043j6947j4540j2768j2145j1170q840o358n417
52125A524050n895o415o473o700p252p205n786l359j160n34k138n120p306p171
$$ y = [1433613, 1452338, 1468622, 1483012, 1496159, 1508397, 1519813, 1530432, 1540068, 1548261, 1554754, 1559878, 1564135, 1567691, 1570722, 1573905, 1577769, 1581654, 1584119, 1584549, 1583845, 1583480, 1584470, 1587138, 1591092, 1595422, 1599677, 1604595, 1610945, 1617884, 1623972, 1630094, 1639594, 1654522, 1673171, 1692440, 1711232, 1729958, 1747968, 1763760, 1777500, 1791271, 1806509, 1822756, 1839169, 1855644, 1871819, 1886396, 1898503, 1908855, 1918583, 1927470, 1934196, 1938072, 1939769, 1940314, 1939785, 1937052, 1930810, 1921048, 1909494, 1898169, 1887419, 1875816, 1862003, 1846007, 1828502, 1809709, 1789806, 1769840, 1751124, 1733715, 1716405, 1698493, 1680731, 1663966, 1647578, 1630278, 1612235, 1595288, 1580748, 1567980, 1555835, 1544665, 1535825, 1529467, 1524050, 1518155, 1511740, 1505267, 1498567, 1491315, 1484110, 1478324, 1474965, 1473805, 1473271, 1471133, 1466013, 1458707, 1451536]
52111A451536n554m489m595m730m200l881m785o578q089q479p617o014m705m437
52097A373383m803m825m396m190m269m031l641m060n245n751m790l416k886l054
52083A314026l219l344l502l244k614k743m176n505n018l139j806j891k523k752
52069A268550k586k321j973j550j263j217j286j303j192j066j324k171k941k610
52055A243747j205J69R64J868L374M790N463N889O805Q081R429J1131J3120J4425
52041A328050J4721J5252J6952J8805J9717K0777K3631K7468K9901L0386L0437
52030A576097L0786L0755L0521L1423L3363L4281L3215L1768L1294L0523K7635
52019A921661K3405K0393J9705K0071J9797J8340J5988J2973R265M980R05j661
$$ y = [1451536, 1445982, 1441493, 1436898, 1432168, 1427968, 1424087, 1419302, 1412724, 1404635, 1396156, 1388539, 1382525, 1377820, 1373383, 1368580, 1363755, 1359359, 1355169, 1350900, 1346869, 1343228, 1339168, 1333923, 1328172, 1323382, 1319966, 1317080, 1314026, 1310807, 1307463, 1303961, 1300717, 1298103, 1295360, 1291184, 1285679, 1280661, 1277522, 1275716, 1273825, 1271302, 1268550, 1265964, 1263643, 1261670, 1260120, 1258857, 1257640, 1256354, 1255051, 1253859, 1252793, 1251469, 1249298, 1246357, 1243747, 1242542, 1242711, 1243675, 1245543, 1248917, 1253707, 1259170, 1265059, 1271864, 1279945, 1289374, 1300505, 1313625, 1328050, 1342771, 1358023, 1374975, 1393780, 1413497, 1434274, 1457905, 1485373, 1515274, 1545660, 1576097, 1606883, 1637638, 1668159, 1699582, 1732945, 1767226, 1800441, 1832209, 1863503, 1894026, 1921661, 1945066, 1965459, 1985164, 2005235, 2025032, 2043372, 2059360, 2072333, 2081598, 2086578, 2087483, 2085822]
52007B085822k243k244l686o756r615j0844j0814j0308r391q490q974j1145j2898
51994A978414j2179j0017r122r898j0004q063n611m478m028k482J24K062K584
51981A907302K845M010N643O588O616O413O438O519O501O521O598O416N829N157
51967A989396M795M744M771M686M217K915N74k372n209p527r149r891r964j0418
51953A961568j2376j5643j8699k0401k1207k2275k3767k4834k5168k5729k7505
51942A723964l0027l1790l2086l1753l1970l2886l3822l4243l3983l3009l1621
51931A366774l0620l0527l0859l0953l1108l1962l2975l2921l1819l0837l0153
51920A022040k8686k6500k5413k5992k5915k3232j9724j8693k0239k1251j9856
$$ y = [2085822, 2083579, 2081335, 2077649, 2070893, 2061278, 2050434, 2039620, 2029312, 2019921, 2011431, 2002457, 1991312, 1978414, 1966235, 1956218, 1947096, 1937198, 1927194, 1919131, 1913520, 1909042, 1905014, 1902532, 1902656, 1904718, 1907302, 1910147, 1914157, 1919800, 1926388, 1933004, 1939417, 1945855, 1952374, 1958875, 1965396, 1971994, 1978410, 1984239, 1989396, 1994191, 1998935, 2003706, 2008392, 2012609, 2015524, 2016098, 2013726, 2008517, 2000990, 1991841, 1981950, 1971986, 1961568, 1949192, 1933549, 1914850, 1894449, 1873242, 1850967, 1827200, 1802366, 1777198, 1751469, 1723964, 1693937, 1662147, 1630061, 1598308, 1566338, 1533452, 1499630, 1465387, 1431404, 1398395, 1366774, 1336154, 1305627, 1274768, 1243815, 1212707, 1180745, 1147770, 1114849, 1083030, 1052193, 1022040, 993354, 966854, 941441, 915449, 889534, 866302, 846578, 827885, 807646, 786395, 766539]
51909G66539j7458j6096j5851j5682j5159j4572j4295j4695j5688j6167j4899
51898E95977j2246r845q514p712p184p535q705r378q779p700o984o327n450n150
51884D84468n981o974o904o073n691o067o475o238n155l454k041k097l529m700
51870D13089m485l695l428l191k111r62j089j947j741m38q1j805m274n614n412
51855C72816m151k127J20J397R64n84k257l766n033n409m386k661j523j389j591
51840C40420j492j137q67r67j608k666l557l626k855j882j325j333j722k253k787
51825C10343l291l685l589k485n08J252J784J346R81Q64J14j411k324j532j10
51810B97749L5r75j080N77K171J706k29j461j100m8Q69J706K480K834K848L020
$$ y = [766539, 749081, 732985, 717134, 701452, 686293, 671721, 657426, 642731, 627043, 610876, 595977, 583731, 573886, 565372, 557660, 550476, 542941, 534236, 524858, 516079, 508379, 501395, 495068, 489618, 484468, 478487, 471513, 464609, 458536, 452845, 446778, 440303, 434065, 428910, 425456, 423415, 421318, 417789, 413089, 408604, 404909, 401481, 398290, 396179, 395217, 394128, 392181, 390440, 390002, 389921, 388116, 383842, 378228, 372816, 368665, 366538, 366658, 368055, 369019, 368435, 366178, 362412, 357379, 351970, 347584, 344923, 343400, 342011, 340420, 338928, 337791, 336924, 335957, 334349, 331683, 328126, 324500, 321645, 319763, 318438, 317105, 315383, 313130, 310343, 307052, 303367, 299778, 297293, 296785, 298037, 299821, 301167, 302148, 303012, 303126, 301715, 299391, 297859, 297749, 297784, 296809, 295729, 296306, 298477, 300183, 299954, 298493, 297393, 297345, 298214, 299920, 302400, 305234, 308082, 311102]
51794C11102L175K574J435J043J739K076R66l55J72K571M769N155M135L176L329
51779C47062M637O117O120L633l34l249l372j348N84O84j037l121l995l274j961
51764C47146j283j350j267n01L23K49p26j483r25Q64K549K714J141r51k047j588
51748C42865j72J235K020K080J711J451J712K264K233Q86j364l050l094k115j765
51733C46897k551k991j580R76K459J920O27J90P96J717K432K647K050R48L78P78
51717C57693J226Q08J01J77P89Q75N42R44K115K420Q16j456k278j142O14J580
51701C65824J641J545J695J719J252Q71J634L568N251N445M585L909L696L390
51687D06025L067L541M878N999O041N191M050L156L225M698O680P520P013O910
$$ y = [311102, 314277, 316851, 318286, 319329, 321068, 323144, 324110, 323755, 323927, 326498, 331267, 336422, 340557, 343733, 347062, 351699, 357816, 363936, 367569, 367235, 363986, 360614, 359266, 359850, 360534, 359497, 356376, 352381, 349107, 347146, 345863, 344513, 343246, 342745, 343068, 343317, 342591, 341108, 340183, 341047, 343596, 346310, 347451, 346500, 344453, 342865, 342693, 343928, 345948, 348028, 349739, 351190, 352902, 355166, 357399, 358285, 356921, 353871, 350777, 348662, 346897, 344346, 341355, 339775, 340751, 343210, 345130, 345757, 345947, 346743, 348460, 350892, 353539, 355589, 356537, 356915, 357693, 358919, 359727, 359828, 360005, 360794, 361669, 362211, 363155, 365270, 367690, 368506, 367050, 364772, 363630, 364244, 365824, 367465, 369010, 370705, 372424, 373676, 374547, 376181, 379749, 385000, 390445, 395030, 398939, 402635, 406025, 409092, 412633, 417511, 423510, 429551, 434742, 438792, 441948, 445173, 449871, 456551, 464071, 471084, 477994]
51673D77994Q591J1176J2733J2475J1051R505Q651Q586Q084N553J469j367j241
51660E73260J8l53k112k792j780j113k060l372l611l225l247l551l697m086m932
51645E33347n135l684j437k06m25r90j052q26p42r34j531k546l377l219k131r88
51629E04124l73k4N17J276J866J845J166N99J274L232M904M905L880L531M120
51614E36842M260L185J772R50M36l08q77o19K85J206J939K563L012L396M048M726
51598E66816M670M091M407N922O447L950k11k708k684k566m206o474p661q170
51584E61623r108r792q812o895o445p977r142q039n981n642p324q587p462m765
51570D55652k839k893m233n533o113n994n442m696l904l133k570k618l374m048
$$ y = [477994, 486585, 497761, 510494, 522969, 534020, 543525, 552176, 560762, 568846, 574399, 575868, 574501, 573260, 573278, 572925, 570813, 568021, 566241, 565128, 563068, 559696, 556085, 552860, 549613, 546062, 542365, 538279, 533347, 528212, 524528, 523091, 522885, 522460, 521470, 520418, 519592, 518850, 517916, 516385, 513839, 510462, 507243, 505112, 504124, 503751, 503727, 504244, 505520, 507386, 509231, 510397, 510996, 512270, 515502, 520406, 525311, 529191, 532722, 536842, 541102, 544287, 546059, 547009, 547445, 547137, 546260, 545641, 545926, 547132, 549071, 551634, 554646, 558042, 562090, 566816, 571486, 575577, 579984, 585906, 592353, 596303, 596092, 593384, 590700, 588134, 583928, 577454, 569793, 561623, 552515, 542723, 533911, 527016, 520571, 512594, 503452, 495413, 489432, 483790, 476466, 467879, 460417, 455652, 452813, 449920, 445687, 440154, 434041, 428047, 422605, 417909, 414005, 410872, 408302, 405684, 402310, 398262]
51556C98262l486j598K19N71l57j221j235q22o66q48j117j387j629j643j328r21
51540C80794p05n60j14O69J345J495J275J303J926K798L387L759M406N274N536
51525D12588M699L491L132L966N333O627P848R102J0107J0422R937R045Q410Q313
51511E13020Q156O969M729K823K582L723M675M219K316k56k391l179k740k290
51497E42356k672l206k916k238k258k651k084n83L23J57L69J899L570M089M176
51482E38331N249P027Q019P768P175O894O583N741M391L035K442L052M070L908
51468F13685K217O10M27P66J39p67KK305L517K072l23r73M83K103K251J058l30
51451F29242r60m34J179L224M460L771J372j024j756j044o34j628l409m889n808
$$ y = [398262, 394776, 393178, 393397, 393968, 393611, 392390, 391155, 390333, 389667, 388819, 387702, 386315, 384686, 383043, 381715, 380794, 380089, 379529, 379415, 380084, 381429, 382924, 384199, 385502, 387428, 390226, 393613, 397372, 401778, 407052, 412588, 417287, 420778, 423910, 427876, 433209, 439836, 447684, 456786, 466893, 477315, 487252, 496297, 504707, 513020, 521176, 528145, 532874, 535697, 538279, 542002, 546677, 550896, 553212, 552956, 550565, 547386, 544646, 542356, 539684, 536478, 533562, 531324, 529066, 526415, 524331, 523748, 524071, 524228, 524597, 526496, 530066, 534155, 538331, 543580, 550607, 558626, 566394, 573569, 580463, 587046, 592787, 597178, 600213, 602655, 605707, 609777, 613685, 615902, 616512, 616939, 617705, 617844, 617077, 617079, 619384, 622901, 624973, 624650, 623677, 624160, 626263, 628514, 629572, 629242, 628282, 627848, 629027, 632251, 636711, 640482, 641854, 640830, 639074, 638030, 637396, 635768, 632359, 627470, 621662]
51436F21662o325o336o024o220p230q137q111p656p374o597m707k963l103m505
51422E36374m787l193j446r68j217j247j069o53P40L132N023N125L980L016L016
51407E45826M204O627R346J0437R121P189P071Q988J1116J2027J1770J0945J0000
51394F64667R450R714J0470J0753R873P968N775M111L213K425R68p48j341m18
51380G36880O20M18n45r79q30r88j515j641j266j133j270o93R68K545K676J443
51364G34690Q8m37k37k17j331l818o858r183j0070r679q637p785p995r485j1099
51349F47947j1072q921o235n092o039p863r123r399r134q636p625n791l523j728
51335E47766q24k13R52K714M334N182N223M676L700K564J740J634K180K851K945
$$ y = [621662, 615337, 609001, 602977, 596757, 589527, 581390, 573279, 565623, 558249, 551652, 546945, 543982, 540879, 536374, 531587, 528394, 526948, 525980, 524763, 523516, 522447, 521794, 522534, 525666, 530689, 535814, 539794, 542810, 545826, 550030, 556657, 566003, 576440, 585561, 592750, 599821, 608809, 619925, 631952, 643722, 654667, 664667, 674117, 683831, 694301, 705054, 714927, 722895, 728670, 732781, 735994, 738419, 739387, 738639, 737298, 736880, 737500, 737918, 737373, 736394, 735564, 734576, 733061, 731420, 730154, 729021, 727751, 727058, 728026, 730571, 733247, 734690, 734778, 734341, 734104, 733887, 732556, 728738, 721880, 712697, 702627, 692948, 684311, 676526, 668531, 659046, 647947, 636875, 627954, 621719, 616627, 610588, 602725, 593602, 584203, 575069, 566433, 558808, 553017, 549494, 547766, 546942, 546729, 547681, 550395, 554729, 559911, 565134, 569810, 573510, 576074, 577814, 579448, 581628, 584479, 587424]
51320E87424J996K8k402m526n797o205o283o684p594q663r667j0907j2505j3681
51306D94534j3584j2782j2736j3540j3364j0993p912o520o983p326o560n977o862
51293C69395q310q443o948n265m445l966k937j545o63n19n36m55p02j405j772
51278C21484j255p32j565l594n152n155m188l279k598j885j225o91k9P05R20N83
51262B92344O81J844L293M027M265M616M785M240L482L296L458L622M654P124
51248C45731R257Q739O421N659P529R293Q563O535N571N675N289M102K981K090
51234D33435J022J02k34r01l202o619r090r448q334o847n738n808p502r775j0647
51219C50414r333o991n175m497m836n791o581o557o062o005o358o073m803l602
$$ y = [587424, 589420, 589448, 587046, 582520, 576723, 570518, 564235, 557551, 549957, 541294, 531627, 520720, 508215, 494534, 480950, 468168, 455432, 441892, 428528, 417535, 409623, 403103, 396120, 388794, 382234, 376257, 369395, 361085, 352642, 345694, 340429, 335984, 332018, 329081, 327536, 326873, 326354, 325818, 325363, 324661, 323256, 321484, 320229, 319497, 317932, 314338, 309186, 304031, 299843, 296564, 293966, 292081, 290856, 290165, 290136, 290841, 291761, 292344, 293025, 294869, 298162, 302189, 306454, 311070, 315855, 320095, 323577, 326873, 330331, 333953, 338607, 345731, 354988, 363727, 370148, 375807, 383336, 392629, 401192, 407727, 413298, 418973, 424262, 428364, 431345, 433435, 434457, 434559, 434325, 433424, 430222, 423603, 414513, 405065, 396731, 389884, 384146, 378338, 370836, 361061, 350414, 341081, 334090, 328915, 324418, 319582, 313791, 307210, 300653, 294591, 288586, 282228, 276155, 271352, 267750]
51205B67750l402l761l699l018k155j436j075j320k048k645k741k497j931p40
51191B35282P22J251L95n88l29P63J316J144J217J766J839R79J11K51J238K228
51175B49585K713K574J794P44K05N01R69Q05J74j75r6j68o44r84o56N0M45L80
51157B58216L43O84J112J204J106J372K068K455J863O64n6J28L93l33j961l233
51141B66025l061j626m7P66P97O46Q33J354J707J333J94j004j450j190j134j799
51125B62344k460k171j318j271k287k834j602N52J585P53q03j751j937j908j966
51110B42926j909j208N90L052M507L487O71j461j390p3P19N48O1n24j440k398
51094B46158k799k737k697k389j053J013K334K059Q90j68j102k274l287l401k681
$$ y = [267750, 264348, 260587, 256888, 253870, 251715, 250279, 249204, 247884, 245836, 243191, 240450, 237953, 236022, 235282, 236004, 237255, 237650, 237062, 236733, 237496, 238812, 239956, 241173, 242939, 244778, 245757, 245868, 246119, 247357, 249585, 252298, 254872, 256666, 257410, 257615, 258116, 259085, 259890, 260064, 259889, 259793, 259625, 258981, 257997, 257341, 257391, 257836, 258216, 258559, 259243, 260355, 261559, 262665, 264037, 266105, 268560, 270423, 271087, 271031, 271159, 271552, 271219, 269258, 266025, 262964, 261338, 261291, 262057, 262854, 263500, 264333, 265687, 267394, 268727, 268921, 267917, 266467, 265277, 264143, 262344, 259884, 257713, 256395, 255124, 252837, 250003, 248401, 248953, 250538, 251291, 250488, 248737, 246800, 244892, 242926, 241017, 239809, 240399, 243451, 247958, 251445, 252116, 250655, 249265, 249192, 249911, 250459, 250520, 249996, 248556, 246158, 243359, 240622, 237925, 235536, 234483, 235496, 237830, 239889, 240779, 240611, 239509, 237235, 233948, 230547, 227866]
51079B27866k045k246l288m572n169m256j952L66J247P77N05J560L307M209L691
51064B20000K645K170K381K759L229M229N752O912O842N633L974K288P22k65j98
51049B69073N01O61k57j445j761j107m70p05j639k235j663k90N12j73j716k845
51033B54441l238l419l220j686J053L037K557L24j354j088O83K660L608K804P57
51018B57919p04j38J711K749K135R76M01K17j17k38N51K062L247L197J804j87
51002B75585j527j374j70Q26J031J014J341J694J490O85m70j699k276j321O45
50987B75474J425k78k727k991o01K146L451L743L896L511K203J151J827L766N090
50972C01086M906L992L209K561K014K014K586K845K166J246J271K321L240L054
$$ y = [227866, 225821, 223575, 220287, 215715, 210546, 206290, 204338, 204704, 205951, 206728, 207233, 208793, 212100, 216309, 220000, 222645, 224815, 227196, 229955, 233184, 237413, 243165, 250077, 256919, 262552, 266526, 268814, 269536, 269271, 269073, 269574, 270235, 269978, 268533, 266772, 265665, 265195, 264490, 262851, 260616, 258953, 258663, 259175, 259002, 257286, 254441, 251203, 247784, 244564, 242878, 243931, 246968, 249525, 249849, 248495, 247407, 248090, 250750, 254358, 257162, 257919, 257215, 257077, 258788, 261537, 263672, 264648, 265049, 265266, 265149, 264911, 265462, 267524, 270771, 273968, 275772, 275585, 274058, 272684, 272514, 273340, 274371, 275385, 276726, 278420, 279910, 280595, 280125, 278426, 276150, 274829, 275474, 276899, 276621, 273894, 270903, 270302, 272448, 275899, 279642, 283538, 287049, 289252, 290403, 292230, 295996, 301086, 305992, 309984, 313193, 315754, 317768, 319782, 322368, 325213, 327379, 328625, 329896, 332217, 335457, 338511]
50958C38511J977R16L82L1o41j307q74J134L486M335L408K253K048K215J915J741
$$ y = [338511, 340488, 341404, 341786, 341817, 341176, 339869, 338995, 340129, 343615, 347950, 351358, 353611, 355659, 357874, 359789, 361530]
$$ [...]
##END NTUPLES=NMR SPECTRUM
##END=
