
##TITLE=AC1126_Huila-pital_5898504_NCl5uFGwVk
##JCAMPDX= 6.0         $$ Bruker NMR JCAMP-DX V2.0
##DATA TYPE= NMR SPECTRUM
##DATA CLASS= NTUPLES
##ORIGIN= BRUKER
##OWNER= Administrator
$$ 1.72 TOPSPIN		Version 2.1
$$ 2012-04-03 20:36:46.078 -0500  Administrator@TOPSPIN
$$ Compression mode = diff/dup
##.OBSERVE FREQUENCY= 400.13188235
##.OBSERVE NUCLEUS= ^1H
##.ACQUISITION MODE= SIMULTANEOUS (DQD)
##.ACQUISITION SCHEME= undefined
##.AVERAGES= 8
##.DIGITISER RES= 22
##SPECTROMETER/DATA SYSTEM= spect
##.PULSE SEQUENCE= zg30
##.SOLVENT NAME= COFFEE_meoh
##.SHIFT REFERENCE= INTERNAL, COFFEE_meoh, 1, 14.98061
##AUDIT TRAIL= $$ (NUMBER, WHEN, WHO, WHERE, PROCESS, VERSION, WHAT)
$$ ##TITLE= Audit trail, TOPSPIN		Version 2.1
$$ ##JCAMPDX= 5.01
$$ ##ORIGIN= Bruker BioSpin GmbH
$$ ##OWNER= Administrator
$$ $$ C:\Bruker\TOPSPIN/data/COFFEE/nmr/AC1126_Huila-pital_5898504_NCl5uFGwVk/10/pdata/1/auditp.txt
$$ ##AUDIT TRAIL=  $$ (NUMBER, WHEN, WHO, WHERE, PROCESS, VERSION, WHAT)
(   1,<2012-04-03 20:36:38.812 -0500>,<Administrator>,<TOPSPIN>,<go>,<TOPSPIN 2.1>,
      <created by zg
	started at 2012-04-03 20:35:32.125 -0500,
	POWCHK enabled, PULCHK disabled,
       configuration hash MD5:
       1A 1E CE 29 27 FD 77 03 67 4E F0 E3 C4 B2 CB 90
       data hash MD5: 64K
       99 44 63 69 8E 27 4A 8C D8 20 0F 93 12 4A 56 19>)
(   2,<2012-04-03 20:36:41.640 -0500>,<Administrator>,<TOPSPIN>,<proc1d>,<TOPSPIN 2.1>,
      <Start of raw data processing
       efp LB = 0 FT_mod = 6 PKNL = 1 PHC0 = 0 PHC1 = 0 SI = 32K 
       data hash MD5: 32K
       74 19 AE 76 21 A1 C9 E5 16 D4 63 F2 B3 EC 3C BE>)
(   3,<2012-04-03 20:36:42.000 -0500>,<Administrator>,<TOPSPIN>,<proc1d>,<TOPSPIN 2.1>,
      <pk PHC0 = 215.0739 PHC1 = 0 
       data hash MD5: 32K
       58 EB 89 AB 73 33 67 7B DB 14 72 0B FA ED 3F BA>)
(   4,<2012-04-03 20:36:42.062 -0500>,<Administrator>,<TOPSPIN>,<proc1d>,<TOPSPIN 2.1>,
      <abs ABSG = 1 
       data hash MD5: 32K
       0F DC 9F EE BA 9E 43 15 0F 2B 7F 4E 9F 73 23 80>)
(   5,<2012-04-03 20:36:42.093 -0500>,<Administrator>,<TOPSPIN>,<proc1d>,<TOPSPIN 2.1>,
      <abs ABSG = 2 
       data hash MD5: 32K
       53 23 08 1A F3 6C FA 3D 17 70 49 60 FF 12 E9 98>)
(   6,<2012-04-03 20:36:42.125 -0500>,<Administrator>,<TOPSPIN>,<proc1d>,<TOPSPIN 2.1>,
      <abs ABSG = 3 
       data hash MD5: 32K
       2B 03 63 58 49 59 54 48 57 66 0A 4A B2 F9 62 7D>)
(   7,<2012-04-03 20:36:42.156 -0500>,<Administrator>,<TOPSPIN>,<proc1d>,<TOPSPIN 2.1>,
      <abs ABSG = 4 
       data hash MD5: 32K
       E7 D1 22 E2 62 E8 FD 87 7A D0 7F 18 C2 EA 96 9E>)
(   8,<2012-04-03 20:36:42.234 -0500>,<Administrator>,<TOPSPIN>,<proc1d>,<TOPSPIN 2.1>,
      <abs ABSG = 5 
       data hash MD5: 32K
       C6 80 BC AB 80 4B 8B EF B7 FE 4E 59 71 76 7E 7D>)
$$ ##END=
$$ 
$$ $$ hash MD5
$$ $$ 23 86 CE 98 14 4D 51 3D 34 16 15 E6 3D 7A 40 E0
##$RELAX= 
##$RELAX= 
##$RELAX= 
##$RELAX= 
##$RELAX= 
##$RELAX= 
##$RELAX= 
$$ Bruker specific parameters
$$ --------------------------
$$ [...]
##$TP= (0..7)
150 150 150 150 150 150 150 150
##$TP07= 0
##$TPNAME0= <>
##$TPNAME1= <>
##$TPNAME2= <>
##$TPNAME3= <>
##$TPNAME4= <>
##$TPNAME5= <>
##$TPNAME6= <>
##$TPNAME7= <>
##$TPOAL= (0..7)
0.5 0.5 0.5 0.5 0.5 0.5 0.5 0.5
##$TPOFFS= (0..7)
0 0 0 0 0 0 0 0
##$TUNHIN= 0
##$TUNHOUT= 0
##$TUNXOUT= 0
##$USERA1= <user>
##$USERA2= <user>
##$USERA3= <user>
##$USERA4= <user>
##$USERA5= <user>
##$V9= 5
##$VALIST= <valist>
##$VCLIST= <CCCCCCCCCCCCCCC>
##$VD= 0
##$VDLIST= <DDDDDDDDDDDDDDD>
##$VPLIST= <PPPPPPPPPPPPPPP>
##$VTLIST= <TTTTTTTTTTTTTTT>
##$WBST= 2048
##$WBSW= 25
##$XGAIN= (0..3)
0 0 0 0
##$XL= 0
##$YL= 0
##$YMAX_a= 533079
##$YMIN_a= -645731
##$ZGOPTNS= <>
##$ZL1= 120
##$ZL2= 120
##$ZL3= 120
##$ZL4= 120
##$ABSF1= 14.98061
##$ABSF2= -5.57192
##$ABSG= 5
##$ABSL= 3
##$ALPHA= 0
##$AQORDER= 0
##$ASSFAC= 0
##$ASSFACI= 0
##$ASSFACX= 0
##$ASSWID= 0
##$AUNMP= <proc_prof1d_extract_pilot.lims>
##$AXLEFT= 0
##$AXNAME= <>
##$AXNUC= <1H>
##$AXRIGHT= 0
##$AXTYPE= 0
##$AXUNIT= <>
##$AZFE= 0.1
##$AZFW= 0.1
##$BCFW= 0
##$BC_mod= 0
##$BYTORDP= 0
##$COROFFS= 0
##$CY= 15
##$DATMOD= 1
##$DC= 0
##$DFILT= <>
##$DTYPP= 0
##$F1P= 0
##$F2P= 0
##$FCOR= 0.5
##$FTSIZE= 32768
##$FT_mod= 6
##$GAMMA= 0
##$GB= 0
##$INTBC= 1
##$INTSCL= 1
##$ISEN= 128
##$LB= 0
##$LEV0= 0
##$LPBIN= 0
##$MAXI= 10000
##$MC2= 0
##$MEAN= 0
##$ME_mod= 0
##$MI= 0
##$NCOEF= 0
##$NC_proc= -8
##$NLEV= 6
##$NOISF1= 0
##$NOISF2= 0
##$NSP= 0
##$NTH_PI= 0
##$NZP= 0
##$OFFSET= 14.98061
##$PC= 1
##$PHC0= 215.0739
##$PHC1= 0
##$PH_mod= 1
##$PKNL= yes
##$PPARMOD= 0
##$PPDIAG= 0
##$PPIPTYP= 0
##$PPMPNUM= 2147483647
##$PPRESOL= 1
##$PSCAL= 4
##$PSIGN= 0
##$PYNMP= <proc.py>
##$REVERSE= no
##$SF= 400.13
##$SI= 32768
##$SIGF1= 0
##$SIGF2= 0
##$SINO= 400
##$SIOLD= 32768
##$SPECTYP= <>
##$SREGLST= <1H.CDCl3>
##$SSB= 0
##$STSI= 32768
##$STSR= 0
##$SW_p= 8223.68421052632
##$SYMM= 0
##$S_DEV= 0
##$TDeff= 65536
##$TDoff= 0
##$TI= <>
##$TILT= no
##$TM1= 0
##$TM2= 0
##$TOPLEV= 0
##$USERP1= <user>
##$USERP2= <user>
##$USERP3= <user>
##$USERP4= <user>
##$USERP5= <user>
##$WDW= 1
##$XDIM= 32768
##$YMAX_p= 461441445
##$YMIN_p= -710836
##$CURPLOT= <Network HP LaserJet P1505>
##$CURPRIN= <$Network HP LaserJet P1505>
##$DFORMAT= <normdp>
##$LAYOUT= <+/1D_H.xwp>
##$LFORMAT= <normlp>
##$PFORMAT= <normpl>
##$SURQMSG= 1
$$ End of Bruker specific parameters
$$ ---------------------------------
##NTUPLES= NMR SPECTRUM
##VAR_NAME=  FREQUENCY,     SPECTRUM/REAL,   SPECTRUM/IMAG
##SYMBOL=    X,             R,               I
##VAR_TYPE=  INDEPENDENT,   DEPENDENT,       DEPENDENT
##VAR_FORM=  AFFN,          ASDF,            ASDF
##VAR_DIM=   32768,         32768,           32768
##UNITS=     HZ,            ARBITRARY UNITS, ARBITRARY UNITS
##FACTOR=    0.250966925370066, 1,           1
##FIRST=     8223.43324360095, -35782,       -55017
##LAST=      0,             -39157,          34276
##MIN=       0,             -710836,         0
##MAX=       8223.43324360095, 461441445,    0
$$ Real data points
##PAGE= N=1
##DATA TABLE= (X++(R..R)), XYDATA
$$ [...]
23734 -124093 -27749 258742 189525 114261 11654 149447 -85745 -51006 -65128 33178 69895
23723 69895 -278492 -208987 -107538 132477 -10728 -61343 -111750 222698 42788 16771 -142181
23711 -157268 -250901 -20138 40118 -163068 -107277 -17661 -339143 196786 235054 14894 -65330
23699 77796 60662 -62892 -13242 246733 -150921 -156230 49673 21063 -152248 144993 -73292
23687 -28793 85265 70521 65054 -427823 -108875 -92583 -55260 -43077 107135 119102 84832
23676 84832 134257 -107162 -156762 -137562 177307 -136041 -166039 -89898 195236 -105191 257749
23664 -578488 -127742 -157991 -60376 -264197 290706 -131645 96178 83627 -163681 87888
23653 -140220 -206535 221796 -329671 -67035 74723 314372 -159580 -204373 -51109 -97706 -145790
23642 -145790 223357 -266172 16030 -39656 -314395 -126532 20299 -121841 30655 -265306
23631 -120016 253936 -200105 -107939 -98824 44915 -1260 -46451 166728 80704 -125464 -283718
23620 -283718 268399 36969 69503 -85420 -270663 77111 -37815 -284283 165034 203291 -76267
23608 10667 -252807 151087 -85473 -68129 -20593 -111251 -52586 -251382 233971 -217851 -187785
23597 -187785 403905 127458 -181634 -38060 66261 54659 37785 140609 157034 -102740
23586 217929 177547 -131668 173217 25277 173870 11790 -54262 -184588 103795 117828
23576 117828 207017 294501 157551 341258 478660 95036 191935 -22372 150764 248449 121274
23564 63378 129174 216611 -38655 125572 -43219 262808 33705 -100713 -102458 221704 254974
23553 254974 433889 -44596 -124881 -237982 -305877 -149662 -59387 25875 160008 380229
23543 380229 219044 -128606 56335 143322 140197 -171582 169054 375085 -155847 46409
23532 -49857 346 288140 41309 -86886 -189959 193102 101726 -161302 -160108 245598 -350491
23520 -68146 -153145 -126741 255229 -92810 -75148 19352 -198419 8962 -47437 -330392 36986
23508 118094 -73350 -106652 -172727 267477 166276 -222949 32304 -303709 33014 6647 -139867
23496 -147887 151894 -30137 -24991 -371573 239506 -164941 -180788 -80268 28436 -117011 1285
23484 12134 -100148 -24242 -132074 -42631 -122543 -236673 75191 74012 42139 -351167 -262933
23473 -262933 -277039 -34229 -183144 -264047 132777 -226082 62766 -107319 300779 87605
23462 -25106 -280474 87903 -379117 33658 -202469 -180753 24333 -34538 -221712 69001 -205082
23450 -16718 -1801 -129745 -353837 56116 96153 201595 110261 -234505 71210 -111043 7556
23438 72855 -30259 2948 -76453 -115781 -352714 -130515 -376632 -40123 86597 100248 43647
23426 -331357 -376835 209456 -20825 122607 -127124 -14226 -40270 78083 173947 -34304 -154502
23415 -154502 255300 152240 -168789 -188084 45020 -419050 -343287 112094 36058 -236490
23404 84513 -24837 -94522 -180847 367999 -313931 -159493 -31502 26100 -85566 160231 -67499
23392 31800 -76133 -13392 -31716 -89074 48853 -18397 81254 94277 -359300 -103368 -285266
23381 -285266 -356154 5917 -87573 -54192 -15165 304958 -213374 -18311 312491 -39721 183163
23369 109472 -109620 222948 511007 -220183 75378 58446 162351 -32079 73198 6523 13606
23358 13606 -101968 4773 49744 -187574 -38682 74691 8970 103288 101491 112975 173245 -119175
23345 -252307 -100135 -160502 -36344 -38239 158867 -124994 -13676 -375548 -350597 96456 12508
23333 26193 -196516 103435 135924 -27971 -262886 -193357 326748 9382 -176257 -255936 -334804
23322 -334804 7877 -215804 -30522 239052 205101 9713 52631 -28996 279426 9482 -152919
23310 125699 245577 -166015 280636 -53161 396924 251470 133329 -74887 -80764 -253742
23300 -253742 -99383 -70733 -131382 -152041 -10413 -32815 306947 256392 32676 40718 51375
23289 51375 -62494 -58833 -118640 169140 -2666 44078 -72515 -191061 -106114 18966 -117230
23277 41199 43493 -92827 -27661 65164 104938 70471 190003 48589 194194 -7269 -458812
23266 -458812 -231942 211335 32489 126506 -88759 15946 -177 -106090 -88817 76722 142006
23255 142006 247986 28079 -145563 175469 45521 290325 9679 -7843 222372 -236418 -79867
23243 67978 151934 137721 162889 -53631 -138330 -73370 28927 64375 -150419 -9370 -88822 -108287
23231 -108287 107573 -19575 114234 58829 -135553 -17022 -248566 247458 -192215 29468
23220 51582 15629 -13824 -7890 98919 -116728 -227562 112120 1676 -226635 -5508 -58030
23209 -58030 -113286 -222682 -110244 37288 -307126 -88467 -222090 -271076 -93516 -2517 -75090
23198 -75090 -118449 206326 -156825 -35974 -349010 552 -8045 38431 -1996 367042 -141316
23186 144166 377305 257006 -8826 8558 23671 -134583 -201831 -171643 -102130 -31312 -338480
23175 -338480 187155 -10768 209984 -37721 -94823 45117 -154047 -341921 -236202 74760
23164 -144768 -239185 -13907 284689 43059 144805 23735 94324 -37281 151942 -55619 -40477
23153 -40477 194126 25897 153729 -250202 -74466 -359670 111201 139389 -210077 180970
23142 -78487 -265805 -309594 111226 -73682 -31574 -124758 132355 -126587 24056 -31831 -137819
23131 -137819 -119280 510022 -200808 -127620 -204775 82595 213140 36349 70228 -90150 305778
23119 140137 -57729 -67885 498523 30364 200505 208280 -14616 133068 -54157 -100230 172823
23107 257234 -190787 76386 -163289 38044 16727 33588 -8449 -160907 -46768 -213499 -432419
23096 -432419 -186278 -129579 248577 -117741 -275254 -177408 -188624 186698 -86648 -190344
23086 -190344 244707 229155 303018 184875 -78086 51131 143983 -166583 -57417 300623 152573
23075 152573 -176916 -82004 108541 -86151 -286831 -67163 -99525 113295 -74753 465202
23064 -19020 93838 128911 -6942 -38244 -9605 -128345 -102513 41420 -44647 -2180 331982 213369
23052 213369 -198491 12905 -21460 -191956 438035 57958 42054 194386 110726 -10553 -176437
23041 -176437 186863 -26287 -132658 -120104 145038 228322 -112327 -28853 -238785 107981
23030 186834 49915 194836 -7657 5480 62210 -36147 272783 205663 -307899 140130 -178857
23018 843 -85691 355881 291479 350717 114417 -5574 -440696 12443 -40321 -2734 -19157 77846
23005 345647 149256 -130520 -187621 -374652 65256 -20386 263569 -164430 2253 -24164 -39239
22994 -39239 -43331 138491 -228652 -47197 98752 327655 187011 60207 148772 -77974 -316156
22983 -316156 -56325 70836 304433 -335347 -118544 -201228 193452 -68528 183291 107496
22973 107496 -176691 69146 -85260 150583 235799 -26916 -270853 213717 -328909 -103310
22962 -141161 -100736 -292014 175349 102523 22456 32366 53466 -180675 179959 28599 -121333
22950 -211809 -143361 -13 -64831 53660 -233139 95843 -316580 -135958 28902 319762 353375
22939 353375 -187388 -67436 97187 238681 -229245 -114966 176074 390777 -124328 82606
22928 -135467 -96927 304028 -175988 -116807 79673 -134575 34407 127949 51449 -93668 -127885
22917 -127885 -306481 -54343 147721 115765 -27797 -38371 100858 -136681 -53699 -370310
22907 -370310 208210 101077 312065 -78442 -64438 50073 157231 -146762 -121697 -161406
22897 -161406 -74275 6929 83801 -174118 251845 -155305 19357 249650 124185 -271323
22886 -450418 -52307 -4994 59864 -22894 -76070 -222992 -314949 84839 -35631 -140579 -32859
22874 -118088 241421 -167565 -214172 -225206 -264619 -185687 -140731 -264692 -235454 241425 -18745
22862 -70831 74410 -271193 -173449 -147220 244207 -208634 292967 -31804 -37287 -217430 127929
22850 -50213 -85265 176232 -182144 -241709 48657 -20462 -14389 23177 -111780 218565 -166693
22838 -89683 -78987 -19830 -542144 -96939 31160 -116897 -70481 -171928 227368 150285 91984
22827 91984 195298 -41943 166185 -151384 -53575 16523 -20604 39879 170481 -176544 -160088
22816 -160088 77200 -146281 492315 -23418 9926 -146139 -302948 -282182 -67975 -310745 -168410
22805 -168410 -262914 153170 27094 211865 23084 -195620 -55142 21407 -74737 -93104 202835
22793 -257726 -77291 287387 -142621 -93724 105805 -111717 -493750 -203588 -106261 -10329
22782 -106698 -96824 -127300 -46335 -248900 122034 28171 160496 -87009 44094 -398256 142262
22770 -385840 235371 259640 -232986 -234348 -140484 43866 -236113 203295 263773 -218132 59963
22758 136793 -117453 -62236 -191200 -91582 -710836 226235 -109017 144913 -122708 -23226
22747 137831 -120457 -261489 29850 -224409 37996 -80000 -87775 87419 -231552 3063 203484
22736 203484 -168861 14366 -196687 42065 -183673 -103128 361061 -47319 -47701 -23420 -19838
22725 -19838 -97821 122327 279982 237580 -193299 -135384 38171 -283151 -93390 86191 -14565
22713 -372998 -278023 -210 -89758 98936 95619 -41976 425535 395034 -11773 -33272 -147706 -55325
22700 -21660 116572 -325912 82920 26181 -129477 -31309 -149830 -115551 -350256 50861 -144022
22688 370034 178269 28417 -409075 -46593 202 208454 -49908 123088 -379743 -12013 -57021
22677 -57021 5393 50578 -199677 173044 -70509 21747 20133 -170470 257882 27166 -205941
22665 -250500 -624 -43630 -100236 73953 -139472 214902 152295 -75901 200038 316062 466361
22654 466361 40993 103089 -83154 -14269 -15740 46042 -151964 13589 -323147 186374 4790
22642 -86393 -202187 -335840 153039 -30 -159469 -178257 -269092 -95628 -154761 -154645 150852 299674
22630 299674 345318 -185303 97925 155551 -119647 147594 91329 -61067 -276901 274249
22619 41853 -125443 606 -115086 -418289 -29910 -53722 -343582 477783 246025 222930 -115370
22607 -148591 -135739 -68261 -325290 51266 -385830 -487605 35675 86550 -12856 48295 176024
22596 176024 -264286 21853 -158149 -279665 -474645 -243983 -44443 -90335 -197581 31926
22585 -52320 -197831 103174 -20549 54614 69848 -245349 -147387 -199009 -343537 -248341 -38922
22573 -28748 -130045 -10593 230962 -74758 -213369 -187223 66451 -94555 24688 -296790 106471
22561 63960 -288825 201724 2326 -145550 83511 -147151 -177574 -390825 277046 -216615
22550 86577 14209 -260173 -265111 16800 549 227452 -3759 -161571 -240004 99710 105874 -405589
22537 -272617 65166 -85518 47525 -307636 21142 -282050 77433 -140851 147047 104440 -139148
22525 -207186 156141 68722 -315055 -90476 -89258 -47080 91966 -62890 249281 153426 44272
22513 77315 -85698 -67890 137217 -39149 215481 -82539 83452 167097 348899 -230001 6581
22501 -398022 208173 -377349 377892 -26490 35963 -30714 49692 152681 -294435 -97608
22490 -30087 -50852 266380 -14321 167139 -65652 -273287 -270449 -74188 -309524 208594 32759
22478 20368 -8590 -108031 -80706 -194217 -13505 -213433 12869 214902 129526 -191656 111029
22466 202286 -96699 -129253 64925 -341447 -98723 135913 -47948 -70191 -144719 -35265 -143546
22455 -143546 183559 -138283 -286377 141049 -148180 -43401 -114671 -98463 152581 48769
22444 -54201 98650 -132628 -238823 -58061 -241129 -181113 215731 98577 45868 181069 61588
22432 -82948 243955 -123978 34555 10826 -34907 -16856 193321 126817 -372501 -254920 -256472
22421 -256472 -54268 79441 243737 -228311 -42017 12547 -251807 109333 -226032 -49901
22410 191529 55044 -146023 147383 -170059 253354 -88362 168376 -204934 -92846 -26618
22399 -12366 -260429 -124268 -346401 14083 117998 -23294 -148025 80773 -13233 -44689 -147462
22388 -147462 23872 -21087 103977 100849 33702 -318503 144423 258623 -74600 67274 171114
22377 171114 -139967 -135878 -19550 -49410 -135305 -217168 178026 -98040 -61927 -146290 173177
22365 66 -239104 -132204 102072 32853 -544813 156087 -224043 36696 -160376 -265816 70737
22353 -204610 -70335 -298119 -134057 -136592 -220363 -53478 75435 249935 109130 148518 169829
22342 169829 -211126 -12532 -114023 -169237 -165206 160373 -219472 42621 120245 -65849 -240355
22331 -240355 12285 -19392 -5512 -70760 7500 -237959 88609 136430 -259287 -225396 -313939
22320 -313939 -305386 -93328 -281861 73024 135411 98567 -67370 -97647 83009 -4188 118039
22308 230514 -111112 -397864 -140397 294720 -16347 27313 211160 -41243 287136 -169830
22297 -51375 159317 -19931 -111510 -157260 -233529 55091 -57755 -30945 -182366 -24283 206772
22285 -142454 47785 322188 -408456 86704 -39135 12521 -51433 -375253 -122138 -17893 -55564
22274 -55564 48117 -112331 -8755 -152927 105619 -49077 -69766 -142334 -56091 -169177 -59936
22262 -280288 -403933 209456 -77661 -149713 -310759 -179912 -142192 111708 -165285 -218569
22252 -218569 262393 211557 62257 -71036 -72637 -153393 -131753 -236413 -185170 86457 -5821
22240 -205677 286349 -166730 7928 -140968 -132287 -286754 140786 40761 122287 60010 -16441
22228 -24424 -81437 -390485 -368115 138276 -211026 -298606 -30005 -203005 -137873 28567 142802
22217 142802 -232885 -124817 126586 -130867 -187751 -33454 112866 -52549 72952 130522
22207 130522 55468 84011 11030 -107887 -177711 -263378 286943 -328988 -157352 66081 -202276
22195 -491928 100456 -103831 -57937 -217459 354657 196557 53382 -118650 131362 63946
22184 -211504 -325288 -419833 -156299 72769 24369 -191493 -285594 2644 -374080 257239 -33904
22172 -40117 19961 142693 -340058 -173619 52173 -103841 136621 153064 201814 192727 87046
22160 -107609 101029 225830 153724 127824 34339 93428 -98271 346983 -86924 212879 -185814
22148 -27290 -137536 42453 -228403 235580 -80644 -15451 -34472 -401720 -337610 48522 -258980
22136 -89682 -222831 172211 -88206 -494864 -25371 34690 -144121 136805 -299886 -108785
22125 -45433 -345060 -190970 194294 -96908 -206349 36534 65906 48201 100574 927 359435
22114 359435 379983 -11828 -210027 170069 -214765 -5205 170762 -114279 -214660 150385
22103 -69087 176869 -99962 -143387 -286308 -121028 25416 -85296 95337 -167405 45125 5223
22091 98666 228471 -125342 96983 -5210 -103889 -120271 65189 -186026 -233617 -140497 66557
22079 -121938 -234427 33586 -217215 130665 -202794 128211 -8425 -95264 -337123 -204315
22069 -204315 -164429 58445 -78281 -353668 -127336 -35941 -96415 78665 230290 -588299 -116172
22057 49163 -13687 -117302 174249 -249222 24356 58853 -57369 18429 26011 -123214 -242980
22046 -242980 -186766 -14900 -54179 -241175 -185998 -326118 133908 1136 -218256 150625 142760
22035 142760 236830 -333383 71117 126500 -92633 203011 -262843 -88204 52711 182562 -391021
22023 -133118 -228576 -61123 -203242 -128935 15949 -230359 -334801 31131 112878 -129740 147336
22011 -114751 -115538 76080 277045 177498 379888 167270 139594 20724 -42673 -174252 210175
21999 -56677 122120 -123172 -395037 -26485 -114425 -159456 138503 106144 -506827 -30139 275195
21987 -323975 -54827 -134942 46331 -122251 -273893 -6938 -294391 -290880 71508 172175 -26058
21975 120564 488840 -130551 101053 164356 -269402 7892 -342774 -30405 -180469 -155266
21965 -155266 28996 -68030 -302493 49192 -110498 -265657 109171 227302 26750 -97663
21954 -123291 157490 -97472 -174905 -305977 -108156 -105285 -295748 -45231 39921 -256598 -4762
21942 -173085 88538 -175525 41706 184333 -170991 -215243 -217280 57044 23036 112287 -203846
21930 17944 -113654 3195 -117163 35326 80676 18861 -176898 -9356 238206 146480 73995
21919 73995 -343830 126760 -79285 192633 134094 28427 99619 -73764 -302761 4958 -296985
21907 -58592 165246 122245 308561 -7336 -40414 61862 -11299 24224 -87881 86409 302003
21896 302003 -149150 -84892 -11360 -8477 -187156 -27101 -33549 -176623 -229663 -166532 -258734
21885 -258734 -238116 -166096 -36591 144947 318166 134952 107031 -288819 56892 181385
21875 181385 -365158 -231496 -259849 -21097 -192398 -216893 5565 -58839 117726 -57757 -248188
21864 -248188 -3360 248279 88735 179646 -257418 -169416 265008 -11998 -30213 -225828 229513
21852 65663 -363013 154833 -179746 -4772 -160962 16449 156563 -525289 -141855 5698 68728
21841 68728 418097 181529 154690 29974 318123 -27740 -121529 -205511 11079 167634 -75988
21829 -389865 -100520 474624 108650 203921 -229781 123452 -35242 -171847 285287 -151331
21818 -257687 -46441 -238706 127055 -79427 -25689 40363 -320431 -40481 -51079 -284077 120898
21806 -86476 113930 -70646 133101 -106737 61917 -45715 56284 -187874 -109304 204143 -131792
21794 46634 -15434 -153727 132102 72756 -13992 -99258 17292 -329816 -219138 48625 -200330
21782 23364 74115 -54575 137740 103122 80698 -34478 202368 20849 95664 -213405 64889
21770 -279336 -99478 -820 85111 150656 -19134 533398 -128689 188052 65876 -35950 -217834
21759 -217834 128659 266119 122795 -92127 -8151 -321624 -159698 100181 122981 14053
21748 -11340 -15555 57676 -138768 -217672 22519 -252306 65086 -263172 -50455 -177356 173305
21736 318675 139203 2006 31141 -87320 -18377 -76859 -40584 -382434 -59212 -46884 -183118
21725 -183118 -114668 209389 62303 -250883 -157553 44859 264876 -48462 99536 -18954 -47756
21714 -47756 -87894 300187 -219120 -143135 -157903 -93460 -155408 147250 -308304 -80442 163586
21702 -76662 -197917 -69170 56890 85329 -288042 -260443 -68649 -330121 -353520 -329366 -235745
21691 -235745 -196656 100630 -71892 41876 -68337 -348491 -306213 5595 -98150 26019 -640 -31623
21679 -31623 193027 78585 194622 -119462 -117733 100352 -54838 -43602 133311 72946 -56243
21667 19508 -11371 42883 -65645 139270 -35203 -73539 -27971 -189924 280523 80475 97940
21656 97940 -4832 16716 73335 -107234 -150443 52753 -261302 -67287 -68571 147522 -55334
21644 -220927 245022 -69162 193513 -62561 70019 90415 70075 -100352 123628 126059 83247
21633 83247 -36549 1218 13355 -152448 -245887 130797 -22631 -150395 -197207 -70467 99883
21621 -163994 -179274 -256372 171559 -357078 202573 -117026 132153 243457 -333830 -136044
21610 98797 -204492 -45885 15027 -46715 -212191 -341071 -266730 -51109 13381 -125501 -209957
21599 -209957 110363 -9533 -68806 -264160 332534 202592 -217777 131961 -25651 -268132
21589 -268132 -148752 34717 53698 93937 -178835 -106623 -1326 -296968 138931 -23500 -94082
21578 -94082 18638 -38070 -79742 -98390 10577 -52746 65407 -118998 -57353 50990 32230
21567 32230 -7018 -227761 -192038 -36711 -93021 -438059 182126 93538 -124272 -56628 4231
21555 106361 96028 -17387 -250175 193927 -7990 -169760 353566 -393154 155091 117023
21545 117023 -68361 -59879 -315174 48127 260666 413696 124407 -24486 -43997 178541 87887
21533 93163 -180197 66647 165015 -295059 -88268 -61236 170576 -285813 13549 204506 -19398
21521 -209365 207803 155360 197027 112785 -257638 56465 -403151 -127392 -299481 -42662
21510 -340488 213916 -221255 -240395 136155 -88977 -189720 54335 111977 84049 -77282 52998
21498 -302551 37063 94139 -305028 100695 -120872 -417198 -331529 -53915 -16218 125217
21487 93184 90147 -25244 222729 81610 -45157 131353 -304927 -19940 317696 -285213 -33855
21475 -129037 -162469 -131980 -8910 55207 -143652 -224227 312534 -413783 -285705 -67998 14509
21463 13915 20180 87480 -321432 -345582 -88058 -284988 -270175 84082 -336364 -216951 -151367
21452 -151367 152726 -63382 -116338 -297291 -57798 432731 200846 246594 61768 -74986 -129315
21441 -129315 40231 -277688 36645 -205578 -326187 113459 -18418 -60175 -132817 80702 -83905
21429 49627 311227 -852 -68718 135192 65366 155773 384746 196240 89987 144980 130907
21418 130907 -46796 14670 66602 102570 -171058 -300174 77855 -44462 -32513 -294317 32313
21406 15119 -143837 521072 141351 42156 -374505 -301647 135881 -180511 -30651 -280997
21396 -280997 68906 -12369 -378387 46069 -23061 -27217 328143 25356 -354432 -193345 -71914
21384 -163508 -138542 -98782 32589 -91131 -38387 175908 -387282 104687 -76876 -176284 -44166
21372 -24086 -76411 -25017 32716 -159166 -299282 64301 33954 -164336 198423 88692 -206388
21360 199224 13406 -115133 -252253 -161801 -405217 31524 -135718 -1409 -9693 16781 20096
21349 20096 5452 -71619 -245184 -8683 28887 -21519 164548 -250931 37842 79774 18813
21337 -157179 -197222 -101258 59762 190378 8459 -190003 -190616 -26747 13835 -151649 -28486
21325 64282 -108380 -22801 205704 76880 107738 -344394 231927 121775 -277377 -141375
21315 -141375 -548361 -175741 -118420 -107403 -247913 -147833 -57846 12637 -50752 -239377
21305 -239377 -297768 98353 108849 -46879 -107676 -155969 -66169 -199129 175578 190604 -155182
21293 204378 169582 162026 -289365 266384 -235184 -174501 -240703 150340 -43201 -250468 158236
21281 -47576 163502 -81023 -65584 -153901 3684 -269575 202071 -57355 -357525 171352 121635
21270 121635 62888 159692 -169981 -34205 -448878 -350908 296059 159589 -219839 -45199
21259 228382 94194 24135 -127769 72654 -196140 42417 116683 208374 -448564 234927 -144801
21247 -24392 -35204 -168981 -204702 247491 -294654 -23210 -125192 62701 -27296 -82260 -39751
21235 -19486 -3257 -67483 -43673 147671 157255 142555 -154102 -176925 -232014 129700 246730
21224 246730 -285668 -81242 -80746 -50255 44410 -354909 199467 125031 90423 -161842 -127565
21213 -127565 -34442 -485648 -207528 -77240 8367 112093 -90533 -21834 57030 110597 -21919
21201 -239077 -55805 -210607 -175155 -154544 58604 -133531 3435 -441677 -2959 -203778 -122365
21190 -122365 -238829 -313226 -192449 353131 183206 39364 -118864 -171827 -212588 -195199
21180 -195199 -229675 -445932 -91065 -115230 -64826 -271061 -197391 -104728 234282 -398413 -229992
21169 -229992 -16608 62743 26273 -18510 70218 150251 -21761 -91921 93484 -129676 -412794
21158 -412794 -264759 333754 112264 -236775 -109417 -231374 71182 -133694 -476809 272918
21147 -150690 25086 -167254 286681 35192 -137702 80834 -39595 -91006 -139730 47505 -194468
21135 185794 -186818 -278811 -353023 68199 -347624 211657 240362 -44778 138088 -145325
21124 -204441 -206256 196053 374411 -31906 -226870 178881 -197369 -354064 -40362 -8364 181592
21112 -497240 36469 -99087 81620 -7449 29247 -174249 -222756 102771 -269852 30894 102310
21101 102310 -248373 -186972 -447146 -25223 -139604 -418501 29406 65889 -225042 361593
21090 -183593 -12373 -84283 22207 -140098 -182912 91526 99424 -38630 86733 -191695 -98494
21079 -98494 4907 -8624 112724 149848 49692 38694 -337779 -247731 4449 254289 -256208
21067 9295 -185360 -33596 117729 -130894 19430 -163664 -155799 365098 -43154 -139612 -116551
21056 -116551 -162237 111349 -286951 -61944 -235953 -60913 -52448 103363 -234054 34155 82847
21045 82847 -205497 136309 20158 -125783 -95087 -193255 -44193 -154926 107718 -131099
21034 -380671 -448142 274323 -89686 -235545 132758 43536 -26088 195869 -183002 -133654
21024 -133654 86106 66045 -197661 -195316 150058 243519 18816 -96005 274145 195113 -179968
21012 174185 -242710 306530 -200028 59401 -37980 -162781 132748 -23553 -124823 127014
21001 9992 -23162 217469 -68663 138131 80342 205296 -110925 238731 328989 -92284 262295
20989 29458 -210216 198571 160699 8018 299728 -108262 -137722 1983 90784 -285592 52722
20977 -87127 29827 -103710 120624 -343316 24591 -120826 20088 -78064 -322909 -165427
20967 -165427 -203563 90924 78188 -96937 267953 -92168 -133797 -99101 -275129 -48039 73921
20955 44288 -17605 -362946 -120871 -357169 1978 -264010 -164835 -188561 -117693 266464 53384
20943 -49171 -215362 62386 -205158 -257115 57100 46979 -259980 33294 15321 -46963 33393
20931 110136 18272 242212 157153 17757 469288 -113285 -16499 328623 126737 -90445
20920 -63909 162847 35525 -258870 138950 -97160 -248017 -207109 -122822 -22447 256705 -115584
20908 -326977 215381 -85566 173940 -283224 17326 -278810 -55187 -55576 -377188 262387 76593
20896 95363 -125335 76258 13521 221062 -5769 -342366 83836 195061 -191 -146056 379700
20884 -358044 243898 -290628 -159097 -47049 -119078 -135999 -199510 62873 13577 -266846 -256090
20873 -256090 44878 -48418 148069 -174224 -96556 2662 -352087 67700 94109 -280795 57785
20861 -171307 117920 -78615 -24371 -103502 214301 -64117 -283762 -232328 -182476 -368268 91404
20849 -298168 -159265 159710 -280045 -385571 -150833 231970 -78682 109100 -62056 -175716
20839 -175716 -195584 -9451 -160768 -69437 -181356 -252827 69798 28634 -122106 -62216 154570
20827 -31788 -32571 -139684 -288697 18512 -161998 -268045 369314 -56912 114642 -112183 10778
20815 -12351 -69238 78604 -212547 -302276 -272179 24516 233786 179233 37565 67985 -51407
20803 -122032 -115808 -271373 -129241 2898 -22604 -93316 -167496 -242890 316032 -224437 15438
20791 -190465 -51328 69925 23821 -79378 -5728 -191843 51622 -150849 42112 -203827 -600720
20780 -600720 -142221 -31123 -369974 -214116 -79853 -161369 -35812 -207587 341441 -86303
20769 -112046 162000 15610 195771 -151681 220746 167091 -3424 112430 76579 -121953
20758 -81018 455 -45510 -169401 27059 -4279 -88978 38684 -120810 -228182 -62214 -54721 -227920
20746 -227920 -85266 -94968 -280019 -238575 -510525 -44571 69074 80335 -51211 -346790 145950
20734 -19816 87118 153365 113454 -113441 475734 147183 -69542 -80666 38448 -25748 -47649
20723 -47649 -44483 57878 42043 23578 -198908 -355640 -8538 -294868 60551 109625 -62622
20711 10119 -239048 -184198 211544 -162288 -274873 -40052 -10487 114023 373654 33774
20700 -303627 -212235 -140683 -362940 -146691 -121637 -192810 -77278 -203406 -90605 -299520 -36086
20688 -387558 -54204 -289059 18572 213434 -236976 50805 247616 -19203 62555 229251
20678 229251 -310276 -254249 46784 265424 -47443 42814 156064 108514 -63997 83238 -112738
20666 -140067 -199356 -54531 90039 -2453 -117939 185964 -35398 54763 -231522 21411 -24519
20654 -142706 211551 90058 -460096 -117329 78195 -24730 -68741 -68918 36470 -17155 -280954
20643 -280954 114019 -14623 -461283 -311844 -387003 241279 -305857 -105159 -335048 -57572
20632 -100779 -345719 174708 53637 -157173 213624 140574 -158453 -65054 -238409 -36273
20621 -93046 -272948 139302 74115 -210428 -157331 -290777 -306635 -164636 -166568 -126386 204371
20609 218903 61628 -211178 -129656 4809 -224762 -299273 14784 -260319 -63750 -408424 206426
20597 -127081 -145505 -49528 222591 -61801 -74127 -107422 -121356 41473 -179182 -31624 -198121
20586 -198121 71695 23669 -109471 -20141 187212 -92983 -157735 149720 -26919 -295256 -151409
20575 -151409 169266 -158887 53718 216570 -189910 78269 71196 -125181 22954 -147261
20564 -325614 95598 162053 -6272 82030 -405700 -103485 -155233 60763 -12990 -309326 -43149
20552 85104 -467263 -138477 -318861 -124846 -2044 402920 34592 -379611 -297572 -94728 77899
20540 37734 -306205 47324 -236622 -33360 -237813 -180792 5817 45610 141392 -246915 70923
20528 -84282 -88384 -134111 -172997 120118 -121857 -122534 141700 -208275 -156990 -243530 -309349
20517 -309349 -368613 250167 -145441 -68247 -68952 349641 -476443 237 -27899 85022 8830 -43006
20504 -72123 -120675 87099 -19117 -45670 -188784 -144247 -50514 -225891 -422938 -132423 21248
20492 33371 45006 -166579 74802 -435248 271214 -469035 -32748 -182043 -265152 198600
20481 -206207 -195481 151042 -186853 45281 -152989 -30188 18684 231309 -346406 -96774
20470 46508 -215915 -151009 74997 -350051 112907 -268522 -202011 42840 -48310 31597 423526
20459 423526 -10552 -63342 31085 107543 -55453 259678 84075 -106242 86629 -152829 -264584
20448 -264584 -213009 4408 -22412 38024 -49384 -78014 123699 173901 506 -228444 14845 160306
20436 160306 -313843 -4957 -288613 -180033 -322961 -333997 41279 -116170 130290 196457
20426 196457 -420536 192466 20859 52078 10858 -46675 -121610 -272351 64403 -217999 353563
20414 -75783 217520 -377997 -165808 -6749 -30574 114261 133333 -303894 -60250 -180872 131070
20402 -220857 -343053 133514 -120781 42659 188748 -171784 1739 -50551 -255808 -284644
20392 -284644 -115743 -140914 -367593 -38619 -87546 -274226 -285681 67301 -82658 -10234 135115
20380 53853 175941 -121383 -119914 264618 -117937 -286457 -91033 148413 -62637 157794
20369 20251 -107324 -192325 217696 -349222 115713 -307603 -58337 143159 40469 -70747
20358 70777 -14607 -131074 141367 231717 -78339 -295882 309075 112273 -50127 -237719
20348 -237719 7334 45345 -62263 -10752 -193865 54527 -124889 95975 -22512 -79620 2018
20336 -66927 189659 114297 -361493 -216117 22666 -17208 -327752 -269048 -250157 80556 -66673
20324 160390 77601 127038 108640 -100728 -185868 -16662 -227856 -264464 -92349 -8741 -90337
20313 -90337 -178139 -80379 -253191 17508 164523 -79270 -192656 -97204 -122372 295458 -219460
20301 -150200 -296209 486066 80038 -76459 -125862 45519 -416557 158306 -292951 -118816
20290 36618 -71112 -178049 320109 -60748 -199738 -136663 -133034 120042 -87335 -168927 -52020
20278 -309176 -95534 -57275 -88096 -31511 -146924 -92887 175570 89439 -136956 68144 -292908
20266 -101575 -124977 -442104 13889 -185697 -253240 22025 -101833 -207521 -145359 -30737 261124
20254 57661 -87002 -423489 91363 -12097 -135986 64634 -360128 -340797 -146500 182070 -45628
20242 161690 85899 -470192 -147420 -143054 -247795 -311906 91773 84650 -218518 -123880 -192708
20231 -192708 -37497 -144274 -31306 -335538 -20341 7731 -83677 -90016 -278431 55957 71712
20220 71712 -184865 -64498 -8584 143589 -58335 -58288 151492 110414 -46703 -58983 195394 -252718
20207 28977 -28851 36231 -393494 136789 75940 -209139 115950 -171308 -55728 -142599 -296119
20196 -296119 -36443 28898 -23217 -12128 9163 90911 -105860 -188485 148316 -145237 153676
20184 62431 -372158 136955 -149094 -169098 -244504 99455 128597 -19217 241776 -164154 -28649
20172 56565 -261553 -324995 -221282 331599 131042 151942 179168 -214115 -106849 -56870
20162 -56870 105810 -290510 218187 -26237 84752 -310515 -51618 126768 39407 -98325 -217303
20151 -217303 186468 188242 126889 -72111 139688 130919 14609 -79239 -210660 -168232 -387635
20140 -387635 -121242 148668 -157894 407392 269938 364174 146751 500278 89928 115106
20130 115106 353071 25356 220866 100846 467201 402239 594115 237109 116388 -102544
20119 -49137 -102623 -255904 49629 103803 -94245 -72231 -239934 33243 -20240 -300938 181790
20107 160897 -34333 -259873 224301 -19225 -118286 -373517 -193130 -300988 90289 -180322
20096 -153507 -184452 85223 -63402 81762 125909 142693 -188358 -112177 -99569 22826 -110475
20084 -153207 -40812 155462 -28773 171911 -41751 -143461 59410 -204885 -37428 24125 -227385
20072 -95052 225421 -263733 -290263 4044 108191 -73566 -211520 179581 -2626 -140728 242013
20060 208700 -303068 192974 -29322 181706 -302180 81878 68797 -22400 -131057 -95110
20050 -95110 -116711 -272159 -41920 11257 -14658 -187180 -293364 -96362 -121637 140370 -29034
20038 -112362 -53741 39674 -166238 35281 42409 -155178 158033 -220234 -179252 88214 127326
20027 127326 -83566 -80495 60045 199180 -161370 -256647 -89608 -105528 313858 202279 -243582
20015 -276062 236764 217658 26846 44498 -278185 -54663 -16666 -239721 -26876 112536 -47926
20003 -44400 -970 -231510 26052 3701 253446 -122903 -22557 -282307 -43886 -132524 45330
19991 108719 -122389 -80879 214044 113634 -321481 -88804 122023 -304650 244056 305242
19981 305242 323342 -43881 286217 -6448 394565 301476 381554 -45268 196656 25207 141621
19970 141621 415745 -27350 -55392 -61725 95310 43771 -268634 78872 -109176 -97784 109776
19958 176720 22585 -23496 201276 -31580 -440685 -149312 -16083 389645 -164349 412579
19947 258175 -336012 204431 -93186 280546 154457 171813 422918 -66320 32717 244775
19937 244775 -245875 -142287 -32639 -123736 190687 -208774 -362383 -109377 -8352 348042
19926 -112597 -117689 -113719 -95374 -71798 -24394 254693 180914 29590 -155815 7305 73259 -107253
19913 89737 60112 -207363 -172219 -92825 -94824 4100 33804 41078 44816 230224 -265196 218023
19900 -22038 -382868 -6504 116415 -91743 23639 -238812 -36880 -67534 7794 74962 -46303
19888 -112185 -131013 -109397 233059 16097 -299742 -338049 -100339 -117081 -38576 82105 -193900
19876 76341 -11239 -98817 -390884 -63939 -118882 -113091 -137334 5217 -74175 -92957 -233754 -231627
19864 -231627 -11677 203737 -158200 -189570 83989 73529 92922 204272 300873 573735 48902
19852 -197627 125697 -126951 227317 184597 8575 149689 107198 59640 -233222 -201558 79897
19840 -133825 -47714 -130772 -14395 6990 -399970 -195224 81995 -87885 -253701 11099 -209740
19828 -265721 -253 -353353 -2911 -412465 95985 -215291 -122800 -1493 -253158 -189864 -70328
19816 -146485 -98723 -80281 304414 -196250 -48016 -240560 99522 -87659 -145439 70393 67065
19805 67065 75205 -101646 345410 222339 119933 -342194 -141436 88381 -79503 35875 -238479
19793 -33564 -254754 -139725 -62439 -233196 -45109 -125247 -206949 -157273 -158266 -121348 -154351
19782 -154351 -165997 -42623 108912 -184838 -358478 156791 -89235 -190031 30844 220224
19772 220224 57210 106318 24543 235928 196278 -170399 47525 -63013 -77756 -50196 -52506
19761 -52506 21635 -59964 217539 81933 71978 -17326 -97635 -203828 -409889 -242093 -186972
19750 -186972 138718 -338398 187344 -200610 -130979 -222679 50206 -85066 223312 -109004
19739 216462 156378 -279155 -40993 -155842 -427516 40773 78590 135047 -2978 55072 126087
19728 126087 86984 352328 -112150 -23639 330911 115105 114423 -110080 314477 -116209
19717 247724 60328 400359 316645 521267 341829 129022 355909 -21563 155364 -52473
19706 -6034 158957 -375512 173333 -263520 41814 -167730 -151704 17681 302693 346728 367461
19695 367461 7199 -71402 -56533 149891 186948 -3980 241304 -211281 16321 71460 25384
19683 273453 78194 114096 515659 -38796 34178 -168795 -115818 -122184 132296 32369 -112447
19671 -205055 -335525 -143752 28676 201021 94578 -181206 44826 -433576 -214043 157143
19660 64079 199316 63744 25593 33667 353308 -537071 248495 -212929 -222506 -37451 -62266
19649 -62266 -198021 -67666 38220 -199792 53481 -295220 -201989 41921 -111268 202542 332599
19638 332599 -263889 -404183 -60226 -259268 9430 -105360 -135360 -96958 -319956 -204600
19628 -204600 102858 -93770 -103637 -113191 196392 -97010 50698 1565 -63525 110510 363898
19617 363898 -172361 -220015 -41314 8941 -50002 -122859 -387239 -86142 93838 60395 112383
19606 112383 -155473 -217391 -245417 99075 -138959 -66949 -38389 -235540 126805 -152088
19595 -115045 127236 -219027 -170115 -60022 30783 31354 8989 -5227 8515 58254 -98184 12605
19582 35122 -66524 36323 -186493 -48919 -327129 134146 -162874 -29209 99878 -285293 -205554
19571 -205554 -88160 -86669 158392 -177669 -337716 8660 127013 -38617 58584 -282923 -22152
19559 -268110 139188 2394 -105425 28991 -120935 -26450 -360898 25258 8248 -123416 -31395
19547 155279 -159142 -381077 -249678 -436503 211512 119650 -177134 57648 258104 102413
19536 249792 -156303 1111 -231584 206711 -124168 265893 -246853 -107073 -227854 -129320
19526 -129320 -60074 -248587 -138599 -89490 388206 -331195 -15280 -513606 -70780 -25529
19515 -74179 33791 278963 332721 -203694 -73956 -319049 -117374 135871 6163 -337875 -49925
19503 29739 116810 61419 164340 -118996 45429 2892 116657 211561 -110175 -260683 -254541
19492 -254541 99530 -79855 -166892 127892 115448 -173246 56362 120531 -61492 -371787 75398
19480 66069 -150543 358386 -75656 84976 -180977 60297 -151996 -16355 -136622 -205843 266099
19468 -220761 -71148 -204251 -44376 58578 -19249 -179656 -177072 196347 121638 159259 224789
19457 224789 164396 145562 94731 -266278 157248 -233946 27673 -50816 87755 -223874 147900
19445 -60503 24029 124380 -51866 -36910 -62840 -267581 -202387 247411 -73391 -102283 57960
19433 -60590 110558 -79864 -108715 -203989 -214703 -97660 6768 -384520 -72040 -115765 -30322
19421 -355391 -50131 -147874 -226999 139192 -200819 91543 1851 -120946 -32298 -25529 287861
19409 -59796 -31556 83780 95424 -7892 103664 -58415 86922 -34888 -123935 41193 -111400
19397 -239481 -47302 -280834 -287937 -265169 -214381 -312482 105546 -316311 -161763 -350165 -59200
19385 -194688 -131918 -356195 219557 -128936 25983 9690 -36773 -167779 -122701 -96729 -286512
19374 -286512 -434655 -275548 -125830 -417385 -154421 8303 -169143 -237764 -136259 96275
19363 -198895 -228898 -57493 -332423 62257 -86784 74187 121701 -155056 -251174 -191219 -38464
19351 89274 -164696 -190620 -405804 -187321 -225437 -137848 -193343 -186298 -197913 -75504 35002
19339 -219623 -413323 206877 -30007 7340 62947 -15485 -21524 -66511 -280656 -85193 85093
19327 -211223 -445232 -206994 -437636 30577 -182456 -254170 -53391 -257637 -175876 -113338
19317 -113338 172805 293145 107406 -20990 -132759 26401 131016 -348688 -182391 -141756
19307 -141756 -428544 -178209 -203431 -136605 -227712 -166044 -73588 -30839 -134432 391538 -132685
19295 -330418 -288102 -20434 -311476 -87752 245920 12106 84061 -189034 63258 52719 54040
19284 54040 2850 147141 -11387 -41525 144768 -150676 295019 -116278 20468 -294072 230493
19272 -196046 -78363 239793 20517 -160281 275755 -115354 -143961 -106564 -368595 -205617
19262 -205617 -144450 -181457 50219 -148833 29282 -161986 -143329 16156 161482 -223804 -78497
19250 -46780 -374155 191080 -82061 -145269 109382 76153 -180012 -205742 -31412 -19096 -382843
19239 -382843 -97075 -106213 318547 -321274 11096 -402201 -137995 -32881 -122734 15593 1933
19227 112589 -30678 -77565 70091 -308162 -152942 59595 -172818 286394 -7530 110446 -6938
19215 -92461 -40539 293406 53684 233578 -321289 -20413 147658 144225 -162381 -205998 285077
19203 35563 32607 249819 85949 -287515 -315083 -115216 -97992 -185277 -250591 -182262 -241663
19192 -241663 -71938 199991 -3797 -44997 -203038 -100860 -350747 -89053 -136498 -152937 65539
19180 -4325 -152565 -341044 98867 -68615 83219 -127886 -116627 -202038 -85071 266047 124717
19168 -3702 34437 -72701 -86615 -24061 -166256 -335494 -261310 -446135 -100717 -157208 21648
19156 83532 94592 40274 271591 -157519 87755 -120464 -86979 195455 -176411 158420
19145 -42878 88398 -247992 -19793 105361 -34699 -15913 51103 -43064 -130732 -234026 -141350
19134 -141350 -199834 -295102 190330 -30012 -15602 -54363 20090 262140 -63890 -174871 -4971
19122 -126046 211890 -46760 -123309 -144486 78231 -3528 117663 -9752 149331 -122252 312296
19110 -123759 137930 -158004 84914 -228041 -201076 -40058 73891 -132546 279780 -190133
19099 -90621 -398634 -351378 -60246 203309 -394335 -94807 -296676 -340173 -102652 -152928 121182
19087 -21659 -207571 -129433 50684 -301913 -12553 50700 -81695 -116438 -324252 92093 -524275
19075 -116661 -2644 -232075 -277293 -58486 67490 68733 164065 436208 -103556 -204985 -150925
19064 -150925 -47116 -135800 303981 -170004 -156708 -131793 -154037 -145537 -11519 -178538 52824
19052 -76848 -124485 -323159 -48751 -119223 -330095 -48118 -299321 -4216 263427 177418 141107
19041 141107 -85212 -81837 -249568 43187 -5309 62682 -96865 -106421 -250234 57615 286695
19030 286695 294807 20999 7778 -217998 -91438 50377 -335934 -37759 35955 -205632 -76167
19018 -164736 22844 -414474 -54852 212556 -165613 217665 -97702 -289606 161366 -88193
19007 12693 -78417 -5569 -335977 -275933 -82147 -60710 -65843 42098 239262 -35901 241639
18995 79471 66529 -6356 -145559 -110284 -106178 -181440 39651 -501096 -170809 89494 67596
18984 67596 -167690 247304 377263 -181749 -48489 27116 93596 -104130 -229258 13449
18973 74075 -456550 330660 -37357 -65251 -336910 -98484 182188 -323525 -227637 -78688 -246929
18962 -246929 307623 -104882 218031 199615 89704 451335 26440 126067 509045 101833
18951 -79537 -165742 201858 338181 -6652 -95022 -56292 154131 48522 -41178 193149 -60497
18939 -31120 -147745 502388 -221078 -385833 -276850 -309524 -99883 -187649 285254 53304
18928 -94118 -66291 -34140 -208580 -101443 37639 -126143 72144 -161545 -537663 357296
18917 -76508 123358 65732 -98341 320003 -240264 134800 -13801 -83508 447910 -228152
18906 45977 -34147 110053 -154616 79104 -11092 69296 -134954 263153 301365 -119066 80351
18894 192520 359151 68509 -240152 -153870 -68975 -256267 133510 97634 -98259 -36560 -51734
18883 -51734 -57015 -180481 1015 -135210 -294615 83769 -161503 -251360 -113181 -272742 -42178
18871 -34962 210090 112406 102307 -132238 -76815 -423378 -344923 69508 252971 236788 -150417
18859 -174637 -47944 24696 -364748 149480 -210944 -26579 200980 -227947 -47562 -19394
18848 1129 -66185 -65147 114491 -142057 -94350 -21180 -40337 277060 41142 -58387 62322
18836 -97187 165800 -158640 174827 -226534 -111691 169789 -301153 -22080 -48936 67752
18825 -221718 8457 -304421 -320330 91622 31020 -406998 242254 -44208 -30670 -119588 -188531
18814 -188531 -389270 -248342 29565 69678 -348985 52702 -163736 -8262 280324 -75428 94248
18802 2790 -85621 -82090 -222 -107703 372960 -238429 237289 99591 -279906 118114 207767
18791 207767 356047 54335 -181710 102564 -25915 64613 -349911 30768 314125 -342277
18780 -41962 -364379 -64167 258924 -111848 62882 -38441 -52869 -153558 -79158 -240577 -489833
18769 -489833 -84701 191138 -150156 -46254 -507228 -134431 157043 -93612 -16409 -378227
18759 -378227 -6192 -325780 -109431 -229513 -95391 -264538 -55845 -172839 -162493 -139523 -69011
18747 -111368 210735 266958 65545 104056 -64909 29121 152880 -194514 -159392 100537 262831
18736 262831 -130988 -120628 201156 -104676 85483 121021 2662 -528443 -59631 99272 -128681
18724 163874 -540649 76609 -16819 40654 127523 -67226 95252 77930 -274777 -215046 55482
18712 35276 160874 -81647 -109460 179632 151578 -146118 -33438 -8517 102154 -272651 220468
18700 51460 31830 -181099 -167303 143096 67973 72358 -211328 -508439 -626169 -198643 56626
18688 -337468 -118210 219641 -226871 -42599 77817 166077 -215503 63591 221325 -220436
18677 -112474 264999 -34284 25185 -117131 -400537 -7118 -43856 325387 -39560 -137229 -262109
18666 -262109 98231 80980 84605 -123407 149513 -167023 15044 -117022 -155727 -122764 -181134
18655 -181134 -78204 -98789 8034 -14623 78919 18633 201158 -125319 81726 219967 -10069
18643 -58664 229586 -43447 -51179 -39461 19622 -101689 -220202 140005 -277757 68649 -101781
18631 -54242 -172082 8508 -89198 46306 21927 -112498 -14147 8350 -135751 -120423 -105954
18620 -105954 -120557 -241333 -71025 -169568 -67342 -560546 227674 -282564 133050 -90241
18609 -14467 -291342 -143854 13945 2058 -39047 -216597 -98145 -75845 -38482 27797 -236895
18597 36122 91566 71850 14401 276169 -36651 -34416 -13577 -82456 -142874 122109 -254460
18585 -145843 -127836 -75770 -55649 -55156 -129335 101586 -219924 -66521 56891 288559 -312036
18573 -169913 7433 -189829 -59686 190984 65626 83678 -93421 -104681 -143921 -209896 -232649
18562 -232649 266000 90783 -98602 -84892 174359 -18414 -93818 -148940 -25819 281992 -195418
18550 -339301 -219944 84258 -101720 -18364 -47047 158009 -19951 -74873 -143451 217627 -111786
18538 -209328 -168532 -8119 -43333 -97729 -272914 -275810 -78852 -165043 -81550 -45103 8769 154163
18526 154163 134063 15786 -176103 525749 13260 -173451 -245359 -62471 -84637 5608 41017
18515 41017 1755 -102479 -294285 164757 -234965 346153 -250949 -36420 255801 -414775
18504 -309974 -432394 38652 -114722 69513 -202131 -46021 -13428 -206879 140026 13362
18493 -135840 98774 143660 208551 28946 -122614 -7182 -76328 -1650 85316 -258131 692 -277142
18480 33643 -351304 296163 -122847 7831 23039 -236174 -183715 77376 -35880 -321750 -160716
18468 -159595 -77022 -79891 -76732 -82827 -9288 -19272 -34195 -250064 -271737 -319052 173204 281496
18456 281496 59878 -62784 168810 70243 -128091 171539 -75180 100355 119132 95691 28880
18444 -8335 36567 144008 -185466 18415 105920 -129313 156570 -397705 182352 215927 -324964
18432 161577 -79759 -42166 107285 28756 -8456 -67488 131989 157938 -161151 -152218 -259634
18421 -259634 110334 -12934 30393 -221580 -81625 -174051 -146320 -25219 -40947 -304971 47488
18409 9135 43826 206067 -110372 126284 -21560 104093 239499 2597 -156604 446163 -64066
18397 -357342 -141676 -87823 153572 -6055 417145 -163541 -201761 -232665 -11099 -188544 -134639
18386 -134639 38992 -69929 -414069 112020 -203242 242349 180119 72166 -99228 -285212
18376 -285212 2348 -53755 -193411 -85065 -100315 -15771 11969 -170628 -17230 -335089 -162551
18364 18990 -232458 -229728 3994 -211342 -2198 -370137 150532 44432 -93102 -79045 95457
18352 -191262 235213 319710 153476 -153185 -228965 319232 122611 247080 -316113 -50349
18341 181470 352278 171300 310240 -224002 -91235 -59597 216199 5261 315719 -129368
18330 -448249 -133469 -496309 -226554 358701 -385522 -55941 -47317 31788 233496 -212625
18319 -203708 -228415 88466 92296 -137665 77851 4522 73131 -7473 -47286 -20764 74589 -39914
18306 2480 252198 -397087 -337851 249060 38171 39512 -145680 -425410 -182842 -33781 -58266
18295 -58266 196123 -22522 138354 101162 181212 -58205 176698 157593 24264 205460 123172
18284 123172 1521 -32498 96035 -70953 -89206 -143709 -149771 433697 24031 241983 -95149
18272 -134574 196363 -173676 2322 -426134 -67417 -79221 -293974 -93441 47024 60050 -67691
18260 -32348 271574 -180022 298831 191543 -148883 -546918 -9162 124025 4833 -227378
18249 406412 -259589 14352 -337505 -145426 208443 17355 -49441 141636 75513 -260673
18238 -59528 -93325 -31285 7054 154939 -78382 -201532 236336 -221976 342 -199069 -117217
18227 -117217 110934 323685 798 -156120 -51612 -50401 15766 -338237 4764 -3581 289990
18215 -65171 44838 -151753 -35556 175452 -69391 -122581 249332 -289086 -220553 -145797 -360691
18204 -360691 191808 -78738 -385084 -455526 -133576 404708 112480 172113 -218674 290866
18193 -245972 80038 -29819 297824 26759 185010 -23388 123542 150437 -120941 -41766 19981
18181 183763 173881 49235 188150 -9524 -128203 76888 -273441 -184793 -151533 100209 13156
18169 129970 173313 55707 -56198 -346391 -113368 -254985 -43534 -198647 187487 -56245
18158 236215 191348 -320738 147774 136599 451264 164470 -155308 120822 164356 -54916
18147 44270 -248839 -266560 -59355 -56638 257010 354113 -166705 -394011 -3922 25236 -144033
18135 12532 -130506 -112403 -206861 29871 379271 -162826 166657 -97254 28405 129763 -33452
18123 281854 -103105 108876 141105 -51698 195500 -403846 -143519 34455 -308594 -167994
18113 -167994 85518 -282251 -16378 -266139 168708 -138248 62637 48636 -120647 -33433
18102 511166 -169596 27398 -24449 -67272 36382 11217 -86617 25293 139996 2621 -142972
18090 24922 -192708 -100453 172864 44202 120122 72171 400803 40166 -47640 -190946 -81874
18078 69695 -193858 -46105 -270718 -25866 -80940 -388404 -414875 -298433 14316 14829 26076
18067 26076 -311702 85836 121032 -280486 -5618 -28587 -370984 -230951 -392562 -11843 -77712
18056 -77712 297135 195040 -226804 -273419 -146929 -78133 -64185 -100434 -53976 -153424 50459
18044 -92427 62928 -82001 -4307 -11878 -36112 -26952 -145939 170744 158476 -369081 -67629 -66900
18032 -66900 50697 188493 101535 -14771 58752 -289828 162295 284977 5736 57968 -138129
18020 -72039 -105450 -43384 -126166 178597 -107405 11436 57042 37232 -156150 -207830 115746
18008 97161 18350 182058 131430 398352 -258732 -148019 159049 -346043 50452 -6171 80607
17996 37786 -187464 -91682 -172081 8479 -58820 -177211 199861 77781 -64827 99824 195596
17985 195596 9138 15500 103684 -144918 137625 131481 -44082 242330 184352 -152045 -62096
17973 -139380 86725 464852 -383903 8291 336506 -202155 -145841 -162808 250467 -29377 -191168
17962 -191168 150755 139060 130816 160462 -42820 -317549 339028 11998 107361 -17713 43225
17950 -194416 -99308 92078 -122622 -13360 -245439 -79912 30912 204364 -118062 -326407
17940 -326407 142280 181000 230265 155881 40987 -331132 167755 -253709 25381 91083 -182569
17928 452961 -9213 -245198 -38991 36411 19156 180636 377184 -179829 -96076 -117871 253996
17916 365471 -187963 -71705 -57331 312783 99041 -164645 -154790 13126 128915 -96985 -176026
17905 -176026 -107304 364622 -54638 -125401 -21108 133663 28380 117065 102094 31144 54490
17894 54490 -55231 182447 234556 35625 -87327 -911 -126523 228942 99288 -65492 26144
17882 20267 115927 142330 -87018 -22849 -196130 -120145 236337 132781 -54345 -258080 310157
17870 387867 -69238 -179427 26780 -227645 16502 19442 -373520 67890 -115111 156389 227790
17859 227790 83424 -114746 -25109 51389 -94870 338695 393884 -65284 54101 77942 230163
17848 230163 246124 -128098 147229 9554 91577 38823 -318848 319756 213242 322841
17838 322841 87859 -261097 72885 -118865 110079 205582 89462 65040 -123307 293584
17827 245775 -9165 -29224 -146329 117360 -184503 -10595 -37592 -318448 98418 -142164 -33251
17815 -142996 128652 205134 233921 -210890 -108419 396010 26805 -64256 -162244 268334
17804 -260967 -81940 3931 -68770 8128 136287 -20776 256010 -83181 -133360 376002 -213880
17792 103033 -205913 -335894 -84188 -105715 -56311 -116297 -49310 292146 -350945 184703
17781 57265 -53166 108393 -229558 89369 116073 61421 -140682 -167529 55422 318523 31443
17769 277669 65241 52564 183925 115018 -272794 44446 -3403 256485 256760 -177227 116845
17757 164483 61575 399412 -403853 -15637 -218348 -137822 591196 240886 -222230 110924
17746 71459 40233 -456929 243317 -34416 341395 137652 -64914 51120 -107234 -309503
17736 -309503 -189274 -202224 7449 123224 -193111 291600 -33751 -80187 35403 -135714 105249
17724 122195 -163472 219702 22176 150157 -118665 -199882 102376 -44094 -41139 295106
17713 108946 103616 81415 -7367 44002 -25231 11275 180732 -150890 -107605 156836 336131
17702 336131 -269315 428379 -57182 290200 194126 137200 -138048 120584 183178 120966
17692 120966 -1084 -73943 -65757 128637 217036 151665 -12649 36122 137750 452869 64323
17680 156784 307109 415835 56524 258469 -143782 -92643 191257 53700 51871 297392
17670 297392 61087 121933 2531 186186 242948 -3848 25992 155137 97632 288005 -9103
17658 -32266 60825 143723 154014 -27406 -63307 -166272 28804 184686 -16100 26513 -5299
17646 -3931 105387 194832 -59191 -206229 -115338 243279 115945 75919 6562 221739 -161994
17634 -213478 96459 -82133 375400 128283 -100221 -130744 -8556 380074 -300365 93583 227288
17623 227288 -98530 248720 73378 220049 105970 -78597 -17689 31539 -101704 54382 114060
17612 114060 371672 88111 152892 77432 681834 141155 65135 -23217 195416 176484 -105422
17600 143331 177654 132435 167242 12441 -42392 -4850 270662 -1414 -45976 175782 217172
17589 217172 408567 26867 231223 283357 184603 163865 29302 -43554 -180696 -105765 227441
17577 -50054 66440 192382 214097 157163 9336 217727 484235 156501 88550 139359 221849
17566 221849 114131 -110436 159234 -140310 33751 474201 -70519 -18303 330593 -11861
17555 177076 -58814 139029 296406 208028 32397 177471 140934 125994 264615 221549 300842
17544 300842 163987 380834 256372 298308 -71488 199829 44714 277235 114183 279631
17534 279631 651185 23135 440280 414841 395574 101760 201552 140867 166848 -82808 68242
17522 344620 132988 193227 213305 265436 488842 333151 460966 268059 436797 233603
17512 233603 539943 904958 607179 624436 583227 800026 828383 962156 368990 390943
17502 390943 424522 190825 -21091 150375 369442 587789 389282 926172 864833 1183681
17492 1183681 772029 831904 485748 769111 612540 469028 234126 576884 325982 445992
17482 445992 325257 167175 70852 473556 323240 133324 165632 399025 160211 626726
17472 626726 427442 409447 300664 50930 255977 351152 69999 167275 535510 230193
17461 226615 311408 310052 128659 369926 8736 228082 560947 -30574 533924 431272 432938
17450 432938 235851 338114 406792 -87747 210212 160352 -71392 186236 85657 236563
17440 236563 361318 43029 247815 447262 311283 320322 256849 403403 552364 472840
17430 472840 312669 195029 216356 241861 405357 233578 447948 559306 407029 326598
17420 326598 456433 -52192 174846 261091 301765 291752 349880 144716 413880 433265 551300
17409 551300 302358 350091 331311 419822 133542 444682 534831 253150 607233 114755
17398 433452 326697 479657 501878 472115 347901 541354 336586 108729 233168 292205
17388 292205 304241 117987 335288 338347 231617 225782 -297634 301241 496883 154277
17377 264606 149635 304015 255644 76520 185772 202851 245463 347234 514088 108288
17366 210610 422829 151016 -47422 103497 296430 385999 175071 254189 608855 138317
17355 362566 675530 762726 229594 204073 8524 -133945 168808 492919 158035 160694 241826
17344 241826 539856 213649 327057 171498 -91914 262213 97014 84256 328599 185423
17334 185423 460608 59569 354771 103893 498976 21160 87744 105970 275273 272752 293879
17323 293879 110277 336356 356638 328359 323161 400225 110093 310970 389010 189915 167879
17312 167879 486186 233359 436102 231506 584549 250198 213400 152999 563165 274472
17301 241249 476122 -5940 326870 257921 110416 117369 307759 106307 232888 410852
17291 410852 241094 311093 201548 263815 463573 59160 240460 50670 328367 189445
17281 189445 362061 151086 473134 180566 -24171 280921 333046 75481 -81046 337077
17270 173247 65236 223771 220710 466605 336569 312383 193311 391845 120493 322026
17260 322026 539180 569687 164103 381325 308465 104126 233328 250300 267305 444966
17250 444966 312301 323858 205299 132911 114300 29114 12399 143514 354605 554653
17240 554653 332296 458972 74527 333488 -47952 337628 228523 302565 209554 251324
17230 251324 336005 536214 75931 239640 463854 -9940 535200 496127 403402 77295 432187
17219 432187 581798 412418 514665 625097 522025 349745 402300 337203 199436 355481
17209 355481 207419 365596 677187 343133 428425 514182 505181 549588 387062 203555
17199 203555 513953 274535 494077 222178 496279 501480 873093 545595 583714 889288
17189 889288 354579 443923 566052 309394 219846 472651 143647 50670 478178 293966
17179 293966 463804 307317 167939 418767 595881 547274 198141 381647 382064 336919
17169 336919 496563 437288 223809 607598 622135 476257 693686 191369 331190 295789
17159 295789 537634 327044 319428 333406 199723 371823 356473 100438 463973 514593
17149 514593 679919 565551 527326 559459 411330 419661 216322 732090 369184 638589
17139 638589 492667 329817 346795 810722 675734 707458 726787 357219 495576 474293
17129 474293 781303 640216 581221 373570 696536 570517 568331 444897 521943 414211
17119 414211 476197 328097 623478 375353 417262 455616 734921 459813 394971 475273
17109 475273 656996 910027 856548 356263 661946 698289 601043 931924 606445 689618
17099 689618 378805 548437 620513 601677 590128 569818 967403 785085 770670 585353
17089 585353 495470 634114 636587 433317 471502 719789 741897 563510 513341 751357 669490
17078 669490 543375 715957 576495 641120 756483 814732 499173 459493 691259 904363
17068 904363 877980 755453 774298 835612 333058 912840 860492 631639 720492 636743 693783
17057 693783 736952 747029 512620 755372 734619 646446 625172 975665 711480 972616
17047 972616 595853 626224 772384 932675 1133948 752972 807931 830675 1099474 1127219
17037 1127219 823583 624722 1051383 999498 1103504 705976 736496 1133877 640765 1156970
17027 1156970 898511 1079123 1049434 873915 1170643 992685 947420 971322 750723 1240620
17017 1240620 749928 889668 917769 840120 1123104 1088228 1093998 946386 1152837 1318228
17007 1318228 861872 835257 922588 1138857 971496 927319 809901 1059507 1081264 989475
16997 989475 977892 985788 912809 1195017 856100 1162700 999066 931725 1293380 881311
16987 881311 1168797 1397374 1211010 1580469 1134351 1419406 1369274 920007 1251082 1270859
16977 1270859 1323511 1248871 1243199 973030 1486340 1528883 1335254 1251058 1539893 1174871
16967 1174871 1592246 1303799 1501442 1575401 1284586 1340782 1549708 1427671 1688017 1507819
16957 1507819 1265646 1477655 1492452 1409027 1485379 1717574 1482760 1476685 1458815 1427112 1664913
16946 1664913 1480847 1672322 1731854 1450392 1828404 1498283 1385430 1701511 1737630 1793900
16936 1793900 1726539 2076730 1784025 1982435 1862841 1534012 2008040 2054685 1672537 1881011
16926 1881011 2013031 2014718 1816522 1922367 1943318 2027641 2289585 2147650 2233078 1822617
16916 1822617 2079212 2612986 2256695 2159552 2464960 2259569 1982152 2183781 2331832 1954775
16906 1954775 2273803 2176979 2404014 2387390 2443448 2272249 2223767 2616261 2218831 2520281
16896 2520281 2864955 2719799 2425973 2847520 2596127 2956231 2775890 2841087 2916630 2796441
16886 2796441 2665601 2717709 2915905 2616621 2784206 2898550 3080992 3452332 3264925 3015282
16876 3015282 3229907 3552155 3407763 3128731 3522384 3276631 3281312 3260879 3198360 3310575
16866 3310575 3430366 3345692 3667469 3595644 3767340 3602996 4391217 3907039 4293949 4098626
16856 4098626 4316980 4339791 4480986 4049878 4404683 4600140 4275738 4701691 4406869 4645043
16846 4645043 4699050 4962290 4730499 4648556 4987574 5260331 5029894 5252426 5004641 5314745
16836 5314745 5625591 5459677 5534330 5726264 5699143 6053019 5884641 6122090 6311956 6291445
16826 6291445 6394109 6334008 6411764 6818457 6498658 6931915 6869418 6947444 7176297 7455236
16816 7455236 7606369 7680197 7795100 8001755 8248599 8192686 8154031 8410329 8505625 9015830
16806 9015830 9041836 9318391 9443370 9319969 9716214 9867850 10222888 10343652 10293779 11063600
16796 11063600 11156763 11491157 11525759 11989737 12033135 12251231 12777594 12780738 12803804 13367446
16786 13367446 13748217 14146873 14320358 14575686 15052815 15176408 15535768 16100267 16261755
16777 16261755 16927030 17401247 17690413 18080829 18597680 19357798 19738032 20185185 21018590
16768 21018590 21584683 22095086 22654111 23726321 24020143 24407746 25446296 26269215 27110333
16759 27110333 27897645 28617937 29802943 30562468 31513374 32821426 33864423 34747897 36030265
16750 36030265 37258324 38296472 40043794 41478061 42736888 44291898 45768903 47271790
16742 47271790 49359763 51041801 52885162 54746717 56674529 58898911 61119429 63497332
16734 63497332 65634643 68196868 70485053 73145035 75721121 78674197 81543601 84355181
16726 84355181 87220817 89997728 92742671 95911689 98564691 101989594 104475148 107271472
16718 107271472 110098270 112642943 115089454 117182104 119161598 121168284 122719475 123652057
16710 123652057 124646411 125045979 125599369 125950099 125754230 124926040 124152486 122887613 121720228
16701 121720228 119905581 117606801 115666429 113450358 110693567 108170159 105409251 102773671
16693 102773671 99484375 96543547 94094637 90862417 88002428 84775026 82110614 79464360
16685 79464360 76618671 74091550 71374869 68712557 66535928 64222445 61711081 59336565
16677 59336565 57522444 55177119 53191328 51548564 49602780 47744420 46441973 44316569
16669 44316569 42929848 41403037 40313599 38569076 37452599 36309873 35320348 34264653
16661 34264653 32692405 31819401 30794292 29966486 28665057 27970572 27363339 26570810 25597434
16652 25597434 24746813 23979970 23211999 22850100 22038947 21614630 20802616 20272283 19923880
16643 19923880 19566254 18714304 18077306 17760906 17589367 16941684 16472074 15721577 15861258
16634 15861258 15386377 14997515 14601016 14530455 14001842 13685796 13506546 13303856 12678395
16625 12678395 12484222 12149211 11972651 11819988 11794666 11636617 10919510 10708878 10562376
16616 10562376 10422419 10263863 10070658 9800563 9734197 9360438 9256926 8889986 9000397
16607 9000397 8792036 8646231 8253966 8031114 7764395 7865457 7731955 7901681 7469904
16598 7469904 7451046 7037324 7135930 6953222 6737979 6835048 6926430 6571496 6450975 6235711
16588 6235711 6194440 5897625 5732017 6056982 5712306 5873055 5833108 5245124 5554312 5596797
16578 5596797 5274129 5164550 5054605 4956824 5347763 5131180 4781665 4852316 5025681 4702764
16568 4702764 4372737 4332858 4397248 4538837 4562542 4484786 4388711 4010259 4409075 4033446
16558 4033446 4135076 4192920 4392531 3961910 3773059 3905022 3640986 3487223 3816629 3524575
16548 3524575 3786369 3610493 3632099 3836524 3191551 3580330 3335677 3072700 3236889 3541910
16538 3541910 2812481 3224020 2878198 2865329 3170521 2922059 3269887 2723288 2945506 2851119
16528 2851119 2820478 2879396 2719918 2840296 2847703 2807999 2707795 2442819 2592296 2678496
16518 2678496 2638818 2583137 2470055 2488953 2948558 2512081 2587756 2399522 2426537 2392007
16508 2392007 2303055 2240521 2489708 2357844 2252496 2517475 2127064 2426003 1977280 1815209
16498 1815209 2200594 2213310 1985807 2224239 1653293 2107351 1853034 2054115 1982153 2188029
16488 2188029 2067091 1649343 2139468 1688008 1720051 1818893 2001795 1755645 1950376 1754269
16478 1754269 1980388 1622641 2109373 1916115 1837865 1935277 1472121 1770742 1884719 1877342
16468 1877342 1756438 1439005 1724559 1514648 1597914 1762066 1787605 1669953 1527097 1763452
16458 1763452 1376857 1465072 1209230 1353539 1332644 1457506 1882299 1525742 1615904 1304863
16448 1304863 1435285 1492499 1535517 1352053 944078 1533907 985572 1412289 1387068 1250395
16438 1250395 1453067 1287741 1284284 1478672 1186918 1689134 1331760 1329790 1209280 1145658
16428 1145658 1210681 1486003 1142344 1188034 1461281 1546038 919001 1100072 1253095 1069366
16418 1069366 1278959 1165009 1176062 1003128 1101265 1110771 1031239 1196904 1197898 1058299 1121878
16407 1121878 1169727 1260486 713123 1487668 1115554 1135960 1080035 1479070 1117208 1079366
16397 1079366 1111682 762812 729924 1197451 997974 1006769 910467 854449 1013862 704227
16387 704227 948117 754752 1163827 1105047 847862 947804 912385 1123528 769043 768132 995511
16376 995511 1039678 681071 910333 960011 797271 852699 1119411 898439 799592 861916
16366 861916 901020 589825 966521 1072945 738951 785120 764332 991106 1013364 1131666
16356 1131666 692131 530578 1334577 935926 1076686 583332 794674 623891 786231
16347 786231 986905 625342 535945 398881 579848 875117 773179 867069 491249 676182
16337 676182 700068 789003 864916 596069 611437 438234 828248 741378 984801 590639
16327 590639 875168 537361 645491 940642 525107 601324 747278 803461 795639 533576
16317 533576 644603 806002 530651 624386 652056 243443 616459 508848 595234 711401
16307 711401 467216 399630 505403 561947 528546 510571 795229 411938 729635 592231
16297 592231 772602 466091 905404 548217 179145 625807 539468 634195 448722 507196
16287 507196 497733 625076 811750 162988 883419 651921 539083 359503 877122 751577
16277 751577 604360 408283 296520 544791 622518 400972 389939 694275 647949 613336
16267 613336 321675 467614 382791 783996 674613 395648 312631 281303 358326 647945
16257 647945 351832 443612 431319 347331 424741 215168 537980 445799 604678 760036
16247 760036 597562 222510 286200 222782 390414 482039 508477 255690 586499 407339
16237 407339 558782 449093 44726 612360 446299 808994 210599 207523 355968 165064
16226 218779 347985 407333 406342 285999 181077 352965 567970 376655 26789 625556
16216 625556 279633 598022 435168 360865 279871 220354 233367 750447 201752 203846 476959
16205 476959 448185 195970 492633 200790 330301 202309 209668 -58822 -54515 324535 370686
16194 370686 28983 416930 510721 264971 410728 377086 -58772 88544 397204 392938 485134
16183 485134 238180 457877 265993 254993 235005 280006 289281 58495 69717 660334 132289
16171 94035 198878 523758 -55881 -3123 431519 425731 34660 195020 -103018 449715 372874
16160 372874 245377 48910 116265 470604 106740 411083 -276067 50351 289931 363830
16150 363830 166229 129125 71256 111058 442487 155783 507130 210411 166309 65639
16139 116372 142157 314546 121990 -4355 186871 149164 376408 492967 261227 499899
16129 499899 -81421 -67281 439449 355384 188500 55379 245253 177466 126607 199300 -72725
16117 263569 25953 230761 48927 229951 183548 408488 239473 -118785 155894 54895
16106 388963 75023 446166 272647 459680 195934 155315 155751 4061 220024 131854 226497
16095 226497 260913 412426 754 87332 -51053 374996 641508 256890 272991 292862 -77241
16083 274028 7660 147437 229289 454047 78907 -64610 369605 -64764 175336 200788 -26988
16071 752749 202598 144325 -92707 147344 216741 307795 290799 295542 221761 25019 211122
16060 211122 125721 259550 -72390 108270 72584 107292 403244 93916 -71695 108945 66634
16049 66634 335108 -61673 110503 143537 -32449 173669 31941 310346 376558 -14747 -271881
16038 -271881 145554 246126 174567 287569 100269 291205 -27403 244138 -111253 413623
16027 202995 -88827 103035 465908 -201701 221338 73141 -79677 29371 36903 207184 102687
16015 63301 297644 128001 173621 133096 -35083 -53429 327891 348944 177386 471802 -70390
16003 -190168 443638 133890 248079 155037 126658 111717 449021 249228 431296 -138214
15992 156433 240014 -28151 113991 57394 -309372 92004 71242 126133 224345 217689 -152286
15980 -109248 -121013 133127 268232 381856 -52772 7094 196168 -145383 541587 541524 1079966
15969 1079966 419874 794976 449204 362043 649267 730037 382052 95634 202873 174424
15959 174424 -145652 -137797 97710 235436 93044 267892 50382 203900 -73433 165558 -51369
15947 57289 170297 -197148 118305 10121 126656 -274249 -249343 28135 26491 -81282 262184
15935 86057 -402177 191985 120038 94651 -343112 -50079 104644 429735 54535 -97161 227748
15923 -99495 113163 -211018 -83634 -266068 -35461 -117215 -121912 44247 217858 -123087 35619
15911 370103 -137836 192165 -207547 -284023 25152 266973 -302307 198794 2162 185724
15901 185724 -183611 -9266 159879 -49428 -159373 -135734 -126506 -96185 -76995 119301 116977
15890 116977 59168 79315 -259858 -97174 215739 -474106 -208408 -87387 275501 -119487
15879 -150441 108612 -37195 -50724 -226712 50873 67309 -68194 -202965 -8222 -303555 -198522
15868 -198522 -110916 132209 151294 -148103 197351 59827 87513 -210695 -46079 -492833
15858 -492833 153116 121849 241589 -401256 -131259 124485 54036 -25737 175281 -313240
15847 135930 47806 55650 -104498 -202701 -9436 41383 13683 172510 9821 -131164 -38993
15835 -145841 -10741 -56709 25643 73817 13602 281787 13099 8770 -144225 33815 89888
15824 89888 126799 7937 -64038 -781 -317122 -29511 -1849 124710 25987 55826 -20889 102366
15811 240320 -137869 -228761 -226772 -167497 -151523 48080 372573 102319 -153542 142825 -296486
15799 245965 -290063 40445 -247305 202537 -64635 -248807 263685 122340 7879 -354713
15788 -45161 139016 119931 -180472 -121764 -237572 -89107 -242117 -156688 -910 -102351 -221952
15777 -221952 -194461 253390 123290 4202 72295 412953 -102789 -216312 227450 -253699
15766 277651 90210 -81352 196905 -280102 434895 200633 59331 -280212 141872 -231016
15755 173085 -176463 246516 327928 -33336 141468 139276 -179274 -35844 63087 167268 -35658
15743 8173 -83913 145964 -86649 88647 228934 62516 133147 344516 244007 49238 -328930
15731 30340 170078 -102194 53729 -31313 139969 52485 83138 52279 -156222 -394588 -58935
15719 5776 108996 -49058 402558 148664 78433 -260718 54814 195333 -406886 142651
15708 208481 -128844 -309495 260507 -222297 -181455 124149 63569 -239015 27218 -150482
15697 -162326 97990 -68219 -106159 -110281 -111663 156755 -4616 121822 -66363 -101776 189995
15685 -80351 166403 174892 153053 99079 56121 116394 -180743 176732 153485 -138388 -42765
15673 -149646 59723 112492 -66315 87288 10655 -143077 138625 -187395 54322 3408 -124700
15661 -263694 61027 199967 259159 -338033 184587 -105060 154813 -148107 -205294 250379
15650 -127670 55239 -30374 45294 -101819 134991 -17997 -8178 -35809 -148280 -188710 40746
15638 -177006 96031 7503 27688 -176415 -209413 -140871 -37646 -43276 -178800 339103 61193
15626 -16293 -137907 -45932 -42250 -89148 32068 -206819 -92695 -138636 -145272 -134297 -144021 143043
15613 -289980 -42965 -20502 -140695 -361886 117505 24827 144114 351678 -163010 -160325
15603 -160325 -115455 129681 55487 -19295 -249022 84502 -165591 -226007 52424 171580 -117740
15591 192009 -285815 -126323 100941 155163 151319 -164388 42514 -91536 -191823 -72362 107197
15579 -175723 -248452 -51545 -17215 -45348 -243201 -172800 -89120 -371070 -12494 47174 159479
15568 159479 -186685 -26196 -241975 -284112 98766 -313372 -24214 117282 40517 -216804
15557 -32172 45943 -224344 -11590 160135 -46876 252922 128059 -126164 -82414 65127 134367
15546 134367 -89767 -241647 -314940 42614 289669 371568 -84525 26490 -60963 -78216 286255
15534 -46170 227545 194732 69003 132393 84161 -32570 -43562 -263266 59701 -10585 80043
15522 161289 246438 -23915 -7251 -118833 -197811 -147791 116827 18124 136760 321665 -145084
15510 -181806 -246494 135814 35277 21233 175788 219056 -137807 364559 109401 161177
15500 161177 68729 53717 -55462 57475 281033 267651 187596 243522 386879 -17191 82482
15488 -82163 -139021 96314 233501 134664 -80832 -12862 58741 -73271 416118 353054 448480
15477 448480 254826 -233943 159329 494008 353186 258298 352427 -59631 197656 333285
15467 333285 215721 51643 -18946 -57560 426505 -87434 -72767 354161 244596 311363 348934
15456 348934 187374 264730 158836 66694 131571 187780 22761 -85988 -133858 65909 -442443
15444 -344999 -42588 -257098 52801 75568 104889 390231 71320 -179264 155258 186887 364243
15433 364243 -146803 201717 65054 340933 459517 75289 634233 709216 686626 562725
15423 562725 377591 244606 408447 302320 266473 140705 50777 355692 -229631 -259928
15413 -259928 60484 647 203653 121976 -175486 90676 -342038 103030 208160 120269 273194
15402 273194 -37599 9250 76894 43184 28962 135786 -46440 68946 317383 16493 -31324
15390 -175498 109931 -213206 -102874 -205499 131745 281117 354720 203218 -76223 -217554
15380 -217554 275550 -51711 -66030 372000 -51892 -184101 67488 -369468 -179008 -127350
15370 -127350 183849 77934 112764 93886 -240475 128045 -22929 -110203 161507 227393 8061
15358 240792 177414 11655 -173995 345021 155106 223012 321354 49901 426517 278825
15348 278825 104121 288920 117236 133178 172498 141583 136282 177708 69184 -28138 404169
15336 424528 185980 60782 185960 356784 429861 55309 99978 53353 293118 434138
15326 434138 393911 392253 244526 -225575 294767 -162076 -217562 83179 10745 -15031 170671
15314 269441 155353 136658 105661 -5634 321781 6594 80586 389479 276994 -9565 177191
15302 363349 438373 128053 -236521 -115695 -129406 239856 134166 -38927 -43713 11443 322586
15291 322586 112378 80733 -148386 321189 55792 215766 291394 -230463 140733 3269
15280 324417 -24758 182544 110385 -113749 52328 118266 95542 153113 -186837 165086 162218
15269 162218 -238030 -223065 -46384 -108554 -16508 -48700 -46887 26624 376673 146630 400172
15258 400172 263273 198630 250375 207582 -206302 215489 302921 348928 -49159 24663 143497
15247 143497 -17654 -269024 32707 61823 169272 90820 113217 254624 138592 160959 163594
15236 163594 133294 500579 314520 343054 412841 350320 386854 760968 1470903 1349225
15226 1349225 1321310 1025761 945951 615503 532020 353364 238516 5820 54930 126843 -211788
15214 315512 -103246 126209 30338 -81234 204910 -14373 -20989 -125715 -115943 68627 -27949
15202 -84340 290166 4278 386439 244411 -12124 101203 -211105 -157070 38646 83572 77965
15191 77965 204954 -27937 125895 -7145 241389 26222 165767 88386 156805 333456 -95248
15179 -27682 230368 26241 75141 -320193 206931 214454 -6219 -1274 173864 -58691 167316
15167 218223 149372 -242509 -98690 308795 37155 295000 -33128 374225 76212 -212853
15156 -68925 358056 445805 170254 172176 123771 -6496 234684 355614 82701 54466 26354
15144 80119 -112309 351487 -312727 86532 58715 -96032 -61330 29876 136420 -87233 -238436
15133 -238436 -19318 345587 156224 133275 390397 -99086 338563 120536 -230226 24238
15122 -31438 76234 -32124 192948 -13833 180953 -158426 97947 212680 171855 184063 236460
15111 236460 240217 126703 -43118 129826 168601 -174584 151366 367000 263736 62517
15100 168584 33918 56740 89356 264906 161366 -89148 433485 142324 255017 108223
15089 130369 189351 346162 132476 157746 86523 -4272 -19537 521977 116363 49530 -35074
15077 42284 -74637 305380 -4866 385803 2138 118754 390539 232782 159056 -86249 214366
15065 409589 107638 359261 776723 45356 97856 409246 246283 -159819 300730 178529
15055 178529 133300 147156 220867 379625 321260 127661 -48791 217631 113226 145800 118191
15044 118191 298524 361922 251780 381120 328895 570201 184383 370735 203987 -3561
15033 572981 318905 529916 352064 289931 447149 304786 442498 125434 295473 249213
15023 249213 392610 238490 417427 459935 425188 398437 363653 539168 804762 571781
15013 571781 422248 883853 900887 427036 378395 340451 615279 300774 608262 578610
15003 578610 497766 511592 360904 292532 510645 539309 509879 195168 356809 461706
14993 461706 394155 298919 287477 131687 585223 868075 732734 116886 306363 657650
14983 657650 672545 268677 189316 333406 511770 643463 324263 472106 519083 388840
14973 388840 420985 578643 674633 609519 573770 422340 450744 343558 696180 755528 875785
14962 875785 501816 279798 431754 616313 339125 384152 534191 617612 514752 951796
14952 951796 791432 831278 494205 561941 216862 414801 221194 424727 138574 379887
14942 379887 349586 378388 229477 332572 445803 455931 663008 316108 338017 521074
14932 521074 371445 392222 568091 506783 481607 474113 727119 623422 511980 416990 589312
14921 589312 838890 546061 635796 776999 872762 833411 1304229 880089 1037239 1227833
14911 1227833 1383617 1191649 1504606 1444852 1657448 1542889 1374170 1404998 1679618 1504524
14901 1504524 1574676 1667042 1778623 1515433 1364366 1197917 959097 1210979 812244 706570
14891 706570 520440 595822 340278 581525 406716 314298 210326 352541 590339 353274
14881 353274 639587 397666 469788 199168 421673 470938 554039 727815 406180 612019
14871 612019 577596 715083 963922 980346 942198 729961 550776 476352 916094 888644
14861 888644 968271 814026 583159 319598 495376 923476 414100 938775 875584 879989
14851 879989 713251 818704 572115 778544 744640 636136 626738 431299 544385 551074
14841 551074 535681 142320 422852 337068 279804 400368 394032 502387 649310 585693 579677
14830 579677 1247273 549729 760018 836156 876809 976801 983912 998320 963512 830759 541303
14819 541303 676025 1254233 436093 554747 818279 444920 713343 517376 622842 660967
14809 660967 278164 463805 772526 621998 784077 678806 785151 961071 746744 793336
14799 793336 567192 873336 725342 784447 931582 785957 917813 982253 739255 941788
14789 941788 1001858 765314 1107657 1108051 737725 736916 744728 686284 548275 732456 323605
14777 782908 598387 606166 733227 857111 468289 553397 717462 912270 567002 648747
14767 648747 409079 902382 652867 722078 792238 667197 668654 992697 865024 876129
14757 876129 841955 851260 905251 422990 1027497 550882 722223 713055 500361 664985 721362
14746 721362 358981 674851 528204 705217 602463 519449 799926 549223 492445 525178
14736 525178 773159 424699 843526 592931 878637 583792 691412 758012 511813 751681
14726 751681 895116 830983 893840 760553 630431 624779 875101 760217 547732 995176
14716 995176 814250 1213949 1457740 1068725 1561966 1544963 1272435 1824032 1295270 1667264
14706 1667264 1316725 862131 1279804 1358387 459696 744478 990258 713556 931101 667853
14696 667853 887219 773592 1069938 1182105 1062661 1081025 1128059 1390265 1083723 1385686
14686 1385686 1621251 1412422 1261651 1911527 1439574 1734714 1210758 1126886 1315174 1302376
14676 1302376 1010501 1128101 1317577 1188478 1161904 1010507 1038084 956712 1009248 737741
14666 737741 1085547 1121677 976218 1037592 1048462 749363 1164495 1320449 784725 872262
14656 872262 1237143 938430 1230481 948182 851016 1106706 1485134 1160446 1409936 1280856
14646 1280856 1200696 817932 1193443 1118166 994000 1375962 1135978 987711 1381664 1060035
14636 1060035 1390529 1573458 1645018 1545473 1184099 1354035 1521273 1392827 1362647 1286730
14626 1286730 1184321 1301104 1489754 1352351 1327273 1477869 1203202 1414388 1402492 1381964
14616 1381964 1295019 1030262 1369834 1175365 1325970 1427991 1333500 1265124 1059105 1580663
14606 1580663 1072727 1262411 1466099 1230499 1954492 1413552 1197412 1435882 1580291
14597 1580291 1826941 1375482 1693640 1496937 1508835 1583246 1683291 1375367 1537874 1795002
14587 1795002 1568178 1872829 1692355 1504501 2085003 1602185 1704367 1542406 1909142
14578 1909142 1734044 1796796 1809788 1573964 1787903 1975802 2136833 1849450 1795373 1665704
14568 1665704 1876786 2099464 2155120 1993143 2019181 2182339 1984699 2060681 1785807 2144838
14558 2144838 2134873 1912494 2236639 2263627 2287881 2479190 2646366 2486574 2358508 2574760
14548 2574760 2782043 2433670 3115677 3310240 2832909 3335364 3792268 3950163 4579407
14539 4579407 5125981 5310281 6132537 6547263 7829852 10137055 13083990 18025821 25473931
14530 25473931 26565695 18044199 12263058 8878121 7023729 5862744 5137417 4958497
14522 4958497 4197234 3353613 3033694 2992618 2640300 2560783 2510326 2746610 2462279 2757442
14512 2757442 2346495 2658188 2310491 2669747 2535373 2619845 3055441 2592207 2792946 2735028
14502 2735028 2603094 2690110 2854970 2667676 2697677 2629794 2944733 2870511 3167646 2813518
14492 2813518 3058392 3255804 2837651 3056557 2901612 3048763 3122961 3575506 3284573 3569005
14482 3569005 3243513 3401221 3502202 3395688 3613208 3267191 3522286 3690083 3619732 3382341
14472 3382341 3807482 3726225 3811635 3703038 3700045 4099188 4197425 3900845 4280374 4097975
14462 4097975 3972561 4160545 4288368 4215808 4379996 4254672 4425438 4321001 4443596 4743323
14452 4743323 4798230 4941347 4844378 4942770 4927561 4907159 5003923 5148238 5126074 5222486 5012013
14441 5012013 5002188 5446341 5226495 5398668 5269929 5466017 5452200 5686379 5744347 5927340
14431 5927340 5796156 6073001 5777425 6406895 6201633 6419688 6522049 6594032 6669548 6571609
14421 6571609 6511312 6796926 6729590 6953476 7305370 7009676 7494018 7548361 7123694 7663183
14411 7663183 7804866 7782126 7914492 8159308 8128255 8282898 8247097 8502610 9054254 9206545
14401 9206545 9049587 9253946 9149747 9260484 9203934 9553826 9256353 9873063 9700956 10354480
14391 10354480 10221553 10455718 10830019 11075115 11036023 11339666 11418525 11270475 11472970 11651485
14381 11651485 11787508 12311150 12505317 12509578 12971362 12663869 13374792 13569058 13595125 14131536
14371 14131536 14213164 14003181 14800929 14718700 15390006 15216012 16239608 16188490 16961716 16738133
14361 16738133 16868113 17301753 17603840 18012462 18185830 18407044 18767313 19527642 19917448
14352 19917448 20163553 20719207 21490192 21319703 22062646 22407842 23022792 23604146 23836046
14343 23836046 24288241 24604036 25401297 26110398 26702967 27130964 27458856 28167066 28992732
14334 28992732 29821071 30601689 31326084 32173175 33263090 33838408 34687495 35993621 36511384
14325 36511384 37644720 38824643 39607612 41205458 42134204 43287838 44322450 46295915
14317 46295915 47615429 48858536 50531394 52192303 53504702 55579434 57590711 59759265
14309 59759265 61196539 63658033 65665652 68070153 70567561 72983179 75887127 78314270
14301 78314270 81664710 84654330 88022645 90931216 94733380 98654445 102914007 107107778
14293 107107778 111539864 116637823 121791216 126879025 133299723 139016853 145500432 152836315
14285 152836315 159716360 167429910 175652396 184317933 193407862 203095412 213052271 223645563
14277 223645563 234985292 246501245 258852965 271659292 284988976 298677564 312772178
14270 312772178 326812458 340492253 353916298 367779335 380783867 393060072 403949427
14263 403949427 412855404 419480251 426279266 434579458 443241290 450630208 455454184 458871117
14255 458871117 461441445 456780382 447600992 440863568 435889124 430034464 421830262 409862189
14247 409862189 397164284 382876125 369465456 355611101 342445744 328933364 315341831
14240 315341831 302020451 289613676 277294508 265713597 254272602 243147140 232477841
14233 232477841 222081836 211469290 200975429 191300956 182105055 173715161 165708549
14226 165708549 157889092 150738794 143982065 137888607 131865472 126194496 120750896 115781948
14218 115781948 111088767 106455446 102540568 98397174 94851086 90913622 87572240 84540325
14210 84540325 81175276 78303292 75541226 73128182 70132614 68113622 65935959 63552066
14202 63552066 61345120 59423531 57675225 56044218 54483361 52658843 51343188 49520601
14194 49520601 48142749 47038598 45942913 44494910 43204364 42031081 41230892 39687372
14186 39687372 38731395 37967099 36936466 35504989 34793680 33942569 33053480 32422736 31521959
14177 31521959 30463275 30326468 29103090 28422670 27784992 27446728 26930549 26271066 25310853
14168 25310853 24786604 24132057 23982175 23235494 22959077 22580237 22333993 21300635 20989916
14159 20989916 20675765 20461040 19632751 19127291 19108694 18270945 18293010 17773010 17733390 17283876
14149 17283876 17215176 16963060 16406790 15977743 15570954 15730325 15338909 15062182 14730167
14140 14730167 14553118 14322844 13645737 13849969 13432711 13573264 12885068 12767941 12888898
14131 12888898 12492713 11964267 11888230 12069247 11616262 11674918 11524080 11349379 11180447 11100041
14121 11100041 10883047 10674912 10472728 10217938 10106613 9798132 9840206 9599099 9703766
14112 9703766 9586490 9373557 9061294 8759576 8811567 8951655 8710933 8494168 8650368 8809584
14102 8809584 8359747 8254837 8085023 7903818 7826353 7720154 7847947 7340074 7580103 7094487
14092 7094487 7436068 6971863 7323810 6951808 6838389 6827577 6664882 6497342 6820767 6769753
14082 6769753 6667151 6440256 6429815 6217183 6170752 6367009 6101749 5788453 5757460 5999129
14072 5999129 5956877 5720242 5512760 5384519 5501806 5269814 5588268 5376715 5182291 5126270
14062 5126270 5180830 5319111 5586095 4758569 4794465 4667452 4984082 5042945 4589616 4938017
14052 4938017 4492743 4641246 4549767 4652875 4821330 4548838 4690041 4671381 4526726 4417347
14042 4417347 4625112 4344456 4255034 4345950 4163853 4364749 4053327 3845696 3792267 4052113
14032 4052113 3725072 3835090 3643584 3632528 3664680 3570449 3655168 3510904 3616395 3478848
14022 3478848 3213691 3653153 3627669 3458565 3542714 3628091 3232182 3164196 3195700 3487332
14012 3487332 3170017 3253727 3158261 2955191 3197121 3238289 2723769 3123000 2887355 3345004
14002 3345004 3464225 3055215 2848701 3049905 2835837 2742582 2486766 2522367 2666719 2616520
13992 2616520 2702770 2510302 2371269 2705039 2657178 2763432 2547357 2722231 2586450 2817037
13982 2817037 2801008 3016289 3319407 3572119 3967855 4274953 5067372 5528362 7285413
13973 7285413 9534354 14127207 21833166 27655631 20826704 15374152 11357878 9115652
13965 9115652 7020801 5794102 5012879 4679669 4265854 3439698 3747388 3457779 3361699
13956 3361699 3412987 3490929 2883056 2712370 2702529 2560444 2934092 2459372 2950771 2533150
13946 2533150 2419033 2727012 1999443 2200685 2618003 2467872 2535651 1963315 2157710 2204516
13936 2204516 2102976 2137184 2215321 2034312 2029485 1977060 2035777 2207220 2052388 1975570 1925882
13925 1925882 1871035 2121413 2174704 1730259 1799170 1893051 2033900 1524510 1889137 1731330
13915 1731330 1790348 1909955 1935971 1651044 1921030 1671796 1836362 2041202 1574545 1560781
13905 1560781 1548785 1887959 1982917 1589616 1760516 1385529 1241558 1512597 1629798 1558701
13895 1558701 1167462 1522579 1478068 1153682 1552798 1419240 1310089 1859810 1337000 1359266
13885 1359266 1254618 1532387 1454948 1151971 1029309 1451877 1386575 1513460 1150246 1378366
13875 1378366 1497124 1436030 1406780 1466326 1294459 1254422 1300587 1231169 1386948 1350325 1391208
13864 1391208 1466180 1413033 1516052 1177116 1407578 1146556 1395607 1197587 992931 1488256
13854 1488256 1207489 993308 1339840 1300194 1252455 1129889 1092776 1092773 1120909 888442 802066
13843 802066 1260653 1017028 1086496 1155865 1040919 1478324 1030473 1160675 1142000 1561007
13833 1561007 855916 1006860 803707 1217616 1030895 818888 1324760 955447 1037209 1086831
13823 1086831 893363 1215631 934266 1033675 1112999 1083195 935576 1075599 960714 1036149
13813 1036149 1159917 1021184 947733 901964 994198 1116706 1123001 1023828 893797 1142973
13803 1142973 942729 1087257 639466 1094549 854429 783192 1128704 909176 1124086 960581
13793 960581 809716 1085054 872118 906385 750642 1170597 835973 1072831 1037153 626435
13783 626435 1223228 697220 730065 638355 1107701 859259 1078441 1227334 781488 718145
13773 718145 964994 901267 526865 536855 886353 1022246 837127 715793 710861 935187
13763 935187 705116 740799 730581 837434 737756 500786 1081784 447565 697626 535971
13753 535971 822537 756404 675110 884887 778582 590355 527982 615445 656074 937324
13743 937324 552061 671769 553558 783207 382875 356304 746679 882509 928813 736373
13733 736373 686705 831280 828859 485155 600871 900939 267728 847664 820764 655347
13723 655347 569750 506237 765731 749023 517417 597031 960584 667541 514599 258192
13713 258192 490335 732184 725765 698623 980397 383769 467284 730280 845806 614048
13703 614048 452404 366799 638079 305439 566180 479734 596441 535698 740106 624731
13693 624731 528447 681576 370632 540986 321517 730682 355053 908989 434500 632281
13683 632281 659130 504968 375721 396739 925500 523383 408089 209760 465818 664504
13673 664504 457792 228513 516963 1110522 823763 566538 655157 667424 358543 759371
13663 759371 563623 801612 314621 756753 518747 743676 515168 402463 389795 311434
13653 311434 375282 426432 422349 511590 557729 303476 763524 525950 326069 610776 325968
13642 325968 423667 448250 804701 367759 528454 389751 438332 391736 695360 521317
13632 521317 436259 607074 635359 352023 360583 259996 358015 605406 506406 382596 599254
13621 599254 464526 182841 286563 657664 555273 718152 452465 532014 313812 300189
13611 300189 376740 416010 480504 613187 604919 224776 592756 205652 277643 335485 481753
13600 481753 474340 64782 470215 404757 196191 213444 618566 310286 -111318 338491
13589 256059 439756 527313 342367 253934 433016 405649 257962 459123 244923 383812
13579 383812 699181 176504 244317 342681 370115 452510 469482 636408 361460 467720
13569 467720 97634 609417 321553 187608 199077 544453 377255 381300 244429 505853
13559 505853 452993 415783 253712 408933 428714 572638 285912 330212 77634 191835
13549 191835 178000 523243 481646 149531 337865 391439 445647 364305 637280 -8064 210365
13537 206737 322113 -17628 408235 185386 85005 491796 144317 173300 439931 307515
13527 307515 332143 126129 -71891 208912 163974 221554 184768 300337 347457 317108 135297
13515 237853 248384 490472 329221 96596 409664 50851 232158 189553 422885 376544
13505 376544 442030 379592 320798 328439 187003 153508 186025 347679 92337 268275 359178
13494 359178 219715 158204 55502 235235 347955 96607 249021 234731 338353 392266
13484 392266 273426 186683 288402 -99424 375857 460160 388716 134114 386015 222776
13474 222776 217800 524848 419240 348197 90557 99373 434311 229145 149097 6295 273816
13463 273816 199459 362325 452828 618781 189237 218405 -64809 384614 106568 444333
13453 444333 297758 277588 388126 609005 -189051 430221 130197 144529 336389 33821
13442 36722 309578 -12447 400270 237310 181895 382211 325881 210951 -105979 407523
13431 150038 278579 345281 78359 187287 128104 -11504 137916 279856 358828 202693
13421 202693 210258 268276 579645 160125 296227 369081 253401 424201 337135 416986 208919
13410 208919 102253 172238 234485 598184 319336 67769 58516 275547 82116 257484 38256
13398 133125 109935 420944 -94919 64853 263904 84324 166356 482199 330268 -31211 387021
13386 348 -138283 343520 196743 194183 235841 -82742 250563 229335 216674 269940 193116
13375 193116 303334 -11232 55112 90568 277305 -51534 -218907 112316 22388 164521
13365 164521 361940 324886 237957 86437 49337 152583 500569 198766 -51100 313468
13354 88048 240443 -102939 407840 480301 282719 503687 415963 216332 238125 522555
13344 522555 321395 328375 304524 157088 35654 -19445 121255 113294 222303 455367 420403
13333 420403 -52579 188513 572028 350736 413849 178474 309865 412719 257293 255964
13323 255964 447863 240153 569294 337971 234225 24600 281433 53422 3375 309453
13313 309453 321118 568228 263758 -74852 138462 179359 -191817 28052 -31233 223160
13302 387872 340029 411451 524904 468939 132195 155543 -70382 215384 283312 314563 271315
13291 271315 150292 44379 251444 256348 270143 258736 196515 192440 43063 467754 30561
13279 200697 -103782 370917 71923 -6775 -69555 152181 86717 230890 296985 348278 186872
13268 186872 -106544 12389 -21058 111886 404515 68724 304072 71049 131372 -114403
13257 182303 237731 74929 -344371 -90039 282849 336003 -21365 113521 162416 353947 59861
13245 147475 168177 83306 4331 304992 -88621 278056 -68405 85917 242111 -25690 80436
13233 55564 -949 -109855 92321 290532 151064 99362 -33276 266845 121238 232862 242407
13222 242407 77553 128686 185118 127924 70822 -196178 57473 228483 -183439 255614 191048
13211 191048 -65913 -28958 94405 212018 71044 169721 345680 -38205 119664 48907 -46071
13199 -207988 381929 236176 131049 131358 90635 116121 36800 185544 -7141 158105 418214
13188 418214 110709 283988 -32544 -30277 150210 260869 -15083 111061 -59025 79873 186153
13177 186153 182112 45379 192684 23495 9120 156980 250937 97637 -56713 453161 78937
13165 97564 89483 8991 -185774 164799 26514 166137 -282488 25939 -52695 645233 226966
13153 98838 212427 200623 -238311 -115352 153892 282327 208746 -99208 106702 250835
13143 250835 2944 243540 118418 117538 112878 234022 -23095 327591 -20565 158630 5999
13131 65955 121490 190410 74494 145359 32432 194289 58746 221316 85209 106020 288554
13120 288554 -112537 -56892 72871 140381 207736 -11648 211593 58392 -59769 309526 -254888
13108 27581 134558 -76807 -53503 146204 -138394 151837 5245 79714 -7990 205324 -132289
13096 85560 95736 65665 -376012 37120 257752 -3960 -128449 3409 59891 76893 -49225
13084 -104149 56705 -68090 -421517 -162167 -36474 41828 311873 230175 258283 -230882 178044
13072 112804 -150563 55457 -27474 63513 -15663 -121311 71361 98836 199857 116355 -158740
13060 523636 -17211 338804 78896 224694 -236601 227485 355522 90325 125462 -319641
13049 280915 142265 243867 -33487 290105 -43139 256497 6712 120579 112589 -184718 193297
13037 505777 -75402 271310 281083 269394 -31885 249989 486757 28526 -3907 406438 -19985
13025 143329 -63293 -36233 -111664 -151851 -143327 122323 -54211 -40612 54841 -35744 71533
13013 151839 66331 1945 95808 -113955 155788 -282416 39556 36989 217572 309678 191994
13002 191994 193825 -61261 65975 327332 -22516 187625 -91531 241584 244654 332410 142413
12990 202332 98797 274901 -142857 -261687 23722 -218657 45225 -385080 -224744 167693
12979 -11183 82442 189341 365964 298778 199508 -43069 -105673 102736 -63137 174014 -11082
12967 70054 8339 157655 455096 -22807 103746 3925 230213 -117140 -67573 -58904 331406
12955 10979 -42130 223040 60996 -132656 -235601 -57841 8002 461928 118012 -192544 8240
12943 99639 427896 141493 -40150 85437 -138900 118738 61580 10860 -9877 124017 31759
12931 148025 -51841 -149044 -20489 -364889 -168024 -80340 -162997 343543 -29481 86211 -135943
12919 -31209 90495 -112160 165319 -214163 230584 -314311 58014 2402 107743 -197610
12908 -246064 67706 44990 -64128 -253923 196080 -112446 115566 -26605 -257453 114559
12897 222863 -68753 -190944 -118307 -64371 -251631 -26143 -206973 -109212 5439 324964 134586
12885 159994 5299 272838 46310 112073 8911 -61923 7151 71648 32644 -107183 32551 208993
12873 208993 -135420 -165322 81753 -171230 -326709 -166792 -191237 29130 177514 -67479
12862 -38722 143122 190295 46347 -190563 206205 -409324 -25042 117204 225132 30729
12851 -135776 -141223 -29789 -38635 338914 169632 115515 188076 512 160640 -454713 -264043
12840 -264043 -251837 1481 6852 132940 -231192 -148721 111465 -132466 251131 -33456 114265
12828 203670 114184 99188 54466 -183658 -136649 -331142 3952 -27368 108491 -7579 56882
12816 -76321 -359120 8770 -230855 209959 12524 -209305 -152989 104927 -139550 -180765 101539
12804 -187632 -139781 -8233 -150459 -55651 45651 -262386 -109353 -20435 21382 39442 -31135
12792 -26354 -220339 -209469 -187350 257009 -269002 341661 -227314 -102252 150103 177439
12782 177439 -89310 179172 109272 -129960 379632 52697 8898 -5806 -161354 -147582 -307720
12771 -307720 -38274 -25066 40138 -116210 -62158 8921 200001 -144262 223847 18112 116515
12760 116515 -229518 -58907 126015 55691 77661 248585 169502 -231876 -177719 -102843 28552
12748 -185416 -234429 -152730 -117391 -15708 130160 65555 169987 98720 85605 173480 -46289
12736 131300 -14746 35301 -180429 193265 84535 -196767 -92674 -17904 -33125 21259 99643
12725 99643 272703 12800 358376 155019 165318 -497223 10071 -44578 113374 -29411 86171
12713 105017 -242547 188307 -420896 -135409 -56884 187626 68261 311468 -39509 -14097
12702 242616 305280 -86115 52915 -58424 -20345 57318 -11766 274333 308744 286767 -64614
12690 280993 93681 492809 340611 289143 -44626 233840 -207032 14794 -69878 -16799 46017
12678 229055 1524 30566 74627 46978 140967 -14422 22434 -78507 60064 119701 106143 -19864
12665 -23069 -248759 486700 263058 85421 -167490 94699 44369 57147 -91098 218376 313233
12654 313233 -286584 -27731 38424 -223490 -86742 -279607 -273337 36287 -99740 208807 -67790
12642 468569 170491 266963 298118 -12746 37583 -80632 -144426 44331 55290 -150598 -43556
12630 -216227 -19111 -13021 114056 313996 112086 221335 164885 27200 -42876 -335508 -268219
12619 -268219 266170 109497 -26868 213761 -2333 214289 377727 298762 54026 165218
12609 165218 142317 175480 -19046 311130 3987 120095 27078 -95411 -145510 138528 159056
12598 159056 135516 -107446 406391 66099 290937 -3218 -169182 -82491 -21196 -108662 151508
12586 -184664 -176544 -109490 -19809 136351 314751 84714 182001 -22915 -334479 -59252 86713
12574 173945 -41903 261748 281573 106636 50938 -246220 -392498 -80023 -138066 -4698 106852
12562 -61160 194180 -207813 -4724 66676 -47519 107876 -183307 -20374 -374 58636 12036
12550 -364474 203547 -117138 -299047 -2356 56933 -89082 -190335 41903 225301 215247 153763
12539 153763 -77261 -249956 -31189 213674 180940 -175157 -267681 -34885 -22328 1392 -71678
12527 -77814 69019 257679 -81795 20267 164085 -14404 245632 -12728 117681 -43020 58696
12515 158870 2117 130707 100234 206706 95989 -169404 -42509 79573 -219 -246726 -58392
12503 -119253 -40925 -155721 -425918 641 -14756 -400939 134834 157725 -57410 -52604 33991
12491 146406 -137932 200701 133802 -255285 -117707 306086 2757 332405 -38449 61201
12480 385439 303333 271520 -56337 -70928 -46952 -271081 270718 -115106 350052 -15883 -196443
12469 -196443 -103809 48570 68135 173330 202025 -238437 32343 -3241 -333185 116099 19942
12457 139509 -183659 -283207 51458 -87680 143990 -90549 -16586 -119191 269458 283563 -121595
12445 -126802 129509 108083 7662 141151 -200867 63613 182564 64836 86436 -31450 70508
12433 58275 -287922 17234 -84054 116254 180564 -266111 134956 98708 -230843 -173918 368108
12421 308733 124843 72495 -55259 76570 -67921 -188180 -104375 202415 36467 5706 46091
12410 46091 -162377 -28529 41741 173768 -20684 -23598 -22241 -78315 -172387 55074 200538
12399 200538 -170989 179543 -202625 -76721 -13842 -76201 -131706 126014 14981 -152291
12388 62626 -36176 111526 129270 -96995 -285949 181525 -13258 -180283 -78648 -118028 159529
12376 -56496 182644 -245888 182592 -348399 187746 -10148 -127281 -117041 -61914 6555 -5367
12364 -186656 277781 279432 29080 222257 475550 78706 -33796 18881 32664 50200 121912
12353 121912 -113988 86803 122155 117072 139661 168558 -213658 -122342 -151933 -254982 39150
12341 -301840 -24550 -19173 -184301 31596 324131 -129628 -48921 234322 105582 -285402
12330 -412129 -100749 -113220 231999 106595 -248839 289488 -407545 -273553 -7424 257691
12319 -35975 -137682 90004 62142 -284293 -60993 235693 -38748 221189 -14498 259166 607544
12308 607544 58739 -149960 -288425 -40465 55518 32406 25981 327706 57415 197756 59798
12296 430885 292494 32345 233605 176137 179299 19489 43189 6325 -42164 46764 260827
12285 260827 -309531 30022 321391 205972 16958 89858 180054 97933 -180345 58596 171314
12274 171314 167182 -296515 176153 106800 290099 39681 40590 410105 104070 233422 47512
12262 132442 -142573 106949 150278 556926 137189 254490 -193784 128190 286876 36186
12251 507520 197033 113867 140612 82644 -136375 290343 343438 97355 54926 203620 165372
12240 165372 350487 -173470 173154 -113666 315666 373948 248024 327837 308572 138492
12229 302970 107266 155148 -75165 247966 10504 501379 -40226 180195 -76481 176167
12218 301149 29854 -109469 199168 215602 4487 132404 -237111 -63314 28050 130423 86497
12207 86497 199926 247313 166287 390852 -4354 77229 214014 336584 234459 147141 -151666
12195 472074 175946 112307 214768 117401 -106028 113521 124246 228627 -11672 187421
12184 299300 -6007 274932 47317 110997 43191 157857 348372 147950 222527 22285 65287
12173 65287 257552 177176 45926 75441 437585 234155 90209 -164990 14912 147721 42195
12161 162432 279308 -80365 168544 -8733 -124119 6528 322082 32216 -28110 329474 442572
12150 442572 337332 -30860 265826 189305 105957 147049 563438 131488 39127 -159983
12139 62056 -135289 157443 232830 153719 -104257 59922 367498 -1737 173645 325748 321648
12128 321648 -71249 118865 84489 -203721 -164643 267410 -155387 -104193 282335 114069
12117 -6496 208455 194291 -205690 -111847 -60902 43303 13227 47920 98141 267414 -154465
12105 193494 15855 144193 116218 175020 255741 39943 4744 31859 387994 -63492 -61935
12094 -61935 58886 164174 303717 59475 -5156 162972 -177265 57633 4834 341411 -188878
12082 248226 62859 352947 231581 225600 5550 -25942 213679 267191 -35960 375987 -80771
12070 -150858 95017 55814 58594 311354 293271 -113085 263842 295299 -97377 159829 355783
12059 355783 58702 145909 168828 -116679 323564 -107653 -461 177781 3105 -64512 332977
12047 189508 31822 -80326 89611 -7874 -93511 -140922 279517 18999 72335 243521 -13575
12035 69874 686907 34750 -168470 13730 326283 27439 187212 -39706 -84677 82319 470936
12024 470936 -156234 171807 -12511 -151214 32228 -27387 120205 254058 52776 87823
12014 87823 -94729 31633 195965 8826 12962 -169403 248299 61208 -272653 -33157 217864
12002 -284173 297659 -181318 152001 159361 110285 456787 318263 71372 -110479 33164
11991 -151859 -34692 -102886 54747 125004 -157753 61755 203944 62890 199163 -281081 240504
11979 271103 -224475 307286 22892 -186453 167789 -153804 -164648 -128970 49843 207851
11969 207851 -4150 107032 -308683 -122986 -25358 -223234 -101012 -207890 -141066 -110488
11959 -110488 132716 29869 17128 130765 -110250 -198097 -148644 110281 47588 46455 122386
11948 122386 57785 28946 303336 191190 2151 -194651 -182279 -62633 -182189 -220905 -63108
11936 -236499 129019 60900 8829 163265 -127714 -292451 21973 76527 71581 136257 7684
11924 -399104 114845 -231690 -144780 27115 46638 68689 -299916 -22115 157853 -1582 -131907
11913 -131907 21786 -97033 -350690 -180845 -175318 -67986 -106070 -80250 -199277 169 -24203
11901 193486 -186140 199335 -11110 134321 11450 279964 115899 -94484 -206654 -289020
11891 -289020 -33580 -231602 -251567 64101 277047 336637 76829 184405 165800 -65266 835
11879 2754 -253481 36727 -121543 -183227 203729 -46007 26324 98935 56339 32290 -371408
11867 310035 223266 264082 166995 -8273 245603 267883 109752 242041 133630 154734 -5918
11855 176255 231171 -133018 58288 142774 138648 60730 -274724 -200016 272242 -79227 -99245
11844 -99245 65616 79386 -546843 269840 -92092 -251220 75103 -88356 -282785 45677 -26843
11832 247135 -304662 -30527 -109643 -72628 -319699 -336569 -141113 224638 -66326 -289928
11822 -289928 211343 -157439 64169 258771 -26867 -182459 -252206 -328623 -74538 -170574 -70961
11810 195632 68861 264245 -83152 54655 -159527 210158 -289551 243069 -16456 10042
11799 -247627 -288483 78217 -8098 -29622 -79378 -145700 -10572 9636 -199106 -66298 25979 -226869
11786 -197994 8851 -222918 -272000 216088 -202393 120246 23627 68463 89614 -327456 -236097
11775 -236097 69856 180497 197572 -39085 201897 -248984 111356 -265478 -173032 333214
11764 -7642 -20497 20754 83918 -237356 -244971 -71224 -292286 119086 -254072 -135332 -6760
11752 -24693 298314 17734 216915 121600 -39918 102590 26369 -105118 -15216 -214023 -340765
11741 -340765 -194761 -4223 -69311 42188 15067 -79527 17892 -380033 244426 -19043 38402
11729 -235312 85885 133958 -149641 -207172 248128 -187030 -25219 -18767 49763 192426 -358442
11717 31862 -57064 324937 -101319 206778 101215 18872 445 103641 121414 45363 -93213
11705 45155 400144 -244340 -130749 106205 17677 -218352 -64178 -47714 -413773 207609
11694 -59188 -256123 -35302 -16723 260191 -75682 -231258 -337525 180049 96655 10547 48896
11683 48896 -185465 266452 300622 1851 -96534 133446 -335153 197989 -100037 203332
11672 -1644 -514466 159130 133004 397305 147067 -411990 277813 110547 -8484 7874 292202
11661 292202 240683 166329 412243 -21669 -288332 135677 194186 -95454 94653 128028 130543
11650 130543 239772 -115432 -179790 224019 -49212 -156316 222 10326 -197020 219498 88671
11638 -12335 169851 -85826 -195081 -290083 190932 152895 119605 250759 128942 279807
11628 279807 -109347 -13862 -64537 66172 16231 -142942 -63597 149723 35284 -43385 333792
11616 259864 81971 579644 -27386 47536 201851 -140756 -235045 -269381 -279359 105019 107159
11605 107159 -107467 140848 -210499 167209 100708 152260 -21448 -343005 132764 103736
11595 103736 -60256 -44402 124144 44244 -174178 -111661 212796 -325678 163226 -90802
11584 -135996 53231 501642 -12990 -215735 44344 -264833 -234489 -37016 332098 118986
11573 3316 205442 48230 175483 305042 16575 -92408 -80844 81684 -114345 68043 54889
11562 54889 -130772 231763 102252 -239722 -50217 437082 -99408 -76165 -151236 69939 151145
11551 151145 217452 277268 -8045 59465 -69856 287544 39314 100546 42183 146770 56481
11539 -509852 143126 15136 169694 15679 183998 -96051 251907 -13053 134110 155879
11529 155879 -391425 -118817 -111827 180904 -4126 -131010 213327 -44067 251905 -101130
11518 -115977 262621 78062 86588 4156 74452 80535 331446 206777 -215582 -44338 169938
11506 129274 83136 -482455 3132 146041 -12526 347508 -82541 230732 38210 -99302 113037
11494 -68620 -362797 -287146 139306 -116147 114741 -10550 62388 159282 -3438 38760 -147015
11482 54076 356908 295632 50289 52453 20828 332690 225031 250102 170007 287848 219513
11471 219513 96193 -4408 393630 113322 49660 74559 -118024 -94523 -94686 -162919 70421
11459 219077 232451 175408 488193 129087 -12605 -124501 246537 29554 298507 -55153
11448 251468 70786 168085 -58989 -126757 -12827 123261 340863 -155880 57508 -92456 390008
11436 186966 -182488 -108019 -118879 -174623 -31928 402367 234788 -256426 -59108 480072
11425 231308 -95029 219648 123670 -156929 -28470 278107 -98737 -53029 -49046 -32708 -84763
11414 -84763 -38014 71913 107983 365997 -83738 -59204 -33341 79019 -121135 -123050 68779
11402 -106351 -335139 -116480 370974 -160445 -239468 67316 44489 -165257 97230 -123679
11391 41699 50921 -184622 75515 316973 157127 -189780 -39943 -198571 -45790 316133 -15619
11379 -90408 292560 105541 -26247 -72825 24618 159971 21153 -144223 -304956 44845 18786
11367 -224296 214622 -171547 -55335 230773 217843 -243427 222894 64543 181918 86980
11356 25541 156968 288344 -149237 34500 -15257 46654 -61927 82502 -34379 -8468 -66443
11345 -66443 -271857 -122957 -170487 -214009 -14295 -439922 -349286 -328119 -102340 -353678 -153752
11333 76431 -258990 129218 44635 -75768 -33133 -240049 232188 -82081 42664 244196 -181867
11321 -41086 139093 -10134 -200365 41422 71546 -85158 133290 253695 -7450 -331517 75379
11309 -74768 -264459 -316290 -23615 -341045 -9216 -36002 -45979 393355 -176325 251117 185124
11298 185124 -259841 -365044 -30855 435006 -494426 -1454 -55381 -354091 139315 95296
11288 95296 -295908 115271 -434811 -72767 -500207 -43611 -97497 247344 66650 -70532 -192771
11277 -192771 129730 -125880 96505 73977 -174267 -354148 -224060 210909 37813 139760
11267 139760 -59278 -11721 23858 -61717 55873 13304 -92506 132151 -289464 218150 18238
11255 -75522 -373946 -141552 170244 -168281 -62262 -225090 -212408 66195 -16496 -236434
11245 -236434 -367841 -230557 -108795 72342 -240317 -104446 -186665 -201352 69361 -13433
11234 260303 -523809 33119 -287192 -375360 -387353 430163 -82321 -138968 197307 -246555
11223 -216417 -57194 -181787 88809 142898 132071 -94173 -63097 40132 -148272 -118453 -38340
11211 -538957 -139632 -272149 36986 -158699 -31512 -211390 -92759 241942 -123918 63073
11200 -299719 86399 -461786 -278840 -59211 -203384 136461 -87317 273272 241740 -223290
11189 -226406 -12965 -107407 -147046 -70351 -69565 -173912 79599 -297582 -251582 245561 -194505
11177 -118008 -222541 67662 10241 -371623 -395497 -30050 14785 -273351 -72734 -58658 -331565
11166 -331565 -44022 -33268 113655 -12789 -207083 -80590 102387 -206065 198186 -296017
11155 -137931 -290609 -368640 49783 13135 16052 -67406 -78196 82211 53483 132228 -139201
11143 11274 -274209 -124778 -54656 27038 -191113 -63140 -386320 -174179 5797 -68497 398820
11131 -95998 208818 -199485 -88277 -211629 51823 -29700 245503 -271140 72279 151146 197957
11120 197957 194527 184949 -60908 -38048 -89889 140496 24111 165642 190986 79781 -184481
11108 -108365 112001 -195884 -99445 -325253 230573 328446 -60005 -177624 -256957 227869
11097 -279919 80194 159282 -119629 -3609 -163498 141525 471127 -11227 85861 -385564 169356
11085 -86168 278700 194149 -160405 428792 54794 -92204 -75295 284279 513355 -191206
11074 33202 376493 170494 14876 29483 -315890 385610 427873 299407 -6506 345187 72330
11062 498297 164785 340652 339089 418816 333282 190940 237685 155872 212816 84308 161503
11051 161503 294175 101038 77358 521559 411468 273089 236000 562902 159865 411520
11041 411520 231825 309003 507687 458384 279295 631884 496706 528641 647046 658227
11031 658227 460166 549659 371696 477144 824327 747199 578312 397356 431557 929844
11021 929844 611996 550951 691224 696945 771418 457228 651676 631670 693245 862929 743106
11010 743106 826462 780281 522251 638606 603036 489503 735296 614325 608358 419115
11000 419115 288641 574035 612132 475372 759571 534153 359053 835996 543771 476804
10990 476804 428594 351552 800532 334705 912304 662815 344458 801393 623024 448755
10980 448755 276860 441347 589936 317523 473883 490498 542644 806762 692297 803583
10970 803583 524966 530242 731527 622773 889741 940452 670934 676699 949070 999393 1241885
10959 1241885 1359331 1459866 1374679 1704154 2028621 1858745 2002230 1942408 2305394 1805069
10949 1805069 1964131 1873796 1648724 1512316 1536789 1471334 1506097 1504404 1660617 1278012
10939 1278012 1277598 1353234 1104944 1347582 1127759 1304741 886313 730841 533375 685306
10929 685306 617922 862551 362204 432373 609074 567355 333093 265583 -8412 208626 219544
10918 219544 -36403 78182 276503 29262 87430 400193 -93024 -65517 -133475 -367796 -111997
10906 93278 -33840 235697 126892 82606 -70893 -130651 72356 -64868 -112075 -316022 114559
10894 -121415 387483 235760 360578 189623 -80027 28948 -127720 -67559 -396395 -72660
10883 -75486 -232964 -85900 303452 -131324 -213055 -25532 -257238 -32581 -177917 72674 67281
10872 67281 -47842 -28758 116316 -289676 -295711 -29172 -2248 -158016 -139147 -200185 -56454
10860 148838 46506 -147300 -152246 -39062 -221425 325255 -236608 -3620 -73286 -46654 -121842
10849 -121842 -96316 -195866 -6943 113296 54297 138328 -124682 -254615 352321 -81581 21556
10837 -486990 -36579 134229 -83785 141745 -157463 -196788 -198891 -107178 167421 136268 -225532
10825 258848 -291164 307862 69652 15545 81840 -719 53013 -168476 -98948 -272507 3494
10813 -243690 -288119 -4830 -74218 54358 120915 33394 -91463 77455 14166 -205901 28158
10801 85978 216875 37833 217673 -199774 -105466 -172614 -32309 -394565 -304378 -95680 93425
10789 109110 -258947 -44017 -242805 79750 -143366 -281246 45820 141687 153265 181538 -534848
10777 -47571 -111080 -237985 -184910 -135657 66749 -82015 120641 -126587 187394 -59928 -133363
10766 -133363 -428947 80701 -234375 -64318 -132006 99537 -69655 -73214 38502 66696 -117127
10754 -15781 14383 -143508 -21975 92204 -244844 364029 -356025 169261 -76265 -168799 21929
10742 -12270 -145618 142116 121772 -84619 -65436 400200 -32387 85413 -65083 -128286 -135205
10731 -135205 -16567 -257557 244644 332716 -79517 -357420 5193 -156023 -129161 -76071 96728
10719 9450 -45210 5408 3243 52141 183863 -93506 -175874 -85683 -13023 -99941 108903 72599
10707 72599 -298643 -132680 263730 -151965 -39840 13227 -181297 -125788 -167051 2595 242474
10696 242474 -462147 -250831 -91905 -174135 9853 326845 -48332 -75267 255210 55554 -62948
10684 69014 -261098 -12898 -463414 -4195 304409 52650 -196645 -185446 37482 124333 -222401
10672 63221 330145 -251871 -182694 240329 -34811 47429 56609 -165045 57053 -156735 -86706
10661 -86706 -31254 75869 135344 -58605 107786 -225506 194872 143234 -78298 -197570 -104788
10650 -104788 -15624 -259615 -201496 91372 -242259 -239541 -184431 -77163 256329 66939 -169407
10638 -115648 248341 -78285 -232464 -18019 -279183 192246 25111 81137 12949 -311618
10627 -157205 -277154 -80335 -302479 -97805 -125614 50325 -262400 -9569 178874 -77827 -336608
10616 -336608 -183152 -15942 476 59144 -236785 -200467 -298421 -272119 -232055 22274 -349194
10604 -103503 172392 44429 -453800 247110 -2941 -186551 66655 121985 -196362 190524
10593 -292723 -313940 -106569 -211895 -44944 25929 219272 -207279 149864 -411312 -110657
10582 209416 -265856 13286 86414 108747 109894 9594 -256672 283215 -116171 132191 78383
10571 78383 -282282 165802 16262 118883 82732 75898 -45440 38914 -298248 -190415 10023
10559 -133777 -153411 -95618 -215647 -64370 121272 -178264 -175203 -66512 65796 -3390 -117158
10548 -117158 -100579 -245281 -406507 -152429 96145 74896 295862 192573 -195375 -335205
10538 -335205 3395 123487 283074 246451 17884 238218 307801 100804 -107972 -87068 -111789
10527 -111789 -82176 -58314 47484 22471 -10604 71593 135583 26518 -249105 -214250 -149754
10516 -149754 -210765 -216611 -257199 -259359 84022 -128753 143788 -293104 -263081 -144489 -434296
10505 -434296 -162506 -196112 219337 -197778 -124645 92280 93372 -224630 84447 158668 -148251
10493 73837 -83462 -111075 9857 -296495 -71637 -192261 -61051 -310709 91123 -24689 -196228
10482 -196228 124220 132061 -123387 -176096 -103414 -234670 -205936 -19226 292944 54830 130500
10471 130500 -42299 -364180 28668 -220845 -106260 103531 61761 44457 -65003 89450 230349
10460 230349 611584 94762 -89870 276622 -21569 254607 -216211 -7349 221981 76525 174471
10449 174471 20730 -64179 24164 -184219 -187064 95487 -119084 12439 -207676 969 -79296
10437 -166307 59949 -46933 131032 110149 -183894 200474 -121566 23398 -450361 -201268
10426 6928 -49116 -105153 225958 -194601 -54105 43813 -760 390958 -239898 85587 -378037
10414 -138013 -157458 -71760 -113742 -311889 -68539 97222 61568 -240766 32173 -176024 -118687
10403 -118687 -167739 -289221 -305322 93705 318716 55568 145745 300382 -369837 -147246
10392 152010 -290859 -109510 -54146 122978 -34018 -86392 -290989 -171360 5290 -79566 -551
10380 -105391 142926 -398678 327811 201684 -50111 186339 3829 11035 29504 -79826 -23295
10368 19562 143914 1816 -79616 -81560 239118 -138448 -452491 195119 463761 -63481 116757
10356 181903 177707 -70484 201801 88522 378341 526723 275967 265195 13019 305134 209539
10345 209539 341890 504148 460026 173609 233492 307361 130104 186528 417519 194615
10334 484202 486847 291052 461555 268886 566260 307513 -10941 432510 132228 216125
10324 216125 41250 65235 21068 178980 52527 537337 328542 258158 169541 266937 -209315
10312 112790 417891 141237 -132441 -78450 164808 58289 188961 78510 68880 -44093 235636
10300 106755 149811 115841 28963 210337 -31456 320025 310363 90171 -155865 -139168 -144776
10289 -144776 9728 -98396 152035 -271548 48426 -53572 -235975 -371280 165427 -143558
10278 -521069 -146002 -411547 46744 -295837 -59201 121531 28714 -66505 14451 211922
10268 211922 -28609 -49294 -83329 -65477 -201370 100278 -35519 -16584 -10433 76748 128919
10257 128919 77860 -10651 -137852 -311622 -370 44985 -88199 103743 209892 16031 50619
10246 50619 114149 72817 149165 -173069 -192705 158361 7914 -179208 309539 -162169 499789
10234 255665 -110774 -58295 271610 227891 138416 -149444 -94727 228988 222877 -19902 -332176
10223 -332176 -207843 4235 -218243 65820 28280 -100057 -336579 -92188 40167 72478 -226592
10211 345875 -204647 -43212 35419 -115584 -248630 -255373 167808 -348951 127641 -9856 -36256
10200 -36256 263453 -114194 404100 -109663 -2623 -34905 -111450 -146705 -227433 43764 17396
10188 -143918 255466 -159841 2944 -98333 140524 -106305 3040 120084 87743 -61698 -286000
10177 -286000 -36715 136165 22863 26424 122342 -381480 -197652 -151727 -622067 -203734 199566
10165 258960 -127704 -358364 -13881 -134832 48999 -46843 283484 -66200 -237587 -31257
10154 -401936 -201523 -130752 25107 -114525 144725 75572 39548 -96165 -42084 -432642 168398
10142 -243657 28704 42390 30988 142871 -266884 283280 -156835 293595 -259972 -65592
10131 -87411 -194579 -22008 -29114 -221842 101251 262016 -324558 -80097 167667 -107751
10120 -42066 -359662 -245492 41083 -181201 -32393 -67787 -170339 46956 61374 -116416 -137314
10109 -137314 -221579 5658 -192219 -37666 -340396 -44291 -67758 154933 200929 -46506 157515
10097 -148455 74319 -367870 30575 182438 -81064 -194113 -132813 196720 223934 -51169 2348
10085 226331 173765 -183920 -128740 129568 76498 78266 361649 97020 -15598 -43388 -122593
10074 -122593 -392895 140160 -198836 184351 131785 -173688 -148123 26357 -136418 24567
10063 11566 -19675 -183225 -287133 215702 314912 -178159 113264 -48881 -191541 -144762
10053 -144762 -35719 24727 215035 -119809 13697 6043 -107655 -43180 70427 -7742 -52243
10042 -52243 1463 44053 -44033 -244574 -231375 -269145 -247205 71473 -180944 259564 -26260
10030 -53294 66055 112199 -509145 -331461 45061 63834 -48193 -222288 187767 -122034 -146221
10019 -146221 -141148 -36371 -331507 -120367 -173290 -89698 61218 -50287 81129 -66658 -104549
10008 -104549 -327219 13648 105150 -34558 140284 115214 176836 -194125 -119077 67854 18212
9996 -111643 -81925 -6014 132235 -336311 -186086 140964 -382851 -195219 32505 41096 78201
9985 78201 -175769 -175301 -106665 -252578 100434 100909 35164 57376 77621 -229851 146357 -55574
9972 -187313 -57407 42660 57274 -99655 -234347 -411864 8320 24249 -97103 -167208 -32638
9960 -66824 -139621 -46930 154458 104886 -101698 -199192 -191550 -135344 -156188 -86129 76823 215530
9948 215530 11010 32497 -194437 94379 10594 499054 -268921 48563 -293458 57078 85981
9937 85981 -35379 176953 316536 297947 -57726 -308704 94840 -319276 150068 7932 -61781
9925 54774 -144385 -354613 128735 -86912 -15665 221178 -611423 -245761 -460058 184893
9914 -56984 61529 8187 -122967 159562 108069 -184321 -332318 -331120 261325 295853 -109313
9902 -174855 -201997 88216 -304892 -40263 -75091 -249370 -98646 163652 -160800 -100315 -142963
9891 -142963 -404024 -86406 -76521 96132 -39989 -106979 -430561 88393 100618 59008 4756 -92626
9878 -381845 -130960 75762 163775 -61038 -78707 -162774 -181780 -227853 -276362 -28992 20893
9866 -104055 -118211 -118864 -197178 -76066 -369032 117608 -263970 179366 -591940 -365430 368507
9854 110025 97228 -155020 27754 -311466 -35773 157031 -6476 -70900 -130906 -125723 -515894
9843 -515894 115127 20703 116650 -70819 -132360 -79007 148978 -354597 -168104 -183300 -123877
9832 -123877 -56401 233673 35269 -24385 -252870 21719 -101123 20597 105869 310630 -17427
9820 -80706 -240122 67540 -20870 -194346 205289 181879 224056 -148595 -134414 -201809 -49240
9808 -346931 -173030 -11718 -136145 -248389 -152171 -295201 102716 -99343 -196592 -142949 -117688
9797 -117688 -195994 -219488 -146122 121410 -86608 239736 73036 -42687 175189 322404 -167543
9785 -2815 203586 -60653 -52984 56498 -80111 -418803 -73017 55958 -211055 -322526 -82319
9773 -18135 48816 78677 -10747 7880 -243802 85028 -118732 -292927 61109 -76097 -291813
9762 -291813 -169927 -9752 -252052 184048 -68946 46252 -175125 81369 -216101 -167381 103843
9750 -424847 63427 -44842 183232 -225397 -4979 -328844 -453474 -82844 6363 -127548 -189387
9739 -189387 -10680 142928 -39751 -65039 -5387 315946 -74162 97725 25440 55654 -256824
9727 -174939 -155912 126918 -252675 48576 -243129 430898 -27524 -31174 -210882 25442 -433276
9715 -122323 26552 47007 82448 -203560 -60034 54357 258925 64064 322279 -1066 -309134
9704 -309134 -81627 -111698 119119 86771 205217 103790 28794 -272699 -33772 -2558 65140
9692 -39574 -364679 -90939 -191751 -68168 139917 -189350 -144908 -299446 -46436 28864 -201842
9680 -149455 -53337 -109936 -118280 -88996 52863 303052 -46582 -155764 -70492 -8538 -145007
9669 -145007 300434 69456 211687 -146341 -316227 -71978 -119627 -287755 -174711 -224755
9659 -224755 -15917 -336415 -272636 -453687 -39092 73161 -203754 -165984 -47890 65851 -51943
9647 42693 48652 12217 161638 322027 266292 149563 19721 -286549 -125774 -28942 84100
9635 -120820 40646 -229407 -432331 -17113 5460 -204067 -59744 -340475 -261633 23123 281342
9624 281342 -103280 -138172 106728 -72130 -66381 -85668 -57781 -89446 -149854 191774 3971
9612 -191903 -176121 -41015 12725 6114 1273 -144608 -88549 -95889 60968 -287320 -134341 94393
9599 -219471 -113048 95468 -10196 307588 30356 275957 -143616 194839 -36113 -248509
9589 -248509 -51577 46018 75675 18568 100210 -208625 -144199 -35306 -55485 -235947 -134874
9578 -134874 -272848 217501 -54671 -235980 -117651 -231541 -52432 117014 56021 -213877
9567 -123298 -270990 -74585 -157138 33594 -17150 -42309 -142306 22711 258838 -389998 -44908
9555 105828 47012 -344162 1815 -160615 -13788 -295388 -116324 -432307 -252263 44353 -21
9543 -287425 572550 -105764 3384 305680 -107103 -447867 -185859 319898 -2274 -19153 -355309
9532 -355309 -95488 -165683 -46601 -229417 109280 52762 -44360 -47346 -240460 155139 -192630
9520 183249 -589329 201883 -213050 136335 -107502 18396 -51562 -86497 -93323 -137963 -259806
9509 -259806 -68552 -312544 -80220 -72415 135139 -23308 -73329 -460180 -229056 -101984 -203952
9498 -203952 -287534 -48002 -323896 88354 3148 -242574 -201847 144732 161713 -64606 30756
9486 188362 51116 924 -383756 -181597 86247 35297 132009 -212601 229562 -309433 -326708
9475 -326708 30349 -304756 -459225 -59889 -22748 -117249 191651 12590 -77549 168800 171354
9464 171354 172764 46945 -87982 216 66825 -99573 -429257 52008 -129613 15401 -257680 53167
9451 -51656 -187693 -349 23431 -894 97921 15686 -161754 41902 -65201 184259 -281702 -94615
9438 121200 -5977 -162268 -210355 -239895 -74413 -35364 -183319 -314370 213206 129903 157282
9427 157282 -157628 -65520 137986 -107404 -163171 16291 38462 73890 -178438 599 -170583
9415 -193353 84567 -37860 -307510 -133967 52885 -288291 59681 -530432 82770 129595 206147
9404 206147 -150636 -270900 84098 -69638 -316616 -24360 -209835 7958 -344410 140764 -396384
9392 -98196 217222 69378 58417 122818 -114150 131048 -157581 -33388 -31954 -241692 -283464
9381 -283464 199133 -240471 121787 -37905 -121070 9789 -61895 195331 -306536 -37617 146005
9369 189356 -145471 15120 -205992 -53856 -202875 -17666 -37358 205172 -47847 -122618 -39085
9357 74108 85687 -154946 51359 130045 13555 -90349 -2176 -235017 37993 -113243 158664
9345 305623 -44918 -276681 -100884 -118362 -321139 -122593 78255 235161 -210388 67516
9334 88787 277587 -278696 -304577 302767 50044 -152125 25106 92715 134444 52603 14372
9322 -260469 22084 -36243 -361047 -28055 -372637 -185286 -385193 21801 -201791 -44246 53468
9310 -183667 63972 -195535 50608 -131519 -133630 -196036 127699 -405879 128639 -281060 12059
9298 -143728 -37219 -80881 131004 -198998 -290683 -161079 174439 221108 67932 -117571 18987
9286 62496 -14556 -41105 -82848 -25415 92602 32822 -344218 -264226 131665 -208743 -77247
9274 53667 127009 -191481 -157524 34173 80763 -111512 311177 -293198 129365 -136834 42053
9262 -90263 -207135 -31741 -115552 153646 -34765 -137931 -223151 32727 215071 -112870 -347549
9251 -347549 57132 76346 145676 -295133 54067 -159920 -185973 -23437 -89759 -125417 114516
9239 -67862 102342 -19596 93879 -133114 -55511 -273939 -154401 -14090 -6070 -295136 -140497
9227 -29773 49078 35299 238351 -32264 188451 -54431 -292332 28206 114326 -118197 -69654
9216 -69654 -169065 -309973 20011 -65603 -248239 921 -17249 140591 -7856 -207570 -203025 -319085
9204 -319085 137303 8921 52495 -141270 75008 -47740 -146385 -14749 -73912 -306810 45794
9192 176062 -336125 -94806 -171666 115155 126772 -23291 -46094 -90610 -20579 -204634 184163
9180 -210841 2248 130131 286127 -41434 119853 -260968 -199368 58527 13579 158928 70624
9168 70908 -89793 -206210 6638 -56824 -247235 -185228 -15205 109067 -184999 -61663 -206859
9157 -206859 -20005 -479205 -99531 -205656 -245631 -166132 -134839 -233452 -48017 -352450 -115138
9145 -90163 -261389 -168157 249361 -271332 202063 -80890 -159618 68246 -195639 125367 -12102
9133 34812 -174729 71692 -138761 -154125 -113457 -190995 -235437 -72132 -323468 128633 -72254
9121 -200147 -268337 -122297 -58747 -218479 -88408 -173099 -33700 -86556 -169040 -394658 -11857
9109 96421 -199765 28464 -141164 -209216 183318 8637 306802 -369715 385016 -179355 -83312
9097 206670 -238905 -233174 159136 117037 -84991 -124266 -209397 -23403 23337 -262418 -27908
9085 74646 113371 -270557 -120608 -16479 -46682 115241 209121 -30467 -118529 66696 90264
9074 90264 -182132 -171310 -191737 -93211 -53878 85722 -84676 -131359 -61584 -158842 142845
9062 -266431 119224 -87449 -279514 178481 -252261 -280068 -6576 -170802 119679 -198693
9051 51825 -220153 -344863 172962 25645 -13105 207149 -127821 121825 -217637 225933
9040 103442 1104 196841 -259587 -24426 253806 87411 -109352 178577 28471 -3749 -185095
9029 -185095 -360275 -122226 -149064 -20125 55530 -49370 -192774 -245384 46401 -93655 -17190
9017 -189378 -46876 -467938 195622 22951 -34992 -225243 -222977 -119255 -141773 107458 39778
9005 -370399 218109 -96124 83191 -48521 -107128 -175617 -287241 81272 -150270 60829 114305
8994 114305 -156086 -236866 -159770 -209571 356753 31921 118319 133585 -134251 39560 12552
8982 -135355 -216378 -69257 -143544 87982 -292684 -136123 -350299 -184411 -255409 -230692 -92082
8970 54170 -38630 -5340 331964 8930 -111250 -17675 56940 -58939 108324 -177866 -395810
8959 -395810 -228101 -125976 44846 -102102 -23265 -89304 159146 425490 48545 -243474
8948 -42629 -71534 -95598 -169769 137576 -195361 367308 -285681 2075 106360 -53231 -78847
8937 -78847 -327189 -257236 -158900 -211327 -35058 -126966 -424514 -376897 24402 -87485 130609
8925 45253 117823 -102762 98547 -197606 -26960 -354961 292894 67139 79917 -71403 164881
8913 315877 414244 408134 -220793 562094 384996 642015 860499 892317 1588989 2544159
8903 2544159 5468987 4465023 2637375 1597377 1220288 472184 524565 202599 259841
8894 259841 243623 -22572 343192 167482 127177 76705 140767 233067 -57069 136514 122980
8883 122980 135798 202041 -250806 260025 109591 152922 210974 -381082 182793 -27054 -37648
8872 -37648 -128089 -226594 -119706 12606 -242195 -278240 -77223 4240 21083 -30900 -251208
8861 -251208 128754 142052 -65286 -163252 31271 -174468 -258016 -189806 -40331 30671 -134356
8849 190237 -387698 -180736 50070 1989 -265167 332950 -265673 19769 169882 -192533
8838 -280015 -257665 43815 128813 -273462 -127076 -37557 -74668 -95276 313097 -96588 -134489
8827 -134489 59538 -311982 21869 -213247 -57857 -275339 -292420 -101956 -8797 106018 310264
8816 310264 -67030 40589 -247438 57988 -58404 73008 -113686 252269 -369227 -26994 -57123
8805 -57123 -413924 230531 96971 -374501 -288491 -56556 201257 136319 -139770 64937 -287856
8793 102678 -223175 -54239 56570 3478 -214954 -156455 -177400 152069 -192912 -167508 106614
8781 -113406 24491 -255052 -61927 -10555 -152483 304209 118609 198822 242506 -38461 -242615
8770 -242615 -215973 -238668 -154473 -165115 -269864 40970 -126351 112292 -131685 -76046 -34764
8758 -249429 -160433 121318 -85424 102019 -234445 -147754 223540 209409 293222 78165 -291042
8746 56191 391369 -176830 34932 -285579 -49129 -143043 -245506 -15484 216071 -90016 -122189
8735 -122189 -286692 -52098 -70738 -181218 -103030 58897 -223109 -165282 -166021 175703 -201209
8723 -120414 69429 167684 22737 -25960 -36903 -291966 -124810 -23828 -205995 169318 -220429
8711 112508 -31129 -306950 -192918 118654 -182945 -67825 6344 83951 -243365 169413 100588
8700 100588 -181398 145938 -164499 12741 -191517 -138851 -69748 156009 114968 23307 102414
8689 102414 107464 14331 -230354 -241744 77693 161976 -110696 37546 -158548 199565 -44610
8677 -113592 -91720 246430 -255944 -200382 82333 -250633 -79105 -67705 256132 -162266 -276061
8666 -276061 438640 -185907 -97300 -293571 -40706 43379 -156760 -259353 327933 -155823
8655 10104 12553 588 -144583 -96010 -64680 -289949 -160808 64739 -190755 -163909 100339
8643 14322 108230 -141923 -237451 134249 -198822 -305040 -112689 -168413 266266 23517 -143103
8631 -241470 -136458 -14077 -75800 -102788 87732 -109266 -43289 -94043 215038 55139 171891
8620 171891 -63163 -3679 165762 -303479 93548 -168859 215837 -1731 -1873 -252260 -104647
8608 -99398 77438 -125496 -132549 -50269 -104566 -116067 -124301 -333775 -35934 -50906 -258046 -59108
8595 5236 119337 -306964 68731 111387 -142521 -131597 -71680 -96143 -44656 -14330 354346
8583 -266799 116663 -90225 -182704 -4759 308 52642 -318284 189494 -155862 27588 -156518
8571 -51651 -13173 -104560 -43994 -90015 -163723 -84459 -257323 -44450 186363 -59773 62505
8559 -315387 -80244 59766 -60746 -75787 -90111 114903 -25031 72459 -74309 -35717 39114
8547 -241792 -119447 24421 68350 25585 -62905 183546 -26905 -244652 -255450 -205208 8641
8535 -8869 -100722 -255589 -144227 -121436 -31241 -448308 174111 -68805 -85578 -200592 -62987
8523 -61128 56015 47446 -114059 162631 185519 -66605 143337 82135 -188975 -17966 -5634
8511 -27139 -101457 258748 -212924 -52429 -67538 32331 60244 124530 31811 48413 -117306
8499 -23824 -59593 -204085 -130608 242166 88331 -191544 13394 -105994 -97512 -249377 -1475
8487 -1697 -305600 -124841 132196 -76632 -89056 27321 67918 -167179 97745 -92032 -381643
8476 -381643 7271 -247929 39421 162491 -369332 192733 144068 -30825 -85409 -53317 -206193
8465 -206193 92867 55791 113822 -122884 -28960 -216790 141595 186205 60008 -63263 -390163
8454 -390163 371034 -140055 6417 -557954 -173514 75075 -288552 218805 121474 -23140 -249685
8443 -249685 -35283 -102650 24933 212395 -350720 45534 -136535 -186054 80229 -319445 -144856
8431 -231045 82186 -2468 59334 145860 116329 -317727 -57339 -57664 -21755 162555 -362790 -197412
8419 -197412 -402424 173046 71158 -94724 -39053 -139664 -286601 179846 58181 -60950 111808
8407 216857 178844 42248 -35988 -108256 -76674 11215 -73144 2971 -116756 97768 -260943
8395 20413 -177874 -133658 -441473 -116493 -59747 -282196 195311 -17939 -84034 -34031 -187436
8384 -187436 8889 33241 -160653 -64214 115140 46166 -141848 -126858 -106084 -229630 162688
8372 -211930 578 -133405 -362353 -62111 67195 -162887 93253 -215512 -252729 -99091 -76464
8361 -76464 -57312 -97872 198769 -8133 -61664 189052 7349 161952 -76362 -164488 -91683 375534
8348 -75156 10446 31816 -43937 -216873 -55304 82721 255802 391048 -142210 -214298 195419
8336 186405 -211313 -303737 -343524 -108218 331654 80513 -70768 74799 -142043 191661 50303
8324 3838 -245060 61438 89444 -611933 -69722 -71038 -53462 -238747 -85888 -30604 38363 -605315
8311 -226112 -255564 -44256 82862 -41868 -38193 32321 -112811 -144715 -239726 -111862 101158
8299 -121470 -94509 -38316 176774 -76229 -241303 85137 -603211 -11872 113252 287939 -91537
8287 -343897 -24789 -153085 326694 -69436 167891 -62892 -91230 -277650 77017 -153437 -61122
8275 171772 14237 51961 32814 -124542 485350 -411869 -78831 92057 149739 -98446 -349861
8264 -349861 10317 69738 -90173 373203 17985 188133 -293561 -110738 -178581 -67206 -170313
8253 -170313 -257927 -290029 -10159 -328298 -197863 188234 11572 17913 -56764 58780 125720
8242 125720 -55327 56770 7551 -150339 -88523 -81818 97392 23639 5316 -371759 144684 67041
8229 -166671 -16166 -26100 134276 -125720 -265849 -92267 -9466 -207841 -131958 -109123 477241
8217 49021 89755 1147 86597 -195622 -33091 -61559 256514 -236831 -34663 -105839 -280749
8206 -280749 33887 95136 181082 -949 -262103 62549 -123626 88012 -138796 227935 228095 -142930
8193 -208017 222576 -327026 -542873 -123395 -258897 -141153 25521 55419 -258091 -73914
8182 -53511 -189152 12170 -114832 76728 97939 118061 -216055 -101639 33332 -32619 -22940
8171 -22940 -149421 -237129 -63903 329944 38372 -152995 36247 -53891 -63294 35298 -8645 -281491
8159 -281491 116131 206918 -114951 -444618 -111005 -92503 -382009 118887 143967 -56786
8148 -226534 -65941 -53650 41780 148692 -54721 -64402 -374793 427224 -186448 -77028 56299
8136 320182 -76679 -138304 -152322 -34612 91343 -65233 78807 -49000 -401059 257405 -117330
8124 -94309 -186578 -85185 -150343 -311204 -304093 -179171 28151 -326209 123026 -31560 -128581
8113 -128581 -466877 -90609 -118755 -117777 4337 47519 152698 23402 -23048 -622912 26799 -177579
8100 -12147 -166751 -55080 -58977 168586 205322 112314 -43373 6385 81757 105510 -149997 -110334
8088 -110334 -317297 343925 321355 -66459 -129160 158378 59404 -51964 -110131 -126132 -2116
8076 -135169 -205224 33198 364397 -53495 -48884 6406 124982 -48122 -122899 -56317 129343
8064 -116645 -244062 -32566 -426362 37791 -41581 -111232 -72096 108011 -155517 232029 182516
8053 182516 -399933 -269666 21874 -246364 -167868 -23898 -187190 -252886 52285 -95932 -209360
8042 -209360 -122210 -68890 -407059 -209613 -156473 -210965 -256560 -70198 -44675 118481 79652
8031 79652 -146565 21687 24117 127704 36008 127941 106272 51805 -53994 151318 -137691
8019 -143480 279485 -66072 -203331 -97668 -350339 -29281 -74899 -8171 -86053 5154 174871
8008 174871 -115005 -142390 -215606 -88260 103232 -13237 75340 239721 -33212 -388372 -204271
7997 -204271 -195454 -267418 -1590 -98309 223676 14486 -16490 360567 -84017 159635 622162
7986 622162 229443 101141 142752 -138441 -31998 53673 203127 182869 -252468 -230907 -41025
7974 -72806 185963 -246626 -169925 -100600 276021 142700 105794 -36294 -50779 175255 -329505
7962 -166764 117830 -32692 -54270 56405 -209070 -148874 307291 256506 199264 29745 -124188
7950 402530 26664 241406 -408997 -244306 -254052 18497 1562 -138617 -117844 -110532 265297
7938 -116966 38181 -171232 -10471 130217 1466 -104239 -113257 57364 119833 -95328 185811
7926 12421 46837 -40349 35346 -293812 -47462 -208097 299080 246875 379637 177892 -110565
7914 -36868 -215620 -337477 151995 35101 -58837 275028 -308409 60872 41041 104045 -189939
7902 99771 -30324 -52637 -304043 -380232 -137829 79603 -363297 28397 -150922 118687 -57718
7890 -360697 -77888 -115143 -229701 -97233 8264 27655 -86331 21581 -161898 -59751 -114630
7879 -114630 -19744 -133104 -404221 -5139 -195098 15139 -298090 -114 57747 52718 5570 270549
7867 270549 146444 -112754 -309829 47869 273697 153436 -97967 -52901 -29440 30687 -21608
7855 -290853 39916 -60922 -63421 -261369 -164945 65598 396011 439 -237000 -153346 -287602
7844 -287602 197280 -544982 -49707 259306 -130719 -147071 140763 -199490 215143 -25600
7833 19668 69738 -132981 -159245 119222 -296353 -83159 -339325 165867 59122 -54893 -236418
7822 -236418 146670 -260889 93528 -280604 266249 -344088 -40060 -15195 -226222 174226
7811 -44425 -3534 -192940 -212745 377 -38650 -9725 -338987 28536 -9456 256897 30094 170216
7799 170216 53940 1556 -119113 -40251 -46171 256277 109989 -4148 -30821 -292945 -231577
7788 -231577 -185393 -34719 117025 -66617 -245324 -12181 2672 -209675 254209 14437 75353
7777 75353 -218693 -171463 -31974 170547 -237126 -59627 -227628 200474 -86794 88032 -11927
7765 45284 -294582 -52915 -406096 -141723 -160062 -78666 308291 309094 -25431 85562 39607
7753 -124957 314223 -203190 17146 281074 360803 36068 -123501 -174107 243675 -113281
7742 179398 5927 -13286 -7801 -175113 -197854 166523 45367 -2902 348672 58575 107602 -6870
7729 -130694 -11502 -34886 -12968 168239 43741 -257631 151909 69367 261691 -209320 143847
7717 204349 -121540 -466363 -115713 -37427 64759 3867 31117 -148139 -49601 -314997 44694
7705 -189452 -92768 138657 198585 -67643 -32521 -234281 79138 -116715 -21407 164103 -167882
7693 -199082 4243 98594 -369166 -192940 -115910 -7986 -109867 47983 127728 -153520 100902
7681 161142 239817 -70377 201222 72583 -115557 283335 -126939 -115572 -132579 234481 44248
7669 14591 149109 -64642 -212495 -188015 -61307 27167 -103460 -13176 232081 61726 -36108
7657 -84286 -122237 -156332 -140990 -55933 -225359 129045 58400 -93634 24559 -181692 276531
7645 -45645 -139968 25376 55556 356379 -295176 -434429 -95387 100454 -112871 -208740 -238026
7634 -238026 -85934 -140015 168065 191502 -278434 -175349 111677 -124076 -131622 -187918 -15107
7622 167877 52765 -284335 -179888 -273375 194513 -111278 -121649 -506187 76329 57433 100341
7611 100341 -113051 158250 187070 64747 320724 84591 -142129 -182921 129696 -48228 -71370
7600 -71370 -146008 -189952 -312393 20956 -10178 4632 291351 -180870 73928 131853 237454
7589 237454 -208380 209969 -186714 -443581 -325160 -402442 -57923 -212754 -72957 -83073
7579 -83073 505341 -112324 -108548 -87611 -99526 -140946 183743 -295373 -161413 -69095 -83246
7568 -83246 -62652 108695 -116381 73881 150121 -63504 91039 -1227 -125429 67393 52528
7557 52528 285983 -84960 86860 -23142 -158020 -157964 -147687 111828 -153013 -51671 313240
7545 -241005 -409073 -234090 -40812 48174 117578 -312506 16292 -109579 -114220 -88594 -77443
7534 -77443 -155684 -319545 281011 -109093 -150327 50799 -116221 8720 102293 36878 275456
7523 275456 -246474 -132164 -72880 243323 51379 -20138 -112441 -564502 -97154 151823 -214801
7511 -23239 -709 87445 -414694 368521 -62341 -386184 -29432 72459 71157 203732 306274
7500 306274 50738 108054 -218977 232510 46279 -64569 193976 206269 -70274 -215534 -401603
7489 -401603 -408762 -40711 -37647 217373 169269 -130362 -230976 33133 -141646 45798 12058
7477 -46909 13295 -305200 -231554 -176466 -435999 179777 244032 119348 -87260 98538 -3217
7465 -49235 -299593 -33142 -30612 70888 -261610 192417 -179186 88259 -152086 -233806 -130274
7454 -130274 -331260 -150335 -145901 -44513 -479050 -315126 -119702 94032 64056 117017 -7923
7442 -104191 153825 192538 120444 184977 -24402 -185856 67153 -212443 118659 120642 -148719
7430 -173193 -42930 -122951 96283 -265388 48852 3846 -52433 -92933 -62896 160109 158247 49664
7417 173567 90242 -98912 139422 -92581 -30749 -146279 173777 90780 32382 211796 -83168
7405 64942 -255164 38078 132090 264 62899 84005 207137 66698 18285 101435 133469 -103576
7392 -289005 -372546 -291496 -94165 144941 334833 372995 -103215 -99160 -411247 77415 -42530
7380 152955 -25748 90429 -13261 108894 86936 -121415 177159 138485 85494 56041 -64734
7368 55512 -109306 190474 74383 -315343 148630 -107826 -174915 171407 -294834 120722
7357 121054 -36191 -283364 55249 39815 -289547 -61663 152908 -307968 -149332 202175
7346 -98436 67322 213448 -303053 -167643 -165716 -148286 -94356 142663 105576 -109722 211094
7334 -90406 130403 64928 216897 -110715 -77578 -209305 -26088 51376 113683 46731 -144362
7322 -434164 -153479 -128903 -219375 31942 -154062 -209040 -200470 -235063 -152060 -164197 101645
7310 76537 -63505 -6138 8480 273740 64535 -377808 -251173 -207022 99198 67501 -245605
7298 -125286 -125975 -12973 37637 -23570 -63511 59807 109113 465231 -80320 -239634 27999 -151991
7285 -281384 134466 19640 -89104 -296038 -143973 32158 29780 136413 199070 -49332 96639
7273 328329 -429198 43775 66859 -60057 244732 166330 43472 -50446 59065 227868 -6217
7261 -124575 64614 -306356 -207651 -24974 77026 -24736 121036 -4778 187997 -16088 28485
7249 130005 -225105 179247 48939 -40683 -200979 32626 162902 -301612 -151268 -81513
7239 -81513 131560 -29530 -30143 -359041 167217 315135 94731 -262065 237677 56049 -179506
7227 -42647 152449 -37228 229807 -255688 6807 342582 -168361 -56878 203891 32533 361213
7216 361213 159166 78305 -248108 -273529 203372 15079 -83589 191372 138918 201358 55737
7204 70249 -226108 -63299 -148554 -93184 -25795 -66758 -483729 221109 -186452 -28211 -38703
7193 -38703 -65065 -4932 -244878 -42916 -237608 -43571 -222081 240236 -70755 -215639 107144
7181 -227892 -123511 123961 -6072 -285104 -15414 -57391 199620 -168422 115945 316232
7171 316232 -131644 -51486 -98442 19122 -63379 -54824 -14648 -66551 9675 985 135243 484432
7159 484432 -42560 -358459 44658 -109749 137173 -225112 246625 22994 17573 -214824 351977
7147 -138814 -180750 42226 -168173 -24421 -267432 -1674 -177211 -384447 241932 -194558 -90194
7135 -22747 7933 198752 98385 74780 -187046 274423 -139243 -298557 -18586 -159533 -86901
7124 -86901 208722 -117245 -198625 -193599 120706 -181344 -196943 -11111 234104 117804 -200472
7112 -139094 11346 222788 108899 -149575 29489 292761 -14271 -10826 56225 196437 141675
7101 141675 -242031 269267 293350 -215204 50583 -88764 -162552 -22278 -52864 15753 57027
7090 57027 -38218 145729 209313 342489 -220749 180659 -269325 -104541 128825 -243084
7079 164458 92335 -89777 31310 -115971 28699 -179677 254740 37356 83098 149925 75818
7068 75818 36185 -37920 263887 159005 245674 530359 -18883 -61452 -68727 -172724 -117530
7057 -117530 4414 -13753 -143072 -171602 51602 2806 -15146 111924 405488 37302 35299 219538
7045 219538 -442200 111944 -49933 -115031 -149020 113864 36270 -33668 -286084 -139673 88334
7033 28488 -760 37062 -36263 -245384 -244351 7388 -201680 -95966 -55653 -103861 -311702 211129
7020 -325432 -82093 -49725 -162155 -55580 34279 -119919 65723 -78230 12052 76221 -186448
7008 2926 -132890 84469 272730 -70863 -163331 239523 -122297 -191461 -78171 68114 -93278
6996 -229157 -162346 -63585 -93501 -279746 -260665 93652 30226 -471256 120044 -40002 -234167
6985 -234167 -124355 260524 177897 -259297 -217474 -239352 -84852 81184 -98831 144658 -182467
6973 2689 82907 268381 -174440 -268636 -461323 -70465 91094 -156678 -62476 -51442 15138
6961 -196516 -99049 197404 -16119 119062 120980 221487 -330480 107794 -5026 -28162 -30872
6950 -30872 17145 19527 -379610 -62524 -273788 -154110 117759 55930 -71923 153442 264087
6939 264087 13799 -92175 -440201 -205082 226240 -82533 47386 111447 -27035 177688 -67595
6927 201650 -176923 -153118 72738 132976 22051 109506 -129018 238097 167111 143595 -156302
6915 -214944 75748 145414 -69273 175362 -169471 86829 175407 -175940 -4409 161653 99270
6904 99270 208200 -20679 168769 38906 -461392 -3390 -163621 -96162 30577 -103881 52552
6892 74254 -61714 63020 61789 -44525 28035 499181 -270216 57260 -112375 37865 238346
6881 238346 -18670 156434 158917 149803 -53583 67112 391131 31157 19921 -110307 159832
6869 -113842 -61439 -129656 59015 68544 -193042 664 237214 289072 -108240 116159 -74197
6857 164749 29831 -422454 24503 92275 -65013 -24493 -65117 -194376 -88593 -21696 27253
6845 -153344 -67382 16050 229813 135547 454891 -103458 -51063 -110714 140747 166081 -139597
6833 28679 203206 134845 -99396 -84095 58642 -238674 -156855 -63039 -45328 -130537 32711
6821 17529 110467 254262 -180488 -157265 -2697 -51189 -168543 -309856 -233332 119188 170669
6810 170669 156318 177882 -254806 192744 -13840 54376 -193187 40717 -68384 -352406 234974
6798 123344 -123421 -66266 -11262 -64574 57537 -31334 -59712 100671 -24357 92458 -135312
6786 5448 245666 -257067 332152 72730 144221 -203687 -558 -89703 -16941 -137865 12441
6774 -178667 42566 -140691 -50243 -182074 304538 -134205 90189 -152028 -227744 60935 8636
6762 -157536 262007 116478 -318092 178614 -134144 198671 -278938 -152273 10002 75096
6752 75096 -210127 101021 45814 117188 21104 -403877 -15077 70212 -379371 -99737 -126943
6741 -126943 -392064 102778 141275 -76647 -36261 276966 154877 -26461 148360 -278902
6730 37287 -345824 111430 -121083 -6628 -388945 -7328 76614 -4234 55832 -384268 55023
6718 -84748 242883 -64785 88546 50185 -104405 64575 -3758 -129920 58002 358261 206753
6707 206753 -431206 -67677 -37414 -71261 -74678 120201 88427 -148892 -212314 -218503 184268
6695 1407 -205971 -290474 78670 -95449 -86858 -292993 58122 -21792 -322529 -127503 -68362
6684 -68362 153067 -115347 178625 39978 -38664 340143 -50373 52343 20321 -90844 141393
6672 -89404 127850 64263 87368 147048 -105635 -294522 -116030 93156 287640 141596 54528
6660 -33020 -100361 50206 72183 -305713 -1509 58885 209863 102727 150259 73755 422471
6649 422471 -35699 1898 266953 158292 -77671 -304896 76376 108646 -5926 37747 -13323
6637 -58932 44261 263484 85141 -28945 -17291 125577 413567 166590 8475 -21414 -85339
6626 -85339 -31694 332750 -2812 7515 -53819 123851 -162796 -392221 -37484 -221569 -178127
6615 -178127 47096 158310 185396 138287 37791 -266419 146757 -84480 -254212 231465 -167025
6603 -21627 141547 -146352 213901 133546 -121664 -273445 1486 -4966 124347 -328513 -107846
6591 -147753 -58938 8700 67416 -148665 -187857 -20207 -53084 236049 -151475 -65007 -210211
6580 -210211 186117 -174212 -98063 29570 -138725 -165932 -84054 -126986 22500 -216680 -114498
6569 -114498 -21053 -788 314697 -229684 -84812 -38279 -64259 -89414 -70581 -235798 -124030
6558 -124030 34754 137578 -298802 -28573 64369 205269 -106557 -68166 107527 -170592
6547 202948 213175 -44354 31639 -68428 172957 221867 -122537 151771 -59463 122110 126864
6536 126864 76352 -102595 -113730 175920 618 210625 -684 -201663 -234363 -137510 279226
6524 116573 -87381 -30134 -69450 -17043 38054 15599 -122463 93663 -28273 -104719 83162
6512 -62934 135465 58818 4929 -107229 -123112 39771 -120741 -218905 88793 14330 -257742
6500 228681 29381 -91733 454030 39042 -79016 -87901 -93524 89427 164837 30882 -323438 -207487
6488 -207487 -27058 -48300 -163799 -60727 53107 -29652 38872 -222389 130681 98302 -249899
6476 293003 227926 -349120 327341 304929 -229492 277837 10423 24186 -237258 -83232 -64154
6465 -64154 88526 163257 138919 -7627 239540 157784 -113889 -105668 -56869 432019 -12941 1826
6452 60609 -196361 -91461 68331 -170426 30845 -263418 -238997 -80128 -92185 -234966 -60445
6440 -1548 -252946 -142635 67023 222241 94892 -334153 34120 -18063 31509 108114 -38524
6428 -353572 285949 151226 -124281 60861 -266438 241054 199802 62307 -63869 -255562
6418 -255562 133563 115446 -213514 239475 40963 112476 209760 95153 -271560 -160728 331758
6406 118055 79409 -213942 330842 -50197 -157970 -144859 -121416 83851 -59954 337566 9873
6394 3307 -158761 197781 215876 -100461 267908 104774 -78714 58578 -207631 -37154 75415
6382 -10739 -213161 -97791 84823 272768 55420 -86639 38543 -138686 -242732 -146861 -143979
6371 -143979 -198590 289312 -155412 -104832 -313427 47085 20529 80098 35191 -505823 -212833
6359 -28671 230571 -289718 282304 30764 -100862 72755 -49241 342759 77770 -28234 194382
6347 345693 218112 -93406 -7855 98347 -8018 -180972 -126794 -191658 -116550 -81282 76865 -322236
6334 79573 -125788 -67263 205934 -29538 -314454 -71671 256365 231444 -72972 143381 102717
6323 102717 -124903 27164 122519 60470 -75832 59180 202128 -55163 281564 200172 37576
6311 -465787 328432 -176428 32081 53218 -41353 244007 -388943 -287465 31688 -49409 -177841
6300 -177841 -277221 -187101 77422 191834 111782 -82430 -144305 -126727 54865 -36543 -155968
6289 -155968 -41110 -94504 -178649 138331 -64725 -85297 49674 319873 -165571 117882 -156085
6277 -36080 -258537 95461 -7097 78210 262124 -25432 -160130 -145701 22591 -108796 -382511
6266 -382511 139143 112333 332103 170038 -968 -48400 -121410 -4724 28494 -135520 95035
6254 -58356 115447 -411768 217987 -158322 -37765 -499321 -84291 -26698 -186551 51926 105590
6243 105590 63130 41866 2936 -176295 54758 136010 4810 -104345 236245 111964 128163
6232 128163 18198 102850 329331 -196653 399046 -143539 -14485 48324 129775 -52277 362192
6220 -66932 221175 -164320 -312650 -69202 -212390 -381598 41057 -170134 -41356 -204146
6210 -204146 192302 127760 -141454 -19925 -436601 -433434 19397 -50211 -251081 -242735 -61392
6198 -218575 -17854 -294249 103784 193681 539094 70437 -190271 -234460 -194039 96079 -275571
6186 9905 368737 -87357 -230036 201296 -39449 200938 21634 -96245 73328 43800 78452
6175 78452 225835 -74874 -20674 -173768 -338616 13330 -246933 41710 5879 363713 168027
6163 129751 190569 137921 70605 -362160 -190893 329077 -231685 -84090 124102 -255181
6152 -133107 -106017 279362 -275573 -13985 -60619 -228884 -53585 -311019 183203 191612 48620
6140 25870 85223 243867 176178 -73159 -96810 132113 -142717 20551 15457 -32860 -25604 258012
6127 279316 -10207 281841 92619 340797 -217510 12909 -5482 -89613 -327111 79423 -44399
6115 -162233 -153522 780 123395 195149 139420 -185238 -124262 -406159 280229 -42474 -108722
6104 -108722 213923 -46028 164852 19528 31977 22905 45408 74466 -101929 -66583 79386
6092 108463 67335 -224312 -49699 362652 -246101 -138392 167272 -155799 -39670 3737 -160435
6080 3496 -137178 157737 -5264 59220 65730 14604 -157760 -33534 -10558 130051 -81556 -261322
6068 -261322 -208969 115105 -86574 137963 401585 9464 -109012 268002 -301925 12424 16908
6057 16908 -17894 228404 -264562 -180416 -113839 -72930 -51804 97595 209433 -137533 36747
6045 137785 177769 77750 13248 -333748 472475 156437 52385 65744 4052 -40066 69206
6033 29418 -217573 286247 -165788 -204661 182105 -237355 -321833 -217720 111909 -134308
6022 162390 -41170 -41335 277860 -166637 -146960 149483 52999 109918 -49155 -24868 -21089 54571
6009 5790 203942 50690 -123545 -209668 -270229 -123405 113388 -149576 -176670 -219502 515326
5997 -11103 100018 190496 67768 69090 -292497 -241670 29861 -355552 293286 94345 215289
5986 215289 16837 78239 -156351 -363113 8667 19991 -91003 -31702 -365706 25284 74551
5975 74551 272044 -3589 -223955 245618 -145345 139165 -133571 79047 -4991 119571 -218995
5963 -135259 -26307 173775 61858 227106 151639 54778 -116685 -50380 -120083 -175825 8935
5951 -271509 142831 -183218 -258041 -27528 -85484 380709 39946 -146832 168138 -182759
5940 51406 -99424 85198 -272151 -202355 19836 120268 -141592 209196 217141 82600 -46953
5928 147019 -141421 60345 -182847 95032 443800 38651 57420 144860 -123074 129386 -189857
5916 141010 -132615 -16580 -67709 -262764 -101588 16596 -176914 165799 184021 -90614 172251
5904 -201303 -32035 -27493 46368 -161312 23287 164778 384620 92665 109318 9737 -22182
5892 -31613 -132133 -86834 -52820 16629 -247987 190976 -325441 16640 77605 -40160 106116
5880 93593 312684 -150898 -105599 108116 49098 -165156 116170 -154065 81284 -136196
5869 -245 -6680 -108250 -128925 56284 -91997 -8707 -182513 -76745 218605 63273 7786 248526
5857 248526 -191698 -45995 -85091 155515 -130755 -10714 -324875 403605 199161 94193
5846 137281 -86912 -250955 196042 -71914 51990 -6371 -71937 -172577 -74848 -36107 59459
5834 238670 -23498 60696 -80360 42927 -2470 -281647 261368 -93038 10130 -85085 139744
5822 -147880 195276 268770 -253103 -23594 -154110 -10470 -303027 184503 56980 -90196 21686
5810 -171174 -81920 98790 130935 46582 165773 -52359 -84573 -11065 -256876 120744 42779
5798 127885 15490 301148 -127644 -19140 454896 -75970 -114319 -264016 -341 75581 -230128
5786 59347 72983 204732 99142 -215855 -99618 143159 -129607 177379 -125223 -105998 -94410
5775 -94410 246043 -21318 -25624 -219141 -140660 -122034 101205 -63462 -161309 141398 38992
5763 -185872 -18965 9590 66549 211672 176102 -76744 -142927 -188680 -345781 -214666 41492
5751 -8921 -96968 -25006 -160525 192376 58527 -8400 224945 255859 -67261 -271997 -18822
5739 -484004 -229087 -13939 -152497 131619 31346 94854 -31545 85223 -147300 82624 -115624
5727 -247639 -315142 206967 131130 -61909 134794 103204 303548 342567 172592 78004 -106029
5715 -86637 202713 89667 -70037 47190 27017 -16385 103605 -79434 63711 -150678 -133749
5704 -133749 -179002 -20008 268940 -332062 -159311 251914 233266 -264195 -26668 135949
5693 31454 21660 353776 -10957 309205 -195432 -36216 -5539 -192791 17849 -104219 186953
5681 38332 188940 -25910 13923 169357 -275546 211439 -145124 -193722 -151016 -186374 244048
5669 254707 154557 -297418 -89183 146046 -174369 79919 210534 -78914 51365 110250 177686
5658 177686 195609 -12036 44718 -23848 234403 -187817 305288 182820 110400 -326019 -172948
5647 -172948 177415 -192152 110418 15313 35697 72750 232084 64087 92381 88045 -87848
5635 214364 284487 -111553 32685 120681 -217677 -55310 34551 254538 -145227 3878 138999
5624 138999 31458 -63533 170559 -275347 83840 126649 -120617 -96120 264059 -377428 -287241
5613 -287241 103314 -82620 154977 -30092 -197749 89655 -118236 64934 -143411 33887 25922
5602 25922 -169697 170806 311697 112494 -44605 129225 -106096 -255439 202155 105672
5592 105672 -542903 -139962 143865 183047 31771 -183925 186086 -242435 -208222 -37573
5581 261695 123517 -182488 60340 -69575 -271382 -90631 -124756 21159 181500 -199687 36940
5569 147001 -238107 243704 135812 165804 443030 271370 18537 -174407 -49659 -183258
5559 -183258 -86387 -149394 -12737 -2356 221971 -275935 -58785 145834 71979 -38921 -21591
5548 -21591 55446 -36447 -202824 263647 -264132 -266792 375326 -243809 65524 9435 -68755
5536 -359217 -240701 254666 -69182 -68259 116179 -161791 86369 175834 85774 26495 -18533
5524 151852 -173598 105242 -15325 206574 229519 -280477 5236 -104857 64154 6672 -97262
5512 -1042 -206712 17469 -76974 -36264 94977 133932 111268 -429135 3941 105919 81019 -42386
5499 -49277 -21019 167534 137936 19713 57479 125856 268944 -272650 -41123 168291 64421
5487 145530 95499 -241838 1716 -245654 241714 260771 218480 -289039 34571 -178443 124422
5475 -188061 -81037 165939 255780 197792 124221 -142930 124438 102232 406827 -16943 -167689
5464 -167689 -171543 -138548 1955 -154253 -278782 -264143 229995 -9549 -190152 263405 -133351
5452 57268 183158 -249870 -101984 207191 -121993 -58212 231163 -251245 363019 61891
5441 273844 72068 92299 -248728 27688 145428 -20433 -444317 -21587 -250638 245387 303625
5430 303625 77010 150731 -149337 22709 105427 -49428 -23575 80538 -174421 -85672 -17126
5418 -43990 -293159 -270130 -334065 -31644 124836 59943 -134038 227248 -91547 18365 -142334
5406 218309 -63068 123655 -226424 117674 -45111 169661 -117819 174059 -36717 -391781
5396 -391781 85617 208922 322436 58511 24177 256639 -21216 -132371 -192262 -67716 -225228
5385 -225228 -445371 42599 31256 -183727 -256358 -207984 79685 197825 -73433 172419 162830
5374 162830 -114259 -10866 304095 -48509 24926 -136413 358911 -24531 135909 -131119
5363 -87525 -75231 -250587 19752 77409 -306903 64757 -93946 122020 -11645 121418 56122
5351 18667 342537 -2083 343384 -75199 -159233 186623 182231 211978 78046 144076 245150
5340 245150 -125340 -247912 -290216 -69784 -151410 157687 210471 16748 60077 3125 -143298
5328 40856 179274 38586 -105808 -80702 40026 75875 5957 324232 54596 289868 -140288
5316 -13144 113037 -403011 -193602 23844 136507 62325 40622 -155717 -233010 -60556 61079
5304 -92327 214873 -19460 12954 388742 170482 219054 -38760 -106218 68537 -208854 153308
5292 162239 19842 -38003 170117 -57906 97263 111380 171509 54028 -157080 4409 231723
5281 231723 -308646 -50672 -231745 -50368 46979 228285 100748 -15951 9517 -23123 261668
5269 95880 -143547 -111601 -178985 -39551 -28210 77322 50695 -185962 -90663 70324 159814
5258 159814 185494 63460 -148271 -136695 268858 -264608 2703 348769 -154865 43678 150394
5247 150394 -372038 81295 -202082 131337 178674 414501 14822 64229 -165347 -113512 128567
5235 83967 185427 -128960 -318497 -160018 -159745 -327897 -214791 18651 -165972 19401 90706
5224 90706 -64291 -154498 42906 200685 -108190 -89328 -114158 -185141 -224001 -56473 71108
5212 252992 -375428 -14663 -61028 191721 -229297 109732 -144114 9177 11193 -224343 -280106
5201 -280106 77116 -132777 259012 70939 71862 13653 282464 -294847 7415 6009 -22763 -166823
5189 -166823 48209 -24041 -199748 -278421 231729 16674 -21765 66458 77903 118293 -216778
5177 -197842 -105157 124897 143283 144552 72522 93381 -108740 -109811 248771 -125899 -97015
5166 -97015 -351562 -25613 20542 326239 -28582 -212894 -108075 -72945 184707 431021 67025
5154 -11529 -115773 142194 384283 266480 113108 165977 162932 6067 -116293 -153779 49670
5142 -332246 -125055 -26568 15464 53931 -129979 84416 -319960 -27924 174270 -81025 -165048
5131 -165048 -207302 165259 155102 -96506 129686 -27407 -266325 157257 191111 -107424 -64789
5120 -64789 138296 -156395 -59245 388702 12480 57063 112804 366296 25224 -212066 94010
5108 189424 -54917 114867 -177017 -162131 -31503 27559 248451 -112606 45343 -133104 -147067
5097 -147067 -26237 13116 -160003 283995 -192179 -118904 -175868 218468 91306 -278504 -121620
5085 -56375 -44994 180344 125713 49305 -135592 195521 54002 25169 209849 -37861 82081
5073 -189370 57523 -16796 -281475 -127960 -100813 124284 -18112 30634 138244 274981 -332947
5061 -64101 134332 -91913 -7511 -22594 -139974 153143 -46041 -132603 164332 -219166 35384
5049 342215 97347 -145124 132018 26657 263926 -260532 234119 138960 219000 -142884
5038 -67366 -110874 -66521 -147401 -31806 -78805 -195172 165970 123606 47010 187110 340678
5027 340678 214982 107131 203901 -392093 215639 -69516 357069 -170417 211248 299509
5017 299509 214470 -72073 191280 209769 -19614 -113404 -84115 -111151 -113144 -112263 300988 212209
5005 212209 28564 -298736 -166661 82582 -54000 129111 72892 124837 184640 39057 -222463
4993 -68304 272560 -154415 -19920 394686 -186172 -101739 -59052 -172522 -239903 95197 -39734
4981 -249858 -484242 -132092 -98601 -75618 -20581 118372 214101 -95965 71730 29133 58260
4970 58260 13127 452757 -27567 382648 -39724 -135896 -208418 91862 400467 128413 -137417
4958 -346194 -99345 100898 23444 24563 -17463 -68090 178608 42187 27990 49943 -164762
4946 -194668 127879 124942 -155635 -413607 -197668 17337 47111 -206380 11695 -235134 -317970
4935 -317970 96929 -256069 3506 -385806 423645 -210146 44382 81520 232028 41264 -139738
4923 -106737 -92886 33078 -75162 21725 -65104 -220474 157356 -203912 75544 -13952 171044
4911 -209216 -269265 277427 77626 -94167 67903 131329 -65986 -147630 -23676 301721 84460
4899 206803 -21116 78811 -352620 214952 -161357 41514 9817 -345790 -235544 36839 60427
4888 60427 69241 124425 -42290 -136752 66180 -46195 139804 155093 -62561 186066 -202637
4876 -53592 17217 36373 -43398 -64646 -137039 102828 116133 225124 -145145 -209737 273639
4864 50434 187053 348673 41565 37525 10568 -275839 405393 -309366 -348238 183073 167973
4853 167973 7824 -298093 -366669 84375 197991 117813 -257399 39646 205815 202336 26807
4841 167008 -66155 -42442 -406396 -98867 345771 113255 -220327 -51806 14363 255439 -13464
4829 -127477 -41717 -138222 -83038 -177152 -91653 49772 -73912 -255524 259116 -2971 97702
4817 -5139 207884 224747 149745 -226549 -234534 57068 22288 -365678 -164750 -305824 27969
4805 11038 148721 -19192 8469 485817 -105181 -4582 -86986 19241 164139 -160695 94840
4793 169378 461875 -90078 21468 183971 93218 236141 -111711 -206796 -88048 135106 249669
4782 249669 251766 245201 -170585 -301579 -274888 -310513 83031 38220 -62293 63043 -64376 -75973
4770 -75973 125629 -122117 253679 -314575 208071 -52722 -194544 212600 168593 60227
4759 63567 145502 -267403 62902 127157 100852 -172964 -7509 -282516 -214408 258416 -159125
4747 5497 400737 284502 83492 38230 328844 45628 107928 -86926 228465 47526 211270
4736 211270 93551 148869 294875 -348238 -135789 -373616 -541411 93510 161567 -263360
4725 348439 -241405 53071 -120573 -158021 204694 437984 -97431 -27622 8455 -175258 57736
4713 -123638 -44721 116595 157305 -123536 71320 -12015 -418469 -133964 220941 94255 38381
4701 174929 104484 -155958 64997 -17947 -110692 209336 97224 -10341 204293 -106224 163275
4689 129612 -53672 -666 -109101 73365 138670 85814 -139720 209264 -252171 -62723 -320422
4678 -320422 -122816 -70733 129464 -66042 -137725 118330 -49997 56365 123645 -176379 74142
4666 -222921 424529 6965 62598 234769 -194912 200350 22341 103801 203116 -150850 -47656
4654 86782 -189304 -205895 -144121 3059 71426 -34374 -183447 -9387 -79402 128712 -111360
4642 180670 190932 -73893 505950 44335 109905 271585 35740 33265 -29338 268641 -224120
4630 -136238 -155338 271448 -34514 130576 -31596 51673 179556 118258 -123978 -123319 -75970
4619 -75970 -187640 61359 -12747 198312 177997 -89580 105008 219226 -94774 -80861 -116378
4608 -116378 -100738 -211714 -14397 17244 -162333 8883 117104 25430 25487 -44074 36716 20145
4596 20145 24911 -556710 47420 4128 286659 20474 95175 -83130 33670 15695 -121033 99429
4583 -45780 -184941 66321 144190 -18583 119980 -106305 -72973 -200971 139218 -281141 112391
4571 250405 -62901 181893 72044 319751 96679 76121 -114103 -2128 -153862 -78700 -179281
4560 -179281 -19104 454771 17750 242113 221328 14252 -34471 -295946 29731 54780 282292
4549 282292 -75039 43306 -162033 44136 396339 91343 48239 -41347 119728 -99763 -247280
4538 -247280 -214548 -356243 -163844 63196 129827 -53231 -22381 -22481 -18108 253612 65962 36639
4526 36639 406731 302843 -121211 181172 152579 -55429 -29673 -89295 -92086 -215 64956 295329
4514 295329 75618 82009 -17654 540162 -51656 161035 95054 219389 328419 -84488 289379
4502 92406 171 56743 -17241 123584 -174543 -146007 3412 -52827 17347 -59381 363543 -36672
4489 170103 266948 108791 -339950 48591 -278635 -215008 -85462 99393 228988 -107124 -341000
$$ [...]
##END NTUPLES=NMR SPECTRUM
##END=
