
##TITLE=AC1126_Huila-pital_5898504_NCl5uFGwVk
##JCAMPDX= 6.0         $$ Bruker NMR JCAMP-DX V2.0
##DATA TYPE= NMR SPECTRUM
##DATA CLASS= NTUPLES
##ORIGIN= BRUKER
##OWNER= Administrator
$$ 1.72 TOPSPIN		Version 2.1
$$ 2012-04-03 20:50:21.281 -0500  Administrator@TOPSPIN
$$ Compression mode = diff/dup
##.OBSERVE FREQUENCY= 400.13188235
##.OBSERVE NUCLEUS= ^1H
##.ACQUISITION MODE= SIMULTANEOUS (DQD)
##.ACQUISITION SCHEME= undefined
##.AVERAGES= 64
##.DIGITISER RES= 22
##SPECTROMETER/DATA SYSTEM= spect
##.PULSE SEQUENCE= noesygpps1d.comp
##.SOLVENT NAME= COFFEE_meoh
##.SHIFT REFERENCE= INTERNAL, COFFEE_meoh, 1, 14.96858
##AUDIT TRAIL= $$ (NUMBER, WHEN, WHO, WHERE, PROCESS, VERSION, WHAT)
$$ ##TITLE= Audit trail, TOPSPIN		Version 2.1
$$ ##JCAMPDX= 5.01
$$ ##ORIGIN= Bruker BioSpin GmbH
$$ ##OWNER= Administrator
$$ $$ C:\Bruker\TOPSPIN/data/COFFEE/nmr/AC1126_Huila-pital_5898504_NCl5uFGwVk/12/pdata/1/auditp.txt
$$ ##AUDIT TRAIL=  $$ (NUMBER, WHEN, WHO, WHERE, PROCESS, VERSION, WHAT)
(   1,<2012-04-03 20:50:16.453 -0500>,<Administrator>,<TOPSPIN>,<go>,<TOPSPIN 2.1>,
      <created by zg
	started at 2012-04-03 20:38:44.796 -0500,
	POWCHK enabled, PULCHK disabled,
       configuration hash MD5:
       1A 1E CE 29 27 FD 77 03 67 4E F0 E3 C4 B2 CB 90
       data hash MD5: 64K
       EA 60 55 C7 3A 12 18 59 ED B1 89 61 EC 20 BC A6>)
(   2,<2012-04-03 20:50:19.328 -0500>,<Administrator>,<TOPSPIN>,<proc1d>,<TOPSPIN 2.1>,
      <Start of raw data processing
       efp LB = 0.3 FT_mod = 6 PKNL = 1 PHC0 = 0 PHC1 = 0 SI = 128K 
       data hash MD5: 128K
       B2 1C 8F 50 5A EC 5F 09 68 39 86 CB 1F 65 50 66>)
(   3,<2012-04-03 20:50:20.531 -0500>,<Administrator>,<TOPSPIN>,<proc1d>,<TOPSPIN 2.1>,
      <pk PHC0 = 36.90857 PHC1 = 0 
       data hash MD5: 128K
       F3 26 32 C6 78 03 12 4A 01 FE 67 E3 CB 4B 43 D2>)
(   4,<2012-04-03 20:50:20.968 -0500>,<Administrator>,<TOPSPIN>,<proc1d>,<TOPSPIN 2.1>,
      <abs ABSG = 1 
       data hash MD5: 128K
       2D FF 1B 4E 0A 67 04 F6 1B CB DA 9D 12 07 B6 F3>)
(   5,<2012-04-03 20:50:21.046 -0500>,<Administrator>,<TOPSPIN>,<proc1d>,<TOPSPIN 2.1>,
      <abs ABSG = 2 
       data hash MD5: 128K
       EC 93 AE 5D B6 D0 B4 F5 00 84 9F 81 CF 87 F9 62>)
(   6,<2012-04-03 20:50:21.093 -0500>,<Administrator>,<TOPSPIN>,<proc1d>,<TOPSPIN 2.1>,
      <abs ABSG = 3 
       data hash MD5: 128K
       C1 73 01 1A 98 FD 6D A7 E4 24 5E 37 5D 7C E4 9C>)
(   7,<2012-04-03 20:50:21.140 -0500>,<Administrator>,<TOPSPIN>,<proc1d>,<TOPSPIN 2.1>,
      <abs ABSG = 4 
       data hash MD5: 128K
       F3 5D 39 A3 88 84 55 75 54 A4 7E 7E 48 EE DF C0>)
(   8,<2012-04-03 20:50:21.203 -0500>,<Administrator>,<TOPSPIN>,<proc1d>,<TOPSPIN 2.1>,
      <abs ABSG = 5 
       data hash MD5: 128K
       E0 45 73 58 72 69 F7 9D EC 7D FC 26 CE 19 24 88>)
$$ ##END=
$$ 
$$ $$ hash MD5
$$ $$ 02 80 82 60 1F 1A 28 95 C3 81 F2 6A 58 00 38 14
##$RELAX= 
##$RELAX= 
##$RELAX= 
##$RELAX= 
##$RELAX= 
##$RELAX= 
##$RELAX= 
##$RELAX= 
$$ Bruker specific parameters
$$ [...]
##$TP07= 0
##$TPNAME0= <>
##$TPNAME1= <>
##$TPNAME2= <>
##$TPNAME3= <>
##$TPNAME4= <>
##$TPNAME5= <>
##$TPNAME6= <>
##$TPNAME7= <>
##$TPOAL= (0..7)
0.5 0.5 0.5 0.5 0.5 0.5 0.5 0.5
##$TPOFFS= (0..7)
0 0 0 0 0 0 0 0
##$TUNHIN= 0
##$TUNHOUT= 0
##$TUNXOUT= 0
##$USERA1= <user>
##$USERA2= <user>
##$USERA3= <user>
##$USERA4= <user>
##$USERA5= <user>
##$V9= 5
##$VALIST= <valist>
##$VCLIST= <CCCCCCCCCCCCCCC>
##$VD= 0
##$VDLIST= <DDDDDDDDDDDDDDD>
##$VPLIST= <PPPPPPPPPPPPPPP>
##$VTLIST= <TTTTTTTTTTTTTTT>
##$WBST= 2048
##$WBSW= 25
##$XGAIN= (0..3)
0 0 0 0
##$XL= 0
##$YL= 0
##$YMAX_a= 14268809
##$YMIN_a= -5890534
##$ZGOPTNS= <>
##$ZL1= 120
##$ZL2= 120
##$ZL3= 120
##$ZL4= 120
##$ABSF1= 14.96858
##$ABSF2= -5.58395
##$ABSG= 5
##$ABSL= 3
##$ALPHA= 0
##$AQORDER= 0
##$ASSFAC= 0
##$ASSFACI= 0
##$ASSFACX= 0
##$ASSWID= 0
##$AUNMP= <proc_prof1d_extract.lims>
##$AXLEFT= 0
##$AXNAME= <>
##$AXNUC= <1H>
##$AXRIGHT= 0
##$AXTYPE= 0
##$AXUNIT= <>
##$AZFE= 0.1
##$AZFW= 0.1
##$BCFW= 0
##$BC_mod= 0
##$BYTORDP= 0
##$COROFFS= 0
##$CY= 15
##$DATMOD= 1
##$DC= 0
##$DFILT= <>
##$DTYPP= 0
##$F1P= 0
##$F2P= 0
##$FCOR= 0.5
##$FTSIZE= 131072
##$FT_mod= 6
##$GAMMA= 0
##$GB= 0
##$INTBC= 1
##$INTSCL= 1
##$ISEN= 128
##$LB= 0.3
##$LEV0= 0
##$LPBIN= 0
##$MAXI= 10000
##$MC2= 0
##$MEAN= 0
##$ME_mod= 0
##$MI= 0
##$NCOEF= 0
##$NC_proc= -3
##$NLEV= 6
##$NOISF1= 0
##$NOISF2= 0
##$NSP= 0
##$NTH_PI= 0
##$NZP= 0
##$OFFSET= 14.96858
##$PC= 1
##$PHC0= 36.90857
##$PHC1= 0
##$PH_mod= 1
##$PKNL= yes
##$PPARMOD= 0
##$PPDIAG= 0
##$PPIPTYP= 0
##$PPMPNUM= 2147483647
##$PPRESOL= 1
##$PSCAL= 4
##$PSIGN= 0
##$PYNMP= <proc.py>
##$REVERSE= no
##$SF= 400.130004813588
##$SI= 131072
##$SIGF1= 0
##$SIGF2= 0
##$SINO= 400
##$SIOLD= 131072
##$SPECTYP= <>
##$SREGLST= <1H.CDCl3>
##$SSB= 0
##$STSI= 131072
##$STSR= 0
##$SW_p= 8223.68421052632
##$SYMM= 0
##$S_DEV= 0
##$TDeff= 65536
##$TDoff= 0
##$TI= <>
##$TILT= no
##$TM1= 0
##$TM2= 0
##$TOPLEV= 0
##$USERP1= <user>
##$USERP2= <user>
##$USERP3= <user>
##$USERP4= <user>
##$USERP5= <user>
##$WDW= 1
##$XDIM= 131072
##$YMAX_p= 389253792
##$YMIN_p= -292350720
##$CURPLOT= <Network HP LaserJet P1505>
##$CURPRIN= <$Network HP LaserJet P1505>
##$DFORMAT= <normdp>
##$LAYOUT= <+/1D_H.xwp>
##$LFORMAT= <normlp>
##$PFORMAT= <normpl>
##$SURQMSG= 1
$$ End of Bruker specific parameters
$$ ---------------------------------
##NTUPLES= NMR SPECTRUM
##VAR_NAME=  FREQUENCY,     SPECTRUM/REAL,   SPECTRUM/IMAG
##SYMBOL=    X,             R,               I
##VAR_TYPE=  INDEPENDENT,   DEPENDENT,       DEPENDENT
##VAR_FORM=  AFFN,          ASDF,            ASDF
##VAR_DIM=   131072,        131072,          131072
##UNITS=     HZ,            ARBITRARY UNITS, ARBITRARY UNITS
##FACTOR=    0.0627417313425165, 1,          1
##FIRST=     8223.62146879498, 2267,         -99652
##LAST=      0,             5474,            -100616
##MIN=       0,             -292350720,      0
##MAX=       8223.62146879498, 389253792,    0
$$ Real data points
##PAGE= N=1
##DATA TABLE= (X++(R..R)), XYDATA
$$ [...]
60596A192605K711J657J511K536L138K222N98m16n23P7J474L314M295L539J858
$$ 1192605 1195316 1196973 1198484 1201020 1204158 1206380 1206978 1206562 1206039 1206116 1207590 1210904 1215199 1218738 1220596
60581A220596Q14J000J971L261M545N350N573N832O490O798N976M697M383N306
$$ 1220596 1221410 1222410 1224381 1227642 1232187 1237537 1243110 1248942 1255432 1262230 1268206 1272903 1277286 1282592
60567A282592O418O995P357Q050R225J0919J3026J4923J5909J6086J6129J6210
$$ 1282592 1289010 1296005 1303362 1311412 1320637 1331556 1344582 1359505 1375414 1391500 1407629 1423839
60555A423839J5932J5232J4418J3394J1807J0098R292R455R304P815N310K668
$$ 1423839 1439771 1455003 1469421 1482815 1494622 1504720 1514012 1523467 1532771 1540586 1545896 1548564
60543A548564K64j689k753k951l276m729p215r971j2564j4796j5996j5328j2898
$$ 1548564 1548828 1547139 1544386 1541435 1538159 1533430 1526215 1516244 1503680 1488884 1472888 1457560 1444662
60530A444662r947p744o552n796m941m019l354k913k170p14J105K427K705K067
$$ 1444662 1434715 1426971 1420419 1414623 1409682 1405663 1402309 1399396 1397226 1396512 1397617 1400044 1402749 1404816
60516A404816J079L71L06N71K77r47k065j477J083M091N799N781M858M150M576
$$ 1404816 1405895 1406266 1406572 1407143 1407420 1406473 1404408 1402931 1404014 1408105 1413904 1419685 1424543 1428693 1433269
60501A433269O518R339J1524J1922J0911R956R968J0321R691P853O328O849R370
$$ 1433269 1439787 1449126 1460650 1472572 1483483 1493439 1503407 1513728 1523419 1531272 1537600 1544449 1553819
60488A553819J2229J4363J6419J9201K2095K4144K5851K8327L1173L3033L4279
$$ 1553819 1566048 1580411 1596830 1616031 1638126 1662270 1688121 1716448 1747621 1780654 1814933
60477A814933L6948M1350M4578M3707L9147L3400K7580K0878J2885M743k115p091
$$ 1814933 1851881 1893231 1937809 1981516 2020663 2054063 2081643 2102521 2115406 2120149 2118034 2110943
60465B110943j0104j1247j1016j0097q598o036k221K311O886J1268J5576J9893
$$ 2110943 2100839 2089592 2078576 2068479 2059881 2053845 2051624 2053935 2060821 2072089 2087665 2107558
60453B107558K4078K7741L0515L2593L4765L7604M0922M4348M8008N2171N6672
$$ 2107558 2131636 2159377 2189892 2222485 2257250 2294854 2335776 2380124 2428132 2480303 2536975
60442B536975O1386O6976P4282Q3064R2311J01785J12388J24765J38389J52440
$$ 2536975 2598361 2665337 2739619 2822683 2914994 3016779 3129167 3253932 3392321 3544761
60432C544761J66785J81463J95829K09063K21344K33848K47572K62474K77445
$$ 3544761 3711546 3893009 4088838 4297901 4519245 4753093 5000665 5263139 5540584
60423E540584K90404K98162K96760K82430K52535K06099J44381P1380o698q3253
$$ 5540584 5830988 6129150 6425910 6708340 6960875 7166974 7311355 7382735 7376037 7292784
60413G292784j52927k11773k56885k87063l03849l10739l10681l04780k93699
$$ 7292784 7139857 6928084 6671199 6384136 6080287 5769548 5458867 5154087 4860388
60404D860388k79294k63810k48062k31666k15003j99635j86410j74185j61193
$$ 4860388 4581094 4317284 4069222 3837556 3622553 3422918 3236508 3062323 2901130
60395B901130j47175j33655j22299j13334j05359r6583q6584p6889o9339o3960
$$ 2901130 2753955 2620300 2498001 2384667 2279308 2182725 2096141 2019252 1949913 1885953
60385A885953n9121n3846m8922m5382m2866m0252l7112l3715l0171k6618k3826
$$ 1885953 1826832 1772986 1724064 1678682 1635816 1595564 1558452 1524737 1494566 1467948 1444122
60374A444122k2595k2558k2365k1115j9065j6958j5267j4151j3548j3104j2426
$$ 1444122 1421527 1398969 1376604 1355489 1336424 1319466 1304199 1290048 1276500 1263396 1250970
60363A250970j1407j0202q941p708o620n614m428l112k227k151k467k470j980
$$ 1250970 1239563 1229361 1220420 1212712 1206092 1200478 1196050 1192938 1190711 1188560 1186093 1183623 1181643
60350A181643j114L44K569M872O066N761M658L592K917K839L499M447M678L713
$$ 1181643 1180529 1180873 1183442 1188314 1194380 1200141 1204799 1208391 1211308 1214147 1217646 1222093 1226771 1230484
60336A230484K331J791K533L895M960N414N645O121O809P284P352P148O530M920
$$ 1230484 1232815 1234606 1237139 1241034 1245994 1251408 1257053 1263174 1269983 1277267 1284619 1291767 1298297 1303217
60322A303217K362K18LJ485K799K615J460O06L31j58j451l130m110l453j126J627
$$ 1303217 1305579 1305797 1305800 1307285 1310084 1312699 1314159 1314765 1315096 1314938 1313487 1310357 1306247 1302794 1301668 1303295
60306A303295K918J917Nl53J809M831O299N720M780N099O539P977Q869R365R569
$$ 1303295 1306213 1308130 1308135 1307782 1309591 1314422 1320721 1326441 1331221 1336320 1342859 1350836 1359705 1369070 1378639
60291A378639R718J0586J2422J3658J2304R064P386R323J2633J3511J1293Q673
$$ 1378639 1388357 1398943 1411365 1425023 1437327 1446391 1453777 1463100 1475733 1489244 1500537 1509210
60279A509210P672P469O648N681N879P036P591O939O312P193R624J2460J4653
$$ 1509210 1516882 1524351 1530999 1536680 1542559 1549595 1557186 1564125 1570437 1577630 1587254 1599714 1614367
60266A614367J5745J5363J3174R541N673K539Jk425m501n860p381j0365j4026
$$ 1614367 1630112 1645475 1658649 1668190 1673863 1676402 1676403 1673978 1669477 1663617 1656236 1645871 1631845
60253A631845j5327j2489p601m486m549o038o958p173p493p985p820o199l148
$$ 1631845 1616518 1604029 1596428 1591942 1587393 1581355 1574397 1567224 1559731 1551746 1543926 1537727 1534579
60240A534579K54K518L009K507K075J852J526J438K191L549M737N635O598P384
$$ 1534579 1534833 1537351 1540360 1542867 1544942 1546794 1548320 1549758 1551949 1555498 1560235 1565870 1572468 1579852
60226A579852P496P435Q240R769J0865J1268J1795J2381J1792J0017R130J0534
$$ 1579852 1587348 1594783 1603023 1612792 1623657 1634925 1646720 1659101 1670893 1680910 1690040 1700574
60214A700574J2954J4565J5850J8430K1916K4059K3954K3294K3979K5943K7965
$$ 1700574 1713528 1728093 1743943 1762373 1784289 1808348 1832302 1855596 1879575 1905518 1933483
60203A933483K9659L1728L4717L8186M1177M3237M4907M7040M9773N2533N5239
$$ 1933483 1963142 1994870 2029587 2067773 2108950 2152187 2197094 2244134 2293907 2346440 2401679
60192B401679N8857O4209P0562P6252Q0506Q4092Q8225R3490R9902J07257J15137
$$ 2401679 2460536 2524745 2595307 2671559 2752065 2836157 2924382 3017872 3117774 3225031 3340168
60181C340168J23012J30608J37885J44450J49479J52494J53962J54709J54923
$$ 3340168 3463180 3593788 3731673 3876123 4025602 4178096 4332058 4486767 4641690
60172D641690J54042J51405J46549J38997J28472J15665J02222Q9323P6555O2898
$$ 4641690 4795732 4947137 5093686 5232683 5361155 5476820 5579042 5668365 5744920 5807818
60162E807818M8613L5273K3748J3282L147n634j1233j3223j2838j1258q556m386
$$ 5807818 5856431 5891704 5915452 5928734 5931881 5926247 5915014 5901791 5888953 5877695 5869139 5864753
60150E864753J229Q054J6021K5264L5995M8237O1349P4189Q6277R8204J10086
$$ 5864753 5865982 5874036 5890057 5915321 5951316 5999553 6060902 6135091 6221368 6319572 6429658
60139F429658J20289J26971J30615J33396J35910J36105J31937J23746J13240
$$ 6429658 6549947 6676918 6807533 6940929 7076839 7212944 7344881 7468627 7581867
60130G581867J01238Q7391P1335N3247L3776J4034m819k2253l8179n1970o2613
$$ 7581867 7683105 7770496 7841831 7895078 7928854 7942888 7938069 7915816 7877637 7825667 7763054
60119G763054o9987p4820p6993p5244o9341o1178n2637m3391l2047j8634m601
$$ 7763054 7693067 7618247 7541254 7466010 7396669 7335491 7282854 7239463 7207416 7188782 7184181
60108G184181R148K3053L7843N3460O8719Q1598R0514R5772R9013J00755R9730
$$ 7184181 7193329 7216382 7254225 7307685 7376404 7458002 7548516 7644288 7743301 7844056 7943786
60097G943786R5356Q9314Q3358P6958O8888O0108N3064M8682M5982M4259M3860
$$ 7943786 8039142 8128456 8211814 8288772 8357660 8417768 8470832 8519514 8565496 8609755 8653615
60086H653615M5097M8298N4686O5281P8802R2548J05500J18940J33940J50149
$$ 8653615 8698712 8747010 8801696 8866977 8945779 9038327 9143827 9262767 9396707 9546856
60076I546856J67359J86233K06875K28392K50682K74992L01775L29368L55562
$$ 9546856 9714215 9900448 10107323 10335715 10586397 10861389 11163164 11492532 11848094
60067A1848094L79233L99746M16353M29133M39088M46066M47728M41704M27782
$$ 11848094 12227327 12627073 13043426 13472559 13911647 14357713 14805441 15247145 15674927
60058A5674927M07032L79892L46285L06690K61922K12643J59983J05562M9920
$$ 15674927 16081959 16461851 16808136 17114826 17376748 17589391 17749374 17854936 17904856
60049A7904856p837o7441j25697j78912k26030k67449l01744l26112l39967l45695
$$ 17904856 17897019 17829578 17703881 17524969 17298939 17031490 16729746 16403634 16063667 15717972
60039A5717972l45395l38828l25207l05285k80714k52750k22562j91613j60632
$$ 15717972 15372577 15033749 14708542 14403257 14122543 13869793 13647231 13455618 13294986
60030A3294986j29116r6924o5785l8135j4979M136J9352K9741L4491L3951K9226
$$ 13294986 13165870 13068946 13003161 12965026 12950047 12954183 12973535 13003276 13037767 13071718 13100944
60019A3100944K1256J0595k258j6827l2973n0868p0387r0510j09698j27012j42742
$$ 13100944 13122200 13132795 13130537 13113710 13080737 13029869 12959482 12868972 12759274 12632262 12489520
60008A2489520j57658j71817j84399j94642k02570k08621k12730k13945k11067
$$ 12489520 12331862 12160045 11975646 11781004 11578434 11369813 11157083 10943138 10732071
59999A0732071k03843j93418j81377j68335j53855j37804j20947j03828q5743
$$ 10732071 10528228 10334810 10153433 9985098 9831243 9693439 9572492 9468664 9382921
59990I382921o5700m3943k1768j45K0596M0082N7944P4427Q9718J02589J10981
$$ 9382921 9317221 9273278 9251510 9251365 9271961 9312043 9369987 9444414 9534132 9636721 9747702
59979I747702J14187J13280J08949J00512Q7837P2649N6415L8155J6286p970l1209
$$ 9747702 9861889 9975169 10084118 10184630 10272467 10345116 10401531 10439686 10455972 10448002 10416793
59968A0416793n1869p1566r1732j10782j25818j35883j42104j45402j45510j42106
$$ 10416793 10364924 10293358 10201626 10090844 9965026 9829143 9687039 9541637 9396127 9254021
59958I254021j35540j26284j14511j00531q4996o8503n1388l4040j6820N88J9269
$$ 9254021 9118481 8992197 8877686 8777155 8692159 8623656 8572268 8538228 8521408 8521996 8541265
59947H541265M0018O2328Q4677J05829J25590J44238J61518J76477J88223J96317
$$ 8541265 8581283 8643611 8728288 8834117 8959707 9103945 9265463 9441940 9630163 9826480
59937I826480K00172J98597J90709J77160J59663J39350J16422R1470O5832M0079
$$ 9826480 10026652 10225249 10415958 10593118 10752781 10892131 11008553 11100023 11165855 11205934
59927A1205934J3377j4519m1650o5567q5962j03936j19058j29000j32227j29404
$$ 11205934 11219311 11204792 11163142 11097575 11011613 10907677 10788619 10659619 10527392 10397988
59917A0397988j21841j10215r5558p9813o4116m7502k8521p452J3995L4450N3342
$$ 10397988 10276147 10165932 10070374 9990561 9926445 9878943 9850422 9842970 9856965 9891415 9944757
59906I944757P0177Q4619R7004J07920J17432J25357J31840J36926J40021J40553
$$ 9944757 10014934 10099553 10196557 10304477 10421909 10547266 10679106 10816032 10956053 11096606
59896A1096606J38783J35197J29629J21960J13179J04707R7035R0034Q4223Q0515
$$ 11096606 11235389 11370586 11500215 11622175 11735354 11840061 11937096 12027130 12111353 12191868
59886A2191868P9058P9656Q3236R1356J04064J19704J37276J57785J82569K11359
$$ 12191868 12270926 12350582 12433818 12525174 12629238 12748942 12886218 13044003 13226572 13437931
59876A3437931K42641K74992L07293L38413L67568L94560M18816M38385M50438
$$ 13437931 13680572 13955564 14262857 14601270 14968838 15363398 15782214 16220599 16671037
59867A6671037M52604M43486M22248L88352L41757K83245K14470J37895N6600
$$ 16671037 17123641 17567127 17989375 18377727 18719484 19002729 19217199 19355094 19411694
59858A9411694k5840j05540j78829k43041k96609l38483l68249l87122l97727
$$ 19411694 19385854 19280314 19101485 18858444 18561835 18223352 17855103 17467981 17070254
59849A7070254m01739l98455l86836l68275l45661l20092k90511k56810k21272
$$ 17070254 16668515 16270060 15883224 15514949 15169288 14849196 14558685 14301875 14080603
59840A4080603j86183j51650j16802q1815m7669j5013J5555M2938O6287Q5560
$$ 14080603 13894420 13742770 13625968 13544153 13496484 13481471 13497026 13539964 13606251 13691811
59830A3691811J00334J08903J09577J02280Q7791O5946L5855k311m6553r3940
$$ 13691811 13792145 13901048 14010625 14112905 14200696 14266642 14302497 14300186 14253633 14159693
59820A4159693j41593j87172k29197k66821k99012l24497l42831l54792l61159
$$ 14159693 14018100 13830928 13601731 13334910 13035898 12711401 12368570 12013778 11652619
59811A1652619l61949l57431l48852l37256l22591l05063k86382k68298k50697
$$ 11652619 11290670 10933239 10584387 10247131 9924540 9619477 9333095 9064797 8814100
59802H814100k32583k14228j96758j80362j64771j51087j40980j33932j27304
$$ 8814100 8581517 8367289 8170531 7990169 7825398 7674311 7533331 7399399 7272095
59793G272095j19578j11786j05231r9508r3655q7654q1747p5427o8205o0633n3728
$$ 7272095 7152517 7040731 6935500 6835992 6742337 6654683 6572936 6497509 6429304 6368671 6314943
59782F314943m8097m4287m3059m4429m7065m9521n1532n3433n4924n5259n4247
$$ 6314943 6266846 6222559 6179500 6135071 6088006 6038485 5986953 5933520 5878596 5823337 5769090
59771E769090n2293m9727m6542m2555l7400l0940k3976j7821j2642p046j08P073
$$ 5769090 5716797 5667070 5620528 5577973 5540573 5509633 5485657 5467836 5455194 5448148 5448040 5455113
59759E455113J2919J7880K3988L2113M0887M8496N4462N9475O4388O9779P5736
$$ 5455113 5468032 5485912 5509900 5542013 5582900 5631396 5685858 5745333 5809721 5879500 5955236
59748E955236Q1538Q5983Q8345Q8721Q7482Q4910Q1521P8019P4606P0888O6817
$$ 5955236 6036774 6122757 6211102 6299823 6387305 6472215 6553736 6631755 6706361 6777249 6844066
59737F844066O3219O0931N9950O0011O1586O5456P1584P9298Q8664J00670J15699
$$ 6844066 6907285 6968216 7028166 7088177 7149763 7215219 7286803 7366101 7454765 7555435 7671134
59726G671134J32623J50144J68470J88817K11546K35758K60732K86654L13612
$$ 7671134 7803757 7953901 8122371 8311188 8522734 8758492 9019224 9305878 9619490
59717I619490L40691L66665L90768M11791M26686M30945M20409L92359L45570
$$ 9619490 9960181 10326846 10717614 11129405 11556091 11987036 12407445 12799804 13145374
59708A3145374K80948K02812J18774L7355l4659r3247j36893j66135j82835j89020
$$ 13145374 13426322 13629134 13747908 13785263 13750604 13657357 13520464 13354329 13171494 12982474
59698A2982474j86323j76533j61958j44594j25229j03967q1338n8278l5128j1395
$$ 12982474 12796151 12619618 12457660 12313066 12187837 12083870 12002532 11944254 11909126 11897731
59688A1897731J3405L9150O5276R1118J16227J40991J66871J95176K25393K55654
$$ 11897731 11911136 11950286 12015562 12106680 12222907 12363898 12530769 12725945 12951338 13206992
59678A3206992K85127L15098L47156L81334M16864M53813M92567N32250N71377
$$ 13206992 13492119 13807217 14154373 14535707 14952571 15406384 15898951 16431201 17002578
59669A7002578O10224O50874O94263P38481P80853Q20567Q58023Q92465R21704
$$ 17002578 17612802 18263676 18957939 19696420 20477273 21297840 22155863 23048328 23970032
59660B3970032R43912R58278R64004R60057R46512R25387Q99855Q73231Q48661
$$ 23970032 24913944 25872222 26836226 27796283 28742795 29668182 30568037 31441268 32289929
59651C2289929Q28767Q14975Q07560Q06320Q10414Q17491Q24045Q27127Q24922
$$ 32289929 33118696 33933671 34741231 35547551 36357965 37175456 37999501 38826628 39651550
59642C9651550Q15355P95329P62219P15307O55071N82167M98358M07776L15819
$$ 39651550 40466905 41262234 42024453 42739760 43394831 43976998 44475356 44883132 45198951
59633D5198951K26930J44300P1180J0921l4431o4452p9076p8107o2120l2780Q227
$$ 45198951 45425881 45570181 45641361 45652282 45617851 45553399 45474323 45396216 45334096 45301316 45309543
59622D5309543N9864J21099J90369K66040L46747M30937N16523O01007O81279
$$ 45309543 45369407 45490506 45680875 45946915 46293662 46724599 47241122 47842129 48523408
59613D8523408P53258Q12416Q54705Q76082Q71358Q34944P63175O54900N09961
$$ 48523408 49276666 50089082 50943787 51819869 52691227 53526171 54289346 54944246 55454207
59604E5454207L29419J18905j09770l42286n66778p74433r57085j107344j221561
$$ 55454207 55783626 55902531 55792761 55450475 54883697 54109264 53152179 52044835 50823274
59595E0823274j300859j348818j369572j368252j351138j324031j291481j258500
$$ 50823274 49522415 48173597 46804025 45435773 44084635 42760604 41469123 40210623
59587D0210623j231672j216999j216769j229169j250088j274110j294444j304066
$$ 40210623 38978951 37761952 36545183 35316014 34065926 32791816 31497372 30193306
59579C0193306j298387j276900j242294j198148j147307j091795j033524r74600
$$ 30193306 28894919 27618019 26375725 25177577 24030270 22938475 21904951 20930351
59571B0930351r16569q59754q04003p50046o99197o51556o05767n61176n19050
$$ 20930351 20013782 19154028 18350025 17599979 16900782 16249226 15643459 15082283 14563233
59562A4563233m80666m45242m11164l78404l48059l20097k93522k68582k46869
$$ 14563233 14082567 13637325 13226161 12847757 12499698 12179601 11886079 11617497 11370628
59553A1370628k28954k13782k00743j90375j82447j75501j69282j65650j65534
$$ 11370628 11141674 10927892 10727149 10536774 10354327 10178826 10009544 9843894 9678360
59544I678360j66814j66928j66027j65534j64984j62592j58209j53160j47594
$$ 9678360 9511546 9344618 9178591 9013057 8848073 8685481 8527272 8374112 8226518
59535H226518j40238j30802j20530j10280r9930q9661p9961p0226n9381m8028
$$ 8226518 8086280 7955478 7834948 7724668 7624738 7535077 7455116 7384890 7325509 7277481
59525G277481l7970k9334k0359j0516j464N852J2755K0364K7759L4037M0175M7226
$$ 7277481 7239511 7210177 7189818 7179302 7177838 7183690 7196445 7216809 7244568 7278605 7318780 7366006
59513G366006N4359O0359O5522P0454P4639P8131Q3063R1233J01385J11101J20361
$$ 7366006 7420365 7480724 7546246 7616700 7691339 7769470 7852533 7943766 8045151 8156252 8276613
59502H276613J30819J42555J54265J66373J81006J98538K16608K33258K49031
$$ 8276613 8407432 8549987 8704252 8870625 9051631 9250169 9466777 9700035 9949066
59493I949066K65247K81939K98395L14299L29372L42879L54269L63592L70863
$$ 9949066 10214313 10496252 10794647 11108946 11438318 11781197 12135466 12499058 12869921
59484A2869921L75577L76952L74041L65798L52068L34351L14564K93099K69068
$$ 12869921 13245498 13622450 13996491 14362289 14714357 15048708 15363272 15656371 15925439
59475A5925439K42276K13763J84656J55851J28779J04973Q4706O7343N3248M3881
$$ 15925439 16167715 16381478 16566134 16721985 16850764 16955737 17040443 17107786 17161034 17204915
59465A7204915L9855M0232M4079N1361O1859P4395Q7496R9713J08860J12163J07752
$$ 17204915 17244770 17285002 17329081 17380442 17442301 17516696 17604192 17703905 17812765 17924928 18032680
59454A8032680R5189P4460M5451Q504l5662q6541j42950k01589k58152l10019
$$ 18032680 18127869 18202329 18247780 18256284 18220622 18134081 17991131 17789542 17531390 17221371
59444A7221371l56397l95871m26096m46366m58343m63337m60960m51403m36829
$$ 17221371 16864974 16469103 16043007 15596641 15138298 14674961 14214001 13762598 13325769
59435A3325769m19052l97748l72706l46079l20300k95072k68482k40278k12085
$$ 13325769 12906717 12508969 12136263 11790184 11469884 11174812 10906330 10666052 10453967
59426A0453967j84961j58657j32874j07628q2526n7043l1482o673J7075M0049
$$ 10453967 10269006 10110349 9977475 9869847 9787321 9730278 9698796 9692123 9709198 9749247
59416I749247O2657Q5652J09827J34530J57331J76341J92081K05994K18155K27739
$$ 9749247 9811904 9897556 10007383 10141913 10299244 10475585 10667666 10873660 11091815 11319554
59406A1319554K34375K37092K32914K18940J95725J66517J33235R5187N1866M870
$$ 11319554 11553929 11791021 12023935 12242875 12438600 12605117 12738352 12833539 12885405 12890275
59396A2890275m3604r2230j39551j82996k20234k50857k75902k96218l11959l23065
$$ 12890275 12846671 12754441 12614890 12431894 12211660 11960803 11684901 11388683 11076724 10753659
59386A0753659l29492l31117l27944l20545l10149k98149k85244k71071k55176
$$ 10753659 10424167 10093050 9765106 9444561 9134412 8836263 8551019 8279948 8024772
59377H024772k38485k22980k09490j96606j82484j66924j50834j34646j18546
$$ 8024772 7786287 7563307 7353817 7157211 6974727 6807803 6656969 6522323 6403777
59368F403777j03537r0549p8740o6302n2990m0515l0190k1501j3258m973L374
$$ 6403777 6300240 6209691 6130951 6064649 6011659 5971144 5940954 5919453 5906195 5901222 5904596
59357E904596J1866K0357K8498L6498M5088N4159O2053O6859O8304O8092O8528
$$ 5904596 5916462 5936819 5965317 6001815 6046903 6101062 6163115 6229974 6298278 6366370 6434898
59346F434898P0872P4820P9525Q5142R2949J03742J16677J30148J43122J55015
$$ 6434898 6505770 6580590 6660115 6745257 6838206 6941948 7058625 7188773 7331895 7486910
59336G486910J65038J72918J79949J88307J99364K13422K30709K51470K75160
$$ 7486910 7651948 7824866 8004815 8193122 8392486 8605908 8836617 9088087 9363247
59327I363247L00579L26948L54261L82823M13095M45588M79963N14603N48134
$$ 9363247 9663826 9990774 10345035 10727858 11140953 11586541 12066504 12581107 13129241
59318A3129241N80891O13711O45563O73675O95809P10941P17880P14911P01347
$$ 13129241 13710132 14323843 14969406 15643081 16338890 17049831 17767711 18482622 19183969
59309A9183969O78221O47073O09254N66641N21629M75721M28986L81405L33743
$$ 19183969 19862190 20509263 21118517 21685158 22206787 22682508 23111494 23492899 23826642
59300B3826642K86631K39649J91905J42739R1429L6993k1024q1893j44095k06020
$$ 23826642 24113273 24352922 24544827 24687566 24778995 24815988 24794964 24713071 24568976 24362956
59290B4362956k66211l23483l76865m25290m67674n03893n35073n62107n84491
$$ 24362956 24096745 23773262 23396397 22971107 22503433 21999540 21464467 20902360 20317869
59281B0317869o01619o14302o23518o28367o27253o20596o10234n96296n77286
$$ 20317869 19716250 19101948 18478430 17850063 17222810 16602214 15991980 15395684 14818398
59272A4818398n53671n28610n03967m77993m48641m17210l86832l58620l31310
$$ 14818398 14264727 13736117 13232150 12754157 12305516 11888306 11501474 11142854 10811544
59263A0811544l03865k76717k50799k26674k04328j83017j61838j41052j22020
$$ 10811544 10507679 10230962 9980163 9753489 9549161 9366144 9204306 9063254 8941234
59254H941234j05279q9766p4645o0544m7826l5044k0681n503Q324J9819K9487
$$ 8941234 8835955 8746189 8671544 8611000 8563174 8528130 8507449 8501946 8510270 8530089 8559576
59243H559576L7894M5547N3500O2383P1022P7554Q1695Q4578Q6609Q7062Q5740
$$ 8559576 8597470 8643017 8696517 8758900 8829922 8907476 8989171 9073749 9160358 9247420 9333160
59232I333160Q3490Q0948P8126P5484P4065P4155P4898P5728P7186P9903Q3575
$$ 9333160 9416650 9497598 9575724 9651208 9725273 9799428 9874326 9950054 10027240 10107143 10190718
59221A0190718Q7676R2553R9166J07765J17020J24430J27756J26405J21351J13651
$$ 10190718 10278394 10370947 10470113 10577878 10694898 10819328 10947084 11073489 11194840 11308491
59211A1308491J03398R0361P4934N7680L8541J7478m362k5140m3980o1331p7527
$$ 11308491 11411889 11502250 11577184 11634864 11673405 11690883 11686521 11661381 11617401 11556070 11478543
59200A1478543r1725j02372j08312j09500j07107j02820r7486r0575q1418p0554
$$ 11478543 11386818 11284446 11176134 11066634 10959527 10856707 10759221 10668646 10587228 10516674
59190A0516674n9244m8066l6978k6470j7488j0093l153M272J1942J8911K4404
$$ 10516674 10457430 10409364 10372386 10345916 10328428 10318335 10315182 10319454 10331396 10350307 10374711
59179A0374711K8196L0890L3965L8815M5620N3810O3548P5833R1019J08290J26959
$$ 10374711 10402907 10433797 10467762 10506577 10552197 10606007 10669555 10745388 10836407 10944697 11071656
59168A1071656J47370J69928J94014K18618K43372K68190K92309L14291L32515
$$ 11071656 11219026 11388954 11582968 11801586 12044958 12313148 12605457 12919748 13252263
59159A3252263L44986L49098L42515L24321K94681K53593K00929J37839O7196
$$ 13252263 13597249 13946347 14288862 14613183 14907864 15161457 15362386 15500225 15567421
59150A5567421p820q4995j62302k36458l03224l59506m04679m39770m65728m82698
$$ 15567421 15559601 15474606 15312304 15075846 14772622 14413116 14008437 13568667 13102939 12620241
59140A2620241m90553m89634m81079m66780m48981m29557m09396l88481l66595
$$ 12620241 12129688 11640054 11158975 10692195 10243214 9813657 9404261 9015780 8649185
59131H649185l43979l21472l00128k80428k61714k42659k22719k03053j85600
$$ 8649185 8305206 7983734 7683606 7403178 7141464 6898805 6676086 6473033 6287433
59122F287433j71214j58929j47138j35157j23512j12802j02571r1598p9529o7877
$$ 6287433 6116219 5957290 5810152 5674995 5551483 5438681 5336110 5244512 5164983 5097106
59112E097106n8774n2508m7048m0256l1912k3085j4427n994J874Q687J4609K0131
$$ 5097106 5038332 4985824 4938776 4898520 4866608 4843523 4829096 4823102 4824976 4833663 4848272 4868403
59100D868403K5249K9869L4704M0581M7032N2828N7894O3373O9658P5737Q0806
$$ 4868403 4893652 4923521 4958225 4998806 5045838 5098666 5156560 5219933 5289591 5365328 5446134
59089E446134Q5313Q9947R4716R9427J04002J07844J09922J09990J08753J06651
$$ 5446134 5531447 5621394 5716110 5815537 5919539 6027383 6137305 6247295 6356048 6462699
59079F462699J03584J00006R6745R3289Q7853P9894P1011O2509N3903M4953L7346
$$ 6462699 6566283 6666289 6763034 6856323 6944176 7024070 7095081 7157590 7211493 7256446 7293792
59068G293792L2628K9884K7418K5695K6488K9876L4304L9267M5842N4473O4063
$$ 7293792 7326420 7356304 7383722 7409417 7435905 7465781 7500085 7539352 7585194 7639667 7703730
59057G703730P3717Q3846R4984J06635J17931J28768J39870J52052J65460J79209
$$ 7703730 7777447 7861293 7956277 8062912 8180843 8309611 8449481 8601533 8766993 8946202
59047H946202J91886K02666K11524K18266K22184K22934K20435K13241J98566
$$ 8946202 9138088 9340754 9552278 9770544 9992728 10215662 10436097 10649338 10847904
59038A0847904J75422J46494J15213Q1939M4993M678l5939p4022j08680j39712
$$ 10847904 11023326 11169820 11285033 11366972 11411965 11416643 11380704 11306682 11198002 11058290
59028A1058290j66695j89659k08969k24229k34852k41899k47611k52743k56070
$$ 11058290 10891595 10701936 10492967 10268738 10033886 9791987 9544376 9291633 9035563
59019I035563k56988k56800k56614k55628k52681k48227k43513k38658k32701
$$ 9035563 8778575 8521775 8265161 8009533 7756852 7508625 7265112 7026454 6793753
59010F793753k25119k16388k07349j98514j89673j80029j69168j58076j48432
$$ 6793753 6568634 6352246 6144897 5946383 5756710 5576681 5407513 5249437 5101005
59001E101005j40726j33669j25693j16379j06451r7138q9514q3488p7427o9916
$$ 5101005 4960279 4826610 4700917 4584538 4478087 4380949 4291435 4207947 4130520 4060604
58991D060604o1990n6402n4303n3968n3292n2236n2047n3085n4567n5764n6660
$$ 4060604 3998614 3942212 3887909 3833941 3780649 3728413 3676366 3623281 3568714 3512950 3456290
58980C456290n7626n8892o0027n9805n7268n3016m8676m5064m1805l8699l6040
$$ 3456290 3398664 3339772 3279745 3219940 3162672 3109656 3060980 3015916 2974111 2935412 2899372
58969B899372l3357k9413k4241j9676j6896j4822j2125r521q485q754q796q190
$$ 2899372 2866015 2836602 2812361 2792685 2775789 2760967 2748842 2739321 2730836 2722082 2713286 2705096
58957B705096p710p382o261m273k645k021j465M4K132L812M881N829O829P542
$$ 2705096 2697386 2690004 2683743 2679470 2676825 2674804 2673339 2673383 2675515 2679327 2684208 2690037 2696866 2704408
58943B704408P678P181O212N403N880Q145J0989J2299J1370R812R656J1077J2787
$$ 2704408 2712086 2719267 2725479 2730882 2736762 2744907 2755896 2768195 2779565 2789377 2799033 2810110 2822897
58930B822897J4179J5885J8105J9728J9986J9989K1363K3795K5142K4175K2302
$$ 2822897 2837076 2852961 2871066 2890794 2910780 2930769 2952132 2975927 3001069 3025244 3047546
58919C047546K2243K5390L0630L5413L7902L8426L8832M0465M3143M6218M9766
$$ 3047546 3069789 3095179 3125809 3161222 3199124 3237550 3276382 3316847 3359990 3406208 3455974
58908C455974N4006N8283O1703O4452O7444P0787P3699P5893P8029Q0592Q3343
$$ 3455974 3509980 3568263 3629966 3694418 3761862 3832649 3906348 3982241 4060270 4140862 4224205
58897D224205Q6133Q9381R3211R6715R8638R8789R8602J00271J05065J12273J20122
$$ 4224205 4310338 4399719 4492930 4589645 4688283 4787072 4885674 4985945 5091010 5203283 5323405
58886E323405J27762J35709J44165J52250J59642J67812J78119J89576K00133
$$ 5323405 5451167 5586876 5731041 5883291 6042933 6210745 6388864 6578440 6778573
58877F778573K09670K20012K32200K45558K59501K74545K91072L08444L25840
$$ 6778573 6988243 7208255 7440455 7686013 7945514 8220059 8511131 8819575 9145415
58868I145415L43061L60441L78979M00288M25126M51997M78712N05272N33738
$$ 9145415 9488476 9848917 10227896 10628184 11053310 11505307 11984019 12489291 13023029
58859A3023029N65174N98379O31927O65723O99987P34000P66462P96019Q21127
$$ 13023029 13588203 14186582 14818509 15484232 16184219 16918219 17684681 18480700 19301827
58850A9301827Q40327Q52603Q56291Q48036Q24487P84719P29055O55899N62659
$$ 19301827 20142154 20994757 21851048 22699084 23523571 24308290 25037345 25693244 26255903
58841B6255903M50367L24832J92256N6046q1195k15038l40232m52586n48870o27034
$$ 26255903 26706270 27031102 27223358 27279404 27198209 26983171 26642939 26190353 25641483 25014449
58831B5014449o87944p34777p69083p89448p95583p91342p81383p66733p46127
$$ 25014449 24326505 23591728 22822645 22033197 21237614 20446272 19664889 18898156 18152029
58822A8152029p20124o91050o59942o26488n91811n58743n28947n01507m74616
$$ 18152029 17431905 16740855 16080913 15454425 14862614 14303871 13774924 13273417 12798801
58813A2798801m47624m21433l97626l76886l57816l38130l17429k97318k78330
$$ 12798801 12351177 11929744 11532118 11155232 10797416 10459286 10141857 9844539 9566209
58804I566209k58857k38365k19239k03325j88705j72517j55270j39498j25475
$$ 9566209 9307352 9068987 8849748 8646423 8457718 8285201 8129931 7990433 7864958
58795G864958j11533r7718q5678p5101o3540n0130l6562k3805j0647L641J7645
$$ 7864958 7753425 7655707 7570029 7494928 7431388 7381258 7344696 7320891 7310244 7313885 7331530
58784G331530L0083M1790N4251O7645Q1305R4815J07828J20017J31984J45125
$$ 7331530 7361613 7403403 7457654 7525299 7606604 7701419 7809247 7929264 8061248 8206373
58774H206373J59948J75396J90378K04874K19203K33263K47178K61859K78158
$$ 8206373 8366321 8541717 8732095 8936969 9156172 9389435 9636613 9898472 10176630
58765A0176630K96032L14858L34272L54536L76362M00314M26076M52851M80830
$$ 10176630 10472662 10787520 11121792 11476328 11852690 12253004 12679080 13131931 13612761
58756A3612761N11407N45143N80375O15015O48875O82813P16292P47200P73567
$$ 13612761 14124168 14669311 15249686 15864701 16513576 17196389 17912681 18659881 19433448
58747A9433448P93806Q05645Q06402P94034P66772P22393O59516N79012M82461
$$ 19433448 20227254 21032899 21839301 22633335 23400107 24122500 24782016 25361028 25843489
58738B5843489L70211K43452J07626k9141j61399k87691m06366n12964o03090
$$ 25843489 26213700 26457152 26564778 26535637 26374238 26086547 25680181 25167217 24564127
58729B4564127o75694p32093p73517q00954q16060q20745q16619q05590p90017
$$ 24564127 23888433 23156340 22382823 21581869 20765809 19945064 19128445 18322855 17532838
58720A7532838p71413p49866p25311o98545o70455o41253o11001n80140n49203
$$ 17532838 16761425 16011559 15286248 14587703 13917248 13275995 12664994 12084854 11535651
58711A1535651n18746m89627m62352m36240m10263l84668l60565l38216l17201
$$ 11535651 11016905 10527278 10064926 9628686 9218423 8833755 8473190 8134974 7817773
58702G817773k97951k81151k65739k49575k32459k16403k02504j89717j77304
$$ 7817773 7519822 7238671 6972932 6723357 6490898 6274495 6071991 5882274 5704970
58693E704970j66151j56615j47270j37118j27301j19146j12183j05476r9387r4553
$$ 5704970 5538819 5382204 5234934 5097816 4970515 4851369 4739186 4633710 4534323 4439770
58683D439770r0362q5926q1340p6852p1968o6682o2316n9794n8255n6566n5014
$$ 4439770 4349408 4263482 4182142 4105290 4033322 3966640 3904324 3844530 3786275 3729709 3674695
58672C674695n4129n3183n1391m9460m8323m7465m6217m5619m7003m9436n0640
$$ 3674695 3620566 3567383 3515992 3466532 3418209 3370744 3324527 3278908 3231905 3182469 3131829
58661C131829n0052m9185m9089m9278m9120m8743m8287m7650m7085m6915m6618
$$ 3131829 3081777 3032592 2983503 2934225 2885105 2836362 2788075 2740425 2693340 2646425 2599807
58650B599807m5274m3056m1135l9926l8509l6135l3446l1678l1168l1103l0470
$$ 2599807 2554533 2511477 2470342 2430416 2391907 2355772 2322326 2290648 2259480 2228377 2197907
58639B197907k9027k7386k6224k5589k5144k4924k5196k5582k5081k3201k0556
$$ 2197907 2168880 2141494 2115270 2089681 2064537 2039613 2014417 1988835 1963754 1940553 1919997
58628A919997j8124j6548j5998j5866j4691j1633q114o546p166p700o726n445
$$ 1919997 1901873 1885325 1869327 1853461 1838770 1827137 1819023 1812477 1805311 1797611 1790885 1785440
58616A785440n214n218m201k836k504k900k861k677l499m933n279m005k197o81
$$ 1785440 1780226 1775008 1770807 1767971 1765467 1762567 1759706 1757029 1753530 1748597 1743318 1739313 1737116 1736435
58602A736435O55J634J593P56M15J347L133N100O885P965P912P456Q207J0932
$$ 1736435 1737090 1738724 1740317 1741073 1741488 1742835 1745968 1751068 1757953 1765918 1773830 1781286 1789493 1800425
58588A800425J4896J9011K2697K5566K7471K9139L1732L5235L8274M0069M1599
$$ 1800425 1815321 1834332 1857029 1882595 1910066 1939205 1970937 2006172 2044446 2084515 2126114
58577B126114M4197M7759N1349N4858N8993O3739O7981P0977P3436P6560Q0578
$$ 2126114 2170311 2218070 2269419 2324277 2383270 2447009 2514990 2585967 2659403 2735963 2816541
58566B816541Q5038R0291R7544J07031J16996J25516J32833J40940J50994J62252
$$ 2816541 2901579 2991870 3089414 3196445 3313441 3438957 3571790 3712730 3863724 4025976
58556D025976J73624J85184J97670K11189K24650K35978K42879K44346K41434
$$ 4025976 4199600 4384784 4582454 4793643 5018293 5254271 5497150 5741496 5982930
58547E982930K35458K25289K07791J81309J47529J09288O8114K4834j8787o0501
$$ 5982930 6218388 6443677 6651468 6832777 6980306 7089594 7157708 7182542 7163755 7103254
58537G103254r8804j32508j59906j79784j92832k00883k05183k06224k04693k01318
$$ 7103254 7004450 6871942 6712036 6532252 6339420 6138537 5933354 5727130 5522437 5321119
58527E321119j96190j89268j81215j72744j63699j53750j43557j34090j25188
$$ 5321119 5124929 4935661 4754446 4581702 4418003 4264253 4120696 3986606 3861418
58518C861418j15998j06536r7705q9979q3200p7470p3144o9946o7068o4133o1294
$$ 3861418 3745420 3638884 3541179 3451200 3368000 3290530 3217386 3147440 3080372 3016239 2954945
58507B954945n8495n5546n2664n0159m7795m5308m3239m2300m2240m2245m2238
$$ 2954945 2896450 2840904 2788240 2738081 2690286 2644978 2601739 2559439 2517199 2474954 2432716
58496B432716m2725m3598m4118m3978m3365m2126l9878l6969l4333l2384l0908
$$ 2432716 2389991 2346393 2302275 2258297 2214932 2172806 2132928 2095959 2061626 2029242 1998334
58485A998334k9841k9270k8776k7716k6136k4492k2767k0895j9740k0162k1113
$$ 1998334 1968493 1939223 1910447 1882731 1856595 1832103 1809336 1788441 1768701 1748539 1727426
58474A727426k0146j6327j1483q127p179q125j0119j2063j2598j1304r600r382
$$ 1727426 1707280 1690953 1679470 1671343 1664164 1656039 1645920 1633857 1621259 1609955 1600355 1590973
58462A590973j0762j1866j1083r009p788q626j0547j1747j1722j1450j1684j2034
$$ 1590973 1580211 1568345 1557262 1548253 1540465 1531839 1521292 1509545 1497823 1486373 1474689 1462655
58450A462655j1917j1508j1209j0896j0305r564q751p579o147n324n611o232o118
$$ 1462655 1450738 1439230 1428021 1417125 1406820 1397256 1388505 1380926 1374779 1369455 1363844 1357612 1351494
58437A351494n214m117l133k576l139m765n875n073l199k220k479k504j418K2
$$ 1351494 1346280 1342163 1339030 1336454 1333315 1328550 1322675 1317602 1314403 1312183 1309704 1307200 1305782 1305804
58423A305804R09J203R10l38k224l317k536n00J140J402O24k17o10r51j851l088
$$ 1305804 1306713 1307916 1308826 1308488 1306264 1302947 1300411 1299911 1301051 1302453 1303077 1302860 1302250 1301299 1299448 1296360
58407A296360l650l001j655j74J510L180L723K543Q76N28J708L170L969L997L250
$$ 1296360 1292710 1289709 1288054 1287880 1289390 1292570 1296293 1298836 1299712 1300240 1301948 1305118 1309087 1313084 1316334
58392A316334J920Q48O61P25J69m77j05Q99R51l26j680k249k437k594k467k271
$$ 1316334 1318254 1319102 1319763 1320488 1320657 1320180 1320075 1320974 1321925 1321599 1319919 1317670 1315233 1312639 1310172 1307901
58376A307901k695l275k405J22K043J314j122k549j861n10k39j054j676j315m01
$$ 1307901 1305206 1301931 1299526 1299648 1301691 1303005 1301883 1299334 1297473 1296963 1296724 1295670 1293994 1292679 1292278
58361A292278K98P52J497K687L980N265O758Q113Q514Q089Q237R668J1160J1369
$$ 1292278 1292576 1293328 1294825 1297512 1301492 1306757 1313515 1321628 1330142 1338231 1346468 1356136 1367296 1378665
58347A378665J0904J1201J2073J2096J1072J0321J0534J0930J0802J0435J0112
$$ 1378665 1389569 1400770 1412843 1424939 1436011 1446332 1456866 1467796 1478598 1489033 1499145
58336A499145R551Q863Q887R944J0970J0692R134P446O482N969N158M134M070
$$ 1499145 1508696 1517559 1526446 1536390 1547360 1558052 1567186 1574632 1581114 1587083 1592241 1596375 1600445
58323A600445N688P885Q835Q315P635P222O106M337L723M859N593M341L026M201
$$ 1600445 1606133 1614018 1622853 1631168 1638803 1646025 1652131 1656468 1660191 1665050 1670643 1674984 1678010 1682211
58309A682211O812P768O799O675Q852J1747J3532J3923J2934J0414P536O543Q204
$$ 1682211 1689023 1696791 1703590 1710265 1719117 1730864 1744396 1758319 1771253 1781667 1789203 1795746 1803950
58296A803950J1012J3325J4732J5148J4532J3723J3776J4123J3254J1371J0372
$$ 1803950 1814962 1828287 1843019 1858167 1872699 1886422 1900198 1914321 1927575 1938946 1949318
58285A949318J0889J1399J0820R962R785J0085J0551J1346J2106J2168J2266J3968
$$ 1949318 1960207 1971606 1982426 1992388 2002173 2012258 2022809 2034155 2046261 2058429 2070695 2084663
58273B084663J6854J8475J7949J7379J8481K0030K0238J9779K0499K2372K3709
$$ 2084663 2101517 2119992 2137941 2155320 2173801 2193831 2214069 2233848 2254347 2276719 2300428
58262B300428K3759K3389K3476K3905K4190K4309K4751K5988K7866K9627L0773
$$ 2300428 2324187 2347576 2371052 2394957 2419147 2443456 2468207 2494195 2522061 2551688 2582461
58251B582461L1514L2025L2018L1724L2278L3975L5257L4954L4446L5675L7974
$$ 2582461 2613975 2646000 2678018 2709742 2742020 2775995 2811252 2846206 2880652 2916327 2954301
58240B954301L9190L9267M0122M2286M4375M5848M7679N0060N2010N3519N5687
$$ 2954301 2993491 3032758 3072880 3115166 3159541 3205389 3253068 3303128 3355138 3408657 3464344
58229C464344N8287N9695N9670N9991O1752O4218O6678O9266P1699P3400P5215
$$ 3464344 3522631 3582326 3641996 3701987 3763739 3827957 3894635 3963901 4035600 4109000 4184215
58218D184215P8661Q3395Q7552R0616R3632R6823R9747J03411J09096J15282J19223
$$ 4184215 4262876 4346271 4433823 4524439 4618071 4714894 4814641 4918052 5027148 5142430 5261653
58207E261653J21514J25382J31321J36541J40326J45535J53646J62552J70925
$$ 5261653 5383167 5508549 5639870 5776411 5916737 6062272 6215918 6378470 6549395
58198F549395J80736J93463K07417K20858K34436K48585K61774K73485K86017
$$ 6549395 6730131 6923594 7131011 7351869 7586305 7834890 8096664 8370149 8656166
58189H656166L01361L18837L37286L56790L77046L97062M17748M41615M68719
$$ 8656166 8957527 9276364 9613650 9970440 10347486 10744548 11162296 11603911 12072630
58180A2072630M96136N22380N48930N76762O05310O35747O71003P11520P55389
$$ 12072630 12568766 13091146 13640076 14216838 14822148 15457895 16128898 16840418 17595807
58171A7595807Q03409Q59135R23072R92340J067039J150921J244239J342384J443357
$$ 17595807 18399216 19258351 20181423 21173763 22240802 23391723 24635962 25978346 27421703
58162B7421703J550007J663252J780496J902446K031838K161341K272423K352945
$$ 27421703 28971710 30634962 32415458 34317904 36349742 38511083 40783506 43136451
58154D3136451K408937K454251K497661K546995K616911K722644K871277L066174
$$ 43136451 45545388 47999639 50497300 53044295 55661206 58383850 61255127 64321301
58146F4321301L313398L616007L968766M367434M818191N330584N907193O547113
$$ 64321301 67634699 71250706 75219472 79586906 84405097 89735681 95642874 102189987
58138A02189987P252622Q026315Q873034R815244J0895158J2145437J3562796
$$ 102189987 109442609 117468924 126341958 136157202 147052360 159197797 172760593
58131A72760593J5125015J6832676J8716629K0769337K2792226K4216887K4082250
$$ 172760593 187885608 204718284 223434913 244204250 266996476 291213363 315295613
58124C15295613K1378779J5696782P707754j014559q779744j4552935j8157346
$$ 315295613 336674392 352371174 360078928 359064369 350284625 335731690 317574344
58117C17574344j9942248k0368540j9829365j8661826j7172443j5613764j4154810
$$ 317574344 297632096 277263556 257434191 238772365 221599922 205986158 191831348
58110A91831348j2876981j1789109j0853322j0016674r234634q474510p706182
$$ 191831348 178954367 167165258 156311936 146295262 137060628 128586118 120879936
58103A20879936o900931o049163n180616m356595l634099l047980k640887k489364
$$ 120879936 113979005 107929842 102749226 98392631 94758532 91710552 89069665 86580301
58095H6580301k651863l071045l559583l918585m068496m055275l955688l811172
$$ 86580301 83928438 80857393 77297810 73379225 69310729 65255454 61299766 57488594
58087E7488594l638954l456257l271847l077002k863362k639071k418604k208917
$$ 57488594 53849640 50393383 47121536 44044534 41181172 38542101 36123497 33914580
58079C3914580k014221j842569j697806j572932j459233j355361j261913j174904
$$ 33914580 31900359 30057790 28359984 26787052 25327819 23972458 22710545 21535641
58071B1535641j090891j012035r40469q73665q10155p53441p05264o60944o16218
$$ 21535641 20444750 19432715 18492246 17618581 16808426 16054985 15349721 14688777 14072559
58062A4072559n73155n34682m98955m64047m32922m08674l89276l71657l56650
$$ 14072559 13499404 12964722 12465767 12001720 11568798 11160124 10770848 10399191 10042541
58053A0042541l45511l35795l25028l14675l06318k97673k86260k73440k61249
$$ 10042541 9697030 9361235 9036207 8721532 8415214 8117541 7831281 7557841 7296592
58044G296592k48949k36235k25736k18531k11075k00566j89609j81526j74815
$$ 7296592 7047643 6811408 6585672 6367141 6156066 5955500 5765891 5584365 5409550
58035E409550j66592j57922j51067j44575j35947j26632j19661j14513j08785
$$ 5409550 5242958 5085036 4933969 4789394 4653447 4526815 4407154 4292641 4183856
58026D183856j02892r8698r5213r0124q4137p9793p7050p3866p0043o6886o4068
$$ 4183856 4080964 3982266 3887053 3796929 3712792 3632999 3555949 3482083 3412040 3345154 3281086
58015C281086o0331n6380n3920n2658n1237m9937m9486m8524m5512m1919m0162
$$ 3281086 3220755 3164375 3110455 3057797 3006560 2956623 2907137 2858613 2813101 2771182 2731020
58004B731020l9442l7125l3397l0899l0148k8855k5919k2917k1308k0857k1066
$$ 2731020 2691578 2654453 2621056 2590157 2560009 2531154 2505235 2482318 2461010 2440153 2419087
57993B419087k1816k2372k1918k1085k1059k1468k1140k0531k1048k2220k1978
$$ 2419087 2397271 2374899 2352981 2331896 2310837 2289369 2268229 2247698 2226650 2204430 2182452
57982B182452j9881j7827j7218j7307j6822j5565j4095j3050j2996j3795j4289
$$ 2182452 2162571 2144744 2127526 2110219 2093397 2077832 2063737 2050687 2037691 2023896 2009607
57971B009607j3527j2063j1050j0707j0675j1012j1554j1288r867q730r106j0039
$$ 2009607 1996080 1984017 1972967 1962260 1951585 1940573 1929019 1917731 1907864 1899134 1890028 1879989
57959A879989j0188j0342j1829j3546j3324j1659j1168j2459j3433j2920j2218
$$ 1879989 1869801 1859459 1847630 1834084 1820760 1809101 1797933 1785474 1772041 1759121 1746903
57948A746903j2250j1923j0450r089r142j0014j0639j1308j2617j3814j3747j2655
$$ 1746903 1734653 1722730 1712280 1703191 1694049 1684035 1673396 1662088 1649471 1635657 1621910 1609255
57936A609255j1534j0325q177n369l618l979n256n200l029j99J311J090L20J03
$$ 1609255 1597721 1587396 1579219 1573850 1570232 1566253 1560997 1555797 1552768 1552569 1553880 1554970 1555290 1555393
57922A555393M25O35K70o86j744j938o97J084J683N94r49j869k660m269o502q387
$$ 1555393 1555818 1556453 1556723 1556037 1554293 1552355 1551658 1552742 1554425 1555019 1554070 1552201 1549541 1545272 1538770 1530383
57906A530383r435r719r248q019o342m609l182k732l754n524o499o236n741n493
$$ 1530383 1520948 1511229 1501981 1493962 1487620 1483011 1479829 1477097 1473343 1467819 1461320 1455084 1449343 1443850
57892A443850m606k743j325j609k810l432l260k799k032j138j245k718l831k900
$$ 1443850 1439244 1436501 1435176 1433567 1430757 1427325 1424065 1421266 1419234 1418096 1416851 1414133 1410302 1407402
57878A407402q44L37N03P20M71j639m671n727m054k338k952m926n927n579n259
$$ 1407402 1406558 1406895 1407398 1408118 1408589 1406950 1402279 1396552 1392498 1390160 1387208 1382282 1376355 1370776 1365517
57863A365517n576n624m540k754j463j323j829j890r93L61J350J632J367J083
$$ 1365517 1359941 1354317 1349777 1347023 1345560 1344237 1342408 1340518 1339525 1339886 1341236 1342868 1344235 1345318
57849A345318J658L681O342P803P261N885N112M937M603L963L119J724j35j258
$$ 1345318 1346976 1350657 1356999 1364802 1372063 1377948 1383060 1387997 1392600 1396563 1399682 1401406 1401271 1400013
57835A400013q15J79J91q67k253m009o301p957p595n750m135l288k669k487l271
$$ 1400013 1399198 1399377 1399568 1398701 1396448 1392439 1386138 1378181 1370586 1364836 1360701 1357413 1354744 1352257 1348986
57820A348986m036l187j296o97k019l383l367k598j729q8K596N050O249O787P396
$$ 1348986 1344950 1341763 1340467 1339770 1337751 1334368 1331001 1328403 1326674 1326586 1329182 1334232 1340481 1347268 1354664
57805A354664P537O689N620N178M984M532M443N241N798M480J355j926l998m548
$$ 1354664 1362201 1368890 1374510 1379688 1384672 1389204 1393647 1398888 1404686 1409166 1410521 1408595 1404597 1400049
57791A400049l753k168j025j611m068p250r605j0058q493n938l942l317l630m087
$$ 1400049 1396296 1394128 1393103 1391492 1387424 1380174 1370569 1360511 1352018 1346080 1342138 1338821 1335191 1331104
57777A331104m459m858n205n242m799l862k747k183k587l296l367l131l869n702
$$ 1331104 1326645 1321787 1316582 1311340 1306541 1302679 1299932 1297749 1295162 1291866 1288499 1285368 1281499 1275797
57763A275797o988o522n235m884n849p100p691p364o225m723l680l461l425k758
$$ 1275797 1268809 1262287 1257052 1252168 1246319 1239219 1231528 1224164 1217939 1213216 1209536 1206075 1202650 1199892
57749A199892j595o86k49J91J006K091L130L763L688L039K536K790L682M622N203
$$ 1199892 1198297 1197611 1197362 1197553 1198559 1200650 1203780 1207543 1211231 1214270 1216806 1219596 1223278 1227900 1233103
57734A233103N243M725M045L982M855N941O243N581M532L654L251L516M176M201
$$ 1233103 1238346 1243071 1247116 1251098 1255953 1261894 1268137 1273718 1278250 1281904 1285155 1288671 1292847 1297048
57720A297048K597k63k695l199j714N26K104K374J824J522J964K425J688m91k922
$$ 1297048 1299645 1299382 1296687 1293488 1291774 1292300 1294404 1296778 1298602 1300124 1302088 1304513 1306201 1305710 1302788
57705A302788l994l009m96K479N079O893P727P595O931O516O851P656Q337Q796
$$ 1302788 1298794 1295785 1295289 1297768 1302847 1309740 1317467 1325062 1331993 1338509 1345360 1353016 1361353 1370149
57691A370149R396J0151J0519J0226R802R865J0186R931Q826P676P677R341J2014
$$ 1370149 1379545 1389696 1400215 1410441 1420243 1430108 1440294 1450225 1459051 1466727 1474404 1483745 1495759
57678A495759J4247J4792J3652J2193J1977J3190J4460J4417J3352J2830J3696
$$ 1495759 1510006 1524798 1538450 1550643 1562620 1575810 1590270 1604687 1618039 1630869 1644565
57667A644565J5019J5480J5257J5762J7630J9962K1766K3250K5101K7201K8823
$$ 1644565 1659584 1675064 1690321 1706083 1723713 1743675 1765441 1788691 1813792 1840993 1869816
57656A869816K9719L0230L0601L1042L2208L4753L8237M1268M3073M4372M6422
$$ 1869816 1899535 1929765 1960366 1991408 2023616 2058369 2096606 2137874 2180947 2225319 2271741
57645B271741M9534N2858N5387N6979N8433O0743O4250O8537P3039P7443Q1541
$$ 2271741 2321275 2374133 2429520 2486499 2544932 2605675 2669925 2738462 2811501 2888944 2970485
57634B970485Q5139Q8383R1793R5777J00548J06676J14924J24983J35252J44698
$$ 2970485 3055624 3144007 3235800 3331577 3432125 3538801 3653725 3778708 3913960 4058658
57624D058658J54305J65472J77460J87804J95234K00757K05510K08673K08118
$$ 4058658 4212963 4378435 4555895 4743699 4938933 5139690 5345200 5553873 5761991
57615E761991K02298J90917J74432J53618J29441J02905P5007M6680J8265j1054
$$ 5761991 5964289 6155206 6329638 6483256 6612697 6715602 6790609 6837289 6855554 6844500
57605F844500m2658p6898j11973j44292j69856j85979j92614j92175j87555j80376
$$ 6844500 6801842 6724944 6612971 6468679 6298823 6112844 5920230 5728055 5540500 5360124
57595E360124j71322j61416j51850j42718j33051j22242j10619r8688q6841p5831
$$ 5360124 5188802 5027386 4875536 4732818 4599767 4477525 4366906 4268218 4181377 4105546
57585D105546o6370n7907m8920l8812k8639j9564j1578m203K621Q996J5514K2454
$$ 4105546 4039176 3981269 3932349 3893537 3864898 3845334 3833756 3829553 3832174 3841170 3856684 3879138
57573C879138K9210L5340M1504M8721N7218O6628P6672Q6867R6212J04183J11681
$$ 3879138 3908348 3943688 3985192 4033913 4091131 4157759 4234431 4321298 4417510 4521693 4633374
57562D633374J19985J28865J36554J41576J43899J44103J41952J36035J24552
$$ 4633374 4753359 4882224 5018778 5160354 5304253 5448356 5590308 5726343 5850895
57553E850895J06500Q2454N4357K4474n601l5061o3217q8888j10618j27667j40626
$$ 5850895 5957395 6039849 6094206 6118680 6113079 6078018 6014801 5925913 5815295 5687628 5547002
57542E547002j50504j57189j59727j58584j56393j55211j53838j49579j42214
$$ 5547002 5396498 5239309 5079582 4920998 4764605 4609394 4455556 4305977 4163763
57533D163763j34233j27229j20315j12629j05167r8830r2625q5554p8765p3883
$$ 4163763 4029530 3902301 3781986 3669357 3564190 3465360 3372735 3287181 3208416 3134533
57523C134533p0243o5810o0225n4929n0586m6401m2052l8337l5451l2204k7805
$$ 3134533 3064290 2998480 2938255 2883326 2832740 2786339 2744287 2705950 2670499 2638295 2610490
57512B610490k3134j9488j7017j5162j3720j2578j0977q120m337r01J390L003
$$ 2610490 2587356 2567868 2550851 2535689 2521969 2509391 2498414 2490294 2485957 2485056 2486446 2489449
57500B489449M884P284R556J1022J1875J3109J5508J8720K1499K2900K3208K3684
$$ 2489449 2494333 2501617 2511173 2522195 2534070 2547179 2562687 2581407 2602906 2625806 2649014 2672698
57488B672698K5355K8140L1196L4056L6954M0039M2792M4772M6499M8894N2016
$$ 2672698 2698053 2726193 2757389 2791445 2828399 2868438 2911230 2956002 3002501 3051395 3103411
57477C103411N5119N7880O0829O4516O9111P4855Q1897Q9501R6391J02159J07405
$$ 3103411 3158530 3216410 3277239 3341755 3410866 3485721 3567618 3657119 3753510 3855669 3963074
57466C963074J12260J15942J18217J19787J20301J17361J08920R5780Q0190O2729
$$ 3963074 4075334 4191276 4309493 4429280 4549581 4666942 4775862 4871642 4951832 5014561
57456E014561M2241J8631n964k9000m9291o6670q0991r2002r9639j04173j06336
$$ 5014561 5056802 5075433 5069469 5040469 4991178 4924508 4843517 4751515 4651876 4547703 4441367
57445D441367j07068j06718j04737j00748r5401q9532q3086p5874o8752o2713
$$ 4441367 4334299 4227581 4122844 4022096 3926695 3837163 3754077 3678203 3609451 3546738
57435C546738n7183n0746m3434l6724l1160k5692j9837j4681j0837o987j833L665
$$ 3546738 3489555 3438809 3395375 3358651 3327491 3301799 3281962 3267281 3256444 3249457 3247624 3251289
57423C251289P589J0025J3127J8234K4246K9246L2951L6962M2764M9831N5880
$$ 3251289 3258878 3268903 3282030 3300264 3324510 3353756 3386707 3423669 3466433 3516264 3572144
57412C572144N9283O1140O4377P0565P8212Q4674Q9117R2846R7078J01254J03532
$$ 3572144 3631427 3692567 3756944 3827509 3905721 3990395 4079512 4172358 4269436 4370690 4474222
57401D474222J02226R6606Q6969P4214N8949M0873J9415m858k9846n3142p3364
$$ 4474222 4576448 4673054 4760023 4834237 4893186 4934059 4953474 4948616 4918770 4865628 4792264
57390D792264r0140j03377j13075j19630j23629j25269j24499j21826j18451j15250
$$ 4792264 4702124 4598747 4485672 4366042 4242413 4117144 3992645 3870819 3752368 3637118
57380C637118j12033j08234j03908r9424r4469q8261q0949p4064o9018o5605o2473
$$ 3637118 3525085 3416851 3312943 3213519 3119050 3030789 2949840 2875776 2806758 2741153 2678680
57369B678680n8730n4552n0366m6151m1741l7438l3995l1943l1014l0209k8578
$$ 2678680 2619950 2565398 2515032 2468881 2427140 2389702 2355707 2323764 2292750 2262541 2233963
57358B233963k6023k3263k1014j9369j8026j6772j5497j4105j2753j1982j2047
$$ 2233963 2207940 2184677 2163663 2144294 2126268 2109496 2093999 2079894 2067141 2055159 2043112
57347B043112j2272j1609r966q456q085q584q886q493p838p445p267o951o261
$$ 2043112 2030840 2019231 2009265 2000809 1992724 1984140 1975254 1966761 1958923 1951478 1944211 1937260 1930999
57334A930999m958k804k27J430J086o67k110k390k167k100j815r49j97l78j153
$$ 1930999 1926041 1923237 1923010 1924440 1925526 1924859 1922749 1920359 1918192 1916092 1914277 1913328 1913131 1912753 1911600
57319A911600j756k384l594m731m490l026k094k747m071m559l743k099m61J97
$$ 1911600 1909844 1907460 1903866 1899135 1894645 1891619 1889525 1886778 1882707 1878148 1874405 1872306 1871845 1872042
57305A872042n95j863j939n93O29O17N6jL46O06J017J854K570K723K907L700M501
$$ 1872042 1871447 1869584 1867645 1867052 1867681 1868298 1868354 1868353 1868699 1869305 1870322 1872176 1874746 1877469 1880376 1884076 1888577
57288A888577M455L903L765M125M513M953N612O033N855N615N696N282L816K634
$$ 1888577 1893032 1896935 1900700 1904825 1909338 1914291 1919903 1925936 1931791 1937406 1943102 1948384 1952200 1954834
57274A954834L347N129N699M843M845O989R685J0856J0576J0269J0571J1141J1780
$$ 1954834 1958181 1963310 1969009 1973852 1978697 1985686 1995371 2006227 2016803 2027072 2037643 2048784 2060564
57261B060564J2618J3580J4427J5074J5304J4553J2502R822P999Q229J0291J2489
$$ 2060564 2073182 2086762 2101189 2116263 2131567 2146120 2158622 2168444 2176443 2184672 2194963 2207452
57249B207452J3036J1935J1044J1876J3933J5774J6924J7708J7941J7342J6835
$$ 2207452 2220488 2232423 2243467 2255343 2269276 2285050 2301974 2319682 2337623 2354965 2371800
57238B371800J7716J9516K0418K0079K0339K2489K5428K7427K8386K9350L0841
$$ 2371800 2389516 2409032 2429450 2449529 2469868 2492357 2517785 2545212 2573598 2602948 2633789
57227B633789L2824L5354L8149M0203M0972M1400M2689M4415M4954M3454M0418
$$ 2633789 2666613 2701967 2740116 2780319 2821291 2862691 2905380 2949795 2994749 3038203 3078621
57216C078621L6514L1898K6664K0982J4594P084j088q551j4414j9106k3395k7184
$$ 3078621 3115135 3147033 3173697 3194679 3209273 3216357 3215269 3206718 3192304 3173198 3149803 3122619
57204C122619k9847l1332l2164l2514l2091l1012l0085k9863l0037l0074k9782
$$ 3122619 3092772 3061440 3029276 2996762 2964671 2933659 2903574 2873711 2843674 2813600 2783818
57193B783818k8755k6158k2022j8065j5973j5182j3752j1292r336q585p690n545
$$ 2783818 2755063 2728905 2706883 2688818 2672845 2657663 2643911 2632619 2623283 2614698 2607008 2601463
57181B601463l146j973j796j397l42J194L426O361R053J0822J2467J4930J7566
$$ 2601463 2598317 2596344 2594548 2593151 2592809 2594003 2597429 2603790 2612843 2623665 2636132 2651062 2668628
57168B668628J9292K0626K2750K5171K6259K5826K5342K5604K6124K6833K8548
$$ 2668628 2687920 2708546 2731296 2756467 2782726 2808552 2833894 2859498 2885622 2912455 2941003
57157B941003L1358L4163L6275L8236M0762M4034M8068N2410N5423N5290N2120
$$ 2941003 2972361 3006524 3042799 3081035 3121797 3165831 3213899 3266309 3321732 3377022 3429142
57146C429142M7887M4249M1563L9741L8489L6742L3549K9710K7038K5988K5608
$$ 3429142 3477029 3521278 3562841 3602582 3641071 3677813 3711362 3741072 3768110 3794098 3819706
57135C819706K5659K6841K8911L0772L2747L6318M0942M3424M1602L6859L1947
$$ 3819706 3845365 3872206 3901117 3931889 3964636 4000954 4041896 4085320 4126922 4163781 4195728
57124D195728K8199K5857K5156K5480K4939K2300J8321J4244J0313O694M207K743
$$ 4195728 4223927 4249784 4274940 4300420 4325359 4347659 4365980 4380224 4390537 4397231 4401438 4404181
57112D404181K86n060j2957k1932l1384m1302n1039n9687o7055p3304p8411q2756
$$ 4404181 4404467 4399407 4386450 4364518 4333134 4291832 4240793 4181106 4114051 4040747 3962336 3879580
57100C879580q7312r2329r6699r9379j00582j01038j01034j00849j01000j01590
$$ 3879580 3792268 3699939 3603240 3503861 3403279 3302241 3201207 3100358 2999358 2897768
57090B897768j02438j04271j08529j15669j24960j36150j49706j65194j81524
$$ 2897768 2795330 2691059 2582530 2466861 2341901 2205751 2056045 1890851 1709327
57081A709327j99160k19998k44259k69628k94145A64320a76324l61701l81271
$$ 1709327 1510167 1290169 1045910 776282 482137 164320 -176324 -538025 -919296
57072i19296m01720m24749m49903m76863n06728n39730n73995o08027o42216o76830
$$ -919296 -1321016 -1745765 -2195668 -2672531 -3179259 -3718989 -4292984 -4901011 -5543227 -6220057
57062f220057p11229p46574p86681q34792q91939r59395j039298j131306j232069
$$ -6220057 -6931286 -7677860 -8464541 -9299333 -10191272 -11150667 -12189965 -13321271 -14553340
57053a4553340j339825j456467j584320j725421j885208k070640k281115k506636
$$ -14553340 -15893165 -17349632 -18933952 -20659373 -22544581 -24615221 -26896336 -29402972
57045b9402972k739307k982397l244896l533265l853350m213888m620579n069544
$$ -29402972 -32142279 -35124676 -38369572 -41902837 -45756187 -49970075 -54590654 -59660198
57037e9660198n551110o055352o571407p092115p628975q214401q877529r622014
$$ -59660198 -65211308 -71266660 -77838067 -84930182 -92559157 -100773558 -109651087 -119273101
57029a19273101j0433331j1293476j2173407j3027286j3818825j4533529j5112096
$$ -119273101 -129706432 -140999908 -153173315 -166200601 -180019426 -194552955 -209665051
57022b09665051j5362538j5001745j3853226j2013579r798274p515614n292482
$$ -209665051 -225027589 -240029334 -253882560 -265896139 -275694413 -283210027 -288502509
57015b88502509l080549p67662J735371M461756P364966J0291148J2983968J5147959
$$ -288502509 -291583058 -292350720 -290615349 -286153593 -278788627 -268497479 -255513511 -240365552
57007b40365552J6549967J7106970J6909659J6165306J5097643J3873129J2594690
$$ -240365552 -223815585 -206708615 -189798956 -173633650 -158536007 -144662878 -132068188
57000a32068188J1341179J0197946R246824Q529662Q023002P649492P318785O966457
$$ -132068188 -120727009 -110529063 -101282239 -92752577 -84729575 -77080083 -69761298 -62794841
56992f2794841O566031O117866N635018N135986M639929M162215L714204L305911
$$ -62794841 -56228810 -50110944 -44475926 -39339940 -34700011 -30537796 -26823592 -23517681
56984b3517681K944655K630683K358079K120981J915763J737090J576904J429946
$$ -23517681 -20573026 -17942343 -15584264 -13463283 -11547520 -9810430 -8233526 -6803580
56976f803580J297208J181526J081964R94326R14836d92417B80076P08501O50628
$$ -6803580 -5506372 -4324846 -3242882 -2248556 -1333720 -492417 280076 988577 1639205
56967A639205N99634N54702N14741M79267M47523M18106L90029L62912L36073
$$ 1639205 2238839 2793541 3308282 3787549 4235072 4653178 5043207 5406119 5742192
56958E742192L09124K83389K60825K41329K23059K05352J89043J73879J58352
$$ 5742192 6051316 6334705 6595530 6836859 7059918 7265270 7454313 7628192 7786544
56949G786544J42697J29481J20363J14438J10371J07586J04490R7801Q4476O2210
$$ 7786544 7929241 8058722 8179085 8293523 8403894 8511480 8615970 8713771 8798247 8860457
56939H860457K8139j9225p5085j28568j70168j97447k12651k18069k15884k09340
$$ 8860457 8888596 8869371 8794286 8665718 8495550 8298103 8085452 7867383 7651499 7442159
56929G442159k00577j88571j71734j51235j29755j08582q8249p0509n7066m7250
$$ 7442159 7241582 7053011 6881277 6730042 6600287 6491705 6403456 6332947 6275881 6228631
56919F228631l9215l2375k6658k0694j3358o062p86L436R360J7226K4447K9580
$$ 6228631 6189416 6157041 6130383 6109689 6096331 6090269 6089483 6092919 6102279 6119505 6143952 6173532
56907F173532L3840L8143M1201M1745M0761M0149M0332M0212L8784L5990L2391
$$ 6173532 6207372 6245515 6286716 6328461 6369222 6409371 6449703 6489915 6528699 6564689 6597080
56896F597080K8393K3540J6553O550n843j8944l1165m1304m8416n2584n5436n8685
$$ 6597080 6625473 6649013 6665566 6672116 6666273 6647329 6616164 6574860 6526444 6473860 6418424 6359739
56884F359739o2226o4633o5414o5663o6390o7246o7245o6002o3908o1593n9396
$$ 6359739 6297513 6232880 6167466 6101803 6035413 5968167 5900922 5834920 5771012 5709419 5650023
56873E650023n7139n4484n1736m9915m9650n0499n1866n3952n7066o0462o2815
$$ 5650023 5592884 5538400 5486664 5436749 5387099 5336600 5284734 5230782 5173716 5113254 5050439
56862E050439o3458o2332n9298n4597m9589m5652m2426l8380l3240k8468k5048
$$ 5050439 4986981 4924649 4865351 4810754 4761165 4715513 4673087 4634707 4601467 4572999 4547951
56851D547951k2114j8409j4129j0429p843n930m138k187J36K851N485P411Q584
$$ 4547951 4525837 4507428 4493299 4482870 4475027 4469097 4464959 4462772 4462908 4465759 4471244 4478655 4487239
56838D487239R521J0449J1011J1147J1950J4816J9497K3706K5253K4274K2750
$$ 4487239 4496760 4507209 4518220 4529367 4541317 4556133 4575630 4599336 4624589 4648863 4671613
56827D671613K2054K1787K0818J8363J3929P397j86o871j1642j5385j9235k2711
$$ 4671613 4693667 4715454 4736272 4754635 4768564 4775961 4775775 4768904 4757262 4741877 4722642 4699931
56815D699931k4356k3687k1468j8464j4991j1539q709o319l516n5L308O070Q973
$$ 4699931 4675575 4651888 4630420 4611956 4596965 4585426 4576717 4570398 4566882 4566827 4570135 4576205 4585178
56802D585178J3123J8360K2978K5155K4403K1489J7168J1387M030l873j0393j4238
$$ 4585178 4598301 4616661 4639639 4664794 4689197 4710686 4727854 4739241 4743271 4739398 4729005 4714767
56790D714767j5654j5556j4349j1962q658n190k198L25K928O039R402J2328J4819
$$ 4714767 4699113 4683557 4669208 4657246 4648588 4643398 4641200 4641525 4644453 4650492 4659894 4672222 4687041
56777D687041J8062K3133K9440L5224L9357M1570M0898L5409K4361R672n414j8457
$$ 4687041 4705103 4728236 4757676 4792900 4832257 4873827 4914725 4950134 4974495 4984167 4978753 4960296
56765D960296k8209l4118l6555l6864l6099l4050l0283k5556k1268j7878j4793
$$ 4960296 4932087 4897969 4861414 4824550 4788451 4754401 4724118 4698562 4677294 4659416 4644623
56754D644623j1498p907l820R71O070J0648J4262J6975J8690J8702J5901R375
$$ 4644623 4633125 4625218 4621398 4622369 4628439 4639087 4653349 4670324 4689014 4707716 4723617 4732992
56742D732992o72j2180k2058k8326l1306l2515l2949l2749l1714k9521k6017k1799
$$ 4732992 4732320 4720140 4698082 4669756 4638450 4605935 4572986 4540237 4508523 4479002 4452985 4431186
56730D431186j7948j4882j2193r871q398p189m497L9M137N563M873L932K873L44
$$ 4431186 4413238 4398356 4386163 4376292 4367894 4360705 4356208 4356247 4360384 4365947 4370820 4374752 4377625 4377969
56716D377969m056r574j5779k2192k6915k7991k6169k4236k3434k2544k0749j9118
$$ 4377969 4373913 4364339 4348560 4326368 4299453 4271462 4245293 4221057 4197623 4175079 4154330 4135212
56704D135212j8509j8024j6617j4774j3498j2896j2653j2824j3210j2917j1508
$$ 4135212 4116703 4098679 4082062 4067288 4053790 4040894 4028241 4015417 4002207 3989290 3977782
56693C977782r843r016r101r531r888r755q575o400m282l371m017n851p985r045
$$ 3977782 3967939 3958923 3949822 3940291 3930403 3920648 3912073 3905673 3901391 3898020 3894003 3888152 3880167 3871122
56679C871122p997n421l136k248k364k846l598m406m681m516m706n223n050m109
$$ 3871122 3863125 3857704 3854568 3852320 3849956 3847110 3843512 3839106 3834425 3829909 3825203 3819980 3814930 3810821
56665C810821l877n055o195o015n600o405p241n634j802J090R46r41k312k875
$$ 3810821 3806944 3801889 3795694 3789679 3784079 3777674 3770433 3764799 3762997 3764087 3765033 3764092 3761780 3758905
56651C758905l545m129l531j931j202k614n156o826o998o656o523o102m867l369
$$ 3758905 3755360 3751231 3747700 3745769 3744567 3741953 3736797 3729971 3722973 3716317 3709794 3703692 3698825 3695456
56637C695456k367j670q12l41j161k888m246m938n737o603o347m729l323l344
$$ 3695456 3693089 3691419 3690607 3690266 3689105 3686217 3681971 3677033 3671296 3664693 3658346 3653617 3650294 3646950
56623C646950l951l806l177l075l242k540j086m51j583l589m787m366k858j517
$$ 3646950 3642999 3639193 3636016 3632941 3629699 3627159 3626073 3625622 3624039 3620450 3615663 3611297 3608439 3606922
56609C606922j282j980k629k691k620k905l218l061k628k303j867j165j068k591
$$ 3606922 3605640 3603660 3601031 3598340 3595720 3592815 3589597 3586536 3583908 3581605 3579738 3578573 3577505 3574914
56595C574914n183o965o905n878n325n580n916n659m827l952l603l954m663n172
$$ 3574914 3569731 3562766 3555861 3549983 3544658 3539078 3533162 3527503 3522676 3518724 3515121 3511167 3506504 3501332
56581C501332n162m723m200l953m119m479m709m758m725m485l867l162k852k741
$$ 3501332 3496170 3491447 3487247 3483294 3479175 3474696 3469987 3465229 3460504 3456019 3452152 3448990 3446138 3443397
56567C443397k179j354j403k633l601k906j213m22j206k499l140k899j972o63
$$ 3443397 3441218 3439864 3438461 3435828 3432227 3429321 3428108 3427686 3426480 3423981 3420841 3417942 3415970 3415307
56553C415307K08k33j590k282j577p58j399l151m232l889l131k896k683j793r88
$$ 3415307 3415515 3415282 3413692 3411410 3409833 3409075 3407676 3404525 3400293 3396404 3393273 3390377 3387694 3385901 3384913
56538C384913j641l516m792m558l942m108m367l444j687n37m08n86r83k117l365
$$ 3384913 3383272 3379756 3374964 3370406 3366464 3362356 3357989 3354545 3352858 3352321 3351913 3351327 3350344 3348227 3344862
56523C344862l144j385j42q03k135k148p15P88J466J353P34J40L89J555K472K301
$$ 3344862 3341718 3340333 3340191 3339388 3337253 3335105 3334390 3335178 3336644 3337997 3338731 3338871 3339260 3340815 3343287 3345588
56507C345588J870K305L110K896J654Q92J634L356M822N054L731J595K41N87J786
$$ 3345588 3347458 3349763 3352873 3355769 3357423 3358315 3359949 3363305 3368127 3373181 3376912 3378507 3378748 3379335 3381121
56492C381121K413K271K095K065J828J522J342N23j721m352n335m435l576m057
$$ 3381121 3383534 3385805 3387900 3389965 3391793 3393315 3394657 3395180 3393459 3389107 3383772 3379337 3375761 3371704
56478C371704n054n544o046p342q695q798p879p464q131q718q103p021p302r361
$$ 3371704 3366650 3361106 3355060 3347718 3339023 3330225 3322346 3314882 3306751 3298033 3289930 3282909 3275607 3266246
56464C266246j1219j0564p473m324l031l386m342n602p042p910p866p906q701
$$ 3266246 3255027 3244463 3236990 3232666 3229635 3226249 3221907 3216305 3209263 3201353 3193487 3185581 3176880
56451C176880q824o434k343N79Q85l59j849l359m551m751m555n567p555p906n205
$$ 3176880 3168056 3161622 3159279 3159858 3160743 3160384 3158535 3155176 3150625 3145874 3141319 3135752 3128197 3120291 3115086
56436C115086j607l0n46j318j772k728m114m767m324l597k957j960p89o35k046
$$ 3115086 3113479 3113449 3112903 3111585 3109813 3107085 3102971 3098204 3093880 3090283 3087326 3085366 3084577 3083942 3081896
56421C081896l960m852m247k789j453q67q68n06J001L143M381L735J751j24q03
$$ 3081896 3077936 3073084 3068837 3066048 3064595 3063728 3062860 3062354 3063355 3066498 3070879 3074614 3076365 3076241 3075438
56406C075438j85J048K043K382K295K296K679L337L813L496K211P38K13P17J066
$$ 3075438 3075253 3076301 3078344 3080726 3083021 3085317 3087996 3091333 3095146 3098642 3100853 3101591 3101804 3102521 3103587
56391C103587M32m44m45J38l2j373k921l820m247m592m682m337l973l919l758
$$ 3103587 3104019 3103575 3103130 3103268 3103236 3101863 3098942 3095122 3090875 3086283 3081601 3077264 3073291 3069372 3065614
56376C065614l066k494l167n039o696p054o526o053n640m702l536l267m090m625
$$ 3065614 3062548 3060054 3056887 3051848 3045152 3038098 3031572 3025519 3019879 3015177 3011641 3008374 3004284 2999659
56362B999659l830k790l391n474o680n412k833j182j033j180q17o01j473l310
$$ 2999659 2995829 2993039 2989648 2984174 2977494 2972082 2969249 2968067 2967034 2965854 2965037 2964436 2962963 2959653
56348B959653n107n999n838n115m509m293m008l062j658o98o07q05o81o06j354
$$ 2959653 2954546 2948547 2942709 2937594 2933085 2928792 2924784 2921722 2920064 2919366 2918759 2917954 2917273 2916667 2915313
56333B915313k776l765l539k368j070k99l66j026j345n92M68J19j968l887l897
$$ 2915313 2912537 2908772 2905233 2902865 2901795 2901496 2901130 2900104 2898759 2898167 2898635 2898754 2896786 2892899 2889002
56318B889002k688k027j978j094Q82K402K425J719J257Q22M4m86j70N62J143J934
$$ 2889002 2886314 2884287 2882309 2881215 2882097 2884499 2886924 2888643 2889900 2890722 2890766 2890280 2890110 2890672 2891815 2893749
56302B893749L327M574M513K950O25j516k358j121J188J950k8k507k406L17K892
$$ 2893749 2897076 2901650 2906163 2909113 2909738 2908222 2905864 2904743 2905931 2907881 2907853 2905346 2902940 2903257 2906149
56287B906149L284J848l0j211q86Q62K580L012K923L781N016M683K796J608K075
$$ 2906149 2909433 2911281 2911251 2910040 2909154 2910016 2912596 2915608 2918531 2922312 2927328 2932011 2934807 2936415 2938490
56272B938490K465J521Q25K383N512P861Q516Q391Q227P819P014O310O361P543
$$ 2938490 2940955 2942476 2943301 2945684 2951196 2959057 2967573 2975964 2984191 2992010 2999024 3005334 3011695 3019238
56258C019238R707J1948J3113J3063J2907J3362J3572J2326R899P851P186P511
$$ 3019238 3028945 3040893 3054006 3067069 3079976 3093338 3106910 3119236 3129135 3136986 3144172 3151683
56246C151683P892P979Q044Q259Q210P382O092N428N895O708P147P801R447J1303
$$ 3151683 3159575 3167554 3175598 3183857 3192067 3199449 3205541 3210969 3216864 3223572 3230719 3238520 3247967 3259270
56232C259270J1962J1765J2474J4548J6545J7592J8630K0603K3135K5781K8998
$$ 3259270 3271232 3282997 3295471 3310019 3326564 3344156 3362786 3383389 3406524 3432305 3461303
56221C461303L2834L6200L8508M0635M3241M5627M7497N0223N4666N9156O1687
$$ 3461303 3494137 3530337 3568845 3609480 3652721 3698348 3745845 3796068 3850734 3909890 3971577
56210C971577O3162O6288P1753P7697Q2822Q7947R4143J01148J08387J16208J25189
$$ 3971577 4034739 4101027 4172780 4250477 4333299 4421246 4515389 4616537 4724924 4841132 4966321
56199D966321J34939J44402J52997J60921J68462J75366J81014J85091J87835
$$ 4966321 5101260 5245662 5398659 5559580 5728042 5903408 6084422 6269513 6457348
56190F457348J89326J88698J84654J76654J65063J50327J32905J13887R4500P4773
$$ 6457348 6646674 6835372 7020026 7196680 7361743 7512070 7644975 7758862 7853362 7928135
56180G928135N3921L2385J2045o060k2795l8827n3017o4052p2531q0119q7478
$$ 7928135 7982056 8014441 8026486 8020426 7997631 7958804 7905787 7841735 7769204 7689085 7601607
56169G601607r4325j00660j06698j12301j17578j23374j29896j35719j39421j41567
$$ 7601607 7507282 7406622 7299924 7187623 7070045 6946671 6816775 6681056 6541635 6400068
56159F400068j43737j46161j47735j47911j47120j45480j42401j37612j31691
$$ 6400068 6256331 6110170 5962435 5814524 5667404 5521924 5379523 5241911 5110220
56150E110220j25527j19781j14534j09095j02697r5872r0148q5838q1315p5368
$$ 5110220 4984693 4864912 4750378 4641283 4538586 4442714 4352566 4266728 4185413 4110045
56140D110045o9015o3729n9235n4646n0556m8039m6325m3535l9384l5268l1908
$$ 4110045 4041030 3977301 3918066 3863420 3812864 3764825 3718500 3674965 3635581 3600313 3568405
56129C568405k8680k5337k2642k0904j9183j6324j2247q177o048o834q851q674
$$ 3568405 3539725 3514388 3491746 3470842 3451659 3435335 3423088 3414911 3408863 3402029 3393178 3384504
56117C384504m894K5K874L472L925N388P571J0307J3314J5204J5116J4768J6412
$$ 3384504 3379610 3379635 3382509 3385981 3389906 3395294 3402865 3413172 3426486 3441690 3456806 3471574 3487986
56104C487986J9236K0478J9777J9434K0262K0381J8906J7761J8304J8888J7605
$$ 3487986 3507222 3527700 3547477 3566911 3587173 3607554 3626460 3644221 3662525 3681413 3699018
56093C699018J5648J5768J8594K2287K5176K7297K9802L3803L9431M5437N0197
$$ 3699018 3714666 3730434 3749028 3771315 3796491 3823788 3853590 3887393 3926824 3972261 4022458
56082D022458N3631N7465O3190P0505P8158Q5541R2983J00995J09531J17455J22767
$$ 4022458 4076089 4133554 4196744 4267249 4345407 4430948 4523931 4624926 4734457 4851912 4974679
56071D974679J24035J21706J17251J11382J04108R6329Q9773Q4978Q0470P4300
$$ 4974679 5098714 5220420 5337671 5449053 5553161 5649490 5739263 5824241 5904711 5979011
56061E979011O5436N3503L8492K1403M337j0736k2928l2369m0057m7798n7197
$$ 5979011 6044447 6097950 6136442 6157845 6162182 6151446 6128518 6096149 6056092 6008294 5951097
56050E951097o8355q0026r0964j00426j07566j11407j11631j08729j03464r6725
$$ 5951097 5882742 5802716 5711752 5611326 5503760 5392353 5280722 5171993 5068529 4971804
56040D971804q9598q2736p5851o8477o0928n3954m8014m3459m0507l8331l5286
$$ 4971804 4882206 4799470 4723619 4655142 4594214 4540260 4492246 4448787 4408280 4369949 4334663
56029D334663l1066k7329k5153k3273k0317j7059j4568j1857p797l892k371k611
$$ 4334663 4303597 4276268 4251115 4227842 4207525 4190466 4175898 4164041 4156244 4152352 4149981 4147370
56017D147370k335j325p70K49L908R545J3983J6265J8603K2134K5124K6287K6797
$$ 4147370 4145035 4143710 4142940 4143189 4147097 4156642 4170625 4186890 4205493 4227627 4252751 4279038 4305835
56004D305835K7785K8604K8750K9193L0677L2757L5226L8295M1004M1901M1817
$$ 4305835 4333620 4362224 4390974 4420167 4450844 4483601 4518827 4557122 4598126 4640027 4681844
55993D681844M3285M6560M9058M9677N0710N4129N8562O1598O2927O3765O4970
$$ 4681844 4725129 4771689 4820747 4870424 4921134 4975263 5033825 5095423 5158350 5222115 5287085
55982E287085O6922O9693P2436P4231P5889P9042Q3333Q6680Q8679R1199R5264
$$ 5287085 5354007 5423700 5496136 5570367 5646256 5725298 5808631 5895311 5983990 6075189 6170453
55971F170453R9917J04543J09700J15278J20461J25757J32223J38786J43596J47994
$$ 6170453 6270370 6374913 6484613 6599891 6720352 6846109 6978332 7117118 7260714 7408708
55961G408708J55366J65750J75768J84564J95219K09044K23046K34960K46598
$$ 7408708 7564074 7729824 7905592 8090156 8285375 8494419 8717465 8952425 9199023
55952I199023K59923K73780K86957L00938L17185L34753L52809L72424L94014
$$ 9199023 9458946 9732726 10019683 10320621 10637806 10972559 11325368 11697792 12091806
55943A2091806M15973M37636M60511M85174N10221N35647N63575N94484O26669
$$ 12091806 12507779 12945415 13405926 13891100 14401321 14936968 15500543 16095027 16721696
55934A6721696O60722P00181P46274P96606Q50577R11251R80090J054852J134562
$$ 16721696 17382418 18082599 18828873 19625479 20476056 21387307 22367397 23422249 24556811
55925B4556811J221364J315479J413791J515400J623261J738655J859783J986347
$$ 24556811 25778175 27093654 28507445 30022845 31646106 33384761 35244544 37230891
55917C7230891K117483K243576K349814K432026K501022K568486K638686K718315
$$ 37230891 39348374 41591950 43941764 46373790 48874812 51443298 54081984 56800299
55909E6800299K822542K963460L141830L357473L618138L930600M293732M709812
$$ 56800299 59622841 62586301 65728131 69085604 72703742 76634342 80928074 85637886
55901H5637886N193134N758375O410714P157113Q016166R007020J0142789J1448932
$$ 85637886 90831020 96589395 103000109 110157222 118173388 127180408 137323197 148772129
55893A48772129J2973594J4759475J6809242J9081964K1490761K3856954K5843689
$$ 148772129 161745723 176505198 193314440 212396404 233887165 257744119 283587808
55886B83587808K6923511K6405723K3572076J8000928R997410P66336p994559
$$ 283587808 310511319 336917042 360489118 378490046 388487456 389253792 381259233
55879C81259233j4891108j9394213k1764275k2570835k2318260k1376097k0036203
$$ 381259233 366368125 346973912 325209637 302638802 280320542 258944445 238908242
55872B38908242j8522535j6978203j5491808j4129017j2927788j1889080j0995450
$$ 238908242 220385707 203407504 187915696 173786679 160858891 148969811 137974361
55865A37974361j0229664r567292q969246q397275p829725p256531o671747o079702
$$ 137974361 127744697 118177405 109208159 100810884 92981159 85724628 79052881 72973179
55857G2973179n497664m943220m425536l952677l535927l179211k872755k604119
$$ 72973179 67475515 62532295 58106759 54154082 50618155 47438944 44566189 41962070
55849D1962070k368464k163178j981411j818235j676339j558548j459862j372118
$$ 41962070 39593606 37430428 35449017 33630782 31954443 30395895 28936033 27563915
55841B7563915j291169j214692j138853j062607r90402r25614q65819q08577p56596
$$ 27563915 26272746 25058054 23919201 22856594 21866192 20940578 20074759 19266182 18509586
55832A8509586p12368o72674o33523n96231n63613n34260n05579m78888m56412
$$ 18509586 17797218 17124544 16491021 15894790 15331177 14796917 14291338 13812450 13356038
55823A3356038m36153m14609l92146l71518l53351l36844l22612l11075l00231
$$ 13356038 12919885 12505276 12113130 11741612 11388261 11051417 10728805 10417730 10117499
55814A0117499k88430k77107k67703k58383k47230k36134k27870k21512k14368
$$ 10117499 9829069 9551962 9284259 9025876 8778646 8542512 8314642 8093130 7878762
55805G878762k06437j99317j92439j84094j74956j67138j60820j54911j50019
$$ 7878762 7672325 7473008 7280569 7096475 6921519 6754381 6593561 6438650 6288631
55796F288631j47555j46526j44115j39167j32774j25899j18700j11731j05718
$$ 6288631 6141076 5994550 5850435 5711268 5578494 5452595 5333895 5222164 5116446
55787E116446j00382r5024q9838q5317q1069p6528p2004o7808o3223n7697n2223
$$ 5116446 5016064 4921040 4831202 4745885 4664816 4588288 4516284 4448476 4385253 4327556 4275333
55776D275333m8288m6144m5055m4398m3751m2867m2225m2659m3958m4967m5236
$$ 4275333 4227045 4180901 4135846 4091448 4047697 4004830 3962605 3919946 3875988 3831021 3785785
55765C785785m5013m3694m0482l6900l6092l8770m2177m3812m3615m1874l8088
$$ 3785785 3740772 3697078 3656596 3619696 3583604 3544834 3502657 3458845 3415230 3373356 3335268
55754C335268l3437l1071l1920l2947l1677k9662k9081k8763k6654k3790k2375
$$ 3335268 3301831 3270760 3238840 3205893 3174216 3144554 3115473 3086710 3060056 3036266 3013891
55743C013891k1724j9677j6736j5399j6085j6928j7181j7914j9499k1032k2143
$$ 3013891 2992167 2972490 2955754 2940355 2924270 2907342 2890161 2872247 2852748 2831716 2809573
55732B809573k3120k3430k2261k0344j9168j8633j7658j6720j7425j9415k0087
$$ 2809573 2786453 2763023 2740762 2720418 2701250 2682617 2664959 2648239 2630814 2611399 2591312
55721B591312j8027j4872j3070j3333j4874j6845j8726k0189k1188k1862k2140
$$ 2591312 2573285 2558413 2545343 2532010 2517136 2500291 2481565 2461376 2440188 2418326 2396186
55710B396186k1944k1566k1375k1314k1102k0593j9531j7620j5523j4979j6895
$$ 2396186 2374242 2352676 2331301 2309987 2288885 2268292 2248761 2231141 2215618 2200639 2183744
55699B183744j9834k1352k0702j9339j9023k0069k1316k1377k0000j8286j7124
$$ 2183744 2163910 2142558 2121856 2102517 2083494 2063425 2042109 2020732 2000732 1982446 1965322
55688A965322j5663j2358p595l924l213m758o688p983q477q226p739p687p591
$$ 1965322 1949659 1937301 1929706 1925782 1922569 1917811 1911123 1903140 1894663 1886437 1878698 1871011 1863420
55675A863420o099l324j519k328m607o036n823m734l683l417m467o213o954o032
$$ 1863420 1857321 1853997 1852478 1850150 1845543 1839507 1833684 1828950 1825267 1821850 1817383 1811170 1804216 1798184
55661A798184m812m719n402n825n891n876n632n404o084p432p548n500l022k089
$$ 1798184 1793372 1788653 1783251 1777426 1771535 1765659 1760027 1754623 1748539 1741107 1733559 1728059 1725037 1722948
55647A722948k240j887q94q9L96N79k33j988l037k568k323l702m753k909O04K162
$$ 1722948 1720708 1718821 1717927 1717838 1718234 1718813 1718580 1716592 1713555 1710987 1708664 1704962 1700209 1697300 1697904 1700066
55631A700066Q70p30q13j59K14N02P54L80m25p33p19j424k474k164k63J268J001
$$ 1700066 1700936 1700206 1699393 1699234 1699448 1699950 1700704 1701084 1700659 1699926 1699207 1697783 1695309 1693145 1692882 1694150 1695151
55614A695151l52j648k928m430n608o000n923n577m498k596p83P4J64K43O90J180
$$ 1695151 1694799 1693151 1690223 1685793 1680185 1674185 1668262 1662685 1658187 1655591 1654808 1654882 1655046 1655289 1655979 1657159
55598A657159R09o75k910m198l993l752m838o282o045l960j751o49o74j868m288
$$ 1657159 1658068 1657393 1654483 1650285 1646292 1642540 1637702 1631420 1625375 1621415 1619664 1619015 1618341 1616473 1612185
55583A612185o844q061q121q426r153r148q456q748j0608j2395j2646j2054j1952
$$ 1612185 1605341 1597280 1589159 1580733 1571580 1562432 1553976 1545228 1534620 1522225 1509579 1497525 1485573
55570A485573j2331j2336j1724j0767r569q276p407p309p812q623r524j0085r927
$$ 1485573 1473242 1460906 1449182 1438415 1428846 1420570 1413163 1405854 1398042 1389419 1379895 1369810 1359883
55557A359883r301q641p768o430n256m937m830l866k563k369l085l031j954j559
$$ 1359883 1350582 1341941 1334173 1327743 1322487 1317550 1312720 1308854 1306291 1303922 1300837 1297806 1295852 1294293
55543A294293k482l031k067j095j851l455l849k948k465l147l991m055l510k791
$$ 1294293 1291811 1288780 1286713 1285618 1283767 1280312 1276463 1273515 1271050 1267903 1263912 1259857 1256347 1253556
55529A253556j827n64N01P50K22l53l51j41p58k377l589k902p07J198J861J899
$$ 1253556 1251729 1251165 1251666 1252416 1252638 1252285 1251934 1251793 1251035 1248658 1245069 1242167 1241460 1242658 1244519 1246418
55513A246418K085K447K983M023N463O682P617Q791R879R470P013L894J685K00
$$ 1246418 1248503 1250950 1253933 1257956 1263419 1270101 1277718 1286509 1296388 1305858 1312871 1316765 1318450 1318650
55499A318650j686l964n416n431m904n182o532p939q313p781p489p979q423p903
$$ 1318650 1316964 1313000 1307584 1302153 1297249 1292067 1285535 1277596 1269283 1261502 1254013 1246034 1237611 1229708
55485A229708o796o047n612m821l855l489l573l187k263j558j093k78K97p89l145
$$ 1229708 1222912 1216865 1211253 1206432 1202577 1199088 1195515 1192328 1190065 1188507 1187414 1187136 1187433 1186644 1183499
55470A183499m263k849p17q0n69l74R21K246K866K776J953O51j43J76O67K4j538
$$ 1183499 1179236 1176387 1175670 1175590 1175021 1174647 1175568 1177814 1180680 1183456 1185409 1186060 1185917 1186093 1186760 1186784 1185246
55453A185246k807l594m763o425p466p224o529o586p573q656q948q182o759n431
$$ 1185246 1182439 1178845 1174082 1167657 1160191 1152967 1146438 1139852 1132279 1123623 1114675 1106493 1099734 1094303
55439A094303m726m641m846n113n415n811o327o722o413n059l273k278k673l865
$$ 1094303 1089577 1084936 1080090 1074977 1069562 1063751 1057424 1050702 1044289 1039230 1035957 1033679 1031006 1027141
55425A027141m825n029m666m259m111l795k590r18n99k604n031m978k414m35j239
$$ 1027141 1022316 1017287 1012621 1008362 1004251 1000456 997866 996948 996349 993745 988714 983736 981322 980887 979648
55410I79648l515m574l537j406O50J710J001j178l050l192k285j956k457k694
$$ 979648 976133 971559 968022 966616 967266 968976 969977 968799 965749 962557 960272 958316 955859 953165
55396I53165k092j213o88o20r52j593k163k257j874j174k00O89O91m17j659j912
$$ 953165 951073 949860 949172 948552 947600 946007 943844 941587 939713 938539 938339 939028 939719 939302 937643 935731
55380I35731j263o00m56q96j855k783k638j305l17r67k297k393j291q71j802k422
$$ 935731 934468 933868 933412 932516 930661 927878 925240 923935 923618 922651 920354 917961 916670 915799 913997 911575
55364I11575j250P88J680Q21p59k073k868k911j708N38K316J960l94k557k454
$$ 911575 910325 911113 912793 913614 912855 910782 907914 905003 903295 903833 906149 908109 907715 905158 902704
55349I02704l79J512J761R19Q4p14j916k940k509m81J571J893K67j918l034k587
$$ 902704 902325 903837 905598 906517 906601 905887 903971 901031 898522 898041 899612 901505 901772 899854 896820 894233
55333H94233j455q51j081j566j853k080k395k626k743k943k915j908j00J008M05
$$ 894233 892778 891927 890846 889280 887427 885347 882952 880326 877583 874640 871725 869817 869717 870725 871130
55318H71130r81j607j447j520j789j093O97J920J206p32k128k422k567l387m404
$$ 871130 870149 868542 867095 865575 863786 862693 863390 865310 866516 865784 863656 861234 858667 855280 850876
55303H50876m539l545k314j708j555j147n29n71j626k720k618j276J71O67J35
$$ 850876 846337 842792 840478 838770 837215 836068 835539 834968 833342 830622 828004 826728 826899 827566 827701
55288H27701o66q67l22J56k82j255j430l31Q21P47j80n73l9M59K3j147k172k373
$$ 827701 827035 826168 825846 826002 825720 824465 823035 822704 823525 824272 824092 823519 823480 823939 823962 822815 820643 818270
55270H18270j740j021j237k622m081m190k661m81J192J824J431M02n87r91q82
$$ 818270 816530 815509 814272 811650 807569 803379 800718 800237 801429 803253 804684 805086 804499 803508 802626
55255H02626p85r79j260j334j252j351j812k324k313j703j209j386j618q27R08
$$ 802626 801841 800862 799602 798268 797016 795665 793853 791529 789216 787513 786304 784918 783300 782473 783381
55240G83381K254K261J168n52k695m421m266k089O9K66r51j646j201n40k28Q8
$$ 783381 785635 787896 789064 788512 785817 781396 777130 775041 775110 775376 774425 772779 771578 771038 770810 770898
55224G70898M83M81O9k16l53q94j788k228j889j387j254j372j712k577l632l632
$$ 770898 771381 771862 771931 771715 771362 770468 768680 766452 764563 763176 761922 760550 758838 756261 752629 748997
55208G48997j929L93J552J096K69L46J146J368L55r22j002P9O93j80j470j503
$$ 748997 747068 747461 749013 750109 750378 750724 751870 753238 753593 752671 751669 751748 752441 752261 750791 749288
55192G49288l62K59o09k047k607j950q35k7L55O37J009J089K78j336k691k750
$$ 749288 748926 749185 748576 746529 743922 741972 741137 741110 741465 742102 743111 744200 744478 743142 740451 737701
55176G37701j550m5Q14N89n36j718j939j034J82J008J493J598Q06p24j632j092
$$ 737701 736151 736106 736920 737509 736973 735255 733316 732282 732464 733472 734965 736563 737369 736645 735013 733921
55160G33921j72k09p35o32m20j315k461j620J067K489P71j939k368l82J352J045
$$ 733921 733749 733540 732805 732173 731753 730438 727977 726357 727424 729913 730684 728745 726377 725995 727347 728392
55144G28392n04j562j424o00L4%m58p35o32n14n96n43l7P03J265J438J112K67
$$ 728392 727888 726326 724902 724302 724336 724336 723878 723143 722511 721997 721401 720858 720821 721524 722789 724227 725339 725606
55126G25606o48r99r33j406k770l936l702k371j336j369k028k620k903k858k490
$$ 725606 724958 723959 723026 721620 718850 714914 711212 708841 707505 706136 704108 701488 698585 695727 693237
55111F93237k066k015k295k261j395P0J438K179K051R79o04j655j420m83j06m06
$$ 693237 691171 689156 686861 684600 683205 683275 684713 686892 688943 689922 689318 687663 686243 685760 685654 685248
55095F85248j49J105J765K76k445m061l798k800j828o41K96k31j737j814L91K526
$$ 685248 685099 686204 687969 688245 685800 681739 677941 675141 673313 672672 672968 672737 671000 669186 669577 672103
55079F72103K441J262J038J091n09l027l659j835q8l43j696k372j842l93J511
$$ 672103 674544 675806 676844 677935 677426 674399 670740 668905 668817 668474 666778 664406 662564 662171 663682
55064F63682K831K540J153K26J27on8J142L231M051K899J820K317K997K177Q93
$$ 663682 666513 669053 670206 670432 670559 670553 670495 671637 674868 678919 681818 683638 685955 688952 691129 692022
55048F92022J067K004J264j496l726l185m29K169K729J128j241k738k821k182
$$ 692022 693089 695093 696357 694861 691135 687950 687521 689690 692419 693547 692306 689568 686747 684565
55034F84565j564j092q54j071j289n12J194K279J750N79J74L93J89o64j576k174
$$ 684565 683001 681909 681055 679984 678695 678183 679377 681656 683406 683985 684159 684552 684741 684077 682501 680327
55018F80327k256j415K20J520J693J378J404J327M79l83j15O66K52j525k959k913
$$ 680327 678071 676656 676876 678396 680089 681467 682871 684198 684677 684294 684179 684845 685097 683572 680613 677700
55002F77700k087j545j250o63J53O35M79j16p07j079j505k272k817k118l26R12
$$ 677700 675613 674068 672818 672155 672308 672943 673422 673306 672599 671520 670015 667743 664926 662808 662482 663394
54986F63394N05n95r64p55r63j375r77R3O44L31o8k55p00j199q12M58J405J423
$$ 663394 663899 663304 662340 661585 660622 659247 658270 658363 659007 659338 659270 659015 658315 657116 656304 656762 658167 659590
54968F59590J198J087K79j612l342l456k090m91N37J010J184J331J700K021J514
$$ 659590 660788 661875 662154 660542 657200 653744 651654 651163 651700 652710 653894 655225 656925 658946 660460
54953F60460q4j891k741k347j288k18M83P18P22Q29J028J059J013J302J852J987
$$ 660460 660376 658485 655744 653397 652109 651891 652374 653092 653814 654643 655671 656730 657743 659045 660897 662884
54937F62884J387O06K54K22L7m68j180j911k300k064j556j471j701j283N9J157
$$ 662884 664271 664877 665131 665353 665390 664922 663742 661831 659531 657467 655911 654440 652739 651456 651515 652672
54921F52672R36n1n09k22O1J62O17J333J354L09q17r25r7Q34J450J881K170K178
$$ 652672 653608 653557 653048 652826 652887 653049 653666 654999 656353 656662 655845 654920 654823 655657 657107 658988 661158 663336
54903F63336J969J844J926K078K179K233K289K553L438N071O797P665P516P173
$$ 663336 665305 667149 669075 671153 673332 675565 677854 680407 683845 688916 695713 703378 710894 718067
54889G18067P395Q134R021J0007J1020J1480J0863R473Q004O547M703K595Q47
$$ 718067 725462 733596 742617 752624 763644 775124 785987 795460 803464 810011 814714 817309 818156
54876H18156n68k535n529q804j1222j2320j2213j1110r415p809o753o241o301
$$ 818156 817588 815053 809524 800720 789498 777178 764965 753855 744440 736631 729878 723637 717336
54863G17336p051p926p713o042m175l487l698l487k403j210n99m61k15Q45L246
$$ 717336 710285 702359 694646 688604 684429 680942 677244 673757 671354 670144 669545 669084 668869 669714 672960
54848F72960O485Q876R231Q433Q397R575J0656J0531R296P331M859K713J933J950
$$ 672960 679445 688321 697552 705985 714382 723957 734613 745144 754440 761771 766630 769343 771276 773226
54834G73226N24l393p781r765q996p650p503q300q947r084r039q962q592p667
$$ 773226 773750 770357 762576 752811 743815 736165 728662 720362 711415 702331 693292 684330 675738 668071
54820F68071o261m801l795l576m149n261o377o773o040m686l794l863m222l900
$$ 668071 661810 657009 653214 649638 645489 640228 633851 627078 621038 616352 612558 608695 604473 600573
54806F00573k784j594r85r38j023q80m98k24m47j161j778j523r2J880K976K029
$$ 600573 597789 596195 595210 594272 593249 592369 591871 591647 591200 590039 588261 586738 586646 588526 591502 593531
54790E93531n75k807k886j260q1o14j984k774k887k955k661j067J441K892K006
$$ 593531 592956 590149 587263 586003 585922 585308 583324 580550 577663 574708 572047 570980 572421 575313 577319
54775E77319j38j541j730j887k621k887j592M89J350J96j586k119j044O13K040
$$ 577319 577181 575640 573910 572023 569402 566515 564923 565412 566762 566958 565372 563253 562209 562822 564862
54760E64862L237M150M154K919J283M67N54M67k97o80N52K811M097L580K747L415
$$ 564862 568099 572249 576403 579322 580605 581072 581626 582093 581796 581116 581668 584479 588576 592156 594903 598318
54744E98318N287O455O006N051N010N922O786O876O230N440N366O532Q392R705
$$ 598318 603605 610060 616066 621117 626127 632049 638835 645711 651941 657381 662747 669279 677671 687376
54730F87376J0020J0172J0782J1070R967P806N920M785L595J615r22l337n125
$$ 687376 697396 707568 718350 729420 739387 747193 753113 757898 761493 763108 762186 758849 753724
54717G53724n948n713m895m297m363m984n876o579o329m692k390q38p26j554k511
$$ 753724 747776 742063 737168 732871 728508 723524 717648 711069 704740 700048 697658 696820 696094 694540 692029
54702F92029l067k729j095J384L443M295M451M822N481N790N542N500O643R074
$$ 692029 688962 686233 685138 686522 689965 694260 698711 703533 709014 714804 720346 725846 732489 741563
54688G41563J1711J3215J3367J3173J3480J3825J3151J1242Q735N963K754o27
$$ 741563 753274 766489 779856 793029 806509 820334 833485 844727 853462 859425 862179 861552
54676H61552l262m656n400o517q595j1547j4566j6368j6272j5173j4635j4910
$$ 861552 858290 853634 848234 841717 833122 821575 807009 790641 774369 759196 744561 729651
54664G29651j4835j3809j2622j1844j0654q253n490l989m135m921n386n281m692
$$ 729651 714816 701007 688385 676541 665887 657634 652144 648155 644020 639099 633713 628432 623740
54651F23740l953l718m258m838m629m025m062m639m382k578l05Q46N36l80j188
$$ 623740 619787 616069 611811 606973 602344 598319 594257 589618 585236 582658 582353 583199 583735 583355 582167
54636E82167j825k302k307j648p54l85p87j317j040L14K097L369L698L307K681
$$ 582167 580342 578040 575733 574085 573331 572946 572159 570842 569802 570116 572213 575582 579280 582587 585268
54621E85268K079J374L88o00q99k28P07R00K82j71L65J664K869L376L218K971
$$ 585268 587347 588721 589109 588509 587610 587382 588089 588989 589271 589100 589465 591129 593998 597374 600592 603563
54605F03563L364M555N657N610M637M144M766N312M402K403R12O78J069J487K096
$$ 603563 606927 611482 617139 622749 627386 631530 636296 641608 646010 648413 649325 650003 651072 652559 654655
54590F54655K909L234K753K413L309M986N824N185M310M705O302P918Q997J0069
$$ 654655 657564 660798 663551 665964 669273 674259 680083 685268 689578 694283 700585 708503 717500 727569
54576G27569J1535J2923J3635J3737J3619J3423J3159J2854J2121J0196O901L080
$$ 727569 739104 752027 765662 779399 793018 806441 819600 832454 844575 854771 861672 864752
54564H64752m96l951p414j0164j1719j3075j5314j7476j7421j4853j1807r921
$$ 864752 864256 860305 852891 842727 831008 817933 802619 785143 767722 752869 741062 731141
54552G31141q936q288q394r349r919r200q143q074q556q169o778n537m953m344
$$ 731141 722205 713917 705523 696174 686255 677055 668912 660838 652282 644113 637335 631798 626845 622501
54538F22501l346k710l222m611n816n974n066l929l496l900m433m564m482m457
$$ 622501 619155 616445 613223 608612 602796 596822 591756 587827 584331 580431 575998 571434 566952 562495
54524E62495m299l870l482l297l078k917l368m186m041k419q06o91j415j543j547
$$ 562495 558196 554326 550844 547547 544469 541552 538184 533998 529957 527538 526732 526041 524626 523083 521536
54509E21536l137o112p916o756l594o53P30M97m64n64J104L191L237J039o87j
$$ 521536 518399 512287 504371 497615 494021 493368 494098 494595 494131 493567 494671 497862 501099 502138 501451 501450
54493E01450J492J035j277k788k028k50Q61J318J994K953L492L276K605J857J280
$$ 501450 502942 503977 502700 499912 497884 497634 498495 499813 501807 504760 508252 511528 514133 515990 517270
54478E17270J154J590K175K354K252K672L914N008M732L290K325L038M896O462
$$ 517270 518424 520014 522189 524543 526795 529467 533381 538389 543121 546411 548736 551774 556670 563132
54464E63132O975O595N654M446L585L582M006L673K039p8j432j747j967l168n325
$$ 563132 570107 576702 582356 586802 590387 593969 597975 601648 603687 603609 602177 600430 598463 595295 589970
54449E89970p141p369o402o070p485r523j0089q496n859l508j911j090j026j471
$$ 589970 582829 575460 569058 562988 555503 545980 535891 527395 521536 518028 516117 515027 514001 512530
54435E12530k074k837l714l964k900j290p18j294j294L07K210K548J172p63k482
$$ 512530 510456 507619 503905 499941 497041 495751 495033 493739 492445 492752 494962 497510 498682 497919 495437
54420D95437l605l437j681M66J391J014N48N54O07O63J184J797J416K11j23J133
$$ 495437 491832 488395 486714 487180 488571 489585 490133 490687 491294 491957 493141 494938 496354 496565 496442 497575
54404D97575K336J759J23m82M88J649J768R48j45r85j116n04J6l40r52o88r3j020
$$ 497575 499911 501670 501793 501311 501799 503448 505216 506164 506019 505034 503918 503414 503430 503090 502138 501450 501357 500337
54386E00337l520m944l420q36n40k889n048m868l090j487o90n42j092k181k929
$$ 500337 496817 491873 488453 487617 487077 484188 479140 474272 471182 469695 469005 468463 467371 465190 462261
54371D62261k569j354r7O43N98j35o95q6J284J685M48q53n53Q03J582J602J888
$$ 462261 459692 458338 458241 458884 459482 459347 458652 458566 459850 461535 461983 461130 460577 461380 462962 464564 466452
54354D66452K492K243P82o38p06O48K571L878L470J422l88n3J862K979K427J829
$$ 466452 468944 471187 471969 471331 470625 471273 473844 477722 481192 482614 482226 482173 484035 487014 489441 491270
54338D91270K502L439L140J916J101J007J087J237J642J923J694J332J078J46
$$ 491270 493772 497211 500351 502267 503368 504375 505462 506699 508341 510264 511958 513290 514368 514514
54324E14514j881l476k775n15N27q58k900l430k339r56l94j175l179n123n213
$$ 514514 512633 509157 506382 505867 506394 505536 502636 499206 496867 495911 495517 494342 491163 486040 480827
54309D80827l231j095n05r81j101o11j09M57J430K173J722M44m68q97j638k416
$$ 480827 477596 476501 475996 475015 473914 473303 473194 473651 475081 477254 478976 479420 478952 478055 476417 474001
54293D74001j927k72N95k97j236k71J925L102K398Q23n68j386j290k29Q07P92
$$ 474001 472074 471802 472397 472100 470864 470593 472518 475620 478018 478841 478273 476887 475597 475368 476175 476967
54277D76967M20J325L378M364K971O92k19L72P23l79k471m309m988m309k769j253
$$ 476967 477387 478712 482090 486454 489425 490117 489898 490270 490993 490614 488143 483834 478846 474537 471768 470515
54261D70515l83j55k93o26j104j885l400n614p193o450l603j131j127l091n032
$$ 470515 470132 469977 469684 469058 467954 466069 462669 457055 449862 443412 439809 438678 437551 434460 429428
54246D29428n908n958n423m309l055k198j500m45M41K6j533k477j550L34J125
$$ 429428 423520 417562 412139 407830 404775 402577 401077 400632 401073 401099 399566 397089 395539 395873 396998
54231C96998q4k101k882j598M37J094j54j639j695p01k08o14r15m97Q5K94M31
$$ 396998 396914 394813 391931 390333 390770 391864 391710 390071 388376 387675 387467 386853 385938 385441 385526 385820 386251
54214C86251Q50J189Q70j21j163j411l05J744L259L014J471L04M92J563K513K722
$$ 386251 387101 388290 389160 389039 387876 386465 386160 387904 391163 394177 395648 395952 396444 398007 400520 403242
54198D03242J999P12j52L3N22J75p18q48j85k88j830l383l496k586j742r12L70
$$ 403242 405241 405953 405801 405834 406356 406531 405813 404965 404780 404492 402662 399279 395783 393197 391455 390543 390913
54181C90913J407J173J85JQ58J278L02j038j143k8P47J18j178j594p19L52O34
$$ 390913 392320 393493 393678 393679 394537 395815 396117 395079 393936 393908 394655 394773 393595 392001 391282 391634 392268
54164C92268M57O27J032J066R61J458K234K076Q58%M36J280J256L34q04j936l004
$$ 392268 392725 393352 394384 395450 396411 397869 400103 402179 403037 403037 403473 404753 406009 406343 405539 403603 400599
54147D00599l432k831j736r36n97o49j170j719j307K9P39j18j310j345q18j129
$$ 400599 397167 394336 392600 391664 391067 390418 389248 387529 386222 386251 386990 386872 385562 384217 383399 382270
54131C82270j831j240O91K275K674K530J958K42j973k397k62K034J932N4j000
$$ 382270 380439 379199 379890 382165 384839 387369 389327 389569 387596 385199 384937 386971 388903 388957 387957
54116C87957k39R23R46k40j849l146l571k892j568n16k37n23r02j086r98p45m87
$$ 387957 387718 388641 389587 389347 387498 384352 380781 377889 376321 375805 375568 375045 374143 373057 372059 371314 370827
54099C70827j79M46J350J915J565M66o98j490j846j686r68j82j13r52k074k965
$$ 370827 370648 371094 372444 374359 375924 376390 375692 374202 372356 370670 369702 369520 369407 368455 366381 363416
54083C63416l821m743m860l175l02J615J221m90j517j150j59Q14J859K787K805
$$ 363416 359595 354852 349992 346817 346515 348130 349351 348861 347344 346194 346035 346849 348708 351495 354300
54068C54300J633J45p53j112j293j079k46N71M93l91j218j526j465j094l01N53
$$ 354300 355933 356078 355325 354213 352920 351841 351595 352166 352659 352268 351050 349524 348059 346965 346664 347217
54052C47217P97L51j70l72n14q55j189j179p64k0R16J679J793J166J90p10j373
$$ 347217 348014 348365 348195 347823 347309 346454 345265 344086 343322 343302 344218 345897 347690 348856 349046 348336 346963
54035C46963j744j738j334n67M50J290J237P1j198j053Q36K968L384J562j144
$$ 346963 345219 343481 342147 341580 342030 343320 344557 344628 343430 342377 343213 346181 349565 351127 349983
54020C49983k878k994k350j967j700o66J192K837L538L689L773L395K136N86m27
$$ 349983 347105 344111 341761 339794 338094 337428 338620 341457 344995 348684 352457 355852 357988 358574 358147
54005C58147j043j748k083j174P10K327K996K831J785q8j524q79J500L296L129
$$ 358147 357104 355356 353273 352099 352809 355136 358132 360963 362748 362660 361136 360257 361757 365053 368182
53990C68182K118J847K197K222J955K043K360K273J871J835K282K708K872L035
$$ 368182 370300 372147 374344 376566 378521 380564 382924 385197 387068 388903 391185 393893 396765 399800
53976C99800L477M366N725O959O893N167L178K784M270O310P717Q179P615O062
$$ 399800 403277 407643 413368 420327 427220 432387 435565 438349 442619 448929 456646 464825 472440 478502
53962D78502M378L921M939O142O325N689M908L792J810l86j254k75J297K061K031
$$ 478502 482880 486801 491740 497882 504207 509896 514804 518596 520406 520020 518766 518491 519788 521849 523880
53947E23880J928J525j49l040n568o349n738n019m715m399l787l111k551k132
$$ 523880 525808 527333 527184 524144 518576 512227 506489 501470 496755 492356 488569 485458 482907 480775
53933D80775k175k983m040m332l742l250l397l335k114k13R17O03l91r38p81p12
$$ 480775 478600 475617 471577 467245 463503 460253 456856 453521 451407 451194 452111 452714 452323 451385 450604 449892
53917D49892j640l375m473l733j808n50o34p59K66J682J947J023K33J54M8n54
$$ 449892 448252 444877 440404 436671 434863 434313 433679 432920 433186 434868 436815 437838 438071 438225 438273 437719
53901D37719r07k61Q95J462J159O70P31J461K483L245L335K803K166J877J782
$$ 437719 436812 436551 437446 438908 440067 440737 441468 442929 445412 448657 451992 454795 456961 458838 460620
53886D60620J284P3j389k172j648j0J792K757K670K377L059M943O836P293O299
$$ 460620 461904 461977 460588 458416 456768 456758 458550 461307 463977 466354 469413 474356 481192 488485 494784
53871D94784N362N699O754P035N994M464L406K960K827K769K461J610O43O49K010
$$ 494784 500146 505845 512599 519634 525628 530092 533498 536458 539285 542054 544515 546125 546768 547417 549427
53856E49427L530L672K451J382J617K746L626L810L824M237M935N378N332N022
$$ 549427 552957 556629 559080 560462 562079 564825 568451 572261 576085 580322 585257 590635 595967 600989
53842F00989M554L669K376J473J647K272J843j0j808k023j073q05k283m724o579
$$ 600989 605543 609212 611588 613061 614708 616980 618823 618813 617005 614982 613909 613104 610821 606097 599518
53827E99518p059o569o089o347p262q050p922o814n427m565m465m680m732m803
$$ 599518 592459 585890 579801 573454 566192 558142 550220 543406 537979 533414 528949 524269 519537 514734
53813E14734n564p105q437q565p776p163p002o552n420m181l323k712k515l516
$$ 514734 509170 502065 493628 485063 477287 470124 463122 456570 451150 446969 443646 440934 438419 434903
53799D34903n605o950n957l430j613j394j752j718j664k304l509m577m939m376
$$ 434903 429298 422348 416391 412961 411348 409954 408202 406484 404820 402516 399007 394430 389491 385115
53785C85115l086j808j231j191r03j65L77L07J16M29J013J046J38j141j695r67
$$ 385115 382029 380221 378990 377799 376896 376731 377108 377415 377531 377960 378973 380019 380157 379016 377321 376354
53769C76354L11P51J0n46K92J617J392o20k319k002m44N09L47lK58J189K594M096
$$ 376354 376665 377416 377426 376880 377172 378789 380181 379561 377242 375240 374796 375305 375652 375649 375907 377096 379690 383786
53751C83786M958M711L860L245L033K962L211L884L971K245n39j868n87J470K084
$$ 383786 388744 393455 397315 400560 403593 406555 409766 413650 417621 419866 419327 417459 416872 418342 420426
53736D20426J786K832N534P587P252N565M503M345M108L663L898M866N224L826
$$ 420426 422212 425044 430578 438165 445417 450982 455485 459830 463938 467601 471499 476365 481589 485415
53722D85415J072j569k721j758P17K820K734O93j147j313n93m29p84p32m27r38
$$ 485415 486487 484918 482197 480439 481156 483976 486710 487403 486256 484943 484350 483921 483137 482405 481978 481040
53706D81040k318l331l288k803k382j539j32N52o97k923l736k205q5K96j370l348
$$ 481040 478722 475391 472103 469300 466918 465379 465247 465799 465102 462179 458443 456238 456153 456449 455079 451731
53690D51731m019l375k419j728j057o4J055J779J720P79p74k188k588j799o75
$$ 451731 447712 444337 441918 440190 439133 439069 440124 441903 443623 444402 443628 441440 438852 437053 436378
53675D36378l44j149k478l333k928j199Q49J692P33r82j970j888j422r82m19J78
$$ 436378 436034 434885 432407 429074 426146 424947 425796 427488 428221 427239 425269 423381 421959 420977 420558 420736
53659D20736L24q2o95j491k678l592k760J52L322M532L563K075J451J671K073
$$ 420736 421060 420978 420283 418792 416114 412522 409762 409914 413236 417768 421331 423406 424857 426528 428601
53644D28601K321K365K152J698J240J041J286K118L410M415M093K192j23j106
$$ 428601 430922 433287 435439 437137 438377 439418 440704 442822 446232 450647 454740 456932 456809 455703
53630D55703k4K247M176M966M970M999N438N962N862M719K903J364O79M62J02
$$ 455703 455679 457926 462102 467068 472038 477037 482475 488437 494299 499018 501921 503285 503964 504426 504528
53615E04528q7O54J955K175N37j496j896n90Q21J333J361J336R43R1n67o86q46
$$ 504528 504441 505095 507050 509225 509762 508266 506370 505780 506601 507934 509295 510631 511574 511665 511098 510412 509566
53598E09566j465j954j733j303j446j837j439n8J362J943J627P80k35r67r50k16
$$ 509566 508101 506147 504414 503111 501665 499828 498389 498331 499693 501636 503263 504043 503808 502841 501891 501675
53582E01675O04J041J416K443M081N176M563K555Q13M03O40M27K00J231L221M083
$$ 501675 502279 503320 504736 507179 511260 516436 520999 523554 524367 524770 525410 525837 526037 527268 530489 534572
53566E34572K826J185J386L226M593M301L150K459K635L182L273K393J127R34
$$ 534572 537398 538583 539969 543195 547788 552089 555239 557698 560333 563515 566788 569181 570308 571242
53552E71242K354L836L504J827J110K424M437N645O197O770P008O271N032M264
$$ 571242 573596 577432 580936 582763 583873 586297 590734 596379 602576 609346 616354 622625 627657 631921
53538F31921M009L695L569M518O455P985P989O819N620N143N539O580P500P166
$$ 631921 635930 639625 643194 647712 654167 662152 670141 676960 682580 687723 693262 699842 707342 714508
53524G14508N310L384L207M597N276L665R93l14K25R71R24J023K159L404L411
$$ 714508 719818 723202 726409 731006 736282 739947 740940 740626 740851 741822 742746 743769 745928 749332 752743
53509G52743K503J914J770J320O76N96Q20M61m0O29K012J927n3j452n67R41R04
$$ 752743 755246 757160 758930 760250 760926 761522 762342 762803 762763 763392 765404 767331 767278 765826 765259 766200 767104
53492G67104K42J135L041L527K441K195L684M947M595L851L978M079L176K461
$$ 767104 767346 768481 771522 775049 777490 779685 783369 788316 792911 796762 800740 804819 807995 810456
53478H10456L399M963N083L985L918N848Q394J0048J0675J0624J0064R709J0709
$$ 810456 813855 818818 823901 827886 831804 837652 846046 856094 866769 877393 887457 897166 907875
53465I07875J2942J4570J4142J2469J1574J2315J3845J5118J6067J7201J8591
$$ 907875 920817 935387 949529 961998 973572 985887 999732 1014850 1030917 1048118 1066709
53454A066709J9604J9551J8443J7053J6350J7039J9367K2800K5839K7047K6641
$$ 1066709 1086313 1105864 1124307 1141360 1157710 1174749 1194116 1216916 1242755 1269802 1296443
53443A296443K6372K7233K8212K8206K8122K9485L1655L2413L1390L0833L2346
$$ 1296443 1322815 1350048 1378260 1406466 1434588 1464073 1495728 1528141 1559531 1590364 1622710
53432A622710L4764L6170L6374L6124L5363L3897L2788L3221L4508L4899L4014
$$ 1622710 1657474 1693644 1730018 1766142 1801505 1835402 1868190 1901411 1935919 1970818 2004832
53421B004832L2924L2039L0719K9084K8503K9652L1338L1913L0967K9059K6842
$$ 2004832 2037756 2069795 2100514 2129598 2158101 2187753 2219091 2251004 2281971 2311030 2337872
53410B337872K5035K4316K4442K4079K2400K0351J9473J9721J9322J6941J3342
$$ 2337872 2362907 2387223 2411665 2435744 2458144 2478495 2497968 2517689 2537011 2553952 2567294
53399B567294J0460R161Q275O182K934K12j015j907m129p478j0293j1845j2931
$$ 2567294 2577754 2586915 2595190 2601372 2604306 2604518 2603503 2601596 2597467 2589989 2579696 2567851 2554920
53386B554920j4020j4485j4273j4835j7242k0418k2540k3460k4379k5545k5872
$$ 2554920 2540900 2526415 2512142 2497307 2480065 2459647 2437107 2413647 2389268 2363723 2337851
53375B337851k4842k3356k2328k1610k0741j9837j9056j8039j6553j5132j4257
$$ 2337851 2313009 2289653 2267325 2245715 2224974 2205137 2186081 2168042 2151489 2136357 2122100
53364B122100j3390j1725r687q589q623q273o249l302j179k53P48K694M943O684
$$ 2122100 2108710 2096985 2087298 2078709 2070086 2061813 2055564 2052262 2051083 2050830 2051578 2054272 2059215 2065899
53350B065899Q352J0828J3983J6902J9170K0979K2316K3260K4745K7647L0987
$$ 2065899 2074251 2085079 2099062 2115964 2135134 2156113 2178429 2201689 2226434 2254081 2285068
53339B285068L2641L2307L2337L4744L8625M1763M3644M5412M7564M9479N1061
$$ 2285068 2317709 2350016 2382353 2417097 2455722 2497485 2541129 2586541 2634105 2683584 2734645
53328B734645N3209N6326N9440O1251O1311O0099N8755N8711O0588O3222O4747
$$ 2734645 2787854 2844180 2903620 2964871 3026182 3086281 3145036 3203747 3264335 3327557 3392304
53317C392304O4751O4374O4227O3476O1590N9597N8624N8070N6435N3355M9729
$$ 3392304 3457055 3521429 3585656 3649132 3710722 3770319 3828943 3887013 3943448 3996803 4046532
53306D046532M6118M2181L7610L2722K7960K3542J9648J6308J2956Q649L024l379
$$ 4046532 4092650 4134831 4172441 4205163 4233123 4256665 4276313 4292621 4305577 4314226 4317250 4313871
53294D313871r866j6270k2660k8675l3468l6424l7872l9020m1020m4050m7407
$$ 4313871 4304005 4287735 4265075 4236400 4202932 4166508 4128636 4089616 4048596 4004546 3957139
53283C957139n0419n2869n4533n4989n4346n3602n3616n4054n3993n3293n2671
$$ 3957139 3906720 3853851 3799318 3744329 3689983 3636381 3582765 3528711 3474718 3421425 3368754
53272C368754n2556n2618n2407n1876n1094n0077m8956m7771m6176m3843m1178
$$ 3368754 3316198 3263580 3211173 3159297 3108203 3058126 3009170 2961399 2915223 2871380 2830202
53261B830202l8980l7403l5906l4217l2507l0682k8509k6603k5994k6337k5934
$$ 2830202 2791222 2753819 2717913 2683696 2651189 2620507 2591998 2565395 2539401 2513064 2487130
53250B487130k4165k2629k2678k3024k1325j7395j3310j0768r937j0474j1820
$$ 2487130 2462965 2440336 2417658 2394634 2373309 2355914 2342604 2331836 2321899 2311425 2299605
53239B299605j2495j0893p350m006k174j173j82N07Q63K062M734P480Q677Q889
$$ 2299605 2287110 2276217 2268867 2264861 2262687 2261514 2261332 2261839 2262702 2264764 2269498 2276978 2285655 2294544
53225B294544J0036J2727J5891J8626K0974K2923K4052K4286K4052K3651K3308
$$ 2294544 2304580 2317307 2333198 2351824 2372798 2395721 2419773 2444059 2468111 2491762 2515070
53214B515070K3591K4668K5300K3852K0363J6564J3656J1440R696Q949R125Q703
$$ 2515070 2538661 2563329 2588629 2612481 2632844 2649408 2663064 2674504 2684200 2693149 2702274 2710977
53202B710977O390K816l42k393l875n285o629q138j0471j3885j7639k0508k1977
$$ 2710977 2717367 2720183 2719841 2717448 2713573 2708288 2701659 2693521 2683050 2669165 2651526 2631018 2609041
53189B609041k2825k4341k6673k8402k8372k7541k8011l0235l2431l3086l2725
$$ 2609041 2586216 2561875 2535202 2506800 2478428 2450887 2422876 2392641 2360210 2327124 2294399
53178B294399l2500l2292l1371l0010k9150k8928k8772k8622k8912k9620l0306
$$ 2294399 2261899 2229607 2198236 2168226 2139076 2110148 2081376 2052754 2023842 1994222 1963916
53167A963916l0957l1680l1794l0291k7298k4111k1742k0385k0163k1178k2563
$$ 1963916 1932959 1901279 1869485 1839194 1811896 1787785 1766043 1745658 1725495 1704317 1681754
53156A681754k2711k1073j8859j7537j7368j7825j8551j9358j9908k0088k0071
$$ 1681754 1659043 1637970 1619111 1601574 1584206 1566381 1547830 1528472 1508564 1488476 1468405
53145A468405j9689j8413j6512j5396j6025j7557j8486j8564j8631j8939j8806
$$ 1468405 1448716 1430303 1413791 1398395 1382370 1364813 1346327 1327763 1309132 1290193 1271387
53134A271387j8063j7670j8447j9771k0129j8806j6705j5512j6083j7612j8489
$$ 1271387 1253324 1235654 1217207 1197436 1177307 1158501 1141796 1126284 1110201 1092589 1074100
53123A074100j8013j6981j6530j6831j7164j6897j5914j4499j3383j3486j4832
$$ 1074100 1056087 1039106 1022576 1005745 988581 971684 955770 941271 927888 914402 899570
53112H99570j5979j5407j3445j1940j1832j2002j0909q591o532o029p261r452
$$ 899570 883591 868184 854739 842799 830967 818965 808056 799465 792933 786904 779643 770191
53100G70191j1324j1732j0516q690p418o977o944p026p229p504p788q167q559
$$ 770191 758867 747135 736619 727929 720511 713534 706590 699564 692335 684831 677043 668876 660317
53087F60317q482p675o686o158n755m637k880j597j550k444l777n413o947p383
$$ 660317 651835 644160 637474 631316 625561 620924 618044 616447 614897 612453 608676 603263 596316 588933
53073E88933o184m145k671k552l640n113n740m690k723j724k387l192k647j677
$$ 588933 582749 578604 575933 573381 569741 564628 558888 554198 551475 549751 547364 544172 541525 539848
53059E39848k247m211n221l851j197R40K041K403K051R30n23j908l268m450m743
$$ 539848 537601 533390 528169 524318 523121 524061 526102 528505 530556 531486 530963 529055 525787 521337 516594
53044E16594l745j986k05J269J888P92j653l209k062P50K518K231J266P71L8j829
$$ 516594 512849 510863 510658 511927 513815 514607 512954 509745 507683 508433 510951 513182 514448 515219 515257 513428
53028E13428l889m202k291J75J102r7k389m450n739o352o279n406m170l508l796
$$ 513428 509539 505337 503046 503221 504323 504226 501837 497387 491648 485296 479017 473611 469441 465933 462137
53013D62137m373m513m357m312m141l454k679k571k990l137k923k962l239k880
$$ 462137 457764 453251 448894 444582 440441 436987 434308 431737 428747 425610 422687 419725 416486 413606
52999D13606j662o60r07k211l836n393o414n908l487m96J077P79k7j72m1o84k116
$$ 413606 411944 411284 410377 408166 404330 398937 392523 386615 383128 382632 383709 384488 384461 384289 384248 383564 381448
52982C81448l114k589p83R40J392M91r76k215k885k883k268j488j296k041l052
$$ 381448 378334 375745 374962 375902 377294 377785 376809 374594 371709 368826 366558 365070 363774 361733 358681
52967C58681l126j778Q4R61M11l72m0J039J175k26j628j554q12j264k838l403
$$ 358681 355555 353777 353861 354822 355233 354861 354821 355860 357035 356809 355181 353627 352815 351551 348713 345310
52951C45310j707J099L146L648K437n46m165n896m389j391L55N64R94K136K449
$$ 345310 343603 344702 347848 351496 353933 353387 349222 343326 338937 337546 337901 338465 339459 341595 344044
52936C44044J102m80o40L89J396J935K098J567K11r48p44M11J002M91j19J49J177
$$ 344044 345146 344666 344026 344415 345811 347746 349844 351411 351622 350674 349930 350341 351343 351834 351715 351864 353041
52919C53041K310L017K723J059j187k279j453J28R72J141J553K164K136J590J655
$$ 353041 355351 358368 361091 362150 360963 358684 357231 357359 358331 359472 361025 363189 365325 366915 368570
52904C68570K644L475L435L264L736M209L761K912K917L721L983L145K246K339
$$ 368570 371214 374689 378124 381388 385124 389333 393094 396006 398923 402644 406627 409772 412018 414357
52890D14357L179L836L866L332K466J809K029K943L295K279Q54O92K021L348L338
$$ 414357 417536 421372 425238 428570 431036 432845 434874 437817 441112 443391 444245 444937 446958 450306 453644
52875D53644K123N35j062k590l478l018j580o86j400k932l442k182l58L78k01
$$ 453644 455767 456302 455240 452650 449172 446154 444574 443888 442488 439556 436114 433932 433574 433952 433751
52860D33751r05p64k3M14L0r77k048k697k854k863k887k401p22J725L277K773
$$ 433751 432846 432082 432059 432473 432503 431526 429478 426781 423927 421064 418177 415776 415054 416779 420056 422829
52844D22829J138N53J927L811M131K486K80j164j763j806r40J079L080L245J489
$$ 422829 423967 424520 426447 430258 434389 436875 437155 435991 434228 432422 431482 432561 435641 438886 440375
52829D40375q9J73J315J329J83k19R89K322K196J154P82J273J309J64j226j511
$$ 440375 440286 440459 441774 443103 443286 443067 444056 446378 448574 449728 450510 451783 453092 453256 452030 450519
52813D50519m93R38J883K032J435L21p37q61M10K408L722L511K155M63j192k563
$$ 450519 450026 450964 452847 454879 456314 456635 455898 455037 455447 457855 461577 465088 467243 467706 466514 463951
52797D63951l017k264j266j324k200k283q22J044K006K265K710L359L632L510
$$ 463951 460934 458670 457404 456080 453880 451597 450775 451819 453825 456090 458800 462159 465791 469301
52783D69301L291K575Q38j104j451K78K381L040K502K365L148L625K668Q02o10
$$ 469301 472592 475167 476005 474901 473450 473728 476109 479149 481651 484016 487164 490789 493457 494259 493649
52768D93649j191j639k170j869j61J877K478J239o71k213l411m514n186n072m473
$$ 493649 492458 490819 488649 486780 486619 488496 490974 492213 491542 489329 485918 481404 476218 471146 466673
52753D66673l863l153j994o36L9p01k669m666n224l907j858o16m38n08n67j314
$$ 466673 462810 459657 457663 457027 457066 456365 453696 449030 443806 439899 438041 437425 436987 436479 435912 434598
52737D34598k890m178m212l429k800k545k431k633l354m154m468m363m050l286
$$ 434598 431708 427530 423318 419889 417089 414544 412113 409480 406126 401972 397504 393141 389091 385805
52723C85805k123j572k385l662l846k847k033k249k999l552l772l627k909j780
$$ 385805 383682 382110 379725 376063 372217 369370 367337 365088 362089 358537 354765 351138 348229 346449
52709C46449r20q59j509k362k799k401j487j033j541k328k545k359k353k368k022
$$ 346449 345529 344670 343161 340799 338000 335599 334112 333079 331538 329210 326665 324306 321953 319585 317563
52694C17563j767k269l068l219k946l189l756l487k288j301r26l27P04J112L57
$$ 317563 315796 313527 310459 307240 304294 301105 297349 293862 291574 290273 289347 289020 289724 290836 291193
52679B91193o82j333k085l180l764l348k723k358j467J72R33m48k618l258k167
$$ 291193 290511 289178 287093 283913 280149 276801 274078 271720 270253 270425 271358 270910 268292 265034 262867
52664B62867q91r9P44J480J280M68L81R97O26j358l159l011j702j299k237l030
$$ 262867 261976 261877 262621 264101 265381 265849 266230 267227 267853 266495 263336 260325 258623 257324 255087 252057
52648B52057k565j291j17P67J455J581Q52o8n4R18J555Q76n35j523j911k188k132
$$ 252057 249492 248201 248084 248851 250306 251887 252739 252671 252617 253535 255090 255966 255431 253908 251997 249809 247677
52631B47677j010Q55K046J925J460J629K160K419K542K778K756K374K557L819
$$ 247677 246667 247522 249568 251493 252953 254582 256742 259161 261703 264481 267237 269611 272168 275987
52617B75987M837L924J546n2L14J565K070J352j06j626k558k563k100j990k343
$$ 275987 280824 284748 286294 286242 286556 288121 290191 291543 291437 289811 287253 284690 282590 280600 278257
52602B78257k536k308k161k451k835k827k363j620q67n98j169k148k660k453k100
$$ 278257 275721 273413 271252 268801 265966 263139 260776 259156 258289 257691 256522 254374 251714 249261 247161
52587B47161k075k301k665l172l396k633q82R52K119K602K437J448L6o54k6J241
$$ 247161 245086 242785 240120 236948 233552 230919 230037 230989 233108 235710 238147 239595 239631 238977 238951 240192
52571B40192K226K840L225L034K141J338J266J209J62j304j651p50k84j281k530
$$ 240192 242418 245258 248483 251517 253658 254996 256262 257471 257633 256329 254678 253928 253644 252363 249833
52556B49833k240m65J023R12m23j654j740m68J548L104L052J221j373l283l655
$$ 249833 247593 247128 248151 249063 248640 246986 245246 244778 246326 249430 252482 253703 252330 249047 245392
52541B45392k663j155K6O16J006J691K569L067K941K552K186J618Q61Q07K135
$$ 245392 242729 241574 241600 242216 243222 244913 247482 250549 253490 256042 258228 259846 260707 261514 263649
52526B63649L784L697J472p93r68O30K002K022J133L4j059j833j637k53J734L441
$$ 263649 267433 271130 272602 271809 270841 271471 273473 275495 276628 276662 275603 273770 272133 271880 273614 277055
52510B77055M131L363J500r6k75M54O66J10j24L47N03j11k15J273L267L897L081
$$ 277055 281186 284549 286049 285953 285678 286132 286798 286908 286784 287131 287634 287523 287308 288581 291848 295745 298826
52493B98826K383K669L368L846M104L942K816R89j59L71J989L264L392K582J420
$$ 298826 301209 303878 307246 311092 315196 319138 321954 322943 322784 323155 325144 328408 331800 334382 335802
52478C35802L81k24k22M96J825L111L372K436J510J781K585K154L77n31R56L218
$$ 335802 336183 335959 335737 336233 338058 341169 344541 346977 348487 350268 352853 355007 355384 354853 355809 359027
52462C59027L366J093r02m15J668K800J849p7j284j136k14M48K30o42j400j664
$$ 359027 362393 363486 362584 362169 363837 366637 368486 368409 367125 365989 365775 366223 366453 365811 364411 362747
52446C62747j871k455k882k192n35P11P08L01O31J274Q78m91j050K62K136K514
$$ 362747 360876 358421 355539 353347 352812 353523 354231 354532 355163 356437 357315 356824 355774 356036 358172 360686
52430C60686J090p44j886k334k179j157M77J632J519N52l89r83j281r94K32K019
$$ 360686 361776 361032 359146 356812 354633 353476 353953 355585 357104 357656 357267 356284 355003 354009 354241 356260
52414C56260L455M088M237M181L607K133J69j213j311m88M35J162J947K640K508
$$ 356260 359715 363803 368040 372221 375828 377961 378130 376917 375606 375118 375553 376715 378662 381302 383810
52399C83810J436O32J212K467K723J819J319J907K177R76m92m02Q66J380O25j01
$$ 383810 385246 385878 387090 389557 392280 394099 395418 397325 399502 400478 399986 399584 400450 401830 402455 402354
52383D02354j28k61p80n99P71J967J691N96L4j8l91q96o32K86P36K06p88j785
$$ 402354 402226 401965 401185 400586 401357 403324 405015 405611 405645 405627 405236 404340 403708 403994 404730 404936 404148 402363
52365D02363k654k930k099o16M86J132K128L389L593K150L40l35M2M23L38qn33
$$ 402363 399709 396779 394680 394064 394550 395682 397810 401199 404792 406942 407282 406947 406989 407412 407750 407742 407209
52348D07209j214j598j265m66L08J114K112K730K196P64l30k88M05P62M41L4L22
$$ 407209 405995 404397 403132 402666 402974 404088 406200 408930 411126 411890 411560 411272 411677 412439 412880 412914 413236
52331D13236J319K065J596J76r22j019p42p70o78K31J534K094J602P86K95J88
$$ 413236 414555 416620 418216 418392 417470 416451 415709 414939 414261 414492 416026 418120 419722 420508 420803 420991
52315D20991M31J083J896K381K311J752Q26M5L51J924L409L441K590K482L229
$$ 420991 421422 422505 424401 426782 429093 430845 431671 431716 432067 433991 437400 440841 443431 445913 449142
52300D49142L426K759K651L666M238L209K010K709M969O661O817O230N522M459
$$ 449142 452568 455327 457978 461644 465882 469091 471101 473810 478779 485440 492257 498487 504009 508468
52286E08468L331L335M943O947P727O910N438M529M777N708O092N128L508K795
$$ 508468 511799 515134 520077 527024 534751 541661 547099 551628 556405 562113 568205 573333 576841 579636
52272E79636L707N388O424O129M940M064M581O372P963Q056P110O705P523Q732
$$ 579636 583343 588731 595155 601284 606224 610288 614869 621241 629204 637260 644370 651075 658598 667330
52258F67330R322R106Q332P357P004Q202J0699J2972J4033J4611J5866J7572J8422
$$ 667330 676652 685758 694090 701447 708451 716653 727352 740324 754357 768968 784834 802406 820828
52245H20828J7800J6497J5772J6253J7631J9065K0013K0764K1890K3167K3658
$$ 820828 838628 855125 870897 887150 904781 923846 943859 964623 986513 1009680 1033338
52234A033338K3125K2583K2907K3674K4063K4316K5268K6856K7957K7754K6472
$$ 1033338 1056463 1079046 1101953 1125627 1149690 1174006 1199274 1226130 1254087 1281841 1308313
52223A308313K4864K3523K2669K2029K1097J9904J9223J9422J9562J8519J6691
$$ 1308313 1333177 1356700 1379369 1401398 1422495 1442399 1461622 1481044 1500606 1519125 1535816
52212A535816J5506J5331J5022J3700J1900J0492R401P988O125M342L357L650
$$ 1535816 1551322 1566653 1581675 1595375 1607275 1617767 1627168 1635156 1641281 1645623 1648980 1652630
52200A652630M961N950N237L111J485J602K619L137L258M005N260N748N097M644
$$ 1652630 1657591 1663541 1668778 1671889 1673374 1674976 1677595 1680732 1683990 1687995 1693255 1699003 1704100 1708744
52186A708744N711P999J0285J1976J3251J4170J4555J4742J5538J7055J8226J7999
$$ 1708744 1714455 1722454 1732739 1744715 1757966 1772136 1786691 1801433 1816971 1834026 1852252 1870251
52174A870251J6612J5136J4066J3229J2915J3869J5714J6459J4524J0628O800
$$ 1870251 1886863 1901999 1916065 1929294 1942209 1956078 1971792 1988251 2002775 2013403 2020203
52163B020203M086K299J389J585K211J874K19j742l380n232p567r519j0411j0790
$$ 2020203 2024289 2026588 2027977 2029562 2031773 2033647 2033866 2032124 2028744 2023512 2015945 2006426 1996015 1985225
52149A985225j1320j1761j1926j2530j3867j4709j3961j2567j2252j2909j2929
$$ 1985225 1973905 1962144 1950218 1937688 1923821 1909112 1895151 1882584 1870332 1857423 1844494
52138A844494j1746j0371r494q722p872p409p233o530n337m850n482n895m955
$$ 1844494 1832748 1822377 1812883 1804161 1796289 1788880 1781647 1775117 1769780 1764930 1759448 1753553 1748598
52125A748598l566l503m953o324o207m752l224k721l378m522n487o136o396n836
$$ 1748598 1745032 1741529 1736576 1730252 1724045 1719293 1716069 1713348 1709970 1705448 1699961 1693825 1687429 1681593
52111A681593m401l226l568n016n922n704n399n608n393m077k727k792m128n588
$$ 1681593 1677192 1673966 1670398 1665382 1659460 1653756 1648357 1642749 1637356 1633279 1630552 1627760 1623632 1618044
52097A618044o634p250o953n395l530k806l350m076m491n112o026o308n330l813
$$ 1618044 1611410 1604160 1597207 1591812 1588282 1585476 1582126 1578050 1573559 1568447 1562421 1556113 1550783 1546970
52083A546970l096l753n191o194n868m438l121k810l079k937k224j576j338j374
$$ 1546970 1543874 1540121 1534930 1528736 1522868 1518430 1515309 1512499 1509420 1506483 1504259 1502683 1501345 1499971
52069A499971j723k439k812j906j57P08k10j857k784k930k976k839j881k75J072
$$ 1499971 1498248 1495809 1492997 1491091 1490934 1491642 1491432 1489575 1486791 1483861 1480885 1478046 1476165 1475890 1476962
52054A476962K009L431N644P429P543O667O864R088J2071J3970J4384J4235J4358
$$ 1476962 1478971 1482402 1488046 1495475 1503018 1509685 1516549 1525637 1537708 1551678 1566062 1580297 1594655
52041A594655J5053J6590J8935K1063K1802K1709K2858K6058K9383L0588K9984
$$ 1594655 1609708 1626298 1645233 1666296 1688098 1709807 1732665 1758723 1788106 1818694 1848678
52030A848678K9594L0028K9957K8566K6896K6154K6045K5588K4635K3569K2204
$$ 1848678 1878272 1908300 1938257 1966823 1993719 2019873 2045918 2071506 2096141 2119710 2141914
52019B141914J9988J7204J5059J4250J3936J2523R489O088M032L596L346J872
$$ 2141914 2161902 2179106 2194165 2208415 2222351 2234874 2244363 2250451 2254483 2258079 2261425 2263297
52007B263297p93l662o070p869q859q999q918r338r970r855q843p853p527p424
$$ 2263297 2262504 2258842 2252772 2244903 2236044 2227045 2218127 2208789 2198819 2188964 2180121 2172268 2164741 2157317
51993B157317o910o019n070m063k868j538j17J286K109J790Q93R41K472M137M418
$$ 2157317 2150407 2144388 2139318 2135255 2132387 2130849 2130732 2132018 2134127 2135917 2136810 2137751 2140223 2144360 2148778
51978B148778L546K778K413J811J033J142K463L638L090Q91j392k438k285j897
$$ 2148778 2152324 2155102 2157515 2159326 2160359 2161501 2163964 2167602 2170692 2171583 2170191 2167753 2165468 2163571
51964B163571k153l302n148p378r748j2027j3901j5016j5319j5406j6362j8761
$$ 2163571 2161418 2158116 2152968 2145590 2135842 2123815 2109914 2094898 2079579 2064173 2047811 2029050
51952B029050k1722k3512k3497k3054k3873k5637k6424k5520k4710k6092k9307
$$ 2029050 2007328 1983816 1960319 1937265 1913392 1887755 1861331 1835811 1811101 1785009 1755702
51941A755702l1950l2478l1789l1691l2657l3526l3167l1735l0315k9718k9945
$$ 1755702 1723752 1691274 1659485 1627794 1595137 1561611 1528444 1496709 1466394 1436676 1406731
51930A406731l0566l1114l1171l0527k9560k9098k9615l0756l1819l2343l1999
$$ 1406731 1376165 1345051 1313880 1283353 1253793 1224695 1195080 1164324 1132505 1100162 1068163
51919A068163l0488k8114k5939k4658k3730k2401k1151k0972k1426k0775j8407
$$ 1068163 1037675 1009561 983622 958964 935234 912833 891682 870710 849284 828509 810102
51908H10102j5892j5030j5769j6705j6816j6015j4699j3461j2808j2471j1535
$$ 810102 794210 779180 763411 746706 729890 713875 699176 685715 672907 660436 648901
51897F48901r860q756r370j0841j1107r378o998n764o178p471q574q731p623n546
$$ 648901 639041 630285 620915 610074 598967 589589 582591 576827 570649 563178 554604 545873 538250 532704
51883E32704l424k319k609l613m307m501m982o142o883n785l244j439j791l384
$$ 532704 529280 526961 524352 520739 516432 511931 506949 500807 493924 488139 484895 483456 481665 478281
51869D78281m341m010l092k353k045k209k692k995k732k150j809j994k686l677
$$ 478281 473940 469930 466838 464485 462440 460231 457539 454544 451812 449662 447853 445859 443173 439496
51855D39496m258l551j785o52j464l330m175l293j988j649k233k760k566j819
$$ 439496 435238 431687 429902 429250 427786 424456 420281 416988 415000 413351 411118 408358 405792 403973
51841D03973j325j924l612n226n494m422l103k278j777j396j462k210l136l426
$$ 403973 402648 400724 397112 391886 386392 381970 378867 376589 374812 373416 371954 369744 366608 363182
51827C63182k744j430j43N17L44l35r81j411j821k318k619k312j320j59L50j34
$$ 363182 360438 359008 358865 359382 359726 359391 358410 356999 355178 352860 350241 347929 346609 346450 346800 346666
51811C46666j000j288q30l01p7K37Q56J320J474K046L304L916K453l53k175j875
$$ 346666 345666 344378 343548 343247 343170 343407 344263 345583 347057 349103 352407 356323 358776 358423 356248 354373
51795C54373n38K79J92l47p84m52J172L564N145M843L256J852J346J310J013L57
$$ 354373 353835 354114 354306 353959 353175 352723 353895 357459 362604 367447 370703 372555 373901 375211 376224 376581
51779C76581j7M90J552K081J615R51Q87R18J13j159j730j558j672k060j387O40
$$ 376581 376564 377054 378606 380687 382302 383253 384140 385058 385171 384012 382282 380724 379052 376992 375605 376245
51763C76245K264K048R91R62K060K918K960K778K572J757K79r36j261j195j428
$$ 376245 378509 380557 381548 382510 384570 387488 390448 393226 395798 397555 397834 396898 395637 394442 393014
51748C93014j763j532n88N02J125J119P95O25Q39J160J021J36j135k021k046j505
$$ 393014 391251 389719 389131 389633 390758 391877 392672 393297 394136 395296 396317 396453 395318 393297 391251 389746
51732C89746j209j546j903j306L36J980K570K144J525J278J322J382J327R89J02
$$ 389746 388537 386991 385088 383782 384118 386098 388668 390812 392337 393615 394937 396319 397646 398635 398737
51717C98737j277k468k584j379M05J688J977J535P74j76j123j492q67L41J243
$$ 398737 397460 394992 392408 391029 391434 393122 395099 396634 397408 397232 396109 394617 393750 394091 395334
51702C95334J545J901K979M546N608N437M306L236L052L592L998L715L073K764
$$ 395334 396879 398780 401759 406305 411913 417350 421656 424892 427944 431536 435534 439249 442322 445086
51688D45086L107L911M719M992M436L482L007L352M025M706N829P469Q459P682
$$ 445086 448193 452104 456823 461815 466251 469733 472740 476092 480117 484823 490652 498121 506580 514262
51674E14262N861M868N309N901N376L929K555J849J757J720Q43j247l486m194
$$ 514262 520123 524991 530300 536201 541577 545506 548061 549910 551667 553387 554230 552983 549497 545303
51660E45303l142j936j822k116j482J9J188J546J930L045M200L963J923n61j689
$$ 545303 542161 540225 538403 536287 534805 534824 536012 537558 539488 542533 546733 550696 552619 552058 550369
51645E50369j175m37o79j415j444o64p7l00r95j685k234k583k647k422j628J91
$$ 550369 549194 548757 548078 546663 545219 544555 544478 544178 543183 541498 539264 536681 534034 531612 529984 530175
51629E30175K470L247J490r86j526k31N26j24n23M26J676K262K710L147K375L41
$$ 530175 532645 535892 537382 536396 534870 534639 535165 535041 534518 534944 536620 538882 541592 544739 547114 547455
51613E47455o26R79L173L115J045n98p29p4R02K192K903K011L09m01J04M76J28
$$ 547455 546829 547808 550981 554096 555141 554543 553814 553740 554642 556834 559737 561748 562057 561656 561760 562236 562364
51596E62364k62m25q74j622k235l060m610n851m995k264J4M05l39j289k683m516
$$ 562364 562102 561677 560803 559181 556946 553886 549276 543425 538430 536166 536180 536585 536246 534957 532274 527758
51580E27758n612n256m421m367m968n328n178m823m429m057l878l901l933l988
$$ 527758 522146 516890 512469 508102 503134 497806 492628 487805 483376 479319 475441 471540 467607 463619
51566D63619m119l861k737j382j124k283l862m924n221m485k539l16O46J28o59
$$ 463619 459500 455639 452902 451520 450396 448113 444251 439327 434106 429621 427082 426766 427412 427540 426881
51551D26881j069j632k306j982m76P16N96O9J11J52m30p90j16O55M49J99J483
$$ 426881 425812 424180 421874 419892 419416 420132 420728 420797 420908 421060 420630 419840 419724 420379 420828 421027 422510
51534D22510L664M371K669P2j402r48J032L310M404L995L515M209N142M594K947
$$ 422510 426174 430545 433214 433286 431884 430936 431968 435278 439682 443677 447192 451401 456543 461137 464084
51519D64084K360L623N233N876N998O218N859M151J774J01l88r7N38J018N58j069
$$ 464084 466444 470067 475300 481176 487174 493392 499251 503402 505176 505277 504889 504792 505330 506348 506906 505837
51503E05837k737k970j695l03Q1k89n33l67j51l4L06R48J312R66N16R55K085K522
$$ 505837 503100 500130 498435 498132 498213 497924 497391 497024 496873 496839 497145 498093 499405 500371 500887 501842 503927 506449
51485E06449J735J146K322M598N735M816L294K891L494L729K967J950J615J941
$$ 506449 508184 509330 511652 516250 521985 526801 530095 532986 536480 540209 543176 545126 546741 548682
51471E48682K043J265o0r82j080q99j024j163o08N99J693K213K312K009J013l76
$$ 548682 550725 551990 551930 550948 549868 548969 547945 546782 546174 546773 548466 550679 552991 555000 556013 555637
51455E55637j108o06L50O19O8n82r15j050r68m74Q6j61j486l027l761l698l593
$$ 555637 554529 553923 554273 554892 554960 554378 553463 552413 551445 550971 551057 550896 549410 546383 542622 538924 535331
51438E35331l687l301j847J07J084L4k571m960n478l957j761m04k61o63r63j012
$$ 535331 531644 528343 526496 526603 527687 527721 525150 520190 514712 510755 508994 508590 508329 507666 506703 505691
51422E05691q11m40m00j304k750l258j938L48K240L716N514P187P207N357L583
$$ 505691 504880 504440 504040 502736 499986 496728 494790 495138 497378 501094 506608 513795 521002 526359 529942
51407E29942L689N214O435O681O604O650O402N514M475M161M895O048O427N274
$$ 529942 533631 538845 545280 551961 558565 565215 571617 577131 581606 585767 590662 596710 603137 608411
51393F08411L049J055J86M14J363K653L518L066J582P07J491K904L122J758j06
$$ 608411 611460 612515 612701 613115 614478 617131 620649 623715 625297 626004 627495 630399 633521 635279 635173
51378F35173j494k012j321M62J957J553n06k262k449j701j065n18L93J316J297
$$ 635173 633679 631667 630346 630808 632765 634318 633812 631550 629101 627400 626335 625817 626210 627526 628823
51363F28823j99k766n222o224n448m162l900m529m652l982l797m659n197m234
$$ 628823 628624 625858 620636 614412 608964 604802 600902 596373 591721 587739 583942 579283 574086 569852
51349E69852k726k286k754k860k537k813l662l742k516j112o82j086j658k111
$$ 569852 567126 564840 562086 559226 556689 553876 550214 546472 543956 542844 542162 541076 539418 537307
51335E37307k093r98R35K122J276q80k362k101o52Q28J512R20r20l049m083l582
$$ 537307 535214 534216 535151 537273 538549 537669 535307 533206 532554 533382 534894 535814 534894 531845 527762 524180
51319E24180k580k333k912l477l794m747p074r922j1341j0293p841n997n643o039
$$ 524180 521600 519267 516355 512878 509084 504337 497263 487341 476000 465707 457866 451869 446226 440187
51305D40187o253o380o929p500o967m985k746j785k395l572m274m215l610k764
$$ 440187 433934 427554 420625 413125 406158 401173 398427 396642 394247 390675 386401 382186 378576 375812
51291C75812k144k249k940l256k526j435j299k217k690j523M65J263j2k204l512
$$ 375812 373668 371419 368479 365223 362697 361262 359963 357746 355056 353533 353998 355261 355249 353045 349533
51276C49533l222j982q85n05o85r25j011j142j381j289n58J79n4j040j258K16
$$ 349533 346311 344329 343444 342939 342254 341329 340318 339176 337795 336506 335948 336127 336073 335033 333775 333991
51260C33991K322L277K679J558P42K32J86J303L696O158P253O778N690M879M447
$$ 333991 336313 339590 342269 343827 344569 344801 344987 346290 349986 356144 363397 370175 375865 380744 385191
51245C85191L922K760Q62j166k438k673k353j875j083P3J020J247R33L31q64k750
$$ 385191 389113 391873 392735 391569 389131 386458 384105 382230 381147 381220 382240 383487 384420 384751 383887 381137
51229C81137m403m886m645m716m807l768j944j409l029m855m574k545j079j373
$$ 381137 376734 371848 367203 362487 357680 353912 351968 350559 347530 342675 338101 335556 334477 333104
51215C33104k578l488l763l426k454j316r87j876l296m292m489l999l096k346
$$ 333104 330526 327038 323275 319849 317395 316079 315092 313216 309920 305628 301139 297140 294044 291698
51201B91698k460l410l998l045q36J109J765J588J640K171K497K035R89Qm59l43
$$ 291698 289238 285828 281830 278785 277949 279058 280823 282411 284051 286222 288719 290754 291743 291751 291292 290949
51185B90949J38N74O80O86J025J434R09q61k585k786j842j476k222k611j338Q86
$$ 290949 291087 291661 292341 293027 294052 295486 296395 295534 292949 290163 288321 286845 284623 282012 280674 281560
51169B81560K349K450J932J606J553J348M92r82k050j537J77J193N56m23k60M07
$$ 281560 283909 286359 288291 289897 291450 292798 293290 292308 290258 288721 288898 290091 290647 290224 289964 290371
51153B90371K13k89N10K122K197K69j093Q1K326L030J892M10q26k179l018k027
$$ 290371 290584 290295 290805 292927 295124 295393 294300 294381 296707 299737 301629 302039 301213 299034 296016 293989
51137B93989K99J502K63j767k150n70J357K397K540K007P93o08j146n41O2m63
$$ 293989 294288 295790 296053 294286 292136 291566 292923 295320 297860 299867 300660 300052 298906 298365 298427 297964
51121B97964j618j935j133n95j407k791l139k050n85J97J24m76j207j510q91L48
$$ 297964 296346 294411 293278 292683 291276 288485 285346 283296 282711 282908 283032 282556 281349 279839 278948 279296
51105B79296J137P58k57p38j86P11P97l76j966k588j768n04p0m79o44K3Q39Q51
$$ 279296 280433 281191 280934 280196 280010 280721 281518 281142 279176 276588 274820 274316 274246 273767 273123 273146 273985 274836
51087B74836M8o85o17JO4j204l000l398j662L94M59j188k005o33J447K266J808
$$ 274836 274884 274199 273582 273583 273647 272443 269443 266045 264383 264777 265236 264048 262043 261410 262857 265123 266931
51070B66931J175O63K1k50N68J907K403J779J026P73O60N58J115K592M052M373
$$ 266931 268106 268769 268790 268540 269108 271015 273418 275197 276223 276996 277656 278214 279329 281921 285973 290346
51054B90346L558K502J853J578J309Q00J39k81j61K12K47j26k37K37M69o50k832
$$ 290346 293904 296406 298259 299837 301146 301946 302085 301804 301643 301855 302102 301976 301739 301976 302445 301795 298963
51037B98963m262l564j485J7J98J52Q21J408P69l99k24J531K912K483J211Q12
$$ 298963 294701 291137 289652 289669 289867 290019 290840 292248 293017 292618 292394 293925 296837 299320 300531 301343
51021C01343J320J541J090N92L85L25O33J685K991L530L149K532J849P57j43N90
$$ 301343 302663 304204 305294 305886 306271 306596 307229 308914 311905 315435 318584 321116 322965 323722 323579 324169
51005C24169K981M785L870P62k074k902j811O0J468J492J53j374j887j487j224
$$ 324169 327150 331935 335805 336567 334493 331591 329780 329840 331308 332800 332953 331579 329692 328205 326981
50990C26981j501j648j072r2P06J278J870K382K598K782L343L985L855K856K169
$$ 326981 325480 323832 322760 322668 323374 324652 326522 328904 331502 334284 337627 341612 345467 348323 350492
50975C50492K780L912L782K001L00M45K156L725M177L957L767L628L264K725K354
$$ 350492 353272 357184 360966 362967 363267 363712 365868 369593 373770 377727 381494 385122 388386 391111 393465
50960C93465K423K958L635L932L709L474L754M315M546M325M013L744L438L384
$$ 393465 395888 398846 402481 406413 410122 413596 417350 421665 426211 430536 434549 438293 441731 445115
50946D45115M056N319O589P718Q970J0071J0270R514Q762Q847R824J1468J3422
$$ 445115 449171 454490 461079 468797 477767 487838 498108 507622 516384 525231 535055 546523 559945
50933E59945J4772J4736J4144J4879J7160J8906J8728J8154J9360K1870K3405
$$ 559945 574717 589453 603597 618476 635636 654542 673270 691424 710784 732654 756059
50922G56059K3341K3435K5204K8223L1195L3199L3850L3579L4024L6871M1830
$$ 756059 779400 802835 828039 856262 887457 920656 954506 988085 1022109 1058980 1100810
50911A100810M6821N0450N3213N6119N9403O3029O7171P1425P4708P6647P8037
$$ 1100810 1147631 1198081 1251294 1307413 1366816 1429845 1497016 1568441 1643149 1719796 1797833
50900A797833P9306P9689P8921P8294P8662P8448P5468P0143O4863O0381N4929
$$ 1797833 1877139 1956828 2035749 2114043 2192705 2271153 2346621 2416764 2481627 2542008 2596937
50889B596937M7412L9509L3347K8490K2873J5991R596N243K532K06k040l640m623
$$ 2596937 2644349 2683858 2717205 2745695 2768568 2784559 2794155 2799398 2801930 2802136 2800096 2796456 2791833
50876B791833o019q676j2173j5331j7711k0246k4145k9343l4319l7682l9850m2820
$$ 2791833 2785814 2777138 2764965 2749634 2731923 2711677 2687532 2658189 2623870 2586188 2546338 2503518
50864B503518m8090n4954o1153o5075o7006o8122o8883o8875o7868o6225o4231
$$ 2503518 2455428 2400474 2339321 2274246 2207240 2139118 2070235 2001360 1933492 1867267 1803036
50853A803036o1750n8799n5884n3274n0368m6489m2098l8625l6815l5646l3226
$$ 1803036 1741286 1682487 1626603 1573329 1522961 1476472 1434374 1395749 1358934 1323288 1290062
50842A290062k8692k3083j8357j5637j4445j3484j1876r489o511l257l66J442
$$ 1290062 1261370 1238287 1219930 1204293 1189848 1176364 1164488 1154999 1148488 1145231 1144865 1146307
50830A146307K084K189K284K370K485L150M759P002R389J1899J4450J6282J6817
$$ 1146307 1148391 1150580 1152864 1155234 1157719 1160869 1165628 1172630 1182019 1193918 1208368 1224650 1241467
50817A241467J6868J7894K0000K1842K2811K4153K7093L0749L3007L3278L3342
$$ 1241467 1258335 1276229 1296229 1318071 1340882 1365035 1392128 1422877 1455884 1489162 1522504
50806A522504L5323L9544M4597M9012N2415N5263N7960O0623O3596O7629P3181
$$ 1522504 1557827 1597371 1641968 1690980 1743395 1798658 1856618 1917241 1980837 2048466 2121647
50795B121647P9696Q6335R3335J01792J11841J21892J30376J37642J45152J53177
$$ 2121647 2201343 2287678 2381013 2482805 2594646 2716538 2846914 2984556 3129708 3282885
50785C282885J60365J65625J69404J72665J75318J76276J74614J70098J62760
$$ 3282885 3443250 3608875 3778279 3950944 4126262 4302538 4477152 4647250 4810010
50776D810010J52572J39749J25021J09280R2893P5609N7517L9991K5042J3421
$$ 4810010 4962582 5102331 5227352 5336632 5429525 5505134 5562651 5602642 5627684 5641105
50766E641105L877n052j2952j8156k0219k0583k0588k0061j8771j8324k1322k8733
$$ 5641105 5644982 5639930 5626978 5608822 5588603 5568020 5547432 5527371 5508600 5490276 5468954 5440221
50754E440221l9071n0275o1617p3512q6073r8538j10048j20572j30748j40690
$$ 5440221 5401150 5350875 5289258 5215746 5129673 5031135 4921087 4800515 4669767 4529077
50744D529077j49226j54861j57476j58455j58747j57548j53526j46953j39666
$$ 4529077 4379851 4224990 4067514 3909059 3750312 3592764 3439238 3292285 3152619
50735C152619j32928j26250j18460j09371j00070r1875q5163p8964p1822o3475
$$ 3152619 3019691 2893441 2774981 2665610 2565540 2473665 2388502 2309538 2237716 2174241
50725B174241n5484m9583m5594m1788l7220l2634k8842k5436k1835j8456j5934
$$ 2174241 2118757 2069174 2023580 1981792 1944572 1911938 1883096 1857660 1835825 1817369 1801435
50714A801435j3887j1548r187p784p536p743p959q361q956r349r309q768p383
$$ 1801435 1787548 1776000 1766813 1759029 1751493 1743750 1735791 1727430 1718474 1709125 1699816 1691048 1683665
50701A683665n031k738j868k240k038o0K980N794Q076J0124J1982J3810J6221
$$ 1683665 1678634 1675896 1674028 1671788 1669750 1669690 1672670 1678464 1686540 1696664 1708646 1722456 1738677
50688A738677J9230K1741K3191K4945K8709L4015L8793M2183M5316M9227N3701
$$ 1738677 1757907 1779648 1802839 1827784 1856493 1890508 1929301 1971484 2016800 2066027 2119728
50677B119728N8512O4195P0692P6588Q0832Q4391Q8941R4476R9464J02933J05171
$$ 2119728 2178240 2242435 2313127 2389715 2470547 2554938 2643879 2738355 2837819 2940752 3045923
50666C045923J06398J06015J03669J00107R6260R1825Q5370P5816O3543N0059
$$ 3045923 3152321 3258336 3362005 3462112 3558372 3650197 3735567 3811383 3874926 3924985
50656C924985L6820K4393J2615J285r482j9332k7763l4090l7786l9079l8790l7397
$$ 3924985 3961805 3986198 3998813 4000098 3990616 3971284 3943521 3909431 3871645 3832566 3793776 3756379
50644C756379l4721l0945k7428k5760k6241k7994l0474l4052l9003m4736n0582
$$ 3756379 3721658 3690713 3663285 3637525 3611284 3583290 3552816 3518764 3479761 3435025 3384443
50633C384443n6810o4169p2442q0054q5390q8344r0234r2022r2979r1501q7163
$$ 3384443 3327633 3263464 3191022 3110968 3025578 2937234 2847000 2754978 2661999 2570498 2483335
50622B483335q1350p5700p0606o5732o1083n6664n1692m5458l8873l3813l0690
$$ 2483335 2401985 2326285 2255679 2189947 2128864 2072200 2020508 1975050 1936177 1902364 1871674
50611A871674k7816k3593j8232j2787p630k709J529M667P143R638J2007J3754
$$ 1871674 1843858 1820265 1802033 1789246 1781616 1778907 1780436 1785103 1792246 1801884 1813891 1827645
50599A827645J5216J7278K0062K2767K4697K5760K6229K6760K8255L0788L3015
$$ 1827645 1842861 1860139 1880201 1902968 1927665 1953425 1979654 2006414 2034669 2065457 2098472
50588B098472L3769L3881L5105L7525L9747M1679M5061N0451N5585N8159N8805
$$ 2098472 2132241 2166122 2201227 2238752 2278499 2320178 2365239 2415690 2471275 2529434 2588239
50577B588239N9820O1942O4149O5885O7602O9176O9483O7797O4455N9975N4637
$$ 2588239 2648059 2710001 2774150 2840035 2907637 2976813 3046296 3114093 3178548 3238523 3293160
50566C293160M8971M3458L7535L0153K1726J4289R211N811K875M25r96j798k865
$$ 3293160 3342131 3385589 3423124 3453277 3475003 3489292 3498503 3504314 3507189 3507614 3506618 3504820 3501955
50553C501955m021m174k963j305k39R1J41J30k80j720m553q519j3022j7839k3178
$$ 3501955 3497934 3493760 3490797 3489492 3489253 3489344 3489485 3489615 3489335 3487615 3483062 3474543 3461521 3443682 3420504
50538C420504k9012l5008m1297m8593n6800o4216o9083p1554p3261p5156p6804
$$ 3420504 3391492 3356484 3315187 3266594 3209794 3145578 3076495 3004941 2931680 2856524 2779720
50527B779720p7712p8069p7897p6518p3473o9338o5161o1549n8521n5651n1978
$$ 2779720 2702008 2623939 2546042 2469524 2396051 2326713 2261552 2200003 2141482 2085831 2033853
50516B033853m6620m0023l4034k9986k7218k4128k0268j6571j3727j1227q080
$$ 2033853 1987233 1947210 1913176 1883190 1855972 1831844 1811576 1795005 1781278 1770051 1761971
50505A761971l752J601P184J1682J4129J5053J6313J9222K3152K6380K8178K9493
$$ 1761971 1758219 1759820 1767004 1778686 1792815 1807868 1824181 1843403 1866555 1892935 1921113 1950606
50493A950606L1627L4762L8091M0944M3251M5032M6171M6850M7683M8911M9940
$$ 1950606 1982233 2016995 2055086 2096030 2139281 2184313 2230484 2277334 2325017 2373928 2423868
50482B423868N0226N0398N1634N3960N6041N6935N7305N8469O0877O4055O7499
$$ 2423868 2474094 2524492 2576126 2630086 2686127 2743062 2800367 2858836 2919713 2983768 3051267
50471C051267P1033P4764P9272Q5350R2810R9947J05119J08665J12380J17185
$$ 3051267 3122300 3197064 3276336 3361686 3454496 3554443 3659562 3768227 3880607 3997792
50461C997792J22216J26085J28136J28268J26542J23279J18696J12065J02134
$$ 3997792 4120008 4246093 4374229 4502497 4629039 4752318 4871014 4983079 5085213
50452E085213Q8933P4266N9756M5116K9206J2095n000k1379l7183n2160o5285
$$ 5085213 5174146 5248412 5308168 5353284 5382490 5394585 5389585 5368206 5331023 5278863 5213578
50441E213578p5887q4155r0045r2630r1274q6849q0938p4119o5817n5870m5442
$$ 5213578 5137691 5053536 4963491 4870861 4779587 4692738 4611800 4537681 4471864 4415994 4370552
50430D370552l6065k8190k1169j4469q532m363k675l683p564j4661k5017l7925
$$ 4370552 4334487 4306297 4285128 4270659 4262127 4257764 4255089 4251406 4243842 4229181 4204164 4166239
50418D166239n2210o6775q0583r2341j00839j05977j09019j11380j13310j14029
$$ 4166239 4114029 4047254 3966671 3874330 3773491 3667514 3558495 3447115 3333805 3219776
50408C219776j12953j10244j06242j01110r5288q9716q5007q0610p5266o8314
$$ 3219776 3106823 2996579 2890337 2789227 2693939 2604223 2519216 2438606 2363340 2295026
50398B295026o0361n2782m6752m2372l8422l3330k6945k0992j7050j4331j0557
$$ 2295026 2234665 2181883 2135131 2092759 2054337 2021007 1994062 1973070 1956020 1941689 1931132
50387A931132m938Q55N111Q153J1218J4394J6957J9015K1395K4006K5899K7006
$$ 1931132 1926194 1927049 1932160 1940313 1951531 1965925 1982882 2001897 2023292 2047298 2073197 2100203
50375B100203K8488L0810L2703L2919L2090L1833L2548L3153L2847L2089L1689
$$ 2100203 2128691 2159501 2192204 2225123 2257213 2289046 2321594 2354747 2387594 2419683 2451372
50364B451372L1716L1754L1673L1600L1345L0389K8654K6928K6244K6899K8300
$$ 2451372 2483088 2514842 2546515 2578115 2609460 2639849 2668503 2695431 2721675 2748574 2776874
50353B776874K9736L1015L2303L3673L5057L6438L7844L9228M0432M1240M1457
$$ 2776874 2806610 2837625 2869928 2903601 2938658 2975096 3012940 3052168 3092600 3133840 3175297
50342C175297M1139M0659M0002L8177L4025K7924K1619J5775Q785r48j2338k2741
$$ 3175297 3216436 3257095 3297097 3335274 3369299 3397223 3418842 3434617 3443402 3442454 3430116 3407375
50330C407375l1260l9279m7752n5780o2320o7665p2380p5853p6956p5305p1276
$$ 3407375 3376115 3336836 3289084 3233304 3170984 3103319 3030939 2955086 2878130 2802825 2731549
50319B731549o5658n9875n5385n1909m7217l9785l0884k2971j6895j1914p742
$$ 2731549 2665891 2606016 2550631 2498722 2451505 2411720 2380836 2357865 2340970 2329056 2321314
50308B321314m828l070j906j882m442r764j6107k1785k6735l1488l5743l8939
$$ 2321314 2316486 2313416 2311510 2309628 2305186 2295422 2279315 2257530 2230795 2199307 2163564 2124625
50296B124625m1424m3962m6317m7359m6668m5318m4593m4397m3450m1014l7855
$$ 2124625 2083201 2039239 1992922 1945563 1898895 1853577 1808984 1764587 1721137 1680123 1642268
50285A642268l5185l3101l0788k7977k5332k3167k0858j8024j5436j3911j2943
$$ 1642268 1607083 1573982 1543194 1515217 1489885 1466718 1445860 1427836 1412400 1398489 1385546
50274A385546j1286q515n166j827J068K986L868M704O484Q921J1076J2859J4596
$$ 1385546 1374260 1365745 1360579 1358752 1359820 1362806 1366674 1371378 1377862 1386783 1397859 1410718 1425314
50261A425314J5570J4721J2872J2459J4537J7487J9423K0378K1126K1360K0399
$$ 1425314 1440884 1455605 1468477 1480936 1495473 1512960 1532383 1552761 1573887 1595247 1615646
50250A615646J8802J7816J7670J7664J7530J7417J6825J4873J1869R389Q392Q105
$$ 1615646 1634448 1652264 1669934 1687598 1705128 1722545 1739370 1754243 1766112 1775501 1783893 1791998
50238A791998P238N625L919K213j62l350o245p673p990q762j0745j2893j3870
$$ 1791998 1799236 1804861 1808780 1810993 1810831 1807481 1801236 1793563 1785573 1776811 1766066 1753173 1739303
50225A739303j3922j4411j5815j7221j7811j7839j7886j8056j8325j8937j9825
$$ 1739303 1725381 1710970 1695155 1677934 1660123 1642284 1624398 1606342 1588017 1569080 1549255
50214A549255k0253j9625j8299j7150j6755j7280j8519j9577j9158j6922j4107
$$ 1549255 1529002 1509377 1491078 1473928 1457173 1439893 1421374 1401797 1382639 1365717 1351610
50203A351610j2058j0555q360n189k256r40j463k880l809l302j629k35k97j329
$$ 1351610 1339552 1328997 1320637 1315448 1313192 1312252 1310789 1307909 1304100 1300798 1299169 1298934 1298637 1297308
50189A297308j791j064l4L61L73N59L71j302m129o012n425l456k555l466m615
$$ 1297308 1295517 1294453 1294419 1294780 1295153 1295712 1296083 1294781 1290652 1284640 1279215 1275759 1273204 1269738 1265123
50174A265123m725m558n166n712m698k793k385m165n972n743m148l248l710m465
$$ 1265123 1260398 1255840 1250674 1244962 1240264 1237471 1235086 1230921 1224949 1219206 1215058 1211810 1208100 1203635
50160A203635m403l354j852o37p0M08J658L296L819K750J424Q37J64j290k124
$$ 1203635 1199232 1195878 1194026 1193389 1193319 1193727 1195385 1198681 1202500 1205250 1206674 1207511 1207675 1206385 1204261
50145A204261p66J595K302R06p20j799l624o724r400j0131r515q605p166n117
$$ 1204261 1203495 1205090 1207392 1208298 1207578 1205779 1202155 1195431 1186031 1175900 1166385 1157780 1150614 1145497
50131A145497m203o181r913j2205j1520r470q499r239j0518j1136j1004j0762
$$ 1145497 1141294 1135113 1125200 1112995 1101475 1092005 1083506 1074267 1063749 1052613 1041609 1030847
50119A030847j0704j0316r111p644p110p687q012o892m926l645l439l246k343
$$ 1030847 1020143 1009827 1000716 993072 985962 978275 970263 963371 958445 954800 951361 948115 945772
50106I45772j547k159m211o328p261p138o986p340p819q060q432r317j0160j0038
$$ 945772 944225 942066 937855 931527 924266 917128 910142 902802 894983 886923 878491 869174 859014 848976
50092H48976q983p960p465p022o235n542n500n984o550o918o706n387l115j091
$$ 848976 839993 832033 824568 817546 811311 805769 800269 794285 787735 780817 774111 768724 765609 764518
50078G64518l71p27j264j659k163k659k557j492L23K273L484L247J968J182J828
$$ 764518 764147 763420 762156 760497 758334 755675 753118 751626 751949 754222 757706 760953 762921 764103 765931
50063G65931K964L180K868L757O187Q241Q112O250M597M515O027Q255R914J0052
$$ 765931 768895 772075 774943 778700 784887 793128 801240 807490 812087 816602 822629 830884 840798 850850
50049H50850R026Q297Q662R251Q913P872P217P245P417P548P952Q503Q738Q849
$$ 850850 859876 868173 876835 886086 894999 902871 910088 917333 924750 932298 940250 948753 957491 966340
50035I66340R385R874R067P035N728O531Q338R145Q776Q702R585J0452J0383R755
$$ 966340 975725 985599 994666 1001701 1007429 1013960 1022298 1031443 1040219 1048921 1058506 1068958 1079341 1089096
50021A089096R360R246R087R120R939J1514J2829J2745J1191R485R244J0799J2940
$$ 1089096 1098456 1107702 1116789 1125909 1135848 1147362 1160191 1172936 1184127 1193612 1202856 1213655 1226595
50008A226595J4431J5302J6255J7309J7886J7906J7820J7663J7026J6065J5485
$$ 1226595 1241026 1256328 1272583 1289892 1307778 1325684 1343504 1361167 1378193 1394258 1409743
49997A409743J5388J5132J4535J4126J3892J3103J1944J1804J3001J3582J1798
$$ 1409743 1425131 1440263 1454798 1468924 1482816 1495919 1507863 1519667 1532668 1546250 1558048
49986A558048Q713O693O111N347L627J863O49o73k457m026n149o765r285j1473
$$ 1558048 1566761 1573454 1579565 1584912 1588539 1590402 1591051 1590378 1587921 1583895 1578746 1571981 1562696 1551223
49972A551223j2072j1580j1237j1126j0566r806r795j0389j0217q713p101o641
$$ 1551223 1539151 1527571 1516334 1505208 1494642 1484836 1475041 1464652 1454435 1445722 1438621 1431980
49960A431980o736n636k729P51L223M160L853K654J190P13K131M604O187O093
$$ 1431980 1425244 1419608 1416879 1417630 1420853 1425013 1428866 1431520 1432710 1433423 1435554 1440158 1446345 1452438
49946A452438N518N752O603P306P915Q561Q252O108L441K856M989P634Q555P767
$$ 1452438 1457956 1463708 1470311 1477617 1485532 1494093 1502345 1508453 1511894 1514750 1519739 1527373 1535928 1543695
49932A543695O512N318L993K496Q24j181l033l531k462j663l027n854p514o649
$$ 1543695 1550207 1555525 1559518 1562014 1562838 1561657 1558624 1555093 1552631 1550968 1547941 1542087 1534573 1527924
49918A527924m525l166l209m162n781q426j2237j6469j9779k1243k1249k1326
$$ 1527924 1523399 1520233 1517024 1512862 1507081 1498655 1486418 1469949 1450170 1428927 1407678 1386352
$$ [...]
##END NTUPLES=NMR SPECTRUM
##END=
