
##TITLE=AC1127_Huila-acevedo_5906844_N7SYexaETs
##JCAMPDX= 6.0         $$ Bruker NMR JCAMP-DX V2.0
##DATA TYPE= NMR SPECTRUM
##DATA CLASS= NTUPLES
##ORIGIN= BRUKER
##OWNER= Administrator
$$ 1.72 TOPSPIN		Version 2.1
$$ 2012-04-10 10:12:29.093 -0500  Administrator@TOPSPIN
$$ Compression mode = diff/dup
##.OBSERVE FREQUENCY= 400.13188235
##.OBSERVE NUCLEUS= ^1H
##.ACQUISITION MODE= SIMULTANEOUS (DQD)
##.ACQUISITION SCHEME= undefined
##.AVERAGES= 8
##.DIGITISER RES= 22
##SPECTROMETER/DATA SYSTEM= spect
##.PULSE SEQUENCE= zg30
##.SOLVENT NAME= COFFEE_meoh
##.SHIFT REFERENCE= INTERNAL, COFFEE_meoh, 1, 14.98061
##AUDIT TRAIL= $$ (NUMBER, WHEN, WHO, WHERE, PROCESS, VERSION, WHAT)
$$ ##TITLE= Audit trail, TOPSPIN		Version 2.1
$$ ##JCAMPDX= 5.01
$$ ##ORIGIN= Bruker BioSpin GmbH
$$ ##OWNER= Administrator
$$ $$ C:\Bruker\TOPSPIN/data/COFFEE/nmr/AC1127_Huila-acevedo_5906844_N7SYexaETs/10/pdata/1/auditp.txt
$$ ##AUDIT TRAIL=  $$ (NUMBER, WHEN, WHO, WHERE, PROCESS, VERSION, WHAT)
(   1,<2012-04-04 17:43:35.000 -0500>,<Administrator>,<TOPSPIN>,<go>,<TOPSPIN 2.1>,
      <created by zg
	started at 2012-04-04 17:42:28.421 -0500,
	POWCHK enabled, PULCHK disabled,
       configuration hash MD5:
       1A 1E CE 29 27 FD 77 03 67 4E F0 E3 C4 B2 CB 90
       data hash MD5: 64K
       E6 FD F6 24 7C 13 F8 C6 E6 5C DD 5E 43 F0 C3 9F>)
(   2,<2012-04-04 17:43:37.578 -0500>,<Administrator>,<TOPSPIN>,<proc1d>,<TOPSPIN 2.1>,
      <Start of raw data processing
       efp LB = 0 FT_mod = 6 PKNL = 1 PHC0 = 0 PHC1 = 0 SI = 32K 
       data hash MD5: 32K
       07 F6 C4 F9 48 B5 FC AD EC A5 E4 4A BA 70 AA 59>)
(   3,<2012-04-04 17:43:37.953 -0500>,<Administrator>,<TOPSPIN>,<proc1d>,<TOPSPIN 2.1>,
      <pk PHC0 = 211.0089 PHC1 = 0 
       data hash MD5: 32K
       73 5A 5A C5 11 65 85 CC 35 C9 BA B0 28 C6 2E 93>)
(   4,<2012-04-04 17:43:38.078 -0500>,<Administrator>,<TOPSPIN>,<proc1d>,<TOPSPIN 2.1>,
      <abs ABSG = 1 
       data hash MD5: 32K
       06 5C 70 56 FF D7 E0 C9 4A 6B DF FA F8 7F AF 7D>)
(   5,<2012-04-04 17:43:38.125 -0500>,<Administrator>,<TOPSPIN>,<proc1d>,<TOPSPIN 2.1>,
      <abs ABSG = 2 
       data hash MD5: 32K
       DD D1 8A 40 C8 5B 07 5C D5 07 FB 4B 59 10 E3 AE>)
(   6,<2012-04-04 17:43:38.156 -0500>,<Administrator>,<TOPSPIN>,<proc1d>,<TOPSPIN 2.1>,
      <abs ABSG = 3 
       data hash MD5: 32K
       0D 10 23 CF 79 00 AA E1 5E 24 8E E8 DE 72 A9 04>)
(   7,<2012-04-04 17:43:38.187 -0500>,<Administrator>,<TOPSPIN>,<proc1d>,<TOPSPIN 2.1>,
      <abs ABSG = 4 
       data hash MD5: 32K
       9C 38 42 A8 8C 72 64 CC 75 26 D8 9B 7E DA 99 9B>)
(   8,<2012-04-04 17:43:38.218 -0500>,<Administrator>,<TOPSPIN>,<proc1d>,<TOPSPIN 2.1>,
      <abs ABSG = 5 
       data hash MD5: 32K
       6C 26 FD 6B EA 5F DB 1A 0D 8F 4E DB 0C 1A B4 38>)
(   9,<2012-04-04 17:43:41.828 -0500>,<Administrator>,<TOPSPIN>,<audit>,<TOPSPIN 2.1>,
      <user comment:
       ICON-NMR User ID: COFFEE
       data hash MD5: 32K
       6C 26 FD 6B EA 5F DB 1A 0D 8F 4E DB 0C 1A B4 38>)
$$ [...]
##$TP= (0..7)
150 150 150 150 150 150 150 150
##$TP07= 0
##$TPNAME0= <>
##$TPNAME1= <>
##$TPNAME2= <>
##$TPNAME3= <>
##$TPNAME4= <>
##$TPNAME5= <>
##$TPNAME6= <>
##$TPNAME7= <>
##$TPOAL= (0..7)
0.5 0.5 0.5 0.5 0.5 0.5 0.5 0.5
##$TPOFFS= (0..7)
0 0 0 0 0 0 0 0
##$TUNHIN= 0
##$TUNHOUT= 0
##$TUNXOUT= 0
##$USERA1= <user>
##$USERA2= <user>
##$USERA3= <user>
##$USERA4= <user>
##$USERA5= <user>
##$V9= 5
##$VALIST= <valist>
##$VCLIST= <CCCCCCCCCCCCCCC>
##$VD= 0
##$VDLIST= <DDDDDDDDDDDDDDD>
##$VPLIST= <PPPPPPPPPPPPPPP>
##$VTLIST= <TTTTTTTTTTTTTTT>
##$WBST= 2048
##$WBSW= 25
##$XGAIN= (0..3)
0 0 0 0
##$XL= 0
##$YL= 0
##$YMAX_a= 528683
##$YMIN_a= -652996
##$ZGOPTNS= <>
##$ZL1= 120
##$ZL2= 120
##$ZL3= 120
##$ZL4= 120
##$ABSF1= 14.98061
##$ABSF2= -5.57192
##$ABSG= 5
##$ABSL= 3
##$ALPHA= 0
##$AQORDER= 0
##$ASSFAC= 0
##$ASSFACI= 0
##$ASSFACX= 0
##$ASSWID= 0
##$AUNMP= <proc_prof1d_extract_pilot.lims>
##$AXLEFT= 0
##$AXNAME= <>
##$AXNUC= <1H>
##$AXRIGHT= 0
##$AXTYPE= 0
##$AXUNIT= <>
##$AZFE= 0.1
##$AZFW= 0.1
##$BCFW= 0
##$BC_mod= 0
##$BYTORDP= 0
##$COROFFS= 0
##$CY= 15
##$DATMOD= 1
##$DC= 0
##$DFILT= <>
##$DTYPP= 0
##$F1P= 0
##$F2P= 0
##$FCOR= 0.5
##$FTSIZE= 32768
##$FT_mod= 6
##$GAMMA= 0
##$GB= 0
##$INTBC= 1
##$INTSCL= 1
##$ISEN= 128
##$LB= 0
##$LEV0= 0
##$LPBIN= 0
##$MAXI= 10000
##$MC2= 0
##$MEAN= 0
##$ME_mod= 0
##$MI= 0
##$NCOEF= 0
##$NC_proc= -8
##$NLEV= 6
##$NOISF1= 0
##$NOISF2= 0
##$NSP= 0
##$NTH_PI= 0
##$NZP= 0
##$OFFSET= 14.98061
##$PC= 1
##$PHC0= 211.0089
##$PHC1= 0
##$PH_mod= 1
##$PKNL= yes
##$PPARMOD= 0
##$PPDIAG= 0
##$PPIPTYP= 0
##$PPMPNUM= 2147483647
##$PPRESOL= 1
##$PSCAL= 4
##$PSIGN= 0
##$PYNMP= <proc.py>
##$REVERSE= no
##$SF= 400.13
##$SI= 32768
##$SIGF1= 0
##$SIGF2= 0
##$SINO= 400
##$SIOLD= 32768
##$SPECTYP= <>
##$SREGLST= <1H.CDCl3>
##$SSB= 0
##$STSI= 32768
##$STSR= 0
##$SW_p= 8223.68421052632
##$SYMM= 0
##$S_DEV= 0
##$TDeff= 65536
##$TDoff= 0
##$TI= <>
##$TILT= no
##$TM1= 0
##$TM2= 0
##$TOPLEV= 0
##$USERP1= <user>
##$USERP2= <user>
##$USERP3= <user>
##$USERP4= <user>
##$USERP5= <user>
##$WDW= 1
##$XDIM= 32768
##$YMAX_p= 470871577
##$YMIN_p= -629525
##$CURPLOT= <Network HP LaserJet P1505>
##$CURPRIN= <$Network HP LaserJet P1505>
##$DFORMAT= <normdp>
##$LAYOUT= <+/1D_H.xwp>
##$LFORMAT= <normlp>
##$PFORMAT= <normpl>
##$SURQMSG= 1
$$ End of Bruker specific parameters
$$ ---------------------------------
##NTUPLES= NMR SPECTRUM
##VAR_NAME=  FREQUENCY,     SPECTRUM/REAL,   SPECTRUM/IMAG
##SYMBOL=    X,             R,               I
##VAR_TYPE=  INDEPENDENT,   DEPENDENT,       DEPENDENT
##VAR_FORM=  AFFN,          ASDF,            ASDF
##VAR_DIM=   32768,         32768,           32768
##UNITS=     HZ,            ARBITRARY UNITS, ARBITRARY UNITS
##FACTOR=    0.250966925370066, 1,           1
##FIRST=     8223.43324360095, -111078,      -207108
##LAST=      0,             179549,          8840
##MIN=       0,             -629525,         0
##MAX=       8223.43324360095, 470871577,    0
$$ Real data points
##PAGE= N=1
##DATA TABLE= (X++(R..R)), XYDATA
$$ [...]
$$ plain form
19483 -130612 -34101 127179 142556 -275273 -123342 417464 163782 -232321 -81366 -191820
19473 -191820 -48596 -40223 197400 73510 -15904 -326516 73140 -233351 163469 -581961 242946
19461 -57887 -162978 52237 -106148 33245 -161332 137402 -37231 279370 -105279 175318
19450 -223406 77819 -376253 -19611 -152393 -6917 -237423 -112202 -151739 97741 -115230 -313359
19439 -313359 -336166 -212164 -159737 64068 -414340 -124208 152276 -280753 -366682 -123575
19428 76916 -152289 -438732 -163577 134845 -109971 -87738 20037 21865 -51591 22406 26667
19417 26667 48281 -11914 -311853 126004 -94550 -19015 -101926 84754 64073 64597 -59959 -100253
19405 -100253 -87267 -128419 124549 186769 -367411 -158508 5731 -208444 84533 -154691 13428
$$ packed form
19483a30612c4101A27179J5377b75273a23342D17464A63782b32321h1366j10454
19473a91820d8596Q373A97400G3510a5904l10612G3140b33351A63469e81961B42946
19461e7887j05091E2237a06148C3245a61332A37402c7231B79370a05279A75318
19450b23406G7819c76253a9611j32782f917k30506a12202l9537I7741a15230j98129
19439c13359k2807J24002N2427F4068d14340a24208A52276b80753q5929a23575
19428G6916a52289k86443a63577A34845a09971K2233B0037J828e1591B2406M261
19417B6667K1614a1914k99939A26004i4550a9015q2911H4754k0681N24e9959m0294
19405a00253J2986m1152A24549O2220c67411a58508E731b08444H4533a54691A3428
$$ plain form
19393 -23658 -3060 -157478 -76225 140537 165960 -38461 44341 -144844 -36312 -30521 -29387 -245682
19381 -245682 -149147 213705 -192617 -332608 108535 -58655 177249 -82635 -183904 136559
19370 -132088 -229766 116859 -212895 85241 -185158 -158180 -137904 64762 10857 -430712 93369
19358 24766 9289 163051 -174775 75095 -134198 -22491 -312673 -168314 -346094 -141920
19347 -355726 6583 -254875 -86066 -23070 -222927 10953 -28415 38501 -380958 -96007 -433436
19336 -433436 -11081 147210 -85308 42860 -163355 -42745 -23060 -99522 -290399 63252 11058
19324 78008 -43584 -130243 -340574 -210244 -149355 114175 320629 -215251 -108601 14494
19313 -286024 214510 -47722 -160121 98315 -218965 -319181 -35188 -147250 57641 -294359
$$ packed form
19393b3658c060j54418g6225A40537K5423c8461D4341a44844c6312N791J134k16295
19381b45682R6535B13705a92617j39991A08535e8655A77249h2635j01269A36559
19370a32088r7678A16859b12895H5241a85158K6978K0276F4762A0857d30712I3369
19358B4766I289J53762a74775G5095a34198b2491k90182J44359j77780a41920
19347c55726F583b54875h6066b3070j99857A0953b8415C8501c80958i6007l37429
19336d33436a1081A47210h5308D2860a63355d2745J9685p6462j90877F3252A1058
19324G8008d3584q6659k10331J30330O0889A14175K06454b15251J06650A4494
19313b86024B14510d7722j12399I8315b18965j00216c5188j12062E7641b94359
$$ plain form
19302 246096 -102088 -59026 -252983 -71092 79173 81293 -279196 -76357 106496 57596 -501847
19290 -44176 -58914 56725 -343523 -401465 -40242 -23110 -194969 210254 -119207 178353 243349
19279 243349 11571 -73857 -288881 31918 -89261 -121035 166664 102852 -170746 -100484 -155040
19268 -155040 19634 -21517 -366259 129410 173220 -134001 45100 125251 -247798 -72638 -81945
19257 -81945 62294 -428662 -320596 7052 111119 47825 157332 -247389 142502 -88474 167878
19245 21933 -272428 254053 -195885 -58546 55361 -174954 -192047 47920 -97067 -57998 24326
19233 -256342 14530 -94245 -518870 -187794 -314235 -156538 -23112 -259445 18598 -72161
19222 151238 86668 -87533 -152096 -221841 -386456 137763 26659 -124660 3783 -263321 -11739
$$ packed form
19302B46096a02088M3062j93957g1092G9173K120b79196g6357A06496m8900e01847
19290d4176j4738E6725c43523n7942d0242J7132j71859B10254a19207A78353O4996
19279B43349A1571g3857k15024C1918h9261l1774A66664o3812a70746P0262n4556
19268a55040A9634b1517l44742A29410M3810a34001D5100Q0151b47798g2638r307
19257h1945F2294d28662J08066G052J04067D7825J09507b47389A42502h8474A67878
19245B1933b72428B54053a95885e8546E5361a74954j7093D7920i7067L9069B4326
19233b56342A4530i4245m24625a87794j26441a56538b3112k36333A8598g2161
19222A51238o4570h7533o4563o9745j64615A37763B6659a24660C783b63321a1739
$$ plain form
19210 163951 -183029 -152173 14051 141886 -13756 48596 126063 51751 -217197 -185839 260090
19198 -115784 -27179 -353191 173650 -131751 -345767 -217331 164948 -209710 35939 -331031
19187 -145477 -235817 -125866 -43193 -164122 -234287 88888 -170546 -565649 -254976 -53908
19176 22651 17061 -248353 221510 -387521 20747 -185253 375513 -155432 70151 81601 -52246
19164 -53944 -265567 -121288 -258193 -45395 -124406 131834 15726 8004 93090 -52891 -298820
19153 -298820 -324420 160340 -46531 -44159 -138540 -2709 -146356 -119979 -145262 140651 -92300
19141 6799 48879 84672 189628 -325258 92997 38525 -547451 -45163 118032 231432 -257160
19129 -244960 78241 -162273 1147 -19261 -50746 275155 69735 -330349 -200779 -85855 14251
$$ packed form
19210A63951a83029L0856A4051J27835a3756D8596P7467E1751b17197L1358B60090
19198a15784b7179l26012A73650a31751k14016J28436A64948b09710C5939c31031
19187a45477r0340J09951d3193j20929p0165H8888a70546l95103b54976e3908
19176B2651n590b48353B21510c87521B0747a85253C75513a55432G0151J1450e2246
19164e3944k11623a21288j36905d5395p9011A31834A5726p722Q5086e2891k45929
19153b98820k5600A60340d6531K372r4381b709j43647K6377k5283A40651i2300
19141F799M2080L5793J04956c25258I2997C8525e47451d5163A18032J13400b57160
19129b44960G8241a62273A147a9261l1485B75155F9735c30349J29570h5855A4251
$$ plain form
19117 128673 -71343 53403 -457093 70842 -118225 -285470 -197654 75046 46845 -171719 46385
19105 -28245 188868 -117759 133529 86110 195078 15691 -64988 156572 -260726 -21626
19094 -61334 -83828 38488 31006 -246258 -53648 -246573 5560 -74500 16290 -90675 -65002 153320
19081 -75053 -98985 166239 -79298 -167233 -132517 54530 -28299 -153934 -82593 24481 5482
19069 -169126 -232332 -229228 -64251 -243915 209869 -18400 -149174 -41512 -379168 -55503 55210
19057 97892 250560 -271563 -21710 -196982 60464 -37165 -91808 -81502 91095 162695 94563
19046 94563 -36911 188924 -63239 45239 -446624 214484 -345879 -270427 161444 -133758
19035 148235 -164622 5352 -12751 265735 285243 -85688 -129472 -18406 201205 -249215 -17072
$$ packed form
19117A28673g1343E3403d57093G0842a18225j67245Q7816G5046k8201a71719D6385
19105b8245A88868a17759A33529m7419J08968A5691f4988A56572b60726b1626
19094f1334k2494C8488p482b46258e3648j92925E560g4500A6290i0675K5673A53320
19081g5053k3932A66239g9298q7935L4716E4530b8299j25635P1341B4481E482
19069a69126o3206L104f4251j79664B09869a8400j30774d1512l37656e5503E5210
19057I7892J52668b71563b1710j75272F0464c7165n4643J0306I1095P1600o8132
19046I4563c6911A88924f3239D5239d46624B14484c45879P5452A61444a33758
19035A48235a64622E352a2751B65735J9508h5688m3784a8406B01205b49215a7072
$$ plain form
19023 154798 211676 -297691 -165077 -274038 353104 274273 517538 -25273 -553464 -127855
19012 -37737 -215730 115041 -20987 -11058 -28749 -19452 408426 150282 2654 -363435 23827
19000 -51659 -284664 129378 -148048 -117395 -180566 -11831 -62882 62597 -300026 -179664 -9423
18988 -169289 -68985 -119343 83133 -507 -400020 77721 -77882 -115682 -244250 111339 -157032
18976 189961 246843 78093 192880 94220 72594 18957 -197820 -51095 -6917 -77856 169431
18964 -90803 -51257 27696 215360 14975 63802 99571 297519 500942 322567 299875 47168
18952 -178856 -34732 -4091 -192595 -56143 -103825 -180793 168589 -129101 127487 -294858 -43514
18940 -343127 -46102 -281381 -168419 -305487 -116245 -389878 -20806 -100374 -226568 85473
$$ packed form
19023A54798N6878b97691J32614j08961C53104p8831K43265b5273n28191a27855
19012c7737j77993A15041b0987R929j7691R297D08426A50282B654c63435B3827
19000e1659k33005A29378a48048L0653o3171a1831n1051F2597c00026J20362i423
18988a69289f8985n0358H3133e07l99513G7721g7882l7800j28568A11339a57032
18976A89961N6882G8093J14787I4220k1626A8957a97820e1095f917p0939A69431
18964i0803L9546B7696J87664A4975M8827L5769J97948K03423j78375k2692D7168
18952a78856c4732d091j88504e6143m7682p6968A68589a29101A27487b94858d3514
18940c43127d6102k35279J12962j37068a16245k73633b0806p9568j26194H5473
$$ plain form
18929 268800 -188465 -235024 -195414 316219 336023 305639 -119691 3419 46405 54174 -38338
18917 -76898 -553099 10570 93088 -126051 210134 -169148 -158797 -111156 -221997 -289650 -416784
18906 -416784 -90288 -131092 146974 -173413 -88117 -157339 166554 -25588 -60146 -125389 64420
18894 327487 282372 -77758 364311 -217860 -37427 350351 -204218 -50835 -118570 -58304 -141119
18883 -141119 18400 286812 -17725 -74769 -125697 -86059 -344008 -102399 170431 -168066
18872 277829 342146 -27454 -103926 -117607 281360 123476 -86329 -259992 213150 -61863 -145167
18861 -145167 -74443 -223660 256726 -90082 -87314 108304 1423 -248756 -158090 -2069 191160
18849 -44119 -86202 -51305 -391203 153016 -512246 -184932 -275658 -250751 9260 -339658 151120
$$ packed form
18929B68800a88465m6559L9610C16219J9804l0384a19691C419M2986P769c8338
18917g6898m76201A0570Q2518a26051B10134a69148J0351M7641j10841o7653j27134
18906d16784i0288m0804A46974a73413Q5296o9222A66554b5588l4558o5243F4420
18894C27487m5115g7758C64311b17860c7427C50351b04218e0835o7735e8304q2815
18883a41119A8400K68412a7725n7044n0928L9638k57949a02399A70431a68066
18872B77829O4317b7454p6472j3681B81360A23476h6329j73663B13150f1863q3304
18861a45167P0724j49217B56726i0082K768A08304A423b48756R0666b069A91160
18849d4119m2083L4897l39898A53016e12246a84932r0726K4907I260c39658A51120
$$ plain form
18837 -12522 -32224 193744 37944 217326 315458 -9801 247384 -235131 -229060 -166787 286585
18825 -24032 33267 -36997 -86399 189145 88359 -104588 -132659 8765 218369 -127671 223696
18813 -114438 23123 525710 -350746 -74167 -81070 -225297 226 -335690 -224816 -11628 20221
18801 -125214 -112935 -188125 -49765 -101362 -128776 51927 51755 99934 141201 -337419 316945
18789 -30945 57460 -240950 -60618 -14440 66074 30166 -132208 92133 -62285 -4949 -57358
18778 -57358 145130 46514 -33585 -301676 -41578 29227 -147610 80480 89051 -242230 -134694
18767 -134694 -33118 121680 -416306 -28013 251061 -253014 -158497 -11341 -37086 -124358 -283424
18756 -283424 -161054 2944 -214767 15256 172122 -180449 -104965 -250020 -361226 -229326
$$ packed form
18837a2522j9702A93744C7944J79382R8132i801B47384b35131O071O2273B86585
18825b4032C3267c6997m9402A89145H8359a04588k8071H765K09604a27671B23696
18813a14438B3123N02587c50746g4167o903j44227B26c35690J10874a1628B0221
18801a25214J2279p5190d9765n1597k7414E1927j72M8179M1267c37419C16945
18789c0945E7460b40950f0618a4440F6074C0166a32208I2133f2285d949n2409
18778e7358A45130D6514c3585k68091d1578B9227a47610H0480Q571b42230J07536
18767a34694c3118A21680d16306b8013B51061b53014R4517a1341k5745q7272j59066
18756b83424J22370B944b14767A5256J56866a80449P5484j45055j11206J31900
$$ plain form
18746 -229326 -90479 -320053 10160 169607 47859 254740 -48599 -372811 -49877 -313688
18736 -313688 109016 146218 322303 -130968 52845 -213822 293580 -154742 -265176 -124544
18725 -62661 22659 -182854 159973 -21034 -103937 -10550 157279 -44712 232952 221486 93503
18713 -321981 111045 321659 -85533 -86817 -101793 -295609 169803 -9560 -124213 144244 -388895
18701 29000 -346887 42363 194804 71224 -88594 -134938 118130 -92134 -243675 -162336 -99161
18690 -99161 188435 -76880 -253970 -130494 -41257 236146 104746 144370 -55442 -107137 38540
18678 -222730 61625 -253151 -96609 -158244 87319 131166 -2703 -311272 328380 -114544 -7613
18666 -164695 66424 153523 -283311 -180809 -148845 -388746 -160191 139225 290751 -246248
$$ packed form
18746b29326i0479k29574A0160J59447D7859K06881d8599l24212d9877k63811
18736c13688A09016L7202J76085a30968E2845b13822B93580a54742j10434a24544
18725f2661B2659a82854A59973b1034q2903a0550A57279d4712B32952j1466I3503
18713c21981A11045K10614h5533j284j4976j93816A69803i560j14653A44244c88895
18701B9000c46887D2363J52441G1224h8594m6344A18130i2134j51541Q1339O3175
18690i9161A88435g6880j77090J23476d1257B36146A04746L9624e5442n1695C8540
18678b22730F1625b53151i6609o1635H7319M3847b703l08569C28380a14544g613
18666a64695F6424Q7099b83311J02502L1964k39901a60191A39225J51526b46248
$$ plain form
18655 -286529 -118991 -13621 352906 -263106 -304181 71350 -216771 -107090 215567 58531
18644 -113652 -12964 -73950 76648 -176131 -137101 -138026 293319 14936 145531 136264 -330013
18632 -180897 -181544 -29512 -60674 2075 -9057 115601 -79753 -189872 108461 20930 -81557 -179311
18620 -179311 -161977 -96442 -151002 -188412 55909 -383651 -189617 -179624 -40873 -31903 -318069
18609 -318069 -7642 -75112 -181529 -167542 24781 -73039 -94540 137917 -51759 85530 72694
18598 72694 44562 117895 61002 108035 -13031 21057 77020 -222511 -149704 -325649 -121910
18586 12902 31195 92053 -179909 -146752 -136945 -157058 127813 33593 -54150 -35234 49301
18574 -71983 192819 -316600 -224391 -138548 141238 437573 -321321 97106 -230171 42050
$$ packed form
18655b86529a18991a3621C52906b63106m1075G1350b16771a07090B15567E8531
18644a13652a2964o0986G6648a76131L9030r25B93319A4936J30595r267c30013
18632a80897o47b9512l1162B075i057A15601g9753j10119A08461B0930h1557r7754
18620a79311J7334O5535n4560l7410E5909c83651a89617R993d0873Q970k86166
18609c18069g642o7470j06417J3987B4781g3039k1501A37917e1759H5530j2836
18598G2694k8132P3333n6893M7033a3031B1057N5963b22511P2807j75945a21910
18586A2902J8293O0858a79909L3157R807k0113A27813C3593e4150J8916D9301
18574g1983A92819c16600R2209Q5843A41238K96335c21321I7106b30171D2050
$$ plain form
18563 146023 -66898 -216796 -346210 238564 -172316 -293617 83943 -256525 21400 -82613
18552 77587 -292749 -170785 -35170 -133762 -38328 -69329 154243 -62833 11975 150826 -344066
18540 -37882 -417819 -164069 -447373 -122393 134453 -153089 -165142 21923 -2211 -63297 -13727
18528 -206512 -116810 91924 77726 48489 203865 -308882 -197405 -171268 37716 -64789 79197
18516 -357248 -55280 -423493 -137232 -88025 -46030 -271609 121663 -102568 -425035 171829
18505 124642 -32867 65787 80876 205591 -196720 195158 -334667 -236608 -155814 -50861 275667
18493 260512 -113726 -351378 -206190 -91273 -173851 105024 -177597 -367893 -35933 -230396
18483 -230396 97504 -117759 49312 101115 -191236 -147318 -250717 92091 342082 -439990
$$ packed form
18563A46023f6898j49898j29414B38564a72316j21301H3943b56525B1400h2613
18552G7587b92749J21964c5170r8592c8328l1001A54243f2833A1975J38851c44066
18540c7882l79937a64069k83304a22393A34453a53089j2053B1923b211o1086a3727
18528b06512Q9702I1924j4198k9237J55376c08882J11477K6137C7716f4789G9197
18516c57248e5280l68213a37232M9207M1995k25579A21663a02568l22467A71829
18505A24642c2867F5787J5089J24715a96720A95158c34667R8059Q0794e0861B75667
18493B60512a13726k37652J45188i1273q2578A05024a77597j90296c5933j94463
18483b30396I7504a17759D9312N1803a91236M3918j03399I2091K49991d39990
$$ plain form
18472 -135249 281647 76150 -121910 -164118 4454 -23360 -39539 -242286 -113829 79041 -41707
18460 119069 -226766 -106664 -4146 -210100 -186017 85983 -285595 -355413 82630 -19272 -201396
18449 -201396 -331885 -74105 -69011 195612 18041 -190932 -191893 190611 -63818 8007 -2147 -318074
18437 -318074 106217 -18355 30537 -284625 256009 -122636 -17602 230622 -15536 -63393
18427 -63393 430525 300801 -40829 -415664 -132146 185174 -357009 -117413 -301328 40324
18416 21847 -298176 -368976 36669 -149137 -137313 -74822 -82055 268074 -249152 177807 -156874
18404 -89423 43140 -63682 143299 -173151 -464484 -97921 75158 -4113 7842 -37167 16435
18392 37563 242283 265151 -153664 100142 299108 -41092 222867 -37817 107901 -10618
$$ packed form
18472a35249B81647G6150a21910m2208D454b3360j6179k02747a13829G9041d1707
18460A19069b26766a06664d146k05954K4083H5983b85595o9818H2630a9272j82124
18449b01396j30489g4105N094A95612A8041a90932r61A90611f3818H007b147l15927
18437c18074A06217a8355C0537b84625B56009a22636a7602B30622a5536m7857
18427f3393D30525j29724d0829l74835a32146A85174c57009a17413j83915D0324
18416B1847b98176p0800C6669a49137J1824O2491p233B68074b49152A77807a56874
18404h9423D3140f3682A43299a73151k91333i7921G5158d113G842c7167A6435
18392C7563K04720K2868a53664A00142J98966d1092B22867c7817A07901a0618
$$ plain form
18381 101011 -153717 -166664 -299557 38867 -6763 -115596 -98973 -44488 37481 -207274 -156393
18370 -156393 -12827 -43959 84613 233182 11418 -45998 -50487 -81228 -92845 131021 38064
18358 279746 -80975 2555 165466 -51413 -313751 -272706 86679 -68564 -24058 150643 137537
18347 137537 124511 -71981 -61582 -36714 194433 70515 -31986 -52448 298927 -285086 -158035
18336 -158035 24543 -6765 -361252 211780 -81586 -76509 -251786 -137119 24523 -142351 -177637
18325 -177637 -35636 -248944 -420975 175490 112289 117784 -111347 -166572 -21447 133361 -271289
18313 81073 32485 -17324 194301 98900 9002 -370308 54561 -214881 -28698 -451674 -65698
18301 230410 410386 -313699 -349969 -65189 -182197 -37584 34823 82919 -12397 -29598 -349478
$$ packed form
18381A01011a53717j2947j32893C8867f763j08833J6623d4488C7481b07274N0881
18370a56393a2827l1132H4613J48569A1418d5998m489l0741j1617A31021C8064
18358B79746h0975B555J62911e1413k62338M1045H6679f8564b4058A50643j3106
18347A37537j3026g1981J0399K4868A94433G0515c1986k0462B98927b85086J27051
18336a58035B4543f765l54487B11780h1586N077j75277J14667B4523a42351l5286
18325a77637c5636k13308j72031A75490o3201N495a11347n5225b1447A33361b71289
18313H1073C2485a7324A94301r5401I002c70308E4561b14881b8698m22976f5698
18301B30410J79976c13699l6270f5189j17008c7584C4823M8096a2397j7201l19880
$$ plain form
18290 -349478 -14065 -15128 41970 60258 127556 10235 -120293 -37470 -140237 -95845 23935
18278 -117793 351195 -8360 -349228 -134881 -264058 -195496 10768 48683 55355 -165986 59792
18266 -370213 -219009 -373027 -203005 161481 -40202 -388129 -87263 -18106 1655 -270747
18255 -185332 -50559 228697 -123282 -261549 -131070 -177739 5080 -55173 291002 -234952
18244 -267978 -320852 13296 -303662 -284516 -118313 -115229 -30963 158000 -25746 -67813 57871
18232 -53982 183048 -15831 -60614 -49475 -63467 97322 253683 233630 -196977 294340 115083
18220 123395 -126797 -148429 -132978 -133726 -208598 -140657 26370 103236 281177 -150729 -256348
18209 -256348 -297511 180253 -377941 -181235 -243515 246970 -29620 -20424 147253 -167793
$$ packed form
18290c49478a4065j063D1970J8288O7298A0235a20293c7470j02767M4392B3935
18278a17793C51195h360l40868a34881j29177O8562A0768L7915O672a65986E9792
18266c70213J51204j54018J70022A61481d0202l47927h7263a8106A655b70747
18255a85332e0559B28697a23282j38267J30479m6669E080e5173B91002b34952
18244b67978n2874A3296c03662J9146a18313L084c0963A58000b5746m2067E7871
18232e3982A83048a5831m4783J1139j3992I7322J56361k0053a96977B94340A15083
18220A23395a26797k1632J5451p48p4872O7941B6370P6866J77941a50729j05619
18209b56348m1163A80253c77941a81235o2280B46970b9620R196A47253a67793
$$ plain form
18198 253209 -109846 -192040 -33890 178720 328867 -174821 -101119 24925 -202506 365674
18187 -177727 -130166 186663 -205009 -159367 -33233 276497 -149556 -48566 -110654 1741 -212319
18175 -147342 164289 -150184 -264786 -94576 338633 -109021 163816 -281908 120239 154238
18165 154238 83121 14643 172878 -20779 -105029 114442 192162 -174058 -101663 -215977 5607
18153 -291575 138208 85960 -260659 -148460 102606 -62213 -68569 193328 -99403 -100550 294564
18141 -203039 34451 385607 -109573 -50825 68998 -81117 -108737 25188 -182870 -425577 -30023
18129 -59722 2283 -95955 170248 315160 129820 251968 -179388 -228160 -81451 89235 281602
18118 281602 -357466 25006 97487 27816 -314809 -71000 246987 -50730 166289 -184366
$$ packed form
18198B53209a09846q2194c3890A78720J50147a74821P3702B4925b02506C65674
18187a77727M7561A86663b05009M5642c3233B76497a49556d8566o2088A741b12319
18175a47342A64289a50184j14602i4576C38633a09021A63816b81908A20239L3999
18165A54238p1117A4643J58235b0779q4250A14442P7720a74058P2395j14314E607
18153b91575A38208n2248b60659J12199A02606f2213o356A93328i9403j147B94564
18141b03039C4451L51156a09573e0825F8998h1117k7620B5188a82870k42707c0023
18129e9722B283i5955A70248J44912A29820J22148a79388m8772h1451H9235J92367
18118B81602c57466B5006P2481B7816c14809g1000B46987e0730A66289a84366
$$ plain form
18107 -58600 173002 180948 -77377 -246510 128930 34522 -243199 -129021 -198977 -170056 195071
18095 -81100 -239846 22414 -44941 58916 38135 -553797 -51196 177043 275857 222776 118013
18084 118013 -283847 117056 -41712 46417 83802 -324035 103306 262903 -128799 97317
18073 -314033 -64060 -109302 -247741 -74121 -341216 -209510 -58935 -297740 -17003 102149
18062 96697 -226441 83228 14582 256366 168300 -23301 -589195 -94891 -53998 17827 44406
18051 44406 -272279 -90226 447594 -82255 80227 126219 -48228 -138999 -20136 174178 -84179
18039 52401 -314712 -105343 -132246 -149142 57604 -89065 -133934 17975 55739 80119 -67267
18027 -17765 124711 -387429 -187122 -169673 -9739 135861 122671 103554 19329 10549 3341
$$ packed form
18107e8600A73002P946g7377j69133A28930C4522b43199J14178o9956K8921A95071
18095h1100j58746B2414d4941E8916k0781e53797e1196A77043R8814n3081j04763
18084A18013b83847A17056d1712D6417L7385c24035A03306J59597a28799I7317
18073c14033f4060m5242j38439g4121k67095J31706e8935k38805a7003A02149
18062I6697b26441H3228A4582K41784q8066b3301n65894i4891M0893A7827K6579
18051D4406b72279i0226D47594h2255H0227M5992d8228r0771b0136A74178h4179
18039E2401c14712a05343k6903j6896E7604h9065m4869A7975L7764K4380f7267
18027a7765A24711c87429a87122J7449i739A35861j3190j9117A9329q780C341
$$ plain form
18015 7506 -162337 -114190 -362605 147014 -207988 88511 -152690 260904 106824 44584
18004 157699 -118385 34366 -22089 -74729 -74733 22797 -150645 -208848 16490 -4875 86482 -17330
17991 -273969 -46727 505758 353219 62392 -40855 -25242 -49971 191113 -93494 -50412 -115358
17980 -115358 72949 258369 353404 -176875 47066 -155425 -99192 -1048 203405 -66166 -116363
17969 -116363 141747 -189318 -41451 101376 144560 -74554 -155674 318157 -178451 84264
17958 123567 66164 -151230 65831 -37776 146463 -21678 -93881 -252659 159563 -27438 55271
17946 299514 -259752 198902 -260381 -106369 -2034 -17399 27921 -203808 122490 -261381
17935 -93915 294556 153168 -30530 -143604 385134 -23413 -134022 392297 -7189 233726
$$ packed form
18015G506a62337M8147k48415A47014b07988H8511a52690B60904A06824D4584
18004A57699a18385C4366b2089n2640mB2797a50645n8203A6490d875H6482a7330
17991b73969d6727E05758j52539F2392d0855J5613k4729A91113i3494M3082o4946
17980a15358G2949J85420R5035a76875D7066a55425N6233a048B03405f6166n0197
17969a16363A41747a89318d1451A01376M3184g4554q1120C18157a78451H4264
17958A23567n7403a51230F5831c7776A46463b1678p2203j58778A59563b7438E5271
17946B99514b59752A98902b60381a06369b034j5365B7921b03808A22490b61381
17935i3915B94556j41388c0530j13074C85134b3413j10609C92297g189B33726
$$ plain form
17924 33405 -136317 138084 -149533 139486 209727 -148562 658 450007 273780 -163235
17913 136125 -200936 158575 -188122 151988 -418815 -232288 -8346 238662 -12061 -113588
17903 -113588 -2469 198133 24579 6382 -40315 56677 101218 -273724 -12709 -175978 63794
17891 -40761 89822 -71951 140064 -181221 -78039 -325979 320579 95983 155790 88418 101962
17880 101962 -85445 98658 -18995 -13775 -101647 -13100 -35985 -263259 52042 187218 81958
17868 90133 -87864 142688 -102000 -41109 -198515 -33222 -414192 158701 387456 -27559
17857 274696 140654 187715 -403004 380225 35172 160646 59020 -3815 30687 -110857 -149639
17846 -149639 119344 202915 93087 -91159 419643 -424677 -495332 222908 17399 7315 -1247
$$ packed form
17924C3405a36317A38084a49533A39486P0241a48562F58M49349j76227a63235
17913A36125b00936A58575a88122A51988d18815J86527h346B38662a2061j01527
17903a13588b469A98133B4579F382d0315E6677M4541b73724a2709j63269F3794
17891d0761H9822g1951A40064a81221g8039k47940C20579I5983N9807o7372J3544
17880A01962h5445I8658a8995N220q7872a3100k2885k27274E2042J35176H1958
17868I0133h7864A42688a02000d1109j57406c3222l80970A58701K28755b7559
17857B74696j34042M7061d03004C80225C5172J25474E9020c815C0687a10857l8782
17846a49639A19344Q3571I3087i1159D19643d24677p0655B22908A7399G315a247
$$ plain form
17834 40540 -37614 158766 39085 153548 121145 -1832 156711 1536 -8340 51026 64764 -114535
17821 183442 102212 133612 214860 -81725 226954 218979 132513 -140190 -105008 -95431 173777
17809 -58717 115924 234302 136868 -83016 57345 146363 -196887 -126141 -399512 -9885 251014
17797 159295 93505 177524 -25552 11902 -143719 -57966 355546 -472240 -115912 -17050 107250
17785 162047 -80823 -378949 -113335 217073 -132665 -135143 -28850 -190234 80889 164980 -150934
17773 131746 42859 264048 -33779 -115267 16553 -118764 9417 400859 -141675 93619 37799
17761 -87350 25467 218958 -83702 -97689 102770 -338967 -242764 211667 486520 111410
17750 -211248 -160069 -247952 -96161 161402 -91087 42905 162010 -16547 87059 -104198 268473
$$ packed form
17834D0540c7614A58766C9085J14463l2403a832A56711A536h340E1026J3738a14535
17821A83442q1230L1400Q1248h1725B26954p975q6466a40190L5182R577A73777
17809e8717A15924J18378r7434h3016E7345Q9018a96887P0746k73371i885B51014
17797A59295o5790Q4019b5552A1902a43719e7966C55546d72240a15912a7050A07250
17785A62047h0823k98126a13335B17073a32665k478b8850j61384H0889Q4091a50934
17773A31746D2859K21189c3779q1488A6553a18764I417L91442a41675I3619C7799
17761h7350B5467J93491h3702j3987A02770c38967R6203B11667K74853A11410
17750b11248N1179q7883i6161A61402i1087D2905J19105a6547H7059a04198B68473
$$ plain form
17738 -38279 83448 197036 346325 125742 -77030 116664 78809 199201 87103 387703
17728 387703 236511 43049 -47840 -163811 15909 -179636 27809 10927 181365 172133 94445
17717 94445 -73839 9301 153452 -278693 -212545 345096 46176 42867 -122583 -38106 263415
17705 103655 391503 -37453 -119258 -42653 -40802 172637 370540 208241 318194 114961
17694 -31150 241846 56492 110546 110088 244862 174112 -87967 202735 229302 112478 -117675
17682 76343 276587 47999 188272 -49965 125048 62652 78101 -222054 15114 -23228 186276
17670 366133 347511 308415 266562 386 32146 227035 29398 50735 85456 154850 -54473 5859
17657 231398 344368 276587 -166471 -169547 82165 264610 221521 -179490 159787 205217 18745
$$ packed form
17738c8279H3448J13588J49289A25742g7030A16664l7855J20392H7103L00600
17728C87703j51192D3049d7840j15971A5909a79636B7809A0927J70438r232p7688
17717I4445g3839I301J44151b78693O6148C45096D6176l309a22583c8106B63415
17705A03655K87848c7453q1805d2653J851A72637J97903j62299J09953A14961
17694c1150B41846E6492N4054m58J34774p0750h7967B02735K6567A12478a17675
17682G6343K00244D7999J40273d9965A25048o2396J5449b22054A5114b3228A86276
17670C66133j8622l9096m1853C86L1760J94889B9398K1337L4721O9394e4473E859
17657B31398J12970o7781a66471l076H2165J82445m3089a79490A59787M5430A8745
$$ plain form
17645 -49414 -291675 266996 38903 303397 150630 -14235 237773 39564 203625 22515
17634 424954 -185496 117335 183927 193768 -90249 -86377 88791 238726 170964 164414 266376
17623 266376 226996 287167 -7580 159264 -2304 -155018 219432 -114069 -41654 -74734 93556
17611 -92068 167490 85023 140173 1134 -50862 20495 173138 -273473 -126135 160764 287014
17600 287014 164593 231006 146889 174767 -448875 184532 -227070 -349128 164890 -137812
17589 -24380 75449 191728 118138 56539 239792 115066 58059 -104018 -73528 -257646 55319
17577 -62944 117023 268036 144476 501492 -4029 -48935 176622 -88134 150878 123874 221097
17566 221097 182313 -187851 156048 33349 78670 235831 -248671 -20879 3036 7870 341613
$$ packed form
17645d9414k42261B66996C8903K64494A50630a4235B37773C9564J64061B2515
17634D24954a85496A17335O6592R841i0249L872H8791J49935o7762o550J01962
17623B66376l9380O0171g580A59264b304j52714B19432a14069d1654l3080I3556
17611i2068A67490q2467N5150A134e0862B0495J52643b73473a26135A60764J26250
17600B87014j22421O6413q4117K7878d48875A84532b27070j22058A64890a37812
17589b4380G5449J16279p3590E6539J83253A15066n7007a04018L0490j84118E5319
17577f2944A17023J51013j23560L57016d029m4906A76622h8134A50878k7004R7223
17566B21097l8784a87851A56048C3349M5321J57161b48671b0879C036M834L33743
$$ plain form
17555 341613 181835 211600 289124 151998 372205 265767 413742 313918 -195230 -30768
17544 114574 80421 363856 64373 -287260 54508 262530 182379 413531 112578 208110
17534 208110 29314 237476 330464 296300 409425 114069 607531 513 389595 284887 376757
17523 376757 33434 40982 279525 279800 188318 146259 163474 349705 535742 397082 380430
17512 380430 202938 814082 878570 974745 834763 883928 522649 437771 425268 259596
17502 259596 504291 161149 263168 164564 501107 561904 824113 731436 968656 763329
17492 763329 982727 1108410 696719 581420 261749 481357 406895 217608 516279 260091
17482 260091 672947 -2982 367861 586018 152052 243999 -161981 384262 172451 442325
$$ packed form
17555C41613j59778K9765P7524j37126K20207j06438J47975r9824a95230c0768
17544A14574l4153K83435F4373b87260E4508K08022q0151K31152A12578R5532
17534B08110B9314K08162R2988l4164J13125A14069M93462E13L89082j04708R1870
17523C76757C3434P548K38543K75r1482m2059J7215J86231J86037j38660j6652
17512C80430j77492O11144O4488R6175j39982M9165l61279q4878j2503j65672
17502B59596K44695A61149J02019r8604L36543O0797K62209r2677K37220k05327
17492G63329K19398J25683m11691j15299B61749K19608p4462j89287K98671k56188
17482B60091M12856b982C67861K18157A52052R1947a61981C84262A72451K69874
$$ plain form
17472 442325 314566 257636 109156 388563 111347 494705 330241 248308 202087 64346
17461 121546 511042 419825 333212 103040 226683 732949 149842 395753 289148 10888
17450 499527 60103 357551 360287 400320 435668 396964 263456 182587 264119 304525 627744
17439 627744 102397 265662 237490 220181 579138 111787 320226 477428 379566 613013
17429 613013 122682 243419 205575 560195 687605 474783 368434 613738 467161 730002
17419 730002 586977 13069 305656 231060 329089 477491 272321 241362 603082 417275
17409 417275 301436 28149 316598 251720 321765 253356 382556 23522 -12281 369026 807843
17398 807843 107265 434954 3913 374346 242869 367198 498643 121917 182030 247375
$$ packed form
17472D42325j27759n6930A09156K79407A11347L83358j64464q1933m6221F4346
17461A21546L89496r1217q6613A03040J23643N06266A49842K45911j06605A0888
17450D99527F0103K97448K736M0033L5348l8704j33508q0869Q1532M0406L23219
17439F27744A02397J63265k8172j7309L58957A11787K08439J57202r7862K33447
17429F13013A22682J20737l7844L54620J27410k12822j06349K45304j46577K62841
17419G30002j43025A3069K92587p4596R8029J48402k05170l0959L61720j85807
17409D17275j15839B8149K88449o4878P0045o8409J29200B3522a2281C69026M38817
17398H07843A07265L27689C913L70433j31477J24329J31445A21917O0113O5345
$$ plain form
17388 247375 295616 284753 334565 193289 344848 -117540 -22423 289022 429971 405346
17378 405346 236763 308981 137140 421577 246710 200758 81813 429241 149953 85326
17368 85326 306199 364939 491417 465470 452894 390032 130787 109711 547942 38653 193845
17357 193845 431432 -174627 400691 307648 107886 512604 360116 253723 13836 73530
17347 73530 86270 46002 234476 310154 459788 313984 398997 462969 232087 -154875 510259
17335 394760 214436 441817 109639 101865 349557 98474 -12167 365019 12542 159674
17325 159674 47802 361356 -240507 -49550 246774 609627 208456 227808 399142 370216
17315 370216 -76816 442056 168880 500968 -256242 227809 447348 170246 76702 127167
$$ packed form
17388B47375M8241j0863M9812j41276J51559a17540b2423B89022J40949k4625
17378D05346j68583P2218A37140K84437j74867m5952H1813L47428A49953o4627
17368H5326K20873N8740J26478k5947j2576o2862A30787k1076M38231C8653J55192
17357A93845K37587a74627D00691r3043A07886M04718j52488j06393A3836N9694
17347G3530J2740m0268J88474P5678J49634j45804Q5013O3972k30882a54875E10259
17335C94760j80324K27381A09639p774K47692I8474a2167C65019A2542J47132
17325A59674D7802L13554b40507d9550B46774L62853B08456J9352J71334k8926
17315C70216g6816D42056A68880L32088b56242B27809K19539A70246G6702N0465
$$ plain form
17305 127167 299789 110322 188152 530848 456976 103980 102945 -11339 435945 279804
17295 279804 318414 -26165 264193 253356 273711 129501 458568 279602 272270 519913 79671
17283 165850 404764 477308 51334 37955 289534 304609 141387 534613 102262 544681
17273 544681 109780 294477 406037 405148 164640 326340 247660 349430 419404 373991 338685
17262 338685 194341 -8887 468254 555543 394337 150046 214742 117998 356669 411374 360232
17251 360232 -7295 -109672 304528 189421 281377 179454 224869 340574 297562 214965 258968
17240 258968 486312 719518 204716 276813 433545 -4644 58194 87541 497937 434354 -117678
17228 99450 402192 165148 95516 103776 456578 150907 235104 370161 363823 349722 544144
$$ packed form
17305A27167J72622A10322P7830L42696p3872A03980j035a1339D35945j56141
17295B79804L8610b6165B64193j0837K0355A29501L29067j78966p332K47643G9671
17283A65850K38914P2544E1334j3379K51579J5075A41387L93226A02262M42419
17273E44681A09780J84697J11560q89A64640J61700p8680J01770O9974m5413l5306
17262C38685j44344h887D68254Q7289j61206A50046O4696r6744K38671N4705n1142
17251C60232g295j02377C04528j15107R1956j01923M5415J15705m3012q2597M4003
17240B58968K27344K33206B04716P2097J56732d644E8194K9347M10396o3583a17678
17228I9450L02742A65148o9632Q260L52802A50907Q4197J35057o338j4101J94422
$$ plain form
17217 544144 -93738 78925 82516 349128 399288 661483 140127 172952 454467 410254 446858
17206 446858 354848 393002 538262 423890 278246 339495 52877 119081 614861 260868
17195 613758 594716 441834 257133 514441 378016 596030 458764 151538 201424 31773
17184 112203 323294 55263 584481 200612 383979 533150 213312 331986 129001 377297
17174 377297 449267 480833 384848 317614 407783 494271 434517 168767 497767 573456 436155
17163 436155 576247 227827 501992 576567 627637 348509 365697 316430 494592 420393
17153 420393 714696 552986 314051 809567 452102 175587 367538 462779 513299 449503
17143 449503 622509 272371 648938 401954 428148 582423 436424 318106 490211 490745
$$ packed form
17217E44144i3738G8925L591K66612N0160K62195A40127L2825K81515m4213L6604
17206D46858r2010L8154J45260j14372j45644O1249E2877O6204M95780B60868
17195F13758j9042j52882j84701K57308j36425K18014j37266A51538M9886C1773
17184A12203K11091E5263N29218B00612J83367J49171B13312J18674A29001K48296
17174C77297P1970L1566r5985o7234R0169Q6488n9754A68767L29000P5689j37301
17163D36155J40092B27827K74165P4575N1070k79128J7188m9267J78162p4199
17153D20393K94303j61710k38935M95516l57465A75587J91951R5241N0520o3796
17143D49503J73006B72371L76567k46984K6194J54275j45999j18318J72105N34
$$ plain form
17133 490745 678686 633448 534641 344133 772061 384387 198220 744308 593844 553476
17123 553476 568973 786450 345545 298148 536046 551272 529333 324181 678579 286124
17112 222631 336505 531293 335704 537539 546910 739064 806096 336111 587164 760567
17102 760567 604568 549338 634824 665761 494158 480669 601960 829680 957697 405141
17091 250650 420032 629135 469754 480925 583566 905438 800673 427467 523561 818490
17081 818490 953936 978118 406582 784065 666514 659498 698922 755481 281717 375641 472399
17070 472399 485558 746815 910293 743473 462653 1021360 643063 876305 478686 546510
17060 546510 861770 577495 653686 742868 639396 925708 993210 857140 958729 767888
$$ packed form
17133D90745J87941m5238r8807j90508M27928C84387j86167N46088j50464m0368
17123E53476J5497K17477C45545m7397K37898J5226k1939k05152L54398B86124
17112B22631J13874J94788j95589K01835R371J92154O7032C36111K51053J73403
17102G60567j55999n5230Q5486L0937j71603j3489J21291K27720J28017D05141
17091B50650J69382K09103j59381J1171J02641L21872j04765l73206R6094K94929
17081H18490J35446K4182D06582L77483j17551p016L9424N6559B81717R3924R6758
17070D72399J3159K61257J63478j66820k80820N58707l78297K33242l97619O7824
17060E46510L15260k84275P6191Q9182j03472K86312O7502j36070J01589j90841
$$ plain form
17050 767888 908603 835676 932367 818906 1113209 794023 1150089 661862 695754 723857
17040 723857 771065 743542 983655 1021370 742048 606289 437071 591320 968291 1011307
17030 1011307 622971 974902 945006 1198723 1034149 1072081 1108975 728385 582022 860490
17020 860490 1072791 758124 915366 606853 539598 1039609 973408 812742 883667 673119
17010 673119 681856 730393 926878 878093 836292 1046982 1068460 1139568 916134 1028790 1042320
16999 1042320 770720 928142 1012860 1379994 864174 892921 1009725 1193316 829887 795284
16989 795284 989976 1246799 1172513 1198636 1229697 1151135 1586641 1278740 1251573 1183153 1047661
16978 1047661 1258083 1237608 1342773 1045677 987703 1184186 972152 1204300 1315350 1320972
$$ packed form
17050G67888J40715p2927R6691j13461K94303l19186L56066m88227L3892K8103
17040G23857M7208k7523K40113L7715k79322j35759j69218J54249L76971M3016
17030A011307l88336L51931k9896K53717j64574L7932L6894l80590j46363K78468
17020H60490K12301l14667J57242l08513o7255N00011o6201j60666P0925k10548
17010F73119Q737M8537J96485m8785m1801K10690K1478P1108k23434J12656J3530
16999A042320k71600J57422Q4718L67134n15820K8747J16804J83591l63429l4603
16989G95284J94692K56823p4286K6123L1061p8562M35506l07901k7167o8420j35492
16978A047661K10422k0475J05165k97096n7974J96483k12034K32148J11050N622
$$ plain form
16968 1320972 1631767 974353 1300867 1464711 1103696 1164493 1270327 1409617 1475593 1246178
16958 1246178 1327977 1717406 1125876 995846 1609964 1154519 1451227 1233525 1357607 1636164
16948 1636164 1541879 1274763 1631590 1618823 1262539 1325825 1240416 1599411 1506463 1732947
16938 1732947 1712847 1557561 1457151 1648392 2000074 1611654 1534749 1358541 1823744 1624043
16928 1624043 1310685 2233489 2009734 1806242 1738284 1738777 2082430 1608217 2111335 1916856
16918 1916856 2097401 2183944 1800130 2221128 2085183 1976021 2163861 2112753 2205041 2074398
16908 2074398 2019256 1998286 2401535 2077478 2545891 2408428 2099210 2180329 2219678 2309555
16898 2309555 2279300 2239207 2606688 2320335 2175217 2689856 2491697 2462413 2640365 2549572
$$ packed form
16968A320972L10795o57414L26514J63844l61015O0797J05834J39290O5976k29415
16958A246178Q1799L89429n91530j30030O14118m55445K96708k17702J24082K78557
16948A636164r4285k67116L56827j2767l56284O3286q5409L58995r2948K26484
16938A732947k0100j55286j00410J91241L51682l88420p6905j76208M65203j99701
16928A624043l13358R22804k23755k03492o7958M93L43653m74213N03118j94479
16918A916856J80545Q6543l83814M20998j35945j09162J87840n1108R2288j30643
16908B074398n5142k0970M03249l24057M68413j37463l09218Q1119L9349Q9877
16898B309555l0255m0093L67481k86353j45118N14639j98159k9284J77952r0793
$$ plain form
16888 2549572 2502686 2631296 2764432 2482436 2857111 2658337 2712364 2949779 2899019 2712848
16878 2712848 2765667 2933263 3248192 3021861 3005146 3004522 3479545 3311106 3050027 3255378
16868 3255378 3432717 3417685 3236311 3208558 3690650 3566183 3579343 3512239 4025821 3768280
16858 3768280 3567356 3882188 3927111 4039621 3742562 3987152 4102995 4153270 3851145 4101501
16848 4101501 4087977 4348751 4151437 4432069 4420672 4137162 4817352 4730858 4757613 4920531
16838 4920531 4860854 5029609 5172364 5065431 5183963 5334045 5392206 5673012 5494445 5762703
16828 5762703 5603590 5353386 5929045 6289965 6056937 6227592 6095354 6560101 6268175
16819 6268175 6860895 6210331 6778761 7120196 7132625 7069943 7524514 7410586 7740726 7712992
$$ packed form
16888B549572m6886J28610J33136k81996L74675j98774N4027K37415n0760j86171
16878B712848N2819J67596L14929k26331j6715o24M75023j68439k61079K05351
16868C255378J77339j5032j81374k7753M82092j24467J3160o7104N13582k57541
16858C768280k00924L14832M4923J12510k97059K44590J15843N0275l02125K50356
16848D101501j3524K60774j97314K80632j1397k83510O80190q6494K6755J62918
16838D920531n9677J68755J42755j06933J18532J50082N8161K80806j78567K68258
16828E762703j59113k50204N75659L60920k33028J70655j32238M64747k91926
16819F268175N92720o50564N68430L41435J2429o2682M54571j13928L30140k7734
$$ plain form
16809 7712992 7855234 7631594 8105497 8435549 8093481 8607795 8794463 8961989 9013694 9350694
16799 9350694 8955008 9542488 9884142 9927687 10574412 10637243 10953629 10880804 11189675 11487818
16789 11487818 11560074 11703911 12121507 12736852 12875821 13083263 12935363 13965932 14219799
16780 14219799 14534037 14732444 15111663 15561806 16163213 16084313 16690639 16995382 17573364
16771 17573364 18121051 18603326 19239090 19625709 20129979 20623939 21289691 22054236 22406635
16762 22406635 23215705 23697238 24492042 25470910 26020138 27210486 27906733 28869804 29628644
16753 29628644 30697947 31969785 32452268 33853659 34813585 36263536 37293651 39155484
16745 39155484 40232889 41692115 43088304 44927055 46480480 48319725 50263266 52094065
$$ packed form
16809G712992J42242k23640M73903L30052l42068N14314J86668J67526N1705L37000
16799I350694l95686N87480L41654M3545O46725O2831L16386p2825L08871K98143
16789A1487818P2256J43837M17596O15345J38969K07442j47900J030569K53867
16780A4219799L14238J98407L79219M50143O01407p8900O06326L04743N77982
16771A7573364N47687M82275O35764L86619N04270M93960O65752P64545L52399
16762B2406635Q09070M81533P94804R78868N49228J190348O96247R63071P58840
16753B9628644J069303J271838M82483J401391R59926J449951J030115J861833
16745C9155484J077405J459226J396189J838751J553425J839245J943541J830799
$$ plain form
16737 52094065 54392155 56481059 58233398 60727146 63099293 65736350 68315561 70892927
16729 70892927 73725575 76437292 79565859 82694069 85226471 88961537 92062627 95221158
16721 95221158 98792164 101840211 105379215 108387679 111430591 114470040 117540210 120195485
16713 120195485 122409004 124787227 126721582 128338629 129625031 130883617 131501135 131772750
16705 131772750 131777563 131068461 130461639 129097155 127713440 125814451 123849596 121257432 118492655
16696 118492655 115994790 112936848 109481156 106778856 103587099 100313798 97029609 93751656
16688 93751656 90388691 87498887 84278541 80806884 78145170 75271657 72111704 69210741
16680 69210741 66741439 64104231 61811460 59538231 57377811 54724063 52982576 50975378
$$ packed form
16737E2094065K298090K088904J752339K493748K372147K637057K579211K577366
16729G0892927K832648K711717L128567L128210K532402L735066L101090L158531
16721I5221158L571006L048047L539004L008464L042912L039449L070170K655275
16713A20195485K213519K378223J934355J617047J286402J258586O17518K71615
16705A31772750M813p09102o06822j364484j383715j898989j964855k592164k764777
16696A18492655k497865l057942l455692k702300l191757l273301l284189l277953
16688I3751656l362965k889804l220346l471657k661714k873513l159953k900963
16680F9210741k469302k637208k292771k273229k160420k653748j741487k007198
$$ plain form
16672 50975378 48888317 47560784 44991910 44164932 42533814 40616074 38854700 37924999
16664 37924999 36419952 35289514 33810456 32841617 32092946 30856248 29620965 28884664
16656 28884664 27709438 27023877 26273175 25334844 24495513 23874261 22687903 22316440 21565870
16647 21565870 21059129 20528922 19812544 18945313 18986257 18601269 17868589 17280653 16806543
16638 16806543 16607559 16109860 15493117 15152990 14822207 14353876 14284480 14003786 13501281
16629 13501281 13104417 12690017 12446212 11935456 11792173 11410801 11413928 11121826 10596024 10735861
16619 10735861 10320638 10232777 9781527 9859747 9765213 9657756 9095853 9092472 8844689 8607819
16609 8607819 8697597 8145222 8668569 7996855 8142835 7671997 7437403 7487234 6920975 7430028
$$ packed form
16672E0975378k087061j327533k568874q26978j631118j917740j761374r29701
16664C7924999j505047j130438j479058r68839p48671j236698j235283p36301
16656B8884664j175226o85561p50702r38331q39331o21252j186358l71463p50570
16647B1565870n06741n30207p16378q67231M0944l84988p32680n87936m74110
16638A6806543j98984m97699o16743l40127l30783m68331o9396k80694n02505
16629A3501281l96864m14400k43805n10756j43283l81372L127k92102n25802J39837
16619A0735861m15223q7861m51250P8220r4534j07457n61903l381k47783k36870
16609H607819Q9778n52375N23347o71714J45980m70838k34594M9831n66259N09053
$$ plain form
16599 7430028 7008740 6960862 6654884 6424499 6628026 6539683 6193251 6229287 5933417 5944196
16589 5944196 5905945 5666125 5740858 5832351 5462300 5458938 5539849 5381063 4875682 5167405
16579 5167405 4800308 4912826 4927941 5104968 4969394 4862244 4593779 4565723 4409797 4179575
16569 4179575 4315345 4213098 4211120 4117922 4058458 3716524 4025500 3971063 3508901 3965826
16559 3965826 3911925 3883055 3603394 3809610 3483224 3561040 3544846 3332276 3471770 3290710
16549 3290710 3418876 3249361 3306628 3211233 3130036 3138098 3380256 3090439 3305101 3569850
16539 3569850 2955032 3178586 2802023 2714545 2946500 2802313 2895753 2589242 2688871 2601298
16529 2601298 2636628 2862630 2761602 2520112 2571471 2436631 2255909 2521324 2300384 2405855
$$ packed form
16599G430028m21288m7878l05978k30385K03527q8343l46432L6036k95870J0779
16589E944196l8251k39820P4733R1493l70051l362Q0911j58786n05381K91723
16579E167405l67097J12518J5115J77027j35574j07150k68465k8056j55926k30222
16569D179575J35770j02247j978r3198n9464l41934L08976n4437m62162M56925
16559C965826n3901k8870k79661K06216l26386P7816j6194k12570J39494j81060
16549C290710J28166j69515N7267r5395q1197Q062K42158k89817K14662K64749
16539C569850o14818K23554l76563q7478K31955j44187R3440l06511R9629q7573
16529B601298L5330K26002j01028k41490N1359j34840j80722K65415k20940J05471
$$ plain form
16519 2405855 2634337 2294337 2508692 2469844 2230072 2794793 2214889 2201415 2187219 1877854
16509 1877854 2276134 1962033 2292308 2025479 2159173 2209987 2207747 2399163 2299128 1909147
16499 1909147 2082982 1947967 2031163 1831439 1802996 2154431 1835175 2040705 1973167 1793475
16489 1793475 1959072 1898860 1668106 1905075 1565799 2012862 1239742 1771365 1487128 1677511
16479 1677511 1747993 1800003 1456023 1766527 1643035 1887154 1558511 1477720 1605176 1457790
16469 1457790 1325470 1694368 1735865 1255529 1357847 1189339 1334220 1549184 1423826 1531338
16459 1531338 1224825 1120477 1485543 1118399 1761909 1375786 1373973 1328195 1281253 1178619
16449 1178619 1572561 1095372 1483788 1055452 1362391 1043721 1239730 1185111 1306227 1111800
$$ packed form
16519B405855K28482l40000K14355l8848k39772N64721n79904j3474j4196l09365
16509A877854L98280l14101L30275k66829J33694N0814k240J91416j00035l89981
16499A909147J73835j35015Q3196j99724k8443L51435l19256K05530o7538j79692
16489A793475J65597o0212k30754K36969l39276M47063p73120N31623k84237J90383
16479A677511P0482N2010l43980L10504j23492K44119l28643q0791J27456j47386
16469A457790j32320L68898M1497m80336J02318j68508J44881K14964j25358J07512
16459A531338l06513j04348L65066l67144O43510l86123j813m5778m6942j02634
16449A178619L93942m77189L88416m28336L06939l18670J96009n4619J21116j94427
$$ plain form
16439 1111800 944275 1453702 1305529 1344455 1080209 1100197 1328356 1249453 1130805 1310185
16429 1310185 1396929 1141290 1062074 940218 1089602 1131328 1073032 653013 1165696 911454
16419 911454 1145913 1229744 1278540 903070 1101309 736944 1305632 990431 939382 1123227
16409 1123227 974809 817283 1089550 960961 1187506 1119236 1009892 840580 603561 836697
16399 836697 869969 796233 819201 543191 1280957 911241 907177 851604 836291 929062 791220
16388 791220 753993 912290 840504 992499 970811 1065589 1028706 739302 675552 980757 1111536
16377 1111536 659856 753639 910560 592105 628088 1220450 863062 887319 959510 545855
16367 545855 875509 794571 628697 835068 565979 943011 520009 863574 787704 960018
$$ packed form
16439A111800j67525N09427j48173L8926k64246J9988K28159p8903j18648J79380
16429A310185Q6744k55639p9216j21856J49384M1726n8296m20019N12683k54242
16419I11454K34459Q3831M8796l75470J98239l64365N68688l15201n1049J83845
16409A123227j48418j57526K72267j28589K26545o8270j09344j69312k37019K33136
16399H36697L3272p3736K2968k76010P37766l69716m064n5573j5313R2771j37842
16388G91220l7227J58297p1786J51995k1688R4778l6883k89404o3750L05205J30779
16377A111536m51680R3783J56921l18455L5983N92362l57388K4257P2191m13655
16367E45855L29654q0938j65874K06371k69089L77032m23002L43565p5870J72314
$$ plain form
16357 960018 798190 521567 580296 675278 600452 757457 727541 558866 475513 693326
16347 693326 743781 785951 485952 785738 889053 337673 631684 644599 557012 656503
16337 656503 805976 428180 548456 337888 850002 826622 681081 585091 707122 808780
16327 808780 724970 795454 773972 710661 598009 570810 502260 676492 530966 445055 794581
16316 794581 494555 377353 626270 641803 526126 272282 586929 789788 663871 576900
16306 576900 514384 709573 641208 816253 582345 660098 309939 380755 345888 214434
16296 214434 382903 354241 236886 620533 416493 520397 433444 220425 378496 631027
16286 631027 411671 546332 378717 587187 349641 459698 376205 630395 526666 575776
$$ packed form
16357I60018j61828k76623N8729R4982p4826J57005k9916j68675q3353K17813
16347F93326N0455M2170k99999K99786J03315C37673K94011J2915q7587R9491
16337F56503J49473l77796J20276k10568N12114k3380j45541r5990J22031J01658
16327H08780q3810P0484k1482o3311j12652k7199o8550J74232j45526q5911L49526
16316G94581l00026j17202K48917J5533j15677k53844L14647K02859j25917q6971
16306E76900o2516J95189o8365J75045k33908P7753C09939P0816l4867j31454
16296B14434J68469k8662j17355L83647k04040J03904q6953k13019J58071K52531
16286F31027k19356J34661j67615K08470k37546J10057q3493K54190j03729M9110
$$ plain form
16276 575776 605736 553835 841005 598667 341183 663175 497533 325932 698358 740163
16266 740163 464570 551990 185186 433625 465057 406723 199090 295617 407773 642300
16256 642300 217634 337427 496017 564518 329629 637407 119915 356170 516953 661005
16246 661005 333308 395839 519716 619722 87191 334266 849454 509162 171448 359772
16236 359772 493562 676825 356102 345471 322117 551221 473956 498852 341943 180411
16226 180411 30232 429717 151225 307228 442675 126784 123382 376813 137839 359580
16216 359580 160551 117619 507736 331620 600532 246910 433489 380115 424068 395719
16206 395719 365631 232224 173008 448146 604147 349246 397640 359282 395621 649140
$$ packed form
16276E75776K9960n1901K87170k42338k57484L21992j65642j71601L72426M1805
16266G40163k75593Q7420A85186K48439L1432n8334A99090R6527J12156K34527
16256F42300B17634J19793J58590O8501k34889L07778A19915K36255J60783J44052
16246F61005l27697O2531J23877J00006H7191K47075N15188l40292A71448J88324
16236C59772J33790J83263l20723j0631k3354K29104p7265K4896j56909j61532
16226A80411C0232L99485A51225J56003J35447A26784l402K53431A37839K21741
16216C59580A60551m2932L90117j76116K68912B46910J86579n3374M3953k8349
16206C95719l0088j33407n9216K75138J56001k54901M8394l8358L6339K53519
$$ plain form
16196 649140 -567 277308 141474 413481 616017 229589 435199 455168 394472 26810 279278
16185 279278 94551 355287 396467 634704 127505 316078 212033 321959 182004 234045
16175 234045 155470 360468 244337 227989 -43197 273835 145659 231225 236122 688359 386450
16164 386450 240185 -72212 -109571 85883 -29630 213556 108883 612567 -90706 101471
16153 337495 434691 136504 325355 238495 97367 210060 46055 274340 129626 56762
16142 101249 120564 207896 268883 274760 317308 304584 13 189510 -34542 514777 492606 148766
16129 261619 269537 208351 -64372 105896 154238 -67903 261665 -79381 284507 -19587 208663
16117 280237 330279 52682 158737 414690 144668 288081 -8502 120186 461991 -43119
$$ packed form
16196F49140e67B77308j35834K72007K02536B29589K05610J9969o0696B6810K52468
16185B79278I4551K60736M1180K38237A27505J88573j04045J09926j39955N2041
16175B34045p8575K04998j16131j6348d3197B73835j28176Q5566M897M52237l01909
16164C86450j46265g2212l7359H5883b9630B13556j04673N03684i0706A01471
16153C37495R7196A36504J88851q6860I7367J12693D6055K28285A29626E6762
16142A01249J9315Q7332O0987N877M2548j2724A3J89497c4542E14777k2171A48766
16129B61619P918o1186f4372A05896M8342f7903B61665g9381B84507a9587B08663
16117B80237N0042E2682J06055K55953A44668J43413h502A20186L41805d3119
$$ plain form
16106 266477 248416 147260 299079 277863 152635 326686 225947 317889 12818 274259
16096 274259 3940 134962 18123 358247 189455 402814 258339 211443 62181 280729
16086 280729 -319631 67687 92575 102373 125051 12871 66153 -352345 166864 56819 -5614
16074 269979 -110611 85081 107653 153512 146201 292199 -69203 221211 216454 53277 -82890
16062 7677 170411 11477 172878 83103 281603 145490 88695 274314 69978 133820 194977
16051 194977 -36733 27838 20332 46064 -124403 4308 -41453 -34515 108760 -39121 426192
16039 173160 86481 -32798 38835 -4056 25163 22079 -39340 21212 228555 -108815 421943
16027 164504 -45599 -46966 67014 -139901 140976 336148 50279 127838 40239 117107 -152933
$$ packed form
16106B66477j8061j01156J51819k1216j25228J74051j00739R1942A2818K61441
16096B74259C940J31022A8123L40124j68792K13359j44475m6896F2181K18548
16086B80729c19631F7687K4888R798K2678A2871N3282c52345A66864E6819e614
16074B69979a10611H5081K2572M5859p311J45998f9203B21211m757E3277h2890
16062G677J62734A1477J61401H3103J98500j36113n6795J85619F9978O3842O1157
16051A94977c6733B7838p506K5732a24403D308d1453O938A08760c9121D26192
16039A73160H6481c2798C8835d056B5163l084c9340B1212K07343a08815D21943
16027A64504d5599j367F7014a39901A40976J95172E0279P7559D0239P6868a52933
$$ plain form
16015 -301304 151750 345762 267478 -275549 5932 121771 163206 -194894 103373 76176
16005 76176 239702 159139 179909 204085 42690 -33696 -151449 -188579 251236 164334 -39900
15993 123764 -23312 252213 30043 354994 94604 -39716 43598 226376 206599 416683 95341
15981 -105953 -78887 304659 393903 165384 98203 182374 220652 379141 491130 817007
15971 817007 527983 837552 722117 889679 1005587 375444 201397 114660 359494 33060
15960 45477 73768 -16356 363439 -255154 -41892 -100852 -2655 -29234 -313637 204742 394850
15949 394850 -205191 95688 -191904 -102932 -178581 105628 96641 -253993 204482 -215448
15938 41831 -233694 32506 67638 -319534 -129 153422 -388269 110164 -111106 12106 197771
$$ packed form
16015c01304A51750J94012p8284b75549E932J15839M1435a94894A03373k7197
16005G6176J63526q0563K0770K4176D2690c3696j17753l7130B51236q6902c9900
15993A23764b3312B52213C0043L24951I4604c9716D3598J82778j9777K10084I5341
15981a05953K7066C04659Q9244A65384o7181Q4171L8278J58489J11989L25877
15971H17007k89024L09569j15435J67562J15908C75444j74047q6737K44834C3060
15960D5477K8291a6356C63439b55154d1892n8960b655k6579k84403B04742J90108
15949C94850b05191I5688a91904Q8972p5649A05628q987b53993B04482b15448
15938D1831b33694C2506L5132c19534a29A53422c88269A10164a11106A2106J85665
$$ plain form
15927 197771 -74394 89141 -256288 -162140 244260 36731 -146427 -173120 232925 155458 -318858
15915 -179589 304186 -87180 -220912 -22654 -131997 -193929 55188 -43211 34768 -84313 -173057
15904 -173057 76584 166551 -259000 -42837 200176 -229623 219269 -168026 -26225 271517
15893 -284402 -309544 -106240 133227 -41724 -202351 201784 254616 131196 -147338 -140935
15883 -140935 121046 54238 69071 71793 -47297 -106033 -138519 65251 -192971 -90597 180086
15871 217008 -11569 -8343 -230226 154840 -142882 -52543 164396 101500 72433 190341 168379
15860 168379 47826 154029 -158273 254393 -169385 -157218 -164438 -1175 -32432 -54617 10393
15848 -87594 -239367 -201019 17613 -242826 3969 61212 184091 -173089 -187387 -252558 -187631
$$ packed form
15927A97771g4394H9141b56288R4148B44260C6731a46427k6693B32925p7467c18858
15915a79589C04186h7180j33732b2654j09343o1932E5188d3211C4768h4313q8744
15904a73057G6584Q9967b59000d2837B00176b29623B19269a68026b6225B71517
15893b84402k5142a06240A33227d1724j60627B01784N2832j23420a47338O403
15883a40935A21046E4238J4833K722d7297n8736l2486F5251a92971i0597A80086
15871B17008a1569L226k21883A54840a42882e2543A64396o2896k9067J17908k1962
15860A68379D7826J06203a58273B54393a69385J2167p220a175l1257k2185A0393
15848h7594j51773L8348A7613b42826C969N7243J22879a73089j4298o5171O4927
$$ plain form
15837 -187631 -47082 -98245 164848 89333 -55388 153314 -217679 178398 -67043 164433
15826 156479 -275187 66249 -235890 -91526 -269918 188750 -19619 -196829 24896 -32424
15815 315338 367203 33362 91426 -81025 -367226 -204045 35983 80388 -240030 -20734 71386
15803 -382984 38947 -306013 60531 -303282 -302013 91527 -93791 42082 137543 143041 -129454
15791 223608 60195 -118897 -54478 132575 92999 289979 3985 -112712 -35032 -284931 -77509
15779 163843 -77840 -49595 -356487 -263413 -48061 7199 -118596 105424 115883 -85811 -75471
15768 -75471 1710 27275 -18738 222077 213325 -100731 -60149 -271845 414710 122229 18889
15756 -547551 173712 281568 145736 -138108 47524 -120170 -268961 -134765 -23489 176480
$$ packed form
15837a87631d7082n1163A64848p5515e5388A53314b17679A78398f7043A64433
15826A56479b75187F6249b35890i1526j78392A88750a9619j77210B4896c2424
15815C15338N1865C3362N8064h1025k86201J63181C5983M4405b40030b0734G1386
15803c82984C8947c06013F0531c03282J269I1527i3791D2082R5461N498a29454
15791B23608F0195a18897e4478A32575l9576J96980C985a12712c5032k49899g7509
15779A63843g7840K8245l06892R3074d8061G199a18596A05424J0459h5811J0340
15768g5471A710K5565a8738B22077q752a00731M0582k11696D14710A22229A8889
15756e47551A73712J07856j35832a38108D7524a20170j48791J34196b3489A76480
$$ plain form
15745 125778 -123816 -31582 294977 -177072 43775 122270 -71350 173685 -48165 135530
15734 149110 -378183 51637 -239543 -330544 141140 78711 -122680 62389 -157162 259877
15723 66366 249785 -171788 55145 -95466 74237 131519 -25887 -18611 -141617 -123613 -83803
15712 -83803 37943 -42342 370923 75150 -298867 73002 130530 -373067 -125900 -135670 366448
15700 36897 13743 116828 231790 -236081 -205232 27029 12980 -154649 47311 -296856 -191079
15689 -191079 35652 -435512 105812 -159747 222829 38019 -64013 -11746 -76789 -33892 -372871
15678 -372871 52063 -304201 135397 155250 -208517 184438 34102 -235282 61331 295244
15668 295244 -232960 -148943 49584 -109524 -117016 250207 -4025 43500 31240 173385 -319572
$$ packed form
15745A25778a23816c1582B94977a77072D3775P8495g1350A73685d8165A35530
15734A49110c78183E1637b39543r1001A41140o2429a22680F2389a57162B59877
15723F6366J83419a71788E5145i5466G4237N7282b5887P276j23006J8004L9810
15712h3803C7943d2342C70923G5150b98867G3002N7528c73067a25900r770C66448
15700C6897A3743J03085J14962b36081L0849B7029A2980a54649D7311b96856J05777
15689a91079C5652d35512A05812a59747B22829C8019f4013a1746o5043c3892l38979
15678c72871E2063c04201A35397J9853b08517A84438C4102b35282F1331K33913
15668B95244b32960Q4017D9584a09524p492B50207d025D3500j2260J42145c19572
$$ plain form
15656 -89265 120830 -4549 -31269 149518 -233889 98703 -34203 95073 -33371 -204985 45013
15644 140404 -343336 52664 -441593 -36189 -307623 -420113 -170417 28811 71376 -101855
15633 -447367 -34194 -76350 178976 -98196 309351 138647 14817 -20673 13522 20824 11600
15622 11600 -97208 -48636 -619601 253921 -189398 -175745 -241121 32975 94510 76688 -291435
15610 -90776 49025 -258833 181076 -145838 -141878 -112796 438606 -66966 49355 123808 30513
15598 134423 183121 -159733 -210817 -271557 -120088 -196554 -10593 12700 163990 -84014 -20085
15586 3198 -225366 -106418 56672 -33006 -150998 212157 -141942 240112 -332425 -460310
15576 -460310 -108057 -136114 207194 -7944 -17928 -101205 -69873 -162969 -297672 -270532 74759
$$ packed form
15656h9265A20830d549k6720A49518b33889I8703c4203I5073c3371j71614D5013
15644A40404c43336E2664d41593c6189k71434j12490a70417B8811M2565a01855
15633d47367c4194m2156A78976i8196C09351A38647A4817b0673A3522P302r224
15622A1600i7208M8572n70965B53921a89398J3653o5376C2975O1535j7822b91435
15610i0776D9025b58833A81076a45838L960K9082D38606f6966D9355P4453C0513
15598A34423M8698a59733n1084o0740a20088p6466a0593A2700J51290h4014b0085
15586C198b25366a06418E6672c3006j17992B12157a41942B40112c32425j27885
15576d60310a08057k8057B07194g944r984q3277L1332r3096j34703K7140G4759
$$ plain form
15564 49406 61077 -177467 -186238 209984 -187363 177359 -77514 147813 -224870 -191209 -162075
15553 -162075 -2311 105970 -70580 -368148 -199220 81637 -249132 -53555 79154 80693 -334316
15541 -1992 -83374 111918 -542727 -49300 19998 85498 -70346 148828 662 -234969 53562
15529 -14050 -27445 25633 272425 -61555 123144 -164150 68097 270999 -47910 -373788 -28164
15517 -134178 26617 104728 -48951 -170268 403819 51986 -300201 -287248 171975 20546 118674
15506 118674 157244 5316 243459 40966 122726 -122181 143008 13864 42999 113847 -4874
15494 418871 219382 552184 260690 430190 227187 225325 7216 -23152 232751 -1172 42771
15482 -67044 214910 229639 306694 243018 147513 131903 40002 -60684 -118 103604 -25460 257463
$$ packed form
15564D9406J1671a77467q771B09984a87363A77359g7514A47813b24870L3661K9134
15553a62075b311A05970g0580k97568J68928H1637b49132e3555G9154J539c34316
15541a992q1382A11918e42727d9300A9998O5500g0346A48828F62b34969E3562
15529a4050j3395B5633K46792f1555A23144a64150F8097K02902d7910l25878b8164
15517a34178B6617P8111d8951j21317D03819E1986c00201J2953A71975B0546R8128
15506A18674L8570E316K38143D0966Q1760a22181A43008A3864K9135P0848d874
15494D18871j99489L32802B60690J69500k03003j862G216b3152B32751a172D2771
15482f7044B14910J4729P7055o3676r5505j5610D0002f0684a18A03604b5460B57463
$$ plain form
15469 74302 66088 147159 161311 203763 307061 93102 152596 290978 181525 260399 267829
15458 267829 322150 442970 131854 286512 74814 245182 200124 -36936 293154 213509
15448 213509 -138235 110751 -31379 196846 115947 -4543 365379 2509 92227 26237 417366
15437 417366 -115238 117974 212990 195729 122471 -2458 134667 147603 124633 53265 717531
15426 717531 794944 585296 1019080 449064 721619 469358 274105 406895 259684 145367
15416 145367 243558 93150 -90516 -74492 -49466 194055 -70296 154173 89509 -2562 -45733
15405 -45733 141351 -47660 -385183 -14424 82907 96973 -119062 -76194 -67816 -50562 -38910
15394 -38910 274108 -320250 -48313 -179352 29961 214464 285030 58728 -232208 -74968 -121392
$$ packed form
15469G4302q214Q1071J4152M2452J03298I3102N9494J38382j09453P8874P430
15458B67829N4321J20820A31854J54658G4814J70368m5058c6936B93154p9645
15448B13509a38235A10751c1379A96846q0899d543C65379B509Q9718B6237L91129
15437D17366a15238A17974R5016j7261p3258b458A34667J2936k2970E3265O64266
15426G17531P7413k09648M33784D49064K72555k52261j95253J32790j47211j14317
15416A45367R8191I3150i0516J6024K5026A94055g0296A54173o4664b562m3171
15405d5733A41351d7660l37523a4424H2907J4066a19062M2868Q378J7254J1652
15394c8910B74108c20250d8313j31039B9961J84503P0566E8728b32208g4968m6424
$$ plain form
15383 -121392 -215637 294996 -5847 -186303 -26415 121725 -287135 -412660 99556 86985 -113534
15371 78632 -20627 -277047 298293 -198075 -73241 180775 170591 152939 -230618 373380
15360 453188 15201 -7103 272584 116106 307984 36934 15823 -1522 106330 215016 -30858
15348 263777 192059 -90061 90404 47426 248538 194795 299910 192821 254490 144638 25368
15336 -35154 -41516 340275 -64359 196180 132364 13618 458603 320550 244306 711948 109679
15324 251182 216398 74417 74282 27357 80254 575955 -176950 48056 -26520 463648 377961
15313 377961 59481 31458 -75847 303938 -64910 -35180 45454 -192328 -134659 -161042 36734
15301 119563 152452 -341693 -65965 -38427 -99461 85207 259947 217614 346308 87540 41729
$$ packed form
15383a21392r4245B94996e847j80456b6415A21725b87135j25525I9556j2571a13534
15371G8632b0627k56420B98293a98075g3241A80775j0184j7652b30618C73380
15360D53188A5201g103B72584A16106J91878C6934A5823a522A06330J08686c0858
15348B63777p1718i0061I0404m2978K01112n3743J05115j07089O1669j09852B5368
15336c5154o362C40275f4359A96180o3816A3618M44985j38053p6244M67642A09679
15324B51182l4784G4417j35B7357N2897M95701a76950D8056b6520D63648q5687
15313C77961E9481k8023g5847C03938f4910K9730D5454a92328N7669k6383C6734
15301A19563L2889c41693f5965K7538o1034H5207J74740m2333J28694H7540D1729
$$ plain form
15289 -74279 -32662 -452217 -35464 101340 -120053 100600 -134878 155017 437299 -120871
15278 -47419 168958 -8143 94659 -205073 -257403 194734 94503 10490 -117905 9754 95202
15267 95202 -12958 -59706 100256 104301 88077 -96420 -15576 -56824 -16554 -5858 237254 -109059
15254 232392 16289 284781 102219 118761 88941 315956 49151 409569 96196 -92326 -226915
15243 -226915 -50475 132387 -88116 350113 -35412 118257 159086 114581 -294422 136647
15232 103990 126249 123169 942936 573512 1594162 1145519 1423895 1421332 761469 347755
15221 514727 21114 340629 166145 -104929 -4437 58089 88803 115100 361589 108065 -129738
15209 585633 298116 586951 -195211 -126557 158709 -97983 37103 -15065 88423 136717 349653
$$ packed form
15289g4279c2662m19555c5464A01340a20053A00600a34878A55017K82282a20871
15278d7419A68958h143I4659b05073n2330A94734I4503A0490a17905I754Q5448
15267I5202a2958m6748A00256M045j6224i6420a5576m1248a6554e858B37254a09059
15254B32392A6289K68492A02219J6542k9820K27015D9151L60418I6196i2326j34589
15243b26915e0475A32387h8116C50113c5412A18257M0829m4505b94422A36647
15232A03990K2259l080Q19767l69424J020650m48643K78376k563o59863C47755
15221E14727B1114L19515A66145a04929d437E8089L0714K6297K46489A08065a29738
15209E85633k87517K88835a95211O8654A58709i7983C7103a5065H8423M8294K12936
$$ plain form
15198 349653 186816 14175 -249303 -22143 128996 -126055 195823 49988 394979 6148
15187 -439505 5685 32478 5783 26805 -132941 170057 31476 -222375 -18292 189940 152709
15176 152709 -138959 343971 6821 -1343 32308 251590 -362961 174147 259082 -117347 323395
15164 -29026 -74689 26924 190798 68922 171976 -159445 118412 61138 -202747 130808
15153 243038 159767 166115 164049 -38116 -234420 107453 119570 -139497 324035 72420 248927
15142 248927 -17377 222187 125184 -86290 37970 109152 265199 28671 63982 344453 195433
15131 195433 -244629 169297 243782 -39928 356605 15667 69106 -184282 -168736 -278842
15121 -278842 80562 124633 101162 -257612 130416 2270 31129 62066 28752 304157 249571
$$ packed form
15198C49653j62837A4175b49303b2143A28996a26055A95823D9988L44991F148
15187d39505E685K6793E783K1022a32941A70057C1476b22375a8292A89940l7231
15176A52709a38959C43971F821a343C2308K19282c62961A74147Q4935a17347C23395
15164b9026m5663B6924J63874F8922J03054a59445A18412n7274b02747A30808
15153B43038q3271O348k066c8116j96304A07453J2117a39497C24035G2420J76507
15142B48927a7377B22187r7003h6290C7970P1182J56047B8671L5311K80471j49020
15131A95433b44629A69297P4485c9928C56605A5667N3439a84282J5546j10106
15121b78842H0562M4071k3471b57612A30416B270K8859L0937B8752K75405n4586
$$ plain form
15110 249571 211039 296814 244707 -137459 311869 438507 197085 115242 -71716 132366
15099 71859 -19231 148093 196713 -23222 -35958 275860 159536 105354 -245357 177473 -70940
15087 9522 26618 233142 -145239 131208 205353 4539 -37011 204130 60877 426321 190557
15075 -26498 408756 291155 99373 22963 244425 100689 -44889 36342 -369547 153015
15064 250888 -37835 503475 -49815 297894 -196493 50978 50459 188142 107884 190346 140319
15053 140319 480882 258694 193102 92299 422668 278958 4639 170255 248632 104767
15042 393288 155210 126290 152603 46745 -62580 697364 -52003 726242 277772 260067 430829
15031 430829 289480 254167 143779 413621 113740 654347 378541 528429 371935 344921
$$ packed form
15110B49571l8532Q5775n2107a37459C11869J26638A97085q1843g1716A32366
15099G1859a9231A48093M8620b3222j2736B75860j16324n4182b45357A77473g0940
15087I522J7096K06524a45239A31208P4145D539c7011B04130F0877L65444A90557
15075b6498D08756j17601I9373B2963K21462A00689d4889C6342c69547A53015
15064B50888c7835E03475d9815B97894a96493E0978n19J37683q0258Q2462n0027
15053A40319L40563k22188o5592I2299L30369j43710D639J65616P8377A04767
15042C93288A55210k8920K6313D6745f2580F97364e2003G26242B77772j7705J70762
15031D30829j41349l5313j10388K69842A13740N40607k75806J49888j56494k7014
$$ plain form
15021 344921 258060 308958 212897 270826 396431 450857 165117 443293 547717 485130 613006
15010 613006 491471 333814 550591 386760 437336 537863 472952 561326 583838 287540
14999 285147 135198 330816 344256 465173 124708 356400 444952 487630 223550 554259
14989 554259 385706 356505 377906 77925 213146 384603 553802 716998 757913 441551
14979 441551 47850 692683 25489 204207 584573 41313 420276 591358 583542 790134
14969 790134 407568 625381 784719 890532 689112 812145 834774 476869 279568 290721
14959 290721 243941 659296 652278 703346 143781 228032 601719 401877 553860 140103
14948 376294 85651 611814 411915 645966 405840 44018 145225 273249 327284 545365
$$ packed form
15021C44921q6861N0898r6061N7929J25605N4426A65117K78176J04424o2587J27876
15010F13006j21535j57657K16777j63831N0576J00527o4911Q8374K2512B87540
14999B85147A35198J95618J3440J20917A24708K31692Q8552M2678B23550L30709
14989E54259j68553k9201K1401G7925J35221J71457J69199J63196M0915l16362
14979D41551D7850O44833B5489J78718L80366D1313L78963J71082p816K06592
14969G90134l82566K17813J59338J05813k01420J23033K2629l57905j97301J1153
14959B90721m6780M15355p018N1068A43781Q4251L73687j99842J51983A40103
14948C76294H5651N26163j99899K34051k40126D4018J01207J28024N4035K18081
$$ plain form
14938 545365 445729 594055 168324 448695 42945 409334 299112 775916 370862 526933
14928 526933 625098 689597 571085 372598 525963 87884 506139 567553 123869 790206
14918 790206 305761 483237 785189 588854 1016201 1238567 1101715 1236581 1498094 1681533
14908 1681533 1407855 1490528 1594513 1723368 1514954 1420427 1876228 1749159 2037317 1512638
14898 1512638 1321887 1333811 1333552 993980 853992 500955 516456 974824 753886 283066
14887 292934 119322 152452 645659 366568 179171 184883 453700 768127 431231 139458
14876 571475 358862 532056 377408 219089 501174 206128 514353 720240 893209 721552
14866 721552 720592 589268 694689 727527 692730 793981 774957 519296 421983 514562 443923
$$ packed form
14938E45365r9636J48326A68324K80371D2945L66389j10222M76804C70862J56071
14928E26933R8165O4499j18512j98487J53365H7884M18255O1414A23869O66337
14918G90206C05761J77476L01952j96335M27347K22366j36852J34866K61513J83439
14908A681533k73678Q2673J03985J28855k08414r4527M55801j27069K88158n24679
14898A512638j90751J1924k59l39572j39988l53037J5501M58368k20938B83066
14887B92934A19322L3130M93207k79091A79171N712K68817L14427l36896A39458
14876E71475k12613J73194j54648j58319K82085B06128L08225K05887J72969j71657
14866G21552r60j31324J05421L2838l4797J01251j9024k55661r7313R2579p0639
$$ plain form
14855 443923 505926 486440 607846 873149 373957 442996 606689 813078 857529 940288
14845 940288 162006 695519 324548 289837 85155 568148 458305 712447 460892 266516
14835 266516 509020 497544 690204 583183 400085 684505 378766 579736 606115 864717
14825 864717 1000611 864548 1032127 1175752 806538 812024 651584 926502 471263 478166
14815 478166 498756 311015 626814 725867 487622 683175 317715 564656 782370 439288
14805 439288 777971 636647 617546 933405 757756 597461 486743 729253 210945 401631
14795 401631 653864 808447 512128 461559 1038906 899128 821606 840026 1083951 1071274
14785 1071274 808563 451737 700163 650787 34284 623378 189061 405328 229900 367177
$$ packed form
14855D43923O2003j9486J21406K65303C73957O9039J63693K06389M4451Q2759
14845I40288A62006N33513C24548l4711H5155M82993j09843K54142k51555j94376
14835B66516K42504j1476J92660j07021j83098K84420l05739K00970K6379K58602
14825H64717J35894j36063J67579J43625l69214N486j60440K74918m55239O903
14815D78166K0590j87741L15799R9053k38245J95553C17715K46941K17714l43082
14805D39288L38683j41324j9101L15859j75649j60295j10718K42510B10945J90686
14795D01631K52233J54583k96319n0569N77347j39778p7522J8420K43925j2677
14785A071274k62711l56826K48426m9376C4284N89094A89061K16267j75428J37277
$$ plain form
14775 367177 612225 703733 508378 532194 912582 658667 449456 781017 713497 629729
14765 629729 876712 992684 517596 1089246 953112 630300 919322 929060 817474 1155942
14755 1155942 811370 502685 746407 541332 448692 511074 641766 748540 796869 329777
14744 389143 566438 295637 826397 511268 453279 502177 584160 1057688 674611 477924
14734 477924 532187 620382 470815 624223 649600 763386 859891 876587 923792 763888 998963
14723 998963 785812 900406 678709 1312612 535533 1167402 764179 898510 1248417 1065094
14713 1065094 1328977 1445401 1492782 1698533 1622372 1514485 1590449 1337937 1420400 1320552
14703 1320552 823527 954587 957584 874140 710578 1148602 853930 890799 975325 705465
$$ packed form
14775C67177K45048R1508j95355K3816L80388k53915k09211L31561o7520q3768
14765F29729K46983J15972m75088N71650j36134l22812K89022R738j11586L38468
14755A155942l44572l08685K43722k05075r2640O2382J30692J06774M8329C29777
14744C89143J77295k70801N30760l15129n7989M8898Q1983M73528l83077j96687
14734D77924N4263Q8195j49567J53408K5377J13786R6505J6696M7205j59904K35075
14723I98963k13151J14594k21697O33903E35533O31869m03223J34331L49907j83323
14713A065094K63883J16424M7381K05751p6161j07887P5964k52512Q2463r9848
14703A320552m97025J31060K997q3444j63562M38024k94672L6869Q4526k69860
$$ plain form
14693 705465 1019836 1187304 799242 1217490 1590322 1194119 1212106 1574048 1687911 1546950
14683 1546950 1966317 1790843 1086729 959318 1003463 980713 944935 1017701 1037474 1102592
14673 1102592 857562 1095750 978637 898982 943250 861427 1049043 741103 935519 1128572
14663 1128572 1562805 1099371 888022 802843 948063 840952 751993 961494 1274910 819557
14653 819557 1074178 1094674 1170212 1042285 860678 985026 865874 987068 771901 1324268
14643 1324268 1111830 816947 1195953 937245 1303260 969308 1255171 1424177 1496498 1380911
14633 1380911 835583 1596505 1268389 1269199 1083482 1000965 1088700 1274240 1374774 1077978
14623 1077978 1067543 1321654 1615988 1083952 1198334 1191088 1056100 1263485 1358824 1132956
$$ packed form
14693G05465L14371J67468l88062M18248L72832l96203J7987L61942J13863j40961
14683A546950M19367j75474p04114j27411M4145k2750l5778P2766J9773O5118
14673A102592k45030K38188j17113p9655M4268q1823J87616l07940J94416J93053
14663A128572M34233m63434k11349q5179J45220j07111q8959K09501L13416m55353
14653H19557K54621K0496P5538j27927j81607J24348j19152J21194k15167N52367
14643A324268k12438k94883L79006k58708L66015l33952K85863J69006P2321j15587
14633A380911n45328P60922l28116Q10j85717q2517Q7735J85540J00534k96796
14623A077978j0435K54111K94334n32036J14382p246j34988K07385R5339k25868
$$ plain form
14613 1132956 1332133 1291581 1167515 1332394 1580759 1394078 1462287 1588060 1586342 1336828
14603 1336828 1481707 1390747 1236867 1563041 1348550 1037271 1425742 1382013 1286162 1457619
14593 1457619 1418250 1636568 1362529 1532495 1659285 1544167 1574341 1603232 1566175 1460427
14583 1460427 1610005 1665781 1458011 1640481 1560032 1613769 1998207 1871138 1743505 1558436
14573 1558436 1702216 1651890 1653525 1778294 1898111 1688918 1384083 1954942 1782199 2013133
14563 2013133 1988589 2024156 1818699 2173728 2186356 2012358 2336484 2071574 2040271 2075661
14553 2075661 2279207 1979121 2220535 2416232 2657674 2263446 2722216 2693692 2824455 3231138
14543 3231138 2949200 3479367 3161987 3677711 3729319 4515547 5194547 5988864 6824584 9217116
$$ packed form
14613A132956J99177m0552j24066J64879K48365j86681O8209J25773j718k49514
14603A336828J44879r0960j53880L26174k14491l11279L88471m3729r5851J71457
14593A457619l9369K18318k74039J69966J26790j15118L0174K8891l7057j05748
14583A460427J49578N5776k07770J82470q0449N3737L84438j27069j27633j85069
14573A558436J43780n0326J635J24769J19817k09193l04835N70859j72743K30934
14563B013133k4544L5567k05457L55029J2628j73998L24126k64910l1303L5390
14553B075661K03546l00086K41414J95697K41442l94228M58770k8524J30763M06683
14543C231138k81938N30167l17380N15724N1608P86228O79000P94317Q35720K392532
$$ plain form
14533 9217116 13383237 19729778 29837158 34467474 20239698 11387630 7088523 5503466
14525 5503466 4503577 4651447 5218561 3806240 3252567 2707873 2559236 2379556 2570543
14516 2570543 2298560 2404475 2520654 2585242 2378917 2305200 2149874 2438673 2314045 2487813
14506 2487813 2272999 2416238 2444829 2260079 2584323 2496988 2277472 2653456 2798454 2843375
14496 2843375 2445214 2368719 2750627 2521077 2807300 2822924 2686804 3188537 2998157 2798125
14486 2798125 2942327 3108738 3087046 2858474 3253531 3269099 3391138 3291268 3436136 3386148
14476 3386148 3185332 3714219 3553048 3469407 3437198 3215617 3680985 3680471 3700540 3730229 3775154
14465 3775154 3778712 3865706 3836104 3755834 4158585 4288335 4271504 4255162 4169027 4216735 4283805
$$ packed form
14533I217116M166121O346541J0107380M630316j4227776q852068m299107j585057
14525E503466r99889J47870N67114j412321n53673n44694j48637j79680J90987
14516B570543k71983J05915J16179O4588k06325p3717j55326K88799j24628J73768
14506B487813k14814J43239K8591j84750L24244q7335k19516L75984J44998M4921
14496B843375l98161p6495L81908k29550K86223J5624j36120N01733j90380k00032
14486B798125J44202J66411k1692k28572L95057J5568J22039r9870J44868m9988
14476C386148k00816N28887j61171q3641l2209k21581M65368n14K0069K9689M4925
14465C775154L558Q6994k9602q0270M02751J29750j6831j6342q6135M7708O7070
$$ plain form
14454 4283805 4331145 4086205 4625080 4398748 4729745 4572084 4520971 4415411 4759597 4820704
14444 4820704 4761832 5083799 4806089 4942395 4913641 5281142 5155792 5434543 5751369 5213355
14434 5213355 5442567 5626455 5725275 5628295 6045650 5738222 5871013 5790964 6124209 6345832
14424 6345832 6101350 6347190 6483987 6367514 6744495 6570911 6544378 7191638 6993435 6877982
14414 6877982 6960623 7403068 6992835 7510396 7564450 7491636 7674982 7715687 8089401 8075353
14404 8075353 8525736 8765187 8654909 9093362 8858605 8873932 9026926 9053075 9188912 9407610
14394 9407610 9434128 9465076 9776658 9869364 9954269 10467796 10554732 10596825 10806661 10910984
14384 10910984 10960671 11024670 11486675 11298812 11277591 11773005 12054668 12147790 12599815 12552204
$$ packed form
14454D283805M7340k44940N38875k26332L30997j57661n1113j05560L44186O1107
14444D820704n8872L21967k77710J36306k8754L67501j25350K78751L16826n38014
14434E213355K29212J83888R8820r6980M17355l07428J32791q0049L33245K21623
14424F345832k44482K45840J36797j16473L76981j73584k6533O47260j98203j15453
14414F877982Q2641M42445m10233N17561N4054p2814J83346M0705L73714j4048
14404H075353M50383K39451j10278M38453k34757J5327J52994K6149J35837K18698
14394I407610K6518L0948L11582R2706Q4905N13527Q6936M2093K09836J04323
14384A0910984M9687O3999M62005j87863k1221M95414K81663R3122M52025m7611
$$ plain form
14374 12552204 12869577 13292500 13507305 13720594 14029057 14245148 14388011 14723718 14693953
14365 14693953 14961294 15813919 16058308 16381790 16352978 16647894 17304968 17150399 18017179
14356 18017179 17821044 18103481 18505365 19078087 19439275 20065346 20482588 21070935 21333806
14347 21333806 21827648 21946222 22692176 23065257 23467370 24015312 24868750 25162428 25865813
14338 25865813 26577022 27211001 27384694 28373120 29322123 29717487 30389070 31141815 32452188
14329 32452188 33080316 34348793 34791169 35781560 36909204 38014055 38876291 40161581 41190405
14320 41190405 42529603 43878572 44875670 46650837 47759720 49519335 50654805 52703346
14312 52703346 54514361 56059862 58076129 60097491 62314132 64828753 66841266 69492614
$$ packed form
14374A2552204L17373M22923K14805K13289L08463K16091J42863L35707k9765
14365A4693953K67341Q52625K44389L23482k8812K94916O57074j54569Q66780
14356A8017179j96135K82437M01884N72722L61188O26071M17242N88347K62871
14347B1333806M93842J18574P45954L73081M02113N47942Q53438K93678P03385
14338B5865813P11209O33979J73693R88426R49003L95364O71583P52745J310373
14329C2452188O28128J268477M42376R90391J127644J104851Q62236J285290J028824
14320D1190405J339198J348969R97098J775167J108883J759615J135470K048541
14312E2703346J811015J545501K016267K021362K216641K514621K012513K651348
$$ plain form
14304 69492614 71905299 74478793 77516568 80044428 83443353 86910038 90304709 94092144
14296 94092144 97606215 102332614 106861278 111300926 115980565 121594358 127125308 133008393
14288 133008393 138978865 145938740 153102636 160192281 168487054 176949998 186446248 195672730
14280 195672730 205381968 216095321 227636121 239353305 252192754 265141995 278872617
14273 278872617 293369256 308348277 323724328 338874960 354183397 368934444 383290439
14266 383290439 397354908 410595458 422496248 433006237 442578594 451210056 459280993
14259 459280993 465755697 469792312 470871577 470700140 470863243 468436355 460108207 453153631
14251 453153631 442793124 431448968 419305541 406283721 392251639 379107744 365070466
$$ packed form
14304F9492614K412685K573494L037775K527860L398925L466685L394671L787435
14296I4092144L514071M726399M528664M439648M679639N613793N530950N883085
14288A33008393N970472O959875P163896P089645Q294773Q462944R496250R226482
14280A95672730R709238J0713353J1540800J1717184J2839449J2949241J3730622
14273B78872617J4496639J4979021J5376051J5150632J5308437J4751047J4355995
14266C83290439J4064469J3240550J1900790J0509989R572357Q631462Q070937
14259D59280993O474704M036615J079265j71437J63103k426888q328148o954576
14251D53153631j0360507j1344156j2143427j3021820j4032082j3143895j4037278
$$ plain form
14244 365070466 350424681 336858215 322714741 309126384 295722221 282126680 269417921
14237 269417921 256836668 244686882 233295317 223306226 212742509 202144478 191821568
14230 191821568 182095706 172883031 164131859 156346636 148631647 141664565 135041475 128949611
14222 128949611 123327785 118039367 113017736 107726921 103308633 99253212 95492414 91404502
14214 91404502 87806952 84110789 81208035 78150688 75124000 72509829 69779624 67473361
14206 67473361 64995080 62765122 60569502 58614283 56544157 54580253 53058837 51653858
14198 51653858 49926028 48450951 46742310 45523673 44188937 43252376 42352323 41222630
14190 41222630 39640029 38389305 37376913 36587243 35397602 34753023 33733565 32815224
$$ packed form
14244C65070466j4645785j3566466j4143474j3588357j3404163j3595541j2708759
14237B69417921j2581253j2149786j1391565r989091j0563717j0598031j0322910
14230A91821568r725862r212675q751172p785223p714989o967082o623090o091864
14222A28949611n621826n288418n021631n290815m418288m055421l760798m087912
14214I1404502l597550l696163k902754l057347l026688k614171k730205k306263
14206F7473361k478281k229958k195620j955219k070126j963904j521416j404979
14198E1653858j727830j475077j708641j218637j334736r36561r00053j129693
14190D1222630j582601j250724j012392p89670j189641o44579j019458r18341
$$ plain form
14182 32815224 31805214 31217519 30920825 29658268 29024986 28216807 27596315 26785687 26363918
14173 26363918 25580318 24991689 24740695 24091954 23617139 22801146 22358923 22205259 21554355
14164 21554355 21048003 20521903 20385450 19326612 19363530 18703282 18481566 18218730 17942654
14155 17942654 17443056 17145612 16831420 16639768 16297865 16105600 15407801 15338599 15074749
14146 15074749 14789624 14601141 14128196 14029042 13615388 13624822 13564957 13152824 12949522 12845051
14136 12845051 12569709 12426835 12005871 12266896 12324898 11651260 11237471 11340274 10927007
14127 10927007 10899397 10895858 10828499 10345778 10453294 10152032 10094330 9829276 9833560 9473451
14117 9473451 9523258 9141854 9107995 9144197 8776121 8653616 8983856 8503395 8236979 8305243
$$ packed form
14182C2815224j010010n87695k96694j262557o33282q08179o20492q10628m21769
14173B6363918p83600n88629k50994o48741m74815q15993m42223j53664o50904
14164B1554355n06352n26100j36453j058838L6918o60248k21716k62836k76076
14155A7942654m99598k97444l14192j91652l41903j92265o97799o9202k63850
14146A5074749k85125j88483m72945r9154m13654R434n9865m12133k03302j04471
14136A2845051k75342j42874m20964K61025N8002o73638m13789J02803m13267
14127A0927007k7610l539o7359m82721J07516l01262n7702k65054M284l60109
14117I473451M9807l81404l3859L6202l68076j22505L30240m80461k66416O8264
$$ plain form
14107 8305243 8188566 8021869 7839452 8100314 7903088 7849472 7757101 7599344 7154318 7249880
14097 7249880 7340082 7051909 7210984 6463353 6924148 6657274 6450634 6717815 6369139 6692023
14087 6692023 6585646 6272316 6300486 5990945 6049784 5943766 6031217 6077649 6016743 5594019
14077 5594019 5582800 5429786 5636886 5608810 5595275 5360207 5632855 5284824 4861252 5324015
14067 5324015 4874091 4938496 4776158 4755560 4798777 4750118 4961056 5127827 4635488 4663815
14057 4663815 4546127 4360508 4611848 4299852 4274657 4592570 4472903 4326861 4271909 4298061
14047 4298061 4406152 4011160 4267176 4266269 4346179 4541127 3858620 3951783 3866730 4059003
14037 4059003 3863782 3767073 3950510 3715295 3495964 3524222 3711841 3833888 3464012 3656827
$$ packed form
14107H305243j16677j66697j82417K60862j97226n3616r2371j57757m45026R5562
14097G249880R0202k88173J59075p47631M60795k66874k06640K67181l48676L22884
14087F692023j06377l13330K8170l09541N8839j06018Q7451M6432o0906m22724
14077E594019j1219j53014K07100k8076j3535k35068K72648l48031m23572M62763
14067E324015m49924O4405j62338k0598M3217m8659K10938J66771m92339K8327
14057D663815j17688j85619K51340l11996k5195L17913j19667j46042n4952K6152
14047D298061J08091l94992K56016r07P9910J94948o82507R3163q5053J92273
14037D059003j95221r6709J83437k35215k19331K8258J87619J22047l69876J92815
$$ plain form
14027 3656827 3563797 3459974 3583656 3331972 3486497 3098906 3147889 3359825 3498860 3147087
14017 3147087 3298918 3004637 2942680 3395243 3151904 2902020 3047930 3235979 2841794 2976448
14007 2976448 2860911 2881886 2567754 3040856 2692016 2856103 2739638 2938929 2473740 2559491
13997 2559491 2561052 2482957 2575963 2636601 2375579 2783941 2579317 2277433 2401121 2432038
13987 2432038 2229474 2565323 2354705 2503603 2201672 2531995 2730564 2591637 2994343
13978 2994343 2963445 3088008 3613476 4357548 6471987 8764496 14103598 24433244 35388987
13969 35388987 24449244 15251954 10391924 7884253 6071459 5344518 4452452 3901779
13961 3901779 4070207 3541441 3456391 3201859 3206932 3054800 2767786 2911550 2652070 2717562
$$ packed form
14027C656827r3030j03823J23682k51684J54525l87591M8983K11936J39035l51773
14017C147087J51831k94281o1957M52563k43339k49884J45910J88049l94185J34654
14007B976448j15537K0975l14132M73102l48840J64087j16465J99291m65189Q5751
13997B559491J561p8095R3006O0638k61022M08362k04624l01884J23688L0917
13987B432038k02564L35849k10618J48898l01931L30323J98569j38927M02706
13978B994343l0898J24563N25468P44072K114439K292509N339102J0329646J0955743
13969C5388987j0939743r197290m860030k507671j812794p26941q92066n50673
13961C901779J68428n28766q5050k54532N073j52132k87014J43764k59480O5492
$$ plain form
13951 2717562 2723675 2539621 2647286 2339364 2462310 2381750 2151664 2120011 2176378 2361250
13941 2361250 2212244 2116006 1970856 1920139 1878333 2292746 2107384 2133110 2191982 2111649
13931 2111649 1847443 1864767 1665638 1674554 1749521 1866245 1746065 1922452 1763988 1709374
13921 1709374 1844364 1822345 1657113 1462989 1656610 1545313 1909317 1593966 1593866 1548689
13911 1548689 1780212 1668864 1742105 1450798 1503791 1696879 1944669 1680710 1391580 1869218
13901 1869218 1522478 1271990 1875098 1758859 1605165 1457142 1593456 1647252 1272733 1362815
13891 1362815 1667575 1564456 1580969 1469900 1759578 1699489 1503681 1344076 1500784 1515957
13881 1515957 1245497 1241554 1630633 987630 1285523 1287876 1236926 1084101 1340192 1352099
$$ packed form
13951B717562O113j84054J07665l07922J22946q0560k30086l1653N6367J84872
13941B361250j49006r6238j45150n0717m1806M14413j85362K5726N8872q0333
13931B111649k64206J7324j99129Q916P4967J16724j20180J76387j58464n4614
13921A709374J34990k2019j65232j94124J93621j11297L64004l15351j00m5177
13911A548689K31523j11348P3241k91307N2993J93088K47790k63959k89130M77638
13901A869218l46740k50488O03108j16239j53694j48023J36314N3796l74519R0082
13891A362815L04760j03119J6513j11069K89678o0089j95808j59605J56708J5173
13881A515957k70460l943L89079o43003K97893K353n0950j52825K56091J1907
$$ plain form
13871 1352099 1363451 1182882 1335691 1615349 1377264 1268062 1428124 1509650 1370872 1444935
13861 1444935 918954 1096364 1160966 1441913 1118010 1316051 1108451 1159652 1147519 998712
13851 998712 1323216 1295972 1418195 1526615 1195359 1179322 1252874 1007936 1274037 1169201
13841 1169201 1038754 1128873 1097444 1126928 772096 1406810 910407 1199055 1013804 911524
13831 911524 1368997 1044036 928193 899010 844398 861568 872075 778382 873487 1212542 788781
13820 788781 1078061 942760 603931 1225355 1010723 840361 1103065 965625 839782 909078
13810 909078 829008 930930 796576 877854 1045553 855665 1036278 848317 840656 747478
13800 747478 717412 654056 555683 656173 790933 641614 1020874 990744 863432 763166
$$ packed form
13871A352099J1352j80569J52809K79658k38085j09202J60062Q1526j38778P4063
13861A444935n25981J77410O4602K80947l23903J98041k07600N1201j2133j48807
13851I98712L24504k7244J22223J08420l31256j6037P3552k44938K66101j04836
13841A169201j30447R0119l1429K9484l54832O34714m96403K88648j85251j02280
13831I11524M57473l24961j15843k9183n4612J7170J0507r3693R5105L39055m23761
13820G88781K89280j35301l38829O21424k14632j70362K62704j37440j25843O9296
13810I09078q0070J01922j34354Q1278J67699j89888J80613j87961p661r3178
13800G47478l0066o3356r8373J00490J34760j49319L79260l0130j27312j00266
$$ plain form
13790 763166 930643 529017 1008633 828231 881482 1007092 737828 759192 820260 843049
13780 843049 716222 794728 660163 725816 915198 1014060 791526 511174 534293 894755
13770 894755 799773 1019338 855110 761152 957156 653642 615305 579441 736533 710345
13760 710345 608564 619753 782038 842774 884754 870771 563560 477581 937920 665301
13750 665301 740385 559786 529898 712708 787222 397742 903529 1135558 866403 624970
13740 624970 795396 1023421 747232 516870 611481 836085 881783 843742 399805 645705
13730 645705 807803 848157 729311 401756 537776 656919 618799 981769 594426 450789
13720 450789 614086 875457 642217 560293 549133 1016464 632199 754429 610925 548760
$$ packed form
13790G63166J67477m01626M79616j80402N3251J25610k69264K1364O1068K2789
13780H43049j26827P8506j34565O5653J89382R8862k22534k80352K3119L60462
13770H94755r4982K19565j64228r3958J96004l03514l8337l5864J57092k6188
13760G10345j01781J1189J62285O0736M1980j3983l07211q5979M60339k72619
13750F65301P5084j80599k9888J82810P4514l89480N05787K32029k69155k41433
13740F24970J70426K28025k76189k30362R4611K24604M5698l8041C99805K45900
13730F45705J62098M0354j18846l27555J36020J19143l8120L62970l87343j43637
13720D50789J63297K61371k33240q1924j1160M67331l84265J22230j43504o2165
$$ plain form
13710 548760 749486 435772 700785 542608 703517 757864 454328 530267 661264 491541
13700 491541 920770 740280 611664 512035 490598 714342 583382 766451 379182 646668
13690 646668 647503 576745 688447 594198 852681 814102 595600 300238 448462 809899 699993
13679 699993 621387 491202 672894 614333 717577 449630 484320 901724 801144 608244
13669 608244 863496 447051 256055 277299 495432 715310 518978 596761 504534 777598
13659 777598 67002 554296 344128 332277 620139 791119 261854 498318 381341 582328
13649 582328 650472 531033 665968 365262 142745 310193 419292 346843 581635 840982
13639 840982 272887 484363 256826 248839 624105 230130 222568 406079 719554 850711
$$ packed form
13710E48760K00726l13714K65013j58177J60909N4347l03536P5939J30997j69723
13700D91541M29229j80490j28616r9629k1437K23744j30960J83069C79182K67486
13690F46668Q35p0758J11702r4249K58483l8579k18502k95362J48224L61437j09906
13679F99993p8606j30185J81692n8561J03244k67947L4690M17404j00580j92900
13669F08244K55252m16445j90996K1244K18133K19878j96332P7783r2227K73064
13659G77598F7002M87294k10168j1851K87862J70980B61854K36464j16977K00987
13649E82328O8144j19439J34935l00706A42745J67448J09099p2449K34792K59347
13639H40982B72887K11476k27537p987L75266B30130p562J83511L13475J31157
$$ plain form
13629 850711 525341 495996 402908 634426 489263 236805 560542 502059 325529 558257
13619 558257 584630 511220 330851 569715 198139 626678 230085 276908 506225 526860
13609 526860 208045 706173 429696 640974 250305 573822 290026 499016 296284 208486
13599 208486 622756 307463 391022 690512 255034 440297 393206 400152 369795 316397 602863
13588 602863 554487 376119 520208 630092 264296 385260 404925 387932 260227 74023
13577 448338 57761 263464 550139 563178 477136 493780 436914 190013 314616 277206 890531
13566 890531 269917 326242 244757 484798 554815 440296 350469 233191 308302 2386 126161
13555 126161 702862 691396 214849 543231 124089 148605 445494 425556 259746 667938
$$ packed form
13629H50711l25370k9345r3088K31518j45163B36805L23737n8483j76530K32728
13619E58257K6373p3410j80369K38864A98139M28539B30085M6823K29317K0635
13609E26860B08045M98128k76477K11278B50305L23517k83796K08990k02732q7798
13599B08486M14270C07463Q3559K99490B55034J85263m7091O946l0357n3398K86466
13588F02863m8376j78368J44089J09884B64296J20964J9665j6993j27705G4023
13577D48338E7761K05703K86675J3039q6042J6644n6866A90013J24603l7410O13325
13566H90531B69917N6325q1485K40041P0017j14519q9827j17278P5111B386J23775
13555A26161N76701j1466B14849L28382A24089K4516K96889j9938j65810M08192
$$ plain form
13545 667938 325682 395310 206119 58020 695456 577051 324106 725160 443660 259715
13535 259715 572133 142386 615047 292014 -10126 475497 152286 262087 312406 87266
13524 376331 257143 310038 255952 182099 404704 316072 319411 417375 122267 411680 193621
13512 291452 444773 458714 442687 536709 201854 391290 213809 337132 80289 453226
13502 453226 277628 91960 467218 293792 138959 12688 152447 229931 232900 231297 141164
13491 141164 124605 298583 368453 164748 332626 446533 411893 256793 131501 239954
13481 239954 320045 43401 181725 728890 175334 228479 142766 126484 367490 543498
13471 543498 370032 187876 256159 111113 682268 26621 254892 422093 376065 387810
$$ packed form
13545F67938C25682O9628j89191E8020O37436j18405k52945M01054k81500j83945
13535B59715L12418A42386M72661B92014a0126D75497A52286J09801N0319H7266
13524C76331j19188N2895n4086p3853K22605q8632L339R7964A22267K89413A93621
13512B91452J53321J3941j6027R4022B01854J89436j77481J23323H0289L72937
13502D53226j75598I1960L75258j73426A38959A2688J39759P7484K969j603r0133
13491A41164j6559J73978O9870A64748J67878J13907l4640j55100j25292J08453
13481B39954Q0091D3401J38324N47165A75334N3145q5713j6282K41006J76008
13471E43498j73466j82156O8283A11113N71155B6621K28271J67201m6028J1745
$$ plain form
13461 387810 200836 183897 85120 123455 -295261 335123 501603 -13382 302154 -193209
13450 255914 382259 61849 277324 12600 338499 338849 259014 4351 484379 277506 333022
13439 333022 336364 385732 244981 328400 262571 482310 450466 -11358 328168 225520 451663
13428 451663 -293244 186475 90438 17343 384560 -138321 240825 -123203 99118 221807
13418 221807 94210 -29411 -4823 150347 357026 15741 262709 307922 125155 715306 141422
13406 139431 260810 520562 236855 245177 359101 18230 -229911 338823 -76267 281269
13395 157268 89373 282951 271320 262958 165118 304624 176318 109275 114172 -50421 303973
13383 197387 70813 658466 -22342 244616 -110217 413396 294777 243717 262113 -199316
$$ packed form
13461C87810j86974j6939H5120L8335b95261C35123J66480a3382C02154a93209
13450B55914J26345F1849K15475A2600L25899L50p9835D351M80028k06873N5516
13439C33022L342M9368j40751Q3419o5829K19739l1844a1358C28168j02648K26143
13428D51663b93244A86475I0438A7343L67217a38321B40825a23203I9118J22689
13418B21807I4210b9411d823A50347K06679A5741K46968M5213A25155N90151A41422
13406A39431J21379K59752B36855Q322J13924A8230b29911C38823g6267B81269
13395A57268o7895J93578j1631q362r7840J39506j28306o7043M897e0421C03973
13383A97387G0813N87653b2342B44616a10217D13396j18619n1060J8396a99316
$$ plain form
13372 388335 39241 104231 216356 398835 75641 417808 475843 308416 306511 504957 115322
13360 553262 366688 446830 229718 209251 267862 428850 360500 153845 441566 297453
13350 297453 12563 165806 550077 232957 475496 367127 661314 228768 343162 -169205
13339 103505 257237 -270394 388675 -32418 424462 471633 468793 120205 258870 560664
13329 560664 193478 82200 256887 287500 250154 342824 124729 277044 246286 102390
13318 321817 345682 300517 374525 61802 179427 103134 162907 -178071 328908 -42577 224848
13306 109553 180934 578520 419055 385127 28244 76095 199851 525481 77439 148726 26154
13294 -197679 484396 97565 199559 63764 220633 207210 302815 126899 233486 -158314
$$ packed form
13372C88335C9241O4990J12125J82479G5641L42167N8035j67427j905J98446A15322
13360E53262j86574Q0142k17112k0467N8611J60988o8350A53845K87721j44113
13350B97453A2563J53243L84271B32957K42539j08369K94187B28768J14394a69205
13339A03505J53732b70394C88675c2418D24462M7171k840A20205J38665L01794
13329E60664A93478H2200J74687L0613l7346R2670A24729J52315l0758A02390
13318C21817K3865m5165P4008F1802J17625p6293N9773a78071C28908d2577B24848
13306A09553P1381L97586j59465l3928B8244M7851J23756L25630G7439P1287B6154
13294a97679D84396I7565J01994F3764J56869j3423R5605A26899J06587a58314
$$ plain form
13283 102916 2760 -93240 -109653 84906 269372 132526 335839 -214271 62573 301002 -183530
13271 240648 126698 5776 343073 353904 347064 -44791 167293 -382604 275510 221250 526907
13260 526907 267553 12407 -56200 132499 -21224 182114 128802 -35599 1827 56871 -98821
13248 60004 -147319 -37866 -60580 122484 124448 203557 -249508 174003 266011 518621 118642
13236 -27773 296415 -223419 166076 83248 154289 257694 91241 -13080 176130 31051 224878
13225 224878 -37680 213227 199019 2223 -90998 75458 -75830 -24350 390818 336994 211512
13214 211512 -14463 156473 -19763 157670 242904 113400 83935 -404949 -276226 333299
13203 123994 453952 418180 313092 -11178 188289 23609 -44871 90556 -74682 -237582 -188682
$$ packed form
13283A02916B760i3240j6413H4906J84466A32526K03313b14271F2573K38429a83530
13271B40648j13950E776L37297J0831o840d4791A67293c82604B75510n4260L05657
13260E26907k59354A2407e6200A32499b1224A82114n3312c5599A827N5044i8821
13248F0004a47319c7866k2714A22484J964P9109b49508A74003R2008K52610A18642
13236b7773B96415b23419A66076q2828P1041J03405I1241a3080A76130C1051J93827
13225B24878c7680B13227j4208B223i0998G5458g5830b4350C90818n3824j25482
13214B11512a4463A56473a9763A57670Q5234A13400k9465d04949J28723C33299
13203A23994L29958l5772j05088a1178A88289B3609d4871I0556g4682j62900M8900
$$ plain form
13192 -188682 138036 150798 185475 301497 -111982 539388 75959 -34290 -185861 -132137
13182 -132137 -125066 102906 92338 375277 -128915 46001 416753 171323 148500 194525 16597
13170 252917 229942 158903 61528 89656 33007 47304 19656 -204888 -22161 164089 -78103
13158 35977 228167 176713 104467 102551 43832 257474 -300015 64616 278914 52780 -55374
13146 -248336 -93246 141773 -200366 467584 -51136 49398 214788 150450 112002 132147 -192842
13134 139984 113056 319441 226657 215961 151759 155211 -277875 -81683 -57457 -44719 416413
13122 -255214 235678 19976 434603 364867 -83155 202000 244252 -172643 -239188 60708 181542
13111 181542 282068 131988 -118409 154358 51470 -137046 156033 -16628 34796 -102883
$$ packed form
13192a88682A38036J2762L4677J16022a11982E39388G5959c4290j51571N3724
13182a32137P071A02906j0568K82939a28915D6001L70752A71323k2823M6025A6597
13170B52917k2975p1039F1528K8128C3007J4297A9656b04888b2161A64089g8103
13158C5977J92190n1454p2246j916D3832K13642c00015F4616K14298E2780e5374
13146b48336i3246A41773b00366D67584e1136D9398J65390o4338l8448K0145a92842
13134A39984k6928K06385r2784j0696o4202L452b77875h1683K4226J2738D16413
13122b55214B35678A9976M14627o9736h3155B02000M2252a72643o6545F0708J20834
13111A81542J00526A31988a18409A54358E1470a37046A56033a6628C4796a02883
$$ plain form
13100 14516 91626 237690 8953 -241391 37566 226496 -146044 177144 -134983 156544
13089 65641 6758 15434 -16361 186892 186403 -146077 7619 36848 269859 -303932 87048 321133
13077 321133 166748 345719 29610 53797 -118615 -178978 -78117 194691 126891 24741 274368
13066 274368 273005 230352 -11667 -92441 216486 87301 -158607 39789 69904 3194 197827
13055 197827 270 -57236 260179 -10533 -95531 313372 146485 386594 141707 -55402 -87778
13044 -87778 163837 104043 223278 259582 234084 170112 221727 21350 24535 -90085 -33765
13032 94866 199875 262015 4292 239085 26518 -60890 191399 216749 -35665 318659 -19694
13020 16180 415962 -200811 393041 73697 -4846 216402 212569 403644 170027 124333 28458
$$ packed form
13100A4516P7110J46064H953b41391C7566J88930a46044A77144a34983A56544
13089F5641F758Q676a6361A86892m89a46077G619K9229K33011c03932H7048K34085
13077C21133j54385J78971B9610K4187a18615o0363g8117A94691o7800B4741K49627
13066B74368j363m2653a1667q0774B16486H7301a58607C9789L0115C194J94633
13055A97827B70e7236B60179a0533q4998C13372A46485K40109A41707e5402l2376
13044h7778A63837n9794J19235L6304k5498o3972N1615B1350L185i0085c3765
13032I4866J05009O2140D292K34793B6518f0890A91399K5350c5665C18659a9694
13020A6180L99782b00811C93041G3697d846B16402l833J91075A70027m5694B8458
$$ plain form
13008 6962 39431 -102301 244129 118080 318828 -57841 -320295 173891 221575 172183 16219
12996 -211209 -15864 -291535 276728 47699 361595 504584 48355 83093 -36204 9316 151101
12985 151101 102410 44793 177091 174948 -102584 -162183 66869 -89932 -46948 26031 260440
12974 260440 204077 -207093 8648 -191846 115125 -162857 302615 178138 -22351 153020
12963 289146 -219781 -24500 -3915 -216534 227049 -28536 -87740 -64307 -48468 -187275 103286
12951 146995 -177375 -137154 -22050 332049 58329 142519 178402 -263086 -39612 57145 -4496
12939 181700 175162 68879 248639 259620 4349 -205732 225734 -112562 89642 76767 370444
12928 370444 21605 -296592 -20311 -327290 67027 71570 233570 335208 153404 -68158 216568
$$ packed form
13008F962L2469a02301B44129A18080K00748e7841k62454A73891M7684m9392A6219
12996b11209a5864k75671B76728D7699L13896J42989D8355L4738c6204I316J41785
12985A51101m8691D4793J32298k143a02584n9599F6869h9932M2984B6031K34409
12974B60440n6363b07093H648a91846A15125a62857C02615j24477b2351A53020
12963B89146b19781b4500c915k12619B27049b8536n9204K3433J5839j38807A03286
12951A46995a77375M0221b2050C32049E8329Q4190L5883b63086c9612E7145d496
12939A81700o538F8879J79760J0981D349b05732B25734a12562H9642j2875K93677
12928C70444B1605b96592b0311l06979F7027M543J62000J01638A53404f8158B16568
$$ plain form
12916 -245711 69015 -172095 73765 120613 -110287 25725 221906 81956 423004 -91858 156842
12904 -9409 57736 -81355 -159003 229472 101874 -79470 145416 -129507 -166514 19558 -269774
12892 227653 -191062 -335902 -219975 -170764 28946 255391 108441 -242315 -126314 19376
12881 199339 104697 181681 250178 -33198 -183108 79488 257657 -220105 375684 -254020
12870 -151694 -1475 82219 204323 13297 -211218 -31882 -36415 145052 60657 -166646 -74247
12858 182181 140373 -175180 -44026 407120 111362 -14439 -184957 -506177 -341883 213745
12847 130841 190022 -31377 63751 6092 163767 -58374 314565 -204494 36000 -203348 -170463
12836 -170463 -207373 27743 -9356 327124 -7682 34581 -91451 119226 18040 80352 -157598
$$ packed form
12916b45711F9015a72095G3765M6848a10287B5725J96181H1956L41048i1858A56842
12904i409E7736h1355p7648B29472A01874g9470A45416a29507l7007A9558b69774
12892B27653a91062j44840J15927M9211B8946K26445A08441b42315J16001A9376
12881A99339r4642P6984O8497c3198j49910G9488J78169b20105C75684b54020
12870a51694a475H2219J22104A3297b11218c1882m533A45052F0657a66646g4247
12858A82181m1808a75180d4026D07120A11362a4439j70518l21220J64294B13745
12847A30841N9181c1377F3751F092J57675e8374C14565b04494C6000b03348L2885
12836a70463l6910B7743i356C27124g682C4581i1451A19226A8040O2312a57598
$$ plain form
12824 -124949 -109286 321883 170639 -254635 185601 314988 -542416 -305314 151715 -6815
12813 -105850 306890 161874 257452 9415 -142939 160171 -272547 -163602 -219011 274087
12802 12747 -52937 95288 109089 145066 -126591 189454 -5842 94829 162827 -140813 -2719
12790 52699 -177759 74380 -71988 -318310 -264777 223608 74648 175819 47257 129145 110662
12779 110662 285 251774 49399 137394 198641 -120988 91275 -74842 85271 -119138 84076
12767 -157810 99093 -136793 125031 31548 180171 197154 109868 -349354 80993 119621 83162
12756 83162 -101132 -146900 197558 154083 414605 -13724 -95201 -112320 -233291 63091 -14419
12744 -158548 -128508 -88800 94171 -286263 -56001 36042 182992 171319 345664 -256688 22446
$$ packed form
12824a24949J5663C21883j51244b54635A85601J29387e42416K37102A51715f815
12813a05850C06890j45016R5578I415a42939A60171b72547J08945n5409B74087
12802A2747e2937I5288J3801L5977a26591A89454e842I4829O7998a40813b719
12790E2699a77759G4380g1988k46322N3533B23608G4648J01171D7257Q1888j8483
12779A10662B85K51489D9399Q7995O1247a20988I1275g4842H5271a19138H4076
12767a57810I9093a36793A25031C1548J48623J6983q7286c49354H0993L8628l6459
12756H3162a01132m5768A97558m3475K60522a3724q1477j7119j20971F3091a4419
12744a58548L0040L9708I4171b86263e6001C6042J46950j1673J74345b56688B2446
$$ plain form
12732 165073 -174785 149900 24994 186929 -49604 -16536 178155 45721 -73285 -237940
12722 -237940 223190 -219981 224149 -57110 110708 -8643 -109786 -101125 -91982 15073 232046
12711 232046 38236 161730 -107453 214268 198959 -14479 131874 -219358 88992 -53635
12700 -275864 -234090 -175716 -43025 106659 133052 111911 326733 40504 88912 109922 297165
12689 297165 198619 -57291 -9238 143444 -30965 67080 172268 410448 -157802 302359 222040
12678 222040 251230 -94311 -84095 160062 463156 -157091 22636 67183 -95198 -309591 -15716
12666 -21660 -7220 142063 527360 370924 183138 44042 155144 779983 170387 36572
12655 69538 81929 -54608 -130600 -163686 -233390 97368 16821 -114756 42735 130379 -60095
$$ packed form
12732A65073a74785A49900B4994J61935d9604a6536A78155D5721g3285j64655
12722b37940B23190b19981B24149e7110A10708h643j01143Q661R143A5073K16973
12711B32046C8236J23494a07453B14268j5309a4479A31874b19358H8992e3635
12700b75864M1774N8374d3025A06659K6393k1141K14822D0504M8408K1010J87243
12689B97165r8546e7291i238A43444c0965F7080J05188K38180a57802C02359q0319
12678B22040K9190i4311J0216A60062L03094a57091B2636M4547i5198k14393a5716
12666b1660g220A42063L85297j56436A83138D4042J11102O24839A70387C6572
12655F9538J2391e4608p5992l3086o9704I7368A6821a14756D2735Q7644f0095
$$ plain form
12643 -204494 -41447 138258 66898 144365 379676 331543 31473 85191 152250 137427 90350
12632 90350 -61112 -200060 201479 171236 -251297 -4648 -92305 101335 3668 -155504 12889
12620 176134 99800 -160785 18337 245864 -118507 39011 465761 164633 219068 141723
12610 141723 146020 -49523 -166759 134080 229914 393813 251143 151845 23331 -181718 -65903
12598 -191116 -52063 160753 -18591 -49770 235698 -343593 336603 324702 151002 122305
12588 122305 137684 225756 -84783 436315 38227 -216111 39815 80973 -14776 -47392 -52769
12577 -52769 -13502 -121113 276610 118829 86112 55654 -51605 -78607 -54367 84182 182940
12566 182940 -23029 85043 277095 -74196 47528 -49795 -91124 299724 159301 173165 -117622
$$ packed form
12643b04494d1447A38258F6898P7467K35311m8133C1473N3718O7059j4823m7077
12632I0350f1112j38948B01479l0243b51297d648q7657A01335C668a55504A2889
12620A76134p6334a60785A8337K27527a18507C9011M26750A64633N4435p7345
12610A41723M297d9523j17236A34080R5834J63899j42670r9298B3331a81718f5903
12598a91116e2063A60753a8591l1179B35698c43593C36603j1901A51002k8697
12588A22305J5379Q8072h4783D36315C8227b16111C9815M1158a4776l2616n377
12577e2769a3502j07611B76610A18829l2717l0458e1605k7002K4240H4182R8758
12566A82940b3029H5043J92052g4196D7528d9795m1329B99724j40423J3864a17622
$$ plain form
12554 -92511 65511 -469 236330 27157 55682 113177 -136411 -22468 20753 4515 -237028 15127
12541 -120486 264076 -86001 8365 313717 41720 -298674 294520 -95074 107283 107371 -266030
12529 -85406 -43001 209010 30297 -298505 -25424 -309044 135966 151722 110839 85250 -126584
12517 139333 -189411 -80818 -212140 26677 216295 -258911 -79871 -129957 42933 -56189 25891
12505 -224860 123787 219036 156410 -263297 242730 78931 250166 429698 -78241 -36694
12494 -249604 272260 182061 72313 87058 -123814 113786 519581 160203 -145622 108476
12483 -40967 255119 6515 -10584 122029 -49302 -148074 -82349 24445 -121187 6053 -197146
12471 141419 176 -339004 -44414 22453 -51610 -170319 22519 89998 30588 165678 96600
$$ packed form
12554i2511F5511d69B36330B7157K8525N7495a36411b2468B0753D515b37028A5127
12541a20486B64076h6001H365L05352D1720b98674B94520i5074A07283Q8b66030
12529h5406M2405B09010C0297b98505b5424k83620A35966J5756m0883k5589a26584
12517A39333a89411h0818j31322B6677J89618b58911g9871n0086D2933e6189B5891
12505b24860A23787R5249o2626b63297B42730G8931J71235J79532g8241c6694
12494b49604B72260r0199G2313J4745a23814A13786M05795A60203a45622A08476
12483d0967B55119F515a0584A22029d9302r8772O5725B4445a21187F053a97146
12471A41419A76c39004d4414B2453e1610j18709B2519O7479C0588J35090o9078
$$ plain form
12460 96600 61977 -261175 -383277 -166556 3189 -237367 18026 -180187 50213 -86060 -356892
12449 -356892 113786 -218381 308049 -228891 -58193 -164690 -58737 170669 -155877 77680
12438 135859 47760 -174697 22298 -125147 294904 -201027 -376099 248377 -17263 -278617
12428 -278617 91935 -69514 79983 -174988 -206304 -45800 -101274 13072 124445 -141698 -10409
12416 42526 -360970 14357 108865 314289 28973 15168 -129967 -260632 -23106 88323 -40141
12404 -293480 89584 -8534 -85819 -59186 113155 -274988 5682 116822 -130239 -147832 -69422
12392 -198150 -268596 59588 36901 445549 49848 20320 -30717 -239944 252515 -120750 109860
12380 224277 356709 -185870 239074 -3897 7057 -19130 -55385 35717 100363 -19273 59150
$$ packed form
12460I6600l4623b61175j22102a66556C189b37367A8026a80187E0213h6060k70832
12449c56892A13786b18381C08049b28891e8193j06497e8737A70669a55877G7680
12438A35859D7760a74697B2298a25147B94904b01027j75072B48377a7263k61354
12428b78617I1935f9514G9983a74988l1316d5800n5474A3072J11373a41698a0409
12416D2526c60970A4357R4508K05424B8973j3805a29967j30665b3106H8323d0141
12404b93480H9584h534p7285K6633A13155b74988E682J11140a30239j7593f9422
12392a98150p0446E9588k2687M08648D9848B0320c0717k09227B52515a20750A09860
12380B24277J32432a85870B39074c897G057a9130l6255C5717O4646a9273E9150
$$ plain form
12368 166835 -20156 98159 68769 475974 -62013 33905 219825 204056 -256253 139251 97214
12357 97214 48882 32990 -2312 -135449 -139054 108060 109116 -111566 42561 274312 100582
12345 -177050 269131 169647 -31681 -7294 -107411 191807 153284 30477 50949 266065 -244278
12333 72834 -240 -131189 58204 91816 -248740 -128234 124120 38028 -99065 -87519 91777
12321 -117594 -46170 -224537 200725 -98152 -50081 166514 304692 443444 -66284 267985
12310 32742 220081 89796 130508 33029 204245 209002 295099 180254 129758 26264 320389
12299 320389 138043 131760 92863 -93826 258088 40463 324935 155386 -30334 145082 -290750
12287 115165 -123409 -101075 109861 94965 119081 112427 36777 37020 207395 160707 88648
$$ packed form
12368A66835b0156I8159k9390M07205f2013C3905J85920j5769b56253A39251m2037
12357I7214m8332j5892b312j33137l605A08060J056a11566D2561K31751A00582
12345a77050B69131r9484c1681g294j00117A91807l8523C0477K0472K15116b44278
12333G2834b40j30949E8204L3612b48740J20506A24120C8028i9065J1546I1777
12321a17594d6170j78367B00725i8152M8071A66514J38178J38752f6284B67985
12310C2742J87339H9796M0712C3029J71216M757Q6097j14845n0496B6264K94125
12299C20389A38043o283l8897i3826B58088D0463K84472A55386c0334A45082b90750
12287A15165a23409K2334A09861j4896K4116o654C6777K43J70375m6688p2059
$$ plain form
12276 88648 227125 11530 268907 186727 -64279 -66837 -134134 82915 367823 175604 178326
12265 178326 250935 -115686 133970 -15091 -154748 340727 226187 263332 189000 58997
12254 26257 168376 415927 421313 344566 237662 344153 224928 296244 209199 195333 59389
12242 414107 33164 18340 14459 128419 192644 151716 354777 230028 183028 244386 -59429
12230 158944 15756 286084 369515 400863 -192935 91404 51296 7652 414260 167426 296638
12219 296638 -99344 -153277 141884 259637 212868 374990 -31076 -114883 330448 239489 245802
12208 245802 105205 285140 -28717 343505 -10573 183449 -68502 105036 223005 110546
12197 458885 156118 225062 97636 133969 291580 -79020 335081 116741 178683 -47428 220298
$$ packed form
12276H8648J38477A1530K57377q2180f4279k558o7297H2915K84908A75604K722
12265A78326P2609a15686A33970a5091j39657C40727j14540L7145p4332E8997
12254B6257J42119K47551N386p6747j06904J06491j19225P1316q7045j3866E9389
12242D14107C3164j4824l881J13960O4225m0928K03061j24749m7000O1358e9429
12230A58944A5756K70328Q3431L1348a92935I1404m0108G652M06608A67426J29212
12219B96638i9344n3933A41884J17753m6769J62122c1076q3807C30448r0959O313
12208B45802A05205J79935b8717C43505a0573A83449f8502A05036J17969A10546
12197D58885A56118O8944I7636L6333J57611g9020C35081A16741O1942d7428B20298
$$ plain form
12185 -131216 223439 140852 236367 12848 370982 245373 315456 229530 -302885 101311
12174 -37814 -197901 -159312 -5337 119737 183515 243400 250203 125128 211689 375576 147620
12162 75608 282633 386915 133104 142684 58893 128100 -10541 255826 142351 170841 -89410
12150 -112567 290691 308823 -3088 522388 209973 161175 588920 15356 24043 28516 -98946
12138 272932 40392 -142269 -252566 -227470 168726 63902 156188 -135003 35641 -276538
12127 -225553 158140 203616 515182 112328 259947 30803 456306 218050 247214 152069
12117 152069 -33064 5755 3452 79625 227148 45979 66738 -195044 97597 -12614 231485
12105 243932 188675 -86614 268804 107222 -314212 260016 95808 -90011 249531 260731
$$ packed form
12185a31216B23439q2587R5515A2848L58134j25609P0083q5926c02885A01311
12174c7814j60087L8589e337A19737O3778N9885O803j25075Q6561J63887A47620
12162G5608K07025J04282A33104R580E8893O9207a0541B55826j13475K8490h9410
12150a12567B90691J8132c088E22388B09973m8798M27745A5356Q687M473i8946
12138B72932D0392a42269j10297K5096A68726F3902R2286a35003C5641b76538
12127b25553A58140M5476L11566A12328J47619C0803M25503B18050K9164r5145
12117A52069c3064E755k303P6173J47523D5979K0759a95044I7597a2614B31485
12105B43932n5257h6614B68804A07222c14212B60016I5808i0011B49531J1200
$$ plain form
12095 260731 279026 229926 -292394 20287 -28957 28545 -23628 62628 -7609 228795 -90607
12083 242580 154516 -168527 -125157 -58858 68827 119760 123234 -34148 38519 114561 -61761
12071 -131703 27429 -80805 56488 233405 -4488 146599 10785 -74584 146635 386048 259742
12060 259742 90105 282468 -119016 -170332 154761 76017 233011 -28941 60234 53348 196652
12049 196652 600105 21852 40655 -23096 -53669 346273 46559 267929 -70269 57527 -281001
12037 403439 342788 110830 82289 -78889 -35331 149028 -341070 83841 212983 265611 -197694
12025 248996 185581 335300 -104828 -53998 441131 202618 -47647 23084 -41909 165115
12014 276883 -185175 243077 217962 387099 165983 214439 -219948 -53534 54265 -84911
$$ packed form
12095B60731J8295m9100b92394B0287b8957B8545b3628F2628g609B28795i0607
12083B42580q8064a68527M3370e8858F8827N0933L474c4148C8519P6042f1761
12071a31703B7429h0805E6488J76917d488A46599A0785g4584A46635K39413j26306
12060B59742I0105J92363a19016n1316A54761G6017J56994b8941F0234o886J43304
12049A96652M03453B1852J8803b3096l0573C46273D6559K21370g0269E7527b81001
12037D03439o0651A10830k8541g8889c5331A49028c41070H3841J29142N2628a97694
12025B48996o3415J49719a04828N0830D41131B02618d7647B3084d1909A65115
12014B76883a85175B43077k5115J69137A65983M8456b19948e3534E4265h4911
$$ plain form
12003 -27976 270275 169842 190697 83507 -24756 -145844 286779 126815 103553 150166 172781
11992 172781 7903 -6972 1725 225080 254945 228462 -115808 -177809 54228 -213418 326526
11980 -301592 132339 -199621 -114933 231427 -158524 253115 -121822 -145322 -35958 -113577
11970 -113577 -124745 360438 -280831 8301 168677 -53622 -42725 28849 77935 -269553 41394
11958 -286586 269041 204132 218504 -177559 -5356 -171516 -45217 142037 -135780 144307
11947 233061 -44720 -178696 -139851 26620 -393733 83778 249189 15969 60220 163498 -259345
11935 58833 -84243 223674 -2342 4070 212462 -331988 -489450 173347 199986 75540 16924
11923 -104938 30579 16453 361686 -13405 276044 15421 179826 -12550 83217 -242773 -28864
$$ packed form
12003b7976B70275j00433K0855H3507b4756j21088B86779A26815k3262M6613K2615
11992A72781G903f972A725K23355K9865k6483a15808o2001E4228b13418C26526
11980c01592A32339a99621Q4688B31427a58524B53115a21822k3500c5958p7619
11970a13577j1168C60438b80831H301J60376e3622J0897B8849M9086b69553D1394
11958b86586B69041o4909J4372a77559e356j66160d5217A42037a35780A44307
11947B33061d4720j33976L8845B6620c93733H3778J65411A5969M4251J03278b59345
11935E8833h4243B23674b342D070K08392c31988j57462A73347K6639G5540A6924
11923a04938C0579j4126L45233a3405B76044A5421J64405a2550H3217b42773b8864
$$ plain form
11911 -15453 46333 -32506 338056 37411 -192761 269637 260152 112860 -272260 -150669 311036
11899 350191 62972 290345 89969 -161354 -57773 78311 -41572 -35363 -91727 25878 -307117
11887 -92797 195686 387338 -135849 -228411 -99903 -97974 -131678 -220383 71872 236735 -270786
11875 69918 -121004 -292696 25431 -95032 -160177 -467136 -101733 -240270 -5429 -115298 -49221
11863 -220154 -42572 -33583 197258 -90806 -145043 -206351 108765 -169112 -58878 -75107 -77920
11852 -77920 88652 112718 77449 95155 -36037 22136 -258298 -119486 42295 8623 -6979 -354042
11840 -354042 48606 170055 -204049 240305 -43728 43965 -17658 55823 -107629 -59524 -141942
11829 -141942 72009 -237518 223556 -108319 -55891 -32182 83196 319165 214275 -110632
$$ packed form
11911a5453D6333c2506C38056C7411a92761B69637r485A12860b72260J21591C11036
11899C50191F2972K27373H9969a61354e7773G8311d1572O209n6364B5878c07117
11887i2797A95686J91652a35849r2562i9903J929l3704q8705G1872J64863b70786
11875F9918a21004j71692B5431i5032o5145l06959a01733j38537e429j09869d9221
11863b20154d2572Q989A97258i0806n4237o1308A08765a69112e8878j6229k813
11852g7920H8652K4066l5269J7706c6037B2136b58298a19486D2295H623f979l47063
11840c54042D8606J21449b04049B40305d3728D3965a7658E5823a07629M8105q2418
11829a41942G2009b37518B23556a08319N2428K3709H3196K35969j04890a10632
$$ plain form
11818 -3519 -384685 97804 50182 10716 -48128 38252 48142 -177483 200618 125461 117874 97610
11806 97610 -220208 -40901 296525 -75395 -105986 58113 15280 93937 56255 202382 247980
11795 247980 -89275 -332497 -250594 99653 6233 -35774 -111812 -115023 -168623 178647 29091
11783 286531 -18446 91495 -16970 -177245 -97726 -13501 -14822 125378 -4920 -90291 165220
11771 -168963 -317004 135429 -13298 -214643 -81534 136121 -125562 -10299 93966 -23097
11760 220302 314938 154982 -407950 -320360 -358541 -408696 185100 -228777 -102714 32036
11749 202959 -355848 -195864 -145598 139543 -6427 -55120 -205212 13622 -66486 42314 -35189
11737 -36359 -163257 312500 -198793 269409 -47622 -44780 -169641 12589 44867 142798 242495
$$ packed form
11818c519l81166I7804m7622A0716d8128C8252R890a77483B00618p5157p587k0264
11806I7610b20208d0901B96525g5395l0591E8113A5280P8657l7682J46127M5598
11795B47980h9275k43222Q1903I9653F233c5774p6038l211n3600A78647B9091
11783B86531a8446I1495a6970j60275P9519a3501j321A25378d920q5371A65220
11771a68963j48041A35429a3298k01345h1534A36121a25562a0299I3966b3097
11760B20302R4636A54982d07950Q7590l8181n0155A85100b28777a02714C2036
11749B02959c55848J59984N0266A39543f427m8693j50092A3622f6486D2314c5189
11737c6359j26898C12500a98793B69409d7622K842j24861A2589L2278R7931R9697
$$ plain form
11726 242495 108956 -294715 -34559 -47602 381967 -132422 -223645 162661 176514 -138775
11715 -87337 245379 69242 238986 -123461 24216 114352 102804 37470 -177666 166632 709
11703 208331 -191488 134860 -57949 -1476 52802 -214025 132537 57597 13627 674 -183394
11691 93109 249889 1381 -69982 -3773 -187189 150360 -60599 187249 295057 132405 177522
11680 177522 -66972 174814 139664 64773 -45640 228907 -405222 109508 51260 -65324 -76638
11669 -76638 16901 133803 -161814 -80174 209816 69315 35134 -32862 109793 105454 357297
11658 357297 7526 -55481 -77803 103232 477772 19941 -40052 179855 -7088 -30559 76461
11646 -136505 -309980 222560 -203644 166911 -104174 49352 -283430 71574 -26473 92297
$$ packed form
11726B42495A08956b94715c4559j3043C81967a32422r1223A62661J3853a38775
11715h7337B45379F9242J69744a23461B4216R0136j1548C7470a77666A66632G09
11703B08331a91488A34860e7949a476E2802b14025A32537E7597A3627F74a83394
11691I3109J56780A381f9982c773j83416A50360f0599A87249J07808A32405M5117
11680A77522f6972A74814l5150F4773d5640B28907d05222A09508E1260f5324j1314
11669g6638A6901J16902a61814h0174B09816F9315l4181c2862A09793m339K51843
11658C57297G526e5481k2322A03232L74540A9941d0052A79855g088k3471G6461
11646a36505j73475B22560b03644A66911a04174D9352b83430G1574b6473I2297
$$ plain form
11635 -89494 95368 275113 154217 77455 -41782 112456 217650 -174448 -47827 188604
11624 -187283 -209908 -127573 -118162 -150574 117784 -74695 -126371 -192265 -128205 -70366 -316154
11613 -316154 -288193 60532 59835 -93281 115879 161674 -44059 372464 153778 98033 165692
11602 165692 -89287 75269 80375 254685 -313925 -138815 -124325 -124292 -423634 273323 -143413
11590 -114675 -143186 -258996 210458 33546 69130 -190574 47021 -185325 -395168 -99568
11579 -186329 -17472 -61136 51315 296471 9669 318796 -88181 154621 251562 234204 106648
11567 109658 323932 238117 -137023 789 76388 -35520 155137 -90785 430447 131675 -324295
11555 -5570 -134192 47307 218219 -247879 90191 156158 -135395 109892 277526 -198898
$$ packed form
11635h9494I5368J79745j20896p6762d1782A12456J05194a74448d7827A88604
11624a87283k2625Q2335R411l2412A17784g4695n1676o5894O4060N7839k45788
11613c16154K7961F0532o97i3281A15879M5795d4059C72464A53778n5745O7659
11602A65692h9287G5269N106J74310c13925a38815J4490L3k99342B73323a43413
11590a14675k8511j15810B10458C3546L5584a90574D7021a85325k09843i9568
11579a86329a7472m3664E1315K45156I669L09127h8181A54621R6941j7358A06648
11567A09658K14274q5815a37023G89P5599c5520A55137i0785D30447A31675c24295
11555e570j28622D7307J70912b47879I0191O5967a35395A09892J67634a98898
$$ plain form
11544 88617 -81466 82077 151300 49125 -209829 185226 166577 284465 -548956 -8371 -254982
11533 -254982 -247322 -128592 166915 4468 187407 -15575 84240 1038 353458 -66542 68185
11521 391050 165141 319184 -41345 -10135 54149 10318 7925 -14893 372288 215033 262541
11510 262541 -18813 -71146 167619 316208 -241106 126321 -14568 88101 59403 -242573
11499 -51690 160726 -149940 -64657 349747 81133 267421 117209 13681 82570 -230378
11488 227536 105636 85323 -47621 293632 -52931 -100111 -34685 184069 -7575 12659 -162983
11476 119420 54403 62015 72635 190939 137783 77750 99394 -35485 -238120 84536 488970
11465 488970 -102656 200823 174751 449892 59986 219787 106838 78269 259807 191698
$$ packed form
11544H8617h1466H2077O9223D9125b09829A85226j8649J17888e48956h371k46611
11533b54982P660J18730A66915D468J82939a5575H4240A038L52420f6542F8185
11521C91050A65141J54043d1345a0135E4149A0318k393a4893C72288j57255M7508
11510B62541a8813n2333A67619J48589b41106A26321a4568H8101k8698b42573
11499e1690A60726a49940f4657C49747H1133J86288A17209A3681O8889b30378
11488B27536A05636k0313d7621B93632e2931m7180c4685A84069g575A2659a62983
11476A19420E4403P612J0620J18304n3156o0033K1644c5485k02635H4536M04434
11465D88970a02656B00823k6072K75141E9986J59801A06838k8569J81538o8109
$$ plain form
11455 191698 328027 -65154 157637 -26461 149239 56790 100012 107174 -198733 -9060 207493
11443 -227910 391980 -76574 163303 110403 25342 86240 177145 -15262 -10526 229850 55722
11431 -158213 196899 354603 -80330 177944 -189765 169188 -180321 -224108 -95433 144213
11420 -320107 187470 71659 250829 113719 207576 -55776 145553 82487 176339 251586 144287
11409 144287 114327 -163522 -370907 -263147 79505 -86405 51951 -62963 5068 184493 2572
11397 -134410 268187 -66728 -91220 -211501 -93783 -97966 -191619 63751 -53202 -136984 -344965
11386 -344965 -129375 -48234 -196338 9815 50867 -3287 162633 -157250 -20925 -52801 -437627
11375 -437627 169176 102497 145158 -30267 -171105 -166464 -195386 30531 177609 50515 -131569
$$ packed form
11455A91698J36329f5154A57637b6461A49239E6790M3222P162a98733i060B07493
11443b27910C91980g6574A63303n2900B5342O0898R0905a5262M736B29850E5722
11431a58213A96899J57704h0330A77944a89765A69188a80321m3787i5433A44213
11420c20107A87470G1659J79170A13719R3857e5776A45553o3066R3852P5247j07299
11409A44287k9960a63522k07385J07760G9505h6405E1951f2963E068J79425B572
11397a34410B68187f6728k4492j20281i3783m183r3653F3751e3202q3782k07981
11386c44965a29375d8234j48104I815M1052c287A62633a57250b0925l1876l84826
11375d37627A69176o6679M2661c0267j40838M641k8922C0531J47078E0515a31569
$$ plain form
11363 -104964 337617 193561 88783 -52135 28049 102179 154134 189831 -45050 -20557 303261
11351 230920 100234 -59852 63965 -208986 -61045 -376504 244470 126864 86015 175072
11341 175072 -216502 148184 80255 114959 258268 -224460 -419968 -202626 154352 -354446
11330 10493 -92127 349668 -60067 604 355622 70583 -92042 -48301 14366 58220 213750
11319 213750 -130807 82095 278405 137567 13918 41509 -75464 -494534 -96248 -279597
11309 -279597 300972 -105178 -167402 -54043 -319013 442674 24419 -53913 -110862 221009
11298 3095 -55844 339236 82056 19837 -315822 -108652 -146018 195391 -106836 105693 79686
11287 79686 102993 80619 65212 16720 -204921 -396467 122120 -207642 -52187 35480 5328
$$ packed form
11363a04964C37617j44056H8783e2135B8049P4130N1955L5697d5050b0557C03261
11351B30920A00234e9852F3965b08986f1045l15459B44470j17606m0849Q9057
11341A75072b16502A48184o7929L4704J43309b24460j95508b02626A54352c54446
11330A0493i2127C49668f0067F04L55018G0583i2042M3741A4366M3854J55530
11319B13750a30807H2095J96310A37567A3918K7591g5464m19070i6248j83349
11309b79597C00972a05178o2224e4043k64970D42674B4419e3913n6949B21009
11298C095e5844C39236H2056A9837c15822a08652l7366A95391a06836A05693k6007
11287G9686K3307k2374j5407A6720b04921j91546A22120b07642e2187C5480E328
$$ plain form
11275 -138642 -268417 -300820 -131892 289110 122251 -182097 105276 3214 -138687 209322
11264 -359337 -123726 -49586 -144162 10569 -235486 -9033 16175 -92637 132211 147608 -297363
11252 -34402 -142061 98766 5498 -49704 272150 -165392 -299957 -337919 248196 -117784 -13319
11240 4433 -347466 -149815 -210759 -420904 -76440 94759 142889 -223737 163447 24621 -186919
11228 -180413 111903 211188 175355 -200073 -99680 -147101 -169335 -241953 34141 -135949 28907
11216 -67736 -37509 -11385 -22821 -111022 -147586 54165 212155 -6596 19038 115653 39727 -484935
11203 42724 109959 -230324 41121 -242536 165808 219798 14612 4964 21065 52243 -56111
11191 -148567 75318 -151581 -66307 -228454 4010 -172180 116970 94164 -339361 -196313
$$ packed form
11275a38642j29775l2403a31892B89110A22251a82097A05276C214a38687B09322
11264c59337a23726d9586r4576A0569b35486i033A6175i2637A32211J5397b97363
11252c4402j07659I8766E498d9704B72150a65392j34565l7962B48196a17784a3319
11240D433c47466a49815o0944k10145g6440I4759M8130b23737A63447B4621a86919
11228a80413A11903R9285l5833b00073i9680m7421k2234p2618C4141a35949B8907
11216f7736L0227a1385j1436q8201l6564E4165J57990f596A9038R6615C9727d84935
11203D2724O7235b30324D1121b42536A65808N3990A4612D964J6101L1178e6111
11191a48567G5318a51581f6307j62147D010a72180A16970k2806c39361J43048
$$ plain form
11181 -196313 242504 -144449 684 -173829 -40036 -383672 -102558 16706 -54428 -101327 -169811
11170 -169811 -305915 -170470 -279978 -207259 263898 400636 50062 -70593 -291114 206400
11159 -19118 35291 -35155 31035 -390787 -345665 244391 -324540 -61430 -446738 226451 -12564
11147 6835 -228667 -319874 -219571 -171950 93802 -197367 -226935 102207 -69655 88988 -112990
11135 -221413 -147107 -73700 255198 -141030 146201 -311524 151397 191388 -49841 -68427
11125 -68427 326460 -52699 155885 -295527 120300 -192338 121591 -12923 -12415 -169807 -312956
11114 -312956 -50233 -47781 177251 319719 -379182 -92941 -14257 215377 22257 291228 -43267
11102 -66096 -100736 -235750 88431 101875 238598 356770 15872 215116 12796 107953 189080
$$ packed form
11181a96313B42504a44449F84a73829d0036l43636a02558A6706e4428m6899o8484
11170a69811j36104J35445j09508P2719B63898J36738E0062g0593k20521B06400
11159a9118C5291c5155C1035c90787M5122B44391c24540f1430l85308B26451a2564
11147F835b28667r1207J00303M7621I3802a97367k9568A02207f9655H8988a12990
11135b21413P4306P3407B55198a41030A46201c11524A51397L9991d9841j8586
11125f8427C26460e2699A55885b95527A20300a92338A21591a2923N08j57392j43149
11114c12956e0233K452A77251J42468c79182i2941a4257B15377B2257K68971d3267
11102f6096l4640j35014H8431J3444J36723J18172A5872J99244A2796R5157Q1127
$$ plain form
11091 189080 -113143 109916 171794 93310 117628 -116585 129425 321755 335669 119703
11080 80637 73563 152899 233308 239287 145882 95149 145618 65436 -78468 135802 137679 391690
11068 391690 26243 268687 -397841 146450 195775 150686 183167 366223 343639 227576
11058 227576 333372 596901 219446 80474 65300 127909 131663 -84309 295 49054 520425
11047 520425 102054 273396 139732 248752 412118 438096 301963 622435 501906 464462
11037 464462 407135 618579 426707 711310 590689 596162 516849 801860 354481 448475
11027 448475 872240 619543 529658 478234 801650 586584 388402 841913 523065 520239
11017 520239 583691 491167 564159 821331 504270 484661 638254 533039 437998 491659 731267
$$ packed form
11091A89080a13143A09916O1878p8484K4318a16585A29425J92330J3914A19703
11080H0637p074P9336Q0409N979r3405n0733N0469F5436g8468A35802J877K54011
11068C91690B6243K42444c97841A46450M9325m5089L2481J83056k2584j16063
11058B27576J05796K63529B19446H0474j5174O2609L754h4309B95M8759M71371
11047E20425A02054J71342j33664J09020J63366K5978j36133L20472j20529l7444
11037D64462n7327K11444j91872K84603j20621N473p9313K85011C54481R3994
11027D48475M23765k52697q9885n1424L23416k15066j98182M53511l18848k826
11017E20239O3452r2524P2992K57172l17061j9609J53593j05215r5041N3661K39608
$$ plain form
11006 731267 492055 528849 336371 234373 564329 737683 674434 396109 596425 659320
10996 659320 416614 395217 344023 348924 460462 247406 211930 483123 729908 833035
10986 833035 503717 341550 667826 711666 726681 186507 876426 256353 501746 498190
10976 498190 612601 899009 722875 705448 621037 885014 529658 997053 692111 947424
10966 947424 713558 582461 754131 970917 1167802 1407703 1003407 1181439 1375471 1707072
10956 1707072 1762212 1879270 2000186 1646495 2063562 2061849 2106904 1905619 1581462 1364245
10946 1364245 1250947 1383998 1558501 1143990 1311706 1630403 1696713 1720061 1267160 1633490
10936 1633490 1235473 1185933 928372 1214453 783608 834157 501227 817753 550252 410917
$$ packed form
11006G31267k39212L6794j92478j01998L29956J73354o3249k78325K00316O2895
10996F59320k42706k1397n1194M901J11538k13056l5476K71193K46785J03127
10986H33035l29318j62167L26276M3840J5015A86507O89919B56353K45393l556
10976D98190J14411K86408j76134j7427q4411K63977l55356M67395l04942K55313
10966I47424k33866j31097J71670K16786J96885K39901m04296J78032J94032L31601
10956A707072N5140J17058J20916l53691M17067j713M5055k01285l24157k17217
10946A364245j13298J33051J74503m14511J67716L18697O6310K3348m52901L66330
10936A633490l98017m9540k57561K86081m30845N0549l32930L16526k67501j39335
$$ plain form
10926 410917 459872 284073 422889 256862 554777 33483 99345 -21672 228166 286426
10916 286426 72918 319527 97749 -8922 29482 172062 58319 -165349 -199529 -6472 99209
10904 33710 -344742 87427 -29932 370525 -85820 -56565 9963 -33798 131787 -338677 274819
10892 -189904 -280635 130951 -64607 -36465 -129907 189153 32328 59212 -116268 143886 86870
10881 86870 -188594 -7064 -200270 -107 221135 32307 -171815 -78701 -21670 -155435 -1521
10869 -47172 -91562 -391660 84435 -15095 49816 7990 148036 -127629 -10961 -40664 -209415
10858 -209415 -25582 -36813 -276917 -81537 -29574 -51806 -141616 11161 40504 -8341 -90336
10847 -90336 -95697 -186536 -18313 289297 -154115 217706 16484 -297795 133761 311788 111706
$$ packed form
10926D10917M8955j75799J38816j66027K97915C3483O5862b1672B28166N8260
10916B86426G2918K46609I7749h922B9482J42580E8319a65349l4180f472I9209
10904C3710c44742H7427b9932C70525h5820K9255I963c3798A31787c38677B74819
10892a89904r0731A30951f4607K8142r3442A89153C2328K6884a16268A43886n7016
10881H6870a88594g064j93206a07B21135C2307a71815g8701b1670j33765a521
10869d7172m4390l00098H4435a5095D9816G990J40046a27629a0961k9703j68751
10858b09415b5582j1231k40104h1537b9574k2232q9810A1161K9343h341q1995
10847i0336n361r0839a8313B89297a54115B17706A6484b97795A33761J78027A11706
$$ plain form
10835 -143012 -35472 -8677 -286018 157548 -40220 -48362 274353 -254999 138735 -86216 11673
10823 219836 -227064 537 64166 163778 -121465 -394596 76560 35773 503657 265102 38648
10811 -116188 201226 220161 -129545 -8105 -160570 -148564 -228587 27134 10034 260998 -279664
10799 -57453 -50890 -252003 84627 -90948 -20290 -128702 127402 -14277 -182883 128294 78148
10788 78148 -42840 -8945 -33781 -195730 7182 -88388 46831 -128722 -133495 -231334 5219 18843
10776 18843 -313107 -250180 -34731 154521 -148470 -409559 -225739 -125842 -183573 -47125 95676
10764 76406 189600 246467 192542 22532 -145888 76689 -100465 -180437 196248 151828 -101362
10752 -289457 149902 37357 52739 19458 39404 -32812 -229064 77344 -219235 13787 -20895
$$ packed form
10835a43012c5472h677k77341A57548d0220q142B74353b54999A38735h6216A1673
10823B19836b27064E37O3629R9612a21465k73131G6560C5773M67884k38555C8648
10811a16188B01226J8935a29545h105j52465J2006q0023B7134A0034K50964b79664
10799e7453O563k01113H4627i0948b0290j08412A27402a4277j68606A28294n0146
10788G8148d2840h945k4836j61949G182h8388D6831a28722m773r7839E219J3624
10776A8843c13107O2927c4731A54521a48470k61089J83820R9897n7731d7125I5676
10764G6406J13194N6867n3925B2532a45888G6689a00465p9972A96248m4420a01362
10752b89457A49902C7357J5382A9458J9946c2812j96252G7344b19235A3787b0895
$$ plain form
10740 -12838 -154257 -172708 130506 -76897 -156162 72045 -33469 -151217 19566 156920 -156974
10728 -247205 -17667 -48330 -239178 -321138 65306 34110 160270 -253589 198070 16525 62582
10717 62582 37718 -86059 -94765 -307423 2478 -78061 111801 -385174 4777 -365552 -501094
10706 -501094 -75353 -198279 435605 226915 2453 -157531 -195865 147729 18080 -241960
10695 -50019 -346974 -163762 -171651 162074 -112235 60901 84483 -298655 -214223 268869 -140248
10683 121752 -92542 -101226 -192627 -230787 47690 -393395 160333 -148122 -162731 -204455 175411
10671 -75136 -15926 -171924 -242303 -115766 -374717 45543 -183595 52063 171842 91815 83645
10660 83645 -215514 -21889 -71083 -101926 39680 -42591 -106896 -46665 -276976 182289 -447830
$$ packed form
10740a2838j41419j8451A30506g6897p9265G2045c3469j17748A9566J37354a56974
10728b47205a7667l0663j90848q1960F5306l1196J26160b53589A98070A6525M6057
10717F2582k4864h6059q706k12658B478g8061A11801c85174D777c65552j35542
10706e01094g5353j22926D35605k08690B453a57531l8334A47729A8080b41960
10695e0019k96955a63762p889A62074a12235F0901K3582b98655Q4432B68869a40248
10683A21752i2542q684r1401l8160D7690c93395A60333a48122j4609m1724A75411
10671g5136a5926j55998p0379a15766k58951D5543a83595E2063J19779q0027q170
10660H3645b15514b1889m9194l0843C9680d2591o4305d6665k30311A82289d47830
$$ plain form
10648 80720 -415656 134021 -14775 149733 137164 -12407 -143824 86187 -13070 -85011 90020
10636 277921 5862 -136697 216631 214075 -76210 -78379 35274 -307259 -306361 -78329 -94617 -269921
10624 -269921 -68223 22678 -32526 133849 119876 -5522 -218345 -23549 -183281 -354207 -400373
10613 -400373 65123 198501 39164 -186716 -210808 -54595 -227241 66116 -416032 -17990 -30864
10602 -30864 193821 -246462 -301845 -9319 -97747 171487 219154 25930 -73050 -452000 -23124
10590 -133460 212972 413 -236766 -207560 -199327 -55065 -222061 -197642 -187697 200998 101237
10579 101237 -181881 -191568 149193 -209355 -170514 -134212 43844 -183774 -4360 3552 -126852
10567 -179942 -73542 -128071 125479 -75795 -42142 205019 37841 68755 -112188 204034 19674
$$ packed form
10648H0720d15656A34021a4775A49733j2569a2407j31417H6187a3070p1941I0020
10636B77921E862a36697B16631k556g6210k169C5274c07259Q98g8329j6288j75304
10624b69921f8223B2678c2526A33849j3973e522k12823b3549j59732j70926m6166
10613d00373F5123J33378C9164a86716k4092e4595j72646F6116d16032a7990j2874
10602c0864A93821b46462n5383i319q8428A71487M7667B5930g3050l78950b3124
10590a33460B12972D13b36766K9206Q233e5065j66996K4419R945B00998r9761
10579A01237a81881r687A49193b09355L8841L6302D3844a83774d360C552a26852
10567a79942g3542n4529A25479g5795L3653B05019C7841L0914a12188B04034A9674
$$ plain form
10555 186832 -232751 383554 43719 -128145 -80818 160843 19334 84630 -144035 -181144
10545 -181144 -256954 -44995 -67489 -99229 -203618 240183 -96958 128999 -91508 14390 -24408
10533 -15525 -315047 -55305 -290305 102355 -131983 -102079 -120560 -148200 274190 -182249
10522 -110535 5098 -143030 -73166 206932 68300 -118501 -170905 -220385 203857 -148766 319078
10510 19793 244128 -94311 -192475 -137175 -32303 -56675 11702 -1346 -65704 232863 264788
10499 264788 -135774 -114273 141306 159530 -308416 48215 40641 -18150 5243 -101404 -176051
10488 -176051 163266 120354 -186919 -173384 53965 -117670 -52336 33745 -352028 -172447
10477 -19154 -35056 31377 -318571 122866 250360 -156059 -353846 -122283 -51997 32888
$$ packed form
10555A86832b32751C83554D3719a28145M7327A60843A9334O5296a44035l7109
10545a81144p5810d4995k2494l1740j04389B40183i6958A28999i1508A4390b4408
10533a5525k99522e5305k35000A02355a31983K9904j8481k7640B74190a82249
10522a10535E098a43030O9864B06932F8300a18501n2404m9480B03857a48766C19078
10510A9793K24335i4311r8164N5300c2303k4372A1702a346o4358B32863L1925
10499B64788a35774K1501A41306J8224c08416D8215p574a8150E243a01404p4647
10488a76051A63266m2912a86919J3535E3965a17670e2336C3745c52028a72447
10477a9154j5902C1377c18571A22866J27494a56059j97787a22283e1997C2888
$$ plain form
10466 39510 69955 173392 184358 1175 421131 249198 501571 268048 37478 16937 114555
10455 114555 -12220 223869 92939 -381434 -74209 269306 68513 -104027 -291018 -100427
10444 15186 48173 131052 -296716 14694 -7700 -61757 46211 137533 -339844 -16020 99629
10432 -260000 -233211 -156036 59189 72 -178546 -122450 -83451 -258034 44449 39235 -99354 -104728
10420 -104728 -108808 301031 221284 197119 -115283 15320 -177871 -100317 -37087 -535534 250097
10408 -268849 -94539 -134995 24974 -27832 -14225 -143920 -84724 416816 54864 289677 -196702
10396 -55038 7647 -550512 -17312 -4748 -359422 -223490 -145092 -340133 23908 -52405 196495
10384 -114944 13186 -346220 34916 39988 138013 49198 -158911 -43603 -123163 -233660 -254620
$$ packed form
10466C9510L0445J03437J0966A175M19956j71933K52373k33523C7478A6937R7618
10455A14555a2220B23869I2939c81434g4209B69306F8513a04027j86991a00427
10444A5186L2987Q2879b96716A4694g700n4057D6211R1322c39844a6020I9629
10432b60000K6789P7175E9189G2a78546N6096L8999j74583D4449n214i9354n374
10420a04728m080C01031p9747k4165a15283A5320a77871P7554c7087m98447B50097
10408b68849i4539m0456B4974b7832J3607j29695N9196D16816E4864K34813a96702
10396e5038G647e50512a7312d748l54674J35932P8398j95041B3908e2405A96495
10384a14944A3186c46220C4916N072R8025D9198a58911d3603p9560j10497k0960
$$ plain form
10373 -254620 16985 294065 -748 141466 -100721 35305 25741 -17661 146957 35427 -298413
10361 241876 237782 265604 186757 181671 -192135 208158 32943 -144117 484967 465305 595463
10350 595463 152585 218660 388446 118303 668478 -248206 255705 69073 57345 289357
10340 289357 219246 276827 209937 -12063 382120 285975 247702 301289 293902 -144359 -195620
10329 -195620 203446 120779 212551 241472 231302 243177 6292 252036 160316 245072 -110277
10317 242099 299065 352842 1286 27132 38945 167053 -123 -45816 -28147 248846 155229 -25005
10304 322268 -18450 143836 62974 331213 -136318 135714 -70651 124842 -178789 -54751
10293 234334 102149 -184216 16194 -56943 -165645 109602 -31792 215163 -125680 -23306
$$ packed form
10373b54620A6985K77080g48A41466a00721C5305r564a7661A46957C5427b98413
10361B41876m094K7822p8847n086a92135B08158C2943a44117D84967j9662J30158
10350E95463A52585O6075J69786A18303N50175b48206B55705F9073j1728K32012
10340B89357p0111N7581o6890a2063C82120r6145l8273N3587p387a44359n1261
10329a95620B03446q2667R1772K8921j0170J1875F292K45744r1720Q4756a10277
10317B42099N6966N3777A286K5846J1813J28108a23m5693J7669B48846r3617b5005
10304C22268a8450A43836F2974K68239a36318A35714g0651A24842a78789e4751
10293B34334A02149a84216A6194e6943j08702A09602c1792B15163a25680b3306
$$ plain form
10282 -218351 -242941 23192 275815 -130324 -70982 -251769 -110974 -96023 34389 242216
10272 242216 -250939 27445 137451 -236842 224612 135687 112019 210954 -250491 53697
10261 -403393 -346313 -47916 -152781 -10462 -194206 -52048 -1183 -93898 -91439 187131 -187848
10249 27989 -76504 -109193 38112 -69444 123881 -51424 -29660 319762 -33432 109302 377429
10238 377429 130369 477364 -16306 122105 88572 -122248 618243 -244785 92701 54320
10228 54320 51419 5329 -198113 44327 -164216 -199373 -773 -106230 84075 85551 -242711 -10025
10215 140209 -482068 -64006 -111651 58016 231572 -129384 187040 -91871 14011 -121724
10204 -103131 94766 -319408 115131 28435 -230829 -105208 26927 -224609 233288 -196076
$$ packed form
10282b18351k4590B3192K52623a30324N9342j80787a10974J4951C4389K07827
10272B42216b50939B7445J10006b36842B24612q8925k3668R8935b50491E3697
10261d03393N7080d7916j04865a0462j83744e2048a183r2715K459A87131a87848
10249B7989g6504l2689C8112f9444A23881e1424K1764C19762c3432A09302K68127
10238C77429A30369L46995a6306A22105l3533a22248F18243b44785I2701l8381
10228E4320k901E329a98113D4327a64216l5157g73j05457H4075J476b42711a0025
10215A40209d82068f4006m7645E8016J73556a29384A87040i1871A4011a21724
10204a03131I4766c19408A15131B8435b30829a05208B6927b24609B33288a96076
$$ plain form
10193 125986 40031 87837 29680 108738 51465 184623 -193715 -79371 -116895 -174596 -181042
10182 -181042 -323320 36272 90824 -218919 24264 -205962 4855 -277937 -66548 83578 -167138
10170 16793 101805 -170024 174041 103057 246759 -282530 43518 -40996 93619 192404 273452
10159 273452 -124277 92327 177706 -300366 -127309 -471224 18763 -115130 -192982 273204
10148 -52906 261 -75026 127230 -171916 -17952 -51255 -2823 -120046 -159263 35906 -238603
10136 49154 141962 -136845 234398 165821 -82575 220984 -38047 -58841 96762 -389713 -125884
10124 287949 -50531 199067 -388338 -302339 -135812 -312705 -151975 -167833 -356341 -69090
10113 -264105 44304 -275932 -394359 104429 105781 -6115 -271845 -55074 -18751 -251950 -214931
$$ packed form
10193A25986D0031M7806B9680P9058E1465J33158a93715g9371l7524n7701o446
10182a81042j42278C6272N4552b18919B4264b05962D855b77937f6548H3578a67138
10170A6793Q5012a70024A74041p0984J43702b82530D3518d0996I3619R8785Q1048
10159B73452a24277I2327Q5379c00366a27309l43915A8763a15130p7852B73204
10148e2906B61g5026A27230a71916a7952l3303b823j17223l9217C5906b38603
10136D9154R2808a36845B34398o8577h2575B20984c8047k0794I6762c89713a25884
10124B87949e0531A99067c88338Q5999a35812j76893a51975j5858j88508f9090
10113b64105D4304b75932j18427A04429J352f115k65730e5074a8751k33199L7019
$$ plain form
10102 -214931 92681 -153681 -250607 -344241 -140997 -424500 -31044 -354396 246596 35115
10091 -35674 -286421 -92350 -238243 128483 -75378 391838 -35305 -228263 264626 86528
10080 -299631 102400 -43515 -526406 -139724 148570 -64653 -279522 -140876 115441 -35272
10069 213738 186272 -216221 -190451 -37407 -109581 105671 -77730 -374775 -57238 221046 -65525
10057 -206826 149718 148298 98482 -5859 202865 -137670 150893 112192 -104800 -118932 -159349
10046 -159349 -73118 -287267 9284 82110 -43161 101441 102359 -78668 -78963 276301 60733 -122912
10033 -142236 -154753 -179235 -75014 290367 -72009 28825 197148 137802 -26157 -48037 -181468
10022 -181468 -249057 36789 -171780 -152376 115448 225504 -99178 -49305 -125139 -267638 338693
$$ packed form
10102b14931I2681a53681r6926r3634a40997k83503c1044l23352B46596C5115
10091c5674k50747i2350j45893A28483g5378C91838c5305j92958B64626H6528
10080b99631A02400d3515m82891a39724A48570f4653k14869J38646A15441c5272
10069B13738k7466b16221K5770c7407p2174A05671g7730k97045e7238B21046f5525
10057b06826A49718j420m9816e859B02865a37670A50893l8701a04800j4132m0417
10046a59349g3118k14149I284P2826d3161A01441R18g8668k95B76301F0733a22912
10033a42236j2517k4482g5014B90367g2009B8825J68323n9346b6157k1880j33431
10022a81468o7589C6789a71780J9404A15448J10056i9178d9305p5834j42499C38693
$$ plain form
10010 -350539 -26092 -38433 -62885 -83223 329776 -8014 -50557 -135429 -144012 -234748 -275535 -210002
9998 -210002 118363 293206 57204 77392 181689 -110470 -5331 -116856 222541 -204505
9987 -223947 -260286 -278712 31374 -25261 -243071 253181 -161682 -32728 -102833 24217 -142464
9975 -138392 -284014 -128072 -265659 57394 88273 -75750 -123921 140256 -37791 -112110 -46915
9963 -139584 -4164 3365 -200671 -95878 -225187 -152291 67300 81425 -114462 -71197 73807
9951 74472 -243251 -88862 -68725 190925 -248362 195545 -17883 243084 -216486 248687
9940 -18184 -6088 72997 -24519 24301 25219 190673 -291613 -344753 -139292 -226733 -373301 -350102
9928 -350102 -193299 -227365 -195154 97541 -87166 223149 49820 22751 195994 258580 17204
$$ packed form
10010c50539b6092j2341k4452k0338C29776h014m2543q4872q583r0736m0787O5533
9998b10002A18363J74843E7204K0188J04297a10470e331j11525B22541b04505
9987b23947l6339j8426C1374b5261k17810B53181a61682c2728p0105B4217a42464
9975a38392j45622a28072j37587E7394L0879g5750m8171A40256c7791p4319d6915
9963a39584d164C365b00671i5878j29309P2896F7300J4125a14462M3265G3807
9951G4472b43251h8862K0137A90925b48362A95545a7883B43084b16486B48687
9940a8184f088G2997b4519B4301R18J65454b91613n3140a39292q7441j46568K3199
9928c50102J56803l4066L2211I7541h7166B23149D9820B2751J73243O2586A7204
$$ plain form
9916 -84787 255948 -112830 -79259 163942 69384 -145740 -16627 355634 72077 152575 -30318
9904 96830 8120 278814 151925 -81341 -155314 -91889 -446077 -242041 95120 -236729 -87254
9892 71035 12151 -185121 -114674 -240084 -260232 -85666 63435 199682 -116115 211970 -347435
9880 -589578 -95103 308273 -36252 -318085 -418893 -247175 -154869 -33815 143430 -449481
9869 62944 -212696 -297324 59576 -68510 87085 -243904 168122 -251399 -79611 -165328 -192305
9858 -192305 -29854 -272937 -46089 -103021 21300 55914 -169860 -415983 -488416 115595 21852
9846 -35466 -279988 152852 -103088 -199217 479839 -54487 -49320 -3920 -256118 -198612 2730
9834 -195094 267658 -12226 41773 44009 -298171 -591638 197523 -456356 -61075 143280 -191236
$$ packed form
9916h4787B55948a12830L3571A63942F9384a45740a6627C55634G2077Q0498c0318
9904I6830H120K70694j26889h1341p3973O3425l54188K04036I5120b36729h7254
9892G1035A2151a85121P0447j25410k0148h5666F3435J36247a16115B11970c47435
9880e89578i5103C08273c6252k81833j00808J71718R2306c3815A43430d49481
9869F2944b12696q4628E9576f8510H7085b43904A68122b51399g9611q5717k6977
9858a92305b9854k43083d6089n6932B1300L4614a69860k46123p2433A15595B1852
9846c5466k44522A52852a03088r6129D79839e4487N167c920k52198N7506B730
9834a95094B67658a2226D1773K236b98171k93467A97523d56356f1075A43280a91236
$$ plain form
9822 -261916 -104964 -288295 -177842 -87391 -153817 -15811 166427 -35591 -17625 270777 -82570
9810 -209107 -101160 -8432 -90957 -148100 -335924 52223 -348984 -172803 115482 14260 -41266
9798 -156624 -73271 -272249 -115536 363387 -240631 224624 -145537 -200768 26201 3189 66193
9787 66193 -188354 207118 134206 177675 207494 -79028 -9134 61942 -60817 35314 -2879 -99621
9775 -99621 -142181 -173093 -418751 -15888 140328 -121687 106713 17621 -433486 -50887 188612
9763 48903 174580 -203347 -98220 -57387 -158851 372946 -3485 -113884 118093 -177041 -205363
9752 -205363 -43517 -441153 67879 -26870 -122643 -118661 58741 23693 -108589 386279 -188403
9740 142497 156950 304669 34366 249399 351069 -168219 -191885 98107 -58604 22003 -97973
$$ packed form
9822b61916a04964j83331J10453h7391o6426a5811A66427c5591a7625B70777h2570
9810b09107a01160h432q2525n7143j87824E2223c48984a72803A15482A4260d1266
9798a56624g3271j98978a15536C63387b40631B24624a45537n5231B6201C189O3004
9787F6193a88354B07118p2912M3469K9819g9028i134F1942f0817C5314b879r6742
9775i9621m2560l0912k45658a5888A40328a21687A06713A7621d33486e0887A88612
9763D8903J25677b03347i8220M0833j01464C72946c485j10399A18093a77041k8322
9752b05363d3517l97636F7879b6870r5773L982E8741B3693a08589C86279a88403
9740A42497J4453J47719C4366K15033J01670a68219k3666I8107e8604B2003i7973
$$ plain form
9728 324345 268066 60399 80226 -196437 -288202 -74329 -40208 -168540 256544 5817 -63069
9716 86868 -129526 16899 -24457 -294258 -161459 -135827 -83172 -106408 1863 -288784 -40380
9704 -315432 -301348 159889 422347 -39302 -62694 217124 -304036 -7650 -53908 -373990 -294496
9693 -294496 -241090 -128902 -151475 176929 -49695 -190134 14932 -159158 -278090 58258 -271380
9681 -62800 -67571 -33811 -1774 -193724 63367 -104546 -131962 -51208 -46138 -273148 -126833 -28829
9668 -21464 -88210 218484 126097 -400578 51998 30548 -15399 -189860 30957 -145167 -374681
9657 -374681 -123905 95368 -166315 -155031 5993 -377177 -102562 -105264 -152263 -196123 90688
9645 168086 -50398 -155201 -208547 189523 -129834 -448745 -160118 -76073 -94957 -142144 -151876
$$ packed form
9728C24345n6279F0399J9827a96437r1765g4329L4121j28332B56544E817f3069
9716H6868a29526A6899b4457k69801J32799K5632N2655k3236A863b88784d0380
9704c15432J4084A59889K62458c9302k3392B17124c04036g650m6258l20082P9494
9693b94496N3406J12188k2573A76929d9695j40439A4932a59158j18932E8258b71380
9681f2800m771L3760a774j91950F3367a04546k7416e1208N070k27010a26833b8829
9668b1464o6746B18484r2387d00578E1998k1450a5399j74461C0957a45167k29514
9657c74681a23905I5368a66315J1284E993c77177a02562k702m6999m3860I0688
9645A68086e0398j04803n3346A89523a29834l18911a60118g6073j8884m7187r732
$$ plain form
9634 -151876 -107535 222184 88575 143183 -177709 -58158 -98248 -72261 -121329 -203980 -237064
9623 -237064 -148080 -68728 11080 -134309 -100143 -429182 -68411 171773 -67775 -17320 -79219
9612 -79219 -276993 -45421 -258859 8438 -516095 -159095 -143233 -516272 123151 -129210 54084
9600 -104689 -285466 138485 -26986 37079 -440444 43951 97488 -257110 36111 -134226 -158877
9589 -158877 -288548 91596 67721 -9652 -119700 -177860 -16528 -90158 -50377 4931 -159033
9577 -30745 -166290 -148165 84945 71079 -100706 -195770 234456 -230038 -344149 86479 185165
9566 185165 -103189 133461 134929 22481 -196774 14318 -128388 -149126 236270 -17908 -82119
9555 -82119 -20131 22078 -12967 27703 322910 -156769 -19019 -288420 -117856 -331178 39082
$$ packed form
9634a51876M4341B22184H8575N4608a77709e8158m0090K5987m9068q2651l3084
9623b37064Q8984f8728A1080a34309L4166l29039f8411A71773f7775a7320o1899
9612g9219j97774d5421k13438H438e16095a59095J5862l73039A23151a29210E4084
9600a04689j80777A38485b6986C7079d40444D3951N3537b57110C6111a34226k4651
9589a58877j29671I1596k3875i652j10048n8160a6528p3630L9781D931a59033
9577c0745j35545J8125H4945j3866a00706r5064B34456b30038j14111H6479R8686
9566A85165a03189A33461J468B2481a96774A4318a28388k0738B36270a7908o4211
9555h2119b0131B2078a2967B7703K95207a56769a9019k69401a17856k13322C9082
$$ plain form
9543 -223127 209237 147552 -25584 -72738 -88002 52026 -81815 -94525 100333 152394 -67195
9531 12271 115696 80500 -131748 -111049 98642 105832 -106615 9606 276792 222779 -124333
9519 -159648 -127453 -86870 -81624 28547 -7626 -77063 -241579 44998 -33485 -434492 -193383
9507 -196075 55361 -310185 -189887 -120126 55461 -94464 -306054 -327654 -260322 105369 -134453
9495 -111190 -93177 -65488 -5152 71416 220113 106231 -304525 126751 -77117 -271567 65855
9483 -400796 -85272 -48982 58609 -250831 -31543 172841 -109523 -165093 -9545 -188482 -142084
9472 -142084 -116467 24893 -328250 -157634 81447 189713 329014 -29669 167443 -161789
9461 83423 -99840 10327 -247198 -37417 -163009 -206718 -66036 -182381 -142847 42964 117109
$$ packed form
9543b23127B09237o1685b5584m7154j5264E2026h1815j2710A00333N2061f7195
9531A2271J03425l5196a31748K0699I8642P190a06615I606K67186n4013a24333
9519a59648L2195M0583N246B8547g626o9437j64516D4998c3485m01007a93383
9507a96075E5361c10185J20298O9761E5461i4464k11590k1600O7332A05369a34453
9495a11190J8013K7689e152G1416J48697A06231c04525A26751g7117j94450F5855
9483d00796h5272L6290E8609b50831c1543A72841a09523n5570i545j78937M6398
9472a42084K5617B4893c28250a57634H1447J08266J39301b9669A67443a61789
9461H3423i9840A0327b47198c7417j25592m3709f6036j16345L9534D2964P4145
$$ plain form
9450 117109 41286 -203661 -369982 -71400 74960 -206936 -296431 -52653 -111741 -60726 208150
9438 -93528 24062 -205616 92010 -268402 281865 24937 152940 45268 -46993 121170 -237568
9426 78693 -6846 -126491 -14725 -71712 -64247 87508 -395583 198570 315080 -140036 40749
9414 -51417 122699 -170118 52627 151293 -71986 220677 98998 -116381 35992 173544 -149379
9402 140211 -118681 -104087 470830 -221311 -278850 -494604 -144026 -187917 -102669 -237764
9392 -237764 216887 -75828 -120061 -41369 -133390 -290428 29700 -298131 -489217 -150416 71027
9380 -106003 26096 -292078 319325 8131 288867 21544 178757 -278305 33499 -188980 -63791
9368 -36675 62249 78848 40517 137653 -547065 29844 -13310 -116127 -54980 28286 -172824
$$ packed form
9450A17109D1286b03661j66321g1400G4960b06936q9495e2653n9088N1015B08150
9438i3528B4062b05616I2010b68402B81865B4937J28003D5268d6993A21170b37568
9426G8693f846j19645a4725n6987P465H7508c95583A98570J16510a40036D0749
9414e1417A22699a70118E2627R8666g1986B20677I8998a16381C5992J37552a49379
9402A40211a18681J4594D70830b21311n7539k15754a44026m3891Q5248j35095
9392b37764B16887g5828m4233d1369r2021j57038B9700b98131j91086a50416G1027
9380a06003B6096b92078C19325H131K80736B1544J57213b78305C3499a88980f3791
9368c6675F2249J6599l8331R7136e47065B9844a3310j02817e4980B8286a72824
$$ plain form
9356 74028 37895 15824 -365129 -75043 172482 181023 -378936 -181641 20185 100868 170541
9345 170541 69896 164220 -100692 -78118 35538 139054 277727 21084 118924 -146757 69328
9333 -151474 -288315 -176530 192178 -148314 98423 -8460 -66410 -171955 111657 -260081
9322 199950 68413 36687 -354382 -177436 22709 -374736 334560 115381 263706 -80510
9311 -97203 11668 -313861 -139348 -130029 -448812 -78801 -69848 -247391 -294603 87694 -40798
9299 54172 -214140 -154703 -330670 -122541 104693 -91807 -83391 120250 -155163 73 -175678
9287 -41199 35343 -14902 -20757 100043 -278283 -12038 -195150 44650 -158753 -210298 -217884
9276 -217884 -84996 -58574 -139494 -161175 48170 -308698 -494241 -234439 -272366 208076 115960
$$ packed form
9356G4028l6133A5824c65129g5043A72482Q541c78936a81641B0185Q0683O9673
9345A70541F9896R4324a00692K2574C5538J03516J38673B1084R7840a46757F9328
9333a51474j36841J11785A92178a48314I8423h460n7950j05545A11657b60081
9322A99950F8413l1726c54382J76946B2709c74736C34560A15381J48325h0510
9311i7203A1668c13861a39348R319l18783g8801Q953j77543m7212H7694d0798
9299E4172b14140N9437j75967a22541A04693i1807Q416A20250a55163G3a75678
9287d1199C5343a4902n855A00043b78283a2038j83112D4650a58753n1545p586
9276b17884h4996K6422q0920k1681D8170c08698j85543b34439l7927B08076r2116
$$ plain form
9265 115960 -458055 -287533 -222008 -140791 -276222 -111299 100091 -61378 -21959 -258477
9255 -258477 96334 31033 -20373 69716 -138097 -136327 99534 -134000 -360714 -151619 -25447
9243 -182467 151970 185091 73867 76778 178208 90119 -204748 154139 89127 -95453 98563
9231 -118980 -83241 289650 39457 235327 -284465 -235579 -47120 -19618 -115833 -68921 87027
9219 -311273 145616 115179 -67896 209221 -337906 92141 -163851 -48135 40247 -166721 191400
9207 -35231 -173034 220765 -245229 -94664 -340932 24557 -148311 186471 304211 -33919
9196 -35139 -367133 -179220 -180482 78452 232785 174960 -68664 102026 -93370 32694 -125217
9184 30470 194927 -135389 -314877 -69206 60078 -50556 -411815 -11151 145628 -151814 -25305
$$ packed form
9265A15960d58055J70522O5525Q1217j35431a11299A00091f1378b1959k36518
9255b58477I6334C1033b0373F9716a38097J770I9534a34000k26714a51619b5447
9243a82467A51970L3121G3867K911J01430q8089b04748A54139o5012i5453I8563
9231a18980L5739B89650C9457J95870b84465M8886d7120a9618r6215M6912H7027
9219c11273A45616l0437f7896B09221c37906I2141a63851d8135D0247a66721A91400
9207c5231j37803B20765b45229i4664k46268B4557a48311A86471J17740c3919
9196c5139l31994a79220j262G8452J54333n7825f8664A02026i3370C2694a25217
9184C0470J64457a35389j79488f9206F0078e0556l61259a1151A45628a51814b5305
$$ plain form
9172 -36363 -48164 -65865 13272 -43257 -232109 -295723 273021 9435 147345 20006 -357956
9160 11294 262842 -60517 -240470 164517 115289 54138 -187588 -315497 -190808 -189294 -22798
9148 374506 49430 -378231 288384 -56474 -87906 101378 -174700 -99492 170249 270505
9138 270505 -462443 83695 -54092 -104150 -75878 98978 56634 -218975 17392 -120294 -192572
9127 -192572 -8889 111814 -248422 -209647 -333651 179737 11515 293147 -251851 -8679 103747
9115 -316476 36309 -37478 35841 90939 -65131 19760 62395 -245880 -429011 -259214 -75061
9103 -296399 238431 -74001 -158229 76292 -51122 -97893 30288 -134614 13402 -115525 -51515
9091 -40972 -141443 -76413 -191788 -411880 -254576 -85545 67097 -279448 147246 -230622
$$ packed form
9172c6363j1801j7701A3272d3257j88852o3614B73021I435J37910B0006c57956
9160A1294K51548f0517j79953A64517m9228E4138a87588j27909J24689J514b2798
9148C74506D9430c78231B88384e6474l1432A01378a74700P5208A70249J00256
9138B70505d62443H3695e4092n0058K8272I8978m2344b18975A7392a20294p2278
9127a92572h889A11814b48422L8775j24004A79737A1515K81632b51851h679A03747
9115c16476C6309c7478C5841N5098f5131A9760M2635b45880j83131J69797g5061
9103b96399B38431g4001q4228G6292e1122m6771C0288a34614A3402a15525e1515
9091d0972j00471O5030j15375k20092J57304h5545F7097b79448A47246b30622
$$ plain form
9080 -62338 265630 -212003 45878 28039 -91239 217275 -59886 99068 277798 -167236 -9892
9068 -185871 -60055 -272662 158892 -153950 39210 102762 -265978 328600 -133087 -186863
9058 -186863 100690 -83997 135629 -37741 5818 218253 11499 181546 52167 26876 -22697
9046 -30394 -88733 -53562 -54422 -196160 -66831 -84200 366449 -95627 -31709 63141 -249981 -28941
9033 -123088 21585 -39467 353175 212797 62603 -442420 -53832 133173 10407 347086 -146665
9021 136892 276482 -358804 -143889 -89255 121479 -134825 80068 -149541 274787 -31764
9010 15516 65628 -57019 16861 -203664 93456 104460 -69129 62678 58160 36946 -62467 37559
8997 -466179 -46824 -227140 168603 -55844 -141762 232229 -190138 -96880 116906 -84952 -311125
$$ packed form
9080f2338B65630b12003D5878j7839i1239B17275e9886I9068J78730a67236i892
9068a85871f0055k12607A58892a53950C9210O3552b65978C28600a33087n3776
9058a86863A00690h3997A35629c7741E818K12435A1499J70047E2167k5291b2697
9046c0394n8339L5171q60j41738f6831j7369C66449i5627c1709F3141b49981b8941
9033a23088B1585c9467C53175j40378F2603d42420e3832A33173A0407L36679a46665
9021A36892J39590c58804a43889N4634A21479a34825H0068a49541B74787c1764
9010A5516N0112e7019A6861b03664I3456J1004f9129F2678m518k1214f2467C7559
8997d66179d6824j80316A68603e5844q5918B32229a90138R3258A16906h4952k26173
$$ plain form
8986 -311125 -162310 -195325 -147235 71964 102308 89956 44190 -144887 -148830 57243 -20133
8974 -173428 -156569 159028 -143751 -370561 -45689 -173797 -147027 -58192 -114449 -1962 -141639
8963 -141639 506478 44631 165851 88791 -40688 17740 -73368 -151053 31726 -110003 -101240
8952 -101240 -375361 -62175 -149152 109983 -157992 -124432 239342 -221551 -33113 -167777
8942 -167777 309559 133583 9621 -1046 -324643 -36102 -225518 -46344 125796 -381938 -424946
8931 -424946 -177180 11353 -35909 -326689 -46254 -178426 -288332 120985 -304422 -278203
8921 -278203 27246 -37253 -80581 -62949 -411967 -94757 217639 214272 196278 -46338 167868
8909 185431 52221 622872 515607 1208289 1716384 3123353 7252751 4273107 1991187
$$ packed form
8986c11125J48815l3015M8090G1964L0344j2352D4190a44887l943E7243b0133
8974a73428J6859A59028a43751k26810d5689j28108K6770e8192n6257a962j39677
8963a41639E06478D4631J21220p7060d0688A7740g3368p7685C1726a10003Q763
8952a01240k74121f2175q6977A09983a57992L3560B39342b21551c3113j34664
8942a67777C09559A33583I621a046l23597c6102j89416d6344A25796c81938m3008
8931d24946a77180A1353c5909k90780d6254j32172j09906A20985c04422K6219
8921b78203B7246c7253m3328J7632l49018i4757B17639l367j7994d6338A67868
8909A85431E2221N70651j07265O92682N08095J406969M129398k979644A991187
$$ plain form
8899 1030297 456067 410872 301139 341737 -113945 377437 102399 -215990 421756 48220
8888 216248 -3237 -3502 -264363 285634 -120524 -252705 113848 -140108 -12463 -188176 -203142
8877 -203142 316716 -8297 -130408 92024 202495 56846 289524 272901 -59061 -25803 -43116
8866 -43116 -28365 -309183 109800 -192267 194848 227576 -358486 -43400 -17263 -345689 116271
8854 -165581 -17094 -120562 -273607 134098 -176613 -6658 -23346 248110 -23215 58361 -116729
8842 -173730 -38109 365119 37620 -24274 -202464 -46576 -135990 -152661 -10997 -67782 -396606
$$ packed form
8899A030297D56067m5195j09733M0598a13945C77437A02399b15990D21756D8220
8888B16248c237k65k60861B85634a20524j32181A13848a40108a2463j75713j4966
8877b03142C16716h297j22111I2024J10471E6846K32678j6623e9061b5803j7313
8866d3116J4751k80818A09800a92267A94848L2728c58486d3400a7263l28426A16271
8854a65581a7094j03468j53045A34098a76613f658j6688B48110b3215E8361a16729
8842a73730c8109C65119C7620b4274j78190d6576q9414j6671a0997n6785l28824
$$ [...]
##END NTUPLES=NMR SPECTRUM
##END=
