
##TITLE=AC1127_Huila-acevedo_5906844_N7SYexaETs
##JCAMPDX= 6.0         $$ Bruker NMR JCAMP-DX V2.0
##DATA TYPE= NMR SPECTRUM
##DATA CLASS= NTUPLES
##ORIGIN= BRUKER
##OWNER= Administrator
$$ 1.72 TOPSPIN		Version 2.1
$$ 2012-04-10 10:12:38.359 -0500  Administrator@TOPSPIN
$$ Compression mode = diff/dup
##.OBSERVE FREQUENCY= 400.13188235
##.OBSERVE NUCLEUS= ^1H
##.ACQUISITION MODE= SIMULTANEOUS (DQD)
##.ACQUISITION SCHEME= undefined
##.AVERAGES= 64
##.DIGITISER RES= 22
##SPECTROMETER/DATA SYSTEM= spect
##.PULSE SEQUENCE= noesygpps1d.comp
##.SOLVENT NAME= COFFEE_meoh
##.SHIFT REFERENCE= INTERNAL, COFFEE_meoh, 1, 14.96846
##AUDIT TRAIL= $$ (NUMBER, WHEN, WHO, WHERE, PROCESS, VERSION, WHAT)
$$ ##TITLE= Audit trail, TOPSPIN		Version 2.1
$$ ##JCAMPDX= 5.01
$$ ##ORIGIN= Bruker BioSpin GmbH
$$ ##OWNER= Administrator
$$ $$ C:\Bruker\TOPSPIN/data/COFFEE/nmr/AC1127_Huila-acevedo_5906844_N7SYexaETs/12/pdata/1/auditp.txt
$$ ##AUDIT TRAIL=  $$ (NUMBER, WHEN, WHO, WHERE, PROCESS, VERSION, WHAT)
(   1,<2012-04-04 17:57:12.578 -0500>,<Administrator>,<TOPSPIN>,<go>,<TOPSPIN 2.1>,
      <created by zg
	started at 2012-04-04 17:45:40.875 -0500,
	POWCHK enabled, PULCHK disabled,
       configuration hash MD5:
       1A 1E CE 29 27 FD 77 03 67 4E F0 E3 C4 B2 CB 90
       data hash MD5: 64K
       A0 09 A2 FE 0C 7B FC C2 0C 1D CC 82 2A CA 48 0E>)
(   2,<2012-04-04 17:57:15.343 -0500>,<Administrator>,<TOPSPIN>,<proc1d>,<TOPSPIN 2.1>,
      <Start of raw data processing
       efp LB = 0.3 FT_mod = 6 PKNL = 1 PHC0 = 0 PHC1 = 0 SI = 128K 
       data hash MD5: 128K
       09 9F D2 09 8D 22 9B 87 35 B5 07 20 EC 4F 12 DB>)
(   3,<2012-04-04 17:57:16.562 -0500>,<Administrator>,<TOPSPIN>,<proc1d>,<TOPSPIN 2.1>,
      <pk PHC0 = 32.7832 PHC1 = 0 
       data hash MD5: 128K
       7C 52 81 02 CA 8D 46 E2 1A 36 BF 55 B0 EE E1 CD>)
(   4,<2012-04-04 17:57:16.781 -0500>,<Administrator>,<TOPSPIN>,<proc1d>,<TOPSPIN 2.1>,
      <abs ABSG = 1 
       data hash MD5: 128K
       28 49 A6 27 4C CA 38 86 36 A2 6F C5 CF BE CA 80>)
(   5,<2012-04-04 17:57:16.859 -0500>,<Administrator>,<TOPSPIN>,<proc1d>,<TOPSPIN 2.1>,
      <abs ABSG = 2 
       data hash MD5: 128K
       EB 87 4B E5 73 BA 7A 32 D5 B7 FA 4A 7B 4A 49 5B>)
(   6,<2012-04-04 17:57:16.921 -0500>,<Administrator>,<TOPSPIN>,<proc1d>,<TOPSPIN 2.1>,
      <abs ABSG = 3 
       data hash MD5: 128K
       46 AD DB 10 1D 1F 8F F6 17 60 87 1D 19 40 70 8F>)
(   7,<2012-04-04 17:57:17.187 -0500>,<Administrator>,<TOPSPIN>,<proc1d>,<TOPSPIN 2.1>,
      <abs ABSG = 4 
       data hash MD5: 128K
       5C AF 1E 2F 78 75 80 40 27 00 F0 77 71 CA 67 0B>)
(   8,<2012-04-04 17:57:17.250 -0500>,<Administrator>,<TOPSPIN>,<proc1d>,<TOPSPIN 2.1>,
      <abs ABSG = 5 
       data hash MD5: 128K
       0D A5 A5 FE 76 B2 8E 67 78 0C 31 29 4E 93 E1 6C>)
(   9,<2012-04-04 17:57:17.484 -0500>,<Administrator>,<TOPSPIN>,<audit>,<TOPSPIN 2.1>,
      <user comment:
       ICON-NMR User ID: COFFEE
       data hash MD5: 128K
$$ [...]
##$TP07= 0
##$TPNAME0= <>
##$TPNAME1= <>
##$TPNAME2= <>
##$TPNAME3= <>
##$TPNAME4= <>
##$TPNAME5= <>
##$TPNAME6= <>
##$TPNAME7= <>
##$TPOAL= (0..7)
0.5 0.5 0.5 0.5 0.5 0.5 0.5 0.5
##$TPOFFS= (0..7)
0 0 0 0 0 0 0 0
##$TUNHIN= 0
##$TUNHOUT= 0
##$TUNXOUT= 0
##$USERA1= <user>
##$USERA2= <user>
##$USERA3= <user>
##$USERA4= <user>
##$USERA5= <user>
##$V9= 5
##$VALIST= <valist>
##$VCLIST= <CCCCCCCCCCCCCCC>
##$VD= 0
##$VDLIST= <DDDDDDDDDDDDDDD>
##$VPLIST= <PPPPPPPPPPPPPPP>
##$VTLIST= <TTTTTTTTTTTTTTT>
##$WBST= 2048
##$WBSW= 25
##$XGAIN= (0..3)
0 0 0 0
##$XL= 0
##$YL= 0
##$YMAX_a= 13439663
##$YMIN_a= -5938893
##$ZGOPTNS= <>
##$ZL1= 120
##$ZL2= 120
##$ZL3= 120
##$ZL4= 120
##$ABSF1= 14.96846
##$ABSF2= -5.58407
##$ABSG= 5
##$ABSL= 3
##$ALPHA= 0
##$AQORDER= 0
##$ASSFAC= 0
##$ASSFACI= 0
##$ASSFACX= 0
##$ASSWID= 0
##$AUNMP= <proc_prof1d_extract.lims>
##$AXLEFT= 0
##$AXNAME= <>
##$AXNUC= <1H>
##$AXRIGHT= 0
##$AXTYPE= 0
##$AXUNIT= <>
##$AZFE= 0.1
##$AZFW= 0.1
##$BCFW= 0
##$BC_mod= 0
##$BYTORDP= 0
##$COROFFS= 0
##$CY= 15
##$DATMOD= 1
##$DC= 0
##$DFILT= <>
##$DTYPP= 0
##$F1P= 0
##$F2P= 0
##$FCOR= 0.5
##$FTSIZE= 131072
##$FT_mod= 6
##$GAMMA= 0
##$GB= 0
##$INTBC= 1
##$INTSCL= 1
##$ISEN= 128
##$LB= 0.3
##$LEV0= 0
##$LPBIN= 0
##$MAXI= 10000
##$MC2= 0
##$MEAN= 0
##$ME_mod= 0
##$MI= 0
##$NCOEF= 0
##$NC_proc= -3
##$NLEV= 6
##$NOISF1= 0
##$NOISF2= 0
##$NSP= 0
##$NTH_PI= 0
##$NZP= 0
##$OFFSET= 14.96846
##$PC= 1
##$PHC0= 32.7832
##$PHC1= 0
##$PH_mod= 1
##$PKNL= yes
##$PPARMOD= 0
##$PPDIAG= 0
##$PPIPTYP= 0
##$PPMPNUM= 2147483647
##$PPRESOL= 1
##$PSCAL= 4
##$PSIGN= 0
##$PYNMP= <proc.py>
##$REVERSE= no
##$SF= 400.130004861134
##$SI= 131072
##$SIGF1= 0
##$SIGF2= 0
##$SINO= 400
##$SIOLD= 131072
##$SPECTYP= <>
##$SREGLST= <1H.CDCl3>
##$SSB= 0
##$STSI= 131072
##$STSR= 0
##$SW_p= 8223.68421052632
##$SYMM= 0
##$S_DEV= 0
##$TDeff= 65536
##$TDoff= 0
##$TI= <>
##$TILT= no
##$TM1= 0
##$TM2= 0
##$TOPLEV= 0
##$USERP1= <user>
##$USERP2= <user>
##$USERP3= <user>
##$USERP4= <user>
##$USERP5= <user>
##$WDW= 1
##$XDIM= 131072
##$YMAX_p= 511075629
##$YMIN_p= -373812202
##$CURPLOT= <Network HP LaserJet P1505>
##$CURPRIN= <$Network HP LaserJet P1505>
##$DFORMAT= <normdp>
##$LAYOUT= <+/1D_H.xwp>
##$LFORMAT= <normlp>
##$PFORMAT= <normpl>
##$SURQMSG= 1
$$ End of Bruker specific parameters
$$ ---------------------------------
##NTUPLES= NMR SPECTRUM
##VAR_NAME=  FREQUENCY,     SPECTRUM/REAL,   SPECTRUM/IMAG
##SYMBOL=    X,             R,               I
##VAR_TYPE=  INDEPENDENT,   DEPENDENT,       DEPENDENT
##VAR_FORM=  AFFN,          ASDF,            ASDF
##VAR_DIM=   131072,        131072,          131072
##UNITS=     HZ,            ARBITRARY UNITS, ARBITRARY UNITS
##FACTOR=    0.0627417313425165, 1,          1
##FIRST=     8223.62146879498, 4383,         -95731
##LAST=      0,             8101,            -95977
##MIN=       0,             -373812202,      0
##MAX=       8223.62146879498, 511075629,    0
$$ Real data points
##PAGE= N=1
##DATA TABLE= (X++(R..R)), XYDATA
$$ [...]
62917C736167k9463m1875n4350o6439p7690q7822r6414j02887j06966j08803j08570
62906B854888j06430j02953r8985r4857r0443q5922q1674p7304p1871o5556n9971
62895A918922n6067n2748m8467m3301l8391l4129l0121k6336k3043k0077j7416
62884A528826j5987j6540j7947j8144j6768j5435j5286j5710j5887j6084j6670
62873A348368j7009j6324j4929j3684j2760j1787j0938j0917j1753j2220j1032
62862A205015q431o331o500q635j0553j0376q182n483l756l717n094o454o093
62849A115410m011k392l056n081o167n770n197m988m212k662j738k238k923k445
62835A062530j444j368k155k530k056j531j512j778k226l242m801o080o350n775
$$ y = [3736167, 3706704, 3664829, 3610479, 3544040, 3466350, 3378528, 3282114, 3179227, 3072261, 2963458, 2854888, 2748458, 2645505, 2546520, 2451663, 2361220, 2275298, 2193624, 2116320, 2044449, 1978893, 1918922, 1862855, 1810107, 1761640, 1718339, 1679948, 1645819, 1615698, 1589362, 1566319, 1546242, 1528826, 1512839, 1496299, 1478352, 1460208, 1443440, 1428005, 1412719, 1397009, 1381122, 1365038, 1348368, 1331359, 1315035, 1300106, 1286422, 1273662, 1261875, 1250937, 1240020, 1228267, 1216047, 1205015, 1196584, 1190253, 1183753, 1175118, 1164565, 1154189, 1146007, 1140524, 1136768, 1133051, 1127957, 1121503, 1115410, 1111399, 1109007, 1105951, 1100870, 1094703, 1088933, 1083736, 1078748, 1074536, 1071874, 1070136, 1067898, 1064975, 1062530, 1061086, 1059718, 1057563, 1055033, 1052977, 1051446, 1049934, 1048156, 1045930, 1042688, 1037887, 1031807, 1025457, 1019682]
62821A019682m988m292l618l012k753k925l098k647j522n76q27k397m439o067
62807I76521o993p185o492n035l686l467m395n347n302m489m044m688n987o912
62793I02499o757n511l727k335k091k719k896j830n74p39k050k470j177N3n70
62778H67106k108k128O0K892M821N488M844K904P02o6R16K061K062J444J280J434
62762H93712J208Q94J338K334K697K094J711K645M318N131M512L678M086N648
62748I36006P000P355P204P106O828O411P000R416J2496J4358J5021J6188J8490
62735A070879K0779K2504K4817K8299L1386L2657L3331L5660L9573M2916M4775
62724A427576M6718N0358N5306O0201O4679O9475P5259Q1927Q8723R4638R9161
$$ y = [1019682, 1014694, 1010402, 1006784, 1003772, 1001019, 998094, 994996, 992349, 990827, 990251, 989424, 987027, 982588, 976521, 969528, 962343, 955851, 950816, 947130, 943663, 939268, 933921, 928619, 924130, 920086, 915398, 909411, 902499, 895742, 890231, 886504, 884169, 882078, 879359, 876463, 874633, 874059, 873320, 871270, 868800, 867623, 867676, 867106, 864998, 862870, 862930, 865822, 870643, 876131, 880975, 883879, 884581, 884515, 885431, 887492, 889554, 890998, 892278, 893712, 894920, 895814, 897152, 899486, 902183, 904277, 905988, 908633, 912951, 918082, 922594, 926272, 930358, 936006, 943006, 950361, 957565, 964671, 971499, 977910, 984910, 994326, 1006822, 1021180, 1036201, 1052389, 1070879, 1091658, 1114162, 1138979, 1167278, 1198664, 1231321, 1264652, 1300312, 1339885, 1382801, 1427576, 1474294, 1524652, 1579958, 1640159, 1704838, 1774313, 1849572, 1931499, 2020222, 2114860, 2214021]
62713B214021J02885J06877J11154J14207J14368J11153J04960R6030Q4419P0600
62703C230674N5391L9251K2190M438j3335l0617m7423o3676p8529r0599r8963
62692B928802j03796j06171j07365j08180j08605j08054j06015j02443r7663r2110
62682A888400q6305q0647p4957o8598o1612n5331n1044m8213m5008m0767l6820
62671A239098l4288l2237k9035k4814k1208j8890j6723j3613j0085p440o037m988
62659A019740l163j04L710P209R596J1103J2711J4902J7118J8607J9542K0926
62647A151897K3571K7426L1835L6243M0660M5405N0393N4921N8575O2189O7235
62636A650350P4064Q1308Q7428R2252R6430R9878J01768J01961J01327J00097
$$ y = [2214021, 2316906, 2423783, 2534937, 2649144, 2763512, 2874665, 2979625, 3075655, 3160074, 3230674, 3286065, 3325316, 3347506, 3351944, 3338609, 3307992, 3260569, 3196893, 3118364, 3027765, 2928802, 2825006, 2718835, 2611470, 2503290, 2394685, 2286631, 2180616, 2078173, 1980510, 1888400, 1802095, 1721448, 1646491, 1577893, 1516281, 1460950, 1409906, 1361693, 1316685, 1275918, 1239098, 1204810, 1172573, 1143538, 1118724, 1097516, 1078626, 1061903, 1048290, 1038205, 1030765, 1024728, 1019740, 1016577, 1016473, 1020183, 1027392, 1036988, 1048091, 1060802, 1075704, 1092822, 1111429, 1130971, 1151897, 1175468, 1202894, 1234729, 1270972, 1311632, 1357037, 1407430, 1462351, 1520926, 1583115, 1650350, 1724414, 1805722, 1893150, 1985402, 2081832, 2181710, 2283478, 2385439, 2486766, 2586863]
62626B586863R6812Q9814P9354O7155N4036L9166K1921L404j4695l1759m7936
62615B944135o2889p6036q7431r7119j03928j06440j05273j02841j00661r8212
62605B003305r4820r1088q7660q4041p9682p5020p0432o5337n9492n4061n0063
62594A191609m6731m2892l9028l6326l4444l1970k8697k5751k3787k2624k2232
62583H37127k2331k1391j8127j3937j1703j1983j2460j1542j0324j0139j0391
62572F82799j0060r605r789j0046r436q188o910n271k884o41L00K31K88O83Q68
62557F12339J010J781K993L809M237N080O342P090P205P954J0141J2654J3829
62544F96464J3654J3769J5480J8507K1732K4473K6805K9089L1597L4446L7499
$$ y = [2586863, 2683675, 2773489, 2852843, 2919998, 2974034, 3013200, 3035121, 3038525, 3023830, 2992071, 2944135, 2881246, 2805210, 2717779, 2620660, 2516732, 2410292, 2305019, 2202178, 2101517, 2003305, 1908485, 1817397, 1729737, 1645696, 1566014, 1490994, 1420562, 1355225, 1295733, 1241672, 1191609, 1144878, 1101986, 1062958, 1026632, 992188, 960218, 931521, 905770, 881983, 859359, 837127, 814796, 793405, 775278, 761341, 749638, 737655, 725195, 713653, 703329, 693190, 682799, 672739, 663134, 653345, 643299, 633863, 625675, 618765, 613494, 610610, 609969, 610269, 610500, 610788, 611471, 612339, 613349, 615130, 618123, 621932, 626169, 631249, 637591, 644681, 651886, 659840, 669981, 682635, 696464, 710118, 723887, 739367, 757874, 779606, 804079, 830884, 859973, 891570, 926016, 963515]
62533I63515M0406M2930M5163M7160M8843N0553N3178N6758N9295N8357N3997
62522A520155M8644M3673L7793K9750K0754J2504M351n326j5825k4694l1196l6734
62510A603849m1874m5497m7316m8743n0427n1036m9596m7077m4445m1017l6270
62499A100551l1758k9444k9176k9245k8612k7221k5042k2283j9965j8897j8421
62488H20487j7362j5782j4685j4388j4229j3709j2954j2087j0788q564n294j784
62476F78861L47K58o75j54K038L838M113M316N942Q121R288R821J1230J3610J5716
62461G66670J6940J7718J8559K0034K3017K7500L1865L4832L7293M0566M3836
62450A078830M5536M6528M9239N3638N6770N6866N5439N4302N2644M8648M2342
$$ y = [963515, 1003921, 1046851, 1092014, 1139174, 1188017, 1238570, 1291748, 1348506, 1407801, 1466158, 1520155, 1568799, 1612472, 1650265, 1680015, 1700769, 1713273, 1717624, 1712298, 1696473, 1671779, 1640583, 1603849, 1561975, 1516478, 1469162, 1420419, 1369992, 1318956, 1269360, 1222283, 1177838, 1136821, 1100551, 1068793, 1039349, 1010173, 980928, 952316, 925095, 900053, 877770, 857805, 838908, 820487, 803125, 787343, 772658, 758270, 744041, 730332, 717378, 705291, 694503, 685939, 680645, 678861, 679208, 679466, 678791, 678637, 680675, 684513, 688626, 692942, 698884, 707005, 716293, 726114, 737344, 750954, 766670, 783610, 801328, 819887, 839921, 862938, 890438, 922303, 957135, 994428, 1034994, 1078830, 1124366, 1170894, 1220133, 1273771, 1330541, 1387407, 1442846, 1497148, 1549792, 1598440, 1640782]
62439A640782L5084K7190J7916P431k757j1540j9366k7296l5445m2747m7913n0413
62427A490926n0633m9421m7639m5892m4300m2494m0125l7452l5064l3168l1559
62416A033179l0074k8340k5326k0420j5066j1955j1972j3095j2907j0901p769
62405H45354m019m94J323J155Q70K084L973N109O057P897R386Q401N804M932P046
62390I04878R905J1426J2172J3241J3922J3026J0991R036P190M576J144k028m120
62377A005359n659q147j2391j7120j9831j9759j9076k0005k1641k1510j9581j8257
62365H02382j8357j7881j5527j2904j1759j1068q772m972j565L67J225J675K172
62352G05016L151M489N363N564O219Q142J0355J1518J1987J2919J3954J3615J1835
$$ y = [1640782, 1675866, 1703056, 1720972, 1728403, 1725646, 1714106, 1694740, 1667444, 1631999, 1589252, 1541339, 1490926, 1440293, 1390872, 1343233, 1297341, 1253041, 1210547, 1170422, 1132970, 1097906, 1064738, 1033179, 1003105, 974765, 949439, 929019, 913953, 901998, 890026, 876931, 864024, 853123, 845354, 841335, 840841, 842164, 843319, 844189, 846273, 850246, 855355, 861412, 869309, 878695, 887096, 892900, 897832, 904878, 914783, 926209, 938381, 951622, 965544, 978570, 989561, 998597, 1005787, 1010363, 1011507, 1009479, 1005359, 999700, 991553, 979162, 962042, 942211, 922452, 903376, 883371, 861730, 840220, 820639, 802382, 784025, 766144, 750617, 737713, 725954, 714886, 706114, 701142, 699577, 699944, 701169, 702844, 705016, 708167, 712656, 718019, 723583, 729802, 737944, 748299, 759817, 771804, 784723, 798677, 812292, 824127]
62339H24127J0409J0587J1599J2006J1328R888Q001O014M450L396K157J04k381
62326I11685m259m982m835m182k845m98K504N189O968Q290R986J2212J4550J7025
62312I66808K0350K4832K9597L3425L6195L9056M3249M9070N5914O2841O8928
62301A430265P3542P6726P9332Q2212Q5088Q6496Q5080Q0624P3527O3957N2274
62290B269123L9858K8280J7553O315n966j8012k8442l7211m4774n0887n5375n9233
62278B061229o3626o8132p0928p0570o7097o1901n6987n3563n0840m7148m2826
62267A407611m0461m1171m2303m0591l6300l2084k8864k5506k1943j9695j9036
62256A059657j8280j6427j4341j2626j0487p592n144m101l856l626l686m385n273
$$ y = [824127, 834536, 845123, 856722, 868728, 880056, 889944, 897945, 903959, 908409, 911805, 913962, 914066, 911685, 907426, 902444, 897609, 893427, 890582, 890084, 892588, 897777, 904745, 913035, 923021, 935233, 949783, 966808, 987158, 1011990, 1041587, 1075012, 1111207, 1150263, 1193512, 1242582, 1298496, 1361337, 1430265, 1503807, 1580533, 1659865, 1742077, 1827165, 1913661, 1998741, 2079365, 2152892, 2216849, 2269123, 2308981, 2337261, 2354814, 2361129, 2355163, 2337151, 2308709, 2271498, 2226724, 2175837, 2120462, 2061229, 1997603, 1929471, 1858543, 1787973, 1720876, 1658975, 1601988, 1548425, 1497585, 1450437, 1407611, 1367150, 1325979, 1283676, 1243085, 1206785, 1174701, 1145837, 1120331, 1098388, 1078693, 1059657, 1041377, 1024950, 1010609, 997983, 987496, 979904, 974760, 970659, 966803, 963177, 959491, 955106, 949833]
62243I49833o044p037q066q207p472p244q179r015q440o868n386m104k602j093
62229H60076j8P31J494K427L709N389O811P432Q276J0874J4583J6901J7127J7522
62215I73334J9847K2935K5059K6616K8658L0641L1771L3059L5936L9850M3369
62204A311075M6588N0437N4505N7680O0339O3817O8120P1991P4736P6185P5428
62193B010901P1516O5109N7635M9052L8332K5774J2881J73j2888k5807l6909m5552
62181B210217n2585n8365o2141o3882o5049o6794o8659o9414o8057o3955n7489
62170A513827n0718m5782m2336l8187l2723k7763k4471k1592j7951j4639j3067
62159A184598j2399j0851q495o722n640m122k244j569k607l751l523k446j745
$$ y = [949833, 943789, 936752, 928686, 920479, 913007, 905763, 897584, 888569, 880129, 873261, 867875, 863771, 861169, 860076, 860058, 860789, 862283, 864710, 868419, 873808, 880619, 888051, 896327, 907201, 921784, 938685, 955812, 973334, 993181, 1016116, 1041175, 1067791, 1096449, 1127090, 1158861, 1191920, 1227856, 1267706, 1311075, 1357663, 1408100, 1462605, 1520285, 1580624, 1644441, 1712561, 1784552, 1859288, 1935473, 2010901, 2082417, 2147526, 2205161, 2254213, 2292545, 2318319, 2331200, 2331373, 2318485, 2292678, 2255769, 2210217, 2157632, 2099267, 2037126, 1973244, 1908195, 1841401, 1772742, 1703328, 1635271, 1571316, 1513827, 1463109, 1417327, 1374991, 1336804, 1304081, 1276318, 1251847, 1230255, 1212304, 1197665, 1184598, 1172199, 1161348, 1152853, 1146131, 1140491, 1136369, 1134125, 1132556, 1129949, 1126198, 1122675, 1120229, 1118484]
62146A118484j353m43P88J392J509K493M849P241Q247Q239Q626R910J1537J3376
62132A194895J6074J9816K3679K6585K8351K9465L0331L0909L0818K9803K8364
62121A489090K7521K7359K6545K4246K1950K1851K3889K6139K7997L0804L5083
62110A782474L9424M2964M6638N0854N4100N5419N6140N7187N6565N1924M4178
62099B337867L6137K8689K0916J3058O516J291l893q996j2703j5197j8291k2470
62087B362924k6139k8343k9903l1101l0537k7465k3409k0270j8290j6988j6586
62076B093893j7204j7827j7337j5835j3990j1923r700q092p785q252q199o820
62064A950929m245j242J157K370K936L864N298O599P870J0128J3579J6884J8884
$$ y = [1118484, 1117131, 1116688, 1117476, 1118868, 1120377, 1122870, 1127719, 1134960, 1143207, 1151446, 1160072, 1169982, 1181519, 1194895, 1210969, 1230785, 1254464, 1281049, 1309400, 1338865, 1369196, 1400105, 1430923, 1460726, 1489090, 1516611, 1543970, 1570515, 1594761, 1616711, 1638562, 1662451, 1688590, 1716587, 1747391, 1782474, 1821898, 1864862, 1911500, 1962354, 2016454, 2071873, 2128013, 2185200, 2241765, 2293689, 2337867, 2374004, 2402693, 2423609, 2436667, 2443183, 2444474, 2440581, 2431585, 2418882, 2403685, 2385394, 2362924, 2336785, 2308442, 2278539, 2247438, 2216901, 2189436, 2166027, 2145757, 2127467, 2110479, 2093893, 2076689, 2058862, 2041525, 2025690, 2011700, 1999777, 1990077, 1981985, 1974200, 1965948, 1957749, 1950929, 1946684, 1945442, 1946599, 1948969, 1951905, 1955769, 1961067, 1967666, 1975536, 1985664, 1999243, 2016127, 2035011]
62051B035011J9996K1225K2772K4469K6665K9619L2515L4205L4737L5458L7631
62040B354303M1392M5887N0099N3652N6927O0092O2205O1935N9286N5892N3530
62029B955200N2955N4188N7018O0783O4410O7086O8427O8065O5941O3181O1591
62018C638845O1926O3443O5315O7367O9096O9417O8269O7394O8556P1788P6143
62007D387559Q1151Q6336R0170R1047Q9112Q5929Q2348P7761P1538O4185N6737
61996E263873M9757M3466L8327L4639L1573K7465K1694J5906J2480J1743J1805
61985E562728J1455J1850J4339J7884K0369K1752K3816K7006K9748L1315L3268
61974E805530L7018M1571M4903M6365M6639M6325M5710M5181M4767M3862M2123
$$ y = [2035011, 2055007, 2076232, 2099004, 2123473, 2150138, 2179757, 2212272, 2246477, 2281214, 2316672, 2354303, 2395695, 2441582, 2491681, 2545333, 2602260, 2662352, 2724557, 2786492, 2845778, 2901670, 2955200, 3008155, 3062343, 3119361, 3180144, 3244554, 3311640, 3380067, 3448132, 3514073, 3577254, 3638845, 3700771, 3764214, 3829529, 3896896, 3965992, 4035409, 4103678, 4171072, 4239628, 4311416, 4387559, 4468710, 4555046, 4645216, 4736263, 4825375, 4911304, 4993652, 5071413, 5142951, 5207136, 5263873, 5313630, 5357096, 5395423, 5430062, 5461635, 5489100, 5510794, 5526700, 5539180, 5550923, 5562728, 5574183, 5586033, 5600372, 5618256, 5638625, 5660377, 5684193, 5711199, 5740947, 5772262, 5805530, 5842548, 5884119, 5929022, 5975387, 6022026, 6068351, 6114061, 6159242, 6204009, 6247871, 6289994]
61963F289994M0005L7872L5330L2088K8579K5153K1563J7908J5068J3409J2034
61952F569003J0191Q331O957N533L647K015J112l8k181l999l623j260J384L585
61938F600657N653P033O532M408K375J236J54j549l421n099o889q615r290q631
61924F584554p615o915n891l939j886j119j882l202m053m130l862m063n201o828
61910F523968q223r591j1853j5024j7735j8880j9052j9763k1782k4740k7818l0277
61898F299230l1785l2712l3726l4735l4796l3663l2739l3632l5958l7548l6825
61887E921111l4186l0962k7869k5054k2886k1720k0877j8879j5145j0819p223
61876E685491l930N79O431J1919J6041K0149K5928L2656L8148M2106M6716N3611
$$ y = [6289994, 6329999, 6367871, 6403201, 6435289, 6463868, 6489021, 6510584, 6528492, 6543560, 6556969, 6569003, 6579194, 6587525, 6594482, 6600015, 6603662, 6605677, 6606789, 6606751, 6604570, 6600571, 6596948, 6595688, 6597072, 6600657, 6606310, 6613343, 6619875, 6624283, 6626658, 6627894, 6628048, 6626499, 6623078, 6617979, 6611090, 6602475, 6593185, 6584554, 6576939, 6570024, 6564133, 6560194, 6558308, 6557189, 6555307, 6552105, 6548052, 6543922, 6540060, 6535997, 6530796, 6523968, 6515745, 6506154, 6494301, 6479277, 6461542, 6442662, 6423610, 6403847, 6382065, 6357325, 6329507, 6299230, 6267445, 6234733, 6201007, 6166272, 6131476, 6097813, 6065074, 6031442, 5995484, 5957936, 5921111, 5886925, 5855963, 5828094, 5803040, 5780154, 5758434, 5737557, 5718678, 5703533, 5692714, 5685491, 5681561, 5682140, 5688571, 5700490, 5716531, 5736680, 5762608, 5795264, 5833412, 5875518, 5922234, 5975845]
61864E975845O1906P0160P8840Q9377J01565J13512J24255J35137J48228J64252
61854G063077J82690K03283K26643K53445K83599L16540L52163L91150M34277
61845I706867M81603N32531N86546O43398P02260P60983Q16503Q65667R04838
61836A6001196R28305R27594Q93210Q17687O97578N33997L33187J07457j25645
61827B1114566l47422n43074p03948q26355r09931r57385r74109r66252r39084
61818A3947006q97485q47054p93043p38133o82586o26976n73675n24971m80831
61809G782252m39686m00913l65402l33791l05301k78739k53885k31411k11780
61800D961344j94646j79173j64637j50783j37797j25978j15437j06080r7686q9815
$$ y = [5975845, 6037751, 6107911, 6186751, 6276128, 6377693, 6491205, 6615460, 6750597, 6898825, 7063077, 7245767, 7449050, 7675693, 7929138, 8212737, 8529277, 8881440, 9272590, 9706867, 10188470, 10721001, 11307547, 11950945, 12653205, 13414188, 14230691, 15096358, 16001196, 16929501, 17857095, 18750305, 19567992, 20265570, 20799567, 21132754, 21240211, 21114566, 20767144, 20224070, 19520122, 18693767, 17783836, 16826451, 15852342, 14886090, 13947006, 13049521, 12202467, 11409424, 10671291, 9988705, 9361729, 8788054, 8263083, 7782252, 7342566, 6941653, 6576251, 6242460, 5937159, 5658420, 5404535, 5173124, 4961344, 4766698, 4587525, 4422888, 4272105, 4134308, 4008330, 3892893, 3786813, 3689127, 3599312]
61790C599312q1934p4030o6861o0958n5577m9535m3202l8532l6560l5790l3967
61779C022366l0687k7169k4045k0836j7386j4329j1807r163o309m146k881j240
61767B852368J643M621O140O651P919J0296J2324J3198J4096J6470K0037K3398
61755B989161K6018K8735L2467L7188M2292M7535N3163N9252O5433P1497P7917
61744C530658Q5151R2799J00160J07619J16426J26913J37999J48947J60448J73131
61734D780251J86184J98690K11474K26210K43235K61760K81793L04335L29774
61725G023706L57665L88190M22351M60625N02826N49542O02274O61708P27230
61716A1696117P98600Q76655R61598J051965J146216J244108J345121J446090
$$ y = [3599312, 3517378, 3443348, 3376487, 3315529, 3259952, 3210417, 3167215, 3128683, 3092123, 3056333, 3022366, 2991679, 2964510, 2940465, 2919629, 2902243, 2887914, 2876107, 2866944, 2860635, 2856489, 2853608, 2852368, 2854011, 2858632, 2864772, 2871423, 2879342, 2889638, 2901962, 2915160, 2929256, 2945726, 2965763, 2989161, 3015179, 3043914, 3076381, 3113569, 3155861, 3203396, 3256559, 3315811, 3381244, 3452741, 3530658, 3615809, 3708608, 3808768, 3916387, 4032813, 4159726, 4297725, 4446672, 4607120, 4780251, 4966435, 5165125, 5376599, 5602809, 5846044, 6107804, 6389597, 6693932, 7023706, 7381371, 7769561, 8191912, 8652537, 9155363, 9704905, 10307179, 10968887, 11696117, 12494717, 13371372, 14332970, 15384935, 16531151, 17775259, 19120380, 20566470]
61708B0566470J541196J623578J685617J717578J706624J637751J497054J276697
61700C3252565R79107O17764K14919k01066n98793r49733j235479j450321j596882
61691B9032081j680638j708988j692558j643516j571761j484008j386223j284865
61683A6579524j185135j089405r98193r12030q31820p58055o90617o29347n74396
61674H910526n25688m82139m41881m03719l68189l36539l08767k83488k59757
61665E500359k37973k18670k01451j85695j71345j58313j46042j34426j24302
61656C922142j16148j09020j01667r3925q6216p8574p1282o5516o1994n9515n6299
61645C021986n2379m9310m7732m6591m4744m2116l9307l7132l6428l7290l8506
$$ y = [20566470, 22107666, 23731244, 25416861, 27134439, 28841063, 30478814, 31975868, 33252565, 34231672, 34849436, 35064355, 34863289, 34264496, 33314763, 32079284, 30628963, 29032081, 27351443, 25642455, 23949897, 22306381, 20734620, 19250612, 17864389, 16579524, 15394389, 14304984, 13306791, 12394761, 11562941, 10804886, 10114269, 9484922, 8910526, 8384838, 7902699, 7460818, 7057099, 6688910, 6352371, 6043604, 5760116, 5500359, 5262386, 5043716, 4842265, 4656570, 4485225, 4326912, 4180870, 4046444, 3922142, 3805994, 3696974, 3595307, 3501382, 3415166, 3336592, 3265310, 3199794, 3137800, 3078285, 3021986, 2969607, 2920297, 2872565, 2825974, 2781230, 2739114, 2699807, 2662675, 2626247, 2588957, 2550451]
61634B550451l8788l8457l8820m0080m1038m0827l9660l7830l5252l2288k9790
61623B137621k7996k6435k5210k5082k5823k5709k3517k0141j7443j6022j4957
61612A889286j3300j1135r234q041p184n997m686m437n959q294r972j0829j1585
61599A778633j1940j0644p704m967l865l911m071m437n350o014n328l550k000
61586A704852j379j371j574j852k081k417l531n604p292o932m771k840k339k394
61572A658475j833r52n10n6J361L283M129L510K857L321M220M459M426N331P007
61557A699028P769O542M134J986M72j018k719l879l613k156j057j866m414o828
61543A692381p610p183o828o636n632l766k501k986m632n886n767m376k673j936
$$ y = [2550451, 2511663, 2473206, 2434386, 2394306, 2353268, 2312441, 2272781, 2234951, 2199699, 2167411, 2137621, 2109625, 2083190, 2057980, 2032898, 2007075, 1981366, 1957849, 1937708, 1920265, 1904243, 1889286, 1875986, 1864851, 1855617, 1847576, 1840392, 1834395, 1829709, 1825272, 1819313, 1811019, 1801047, 1790218, 1778633, 1766693, 1756049, 1748345, 1743378, 1739513, 1735602, 1731531, 1727094, 1721744, 1715730, 1710402, 1706852, 1704852, 1703473, 1702102, 1700528, 1698676, 1696595, 1694178, 1690647, 1685043, 1677751, 1670819, 1666048, 1663208, 1660869, 1658475, 1656642, 1655690, 1655180, 1655124, 1656485, 1659768, 1663897, 1667407, 1670264, 1673585, 1677805, 1682264, 1686690, 1692021, 1699028, 1706797, 1713339, 1717473, 1719459, 1719931, 1718913, 1716194, 1712315, 1708702, 1706546, 1705489, 1703623, 1699209, 1692381, 1684771, 1677588, 1670760, 1664124, 1658492, 1654726, 1652225, 1649239, 1644607, 1638721, 1632954, 1628578, 1625905, 1623969]
61529A623969k603l397k498J48K764M243N440P431R784J1586J2983J4652J6579
61516A701081J8414K0367K2801K5652K9070L3722L9438M4502M7475M8952N0500
61505B081974N2613N4831N6825N8040N7222N4009N0308M8372M8035M7240M4788
61494B654257M1030L6577L2174K9216K8409K8215K6538K3507K0574J7417J2271
61483B950185N296j072n396q410j0617j1494j1835j3929j7965k0861k0364j8126
61471B815412j6673j5523j2646q209m071m45M299J0667J7180K2684K7780L3549
61459B874004M0184M7303N4711O2500P0905Q0206R0418J01337J13224J26922J42754
61448C804468J59862J77152J94385K11779K29274K46981K65626K85618L06033
$$ y = [1623969, 1621366, 1617969, 1615471, 1615619, 1618383, 1622626, 1628066, 1635497, 1645281, 1656867, 1669850, 1684502, 1701081, 1719495, 1739862, 1762663, 1788315, 1817385, 1851107, 1890545, 1935047, 1982522, 2031474, 2081974, 2134587, 2189418, 2246243, 2304283, 2361505, 2415514, 2465822, 2514194, 2562229, 2609469, 2654257, 2695287, 2731864, 2764038, 2793254, 2821663, 2849878, 2876416, 2899923, 2920497, 2937914, 2950185, 2955481, 2954409, 2949013, 2940603, 2929986, 2918492, 2906657, 2892728, 2874763, 2853902, 2833538, 2815412, 2798739, 2783216, 2770570, 2762361, 2758290, 2757845, 2762144, 2772811, 2789991, 2812675, 2840455, 2874004, 2914188, 2961491, 3016202, 3078702, 3149607, 3229813, 3320231, 3421568, 3534792, 3661714, 3804468, 3964330, 4141482, 4335867, 4547646, 4776920, 5023901, 5289527, 5575145, 5881178]
61439E881178L25181L41484L53114L57696L53410L39723L15970K80266K31592
61430H779614J72652J09045M5614j5128p1365j20909j62361j95825k21509k38712
61420H081116k47008k47576k42514k33400k21173k06792j90963j73572j54214
61411F163904j33420j12773r3752p6656o0612m4367k7312j0123N693J9267L1215
61400E661064M2634N3580O3210P1286P8433Q4543Q8153Q8440Q7093Q6593Q6913
61389F491942Q5538Q1251P6297P3697P3615P3696P2412P0478O9155O8539O7917
61378G304537O6781O4948O2237N8411N3247M6582L8621L0189K2291J5343Q936
61367G772123K154n914j5261k4301l0939l4999l8672m3547m8142m9708m7829m4515
$$ y = [5881178, 6206359, 6547843, 6900957, 7258653, 7612063, 7951786, 8267756, 8548022, 8779614, 8952266, 9061311, 9106925, 9091797, 9020432, 8899523, 8737162, 8541337, 8319828, 8081116, 7834108, 7586532, 7344018, 7110618, 6889445, 6682653, 6491690, 6318118, 6163904, 6030484, 5917711, 5823959, 5747303, 5686691, 5642324, 5615012, 5604889, 5610582, 5629849, 5661064, 5703698, 5757278, 5820488, 5891774, 5970207, 6054750, 6142903, 6231343, 6318436, 6405029, 6491942, 6577480, 6658731, 6735028, 6808725, 6882340, 6956036, 7028448, 7098926, 7168081, 7236620, 7304537, 7371318, 7436266, 7498503, 7556914, 7610161, 7656743, 7695364, 7725553, 7747844, 7763187, 7772123, 7774277, 7768363, 7753102, 7728801, 7697862, 7662863, 7624191, 7580644, 7532502, 7482794, 7434965, 7390450]
61355G390450m1080l6887l1449k5941k1837j9127j6636j3365r207n154k918l505
61343G163344o091r084j2020j5249j8165j9464j9131j8159j6127j1182l005O414
61331G022081J6133K8202M4671O4401Q4778J05372J27873J53139J80221K07891
61321H034762K35472K62347K88004L12565L36088L57296L73752L83107L83569
61312A0966962L73725L52830L20965K78298K24903J62314R4673K7078l7103r6678
61302A2667967j51114j99845k42836k80505l12785l38817l57692l69136l73811
61293A0041426l73326l69549l63311l54129l41586l26319l09084k89761k68219
61284G046142k45589k23534k02618j82327j62387j43083j24449j06081q7771o9798
$$ y = [7390450, 7349370, 7312483, 7281034, 7255093, 7233256, 7214129, 7197493, 7184128, 7174921, 7169767, 7166849, 7163344, 7157253, 7148169, 7136149, 7120900, 7102735, 7083271, 7064140, 7045981, 7029854, 7018672, 7015667, 7022081, 7038214, 7066416, 7111087, 7175488, 7260266, 7365638, 7493511, 7646650, 7826871, 8034762, 8270234, 8532581, 8820585, 9133150, 9469238, 9826534, 10200286, 10583393, 10966962, 11340687, 11693517, 12014482, 12292780, 12517683, 12679997, 12774670, 12801748, 12764645, 12667967, 12516853, 12317008, 12074172, 11793667, 11480882, 11142065, 10784373, 10415237, 10041426, 9668100, 9298551, 8935240, 8581111, 8239525, 7913206, 7604122, 7314361, 7046142, 6800553, 6577019, 6374401, 6192074, 6029687, 5886604, 5762155, 5656074, 5568303, 5498505]
61274E498505n2615l6690k2249q798M631J8204L0839M1494N0275N7625O3256O6847
61262E711324O9104P1022P2467P2526P0923O8137O4356N9352N3322M7153M1632
61251F401318L6857L2206K6783K0212J3143O414l15p977j6127k3055k8450l4145
61239F426864m1184m7939n2782n6972o2706o9418p4472p7023p8744q0850q2597
61228E702177q2953q1794p9099p4734o9511o4834o0717n5654m8979m2105l6778
61217E005019l3261l0844k9065k7706k6388k4969k3923k3869k4994k6892k8575
61206D704533k8830k7172k4323k1111j7252j1995n521J396Q730J7091K6466L6446
61194D658458M7479O0440P4877Q9069J02122J14727J27503J39856J50763J59494
$$ y = [5498505, 5445890, 5409200, 5386951, 5378153, 5382784, 5400988, 5431827, 5473321, 5523596, 5581221, 5644477, 5711324, 5780428, 5851450, 5923917, 5996443, 6067366, 6135503, 6199859, 6259211, 6312533, 6359686, 6401318, 6438175, 6470381, 6497164, 6517376, 6530519, 6536933, 6536618, 6528641, 6512514, 6489459, 6461009, 6426864, 6385680, 6337741, 6284959, 6227987, 6165281, 6095863, 6021391, 5944368, 5865624, 5784774, 5702177, 5619224, 5537430, 5458331, 5383597, 5314086, 5249252, 5188535, 5132881, 5083902, 5041797, 5005019, 4971758, 4940914, 4911849, 4884143, 4857755, 4832786, 4808863, 4784994, 4760000, 4733108, 4704533, 4675703, 4648531, 4624208, 4603097, 4585845, 4573850, 4568329, 4569725, 4578455, 4595546, 4622012, 4658458, 4705937, 4766377, 4841254, 4930323, 5032445, 5147172, 5274675, 5414531, 5565294, 5724788]
61184E724788J65026J65849J60914J49933J32421J07454P4905L6138o812n1757
61174F658859r5714j35023j67060j91406k08787k19501k23457k21267k14590k05326
61164D776728j94664j82878j70141j57416j45986j35750j24982j12687j00412
61155C451812r0417q2628p4992o6579n8590n2132m6657m1061l4987k8503k1727
61144B853539j5217r596m429J279P068J0932J1946J1716J2241J3393J3457J1426
61132B917755P856M025R84j037k818n368q669j1818j4515j7384k0579k3203k4767
61119B800462k6189k8490l1217l3006l3099l1817l0170k9568l0971l3561l5063
61108B457311l4278l2721l2783l4875l7350l8852l9574m0232m0871m1062m0671
$$ y = [5724788, 5889814, 6055663, 6216577, 6366510, 6498931, 6606385, 6681290, 6717428, 6710616, 6658859, 6563145, 6428122, 6261062, 6069656, 5860869, 5641368, 5417911, 5196644, 4982054, 4776728, 4582064, 4399186, 4229045, 4071629, 3925643, 3789893, 3664911, 3552224, 3451812, 3361395, 3278767, 3203775, 3137196, 3078606, 3026474, 2979817, 2938756, 2903769, 2875266, 2853539, 2838322, 2828726, 2824297, 2825576, 2832644, 2843576, 2855522, 2867238, 2879479, 2892872, 2906329, 2917755, 2925611, 2929636, 2930620, 2929583, 2926765, 2921397, 2912728, 2900910, 2886395, 2869011, 2848432, 2825229, 2800462, 2774273, 2745783, 2714566, 2681560, 2648461, 2616644, 2586474, 2556906, 2525935, 2492374, 2457311, 2423033, 2390312, 2357529, 2322654, 2285304, 2246452, 2206878, 2166646, 2125775, 2084713, 2044042]
61097B044042l9946l9039l7734l5784l3504l1936l2111l4069l6729l8727l9302
61086A645161l8554l7186l5937l5028l4157l2973l1180k8224k3721j8592j4793
61075A314816j3114j2063r965p248n353m214k538j33J971L669N994Q908J0831
61062A291561J1010J0655J0861J1068J0668J0666J2287J4756J6018J5246J3579
61051A428375J2593J2828J3764J4501J4354J3079J0742P715M869L239K800K120
61039A540979J15k326l550l545l695m365m407l336k320k397l078l412l391l691
61025A497581m750o544q466r352q648p564p912r742j1348j1598j0818r446p624
61012A383769o311o795q511r193p902o186n412m847l457j971j774k917m322m997
$$ y = [2044042, 2004096, 1965057, 1927323, 1891539, 1858035, 1826099, 1793988, 1759919, 1723190, 1684463, 1645161, 1606607, 1569421, 1533484, 1498456, 1464299, 1431326, 1400146, 1371922, 1348201, 1329609, 1314816, 1301702, 1289639, 1279674, 1272426, 1267073, 1262859, 1260321, 1260188, 1262159, 1265828, 1271822, 1280730, 1291561, 1302571, 1313226, 1324087, 1335155, 1345823, 1356489, 1368776, 1383532, 1399550, 1414796, 1428375, 1440968, 1453796, 1467560, 1482061, 1496415, 1509494, 1520236, 1527951, 1532820, 1536059, 1538859, 1540979, 1541094, 1538768, 1535218, 1531673, 1527978, 1523613, 1519206, 1515870, 1513550, 1511153, 1508075, 1504663, 1501272, 1497581, 1492831, 1486287, 1477821, 1468469, 1459821, 1452257, 1444345, 1434603, 1423255, 1411657, 1400839, 1391393, 1383769, 1377458, 1370663, 1362152, 1352959, 1345057, 1338871, 1333459, 1328612, 1325155, 1323184, 1321410, 1318493, 1314171, 1309174]
60998A309174m303k160L72J966K851M263N847N716L753K603M124O990R251J1094
60984A361541J3401J5417J6002J5818J6315J7584J8838J9952K1149K2295K3826
60973A562138K6948L1567L5571L7633L9107M1592M4445M6549M8671N1795N4836
60962B020852N6523N8176O1969O7468P2361P5854P9000Q2553Q6762R2501J00310
60951B854329J09071J17666J27021J38408J50874J62566J73495J84608J95483
60942D213521K05596K16646K30792K47785K66759K89433L18024L50996L84731
60933F724283M19065M57837N04825N62488O33531P19352Q18003R28155J053915
60924A2821454J200464J366782J549860J754924J992441K265597K572491K917309
$$ y = [1309174, 1304871, 1302711, 1303083, 1305049, 1307900, 1312163, 1318010, 1323726, 1327479, 1330082, 1334206, 1341196, 1350447, 1361541, 1374942, 1390359, 1406361, 1422179, 1438494, 1456078, 1474916, 1494868, 1516017, 1538312, 1562138, 1589086, 1620653, 1656224, 1693857, 1732964, 1774556, 1819001, 1865550, 1914221, 1966016, 2020852, 2077375, 2135551, 2197520, 2264988, 2337349, 2413203, 2492203, 2574756, 2661518, 2754019, 2854329, 2963400, 3081066, 3208087, 3346495, 3497369, 3659935, 3833430, 4018038, 4213521, 4419117, 4635763, 4866555, 5114340, 5381099, 5670532, 5988556, 6339552, 6724283, 7143348, 7601185, 8106010, 8668498, 9302029, 10021381, 10839384, 11767539, 12821454, 14021918, 15388700, 16938560, 18693484, 20685925, 22951522, 25524013, 28441322]
60916B8441322L288639L601420L680882L359578K628748J688062Q23146K26206
60908D7738003o8664j11963L6609K83439M46136L03893k48537j100218j994408
60899D5284290k701705l131041l309341l302653l169889k958767k706943k437692
60891B1566259k164314j900719j661369j452062j268610j105955r63575q41977
60883A0207678p39401o53441n81894n21117m67182m19523l80242l49136l22438
60874E773304k97106k73297k51897k32637k15693k02354j92652j84422j75973
60865C747273j67760j60549j53793j46890j40144j33484j25962j17601j10034
60856B491056j04026r7933r0051q1349p4364p0120o7431o4739o1488n7853n4027
$$ y = [28441322, 31729961, 35331381, 39012263, 42371841, 45000589, 46688651, 47511797, 47738003, 47669339, 47557376, 47593985, 47877424, 48323560, 48627453, 48378916, 47278698, 45284290, 42582585, 39451544, 36142203, 32839550, 29669661, 26710894, 24003951, 21566259, 19401945, 17501226, 15839857, 14387795, 13119185, 12013230, 11049655, 10207678, 9468277, 8814836, 8232942, 7711825, 7244643, 6825120, 6444878, 6095742, 5773304, 5476198, 5202901, 4951004, 4718367, 4502674, 4300320, 4107668, 3923246, 3747273, 3579513, 3418964, 3265171, 3118281, 2978137, 2844653, 2718691, 2601090, 2491056, 2387030, 2289097, 2199046, 2117697, 2043333, 1973213, 1905782, 1841043, 1779555, 1721702, 1667675]
60845A667675m9973m5698m1704l8818l7128l5517l3000l0115k7950k6281k4048
60834A277443k1490k0015j9853j9521j8066j6247j4800j3097j0427p361m876l178
60822A108512k147j872j814o66J876M123M337K952J790J700K103K331K370K589
60808A128184L581N717Q235R371Q356O578N723N539M671L103K060J722Q40j150
60794A192530l055l526k446l26K425M941N887N058M296N675R028J2132J3068J1758
60780A257445R387P234N968N519N327N000M739M887N228N142M359L247K458K492
60766A328432L519N230P010Q504R857J1047J1504J0930J0178J0395J1396J1859
60754A439861J1236J0440J0262J0144R247P890P005O689O249N326L949J821j332
$$ y = [1667675, 1617702, 1572004, 1530300, 1491482, 1454354, 1418837, 1385837, 1355722, 1327772, 1301491, 1277443, 1255953, 1235938, 1216085, 1196564, 1178498, 1162251, 1147451, 1134354, 1123927, 1116566, 1111690, 1108512, 1106365, 1104493, 1102679, 1102013, 1103889, 1108012, 1112349, 1115301, 1117091, 1118791, 1120894, 1123225, 1125595, 1128184, 1131765, 1137482, 1145717, 1155088, 1163444, 1170022, 1175745, 1181284, 1185955, 1189058, 1191118, 1192840, 1193680, 1192530, 1189475, 1185949, 1183503, 1183177, 1185602, 1190543, 1196430, 1201488, 1205784, 1211459, 1220487, 1232619, 1245687, 1257445, 1266832, 1274066, 1280034, 1285553, 1290880, 1295880, 1300619, 1305506, 1310734, 1315876, 1320235, 1323482, 1325940, 1328432, 1331951, 1337181, 1344191, 1352695, 1362552, 1373599, 1385103, 1396033, 1406211, 1416606, 1428002, 1439861, 1451097, 1461537, 1471799, 1481943, 1491190, 1499080, 1506085, 1512774, 1519023, 1524349, 1528298, 1530119, 1528787]
60741A528787m708o928p853q860j0823j2819j3621j3555j3889j4802j5155j4293
60729A391481j3040j2568j2955j3363j3078j1893r857p262m779k956j478N09L182
60716A291943N654P140P986R072J0592J2128J3596J5260J6876J7827J8263J9176
60704A445513K0814K1935K1267J9104J6681J4599J2722J1132J0107R365Q261O755
60692A618255N403M478L904M020N402P759R808J0562J0150R185Q035O916N984
60679A709861N001L500J618J02p62j638l022m220m113k730j494j840l814o094
60665A690355p349p591p951r085j0173j0051q856p775p412p237o658n688m497
60652A590032l258k605l286n009o485o998p086p319p458p286p364q153r222r935
$$ y = [1528787, 1524079, 1517151, 1509298, 1500438, 1489615, 1476796, 1463175, 1449620, 1435731, 1420929, 1405774, 1391481, 1378441, 1365873, 1352918, 1339555, 1326477, 1314584, 1304727, 1297465, 1292686, 1289730, 1288252, 1288761, 1291943, 1297597, 1304737, 1312723, 1321795, 1332387, 1344515, 1358111, 1373371, 1390247, 1408074, 1426337, 1445513, 1466327, 1488262, 1509529, 1528633, 1545314, 1559913, 1572635, 1583767, 1593874, 1603239, 1611500, 1618255, 1623658, 1628136, 1632040, 1636060, 1641462, 1649221, 1659029, 1669591, 1679741, 1688926, 1696961, 1703877, 1709861, 1714862, 1718362, 1719980, 1720082, 1719320, 1717682, 1714660, 1710440, 1706327, 1703597, 1702103, 1700263, 1696449, 1690355, 1683006, 1675415, 1667464, 1658379, 1648206, 1638155, 1629299, 1621524, 1614112, 1606875, 1600217, 1594529, 1590032, 1586774, 1584169, 1580883, 1575874, 1569389, 1562391, 1555305, 1547986, 1540528, 1533242, 1525878, 1517725, 1508503, 1498568]
60638A498568j0302j0480j0244r543q784p812n770k844j001j583l027k766p90
60625A423622N45J60l24O84K294K303k94m701r317j2585j3701j3326j3099j3814
60611A348447j4618j4518j3917j3834j4200j3979j2673j0692q360n670l192k134
60599A220660k889m245m735m272l760l494k874j651m78J00M02Q85J283J097M95
60584A196524rm83j415k752l790m007l480k510j454q09o99l85Q47K384K946K729
60568A183637L558O306R375J0745J0618J0828J2326J4502J6624J8616K0527K2294
60556A339956K4112K6156K7932K8860K9548L1283L4057L6114L6047L4373L2356
60545A680794K9995K6234K0744J4471Q345K323l909r789j4104j6433j7858j9860
$$ y = [1498568, 1488266, 1477786, 1467542, 1457999, 1449215, 1441403, 1435633, 1432789, 1431788, 1430205, 1427178, 1424412, 1423622, 1424167, 1424327, 1424003, 1424687, 1426981, 1429284, 1428990, 1424289, 1414972, 1402387, 1388686, 1375360, 1362261, 1348447, 1333829, 1319311, 1305394, 1291560, 1277360, 1263381, 1250708, 1240016, 1231656, 1225986, 1222794, 1220660, 1217771, 1213526, 1208791, 1204519, 1200759, 1197265, 1194391, 1192740, 1192262, 1192362, 1192764, 1193649, 1194932, 1196029, 1196524, 1196515, 1196032, 1194617, 1191865, 1188075, 1184068, 1180588, 1178078, 1176624, 1175815, 1175116, 1174731, 1175578, 1177962, 1180908, 1183637, 1187195, 1193501, 1202876, 1213621, 1224239, 1235067, 1247393, 1261895, 1278519, 1297135, 1317662, 1339956, 1364068, 1390224, 1418156, 1447016, 1476564, 1507847, 1541904, 1578018, 1614065, 1648438, 1680794, 1710789, 1737023, 1757767, 1772238, 1780583, 1782906, 1778997, 1769208, 1755104, 1738671, 1720813, 1700953]
60533A700953k2551k4381k3846k1279j8593j7373j7502j7627j6611j4407j1723
60522A495060r229p130n469m563m855o270p959q938q831p957o885o106n824n738
60508A399306n171l643j333J148L259M642N143N072N253O352Q237J0287J2187
60495A450739J4031J5866J7634J9497K1655K3855K5545K6717K8069L0122L2503
60484A706233L4464L5788L7015L8867M1695M5296M8980N1760N2565N0459M4929
60473B188051L6172K5091J2853M65j1252k1551k9874l5799l8741l8121l4352k9240
60461B023702k4387j9334j2351l380N019J0542J3981J7917K3063K7534K9935L1524
60449B123765L4414L8803M3305M7454N2348N8857O6654P5499Q6281R9908J15954
$$ y = [1700953, 1678402, 1654021, 1630175, 1608896, 1590303, 1572930, 1555428, 1537801, 1521190, 1506783, 1495060, 1485831, 1478701, 1473232, 1468669, 1463814, 1457544, 1449585, 1440647, 1431816, 1423859, 1416974, 1410868, 1405044, 1399306, 1394135, 1390492, 1389159, 1390307, 1393566, 1398208, 1403351, 1408423, 1413676, 1420028, 1428265, 1438552, 1450739, 1464770, 1480636, 1498270, 1517767, 1539422, 1563277, 1588822, 1615539, 1643608, 1673730, 1706233, 1740697, 1776485, 1813500, 1852367, 1894062, 1939358, 1988338, 2040098, 2092663, 2143122, 2188051, 2224223, 2249314, 2262167, 2262632, 2251380, 2229829, 2199955, 2164156, 2125415, 2087294, 2052942, 2023702, 1999315, 1979981, 1967630, 1964250, 1969269, 1979811, 1993792, 2011709, 2034772, 2062306, 2092241, 2123765, 2158179, 2196982, 2240287, 2287741, 2340089, 2398946, 2465600, 2541099, 2627380, 2727288, 2843242]
60438B843242J33424J52324J73431J96644K20651K44416K68158K92562L17752
60429D842604L43383L69092L94192M17128M35213M44095M37086M06326L46606
60420H435725K59006J50613L0718r2024k09237l11850l91887m45663m74563m82475
60410F468363m73357m51302m21347l88333l54970l21961k89965k60348k33848
60401C272932k09911j87973j68458j51645j36518j21885j08080r6351q6948p8891
60391A926272p1548o5162n9772n4773m9876m5573m2214l9400l6592l3747l1080
60380A396535k8810k7293k6684k6359k5378k3664k1917k0292j8206j5718j3902
60369A148312j3241j2753j1518j0050r196q558p184n302m073l861l927l790l765
$$ y = [2843242, 2976666, 3128990, 3302421, 3499065, 3719716, 3964132, 4232290, 4524852, 4842604, 5185987, 5555079, 5949271, 6366399, 6801612, 7245707, 7682793, 8089119, 8435725, 8694731, 8845344, 8876062, 8784038, 8574801, 8262951, 7871064, 7425401, 6950838, 6468363, 5995006, 5543704, 5122357, 4734024, 4379054, 4057093, 3767128, 3506780, 3272932, 3063021, 2875048, 2706590, 2554945, 2418427, 2296542, 2188462, 2092111, 2005163, 1926272, 1854724, 1789562, 1729790, 1675017, 1625141, 1579568, 1537354, 1497954, 1461362, 1427615, 1396535, 1367725, 1340432, 1313748, 1287389, 1262011, 1238347, 1216430, 1196138, 1177932, 1162214, 1148312, 1135071, 1122318, 1110800, 1100750, 1091554, 1082996, 1075812, 1070510, 1066437, 1062576, 1058649, 1054859, 1051094]
60356A051094l911l407j525J212L439M420M840N909P754R067Q686P185O236O468
60342A107467O938O861O757P230P626O920N466M719N401O695P335O889O026N888
60328A198218P081Q851R522Q081N192K371N23l14l66O5M57L46k87j140j880k111
60312A234609j617j008j465l190m688m351k349k43R41J498K138L063L854L815
60298A231007K740J716K583N910R958J2520J3273J3447J3732J3812J3616J3639
60286A347953J3797J3308J2133J1415J1843J2371J1383Q658N518L236J840N66
60274A454021q95j893j603p4J842L596N399P384Q934R355Q784P779O491M814K961
60259A516895J039j564n406r553j1958j1651r915q882r305j0112r881q352o312
$$ y = [1051094, 1047183, 1043776, 1042251, 1043463, 1046902, 1051322, 1056162, 1062071, 1069825, 1078892, 1087578, 1094763, 1100999, 1107467, 1114405, 1121266, 1128023, 1135253, 1142879, 1149799, 1155265, 1159984, 1165385, 1172080, 1179415, 1186304, 1192330, 1198218, 1205299, 1214150, 1223672, 1231753, 1236945, 1239316, 1239839, 1239525, 1239159, 1239224, 1239681, 1240027, 1239740, 1238600, 1236720, 1234609, 1232992, 1231984, 1230519, 1227329, 1222641, 1218290, 1215941, 1215698, 1216639, 1218137, 1220275, 1223338, 1227192, 1231007, 1233747, 1235463, 1238046, 1243956, 1253914, 1266434, 1279707, 1293154, 1306886, 1320698, 1334314, 1347953, 1361750, 1375058, 1387191, 1398606, 1410449, 1422820, 1434203, 1442861, 1448379, 1451615, 1453455, 1454021, 1453126, 1451233, 1449630, 1449556, 1451398, 1454994, 1460393, 1467777, 1476711, 1486066, 1494850, 1502629, 1509120, 1513934, 1516895, 1517934, 1516370, 1510964, 1501411, 1489453, 1477802, 1467887, 1459005, 1449700, 1439588, 1429707, 1421355, 1415043]
60246A415043m357k350k88J069J230J104J885K962K532N14q03J65K203L372L658
60231A427939L969L883K436L85l59O77K340M025O210Q759J0532J1056J1123J1355
60217A504330J1475J1401J1691J2430J2876J2759J2908J3992J5460J6252J6099
60206A651673J5793J6610J9361K3486K7318K9961L2375L5801L9784M3131M6176
60195A981469N0207N4925N8552O0811O3826O9391P6944Q4994R3083J01581J10726
60184B806509J20607J30982J40808J49175J57004J66143J76340J84887J90011
60175D222466J92716J94226J93547J89090J81041J70385J57022J40664J22638
60166E763795J04673Q6554O6787M5369K4276N412j0632k3946l4639m2685m7555
$$ y = [1415043, 1410686, 1408336, 1408048, 1409117, 1410347, 1411451, 1413336, 1416298, 1418830, 1419344, 1418541, 1418706, 1420909, 1424281, 1427939, 1431908, 1435791, 1438227, 1438612, 1438253, 1438930, 1441270, 1445295, 1451505, 1460264, 1470796, 1481852, 1492975, 1504330, 1515805, 1527206, 1538897, 1551327, 1564203, 1576962, 1589870, 1603862, 1619322, 1635574, 1651673, 1667466, 1684076, 1703437, 1726923, 1754241, 1784202, 1816577, 1852378, 1892162, 1935293, 1981469, 2031676, 2086601, 2145153, 2205964, 2269790, 2339181, 2416125, 2501119, 2594202, 2695783, 2806509, 2927116, 3058098, 3198906, 3348081, 3505085, 3671228, 3847568, 4032455, 4222466, 4415182, 4609408, 4802955, 4992045, 5173086, 5343471, 5500493, 5641157, 5763795, 5868468, 5955022, 6021809, 6067178, 6091454, 6096866, 6086234, 6062288, 6027649, 5984964, 5937409]
60155E937409m8369m5191l9446l2128k2550j0126L721J7265L1246M7722O6422
60144E905975Q4573J00555J15547J30895J45824J58671J68760J75891J79387J78753
60134G344831J74255J65752J52111J33007J10350Q6477O1736L5374Q220j7588
60124H254525m1421o4533q6971j06047j19188j26942j31387j32543j28334j17942
60114G199217j03319q6933o9507n0566k9888p663J5592L8380N8619P5709R1237
60103G130878J06366J19328J27000J28297J24659J17665J07851R5520Q1037O4368
60093H202969M5980K8177J3772L194n280j2137j5301j2831n075O730K2233M1157
60081H313588O2249Q4429J07946J33298J60119J88246K18594K51680K86268L20860
$$ y = [5937409, 5889040, 5843849, 5804403, 5772275, 5749725, 5739599, 5743320, 5760585, 5791831, 5839553, 5905975, 5990548, 6091103, 6206650, 6337545, 6483369, 6642040, 6810800, 6986691, 7166078, 7344831, 7519086, 7684838, 7836949, 7969956, 8080306, 8166783, 8228519, 8263893, 8272113, 8254525, 8213104, 8148571, 8061600, 7955553, 7836365, 7709423, 7578036, 7445493, 7317159, 7199217, 7095898, 7008965, 6939458, 6888892, 6859004, 6851341, 6866933, 6905313, 6963932, 7039641, 7130878, 7237244, 7356572, 7483572, 7611869, 7736528, 7854193, 7962044, 8057564, 8138601, 8202969, 8248949, 8277126, 8290898, 8294092, 8288812, 8276675, 8261374, 8248543, 8243468, 8250198, 8272431, 8313588, 8375837, 8460266, 8568212, 8701510, 8861629, 9049875, 9268469, 9520149, 9806417, 10127277]
60071A0127277L55467L90530M25208M58317M89991N20500N47964N69066N81854
60062A4466174N86354N82773N70766N50100N20379M80393M29594L70174L05770
60053A8862477K37806J64944Q6574M928p6920j57278k34726l06225l68040m18059
60043A7795481m55994m81742m94802m95235m84288m63629m34496l97808l54906
60034A3732581l07880k59052k10084j61703j14322o8715k5851J3423M8104P6800
60024A2723301R8385J12693J19803J18958J09129R0819O6483L8868R549k0792
60014A3467196n1479q1827j11443j39963j66670j90864k12357k31263k47297k59726
60004A1774307k68109k72798k74387k72695k66652k55527k40032k21755k01571
$$ y = [10127277, 10482744, 10873274, 11298482, 11756799, 12246790, 12767290, 13315254, 13884320, 14466174, 15052528, 15635301, 16206067, 16756167, 17276546, 17756939, 18186533, 18556707, 18862477, 19100283, 19265227, 19351801, 19356729, 19279809, 19122531, 18887805, 18581580, 18213540, 17795481, 17339487, 16857745, 16362943, 15867708, 15383420, 14919791, 14485295, 14087487, 13732581, 13424701, 13165649, 12955565, 12793862, 12679540, 12610825, 12584974, 12598397, 12646501, 12723301, 12821686, 12934379, 13054182, 13173140, 13282269, 13373088, 13439571, 13478439, 13487988, 13467196, 13415717, 13333890, 13222447, 13082484, 12915814, 12724950, 12512593, 12281330, 12034033, 11774307, 11506198, 11233400, 10959013, 10686318, 10419666, 10164139, 9924107, 9702352, 9500781]
59995I500781j79211j54404j27665r9668p0626m0921j1616J6361M3158O9317R4557
59984I040063J17957J38913J56973J70873J78755J79577J73717J62107J45385
59975A0464320J23903R8003O8189L5386J015l3568o7620j00527j31208j58460
59965A0299433j81648k00291k13284k19454k18864k12879k02851j89387j72824
59956H487951j53557j31835j07881q2313n5875k8831j215K6436N3497Q0305J07878
59945H194560J36357J64506J90839K14410K34512K50551K62465K70182K72389
59936A0190771K66965K53069K31793K04391J71238J33292R3003N2312J0829l2246
59926A1575417p5067j13987j47246j75754j99730k16652k23799k21594k12915
$$ y = [9500781, 9321570, 9167166, 9039501, 8939833, 8869207, 8828286, 8816670, 8833031, 8876189, 8945506, 9040063, 9158020, 9296933, 9453906, 9624779, 9803534, 9983111, 10156828, 10318935, 10464320, 10588223, 10686226, 10754415, 10789801, 10790816, 10757248, 10689628, 10589101, 10457893, 10299433, 10117785, 9917494, 9704210, 9484756, 9265892, 9053013, 8850162, 8660775, 8487951, 8334394, 8202559, 8094678, 8012365, 7956490, 7927659, 7926444, 7952880, 8006377, 8086682, 8194560, 8330917, 8495423, 8686262, 8900672, 9135184, 9385735, 9648200, 9918382, 10190771, 10457736, 10710805, 10942598, 11146989, 11318227, 11451519, 11544522, 11596834, 11607663, 11575417, 11500350, 11386363, 11239117, 11063363, 10863633, 10646981, 10423182, 10201588, 9988673]
59917I988673j99877j82720j61459j36984j10223q1483n1199k0506R547L8633
59907I092402O6401R1733J13582J32228J48779J63437J74894J81425J82233J77901
59897A0525015J70222J61344J52228J41835J28671J13215R8037Q5388P5573O7995
59887A1719523O2723O0427O1777O7750P9744R8421J22877J51831J85067K22743
59877A2832883K63913L07035L51683L98334M46199M92390N33696N68278N95035
59868A6789446O11996O15940O03339N71341N18406M44656L51780K42793J22207
59859B0871904l596j27041k41407l42504m28344m97446n47969n78692n90454n86220
59849A6928231n69630n43657n10453m71614m27975l79785l27984k75019k23219
$$ y = [9988673, 9788796, 9606076, 9444617, 9307633, 9197410, 9115927, 9064728, 9044222, 9053769, 9092402, 9158803, 9250536, 9364118, 9496346, 9645125, 9808562, 9983456, 10164881, 10347114, 10525015, 10695237, 10856581, 11008809, 11150644, 11279315, 11392530, 11490567, 11575955, 11651528, 11719523, 11782246, 11842673, 11904450, 11972200, 12051944, 12150365, 12273242, 12425073, 12610140, 12832883, 13096796, 13403831, 13755514, 14153848, 14600047, 15092437, 15626133, 16194411, 16789446, 17401442, 18017382, 18620721, 19192062, 19710468, 20155124, 20506904, 20749697, 20871904, 20868308, 20741267, 20499860, 20157356, 19729012, 19231566, 18683597, 18104905, 17514451, 16928231, 16358601, 15814944, 15304491, 14832877, 14404902, 14025117, 13697133, 13422114, 13198895]
59840A3198895j72485j21060o8984j9233K5542O6140J05121J42705J75797K00875
59830A3533313K16386K22288K18414K03734J76647J35958Q2449J9587m8082j17341
59820A4643353j86602k53913l15726l68099m08724m37654m56394m66335m67799
59811A1282107m60576m45592m25407m02443l77248l49363l19548k90005k62434
59802G949491k37026k13347j91188j70274j50187j31133j14134j00195q9829q3303
59792F468875q0372p9487p8293p5567p1961o8555o5371o1675n6926n0942m4007
59781E735719l7469l3466l3162l5657l9290m3648m9403n6476o3268o7807o9218
59770E206855o7884o4599n9687n2895m4170l4507k5695j9031j4431j0764o658
$$ y = [13198895, 13026410, 12905350, 12836366, 12817133, 12842675, 12908815, 13013936, 13156641, 13332438, 13533313, 13749699, 13971987, 14190401, 14394135, 14570782, 14706740, 14789189, 14808776, 14760694, 14643353, 14456751, 14202838, 13887112, 13519013, 13110289, 12672635, 12216241, 11749906, 11282107, 10821531, 10375939, 9950532, 9548089, 9170841, 8821478, 8501930, 8211925, 7949491, 7712465, 7499118, 7307930, 7137656, 6987469, 6856336, 6742202, 6642007, 6552178, 6468875, 6388503, 6309016, 6230723, 6155156, 6083195, 6014640, 5949269, 5887594, 5830668, 5779726, 5735719, 5698250, 5664784, 5631622, 5595965, 5556675, 5513027, 5463624, 5407148, 5343880, 5276073, 5206855, 5138971, 5074372, 5014685, 4961790, 4917620, 4883113, 4857418, 4838387, 4823956, 4813192, 4806534]
59759D806534r48O858J6169K5807L5287M5006N4673O2525O7216P0056P3932P9899
59747E343014Q6102R0415R2726R3685R2573Q8041Q0505P2015O3722N5159M6393
59736F204350L9194L4931L2818L1736L2800L8166M7754N9046P0318Q2456R7390
59725F770959J16281J39534J66834J96417K25945K55166K86477L21850L60439
59716H839902M00158M40031M79330N15537N44879N63756N67355N47609M95644
59707A3394201M08033K90334J54913J6464j11272k17893k98235l52210l82333
59698A2902002l91614l83390l61691l30641k93734k53895k13625j74615j37490
59689A0361307j02086o7784l3793K97L4106O6875R8297J28640J58491J88764K20446
$$ y = [4806534, 4805586, 4812444, 4828613, 4854420, 4889707, 4934713, 4989386, 5051911, 5119127, 5189183, 5263115, 5343014, 5429116, 5519531, 5612257, 5705942, 5798515, 5886556, 5967061, 6039076, 6102798, 6157957, 6204350, 6243544, 6278475, 6311293, 6343029, 6375829, 6413995, 6461749, 6520795, 6591113, 6673569, 6770959, 6887240, 7026774, 7193608, 7390025, 7615970, 7871136, 8157613, 8479463, 8839902, 9240060, 9680091, 10159421, 10674958, 11219837, 11783593, 12350948, 12898557, 13394201, 13802234, 14092568, 14247481, 14263945, 14152673, 13934780, 13636545, 13284335, 12902002, 12510388, 12126998, 11765307, 11434666, 11140932, 10887037, 10673412, 10498797, 10361307, 10259221, 10191437, 10157644, 10157941, 10192047, 10258922, 10357219, 10485859, 10644350, 10833114, 11053560]
59678A1053560K53707K87678L21883L57301L95117M35011M75939N18202N63324
59669A4661722O11909O62956P15494P69634Q25710Q83296R41296R97963J050649
59660B2120629J096397J133038J159033J172471J171379J155279J125748J085839
59652C1219813J040101R94722R55702R26225R06798Q97864R00418R13492R32572
59643C9687707R51357R63965R65022R49454R13653Q56062P76011O73388N50839
59634D7287458M15337K75983J40480J4470r6694j87378k53124k91851l03652k90070
59624D6710959k53508j96645j22022l2089P0768J84498L07307M37024N70879P06087
59614D8383258Q40103R69925J091312J198693J285305J343254J364057J339443
$$ y = [11053560, 11307267, 11594945, 11916828, 12274129, 12669246, 13104257, 13580196, 14098398, 14661722, 15273631, 15936587, 16652081, 17421715, 18247425, 19130721, 20072017, 21069980, 22120629, 23217026, 24350064, 25509097, 26681568, 27852947, 29008226, 30133974, 31219813, 32259914, 33254636, 34210338, 35136563, 36043361, 36941225, 37841643, 38755135, 39687707, 40639064, 41603029, 42568051, 43517505, 44431158, 45287220, 46063231, 46736619, 47287458, 47702795, 47978778, 48119258, 48133728, 48037034, 47849656, 47596532, 47304681, 47001029, 46710959, 46457451, 46260806, 46138784, 46106695, 46177463, 46361961, 46669268, 47106292, 47677171, 48383258, 49223361, 50193286, 51284598, 52483291, 53768596, 55111850, 56475907, 57815350]
59606E7815350J261613J123715R22090O59630L47092J190l58400p11159j037574
59597F0023547j321276j550644j719251j826157j875878j876758j838154j769150
59589D6246279j679430j579903j481638j394954j329624j294117j292288j320160
59581C4874165j366272j415581j454169j472729j467902j441109j395908j336203
59573B3524292j265995j189307j109310j028110r47684q70476p98466p32048o70357
59564A4912539o12458n58096n07686m61833m20573l83062l48309l15972k86001
59555A1018549k57996k31877k08854j90468j76751j66418j58830j54428j53166
59546I319761j53985j56166j59882j64934j70219j74813j78396j80241j79228
$$ y = [57815350, 59076963, 60200678, 61122768, 61782398, 62129490, 62130680, 61772280, 61061121, 60023547, 58702271, 57151627, 55432376, 53606219, 51730341, 49853583, 48015429, 46246279, 44566849, 42986946, 41505308, 40110354, 38780730, 37486613, 36194325, 34874165, 33507893, 32092312, 30638143, 29165414, 27697512, 26256403, 24860495, 23524292, 22258297, 21068990, 19959680, 18931570, 17983886, 17113410, 16314944, 15582896, 14912539, 14300081, 13741985, 13234299, 12772466, 12351893, 11968831, 11620522, 11304550, 11018549, 10760553, 10528676, 10319822, 10129354, 9952603, 9786185, 9627355, 9472927, 9319761, 9165776, 9009610, 8849728, 8684794, 8514575, 8339762, 8161366, 7981125, 7801897]
59537G801897j75403j70117j63931j55784j45003j32879j21275j10687j00411
59528F526407q9592p7478o3758m9439l6365k5329j5583o481J852R760J8171K6753
59516F218918L3809L8880M3584M8817N3271N6244N9750O5724P2894P8799Q3662
59505F854352Q9815R8208J08031J19232J32829J48706J65213J81351J97766K15407
59495H310910K34547K55230K77455L00732L24376L48049L71341L93360M13660
59486A1229660M32774M50648M65288M74345M77277M74569M65771M50335M29765
59477A5350432M06535L80663L49447L11207K67967K24016J83200J47694J17872
59468A7739033R2531P0281N1462L8147L2093L3387M1316N5720P6765J03468J32574
$$ y = [7801897, 7626494, 7456377, 7292446, 7136662, 6991659, 6858780, 6737505, 6626818, 6526407, 6436815, 6359337, 6295579, 6246140, 6209775, 6184446, 6168863, 6162382, 6164234, 6173994, 6192165, 6218918, 6252727, 6291607, 6335191, 6384008, 6437279, 6493523, 6553273, 6618997, 6691891, 6770690, 6854352, 6944167, 7042375, 7150406, 7269638, 7402467, 7551173, 7716386, 7897737, 8095503, 8310910, 8545457, 8800687, 9078142, 9378874, 9703250, 10051299, 10422640, 10816000, 11229660, 11662434, 12113082, 12578370, 13052715, 13529992, 14004561, 14470332, 14920667, 15350432, 15756967, 16137630, 16487077, 16798284, 17066251, 17290267, 17473467, 17621161, 17739033, 17831564, 17901845, 17953307, 17991454, 18023547, 18056934, 18098250, 18153970, 18230735, 18334203, 18466777]
59457A8466777J59133J78669J89002J89445J78330J52686J10983N4931j2346q8630
59447A9578980j71867k58207l42538m20546m89282n46551n91102o22696o40755
59438A5495436o43977o32575o09826n79773n44527n05441m65266m26338l87675
59429A0700038l46935l05012k65599k30235j96755j63198j30232r8866o8523l8666
59419H856017r972J7591M5738P5420J05215J33650J61497J90042K18511K45053
59409A0038762K69250K91790L12304L29209L41343L48101L48038L38654L17967
59400A2935418K85575K42258J89109J27342N8670j4256q7925j58964k25097k84777
59390A3067353l36084l76946m06681m26445m37816m41573m38254m29055m15426
$$ y = [18466777, 18625910, 18804579, 18993581, 19183026, 19361356, 19514042, 19625025, 19679956, 19667610, 19578980, 19407113, 19148906, 18806368, 18385822, 17896540, 17349989, 16758887, 16136191, 15495436, 14851459, 14218884, 13609058, 13029285, 12484758, 11979317, 11514051, 11087713, 10700038, 10353103, 10048091, 9782492, 9552257, 9355502, 9192304, 9062072, 8963206, 8894683, 8856017, 8846045, 8863636, 8909374, 8984794, 9090009, 9223659, 9385156, 9575198, 9793709, 10038762, 10308012, 10599802, 10912106, 11241315, 11582658, 11930759, 12278797, 12617451, 12935418, 13220993, 13463251, 13652360, 13779702, 13838372, 13824116, 13736191, 13577227, 13352130, 13067353, 12731269, 12354323, 11947642, 11521197, 11083381, 10641808, 10203554, 9774499, 9359073]
59381I359073l98283l78161l55890l32681l09639k87334k65674k44119k22472
59372F564820k01401j81924j64358j48146j32550j17081j01525q6232p2183o0042
59362E299378m9211l8531k7817j7820q738J82R238J7534K4342L0723L8804M9022
59350E327106N8393O2304N8831N1242M5390M4643M8118N3766O1288P1404Q4149
59339E966634R9323J16919J35163J49620J56987J59473J63174J72296J86913K05913
59329G512415K29236K56611K86602L18166L51750L88024M26883M68313N12787
59320A0750787N60112O09162O59347P10991P63407Q13727Q58172Q93635R17694
59311A7537034R28529R25399R08286Q76830Q31111P73869P10252O44404N77525
$$ y = [9359073, 8960790, 8582629, 8226739, 7894058, 7584419, 7297085, 7031411, 6787292, 6564820, 6363419, 6181495, 6017137, 5868991, 5736441, 5619360, 5517835, 5431603, 5359420, 5299378, 5250167, 5211636, 5183819, 5165999, 5157261, 5157443, 5166681, 5184215, 5208557, 5239280, 5278084, 5327106, 5385499, 5447803, 5506634, 5557876, 5603266, 5647909, 5696027, 5749793, 5811081, 5882485, 5966634, 6065957, 6182876, 6318039, 6467659, 6624646, 6784119, 6947293, 7119589, 7306502, 7512415, 7741651, 7998262, 8284864, 8603030, 8954780, 9342804, 9769687, 10238000, 10750787, 11310899, 11920061, 12579408, 13290399, 14053806, 14867533, 15725705, 16619340, 17537034, 18465563, 19390962, 20299248, 21176078, 22007189, 22781058, 23491310, 24135714, 24713239]
59302B4713239N09873M43046L79062L18358K59933K02435J44030Q2231J5352n6159
59292B7011400j30707k07238k84965l61823m34401m99463n55312o02034o40989
59283B3294468o73797p01378p24018p42242p56865p67931p74118p73609p65365
59274A6615145p49754p28485p03678o76234o45262o09975n71739n33148m95394
59265A0901476m58015m21034l85614l52232l20017k88606k59124k32461k07949
59256G976424j84657j62859j43197j25342j08480r2445p7361o2773m7909l2517
59246F938884j6950j768J2501K5719L8429N1273O4149P6645Q9043J01926J14932
59235G494783J27177J38769J50625J62761J74279J85064J95747K05713K13008
$$ y = [24713239, 25223112, 25666158, 26045220, 26363578, 26623511, 26825946, 26969976, 27052207, 27067559, 27011400, 26880693, 26673455, 26388490, 26026667, 25592266, 25092803, 24537491, 23935457, 23294468, 22620671, 21919293, 21195275, 20453033, 19696168, 18928237, 18154119, 17380510, 16615145, 15865391, 15136906, 14433228, 13756994, 13111732, 12501757, 11930018, 11396870, 10901476, 10443461, 10022427, 9636813, 9284581, 8964564, 8675958, 8416834, 8184373, 7976424, 7791767, 7628908, 7485711, 7360369, 7251889, 7159444, 7082083, 7019310, 6971401, 6938884, 6921934, 6920166, 6932667, 6958386, 6996815, 7048088, 7112237, 7188882, 7277925, 7379851, 7494783, 7621960, 7760729, 7911354, 8074115, 8248394, 8433458, 8629205, 8834918, 9047926]
59226I047926K16919K18884K20115K20038K17971K14795K11684K08481K04377
59217A0981190J99173J93071J86270J79266J72082J62487J46706J23190R4376
59208A2437811O3688L2259l38l3756o6927r9321j30506j59223j84038k04109k18492
59197A1437048k25959k26618k22392k14580k02300j84803j63917j42467j21262
59188I732750r9374p6362n2460k7568j991K2490M4249O3985Q3516J03032J21379
59177I913646J38432J55086J71209J85741J98716K11291K23699K35178K46232
59168A1679230K59000K74795K92870L12272L33445L57181L83010M09218M33559
59159A4734580M53480M66389M70040M61985M38882L97742L38233K62700J73600
$$ y = [9047926, 9264845, 9483729, 9703844, 9923882, 10141853, 10356648, 10568332, 10776813, 10981190, 11180363, 11373434, 11559704, 11738970, 11911052, 12073539, 12220245, 12343435, 12437811, 12501499, 12533758, 12533420, 12499664, 12432737, 12333416, 12202910, 12043687, 11859649, 11655540, 11437048, 11211089, 10984471, 10762079, 10547499, 10345199, 10160396, 9996479, 9854012, 9732750, 9633376, 9557014, 9504554, 9476986, 9474995, 9497485, 9541734, 9605719, 9689235, 9792267, 9913646, 10052078, 10207164, 10378373, 10564114, 10762830, 10974121, 11197820, 11432998, 11679230, 11938230, 12213025, 12505895, 12818167, 13151612, 13508793, 13891803, 14301021, 14734580, 15188060, 15654449, 16124489, 16586474, 17025356, 17423098, 17761331, 18024031, 18197631]
59150A8197631P2333l8841j55063k70266l79375m78187n62219o27603o73319p01236
59140A4383855p13596p11451o95934o70013o37764o02203n64609n25756m86772
59131H775757m48593m11655l76695l44949l16719k90557k65021k40892k20230
59122E860446k03360j88173j72829j57917j45092j34453j24307j13332j02197
59113D518786r2715q5570p9260p1685o2710n4289m7704m1752l4651k6689j9513
59102C902248j3426p225n20N748J1279J7134K3959L1054L7800M4550N1455N7788
59090D161844O3365O9361P6758Q4777R1780R7089J01428J06126J12225J19763
59080E084516J27641J34791J41317J47750J53604J58003J61354J64859J68486
$$ y = [18197631, 18269964, 18231123, 18076060, 17805794, 17426419, 16948232, 16386013, 15758410, 15085091, 14383855, 13670259, 12958808, 12262874, 11592861, 10955097, 10352894, 9788285, 9262529, 8775757, 8327164, 7915509, 7538814, 7193865, 6877146, 6586589, 6321568, 6080676, 5860446, 5657086, 5468913, 5296084, 5138167, 4993075, 4858622, 4734315, 4620983, 4518786, 4426071, 4340501, 4261241, 4189556, 4126846, 4072557, 4024853, 3983101, 3948450, 3921761, 3902248, 3888822, 3881597, 3881077, 3886825, 3898104, 3915238, 3939197, 3970251, 4008051, 4052601, 4104056, 4161844, 4225209, 4294570, 4371328, 4456105, 4547885, 4644974, 4746402, 4852528, 4964753, 5084516, 5212157, 5346948, 5488265, 5636015, 5789619, 5947622, 6108976, 6273835, 6442321]
59071F442321J71122J72556J73381J72883J69292J62543J54638J46700J37864
59062G903300J27881J18575J11525J06267J01917R8933R8213J00012J04652J12551
59052H983826J22883J34049J46107J60508J76867J92633K06919K21500K36341
59043A0581633K47304K50563K46582K37026K20151J92523J53737J06601N3834
59034A2289954k611n9976j14926j64819k07098k38834k59007k69925k74444k73002
59024A0425312k65304k53041k38512k22222k04495j87882j74976j65035j55780
59015H558065j47607j43025j42800j45688j51241j59784j69920j79026j86069
59006G132905j91614j95499j97192j97829j99016j99804j97631j92069j85043
$$ y = [6442321, 6613443, 6785999, 6959380, 7132263, 7301555, 7464098, 7618736, 7765436, 7903300, 8031181, 8149756, 8261281, 8367548, 8469465, 8568398, 8666611, 8766623, 8871275, 8983826, 9106709, 9240758, 9386865, 9547373, 9724240, 9916873, 10123792, 10345292, 10581633, 10828937, 11079500, 11326082, 11563108, 11783259, 11975782, 12129519, 12236120, 12289954, 12287343, 12227367, 12112441, 11947622, 11740524, 11501690, 11242683, 10972758, 10698314, 10425312, 10160008, 9906967, 9668455, 9446233, 9241738, 9053856, 8878880, 8713845, 8558065, 8410458, 8267433, 8124633, 7978945, 7827704, 7667920, 7498000, 7318974, 7132905, 6941291, 6745792, 6548600, 6350771, 6151755, 5951951, 5754320, 5562251, 5377208]
58997E377208j77647j69514j61163j53944j47542j40228j31853j24010j17129
58988D054178j10093j02884r6948r2604q8699q5126q3090q2359q0792p7230p2652
58977C081701o8004o3175n8449n4606n1090m6422m0801l6012l2355k8160k2815
58966B579812j7707j3543r451n615m063n443p318p198n524m377m851o600q414
58953B479708q489n853k193m07p92o91J370L667M471M863O643R313J1032J1218
58939B513860J0650R999R581R664R936R487Q146O877O392O609P901J1205J5974
58926B636281J9629K0400J9503J9310K0308K1125K0862K0212K0481K2211K4655
58915B864977K6510K7463K8664L1059L3858L5836L7522M0490M4756M8795N1980
$$ y = [5377208, 5199561, 5030047, 4868884, 4714940, 4567398, 4427170, 4295317, 4171307, 4054178, 3944085, 3841201, 3744253, 3651649, 3562950, 3477824, 3394734, 3312375, 3231583, 3154353, 3081701, 3013697, 2950522, 2892073, 2837467, 2786377, 2739955, 2699154, 2663142, 2630787, 2602627, 2579812, 2562105, 2548562, 2539111, 2533496, 2529433, 2523990, 2516672, 2509474, 2503950, 2499573, 2494722, 2488122, 2479708, 2471219, 2465366, 2463173, 2462766, 2461974, 2461283, 2462653, 2466320, 2470791, 2475654, 2482297, 2491610, 2502642, 2513860, 2524510, 2534509, 2544090, 2553754, 2563690, 2573177, 2581323, 2588200, 2594592, 2601201, 2609102, 2620307, 2636281, 2655910, 2676310, 2695813, 2715123, 2735431, 2756556, 2777418, 2797630, 2818111, 2840322, 2864977, 2891487, 2918950, 2947614, 2978673, 3012531, 3048367, 3085889, 3126379, 3171135, 3219930, 3271910]
58904C271910N5060N8193O0578O2405O4959O8245P0609P1534P2767P5657P9214
58893D011131Q2050Q4673Q8382R3077R7564J01331J05176J10435J18043J27623
58883E019485J37388J45865J53754J63115J74768J87781K01244K15114K29373
58874F627887K44050K60124K78616K98756L18903L39386L62500L89377M18939
58865I538538M50271M83875N20015N57968N97738O40615O87105P36064P86558
58856A4998747Q38831Q92566R45967R97374J046123J090905J128678J155874J169199
58847B4264264J164659J137469J083802J001624Q89852P48596N80753L92029J89263
58838C1452311j9852k26162m20877n98255p54471q84525r83717j052491j096217
$$ y = [3271910, 3326970, 3385163, 3445741, 3508146, 3573105, 3641350, 3711959, 3783493, 3856260, 3931917, 4011131, 4093181, 4177854, 4266236, 4359313, 4456877, 4558208, 4663384, 4773819, 4891862, 5019485, 5156873, 5302738, 5456492, 5619607, 5794375, 5982156, 6183400, 6398514, 6627887, 6871937, 7132061, 7410677, 7709433, 8028336, 8367722, 8730222, 9119599, 9538538, 9988809, 10472684, 10992699, 11550667, 12148405, 12789020, 13476125, 14212189, 14998747, 15837578, 16730144, 17676111, 18673485, 19719608, 20810513, 21939191, 23095065, 24264264, 25428923, 26566392, 27650194, 28651818, 29541670, 30290266, 30871019, 31263048, 31452311, 31432459, 31206297, 30785420, 30187165, 29432694, 28548169, 27564452, 26511961, 25415744]
58829B5415744j119139j121794j105320j074512j034597r87958r36076q81806
58821A7154542q27509p73434p20083o69730o23561n79843n37371m98369m65333
58812A1459309m37060m10514l84814l60833l38441l16811k96095k76427k56613
58803H381701k36133k16902k00564j85529j69359j52733j38046j25136j11598
58794F845701r6952q3454p2454o2408n1063l7942k4307j1870j510P827J8541L1741
58782F461850M5780N8496O9990Q1879R4813J08339J22416J37304J52427J67018
58772G500312J81685J97964K16492K36658K57683K79052L00384L21901L44621
58763I836752L69349L96033M24777M56518M92018N30956N72768O17376O64508
$$ y = [25415744, 24296605, 23174811, 22069491, 20994979, 19960382, 18972424, 18036348, 17154542, 16327033, 15553599, 14833516, 14163786, 13540225, 12960382, 12423011, 11924642, 11459309, 11022249, 10611735, 10226921, 9866088, 9527647, 9210836, 8914741, 8638314, 8381701, 8145568, 7928666, 7728102, 7542573, 7373214, 7220481, 7082435, 6957299, 6845701, 6748749, 6665295, 6592841, 6530433, 6479370, 6441428, 6417121, 6405251, 6403741, 6411568, 6430109, 6461850, 6507630, 6566126, 6636116, 6717995, 6812808, 6921147, 7043563, 7180867, 7333294, 7500312, 7681997, 7879961, 8096453, 8333111, 8590794, 8869846, 9170230, 9492131, 9836752, 10206101, 10602134, 11026911, 11483429, 11975447, 12506403, 13079171, 13696547, 14361055]
58754A4361055P13440P64105Q17066Q71623R25293R75831J022117J061951J090876
58745B2603357J104593J100908J077801J031138R56265Q51035P16060N53567L67980
58736C0362704J66845m0517k45091m38592o13668p65376q91676r91488j063488
58727B5479653j107883j127943j128422j113313j085872j049208j005676r56932
58719A6904404r05381q53896q03532p53657p05111o60514o20143n80654n40064
58710A0481452n01255m67881m39316m12595l87187l64445l43802l23115l01991
58701F939865k81911k63488k46096k29567k13979j98576j83025j68828j57236
58692D997159j46802j35433j23777j14089j06580r9610r2791q7083q2248p6908
$$ y = [14361055, 15074495, 15838600, 16655666, 17527289, 18452582, 19428413, 20450530, 21512481, 22603357, 23707950, 24808858, 25886659, 26917797, 27874062, 28725097, 29441157, 29994724, 30362704, 30529549, 30489032, 30243941, 29805349, 29191681, 28426305, 27534629, 26543141, 25479653, 24371770, 23243827, 22115405, 21002092, 19916220, 18867012, 17861336, 16904404, 15999023, 15145127, 14341595, 13587938, 12882827, 12222313, 11602170, 11021516, 10481452, 9980197, 9512316, 9073000, 8660405, 8273218, 7908773, 7564971, 7241856, 6939865, 6657954, 6394466, 6148370, 5918803, 5704824, 5506248, 5323223, 5154395, 4997159, 4850357, 4714924, 4591147, 4477058, 4370478, 4270868, 4178077, 4090994, 4008746, 3931838]
58682C931838p1169o6738o4284o2616o0604n8105n5170n1959m9407m8467m8780
58671C294539m9109m8660m7103m4423m1912m1863m4663m7499m7739m6369m6209
58660B788990m7934m9907n0887n0885n0162m9216m8882m8934m7795m5090m2695
58649B256603m1669m0314l7447l5149l5370l6030l4108l0814k9679l0605k9974
58638A875444k6367k2276j9976j9151j9091k0026k1558k2360k2123k1780k1549
58627A639187k0661j8990j7027j4510j1074p773n779m181j491J294J945R94J418
58614A543352M265P284Q460Q252P652O317L684L69k437m074m645m804n119n133
58600A563423l920k110j811l390m360l030j112n68j53K065M876O037O578R236
$$ y = [3931838, 3860669, 3793931, 3729647, 3667031, 3606427, 3548322, 3493152, 3441193, 3391786, 3343319, 3294539, 3245430, 3196770, 3149667, 3105244, 3063332, 3021469, 2976806, 2929307, 2881568, 2835199, 2788990, 2741056, 2691149, 2640262, 2589377, 2539215, 2489999, 2441117, 2392183, 2344388, 2299298, 2256603, 2214934, 2174620, 2137173, 2102024, 2066654, 2030624, 1996516, 1965702, 1936023, 1905418, 1875444, 1849077, 1826801, 1806825, 1787674, 1768583, 1748557, 1726999, 1704639, 1682516, 1660736, 1639187, 1618526, 1599536, 1582509, 1567999, 1556925, 1549152, 1543373, 1539192, 1537701, 1538995, 1540940, 1541934, 1543352, 1547617, 1554901, 1563361, 1571613, 1579265, 1585582, 1589266, 1589635, 1587198, 1583124, 1578479, 1573675, 1568556, 1563423, 1559503, 1557393, 1555582, 1552192, 1547832, 1544802, 1543690, 1543122, 1542969, 1545034, 1549910, 1555947, 1562525, 1571761]
58586A571761J3725J7376J9811K3049K7302L0423L1870L3819L7709M2458M6593
58575A895896M9786N2165N4289N7638O3001O8841P3497P8055Q4518R2237R9378
58564B669301J06934J17595J31093J44369J56322J68884J83187J98285K14082
58555D090052K32165K52813K73891K93373L10549L24526L34020L38657L37908
58546F787954L28788L07320K72409K25898J69431J04304L4203l5321j00560j60104
58536G934322k11717k51965k79392k95503l02378l01731k96127k88210k78477
58527E428822k66015k51092k34771k16962j97646j79041j63431j49700j35348
58518C634816j20815j08290r7428q6339p5898o8631o3933n8898n3440m9931m8098
$$ y = [1571761, 1585486, 1602862, 1622673, 1645722, 1673024, 1703447, 1735317, 1769136, 1806845, 1849303, 1895896, 1945682, 1997847, 2052136, 2109774, 2172775, 2241616, 2315113, 2393168, 2477686, 2569923, 2669301, 2776235, 2893830, 3024923, 3169292, 3325614, 3494498, 3677685, 3875970, 4090052, 4322217, 4575030, 4848921, 5142294, 5452843, 5777369, 6111389, 6450046, 6787954, 7116742, 7424062, 7696471, 7922369, 8091800, 8196104, 8230307, 8194986, 8094426, 7934322, 7722605, 7470640, 7191248, 6895745, 6593367, 6291636, 5995509, 5707299, 5428822, 5162807, 4911715, 4676944, 4459982, 4262336, 4083295, 3919864, 3770164, 3634816, 3514001, 3405711, 3308283, 3221944, 3146046, 3077415, 3013482, 2954584, 2901144, 2851213, 2803115]
58507B803115m5187m1080l8252l6629l3698l0061k9266l1347l2168l0508l0215
58496B424704l3447l7233l8989m0389m2991m4859m4464m3753m4258m3932m0954
58485A969435l7381l5962l6051l5310l3085k9929k6214k3057k2070k2653k2125
58474A645598j9754j7707j7009j5977j3948j2921j3833j4605j3794j2825j2860
58463A480365j2736j1722j1077j1233j0609q949q396r601j0148q623o847o307
58451A364117n721l978k202j121K69J820J574m09j312m11p13l726o653p139o908
58436A327487q035r321r179q671q877q466o719n803p311r421j0126j0320j1171
58423A214067j1378r648p169n259l267r33K6j113k463k858l739n773o941o201
$$ y = [2803115, 2757928, 2716848, 2678596, 2641967, 2608269, 2578208, 2548942, 2517595, 2485427, 2454919, 2424704, 2391257, 2354024, 2315035, 2274646, 2231655, 2186796, 2142332, 2098579, 2054321, 2010389, 1969435, 1932054, 1896092, 1860041, 1824731, 1791646, 1761717, 1735503, 1712446, 1690376, 1667723, 1645598, 1625844, 1608137, 1591128, 1575151, 1561203, 1548282, 1534449, 1519844, 1506050, 1493225, 1480365, 1467629, 1455907, 1444830, 1433597, 1422988, 1414039, 1405643, 1396042, 1385894, 1377271, 1370424, 1364117, 1358396, 1354418, 1352216, 1351095, 1351364, 1353184, 1354758, 1354349, 1353037, 1352626, 1351913, 1348187, 1341534, 1334395, 1327487, 1319452, 1310131, 1300952, 1292281, 1283404, 1274938, 1268219, 1262416, 1255105, 1245684, 1235558, 1225238, 1214067, 1202689, 1193041, 1185872, 1180613, 1177346, 1176413, 1176439, 1175326, 1172863, 1170005, 1166266, 1160493, 1153552, 1147351]
58409A147351n563o235o173m081k381l292n062n010l603k691k305j724j439j789
58395A096003j784j032m17K08K097M470M827L461L686O393Q715R402J0655J2867
58381A159551J2770R293O256O305O974N648L750K893J592r02k180j400j836n252
58367A203462q434q745q461r842j0679q885o887p183p808o380m472l848k654N29
58353A109713L078L096L238N563P126N429L675N561R125J0776J1324J2744J3218
58340A203666J0972R178J1227J4570J4853J3011J2706J3769J3711J2995J3508
58329A344166J4331J3901J3743J5477J6965J5870J3987J3612J3045J0211P227
58318A492535O646O728N112L435L532L118K43j949l61K252K056P29J626L412L431
$$ y = [1147351, 1141788, 1135553, 1129380, 1125299, 1122918, 1119626, 1114564, 1109554, 1105951, 1103260, 1100955, 1099231, 1097792, 1096003, 1094219, 1093187, 1092770, 1092978, 1095075, 1099545, 1104372, 1107833, 1111519, 1117912, 1126627, 1136029, 1146684, 1159551, 1172321, 1181614, 1187870, 1194175, 1201149, 1206797, 1210547, 1213440, 1215032, 1214130, 1211950, 1210550, 1208714, 1203462, 1195028, 1186283, 1177822, 1167980, 1157301, 1148416, 1141529, 1134346, 1126538, 1120158, 1115686, 1111838, 1109184, 1109713, 1112791, 1115887, 1119125, 1124688, 1131814, 1137243, 1140918, 1146479, 1155604, 1166380, 1177704, 1190448, 1203666, 1214638, 1223816, 1235043, 1249613, 1264466, 1277477, 1290183, 1303952, 1317663, 1330658, 1344166, 1358497, 1372398, 1386141, 1401618, 1418583, 1434453, 1448440, 1462052, 1475097, 1485308, 1492535, 1499181, 1505909, 1511021, 1514456, 1517988, 1521106, 1521349, 1519400, 1519039, 1521291, 1523347, 1524076, 1525702, 1529114, 1532545]
58303A532545L447N961Q474P712N949O927R040Q806P711R102J1481J1283R350
58290A637788Q588Q274O666N832P739R002N822R01p68L62J030J873N041Q488R124
58275A715762Q453R288J0405J0148J1014J4707J7305J5703J3859J6017J9168J9356
58263A881185J9687K3889K7654K5403K0703K0564K3817K4458K2428K1712K1637
58252B133137J9327J7119J8463K0311J8525J6626J9864K4968K5551K3460K4792
58241B362143K8708L0371L0890L4041L7133L5501L2308L3468L6990L7678L7763
58230B736994M1953M6663M5842M2875M4807M9309M9589M7632M9852N4087N4061
58219C263664N2489N6179O2285O3254O1446O4756P1643P4866P6140Q2284R0612
$$ y = [1532545, 1535992, 1541953, 1550427, 1558139, 1564088, 1571015, 1580055, 1588861, 1596572, 1605674, 1617155, 1628438, 1637788, 1646376, 1654650, 1661316, 1667148, 1674887, 1683889, 1689711, 1690612, 1689844, 1690206, 1691236, 1693109, 1698150, 1706638, 1715762, 1724215, 1733503, 1743908, 1754056, 1765070, 1779777, 1797082, 1812785, 1826644, 1842661, 1861829, 1881185, 1900872, 1924761, 1952415, 1977818, 1998521, 2019085, 2042902, 2067360, 2089788, 2111500, 2133137, 2152464, 2169583, 2188046, 2208357, 2226882, 2243508, 2263372, 2288340, 2313891, 2337351, 2362143, 2390851, 2421222, 2452112, 2486153, 2523286, 2558787, 2591095, 2624563, 2661553, 2699231, 2736994, 2778947, 2825610, 2871452, 2914327, 2959134, 3008443, 3058032, 3105664, 3155516, 3209603, 3263664, 3316153, 3372332, 3434617, 3497871, 3559317, 3624073, 3695716, 3770582, 3846722, 3929006, 4019618]
58208D019618R3355R2932R7472J04843J06908J05918J10442J18817J23270J26497
58198E100072J36738J50265J57022J59991J70105J85368J94699J99559K11390
58189F665209K30081K45563K58419K77765L00794L16476L27811L47937L75545
58180I345600L97211M12911M35261M64176M87084N04380N29670N64170N96057
58171A3736520O25832O66652P18688P69068Q17773Q76934R44454J006192J064449
58162B1226562J135540J219471J302017J385928J487947J605544J720242J833039
58154C2916290J961172K101753K237398K376884K549145K757943K985574L239311
58146E3125470L546917L909257M310744M775653N356891O068909O891356P835608
$$ y = [4019618, 4112973, 4205905, 4303377, 4408220, 4515128, 4621046, 4731488, 4850305, 4973575, 5100072, 5236810, 5387075, 5544097, 5704088, 5874193, 6059561, 6254260, 6453819, 6665209, 6895290, 7140853, 7399272, 7677037, 7977831, 8294307, 8622118, 8970055, 9345600, 9742811, 10155722, 10590983, 11055159, 11542243, 12046623, 12576293, 13140463, 13736520, 14362352, 15029004, 15747692, 16516760, 17334533, 18211467, 19155921, 20162113, 21226562, 22362102, 23581573, 24883590, 26269518, 27757465, 29363009, 31083251, 32916290, 34877462, 36979215, 39216613, 41593497, 44142642, 46900585, 49886159, 53125470, 56672387, 60581644, 64892388, 69668041, 75024932, 81093841, 87985197, 95820805]
58138I5820805Q940993J0213631J1649735J3309201J5264360J7473000J9808465
58131A92480190K2219672K4767165K7568871L0884422L5066413L9818200M3193862
58124D15998795M1892552L3463118J8606844J114320j4621453k6055288l2922793
58117D37476095l6129125l6714333l5542629l3289618l0411557k7205599k3945760
58110B14237474k0885218j8145998j5715426j3557151j1652765r956270q399700
58103A15924946o950136n607518m364877l224083k219809j374729o84655k26532
58095I1272607k19218q42248j984120l265290m326373n027419n387305n455512
58087F4765122n292699m986875m612035m196735l761513l348008k984311k659721
$$ y = [95820805, 104761798, 114975429, 126625164, 139934365, 155198725, 172671725, 192480190, 214699862, 239467027, 267035898, 297920320, 332986733, 372804933, 415998795, 457891347, 491354465, 509961309, 511075629, 496454176, 470398888, 437476095, 401346970, 364632637, 329090008, 295800390, 265388833, 238183234, 214237474, 193352256, 175206258, 159490832, 145933681, 134280916, 124324646, 115924946, 108974810, 103367292, 99002415, 95778332, 93558523, 92183794, 91499139, 91272607, 91053389, 90211141, 88227021, 84961731, 80635358, 75607939, 70220634, 64765122, 59472423, 54485548, 49873513, 45676778, 41915265, 38567257, 35582946, 32923225]
58079C2923225k360558k098681j883312j697850j527345j380274j263343j161943
58071A9549919j064289r79600r15144q59103q02000p52115p14734o78145o34361
58062A2150428n92685n59408n24662m82199m42280m12412l84581l53499l28618
58053H070084l16028l06455k92813k82011k78276k72271k58260k45351k40364
58044E578255k35598k24641k14404k10226k04406j90969j77281j69709j61821
58035C789200j48142j36023j32175j30000j21758j11826j06818j03392r6444q9353
58025B613269q6032q2376p4810o7995o5676o3369n8005n4836n6848n7486n2095
58014A893741m6512m6040m5865m0970l5819l5351l5430l1104k5783k3731k1875
$$ y = [32923225, 30562667, 28463986, 26580674, 24882824, 23355479, 21975205, 20711862, 19549919, 18485630, 17506030, 16590886, 15731783, 14929783, 14177668, 13462934, 12784789, 12150428, 11557743, 10998335, 10473673, 9991474, 9549194, 9136782, 8752201, 8398702, 8070084, 7754056, 7447601, 7154788, 6872777, 6594501, 6322230, 6063970, 5818619, 5578255, 5342657, 5118016, 4903612, 4693386, 4488980, 4298011, 4120730, 3951021, 3789200, 3641058, 3505035, 3372860, 3242860, 3121102, 3009276, 2902458, 2799066, 2702622, 2613269, 2527237, 2444861, 2370051, 2302056, 2236380, 2173011, 2115006, 2060170, 2003322, 1945836, 1893741, 1847229, 1801189, 1755324, 1714354, 1678535, 1643184, 1607754, 1576650, 1550867, 1527136, 1505261]
58003A505261j7312j4621j7235j9654j6665j2662j3566j6800j7492j7469j9899
57992A321886k1705j9394j6179j5891j5920j3171j0551j0700r940n529k207m284
57980A176415p698p179m974n183n774l747k086l862n144j661K766K188j929m463
57966A127669n278o899q049o684n370o975q955q172p001q423r634p177l984m548
57952A030520p181p852p723r995j2777j2065q929p380p707p691p619q512q355
57939I16734n465k653k910m084k873o42p9L69L178O210O018L610J726m56m597
57924I14086q338q606o886o165n579l194r11j302k531j610O5m03j916j943j756
57909H63011l889o923p849p164o892o264m126k791m577p101o883m853l647k525
$$ y = [1505261, 1487949, 1473328, 1456093, 1436439, 1419774, 1407112, 1393546, 1376746, 1359254, 1341785, 1321886, 1300181, 1280787, 1264608, 1248717, 1232797, 1219626, 1209075, 1198375, 1188435, 1182906, 1180699, 1176415, 1168717, 1161538, 1156564, 1151381, 1145607, 1141860, 1139774, 1135912, 1130768, 1129107, 1131873, 1134061, 1132132, 1127669, 1122391, 1115492, 1107443, 1100759, 1095389, 1088414, 1079459, 1071287, 1064286, 1055863, 1046229, 1039052, 1035068, 1030520, 1023339, 1015487, 1007764, 997769, 984992, 972927, 963998, 956618, 948911, 941220, 933601, 925089, 916734, 911269, 908616, 905706, 901622, 898749, 898107, 898028, 898397, 901575, 907785, 913803, 917413, 919139, 918683, 914086, 905748, 897142, 890256, 884091, 878512, 875318, 874407, 873105, 870574, 868964, 869029, 868626, 866710, 864767, 863011, 859122, 852199, 844350, 837186, 830294, 824030, 819904, 817113, 812536, 805435, 798552, 793699, 790052, 787527]
57895G87527K6J732m4l119l926l367m022m522k322O62R49l35J53J789J857J239
57879G74277K479M298L836K358K789L642J535k014k809j524k552o171q308p751
57865G64085p344q059p737n978m803m156j972R34J256q95j437J366M559N474N007
57850G40300M783M718M522M673N047M958M776N324N937N397M035K707Q57j912
57836G96122l897l778l374m843o845o890n771n996p423q137q309r222r888q427
57822G03322n665l735k487q83j37j494k717j185J230J017p29O2L663O459O994
57807G03715P138P665P449O942P869R398Q946O683N151M578K796l95k905m323
57793G70707o054p804q003p533q737j0883j0962r028q384j0102j1509j0587q215
$$ y = [787527, 787553, 789285, 789241, 786122, 782196, 778829, 774807, 770285, 767963, 768625, 769574, 769239, 769392, 771181, 773038, 774277, 776756, 781054, 784890, 787248, 790037, 793679, 795214, 793200, 790391, 788867, 786315, 780144, 771836, 764085, 756741, 748682, 740945, 734967, 730164, 726008, 724036, 724970, 726226, 725331, 723894, 725260, 729819, 735293, 740300, 745083, 749801, 754323, 758996, 764043, 769001, 773777, 779101, 785038, 790435, 794470, 797177, 798034, 796122, 792225, 788447, 785073, 780230, 773385, 766495, 760724, 754728, 747305, 739168, 730859, 721637, 711749, 703322, 697657, 693922, 691435, 690552, 690415, 688921, 686204, 685019, 686249, 687266, 686537, 686599, 690262, 696721, 703715, 710853, 718518, 725967, 732909, 740778, 750176, 759122, 765805, 770956, 775534, 778330, 777935, 775030, 770707, 764653, 756849, 748846, 741313, 732576, 721693, 710731, 701703, 693319, 683217, 671708, 661121, 652906]
57780F52906n769l966m087o659r206q822o594n725o247n823m927o155q736r048
57766E61142o836n738p018p871o971o694q310r568q723p155o427o239o329p102
57752D60161p589o242m158l805m465l030M68K678K681L091M635M835L273L163
57738D55696N760P971P536O241N904N406L930L133L824M210L400K890K932J530
57724E20363j058j340J571L533J598j625k798k881l873m565l477k747m789p666
57710D90246p813n416l468l138l423l706l643j952J674M913N705N343O188P884
57696D89394Q563Q341Q881J0445J1769J2075J1344R607P539O492O580O258N140
57683F02428N001O433P055N348L788N263Q421R680Q358O722O067N850O016P167
$$ y = [652906, 647137, 643171, 639084, 632425, 623219, 614397, 607803, 602078, 595831, 590008, 585081, 578926, 570190, 561142, 554306, 548568, 541550, 533679, 526708, 520014, 511704, 502136, 493413, 486258, 479831, 473592, 467263, 460161, 452572, 446330, 442172, 438367, 433902, 430872, 431340, 434018, 436699, 439790, 444425, 449260, 452533, 455696, 461456, 469427, 476963, 483204, 489108, 494514, 498444, 501577, 505401, 509611, 513011, 515901, 518833, 520363, 519305, 517965, 519536, 523069, 524667, 523042, 520244, 517363, 513490, 508925, 505448, 502701, 497912, 490246, 482433, 477017, 473549, 470411, 466988, 463282, 459639, 457687, 459361, 464274, 469979, 475322, 481510, 489394, 497957, 506298, 515179, 525624, 537393, 549468, 560812, 570419, 577958, 584450, 591030, 597288, 602428, 607429, 613862, 620917, 626265, 630053, 635316, 643737, 653417, 661775, 668497, 674564, 680414, 686430, 693597]
57669F93597Q695R259R073R650J1394J3208J4327J4995J5639J6678J8594K0963
57657H56072K2233K1761K1118K1959K3626K4538K4908K6087K8038K9531L0604
57646A130475L2796L6815M1496M5382M8147N0296N2444N5142N8743O3267O8570
57635A683573P4474Q0602Q6495R2096R7917J04772J13734J25737J40325J55360
57625B755085J69365J83639K00426K19466K38318K55864K73041K89958L04797
57616D889959L16126L23751L26314L20463L03757K76837K42047K01702J57911
57607G358867J11185N8125o318q1935j60188k29719k83388l19238l37782l41127
57597E768482l33162l17821k97460k73916k49611k26141k03262j80823j60282
$$ y = [693597, 702292, 711551, 720624, 730274, 741668, 754876, 769203, 784198, 799837, 816515, 835109, 856072, 878305, 900066, 921184, 943143, 966769, 991307, 1016215, 1042302, 1070340, 1099871, 1130475, 1163271, 1200086, 1241582, 1286964, 1335111, 1385407, 1437851, 1492993, 1551736, 1615003, 1683573, 1758047, 1838649, 1925144, 2017240, 2115157, 2219929, 2333663, 2459400, 2599725, 2755085, 2924450, 3108089, 3308515, 3527981, 3766299, 4022163, 4295204, 4585162, 4889959, 5206085, 5529836, 5856150, 6176613, 6480370, 6757207, 6999254, 7200956, 7358867, 7470052, 7528177, 7521859, 7439924, 7279736, 7050017, 6766629, 6447391, 6109609, 5768482, 5435320, 5117499, 4820039, 4546123, 4296512, 4070371, 3867109, 3686286, 3526004]
57588C526004j42740j26978j11157r5212q0127o6233n3702m3406l5531k8449k0406
57577B722063j1401k261O788J5644K3886L2033M1648N2957O4093P3976Q4043R5705
57565C199174J08051J19855J31945J45632J60361J74812J88703K01605K11613
57556D641751K17223K18978K17031K08615J90277J61542J24375Q0462L1380j9699
57546F071935o8997j14319j54448j87451k11690k27726k37333k41439k40610k36264
57536D151658k29391k19237k05402j90078j76049j63427j50699j38008j26979
57527B552388j17940j09742j01863r4662q7885q0982p4435o8918o3709n7816n2000
57516A642436m7692m4400m0313l5104l0271k6933k4978k4007k3433k2089j9321
$$ y = [3526004, 3383264, 3256286, 3145129, 3049917, 2969790, 2903557, 2849855, 2806449, 2770918, 2742469, 2722063, 2710662, 2708401, 2715189, 2730833, 2754719, 2786752, 2828400, 2881357, 2945450, 3019426, 3103469, 3199174, 3307225, 3427080, 3559025, 3704657, 3865018, 4039830, 4228533, 4430138, 4641751, 4858974, 5077952, 5294983, 5503598, 5693875, 5855417, 5979792, 6060254, 6091634, 6071935, 6002938, 5888619, 5734171, 5546720, 5335030, 5107304, 4869971, 4628532, 4387922, 4151658, 3922267, 3703030, 3497628, 3307550, 3131501, 2968074, 2817375, 2679367, 2552388, 2434448, 2324706, 2222843, 2128181, 2040296, 1959314, 1884879, 1815961, 1752252, 1694436, 1642436, 1594744, 1550344, 1510031, 1474927, 1444656, 1417723, 1392745, 1368738, 1345305, 1323216, 1303895]
57505A303895j6065j3475j1222q507n807l957k485o39J003J832L100O338J0681
57492A264692J3933J5626J6901J8126J8959K0272K3676K9051L4439L8334M0756
57481A534765M2545M4956M9212N4989O0272O4152O8421P4722Q1818Q7936R4178
57470B257966J02782J13240J23178J32169J41693J51914J61503J70089J77820
57461C532354J82937J82774J76904J66351J50051J25455R2775N5492J6443k3415
57451D658121o2168r6301j23873j45566j61808j71577j74984j74363j71678j66959
57441C208844j60065j51695j41869j29757j15980j03029r2429q3387p4927o7240
57431B088466o0190n2570m3931l5379k7767k0688j3926q093l190J823P501J3455
$$ y = [1303895, 1287830, 1274355, 1263133, 1254626, 1248819, 1244862, 1242377, 1241738, 1242741, 1244573, 1247673, 1254011, 1264692, 1278625, 1294251, 1311152, 1329278, 1348237, 1368509, 1392185, 1421236, 1455675, 1494009, 1534765, 1577310, 1622266, 1671478, 1726467, 1786739, 1850891, 1919312, 1994034, 2075852, 2163788, 2257966, 2360748, 2473988, 2597166, 2729335, 2871028, 3022942, 3184445, 3354534, 3532354, 3715291, 3898065, 4074969, 4241320, 4391371, 4516826, 4609601, 4665093, 4681536, 4658121, 4595953, 4499652, 4375779, 4230213, 4068405, 3896828, 3721844, 3547481, 3375803, 3208844, 3048779, 2897084, 2755215, 2625458, 2509478, 2406449, 2314020, 2230633, 2155706, 2088466, 2028276, 1975706, 1931775, 1896396, 1868629, 1847941, 1834015, 1825922, 1822732, 1824555, 1832056, 1845511]
57419A845511J9629K6299L2675L7608M1887M7696N5428O3329P0633P8742Q8564
57408B408001R9048J09159J19076J28740J37318J44847J52167J58454J61054J58544
57398C776408J51723J40744J23672R9057O7826L1594q457m9871q8471j21322j48395
57387C974508j70162j85557j93640j95353j92335j85756j77294j69097j61414
57378B343900j52285j40917j29229j18792j08639r7943q8441q1911p7083p1444
57368A277216o4862n9176n5244n2358m9702m6718m2811l8199l4194l1544k9511
57357G72897k7465k5916k4852k2884j9559j6820j6472j7591j8105j7456j6027
57346E49750j3569j0232p856p930r234r491q552p961q258q679q918r210r057p707
$$ y = [1845511, 1865140, 1891439, 1924114, 1961722, 2003609, 2051305, 2106733, 2170062, 2240695, 2319437, 2408001, 2507049, 2616208, 2735284, 2864024, 3001342, 3146189, 3298356, 3456810, 3617864, 3776408, 3928131, 4068875, 4192547, 4291604, 4359430, 4391024, 4382567, 4332696, 4244225, 4122903, 3974508, 3804346, 3618789, 3425149, 3229796, 3037461, 2851705, 2674411, 2505314, 2343900, 2191615, 2050698, 1921469, 1802677, 1694038, 1596095, 1507654, 1425743, 1348660, 1277216, 1212354, 1153178, 1097934, 1045576, 995874, 949156, 906345, 868146, 833952, 802408, 772897, 745432, 719516, 694664, 671780, 652221, 635401, 618929, 601338, 583233, 565777, 549750, 536181, 525949, 518093, 510163, 500929, 491438, 482886, 474925, 466667, 457988, 449070, 439860, 430803, 423096]
57332D23096n722m620n108o682q483r473q662o342m445m449n534o024n666n327
57318C36559n170m648l791l218l210l600m083l961k494j61J394J416Q71O67M46
57303C07017q0k35Q4j88j300j832j154p73j773k871k871k893m030m827l616j628
57287B77030r59j011J8J393R53q08j142O30K402L034L789N455O659O081M457L421
57271C11402L734N066O433O680N602M500M651N724O725P630Q675R060Q228P411
57257D01521P865Q409P153M977M661O683Q648Q952Q621R044J0195J1565J2975
57244E11269J3867J3600J2884J3318J5210J7359J9098K0934K3112K5234K7354
57233G13239K9794L1990L3322L4918L8535M3654M7915N0531N2897N5526N7078
$$ y = [423096, 417374, 412754, 407646, 400964, 392481, 383008, 374346, 368004, 363559, 359110, 353576, 347552, 341886, 336559, 331389, 326741, 322950, 319732, 316522, 312922, 308839, 304878, 302384, 302223, 303617, 305033, 305904, 306571, 307017, 306937, 306702, 306786, 306598, 305298, 303466, 302312, 301539, 299766, 296895, 294024, 291131, 287101, 282274, 278658, 277030, 276071, 275060, 275078, 276471, 277424, 276616, 275474, 276104, 278506, 281540, 285329, 290784, 297443, 303524, 307981, 311402, 315136, 320202, 326635, 333315, 338917, 343417, 348068, 353792, 360517, 368147, 376822, 385882, 394110, 401521, 409386, 417795, 424948, 429925, 434586, 441269, 449917, 458869, 467490, 476534, 486729, 498294, 511269, 525136, 538736, 551620, 564938, 580148, 597507, 616605, 637539, 660651, 685885, 713239, 743033, 775023, 808345, 843263, 881798, 925452, 973367, 1023898, 1076795, 1132321, 1189399]
57222A189399N7182N7704N9828O2017O2476O1788O1441O0980N8415N2842M5314
57211A829386L7500L0298K3442J5880O910k757j1478j8309k3517k7570l0322l1320
57199A798143l0295k7467k3996k1591k0808k0252j8422j5733j3497j1649r076
57188A585357n679k367O92M176Q078J1657J4659J7127J8403J7933J6616J5584
57176A702236J4170J1102P316N316N875P566R532J2474J6656K1120K5274K9381
57164A868018L3265L6314L8835M1609M4108M5069M4590M3769M2524M0114L7403
57153B315618L6032L5547L4006L1450K9842K9481K8504K6385K4811K4388K3573
57142B639637K1811K0918K2236K4867K7561K9967L1435L1372L1392L4193L9381
$$ y = [1189399, 1246581, 1304285, 1364113, 1426130, 1488606, 1550394, 1611835, 1672815, 1731230, 1784072, 1829386, 1866886, 1897184, 1920626, 1936506, 1943416, 1940659, 1929181, 1910872, 1887355, 1859785, 1829463, 1798143, 1767848, 1740381, 1716385, 1694794, 1673986, 1653734, 1635312, 1619579, 1606082, 1594433, 1585357, 1579678, 1577311, 1578003, 1582179, 1590257, 1601914, 1616573, 1633700, 1652103, 1670036, 1686652, 1702236, 1716406, 1727508, 1734824, 1740140, 1746015, 1753581, 1763113, 1775587, 1792243, 1813363, 1838637, 1868018, 1901283, 1937597, 1976432, 2018041, 2062149, 2107218, 2151808, 2195577, 2238101, 2278215, 2315618, 2351650, 2387197, 2421203, 2452653, 2482495, 2511976, 2540480, 2566865, 2591676, 2616064, 2639637, 2661448, 2682366, 2704602, 2729469, 2757030, 2786997, 2818432, 2849804, 2881196, 2915389, 2954770]
57131B954770M3457M4845M5912M8798N2340N4524N5089N4077N0588M4649L8093
57120C487142L2368K7553K4266K3776K5465K7076K8236L0511L3451L4281L2567
57109C806692L1214L1590L1738L0837L0994L2690L2872L0042K6970K5963K5684
57098D137286K5110K6023K8573K9054K5604K1625J9836J7367J1063L430j343l544
57086D340084n492o552n402l943m181m369k982l404r747k0959l3750m8227o5767
57073D125309q4505j02290j21241j44217j69533j94149k19064k46458k74880l02603
57063B266369l32192l66146m01597m35425B59830b54992n67306o27130o96208
57054b145636p76546q65734r62730j073519j204007j352604j517342j704213j919991
$$ y = [2954770, 2998227, 3043072, 3088984, 3137782, 3190122, 3244646, 3299735, 3353812, 3404400, 3449049, 3487142, 3519510, 3547063, 3571329, 3595105, 3620570, 3647646, 3675882, 3706393, 3739844, 3774125, 3806692, 3837906, 3869496, 3901234, 3932071, 3963065, 3995755, 4028627, 4058669, 4085639, 4111602, 4137286, 4162396, 4188419, 4216992, 4246046, 4271650, 4293275, 4313111, 4330478, 4341541, 4344971, 4343628, 4340084, 4334592, 4328040, 4322638, 4318695, 4314514, 4310145, 4307163, 4303759, 4294012, 4273053, 4239303, 4191076, 4125309, 4040804, 3938514, 3817273, 3673056, 3503523, 3309374, 3090310, 2843852, 2568972, 2266369, 1934177, 1568031, 1166434, 731009, 259830, -254992, -822298, -1449428, -2145636, -2922182, -3787916, -4750646, -5824165, -7028172, -8380776, -9898118, -11602331, -13522322]
57045a3522322k163901k436430k749655l118749l551721m059835m669168n407672
57037d1679453o289321p324629q532864r922348j1467167j3120323j4833561j6545594
57029a29715260j8182163j9701686k1090299k2231351k2823916k2589080k1616187
57022b77949942k0363039j9162322j7772022j5559265j2147494p785052l073066
57015c73812202J536212N911000J0047357J3868465J7214821J9923499K1871707
57008b83439141K2995390K3314686K2936595K2016743K0716491J9182687J7536953
57001a34739596J5866510J4229573J2670725J1223883R904247Q711646P644337
56994e4488675O701301N873496N145077M504584L946153L460537L035077K662826
$$ y = [-13522322, -15686223, -18122653, -20872308, -23991057, -27542778, -31602613, -36271781, -41679453, -47968774, -55293403, -63826267, -73748615, -85215782, -98336105, -113169666, -129715260, -147897423, -167599109, -188689408, -210920759, -233744675, -256333755, -277949942, -298312981, -317475303, -335247325, -350806590, -362954084, -370739136, -373812202, -372275990, -366364990, -356317633, -342449168, -325234347, -305310848, -283439141, -260443751, -237129065, -214192470, -192175727, -171459236, -152276549, -134739596, -118873086, -104643513, -91972788, -80748905, -70844658, -62133012, -54488675, -47787374, -41913878, -36768801, -32264217, -28318064, -24857527, -21822450, -19159624]
56986a9159624K342500K069022J832923J629163J457674J314395J190210J079630
56978f244107R82610Q96938Q17130P42245O77010O23189N76691c93678A04254
56968E69579M31445L94235L57905L26244K98313K72524K49023K25890J99081J69174
56958C493413J42866J24706J12027J00515Q9881Q0937P1970O1565N1488M3761
56948D373129L8365L6011L8895M6324N4637O4538Q2319J07286J21547J00364L4325
56937E097740o1451j59216k36795k86566l13091l25126l28420l24044l12066k94640
56927B456325k74659k53370k31067k08643j86904j65777j45821j29199j17561
56918G43324j10029j04739j00978r8230r4530q7872F8395b78n9890n2697m6884
$$ y = [-19159624, -16817124, -14748102, -12915179, -11286016, -9828342, -8513947, -7323737, -6244107, -5261497, -4364559, -3547429, -2805184, -2128174, -1504985, -928294, -393678, 104254, 569579, 1001024, 1395259, 1753164, 2079408, 2377721, 2650245, 2899268, 3125158, 3324239, 3493413, 3636279, 3760985, 3873012, 3973527, 4063408, 4144345, 4216315, 4277880, 4329368, 4373129, 4411494, 4447505, 4486400, 4532724, 4587361, 4651899, 4734218, 4841504, 4963051, 5063415, 5097740, 5036289, 4877073, 4640278, 4353712, 4040621, 3715495, 3387075, 3063031, 2750965, 2456325, 2181666, 1928296, 1697229, 1488586, 1301682, 1135905, 990084, 860885, 743324, 633295, 528556, 427578, 329348, 234818, 146946, 68395, -278, -60168, -112865, -159749]
56907a59749m1523l5306k8050k0990j4937r293l729R19M510Q683J4526K0506K4157
56894b40276K4546K1780J5733P113j487p694j1708j4901j7086j7012j4791j1839
56882b67622q780n172j071K653N435P343Q504R281J0596J3164J6780K0995K5580
56869a62314K9384K9944K5664J7741Q799M94o351j0577j1530j0480r350q369o519
56856a13464l888j920j395j660j868j733j067K75J889L106L724L880L633L317
56842a07171L737N187O937Q394R939J1768J3080J3630J4775b293A7786K0669J9722
56829E8177J9493K0764K2440K3832K5073K5433K3455J8964J3186O708p55q457
56817B48313j4349j7197j7489j6142j3806j1445r726p711l970Q65M672P237J0718
$$ y = [-159749, -201272, -236578, -264628, -285618, -300555, -309848, -313577, -312658, -308148, -299465, -284939, -264433, -240276, -215730, -193950, -178217, -171104, -172591, -180285, -191993, -206894, -223980, -240992, -255783, -267622, -276402, -281574, -282645, -279992, -274557, -267214, -258710, -249429, -238833, -225669, -208889, -187894, -162314, -132930, -102986, -77322, -59581, -50782, -50288, -56639, -67216, -78746, -89226, -98576, -106945, -113464, -117352, -119272, -120667, -122327, -124195, -125928, -126995, -126720, -124831, -121725, -118001, -114121, -110488, -107171, -103434, -98247, -91310, -82916, -72977, -61209, -48129, -34499, -19724, -2293, 17786, 38455, 58177, 77670, 98434, 120874, 144706, 169779, 195212, 218667, 237631, 250817, 257525, 256770, 248313, 233964, 216767, 199278, 183136, 169330, 157885, 148159, 140448, 136478, 137343, 142015, 149252, 159970]
56804A59970J6021K1018K3685K5168K8170L3515L9440M3080M1607L3388J9622
56793D84684M213q936j8043k2898k3935k2590k0701j8293j3473n896J589O514
56781C42235J0418J6442K4429L1224L5530L9667M6026N4073O1535O6446O6794
56770G94819N9991M4703K2982n40k1557l7803m8670n4298n5291n2681m7737m1603
56758E62315l4954k7886k0242j2253m684J817P455J3233J9999K7572L4845M0671
56746F07888M4347M5145M1901L3706K1038N790r820k3970l5089m1973m4489m3637
56734F00837m0647l6371l1650k7446k4008k0507j6107j1129o558k698J056N191
56722C89963R402J2953J5290J6225J5695J3343Q472Q73q203j6345k1748k4393
$$ y = [159970, 175991, 197009, 220694, 245862, 274032, 307547, 346987, 390067, 431674, 465062, 484684, 488897, 479961, 461918, 439020, 415085, 392495, 371794, 353501, 340028, 334132, 335721, 342235, 352653, 369095, 393524, 424748, 460278, 499945, 545971, 600044, 661579, 728025, 794819, 854810, 899513, 922495, 921955, 900398, 862595, 813925, 759627, 704336, 651655, 603918, 562315, 527361, 499475, 479233, 466980, 462296, 464113, 471568, 484801, 504800, 532372, 567217, 607888, 652235, 697380, 739281, 772987, 794025, 799815, 789995, 766025, 730936, 688963, 644474, 600837, 560190, 523819, 492169, 464723, 440715, 420208, 404101, 392972, 386414, 383716, 384772, 389963, 399365, 412318, 427608, 443833, 459528, 472871, 481343, 482216, 474013, 457668, 435920, 411527]
56710D11527k5308k5195k4294k3080k2109k1217j9664j7185j4337j1642r021o403
56698A92072m274l052k381j664j085j288k056k374k141k717m751o384n227j861
56684A50817N15K48q67p52j84j002k665k981j665p23j206j844j535j145j815l090
56668A30106l960m523n325n777m710k211N1M90q32k236k078n40M25m56j923j850
56652I4651l82L71l41q61K8J227J328O27j43j361l106l750j911J203L296L929
56636I4805M037L466J364j342k364j305l45j115k616k957j762o3J145J462J125
56621I3535R57J633K704L005K221J170N55L48N85J594L046L824L452K722K377
56606A23728K000R54l00p27j84N34R21J281J879K284J953J177P15N52k69k040
$$ y = [411527, 386219, 361024, 336730, 313650, 291541, 270324, 250660, 233475, 219138, 207496, 198475, 192072, 187798, 184746, 182365, 180701, 179616, 178328, 176272, 173898, 171757, 169040, 164289, 157905, 152678, 150817, 151332, 151580, 150713, 149961, 149777, 148775, 146110, 143129, 141464, 140741, 139535, 137691, 136156, 135011, 133196, 130106, 126146, 121623, 116298, 110521, 105811, 103600, 103651, 104141, 103309, 101073, 98995, 98455, 98880, 98424, 96501, 94651, 94269, 94640, 94299, 93438, 93466, 94693, 96021, 96648, 96505, 95144, 92038, 88288, 86377, 87580, 90876, 94805, 98842, 102308, 103672, 102330, 99966, 98661, 98316, 97201, 94585, 91628, 89866, 89803, 90948, 92410, 93535, 94492, 96125, 98829, 101834, 104055, 105225, 105780, 106128, 106713, 108307, 111353, 115177, 118629, 121351, 123728, 125728, 126682, 126382, 125655, 125471, 126005, 126926, 128207, 130086, 132370, 134323, 135500, 136215, 136767, 136498, 134458]
56590A34458l393k823r22K64M1k24M36J129Q78K79J04m04k036l571l130j029O37
56573A20694R38Q10R15O74l49j686k951m214n099m728k918n57J375K318K024R87
56557A08233O35J706K838K330R21R27K664L804K649J21j950k795k481j472q69
56542A17261j450k062q32J737L006K112J183J715K303J511N36R98K121K350K158
56527A34647K697L109J746o46j619n66P33J005Q03Q22P98M85K30K75N67J294K461
56510A48841L085K168M33k48Q31K731M668O716Q446Q554O727M718M518O067P559
56495B15814P601O369M912L999L725L744L628L147K461K131K614L436L187R73
56481B67741k199m219m145k904j692p65k14p48k675m795n329l776j256P16J307
$$ y = [134458, 131065, 128242, 127320, 127584, 127625, 127401, 127837, 128966, 129844, 130123, 130227, 129823, 127787, 124216, 121086, 120057, 120694, 121632, 122442, 123357, 124031, 123682, 121996, 119045, 114831, 109732, 105004, 102086, 101529, 102904, 105222, 107246, 108233, 108868, 110574, 113412, 115742, 116663, 117590, 120254, 124058, 126707, 126828, 124878, 122083, 119602, 118130, 117261, 115811, 113749, 112917, 114654, 117660, 119772, 120955, 122670, 124973, 126484, 127020, 128018, 130139, 132489, 134647, 137344, 140453, 142199, 141553, 139934, 139368, 140101, 141106, 141909, 142731, 143529, 144014, 144244, 144519, 145086, 146380, 148841, 151926, 154094, 154527, 154279, 155110, 157841, 162509, 169225, 177671, 186225, 192952, 197670, 202188, 208255, 215814, 223415, 229784, 234696, 238695, 242420, 246164, 249792, 252939, 255400, 257531, 260145, 263581, 266768, 267741, 265542, 261323, 257178, 254274, 252582, 251817, 251603, 250855, 248180, 243385, 238056, 234280, 233024, 233740, 235047]
56466B35047P07j18k78J52M05K02j65q63k480m573n526m594l026k303k350k296
56450B07941j908j273j72J153J606P66r2K68J205J370Q01M76M78J47n56j077j230
56433B09903j016k56N72K10j328j882o2K166K020Pr86r0Q96J000J302K313K833
56416B17602K305J997K820L965M599N078N419M595K563J242J930L250L226K138
56402B62729J601J774J441M12N3J273L261M621M863M491M101L698K812J312l1
56387B98411k14O19J055Kk016l540l738k941k048j779k280k940k791j524q4Q7
56371B74279j344k999l120j558o7l09j877k911k439j285n88m36l14n6K00K63k81
56354B55158j677l033k820r67O40N41n07r76n75K66J499K615K023q34l704l909
$$ y = [235047, 235754, 235636, 235358, 235510, 235915, 236117, 235952, 235089, 232609, 228036, 222510, 217916, 214890, 212587, 210237, 207941, 206033, 204760, 204588, 205741, 207347, 208113, 208021, 208289, 209494, 210864, 211665, 212141, 212619, 212766, 212210, 211133, 209903, 208887, 208631, 209203, 209413, 208085, 206203, 206141, 208307, 210327, 210334, 209348, 209258, 210154, 211154, 212456, 214769, 217602, 219907, 221904, 224724, 228689, 233288, 238366, 243785, 248380, 250943, 252185, 254115, 257365, 260591, 262729, 264330, 266104, 267545, 267957, 268010, 269283, 272544, 277165, 282028, 286519, 290620, 294318, 297130, 298442, 298411, 298197, 298816, 299871, 299873, 297857, 294317, 290579, 287638, 285590, 283811, 281531, 278591, 275800, 274276, 274192, 274279, 272935, 269936, 266816, 265258, 265191, 264882, 263005, 260094, 257655, 256370, 255782, 255346, 255032, 254976, 255176, 255439, 255158, 253481, 250448, 247628, 246661, 247301, 247842, 247335, 246359, 245784, 246050, 247549, 250164, 252187, 251353, 247649, 243740]
56338B43740j783J91J013J664K455K470J778J678K267J967L50o85L61K325L027
56323B62818J967L13p81q99j29J026J964K706L792N232O233O219N507M749M358
56308C05075M565N335O079O026M996L429J952J278J971L579M626M355L698L625
56294C60589L476K343R78O25P57%j252j269K02J705K538L354M318M662M248L738
56278C91012L086J795O50J118K976M620N756P539R787J0637R505Q016P304O731
56264D70532O009O204P533Q505Q503R081J1237J3309J3282J1685J0664J1253J2899
56251F00696J4647J5736J5837J5489J5454J5358J4188J2172J0668R910Q728O858
56239G55741N583N516N821O141P302R243J0444J0338J0228J0971J1916J3033J5666
$$ y = [243740, 241957, 242148, 243161, 244825, 247280, 249750, 251528, 253206, 255473, 257440, 257790, 257105, 257466, 259791, 262818, 264785, 265098, 264317, 263418, 263289, 264315, 266279, 268985, 272777, 278009, 284242, 290461, 295968, 300717, 305075, 309640, 314975, 321054, 327080, 332076, 335505, 337457, 338735, 340706, 344285, 348911, 353266, 356964, 360589, 364065, 366408, 367386, 368011, 368768, 368768, 367516, 366247, 366449, 368154, 370692, 374046, 378364, 383026, 387274, 391012, 394098, 395893, 396543, 397661, 400637, 405257, 411013, 418552, 428339, 438976, 448481, 456497, 463801, 470532, 476541, 482745, 490278, 498783, 507286, 516367, 527604, 540913, 554195, 565880, 576544, 587797, 600696, 615343, 631079, 646916, 662405, 677859, 693217, 707405, 719577, 730245, 740155, 748883, 755741, 761324, 766840, 772661, 778802, 786104, 795347, 805791, 816129, 826357, 837328, 849244, 862277, 877943]
56226H77943J9767K2858K3504K3679K5717K8808L0691L1317L2715L6127M0978
56215A194104M5922M9625N1605N3365N7560O4793P2554P8510Q3434Q9574R7445
56204A938491J05985J14863J24986J37011J50486J64252J77225J89260K01297
56195C303856K13926K26135K36572K45486K53512K59125K59746K55108K46800
56186E500266K34461K15824J90903J62732J32909J00049O4078K8512l597l2807
56176F593330o0132q3909j02466j17236j30351j41176j48077j51771j54329j56356
56166E347527j57562j58681j60639j62987j64965j66850j68659j69147j67615
56157C870422j65129j62593j59455j55519j51845j48449j43459j36134j28340
$$ y = [877943, 897710, 920568, 944072, 967751, 993468, 1022276, 1052967, 1084284, 1116999, 1153126, 1194104, 1240026, 1289651, 1341256, 1394621, 1452181, 1516974, 1589528, 1668038, 1751472, 1841046, 1938491, 2044476, 2159339, 2284325, 2421336, 2571822, 2736074, 2913299, 3102559, 3303856, 3517782, 3743917, 3980489, 4225975, 4479487, 4738612, 4998358, 5253466, 5500266, 5734727, 5950551, 6141454, 6304186, 6437095, 6537144, 6601222, 6629734, 6626137, 6593330, 6533198, 6449289, 6346823, 6229587, 6099236, 5958060, 5809983, 5658212, 5503883, 5347527, 5189965, 5031284, 4870645, 4707658, 4542693, 4375843, 4207184, 4038037, 3870422, 3705293, 3542700, 3383245, 3227726, 3075881, 2927432, 2783973, 2647839, 2519499]
56148B519499j21543j14848j07556j00818r4990q8340q0362p3359o8593o4077
56138A605013n8452n3640n0911m7713m1748l5149l1186k9469k7755k5909k4627
56127A178454k2856j9916j7718j7450j6649j3039q675o611o034m544k631j786
56115A040545o47K635O296P607P682R436J2612J4950J6433J8212J9259J8405J7784
56102A191209J9809K2519K2422K0210J9034J8922J7738J6067J6072J6768J5507
56091A396277J3234J3294J5803J7947J9286K2028K6513L0856L4687L9235M4359
56080A673519M9389N5938O5921P7855Q8834R8861J09203J18427J24261J27482
56070B589690J29276J26989J17740J04575R3647Q6688Q1222P6042P0771O2031
$$ y = [2519499, 2397956, 2283108, 2175552, 2074734, 1979744, 1891404, 1811042, 1737683, 1669090, 1605013, 1546561, 1492921, 1442010, 1394297, 1352549, 1317400, 1286214, 1256745, 1228990, 1203081, 1178454, 1155598, 1135682, 1117964, 1100514, 1083865, 1070826, 1062151, 1055540, 1049506, 1044962, 1042331, 1040545, 1039898, 1042533, 1048829, 1056436, 1064118, 1073554, 1086166, 1101116, 1117549, 1135761, 1155020, 1173425, 1191209, 1211018, 1233537, 1255959, 1276169, 1295203, 1314125, 1331863, 1347930, 1364002, 1380770, 1396277, 1409511, 1422805, 1438608, 1456555, 1475841, 1497869, 1524382, 1555238, 1589925, 1629160, 1673519, 1722908, 1778846, 1844767, 1922622, 2011456, 2110317, 2219520, 2337947, 2462208, 2589690, 2718966, 2845955, 2963695, 3068270, 3161917, 3248605, 3329827, 3405869, 3476640, 3538671]
56060C538671M6643K7551J0603l294j6830k9078l6796m1791m9537o0744p1327
56049C314071q0521r1563j04026j12806j15690j15228j12292j04646r3063q2155
56039B302081p3628o4656n4294m5485l9481l4021k8362k4513k2486j9713j6042
56028A879400j3941j3379j1933j0102j0624j2507j1911q961p465p830o912m734
56016A759101m424n305l391R84L326L193M733Q574J0885J1199J3240J7209J9216
56003A838540J9335K1956K7069K9578K8621K9057L2099L3115L0630K9006L0147
55992B149153L0895L0489L2112L5342L5795L4063L5912M1794M5462M4992M5522
55981B561531M8870N0524M9436N0570N4784N6500N4605N5281O0698O5344O6994
$$ y = [3538671, 3585314, 3612865, 3623468, 3620174, 3603344, 3574266, 3537470, 3495679, 3446142, 3385398, 3314071, 3233550, 3141987, 3037961, 2925155, 2809465, 2694237, 2581945, 2477299, 2384236, 2302081, 2228453, 2163797, 2109503, 2064018, 2024537, 1990516, 1962154, 1937641, 1915155, 1895442, 1879400, 1865459, 1852080, 1840147, 1830045, 1819421, 1806914, 1795003, 1786042, 1778577, 1770747, 1763835, 1759101, 1754677, 1749372, 1745981, 1746965, 1750291, 1753484, 1758217, 1766791, 1777676, 1788875, 1802115, 1819324, 1838540, 1857875, 1879831, 1906900, 1936478, 1965099, 1994156, 2026255, 2059370, 2090000, 2119006, 2149153, 2180048, 2210537, 2242649, 2277991, 2313786, 2347849, 2383761, 2425555, 2471017, 2516009, 2561531, 2610401, 2660925, 2710361, 2760931, 2815715, 2872215, 2926820, 2982101, 3042799, 3108143, 3175137]
55970C175137P0654P7835Q2852Q3790Q6280R2257R6074R5992R8335J05724J12551
55959D177481J16644J23648J34997J43673J47026J51884J61723J71069J77737
55950E505882J87750K02663K15279K23744K36166K55271K72655K84572K98858
55941G682840L19395L38809L53709L71644L95465M16916M33678M55877M87258
55932A1255591N17372N41687N71319O12934O57636P00299P50330Q11463Q70959
55923A7289590R21841R76221J043552J115977J188283J270643J367366J465423
55915B6638896J558761J660766J778194J898458K018609K159203K332458K526483
55907D2571828K739102K994236L304694L655637M048954M525098N114218N806727
$$ y = [3175137, 3245791, 3323626, 3406478, 3490268, 3576548, 3668805, 3764879, 3860871, 3959206, 4064930, 4177481, 4294125, 4417773, 4552770, 4696443, 4843469, 4995353, 5157076, 5328145, 5505882, 5693632, 5896295, 6111574, 6335318, 6571484, 6826755, 7099410, 7383982, 7682840, 8002235, 8341044, 8694753, 9066397, 9461862, 9878778, 10312456, 10768333, 11255591, 11772963, 12314650, 12885969, 13498903, 14156539, 14856838, 15607168, 16418631, 17289590, 18211431, 19187652, 20231204, 21347181, 22535464, 23806107, 25173473, 26638896, 28197657, 29858423, 31636617, 33535075, 35553684, 37712887, 40045345, 42571828, 45310930, 48305166, 51609860, 55265497, 59314451, 63839549, 68953767, 74760494]
55899G4760494O599205P521497Q588431R782532J1123749J2693379J4546383J6676906
55891A62292576J9120646K1987663K5314781K8995001L2898590L6749956L9513273
55884C66872486L9082147L3293470K1787860O826908p974997j9801791k7698157
55877D12387926l2072174l3739884l3461490l1889672k9539360k6765432k3845080
55870B01074834k1035248j8502041j6266608j4286307j2547591j1046408r743011
55863I7647620q594295p594032o740353n999654n339543m763897m280947l867143
55855E0467756l494134l163105k882282k636487k407589k201461k027500j872689
55847B9782509j721168j579634j459890j354794j253452j162027j088104j021439
$$ y = [74760494, 81359699, 88881196, 97469627, 107252159, 118375908, 131069287, 145615670, 162292576, 181413222, 203400885, 228715666, 257710667, 290609257, 327359213, 366872486, 405954633, 439248103, 461035963, 467862871, 459887874, 440086083, 412387926, 380315752, 346575868, 313114378, 281224706, 251685346, 224919914, 201074834, 180039586, 161537545, 145270937, 130984630, 118437039, 107390631, 97647620, 89053325, 81459293, 74718940, 68719286, 63379743, 58615846, 54334899, 50467756, 46973622, 43810517, 40928235, 38291748, 35884159, 33682698, 31655198, 29782509, 28061341, 26481707, 25021817, 23667023, 22413571, 21251544, 20163440, 19142001]
55839A9142001r50792q83919q31390p86147p37994o93144o60421o32180n97598
55830A2368416n61840n34118n09181m78197m46515m23479m05263l83876l62855
55821H263092l48297l34422l13612k91392k76469k64994k49146k32306k21228
55812E731226k11839j97359j82348j74389j69542j60237j50288j47838j49855
55803D187531j47626j41796j38366j35247j26347j14418j07101j04152j00386
55794C072092r7117r8913j02900j02683r9315r7832r6582r0633q2135p6787p3362
55783B053833o6932n9206n5405n3794m8416l9883l3966l1506k8629k4879k2790
55772A588427k1483j8677j6668j8727k2145k2261k0488k0952k2512k1790k0778
$$ y = [19142001, 18191209, 17307290, 16475900, 15689753, 14951759, 14258615, 13598194, 12966014, 12368416, 11806576, 11272458, 10763277, 10285080, 9838565, 9415086, 9009823, 8625947, 8263092, 7914795, 7580373, 7266761, 6975369, 6698900, 6433906, 6184760, 5952454, 5731226, 5519387, 5322028, 5139680, 4965291, 4795749, 4635512, 4485224, 4337386, 4187531, 4039905, 3898109, 3759743, 3624496, 3498149, 3383731, 3276630, 3172478, 3072092, 2974975, 2876062, 2773162, 2670479, 2571164, 2473332, 2376750, 2286117, 2203982, 2127195, 2053833, 1986901, 1927695, 1872290, 1818496, 1770080, 1730197, 1696231, 1664725, 1636096, 1611217, 1588427, 1566944, 1548267, 1531599, 1512872, 1490727, 1468466, 1447978, 1427026, 1404514, 1382724, 1361946]
55761A361946k3361k7282k7668k5805k6495k9222k9747k8004k6863k5565k2019
55750A069915j8983k0177k2679k0893j5837j2731j1680q733m249k020j506J050
55738I31477M807N294K419J84r08m020q931j1751j1599j1359j1875j1260r736
55725H62742r635j0943j1770j2364j3831j4312j1587p827o591o978o174n652q780
55712G36298j4085j7127j7601j8426j9239j7230j3330j1294j1355j0719r526j0336
55700E66030j2472j2730j1156j0529j0923j0364r780j1500j3786j2967j0215j0024
55688D29584j2466j3173j0904q944q793q338o718n606n149l678j734j599k850
55675C39632k980k048j978j961K50L228L465J472O90J041n52l559m133k160j714
$$ y = [1361946, 1338585, 1311303, 1283635, 1257830, 1231335, 1202113, 1172366, 1144362, 1117499, 1091934, 1069915, 1050932, 1030755, 1008076, 987183, 971346, 958615, 946935, 938202, 933953, 931933, 930427, 931477, 936284, 941578, 943997, 944181, 943273, 939253, 930322, 918571, 906972, 895613, 883738, 872478, 862742, 853107, 842164, 830394, 818030, 804199, 789887, 778300, 770473, 763882, 756904, 750730, 745078, 736298, 722213, 705086, 687485, 669059, 649820, 632590, 619260, 607966, 596611, 585892, 576366, 566030, 553558, 540828, 529672, 519143, 508220, 497856, 488076, 476576, 462790, 449823, 439608, 429584, 417118, 403945, 393041, 384097, 375304, 366966, 360248, 354642, 349493, 345815, 344081, 342482, 339632, 336652, 334604, 332626, 330665, 330915, 334143, 337608, 339080, 339770, 340811, 340259, 336700, 332567, 330407, 328693]
55660C28693l816m943l791l388m950n398k964l00J10p11j148j215o20J454L631
55645C00644L338J347J212L641N555N361M691M163K148j112k659j546l69p02r80
55630C24732o0R15J524L243O293Q722R539R597Q832O316L423K932M307L947R51
55615C95213j487j441q74j550k417k533k921l850l600j570M33J216J684K381K488
55600C81172K130K635L766L612J816P8p74j156m13K173M306K787j088k645q68
55585C97531K80j540l893m430m408n420o656p388q619j0406j0903r696q888r475
55571C06089r972r828j0580j2254j2474j0685r455r881r520o895m326m083n114
55558A91022n815o725q109q091n780l487l414m527m894m593m218l030p79Q01M31
$$ y = [328693, 324877, 319934, 316143, 312755, 307805, 302407, 299443, 299143, 299253, 298542, 297394, 296179, 295559, 297013, 300644, 303982, 305329, 306541, 310182, 315737, 321098, 325789, 329952, 332100, 330988, 328329, 326783, 326414, 325712, 324732, 324672, 325587, 327111, 330354, 336647, 345369, 354908, 364505, 373337, 379653, 383076, 386008, 390315, 394262, 395213, 393726, 392285, 391411, 389861, 387444, 384911, 381990, 378140, 374540, 372970, 373403, 374619, 376303, 378684, 381172, 383302, 385937, 389703, 393315, 395131, 395209, 394435, 393279, 392866, 395039, 399345, 402132, 401044, 398399, 397531, 397811, 396271, 392378, 387948, 383540, 378120, 371464, 364076, 355457, 345051, 334148, 324452, 315564, 306089, 296117, 286289, 275709, 263455, 250981, 240296, 230841, 220960, 211440, 204545, 200219, 196136, 191022, 185207, 178482, 170373, 162282, 156502, 153015, 149601, 145074, 140180, 135587, 131369, 128339, 127560, 128361, 128792]
55543A28792o78r06m29M6N87Q39k06k011k394p33J043J635J798J828O32j462k155
55526A26226q25K90o8l02N70R55Lm58O62J471M99p41q17r28k031k338m31J869
55508A23606K451K239K903L634L184K780L938N195M104J175j023j569j442j144
55494A50031n10j91j183l244n198o165n747m111k597k617l299k336O8P42j567
55479A12076l530j656K918O220O279M058J251p15p65P79K159K422K467L046L521
55464A40530L659M565O447P462O301M029K070M67o19p9J777K453P35j271j507
55449A77019j121k168m197n585o403p596q669q469p183n858m994m853n655o398
55435I7870n425l272k655m193m901k781k09k10j872k418j750j761k586k633j620
$$ y = [128792, 128114, 127208, 126779, 126825, 127412, 128251, 128045, 126034, 123640, 122907, 123950, 125585, 127383, 129211, 129843, 128381, 126226, 125401, 125691, 125623, 125321, 125891, 126846, 126849, 126391, 127053, 128524, 129023, 128282, 127465, 126537, 124506, 122168, 121737, 123606, 126057, 128296, 131199, 134833, 138017, 140797, 144735, 149930, 154034, 155209, 154186, 152617, 151175, 150031, 149521, 149330, 148147, 144903, 139705, 133540, 127793, 123682, 121085, 118468, 115169, 112833, 112901, 113643, 112076, 108546, 106890, 109808, 116028, 122307, 126365, 127616, 126901, 126136, 126915, 129074, 131496, 133963, 137009, 140530, 144189, 148754, 155201, 162663, 168964, 172993, 175063, 175530, 174911, 174832, 176609, 179062, 179797, 178526, 177019, 175898, 173730, 169533, 163948, 157545, 149949, 141280, 132811, 125628, 119770, 114776, 109923, 104268, 97870, 92445, 89173, 86518, 82325, 77424, 74643, 74434, 74224, 72352, 69934, 68184, 66423, 63837, 61204, 59584]
55420E9584q92j203k105k966l085j841l7L68p52q60J384L442K354r90l405l756
55404D5240l203k466j386l93j46k78j89l02j037j627j432j107j096n12R77J822
55388C2865R04n79j259j875l363m479l554j210O73J324P65j047k917k268J419
55373A5399M909N183L325K139J978J563R68Q72M27j217k673k483j914k666l428
55358B2382k001M96J052m99j594j101p7J061K745L961L074R18R2J033J541M34
55342C3517r02r47R6J187J408J73j954l049k133q82j240k463k617j791j349j153
55326A5901l42J38j048k435j404J351K433Q75o51l37L39l57j635j828q94j08m93
55309I505k000l227k124J498M644M125N75k381k550p70J332K731K483M74j279
$$ y = [59584, 58692, 57489, 55384, 52418, 49333, 47492, 47455, 47823, 47071, 46211, 47595, 51037, 53391, 52401, 48996, 45240, 42037, 39571, 38185, 37792, 37646, 37368, 37179, 36877, 35840, 34213, 32781, 31674, 30578, 30066, 31043, 32865, 33769, 33190, 31931, 30056, 26693, 22214, 18660, 17450, 18123, 19447, 20212, 19165, 16248, 13980, 15399, 20308, 25491, 28816, 30955, 32933, 34496, 35464, 36336, 36763, 35546, 32873, 30390, 28476, 25810, 22382, 20381, 20877, 21929, 21430, 19836, 18735, 18658, 19719, 22464, 26425, 29499, 30417, 30509, 31542, 33083, 33517, 32615, 31668, 31764, 32951, 34359, 34532, 32578, 29529, 27396, 26514, 25274, 22811, 20194, 18403, 17054, 15901, 15559, 15697, 14649, 12214, 10810, 12161, 14594, 15469, 14818, 14481, 14820, 14463, 12828, 11000, 10106, 9998, 9505, 7505, 4278, 2154, 3652, 8296, 12421, 12996, 10615, 8065, 7295, 8627, 11358, 13841, 14315, 13036]
55294A3036n71J586K025J60j124L6J740J379p54k401k381j275o2P11Q48L97m04
55277A2946j166j220j41J205J150l50j020O64K942L049R21j290k425k804k341
55262A0120p15R07Q50m35r17j01N61L95L17Q29J253J380J916K909L385K837J644
55245B7135L7j804k875k375j405j690k777k571p70N35O8q75o30O15J607J717J140
55228A5082L94nn5l91j182j401l44P85L17j242j690jK604M318M203K384J00q90
55210B2986j62O57J52q67r12j60L64P06J122O45j267k777j800P64K347K309J728
55193B5835P31j086k351j271J100K002J080M36P63N25r55k551l605m387m302k473
55177I491j11O51L04J188L208L787K401J555K360K724J205n73r49p66j201j621
$$ y = [13036, 12465, 14051, 16076, 16236, 15112, 15148, 16888, 18267, 17513, 15112, 12731, 11456, 11394, 12105, 12953, 13350, 12946, 11780, 10560, 10419, 11624, 12774, 12424, 11404, 12068, 15010, 18059, 18980, 17690, 15265, 12461, 10120, 9405, 10312, 11162, 10727, 9810, 9709, 10270, 10665, 10982, 11811, 13064, 14444, 16360, 19269, 22654, 25491, 27135, 27172, 25368, 22493, 20118, 18713, 17023, 14246, 11675, 10905, 11440, 11508, 10633, 10003, 10618, 12225, 13942, 15082, 15476, 15471, 15416, 15025, 13843, 12442, 12098, 12883, 13200, 11958, 10268, 10267, 12871, 17189, 21392, 23776, 23876, 22986, 22824, 23481, 23633, 22766, 21854, 21694, 22058, 22764, 23886, 24531, 23264, 20487, 18687, 19451, 21798, 24107, 25835, 26566, 25480, 23129, 21858, 22958, 24960, 26040, 26476, 27239, 27764, 26809, 24258, 20653, 16266, 11964, 9491, 9380, 10031, 10335, 11523, 14731, 18518, 20919, 22474, 24834, 27558, 28763, 28190, 27241, 26475, 25274, 23653]
55161B3653j273r32j236j299m39M32L80j10k74j07M60J754L151L284K020O33k34
55144B9863j034j675j438o33k36R1J268K311J330r53j749n14M50J47L13J866L223
55127C2630L334L125K788R13k204l704k358o61q11j600j318q36j379j769n14J342
55111B6978J934J506J391J509Q76m83j771k482k217p42R65J363N89J34K1j112
55095B8459k683k217K69J511J31j030J74J527M17j765k297j534j343j398k90J390
55079A9321K124K044J825P46j411k431n72K244L089K305K132K609K141R17M52
55064C7535N93M0q57p84j98n56j420j193j06L52L33J135K287K192J320J746L375
55047D5794L711J764m78j174q07m85j02Q66K133K952K669R27j666l239k388r5
$$ y = [23653, 22380, 21448, 20212, 18913, 18474, 18906, 19286, 19176, 18902, 18795, 19255, 21009, 24160, 27444, 29464, 30097, 29863, 28829, 27154, 25716, 25083, 24847, 24938, 26206, 28517, 29847, 28894, 27145, 26631, 27081, 27228, 27541, 29407, 32630, 35964, 39089, 41877, 42790, 40586, 36882, 34524, 33863, 33052, 31452, 30134, 29298, 27919, 26150, 25636, 26978, 28912, 30418, 31809, 33318, 34194, 33711, 31940, 29458, 27241, 26499, 27464, 28827, 29416, 29550, 29571, 28459, 25776, 23559, 23828, 25339, 25470, 24440, 24614, 26141, 26558, 24793, 22496, 20962, 19619, 18221, 17931, 19321, 21445, 23489, 25314, 26060, 24649, 22218, 21646, 23890, 26979, 29284, 31416, 34025, 36166, 37083, 37535, 38128, 38168, 37311, 36527, 36329, 35773, 34353, 33160, 33054, 33406, 33739, 34874, 37161, 39353, 40673, 42419, 45794, 49505, 51269, 50791, 49617, 48810, 48325, 48223, 49089, 51222, 54174, 56843, 57770, 56104, 52865, 50477, 50382]
55031E0382J360J135L41K05J049K590L888L543J369o86p55L96O26m48j305j035
55015F2655p3J170K616L635L485K602J995J606P16m03q32o55o82q02k20P79R59
54998G8551M3r34j224j141j231j632k071j865m70J174R79j502l825l748k287j813
54982E7004k273j827m13O9r51j818j448p16m44Q7J609L361M039L392K275J631
54966F3577J641J504K67j684k614j519N17J895K353K279J392k34j079O3J932K362
54950G2652J339N76P05J012J362K148K624J680K10L02J916K735J836J004J699
54935I3800K750K303L49j860l481m113l348j516q4k57j567k575k593k110j864
54920G3834j961j859j136r7O43J131K004L100L175J657o8j60J489L399M308M046
$$ y = [50382, 51742, 52877, 53218, 53423, 54472, 57062, 60950, 64493, 65862, 65176, 64421, 64817, 65443, 64995, 63690, 62655, 62582, 63752, 66368, 70003, 73488, 76090, 78085, 79691, 80407, 80004, 79172, 78517, 77835, 77033, 76813, 77592, 78551, 78594, 77660, 76436, 75295, 74064, 72432, 70361, 68496, 68026, 69200, 70179, 68677, 64852, 61104, 58817, 57004, 54731, 52904, 52491, 52560, 51609, 49791, 48343, 47627, 47183, 47270, 48879, 52240, 56279, 59671, 61946, 63577, 65218, 66722, 66989, 65305, 62691, 61172, 61689, 63584, 65937, 68216, 69608, 69374, 68295, 68358, 70290, 72652, 73991, 74567, 75272, 76284, 77646, 79794, 82418, 84098, 84308, 84610, 86526, 89261, 91097, 92101, 93800, 96550, 98853, 99202, 97342, 93861, 89748, 86400, 84884, 84800, 84543, 82976, 80401, 77808, 75698, 73834, 71873, 70014, 68878, 68781, 69424, 70555, 72559, 75659, 78834, 80491, 80423, 80263, 81752, 85151, 89459, 93505]
54904I3505L192K644K954L479L012J778J527K931M396M626M723O080P790Q197
54890A50834P773Q208R574J0679J1473J2814J4411J5359J6180J7888J9333J7948
54878C12474J3268P522K628j390m932p933j0671j3541j5775j6157j5122j4407
54866B35964j4480j4163j2915j1589j0694r616p946o068m220k366r56m24j13P37
54852A41151J417R56M29J880N139P970R261R875J0431J0646J1012J2515J4431
54839B37113J4778J3397J2154J1595J0083O913L608J066k148p178j2637j6331
54827B72413j7609j7021j5354j3856j3558j3522j1639q033n507n589o405n868
54815A38452m778m946o094o637o131n181l992k700k075k395k494j301N01J493
$$ y = [93505, 96697, 99341, 102295, 105774, 108786, 110564, 112091, 115022, 119418, 124044, 128767, 134847, 142637, 150834, 158607, 166815, 176389, 187068, 198541, 211355, 225766, 241125, 257305, 275193, 294526, 312474, 325742, 333264, 335892, 334502, 329570, 321637, 310966, 297425, 281650, 265493, 250371, 235964, 221484, 207321, 194406, 182817, 172123, 162507, 154561, 148493, 144273, 141907, 140951, 140527, 140414, 141151, 142568, 143524, 143953, 145833, 150972, 158942, 168203, 178078, 188509, 199155, 210167, 222682, 237113, 251891, 265288, 277442, 289037, 299120, 306033, 309641, 310707, 308559, 301381, 288744, 272413, 254804, 237783, 222429, 208573, 195015, 181493, 169854, 161821, 156314, 150725, 144320, 138452, 133674, 128728, 122634, 115997, 109866, 104685, 100693, 97993, 95918, 93523, 91029, 89728, 90229, 91722]
54801I1722J393P89N4m29m9R10R23p99k958l816l246k167j001K6J13j082k354
54784G8029k217r00J10K1p16j473k042k346k259j662m88R16J607J001j0o0O60
54767F8171P27r1n29l53j007k797l475j299K161M089M152M231N256O193N936M527
54751I5892K668J163P35J339J821J177L3K5J803M365O259O955P078P628Q850R872
54735A57663R775Q921Q510R081J0388J2530J5774J9115K0602J9627J7516J5326
54723C24828J2553Q722M689J252k113n969r472j1405j1750j1325j0817j0970j2391
54710B65832j4115j3676j0007n193k033r72p59q97j560k030j301J23R12J147K136
54695B17607M007N392N703O159P848J0082J1421J1536J1366J1995J3901J6806
$$ y = [91722, 93115, 93904, 93958, 93529, 93480, 94390, 95313, 94514, 91556, 87740, 84494, 82327, 81326, 81352, 81465, 80383, 78029, 75812, 74912, 75022, 75043, 74327, 72854, 70812, 68466, 66207, 64545, 64057, 64973, 66580, 67581, 67571, 67511, 68171, 68898, 68807, 68278, 67925, 66918, 64121, 60646, 59347, 61508, 65597, 69749, 73980, 79236, 85429, 91365, 95892, 98560, 99723, 100458, 101797, 103618, 104795, 104828, 104853, 106656, 111021, 117280, 124235, 131313, 138941, 147791, 157663, 167438, 176359, 184869, 193950, 204338, 216868, 232642, 251757, 272359, 291986, 309502, 324828, 337381, 346103, 350792, 352044, 349931, 343962, 334490, 323085, 311335, 300010, 289193, 278223, 265832, 251717, 238041, 228034, 222841, 220808, 219836, 219077, 218180, 216620, 214590, 213289, 213412, 214324, 215471, 217607, 221614, 227006, 232709, 238868, 246716, 256798, 268219, 279755, 291121, 303116, 317017, 333823]
54683C33823J9687K1133K0293J7536J4000J0392O546K306j669m628p042j0140
54671D22237j3835j6415j6990j6945j7624j7901j6038j3012j1613j2482j3521
54660B55861j3342j2774j2438j1429r437p864p474o967n307l647l422m136m573
54647A53051m665m629l773j927o06r38j687j196l9K73R5Q90K373K753J500j42
54631A41333j273k031k254j320L92J373P49q32k170k458j444L87J883K351K396
54616A37082K814L260K962K207J831J693J033J32K67J927M198N901O540O234N667
54601A83748N850P002P796O754M261K253K028L106M216M503L792K366P30o64j444
54586B36297j220n2J102J433J868M062P381Q823P137N096N973R220J1801J2624
$$ y = [333823, 353510, 374643, 394936, 412472, 426472, 436864, 443410, 445716, 444047, 439419, 432377, 422237, 408402, 391987, 374997, 358052, 340428, 322527, 306489, 293477, 281864, 269382, 255861, 242519, 229745, 217307, 205878, 196441, 188577, 181103, 174136, 168829, 165182, 161760, 157624, 153051, 148386, 143757, 139984, 138057, 137451, 136513, 134826, 133630, 133591, 133864, 133959, 134849, 137222, 139975, 141475, 141333, 140060, 138029, 135775, 134455, 134847, 136220, 136969, 136137, 133967, 131509, 130065, 130452, 132335, 134686, 137082, 139896, 143156, 146118, 148325, 150156, 151849, 152882, 153014, 153281, 155208, 159406, 165307, 171847, 178081, 183748, 189598, 196600, 204396, 211150, 215411, 217664, 219692, 222798, 227014, 231517, 235309, 237675, 238405, 237741, 236297, 235077, 235025, 236127, 237560, 239428, 243490, 250871, 259694, 266831, 271927, 277900, 287120, 298921, 311545]
54572C11545J3098J4037J4596J4338J4034J4018J3597J2515J1347R932P040K163
54560D52260l533q488j2043j4223j5409j6365j7582j8346j7514j5269j2996j1357
54548B89135r652p358n089l630l031k929l004k809k105j518j977l331m461m952
54534B33289n538o660p599p504o452n004l507k280j794k171k946l657m245m675
54520A69257m704m248l571l055l037l755m899n394m382k440j158j363k325k774
54506A22152k141q48P6k78j670k533j519P57K312K148J133L87j90j202k355k631
54490A13598j680m66k82j335k456k283p08J056J787J394O44K21K97P36J399K299
54474A14221L497M615M755L653K680L559N847O983N589L488L432N704Q277R566
$$ y = [311545, 324643, 338680, 353276, 367614, 381648, 395666, 409263, 421778, 433125, 443057, 450097, 452260, 448727, 440239, 428196, 413973, 398564, 382199, 364617, 346271, 328757, 313488, 300492, 289135, 279483, 272125, 267036, 263406, 260375, 257446, 254442, 251633, 249528, 248010, 246033, 242702, 238241, 233289, 227751, 221091, 213492, 205988, 199536, 194532, 191025, 188745, 186951, 184780, 181834, 178177, 173932, 169257, 164553, 160305, 156734, 153679, 150642, 146887, 141988, 136594, 132212, 129772, 128614, 127251, 124926, 122152, 120011, 119163, 119239, 118961, 117291, 114758, 113239, 113996, 116308, 118456, 119589, 119976, 119786, 118584, 116229, 113598, 111918, 111452, 111170, 109835, 107379, 105096, 104388, 105444, 107231, 108625, 109269, 109490, 109787, 110523, 111922, 114221, 117718, 122333, 127088, 130741, 133421, 136980, 142827, 149810, 155399, 158887, 162319, 168023, 176300, 185866]
54460A85866R650R017P677N786M150L555L915M230L262N76k854n415o489o897
54446B16029p509q223q698r145r659r554q322o618n456m831m028k812j686j306
54432A28182k110l838n076m213j500Q31J218M84J69M41O86Q94J118Q16J57P67
54416A19026L375N831N446K638K17k99L20J234K375L140K599J430J651L734N648
54401A58365N448L473J280l87j737k928l755l986l617k981k583k524k328j740
54387A40000j200j054j053j140j877l167l606k383q42p48j748k185j824j979l166
54372A12028m254m011k316j2J510J066q45k052j185O63J861K419K721J831n50
54357A08874j894L82M656O682N070K293M67o48j247m86J202J761O98P9J241K795
$$ y = [185866, 195516, 204533, 212210, 217996, 222146, 225701, 229616, 233846, 237108, 237684, 234830, 229415, 222926, 216029, 208520, 200297, 191599, 182454, 172795, 163241, 154919, 148301, 142845, 138014, 133986, 131174, 129488, 128182, 126072, 122234, 117158, 112945, 111445, 112276, 113494, 113978, 114147, 114588, 115274, 116168, 117286, 118102, 118259, 119026, 122401, 128232, 133678, 136316, 136533, 136234, 136554, 137788, 140163, 143303, 145902, 147332, 148983, 152717, 158365, 163813, 167286, 168566, 168179, 166442, 163514, 159759, 155773, 152156, 149175, 146592, 144068, 141740, 140000, 138800, 137746, 136693, 135553, 133676, 130509, 126903, 124520, 123678, 122930, 121182, 118997, 117173, 115194, 112028, 107774, 103763, 101447, 101435, 102945, 104011, 103166, 101114, 99929, 100592, 102453, 104872, 107593, 109424, 108874, 106980, 107362, 112018, 118700, 123770, 126063, 126530, 125882, 124635, 124149, 125351, 127112, 127810, 127889, 129130, 131925]
54341A31925L185L066L702M874N717O122O177N621M773M654N416O003N852N417
54327B02504M662K930O98n13n05n85r63m35O81J42k435m165l020q45l54j422k596
54310A93779l961n960p156o058l940l117l405k950j791j772l119l815k731j069
54296A42935q7O81K016L209K781N29j833k135J33L125M382L341J640R25J336K312
54280A65290L530M460M257L078K435L203M316M382L708L463L674L357K078L71
54266B11602j078j824j836j858k873m528n107l964k800l334m725m808l230j716
54252A67921j567k399l344m215n182o122o647o444n601m691m227m002l506k982
54238A06992l121l624l281j901p79n79j91J277K605J918p59l586m930m348k290
$$ y = [131925, 135110, 138176, 141878, 146752, 152469, 158591, 164768, 170389, 175162, 179816, 185232, 191235, 197087, 202504, 207166, 210096, 210794, 210281, 209776, 209191, 208228, 207793, 208474, 208616, 206181, 202016, 198996, 198151, 197797, 196375, 193779, 189818, 183858, 176702, 170644, 166704, 163587, 160182, 157232, 155441, 153669, 150550, 146735, 144004, 142935, 142848, 143529, 145545, 148754, 151535, 152064, 150231, 148096, 148229, 151354, 155736, 159077, 160717, 161642, 162978, 165290, 168820, 173280, 177537, 180615, 183050, 186253, 190569, 194951, 198659, 202122, 205796, 209153, 211231, 211602, 210524, 208700, 206864, 205006, 202133, 197605, 192498, 188534, 185734, 182400, 177675, 172867, 169637, 167921, 166354, 163955, 160611, 156396, 151214, 145092, 138445, 132001, 126400, 121709, 117482, 113480, 109974, 106992, 103871, 100247, 96966, 95065, 94286, 93707, 93516, 94793, 97398, 99316, 98557, 94971, 90041, 85693, 83403]
54223H3403J41J695K090K061J926J019p38k013j800q27j61L90J203J398J33j521
54207H8399j753n30N71P03M27L80N87R81J471J620J188O86N78M00l50j005n17
54190I3836R28K077K104J067o55k420l302k935k097j686j528r24K42J546K609
54175H8862K913J981M50PJ203K309J501o48k032j593R7J892K638J528p45k033
54159I8330j219K95P92P05J252J934J466L79J81N74j98k269l773l622k611j489
54143I0727m7J425J761P81l3L99J266J215J52j021j681j849j839j890j819j176
54127H6371r4M59L7l63K25R08J09j818k805j911k84R96K217L523L715J873p10
54110I2448j585q0J805J735j83j550p28J071J517M45j03Q48J764J106n19j931
$$ y = [83403, 83544, 85239, 87329, 89390, 91316, 92335, 91597, 89584, 87784, 86957, 86796, 87186, 88389, 89787, 89920, 88399, 86646, 86116, 86687, 87390, 87817, 88197, 88784, 89765, 91236, 92856, 94044, 94730, 95308, 95708, 95358, 94353, 93836, 94764, 96841, 98945, 100012, 99357, 96937, 93635, 90700, 88603, 86917, 85389, 84465, 84707, 86253, 88862, 91775, 93756, 94206, 94213, 95416, 97725, 99226, 98578, 96546, 94953, 95050, 96942, 99580, 101108, 100363, 98330, 97111, 97406, 98198, 98903, 100155, 102089, 103555, 103934, 104115, 104689, 104491, 102222, 98449, 94827, 92216, 90727, 90680, 92105, 93866, 94647, 94614, 95013, 96279, 97494, 97646, 96625, 94944, 93095, 91256, 89366, 87547, 86371, 86277, 86736, 86773, 86410, 86635, 87543, 87652, 85834, 83029, 81118, 80834, 81830, 84047, 87570, 91285, 93158, 92448, 90863, 90783, 92588, 94323, 94140, 92590, 91862, 92933, 94450, 94895, 94792, 95640, 97404, 98510, 97991, 96060]
54094I6060l324m923n257l007L77K102J571N27J29m0l81p04j120j708j581j62
54078G8559J001k3k296k933j398j31m84p95L17J326L41j541j536R71L548L438
54062G8364K98l545n050l145K69K432K610K049J564P75k82o80l01k55q88q91N57
54045G3881K141K138Q06j72N7Q05R62Rj587k503j580P45K499K228N33p93p23K89
54027G9735J193J533J763K357K760J911J11p29L96J853J486m31k004k625k930
54012H6379k409J66L724N038K889j26j127m09L3k43q6J053K446L147K804J764
53996A05043R29Q76R96L72m31J13J961L237L051K739L369L860K967J501R59J267
53980A32809J562K153L771N677O388N971N919O901Q017Q385Q176P941P884P960
$$ y = [96060, 92736, 87813, 82556, 79549, 79926, 82028, 83599, 84126, 84255, 84215, 83834, 83130, 82010, 80302, 78721, 78559, 79560, 79537, 77241, 74308, 72910, 72779, 72295, 71500, 71817, 73143, 73484, 71943, 70407, 71378, 74926, 78364, 78662, 75117, 70067, 66922, 67191, 69623, 72233, 74282, 75846, 76621, 76339, 75659, 75358, 75103, 74215, 73324, 73881, 76022, 78160, 78966, 78794, 78851, 79656, 80618, 80627, 79040, 76537, 74957, 75702, 78201, 80429, 80962, 80169, 79446, 79735, 80928, 82461, 84224, 86581, 89341, 91252, 91363, 90634, 91030, 92883, 94369, 93938, 91934, 89309, 86379, 83970, 84136, 87860, 92898, 95787, 95661, 94534, 94125, 94158, 93915, 93829, 94882, 97328, 100475, 103279, 105043, 105972, 106848, 107844, 108216, 107785, 107898, 109859, 113096, 116147, 118886, 122255, 126115, 129082, 130583, 131542, 132809, 134371, 136524, 140295, 145972, 152360, 158331, 164250, 171151, 179168, 187553, 195729, 203670, 211554, 219514]
53966B19514P972P537O479N206M248L731L650M267N592O884P273O638N406L871
53952B98268K214Q68K83M39Q25P55k94k152l754m155l743l668m058l985l267k964
53936B71612l515l825l095k326k868m383n434n417m845m228l748l593l632l226
53922B17477k194j521k207l750m662m262l132k095j501j323j318j171q83p39n90
53907A86129K84K108L871M268L002Q70r94j637q08N15Q64J9p17m59k7n05j405
53890A95378j344L8J840L161L738L692L488L821M786N508N272M634M634N285N678
53875B49609N338M717M487M952O017P188P868P920P713P363O557N372M522M222
53861C33845L620K034J24q20k77J456L761N654O044M955L838L964N118O567Q215
$$ y = [219514, 227486, 235023, 241502, 246708, 250956, 254687, 258337, 262604, 268196, 275080, 282353, 288991, 294397, 298268, 300482, 301350, 301633, 302072, 302897, 303652, 303358, 301206, 297452, 293297, 289554, 285886, 281828, 277843, 274576, 271612, 268097, 264272, 261177, 258851, 255983, 251600, 246166, 240749, 235904, 231676, 227928, 224335, 220703, 217477, 215283, 213762, 211555, 207805, 203143, 198881, 195749, 193654, 192153, 190830, 189512, 188341, 187458, 186719, 186129, 186413, 188521, 192392, 196660, 199662, 200532, 199538, 197901, 197093, 197608, 198472, 198491, 197774, 197315, 197288, 196783, 195378, 194034, 194072, 195912, 199073, 202811, 206503, 209991, 213812, 218598, 224106, 229378, 234012, 238646, 243931, 249609, 254947, 259664, 264151, 269103, 275120, 282308, 290176, 298096, 305809, 313172, 319729, 325101, 329623, 333845, 337465, 339499, 339623, 338803, 338526, 339982, 343743, 349397, 355441, 360396, 364234, 368198, 373316, 379883, 388098]
53846C88098R823J0220Q767O756N680M857K604n34j934o30J069N68j810l684l686
53831D26164k526j470j004j045j757l528o187q666r859r823r576r622r370q432
53817C43299p650p969q825q821p827p243p841q520p907o482o050p207q350p735
53803B34872n784m445m554n027m831m479m706m865l977k651k344l095l592l319
53789A77203k965k761k227j788k573m098m145j887O42J267K44j013k019k596j892
53774A49392K76K163J977K34j161j298n48M96J067K66j514k397j506l38q5N93
53758A47617K943M917L612j9k025q05J369K284K312K439K422J987J818K335K940
53743A76146L300L865M668N016M885N091N616N388M230L476M009N207O324P389
$$ y = [388098, 397921, 408141, 416908, 423664, 429344, 434201, 436805, 436271, 434337, 433707, 434776, 435344, 433534, 429850, 426164, 423638, 422168, 421164, 420119, 418362, 414834, 408647, 399981, 390122, 380299, 370723, 361101, 351731, 343299, 335649, 327680, 318855, 310034, 302207, 294964, 287123, 278603, 270696, 264214, 258164, 250957, 242607, 234872, 229088, 224643, 220089, 215062, 210231, 205752, 201046, 196181, 192204, 189553, 187209, 184114, 180522, 177203, 174238, 171477, 169250, 167462, 164889, 160791, 156646, 154759, 155401, 156668, 156912, 155899, 153880, 151284, 149392, 149668, 151831, 153808, 154042, 152881, 151583, 151035, 151531, 152598, 152864, 151350, 148953, 147447, 147109, 147024, 147617, 150560, 155477, 159089, 159070, 157045, 156240, 157609, 159893, 162205, 164644, 167066, 169053, 170871, 173206, 176146, 179446, 183311, 187979, 192995, 197880, 202971, 208587, 213975, 218205, 221681, 225690, 230897, 237221, 244610]
53729B44610Q119P671O249N325N377N002L410J981K181L149L018J493l11j766
53715B95508k870l227k408j089n17j030k031l173m497n615n843n196m486m320
53701B49206m531m628m290l520k699k493l245m471n184m793l571k278j320l27
53687B01856J171K528K146m57l280l729j720L41O63k45j279k391l570l619j487
53672A86928J804M070M522M271M333M322L424J811N96P34K231M109N045M281K311
53657B34792N38RL82L71o10j571j242j6L36q05j859j252L02J046Q76J149K163
53640B34609K682K148J575J670J740J296J253K337L483L206J838J043J534K465
53626B62879K884K692K253J952K180L005L785L700K791J954J842K167K198J648
$$ y = [244610, 252729, 260400, 266649, 271974, 277351, 282353, 285763, 287744, 289925, 293074, 296092, 297585, 297274, 295508, 292638, 289411, 287003, 285914, 285397, 284367, 282336, 279163, 274666, 269051, 263208, 258012, 253526, 249206, 244675, 240047, 235757, 232237, 229538, 227045, 223800, 219329, 214145, 209352, 205781, 203503, 202183, 201856, 203027, 205555, 207701, 207244, 203964, 200235, 198515, 198856, 199519, 199274, 197995, 195604, 192034, 188415, 186928, 188732, 192802, 197324, 201595, 205928, 210250, 213674, 215485, 216081, 216815, 219046, 223155, 228200, 232481, 234792, 235330, 235339, 235721, 236092, 235482, 233911, 232669, 232653, 232989, 232184, 230325, 229073, 229375, 230421, 231297, 232446, 234609, 237291, 239439, 241014, 242684, 244424, 245720, 246973, 249310, 252793, 255999, 257837, 258880, 260414, 262879, 265763, 268455, 270708, 272660, 274840, 277845, 281630, 285330, 288121, 290075, 291917, 294084, 296282, 297930]
53612B97930R40P17J099J485J289P41O51J360K385L068L031K074L88r75q59L78
53596C15702Q78m25k334k990k262j537j578j795j493q56l93k26k17k96l69k56
53580B99553K6K35K77M05Q37J399J653J306M26n93j188q06O87K630L716L074J401
53563C15038N13J387L005L737L443L329L929M371L967L372L442L820L661L262
53549C60276L861N826P964Q866Q279O917N460M217L397L172L380L610L791M419
53535D33435N868P597Q505Q171P299O709O353N763N015M651M737M655L795K158
53521E14711L20q29n65R84K681L453L313K909K434J623N75k12n38m55K90J843
53505E32537L325L399J905J57n79j70Q09J611J510N40J09J623M239N467M482L313
$$ y = [297930, 298870, 299587, 300686, 302171, 303460, 304201, 304852, 306212, 308597, 311665, 314696, 316770, 317158, 316183, 315324, 315702, 316580, 316155, 313821, 310831, 308569, 307032, 305454, 303659, 302166, 301310, 300917, 300691, 300474, 300178, 299809, 299553, 299579, 299814, 300091, 300496, 301333, 302732, 304385, 305691, 306117, 305524, 304336, 303530, 304217, 306847, 310563, 313637, 315038, 315551, 316938, 319943, 323680, 327123, 330452, 334381, 338752, 342719, 346091, 349533, 353353, 357014, 360276, 364137, 369963, 377927, 386793, 395072, 401989, 407449, 411666, 415063, 418235, 421615, 425225, 429016, 433435, 439303, 446900, 455405, 463576, 470875, 477584, 483937, 489700, 494715, 499366, 504103, 508758, 512553, 514711, 515031, 514202, 513637, 514621, 517302, 520755, 524068, 526977, 529411, 531034, 531609, 531397, 530859, 530404, 530694, 532537, 535862, 539261, 541166, 541323, 540744, 540574, 541383, 542994, 544504, 545044, 545153, 546776, 551015, 556482, 560964, 564277]
53489E64277L846N202N398M462M090M990O200O876P184P344P000N906M447L231
53475F40453K781L413M940O523P496Q148R055J0033J0552J0861J1591J2470J2676
53462G50992J2511J3376J5598J7601J8062J7811J8517K0190K1298K1125K0716
53451I47797K1243K2482K3493K4086K4829K5928K6972K7757K8756L0392L2359
53440A236094L4025L5165L5951L6534L7060L7884L9186M0401M0641L9885L9230
53429A652056L9672M0971M2029M2104M1327M0206L9017L7734L6392L5333L4990
53418B081831L5380L5903L5801L4760L3035L1190K9907K9657L0218L0694L0417
53407B438793K9562K8495K6817K3840J9822J5904J2708R780O679L841J854M44
$$ y = [564277, 568123, 573325, 578723, 583185, 587275, 592265, 598465, 605341, 612525, 619869, 626869, 632775, 637222, 640453, 643234, 646647, 651587, 658110, 665606, 673754, 682809, 692842, 703394, 714255, 725846, 738316, 750992, 763503, 776879, 792477, 810078, 828140, 845951, 864468, 884658, 905956, 927081, 947797, 969040, 991522, 1015015, 1039101, 1063930, 1089858, 1116830, 1144587, 1173343, 1203735, 1236094, 1270119, 1305284, 1341235, 1377769, 1414829, 1452713, 1491899, 1532300, 1572941, 1612826, 1652056, 1691728, 1732699, 1774728, 1816832, 1858159, 1898365, 1937382, 1975116, 2011508, 2046841, 2081831, 2117211, 2153114, 2188915, 2223675, 2256710, 2287900, 2317807, 2347464, 2377682, 2408376, 2438793, 2468355, 2496850, 2523667, 2547507, 2567329, 2583233, 2595941, 2605721, 2612400, 2616241, 2618095, 2618539]
53395B618539j336m070p516j0961j3841j6132j8222k0304k2061k3220k4168k5456
53383B431252k6915k7932k8492k9190l0212l1061l1397l1364l1013l0252k9562
53372B103862k9745l0593l0688k9109k6462k3720k0816j7097j2665q566n980n493
53360A862928o571p445o377l515p48O97J590K968M391N104N959Q583J2889J6996
53346A897449J9692K1692K4175K7120K9677L1566L3485L6221L9613M2449M3714
53335B246853M4017M5266M8579N2978N6586N8662N9817O0853O2213O4220O6859
53324B866903O9404P1117P2257P3684P5541P7176P8233P8890P8930P7719P5431
53313C695285P3325P2141P0861O7794O2606N6595N1242M6946M3112L8847L3516
$$ y = [2618539, 2617203, 2613133, 2605617, 2594656, 2580815, 2564683, 2546461, 2526157, 2504096, 2480876, 2456708, 2431252, 2404337, 2376405, 2347913, 2318723, 2288511, 2257450, 2226053, 2194689, 2163676, 2133424, 2103862, 2074117, 2043524, 2012836, 1983727, 1957265, 1933545, 1912729, 1895632, 1882967, 1874401, 1868421, 1862928, 1856357, 1848912, 1842535, 1839020, 1838272, 1838969, 1840559, 1843527, 1847918, 1853022, 1858981, 1867564, 1880453, 1897449, 1917141, 1938833, 1963008, 1990128, 2019805, 2051371, 2084856, 2121077, 2160690, 2203139, 2246853, 2290870, 2336136, 2384715, 2437693, 2494279, 2552941, 2612758, 2673611, 2735824, 2800044, 2866903, 2936307, 3007424, 3079681, 3153365, 3228906, 3306082, 3384315, 3463205, 3542135, 3619854, 3695285, 3768610, 3840751, 3911612, 3979406, 4042012, 4098607, 4149849, 4196795, 4239907, 4278754, 4312270]
53302D312270K7062K0095J3445P322J046o027j3363j9596k4235k8493l3864m0314
53290D215348m6568n1845n6277n9811o1874o2478o2613o3081o3874o5041o6919
53279C554967o8834o8901o6370o3125o1339o0582n8945n6473n5355n6549n8191
53268B880303n8077n6167n3730n1226m8282m4952m1928l9661l8019l6544l4645
53257B377072l1951k8889k6503k5247k4475k3579k2932k2999k3076k2001j9859
53246B105561j7864j6550j5156j3169j1322j0353r533p395l646M39L428M926N503
53233B014869O076P378R450J1619J3526J5994J9994K4759K7999K8567K7877K8048
53221B236156K9572L1548L3365L4890L5710L5401L4355L3180L1604K9123K6456
$$ y = [4312270, 4339332, 4359427, 4372872, 4380194, 4381240, 4375213, 4361850, 4342254, 4318019, 4289526, 4255662, 4215348, 4168780, 4116935, 4060658, 4000847, 3938973, 3876495, 3813882, 3750801, 3686927, 3621886, 3554967, 3486133, 3417232, 3350862, 3287737, 3226398, 3165816, 3106871, 3050398, 2995043, 2938494, 2880303, 2822226, 2766059, 2712329, 2661103, 2612821, 2567869, 2525941, 2486280, 2448261, 2411717, 2377072, 2345121, 2316232, 2289729, 2264482, 2240007, 2216428, 2193496, 2170497, 2147421, 2125420, 2105561, 2087697, 2071147, 2055991, 2042822, 2031500, 2021147, 2011614, 2004219, 2000573, 2001012, 2004440, 2009366, 2014869, 2020945, 2028323, 2037773, 2049392, 2062918, 2078912, 2098906, 2123665, 2151664, 2180231, 2208108, 2236156, 2265728, 2297276, 2330641, 2365531, 2401241, 2436642, 2470997, 2504177, 2535781, 2564904, 2591360]
53210B591360K4869K4134K2574J9322J5178J1072P193L984K203J291q06n090j0012
53197B707272j3538j5499j6883j7978j8725j9914k2398k5615k8229k9959l1452
53186B467082l2843l3689l4164l4947l6032l6788l7092l7324l7300l6436l5005
53175B075462l4007l3616l2857l1163k9264k8045k7353k6549k5631k5216k5564
53164A756197k6077k5795k4326k2313k0697j9595j8384j7077j6670j7503j8167
53153A529593j7215j5341j4495j5016j5179j3872j2332j2466j4451j6771j8173
53142A364282j8694j8961j9156j8897j8030j7185j7195j7897j8061j6920j5237
53131A168049j4316j4387j4784j5212j5891j6710j7383j8384k0414k2744k3317
$$ y = [2591360, 2616229, 2640363, 2662937, 2682259, 2697437, 2708509, 2715702, 2719686, 2721889, 2723180, 2722374, 2717284, 2707272, 2693734, 2678235, 2661352, 2643374, 2624649, 2604735, 2582337, 2556722, 2528493, 2498534, 2467082, 2434239, 2400550, 2366386, 2331439, 2295407, 2258619, 2221527, 2184203, 2146903, 2110467, 2075462, 2041455, 2007839, 1974982, 1943819, 1914555, 1886510, 1859157, 1832608, 1806977, 1781761, 1756197, 1730120, 1704325, 1679999, 1657686, 1636989, 1617394, 1599010, 1581933, 1565263, 1547760, 1529593, 1512378, 1497037, 1482542, 1467526, 1452347, 1438475, 1426143, 1413677, 1399226, 1382455, 1364282, 1345588, 1326627, 1307471, 1288574, 1270544, 1253359, 1236164, 1218267, 1200206, 1183286, 1168049, 1153733, 1139346, 1124562, 1109350, 1093459, 1076749, 1059366, 1040982, 1020568, 997824, 974507]
53120I74507k1295j8514j7440j8218j8763j7602j5640j4815j5597j6570j6346
53109G83707j5219j4435j4293j3952j3115j2730j3383j3866j2655j0257q856r423
53097F31523j0505j0309r041q317q801r414q950p664o798o907p397p728q315r531
53083E11846j0444r638p336n505n406o020n560l821k202j864k578l245l060k293
53069D42874k063k985m161m242l410l136l812m083l115k014k015k737l313l883
53055C97905m487l983j827J23l04k479l979m025l807l875l505k588j973j687q29
53040C58680N96J614K244L452M878M776K863J188J265K144K284J659R35N3j125
53025C87506j957j959j721j953k538l198m048m847m857m166m011m947n923n985
$$ y = [974507, 953212, 934698, 917258, 899040, 880277, 862675, 847035, 832220, 816623, 800053, 783707, 768488, 754053, 739760, 725808, 712693, 699963, 686580, 672714, 660059, 649802, 640946, 631523, 621018, 610709, 601668, 593351, 584550, 575136, 566186, 558522, 551724, 544817, 537420, 529692, 521377, 511846, 501402, 491764, 484428, 478923, 473517, 467497, 461937, 458116, 455914, 454050, 451472, 448227, 445167, 442874, 440811, 437826, 433665, 429423, 426013, 422877, 419065, 414982, 411867, 409853, 407838, 405101, 401788, 397905, 393418, 389435, 387608, 387731, 387427, 384948, 380969, 376944, 373137, 369262, 365757, 363169, 361196, 359509, 358680, 359276, 360890, 363134, 366586, 371464, 376240, 379103, 380291, 381556, 383700, 385984, 387643, 388578, 388631, 387506, 385549, 383590, 381869, 379916, 377378, 374180, 370132, 365285, 360428, 356262, 352251, 347304, 341381, 335396]
53011C35396n773o300p310p846p584o662n065l147j958k184l357m721n993o782
52997B60714o407n048l904l435k722j388o58j255j688l70J706K137L05k238l933
52982B31816m249l170j302j84q20k097k079o79L58Mj005j648j737j466j109j266
52966B09367k271l263l014j795j082j283j108K42J595J422lj037q57k09p4l23
52950A96307q0Q75J542Q75p64j875j533k37J150K373L249L098J769M42L26R37
52934B08454R30K93L51J506K374J668m1j154r63j49L42K55L2J30N71J122J795
52917B17516K683L328K861J276j19k13N07Q64P77J091J913K393K177J913K062
52902B41029K247K164K164K449K627K635L321N176P164P804P126O582O999P461
$$ y = [335396, 329623, 323323, 316013, 308167, 300583, 293921, 288856, 285709, 283751, 281567, 278210, 273489, 267496, 260714, 254307, 249259, 245355, 241920, 239198, 237810, 237152, 235897, 234209, 233839, 235545, 237682, 237987, 235749, 231816, 227567, 224397, 223095, 222911, 222091, 219994, 217915, 217236, 217594, 217598, 216593, 214945, 213208, 211742, 210633, 209367, 207096, 203833, 200819, 199024, 197942, 196659, 195551, 195793, 197388, 198810, 198807, 197770, 196913, 196704, 196630, 196307, 196227, 197102, 198644, 199519, 198755, 196880, 195347, 195110, 196260, 198633, 201882, 204980, 206749, 207191, 207517, 208454, 209384, 209677, 210028, 211534, 213908, 215576, 215535, 214381, 213418, 213269, 213611, 213866, 213898, 214028, 214599, 215721, 217516, 220199, 223527, 226388, 227664, 227545, 227332, 227839, 228703, 229480, 230571, 232484, 234877, 237054, 238967, 241029, 243276, 245440, 247604, 250053, 252680, 255315, 258636, 263812, 270976, 278780, 285906, 292488, 299487, 306948]
52888C06948O701M946L743M101N329N892N044L392K075J752K308L097L374K737
52874C61439J402j51j761l530n128n658m572k509q78o33j511k329k124j170p10
52859C30177j355k002j203N30R13j092l612m086k408p97q82k093k912k753k225
52844C04200k124k553k870k412j241l7Q27J619K494K919K442J550J110J196J184
52829C08304Q76Q34J528K623L291K985J911Q47L74J99m08j393j686o00J090J996
52813C22771J748J160J004J109O33j053l483n030m239j571R23J953K238K775L058
52798C23996K080L29o88m97J62Q75J853K696K440J115j6k80m10j004j336n09J061
52781C31867K338L176M155N259N585M524K563Q63L21J080K598M071M830M572L422
$$ y = [306948, 313649, 318595, 322338, 326439, 331768, 337660, 342704, 346096, 348171, 349923, 352231, 355328, 358702, 361439, 362841, 362690, 360929, 357399, 352271, 346613, 342041, 339532, 338654, 338021, 336510, 334181, 332057, 330887, 330177, 328822, 326820, 325617, 326147, 327060, 325968, 322356, 318270, 315862, 315065, 314183, 312090, 309178, 306425, 304200, 302076, 299523, 296653, 294241, 293000, 292963, 293790, 295409, 297903, 300822, 303264, 304814, 305924, 307120, 308304, 309180, 310014, 311542, 314165, 317456, 320441, 322352, 323199, 323573, 323772, 323364, 321971, 320285, 319685, 320775, 322771, 324519, 325679, 326683, 327792, 328425, 327372, 323889, 318859, 314620, 313049, 313972, 315925, 318163, 320938, 323996, 326076, 326405, 325717, 325220, 325382, 326257, 328110, 330806, 333246, 334361, 334345, 334065, 333655, 332651, 331315, 330806, 331867, 334205, 337381, 341536, 346795, 352380, 356904, 359467, 360330, 360651, 361731, 364329, 368400, 373230, 377802, 381224]
52766C81224K001J169J360K074K339J688N16m30p00l76nk83j426k868l784l908
52750C78591l681l728m447n829p306p925p109n212l185j865j804l181n328o778
52736C11213o596n442m583m187l489k468k058k580l092k832k310k355k841l212
52722B63168l527m099m560m266l468l097l350l427k936k607l044l452k569o49
52708B18117M60m86k609l986l757k555j359o81o90j252j738j582j259j946l785
52693A90892n190m564k277k64J41o68j497j755j805k254l194m062m246l659k655
52678A52943j615r55j310k919m717m942l046m55J004R14J37n13q55j119j639k451
52662A28462k844j906K9J233N54j072j869j456p60k18O29J768K160J067p89j880
$$ y = [381224, 383225, 384394, 385754, 387828, 390167, 391855, 392371, 391941, 391241, 390865, 390860, 390577, 389151, 386283, 382499, 378591, 374910, 371182, 366735, 360906, 353600, 345675, 338566, 333354, 330169, 328304, 326500, 323319, 317991, 311213, 304617, 299175, 294592, 290405, 286916, 284448, 282390, 279810, 276718, 273886, 271576, 269221, 266380, 263168, 259641, 255542, 250982, 246716, 243248, 240151, 236801, 233374, 230438, 227831, 224787, 221335, 218766, 218117, 218577, 218091, 215482, 211496, 207739, 205184, 203825, 203144, 202454, 201202, 199464, 197882, 196623, 194677, 190892, 185702, 181138, 178861, 178597, 178738, 178070, 176573, 174818, 173013, 170759, 167565, 163503, 159257, 155598, 152943, 151328, 150373, 149063, 146144, 141427, 136485, 133439, 132984, 133988, 134902, 135039, 134526, 133671, 132552, 130913, 128462, 125618, 123712, 123741, 124974, 125528, 124456, 122587, 121131, 120371, 120153, 120782, 122550, 124710, 125777, 124988, 123108]
52646A23108j356K94J753J966J001m1j48O15J345J326O55kn0N61J407K230L229
52629A37893M371M779L670J796Q24J160J544J168R35J898L643N084N843O000N412
52614A86020M309L574L437K835J083q00j601j667j883j977j452j132j937k980
52600A85829k898k390l215m979n402l897k559l011m260m499l460k144j449j666
52586A40000k395k686k086j531k027k819k431j248j138k411l258k603j409n57
52572A11401M03J510J495kj167m71J000J275K71o24p63n10o2O31J267J623K025
52555A19302K511K319J147K0j41M4m53j239j175j68R50J826K486K275M30k323
52539A27811m017l546j700k4N10j24j179j507n94P08J042K77k32O93K625L932
$$ y = [123108, 121752, 122046, 123799, 125765, 126766, 126725, 126577, 127192, 128537, 129863, 130518, 130516, 130466, 131027, 132434, 134664, 137893, 142264, 147043, 150713, 152509, 153333, 154493, 156037, 157205, 158140, 160038, 163681, 168765, 174608, 180608, 186020, 190329, 193903, 197340, 200175, 201258, 200458, 198857, 197190, 195307, 193330, 191878, 190746, 188809, 185829, 182931, 180541, 177326, 172347, 166945, 163048, 160489, 157478, 153218, 148719, 145259, 143115, 141666, 140000, 137605, 134919, 132833, 131302, 129275, 126456, 124025, 122777, 121639, 119228, 115970, 113367, 111958, 111401, 111804, 113314, 114809, 114807, 113640, 113169, 114169, 115444, 115715, 115091, 114328, 113818, 113756, 114387, 115654, 117277, 119302, 121813, 124132, 125279, 125299, 125158, 125202, 124749, 123510, 122335, 122167, 123117, 124943, 127429, 129704, 130134, 127811, 123794, 120248, 118548, 118524, 119034, 118910, 117731, 116224, 115630, 116338, 117380, 117657, 117425, 118118, 120743, 124675]
52523A24675L465J698K55K79J285J875J390N46L73J006J722J780J133O23J307
52508A43412L120M534M271L070K724L529L993L201J992J320Q43k3q17q03j84M33
52492A74615J009J662J956J502P63M81P82J355K018K446K088R26j51l63J30Q85
52476A92104J843K821L202K850K569K934L401L238K500J469J52q74k98K043M079
52461B24033L762J717K79M90J333J625J200M61o8K45J514K767K906K054J208Q43
52445B46369P81J034J626J787N95j467k666j985k50R22P55k18q43m65M66R38O16
52428B47995M1m73j220k024j829j94J688K472K382K494K939K950K116N72j438
52413B58471l182l345j622K21L34p07q34M82J849K285K144J706O50p26j300p89
$$ y = [124675, 128140, 129838, 130093, 130372, 131657, 133532, 134922, 135468, 135841, 136847, 138569, 140349, 141482, 142105, 143412, 146532, 151066, 155337, 158407, 161131, 164660, 168653, 171854, 173846, 175166, 176009, 175986, 175169, 174366, 174182, 174615, 175624, 177286, 179242, 180744, 181507, 181988, 182770, 184125, 186143, 188589, 190677, 191603, 191452, 191089, 191219, 192104, 193947, 196768, 199970, 202820, 205389, 208323, 211724, 214962, 217462, 218931, 219083, 218209, 217911, 219954, 224033, 227795, 229512, 229791, 230281, 231614, 233239, 234439, 234900, 234832, 235077, 236591, 239358, 242264, 244318, 245526, 246369, 247150, 248184, 249810, 251597, 252192, 250725, 248059, 246074, 245824, 246746, 247501, 247283, 246440, 245975, 246441, 247379, 247995, 248036, 247563, 246343, 244319, 242490, 242296, 243984, 246456, 248838, 251332, 254271, 257221, 259337, 259909, 258471, 255289, 251944, 250322, 250543, 250877, 250170, 249336, 249818, 251667, 253952, 256096, 257802, 258452, 257726, 256426, 255637]
52397B55637k09k37l32m7Q2k62k39R21K471K959K083R19M12L47K2n18m16P03J905
52378B66201K046J581K070L619M155K243n20j414j69R96N75o29j184q28k20N1
52362B78573j27k41N52K254L396K618N96p29o28ML65N07M21j29o75m32K58K80
52344B86863m04p73p35j271k310k386j117n1o5J06J487K813K593J692J832K535
52328B90809J916mr11N61K973L971K856P42r06j243k66J309K461K480J387j08
52312C08027j007p97rL11j34o07n07j10K26R48K671N022O847P286O295M369K324
52295C41155J050Q81J417K183L097L893L853K833K004K529L860M440L959L686
52281C80840M379N045M411K761J611J960L500N234O326O551O353O386O703O789
$$ y = [255637, 255428, 255191, 254859, 254812, 254894, 254632, 254393, 255314, 257785, 260744, 262827, 263746, 264158, 264505, 264527, 264009, 263593, 264296, 266201, 268247, 269828, 271898, 275517, 279672, 281915, 281395, 279981, 279812, 280808, 281383, 280754, 279570, 278742, 278522, 278573, 278446, 278205, 278757, 281011, 284407, 287025, 287621, 286892, 286264, 286268, 286633, 287140, 287561, 287432, 286757, 286325, 286583, 286863, 286459, 285686, 284951, 283680, 281370, 278984, 277867, 277816, 277751, 277857, 279344, 282157, 284750, 286442, 288274, 290809, 292725, 292721, 291810, 292371, 295344, 299315, 302171, 302913, 302007, 300764, 300498, 301807, 304268, 306748, 308135, 308027, 307020, 306223, 306214, 306525, 306391, 305784, 305277, 305167, 305393, 306341, 309012, 314034, 320881, 328167, 334462, 338831, 341155, 342205, 343086, 344503, 346686, 349783, 353676, 357529, 360362, 362366, 364895, 368755, 373195, 377154, 380840, 385219, 390264, 394675, 397436, 399047, 401007, 404507, 409741, 416067, 422618, 428971, 435357, 442060, 448849]
$$ [...]
##END NTUPLES=NMR SPECTRUM
##END=
