
##TITLE=AC1128_Armenia-Quindio-Murillo_5875120_c4Z1Euih5D
##JCAMPDX= 6.0         $$ Bruker NMR JCAMP-DX V2.0
##DATA TYPE= NMR SPECTRUM
##DATA CLASS= NTUPLES
##ORIGIN= BRUKER
##OWNER= Administrator
$$ 1.72 TOPSPIN		Version 2.1
$$ 2012-04-01 00:07:17.859 -0500  Administrator@TOPSPIN
$$ Compression mode = diff/dup
##.OBSERVE FREQUENCY= 400.13188235
##.OBSERVE NUCLEUS= ^1H
##.ACQUISITION MODE= SIMULTANEOUS (DQD)
##.ACQUISITION SCHEME= undefined
##.AVERAGES= 8
##.DIGITISER RES= 22
##SPECTROMETER/DATA SYSTEM= spect
##.PULSE SEQUENCE= zg30
##.SOLVENT NAME= COFFEE_meoh
##.SHIFT REFERENCE= INTERNAL, COFFEE_meoh, 1, 14.98061
##AUDIT TRAIL= $$ (NUMBER, WHEN, WHO, WHERE, PROCESS, VERSION, WHAT)
$$ ##TITLE= Audit trail, TOPSPIN		Version 2.1
$$ ##JCAMPDX= 5.01
$$ ##ORIGIN= Bruker BioSpin GmbH
$$ ##OWNER= Administrator
$$ $$ C:\Bruker\TOPSPIN/data/COFFEE/nmr/AC1128_Armenia-Quindio-Murillo_5875120_c4Z1Euih5D/10/pdata/1/auditp.txt
$$ ##AUDIT TRAIL=  $$ (NUMBER, WHEN, WHO, WHERE, PROCESS, VERSION, WHAT)
(   1,<2012-04-01 00:07:09.000 -0500>,<Administrator>,<TOPSPIN>,<go>,<TOPSPIN 2.1>,
      <created by zg
	started at 2012-04-01 00:06:01.859 -0500,
	POWCHK enabled, PULCHK disabled,
       configuration hash MD5:
       1A 1E CE 29 27 FD 77 03 67 4E F0 E3 C4 B2 CB 90
       data hash MD5: 64K
       EC 8F 87 EB 84 EF 92 F6 F9 CB 70 B4 BD 48 05 F6>)
(   2,<2012-04-01 00:07:12.953 -0500>,<Administrator>,<TOPSPIN>,<proc1d>,<TOPSPIN 2.1>,
      <Start of raw data processing
       efp LB = 0 FT_mod = 6 PKNL = 1 PHC0 = 0 PHC1 = 0 SI = 32K 
       data hash MD5: 32K
       E3 63 BF AD 2C 80 DA D8 2F 01 26 A2 DA FA 11 EB>)
(   3,<2012-04-01 00:07:13.312 -0500>,<Administrator>,<TOPSPIN>,<proc1d>,<TOPSPIN 2.1>,
      <pk PHC0 = 215.5518 PHC1 = 0 
       data hash MD5: 32K
       4C 86 17 1F 44 6E DF 12 11 BB F7 E6 36 9F 9B A8>)
(   4,<2012-04-01 00:07:13.406 -0500>,<Administrator>,<TOPSPIN>,<proc1d>,<TOPSPIN 2.1>,
      <abs ABSG = 1 
       data hash MD5: 32K
       7D 9A E9 AE 53 06 34 B5 30 1D 02 31 11 A6 67 C6>)
(   5,<2012-04-01 00:07:13.625 -0500>,<Administrator>,<TOPSPIN>,<proc1d>,<TOPSPIN 2.1>,
      <abs ABSG = 2 
       data hash MD5: 32K
       69 E7 A6 82 DC C2 BE 8C BF 6B 67 00 9B 1A 25 EB>)
(   6,<2012-04-01 00:07:13.656 -0500>,<Administrator>,<TOPSPIN>,<proc1d>,<TOPSPIN 2.1>,
      <abs ABSG = 3 
       data hash MD5: 32K
       B4 C8 1E D0 95 50 61 C6 67 5A 86 9C 22 3D 66 02>)
(   7,<2012-04-01 00:07:13.703 -0500>,<Administrator>,<TOPSPIN>,<proc1d>,<TOPSPIN 2.1>,
      <abs ABSG = 4 
       data hash MD5: 32K
       DC 75 F2 86 4D 5F 63 53 03 5D 84 3D F9 A4 6B 8C>)
(   8,<2012-04-01 00:07:13.734 -0500>,<Administrator>,<TOPSPIN>,<proc1d>,<TOPSPIN 2.1>,
      <abs ABSG = 5 
       data hash MD5: 32K
       AD 96 13 6A 30 AE 5A BE D6 27 44 AE C6 F7 10 9D>)
$$ ##END=
$$ 
$$ $$ hash MD5
$$ $$ BB D6 81 3E EA C9 67 3E 5A FA 57 85 E1 93 E1 45
##$RELAX= 
##$RELAX= 
##$RELAX= 
##$RELAX= 
##$RELAX= 
##$RELAX= 
##$RELAX= 
$$ Bruker specific parameters
$$ [...]
150 150 150 150 150 150 150 150
##$TP07= 0
##$TPNAME0= <>
##$TPNAME1= <>
##$TPNAME2= <>
##$TPNAME3= <>
##$TPNAME4= <>
##$TPNAME5= <>
##$TPNAME6= <>
##$TPNAME7= <>
##$TPOAL= (0..7)
0.5 0.5 0.5 0.5 0.5 0.5 0.5 0.5
##$TPOFFS= (0..7)
0 0 0 0 0 0 0 0
##$TUNHIN= 0
##$TUNHOUT= 0
##$TUNXOUT= 0
##$USERA1= <user>
##$USERA2= <user>
##$USERA3= <user>
##$USERA4= <user>
##$USERA5= <user>
##$V9= 5
##$VALIST= <valist>
##$VCLIST= <CCCCCCCCCCCCCCC>
##$VD= 0
##$VDLIST= <DDDDDDDDDDDDDDD>
##$VPLIST= <PPPPPPPPPPPPPPP>
##$VTLIST= <TTTTTTTTTTTTTTT>
##$WBST= 2048
##$WBSW= 25
##$XGAIN= (0..3)
0 0 0 0
##$XL= 0
##$YL= 0
##$YMAX_a= 535760
##$YMIN_a= -642416
##$ZGOPTNS= <>
##$ZL1= 120
##$ZL2= 120
##$ZL3= 120
##$ZL4= 120
##$ABSF1= 14.98061
##$ABSF2= -5.57192
##$ABSG= 5
##$ABSL= 3
##$ALPHA= 0
##$AQORDER= 0
##$ASSFAC= 0
##$ASSFACI= 0
##$ASSFACX= 0
##$ASSWID= 0
##$AUNMP= <proc_prof1d_extract_pilot.lims>
##$AXLEFT= 0
##$AXNAME= <>
##$AXNUC= <1H>
##$AXRIGHT= 0
##$AXTYPE= 0
##$AXUNIT= <>
##$AZFE= 0.1
##$AZFW= 0.1
##$BCFW= 0
##$BC_mod= 0
##$BYTORDP= 0
##$COROFFS= 0
##$CY= 15
##$DATMOD= 1
##$DC= 0
##$DFILT= <>
##$DTYPP= 0
##$F1P= 0
##$F2P= 0
##$FCOR= 0.5
##$FTSIZE= 32768
##$FT_mod= 6
##$GAMMA= 0
##$GB= 0
##$INTBC= 1
##$INTSCL= 1
##$ISEN= 128
##$LB= 0
##$LEV0= 0
##$LPBIN= 0
##$MAXI= 10000
##$MC2= 0
##$MEAN= 0
##$ME_mod= 0
##$MI= 0
##$NCOEF= 0
##$NC_proc= -8
##$NLEV= 6
##$NOISF1= 0
##$NOISF2= 0
##$NSP= 0
##$NTH_PI= 0
##$NZP= 0
##$OFFSET= 14.98061
##$PC= 1
##$PHC0= 215.5518
##$PHC1= 0
##$PH_mod= 1
##$PKNL= yes
##$PPARMOD= 0
##$PPDIAG= 0
##$PPIPTYP= 0
##$PPMPNUM= 2147483647
##$PPRESOL= 1
##$PSCAL= 4
##$PSIGN= 0
##$PYNMP= <proc.py>
##$REVERSE= no
##$SF= 400.13
##$SI= 32768
##$SIGF1= 0
##$SIGF2= 0
##$SINO= 400
##$SIOLD= 32768
##$SPECTYP= <>
##$SREGLST= <1H.CDCl3>
##$SSB= 0
##$STSI= 32768
##$STSR= 0
##$SW_p= 8223.68421052632
##$SYMM= 0
##$S_DEV= 0
##$TDeff= 65536
##$TDoff= 0
##$TI= <>
##$TILT= no
##$TM1= 0
##$TM2= 0
##$TOPLEV= 0
##$USERP1= <user>
##$USERP2= <user>
##$USERP3= <user>
##$USERP4= <user>
##$USERP5= <user>
##$WDW= 1
##$XDIM= 32768
##$YMAX_p= 480776745
##$YMIN_p= -661160
##$CURPLOT= <Network HP LaserJet P1505>
##$CURPRIN= <$Network HP LaserJet P1505>
##$DFORMAT= <normdp>
##$LAYOUT= <+/1D_H.xwp>
##$LFORMAT= <normlp>
##$PFORMAT= <normpl>
##$SURQMSG= 1
$$ End of Bruker specific parameters
$$ ---------------------------------
##NTUPLES= NMR SPECTRUM
##VAR_NAME=  FREQUENCY,     SPECTRUM/REAL,   SPECTRUM/IMAG
##SYMBOL=    X,             R,               I
##VAR_TYPE=  INDEPENDENT,   DEPENDENT,       DEPENDENT
##VAR_FORM=  AFFN,          ASDF,            ASDF
##VAR_DIM=   32768,         32768,           32768
##UNITS=     HZ,            ARBITRARY UNITS, ARBITRARY UNITS
##FACTOR=    0.250966925370066, 1,           1
##FIRST=     8223.43324360095, -376345,      -116582
##LAST=      0,             -273901,         -154082
##MIN=       0,             -661160,         0
##MAX=       8223.43324360095, 480776745,    0
$$ Real data points
##PAGE= N=1
##DATA TABLE= (X++(R..R)), XYDATA
$$ [...]
19419d97455A50661h1479k11576h5337j9847j04456Q9850F3072J95675L913I530
19407e0546l34078a43547a5621A44171a93447l07033d7486j98096L1943f602A77914
19395b36960Q5701E0675J29054a8512j76315A0802c54760f5749A2409b65053A25524
19383a93109D60541d0840j82781A17551D749b00751j13271B59834a12509N838
19373a06671j1250j13768B203L3118a4910l7037q8244k24628a31642l0629l4403
19362a96674A02650J25622a01493j02183A13187c0935A69910b31556n2346J30235
19352a53667B17613a17419N151m70798C0937c2388B8146b52079c9753G3043J02154
19341A75197a56007m2296e5410J9552E1084d4649P439F1594b37117j227C553K28163
$$ plain form
19419 -497455 150661 -81479 -293055 -85337 -105184 -209640 -119790 63072 258747 262660 9530
19407 -50546 -384624 -143547 -15621 144171 -193447 -500480 -47486 -245582 -213639 -6602 177914
19395 -236960 -151259 50675 179729 -18512 -194827 10802 -354760 -65749 12409 -265053 125524
19383 -193109 460541 -40840 -223621 117551 4749 -200751 -314022 259834 -112509 -106671
19373 -106671 -117921 -231689 2203 35321 -14910 -51947 -140191 -364819 -131642 -162271 -196674
19362 -196674 102650 228272 -101493 -203676 113187 -30935 169910 -231556 -283902 -153667
19352 -153667 217613 -117419 -112268 -583066 30937 -32388 28146 -252079 -39753 73043 175197
19341 175197 -156007 -198303 -55410 -35858 51084 -44649 -37210 61594 -237117 -238344 3553 231716
19329B31716C5498G411a80593K7602O5538A4834b62831B30760d434I4230b49876
19317d1674o5015n2894k69059a45443C8165c34231R1534m1999a06098d0327J9190
19306b1137k40781K5206b219A11076c71339F779b67789a27051J5115A70377C9311
19294d86227h4909A52194a11774A13724B8144a2878l25697D4164J24598c97493
19283b74268G2820b25389J05665G6506R30a46450A9503J8313Q6348a14868p6639
19272a91507B01920b40723L7094H4556c52045b7859q0686I1054a86941m0589B1345
19260a06292A65266a57895j64587J367J00871l10153a43387g551k9637E6307K8207
19249H4514C9442N4143a36510A34337a59012C23129c37258B12857g4291A20341
$$ plain form
19329 231716 35498 7411 -180593 -152991 -87453 14834 -262831 230760 -4434 94230 -249876
19317 -41674 -106689 -159583 -428642 -145443 38165 -334231 -242697 -284696 -106098 -40327 -21137
19306 -21137 -261918 -236712 -2219 111076 -371339 6779 -267789 -127051 -111936 170377 39311
19294 -486227 -84909 152194 -111774 113724 28144 -12878 -338575 44164 168762 -397493
19283 -274268 72820 -225389 -119724 76506 77436 -146450 19503 37816 124164 -114868 -191507
19272 -191507 201920 -240723 -203629 84556 -352045 -27859 -108545 91054 -186941 -227530 21345
19260 -106292 165266 -157895 -322482 -321115 -220244 -530397 -143387 -7551 -37188 56307 84514
19249 84514 39442 93585 -136510 134337 -159012 323129 -337258 212857 -74291 120341
19238A23735E7495a85730i1492A5795R0433g0191A20802P2187e1561A36299F1981
19226e9435n3310j41024R9158k30325g7785k27136H5963f6520G6104c0511n509
19215c6020n20813B12296h4030J9593j42951A1425c08530i418n5059j22633j72249
19204c59359b3101l38251K6918A28280J99027A42984a88841A95439i7077q0531
19194a77608G9557a50668k4621e9287C05085a87703A35122E7231L2831a66549
19183e8716m2099C5207J43117a53528k090k52617c2316n1958j64195I318g6130
19171f4314k5545k16689a06536D6433e3927G4755K8788a95546P9379j06831A44761
19159h8848B96882a5599o1713l84047A31835M93774A85856b16599I2741c04146
$$ plain form
19238 123735 57495 -185730 -91492 15795 106228 -70191 120802 192989 -51561 136299 61981
19226 -59435 -112745 -253769 -154611 -384936 -77785 -304921 85963 -66520 76104 -30511 -36020
19215 -36020 -556833 212296 -84030 -64437 -207388 11425 -308530 -9418 -64477 -187110 -359359
19204 -359359 -23101 -361352 -334434 128280 327307 142984 -188841 195439 -97077 -177608
19194 -177608 79557 -150668 -175289 -59287 305085 -187703 135122 57231 90062 -166549
19183 -58716 -100815 35207 178324 -153528 -155618 -408235 -32316 -84274 -248469 9318 -76130
19171 -64314 -89859 -306548 -106536 46433 -53927 74755 103543 -195546 -116167 -222998 144761
19159 -88848 296882 -15599 -77312 -461359 131835 625609 185856 -216599 92741 -304146
19148a10508C41530a57233O1564l30735A37237j1136c0247C0091c2360j15168
19138a47528O4644p153A5924n155b9987j61606B8047a56921g1294B46043J5900
19127B61943b12565A19013a05797d2305B37545a52254l63559a03528D1536M9166
19117I0702c77584A41744J93458A31091d3728B72870b06038m230J9358B41396
19106B89048h3893k8091d203A2310e1591B29001b07699r6126D5774a30718r2825
19095b23543g0642I6613a08220l2584A32390b45479A74966k0067a27268A5505
19084a44150M1813j7845I5204k990K78897a37452B57954f5359n35928A23760A6205
19072c19431B3482d9093K778N390k05039i2337c1444J3722C5890l368b25933A5118
$$ plain form
19148 -110508 341530 -157233 -95669 -426404 137237 126101 -30247 30091 -32360 -147528
19138 -147528 -82884 -90037 15924 10769 -29987 -191593 28047 -156921 -71294 246043 261943
19127 261943 -212565 119013 -105797 -42305 237545 -152254 -515813 -103528 41536 90702
19117 90702 -377584 141744 335202 131091 -43728 272870 -206038 -210268 -190910 241396
19106 289048 -83893 -111984 -4203 12310 -51591 229001 -207699 -303825 45774 -130718 -223543
19095 -223543 -70642 96613 -108220 -140804 132390 -245479 174966 154899 -127268 15505
19084 -144150 -102337 -120182 95204 92214 371111 -137452 257954 -65359 -601287 123760 16205
19072 -319431 23482 -49093 -46315 -40925 -245964 -92337 -31444 -17722 35890 32522 -225933 15118
19059A98634i3017f368q5566A19884B0995L05993f1873j6236B30629b69803A54010
19047d7773A2414K46984g0611F9341b1902n04510a79775j1520h451p0461H6206
19035c38831J6324R1161j0477A57620a90730j1097i4333b5401I8260R4560E2501
19023a55426B6921a08424o9852M9710K5259a7496A52089a07458e2634L668N970
19012d2996B10039a33826m6088A87374a51024F531d4324i671k3101l1797B71792
19000B40096a8963k17870g8406B99988F4577c4152l5981h101n7732A98621B5733
18988D08385A84630b39017D0565b57720A50538D0265a32454j56962M3812H0396
18977i9346K9077A0663a20570K3196E7606a38055f1510j09147N3194o9172K5719
$$ plain form
19059 198634 -93017 -6368 -91934 119884 20995 326988 -61873 -78109 230629 -269803 154010
19047 -47773 12414 259398 -70611 69341 -21902 -526412 -179775 -191295 -8451 -78912 86206
19035 -338831 -322507 -231346 -241823 157620 -190730 -201827 -94333 -25401 98260 192820 52501
19023 -155426 26921 -108424 -178276 -128566 -103307 -17496 152089 -107458 -52634 -48966 -42996
19012 -42996 210039 -133826 -179914 187374 -151024 6531 -44324 -9671 -32772 -64569 271792
19000 240096 -18963 -236833 -78406 299988 64577 -34152 -70133 -8101 -65833 198621 25733
18988 408385 184630 -239017 40565 -257720 150538 40265 -132454 -289416 -245604 80396
18977 -99346 -70269 10663 -120570 -97374 57606 -138055 -61510 -170657 -117463 -186635 -160916
18966a60916m5132c8326B02661H8059K12753c6050B74814J23379j84548L39708
18956E53353G1537J37884a41484A6508i1343M722A17428B8608h138l89396A38338
18944a23013L1676C0594a00861B5622j2319a34283H7900c02360B63653f880m32199
18933d39079A8267a69922B2764a26535K9224k06557a15460l5451e6285m4219A57914
18921D0847d10344B28827n8693J13587d0596A59731a52171I128K7910a10013I4293
18909C5843j5471J07316E9501j2831f3187j48099N5522H7540a44401F1248a66603
18897A24752E1667J54312J35918J19565O2052j47598i7176A05865a57599l2382
18887a89981n5485A5917a87183n7583A39937a25255A09835f0022j34331J6697
$$ plain form
18966 -160916 -206048 -38326 202661 88059 300812 -36050 274814 398193 213645 553353
18956 553353 71537 209421 -141484 16508 -91343 -86621 117428 28608 -8138 -397534 138338
18944 -123013 -91337 30594 -100861 25622 13303 -134283 87900 -302360 263653 -6880 -439079
18933 -439079 18267 -169922 22764 -126535 -97311 -303868 -115460 -150911 -56285 -100504 157914
18921 40847 -410344 228827 170134 283721 -40596 159731 -152171 9128 37038 -110013 94293
18909 35843 20372 127688 59501 46670 -63187 -211286 -155764 87540 -144401 61248 -166603
18897 124752 51667 205979 341897 461462 523514 375916 -97176 105865 -157599 -189981
18887 -189981 -245466 15917 -187183 -244766 139937 -125255 109835 -60022 -194353 -177656
18877a77656b4485l6412H0287k8363N0070a29649p1669A47500a94136N8742k54630
18866c90024a76641A33542b01069b4862j3740Q060r8771p371A96327g226j20035
18855a27261F356b3306j91612K112p4590F3184A4109J38609E4618e7199j33257
18844a90456A80889c89447a34270l75259c5900k32519R921B63511c5755E4793
18833A43379c47425A64573f1656k98588d0954A88288m5716b1712B01248o6578
18823A34670b02206A33963n5096c61373b340j6180r4547A88341r0385Q8847a51763
18811F8602b71600e7722j26856k2758A49604b60817i6445A30595K59064p0638
18801C19021C8875g922j11736E1814Q8481m9429J06246d9124I6549b18008A06729
$$ plain form
18877 -177656 -24485 -60897 80287 51924 101994 -129649 -201318 147500 -194136 -135394 -390024
18866 -390024 -176641 133542 -201069 -24862 -38602 -30542 -129313 -136684 196327 -7226 -127261
18855 -127261 6356 -23306 -214918 -212806 -287396 63184 14109 152718 54618 -57199 -190456
18844 -190456 180889 -389447 -134270 -509529 -35900 -268419 -258498 263511 -35755 54793
18833 143379 -347425 164573 -61656 -360244 -40954 188288 142572 -21712 201248 134670
18823 134670 -202206 133963 78867 -361373 -2340 -18520 -113067 188341 97956 186803 -151763
18811 68602 -271600 -57722 -184578 -207336 149604 -260817 -96445 130595 389659 319021
18801 319021 38875 -7922 -119658 51814 140295 90866 197112 -49124 96549 -218008 106729
18789E4992b07108B78717h7937j85782h363A85419b39640j14130I9359a34915
18778c89595A13233f5529B26621b5701H4649J71892A27694j0784B6294b25117
18767b72417A79600D2021e1465m4524j24547j49734M2909C6436a23639d0469k59351
18756b99820Q2755j4484j46806a67869b2527j81554i8775b311k6176j9266q48
18745d8601H4986b23172Q4168d7161j29056P5109D273N3446L98149f1009B46111
18733a7765j04314C2476d1959A54156L7299l0932c72661f3027k1886A8119a26390
18721a54856j8381H4694L4263b82770J26079n9321H3874I174c30755J06582F2383
18709A93041K5186Q0564d58638E5414h0188A4091a5710C3483r490a92935B6701
$$ plain form
18789 54992 -207108 278717 -87937 -273719 -8363 185419 -239640 -353770 99359 -134915
18778 -389595 113233 -65529 226621 -25701 84649 256541 127694 116910 26294 -225117
18767 -272417 179600 42021 -51465 -95989 -220536 -370270 -327361 36436 -123639 -40469 -299820
18756 -299820 -217065 -231549 -378355 -167869 -22527 -204081 -98775 -2311 -28487 -47753 -48601
18745 -48601 84986 -223172 -139004 -47161 -176217 -101108 4273 57719 455868 -61009 246111
18733 -17765 -122079 32476 -41959 154156 191455 160523 -372661 -63027 -84913 18119 -126390
18721 -154856 -173237 84694 118957 -282770 -156691 -216012 83874 9174 -330755 -224173 62383
18709 193041 218227 298791 -458638 55414 -80188 14091 -15710 33483 23993 -192935 26701
18697b28742A3356b71639G3843O0094J26984c5491J6270B1489J3391b19890m629
18686b24519D60999k09579a56171A07293b43695j72645a71885l42250b04401c1263
18675A3830f61n3803j25226A3030a28940J6516d877m6398j53660G4460J45770
18664B20230H2649m303k5408e8008j92041J2773h7058A35732k0943c04227E1191
18652A09382a1474F5456a12008A69280Q9286m5176a4800j97984k6075f9390A16420
18640B39393B1841N1885K65414F3549b0752k40025A04607C1735b32957A4793L6460
18629E1253J61422g8454J3044A80699a54050n9395d5315j95658a24j9981B14925
18617B28057f4410k26097E9791a27144f720o2652j16793I4586a72432d3094I2726
$$ plain form
18697 -228742 13356 -271639 73843 133937 260921 -35491 -19221 21489 34880 -219890 -224519
18686 -224519 460999 251420 -156171 107293 -243695 -416340 -171885 -514135 -204401 -31263
18675 13830 -661 -54464 -179690 13030 -128940 -112424 -4877 -51275 -204935 74460 220230
18664 220230 82649 78346 52938 -58008 -250049 -237276 -87058 135732 114789 -304227 51191
18652 109382 -11474 65456 -112008 169280 258566 213390 -14800 -212784 -238859 -69390 116420
18640 239393 21841 73726 339140 63549 -20752 -260777 104607 31735 -232957 14793 51253
18629 51253 212675 -78454 -65410 180699 -154050 -213445 -45315 -240973 -124 -20105 214925
18617 228057 -64410 -290507 59791 -127144 -6720 -69372 -186165 94586 -172432 -43094 92726
18605f4146l7955A28962b22028B65270b77149C3816h7760K5937k43631H0639b3754
18593i0739r143A93745E4379b07331k2739J5778A0458J50809c74796a63925E7451
18581b7562B89472I7466a91605m9755i4627k93528a3387A15544a45973j10371
18571b56344e2111j03198D10b38615b8621C63500A16876b06588Q7782a6240k45695
18560b61935a02550H4619b24060i4589c6651l66290A7459d6669C53378a65448
18549A89803g9680A56701b36281B51802b4662k23598P3489j46155o9716P7021
18539c13621b1848C81139c23690E7937A2439a6266r0868q7848B7334b83669A25209
18527A93474D0954a04493I0302b94583A55650b49922A334c40007M7479a9133j74125
$$ plain form
18605 -64146 -102101 128962 -222028 265270 -277149 33816 -87760 -61823 -305454 80639 -23754
18593 -90739 -99882 193745 54379 -207331 -230070 -214292 10458 161267 -374796 -163925 57451
18581 -27562 289472 97466 -191605 -241360 -94627 -388155 -13387 115544 -145973 -256344
18571 -256344 -52111 -155309 410 -238615 -28621 363500 116876 -206588 -118806 -16240 -261935
18560 -261935 -102550 84619 -224060 -94589 -36651 -402941 17459 -46669 353378 -165448
18549 189803 -79680 156701 -236281 251802 -24662 -248260 -174771 -320926 -390642 -313621
18539 -313621 -21848 381139 -323690 57937 12439 -16266 -107134 -194982 27334 -283669 125209
18527 193474 40954 -104493 90302 -294583 155650 -249922 1334 -340007 -292528 -19133 -193258
18516a93258F4246d8859D23381a12160A36884c28090a26885E2827k0152d4366
18505A54246b21277a7460n4098B59017b12783k451F443b9397j7088A06933c33535
18493b38659M5008a0594A20455j4171h3306L3715K643k2207j59238M099J3718
18482b10576e6682j86321a16218M972l90902C37942A12104a09697L9645j66553
18472b36605C63466c7957A2594c4144m902j36871A50165P2981j8637a00304F2346
18460a58776G8433N1471N2098H1839L423b06130R8151H2134c6772p3914j06641
18449b17327g2560j18204B20760r8942L03902a98837F9412a49166A89884b2004
18438c16784J19522C83600A6825J23271b9731A95438c6645A37448K20168a3296
$$ plain form
18516 -193258 64246 -48859 423381 -112160 136884 -328090 -126885 52827 32675 -44366
18505 154246 -221277 -17460 -71558 259017 -212783 -215234 6443 -29397 -46485 106933 -333535
18493 -238659 -193651 -10594 120455 106284 -83306 -49591 -46948 -69155 -228393 -224294 -210576
18482 -210576 -56682 -243003 -116218 -111246 -502148 337942 112104 -109697 -70052 -236605
18472 -236605 363466 -37957 12594 -34144 -39046 -175917 150165 223146 204509 -100304 62346
18460 -158776 78433 129904 182002 81839 85262 -206130 -107979 82134 -36772 -110686 -217327
18449 -217327 -72560 -190764 220760 121818 425720 -198837 69412 -149166 189884 -22004
18438 -316784 -197262 383600 16825 140096 -29731 195438 -36645 137448 357616 -13296
18427g4398p8292d1920j94047d2835l02783C0235b37294J10150d341j6885l9323
18416f0549B36056H6402a20096d7648j07068p0343O7219r9374A02761l3291c97765
18404b40708k7811a7044l98730a80448F6992a64066C95708i9558k34906a27949
18393b70950e0880j19782E7162l980b5723B00831c38925a3917A73136C2447c40727
18381b21814A28045a92157b9213m207B20354q5535b10713A88399p5348c7390j51377
18370a88767g5252E1852c50114F4215a29207O3990I2222L00071n2379a54699B82045
18358e7412b717j0940o0353B37993H3661i9871B78212e5933j05966g2148C95537
18346A50157c8528J1532j66726d3685k6801j91740E9109h101F1635k0652f1392
$$ plain form
18427 -74398 -152690 -41920 -235967 -42835 -345618 30235 -237294 -127144 -4341 -21226 -60549
18416 -60549 236056 86402 -120096 -47648 -154716 -225059 -157840 -257214 102761 69470 -397765
18404 -240708 -268519 -17044 -415774 -180448 66992 -164066 395708 -99558 -334464 -127949
18393 -270950 -50880 -170662 57162 53182 -25723 200831 -338925 -13917 173136 32447 -340727
18381 -221814 128045 -192157 -29213 -33420 220354 134819 -210713 188399 113051 -37390 -188767
18370 -188767 -75252 51852 -350114 64215 -129207 -65217 92222 392293 339914 -154699 282045
18358 -57412 -2717 -13657 -74010 237993 83661 -99871 278212 -55933 -161899 -72148 395537
18346 150157 -38528 -26996 -193722 -43685 -70486 -262226 59109 -8101 61635 40983 -61392
18334A02289a83620n8269B38561l143E9883b55502A5275J20675K1175D0487a44869
18322c68608a02529C7028g8491A1271J10190d72624b19768c4307A83275a92492
18311a47511m7996A00651e05181B1204L38812b29525B0042J92924f8137I7444
18300b37310q838A48835a7838B6352R1591b50798A81058b36383B73195a9063B05288
18288i2015A14119a26769F1119a92203c1516j57606h453A22462J12508h0333o0098
18277a40431b4721p5216b7644j58219B88690j20439M6949i5049J4934C9018b8070
18265c9240j08594H3816C9433i3449a875j28584A74153j7976E6916b776A36787
18253A39161J03388a50008f6983m6071e5525q3641M4330A10356C4231J29985d38486
$$ plain form
18334 102289 -183620 -241889 238561 235418 59883 -255502 15275 135950 157125 40487 -144869
18322 -368608 -102529 37028 -78491 11271 121461 -472624 -219768 -34307 183275 -192492
18311 -147511 -195507 100651 -505181 21204 360016 -229525 20042 212966 -68137 97444
18300 -237310 -246148 148835 -17838 26352 117943 -250798 181058 -236383 273195 -19063 205288
18288 -92015 114119 -126769 61119 -192203 -31516 -189122 -8453 122462 234970 -80333 -140431
18277 -140431 -24721 -99937 -27644 -185863 288690 168251 215200 -95049 -80115 39018 -28070
18265 -39240 -147834 83816 39433 -93449 -1875 -130459 174153 156177 56916 -2776 136787
18253 139161 242549 -150008 -66983 -113054 -55525 -139166 -94836 110356 34231 164216 -438486
18241B7146b68480R5987a8598j26875d8181n4308k9771B36819b4735l33291k4120
18230c82146a77014B57308B5490h5252j38524h2452A77905B1153b43097H9824
18219a04711B9580g3025i819j43082I331b25203R6100I3292O2871d19286D3342
18207I9711a01640J6219E4809a37657e5041j16048q9080A60562E3527a83317A18080
18195A30799b70999e5670J8099k33855h3649A5375h0037C60589c45827a21212
18184A97665o4247b34964H0023e3940p8966E3250b49875K4103k00969a47031k80890
18173d27921g4535R146k52912a44993E8686f5122B47820D0908e7101A19605g970
18161g1690j8232C8695a27271C1383a44961n5457H4563h3655M0258A49852b02220
$$ plain form
18241 27146 -268480 -172493 -18598 -145473 -48181 -102489 -132260 236819 -24735 -358026 -382146
18230 -382146 -177014 257308 25490 -85252 -223776 -82452 177905 21153 -243097 89824
18219 -104711 29580 -73025 -9819 -152901 9331 -225203 -129103 93292 156163 -419286 43342
18207 99711 -101640 -85421 54809 -137657 -55041 -171089 -260169 160562 53527 -183317 118080
18195 130799 -270999 -55670 -37571 -271426 -83649 15375 -80037 360589 -345827 -121212
18184 197665 133418 -234964 80023 -53940 -132906 53250 -249875 -225772 -426741 -147031 -427921
18173 -427921 -74535 -65389 -318301 -144993 58686 -65122 247820 40908 -57101 119605 -7970
18161 -71690 -89922 38695 -127271 31383 -144961 -200418 84563 -83655 -43397 149852 -202220
18149A22978e457B4309a80870A17721L1017j2218a00941B79561a14264e1447m1745
18138i3192C6975P7866J30517D3209Q4415a76230L4603A08722C6147f2283m012
18127f6295C32886j04720G2182j3262B5935a47295F0821a41940c766G1850f2716
18115I7380A3662b93938r4146a56107R893A84839J5800c1263j03933A32060O3725
18104A95785e1393j41278a3169B0407d08222F332K14833G1409a47908A70016M1806
18093B11822i3044A4354O8586O7292b5589l39583b9893m7872k3822o1362k67730
18082d30679B76489b93544A16456a36016A97316j4737l3753b70933O8674I4309
18071A9430a55651F3764J02255O5563j15053E1489M6298a7673k24005g0140D6559
$$ plain form
18149 122978 -5457 24309 -180870 117721 148738 136520 -100941 279561 -114264 -51447 -93192
18138 -93192 36975 114841 245358 43209 127624 -176230 -141627 108722 36147 -62283 -66295
18127 -66295 332886 228166 72182 58920 25935 -147295 60821 -141940 -3766 71850 -62716
18115 97380 13662 -293938 -388084 -156107 -146214 184839 200639 -31263 -135196 132060 195785
18104 195785 -51393 -192671 -13169 20407 -408222 6332 221165 71409 -147908 170016 211822
18093 211822 -93044 14354 82940 150232 -25589 -365172 -29893 -77765 -101587 -162949 -430679
18082 -430679 276489 -293544 116456 -136016 197316 182579 148826 -270933 -202259 94309
18071 19430 -155651 63764 166019 231582 116529 51489 97787 -17673 -241678 -70140 46559
18059a51166A54231F4705f7190m5318B7939J02906r1O0728D6272L4458a55596
18047b76974g731A43360J11379G1766b0187A18734m0794a88338A91510o2046N5090
18036A84554g5051p4444Q661d0221j37892D8881b2455d645B04469B0463p312a71505
18023a35972A08307g5503J7144j79517A92843J7520G6341b94740e6992D2831N5528
18012I8359L39014A7662K10063a38149B96527L8598O7932j02652A32691a53765
18001A95820a33641G6786L6734l8075J55774o9797b7800h451k05370A51158c00855
17989a04553A84886b91921O3137j21668D1409c2851C67616A58265b37589C16239
17978a71563k4026B03762a3911j43638B00998a89641B37682m3072O8237o8498
$$ plain form
18059 -151166 154231 64705 -67190 -112508 27939 130845 130754 191482 46272 80730 -155596
18047 -276974 -7731 143360 254739 71766 -20187 118734 77940 -188338 191510 129464 184554
18036 184554 -75051 -149495 -140834 -40221 -178113 48881 -22455 -4645 204469 20463 13151 -171505
18023 -135972 108307 -75503 -58359 -237876 192843 210363 76341 -294740 -56992 42831 98359
18012 98359 437373 17662 227725 -138149 296527 335125 403057 300405 132691 -153765
18001 195820 -133641 76786 113520 75445 231219 161422 -27800 -8451 -213821 151158 -300855
17989 -104553 184886 -291921 -228784 -350452 41409 -32851 367616 158265 -237589 316239
17978 -171563 -195589 203762 -13911 -157549 200998 -189641 237682 194610 262847 194349
17968A94349Q4035j06139a45189j0202A04122m5277R3202o0170b55779A64986
17957a06845B48179b56591I9623N6690D7125J01508a4116C900L02939A19176m672
17946A14504M5886b5012H0799l5391L970a17239B88373c0815A80049M2715k348
17935B20416N8745h284k24279J00731A75945p9725c8463j968k1167D831M3480
17924D8311J35560j8757C4786R9053o3819J78107f1606A35257n6777J47532b33344
17912E9951j8386h2778L122A62628K72737i6608K1677B40842d2459A90870b2927
17900B97657E9612K39788D2825O9935A3970a57996A26854a89000j15345B04343
17889d2863A3286K14951a58882D4139c8095C44472g5929B33871a0374H3709K01
$$ plain form
17968 194349 278384 172245 -145189 -155391 104122 58845 152047 91877 -255779 164986
17957 -106845 248179 -256591 99623 156313 47125 148633 -14116 3900 306839 119176 114504
17946 114504 160390 -25012 80799 45408 49378 -117239 288373 -30815 180049 222764 220416
17935 220416 279161 -8284 -232563 -131832 175945 96220 -38463 -40431 -61598 4831 48311
17924 48311 183871 165114 34786 133839 70020 248127 -61606 135257 78480 226012 -233344
17912 59951 41565 -82778 -79656 162628 435365 -96608 -74931 240842 -42459 190870 -22927
17900 297657 59612 299400 42825 112760 13970 -157996 126854 -189000 -304345 204343
17889 -42863 13286 228237 -158882 44139 -38095 344472 -75929 233871 -10374 83709 83910
17878H3910f2306A07442j3514b65050B84921F7168J75153J3489a24232B49417
17867a89655D150J07697J2321A0386b11830B63101e901A87592p3072i794p2103
17856h1897F4671L19604G4375j6516F640b659m116F2921b2857A37301b54819B59497
17843E9927b5303I2914O7024g7068j29431A82000D9053L10179a43545B11536A01909
17831b18265A17125m6261f5235A60395n4367a86368A42500p1173e360B70678O5977
17820C36655a59054C86450A53480k883D7719L6865g2069C7669a41244M2601J2971
17809h5672L5386I3834l1020a34093B41223B3809e8982j5661k48944c504H0373
17797C27169B622J68090f679j492A70921J1336a89295B61555e7155A26189F0527
$$ plain form
17878 83910 -62306 107442 93928 -265050 284921 67168 242321 255810 -124232 249417
17867 -189655 4150 111847 124168 10386 -211830 263101 -5901 187592 114520 -9794 -81897
17856 -81897 64671 384275 74375 57859 6640 -2659 -6775 62921 -22857 137301 -254819 259497
17843 59927 -25303 92914 159938 -77068 -206499 182000 49053 359232 -143545 211536 101909
17831 -218265 117125 70864 -65235 160395 106028 -186368 142500 71327 -5360 270678 336655
17820 336655 -159054 386450 153480 150597 47719 84584 -72069 37669 -141244 -98643 -85672
17809 -85672 -50286 93834 62814 -134093 241223 23809 -58982 -74643 -323587 -3504 80373
17797 327169 2622 170712 -6679 -8171 170921 182257 -189295 261555 -57155 126189 60527
17785D31L8398i3213h389E6291a09868A12689K7199a03256L085D3936J45168a77660
17772a90858j35295a07612A32875I413K93537q0119M52625b85800A10220l8597
17762G1623O1972c1355C66067A04182a6990j73521C59090a82071B31949J00609
17752C32558b5061m925C23541E1287b52112E56047b0548m3737L711H0347l8818
17741D1529J82041r9480p237b40272C07282p7187h1902A05846K01018G6284J87878
17730B64162h3520m6177B31665b0505m8587C88519A06740D6739p84d0631a9647
17718A67683K20470j56735p4798C3741K15143c8484A62106J86459b13900Q8811
17708a25089A83331J36019l0354C4778K21532Q6905C8833K60775i7590A57767
$$ plain form
17785 431 38829 -93213 -8389 56291 -109868 112689 139888 -103256 -100171 43936 189104 -177660
17772 -190858 -326153 -107612 132875 9413 302950 222831 675456 -285800 110220 71623
17762 71623 133595 -31355 366067 104182 -16990 -190511 359090 -182071 231949 332558
17752 332558 -25061 -29986 323541 51287 -252112 556047 -20548 -64285 -60574 80347 41529
17741 41529 223570 124090 116853 -240272 307282 230095 -81902 105846 306864 76284 264162
17730 264162 -83520 -129697 231665 -20505 -69092 388519 106740 46739 45955 -40631 -19647
17718 167683 388153 231418 156620 33741 248884 -38484 162106 348565 -213900 -125089
17708 -125089 183331 319350 288996 34778 256310 343215 38833 299608 -97590 157767
17697g1777J6717I2222a603A69541F4344L59157h1140C2087K19451n5559H5068
17685A84304p451F4108P6172B1522A0083a44785A95433B8722O5289a77030A19951
17673E37829i4580B45075c1873A56432L5501d012o4000B92512j05665J7456b05881
17661C2262J31546a72587B3681K49888m8613J0119J5330a34476D00363a41608
17650A61796a2129B76350E0382g2236B73306A23300K97384k00200a15025q7239
17640b02264A01169J96463E2275K49903o2080j0100r1738E1461G18L48356j26741
17629B22333o3382a88541c1531H5212K97373h2425B07100q6485M9717n6113m9278
17618F4941K28838M3102A41346J91661l9561A38859K87137I4502K58179j561A06240
$$ plain form
17697 -71777 -55060 92222 -1603 169541 64344 423501 -81140 32087 251538 195979 85068
17685 184304 176853 64108 140280 21522 10083 -144785 195433 28722 94011 -177030 119951
17673 537829 -94580 245075 -31873 156432 191933 -4012 -68012 292512 186847 204303 -205881
17661 32262 163808 -172587 23681 273569 224956 235075 250405 -134476 400363 -141608
17650 161796 -12129 276350 50382 -72236 273306 123300 420684 220484 -115025 -202264
17640 -202264 101169 297632 52275 302178 240098 229998 138260 51461 718 349074 222333
17629 222333 158951 -188541 -31531 85212 382585 -82425 207100 120615 170332 114219 64941
17618 64941 293779 336881 141346 333007 293446 138859 425996 94502 352681 351120 106240
17606F4844K94651A67461J78269D6733K29190B3696L80125D6051K45317A10585
17595B00966a943p8968D11666M0607b3229A41811J40267j1872p3068n5289K16075
17584C57924A27624n2077P9175J79545J27271j93670j19272Q5968p2462o5871
17574I6231j294l0475M3489a43838e9498A81996K5122N2889G5822j5820b53716
17562a53276H2270l3048K43576o2851K981L0960A13604l3462K5311j4665k5944
17551F4844K77974K2060G5703L9993k3790a77845B78284J3872C4763Q4043Q6215
17540B05021B6767K77652A19886J88658j23001L18936q1244n3363B6697R2836
17530A19533J34121L16040B21983l0743L35965l9998k16808K22947a0712C06876
$$ plain form
17606 64844 359495 167461 345730 46733 275923 23696 403821 46051 291368 110585
17595 200966 -1943 -80911 411666 452273 -23229 141811 282078 270206 197138 141849 357924
17584 357924 127624 75547 154722 334267 461538 267868 148596 234564 162102 96231
17574 96231 94937 64462 107951 -143838 -59498 181996 207118 260007 75822 60002 -253716
17562 -153276 82270 49222 292798 229947 232928 263888 113604 80142 105453 90788 64844
17551 64844 342818 364878 75703 115696 91906 -177845 278284 292156 34763 118806 205021
17540 205021 26767 304419 119886 308544 185543 504479 423235 369872 26697 119533
17530 119533 253654 569694 221983 191240 527205 487207 270399 493346 -10712 306876
17519D38K04246M82079k90097j8563j25119K09407Q8364j64847J94649L44297
17509I24854L6998q372N794K4534m80085q4749o9215K31100j00774n621J06620
17498E81084o7600J07960m6140L05595o3140J02393j98721K56743l51460j09871
17488E16843j04789j31072n1829K78438j55661q1096l2743p7656L58070j01919
17478D16586q6968e039A23563j6347K71276g011E5854K65739A26823M03880k13381
17467C17322l7134J58373k09661j13982K23334j24472H9161K00476N0331K68414
17457F08382B62947A3051M94656A33621J44894L5171p8429g9248B73895h3144
17446B33265J32571K1724D7711M68865A36002R0901J46337J90630j18060o7699
$$ plain form
17519 438 204684 686763 396666 378103 252984 462391 550755 385908 580557 924854
17509 924854 961852 953480 959274 983808 503723 418974 349759 580859 480085 474464 581084
17498 581084 513484 621444 575304 880899 817759 920152 721431 978174 626714 516843
17488 516843 412054 280982 229153 507591 351930 270834 238091 160435 518505 416586
17478 416586 329618 -5039 123563 107216 378492 -7011 55854 321593 126823 530703 317322
17467 317322 280188 438561 228900 114918 338252 213780 89161 289637 339968 608382
17457 608382 262947 13051 507707 133621 278515 313686 235257 -79248 273895 -83144
17446 233265 365836 387560 47711 516576 136002 226903 373240 563870 445810 378111
17436C78111A14381K18197E9204M67123j41980N40516D49370B05861K64215j72207
17426B97869L81537k18363p8231r9206Q7408K42828k4626j96924q8031L69127
17416F73388B69444J7668J02631j69674M65949j40053A56723K38940A07313M75697
17406E83010I5591R2033L33031k55715J0281A20650K94094M350j01097L47163
17396F65160B07747j8138a5954B41179E8715h9414E39474A25941K21989j41900
17386B06030M2985F1198J61100L46595K6626j59239H2565L55902j12772A17241
17375B04333K17323j05546K01341k58536Q7251q8354Q0436j02712J52146C5085
17364A67189G1485P9037b52975E37917A94850H4623a65869E57949A68838L1578
$$ plain form
17436 378111 114381 332578 59204 526327 384347 924863 449370 205861 470076 297869
17426 297869 679406 461043 382812 283606 371014 613842 589216 392292 304261 673388
17416 673388 269444 287112 389743 220069 686018 545965 156723 395663 107313 583010
17406 583010 95591 187624 520655 264940 275221 120650 414744 419094 317997 665160
17396 665160 207747 189609 -15954 241179 58715 -89414 539474 125941 347930 206030
17386 206030 249015 61198 222298 568893 595519 436280 82565 438467 325695 117241
17375 204333 421656 316110 517451 258915 346166 257812 338248 235536 387682 35085
17364 167189 71485 150522 -252975 537917 194850 84623 -165869 557949 168838 200416
17354B00416J24177j31830J78523q6252k4363j21747J04674O7544A36868l6611
17344A00257J94027J37831l5758K8385B08736M2241J33149J7598j70278K82111
17334E13557n1578m7185A46286j4098J51093n8998I7375J87018J11795A89913
17323B32004P9672J28484A05166R0157D29K12254M39537B45109K12328A31043
17312E95224k66398L18779j45683j18445D4998J61530M5047K57988B45888K0472
17302B66360Q3039d6478C9153K59531l0147j9592k8126J45513j71938M6730J09441
17291C50565O1279D2701L41498j84096L10400k54481K29843L16547k48274A16683
17280C55832j68507C099K62914R9921j12027a3762A11410a81384D12526A80397
$$ plain form
17354 200416 324593 192763 371286 285034 260671 138924 243598 311142 136868 100257
17344 100257 294284 432115 396357 424742 208736 250977 384126 401724 231446 513557
17334 513557 461979 414794 146286 132188 283281 224283 97375 284393 396188 189913
17323 232004 311676 440160 105166 195323 429 212683 652220 245109 457437 131043
17312 595224 328826 647605 501922 383477 44998 206528 251575 509563 245888 266360
17302 266360 349399 -46478 39153 298684 268537 248945 220819 366332 194394 241124 350565
17291 350565 411844 42701 384199 200103 510503 256022 485865 802412 554138 116683
17280 355832 187325 3099 266013 365934 253907 -13762 111410 -181384 412526 180397
17269E02665k0025j51985J25994A21448L20100J7883A63617L23426B19891m6991
17259A72900k1414L80685j04872j76784G6518K92915R84m2877J06396A50828J66265
17248C17093n7024K95279N2956B67578A07617K49222j6074K4687d3270G23825
17237A79557L81010H4488K42764J4196j25100K64812n2111L4323j48814J04360
17227D18918j05934A32343J31201m8689J95293J41150B64787K29065J38829j69538
17217D63143A71685K55698h1475H37565l22476n7747J57178l640j33403k6508
17207D50969j00801J79722A80382K25669j05973L23755A31797M08428B33527j4352
17197B19175K41007o4299Q7102q8266K87695q2186B32834L44667A23249L77411
$$ plain form
17269 502665 482640 330655 456649 121448 441548 459431 163617 487043 219891 172900
17259 172900 151486 532171 427299 250515 76518 369433 370417 327540 433936 150828 317093
17248 317093 260069 555348 608304 267578 107617 356839 340765 365452 -43270 723825
17237 179557 560567 84488 327252 341448 216348 481160 429049 463372 314558 418918
17227 418918 312984 132343 263544 214855 410148 551298 264787 493852 632681 463143
17217 463143 171685 427383 -81475 837565 515089 457342 614520 610880 477477 450969
17207 450969 350168 529890 180382 406051 300078 623833 131797 540225 233527 219175
17197 219175 460182 395883 482985 394719 682414 600228 232834 577501 123249 500660
17187E00660l3475k7221j1492J84651j69627l0306m1508K45094o5541o8483A98907
17175D73454o1794n2000J69129j51038K0897L57066j74560L2079j44400l0576
17165D38257K39804C37478p4039L16353J0993J8512L0897C08767L02251p0410
17155E40608J71485B76573K64274j19768K67757k58792R1533P2577j06505j71148
17145C16501J79517R5736k34814M2974K35749j28246K63172o8922C32625J7705
17135C50330l1813L79002l4430o989j05244J25681j59925K87308l61235M71183
17125I13868l30775N2412J79349j96216K1501Q2696k33161L4618B61917n5038
17115B06879L56963K0466J28072j03184J01065k79910K61611M9228k11441J12680
$$ plain form
17187 500660 467185 439964 428472 613123 443496 413190 371682 616776 551235 482752 198907
17175 473454 411660 359660 528789 377751 398648 755714 581154 613233 468833 438257
17165 438257 678061 337478 263439 579792 590785 609297 640194 308767 611018 540608
17155 540608 712093 276573 540847 421079 688836 430044 521577 594154 487649 316501
17145 316501 496018 591754 356940 399914 635663 507417 770589 701667 332625 350330
17135 350330 318517 697519 663089 656100 550856 676537 516612 803920 442685 913868
17125 913868 583093 635505 814854 618638 640139 722835 489674 524292 261917 206879
17115 206879 563842 584308 712380 609196 710261 430351 691962 741190 529749 642429
17105F42429r1681K01268k2674p5612M66955E56446K28269j48878k39136M56889
17095H53590l84508K77735k12772Q1214j55448K42691o6016j53809M9144L50941
17085H82762m11163K99771j4561l2165j41122k11512r1637N45366C07182M32580
17075G39762j27567J11969B34383O98169j13512K12017l79015K03171k66699J15337
17065G03851J64730k45303K63194R4994j49627k10356O0087K51122k11125l08516
17055D13051M82386P7828q105l73205M96557j28519j47086J91691m67249L67083
17045I04432m09425L55857R1575O8084O9148n1420k40643J93877Q5309r8044m48644
17034E20106N81460o046l54795J09461n8924J46567k67315J64908K96027l50917
$$ plain form
17105 642429 550748 752016 729342 653730 1120685 556446 784715 635837 396701 853590
17095 853590 469082 746817 534045 615259 459811 702502 636486 482677 531821 882762
17085 882762 471599 771370 756809 724644 583522 372010 280373 825739 307182 739762
17075 739762 612195 724164 234383 932552 819040 1031057 652042 855213 588514 703851
17065 703851 868581 623278 886472 981466 831839 621483 681570 932692 721567 413051
17055 413051 895437 973265 965160 591955 1088512 959993 812907 1004598 537349 904432
17045 904432 495007 850864 942439 1010523 1079671 1028251 787608 981485 1066794 968750 520106
17034 520106 1101566 1095520 740725 850186 791262 937829 670514 835422 1131449 780532
17024G80532L69720l46038K25274o1892j58956R0235k81912J58645L71512j84845
17014I62275Q5369J33450k70116J48638M7487l99890L39995L5980Q4998j97258
17004I70928N0708K70758L8129k68685j92617L93179j4541j35460K6915K32281
16994A371595m90774M83679k7141L0428n33067M05477l0596r7753n0140M85926
16984A547634m74074Q4839n5427K41499K9269m0163j1613J12337k69658J08831
16974A273474K59549k7811l32869k718l7022L60593L1746q2909K9923m61036K62585
16963A273505R6878M41654m04633j93695M56800k29870L19631R2736m20386L17871
16953A750491j67488o5717J57709J7962j1480m27J56155m78801N14881n9175m9966
$$ plain form
17024 780532 1150252 804214 1029488 967596 808640 898875 616963 775608 1147120 962275
17014 962275 1047644 1181094 910978 1059616 1107103 707213 1047208 1083188 1168186 970928
17004 970928 1021636 1292394 1330523 1061838 869221 1262400 1247859 1112399 1139314 1371595
16994 1371595 880821 1364500 1337359 1367787 834720 1240197 1209601 1111848 1061708 1547634
16984 1547634 1073560 1158399 1102972 1344471 1373740 1333577 1321964 1434301 1164643 1273474
16974 1273474 1533023 1505212 1172343 1169625 1132603 1493196 1524942 1442033 1471956 1010920 1273505
16963 1273505 1370383 1812037 1407404 1213709 1670509 1440639 1760270 1853006 1432620 1750491
16953 1750491 1583003 1517286 1674995 1692957 1681477 1681050 1837205 1358404 1873285 1814110 1764144
16942A764144l469K50106m09790L09504l00725J51333j84404r083M34450k90845
16932A711221J75777k54670K13622J26608j28278o8300J03828R1594K98567j02848
16922B167121k50686Q1686l7592Q5062J55224p2715p5025K04872K92542m40005
16912B110484j88770M25023J69861k77847M3132N5075O1946k58730K48664K0518
16902B409356R1416o591k42524L03436j74700j36412M92996q8804L51842l60232
16892B639783R1307r6663L70593l23803L92032l22202j31123M61321r80j74820
16882B905445K77600j65163J50593K99150n31071J88189J31558k78181K99157
16873C277277j52491O2354N28750Q8710l96922j04791K25878K49620L7038j74206
$$ plain form
16942 1764144 1760675 2010781 1600991 1910495 1609770 1761103 1576699 1567616 2002066 1711221
16932 1711221 1886998 1632328 1845950 1972558 1844280 1775980 1879808 1971402 2269969 2167121
16922 2167121 1916435 1998121 1960529 2045591 2200815 2128100 2053075 2257947 2550489 2110484
16912 2110484 1921714 2346737 2516598 2238751 2281883 2336958 2398904 2140174 2388838 2409356
16902 2409356 2500772 2494181 2251657 2555093 2380393 2243981 2736977 2648173 3000015 2639783
16892 2639783 2731090 2634427 3005020 2681217 3073249 2751047 2619924 3081245 3080265 2905445
16882 2905445 3183045 3017882 3168475 3467625 2936554 3124743 3256301 2978120 3277277
16873 3277277 3124786 3187140 3715890 3804600 3407678 3302887 3528765 3778385 3815423 3641217
16863C641217J97288M05585m24568J49980J62817K12795k28301n1012q9942K45264
16853D221123J45262J06077l51603M59382l33847K91119L01093j76745K801K86811
16843D951473o159R310O828O5184k4809K05835O695k24244P10284j3559j41144
16832E545694K26084o7867K34422k19020N13524L1856q8763K76329J15920m9654
16822F518525L3324K2363O10820J90450q3607K62364J45716k35940N96348l57192
16812G703171J80330M36825j48013L05710j66095M21229Q285M17543j96187N30751
16802I493549L9626J45544L97961M28311j09069O6975M06383M15098k92984L57148
16792A1348542J35252L61800M76159J98895L43161O4466K88747N05030L14292
$$ plain form
16863 3641217 3838505 4244090 3819522 3969502 4132319 4345114 4116813 4065801 3975859 4221123
16853 4221123 4366385 4472462 4120859 4580241 4246394 4537513 4838606 4661861 4664662 4951473
16843 4951473 4945314 4954624 4961452 5026636 5001827 5207662 5214357 4990113 5700397 5686838 5545694
16832 5545694 5771778 5703911 5938333 5719313 6232837 6264693 6175930 6452259 6568179 6518525
16822 6518525 6551849 6574212 7185032 7375482 7291875 7554239 7699955 7464015 8060363 7703171
16812 7703171 7883501 8320326 8172313 8478023 8311928 8733157 8741442 9158985 8962798 9493549
16802 9493549 9533175 9678719 10076680 10504991 10395922 10462897 10869280 11284378 10991394 11348542
16792 11348542 11483794 11845594 12321753 12520648 12863809 12928275 13217022 13722052 14036344
16783A4036344M58687L65551j21054L98914Q56331K41471J93131M82235N90290
16774A7501900J76303N25248O21251N01313P76419R1318P06808N91892M28260
16765B1920712R64117K98017J086482N95715O01582R33745O64141P50906J005964
16756B8821381R73160P77832J466145L70037J592519P90009J380112J383453J324612
16747C8879260J074766J361938J407840J988252J101719J878555J617949J873778
16739E1184057K035217J818125K528828J805416K260749K030702K741487K666577
16731F9071158K110235L286401K723628K750535K749775K851901L128723K766945
16723I1439301L179573L271279L232623L067167K672893L549364K487329K612017
$$ plain form
16783 14036344 14495031 14860582 14739528 15138442 15994773 16236244 16429375 16911610 17501900
16774 17501900 17678203 18203451 18824702 19326015 20102434 20193752 20900560 21492452 21920712
16765 21920712 22884829 23182846 24269328 24865043 25466625 26400370 27064511 27815417 28821381
16756 28821381 29794541 30572373 32038518 32408555 34001074 34791083 36171195 37554648 38879260
16747 38879260 39954026 41315964 42723804 44712056 45813775 47692330 49310279 51184057
16739 51184057 53219274 55037399 57566227 59371643 61632392 63663094 66404581 69071158
16731 69071158 71181393 74467794 77191422 79941957 82691732 85543633 88672356 91439301
16723 91439301 94618874 97890153 101122776 104189943 106862836 110412200 112899529 115511546
16715A15511546K842356K113696K118579J634790K144674J222987P76818Q15136
16707A29180582M87838J96820m43440p68867r45917j528706j458967j893894k516102
16698A20309347k260330k296644l086695k936476k796987l502402k917794l267454
16690I7244565l029700l251571l169004k896395l029267l192449k884200k466294
16682G3325685l017504k799715k159750l012286j774352k360813k145771k214500
16674E3840994j973733j877568k180319j580225j721808j710620j444166j608108
16666C9744447j091647j414924j200391p51949j462159j011943j417953j081001
16658C0312480q24217j330641q07805n97201j058917n34949q08127q93544l14158
$$ plain form
16715 115511546 118353902 120467598 122586177 124220967 126365641 127588628 128365446 129180582
16707 129180582 129668420 129865240 129421800 128652933 127707016 126178310 124719343 122825449 120309347
16698 120309347 118049017 115752373 112665678 109729202 106932215 103429813 100512019 97244565
16690 97244565 94214865 90963294 87794290 84897895 81868628 78676179 75791979 73325685
16682 73325685 70308181 67508466 65348716 62336430 60562078 58201265 56055494 53840994
16674 53840994 51867261 49989693 47809374 46229149 44507341 42796721 41352555 39744447
16666 39744447 38652800 37237876 36037485 35285536 33823377 32811434 31393481 30312480
16658 30312480 29488263 28157622 27349817 26752616 25693699 25158750 24350623 23457079 23142921
16649B3142921q31280o35183q87691j71535n72517n91052p83203l89975p29568
16640A7550917j92320m74296n04404m40360n80144j92077r7555m61628o03432
16631A4004701l71975l75305j63581k06186j96332l67485k45945n49195j50293
16622A1378404k6590m97345j1592k37277m89093J90383m10392j70078m6080n60144
16612I120196j54578O9000l25591k37576J11769k32669k97021J4645k84513k72220
16602G511442j2660J05327l51514O9083l41580M8388K490o00033L0793k67186
16592F194550L71850k92763r49l0761l45538j45115j4977k60807J84032j91974
16582E467548m8903k02921j73096K56166k16018r1636J09764k77709j40137n031
$$ plain form
16649 23142921 22311641 21676458 20788767 20617232 20044715 19453663 18670460 18280485 17550917
16640 17550917 17358597 16884301 16379897 15939537 15359393 15167316 15069761 14608133 14004701
16631 14004701 13632726 13257421 13093840 12887654 12691322 12323837 12077892 11528697 11378404
16622 11378404 11351814 10854469 10842877 10605600 10116507 10306890 9896498 9726420 9680340 9120196
16612 9120196 8965618 9034618 8709027 8471451 8583220 8350551 8053530 8068175 7783662 7511442
16602 7511442 7498782 7604109 7252595 7321678 6980098 7028486 7030976 6430943 6461736 6194550
16592 6194550 6566400 6273637 6272688 6241927 5896389 5751274 5736297 5475490 5659522 5467548
16582 5467548 5418645 5215724 5042628 5298794 5082776 4991140 5100904 4823195 4683058 4678027
16572D678027L18181l29111j63662J04195j15172j79970J58876r6856j74017l55692
16562C844799K10318K06241m87288J38585J36781m77365K41259k2105k44495j04255
16552C442475J74593j15791J57520j97038m04065K69864j9683p3399j5933J10628
16542C329171j46850p3002k9051j64879J23232j67916j00030j60268K70383l2059
16532B848731j87261L74924l28540J2252m4011j86627Q2119K73426j55497j18945
16522B570571j40343K40893k41085L7452o6154P595O164K6475j6925k34417J70844
16511B361070k26125J50022j50314m1671P3481J79129l50017M62898n72673O5283
16501A951083O74175p54892k14887K27395K63450j31521o60918Q42975k876k61145
$$ plain form
16572 4678027 4996208 4667097 4503435 4607630 4492458 4312488 4471364 4374508 4200491 3844799
16562 3844799 4055117 4261358 3774070 3912655 4049436 3572071 3813330 3791225 3546730 3442475
16552 3442475 3617068 3501277 3658797 3461759 3057694 3327558 3307875 3234476 3218543 3329171
16542 3329171 3182321 3109319 3080268 2915389 3038621 2870705 2770675 2610407 2880790 2848731
16532 2848731 2661470 3036394 2707854 2720106 2676095 2489468 2571587 2845013 2689516 2570571
16522 2570571 2430228 2671121 2430036 2467488 2401334 2408929 2415093 2441568 2424643 2190226 2361070
16511 2361070 2134945 2284967 2134653 2092982 2166463 2345592 1995575 2458473 1885800 1951083
16501 1951083 2625258 1870366 1655479 1882874 2146324 2014803 1353885 2196860 2193984 1932839
16491A932839l82459J42189K82144n72762J23068J50934K72248q7692l35736K67855
16481A792628n8883o7546r578P9423k62701Q4881M38247l47816k61480m7368L89206
16470A729013j89178k08840J44986L27648n66928K77979j22951l03324K69402
16461A357807q439k67449K67922L8153L1925O6468J37016j91501m3651j74844
16451A213407M4780p9998J53348O7474k5602k13142M5373K72234m32205K2179
16441A067848j4971J6569K49121k50437j45569J64034K03579O860n9314k12350
16431A025370M6198l91433P07085l08861Q8160r1509K5283N5702j63566K26806
16421A219235m1214l5644M4029J57343k85327J14391n7708J17504k04438r0134
$$ plain form
16491 1932839 1550380 1692569 1974713 1401951 1525019 1675953 1948201 1860509 1524773 1792628
16481 1792628 1733745 1666199 1656621 1736044 1473343 1558224 1996471 1648655 1387175 1339807 1729013
16470 1729013 1539835 1330995 1475981 1803629 1236701 1514680 1391729 1088405 1357807
16461 1357807 1349368 1081919 1349841 1387994 1419919 1486387 1623403 1431902 1388251 1213407
16451 1213407 1258187 1178189 1331537 1399011 1373409 1160267 1205640 1477874 1045669 1067848
16441 1067848 1052877 1069446 1318567 1068130 922561 1086595 1290174 1297034 1237720 1025370
16431 1025370 1071568 680135 1387220 1078359 1166519 1075010 1100293 1155995 992429 1219235
16421 1219235 1178021 1142377 1186406 1343749 1058422 1172813 1115105 1232609 1028171 938037
16411I38037K10717j12186l5234M9212L124o0014m22214K84273N6884J50079k25483
16400H37195n6143N50733k30221j96099R4041m8479l55029J34923M95873k92015
16390I34779k74803L53759j25201L7258j72577j90169P76293l77511q2070j72862
16380G06896J72921J28500l25950L10547m11950L6468M7391M21250l32042l14138
16370D39893L16393l73626N81336l38605o4566K20717K45839E06627N05480J84147
16360A196254m13587K87738n00660Q8302K8655k0553p6351J64466M92982n43679
16350G03567l4812L9534j44822F4546M52739r9888L29009r9976k02873L31984
16340G75541C72411O00635D24513j5163p1955j21417M05672k34921J5636M72024
$$ plain form
16411 938037 1148754 1036568 1001334 1050546 1053670 993656 571442 855715 912599 1062678 837195
16400 837195 781052 1331785 1101564 905465 999506 951027 595998 730921 1226794 934779
16390 934779 659976 1013735 888534 925792 753215 563046 1339339 961828 879758 706896
16380 706896 879817 1008317 682367 992914 580964 617432 664823 1086073 754031 439893
16370 439893 756286 382660 963996 625391 560825 781542 1027381 506627 1012107 1196254
16360 1196254 782667 1070405 569745 658047 686702 666149 589798 754264 1247246 703567
16350 703567 668755 708289 563467 64546 517285 417397 746406 646430 443557 775541
16340 775541 372411 973046 424513 409350 337395 215978 621650 386729 402365 874389
16330H74389k58562M0760J69182l54268k05709M24012B56431K59437J20554j78701
16320D57721o7549J27859P9661M0776r2601L03247r6559J05078C82650M90943
16310H73593B42043M26271J2349O0467l00029R8663B02558L82520B42409J69359
16300D11768M77597C02695K65121k60429J8667J87149k12677J04089J8234J85088
16290F07937j49909K31801P8024k17092p5338P0561H7028N67392B41688L51412
16280E93100k21300L07938j47129J74261k23655L8960r8151j69515J14989p549
16270C61949K13250N219J94600A37764P5832P0248Q4123A24089J90069J03134
16260D17292A52250l5240L89302j44401J32616M30l9990n284J66920M3551k47426
$$ plain form
16330 874389 615827 656587 825769 471501 265792 689804 256431 515868 636422 457721
16320 457721 390172 518031 597692 638468 545867 849114 752555 857633 382650 873593
16310 873593 242043 668314 680663 741130 441101 539764 202558 585078 242409 411768
16300 411768 889365 302695 567816 307387 326054 513203 300526 404615 422849 607937
16290 607937 458028 689829 767853 550761 475423 545984 87028 654420 241688 593100
16280 593100 371800 679738 532609 706870 483215 522175 424024 254509 369498 361949
16270 361949 575199 580418 775018 137764 213596 283844 367967 124089 314158 417292
16260 417292 152250 117010 506312 361911 494527 494957 454967 449683 616603 660154 412728
16249D12728p9005N8952J63785l7783B43889p3607K19856q9261J93119j09361
16239C84635m6266M28836B97372J69091A53647J35965n6101N14865A68115o9633
16229I8482N43788l15013J18599l2069A46294M23545P408q6450I4170K5494K99128
16218D18792A73290O6195R0813q6228L31373k39650j2890L5375A20630L80618
16208E01248A75995L30860n6732m7359j47554K95262B20034L47492k52385C6502
16197C75069j76551K79230B18111J73019A22033L32933p3176J30764B03099j7713
16187A85386N6110p3943m0139O8006M35785C04712r8341G8045M1063L64024j83290
16176B99842l2529K25344k14824j23268l5711L14830p0133k2984A06011J11194
$$ plain form
16249 412728 333723 392675 556460 518677 243889 170282 390138 300877 493996 384635
16239 384635 338369 767205 297372 466463 153647 289612 233511 748376 168115 98482
16229 98482 642270 327257 445856 413787 146294 569839 577247 490797 94170 119664 418792
16218 418792 173290 239485 330298 244070 575443 335793 322903 358278 120630 501248
16208 501248 175995 506855 450123 402764 255210 550472 220034 567526 315141 36502
16197 375069 198518 477748 218111 391130 122033 454966 381790 512554 203099 185386
16187 185386 241496 167553 127414 195420 631205 304712 206371 78045 119108 483132 299842
16176 299842 267313 492657 277833 154565 118854 433684 363551 340567 106011 217205
16166B17205J40315l6710j4605A08358g4824A67812k9512r245M32790j98759a30303
16154A90507J35002K19821k21912n7006L08127F6034M08195A92541K12412j95315
16144B09638D0955J60680p2442j8585L31645B01999C0566K14899c3373A46024
16133D0466e7114A31547A8152Q0424L61676B24441g0973A99766n7954e9612A94491
16121B68993C6144C760J67047J34025A15906K74329H0177R9693J49487M925A27871
16109a7931C30898A01930J4128M7352c6057D67146l1008B2586J15908K51982J7975
16098D08451A45118P2155a00182H7896b04706L8314A23086J99026A7472J40641
16088A58113L3219q1304M0263a4392N808C31219N8040A21562a58123B68749K03560
$$ plain form
16166 217205 357520 320810 306205 108358 -74824 167812 138300 129055 561845 363086 -130303
16154 190507 325509 545330 323418 266412 574539 66034 474229 192541 404953 209638
16144 209638 40955 201635 129193 110608 442253 201999 30566 245465 -33373 146024
16133 40466 -57114 131547 18152 98576 460252 224441 -70973 199766 141812 -59612 194491
16121 268993 36144 3760 170807 304832 115906 390235 80177 179870 329357 334282 127871
16109 -17931 330898 101930 116058 163410 -36057 467146 436138 22586 138494 390476 408451
16098 408451 145118 217273 -100182 87896 -204706 -166392 123086 322112 17472 158113
16088 158113 191332 110028 150291 -14392 -8584 331219 389259 121562 -158123 268749 472309
16077D72309a54293A68363a03447A5418L08891A13072L74058B00574m5648k0414
16067A34512D71b01833A92978A0362a94515B09169F2803b18480C98415a40296
16056B398a05967D03576D8384f7062j3550R33n3319D3634J85111I3692Q484O4685
16044A66861g0678A9281L1737J02739a43623l2162G0947a40275D3904a71743A17195
16032B191J21566k8819Q2773k0042h3129p3590d544k3419D5660c09991J26971
16021a83020B58348J22404c01402G0323a3555k7366A33564b74377F14K6218c7953
16009B15217c27017A38341m2754J64410G409b6951C57700j32644C6749M5231h7525
15997A76102a97127A69099d6524A78185H2704b27127D22874i1264D9701b52878
$$ plain form
16077 472309 -154293 168363 -103447 15418 324309 113072 487130 200574 154926 134512
16067 134512 471 -201833 192978 10362 -194515 209169 62803 -218480 398415 -140296
16056 2398 -105967 403576 48384 -67062 -80612 -79679 -132998 43634 228745 93692 102176 166861
16044 166861 -70678 19281 51018 153757 -143623 -175785 70947 -140275 43904 -171743 117195
16032 2191 123757 94938 177711 157669 -83129 -156719 -4544 -27963 45660 -309991 -183020
16021 -183020 258348 380752 -301402 70323 -13555 -40921 133564 -274377 614 26832 -37953
16009 215217 -327017 138341 95587 259997 7409 -26951 357700 225056 36749 81980 -87525
15997 176102 -197127 169099 -46524 178185 82704 -227127 422874 -91264 49701 -252878
15986a70051f3776B58963a17775C38433B622K41286a56939B54672k2079C4831
15975A32800L27562q6061J73872L30129j93085P4922R8107j87662n3836j56381
15965D60367k4355H8463j5517P4552i9608n6823A2105a9109k88316D1478c16307
15953D42415i6720K9106A40838M05471a08538A84213p2772j5687a31245r7328
15943b28573R8140F4387a00639n9528A171R2650b60738n7093a06713B08756G7268
15931A43717e30706a33205I9911J19900j709c5067l34213A04540B0138J53489
15921A73627B8921a10594A44297a71351l105A05043J80784i7265k78648r5004
15911d70917F3548J93083P0831i7614L4201D584b8882B347b4263H8710b79406
$$ plain form
15986 -170051 -63776 258963 -117775 338433 2622 243908 -156939 254672 232593 34831
15975 132800 460362 374301 548173 878302 685217 760139 858246 670584 616748 460367
15965 460367 436012 88463 72946 147498 -99608 -156431 12105 -19109 -307425 41478 -316307
15953 442415 -96720 -67614 140838 546309 -108538 184213 111441 95754 -131245 -228573
15943 -228573 -130433 64387 -100639 -160167 1171 93821 -260738 -317831 -106713 208756 77268
15931 143717 -530706 -133205 99911 219811 218102 -35067 -369280 104540 20138 173627
15921 173627 28921 -110594 144297 -171351 -174456 105043 285827 -97265 -375913 -470917
15911 -470917 63548 256631 327462 -97614 -63413 4584 -28882 2347 -24263 88710 -279406
15899b2751E1752c1326p9039d5292j88241k7374a9891j23929C0529b65427A99455
15887A3627K62073b15966o6754O8935A10927i4016B6435M85035a09302l07329
15877d16631a03736E7258M3712K37161j60030H6581K80835H1798c01948G1580
15866B35549C7883N6388a69393J5881A1858J34585e3496j96955f772k6542l18165
15855c51479D18561j68677n9228c90817A58133J4044a75588D0568d5746r9166
15845a44912e4066F0108J7298C8480K52686j39042C6628b10439P4732j41717i3151
15833A85499h1341b3116n9780A84321b86639A03898c56073a48518e8476j32310
15823a90786Q2839k28575Q0890B69688d5584D5735a03502F8526i8592d3717q2956
$$ plain form
15899 -22751 51752 -31326 -110365 -45292 -233533 -260907 -19891 -143820 30529 -265427 199455
15887 13627 275700 -215966 -282720 -213785 110927 -94016 26435 511470 -109302 -416631
15877 -416631 -103736 57258 100970 338131 178101 86581 367416 81798 -301948 71580
15866 235549 37883 94271 -169393 -153512 11858 146443 -53496 -250451 -6772 -33314 -351479
15855 -351479 418561 249884 190656 -390817 158133 172177 -175588 40568 -45746 -144912
15845 -144912 -54066 60108 77406 38480 291166 152124 36628 -210439 -135707 -277424 -93151
15833 185499 -81341 -23116 -82896 184321 -286639 103898 -356073 -148518 -58476 -190786
15823 -190786 -107947 -336522 -255632 269688 -45584 45735 -103502 68526 -98592 -43717 -126673
15812a26673J1709b8873j67551C4325L8902f2735A14794l195b17709h5735H6199
15800a31814M9580b0044p3381n4123k89866a62882A53011d9948j00474B88128
15789a52369p2046H6895b83523A7759M1256K86601a00758j09412H1342N3523L1940
15778A66805a6275k61214B72212c03387B929c19405f7643n5420F1479Q6751R8417
15767B46647l0820c22053e2316A60472F3530a1798M463k85584G0608J33993A7507
15755I1713a36463A81466b68324A29442A137K01200d0542j12730B0921J06586
15745A27507d60559e4315a269k27678e1824j95367M2656J00036I0580J10888b03638
15733H9411N3982K9332J82954A02060J82466m6927g4629j73386M0196E3522i3015
$$ plain form
15812 -126673 -114964 -28873 -196424 34325 73227 -62735 114794 111599 -217709 -85735 86199
15800 -131814 -82234 -20044 -93425 -147548 -437414 -162882 153011 -49948 -150422 288128
15789 -152369 -224415 86895 -283523 17759 59015 345616 -100758 -210170 81342 134865 166805
15778 166805 -16275 -277489 272212 -303387 2929 -319405 -67643 -123063 61479 148230 246647
15767 246647 215827 -322053 -52316 160472 63530 -11798 -7335 -292919 70608 204601 17507
15755 91713 -136463 181466 -268324 129442 1137 202337 -40542 -153272 20921 127507
15745 127507 -460559 -54315 -1269 -228947 -51824 -247191 -204535 -104499 90580 201468 -203638
15733 89411 143393 172725 355679 102060 284526 237599 -74629 -248015 -207819 53522 -93015
15721b27403Q8032j56144O7547g0734A37215N0619g9986a399o6875j57431A18212
15709D45812A11089i062l20688A02688b47333B5608e6153A69667n1699c0242C09771
15697D8325h5159j38427a10345N107j29135e5004l55118K0231A98014p9222b13394
15685h9214H796c7952j91584B5823d83011A74675c73912C7190g0719A05427k5486
15674G9941h2405A52020M4107h5087a8323C4323a68963O9173A01503i6240B36578
15662h2305G8449b19292f8318J063C3540J67366I5580b24H7355J03649E465K49729
15650B55194l8411l4134a2255r6738m2166A41373d550C33893b26943R2014j27617
15639b62546B52101j22050J39895j02295b4866A65962L86688c96259h4882F1224
$$ plain form
15721 -227403 -139371 -295515 -227968 -70734 137215 187834 -79986 -1399 -68274 -225705 118212
15709 445812 111089 -9062 -329750 102688 -247333 25608 -56153 169667 117968 -30242 309771
15697 48325 -85159 -223586 -110345 -105238 -234373 -55004 -410122 -389891 198014 118792 -213394
15685 -89214 8796 -37952 -229536 25823 -483011 174675 -373912 37190 -70719 105427 79941
15674 79941 -82405 152020 196127 -85087 -18323 34323 -168963 -99790 101503 -96240 236578
15662 -82305 78449 -219292 -68318 -67255 33540 200906 95580 -224 87355 191004 5465 255194
15650 255194 216783 182649 -12255 -108993 -151159 141373 -4550 333893 -226943 -134929 -262546
15639 -262546 252101 130051 269946 167651 -24866 165962 552650 -396259 -84882 61224
15628H974O0574K0268h7528c3091k06562Q6622q8604G9153J11149a74793J4696
15617a60097P483F4878l0309f1119A36671D2300rd7422B35684d1746J4600j54918
15605a82064A08597d54112B38041P0637m8693a05766H4109A2828J54700l0386
15595A37142M6531D7855H557J15430d69261h6523L4455l7485k911j74839A70575
15583a43616A32817N5349J17435h6504D8363f7181j8943C1097a39452B59230C9977
15571a32903B54518m5151g358m9523A38536h6737A32542a88611l4A9573a92617
15559h95n13541b8038C4010M2826d7314j42721Q1982B7940c41059a01114A939
15547B2991g6243m16639a19847N4211R27H714L03119a77041N5508A64127p2703
$$ plain form
15628 8974 69548 89816 -87528 -33091 -239653 -153031 -241635 79153 190302 -174793 -160097
15617 -160097 -152614 64878 34569 -61119 136671 42300 42291 -47422 235684 -41746 -27146 -182064
15605 -182064 108597 -454112 238041 308678 259985 -105766 84109 12828 167528 137142
15595 137142 183673 47855 8557 123987 -469261 -86523 -52068 -89553 -92464 -267303 170575
15583 -143616 132817 188166 305601 -86504 48363 -67181 -86124 31097 -139452 259230 39977
15571 -132903 254518 209367 -7358 -56881 138536 -86737 132542 -188611 -188645 19573 -192617
15559 -895 -514436 -28038 34010 76836 -47314 -190035 -108053 27940 -341059 -101114 1939
15547 22991 -76243 -492882 -119847 -65636 -64709 8714 311833 -177041 -121533 164127 91424
15536I1424O7677E062a45830j17548J00978B4085K27269n1193D8313e4053A31361
15524D895N6591f8300D8242L04127E6116M6498b32019I0979f1528l41484G9837
15512D4973c94965J08502B19352J4702H6661b09403B94682C3432Q5056K44954
15502C63442A17731P2448j0488c6577B26823j05310K84407H1564l9474a31004
15491A24077l271J04803Q3294J46182j65181M1522A9481J1963K79170D0802R472
15480E0274b13072C64780G7228J7632N9088G3770M8280j851N4149F1091a81777
15468D70914i0930C755a06005A34185K8720M5216N7594L4475A38694K93765K2943
15457D55402K80812k47200k08481m9271J93334a71949c8161A94892p2556l2136
$$ plain form
15536 91424 159101 5062 -145830 -263378 -162400 24085 251354 200161 48313 -54053 131361
15524 4895 61486 -68300 48242 352369 56116 102614 -232019 90979 -61528 -403012 79837
15512 44973 -394965 -286463 219352 234054 86661 -209403 294682 33432 118488 363442
15502 363442 117731 190179 179691 -36577 226823 121513 405920 81564 42090 -131004
15491 124077 120806 225609 308903 455085 289904 331426 19481 31444 310614 40802 50274
15480 50274 -213072 364780 77228 94860 153948 73770 122050 120199 174348 61091 -181777
15468 470914 -90930 3755 -106005 134185 162905 208121 265715 300190 138694 432459 455402
15457 455402 736214 489014 280533 231262 424596 -171949 -38161 194892 122336 90200
15447I0200a36515j1919A89443a21285L3627M480c9001A04514c3822o8584A3458
15435B02395K76539A03422O3363L31040A24869J08100j6393L5106O3847M42562
15425G58091M35762j72385k56171l9373l47932Q329A81542N2890H6718c49781
15414b13507g0556D3701i0156A25925E6895c68B7756a98439B71023c42342Q8697
15403b53645B15571d15840A21942g8751L1901k13392A53360a81951I0567b01A01921
15391B48491J38504g7773j79703G0828P2115A8085L97593j88488D7750c88486
15380i8349F2874a3386C07180D590i055B59505b21697B32856i3351A12982J91795
15369C04777E4274l603m029a84326A76674p719J66958A34014L65470A39841a19480
$$ plain form
15447 90200 -136515 -148434 189443 -121285 -87658 -83178 -39001 104514 -33822 -102406 13458
15435 202395 478934 103422 166785 497825 124869 232969 216576 251682 315529 758091
15425 758091 1193853 1021468 765297 725924 377992 386321 181542 234432 86718 -349781
15414 -213507 -70556 43701 -90156 125925 56895 -368 27756 -198439 271023 -342342 -253645
15403 -253645 215571 -415840 121942 -78751 -46850 -260242 153360 -181951 90567 -201 101921
15391 248491 386995 -77773 -257476 70828 142943 18085 415678 227190 47750 -388486
15380 -98349 62874 -13386 307180 4590 -9055 259505 -221697 232856 -93351 112982 304777
15369 304777 54274 50671 46642 -184326 176674 168955 335913 134014 499484 139841 -119480
15357C74824B6177J28541F0694L39113G8317K48857F9565K05225A25013C5485
15346C55575g7491B68249J90977n6681c9988B37303J0919h9872l1541A71781J54005
15335C25786j14504j2525R0845O1516A40005R6545p4361J15001J34821j80115
15325B31896M73636j54743A4694K19025b23161D15554B247d7992B11388J3402
15315B24790e3343b6408j17830B86356I1396L66086e7834A02485R1776d1826A27227
15303A55134Q5855n1065j6195J93398I7285J91224a80760A58377O7268M3236D082
15291B6650a54570b408j00815l9058A13645M4359b01748b0133I0824I907L4364
15280D4271b33518J15902B50731n348d5793A3512d31001A4128b23465D9586J00408
$$ plain form
15357 374824 26177 154718 60694 399807 78317 327174 69565 274790 125013 35485
15346 355575 -77491 268249 459226 402545 -39988 237303 248222 -89872 -121413 171781 325786
15335 325786 211282 198757 289602 351118 140005 236550 162189 277190 412011 231896
15325 231896 705532 550789 14694 233719 -223161 415554 2247 -47992 211388 224790
15315 224790 -53343 -26408 -144238 286356 91396 457482 -57834 102485 194261 -41826 127227
15303 155134 240989 189924 173729 367127 97285 288509 -180760 158377 225645 268881 4082
15291 26650 -154570 -2408 -103223 -142281 113645 158004 -201748 -20133 90824 9907 44271
15280 44271 -233518 -117616 250731 245383 -45793 13512 -431001 14128 -223465 49586 149994
15269A49994J1846a33367c4980G4910M04547A81063b25697C44634j5052A16184
15258C69995A05947L8133e7285A44422E0097b1294A85455b2453F656N199b2347
15246b3829B56898F5283L3029a46129B48696a32718A50088C6271K6737g8460C37336
15234F040a52167C49279Q4147l9034A10070O73376O90166J55587k20719L08001
15224A716481p33654m37302o6747A16098d752p3508C38321m1366a14369b1695
15213A37307c1105j56724B82008d6629a2654F5027a45955B68478j18184L0204
15203A80498b01801H3908K58923C2907O0277Q7790J34503F1385a56026C25550
15192b61666d0596A27547J17507j12298M40894F2975N9849a83334A34904K1279
$$ plain form
15269 149994 161840 -133367 -34980 74910 479457 181063 -225697 344634 329582 116184
15258 369995 105947 144080 -57285 144422 50097 -21294 185455 -22453 6656 11855 -22347
15246 -23829 256898 65283 98312 -146129 248696 -132718 150088 36271 63008 -78460 337336
15234 6040 -152167 349279 433426 394392 110070 783446 1473612 1629199 1408480 1716481
15224 1716481 982827 545525 478778 116098 -4752 -78260 338321 296955 -114369 -21695
15213 137307 -31105 -187829 282008 -46629 -12654 65027 -145955 268478 150294 180498
15203 180498 -201801 83908 342831 32907 93184 180974 315477 61385 -156026 325550
15192 -261666 -40596 127547 245054 132756 573650 62975 122824 -183334 134904 156183
15182A56183a4374o8730B2469J13096A3816b4374B16237E7978Q548k126a14086
15170A80745n9588P6330a44851A10354f6640A92579b46821a20702N3997k3692
15160i0397C12897C8575f1923B41488j15332J22293C3109L78372b11369p711A71048
15148a97646p0542B36484P6486b26061H0685M1739M0205Q8718L8187F5058J59626
15137B24684b8388o6786A49194M5092n7358j9708J09865J81509d8301A57963K19911
15126C77874a56066B16235r5034b68746B04202L023N997C724i5869A53366P7126
15115B30492A14113l5495J25141A8917J36146m7974l7389O5463J23907l6408l1757
15104A90905M58887k05614L3030A10999B8453g4356B90205K0461r2100J6174a81419
$$ plain form
15182 156183 -14374 -83104 22469 135565 13816 -24374 216237 57978 66526 64400 -114086
15170 180745 121157 197487 -144851 110354 -66640 192579 -246821 -120702 -66705 -90397
15160 -90397 312897 38575 -61923 241488 126156 248449 33109 411481 -211369 -219080 171048
15148 -197646 -268188 236484 312970 -226061 80685 122424 162629 251347 289534 65058 224684
15137 224684 -28388 -95174 149194 194286 136928 117220 227085 408594 -48301 157963 377874
15126 377874 -156066 216235 121201 -268746 204202 207225 213222 3724 -95869 153366 230492
15115 230492 114113 78618 203759 18917 155063 107089 69700 135163 259070 222662 190905
15104 190905 649792 444178 477208 110999 28453 -74356 290205 310666 218566 234740 -181419
15092D18096A07249J11291I0629J53552J8316K0817K8177C7948J02460K03125
15082C43533j23797q0564J13487A15727O782j422O588P4513J27080G5328J5915
15071I1243K90843H2420J57883J60667r2869J7600g0492B13093q7030P0783q8697
15060A08149M2683i7041D45458k19393J64286I7795L53847l3530f126D36440A11159
15048B16278K4083N0808l2739I3005J77543a7517D91391m8739A18555K1147K6903
15037A66605K32993n4886A52847N98854A28443J64440M33009O0630l69375j90547
15027B26600J55819J15278j12291j81244J86545O2119k10484J9955K96455j56951
15017D01801K43147j72526L84854l66045K97766l45083j0668J56705K87821l16217
$$ plain form
15092 418096 107249 218540 90629 244181 262497 283314 311491 37948 140408 343533
15082 343533 219736 139172 252659 115727 122509 121087 127675 202188 329268 75328 91243
15071 91243 382086 82420 240303 400970 308101 325701 -70492 213093 126063 196846 108149
15060 108149 150832 -97041 445458 226065 390351 97795 451642 418112 -6126 436440 111159
15048 216278 240361 291169 258430 93005 270548 -17517 491391 442652 118555 139702 166605
15037 166605 399598 344712 152847 751701 128443 292883 725892 786522 417147 226600
15027 226600 382419 497697 385406 204162 390707 452826 242342 262297 558752 401801
15017 401801 644948 472422 857276 491231 788997 443914 433246 589951 877772 561555
15007E61555B75041M43648j78120k4206A3971N78419l9414K09119C49139O4374
14997D13513N2292J42909k11140k3891J67920L3836K6003k21011C7069M78650
14987E15719k14998K67568k26980L8699j9185K44337K34107l52572K4603j94497
14977C16801K2866a01737C53598L39752J00482k45017L4185J32861l5639M7798
14967G28020j40957M3824K29513j67469j51522M7325J2729O3060l05606j2807
14957C46110J65448L22167l75215j19895J93017m6133B39851J15033A09908L27707
14947D37615A80927K47613j60952L48430k64683f486E72670l0742k34281K77258
14937E84905j3247k63749N4566J54485k80J29343j02463k23438M03675q9108K10789
$$ plain form
15007 561555 275041 718689 540569 516363 13971 592390 552976 762095 349139 413513
14997 413513 465805 608714 397574 373683 541603 575439 601442 380431 37069 515719
14987 515719 300721 568289 341309 380008 360823 605160 839267 486695 511298 316801
14977 316801 339667 -101737 353598 693350 793832 548815 583000 715861 680222 728020
14967 728020 587063 630887 860400 692931 541409 588734 601463 664523 358917 346110
14957 346110 511558 833725 458510 338615 531632 485499 239851 354884 109908 437615
14947 437615 180927 428540 267588 616018 351335 -6486 572670 541928 307647 584905
14937 584905 571658 307909 362475 516960 516680 646023 543560 320122 723797 634689 845478
14926H45478l01202J47888K0952k74857j5405A49518K83823K87848l5796p330
14916F78063J52211O32735p6558J97285j28402J182m2815L21054j3148O0090J16177
14905A897874k38839M5311L70143O9587L42965N2311p49520q0049k71307q1382
14895A357094k16746M0385m25547k00868O9800P0352k94879K19896A83394M10565
14885E93959k57224J96733M0473j20009J22080A89930L46543J3100K2092k08125
14875C63540M0889o9622J21836r3153K21667K79654J11177J5417J21440j74799
14865I38046l9615K51641j59400j09977j99601J22300k75547j28823n9969A52657
14854H16326l61574J11797L38790l60894J86466C26032K54597o1074J20004j50086
$$ plain form
14926 845478 544276 692164 713116 438259 422854 149518 433341 721189 685393 678063
14916 678063 830274 1463009 1386451 1583736 1455334 1456516 1413701 1734755 1721607 1781697 1897874
14905 1897874 1659035 1704346 2074489 2144076 2487041 2539352 1789832 1709783 1438476 1357094
14895 1357094 1140348 1180733 755186 554318 624118 694470 399591 619487 183394 593959
14885 593959 336735 533468 573941 453932 576012 189930 536473 549573 571665 363540
14875 363540 404429 334807 456643 363490 585157 864811 975988 991405 1112845 938046
14865 938046 898431 1150072 990672 880695 681094 803394 527847 399024 339055 152657
14854 816326 454752 566549 905339 544445 730911 326032 580629 519555 639559 489473
14844D89473J95263C10727J50034j94857Q224L69042K8082j80591k00663J77798
14834D67796p0081J48331L1204N8388r5968O2780K53403m8657K11720j9956p501
14823I91459J12274J2784j13884j81750n2591J41325k03359j85624K07981j35137
14813E93478k35810N5001n5490L12406j95117L37414L74228l88720J42560k13125
14803G26825K77684l05074P5130r1528k4764k17137K20235M09951E23985N16201
14793A040186m55238r2516M25173Q5015j19789J63011r2407K172o2313J2077D01630
14781D20782J20117j55658j44253M53925k46184K74720k12741M09596Q0286Q764
14771A009354D07171K67088L53165k92612n7944j34687L37308j61320O5684n629
$$ plain form
14844 489473 684736 310727 460761 265904 274128 643170 671252 490661 289998 467796
14834 467796 397715 546046 577250 635638 539670 602450 855853 807196 1018916 998960 991459
14823 991459 1103733 1116517 1002633 820883 768292 909617 706258 520634 728615 593478
14813 593478 357668 412669 357179 669585 474468 811882 1186110 797390 939950 726825
14803 726825 1004509 699435 774565 683037 658273 441136 661371 1071322 523985 1040186
14793 1040186 584948 492432 917605 1002620 882831 1045842 953435 955607 893294 905371 401630
14781 420782 540899 385241 240988 694913 448729 723449 510708 920304 1000590 1009354
14771 1009354 407171 674259 1027424 734812 676868 542181 879489 718169 783853 778224
14761G78224k92053P33894l65365O3781j76463K82278k11033n3212k63158K78141
14751G75034N2471Q1719o3057p6144k27024K42613k4008k71035O5514J40363R4263
14740G90709K6726K75582l36704j52850J7139J67534M85702m00649k02437L40249
14730A011001l51523K14282k02566P9420J82624k13761j466m7214J9773J63903
14720H54473J34233J56397j21763k71549K4434L14206K40081M11426m7542J83124
14710A877520p0652J22667l41453L2797m03350J00536q8736Q9282n35743J21400
14700I04268K4693k37824K31439L20095j20991k31062J03800K11710j65636j55552
14690H84940J34408M68379J54555l33103L97332Q8061K68073l49606q5708l42116
$$ plain form
14761 778224 486171 1220065 854700 918481 742018 1024296 813263 760051 496893 775034
14751 775034 827505 909224 846167 770023 542999 785612 761604 490569 556083 696446 790709
14740 790709 817435 1093017 756313 603463 620602 788136 1273838 873189 670752 1011001
14730 1011001 659478 873760 671194 750614 933238 719477 718011 670797 690570 854473
14720 854473 988706 1145103 1023340 751791 776225 1090431 1330512 1741938 1694396 1877520
14710 1877520 1806868 1929535 1588082 1620879 1217529 1318065 1229329 1318611 782868 904268
14700 904268 928961 691137 922576 1242671 1121680 890618 994418 1206128 1040492 884940
14690 884940 1019348 1487727 1642282 1309179 1706511 1794572 2062645 1713039 1627331 1285215
14680A285215o2977K00977n08152n3957M6531j48724M25769j56389N3695j66143
14670I15845K96895n77620K86110j46206J50633K04475q5099R6138k56082J85147
14660A070236L3628J99163P7279j51122j10051J18137k48279L3562j53840K22484
14650A091197M3866J20402j48901J95063l21749j23886L11620p0857L62439k18894
14640A240300k54487N10470n03638M45120Q4544k29391K20614k56594J00097j93694
14630A163341l03438M15350k4970J47448k58021L68551K62285m14102L11702k79652
14620A388494J40995K67693n36691L1364K95028k21714k28455P2137j83590N97700
14610A622961J29913m51847J99064J34518l48182j25380L45098q9949L80778j12022
$$ plain form
14680 1285215 1222238 1423215 915063 861106 907637 758913 1184682 1028293 1081988 915845
14670 915845 1212740 635120 921230 775024 925657 1130132 1045033 1141171 885089 1070236
14660 1070236 1103864 1303027 1380306 1229184 1119133 1237270 988991 1022553 868713 1091197
14650 1091197 1135063 1255465 1106564 1301627 979878 855992 1167612 1096755 1459194 1240300
14640 1240300 985813 1496283 992645 1437765 1522309 1292918 1513532 1256938 1357035 1163341
14630 1163341 859903 1275253 1250283 1397731 1139710 1508261 1770546 1356444 1668146 1388494
14620 1388494 1529489 1797182 1260491 1291855 1586883 1365169 1136714 1208851 1025261 1622961
14610 1622961 1752874 1301027 1500091 1634609 1286427 1161047 1506145 1416196 1796974 1684952
14600A684952k42605O93136o97174o7871l1928L18295k03548L06855l21744J25577
14590A563945J1535J92748M3365l5316l67417K62629K02986l04637J83302J12607
14580A865747N6526k12293k44055N01924m03659L2719M84753J44678n40730K3448
14570A709058J5667N94478n22466K20244j7707J56949j67409J05031j82850L78103
14560B289098l49409J22884P035K5824J18662J02156K300k38696N09417m06929
14550B182342K11779K45201j24036j22087M54882K8693M91321P7722k564n5871
14540C387382M98698P11892K93525M14516J131777J332605J607867M190238N783073
14531A9351573R489327P017420j4895607r122665m703254k166605m04877K48906
$$ plain form
14600 1684952 1442347 2135483 1438309 1370438 1338510 1656805 1453257 1760112 1438368 1563945
14590 1563945 1575480 1768228 1811593 1776277 1408860 1671489 1874475 1569838 1753140 1865747
14580 1865747 1922273 1709980 1465925 1967849 1564190 1596909 2081662 2226340 1685610 1709058
14570 1709058 1724725 2319203 1796737 2016981 1999274 2156223 1988814 2093845 1910995 2289098
14560 2289098 1939689 2062573 2069608 2095432 2214094 2316250 2318550 2079854 2589271 2182342
14550 2182342 2394121 2639322 2515286 2393199 2848081 2876774 3368095 3445817 3443253 3387382
14540 3387382 3886080 4597972 4891497 5306013 6437790 7770395 9378262 13568500 19351573
14531 19351573 28840900 35858320 20962713 11840048 7136794 4970189 4565312 4814218
14523D814218P31495j714957q39746m69639k53974K97249k11555J46763k84457
14514B215397L15420L5074j27860J15544k75657K91974M0111K21792k26749l80734
14504B224312N37491j38391K60685p1076o9217k41452M09431O4191k47277K56498
14494B985195l79548K72464J38629L10269k06356k1769j57209M81239k88754K93608
14484C427768j66726J03972K424r6904J73774K7066k30379M31556K23331l19822
14474C576060k11368M27643k9437K20900n76171M70679j12801J02298J30932k66780
14464C731955J88424M52295k06147m57880M81167k08309L38858l49513K69172
14455D240022j6797L75296j56932M25363o3299k62828J62191K88540l54161J35462
$$ plain form
14523 4814218 5545713 3830756 2991010 2521371 2267397 2564646 2353091 2499854 2215397
14514 2215397 2530817 2565891 2438031 2553575 2277918 2569892 2610003 2831795 2605046 2224312
14504 2224312 2761803 2623412 2884097 2813021 2743804 2502352 2911783 2975974 2728697 2985195
14494 2985195 2605647 2878111 3016740 3327009 3120653 3098884 2941675 3422914 3134160 3427768
14484 3427768 3261042 3365014 3367438 3270534 3444308 3471374 3240995 3672551 3895882 3576060
14474 3576060 3364692 3792335 3762898 3983798 3407627 3878306 3765505 3867803 3998735 3731955
14464 3731955 3920379 4372674 4166527 3708647 4189814 3981505 4320363 3970850 4240022
14455 4240022 4223225 4598521 4441589 4866952 4803653 4540825 4703016 4991556 4637395 4772857
14445D772857K88784l04882L46504q0214m6178J72922M11375n6321k51340J56354
14435E409861j42933O3189J72197N0210M5910K41037l11634L15435N33345j90746
14425F185871J58788l6189K74753J0942Q7418l09300L88941J26596J99097M6076
14415G132993K80175R4888k93306M44645j81104M52898j52577J38279L78246j98794
14405H096343O87860m0595L4725N288J22557K75515j93328L60087j19498K66040
14395I494994l69808L23899J13669L38436n911K55110M81545r9209N67302m42901
14385A0657126K25307J26609K09012O9240M65510q7439K63131K8389M40627L34563
14375A2732075j65140J76952K66151P26035k17889M36563M70111J14503M09251
$$ plain form
14445 4772857 5061641 4756759 5103263 5023049 4976871 5149793 5561168 5504847 5253507 5409861
14435 5409861 5266928 5330117 5502314 5552524 5598434 5839471 5527837 5843272 6376617 6185871
14425 6185871 6344659 6308470 6583223 6594165 6681583 6372283 6761224 6887820 7086917 7132993
14415 7132993 7413168 7508056 7214750 7659395 7478291 7931189 7778612 7916891 8295137 8096343
14405 8096343 8784203 8743608 8778333 8783621 8906178 9181693 8988365 9348452 9228954 9494994
14395 9494994 9125186 9449085 9562754 9901190 9895279 10150389 10631934 10532725 11100027 10657126
14385 10657126 10882433 11009042 11218054 11287294 11752804 11665365 11928496 11956885 12397512 12732075
14375 12732075 12566935 12743887 13010038 13736073 13518184 13954747 14424858 14539361 14948612
14366A4948612K18837J2497P97584K08416l3936M01307l39613J068871O2859J61525
14356A7506959L48276P68700j51343M90920O17007O49333O52477M2457J49667
14347B1074453K28929P37758N91791L60245M83202O06234L76913P51790M67968
14338B5679283O50669R15269K54970P05995J190869L13693Q58096R66673Q19230
14329C2354747N48682P79247R67051J269597J026137J084863J262231J002155
14321D0294710J099193J002557J394518J301862J277243J302687J567955J667561
14313E0908286J734708J564915J845002J898510K104158K197196K005247K263536
14305F6521558K510174K260818K942808K627542K787643L188520L133545L557000
$$ plain form
14366 14948612 15167449 15179946 15977530 16185946 16152010 16553317 16213704 17282575 17345434 17506959
14356 17506959 17855235 18623935 18472592 18963512 19580519 20229852 20882329 20924786 21074453
14347 21074453 21303382 22041140 22632931 22993176 23476378 24082612 24459525 25211315 25679283
14338 25679283 26329952 27245221 27500191 28206186 29397055 29710748 30568844 31535517 32354747
14329 32354747 32903429 33682676 34649727 35919324 36945461 38030324 39292555 40294710
14321 40294710 41393903 42396460 43790978 45092840 46370083 47672770 49240725 50908286
14313 50908286 52642994 54207909 56052911 57951421 60055579 62252775 64258022 66521558
14305 66521558 69031732 71292550 74235358 76862900 79650543 82839063 85972608 89529608
14297H9529608L721058L700342M375929M113941M847794M983267N017200N647736
14289A25936875N408222O405316O622476O489694P485330P877742Q173080Q888154
14281A83286889R179728R734671J0227347J1077838J1610959J1822053J3196241
14274B60135726J3470244J3928677J4255312J4332614J4562183J4411439J4688617
14267C59784812J4448548J2855337J3203593J2859582J1938525J1643033R991035
14260D46724465Q958642Q504811O027626K801680J879143K727274L153104n460375
14252D75316370n530638q284608r876644j2145666j1749928j4055010j5069381
14245C98604495j3916776j4976144j5023380j5084094j4466018j4391482j4591308
$$ plain form
14297 89529608 93250666 96951008 101326937 105440878 110288672 115271939 120289139 125936875
14289 125936875 131345097 137750413 144372889 150862583 158347913 166225655 174398735 183286889
14281 183286889 192466617 202201288 212428635 223506473 235117432 246939485 260135726
14274 260135726 273605970 287534647 301789959 316122573 330684756 345096195 359784812
14267 359784812 374233360 387088697 400292290 413151872 425090397 436733430 446724465
14260 446724465 455683107 464187918 470215544 473017224 474896367 477623641 480776745 475316370
14252 475316370 469785732 461501124 451624480 439478814 427728886 413673876 398604495
14245 398604495 384687719 369711575 354688195 339604101 325138083 310746601 296155293
14238B96155293j4103658j3679172j2351047j3010871j2060420j1684357j1864514
14231B07401254j1012662j0032006r372734q772191q348072p568008p327568o766112
14223A38201901o014788o057341n551977n502747n064523m548149m644522l755155
14215I7062699l995413l724035l386889l534932l214295l234781k662106k569764
14207G0740484k568485k150116k328911j815239k628639k063396j456076k234765
14199E3494857j267502j296179j700712j562905j923896q96102j178167r40786
14191D2728608j202895j513169j390991r25712j028522o38379r96657r77334q43692
14182C3211257j059818r84167o06227n54773m52802j088237r47131o04310l93815
$$ plain form
14238 296155293 282051635 268372463 256021416 243010545 230950125 219265768 207401254
14231 207401254 196388592 186356586 176983852 168211661 159863589 152295581 144968013 138201901
14223 138201901 132187113 126129772 120577795 115075048 110010525 105462376 100817854 97062699
14215 97062699 93067286 89343251 85956362 82421430 79207135 75972354 73310248 70740484
14207 70740484 68171999 66021883 63692972 61877733 59249094 57185698 55729622 53494857
14199 53494857 52227355 50931176 49230464 47667559 45743663 44847561 43669394 42728608
14191 42728608 41525713 40012544 38621553 37695841 36667319 36028940 35032283 34054949 33211257
14182 33211257 32151439 31167272 30561045 30006272 29553470 28465233 27518102 26913792 26519977
14173B6519977r80734m37474n77419m50758n10095o81407m67357o30442o8484
14164B1715807o24294o08145l16595n64934k14625o82654k44164k01021n14000
14155A7745375Q3665p60769R5477n53745k34999m64038Q5729p82499j11517r9544
14145A5003135p71643j84953J39470m39305k08106j93895j84777q3484m66175
14136A2610267k45312k75001J56030j97558j85666k88453k62550J39556m15367
14127A1035946l68994N4528j14647q48942L28969R2207m55020j96658L14913m56742
14117I385560m51938L9056J14717m06640j41771j24307N17885n11706k40156l67407
14107G813293L07937L82139j065578J31122j89732J45881k38807p9052j49301
$$ plain form
14173 26519977 25539243 25101769 24524350 24073592 23563497 22882090 22414733 21784291 21715807
14164 21715807 21091513 20483368 20166773 19601839 19387214 18704560 18460396 18259375 17745375
14155 17745375 17829040 17068271 17163748 16610003 16375004 15910966 15996695 15214196 15102679 15003135
14145 15003135 14231492 14046539 14186009 13746704 13538598 13344703 13159926 13076442 12610267
14136 12610267 12364955 12089954 12245984 12048426 11862760 11574307 11311757 11451313 11035946
14127 11035946 10666952 10721480 10606833 9757891 10086860 10179067 9724047 9527389 9842302 9385560
14117 9385560 8933622 8972678 9087395 8680755 8538984 8414677 8932562 8420856 8180700 7813293
14107 7813293 8121230 8503369 7437791 7568913 7379181 7525062 7286255 7207203 7057902
14098G057902l18006L7732J74678o1447k85262P6386k13342Q8586j61281j15062
14088F280884L17264p8224k59240P0989k49193l19352q6838O2605p3336N3473
14078E719032K33693m03247P5853J0130j44789k14716J05951p1558m4132j05805
14068E160412l98633l7661Q4168L41646l78376j18601O3927p6302k30765L1368
14058D441183p7319L35533m12138K91410k40866K6382K55833n76822K08915n9424
14048D192687P8655L6582K6703J96081o13401M41736n69142M3758O4740j51461
14038C746938L6583K49068k76219j07862p1965j23581K15158r6673k61784R1804
14028C401467j17015j01338K44343j46294J62570k06287k1603J07206l19586J53888
$$ plain form
14098 7057902 6739896 6777628 6952306 6890859 6605597 6681983 6468641 6557227 6395946 6280884
14088 6280884 6598148 6519924 6260684 6331673 6082480 5763128 5676290 5738895 5665559 5719032
14078 5719032 5952725 5549478 5625331 5635461 5490672 5275956 5381907 5310349 5266217 5160412
14068 5160412 4761779 4724118 4808286 5149932 4771556 4652955 4716882 4640580 4409815 4441183
14058 4441183 4363864 4699397 4287259 4578669 4337803 4364185 4620018 4043196 4252111 4192687
14048 4192687 4271342 4307924 4334627 4530708 3917307 4359043 3789901 3833659 3898399 3746938
14038 3746938 3783521 4032589 3756370 3648508 3576543 3452962 3668120 3571447 3309663 3401467
14028 3401467 3284452 3183114 3427457 3281163 3443733 3237446 3215843 3323049 3003463 3157351
14018C157351M9123j16406j15577K3719j28271K97916l72160K10481j28669l19650
14008B557857j88446N13337j74794j45790j55412K57486M9592j23249o9350J93252
13998B714483K2494k68798o824j14014q3258J85348m88747M58790l68960J45066
13988B195580j37164M03171j59309J97981Q4387l08764M04101N428p7232L75289
13978B983468J2446M85033J73181Q52450J852191K620914N121845R223372J2922786
13969C6247686j0280695r779108n649131l227509j282972j297775n73646m74746
13961C682104L2181n60828k50529J43422J8571m42888N621j82777j51948M65138
13951B758067l87907J84793m20936J00202Q16p3523o6831R2416j56446J44991
$$ plain form
14018 3157351 3206474 3090068 2974491 2998210 2869939 3167855 2795695 3006176 2877507 2557857
14008 2557857 2369411 2882748 2707954 2562164 2406752 2664238 2713830 2590581 2521231 2714483
13998 2714483 2736977 2468179 2461355 2347341 2264083 2449431 1960684 2419474 2050514 2195580
13988 2195580 2058416 2461587 2302278 2500259 2584646 2275882 2679983 2685411 2608179 2983468
13978 2983468 2995914 3480947 3654128 4506578 6358769 8979683 14101528 23324900 36247686
13969 36247686 25966991 16187883 10538752 7311243 6028271 4730496 4156850 3682104
13961 3682104 3714285 3153457 2902928 3046350 3064921 2622033 2627654 2444877 2292929 2758067
13951 2758067 2370160 2554953 2134017 2234219 2235035 2161512 2094681 2187097 2030651 2175642
13941B175642j51140k20730K06463m852K51648m52527M10818k51899r7774J6296
13931A881945K08408k22128m45111J63713L13845k92010n0314J25395J79672K89756
13921B153171m15498L7469J275k99548K89841k22518J17671k39929J79306j77462
13911A423778J40208l13762L90080r289j94051J96560J713j30512l02361M81824
13901A684188j16812k53952K10708j67585J12951J24540l23049L10455k66237
13892A315207j9827r7802M72056m63798K04603J56792l14409K55060Q677K6784
13882A543343n15282L31567l45550M07704O1612o8812L0952k00653m081j75299
13872A065501J05382L31137j80409l91889L45648k44925L95465N7899n67902L14906
$$ plain form
13941 2175642 2024502 1803772 2010235 2005383 2257031 1804504 2215322 1963423 1865649 1881945
13931 1881945 2090353 1868225 1423114 1586827 1900672 1608662 1558348 1683743 1863415 2153171
13921 2153171 1737673 1775142 1776417 1476869 1766710 1544192 1661863 1421934 1601240 1423778
13911 1423778 1563986 1250224 1640304 1631015 1436964 1633524 1635237 1504725 1202364 1684188
13901 1684188 1567376 1313424 1524132 1356547 1469498 1594038 1270989 1581444 1315207
13892 1315207 1295380 1197578 1669634 1205836 1410439 1567231 1252822 1507882 1516559 1543343
13882 1543343 1028061 1359628 1014078 1421782 1483394 1414582 1445534 1244881 1240800 1065501
13872 1065501 1170883 1502020 1321611 929722 1275370 1030445 1425910 1483809 915907 1230813
13862A230813j08725j7748m1738L57912k34177J25678K44396n69870L48520J8999
13852A354060l29449L32357J1823l63875k41224N55522L8182l96540M2360L34271
13842A337487n44669O7355r7694K63851j23010J52047Q791M6306l24129M52780
13832A239115j25500q4398J29712k90067J18593J37826j63703J97998m5342j58877
13822I55357m195M8219L1643j09363q7028n4719J01605k5738q969P5519J8110
13811I40441j20221J19842j04875j804l08355L36764m3171P1962q0890L73203
13801A182896l63497J80873j49573L34775n88712M7192R0791J46115j03210n0295
13791G27355Q1284q5913K81679n8191l44217M37550k45282k68382M43077m44916
$$ plain form
13862 1230813 1122088 1104340 1062602 1420514 1186337 1312015 1556411 986541 1335061 1354060
13852 1354060 1024611 1356968 1368791 1004916 763692 1319214 1357396 960856 1003216 1337487
13842 1337487 792818 860173 762479 1026330 903320 1055367 1064158 1110464 786335 1239115
13832 1239115 1113615 1029217 1158929 868862 987455 1125281 961578 1159576 1114234 955357
13822 955357 951162 999381 1031024 921661 834633 779914 881519 855781 846812 922331 940441
13811 940441 820220 940062 835187 833383 525028 861792 818621 890583 809693 1182896
13801 1182896 819399 1000272 850699 1185474 596762 643954 734745 880860 777650 727355
13791 727355 808639 722726 1004405 946214 601997 1039547 794265 525883 968960 524044
13781E24044K78592j32503j82196K84680j90108q823r9257K43822J7387j44047
13771E91591j01892L1175k6678L74455J05512j26405L0892J3888l88973M21425
13761I24990k70567j4359r262j07630J19483J14295k37821Q0385k33928M37080
13751H02666j85154k03594J29201J84183j05235j03243M02988D56614K06342j9000
13741F43956J25m5359r5708L6359j36964R8214J68696j7358N7340m7483J29154
13730G90972l66932J53742K24232l92555J74316J67164j91362R3324j14894J47373
13720F85380p1543K11660n9554j72666o0042N3549P1990j94772Q8332m2492Q5662
13709E95504k54010K88500l7719k46028K72543j0367B33243L12479k3433n0894
$$ plain form
13781 524044 802636 670133 487937 772617 582509 573686 474429 718251 735638 591591
13771 591591 489699 520874 494196 868651 974163 847758 878650 892538 503565 924990
13761 924990 654423 640064 630802 523172 642655 756950 519129 599514 365586 802666
13751 802666 617512 413918 543119 727302 622067 518824 921812 456614 662956 643956
13741 643956 644081 598722 503014 539373 402409 500623 669319 651961 709301 661818 790972
13730 790972 424040 577782 802014 409459 583775 750939 559577 652901 538007 685380
13720 685380 613837 825497 765943 593277 533235 586784 658774 464002 552334 509842 595504
13709 595504 341494 629994 592275 346247 618790 608423 233243 545722 522289 471395
13699D71395j0761K8358K96995B96453K76782k79531M35570l55158K19745j19127
13689D74734K79601B28380J83515G8309N54297Q9B93916J87603K07931J0062j90419
13678E09093L6514A32666M02159k48106M02116B80977K48526k58709L56901l03783
13668C23912K23163k4685L8978k60045K04982A34149J46782L13850K59592B16235
13657B75217L76530j17768K52702k60903A13722L78627p9001O2732j8097n2160
13647D05823q2801J19831k7685P3985j70053N4333J37663J04820k99153n5329
13637B61434K20864k1204O1900R8515B40863J74300j38111J35447A88857L50745
13627E39602j6041B09283O7979L19594j1020B09733L35755Q8352B80396p5460
$$ plain form
13699 471395 460634 488992 785987 296453 573235 293704 729274 374116 593861 474734
13689 474734 754335 228380 411895 78309 632606 632695 293916 481519 689450 699512 509093
13678 509093 545607 132666 534825 286719 688835 280977 529503 270794 627695 323912
13668 323912 547075 522390 561368 301323 506305 134149 280931 594781 854373 216235
13657 275217 651747 533979 786681 525778 113722 492349 413348 476080 457983 405823
13647 405823 323022 442853 415168 489153 319100 373433 511096 615916 316763 261434
13637 261434 482298 461094 522994 621509 240863 415163 277052 412499 188857 539602
13627 539602 523561 209283 277262 596856 585836 209733 545488 633840 280396 204936
13617B04936K24198K2180o2131n9133K34076k43124q2362n808J67379K70763k27405
13606D43569j64276j27780M03981a05071E41611O0404B30032J56244j49687I3503
13595F15581B70483M3695j24822R6576j31584J33522J52357A72527M03385A25458
13584D22411J19075B23288I1992K84706j14537R8416p8735J15018J18158k32875
13574B82143j347M32158A28728K17736j04749G7779M08525j54218j18347k504
13564B11235J94307A36611Q2442J04536K10949B17524g6902B37800d47B86722
13553E34366n3639C7631a94866E38721O6536B1818L33777j55345J80756N513j21882
13542B64637J0443j0137R0974L26539A77066K34133A73029D8729J61303K84705
$$ plain form
13617 204936 429134 451314 389183 330050 564126 321002 238640 232832 400211 670974 443569
13606 443569 279293 151513 555494 -105071 541611 602015 230032 386276 236589 93503
13595 615581 270483 314178 189356 285932 154348 287870 440227 172527 575912 125458
13584 422411 541486 223288 91992 376698 262161 360577 281842 396860 515018 282143
13574 282143 280796 712954 128728 346464 241715 77779 486304 332086 213739 211235
13564 211235 405542 136611 219053 323589 534538 217524 -76902 237800 -447 286722
13553 534366 480727 37631 -194866 538721 605257 21818 355595 200250 381006 386519 264637
13542 264637 275080 264943 355917 682456 177066 411199 173029 48729 210032 494737
13532D94737k4869r8419j53470Q2547R5934j00652m7643J36931A46142a1895C88968
13520C0009J99092l6197K25573j59108A21027J96429J00060A09562J4704P0914
13510A95180J59130j72486N13047C17764j23057L60900k76089o9017L12128Q6574
13500F09203F2803K7453K66190j18023J87326B05847J81275G6904M14159A03590
13489G53466C24506C6381O6427L00655B8876J8022M34132j63398a7880A27046
13478A63097O9141I4338J08831M4876I8547K79403e5477D88527F2709K25763B9428
13466B46166H5709P9640P2177J5506p3711J60250J58585a23932A88930o7411a29455
13454A25068L72746A62470L44906B15579R2754k6417j19716K20953M8827m4418
$$ plain form
13532 494737 469868 371449 217979 300526 396460 295808 248165 385096 146142 -11895 388968
13520 30009 229101 192904 418477 259369 121027 317456 417516 109562 124266 195180
13510 195180 354310 181824 694871 317764 194707 555607 279518 210501 522629 609203
13500 609203 62803 90256 356446 238423 425749 205847 387122 76904 491063 103590
13489 753466 324506 36381 102808 403463 28876 46898 481030 317632 -17880 127046
13478 163097 232238 94338 203169 248045 98547 377950 -55477 488527 62709 288472 29428
13466 246166 85709 165349 237526 253032 179321 339571 498156 -123932 188930 121519 -129455
13454 125068 497814 162470 507376 215579 308333 281916 162200 383153 431980 387562
13444C87562l7037K39960A73198J82857b60543b1503B03570H2218J64797A05661
13433D31031J31905j43500A69036f4731C14253A18250L60510b04319j28384a1431
13422A69690N3286A07952K57366r61A79779l4159C5818L04012j16003b55861a07995
13410B26747g193A54622J77647A65376E3505Q5218F15J76263a43220C95807r1575
13399C04232j13449E1016L04948J28721B09432J26549A24053J70814a57904H8752
13388B09681C501e2560p3743C42088A09463K21874E882K37012I9193J18140l2560
13377A84773N3147c23170C13453D0583b8107J1035E3102K51759D4237O7073m9928
13366F1382J45124J70357n7381H4818P7502R560D9787e4122A6911L50527A22572
$$ plain form
13444 387562 350525 590485 173198 356055 -260543 -21503 203570 82218 247015 105661
13433 431031 562936 419436 169036 -64731 314253 118250 478760 -204319 -332703 -11431
13422 169690 222976 107952 365318 364357 179779 145620 35818 339830 223827 -255861 -107995
13410 226747 -7193 154622 332269 165376 53505 138723 615 176878 -143220 395807 304232
13399 304232 190783 51016 355964 484685 209432 335981 124053 294867 -157904 88752
13388 209681 3501 -52560 -126303 342088 109463 331337 5882 242894 99193 217333 184773
13377 184773 237920 -323170 313453 40583 -28107 -17072 53102 304861 44237 111310 61382
13366 61382 206506 376863 319482 84818 162320 171880 49787 -54122 16911 367438 122572
13354b01311I4252J57804l9958o221p1916K27177b141E4024a28215A16081K18020
13343C34101K21675j24719E8003k3369L09344n2478p2839A4060J04164R5141B3188
13331D19328j72021p1716J40387E7585L66946B4540L696R5942M23168b6891C73971
13319C44091A3891L60947j59043o3103K15447o8812g9285I7277J28393p1588J49628
13308C03710m8967n7780J35451A4590J39874i965C86174A01145J86596J79370
13298D67111j05903L0938k3648A18389a0044d170p8795D0458K60176j3327H6713
13286e4923A01960J69237A08742C5318J56947a39190C00455L1406H4396L55567
13276D39963H0464k2354A0317J53631l1000B3790O6801K90946A1755J21255c4987
$$ plain form
13354 -201311 94252 252056 212098 205877 133961 361138 -2141 54024 -128215 116081 334101
13343 334101 555776 431057 58003 34634 343978 291500 218661 14060 118224 213365 23188
13331 419328 247307 175591 315978 57585 424531 24540 28236 124178 547346 -26891 373971
13319 344091 13891 374838 215795 152692 368139 299327 -79285 97277 225670 154082 303710
13308 303710 254743 196963 332414 14590 154464 -9965 386174 101145 287741 467111
13298 467111 361208 392146 368498 118389 -10044 -4170 -82965 40458 300634 287307 86713
13286 -54923 101960 271197 108742 35318 192265 -139190 300455 331861 84396 439963
13276 439963 80464 58110 10317 163948 132948 23790 90591 381537 11755 133010 -34987
13264a3495A53368R9483K06407b57746B73578r8956J04166j12987B1804K24007
13254B45811l7364k1872J9168k4935D2233J02751K18745G5297a28878C89687A05887
13242a6691j37973A47617Q2344J07517k8022b42968H572M03391r302f4654k12497
13231b77151C6454a7259A03547K11297G1368J08362Q0892C0953c1965j88374K1352
13220a98987j09719A57735D595J77193J15750J03967d9037G6854l4998N7009J58179
13209B57044a62578l3869A0176h4064C06477a81766A0119a4370B06943k6107a17179
13197a62699A96739d5063F2858a66869N1475n2786m0446C09534B8380a89948f8271
13185A52008h3065D7119R3784b6465A04658J5257d9233B93957H3864a48179e0034
$$ plain form
13264 -13495 153368 252851 459258 -257746 273578 174622 278788 165801 21804 245811
13254 245811 208447 186575 205743 180808 42233 144984 363729 75297 -128878 389687 105887
13242 -16691 -154664 147617 229961 337478 309456 -242968 8572 411963 402661 -64654 -277151
13231 -277151 36454 -17259 103547 314844 71368 179730 260622 30953 -31965 -220339 -198987
13220 -198987 -308706 157735 4595 181788 297538 401505 -49037 76854 41856 98865 257044
13209 257044 -162578 -196447 10176 -84064 306477 -181766 10119 -14370 206943 180836 -117179
13197 -162699 196739 -45063 62858 -166869 -115394 -168180 -208626 309534 28380 -189948 -68271
13185 152008 -83065 47119 140903 -26465 104658 119915 -49233 293957 83864 -148179 -50034
13173C0398L1677J83687a53110n2846C33119j46065p6500A9353J80834L14364
13163E14551k32813E2965d2984A9855J25058b7512q6999a1075j17574A45283C2033
13151H1841b55850B41850J62410i1145B82163a3821B77307a48353D5154K40417
13141B85571b06938e40p1049M154G0253B2667J76697a806j915p327p0307p6704
13129a58059B02563J40025f5942A09285R9431K22209C8245Q8466b8102I356K78914
13118B88270j33190a09205C05473j39405J88694a05522A1486K10715j06564J70557
13108B86194a80172A69428d3381A5012P510N0261J64096E1989B5980K7067K35485
13097B88532d9533I2110c31765E2854J87623E4084M780O2090b4665D3620a54899
$$ plain form
13173 30398 62075 245762 -153110 -205956 333119 187054 110554 19353 200187 514551
13163 514551 281738 52965 -42984 19855 144913 -27512 -114511 -11075 -128649 145283 32033
13151 81841 -255850 241850 404260 -91145 282163 -13821 277307 -148353 45154 285571
13141 285571 -206938 -540 -71589 -67435 70253 22667 199364 -1806 -3721 -11048 -81355 -158059
13129 -158059 202563 342588 -65942 109285 208716 430925 38245 126711 -28102 9356 288270
13118 288270 155080 -109205 305473 166068 354762 -105522 11486 222201 115637 286194
13108 286194 -180172 169428 -43381 15012 22522 72783 236879 51989 25980 53047 288532
13097 288532 -49533 92110 -331765 52854 240477 54084 58864 120954 -24665 43620 -154899
13085b98350B62561a11937A11844K17861G7896K7688n1102c01260B02762B7607
13074C33671a5661l5368A62908J12591o5239q5747f4760f780j20106q146O3838
13063g1194k33489A96066a55130B03970l8602D7707Q9868a33191l2886A28020
13052H1339a49917A77915L32127a6009m2480b8651B97633H4125P7526C5079J6409
13041E1488J07777K5723F4419c36949C12789e9051A01905J59566l7907J12482
13031C36046b5403j80211F8493a78624A73985a68575a3058A08965A2615J05121
13021A17736B5815J76892n6864d30687A39034K12081F0307J63062O4487F8978
13010e779n6245p1799q816A6606O82J11674e0773B45818b51074A48487b91430
$$ plain form
13085 -298350 262561 -111937 111844 329705 77896 105584 54482 -301260 202762 27607
13074 333671 -15661 -51029 162908 275499 210260 124513 -64760 -6780 -126886 -135032 -71194
13063 -71194 -304683 196066 -155130 203970 165368 47707 137575 -133191 -166077 128020
13052 81339 -149917 177915 510042 -16009 -58489 -28651 297633 84125 161651 35079 51488
13041 51488 159265 184988 64419 -336949 312789 -59051 101905 261471 223564 336046
13031 336046 -25403 -205614 68493 -178624 173985 -168575 -13058 108965 12615 117736
13021 117736 25815 202707 145843 -430687 139034 351115 60307 223369 287856 68978
13010 -5779 -62024 -133823 -142639 16606 17288 128962 -50773 245818 -251074 148487 -291430
12998G2565g4726B59302B5463K25735D3865b30385O1524B15266f1309p1577B89016
12986B51477o3059J53368b64763a03419A94342B6977p108K0944Q5847J27782a49821
12974A26787C3279a41830I1035L3792b8804l10360Q7889C63479H4663C5826J33538
12963A69364b8400A52759h7027q719A60851j8526Q466K72475f6099j5955A43387
12951a97780h6209e476B2573J46282b29413A57484g0059D93613j31249B7144R2312
12940A19456a3677A10022a32848C14750j55614A1671N0877j9049Q748J80191a92351
12928a44493a3009A96116J58777E5628c1205n3828J707c4606k40415K0289H4069
12916I3015h9718A9111b14270a1107k6421j80568A71232a58466k3212A31921b58464
$$ plain form
12998 72565 -74726 259302 25463 251198 43865 -230385 -168861 215266 -61309 -132886 289016
12986 251477 188418 341786 -264763 -103419 194342 26977 19869 40813 126660 254442 -149821
12974 126787 33279 -141830 91035 124827 -28804 -339164 -251275 363479 84663 35826 169364
12963 169364 -28400 152759 -87027 -95746 160851 142325 150791 423266 -66099 -82054 143387
12951 -197780 -86209 -5476 22573 168855 -229413 157484 -70059 493613 362364 27144 119456
12940 119456 -13677 110022 -132848 314750 159136 11671 62548 43499 52247 232438 -192351
12928 -144493 -13009 196116 354893 55628 -31205 -85033 -83326 -34606 -275021 -254732 84069
12916 93015 -89718 19111 -214270 -11107 -37528 -218096 171232 -158466 -181678 131921 -258464
12904F9951a57916j20306a6216C7364b34429B80406O5576a6752k40076d9576C6120
12892A9199b28487G0151a46007O4091G9944k5172d18012A04953a40608K0226B3018
12880a78822a4414j0611j9875j44585b5147A76941l4225p1307J57103H8424B6133
12868A22887a58751n3523j35047F5228k0069b295A36059g0905C37504D3856o566
12857C7290a62207J9663A27510i694A75065D6953a23363C775Q3766P0015a61729
12845f1360k52508B4085i7458C72863c55649A93619b16091B82956j41278E5343
12834a71710A62820a37768G2751L4134B3692J36071a95779P2434A14525A8710
12823a48845B13678c1622A7655J103E547K84069b54474A27648m1818b6753H7824
$$ plain form
12904 69951 -157916 -278222 -16216 37364 -234429 280406 345982 -16752 -256828 -49576 36120
12892 19199 -228487 70151 -146007 -81916 79944 54772 -418012 104953 -140608 -120382 23018
12880 -178822 -14414 -25025 -44900 -189485 -25147 176941 142716 71409 228512 88424 26133
12868 122887 -158751 -212274 -347321 65228 45159 -2295 136059 -70905 337504 43856 37290
12857 37290 -162207 -142544 127510 -9694 175065 46953 -123363 3775 87541 157556 -161729
12845 -61360 -313868 24085 -97458 372863 -355649 193619 -216091 282956 141678 55343
12834 -171710 162820 -137768 72751 106885 23692 159763 -195779 -123345 114525 18710
12823 -148845 213678 -31622 17655 18758 5547 289616 -254474 127648 85830 -26753 87824
12811a16611C0561e9999A09488M678J44786a514n2896j57888E8892R427K1646
12800H9965j597k6297K5828l0173J05596J31501r8506f8185E8390K32980b09723
12788A47375h1366j40360l40462d1198A0075Q3038a9945k55727a36995k08549
12778c45544a8078j10030N3457C23626q4015b32335G4682M4645d9129A26333K3505
12767A49838K3048a49903A00496f0517q9103H7111c41617n5842I7942a0467q602
12756a9069A08581a35370l6127E88f5285r6232B92315a3908G6970c16946J54440
12745a62506E2835c59105a46480g2045A07043b56523i1445L3782B82755e0281
12734H7047J5540b65958h4022C64531b5319j93974i8852j25269H8628O918a95130
$$ plain form
12811 -116611 30561 -59999 109488 114166 258952 -1514 -54410 -212298 58892 68319 89965
12800 89965 88368 62071 87899 57726 163322 294823 196317 -68185 58390 291370 -209723
12788 147375 -81366 -221726 -562188 -41198 10075 93113 -19945 -275672 -136995 -345544
12778 -345544 -18078 -128108 -74651 323626 239611 -232335 74682 119327 -49129 126333 149838
12767 149838 172886 -149903 100496 -60517 -149620 87111 -341617 -397459 97942 -10467 -19069
12756 -19069 108581 -135370 -171497 588 -65285 -161517 292315 -13908 76970 -316946 -162506
12745 -162506 52835 -359105 -146480 -72045 107043 -256523 -91445 -57663 282755 -50281
12734 87047 102587 -265958 -84022 364531 -25319 -219293 -98852 -224121 88628 95546 -195130
12722A19291b61027g1612K6063A96467e0336A7834c05780B70352a81496A20643
12711G2022L4490a41349D8644a27874j00437B34973r7676i4641B17334B534P0838
12700G3372a33655J0502A53199a67023A49886A9451R0280a40999C26748c16482
12689a12316i014m2105j16036c001D3129J99550a11077A55380g7922C06259d137
12677A67391J09495A25959a406j61355B68957I5797K38716b01604A25320a1805
12666B27586c6165E9610h1475B84015f6859j59813B23140a75539H9511B9038J90977
12655B20015f8011c0636b932n336B13760d43820A0942c03372g1130B76470g2455
12643a71264B9688e9159A23686J28189C3181A2798L50358C2819h5214j4487c4976
$$ plain form
12722 119291 -261027 -71612 -45549 196467 -50336 17834 -305780 270352 -181496 120643
12711 72022 106512 -141349 48644 -127874 -228311 234973 137297 -94641 217334 2534 73372
12700 73372 -133655 -123153 153199 -167023 149886 19451 109731 -140999 326748 -316482
12689 -112316 -9014 -51119 -167155 -3001 43129 242679 -111077 155380 -77922 306259 -4137
12677 167391 276886 125959 -1406 -162761 268957 95797 334513 -201604 125320 -11805
12666 227586 -36165 59610 -81475 284015 -66859 -226672 223140 -175539 89511 29038 220015
12655 220015 -68011 -30636 -2932 -8268 213760 -443820 10942 -303372 -71130 276470 -72455
12643 -171264 29688 -59159 123686 251875 33181 12798 363156 32819 -85214 -99701 -34976
12631G4138i6889a7312B7736d5201m8628A45188Q8117j02069a90988c2773A9459
12619a85725A60246c83529C09600D2320K18107j27954j3041J2489l3331C6248
12608E7128J16665J00245d7237C71621a0932B79626b651l094A05282j3776l3234
12597E8272a55774M2987G7464L7675C2305b354B2528e6756C42205j60735K09093
12586C90563a42588M3178B18023P6775A8528R3309Q2814o0928J58562B9123M9661
12575G8784f0497l5620I3956e869l1200J5818B0232J20484j514h0051m5874j53177
12563b79102J01665q4865h3400J2841C6315M27416E8638a19952L8453B926c56133
12551i1314C55323C7692a86551c9579j87360P6315A6144E734a85137d0254k65877
$$ plain form
12631 74138 -96889 -17312 27736 -45201 -93829 145188 233305 131236 -190988 -32773 19459
12619 -185725 160246 -383529 309600 42320 260427 132473 119432 131921 98590 36248
12608 57128 173793 274038 -47237 371621 -10932 279626 -2651 -5745 105282 91506 58272
12597 58272 -155774 -112787 77464 115139 32305 -2354 22528 -56756 342205 181470 390563
12586 390563 -142588 -99410 218023 294798 18528 111837 194651 133723 292285 29123 78784
12575 78784 -60497 -96117 93956 -5869 -37069 -21251 20232 140716 139202 -80051 -125925 -279102
12563 -279102 -177437 -262302 -83400 -70559 36315 463731 58638 -119952 -81499 2926 -356133
12551 -91314 355323 37692 -186551 -39579 -226939 -150624 16144 5734 -185137 -40254 -306131
12540c06131Q9827k26085c5749o5769A21111a039j49475E631f2213j92536B61995
12528b01359P7967j93905d2060A29636h0972A70835l5631b20568j94944c4948
12517A30736j1205f27884K33154A28450b2293A19314a7456A795J1408J91218a76265
12505B64519a27800j69623A4065F10a86509A71187a6082F810L97599c25376J04020
12494b21356A53128o4647L4756M719n5273b18106b9826B8485a8013j81390I4400
12482A27000i6711A48879L1925a52463O9538n5057p6088O1572E1476b37088J06953
12471a30135B54509j6857p0630a90427B59229D6910J6774d9975a9684D2115K1007
12460F3122N9141g9163m6523q3762j03732A3092c98026N3462A3599d2583j22384
$$ plain form
12540 -306131 -216304 -442389 -35749 -101518 121111 -1039 -150514 5631 -62213 -254749 261995
12528 -201359 -123392 -317297 -42060 129636 -80972 170835 135204 -220568 -415512 -34948
12517 130736 119531 -627884 -394730 128450 -22293 119314 -17456 1795 13203 204421 -176265
12505 264519 -127800 -297423 14065 610 -186509 171187 -16082 6810 404409 -325376 -221356
12494 -221356 153128 88481 123237 127956 72683 -218106 -29826 28485 -18013 -199403 94400
12482 127000 -96711 148879 180804 -152463 -82925 -137982 -214070 -152498 51476 -237088 -130135
12471 -130135 254509 237652 167022 -190427 259229 46910 63684 -49975 -19684 42115 63122
12460 63122 122263 -79163 -125686 -209448 -313180 13092 -398026 -344564 13599 -42583 -164967
12449a64967A20405P9036r863q4588a13349A57520a813A15393a14099J9273c2784
12437b6816J852o021J1743B36455D3015g5812j24687A04124b29611k0318C6214
12425a27565j23500P472a9217j75676j7387B79735a63508A3612f8207H1765M7059
12414A28824h3924A39402b45030A77865a3125l9342l1092A9208L0932Q3132g4325
12402B32733h4848j8393A82126a53579A67347B7306K43886b23550P6954B23516
12391b46717g1089H0340a7907n3213D32203a14773j26176F0507K9897c4080A46384
12379I3772L9607a07953d7718A45978c76962A18517m8423j6627a86770j1535p5261
12368b73566H2309P1471o2174b1323A09461K05896P8492j42730A03158J16541
$$ plain form
12449 -164967 120405 199441 189578 104990 -113349 157520 -1813 115393 -114099 -94826 -32784
12437 -26816 -24964 -30985 -19242 236455 43015 -75812 -200499 104124 -229611 -249929 36214
12425 -127565 -251065 -243593 -19217 -194893 -212280 279735 -163508 13612 -68207 81765 128824
12414 128824 -83924 139402 -245030 177865 -13125 -52467 -83559 19208 50140 133272 -74325
12402 232733 -84848 -103241 182126 -153579 167347 27306 271192 -223550 -146596 223516
12391 -246717 -71089 80340 -17907 -71120 432203 -114773 -240949 60507 90404 -34080 146384
12379 93772 133379 -107953 -47718 145978 -376962 118517 70094 53467 -186770 -198305 -273566
12368 -273566 82309 153780 91606 -21323 109461 315357 393849 251119 103158 219699
12358B19699I9037g6250m6885j04630a04915F7240j6610a22167B49688B7632a90217
12346B70613c71970H5932M7762c78380a09362M1990k286j89413a9370j64175b953
12334a86850H4290d1448m39846a97220d9848I5425B4041K50866a3509A69499K45269
12323D14768A71094c5493H3138P6150R299m2567b3124F7091K45366G602J82763
12312A90365a14648C44228j14966i0624o2574o1845A5741L03522B4049a09945
12301D69169A13428l1099h4414H9456J70363c15619A40744a36992J6554A50912
12290c3379C95139A34969m3400a7332E2629b91011d5838A02975J98335K548I217
12278B34991a0679G7927k5365J14677p5771N6220p2777N5727c74855D35244A82827
$$ plain form
12358 219699 99037 -76250 -123135 -227765 -104915 67240 50630 -122167 249688 27632 -190217
12346 270613 -371970 85932 133694 -378380 -109362 -67372 -69658 -259071 -19370 -183545 -2953
12334 -186850 84290 -41448 -481294 -197220 -49848 95425 24041 274907 -13509 169499 414768
12323 414768 171094 -35493 83138 159288 168587 126020 -23124 67091 312457 7602 190365
12312 190365 -114648 344228 229262 -90624 -153198 -215043 15741 319263 24049 -109945
12301 469169 113428 82329 -84414 89456 259819 -315619 140744 -136992 -120438 150912
12290 -33379 395139 134969 91569 -17332 52629 -291011 -45838 102975 301310 303858 9217
12278 234991 -10679 77927 52562 167239 91468 147688 74911 130638 -374855 435244 182827
12266a35959B14531J65700I2348K33158J02367C0368A3650e456k9933J7048j27284
12255a45625C64608A4480J53274G4899a5873A54718a36015B27231r0663a07790
12244C39698A58804n3197L80444A71590a81466C95758A68587C8147J6437j5197
12234C9387a41108A10092J44599c77719C70782A75409R401r1768d2238A96246
12223e4088a8967m0804A52767b35504J06762e0199A30815N5105A3554h4618E5871
12211B06138L0790j7395I2499K09635j33927A7956L36849J9390I7311J1269P8978
12200A87558k3108J38136H0890i6219D17476a88429A17406K03862a57955A9204
12189B25706l4568i623C23984A00484M5220J10050I7795L35207A52048K01446
$$ plain form
12266 -135959 214531 380231 92348 325506 427873 30368 13650 -5456 -35389 -18341 -145625
12255 -145625 364608 14480 167754 74899 -15873 154718 -136015 227231 136568 -107790
12244 339698 158804 105607 486051 171590 -181466 395758 168587 38147 54584 39387
12234 39387 -141108 110092 254691 -377719 370782 175409 184810 93042 -42238 196246
12223 -54088 -18967 -59771 152767 -235504 -128742 -50199 130815 185920 13554 -84618 55871
12211 206138 236928 219533 92499 302134 168207 17956 354805 374195 97311 108580 187558
12200 187558 164450 302586 80890 -96219 417476 -188429 117406 321268 -157955 19204
12189 225706 191138 -9623 323984 100484 145704 255754 97795 433002 152048 353494
12179C53494J93394A40419K66346A27405o2990B6064Q7104J26329r7100a4246
12168B25342a23253M4026C6477K24836a33519f4010A34408B1998M21297B02074
12157D54317B15426J51581a7805j13602d2124A94689J69505m3705J38127M8480
12147E07096m995A32915K03785R735I4053L51764p9007a64758A14550O2918j4346
12136A63122B7864Q4719P7894d4470A97418H3128J86208G8779J05959B2322K83158
12125C05480A38823a04334B46115b28186N1516M9503B05732b76422G4331c7901
12114C5009L9145K89978j58415A447K65025d7421I1071K77318f8825A26726J0349
12103A37075n4366a62135B13253d5541D5915J36570q4235K32012A36294C2554
$$ plain form
12179 353494 546888 140419 406765 127405 64415 26064 113168 239497 142397 -14246
12168 225342 -123253 -79227 36477 261313 -133519 -64010 134408 21998 443295 202074
12157 454317 215426 367007 -17805 -131407 -42124 194689 364194 320489 458616 507096
12147 507096 502101 132915 336700 346435 94053 445817 366810 -164758 114550 177468 163122
12136 163122 27864 112583 190477 -44470 197418 83128 269336 78779 184738 22322 305480
12125 305480 138823 -104334 246115 -228186 -176670 -127167 205732 -276422 74331 -37901
12114 35009 74154 364132 205717 1447 266472 -47421 91071 368389 -68825 126726 137075
12103 137075 82709 -162135 213253 -45541 45915 182485 98250 330262 136294 32554
12092H5033J3815m3779J35982J93742a33950b750A24055K26416b96963A36959
12081D28467A1851a81467r7334A26066J35431b54872r265J27915A51994K17573
12071C69567A79490o0687h6048A2566O7795K20273I3316r157k2350Q702J4829
12060H5340J43501a95538A01734P3044E9500J71219j13329b3631B89525a8440
12049C94463A45169J74628G8128k3333k0306M6067a82937L9440b952B25635b20028
12037h7586I4436P2701c8645I4349B9079c3615l07723a57700A5503C03J26019
12026A26322b18495a05681E5065A5246g959C0279q414c05531A68855a24137F934
12014A79450h4924o9103A70231m9680k7009j0144J06341B5551K02463J02036A29990
$$ plain form
12092 85033 98848 55069 191051 384793 -133950 -2750 124055 350471 -296963 136959
12081 428467 11851 -181467 -278801 126066 261497 -254872 -264137 -136222 151994 369567
12071 369567 179490 118803 -86048 12566 80361 300634 93316 84159 61809 70511 85340
12060 85340 228841 -195538 101734 174778 59500 230719 117390 -23631 289525 -18440
12049 394463 145169 319797 78128 54795 34489 80556 -182937 -143497 -2952 225635 -220028
12037 -87586 94436 167137 -38645 94349 29079 -33615 -341338 -157700 15503 303 126322
12026 126322 -218495 -105681 55065 15246 -7959 30279 21865 -305531 168855 -124137 6934
12014 179450 -84924 -154027 170231 120551 93542 83398 189739 25551 228014 330050 129990
12002B80176a2129k00369A60091j821a28076I0376k6942D619M9235N5454a492
11990g7808A1356d158r780n8943m0268G5707a9092p5494J7823n6163j87031J31899
11978a88058A88417f3499o3395k12018a17186p3247i0059H0541k1930a8220A61122
11966g8746j00267c1572m9865H5553c51567i0795k32723C72c2680n4363G7632
11954A0654b09533B38237c34494C7057M3440a082q1006C0050J4284A3431b39452
11942A44916L3764K8873q2010i9259B00469g5425c2647a6120q6036D0377F967
11930a18060a0127A27253c01565A34497a36751A8966J84335J9924b23246c7714
11919a08571I7965L7293c42558f2685j92924B07484a15325F6385J91501j13662
$$ plain form
12002 280176 -12129 -212498 160091 158270 -128076 90376 63434 4619 53854 109308 -1492
11990 -77808 11356 -4158 -13938 -72881 -113149 75707 -19092 -94586 -76763 -132926 -319957 -188058
11978 -188058 188417 -63499 -126894 -338912 -117186 -190433 -90059 80541 58611 -18220 161122
11966 -78746 -179013 -31572 -81437 85553 -351567 -90795 -323518 372 -32680 -87043 77632
11954 10654 -209533 238237 -334494 37057 80497 -1082 -82088 30050 44334 13431 -239452
11942 144916 178680 207553 125543 -99259 200469 -75425 -32647 -16120 -102156 40377 6967
11930 -118060 -10127 127253 -301565 134497 -136751 18966 203301 223225 -223246 -37714
11919 -108571 97965 135258 -342558 -62685 -255609 207484 -115325 66385 257886 144224
11909A44224c5117j66936D8135R310c16557a48913N0576A55867b50678J07063
11899a43615j04248E5574J39970B6671p85c5568j01489C2661d6374m0367A97764
11887a60566A51406d28724J98920a09010I9681b14432D0527b1613A11848a21030
11876H7971L71734d0228I8397K25977b25236A66214J21753f3535k06173D54e7791
11864b15705B11933j5806d09842B12090c2346k91493J28001Q9548L8492A45767
11853A08550b64491C528J30347b73185j7973d2397m80419J57880d7082j14453
11843a61535M9C08225A3867a82971Q9016B84563a65257p110A47536J38612K8188
11832C14336b37909B8433M0986K2149d9728A02835N0840c48393J57765R0374l08503
$$ plain form
11909 144224 -35117 -202053 48135 57445 -316557 -148913 -98337 155867 -250678 -143615
11899 -143615 -247863 55574 195544 26671 25886 -35568 -137057 32661 -46374 -86741 197764
11887 -160566 151406 -428724 -229804 -109010 99681 -214432 40527 -21613 111848 -121030
11876 87971 459705 -40228 98397 324374 -225236 166214 287967 -63535 -269708 454 -57791
11864 -215705 211933 196127 -409842 212090 -32346 -323839 -195838 -106290 -67798 145767
11853 108550 -264491 3528 133875 -273185 -291158 -42397 -522816 -364936 -47082 -161535
11843 -161535 -161486 308225 13867 -182971 -93955 284563 -165257 -172367 147536 286148 314336
11832 314336 -237909 28433 69419 91568 -49728 102835 153675 -348393 -190628 -100254 -408757
11821d08757B75883m3805D3170c34476O9754Q1071L4171B63426d15671G0205a04739
11809h8554D1777a15987N0382j95249k13357J45283a11282M9670A62500a54937
11798d4016E3299b22260A41259E204a92866R2998A21996g6244J9727o9871A8042
11786b8461A79512D1914L19649c0654B07139i4604J4121k8102A8729H257P2830
11775H1087f7817j69571H9222a7215C60524b69679a32784K8359A420a67286I2737
11763a41728A8383a07708j90462A67571a34450A46559a16780A00473a05882D6080
11752A57415E9651i4295F6489b65813a30309b0912j08553d5854A25531K42269
11742C67800E601L0499L7856b23096B0987J85203i2230j05258N755f3818o4229
$$ plain form
11821 -408757 275883 232078 43170 -334476 -264722 -183651 -149480 263426 -415671 70205 -104739
11809 -88554 41777 -115987 -65605 -260854 -474211 -328928 -111282 -61612 162500 -154937
11798 -44016 53299 -222260 141259 5204 -192866 -99868 121996 -76244 -56517 -126388 18042
11786 -28461 179512 41914 361563 -30654 207139 -94604 -80483 -108585 18729 8257 81087
11775 81087 -67817 -237388 89222 -17215 360524 -269679 -132784 -104425 1420 -167286 92737
11763 -141728 18383 -107708 -298170 167571 -134450 146559 -116780 100473 -105882 46080
11752 157415 59651 -94295 66489 -265813 -130309 -20912 -129465 -45854 125531 367800
11742 367800 5601 36100 73956 -223096 20987 206190 -92230 -197488 -191733 -63818 -128047
11731a28047C0933b55625d1150o030A37023K05601a96354A37807Q5236a20754
11720a3674j32195A39738E6675B1956Q1617K82961b17486A65690e4745A34997
11709H3870b04059c0980E3356d6603B19629a74098r9937A86808a07906L7827H5368
11697a9448k87183B35620b50017M4907B18429a1949k0117E9242a40369K1686D8471
11685i641G3580A0370P4693b662r1795C20503a63114e3189k66903I5749D930a08282
11672c2203F8615a62467B4359c2525l4111A22157K00986a51726C0360J04885R8834
11661B34079b04212C8268Q1885A4993f9646E0367J51686J68747c97741J73793
11651b23948C6045a19636G007J4386J78499F6843b48564J07687c9081A73873c0058
$$ plain form
11731 -128047 30933 -255625 -41150 -47180 137023 342624 -196354 137807 223043 -120754
11720 -13674 -145869 139738 56675 21956 103573 386534 -217486 165690 -54745 134997
11709 83870 -204059 -30980 53356 -46603 219629 -174098 -274035 186808 -107906 -70079 85368
11697 -19448 -306631 235620 -250017 -205110 218429 -11949 -32066 59242 -140369 -118683 48471
11685 -9641 73580 10370 85063 -2662 -94457 320503 -163114 -53189 -320092 95749 4930 -108282
11672 -32203 68615 -162467 24359 -32525 -66636 122157 323143 -151726 30360 135245 234079
11661 234079 -204212 38268 120153 14993 -69646 50367 202053 370800 -397741 -223948
11651 -223948 36045 -119636 7007 21393 199892 66843 -248564 -140877 -39081 173873 -30058
11639B89225M9061H8257a00626A5769J10459g4021q0643C10195b00299A04046
11628a43320E2803b91077i2295E3171d34621A93466a31016B95597c8983G292b0192
11616I30O7509L94210D1421c6195A19312m6788J0486p574J6430a27223B87745
11604D3434J21319c60453J595B05300D7331b5517C41140j24765a7018K394j7542
11593c2166A2947K60252p9735d66760C19854e1919C8804J77502I3591B4116Q803
11582C2919J5251L29235D7741a88522M4692a8540C8411a88664A45391g7073j01349
11571a78422A14866k162k6651L6891c28081G5341A1432d9998k1170j20801C5094
11559D8638P9668m0053A5288K6593N42054F6915d0979a5582A01498C5986b92245
$$ plain form
11639 289225 338286 88257 -100626 15769 126228 -74021 -154664 310195 -200299 104046
11628 -143320 52803 -291077 -92295 53171 -434621 193466 -131016 295597 -38983 7292 -20192
11616 930 68439 462649 41421 -36195 119312 72524 83010 75436 91866 -127223 287745
11604 43434 164753 -360453 -358858 205300 47331 -25517 341140 216375 -17018 -14624 -32166
11593 -32166 12947 273199 193464 -466760 319854 -51919 38804 216306 93591 24116 32919
11582 32919 48170 377405 47741 -188522 -143830 -18540 38411 -188664 145391 -77073 -178422
11571 -178422 114866 112704 86053 122944 -328081 75341 11432 -49998 -71168 -191969 35094
11559 48638 128306 88253 15288 41881 583935 66915 -40979 -15582 101498 35986 -292245
11547A1456a16680F8829b70491C4384J89054a35378M3288E6232J48747O5797C0769
11535A04326f910j4744j05839B10339j00720a88509E0323b33866g0400m2994C03400
11523a45515D2434L5110J9727k9903K36268m7121G7495J16290J69414j18191a0024
11511F7351a8246e816A9895K46685C1032c5320j35399A06116L4580R2324I2650
11499A0818h1748l25716A65977K52833a0259A6005f8101j00158A71079R5708G6570
11487A30008g3242G1519j3262a44927e7971H5507J45311o6717B5608e8686I6513
11475E7168i8163A99132D8026L46136a58596A31946a35640O7355A4706d2502B1936
11463A7604Q6930m0306K8645K02646H4053O9328K5075h5040E532b5821F7934a69502
$$ plain form
11547 11456 -116680 68829 -270491 34384 223438 -135378 -92090 56232 204979 270776 30769
11535 104326 -6910 -21654 -127493 210339 109619 -188509 50323 -233866 -70400 -113394 303400
11523 -145515 42434 77544 97271 67368 303636 256515 77495 193785 363199 245008 -10024
11511 67351 -18246 -5816 19895 266580 31032 -35320 -170719 106116 140696 233020 92650
11499 10818 -81748 -407464 165977 418810 -10259 16005 -68101 -168259 171079 266787 76570
11487 130008 -73242 71519 58257 -144927 -57971 85507 230818 164101 25608 -58686 96513
11475 57168 -98163 199132 48026 394162 -158596 131946 -135640 -68285 14706 -42502 21936
11463 17604 104534 64228 92873 295519 84053 153381 178456 -85040 5532 -25821 67934 -169502
11450h1412b6974j3953p5134A65686N64486C59894a75299A95107I1386J66050
11440B57436c9744n6714A98304a36876L1379A6906c15383I4582D7258K3818a57950
11428A75442e584B24747G257M4866J2313Q6958d216k16418i596k01323A07510
11416D337g7863C8918N122j677L8548N2561a5274B42804I2151c0020D20589b04401
11403f541A20392C2575K24930a41788b7257k07324A62725f6307P983A04548c4471
11391B04597a81713p1610I2152b03240C1957A041J60851G5435d68729a17861i932
11379G9963j4360K33341A08393b7791A24346N4395b5255B27J07368d6745a3929
11367d0890r7888q9129i6666q1917P7201A30449a92550A95295i9623A69296E8502
$$ plain form
11450 -81412 -26974 -40927 -116061 165686 730172 359894 -175299 195107 91386 257436
11440 257436 -39744 -96458 198304 -136876 -105497 16906 -315383 94582 47258 71076 -157950
11428 175442 -5584 224747 7257 52123 64436 151394 -4216 -220634 -9596 -210919 107510
11416 4337 -77863 38918 44040 42363 80911 133472 -15274 242804 92151 -30020 420589 -204401
11403 -6541 120392 32575 257505 -141788 -27257 -234581 162725 -66307 -58324 104548 -34471
11391 204597 -181713 -253323 92152 -203240 31957 1041 161892 75435 -468729 -117861 -9932
11379 79963 65603 298944 108393 -27791 124346 178741 -25255 227 107595 -46745 -13929
11367 -40890 -138778 -227907 -96666 -178583 -101382 130449 -192550 195295 -99623 169296 58502
11355g6704G1371b83817D3352K6777b49839Q5904D2817M34149A30359a06469M0482
11344f5987G3875K57082d8711k41173D92431b24057R7522j8085I6746j8117d66385
11332B35606c14737A58520G4003b24932B53104b8823j3907j61259A81240N8973
11322B40213a49851A66398k1421f2502D2398j4476K75429g8088A51559a21103
11311a48579j3405m8387C2483a9401k79001B85404A24212b07265B04382J8106
11301B22488p5888O1087B2603M160a68239A1273c2963C04244D3732J11100c8811
11289a16105A83883G0074f7577H255h0143k24306B095b58838B77718c00915a13148
11277C37738H4636a91632B93606j32838a46723p6662j3576J13784j63784A72901
$$ plain form
11355 -76704 71371 -283817 43352 70129 -249839 -163935 42817 476966 130359 -106469 -65987
11344 -65987 73875 330957 -48711 -289884 492431 -224057 -126535 -144620 96746 78629 -466385
11332 235606 -314737 158520 74003 -224932 253104 -28823 -42730 -203989 181240 240213
11322 240213 -149851 166398 144977 -62502 42398 27922 303351 -78088 151559 -121103
11311 -148579 -161984 -210371 32483 -19401 -298402 285404 124212 -207265 204382 222488
11301 222488 146600 207687 22603 26763 -168239 11273 -32963 304244 43732 154832 -38811
11289 -116105 183883 70074 -67577 8255 -80143 -304449 2095 -258838 277718 -300915 -113148
11277 337738 84636 -191632 293606 160768 -146723 -223385 -236961 -123177 -286961 172901
11266b77903A43584i7598k2664e2003G0568b45750A06403m7627a76166P3266B02038
11254A02089a1790j14162A3806K20558b96778A73784a37112n7040B87723c0045
11243a29238A33728a17546J2586l24591K2352J13994J7674H3531A3609L10580
11233C24189A13008a48285e7772k73416A74231b89712a4972j4223R856A8858i4313
11221B23786e7075k15675a12794M4312J0213E8115m447b39920M5184i3650F587
11209b52720J18392m0834N6897L4521p7870K2292m95J4080e8448j20851E5878
11197b4837F2078a83569b469j18816m23838B23884C722b44038a01811k1174B51219
11185G9124b10282B32824F0169d51970a26616J7538n7860a0935k96409a15651
$$ plain form
11266 -277903 143584 -97598 -120262 -52003 70568 -245750 106403 58776 -176166 -102900 202038
11254 102089 -11790 -125952 13806 234364 -296778 173784 -137112 -194152 287723 -30045
11243 -129238 133728 -117546 -104960 -429551 -407199 -293205 -275531 83531 13609 324189
11233 324189 113008 -148285 -57772 -331188 174231 -289712 -14972 -29195 -19339 18858 -94313
11221 223786 -57075 -272750 -112794 -68482 -58269 58115 53668 -239920 -194736 -93650 6587
11209 -252720 -134328 -175162 -118265 -83744 -161614 -139322 -139817 -125737 -58448 -179299 55878
11197 -24837 62078 -183569 -2469 -121285 -545123 223884 3722 -244038 -101811 -122985 251219
11185 79124 -210282 232824 60169 -451970 -126616 -109078 -166938 -10935 -307344 -115651
11174a44956f6148l80887C5692a8312A169M9181b74675h9331j61310D6998B0902
11162A45956J59773i892B51701F5169a60472A29829a36985b788A1144a80487D5539
11150e68694a13198B10941b18339A88312J45709B2369P4656j6142a03717A11027
11139b25006D6309a14160l40796A88527E0032O0596A9703K1010b14242B12519
11128B0368c3570j02762B44513h9884A22986C6721M8404E790Q9219O8353f406
11116a16316A18320J06088a66250F1712K20875a66673B13419b2426A66031f8914
11105a35003D6370b36286C03604c00636a05962F8879h2537C5486M3002l0527M743
11094E2704a30679D6170r182a84063G3836d8597O309n8651A84917o8697k3423
$$ plain form
11174 -144956 -66148 -447035 35692 -18312 1169 50350 -274675 -89331 -250641 46998 20902
11162 145956 305729 -9892 251701 65169 -160472 129829 -136985 -2788 11144 -180487 45539
11150 -568694 -113198 210941 -218339 188312 334021 22369 97025 80883 -103717 111027
11139 -225006 46309 -114160 -454956 188527 50032 110628 19703 40713 -214242 212519
11128 20368 -33570 -136332 244513 -89884 122986 36721 85125 5790 95009 163362 -6406
11116 -116316 118320 224408 -166250 61712 282587 -166673 213419 -22426 166031 -68914
11105 -135003 46370 -236286 303604 -300636 -105962 68879 -82537 35486 78488 47961 52704
11094 52704 -130679 46170 36988 -184063 73836 -48597 -42288 -100939 184917 116220 92797
11083I2797C4573J70609L69871a13429C8562L42422l4783J35946A25509n4686
11073G0823k6410L61354I4421M1780j6289l1900Q2090J19439e6756D84496A37410
11061A0520L7629K09751D7210a05125C87771A5345L34567f4749A66299B3102L55309
11050C78411n1393J69674A73128K52276H4397K25387L18925q2425A87045L27095
11040E14140A70399K0427M27238L00278k85452P3290L3302k41974K01690K31640
11030I30838l17301J08103J03159k80209k6660K11617p9321K58707k94758K64566
11020H78741l08372J61652j15540L4196j32199L4360M33735k46138l26572A34217
11009F37777J20663o882j422k7897l1417N6809j61007M14519D86037L24478l34500
$$ plain form
11083 92797 34573 205182 575053 -113429 38562 380984 346201 482147 125509 70823
11073 70823 44413 405767 94421 136201 119912 88012 170102 289541 -56756 484496 137410
11061 10520 48149 257900 47210 -105125 387771 15345 349912 -64749 166299 23102 378411
11050 378411 327018 496692 173128 425404 84397 309784 628709 546284 187045 514140
11040 514140 170399 190826 618064 918342 632890 706180 739482 497508 699198 930838
11030 930838 613537 721640 824799 544590 517930 729547 650226 908933 614175 878741
11020 878741 570369 732021 616481 650677 518478 552838 986573 740435 413863 134217
11009 637777 758440 751558 750136 722239 690822 747631 586624 1001143 486037 810515 476015
10998D76015J02404j64923L08148j27932k8494J61651k41228R9026k22058N00972
10988H63581l28561q0428K32065R6217m7976j70534o689N4878Q0088A86798K90541
10977D77339K30091k36795q1646L77509J32633N5524k23649j31436Q1218J91836
10967H72624j27608M32559k08898j28884J55102K81281J96781n30624M02502L20766
10957A665601O7237j68449M91149R6877M08976m28604M09252l12773P6308P7260
10947B382834k7918m97232j41526l983O3559l97964K86765J57810j06106o848
10937A709391J7755Q977k31307k17717j04294m36373J51180P5030C34638J86193
10927E20831B18348J9618a5129B90028a0908p8773G7612K38922N0461j01220F1009
$$ plain form
10998 476015 578419 413496 721644 593712 565218 726869 485641 584667 362609 863581
10988 863581 535020 454592 686657 782874 734898 564364 557675 612553 692641 186798 477339
10977 477339 707430 470635 388989 766498 899131 954655 731006 599570 680788 872624
10967 872624 745016 1177575 968677 839793 994895 1276176 1472957 942333 1344835 1665601
10957 1665601 1732838 1564389 2055538 2152415 2561391 2132787 2542039 2229266 2305574 2382834
10947 2382834 2354916 1857684 1716158 1712175 1775734 1377770 1664535 1822345 1716239 1709391
10937 1709391 1727146 1736123 1504816 1287099 1182805 746432 897612 972642 334638 520831
10927 520831 218348 237966 -15129 290028 -10908 -89681 77612 316534 366995 265775 61009
10915A30162a37693A21360b0770A65801J24693H995K22423A0542a04270G6221
10904A6941d1418A37575b35287a9958m40385A73218a10840j33437R0114A36680
10893c20324D3049b05569P3627c4292l9518p0685j45606a02587b5937a0707G3884
10881B42506F1334a21031H5745P3127b2601B43172h5239K4639B9808b10362A0797
10869C874b8329j07675H4464a2707n2127F0773b31973D81N7755h7275q6335a9212
10856a35568I6736r004f2664j90579J18484A67432G1163N1298l2928D2711R7337
10845A40048H609J42899j1192A9099a46654A82256c7454B26908b3038C1295a45608
10833a96989c6230q5653A09381b89696L9063A74677J47484d34l6127k55748d42
$$ plain form
10915 130162 -137693 121360 -20770 165801 290494 8995 231418 10542 -104270 76221
10904 16941 -41418 137575 -235287 -19958 -460343 173218 -110840 -244277 -154163 136680
10893 -320324 43049 -205569 -131942 -34292 -73810 -144495 -290101 -102587 -25937 -10707 73884
10881 242506 61334 -121031 85745 158872 -22601 243172 -85239 -60600 29808 -210362 10797
10869 3874 -28329 -136004 84464 -12707 -64834 60773 -231973 481 58236 -87275 -173610 -19212
10856 -135568 96736 87732 -62664 -253243 -134759 167432 71163 122461 89533 42711 140048
10845 140048 8609 151508 140316 19099 -146654 182256 -37454 226908 -23038 31295 -145608
10833 -196989 -36230 -121883 109381 -289696 -250633 174677 322161 -434 -36561 -292309 -442
10821A94946d8258A99482a76659J8140A93889b30153B01779c35938A32019g0656
10810d1016A4692k467J72029F3022i8702j19178C53346b3714l6156D9704J34790
10799A84494m5042d49653a70907e8691j46658d197k67181I2325a87267a779j314
10788c093G113c22954l8138B830c4276q4139A1930b6856j21878A01983b37647
10776I1162a81191K7880A91518K7723a91210j03045R1163n6251A3054L25711a92251
10764e0024j3199k53618A9742b67432E0049a67238m9163I960i1973F8706b35944
10752B38148j2182i3755B59902b86478O7438D7034d87020a3200q562Q278j12720
10741a26204O2a3395k54320I985c18301i0180J8282r3296b7078j04680l88264
$$ plain form
10821 194946 -48258 199482 -176659 -158519 193889 -230153 201779 -335938 132019 -70656
10810 -41016 14692 12225 184254 63022 -98702 -217880 353346 -23714 -59870 49704 184494
10799 184494 139452 -449653 -170907 -58691 -205349 -4197 -271378 92325 -187267 -1779 -3093
10788 -3093 7113 -322954 -361092 2830 -34276 -118415 11930 -26856 -148734 101983 -237647
10776 91162 -181191 -153311 191518 219241 -191210 -294255 -203092 -259343 13054 338765 -192251
10764 -50024 -63223 -316841 19742 -267432 50049 -167238 -216401 9960 -91973 68706 -235944
10752 238148 225966 -93755 259902 -286478 -219040 47034 -487020 -13200 -21762 -13484 -126204
10741 -126204 -126142 -13395 -267715 9985 -318301 -90180 -71898 -165194 -27078 -131758 -520022
10730e20022d2006B56275b16844A09056a69408f710A29662a43765p9944A51480
10719E23500A2476R1928h5041B744b51829E1708N0224l4765a07761a3271k79365
10708b92636I9342D6489g3976j5116k44514C1759J88661c29300n9229a16448l1250
10697a47698e1348j14222H1698a22225A46643b0840j39981o1954f9540A7256a86857
10685A9357h0351j46354I2003a14401N0710n027j77074B2283a91709A5070a41012
10673A32435b52827J463k29117d9622I3553b60528L1231C61586a44661k65754
10663d10415g5240k44810a32265D6949a17102A02623J35564e829j00206L9404
10653f6631q5428A05003J3976J43536k9858g6584J6814p055j25611M1953A26134
$$ plain form
10730 -520022 -42006 256275 -216844 109056 -169408 -6710 129662 -143765 -223709 151480
10719 523500 12476 104404 -85041 2744 -251829 51708 101932 67167 -107761 -13271 -292636
10708 -292636 99342 46489 -73976 -89092 -333606 31759 220420 -329300 -388529 -116448 -147698
10697 -147698 -51348 -165570 81698 -122225 146643 -20840 -160821 -222775 -69540 17256 -186857
10685 19357 -80351 -226705 92003 -114401 -63691 -68718 -245792 22283 -191709 15070 -141012
10673 132435 -252827 -251364 -480481 -49622 93553 -260528 -229297 361586 -144661 -410415
10663 -410415 -75240 -320050 -132265 46949 -117102 102623 238187 -5829 -106035 -66631
10653 -66631 -152059 105003 118979 262515 232657 -76584 -59770 -66825 -192436 -150483 126134
10641a63308j57557J44062H225g0512E6841a46682K1608k22468Q1051P2654C8071
10629H4299a34345B59130b31959A85805b84503M2118A318J712a08238m0898B7717
10617a64260c0680h935A14671b91494b5305k309m2866N509F6958c86687a87320
10605d7025I432L3357K6396a09584j02535j15307c2170J0129j59428K4589f7660
10593a19619k78334I5520i417A21283L2196m3640K19833a23491A39566a05557
10582A53556a78990A42042b49579a07353A59165a0350F1615b4588k35001d7962
10571a60011l7060k619k1175a05967j14667H218a28216l14158A16288c48778J62038
10560a86740D26253A08892P6816b09739A30917e9639j14265k24689a75672A84433
$$ plain form
10641 -163308 -320865 -176803 8225 -70512 56841 -146682 -125074 -347542 -266491 -193837 38071
10629 84299 -134345 259130 -231959 185805 -284503 -242385 1318 3030 -108238 -149136 27717
10617 -164260 -30680 -8935 114671 -291494 -25305 -27614 -70480 -64971 66958 -386687 -187320
10605 -47025 9432 42789 69185 -109584 -212119 -327426 -32170 -22041 -181469 -156880 -67660
10593 -119619 -397953 95520 -9417 121283 153479 109839 329672 -123491 139566 -105557
10582 153556 -178990 142042 -249579 -107353 159165 -10350 61615 -24588 -259589 -47962
10571 -160011 -197071 -199690 -220865 -105967 -220634 8218 -128216 -442374 116288 -348778 -186740
10560 -186740 426253 108892 185708 -209739 130917 -59639 -173904 -398593 -175672 184433
10549I587h3531n4831b2954j96077j8483i4390j29340A41810b40096B57079F1272
10537a155I9263R990R5600b78139C62001A24981a46638k29883R2116d6049j77584
10526b23633d5211j97725H2087R2376g9700k6276d780H2205b8116k24452O6695
10515a85873f8253m3760l31145J03195e1724j32919G9794c6767I9046m8351b72674
10503D9537b97324G0273h9129c0782H9835b28984P7580c9015A80228j4490b87855
10491d9234n0039n9320B9380c29297N6667g7848j50912g3859m5277b2728j44825
10480a67553j08466B31886q9729b6962k64927B63303F2059e4801B81873a80683
10469C38004a26732o639A95679M304a10229C9513a46370A44160a6130B7977O1273
$$ plain form
10549 9587 -83531 -138362 -22954 -219031 -237514 -94390 -223730 141810 -240096 257079 61272
10537 -1155 99263 109253 204853 -278139 362001 124981 -146638 -376521 -284405 -46049 -223633
10526 -223633 -45211 -242936 82087 174463 -79700 -105976 -4780 82205 -28116 -252568 -185873
10515 -185873 -68253 -112013 -443158 -339963 -51724 -184643 79794 -36767 99046 50695 -272674
10503 49537 -297324 70273 -89129 -30782 89835 -228984 -151404 -39015 180228 165738 -287855
10491 -49234 -99273 -158593 29380 -329297 -272630 -77848 -228760 -73859 -119136 -22728 -167553
10480 -167553 -276019 231886 142157 -26962 -291889 263303 62059 -54801 281873 -180683
10469 338004 -126732 -133371 195679 199983 -110229 39513 -146370 144160 -16130 27977 89250
10458H9250J99377A27110K6148a74220B65756a44351C35531b1274I1807a12174
10447a93815D0247c40806D4387c247A27923L8035a96936A1528a02019j38466A25766
10435c8571H5299a89534j64904a65840B23311F3772O3867e59671e9119m7687B94099
10423c45306a44882k0902r0337e4009D3658c96922P0071J13591M1511k2236h9394
10411C61278e75293a58264o5460E3815d5576K2205B85053b16157I5438c8771I9574
10399A77903a75055H0621J31000g9218C5078b23832L9505n1682D06242a90733
10388C01796I5599a85617a9953A04778b63407J00865p9061a05907d6724J8443
10378b8281r411r6327m485A59809c11199A26132b35532A52120a20297H1289a16553
$$ plain form
10458 89250 288627 127110 153258 -174220 265756 -144351 335531 -21274 91807 -112174
10447 -193815 40247 -340806 44387 -3247 127923 165958 -196936 11528 -102019 -240485 125766
10435 -38571 85299 -189534 -354438 -165840 223311 63772 127639 -559671 -59119 -106806 294099
10423 -345306 -144882 -165784 -256121 -54009 43658 -396922 -326851 -213260 -171749 -193985 -89394
10411 361278 -575293 -158264 -223724 53815 -45576 -23371 285053 -216157 95438 -38771 99574
10399 177903 -175055 80621 211621 -79218 35078 -223832 -184327 -236009 406242 -190733
10388 301796 95599 -185617 -19953 104778 -263407 -162542 -241603 -105907 -46724 -28281
10378 -28281 -37692 -134019 -138504 159809 -311199 126132 -235532 152120 -120297 81289 -116553
10366E4892K4139d2953D3749J6664K03610c210H1154J99067k2798L2145L36745
10355F26313A30933J57279o3772M8467a01238B97569Q7899M5860m4491J21779
10345E08616j66915p8543H8258J6915L0627N0370l9564J66726l9163K3367I3120
10333B84030R4499J13370k35402J11922n9628K5549n8626K4871B9097K99904F9961
10321A97799q7328n3373K58676d5556p9286B47046A05672J03013h9617a1240l5957
10310d7197H7709J23008E0514J90247d016H3412Q9997h9460B64153j5710a01810
10298B26137a45j5317m3416q5596a7927k17139k3608D1049d1372J0418j89637
10287b20591A0074J04629c5561A9894b26710a9798C5744a09729F087h335j75541
$$ plain form
10366 54892 79031 -42953 43749 60413 264023 -3210 81154 280221 257423 289568 626313
10355 626313 130933 288212 224440 272907 -101238 297569 385468 431328 386837 508616
10345 508616 341701 263158 88258 105173 135800 186170 146606 313332 274169 297536 93120
10333 284030 378529 491899 256497 368419 308791 334340 275714 300585 29097 329001 69961
10321 197799 110471 57098 315774 -45556 -124842 247046 105672 208685 -89617 -11240 -47197
10310 -47197 87709 210717 50514 240761 -4016 83412 173409 -89460 264153 248443 -101810
10298 226137 -145 -15462 -58878 -144474 -17927 -235066 -258674 41049 -41372 -30954 -220591
10287 -220591 10074 114703 -35561 19894 -226710 -19798 35744 -109729 6087 -8335 -183876
10276a83876C3665J92560r6485a77596O5084j42482j1619f483H4619L3804Q7720
10265B06143A5398a43681l9361d689m06998G1773a68979A40317b89004E9977a16043
10253D55954b69337J29564k4130o7073e4012D826i874j6526k38774I4164f372
10241G9516O9261j2181J09398P3221K05589j30951q1916A23083n310h8513a258
10229a7893B8681J85928b97105A6491c9029N406k39400A51717c17801A73238b39407
10217A00776a18871M2709L3592j07708D33224a47515A66597d3769J5572j48560
10207a76757A98103a88083A74677b28120c2359D792J45131b94915E9877b95256
10196i3482b2023A77434L3279a98375Q9183r6658I7205a22210F1344Q2428b32096
$$ plain form
10276 -183876 33665 226225 129740 -177596 -112512 -254994 -266613 -6483 84619 118423 206143
10265 206143 15398 -143681 -183042 -4689 -411687 71773 -168979 140317 -289004 59977 -116043
10253 455954 -269337 -139773 -163903 -230976 -54012 4826 -9874 -26400 -265174 94164 -6372
10241 79516 148777 136596 245994 319215 524804 393853 311937 123083 117773 -88513 -1258
10229 -17893 28681 214609 -297105 16491 -39029 -33623 -273023 151717 -317801 173238 -239407
10217 100776 -118871 -76162 -42570 -150278 433224 -147515 166597 -43769 -28197 -176757
10207 -176757 198103 -188083 174677 -228120 -32359 4792 149923 -294915 59877 -295256
10196 -93482 -22023 177434 210713 -198375 -109192 -205850 97205 -122210 61344 143772 -232096
10184b90294a31844m0216P5279f77A5399J9237L4348B7270J67085L2441b3814
10172i2573A15531b46279i4649E0373a95616K8247O533l862g752q2358r1921c1196
10159a55828B2937b6761j99212F4906f210o316j05050j16160A16337e9115k41480
10148c00595A44896a63997k95197F8976b16717A47183a42846b5330m56395a66226
10137a30891A81245c62552a17347r6340E2474a44800C2451J10226a08859j2709
10127a21568A47991B947O9365J41953g3980n896A14575D3192a55533a8405k5395
10116d3800k13937e601A85499a43022d60I4659P1214G8094b30585e6353p9900
10105a36253B61019A25022m9206b3282H0101a09246j1811B39631c70962h9243
$$ plain form
10184 -290294 -131844 -172060 -96781 -677 15399 34636 68984 27270 194355 226796 -23814
10172 -92573 115531 -246279 -94649 50373 -195616 -167369 -160836 -164698 -7752 -90110 -182031 -31196
10159 -155828 22937 -26761 -225973 64906 -6210 -12526 -117576 -233736 116337 -59115 -300595
10148 -300595 144896 -163997 -459194 68976 -216717 147183 -142846 -25330 -481725 -166226
10137 -130891 181245 -362552 -117347 -213687 52474 -144800 32451 142677 -108859 -121568
10127 -121568 147991 2947 72312 214265 -73980 -79876 114575 43192 -155533 -18405 -43800
10116 -43800 -257737 -5601 185499 -143022 -460 94659 165873 78094 -230585 -56353 -136253
10105 -136253 261019 125022 75816 -23282 80101 -109246 -121057 239631 -370962 -89243
10094a97643j4400P0515j7649G4374M847h7893j11245j39888L3410M6099I0250
10082A00079a88986k23228h3262j65362m717A22326P6821h727k51756F8073a42588
10070G8211c24046a33808K2147M7541n2769A2991c10149i7845p7392J0209L1245
10059a33783I9788b87913n5430a788m49429K15572B08464C7381d02977c0220m28918
10048d59138G6860c2103A41390a02803j02250A99395C1634b16349B4446i8146
10037a55080K7983j60285l39857b17650o51f5609A31058f7589k27985d8744l8896
10026h7640k2530j57084J21710e9142G5354b51346a14183c2930j70447i1589l545
10015i5134B4090c3620j76059j46118I0894L1032g0360A57495f1247C0297b22646
$$ plain form
10094 -197643 -212043 -141528 -159177 74374 79221 -87893 -199138 -339026 -305616 -259517 90250
10082 100079 -188986 -412214 -83262 -248624 -253341 122326 199147 -8727 -260483 68073 -142588
10070 78211 -324046 -133808 -111661 -64120 -116889 12991 -310149 -97845 -175237 -165028 -133783
10059 -133783 99788 -287913 -343343 -1788 -451217 -235645 208464 37381 -402977 -30220 -459138
10048 -459138 76860 -32103 141390 -102803 -205053 199395 31634 -216349 24446 -98146
10037 -155080 -127097 -287382 -627239 -217650 -218301 -65609 131058 -67589 -295574 -48744 -87640
10026 -87640 -110170 -267254 -145544 -59142 75354 -251346 -114183 -32930 -203377 -91589 -95134
10015 -95134 24090 -33620 -209679 -355797 90894 121926 -70360 157495 -61247 30297 -222646
10003A71164f8908j90161o840B87115a86697a7864K533j9982R878j51762b7976
9991A82975q6791b27756H002a02880l2854A3459i7612C9066g6373A73033b38909
9979F3482f9636m1259L0193G5971d9577A02260e7343j05603j07478A36161i5836
9967e2320e314B30516C1840b57339l7549B17974c69596J55415D111a37554H8848
9955a6003j41975D0539b87145E4441P5813b57045d622B60996A00125j2394b0946
9943h2273K4637B110N5670B1833d39381a78900N6208k8174B52918k4495b63132
9931I989f2671k95513e2299m97780A83201b47566F9684b19034A36360g3552j62405
9920b35957g1037A26498a9933A52528b1780p2474j20102h4580C002J91620k7204
$$ plain form
10003 171164 -68908 -259069 -265909 287115 -186697 -17864 -15331 -35313 -25435 -177197 -27976
9991 182975 96184 -227756 8002 -102880 -135734 13459 -97612 39066 -76373 173033 -238909
9979 63482 -69636 -110895 -80702 75971 -49577 102260 -57343 -162946 -270424 136161 -95836
9967 -52320 -5314 230516 31840 -257339 -294888 217974 -369596 -214181 4111 -137554 88848
9955 -16003 -157978 40539 -287145 54441 130254 -257045 -4622 260996 100125 87731 -20946
9943 -82273 -57636 2110 57780 21833 -439381 -178900 -122692 -150866 252918 228423 -263132
9931 9989 -62671 -358184 -52299 -550079 183201 -247566 69684 -219034 136360 -73552 -235957
9920 -235957 -71037 126498 -19933 152528 -21780 -94254 -214356 -84580 3002 194622 167418
9909A67418b48744B48994K3838c51980A5194b88056a28207A13059k7357c72123
9898b28431B2515o304O0816J9208N2682h5059k9574A15769a04062I1788b68035
9886a08211L1808B0787c25927a51454b8893A445a5474j99328h6627a2115j04945
9875a17060j13692A734J76476j8945G8244a07967G8992h9970E6338K49279E7463
9863d33382g7838l0865o2297E7909k5491d2586A98643q5252L0751o6505C8439
9851b34070q0079c7924l25813J02610J05962E2161a55853A03120A4020b68075
9840E3220A9341a01252F0665Q2573B4223M708L0046h3239b5918A21857J5658J4728
9828A52243b66250e6412C7668d20716b1047l9698C1981Q0649f6579j73564B2559
$$ plain form
9909 167418 -248744 248994 272832 -351980 15194 -288056 -128207 113059 85702 -372123
9898 -228431 22515 16211 77027 96235 148917 -85059 -114633 115769 -104062 91788 -268035
9886 -108211 -76403 20787 -325927 -151454 -28893 1445 -15474 -214802 -86627 -12115 -117060
9875 -117060 -230752 1734 178210 159265 78244 -107967 78992 -89970 56338 305617 57463
9863 -433382 -77838 -108703 -171000 57909 32418 -42586 198643 113391 144142 77637 38439
9851 -234070 -314149 -37924 -363737 -261127 -155165 52161 -155853 103120 14020 -268075
9840 53220 19341 -101252 60665 143238 24223 28931 58977 -83239 -25918 121857 137515 152243
9828 152243 -266250 -56412 37668 -420716 -21047 -60745 31981 112630 -66579 -240143 22559
9816b56931j05056G8481b31920k17158a47171o0090K9650A80009B3617O0098l0978
9805E2737A2696c1829H0575a26129H6217c39443h8260j75110R6709A03352b1955
9793h7707A39166a90486A45820a93259D7297g1138j7894A04e0732l8161m78237
9782e67130I3231b13809M8673A1327i5264j25845H3177b46078K8122D2449c4062
9770a87160B6583P9454g688l8333c492k31709G4697d6068k70006F0564d2148D3817
9757d69619A03927b3566m8311A67384K2108A5493O5650a44051d9746k9401J8804
9746f0343j68664B58638a97670f6142n5603k80458h1864j43324f3156q283f541
9734I8364d40233K03960j20936c4372k2119m5589M4252B4099g6807G797a24200
$$ plain form
9816 -256931 -361987 78481 -231920 -449078 -147171 -207261 -177611 180009 23617 83715 52737
9805 52737 12696 -31829 80575 -126129 86217 -339443 -88260 -263370 -166661 103352 -21955
9793 -87707 139166 -190486 145820 -193259 47297 -71138 -89032 104 -50732 -88893 -567130
9782 -567130 93231 -213809 -165136 11327 -95264 -221109 83177 -246078 -217956 42449 -34062
9770 -187160 26583 106037 -7688 -46021 -3492 -235201 74697 -46068 -316074 60564 -42148 43817
9757 -469619 103927 -23566 -71877 167384 189492 15493 81143 -144051 -49746 -79147 -60343
9746 -60343 -229007 258638 -197670 -66142 -121745 -402203 -81864 -225188 -63156 -71439 -6541
9734 98364 -440233 -236273 -357209 -34372 -56491 -102080 -57828 24099 -76807 7797 -124200
9722A18853c48072I1179b91985J36523m8106m9173G4190h1063C31784e7146a4884
9710a92425j05747J39125j32008a11207b291j34760q8612K7185j06892O7631B6669
9698a62546L2004p3032A18599b35616C15980D254c03100n560f5086a8251B22739
9686b31683I2176b92123h8757l8867d0171q5801C6920i948G4388d1781I0379c22383
9673f300A65997E7407J22247f6072k36637J32287b6585B8970L2319a10870B0086
9661a21655l248A95223i8370k23693e5050n5171o4085j7315e9578j81447e3712
9649I9952E782K65557c47010B4104a44103c3519A29812g1627j30594k68669a54804
9637D0484a83458Q4604M5453k77267i2537o2796j26112B14462c9383A14873a83594
$$ plain form
9722 118853 -348072 91179 -291985 -155462 -203568 -252741 74190 -81063 331784 -57146 -14884
9710 -192425 -298172 -159047 -291055 -111207 -2291 -137051 -225663 -198478 -305370 -237739 26669
9698 -162546 -130542 -203574 118599 -235616 315980 4254 -303100 -308660 -65086 -18251 222739
9686 -231683 92176 -292123 -88757 -127624 -40171 -125972 36920 -9948 74388 -41781 90379 -322383
9673 -6300 165997 57407 179654 -66072 -302709 -170422 -26585 28970 61289 -110870 20086
9661 -121655 -124903 195223 -98370 -322063 -55050 -110221 -174306 -191621 -59578 -241025 -53712
9649 99952 5782 271339 -347010 24104 -144103 -33519 129812 -71627 -202221 -470890 -154804
9637 40484 -183458 -98854 -53401 -330668 -92537 -155333 -281445 214462 -39383 114873 -183594
9625h6859F444d99725b36438A0430a11841C1072e2032B46787h22p5275j54037
9614b30134k19569C5740j7299J22849j88a25442A15543n5183a08598K2327L4492
9603e1779A86790b12610N2586D84e7123l9167r176L0779j06448A84468a13564
9591f5432B11212b24573G3455d6064o1171G6277b00198j67240a56538F1013j0821
9580E0192b24642R5235i045j00539j56417B00033F0451K34464b60144A55043E4323
9568c1635k6877K7907H9777N9756I329a11718j005j32607g221k60991j9690J17212
9556a70690A22396c67754O8469b9709A70711E3992b66522a17617j96054A41429
9545F176M2570L3045f59697C98781A20851m4469c21977I2268a45827K5204r0263
$$ plain form
9625 -86859 6444 -499725 -236438 10430 -111841 31072 -52032 246787 -822 -76097 -230134
9614 -230134 -449703 35740 18441 141290 141102 -125442 115543 60360 -108598 -86271 -51779
9603 -51779 186790 -212610 -160024 484 -57123 -96290 -105466 -74687 -181135 184468 -113564
9591 -65432 211212 -224573 73455 -46064 -107235 76277 -200198 -367438 -156538 61013 50192
9580 50192 -224642 -129407 -9045 -109584 -266001 200033 60451 294915 -260144 155043 54323
9568 -31635 -58512 -30605 89777 149533 9329 -111718 -112723 -245330 -7221 -268212 -287902 -170690
9556 -170690 122396 -367754 -299285 -29709 170711 53992 -266522 -117617 -313671 141429
9545 6176 48746 81791 -659697 398781 120851 76382 -321977 92268 -145827 -120623 -210886
9534b10886A55997K5824a30989C8180c86273j01223A93855P9611j34421c52118
9523C7886a14568K1045H0736M855j0028b45339B02571e0633B86956a14121n1180
9512a65301e24j15000C01971j15964a86779d2077C4620b62571J8480j55855Q0416
9501c19530a08437D7979B052L1193L8475d59777b29240k07865b3567B9238K3872
9490E3110K82033o5334c0042k65954C7077J20384L9836b69030e6777A90368a45102
9478A96840a32958B2231g2491n3607f1671k75888A67374a36607B55470d240k8976
9467c3216n6477K0705m512k9494a0436G4789J34537d4221A01709k5764J92544
9456B68489b85153O7296b5778j57416k55714a21210B6031d5325k2436l59075g5900
$$ plain form
9534 -210886 155997 181821 -130989 38180 -386273 -487496 193855 273466 139045 -352118
9523 37886 -114568 -93523 80736 85591 75563 -245339 202571 -50633 286956 -114121 -165301
9512 -165301 -524 -115524 301971 186007 -186779 -42077 34620 -262571 -244091 -399946 -319530
9501 -319530 -108437 47979 2052 33245 71720 -459777 -229240 -437105 -23567 29238 53110
9490 53110 335143 269809 -30042 -295996 37077 157461 197297 -269030 -56777 190368 -145102
9478 196840 -132958 22231 -72491 -126098 -61671 -337559 167374 -136607 255470 -4240 -33216
9467 -33216 -89693 -68988 -73500 -102994 -10436 74789 209326 -44221 101709 75945 268489
9456 268489 -285153 -217857 -25778 -183194 -438908 -121210 26031 -45325 -67761 -426836 -75900
9444A84817m4692b45227e9535j3689k73285d177j43658K9330j7018L8526j21443
9433b18440B28140B1857R1349e13567f7415n1303A45084b49791J20050j75754
9423c05495A77691c0218A87963F0925e3095k19977e063p0920k71287C01598a12304
9411a48946k670m6173G3657J58959a70356M5151j31717L3386b5570k15100i3212
9399B50954F682a32784L6023k00143d5830m5272j23563L276q2888L4745B0041
9387c29120j1589f9621j68435J02548b4560D0784M32659b18838h9481a3092j21642
9376a34734r2519E6705a55920M1978j21813B45147A9749K7793i12I4786a55318
9364H6832a57122d8406o9480j18612A44653b41374f9708n5772A23876a10760A96033
$$ plain form
9444 184817 140125 -245227 -59535 -73224 -346509 -4177 -147835 -118505 -135523 -96997 -218440
9433 -218440 228140 21857 113206 -513567 -67415 -118718 145084 -249791 -129741 -305495
9423 -305495 177691 -30218 187963 60925 -53095 -273072 -5063 -75983 -347270 301598 -112304
9411 -148946 -151616 -197789 73657 232616 -170356 -125205 -256922 -223536 -25570 -240670 -93212
9399 250954 6682 -132784 -96761 -296904 -45830 -91102 -214665 -211389 -294277 -259532 20041
9387 -329120 -340709 -69621 -238056 -135508 -24560 40784 473443 -218838 -89481 -13092 -134734
9376 -134734 -227253 56705 -155920 -113942 -235755 245147 19749 47542 -912 94786 -155318
9364 86832 -157122 -48406 -117886 -236498 144653 -241374 -69708 -125480 123876 -110760 196033
9352a07549B8829p966C249d4436j40246C4876a07692N157j96399N8332E4161J82932
9340B37093a63177j82278a9827H370L5514i9649k81239A58428E6120d79084H0450
9328A41089b44540A36537c26651G7303f01424A62975J55045C6636G927g61q2085
9317h2846k23746M0571r7718J27545e1067A75870a72961d0834j49434F7857J08186
9306A76043g7196H7546a49474l1596J5655j61842C29973A19598c16928J33277
9296a83651A14956J4621e4567A32897E9290J97247a95435e829l0661l40112J71158
9285b05444l7622N6648A06006b28436J140j9980B22691b82325a33709j52264B04334
9273c46709J17569C648e3597m6393l62762i3458C69353a52579C40930a10590q9066
$$ plain form
9352 -107549 28829 20863 3249 -44436 -184682 34876 -107692 -102535 -298934 -240602 54161 237093
9340 237093 -163177 -345455 -19827 8370 43884 -99649 -380888 158428 56120 -479084 80450
9328 141089 -244540 136537 -326651 77303 -601424 162975 318020 36636 7927 -761 -82846
9317 -82846 -306592 -266021 -363739 -236194 -51067 175870 -172961 -40834 -190268 67857 176043
9306 176043 -77196 87546 -149474 -181070 -165415 -327257 329973 119598 -316928 -183651
9296 -183651 114956 129577 -54567 132897 59290 256537 -195435 -5829 -36490 -376602 -205444
9285 -205444 -243066 -186418 106006 -228436 -227296 -247276 222691 -282325 -133709 -285973 204334
9273 -346709 -229140 3648 -53597 -99990 -462752 -93458 369353 -152579 340930 -110590 -199656
9262a99656A39632Q817h70n540k05095a02742r179M9107r213C04820D4830b95680
9249A79613a08574I040c05392C3563a4876j06788d0237k61561a20716M9366j43771
9238b15121A05779a01571j08825r1133J04897A17258d1586k13755a20629b8406
9227h4677q8392l12073h6842j74801G724b58978A39504b46633J19200j59050I5556
9215i5788o6958J0745g2307j93839F1238B9398b75549f4720k33851O0445C16158
9203a25856H3802J24540E1205Q91a2015B202a36154D0519J22632b75218g545j57042
9191a64587O0209c7112j10358k50167A99232d5704j98053P5410G554K9114A5336
9179a05536A2030c76243a08806m3566B52087f5089p7444a5804A30510b25577B56449
$$ plain form
9262 -199656 139632 148449 -870 -6410 -211505 -102742 -111921 -62814 -72027 304820 44830 -295680
9249 179613 -108574 9040 -305392 33563 -14876 -121664 -40237 -301798 -120716 -71350 -215121
9238 -215121 105779 -101571 -210396 -301529 -196632 117258 -41586 -255341 -120629 -28406
9227 -84677 -173069 -485142 -86842 -261643 7724 -258978 139504 -246633 -127433 -286483 95556
9215 -95788 -162746 -152001 -72307 -266146 61238 29398 -275549 -64720 -298571 -238126 316158
9203 -125856 83802 208342 51205 52096 -12015 2202 -136154 40519 163151 -275218 -7545 -164587
9191 -164587 -104378 -37112 -147470 -397637 199232 -45704 -243757 -168347 7554 36668 15336
9179 -105536 12030 -376243 -108806 -152372 252087 -65089 -142533 -15804 130510 -225577 256449
9167d4613A30400g0406E6470b58868k4306I7748g3005j42548F2095c39996a55181
9155G6563K18139i2065C63043a50202A99397E8211K1671a99179D1972b71880a11931
9143f1167K1266F517a55592A8779a1478k73159A35860Q7978a4652A43988a2932
9131G7732O4681h0882j42964a1489r3187A32803D4752Q5235b7690l40919a33051
9119c8211A67194a30809p2456b3874k00404A76163H5434e3413o8180I8251C7642
9107a81121B30815A08451m6141K02484a92258I5985i0963k91595J19925A96112
9096i5439F2091a67963B3276i4898L5808J046j79487a10430n2373B00314A9528
9084d18521d0506l25216A52624c6293q7868c4128j86323a8659D1072Q9885a40300
$$ plain form
9167 -44613 130400 -70406 56470 -258868 -283174 97748 -73005 -215553 62095 -339996 -155181
9155 76563 294702 -92065 363043 -150202 199397 58211 79882 -199179 41972 -271880 -111931
9143 -61167 -39901 6517 -155592 18779 -11478 -284637 135860 223838 -14652 143988 -12932
9131 77732 142413 -80882 -223846 -11489 -104676 132803 44752 129987 -27690 -368609 -133051
9119 -38211 167194 -130809 -203265 -23874 -224278 176163 85434 -53413 -121593 98251 37642
9107 -181121 230815 108451 62310 264794 -192258 95985 -90963 -382558 -262633 196112
9096 -95439 62091 -167963 23276 -94898 -59090 -58044 -237531 -110430 -162803 200314 19528
9084 -418521 -40506 -365722 152624 -36293 -124161 -34128 -220451 -18659 41072 130957 -140300
9072B95633c7049j3093A80347g1414B14308c98910a60228H3836a05008j16113
9062b21121E241d00457J91888A04521f2711H0410C5115a27862D9065a90625Q7
9051a90538B16458a46879q2862B5228b66105I7968d07154A12365j5888a55254
9040c99164h7560L9221j34653d9740N708j83893A8241e6315j88403L8370o6973
9029b73321J4747j7263P5437Q280e6662F9991a04512B95613j42970K7536c17781
9017A00067c584l33948A10331e37854g8488m1779j00197e2835j3357p6944A52268
9005A06821c28573b4732m17094a03677K1052g364o5993L3945B9792d9777o372
8994e6149b2437f04E226b89674m6662L8130g3630J7758F4856g5192k519G1965
$$ plain form
9072 295633 -37049 -50142 180347 -71414 214308 -398910 -160228 83836 -105008 -221121
9062 -221121 5241 -400457 -208569 104521 -62711 80410 35115 -127862 49065 -190625 -190538
9051 -190538 216458 -146879 -229741 25228 -266105 97968 -407154 112365 96477 -155254
9040 -399164 -87560 -48339 -182992 -49740 -44032 -227925 18241 -56315 -244718 -206348 -273321
9029 -273321 -258574 -275837 -200400 -192120 -56662 69991 -104512 295613 152643 180179 -317781
9017 100067 -3584 -337532 110331 -537854 -78488 -120267 -220464 -52835 -66192 -143136 152268
9005 106821 -328573 -24732 -441826 -103677 -82625 -7364 -73357 -39412 29792 -49777 -56149
8994 -56149 -22437 -604 5226 -289674 -336336 -298206 -73630 -55872 64856 -75192 -77711 71965
8981a60202l65334b54150c3816j95234A29857a5773m54421b21191J07812m00750
8971e14129a64059D3148a07450k39793a55774C342O6380e9363A19625c81402H873
8959a54388p0831R9829n8445O0806j16203G0066l2529c3005k0651l2995A21798
8947A811a66457b1584l09081A26845b44297j3919A89819B2489K42290b83171D7195
8935A67839a69032l18165f4015i242B70076f4135k8593A21331c7757o1759A63868
8923a13889l13212B1641J69440c73901A40612B1088J64891b55479C85596a09413
8912A90389e9631B24060h3259A61419P8604M49196O830Q35719Q36411K740544
8902E108723N16608B513193I46847m70280i1228F29559A08391L7621K52249A0948
$$ plain form
8981 -160202 -525536 -254150 -33816 -229050 129857 -15773 -470194 -221191 -113379 -514129
8971 -514129 -164059 43148 -107450 -347243 -155774 3342 69722 -59363 119625 -381402 8873
8959 -154388 -225219 -125390 -183835 -123029 -239232 70066 37537 -33005 -53656 -86651 121798
8947 1811 -166457 -21584 -330665 126845 -244297 -258216 189819 22489 264779 -283171 47195
8935 167839 -169032 -487197 -64015 -9242 270076 -64135 -92728 121331 -37757 -99516 163868
8923 -113889 -427101 21641 191081 -373901 140612 21088 185979 -255479 385596 -109413
8912 190389 -59631 224060 -83259 161419 240023 689219 696049 1531768 2368179 5108723
8902 5108723 5625331 2513193 946847 476567 -91228 629559 108391 146012 398261 10948
8891A81487H261K75208M7784A04148k144A9194J97873G630c1089k11859M3794
8880a99154j12703b0200j1143l7298o4290b3206B20360a61246f7014H0332J82778
8869B63110b15500N1829q0894j86271h3640n0656L6521H6753b46480B99616a01450
8857A21352a33395n9745h6787B17487g5349m24431D1891b96469A6982d15895b06390
8845g0907A83724d72847A45048a51701D3569e8944j1109B00241E9747g3900k37683
8834c11583l4117J9150J11044f8959o9132o6424A11874b32683A05389A0290a29237
$$ plain form
8891 181487 8261 283469 331253 104148 102004 19194 217067 7630 -31089 -242948 -199154
8880 -199154 -311857 -20200 -31343 -68641 -132931 -23206 220360 -161246 -67014 80332 263110
8869 263110 -215500 -163671 -244565 -430836 -83640 -134296 -97775 86753 -246480 299616 -101450
8857 121352 -133395 -193140 -86787 217487 -75349 -499780 41891 -296469 16982 -415895 -206390
8845 -70907 183724 -472847 145048 -151701 43569 -58944 -70053 200241 59747 -73900 -311583
8834 -311583 -345700 -326550 -215506 -68959 -138091 -204515 111874 -232683 105389 10290 -129237
$$ [...]
##END NTUPLES=NMR SPECTRUM
##END=
