
##TITLE=AC1128_Armenia-Quindio-Murillo_5875120_c4Z1Euih5D
##JCAMPDX= 6.0         $$ Bruker NMR JCAMP-DX V2.0
##DATA TYPE= NMR SPECTRUM
##DATA CLASS= NTUPLES
##ORIGIN= BRUKER
##OWNER= Administrator
$$ 1.72 TOPSPIN		Version 2.1
$$ 2012-04-01 00:20:53.140 -0500  Administrator@TOPSPIN
$$ Compression mode = diff/dup
##.OBSERVE FREQUENCY= 400.13188235
##.OBSERVE NUCLEUS= ^1H
##.ACQUISITION MODE= SIMULTANEOUS (DQD)
##.ACQUISITION SCHEME= undefined
##.AVERAGES= 64
##.DIGITISER RES= 22
##SPECTROMETER/DATA SYSTEM= spect
##.PULSE SEQUENCE= noesygpps1d.comp
##.SOLVENT NAME= COFFEE_meoh
##.SHIFT REFERENCE= INTERNAL, COFFEE_meoh, 1, 14.9687
##AUDIT TRAIL= $$ (NUMBER, WHEN, WHO, WHERE, PROCESS, VERSION, WHAT)
$$ ##TITLE= Audit trail, TOPSPIN		Version 2.1
$$ ##JCAMPDX= 5.01
$$ ##ORIGIN= Bruker BioSpin GmbH
$$ ##OWNER= Administrator
$$ $$ C:\Bruker\TOPSPIN/data/COFFEE/nmr/AC1128_Armenia-Quindio-Murillo_5875120_c4Z1Euih5D/12/pdata/1/auditp.txt
$$ ##AUDIT TRAIL=  $$ (NUMBER, WHEN, WHO, WHERE, PROCESS, VERSION, WHAT)
(   1,<2012-04-01 00:20:47.968 -0500>,<Administrator>,<TOPSPIN>,<go>,<TOPSPIN 2.1>,
      <created by zg
	started at 2012-04-01 00:09:16.218 -0500,
	POWCHK enabled, PULCHK disabled,
       configuration hash MD5:
       1A 1E CE 29 27 FD 77 03 67 4E F0 E3 C4 B2 CB 90
       data hash MD5: 64K
       DF 00 4C 56 17 23 07 AE 65 3B EC 49 0D E8 F9 8D>)
(   2,<2012-04-01 00:20:50.875 -0500>,<Administrator>,<TOPSPIN>,<proc1d>,<TOPSPIN 2.1>,
      <Start of raw data processing
       efp LB = 0.3 FT_mod = 6 PKNL = 1 PHC0 = 0 PHC1 = 0 SI = 128K 
       data hash MD5: 128K
       45 7F 5D C4 D3 9B 3D 5E 97 A7 61 74 A0 1F 6F F9>)
(   3,<2012-04-01 00:20:52.281 -0500>,<Administrator>,<TOPSPIN>,<proc1d>,<TOPSPIN 2.1>,
      <pk PHC0 = 38.38623 PHC1 = 0 
       data hash MD5: 128K
       B8 E0 B0 73 FB 92 41 1C 35 50 4B 0B C2 6E 6D 29>)
(   4,<2012-04-01 00:20:52.781 -0500>,<Administrator>,<TOPSPIN>,<proc1d>,<TOPSPIN 2.1>,
      <abs ABSG = 1 
       data hash MD5: 128K
       59 A0 EA 5E 47 DA 24 EB 8E 27 85 25 E4 A6 A1 FC>)
(   5,<2012-04-01 00:20:52.859 -0500>,<Administrator>,<TOPSPIN>,<proc1d>,<TOPSPIN 2.1>,
      <abs ABSG = 2 
       data hash MD5: 128K
       F4 07 81 34 20 F1 6A 2E 28 89 0C 71 CF E7 F0 23>)
(   6,<2012-04-01 00:20:52.937 -0500>,<Administrator>,<TOPSPIN>,<proc1d>,<TOPSPIN 2.1>,
      <abs ABSG = 3 
       data hash MD5: 128K
       21 EA 0B 2B 13 08 AC A2 C3 01 AC AD BA 6F 3F 70>)
(   7,<2012-04-01 00:20:53.000 -0500>,<Administrator>,<TOPSPIN>,<proc1d>,<TOPSPIN 2.1>,
      <abs ABSG = 4 
       data hash MD5: 128K
       81 D5 9D 19 01 2C 60 FE 91 1A 6B EA D9 7E FF DF>)
(   8,<2012-04-01 00:20:53.046 -0500>,<Administrator>,<TOPSPIN>,<proc1d>,<TOPSPIN 2.1>,
      <abs ABSG = 5 
       data hash MD5: 128K
       AE 23 13 B8 87 F0 C7 2E 2E D0 0E 4F 4A 3A AA 77>)
$$ ##END=
$$ 
$$ $$ hash MD5
$$ $$ B6 7C 00 C6 18 9A F3 12 B8 E3 BC AE 6F A7 68 5C
##$RELAX= 
##$RELAX= 
##$RELAX= 
##$RELAX= 
##$RELAX= 
##$RELAX= 
##$RELAX= 
##$RELAX= 
$$ [...]
##$TP07= 0
##$TPNAME0= <>
##$TPNAME1= <>
##$TPNAME2= <>
##$TPNAME3= <>
##$TPNAME4= <>
##$TPNAME5= <>
##$TPNAME6= <>
##$TPNAME7= <>
##$TPOAL= (0..7)
0.5 0.5 0.5 0.5 0.5 0.5 0.5 0.5
##$TPOFFS= (0..7)
0 0 0 0 0 0 0 0
##$TUNHIN= 0
##$TUNHOUT= 0
##$TUNXOUT= 0
##$USERA1= <user>
##$USERA2= <user>
##$USERA3= <user>
##$USERA4= <user>
##$USERA5= <user>
##$V9= 5
##$VALIST= <valist>
##$VCLIST= <CCCCCCCCCCCCCCC>
##$VD= 0
##$VDLIST= <DDDDDDDDDDDDDDD>
##$VPLIST= <PPPPPPPPPPPPPPP>
##$VTLIST= <TTTTTTTTTTTTTTT>
##$WBST= 2048
##$WBSW= 25
##$XGAIN= (0..3)
0 0 0 0
##$XL= 0
##$YL= 0
##$YMAX_a= 13796911
##$YMIN_a= -7188580
##$ZGOPTNS= <>
##$ZL1= 120
##$ZL2= 120
##$ZL3= 120
##$ZL4= 120
##$ABSF1= 14.9687
##$ABSF2= -5.58383
##$ABSG= 5
##$ABSL= 3
##$ALPHA= 0
##$AQORDER= 0
##$ASSFAC= 0
##$ASSFACI= 0
##$ASSFACX= 0
##$ASSWID= 0
##$AUNMP= <proc_prof1d_extract.lims>
##$AXLEFT= 0
##$AXNAME= <>
##$AXNUC= <1H>
##$AXRIGHT= 0
##$AXTYPE= 0
##$AXUNIT= <>
##$AZFE= 0.1
##$AZFW= 0.1
##$BCFW= 0
##$BC_mod= 0
##$BYTORDP= 0
##$COROFFS= 0
##$CY= 15
##$DATMOD= 1
##$DC= 0
##$DFILT= <>
##$DTYPP= 0
##$F1P= 0
##$F2P= 0
##$FCOR= 0.5
##$FTSIZE= 131072
##$FT_mod= 6
##$GAMMA= 0
##$GB= 0
##$INTBC= 1
##$INTSCL= 1
##$ISEN= 128
##$LB= 0.3
##$LEV0= 0
##$LPBIN= 0
##$MAXI= 10000
##$MC2= 0
##$MEAN= 0
##$ME_mod= 0
##$MI= 0
##$NCOEF= 0
##$NC_proc= -3
##$NLEV= 6
##$NOISF1= 0
##$NOISF2= 0
##$NSP= 0
##$NTH_PI= 0
##$NZP= 0
##$OFFSET= 14.9687
##$PC= 1
##$PHC0= 38.38623
##$PHC1= 0
##$PH_mod= 1
##$PKNL= yes
##$PPARMOD= 0
##$PPDIAG= 0
##$PPIPTYP= 0
##$PPMPNUM= 2147483647
##$PPRESOL= 1
##$PSCAL= 4
##$PSIGN= 0
##$PYNMP= <proc.py>
##$REVERSE= no
##$SF= 400.130004765061
##$SI= 131072
##$SIGF1= 0
##$SIGF2= 0
##$SINO= 400
##$SIOLD= 131072
##$SPECTYP= <>
##$SREGLST= <1H.CDCl3>
##$SSB= 0
##$STSI= 131072
##$STSR= 0
##$SW_p= 8223.68421052632
##$SYMM= 0
##$S_DEV= 0
##$TDeff= 65536
##$TDoff= 0
##$TI= <>
##$TILT= no
##$TM1= 0
##$TM2= 0
##$TOPLEV= 0
##$USERP1= <user>
##$USERP2= <user>
##$USERP3= <user>
##$USERP4= <user>
##$USERP5= <user>
##$WDW= 1
##$XDIM= 131072
##$YMAX_p= 534440488
##$YMIN_p= -578315682
##$CURPLOT= <Network HP LaserJet P1505>
##$CURPRIN= <$Network HP LaserJet P1505>
##$DFORMAT= <normdp>
##$LAYOUT= <+/1D_H.xwp>
##$LFORMAT= <normlp>
##$PFORMAT= <normpl>
##$SURQMSG= 1
$$ End of Bruker specific parameters
$$ ---------------------------------
##NTUPLES= NMR SPECTRUM
##VAR_NAME=  FREQUENCY,     SPECTRUM/REAL,   SPECTRUM/IMAG
##SYMBOL=    X,             R,               I
##VAR_TYPE=  INDEPENDENT,   DEPENDENT,       DEPENDENT
##VAR_FORM=  AFFN,          ASDF,            ASDF
##VAR_DIM=   131072,        131072,          131072
##UNITS=     HZ,            ARBITRARY UNITS, ARBITRARY UNITS
##FACTOR=    0.0627417313425165, 1,          1
##FIRST=     8223.62146879498, -4484,        -108649
##LAST=      0,             -373,            -108952
##MIN=       0,             -578315682,      0
##MAX=       8223.62146879498, 534440488,    0
$$ Real data points
##PAGE= N=1
##DATA TABLE= (X++(R..R)), XYDATA
$$ [...]
61710B3106114J655481J750825J828728J879820J894127J858636J757010J573804
$$ 23106114 24761595 26512420 28341148 30220968 32115095 33973731 35730741 37304545
61702C7304545J300583R40436N09768L6920m42664q93244j284825j597111j821586
$$ 37304545 38605128 39545564 40055332 40092252 39649588 38756344 37471519 35874408 34052822
61693C4052822j960979k025573k028591j983908j905515j805754j692836j571340
$$ 34052822 32091843 30066270 28037679 26053771 24148256 22342502 20649666 19078326
61685A9078326j445729j321999j205221j096985r96656r04230q20564p45517o77418
$$ 19078326 17632597 16310598 15105377 14008392 13011736 12107506 11286942 10541425 9864007
61676I864007o14665n56912n04570m57712m15795l78082l44135l13751k86403
$$ 9864007 9249342 8692430 8187860 7730148 7314353 6936271 6592136 6278385 5991982
61667E991982k61140k37537k16417j98811j84213j70852j57805j45766j35521
$$ 5991982 5730842 5493305 5276888 5078077 4893864 4723012 4565207 4419441 4283920
61658D283920j26893j19629j13963j09315j03771r6217q8136q1863p7592p3557
$$ 4283920 4157027 4037398 3923435 3814120 3710349 3614132 3525996 3444133 3366541 3292984
61648C292984o8788o4124o0575n8199n6669n5615n4082n1094m7460m5640m6826
$$ 3292984 3224196 3160072 3099497 3041298 2984629 2929014 2874932 2823838 2776378 2730738 2683912
61637B683912m9013m9119m6552m3495m1924m1484m0602l8678l6488l4856l3741
$$ 2683912 2634899 2585780 2539228 2495733 2453809 2412325 2371723 2333045 2296557 2261701 2227960
61626B227960l2667l1446l0093k8323k5743k2672k0230j9113j8591j7308j5078
$$ 2227960 2195293 2163847 2133754 2105431 2079688 2057016 2036786 2017673 1999082 1981774 1966696
61615A966696j3141j2304j1611r644o783n010n369o674p387p704q619r683r304
$$ 1966696 1953555 1941251 1929640 1919996 1913213 1908203 1902834 1896160 1888773 1881069 1872450 1862767 1853463
61602A853463p469o440p903j0652j2189j1811j0854j0420j0242r786r133q458
$$ 1853463 1845994 1839554 1831651 1820999 1808810 1796999 1786145 1775725 1765483 1755697 1746564 1738106
61590A738106p481n868l692j376L19N03r41k855l967m311m521m128k101Q77K542
$$ 1738106 1730625 1724757 1721065 1719689 1720008 1720511 1719570 1716715 1712748 1708437 1703916 1699788 1697687 1698564 1701106
61575A701106K153J724L137N496O913P585R121J1459J2636J1753J0300R828R812
$$ 1701106 1703259 1704983 1708120 1713616 1720529 1728114 1737235 1748694 1761330 1773083 1783383 1793211 1803023
61562A803023Q767O510M254K879K082J166j54j897m185o873r123j0039r982j0637
$$ 1803023 1811790 1818300 1822554 1825433 1827515 1828681 1828527 1826630 1822445 1815572 1806449 1796410 1786428 1775791
61548A775791j3007j5718j6315j4365j2139j1734j2585j2738j1646j0447r852
$$ 1775791 1762784 1747066 1730751 1716386 1704247 1692513 1679928 1667190 1655544 1645097 1635245
61537A635245r238p999o537n509m927m348l307j249K098N827Q192Q625Q758J0469
$$ 1635245 1626007 1618008 1611471 1605962 1601035 1596687 1593380 1592131 1594229 1600056 1608248 1616873 1625631 1636100
61523A636100J3316J5133J5188J5385J7790K1982K5974K9039L2281L6404M0410
$$ 1636100 1649416 1664549 1679737 1695122 1712912 1734894 1760868 1789907 1822188 1858592 1899002
61512A899002M3135M5066M7583N0984N4230N6457N7805N8810N9839O1146O2691
$$ 1899002 1942137 1987203 2034786 2085770 2140000 2196457 2254262 2313072 2372911 2434057 2496748
61501B496748O3637O2884O0237N6569N2690M8862M5515M3369M2307M0927L8009
$$ 2496748 2560385 2623269 2683506 2740075 2792765 2841627 2887142 2930511 2972818 3013745 3051754
61490C051754L3900K9870K6502K3336J9650J5116J0044N414K090m45l850q741
$$ 3051754 3085654 3115524 3142026 3165362 3185012 3200128 3210172 3215586 3217676 3217231 3213381 3204640
61478C204640j3445j5963j6564j7131j8250j8320j5825j1285o405k144J716N671
$$ 3204640 3191195 3175232 3158668 3141537 3123287 3104967 3089142 3077857 3071452 3069308 3071024 3076695
61466C076695R930J4558J9649K5192L1048L7189M4004N2219O2166P3065Q3503
$$ 3076695 3086625 3101183 3120832 3146024 3177072 3214261 3258265 3310484 3372650 3445715 3529218
61455C529218R3059J03011J14925J28859J43656J58773J74936J92890K12337K32444
$$ 3529218 3622277 3725288 3840213 3969072 4112728 4271501 4446437 4639327 4851664 5084108
61445E084108K52794K73437K94419L15672L36929L57258L74950L88305L96340
$$ 5084108 5336902 5610339 5904758 6220430 6557359 6914617 7289567 7677872 8074212
61436H074212L98169L91703L73688L41563K95241K36910J69494R6064K0680n1359
$$ 8074212 8472381 8864084 9237772 9579335 9874576 10111486 10280980 10377044 10397724 10346365
61426A0346365j15371j69348k13520k48007k71991k85375k89965k88052k80515
$$ 10346365 10230994 10061646 9848126 9600119 9328128 9042753 8752788 8464736 8184221
61417H184221k67379k49682k29445k07907j85077j61277j37923j16034r5043p4005
$$ 8184221 7916842 7667160 7437715 7229808 7044731 6883454 6745531 6629497 6534454 6460449
61407F460449n3347l4245j6673N91J7917L4083M8119O0665P2433Q2408Q8983R2523
$$ 6460449 6407102 6372857 6356184 6356775 6374692 6408775 6456894 6517559 6589992 6672400 6761383 6853906
61395F853906R5038R7345R8274R7130R5136R3398R1208Q7943Q5174Q4779Q5857
$$ 6853906 6948944 7046289 7144563 7241693 7336829 7430227 7521435 7609378 7694552 7779331 7865188
61384G865188Q5792Q3991Q2178Q1176P9924P8033P6587P5443P2306O6066N8821
$$ 7865188 7950980 8034971 8117149 8198325 8278249 8356282 8432869 8508312 8580618 8646684 8705505
61373H705505N2718M6548L7810K6672J5437N031n480j6282k6208l4749m2531m9481
$$ 8705505 8758223 8804771 8842581 8869253 8884690 8889721 8884241 8867959 8841751 8807002 8764471 8714990
61361H714990n4486n7289n9014o0135n9475n5968n0217m3626l7058l0930k5633
$$ 8714990 8660504 8603215 8544201 8484066 8424591 8368623 8318406 8274780 8237722 8206792 8181159
61350H181159k1039j6338j1084n846j509J504L020K905J467n46k781n442q319
$$ 8181159 8160120 8143782 8132698 8126852 8125343 8126847 8129867 8132772 8134239 8133693 8130912 8125470 8117151
61337H117151j0230r918o961j447O676J7520L1030M7291O6579Q8661J12416J36691
$$ 8117151 8106921 8097003 8090042 8088595 8095271 8112791 8143821 8191112 8257691 8346352 8458768 8595459
61325H595459J61381J87309K15139K44645K74936L05027L34036L60976L84606
$$ 8595459 8756840 8944149 9159288 9403933 9678869 9983896 10317932 10678908 11063514
61316A1063514M03752M17556M24868M23424M10331L83781L43798K91123K26511
$$ 11063514 11467266 11884822 12309690 12733114 13143445 13527226 13871024 14162147 14388658
61307A4388658J51949P1900p919q2989j50860k10579k62414l07654l47265l80673
$$ 14388658 14540607 14612507 14604588 14521599 14370739 14160160 13897746 13590092 13242827 12862154
61297A2862154m06643m24988m36409m41158m39183m31342m19162m03491l84679
$$ 12862154 12455511 12030523 11594114 11152956 10713773 10282431 9863269 9459778 9075099
61288I075099l63797l42068l19207k94213k67926k42805k19559j96094j70848
$$ 9075099 8711302 8369234 8050027 7755814 7487888 7245083 7025524 6829430 6658582
61279F658582j45467j22662j02655q3428o3719m4266k6402j0577L783J7647L1386
$$ 6658582 6513115 6390453 6287798 6204370 6140651 6096385 6069983 6059406 6063189 6080836 6112222
61268F112222M4026N3987O1070O7007P3368P9573Q3660Q4577Q2965Q0067P6557
$$ 6112222 6156248 6210235 6271305 6338312 6411680 6491253 6574913 6659490 6742455 6822522 6899079
61257F899079P2231O6504N9478N2556M7288M3345L8647L1979K4487J7850J1927
$$ 6899079 6971310 7037814 7097292 7149848 7197136 7240481 7279128 7311107 7335594 7353444 7365371
61246G365371N244k915j2042k1396l0407l8408m5108n1197n7537o3828o9003p2905
$$ 7365371 7370615 7367700 7355658 7334262 7303855 7265447 7220339 7169142 7111605 7047777 6978774 6905869
61234F905869p6695q1407q6728r1460r4727r6407r6619r5134r1489q5755p8956
$$ 6905869 6829174 6747767 6661039 6569579 6474852 6378445 6281826 6186692 6095203 6009448 5930492
61223E930492p2273o5905n9235n2061m4962l8388l2177k6435k2159k0405k1192
$$ 5930492 5858219 5792314 5733079 5681018 5636056 5597668 5565491 5539056 5516897 5496492 5475300
61212E475300k3485k5868k7093k6667k5222k3730k2189j9850j6788j4053j1737
$$ 5475300 5451815 5425947 5398854 5372187 5346965 5323235 5301046 5281196 5264408 5250355 5238618
61201E238618q163j966N992J3950K1805L1139M3004N6859P1579Q6556J01699J16974
$$ 5238618 5230455 5228489 5234481 5248431 5270236 5301375 5344379 5401238 5472817 5559373 5661072 5778046
61189E778046J32121J46581J59677J70936J79776J84778J83929J75941J60676
$$ 5778046 5910167 6056748 6216425 6387361 6567137 6751915 6935844 7111785 7272461
61180G272461J38092J07645O9323K4554k4455p5437j25500j70884k08402k36750
$$ 7272461 7410553 7518198 7587521 7612075 7587620 7512183 7386683 7215799 7007397 6770647
61170F770647k55826k65567k66482k60636k50851k38951k25375k10134j93508
$$ 6770647 6514821 6249254 5982772 5722136 5471285 5232334 5006959 4796825 4603317
61161D603317j76291j59932j45768j33559j21580j08982r7120q7541p9605p1378
$$ 4603317 4427026 4267094 4121326 3987767 3866187 3757205 3660085 3572544 3492939 3421561
61151C421561o2146n2624m3342l4464k6751k0959j6190j0370k752N168J1303J4608
$$ 3421561 3359415 3306791 3263449 3228985 3202234 3181275 3165085 3154715 3151963 3157131 3168434 3183042
61139C183042J5137J3812J2346J2214J3129J3311J1486Q027M057K32l364o852
$$ 3183042 3198179 3211991 3224337 3236551 3249680 3262991 3274477 3282504 3286561 3286793 3283429 3276577
61127C276577j0432j4129j7565k0348k2671k5122k7982l1028l3796l5763l6685
$$ 3276577 3266145 3252016 3234451 3214103 3191432 3166310 3138328 3107300 3073504 3037741 3001056
61116C001056l7041l7605l8200l7856l6630l6094l7083l8345l8760l9594m2537
$$ 3001056 2964015 2926410 2888210 2850354 2813724 2777630 2740547 2702202 2663442 2623848 2581311
61105B581311m6472m8553m8254m7901m9075n0658n1122n0707n0344m9930m8781
$$ 2581311 2534839 2486286 2438032 2390131 2341056 2290398 2239276 2188569 2138225 2088295 2039514
61094B039514m6839m4721m3289m3483m5451m7530m7291m4182m0123l7040l4953
$$ 2039514 1992675 1947954 1904665 1861182 1815731 1768201 1720910 1676728 1636605 1599565 1564612
61083A564612l2930l0685k8412k6009k3291k0386j7395j4324j1665j0036q956
$$ 1564612 1531682 1500997 1472585 1446576 1423285 1402899 1385504 1371180 1359515 1349479 1340523
61072A340523p007l800p14J119K572N229R017J2222J3606J3715J4103J5766J8314
$$ 1340523 1333516 1329716 1329002 1330121 1332693 1337922 1346939 1359161 1372767 1386482 1400585 1416351 1434665
61059A434665K0438K1251K1094K0850K0776K0514J9980J9423J8841J8182J7838
$$ 1434665 1455103 1476354 1497448 1518298 1539074 1559588 1579568 1598991 1617832 1636014 1653852
61048A653852J7982J7606J5560J2415R842Q091N794K620K43l19o55k777o151q481
$$ 1653852 1671834 1689440 1705000 1717415 1727257 1735348 1741142 1743762 1744005 1743686 1743031 1740254 1734103 1725622
61034A725622q803q313q396r167j0110j1118j2465j4215j5896j6788j6590j5891
$$ 1725622 1716819 1708506 1700110 1690943 1680833 1669715 1657250 1643035 1627139 1610351 1593761 1577870
61022A577870j5681j6302j7120j7283j6486j5050j3634j2852j2818j3129j3438
$$ 1577870 1562189 1545887 1528767 1511484 1494998 1479948 1466314 1453462 1440644 1427515 1414077
61011A414077j3657j3311j1496q234n155l793l794l825l611l651l608k587p76
$$ 1414077 1400420 1387109 1375613 1367379 1362224 1358431 1354637 1350812 1347201 1343550 1339942 1337355 1336579
60998A336579Q63K199L756N258O066O640P648Q208P298O428Q056J1431J3182J2472
$$ 1336579 1337442 1339641 1343397 1348655 1354721 1361361 1369009 1377217 1384515 1390943 1398999 1410430 1423612 1436084
60984A436084J2241J4384J7076J8379J9348K1483K3943K5582K7408L0628L4243
$$ 1436084 1448325 1462709 1479785 1498164 1517512 1538995 1562938 1588520 1615928 1646556 1680799
60973A680799L6870L9083M1733M4025M5460M7726N2069N6735N9690O2013O5658
$$ 1680799 1717669 1756752 1798485 1842510 1887970 1935696 1987765 2044500 2104190 2166203 2231861
60962B231861O9604P1678P2884P6247Q1888Q6790Q9430R1662R5782J02271J10593
$$ 2231861 2301465 2373143 2446027 2522274 2604162 2690952 2780382 2872044 2967826 3070097 3180690
60951C180690J19856J28681J36393J44311J54137J65532J77074J88686K01064
$$ 3180690 3300546 3429227 3565620 3709931 3864068 4029600 4206674 4395360 4596424
60942D596424K13802K26529K40900K58832K79817L02711L28864L60306L96006
$$ 4596424 4810226 5036755 5277655 5536487 5816304 6119015 6447879 6808185 7204191
60933G204191M33612M73948N20292N74461O37614P13335Q04678R09201J022823
$$ 7204191 7637803 8111751 8632043 9206504 9844118 10557453 11362131 12271332 13294155
60924A3294155J147848J290878J453738J634722J838321K072727K336559K621665
$$ 13294155 14442003 15732881 17186619 18821341 20659662 22732389 25068948 27690613
60916B7690613K929585L254084L517460L542566L148618K319823J274043L36090
$$ 27690613 30620198 33874282 37391742 40934308 44082926 46402749 47676792 48012882
60908D8012882k70047n10939m66492k28782R1289L03102J72925m17665j349402
$$ 48012882 47742835 47231896 46765404 46536622 46627911 46931013 47103938 46686273 45336871
60899D5336871k325672l066807l455966l533163l400035l148400k844933k534586
$$ 45336871 43011199 39944392 36488426 32955263 29555228 26406828 23561895 21027309
60891B1027309k239695j965283j712917j486724j287675j111396r55214q21773
$$ 21027309 18787614 16822331 15109414 13622690 12335015 11223619 10268405 9446632
60883I446632p13074o25714n54504m96582m49451m08837l71493l37641l08339
$$ 9446632 8733558 8107844 7553340 7056758 6607307 6198470 5826977 5489336 5180997
60874E180997k82582k58841k37269k18506k02122j87739j75856j66253j57440
$$ 5180997 4898415 4639574 4402305 4183799 3981677 3793938 3618082 3451829 3294389
60865C294389j48927j42167j37896j34378j29591j23360j16081j07347r7450q8440
$$ 3294389 3145462 3003295 2865399 2731021 2601430 2478070 2361989 2254642 2157192 2068752
60855B068752q1782p6337p0318o3953n8599n4410n0681m7449m5047m2723l9271
$$ 2068752 1986970 1910633 1840315 1776362 1717763 1663353 1612672 1565223 1520176 1477453 1438182
60844A438182l4623k9750k5608k3074k2845k4236k4980k3423k0236j6956j3989
$$ 1438182 1403559 1373809 1348201 1325127 1302282 1278046 1253066 1229643 1209407 1192451 1178462
60833A178462j1159r025q135p746o743n150l436j278J481L559L620K542K526M359
$$ 1178462 1167303 1158278 1150143 1142397 1135654 1130504 1127068 1125790 1127271 1130830 1134450 1136992 1139518 1143877
60819A143877O907R025J0359J0601R508P734O343N502M714L983L553K898J367
$$ 1143877 1150784 1159809 1170168 1180769 1190277 1198011 1204354 1209856 1214570 1218553 1222106 1225004 1226371
60806A226371m79j563k099l176m722n550n467n653o657p479p103n597l431q98
$$ 1226371 1225892 1224329 1222230 1219054 1214332 1208782 1203315 1197662 1191005 1183526 1176423 1170826 1167395 1166497
60792A166497J455L096M486O579R169J1140J2590J5025J8821K2088K2984K1786
$$ 1166497 1167952 1171048 1175534 1182113 1191282 1202422 1215012 1230037 1248858 1270946 1293930 1315716
60780A315716J9848J7836J6140J5685J6795J7996J7474J5298J3072J1710J0746
$$ 1315716 1335564 1353400 1369540 1385225 1402020 1420016 1437490 1452788 1465860 1477570 1488316
60769A488316R630Q573P967P743P544P072O205N092M120L567L397L478L690L788
$$ 1488316 1497946 1506519 1514486 1522229 1529773 1536845 1543050 1548142 1552262 1555829 1559226 1562704 1566394 1570182
60755A570182L457K660J622M49p76j760k459l549n664q327j0660j2878j5668j8258
$$ 1570182 1573639 1576299 1577921 1578370 1577594 1575834 1573375 1569826 1564162 1555835 1545175 1532297 1516629 1498371
60741A498371j8947j7954j7743j9504k1153k0195j7007j3857j1985j1274j1519
$$ 1498371 1479424 1461470 1443727 1424223 1403070 1382875 1365868 1352011 1340026 1328752 1317233
60730A317233j2126j1548q945n741l695k253J65L088M602M678N382P681J0465
$$ 1317233 1305107 1293559 1284614 1278873 1275178 1272925 1273090 1276178 1280780 1285458 1290840 1298521 1308986
60717A308986J2933J5580J8252J9585J9279J8898J9446K0103K0312K1032K2550
$$ 1308986 1321919 1337499 1355751 1375336 1394615 1413513 1432959 1453062 1473374 1494406 1516956
60706A516956K3135K1622J9633J9070J8799J6214J1505P909P660R583J1106J1094
$$ 1516956 1540091 1561713 1581346 1600416 1619215 1635429 1646934 1654843 1662503 1672086 1683192 1694286
60694A694286J0119R028Q043O994N968N593O344P551P819O716N260M238L130J423
$$ 1694286 1704405 1713433 1721476 1728470 1734438 1740031 1746375 1753926 1761745 1768461 1773721 1777959 1781089 1782512
60680A782512j85j013j854l669n655o339o207p307j0092j2514j2813j1735j1228
$$ 1782512 1782327 1781314 1779460 1775791 1770136 1763797 1757590 1750283 1740191 1727677 1714864 1703129 1691901
60667A691901j1946j3011j3511j3494j3640j4321j4917j4212j1925r488q484q564
$$ 1691901 1679955 1666944 1653433 1639939 1626299 1611978 1597061 1582849 1570924 1561436 1552952 1544388
60655A544388q002o246m740m855o288p864q860q878p696o102n930p903j0112r998
$$ 1544388 1536386 1530140 1525400 1520545 1514257 1506393 1497533 1488655 1480959 1474857 1468927 1461024 1450912 1440914
60641A440914p543n204m618m768l865j843j5R78J664K343K444J633O69L84M26
$$ 1440914 1433371 1428167 1423549 1418781 1414916 1413073 1413058 1414036 1415700 1418043 1420487 1422120 1422789 1423173 1423599
60626A423599k10j669l297n050p693j1289j4553j6325j6872j7114j7331j7389
$$ 1423599 1423389 1421720 1418423 1413373 1405680 1394391 1379838 1363513 1346641 1329527 1312196 1294807
60614A294807j7440j7410j6475j4160j1456r585q219o291m161l183l182k336o8
$$ 1294807 1277367 1259957 1243482 1229322 1217866 1208281 1200062 1193771 1189610 1186427 1183245 1180909 1180841
60601A180841J809J806J006J273K447K800J574l73j976k697k151l92J495K254
$$ 1180841 1182650 1184456 1185462 1186735 1189182 1191982 1193556 1193183 1191207 1188510 1186359 1185967 1187462 1189716
60587A189716K014J951K307J948K88j521k107j851k207l363l688j799J636M722
$$ 1189716 1191730 1193681 1195988 1197936 1198224 1196703 1194596 1192745 1190538 1187175 1183487 1181688 1183324 1188046
60573A188046O437P187P625P895Q325R749J2398J5046J6309J6459J6969J8463
$$ 1188046 1194483 1201670 1209295 1217190 1225515 1235264 1247662 1262708 1279017 1295476 1312445 1330908
60561A330908K0177K1537K2974K4758K6195K6711K6830K7228K7529K6886K5220
$$ 1330908 1351085 1372622 1395596 1420354 1446549 1473260 1500090 1527318 1554847 1581733 1606953
60550A606953K2972K0035J6009J1375P495N259M204K993L97m011r551j4855j8937
$$ 1606953 1629925 1649960 1665969 1677344 1684839 1690098 1694302 1697295 1697692 1693681 1684130 1669275 1650338
60537A650338k1722k3351k3548k2274k0434j9049j7912j5993j3106j0283q393
$$ 1650338 1628616 1605265 1581717 1559443 1539009 1519960 1502048 1486055 1472949 1462666 1454273
60526A454273p185n912m306k643j403r38j046q71J48J157M94k293n693p794q010
$$ 1454273 1447088 1441176 1436870 1434227 1432824 1431886 1430840 1429969 1430117 1431274 1431768 1429475 1423782 1415988 1407978
60511A407978o959n392l792k527j613m80J453M002O320P746Q358Q827R875J1627
$$ 1407978 1401019 1395627 1391835 1389308 1387695 1387215 1388668 1392670 1398990 1406736 1415094 1423921 1433796 1445423
60497A445423J3286J3847J3371J3159J4244J6057J7214J7349J7514J8762K1034
$$ 1445423 1458709 1472556 1485927 1499086 1513330 1529387 1546601 1563950 1581464 1600226 1621260
60486A621260K3591K6001K8409L1186L4700L9081M3965M8626N2575N5813N8390
$$ 1621260 1644851 1670852 1699261 1730447 1765147 1804228 1848193 1896819 1949394 2005207 2063597
60475B063597N9903N9643N6863N0737M0701K7395J2824j192j4464k7420l8837
$$ 2063597 2123500 2183143 2240006 2290743 2331444 2358839 2371663 2370471 2356007 2328587 2289750
60464B289750m5923m7121m3781l8433l2332k5561j8437j1420m123L958J1891J7947
$$ 2289750 2243827 2196706 2152925 2114492 2082160 2056599 2038162 2026742 2022619 2026577 2038468 2056415
60452B056415K1950K5635L0285L5385M0098M4607M9186N3283N6852O1631O9642
$$ 2056415 2078365 2104000 2134285 2169670 2209768 2254375 2303561 2356844 2413696 2475327 2544969
60441B544969Q0821R3385J06164J19509J34129J50288J68060J87241K07029K26667
$$ 2544969 2625790 2719175 2825339 2944848 3078977 3229265 3397325 3584566 3791595 4018262
60431D018262K46285K66175K85462L02851L18687L34881L52550L70726L87306
$$ 4018262 4264547 4530722 4816184 5119035 5437722 5772603 6125153 6495879 6883185
60422F883185L99179M00522L82826L38774K66401J69208N3693p1783j96700l09506
$$ 6883185 7282364 7682886 8065712 8404486 8670887 8840095 8893788 8822005 8625305 8315799
60412H315799m00480m63888m98338n06624m95035m71027m40123m05036l67668
$$ 8315799 7915319 7451431 6953093 6446469 5951434 5480407 5040284 4635248 4267580
60403D267580l30826k97224k67425k39913k13314j87972j65182j45534j28553
$$ 4267580 3936754 3639530 3372105 3132192 2918878 2730906 2565724 2420190 2291637
60394B291637j13747j01250r1192q2960p5542o8415o1643n5266m9203m3653l9006
$$ 2291637 2177890 2076640 1985448 1902488 1826946 1758531 1696888 1641622 1592419 1548766 1509760
60383A509760l5276l2121k9501k7700k6650k5948k5613k5917k6215k5046k2041
$$ 1509760 1474484 1442363 1412862 1385162 1358512 1332564 1306951 1281034 1254819 1229773 1207732
60372A207732j8762j6717j5524j4011j2283j1294j1015j0541r714r031q192o425
$$ 1207732 1188970 1172253 1156729 1142718 1130435 1119141 1108126 1097585 1087871 1078840 1070648 1064223
60360A064223m258l118k815j435J473L591L054J281R15K207L382L737M212N164
$$ 1064223 1059965 1056847 1054032 1052597 1054070 1057661 1060715 1061996 1062911 1065118 1068500 1072237 1076449 1081613
60346A081613N684N396N204N722O419O819P316Q179Q858Q948Q836Q816Q459P666
$$ 1081613 1087297 1092693 1097897 1103619 1110038 1116857 1124173 1132352 1141210 1150158 1158994 1167810 1176269 1183935
60332A183935P368Q228R319R120P466N590M535M288M277L938K896J339O2m73j002
$$ 1183935 1191303 1199531 1208850 1217970 1225436 1231026 1235561 1239849 1244126 1248064 1250960 1252299 1252361 1251888 1250886
60317A250886k676n457p887q482o879l857q91M99j55j541j795o22M31K03m81K4
$$ 1250886 1248210 1242753 1234866 1226384 1219505 1215648 1214757 1215256 1215101 1213560 1211765 1211143 1211574 1211777 1211296 1211320
60301A211320J987M109N212N363N372N780O591P465P911P533O437N466N723P612
$$ 1211320 1213307 1217416 1222628 1227991 1233363 1239143 1245734 1253199 1261110 1268643 1275080 1280546 1286269 1293881
60287A293881J0318J2340J2723J1729J0251Q846P573O491N827N483M823L354J430
$$ 1293881 1304199 1316539 1329262 1340991 1351242 1360088 1367661 1374152 1379979 1385462 1390285 1393639 1395069
60274A395069ll28K47J101J812K239K208J582Q38J159L289O244P872P105N217
$$ 1395069 1395066 1394738 1394985 1396086 1397898 1400137 1402345 1403927 1404765 1405924 1409213 1415457 1423329 1430434 1435651
60259A435651M272M688M956L601P24k404m615n539n456m761l503j566N77J862
$$ 1435651 1439923 1444611 1449567 1453168 1453892 1451488 1446873 1441334 1435878 1431117 1427614 1426048 1426625 1428487
60245A428487J950J992L154M728M986L705K400J913J442N82O51K711N509O919
$$ 1428487 1430437 1432429 1435583 1440311 1445297 1449002 1451402 1453315 1454757 1455339 1455990 1458701 1464210 1471129
60231A471129O635N959N575N155M911N761P778R795J0906J1344J1638J1933J2355
$$ 1471129 1477764 1483723 1489298 1494453 1499364 1505125 1512903 1522698 1533604 1544948 1556586 1568519 1580874
60218A580874J3095J3860J4159J4313J5199J6855J8394J9466K0634K2023K2942
$$ 1580874 1593969 1607829 1621988 1636301 1651500 1668355 1686749 1706215 1726849 1748872 1771814
60207A771814K3438K4833K7843L1382L4262L6961M0438M4277M7583N1030N6169
$$ 1771814 1795252 1820085 1847928 1879310 1913572 1950533 1990971 2035248 2082831 2133861 2190030
60196B190030O2835O8904P2902P5666P9127Q4494R1821J00357J08952J16995J25142
$$ 2190030 2252865 2321769 2394671 2470337 2549464 2633958 2725779 2826136 2935088 3052083 3177225
60185C177225J34461J44816J55009J64549J74105J83925J93056K00679K07092
$$ 3177225 3311686 3456502 3611511 3776060 3950165 4134090 4327146 4527825 4734917
60176D734917K12554K16051K16174K12525K05478J95202J81858J66169J48807
$$ 4734917 4947471 5163522 5379696 5592221 5797699 5992901 6174759 6340928 6489735
60167F489735J29525J07931Q4776O1621L9380J8235j241j7998l1646m2579n0655
$$ 6489735 6619260 6727191 6811967 6873588 6912968 6931203 6929962 6911964 6880318 6837739 6787084
60156F787084n4733n4074m9571m2882l4747k4670j2042L013J9981L8638N8997
$$ 6787084 6732351 6678277 6628706 6585824 6551077 6526407 6514365 6517378 6537359 6575997 6634994
60145F634994Q0413J01295J20379J38195J56272J74358J89495J98927K03108K04392
$$ 6634994 6715407 6816702 6937081 7075276 7231548 7405906 7595401 7794328 7997436 8201828
60135H201828K03131J96882J83713J64629J41966J16835Q9258N9797K9721o3k9231
$$ 8201828 8404959 8601841 8785554 8950183 9092149 9208984 9298242 9358039 9387760 9387697 9358466
60124I358466n7335q3629j07269j27203j42117j51067j53873j50605j41304j26786
$$ 9358466 9301131 9217502 9110233 8983030 8840913 8689846 8535973 8385368 8244064 8117278
60114H117278j08977q9610o8940m6522k2706J511K5643M9646P2894R4213J12800
$$ 8117278 8008301 7918691 7849751 7803229 7780523 7782034 7807677 7857323 7930217 8024430 8137230
60103H137230J28214J39529J45526J45809J41035J32060J19590J04481Q7560O9289
$$ 8137230 8265444 8404973 8550499 8696308 8837343 8969403 9088993 9193474 9281034 9350323
60093I350323N0469L3069J9136Q851R02n009p114l431O419K1619M1219O4220Q9602
$$ 9350323 9400792 9433861 9452997 9461848 9462750 9457741 9450627 9447196 9453615 9475234 9516453 9580673 9670275
60080I670275J17013J46686J78206K10251K42342K75842L12207L50835L89755
$$ 9670275 9787288 9933974 10112180 10322431 10564773 10840615 11152822 11503657 11893412
60071A1893412M28047M66431N05469N44116N80177O11603O37134O56079O67557
$$ 11893412 12321459 12787890 13293359 13837475 14417652 15029255 15666389 16322468 16990025
60062A6990025O69832O60692O38885O05151N61467N09249M48475L78541K99825
$$ 16990025 17659857 18320549 18959434 19564585 20126052 20635301 21083776 21462317 21762142
60053B1762142K14362J24979L3710n8635j51077k41125l25379m01107m66302n18556
$$ 21762142 21976504 22101483 22135193 22076558 21925481 21684356 21358977 20957870 20491568 19973012
60043A9973012n55455n76407n82870n76209n56553n24687m83675m37166l86624
$$ 19973012 19417557 18841150 18258280 17682071 17125518 16600831 16117156 15679990 15293366
60034A5293366l31692k73052k13464j55730j00811m8562L32M3889Q0149J08358
$$ 15293366 14961674 14688622 14475158 14319428 14218617 14170055 14170387 14214276 14294425 14402783
60024A4402783J28589J40488J43042J35852J20028R7257O8550L4805j969l9389
$$ 14402783 14531372 14671860 14814902 14950754 15070782 15168039 15236589 15271394 15269425 15230036
60014A5230036p6399j12821j47262j77556k03693k28244k52719k75299k93379
$$ 15230036 15153637 15040816 14893554 14715998 14512305 14284061 14031342 13756043 13462664
60005A3462664l06590l15626l19735l17686l10162k98948k84261k65025k41357
$$ 13462664 13156074 12840448 12520713 12203027 11892865 11593917 11309656 11044631 10803274
59996A0803274k14778j86183j55589j23796r2263o1252k9978J365L1690O1254
$$ 10803274 10588496 10402313 10246724 10122928 10030665 9969413 9939435 9940800 9972490 10033744
59986A0033744R1509J22078J49838J72015J88518K00313K06933K06851J99193
$$ 10033744 10125253 10247331 10397169 10569184 10757702 10958015 11164948 11371799 11570992
59977A1570992J84075J62076J34176J01545O4890K4886j6586n6795r4280j29353
$$ 11570992 11755067 11917143 12051319 12152864 12217754 12242640 12226054 12169259 12074979 11945626
59967A1945626j62047j90938k14639k32905k45312k50280k46858k36553k22075
$$ 11945626 11783579 11592641 11378002 11145097 10899785 10649505 10402647 10166094 9944019
59958I944019k04911j85084j62466j37202j09406p9535m8656j7601J3606M4938
$$ 9944019 9739108 9554024 9391558 9254356 9144950 9065415 9016759 8999158 9012764 9057702
59948I057702P5747J05735J35664J66198J96656K25666K52273K75618K94251L06632
$$ 9057702 9133449 9239184 9374848 9541046 9737702 9963368 10215641 10491259 10785510 11092142
59938A1092142L11600L07907K94469K71946K42802K08758J69619J25826Q0388
$$ 11092142 11403742 11711649 12006118 12278064 12520866 12729624 12899243 13025069 13105457
59929A3105457L6201p286n2293r8309j41849j80069k11985k36163k50145k53070
$$ 13105457 13141658 13134372 13082079 12983770 12841921 12661852 12449867 12213704 11963559 11710489
59919A1710489k46807k33562k14175j89414j61030j30456r7937o4030l0370K161
$$ 11710489 11463682 11230120 11015945 10826531 10665501 10535045 10437108 10373078 10342708 10344869
59909A0344869L4488O7032R7596J23291J43908J61702J78179J92523K03112K09182
$$ 10344869 10379357 10446389 10543985 10667276 10811184 10972886 11151065 11343588 11546700 11755882
59899A1755882K10750K07941K00904J90085J76367J61020J45285J29748J14460
$$ 11755882 11966632 12174573 12375477 12565562 12741929 12902949 13048234 13177982 13292442
59890A3292442R9988Q7863P9594P5674P6049Q1087R1471J07582J29549J57530
$$ 13292442 13392430 13480293 13559887 13635561 13711610 13792697 13884168 13991750 14121299 14278829
59880A4278829J91347K30246K73647L21521L73132M25945M77033N25378N71485
$$ 14278829 14470176 14700422 14974069 15295590 15668722 16094667 16571700 17097078 17668563
59871A7668563O14574O51345O77713O90472O86749O63161O16808N46769M54121
$$ 17668563 18283137 18934482 19612195 20302667 20989416 21652577 22269385 22816154 23270275
59862B3270275L41206K11851P1864p1646k11513l40951m53763n45657o15365o63658
$$ 23270275 23611481 23823332 23895196 23823550 23612037 23271086 22817323 22271666 21656301 20992643
59852B0992643o91243o98551o87362o61304o24081n78056n24956m67095m07012
$$ 20992643 20301400 19602849 18915487 18254183 17630102 17052046 16527090 16059995 15652983
59843A5652983l46413k86037k26280j67548j10353n5440l307M6481R4563J39892
$$ 15652983 15306570 15020533 14794253 14626705 14516352 14460912 14457605 14504086 14598649 14738541
59833A4738541J79467K10696K32998K46225K48679K38239K14506J78010J28108
$$ 14738541 14918008 15128704 15361702 15607927 15856606 16094845 16309351 16487361 16615469
59824A6615469O4219j0727r0648j70856k50030l26675l95986m52425m94087n22570
$$ 16615469 16679688 16668961 16578313 16407457 16157427 15830752 15434766 14982341 14488254 13965684
59814A3965684n39469n45084n40099n26324n05523m78972m48374m15803l82380
$$ 13965684 13426215 12881131 12341032 11814708 11309185 10830213 10381839 9966036 9583656
59805I583656l48136l13527k80066k49099k20802j94717j70641j48926j30665
$$ 9583656 9235520 8921993 8641927 8392828 8172026 7977309 7806668 7657742 7527077
59796G527077j17453j09899j06069j02658r8176r3980r1563q9842q6263p9765
$$ 7527077 7409624 7299725 7193656 7090998 6992822 6898842 6807279 6717437 6631174 6551409
59786F551409p1504o2928n4476m6433l9875l6018l5044l6263l9416m5035n3106
$$ 6551409 6479905 6416977 6362501 6316068 6276193 6240175 6205131 6168868 6129452 6084417 6031311
59775F031311o1776o8195p0950p1111p0507o9419o6506o0659n2094m1745l0466
$$ 6031311 5969535 5901340 5830390 5759279 5688772 5619353 5552847 5492188 5440094 5398349 5367883
59764E367883j9122q694L03Q122J5243K1979K9072L8059N0065O4148P7557Q7873
$$ 5367883 5348761 5340067 5340370 5348492 5363735 5385714 5414786 5452845 5502910 5567058 5644615 5732488
59752E732488R4775R9610J03804J07906J11629J14122J14220J11132J05139R7339
$$ 5732488 5827263 5926873 6030677 6138583 6250212 6364334 6478554 6589686 6694825 6792164
59742F792164Q8569P9035O9191O0235N3061M7281M2318L9159L9803M4894N3188
$$ 6792164 6880733 6959768 7028959 7089194 7142255 7189536 7231854 7271013 7310816 7355710 7408898
59731G408898O3816P7621R5387J15943J37563J60534J86816K17254K50550K85154
$$ 7408898 7472714 7550335 7645722 7761665 7899228 8059762 8246578 8463832 8714382 8999536
59721H999536L20870L58149L96873M36514M76815N17545N57494N93745O21472
$$ 8999536 9320406 9678555 10075428 10511942 10988757 11506302 12063796 12657541 13279013
59712A3279013O34133O24127N83943N07750L94127K49308Q8000p0757k10425l21085
$$ 13279013 13913146 14537273 15121216 15628966 16023093 16272401 16360401 16289644 16079219 15758134
59702A5758134l98825m43600m58634m50286m26085l91913l51075l05626k57756
$$ 15758134 15359309 14915709 14457075 14006789 13580704 13188791 12837716 12532090 12274334
59693A2274334k09662j62729j17363p3703l2071P439M5579Q3531J21627J59037
$$ 12274334 12064672 11901943 11784580 11710877 11678806 11686245 11731824 11815355 11936982 12096019
59683A2096019J95046K30172K65457L01191L37226L74170M13264M55072M99286
$$ 12096019 12291065 12521237 12786694 13087885 13425111 13799281 14212545 14667617 15166903
59674A5166903N45795N94837O46033O98465P52105Q08053Q66790R27336R88635
$$ 15166903 15712698 16307535 16953568 17652033 18404138 19212191 20078981 21006317 21994952
59665B1994952J050550J112350J171200J223388J266389J298576J317568J320543
$$ 21994952 23045502 24157852 25329052 26552440 27818829 29117405 30434973 31755516
59657C1755516J306267J275797J231514J177061J118417J063306J018209R86183
$$ 31755516 33061783 34337580 35569094 36746155 37864572 38927878 39946087 40932270
59649D0932270R67818R63239R72062R91784J017233J042016J060197J066520J055582
$$ 40932270 41900088 42863327 43835389 44827173 45844406 46886422 47946619 49013139 50068721
59640E0068721J021657R60164Q69917P53972O18227M69366L14308J60846J7374
$$ 50068721 51090378 52050542 52920459 53674431 54292658 54762024 55076332 55237178 55254552
59631E5254552j08666k11748k87595l32553l44601l24828k77182k06472j16686
$$ 55254552 55145886 54934138 54646543 54313990 53969389 53644561 53367379 53160907 53044221
59622E3044221j0786J08768K39694L79663N25978O75514Q25124R71753J111786
$$ 53044221 53033435 53142203 53381897 53761560 54287538 54963052 55788176 56759929 57871715
59613E7871715J240323J351202J437504J491435J503757J464119J362907J193592
$$ 57871715 59112038 60463240 61900744 63392179 64895936 66360055 67722962 68916554
59605F8916554R54235O48302K85583j17016n36281r45823j320477j640191j892197
$$ 68916554 69870789 70519091 70804674 70687658 70151377 69205554 67885077 66244886 64352689
59596F4352689k071333k178982k221364k207838k149560k058493j946820j826794
$$ 64352689 62281356 60102374 57881010 55673172 53523612 51465119 49518299 47691505
59588D7691505j710827j611350j539937j505235j509824j547408j602884j656754
$$ 47691505 45980678 44369328 42829391 41324156 39814332 38266924 36664040 35007286
59580C5007286j692102j699854j679267j634430j570286j491009j400659j304083
$$ 35007286 33315184 31615330 29936063 28301633 26731347 25240338 23839679 22535596
59572B2535596j206434j111643j021469r36079q55395p79825p09858o45459n86142
$$ 22535596 21329162 20217519 19196050 18259971 17404576 16624751 15914893 15269434 14683292
59563A4683292n31622m82068m37484l97005l59278l23751k91243k62828k38396
$$ 14683292 14151670 13669602 13232118 12835113 12475835 12152084 11860841 11598013 11359617
59554A1359617k16918j97904j81966j69791j61394j56686j55928j58874j64053
$$ 11359617 11142699 10944795 10762829 10593038 10431644 10274958 10119030 9960156 9796103
59545I796103j69733j75345j81162j86753j90788j92343j91529j88452j82409
$$ 9796103 9626370 9451025 9269863 9083110 8892322 8699979 8508450 8319998 8137589
59536H137589j72753j60197j46574j33352j20609j07410r3012p7826o3215n0239
$$ 8137589 7964836 7804639 7658065 7524713 7404104 7296694 7203682 7125856 7062641 7012402
59526G012402l8489k6508j3506m30J0965K0013K7805L5956M4969N3935O1661O7681
$$ 7012402 6973913 6947405 6933899 6933469 6944434 6964447 6992252 7028208 7073177 7127112 7188773 7256454
59514G256454P2160P5363P7769Q0443Q4553R0408R7566J06115J16978J30542J45680
$$ 7256454 7328614 7403977 7481746 7562189 7646742 7737150 7834716 7940831 8057809 8188351 8334031
59503H334031J60973J76353J92737K10413K28821K47857K68366K91080L15760
$$ 8334031 8495004 8671357 8864094 9074507 9303328 9551185 9819551 10110631 10426391
59494A0426391L41567L67765L93883M19721M45276M70238M93552N13841N30167
$$ 10426391 10767958 11135723 11529606 11949327 12394603 12864841 13358393 13872234 14402401
59485A4402401N41736N47192N45224N36120N21707N03289M80457M52430M19782
$$ 14402401 14944137 15491329 16036553 16572673 17094380 17597669 18078126 18530556 18950338
59476A8950338L84058L46157L05917K63415K20086J78500J41301J10338Q6564
$$ 18950338 19334396 19680553 19986470 20249885 20469971 20648471 20789772 20900110 20986674
59467B0986674P0436O2188O1622O7998Q0387R7839J18737J40306J59269J72675
$$ 20986674 21057110 21119298 21180920 21248918 21329305 21427144 21545881 21686187 21845456 22018131
59457B2018131J77496J69886J46155J04846M7237k4188j06866j97778k93066l88621
$$ 22018131 22195627 22365513 22511668 22616514 22663751 22639563 22532697 22334919 22041853 21653232
59447B1653232m80474n64510o36676o93971p34698p57890p63666p54284p33344
$$ 21653232 21172758 20608248 19971572 19277601 18542903 17785013 17021347 16267063 15533719
59438A5533719p03281o64796o19308n70305n20933m71539m21289l71321l24313
$$ 15533719 14830438 14165642 13546334 12976029 12455096 11983557 11562268 11190947 10866634
59429A0866634k81319k40931k01781j64183j28791r5016o1707k8610L711L5011
$$ 10866634 10585315 10344384 10142603 9978420 9849629 9754613 9692906 9664296 9668007 9703018
59419I703018O5811R6802J28044J58848J88561K17454K46364K75176L02352L26631
$$ 9703018 9768829 9865631 9993675 10152523 10341084 10558538 10804902 11080078 11382430 11709061
59409A1709061L48460L68533L85302L95311L96057L87247L68945L39876K98442
$$ 11709061 12057521 12426054 12811356 13206667 13602724 13989971 14358916 14698792 14997234
59400A4997234K44559J79606J05354K3905o1630j47182k28473l01624l63910m14735
$$ 14997234 15241793 15421399 15526753 15550658 15489028 15341846 15113373 14811749 14447839 14033104
59390A4033104m55439m87088n08731n18683n17311n07403m91679m71113m46206
$$ 14033104 13577665 13090577 12581846 12063163 11545852 11038449 10546770 10075657 9629451
59381I629451m18687l90835l63545l36220l08487k81187k55432k31405k08417
$$ 9629451 9210764 8819929 8456384 8120164 7811677 7530490 7275058 7043653 6835236
59372F835236j85926j64171j43979j26000j09979r4859p9781o4747n0063l5617
$$ 6835236 6649310 6485139 6341160 6215160 6105181 6010322 5930541 5865794 5815731 5780114
59362E780114k1396q309K585J1715K0688L0131L8949M6238N2744N9779O7664P6050
$$ 5780114 5758718 5750409 5752994 5764709 5785397 5815528 5854477 5900715 5953459 6013238 6080902 6156952
59350F156952Q4472R1470R4388R1899Q6472Q2815Q4165R1037J02779J18465J36628
$$ 6156952 6241424 6332894 6427282 6519181 6605653 6688468 6772633 6863670 6966449 7084914 7221542
59339G221542J56052J76839J98961K19963K36477K48611K60766K77286K99120
$$ 7221542 7377594 7554433 7753394 7973357 8209834 8458445 8719211 8996497 9295617
59330I295617L25494L56544L92663M32977M76375N23016N73233O25995O79959
$$ 9295617 9621111 9977655 10370318 10803295 11279670 11802686 12375919 13001914 13681873
59321A3681873P35102P91644Q48078R01834R51176R94672J029304J050772J055626
$$ 13681873 14416975 15208619 16056697 16958531 17909707 18904379 19933683 20984455 22040081
59312B2040081J041837J008230R55488Q87710Q10909P29470O45305N60463M78387
$$ 22040081 23081918 24090148 25045636 25933346 26744255 27473725 28119030 28679493 29157880
59303B9157880M01769L30449K62325J95217J27125N6074j8906r6983j76778k58077
$$ 29157880 29559649 29890098 30152423 30347640 30474765 30530839 30511933 30414950 30238172 29980095
59293B9980095l41345m25344n05837n77151o35296o79941p13652p39391p58892
$$ 29980095 29638750 29213406 28707569 28130418 27495122 26815181 26101529 25362138 24603246
59284B4603246p73307p84516p94742q04811q13442q18471q18507q13285q02846
$$ 24603246 23829939 23045423 22250681 21445870 20632428 19813957 18995450 18182165 17379319
59275A7379319p86812p64560p36036p02259o64724o24516n82385n39425m96835
$$ 17379319 16592507 15827947 15091911 14389652 13724928 13100412 12518027 11978602 11481767
59266A1481767m55037m13976l74469l37940l04347k71899k39861k10223j84845
$$ 11481767 11026730 10612754 10238285 9900345 9595998 9324099 9084238 8874015 8689170
59257H689170j62181j39006j14859r2372p3153n5690l8154k1070n779Q297K3026
$$ 8689170 8526989 8387983 8273124 8180752 8107599 8051909 8013755 7992685 7986906 7995203 8018229
59246H018229L8799N3967O7058P8493Q9748J01523J13111J23382J31909J38978
$$ 8018229 8057028 8110995 8178053 8256546 8346294 8447817 8560928 8684310 8816219 8955197
59236H955197J44611J48105J48787J46839J42981J37690J31281J24487J18331
$$ 8955197 9099808 9247913 9396700 9543539 9686520 9824210 9955491 10079978 10198309
59227A0198309J13368J09541J06825J05654J06759J10718J17489J26277J36127
$$ 10198309 10311677 10421218 10528043 10633697 10740456 10851174 10968663 11094940 11231067
59218A1231067J46679J57716J68070J76137J81700J85645J86859J80960J63854
$$ 11231067 11377746 11535462 11703532 11879669 12061369 12247014 12433873 12614833 12778687
59209A2778687J35757J00322O0963J9897k0392n7663r1827j23847j52434j74176
$$ 12778687 12914444 13014766 13075729 13095626 13075234 13017571 12925744 12801897 12649463 12475287
59199A2475287j87470j93950j95305j91098j80945j66595j50078j31413j09863
$$ 12475287 12287817 12093867 11898562 11707464 11526519 11359924 11209846 11078433 10968570
59190A0968570q6216o2102l8206j4933O181K3620L7976N1187O3995P5618Q5556
$$ 10968570 10882354 10820252 10782046 10767113 10773294 10796914 10834890 10886077 10950072 11025690 11111246
59179A1111246R4174J01681J08154J14765J23644J36135J52167J71551J94765
$$ 11111246 11205420 11307101 11415255 11530020 11653664 11789799 11941966 12113517 12308282
59170A2308282K22110K53044K87033L24272L64828M07339M49074M87220N19725
$$ 12308282 12530392 12783436 13070469 13394741 13759569 14166908 14615982 15103202 15622927
59161A5622927N44880N60337N62663N47996N13186M56559L78194K79956J65272
$$ 15622927 16167807 16728144 17290807 17838803 18351989 18808548 19186742 19466698 19631970
59152A9631970L8355r6369k33717l66978m88897n94056o79884p45232p89004q10961
$$ 19631970 19670325 19573956 19340239 18973261 18484364 17890308 17210424 16465192 15676188 14865227
59142A4865227q13098p99062p72353p35884o92844o46624n99450n51916n04417
$$ 14865227 14052129 13253067 12480714 11744830 11051986 10405362 9805912 9253996 8749579
59133H749579m58411m15653l76586l40415l06897k77166k52173k30892k11110
$$ 8749579 8291168 7875515 7498929 7158514 6851617 6574451 6322278 6091386 5880276
59124E880276j91934j74370j59120j45102j31132j17940j06990r7906q8782p8927
$$ 5880276 5688342 5513972 5354852 5209750 5078618 4960678 4853688 4755782 4667000 4588073
59114D588073o9556o1382n3355m4540l5797k8306k1556j4044n396L329J1081J7655
$$ 4588073 4518517 4457135 4403780 4359240 4323443 4295137 4273581 4259537 4254141 4257470 4268551 4286206
59102D286206K3493K9456L6461M4563N2750O0237O7388P4682Q1556Q7310R2659
$$ 4286206 4309699 4339155 4375616 4420179 4472929 4533166 4600554 4675236 4756792 4844102 4936761
59091D936761R8993J06320J13344J19657J26422J34384J42336J48375J51878J53593
$$ 4936761 5035754 5142074 5255418 5375075 5501497 5635881 5778217 5926592 6078470 6232063
59081F232063J54256J53937J52404J49329J44277J37131J28518J19234J09195
$$ 6232063 6386319 6540256 6692660 6841989 6986266 7123397 7251915 7371149 7480344
59072G480344R7569Q4183P0343N7836M7607L9955L5453L4734L7363M1987M7986
$$ 7480344 7577913 7662096 7732439 7790275 7837882 7877837 7913290 7948024 7985387 8027374 8075360
59061H075360N6226O7693Q2124R8624J16888J36909J57999J79062J99696K20223
$$ 8075360 8131586 8199279 8281403 8380027 8496915 8633824 8791823 8970885 9170581 9390804
59051I390804K40869K61695K82851L03826L22628L36862L45574L48919L46005
$$ 9390804 9631673 9893368 10176219 10480045 10802673 11139535 11485109 11834028 12180033
59042A2180033L34462L12359K79420K36163J83237J22363N6721j0398p6573j39288
$$ 12180033 12514495 12826854 13106274 13342437 13525674 13648037 13704758 13694360 13617787 13478499
59032A3478499j95103k40968k76011l01351l18560l28872l33508l33999l32144
$$ 13478499 13283396 13042428 12766417 12465066 12146506 11817634 11484126 11150127 10817983
59023A0817983l29656l27423l25104l22041l18500l15243l12007l07666l02049
$$ 10817983 10488327 10160904 9835800 9513759 9195259 8880016 8568009 8260343 7958294
59014G958294k96158k90200k83026k74290k65520k57713k49277k37999k24261
$$ 7958294 7662136 7371936 7088910 6814620 6549100 6291387 6042110 5804111 5579850
59005E579850k10617j98644j87851j77344j66967j56700j46242j35522j24810
$$ 5579850 5369233 5170589 4982738 4805394 4638427 4481727 4335485 4199963 4075153
58996D075153j14253j04100r5176q8197q2623p7142p1380o6254o2600o0293n8977
$$ 4075153 3960900 3856800 3761624 3673427 3590804 3513662 3442282 3376028 3313428 3253135 3194158
58985C194158n8743n9557o0535o0320n8243n4878n1409m8358m5057m0601l5152
$$ 3194158 3135415 3075858 3015323 2955003 2896760 2841882 2790473 2742115 2697058 2656457 2621305
58974B621305k9691k4623j9537j4544j0583p802m813n88L906P167R377J1550J3220
$$ 2621305 2591614 2566991 2547454 2532910 2522327 2514525 2509712 2509124 2513030 2520197 2529574 2541124 2554344
58961B554344J2839J0432P942O582N464L535J432M38O93J558L022N523Q692J1356
$$ 2554344 2567183 2577615 2585557 2592139 2597603 2601138 2602570 2603008 2603701 2605259 2608281 2613804 2622496 2633852
58947B633852J2969J4299J6441J9450K2147K3167K2274K0733K0099K0480K0245
$$ 2633852 2646821 2661120 2677561 2697011 2719158 2742325 2764599 2785332 2805431 2825911 2846156
58936B846156J7853J3730R897P848P486Q105R559J1834J4281J6197J7916K0170
$$ 2846156 2864009 2877739 2887636 2895484 2902970 2911075 2920634 2932468 2946749 2962946 2980862 3001032
58924C001032K2556K3852K4041K4717K6910K9761L2141L4323L6890L9222M0592
$$ 3001032 3023588 3047440 3071481 3096198 3123108 3152869 3185010 3219333 3256223 3295445 3336037
58913C336037M1916M4604M8238N1297N3788N7150O1624O5874O9425P3361P8048
$$ 3336037 3377953 3422557 3470795 3522092 3575880 3633030 3694654 3760528 3829953 3903314 3981362
58902C981362Q2276Q5556Q9285R4403R9476J02458J03160J02968J03274J05222
$$ 3981362 4063638 4149194 4238479 4332882 4432358 4534816 4637976 4740944 4844218 4949440
58892D949440J09505J15273J20459J24540J29778J38372J49500J60596J70606
$$ 4949440 5058945 5174218 5294677 5419217 5548995 5687367 5836867 5997463 6168069
58883F168069J80482J91275K03374K17086K32503K49068K66352K84796L04856
$$ 6168069 6348551 6539826 6743200 6960286 7192789 7441857 7708209 7993005 8297861
58874H297861L26028L47725L70274L94100M18921M44964M74041N07886N46004
$$ 8297861 8623889 8971614 9341888 9735988 10154909 10599873 11073914 11581800 12127804
58865A2127804N86533O28672O72976P19877P69231Q20866Q74351R28752R83602
$$ 12127804 12714337 13343009 14015985 14735862 15505093 16325959 17200310 18129062 19112664
58856A9112664J039192J094747J147168J192920J230147J257446J271544J267906
$$ 19112664 20151856 21246603 22393771 23586691 24816838 26074284 27345828 28613734
58848B8613734J242682J192257J112058R98458Q51845O75976M75064K53987K0971
$$ 28613734 29856416 31048673 32160731 33159189 34011034 34687010 35162074 35416061 35437032
58839C5437032k12811m37233o45121q30308r86488j109375j198637j256855j287535
$$ 35437032 35224221 34786988 34141867 33311559 32325071 31215696 30017059 28760204 27472669
58830B7472669j294390j281165j251243j207986j155265j096554j033721r67884
$$ 27472669 26178279 24897114 23645871 22437885 21282620 20186066 19152345 18184461
58822A8184461r01175q36312p74729p16786o63359o15283n71386n29520m89840
$$ 18184461 17283286 16446974 15672245 14955459 14292100 13676817 13105431 12575911 12086071
58813A2086071m54797m25270l98957l73572l49362l27094l05456k82445k58304
$$ 12086071 11631274 11206004 10807047 10433475 10084113 9757019 9451563 9169118 8910814
58804H910814k35339k15319j98101j82280j66254j49116j31379j14537r9499q5789
$$ 8910814 8675475 8460156 8262055 8079775 7913521 7764405 7633026 7518489 7418990 7333201
58794G333201p2518n9293m5926l2081j7756l451J0570K4531L8379N1577O4152
$$ 7333201 7260683 7201390 7155464 7123383 7105627 7102176 7112746 7137277 7175656 7227233 7291385
58783G291385P7096R1264J06287J21195J35667J50292J65928J82898K00658K18321
$$ 7291385 7368481 7459745 7566032 7687227 7822894 7973186 8139114 8322012 8522670 8740991
58773H740991K35767K53928K73529K94105L14959L36648L60524L87242M16585
$$ 8740991 8976758 9230686 9504215 9798320 10113279 10449927 10810451 11197693 11614278
58764A1614278M48270M81884N16563N52202N90519O33413O80469P29679P80461
$$ 11614278 12062548 12544432 13060995 13613197 14203716 14837129 15517598 16247277 17027738
58755A7027738Q34130Q91088R49264J005909J059487J108991J152350J186248
$$ 17027738 17861868 18752956 19702220 20708129 21767616 22876607 24028957 25215205
58747B5215205J206900J210623J194069J153985J086439R87220Q54238O89477
$$ 25215205 26422105 27632728 28826797 29980782 31067221 32054441 32908679 33598156
58739C3598156M97890K85199N8052j74641m02578o16436q08464r71965j102648
$$ 33598156 34096046 34381245 34439297 34264656 33862078 33245642 32437178 31465213 30362565
58730C0362565j200436j268036j307692j321010j311386j284070j243589j193046
$$ 30362565 29162129 27894093 26586401 25265391 23954005 22669935 21426346 20233300
58722B0233300j135865j075802j014831r53201q91842q32636p76127p21516o69467
$$ 20233300 19097435 18021633 17006802 16053601 15161759 14329123 13552996 12831480 12162013
58713A2162013o22453n81474n44669n10029m77324m46648m17421l89827l64944
$$ 12162013 11539560 10958086 10413417 9903388 9426064 8979416 8561995 8172168 7807224
58704G807224l42501l20618k98746k78579k61001k44503k27805k11643j96618
$$ 7807224 7464723 7144105 6845359 6566780 6305779 6061276 5833471 5621828 5425210
58695E425210j81817j67089j54249j44153j34919j25030j15844j08793j02332
$$ 5425210 5243393 5076304 4922055 4777902 4642983 4517953 4402109 4293316 4190984
58686D190984r4429q6168q0041p5992p2107o8225o5906o5271o4508o2519n9973
$$ 4190984 4096555 4010387 3930346 3854354 3782247 3714022 3648116 3582845 3518337 3455818 3395845
58675C395845n7772n6290n5931n6704n7234n5866n2770m9786m8302m8271m9056
$$ 3395845 3338073 3281783 3225852 3169148 3111914 3056048 3003278 2953492 2905190 2856919 2807863
58664B807863m9979n0311m9779m8999m8639m8503m7996m7011m5815m4689m4080
$$ 2807863 2757884 2707573 2657794 2608795 2560156 2511653 2463657 2416646 2370831 2326142 2282062
58653B282062m4203m4077m2082l8139l4169l1760l0621k9904k9519k9210k7954
$$ 2282062 2237859 2193782 2151700 2113561 2079392 2047632 2017011 1987107 1957588 1928378 1900424
58642A900424k5461k2926k1196j9547j7357j5464j4678j4519j4586j5487j7002
$$ 1900424 1874963 1852037 1830841 1811294 1793937 1778473 1763795 1749276 1734690 1719203 1702201
58631A702201j7275j5496j3648j3597j4163j3165j0816q713o794l922n04K013
$$ 1702201 1684926 1669430 1655782 1642185 1628022 1614857 1604041 1595328 1588534 1584612 1584108 1586121
58619A586121L675N558P196O831M070L63k979n417o251n108l325k920m035m849
$$ 1586121 1589796 1595354 1602550 1609381 1613451 1613814 1610835 1605418 1599167 1594059 1590734 1587814 1583779 1578930
58605A578930m110k336n07J113K677M227N559O095N353L943L319M052N437P277
$$ 1578930 1574820 1572484 1571977 1573090 1575767 1579994 1585553 1591648 1597001 1600944 1604263 1608315 1613752 1621029
58591A621029J0390J4400J6977J6909J6299J7859K1644K6364L2200L9663M6886
$$ 1621029 1631419 1645819 1662796 1679705 1696004 1713863 1735507 1761871 1794071 1833734 1880620
58580A880620N1013N1968N2501N4751N8807O4182P0489P6800Q2376Q8106R5450
$$ 1880620 1931633 1983601 2036102 2090853 2149660 2213842 2284331 2361131 2443507 2531613 2627063
58569B627063J04107J12272J19077J25481J33085J43354J57265J74194J91654
$$ 2627063 2731170 2843442 2962519 3088000 3221085 3364439 3521704 3695898 3887552
58560C887552K07641K22686K38554K55921K74585K94453L14549L32492L46862
$$ 3887552 4095193 4317879 4556433 4812354 5086939 5381392 5695941 6028433 6375295
58551F375295L58580L67659L70302L61995L42113L12276K71383K16333J47656
$$ 6375295 6733875 7101534 7471836 7833831 8175944 8488220 8759603 8975936 9123592
58542I123592P1030p295q3581j55009k18231k70752l11572l39827l54948l58672
$$ 9123592 9194622 9187327 9103746 8948737 8730506 8459754 8148182 7808355 7453407 7094735
58532G094735l54679l45542l31778l14132k94596k74570k54021k33110k13044
$$ 7094735 6740056 6394514 6062736 5748604 5454008 5179438 4925417 4692307 4479263
58523D479263j94753j78147j62827j48104j32593j15763r9813q7849q0124p4120
$$ 4479263 4284510 4106363 3943536 3795432 3662839 3547076 3447263 3359414 3279290 3205170
58513C205170o8448o4254o2283o0955n8340n4392n0401m7609m6761m7612m8537
$$ 3205170 3136722 3072468 3010185 2949230 2890890 2836498 2786097 2738488 2691727 2644115 2595578
58502B595578m8192m7550m8639n1208n2735n1988n0506m9940m9861m8957m6777
$$ 2595578 2547386 2499836 2451197 2399989 2347254 2295266 2244760 2194820 2144959 2096002 2049225
58491B049225m3594m0013l7188l5977l5378l3312k9445k5707k3606k2565k1450
$$ 2049225 2005631 1965618 1928430 1892453 1857075 1823763 1794318 1768611 1745005 1722440 1700990
58480A700990k0202j9141j7974j6317j4384j2597j1244j0665j0946j1285j0562
$$ 1700990 1680788 1661647 1643673 1627356 1612972 1600375 1589131 1578466 1567520 1556235 1545673
58469A545673q620o351m703m288n417p544r244r760j0015j1131j2758j4094j5474
$$ 1545673 1537053 1530702 1525999 1521711 1516294 1508750 1499506 1489746 1479731 1468600 1455842 1441748 1426274
58456A426274j7497j9527k0682k1292k1784k1225j8947j6496j5810j6344j6175
$$ 1426274 1408777 1389250 1368568 1347276 1325492 1304267 1285320 1268824 1253014 1236670 1220495
58445A220495j5083j4151j3195j1164q618p214p039o637n314l453j360J55p61
$$ 1220495 1205412 1191261 1178066 1166902 1158284 1151070 1144031 1137394 1132080 1128627 1127267 1127422 1126661
58432A126661m422p641p300m850m095n452n999m643l352l253l188k599k458k709
$$ 1126661 1122239 1114598 1107298 1102448 1098353 1092901 1086902 1082259 1078907 1075654 1072466 1069867 1067409 1064700
58418A064700j853K22J718J691J020N10L72J256L158L915J803j005j025J220K234
$$ 1064700 1062847 1063069 1064787 1066478 1067498 1068008 1068380 1069636 1072794 1076709 1078512 1077507 1076482 1077702 1079936
58403A079936J331J077K069K008N90O22L059N192N268M949N687O344O011N640
$$ 1079936 1081267 1082344 1084413 1086421 1087011 1087633 1090692 1095884 1101152 1106101 1111788 1118132 1124143 1129783
58389A129783N310L241r04m973p854j0704j3481j3903j1486q970q025p037m995
$$ 1129783 1135093 1138334 1137430 1132457 1124603 1113899 1100418 1086515 1075029 1066059 1058034 1050997 1046002
58376A046002l884m976o101n139l375k913l358l342l076l285l579l654m081m665
$$ 1046002 1042118 1037142 1031041 1025902 1022527 1019614 1016256 1012914 1009838 1006553 1002974 999320 995239 990574
58362I90574m097k326r60m49N12K160L217L986O342R713J0837R031P943J0248
$$ 990574 986477 984151 983191 982742 983254 985414 988631 992617 998959 1008672 1019509 1028540 1036483 1046731
58348A046731J4087J6628J7685J7884J6777J4958J4792J6720J7912J6561J4477
$$ 1046731 1060818 1077446 1095131 1113015 1129792 1144750 1159542 1176262 1194174 1210735 1225212
58337A225212J3365J1899Q702N002J956j461n549p972p358n916n997o774o727
$$ 1225212 1238577 1250476 1259178 1264180 1266136 1264675 1259126 1251154 1243796 1237880 1231883 1225109 1218382
58324A218382o578p214p368n868l794k192j16K909N083N133M532M948N894O619
$$ 1218382 1211804 1204590 1197222 1191354 1187560 1185368 1185252 1188161 1193244 1198377 1202909 1207857 1213751 1220370
58310A220370P723R183R474Q312P579Q161Q672Q523Q937R807R213P333O977Q733
$$ 1220370 1228093 1237276 1246750 1255062 1262641 1270802 1279474 1287997 1296934 1306741 1315954 1323287 1330264 1338997
58296A338997R650Q384P341P868P921O622O435Q299R203P493O035P113Q472P618
$$ 1338997 1348647 1357031 1364372 1372240 1380161 1386783 1393218 1401517 1410720 1418213 1424248 1431361 1439833 1447451
58282A447451N958N450N144M167M241O153P543P041O755Q058R096R004J0012J2691
$$ 1447451 1453409 1458859 1464003 1468170 1472411 1478564 1486107 1493148 1499903 1507961 1517057 1526061 1536073 1548764
58268A548764J4014J3019J3284J6591J9562J9955K0756K3918K5872K3879K1541
$$ 1548764 1562778 1575797 1589081 1605672 1625234 1645189 1665945 1689863 1715735 1739614 1761155
58257A761155K2858K5706K6263K5481K5985K6862K6529K6784K9092L0727K9211
$$ 1761155 1784013 1809719 1835982 1861463 1887448 1914310 1940839 1967623 1996715 2027442 2056653
58246B056653K6758K6131K6180K5471K5859K8234K9570K8386K8309L1837L5663
$$ 2056653 2083411 2109542 2135722 2161193 2187052 2215286 2244856 2273242 2301551 2333388 2369051
58235B369051L6620L6996L9345M1509M1530M1924M4373M5919M5210M6293N1180
$$ 2369051 2405671 2442667 2482012 2523521 2565051 2606975 2651348 2697267 2742477 2788770 2839950
58224B839950N5258N5420N5898O0216O4445O4879O5285O9733P5103P7660Q0103
$$ 2839950 2895208 2950628 3006526 3066742 3131187 3196066 3261351 3331084 3406187 3483847 3563950
58213C563950Q4964Q8344Q7714Q8616R5632J04019J08539J12953J21968J31424
$$ 3563950 3648914 3737258 3824972 3913588 4009220 4113239 4221778 4334731 4456699 4588123
58203D588123J36031J39612J47899J57983J64884J71777J83592J97051K07136
$$ 4588123 4724154 4863766 5011665 5169648 5334532 5506309 5689901 5886952 6094088
58194F094088K17019K31522K47285K59241K70064K83673K96903L07253L20514
$$ 6094088 6311107 6542629 6789914 7049155 7319219 7602892 7899795 8207048 8527562
58185H527562L40460L60085L73841L88844M12210M37707M57825M78440N07581
$$ 8527562 8868022 9228107 9601948 9990792 10403002 10840709 11298534 11776974 12284555
58176A2284555N40290N69646O01920O44491O89097P24211P54513P90988Q31625
$$ 12284555 12824845 13394491 13996411 14640902 15329999 16054210 16808723 17599711 18431336
58167A8431336Q69589R10328R62023J018951J072959J131002J202645J282044
$$ 18431336 19300925 20211253 21173276 22192227 23265186 24396188 25598833 26880877
58159B6880877J362159J453898J569263J698822J828931J967356K127304K301103
$$ 26880877 28243036 29696934 31266197 32965019 34793950 36761306 38888610 41189713
58151D1189713K476422K663364K877118L110045L351471L618645L936307M304809
$$ 41189713 43666135 46329499 49206617 52316662 55668133 59286778 63223085 67527894
58143F7527894M723873N227610N856603O615109P495103Q517412R704804J1043771
$$ 67527894 72251767 77479377 83335980 89951089 97446192 105963604 115668408 126712179
58135A26712179J2522092J4167545J5991626J7941555J9985590K2210301K4775466
$$ 126712179 139234271 153401816 169393442 187334997 207320587 229530888 254306354
58128B54306354K7848595L1605603L5955804L9795494M0597240L5485102K3465842
$$ 254306354 282154949 313760552 349716356 389511850 430109090 465594192 489060034
58121D89060034O752482j0341629k3981007l2535975l6413480l6915661l5376839
$$ 489060034 495812516 485470887 461489880 428953905 392540425 355624764 320247925
58114C20247925l2838275k9947455k6984951k4047749k1218228j8566425j6103431
$$ 320247925 287409650 257462195 230477244 206429495 185211267 166644842 150541411
58107A50541411j3824128j1754489r910540q263515o785690n478846m332422l317376
$$ 150541411 136717283 124962794 115052254 106788739 100003049 94524203 90191781 86874405
58099H6874405k435363j683796r60374j53988N76792P53584j4010j584766l354955
$$ 86874405 84439042 82755246 81794872 81640884 82217676 82971260 82957250 81372484 78017529
58090G8017529m745786n537119n793672n656315n266314m765918m258094l776705
$$ 78017529 73271743 67734624 61940952 56284637 51018323 46252405 41994311 38217606
58082C8217606l327084k926232k584273k285914k017408j785563j593527j425742
$$ 38217606 34890522 31964290 29380017 27094103 25076695 23291132 21697605 20271863
58074B0271863j272610j144498j047324r67740q94267q30732p78333p26355o70930
$$ 20271863 18999253 17854755 16807431 15839691 14945424 14114692 13336359 12610004 11939074
58065A1939074o22481n85109n47802n04712m65303m35849m08529l77290l48050
$$ 11939074 11316593 10731484 10183682 9678970 9213667 8777818 8369289 7991999 7643949
58056G643949l25477l04974k84910k72031k68067k64704k57637k52227k50297
$$ 7643949 7318472 7013498 6728588 6456557 6188490 5923786 5666149 5413922 5163625
58047E163625k44846k32911k20523k10256j96736j78997j64510j56120j47283
$$ 5163625 4918779 4685868 4465345 4255089 4058353 3879356 3714846 3558726 3411443
58038C411443j34677j23760j17458j11002j02204r5613r2337q6786p7482p0412
$$ 3411443 3276766 3153006 3035548 2924546 2822342 2726729 2634392 2547606 2470124 2399712
58028B399712o7900o4724n8817n5193n5636n4956n1196m9279n0858n0705m6968
$$ 2399712 2331812 2267088 2208271 2153078 2097442 2042486 1991290 1942011 1891153 1840448 1793480
58017A793480m4947m6679m6508m1231l5471l2877l0785k7467k5874k6521k5121
$$ 1793480 1748533 1701854 1655346 1614115 1578644 1545767 1514982 1487515 1461641 1435120 1409999
58006A409999k0892j8811k0139j9381j4232r986j0189j1126r635q395r434j0024
$$ 1409999 1389107 1370296 1350157 1330776 1316544 1306558 1296369 1285243 1275608 1267213 1257779 1247755
57994A247755r005r775j3243j4950j2867j1020j1984j2851j1945j2191j4333j4093
$$ 1247755 1238750 1228975 1215732 1200782 1187915 1176895 1164911 1152060 1140115 1127924 1113591 1099498
57982A099498r751n681m729m048k001j908m970o390l023J438K982K873K908J266
$$ 1099498 1089747 1084066 1079337 1075289 1073288 1071380 1066410 1060020 1056997 1058435 1061417 1064290 1067198 1068464
57968A068464k665n281m650l990n477o213m145k391l695n805o220o394p652p997
$$ 1068464 1065799 1060518 1055868 1051878 1046401 1040188 1036043 1033652 1029957 1024152 1017932 1011538 1003886 995889
57954I95889o615o481q968j0806r872q894r980j0744r446q817j0823j2610j1561
$$ 995889 989274 982793 973825 963019 953147 944253 934273 923529 914083 905266 894443 881833 870272
57941H70272r738r381q613n516k142o51L84K233K851J078j68J445L849M767N560
$$ 870272 860534 851153 842540 837024 834882 834231 834615 836848 839699 840777 840609 842054 845903 850670 856230
57926H56230P473Q232O035K985J152p98l770n309m050k822l752m540l498l679
$$ 856230 863703 871935 877970 880955 882107 881309 877539 872230 868180 865358 861606 857066 853568 849889
57912H49889p567j1662j1419q302p040q546j0122j0432j0037q896p114o383p522
$$ 849889 842322 830660 819241 810939 803899 795353 785231 774799 764762 755866 748752 742369 734847
57899G34847q480p584o439o800p272o088m605m890o128o419n861n154l578j111
$$ 734847 726367 718783 712344 705544 698272 692184 687579 682689 676561 670142 664281 659127 655549 654438
57885F54438r6j904m200m226k604j440j043r23j727l661n215n596o082p182p162
$$ 654438 654342 652438 648238 644012 641408 639968 638925 638002 636275 632614 627399 621803 615721 608539 601377
57870F01377n350l934m355n026m780n227p283q704p808o386o166n530k804K49
$$ 601377 596027 592093 587738 582712 577932 572705 565422 556718 548910 542524 536358 530828 528024 528273
57856E28273J478K017L875O297P466P507P210O303N424O960J1225J4592J4213
$$ 528273 529751 531768 535643 541940 549406 556913 564123 570426 575850 582810 594035 608627 622840
57843F22840J1828J0303R299P166M248J423j794m961n578l243j749l896p279q481
$$ 622840 634668 644971 654270 661436 665684 667107 665313 660352 654774 651531 649782 645886 638607 630126
57829F30126q322r283j0651j0278q763q114q185p825p561p932p343m699j987j288
$$ 630126 621804 612521 601870 591592 582829 574715 566530 558705 551144 543212 535869 531170 529183 527895
57815E27895j519r95n10q93m10K029M062L744L237M925O915O526N224N582O132
$$ 527895 526376 525381 524871 523978 523568 525597 529659 533403 536640 541565 548480 555006 560230 565812 571944
57800E71944M127J121N32J628J060j049j765j025j605l866n258m943m653n044
$$ 571944 576071 577192 577724 579352 580412 579363 577598 576573 574968 571102 565844 560901 556248 551204
57786E51204n118n046n948p070o660n352n242o056n702m313m220n961p485p461
$$ 551204 546086 541040 535092 528022 521362 516010 510768 504712 499010 494697 490477 484516 477031 469570
57772D69570o645o032o084p315r381j0362r233p950q721j0617j1512j1678j2332
$$ 469570 462925 456893 450809 443494 434113 423751 414518 406568 397847 387230 375718 364040 351708
57759C51708j2293r770o230m779n478n811n058m686m958m652l741l298l172k548
$$ 351708 339415 329645 323415 318636 313158 307347 302289 297603 292645 287993 284252 280954 277782 275234
57745B75234k097k587k395M34M606P223P968Q379Q256O571M922N909Q545R241
$$ 275234 273137 270550 268155 268589 273195 280418 288386 296765 305021 311592 316514 322423 330968 340209
57731C40209P147M799L668K859K072K124K381J326l05l46Q21O95r17j656j009
$$ 340209 347356 352155 355823 358682 360754 362878 365259 366585 366280 365934 366755 367450 366533 364877 363868
57716C63868j217l200n122n703n703n398l812j204N39P90Q05J050P25J67P96K366
$$ 363868 362651 359451 354329 348626 342923 337525 333713 332509 333048 333838 334643 335693 336418 336585 337381 339747
57700C39747L206L509N159P898R045P885O963P930R216R126Q376Q112Q006P784
$$ 339747 342953 346462 351621 359519 368564 376449 383412 391342 400558 409684 418060 426172 434178 441962
57686D41962Q363R967J1118J0811R952R598R480R268R582J0743J1976J2655J3097
$$ 441962 450325 460292 471410 482221 492173 501771 511251 520519 530101 540844 552820 565475 578572
57673E78572J3660J4320J5329J6802J7614J6531J4610J4503J6979J9854K1025
$$ 578572 592232 606552 621881 638683 656297 672828 687438 701941 718920 738774 759799
57662G59799K0957K1473K3351K5852K7870K9141L0561L2917L5260L5732L4663
$$ 759799 780756 802229 825580 851432 879302 908443 939004 971921 1007181 1042913 1077576
57651A077576L4971L8195M2165M4407M5875M8934N3446N7778O2073O7485P3300
$$ 1077576 1112547 1150742 1192907 1237314 1283189 1332123 1385569 1443347 1505420 1572905 1646205
57640A646205P8028Q2407Q8306R5492J02523J09779J18394J27175J34221J40824
$$ 1646205 1724233 1806640 1894946 1990438 2092961 2202740 2321134 2448309 2582530 2723354
57630B723354J50208J62861J76557J90532K05996K22986K40382K58644K78610
$$ 2723354 2873562 3036423 3212980 3403512 3609508 3832494 4072876 4331520 4610130
57621D610130K97811L11844L19312L21637L18169L05681K82703K50277K08619
$$ 4610130 4907941 5219785 5539097 5860734 6178903 6484584 6767287 7017564 7226183
57612G226183J57899J02735N1009O806l1620o6690r9306j32557j71444k16097
$$ 7226183 7384082 7486817 7537826 7544632 7513012 7446322 7347016 7214459 7043015 6826918
57602F826918k59435k94186l18250l31305l31251l17879k96310k72616k48283
$$ 6826918 6567483 6273297 5955047 5623742 5292491 4974612 4678302 4405686 4157403
57593D157403k22113j95153j70244j48323j28395j10028r3558p8671o4776n1959
$$ 4157403 3935290 3740137 3569893 3421570 3293175 3183147 3089589 3010918 2946142 2894183
57583B894183m0334k9426j8984r076R23J1637K1875L0021L7371M7185N9883P2530
$$ 2894183 2853849 2824423 2805439 2796363 2797286 2808923 2830798 2860819 2898190 2945375 3005258 3077788
57571C077788Q3842R6022J10309J24546J37162J50004J64810J80058J93793K06617
$$ 3077788 3161630 3257652 3367961 3492507 3629669 3779673 3944483 4124541 4318334 4524951
57561D524951K19168K29279K34403K34589K30390K19898K00367J70879J31419
$$ 4524951 4744119 4973398 5207801 5442390 5672780 5892678 6093045 6263924 6395343
57552F395343Q1826K4359l4893r0014j39241j82737k18682k44555k60777k70084
$$ 6395343 6477169 6501528 6466635 6376621 6237380 6054643 5835961 5591406 5330629 5060545
57542E060545k74025k72435k65447k54119k39767k24165k09210j95192j80887
$$ 5060545 4786520 4514085 4248638 3994519 3754752 3530587 3321377 3126185 2945298
57533B945298j66417j53827j43547j32988j20676j09033j00596r3949q6445p8615
$$ 2945298 2778881 2625054 2481507 2348519 2227843 2118810 2018214 1924265 1837820 1759205
57523A759205p2581o7833o2194n5784n0508m6305m1373l5842l2002l0569k9441
$$ 1759205 1686624 1618791 1556597 1500813 1450305 1404000 1362627 1326785 1294783 1264214 1234773
57512A234773k6729k2974j9790j7822j6564j4995j2194q186m096j001J006K321
$$ 1234773 1208044 1185070 1165280 1147458 1130894 1115899 1103705 1095519 1091423 1090422 1091428 1093749
57500A093749L344M816P319R982J1276J1643J3436J7495K1927K5282K8471L2175
$$ 1093749 1097093 1101909 1109228 1119210 1130486 1142129 1155565 1173060 1194987 1220269 1248740 1280915
57488A280915L5121L6970M0165M6274N2726N6306N8115O1710O7686P3557P8328
$$ 1280915 1316036 1353006 1393171 1439445 1492171 1548477 1606592 1668302 1735988 1809545 1887873
57477A887873Q3718R0801R8398J05358J12165J19843J28798J38998J49816J59859
$$ 1887873 1971591 2062392 2160790 2266148 2378313 2498156 2626954 2765952 2915768 3075627
57467C075627J68173J75268J81671J86133J86590J82076J72066J54783J28442
$$ 3075627 3243800 3419068 3600739 3786872 3973462 4155538 4327604 4482387 4610829
57458D610829R3917N4395J2549l0175p1675j08675j38781j61908j79114j90791
$$ 4610829 4704746 4759141 4771690 4741515 4669840 4561165 4422384 4260476 4081362 3890571
57448C890571j96322j95196j88406j78607j68343j58039j46668j34345j22796
$$ 3890571 3694249 3499053 3310647 3132040 2963697 2805658 2658990 2524645 2401849
57439B401849j12867j03275r2701q1583p0870o0580n0799m2518l6059k9938k2699
$$ 2401849 2288982 2185707 2093006 2011423 1940553 1879973 1829174 1786656 1750597 1720659 1697960
57428A697960j4755p226k38O328J1780J5933K0278K6293L3479M0540M7547N5410
$$ 1697960 1683205 1675979 1675741 1682069 1693849 1709782 1730060 1756353 1789832 1830372 1877919 1933329
57416A933329O4042P2470Q0364Q8241R6665J05861J15612J25206J34298J43738
$$ 1933329 1997371 2069841 2150205 2238446 2335111 2440972 2556584 2681790 2816088 2959826
57406B959826J54067J63343J68524J69082J66586J60443J47230J25392R7311O4939
$$ 2959826 3113893 3277236 3445760 3614842 3781428 3941871 4089101 4214493 4311804 4376743
57396D376743K6903j7435o3765j05871j41043j69823j92295k07655k16232k19233
$$ 4376743 4403646 4386211 4322446 4216575 4075532 3905709 3713414 3505759 3289527 3070294
57386C070294k17292k11169k02617j92734j80913j67180j53711j42056j30999
$$ 3070294 2853002 2641833 2439216 2246482 2065569 1898389 1744678 1602622 1471623
57377A471623j19358j08669j00432r2917q3935p4896o8654o4779o0428n4863m9779
$$ 1471623 1352265 1243596 1143164 1050247 966312 891416 822762 757983 697555 642692 592913
57366E92913m5925m2549l9610l7578l5631l2769l0065k9051k8780k7306k5273
$$ 592913 546988 504439 464829 427251 391620 358851 328786 299735 270955 243649 218376
57355B18376k4813k5607k5197k2982k0725j9156j7119j4391j2614j2796I037e530
$$ 218376 193563 167956 142759 119777 99052 79896 62777 48386 35772 22976 9037 -5530
57342a9554j2204r676p720o967o537n662n033n147m900l548k239j567L05M510
$$ -19554 -31758 -41434 -49154 -56121 -62658 -68320 -73353 -78500 -83400 -86948 -89187 -90754 -90449 -85939
57328h5939Q658J0135J0204J1394J2794J1924R687b076G776R110O387M196L532
$$ -85939 -77281 -67146 -56942 -45548 -32754 -20830 -11143 -2076 7776 16886 23273 27469 31001
57315C1001L173L253N178P752P797N258L632M546N806N755N546N941N558L855
$$ 31001 34174 37427 42605 50357 58154 63412 67044 71590 77396 83151 88697 94638 100196 104051
57301A04051K448K001R80r96j673K04K637L485L276L341L453K994K359J787P40
$$ 104051 106499 108500 109480 108484 106811 107015 109652 113137 116413 119754 123207 126201 128560 130347 131087
57286A31087l92K2K364M919O456P545Q415P882N739M010M392O142P639Q370Q384
$$ 131087 130695 130717 133081 138000 144456 152001 160416 168298 174037 178047 182439 188581 196220 204590 212974
57271B12974P686P146Q183J0467J1789J1145J0183J0495J1392J1588J1322J1390
$$ 212974 220660 227806 235989 246456 258245 269390 279573 290068 301460 313048 324370 335760
57259C35760J1588J1508J1671J2683J4102J5141J5649J5840J5952J6628J8422
$$ 335760 347348 358856 370527 383210 397312 412453 428102 443942 459894 476522 494944
57248D94944K0624K1713K1418K1083K1669K2706K3595K4580K5929K7352K8771
$$ 494944 515568 537281 558699 579782 601451 624157 647752 672332 698261 725613 754384
57237G54384L0816L3966L7916M1737M4253M4752M4107M4506M7075N0529N3138
$$ 754384 785200 819166 857082 898819 943072 987824 1031931 1076437 1123512 1174041 1227179
57226A227179N4925N6588N7736N7942N8175N9071N9027N6334N1935M7568M2390
$$ 1227179 1282104 1338692 1396428 1454370 1512545 1571616 1630643 1686977 1738912 1786480 1828870
57215A828870L4421K4350J4720N999l347j3332k2214k9517l6104m1406m3895m4198
$$ 1828870 1863291 1887641 1902361 1908360 1905013 1891681 1869467 1839950 1803846 1762440 1718545 1674347
57203A674347m4531m4903m3204l9256l5510l3231l1159k8417k5732k3232j9932
$$ 1674347 1629816 1584913 1541709 1502453 1466943 1433712 1402553 1374136 1348404 1325172 1305240
57192A305240j5986j2651r649n245P58O728J1946J6790K0398K1389K0973K1911
$$ 1305240 1289254 1276603 1266954 1261709 1262467 1269195 1281141 1297931 1318329 1339718 1360691 1382602
57180A382602K4151K4994K3845K3209K4408K5986K7048K8566L0585L1696L2279
$$ 1382602 1406753 1431747 1455592 1478801 1503209 1529195 1556243 1584809 1615394 1647090 1679369
57169A679369L4737L9467M4020M7240N0773N5425N9498O2066O4521O7593O9921
$$ 1679369 1714106 1753573 1797593 1844833 1895606 1951031 2010529 2072595 2137116 2204709 2274630
57158B274630P0857P1646P2780P3109P2537P2451P2585P0746O6490O1997N8486
$$ 2274630 2345487 2417133 2489913 2563022 2635559 2708010 2780595 2851341 2917831 2979828 3038314
57147C038314N5074N1742M9902M9245M7671M4950M2852M1186L7898L3620L1536
$$ 3038314 3093388 3145130 3195032 3244277 3291948 3336898 3379750 3420936 3458834 3492454 3523990
57136C523990L1913L1519K9693K9870L3430L7062L8351L9209M1301M2727M1897
$$ 3523990 3555903 3587422 3617115 3646985 3680415 3717477 3755828 3795037 3836338 3879065 3920962
57125C920962M0497L9893L8597L5769L3325L2084K9794K5417K1435J9424J7186
$$ 3920962 3961459 4001352 4039949 4075718 4109043 4141127 4170921 4196338 4217773 4237197 4254383
57114D254383J2661O776K93p995j7526k4724k7962k9673l1396l1417k9567k9138
$$ 4254383 4267044 4273820 4274113 4266118 4248592 4223868 4195906 4166233 4134837 4103420 4073853 4044715
57102D044715l1014l1168k7583k4695k7013l2798l8116m2726m7782n1863n3895
$$ 4044715 4013701 3982533 3954950 3930255 3903242 3870444 3832328 3789602 3741820 3689957 3636062
57091C636062n6599o2941p2143q2649r5606j12077j30225j48425j67683j88160
$$ 3636062 3579463 3516522 3444379 3361730 3266124 3154047 3023822 2875397 2707714 2519554
57081B519554k07296k24282k42353k63921k87807l13704l44108B57148a56553
$$ 2519554 2312258 2087976 1845623 1581702 1293895 980191 636083 257148 -156553
57071f02905m80135n16755n53018n88351o29036o80186p39510q03655q74334r53239
$$ -602905 -1083040 -1599795 -2152813 -2741164 -3370200 -4050386 -4789896 -5593551 -6467885 -7421124
57061g421124j037489j125599j221787j328915j443636j563970j695000j841689
$$ -7421124 -8458613 -9584212 -10805999 -12134914 -13578550 -15142520 -16837520 -18679209
57053a8679209k003328k181118k383436k616992k880404l173106l502133l872795
$$ -18679209 -20682537 -22863655 -25247091 -27864083 -30744487 -33917593 -37419726 -41292521
57045d1292521m281494m725975n214022n754080o347268o998128p724055q545620
$$ -41292521 -45574015 -50299990 -55514012 -61268092 -67615360 -74613488 -82337543 -90883163
57037i0883163r478483j0542678j1763826j3150438j4681264j6325296j8057625
$$ -90883163 -100361646 -110904324 -122668150 -135818588 -150499852 -166825148 -184882773
57030a84882773j9844117k1633176k3376883k5028757k6505384k7719968k8732969
$$ -184882773 -204726890 -226360066 -249736949 -274765706 -301271090 -328991058 -357724027
57023c57724027k9814884l1183390l2557213l3012431l1412214k7102728k0307712
$$ -357724027 -387538911 -418722301 -451279514 -484291945 -515704159 -542806887 -563114599
57016e63114599j1967374l233709M998562J2283763J8520204K3708457K7797137
$$ -563114599 -575081973 -578315682 -573317120 -561033357 -542513153 -518804696 -491007559
57009d91007559L0720330L2519354L3374848L3518225L3132324L2320748L1125196
$$ -491007559 -460287229 -427767875 -394393027 -360874802 -327742478 -295421730 -264296534
57002b64296534K9555089K7629401K5417008K3035807K0609710J8234428J5979869
$$ -264296534 -234741445 -207112044 -181695036 -158659229 -138049519 -119815091 -103835222
56995a03835222J3900688J2030287J0375795Q930340P684939O624574N723917
$$ -103835222 -89934534 -77904247 -67528452 -58598112 -50913173 -44288599 -38564682
56988c8564682M956685M304612L752734L282759K877169K524936K218628J950580
$$ -38564682 -33607997 -29303385 -25550651 -22267892 -19390723 -16865787 -14647159 -12696579
56980a2696579J715839J513888J343077J196950J068919R56574Q58646P71912
$$ -12696579 -10980740 -9466852 -8123775 -6926825 -5857906 -4901332 -4042686 -3270774
56972c270774O93944O25096N65096N11031d14784D45L74366L35677K97600K61896
$$ -3270774 -2576830 -1951734 -1386638 -875607 -414784 445 374811 710488 1008088 1269984
56962A269984K30453K02716J78082J57837J42769J31235J21114J11459J01205
$$ 1269984 1500437 1703153 1881235 2039072 2181841 2313076 2434190 2545649 2646854
56953B646854Q8847P4642O0838M8384L5284J9080m72k1295l9938n2623n6919n2464
$$ 2646854 2735701 2810343 2871181 2919565 2954849 2973929 2973457 2952162 2912224 2859601 2802682 2750218
56941B750218l9981k2751j1284k1915o3885j27728j91303k37686k63691k72922
$$ 2750218 2710237 2687486 2676202 2654287 2590402 2462674 2271371 2033685 1769994 1497072
56931A497072k67889k50932k26827k00207j72925j46023A10657I772g2969o6266
$$ 1497072 1229183 978251 751424 551217 378292 232269 110657 9772 -72969 -139235
56921a39235n2662m3525l8881l7765l8956m0528m0638l9190l7048l3794k8261
$$ -139235 -191897 -235422 -274303 -312068 -351024 -391552 -432190 -471380 -508428 -542222 -570483
56910e70483k0948j3365n447L556J2193J8138K2195K7320L3594L8094M0273M3277
$$ -570483 -591431 -604796 -610243 -606687 -594494 -576356 -554161 -526841 -493247 -455153 -414880 -371603
56898c71603M8567N3104N3804N1482M8305M4311c3429a790B2587J7119J0923P892
$$ -371603 -323036 -269932 -216128 -164646 -116341 -72030 -33429 -1790 22587 39706 50629 58521
56886E8521Q268R257Q476O835O327O933P598Q609J0821J3604J5497J6339J7215
$$ 58521 66789 76046 84522 91357 97684 104617 112215 120824 131645 145249 160746 177085 194300
56873A94300J8851K1183K4103K7442L0319L1051K7743J9291O685o703j7226k3494
$$ 194300 213151 234334 258437 285879 316198 347249 374992 394283 400968 394265 377039 353545
56861C53545k6388k7143k6620k5785k5112k3640k0264j5877j2478j0274p565l675
$$ 353545 327157 300014 273394 247609 222497 198857 178593 162716 150238 139964 132399 128724
56849A28724oK165L214L988M752N759P425R440J0938J1741J2323J2603J2289J2244
$$ 128724 128718 130883 134097 138085 142837 148596 156021 165461 176399 188140 200463 213066 225355 237599
56835B37599J3810J6706J9296K0869K1965K2558K1955K0704K0545K2047K4036
$$ 237599 251409 268115 287411 308280 330245 352803 374758 395462 416007 438054 462090
56824D62090K5507K6202K5146K0884J3934O899J440l069p191r796r807p822m865
$$ 462090 487597 513799 538945 559829 573763 580662 582102 579033 571842 562046 552239 544417 539552
56811E39552j096L125O450Q183R668J2651J6938K0774K3141K4927K7951L3226
$$ 539552 538456 541581 548031 556214 565882 578533 595471 616245 639386 664313 692264 725490
56799G25490L9795M5026M6243M2132L2829J9607N140p225j5798k1506k5448k6702
$$ 725490 765285 810311 856554 898686 931515 951122 956262 949037 933239 911733 886285 859583
56787H59583k4184j9379j4898j1059o286m22N106J0142J6047K2844K9003L4565
$$ 859583 835399 816020 801122 790063 783777 783355 788461 798603 814650 837494 866497 901062
56775I01062M1489M9860N6468N8725N7492N4100M6631L1916J0437j2746l1901
$$ 901062 942551 992411 1048879 1107604 1165096 1219196 1265827 1297743 1308180 1295434 1263533
56764A263533m4232n0155n1538n0078m6699m1912l6289l0317k4061j7519j1025
$$ 1263533 1219301 1169146 1117608 1067530 1020831 978919 942630 912313 888252 870733 859708
56753H59708m692K015R378J6494K2252K6879L1499L6422M0629M2358L9381K9755
$$ 859708 855016 857031 866409 882903 905155 932034 963533 999955 1040584 1082942 1122323 1152078
56741A152078J3847m810k1884l4992m3420m6779m5780m2984m0367l7001l1320
$$ 1152078 1165925 1161115 1139231 1104239 1060819 1014040 968260 925276 884909 847908 816588
56730H16588k4609j9457j5622j0607m184J019L765O001R577J3947J7936K1236
$$ 816588 791979 772522 756900 746293 742109 743128 746893 752894 762471 776418 794354 815590
56718H15590K2972K1085J4473M289p450j8877k7696l2031l2657l2405l2692l2500
$$ 815590 838562 859647 874120 878409 870959 852082 824386 792355 759698 727293 694601 662101
56706F62101l1107k9332k7399k4187j9792j6373j4992j3865j1345q584p378p237
$$ 662101 630994 601662 574263 550076 530284 513911 498919 485054 473709 465125 457747 450510
56694D50510o578n493n230n748n679m333k317m63Q68J598J818J710J305O11k4
$$ 450510 443932 438439 433209 427461 421782 417449 415132 414669 415537 417135 418953 420663 421968 422579 422555
56679D22555k73m20q85j364j411j440k052k708k529k029k401l382l523k508j441
$$ 422555 422282 421862 420977 419613 418202 416762 414710 412002 409473 407444 405043 401661 398138 395630 394189
56664C94189j016j122j977l641m648l383q17M37j79p59l17N4k39j99N95J189J315
$$ 394189 393173 392051 390074 386433 381785 378402 377585 378022 377843 377084 376767 376821 376582 376383 376978 378167 379482
56647C79482J810K346J286j267k893k349j222j020j042m84k16q94j471j142q73
$$ 379482 381292 383638 384924 383657 380764 378415 377193 376173 375131 374647 374431 373537 372066 370924 370051
56632C70051j440j851j192l20k02j44Q81K582M191N580O459O102M774L887L827
$$ 370051 368611 366760 365568 365248 365046 364902 365783 368365 372556 378136 384595 390697 395471 399358 403185
56617D03185L434K358J961K811L402K552J148L17j80n85k99L84p8j730k288o18
$$ 403185 406619 408977 410938 413749 417151 419703 420851 421168 420988 420403 420104 420488 420410 418680 416392 415774
56601D15774J175J016kK35J413J737Q14n92k333m398n688n172l469j849o56K49
$$ 415774 416949 417965 417963 418198 419611 421348 422162 421570 419237 414839 409151 403979 400510 398661 398005 398254
56585C98254O22N99J024J951K237J521R57J019N43r53k058j963j990l075l913
$$ 398254 398876 399475 400499 402450 404687 406208 407165 408184 408727 407774 405716 403753 401763 398688 394775
56570C94775l349k553k853l420l122k730l069k899j023J097J295l2q60n46K16
$$ 394775 391426 388873 386020 382600 379478 376748 373679 370780 369757 370854 372149 372117 371257 370711 370927
56555C70927J187K255K513J591P11O86L11j342k793k538j937l131n379o071m469
$$ 370927 372114 374369 376882 378473 379184 379870 380181 378839 376046 373508 371571 368440 363061 356990 352521
56540C52521j984L43K257K983J931K14n11j85K96P55J069J38k271l852k337J085
$$ 352521 350537 350880 353137 356120 358051 358265 357754 357569 357865 358620 359689 359827 357556 353704 351367 352452
56524C52452L218K943J624M10n09o30M68J786K083J901K627M098N063N278N225
$$ 352452 355670 358613 360237 360647 360138 359508 359976 361762 363845 365746 368373 372471 377534 382812 388037
56509C88037M622L249K403L291M756M917M333N050P033Q187P736P034O940O683
$$ 388037 392659 395908 398311 401602 406358 411275 415608 420658 427691 435878 443614 450648 457588 464271
56495D64271N701M649M100L843L687L664L384K522J818K342L824M831M377K598
$$ 464271 469972 474621 478721 482564 486251 489915 493299 495821 497639 499981 503805 508636 513013 515611
56481E15611K64j545k012j671j996l211l787l068k604l558m612m232l251l184
$$ 515611 515875 514330 512318 510647 508651 505440 501653 498585 495981 492423 487811 483579 480328 477144
56467D77144l507k839j595j010q61l50k57j814m259n738n803n073l495j062P94
$$ 477144 473637 470798 469203 468193 467332 466982 466725 464911 460652 454914 449111 444038 440543 439481 440275
56452D40275Q09j73q21j655l486n028m691l414k989k813j244R50J696J287J678
$$ 440275 441084 440911 440090 438435 434949 429921 425230 421816 418827 416014 414770 415720 417416 418703 420381
56437D20381K740K482O82q14j229j478j884j975k184k989k964o38K337L084K058
$$ 420381 423121 425603 426285 425471 424242 422764 420880 418905 416721 413732 410768 410130 412467 415551 417609
56422D17609K250M164N238M384L397L232K634J319J153K893M731N345N771O950
$$ 417609 419859 424023 429261 433645 437042 440274 442908 444227 445380 448273 453004 458349 464120 471070
56408D71070P877P511O466N612M842M123M019M377M158L195K514K608L057L903
$$ 471070 478947 486458 492924 498536 503378 507501 511520 515897 520055 523250 525764 528372 531429 535332
56394E35332N440O563N518K628J68p09r19j196j181j059j824l409m493m599m432
$$ 535332 540772 547335 552853 555481 555649 554940 554021 552825 551644 550585 548761 545352 540859 536260 531828
56379E31828m107l081k014k305l565l788k435j189j217j861k299k513k273j366
$$ 531828 527721 524640 522626 520321 516756 512968 510533 509344 508127 506266 503967 501454 499181 497815
56365D97815q45j898l413l172j508j109k840m552m565l628k722j615n81r58k865
$$ 497815 496970 495072 491659 488487 486979 485870 483030 478478 473913 470285 467563 465948 465367 464409 461544
56350D61544m453m414l365k059m33R95R58m93j736j988j983j867o91J416K898
$$ 461544 457091 452677 449312 447253 446820 447815 448773 448280 446544 444556 442573 440706 440015 441431 444329
56335D44329L255L557L983L361J859J537L085M571M540M079M325M264K771R72
$$ 444329 447584 451141 455124 458485 460344 461881 464966 469537 474077 478156 482481 486745 489516 490488
56321D90488P57K069L148K747J252J82Q59K844L942K942J619K323M298M845L647
$$ 490488 491245 493314 496462 499209 500461 500643 501502 504346 508288 511230 512849 515172 519470 524315 527962
56306E27962L094M214N167M367K548J082N62J413L650N607N299L376K345K770
$$ 527962 531056 535270 540437 544804 547352 548434 548996 550409 554059 559666 564965 568341 570686 573456
56292E73456K934K390K764M427N463M776L454K354J099J44Q65K719L352K444K432
$$ 573456 576390 578780 581544 585971 591434 596210 599664 602018 603117 603261 604126 606845 610197 612641 615073
56277F15073M447O717Q081R781J2239J3318J1718R399Q730R645J1116J2983J4773
$$ 615073 619520 626237 634318 644099 656338 669656 681374 690773 699503 709148 720264 733247 748020
56264G48020J5171J4238J3750J4070J3394J1462J0918J3143J5627J5823J4915
$$ 748020 763191 777429 791179 805249 818643 830105 841023 854166 869793 885616 900531
56253I00531J5258J6309J5838J3507J0884R030Q011P685P513O773O008O805R142
$$ 900531 915789 932098 947936 961443 972327 981357 989368 997053 1004566 1011339 1017347 1024152 1033294
56240A033294J0707R994Q225P255P424Q465J0572J3429J5989J8198K1055K4332
$$ 1033294 1044001 1053995 1062220 1069475 1076899 1085364 1095936 1109365 1125354 1143552 1164607 1188939
56228A188939K6401K7069K8215L0741L3285L4881L6503L9035M2030M5277M9262
$$ 1188939 1215340 1242409 1270624 1301365 1334650 1369531 1406034 1445069 1487099 1532376 1581638
56217A581638N3497N6978O0629O6350P3238P8238Q1233Q5785R3698J02722J10941
$$ 1581638 1635135 1692113 1752742 1819092 1892330 1970568 2051801 2137586 2231284 2334006 2444947
56206B444947J19633J29984J40838J51610J63797J77593J90764K02911K17012
$$ 2444947 2564580 2694564 2835402 2987012 3150809 3328402 3519166 3722077 3939089
56197C939089K34222K51084K64641K76579K89031K99871L05660L06319L03289
$$ 3939089 4173311 4424395 4689036 4965615 5254646 5554517 5860177 6166496 6469785
56188F469785K95670K81702K61845K37131K06560J69410J28323Q7190M7521R365
$$ 6469785 6765455 7047157 7309002 7546133 7752693 7922103 8050426 8137616 8185137 8194502
56178H194502k6103n7518q5039j08861j27798j41363j51360j59552j65851j70492
$$ 8194502 8168399 8110881 8025842 7916981 7789183 7647820 7496460 7336908 7171057 7000565
56168G000565j75367j81313j86717j90794j95434k01768k07962k12507k16544
$$ 7000565 6825198 6643885 6457168 6266374 6070940 5869172 5661210 5448703 5232159
56159E232159k20547k22077k19614k15408k11741k07362k00488j92117j83475
$$ 5232159 5011612 4789535 4569921 4354513 4142772 3935410 3734922 3542805 3359330
56150C359330j73393j61407j50214j41627j33133j22065j10175j00453r2345q3957
$$ 3359330 3185937 3024530 2874316 2732689 2599556 2477491 2367316 2266863 2174518 2090561
56140B090561p6280p1079o6893o1168n4506m9179m5298m1665l8463l5926l2548
$$ 2090561 2014281 1943202 1876309 1815141 1760635 1711456 1666158 1624493 1586030 1550104 1517556
56129A517556k7655k3558k2071k1365j9145j6325j4554j2903j0201p602n715k471
$$ 1517556 1489901 1466343 1444272 1422907 1403762 1387437 1372883 1359980 1349779 1342177 1336462 1333991
56117A333991K688O200N851N123P708J1335J1941J0678J1343J3598J4402J3961
$$ 1333991 1336679 1342879 1348730 1353853 1361561 1372896 1384837 1395515 1406858 1420456 1434858 1448819
56105A448819J4818J6594J6809J5519J4407J2914R869P269P683R473R285P753
$$ 1448819 1463637 1480231 1497040 1512559 1526966 1539880 1549749 1557018 1564701 1574174 1583459 1591212
56093A591212Q091J0472J2507J4056J7018K1375K5654L0192L6058M2179M7349
$$ 1591212 1599303 1609775 1622282 1636338 1653356 1674731 1700385 1730577 1766635 1808814 1856163
56082A856163N3366O2368P2992Q3104R4023J07728J22123J33597J42090J49044
$$ 1856163 1909529 1971897 2044889 2127993 2222016 2329744 2451867 2585464 2727554 2876598
56072B876598J52527J49365J40273J28283J14192R8208Q3758P4288O7984O0510
$$ 2876598 3029125 3178490 3318763 3447046 3561238 3659446 3743204 3817492 3885476 3945986
56062C945986N1041M0806K8214J1151p580k2824l3783m3329n2516o0939p0687
$$ 3945986 3997027 4037833 4066047 4077198 4069618 4046794 4013011 3969682 3917166 3856227 3785540
56051C785540q4208r9479j12276j21863j29587j33811j31518j23490j12995j01043
$$ 3785540 3701332 3601853 3489577 3367714 3238127 3104316 2972798 2849308 2736313 2635270
56041B635270q7560p4921o5345n7098m8120m0511l6287l2183k4799j7528j5769
$$ 2635270 2547710 2472789 2407444 2350346 2302226 2261715 2225428 2193245 2168446 2150918 2135149
56030B135149j8212j9650j9525k0506k1330j8689j4172j1837j0752p129j954Q63
$$ 2135149 2116937 2097287 2077762 2057256 2035926 2017237 2003065 1991228 1980476 1973347 1971393 1972256
56018A972256J913M542P746Q284P769J0039J3643J4762J5261J9500K5309K6953
$$ 1972256 1974169 1978711 1986457 1994741 2002510 2012549 2026192 2040954 2056215 2075715 2101024 2127977
56006B127977K5296K6091K9612L1067L0116L0913L3544L4308L3748L5696L9237
$$ 2127977 2153273 2179364 2208976 2240043 2270159 2301072 2334616 2368924 2402672 2438368 2477605
55995B477605M0341M0348M3818M9051N0038M6995M5645M6927M6782M5322M6609
$$ 2477605 2517946 2558294 2602112 2651163 2701201 2748196 2793841 2840768 2887550 2932872 2979481
55984B979481N0070N1656N2543N6989O2731O3878O2267O5283P3069P8733Q0725
$$ 2979481 3029551 3081207 3133750 3190739 3253470 3317348 3379615 3444898 3517967 3596700 3677425
55973C677425Q4042Q9511R2974R5075J00884J09737J16185J20593J28075J37655
$$ 3677425 3761467 3850978 3943952 4039027 4139911 4249648 4365833 4486426 4614501 4752156
55963D752156J43685J47046J53531J62460J68734J74395J85500J99674K09947
$$ 4752156 4895841 5042887 5196418 5358878 5527612 5702007 5887507 6087181 6297128
55954F297128K18682K33160K49960K59524K64362K75850K94140L08871L19139
$$ 6297128 6515810 6748970 6998930 7258454 7522816 7798666 8092806 8401677 8720816
55945H720816L34372L55124L72059L85080M04153M29535M50784M67668M92001
$$ 8720816 9055188 9410312 9782371 10167451 10571604 11001139 11451923 11919591 12411592
55936A2411592N25972N58906N88602O25015O68949P08328P40096P74900Q15895
$$ 12411592 12937564 13496470 14085072 14710087 15379036 16087364 16827460 17602360 18418255
55927A8418255Q54362Q90576R36625R93930J050682J105815J171819J250041J328743
$$ 18418255 19272617 20163193 21099818 22093748 23144430 24250245 25422064 26672105 28000848
55918B8000848J410057J511633J636356J768609J905763K063321K243260K429631
$$ 28000848 29410905 30922538 32558894 34327503 36233266 38296587 40539847 42969478
55910D2969478K622532K842563L094255L361001L644464L971347M353942M786631
$$ 42969478 45592010 48434573 51528828 54889829 58534293 62505640 66859582 71646213
55902G1646213N290551N915113O682867P579105Q603531R777212J1092526J2526064
$$ 71646213 76936764 82851877 89534744 97113849 105717380 115494592 126587118 139113182
55894A39113182J4116881J5960222J8112291K0585766K3438414K6736926L0412560
$$ 139113182 153230063 169190285 187302576 207888342 231326756 258063682 288476242
55887B88476242L4296869L8248008M1815696M3491018M0701403L1385486J6025766
$$ 288476242 322773111 361021119 402836815 446327833 487029236 518414722 534440488
55880E34440488k030050j8514138l0610000l7739753m0739083m0793234l8971788
$$ 534440488 532410438 513896300 483286300 445546547 404807464 364014230 325042442
55873C25042442l6133334l2851910k9426791k6033297k2825643j9898680j7262112
$$ 325042442 288909108 256057198 226630407 200597110 177771467 157872787 140610675
55866A40610675j4910950j2868747j1139537r680116q448313p428666o590072
$$ 140610675 125699725 112830978 101691441 92011325 83563012 76134346 69544274
55859F9544274n869043n220089m642929m141874l697535l295766k946414k653742
$$ 69544274 63675231 58455142 53812213 49670339 45972804 42677038 39730624 37076882
55851C7076882k399648k171943j979318j823863j687154j557245j442760j347716
$$ 37076882 34677234 32505291 30525973 28702110 27014956 25457711 24014951 22667235
55843B2667235j258295j166835j084457j017632r55207q89884q30428p81664p33779
$$ 22667235 21408940 20242105 19157648 18140016 17184809 16294925 15464497 14682833 13949054
55834A3949054o82205o37606o05535n75729n41695n11795m90684m68375m38251
$$ 13949054 13266849 12629243 12023708 11447979 10906284 10394489 9903805 9435430 8997179
55825H997179m08477l85363l62187l34561l10659k95847k82371k64217k47710
$$ 8997179 8588702 8203339 7841152 7506591 7195932 6900085 6617714 6353497 6105787
55816F105787k37864k28407k14877k03878j99856j95812j86452j77840j74762
$$ 6105787 5867923 5639516 5424639 5220761 5020905 4825093 4638641 4460801 4286039
55807D286039j70881j60828j50299j44642j38608j26807j13946j05437r7595q6048
$$ 4286039 4115158 3954330 3804031 3659389 3520781 3393974 3280028 3174591 3076996 2990948
55797B990948p4754o8369o4461o0970o2305p0082p6596p5502p0932o8757o7033
$$ 2990948 2916194 2847825 2783364 2722394 2660089 2590007 2513411 2437909 2366977 2298220 2231187
55786B231187o2448n7948n6256n3403m6231l9180l6546l4991l0619k6450k6003
$$ 2231187 2168739 2110791 2054535 2001132 1954901 1915721 1879175 1844184 1813565 1787115 1761112
55775A761112k6222k3665k1372k2946k5698k5969k5452k6481k6922k5242k4639
$$ 1761112 1734890 1711225 1689853 1666907 1641209 1615240 1589788 1563307 1536385 1511143 1486504
55764A486504k6744k7440k4232k1462k2811k5008k4429k3437k4509k4579k1118
$$ 1486504 1459760 1432320 1408088 1386626 1363815 1338807 1314378 1290941 1266432 1241853 1220735
55753A220735j7658j7335j7019j3783j0946j1528j1837q121l803l317m157j951
$$ 1220735 1203077 1185742 1168723 1154940 1143994 1132466 1120629 1112508 1108705 1105388 1101231 1099280
55741A099280J506K220J457K362L234R17k754m294n068q298j2740j5098j5838
$$ 1099280 1100786 1103006 1104463 1106825 1110059 1110976 1108222 1103928 1098860 1090562 1077822 1062724 1046886
55728A046886j7175j8253j7389j6173j6480j6379j3672j0328q983q299o244m462
$$ 1046886 1029711 1011458 994069 977896 961416 945037 931365 921037 912054 903755 897511 893049
55716H93049n036o465p164r192j3943j8051j8396j7398j8475k0073j9128j6764
$$ 893049 888013 881548 874384 865192 851249 833198 814802 797404 778929 758856 739728 722964
55704G22964j5318j3409r353o000o641r228j0110j0344j2679j5214j4040r928
$$ 722964 707646 694237 684884 678884 672243 663015 652905 642561 629882 614668 600628 590700
55692E90700o677m900k858j352k277m056l865k890m285p320q706q489r598j2327
$$ 590700 584023 579123 576265 574913 572636 568580 564715 561825 557540 550220 541514 533025 523427 511100
55678E11100j3945j3295j1747j0052p908n939m967m218k897k084k559k897k361
$$ 511100 497155 483860 472113 462061 454153 448214 443247 439029 436132 434048 431489 428592 426231
55665D26231k998n740p475n683l048l347n450n809m384l546l360k596k291l705
$$ 426231 423233 417493 410018 404335 401287 397940 392490 386681 382297 378751 375391 372795 370504 366799
55651C66799m602k353J060J852O00P89K754M012M332N469O799O072L888K736K279
$$ 366799 362197 359844 360904 362756 363356 364145 366899 370911 375243 380712 387511 393583 397471 400207 402486
55636D02486K85k299k096R06L016K535J575J731K043J960K577M022M708M069L383
$$ 402486 402771 400472 398376 399282 402298 404833 406408 408139 410182 412142 414719 418741 423449 427518 430901
55621D30901L454L714L851M086L898K587Q50q6l23m32J3J157J505L37k31J707
$$ 430901 434355 438069 441920 446006 449904 452491 453341 453255 452932 452500 452513 453670 455175 455512 455281 456988
55605D56988M361M876L902M121N512N715M286L036K673K342K045K424K667J502
$$ 456988 461349 466225 470127 474248 479760 485475 489761 492797 495470 497812 499857 502281 504948 506450
55591E06450k08p12m87j344l178m470n177o310p452p612p687r234j1633j3197
$$ 506450 506242 505530 505043 503699 500521 496051 490874 484564 477112 469500 461813 452579 440946 427749
55577D27749j3891j4231j3074r903p682r428j3037j3630j0410p126o296o991q077
$$ 427749 413858 399627 386553 376650 368968 359540 346503 332873 322463 315337 309041 302050 293973
55564B93973r399r683p373m000l007m729o082n583n066n670n820m276k091m77
$$ 293973 284574 274891 267518 263518 260511 255782 249700 244117 239051 233381 227561 223285 221194 220717
55550B20717O43J089M0j990l168k980k671k753k370j386p06l01P10J794J363m04
$$ 220717 221360 222449 222489 220499 217331 214351 211680 208927 206557 205171 204465 204164 204874 206668 208031 207627
55534B07627j607j743k208l329l467j698Q58K920M200M380L039J020o5J08N67
$$ 207627 206020 204277 202069 198740 195273 193575 194433 197353 201553 205933 208972 209992 209927 210035 210602
55519B10602J020J893K808L050L168M054M979M898M942O922R865J1099J0570J0910
$$ 210602 211622 213515 216323 219373 222541 226595 231574 236472 241414 248336 258201 269300 279870 290780
55505B90780J3027J4792J4509J2823J0635P800M581J887n90m168q533j1603j2470
$$ 290780 303807 318599 333108 345931 356566 364366 368947 370834 370244 366076 357543 345940 333470
55492C33470j2348j2220j1751j0853j0108r220p131m161k075j810k773m163n085
$$ 333470 321122 308902 297151 286298 276190 266970 259839 255678 253603 251793 249020 244857 239772
55479B39772m078r60J473N17k068j935J626M799M904L505K916K872K172J092N19
$$ 239772 235694 234734 236207 236724 234656 232721 234347 239146 244050 247555 250471 253343 255515 256607 257126
55464B57126N51R85J697J940R42o62j654k477m483p166q516q028o934n628l680
$$ 257126 257677 258662 260359 262299 263241 262579 260925 258448 253965 246799 238283 230255 223321 217693 214013
55449B14013k214l098n532o615n716n117n905o508o035n776o333o461n728n342
$$ 214013 211799 208701 203169 196554 190838 185721 179816 173308 167273 161497 155164 148703 142975 137633
55435A37633n331m109j912j209k374k476q4K139J707op29r43j936k805k241j329
$$ 137633 132302 128193 126281 125072 122698 120222 120138 122277 123984 123978 123249 122306 120370 117565 115324 113995
55419A13995j811l184l811l546l100k352j206p44j562k326j866j186j540j987
$$ 113995 112184 109000 105189 101643 98543 96191 94985 94241 92679 90353 88487 87301 85761 83774
55405H3774r70Q57J484M17r92j480p41P87J897J398j21n34Q24J979J226m42j232
$$ 83774 82804 83661 85145 85562 84570 83090 82349 83136 85033 86431 86310 85776 86600 88579 89805 89363 88131
55388H8131j166j110p31N82K003K326J838J425P27j028l058l591k097L51K457
$$ 88131 86965 85855 85124 85706 87709 90035 91873 93298 94025 92997 89939 86348 84251 84602 87059
55373H7059L504L312K411J709J268K99j123j562l57J071J243P12Q03J391J416
$$ 87059 90563 93875 96286 97995 99263 99562 98439 96877 96520 97591 98834 99546 100349 101740 103156
55358A03156Q46O79J305K099K278J373o69l084m462m038k440p67M47J116J319
$$ 103156 104002 104681 105986 108085 110363 111736 111067 107983 103521 99483 97043 96276 96723 97839 99158
55343I9158J520K198K974K947K081J261Q60M21k16p53j413k551l312k447o00J18
$$ 99158 100678 102876 105850 108797 110878 112139 112999 113420 113204 112451 111038 108487 105175 102728 102128 102246
55327A02246q89k164k772l106k790n92K614L764J894j28P0Q44m55l187m709m226
$$ 102246 101357 99193 96421 93315 90525 89933 92547 96311 98205 98077 98147 98991 98536 95349 90640 86414
55311H6414k817j002J177K600K176Q78N20R89P56k88p08j30k0j409l351m156l308
$$ 86414 83597 82595 83772 86372 88548 89426 89946 90935 91691 91403 90695 90565 90545 89136 85785 81629 78321
55294G8321j824j106j559k308k466k377k800l077j708J064K932K528J125M78M76
$$ 78321 76497 75391 73832 71524 69058 66681 63881 60804 59096 60160 63092 65620 66745 67223 67699
55279F7699O5q11j389j277n46M28O54o77k533k732r91L70l01j866k469j907o59
$$ 67699 67764 66953 65564 64287 63741 64169 64823 64146 61613 58881 57890 58260 57959 56093 53624 51717 51058
55262E1058J428L871M711K953N16j12Q91J489P79n03j535j936j439m18L8m39q65
$$ 51058 52486 56357 61068 64021 64537 64425 65316 66805 67584 67081 65546 63610 62171 61753 61791 61352 60487
55245F0487n74k23k66l8N89M61o14q30P72K307J900P01Q24J880K020J163O35N59
$$ 60487 59913 59690 59424 59386 59975 60436 59822 58992 59764 62071 63971 64672 65496 67376 69396 70559 71194 71753
55227G1753O4o03n01O8R5j86J17O80N61L9p7k61j353k520k246p35N57J271J995
$$ 71753 71817 71214 70713 70781 70876 70690 70807 71487 72048 72087 72010 71749 70396 67876 65630 64895 65452 66723 68718
55208F8718K404J615P7q22p29k07O88J908K261Q92o80k72J637K479J199p22j682
$$ 68718 71122 72737 72814 71992 71263 71056 71744 73652 75913 76805 76125 75853 77490 79969 81168 80446 78764
55191G8764j301K08K092K857J988J249K084K610K1m584p028n821l740l074k617
$$ 78764 77463 77671 79763 82620 84608 85857 87941 90551 90572 85988 78960 73139 69399 66325 63708
55176F3708p10J655K629K236J536P72O4L22J794K829J847l08j485j046j17M85
$$ 63708 62998 64653 67282 69518 71054 71826 71890 72212 74006 76835 78682 78374 76889 75843 75726 76211
55160G6211J096J923K202J177n89j479m75J669L119K824J302l13j374j698j291
$$ 76211 77307 79230 81432 82609 82020 80541 80066 81735 84854 87678 88980 88667 87293 85595 84304
55145H4304o92p83j621k174j783j089p73l95N93J661K083K057J903J211L3k70
$$ 84304 83612 82829 81208 79034 77251 76162 75389 74994 75587 77248 79331 81388 83291 84502 84535 84265
55129H4265J038K422K119Q28L84O76K16q61r48O3M39m93j278o50R23K389L040
$$ 84265 85303 87725 89844 90672 91056 91732 91948 91087 90139 90202 90641 90148 88870 88220 89143 91532 94572
55112I4572K103p63m041n189l535r90N54J034J072P76L67O34J782K852K928K095
$$ 94572 96675 95912 91871 86682 83147 82157 82711 83745 84817 85593 85960 86594 88376 91228 94156 96251
55096I6251Q00p36k052k416j838j282j471k079k467k506k419k325k196j921j385
$$ 96251 97051 96315 94263 91847 90009 88727 87256 85177 82710 80204 77785 75460 73264 71343 69958
55081F9958p56l63p9O50J759K383K232K118K421K274J271N90J025J389M83n86
$$ 69958 69202 68839 68760 69410 71169 73552 75784 77902 80323 82597 83868 84458 85483 86872 87355 86769
55065H6769j70J085J404Q59P55Q51j32j720k154j348o96j83J488L748M193K243
$$ 86769 86599 87684 89088 89947 90702 91553 91421 89701 87547 86199 85503 85320 86808 90556 94749 96992
55049I6992J76l07J2J45N44J482K040J855J975K952L774L520K522J329K85L93
$$ 96992 97168 96861 96873 97018 97562 99044 101084 102939 104914 107866 111640 115160 117682 119011 119296 119689
55033A19689K431M794M656K017O5N91J698J328L74M29P85j2j376j687q35K09J249
$$ 119689 122120 126914 131570 133587 133652 134243 135941 137269 137643 138072 138857 138845 137469 135782 134947 135156 136405
55016A36405K389K723J356q90k307k342j581m39Q70J687J418L55q21j872k761
$$ 136405 138794 141517 142873 141983 139676 137334 135753 135314 136184 137871 139289 139644 138823 136951 134190
55001A34190l273l398l345k860j622m54p33k076k353p99N85r6j915k674j851n99
$$ 134190 130917 127519 124174 121314 119692 119238 118505 116429 114076 113277 113862 113766 111851 109177 107326 106727
54985A06727J87M37L20K45P91J791K183J569Q49P73Q25L41m97j369k243k470j049
$$ 106727 106914 107351 107671 107916 108707 110498 112681 114250 115099 115872 116697 117038 116541 115172 112929 110459 109410
54968A09410J388K560J601M02P51J803J892J127N01n3q56j009K40J776K054J368
$$ 109410 110798 113358 114959 115361 116112 117915 119807 120934 121435 121382 120526 119517 119757 121533 123587 124955
54952A24955R60Q54M64L25J184K177J967J072J049J869K154J556Q66Q6j418l036
$$ 124955 125915 126769 127233 127558 128742 130919 132886 133958 135007 136876 139030 140586 141452 141538 140120 137084
54936A37084l310k388j952k358j910K88K517K597O44j291j652o54L38K44o52r42
$$ 137084 133774 131386 129434 127076 125166 125454 127971 130568 131212 129921 128269 127615 127953 128197 127545 126603
54920A26603K76K182L154K676J655J111J312K031K881L383L387L317L507L602
$$ 126603 126879 129061 132215 134891 136546 137657 138969 141000 143881 147264 150651 153968 157475 161077
54906A61077L283L070L591M319M018K416N89k43L39K025M108N842P061Q356J0180
$$ 161077 164360 167430 171021 175340 179358 181774 182363 182120 182459 184484 188592 194434 201495 209851 220031
54891B20031J2064J3256J3813J4508J5800J7454J8817J9129J7903J5417J2352
$$ 220031 232095 245351 259164 273672 289472 306926 325743 344872 362775 378192 390544
54880C90544Q754M175q46m625o486q049j1180j5454j8802j9999j9295j7199j4167
$$ 390544 399298 403473 402627 398002 391516 383467 372287 356833 338031 318032 298737 281538 267371
54867B67371j1249r595r134q659p371n588m037l068k568k021q90O09J477J237
$$ 267371 256122 246527 237393 228734 221363 215775 211738 208670 206102 204081 203191 203800 205277 206514
54853B06514P00R74K227M007O076Q241J0062J1402J2648J3832J4516J5095J6713
$$ 206514 207214 208188 210415 214422 220498 228739 238801 250203 262851 276683 291199 306294 323007
54840C23007J8859J8703J4475Q290L627J078j346m631q035j1362j5290j9161k0963
$$ 323007 341866 360569 375044 383334 386961 388039 386693 382062 374027 362665 347375 328214 307251
54827C07251k0149j8479j7459j6700j5360j3527j1442q953o481n071m806m603
$$ 307251 287102 268623 251164 234464 219104 205577 194135 185182 178701 173630 168824 164221
54815A64221m126m285n108n000l248j472j041o47J599M643N415K931n05k355k316
$$ 164221 160095 155810 150702 145702 142454 140982 139941 139294 140893 145536 150951 153882 153377 151022 148706
54800A48706j401k34Q26J043J0j442j983j312l34Q1j15n46r22j033p30k35r7m80
$$ 148706 147305 147071 147897 148940 148950 147508 145525 144213 143879 143960 143845 143299 142377 141344 140614 140379 140282 139802
54782A39802r79j485k665m805o631o324l761q29O72O17n8n57m61K62R82R23M20
$$ 139802 138823 137338 134673 129868 123237 116913 113152 112323 112995 113612 113554 112997 112536 112798 113780 114703 115123
54765A15123P34K096L010K340J058Q24J673K372K463K603L130L570L559L228K756
$$ 115123 115857 117953 120963 123303 124361 125185 126858 129230 131693 134296 137426 140996 144555 147783 150539
54750A50539K381K598L539M383M413M349N445P368Q382P933P616Q874J0779J1266
$$ 150539 152920 155518 159057 163440 167853 172202 177647 185015 193397 201330 208946 217820 228599 239865
54736B39865J0042R142J0433J3412J5996J7029J7167J7298J7097J5834J3704J1220
$$ 239865 249907 259049 269482 282894 298890 315919 333086 350384 367481 383315 397019 408239
54724D08239P785K543l470p774r530j0540j2375j4110j4102j2576j1036j0132
$$ 408239 416024 418567 415097 407323 397793 387253 374878 360768 346666 334090 323054 312922
54712C12922r575r238q919p800n627l658l075l142k385q25N64J801L406M647M493
$$ 312922 303347 294109 285190 277390 271763 268105 265030 261888 259503 258678 259242 261043 264449 269096 273589
54697B73589M032N585R189J2185J2844J2468J3059J4627J5857J6237J6412J7167
$$ 273589 277621 283206 292395 304580 317424 329892 342951 357578 373435 389672 406084 423251
54685D23251J8692K0235K0108J6836J0757L876j995o327r267j1071j2457j4384
$$ 423251 441943 462178 482286 499122 509879 513755 511760 505433 496166 485095 472638 458254
54673D58254j6967j9267k0432k0480j9874j9020j8251j7596j6542j4727j2693
$$ 458254 441287 422020 401588 381108 361234 342214 323963 306367 289825 275098 262405
54662B62405j1253j0274r055p607o561n923n063l852k802k199k074k620l602l797
$$ 262405 251152 240878 231823 224216 217655 211732 206669 202817 200015 197816 195742 193122 189520 185723
54648A85723k484j035j329k925l641k746j615j108n89J31J00q30j377r74n98o74
$$ 185723 183239 182204 180875 177950 174309 171563 169948 168840 168251 168382 168482 167652 166275 165301 164703 164029
54632A64029k47P82Q58m34r46Q09K969K972J369N79J046J206N45J29K67J94J83
$$ 164029 163782 164564 165422 164988 164042 164851 167820 170792 172161 172740 173786 174992 175537 175666 175933 176127 176310
54615A76310J705M681O628N606K719N76K85J064K090L392M959O018N831M772M049
$$ 176310 178015 182696 189324 194930 197649 198225 198510 199574 201664 205056 210015 216033 221864 226636 230685
54600B30685M294M905N124N246O027P103P066N419L550L043L651L814K879J902
$$ 230685 234979 239884 245008 250254 256281 263384 270450 275869 279419 282462 286113 289927 292806 294708
54586B94708K089L126L659L223L071M511O765P611O524N971Q376J2673J5520J5572
$$ 294708 296797 299923 303582 306805 309876 314387 321152 328763 335287 341258 349634 362307 377827 393399
54572C93399J4663J4496J4310J2699J0006P456N025J736k519o847j0703j4261
$$ 393399 408062 422558 436868 449567 459573 467029 472054 473790 471271 464424 453721 439460
54560D39460j7514j9816k0418j9074j6404j3799j2340j1462r555o413m013l908
$$ 439460 421946 402130 381712 362638 346234 332435 320095 308633 299078 292665 288652 284744
54548B84744m874m484k377m29N9k27r4N92J275J512R35p33l066m938n674n793
$$ 284744 279870 275386 273009 272580 272639 272412 272318 272910 274185 275697 276632 275899 272833 267895 262221 256428
54532B56428o085o425o029m726l410l095l869m947n626n908o146o326n982m866
$$ 256428 250343 243918 237889 233163 229753 226658 222789 217842 212216 206308 200162 193836 187854 182988
54518A82988l473k627k634k908k649j871j577k600m381n365m697k992j232L46
$$ 182988 179515 176888 174254 171346 168697 166826 165249 162649 158268 152903 148206 145214 143982 144328
54504A44328J712K244J407o8p98m16K98Q31J458K188K274J190n63k010k475j765
$$ 144328 146040 148284 149691 149623 148825 148409 148707 149538 150996 153184 155458 156648 156085 154075 151600 149835
54488A49835j99J339K055K050J953J834J248L54k1L97R92J359J701J985J776J349
$$ 149835 149636 150975 153030 155080 157033 158867 160115 160469 160448 160845 161837 163196 164897 166882 168658 170007
54472A70007J811L529N369O155O025N780N714N755O031O547O947P077P103O720
$$ 170007 171818 175347 180716 186871 192896 198676 204390 210145 216176 222723 229670 236747 243850 250570
54458B50570N218K828Q94j05j412l885o155o392n111m594n815p476q124p778p148
$$ 250570 255788 258616 259510 259405 257993 254108 247953 241561 236450 231856 226041 218565 210441 202663 195515
54443A95515o471n656m868m318l901l373k658j841j051n34n30r03r91j56J304
$$ 195515 189044 183388 178520 174202 170301 166928 164270 162429 161378 160844 160314 159411 158420 158264 159568
54428A59568J995P59j641k794j225J785L698L629K741K176K008K163K712K893
$$ 159568 161563 162322 160681 157887 156662 158447 162145 165774 168515 170691 172699 174862 177574 180467
54414A80467J510q53j506J216N503P956P170M377J356r16j998j776o77O17J682
$$ 180467 181977 181124 179618 180834 186337 194293 201463 205840 207196 206280 204282 202506 201829 202446 204128
54399B04128K150J561O2j238j454j079j268k295l462m132m078l082j193P61J619
$$ 204128 206278 207839 207901 206663 205209 204130 202862 200567 197105 192973 188895 185813 184620 185381 187000
54384A87000R25q27k776m184m689m578m534m724m504l326j519K29J501J998J530
$$ 187000 187925 187098 184322 180138 175449 170871 166337 161613 157109 153783 152264 152493 153994 155992 157522
54369A57522P02P02J706K331J461r9q31o11m85q74j200j046m96M54J830L088L534
$$ 157522 158224 158926 160632 162963 164424 164325 163494 162883 162398 161524 160324 159278 158782 159236 161066 164154 167688
54352A67688L279K999K903K763K782L433M452M899M365L455K934K906K992K908
$$ 167688 170967 173966 176869 179632 182414 185847 190299 195198 199563 203018 205952 208858 211850 214758
54338B14758K866L534N308P378Q121O945N162M332M455M536M371M395M204K688
$$ 214758 217624 221158 226466 233844 241965 248910 254072 258404 262859 267395 271766 276161 280365 283053
54324B83053m1k118k061p61o00k705n624o874n618l461k508l093l957m168l951
$$ 283053 283012 280894 278833 278072 277472 274767 269143 262269 256651 253190 250682 247589 243632 239464 235513
54309B35513l742l665m129n534o974o610m201j869j295j438m86J130J391j97j999
$$ 235513 231771 228106 223977 218443 211469 204859 200658 198789 197494 196056 195570 196700 198091 197894 195895
54294A95895k491j561K63K248L120J874n65j699q4L015N031M638K806J678K552
$$ 195895 193404 191843 192106 194354 197474 199348 198783 197084 197000 200015 205046 209684 212490 214168 216720
54279B16720M666O129O119N536N335N180M456L492K764J797J32j370j719j649
$$ 216720 221386 227515 233634 239170 244505 249685 254141 257633 260397 262194 262326 260956 259237 257588
54265B57588k617m327n007m221l563m233n567o482p047p694p950o982m996l338
$$ 257588 254971 250644 245637 241416 237853 233620 228053 221571 214524 206830 198880 191898 186902 183564
54251A83564l156m113m598l414j287j70q20j919k101j756j942k543k809k841l056
$$ 183564 180408 176295 171697 168283 166996 166826 166006 164087 161986 160230 158288 155745 152936 150095 147039
54236A47039k918j799n76o01j474j684j196j316j998j493O85K511K142L59p90
$$ 147039 144121 142322 141746 141145 139671 137987 136791 135475 133477 131984 132669 135180 137322 137681 136891
54221A36891n84J27L73q0q06j008k39Q74J257P63J58k10p03j289j330o25L34J388
$$ 136891 136307 136434 136807 136727 135921 134913 134674 135548 136805 137568 137726 137516 136813 135524 134194 133569 133903 135291
54203A35291K770M011M103L131K420K514K333R89p58j643j573j337j399j716k060
$$ 135291 138061 142072 146175 149306 151726 154240 156573 157562 156804 155161 153588 152251 150852 149136 147076
54188A47076k009j176J04R02Q15K91k26o43p04j75L29l9p23j38J861L429L240
$$ 147076 145067 143891 143995 144897 145712 146003 145777 145134 144430 144255 144584 144545 143822 143684 145545 148974 152214
54171A52214K079J011l45k347l548k236Q07K800K067n05k958m028l506j900o8
$$ 152214 154293 155304 154959 152612 149064 146828 147635 150435 152502 151997 149039 145011 141505 139605 139537
54156A39537J393K507L397L616K568N54j130j274J40J797K079N54j483k310j661
$$ 139537 140930 143437 146834 150450 153018 153572 152442 151168 151308 153105 155184 155738 154255 151945 150284
54141A50284q28q74j518j949j933j667j180n47k56p66j873k863l229k907k060
$$ 150284 149456 148582 147064 145115 143182 141515 140335 139788 139532 138766 136893 134030 130801 127894 125834
54126A25834q54N58J814K168R37j551l782m380l396j872n62L36O80M90K68M23
$$ 125834 124980 125538 127352 129520 130457 128906 125124 120744 117348 115476 114914 115250 115930 116420 116688 117111
54110A17111O19M48K46M07N55M62R99K626L688K202r50k788k223j139j185j706
$$ 117111 117730 118178 118424 118831 119386 119848 120847 123473 127161 129363 128413 125625 123402 122263 121078 119372
54094A19372j633j310j345j321q58m79l79K46J643K590K141J081O39Q35J061J071
$$ 119372 117739 116429 115084 113763 112905 112426 112047 112293 113936 116526 118667 119748 120387 121222 122283 123354
54078A23354N16j138l220l911k776j763k356l248k511o89L11K84N61J383J624
$$ 123354 123870 122732 119512 115601 112825 111062 108706 105458 102947 102258 102569 102853 103414 104797 106421
54063A06421R78N27R97J817K137J732Q55M2n8M90O66j85j325j729j546j411j148
$$ 106421 107399 107926 108923 110740 112877 114609 115464 115506 115448 115938 116604 116419 115094 113365 111819 110408 109260
54046A09260l46M08L71K00J074K501K613Q35j182j588k87J402K164J679Q11Q33
$$ 109260 108914 109322 109693 109893 110967 113468 116081 116916 115734 114146 113859 115261 117425 119104 119915 120748
54030A20748J911K691K091Q62M44P83O26l35j062q81k57K96P63Q41r6j704k412
$$ 120748 122659 125350 127441 128303 128747 129530 130156 129821 128759 127878 127621 127917 128680 129521 129425 127721 125309
54013A25309j256Q21K169K315K025J909J810J404Q10L96L25N90J231K207K914
$$ 125309 124053 124874 127043 129358 131383 133292 135102 136506 137316 137712 138037 138627 139858 142065 144979
53998A44979K424O33j091j129N49K447L401L630L768L900L971M318N094N714N514
$$ 144979 147403 148036 146945 145816 146365 148812 152213 155843 159611 163511 167482 171800 176894 182608 188122
53983A88122M566L424K490J950K019K840M419O560Q581R419Q894Q393R125J0057
$$ 188122 192688 196112 198602 200552 202571 205411 209830 216390 224971 234390 243284 251677 260802 270859
53969B70859R304P372O828Q390R738R225Q323Q823R639Q650O239M684M889N763
$$ 270859 280163 287535 294363 302753 312491 321716 330039 338862 348501 357151 363390 368074 372963 378726
53955C78726O226O060N169L638K124R31n76k412k997j372O49N03j779m259o265
$$ 378726 384952 391012 396181 399819 401943 402874 402298 399886 396889 395517 396166 396669 394890 390631 384366
53940C84366q496j0474j0548q656o794o364o829p300p671p743o910n280l849l238
$$ 384366 375870 365396 354848 346192 339398 333034 326205 318905 311234 303491 296581 291301 287452 284214
53926B84214l257l627m004l536j872k02J49l34n37j078l098n203m533j207J293
$$ 284214 280957 277330 273326 269790 267918 267716 267865 267531 266994 265916 262818 257615 253082 251875 253168
53911B53168R36l62k57O54P26K43M61J135J114L89k32p19j452j872j031Q17K334
$$ 253168 254104 253742 253485 254139 254865 255108 255569 256704 257818 258207 257975 257256 255804 253932 252901 253718 256052
53894B56052K776K580K492K796L228L307K947K857L734N070N647N318N154N573
$$ 256052 258828 261408 263900 266696 269924 273231 276178 279035 282769 287839 293486 298804 303958 309531
53880C09531N707N121M841N818P454Q647R257R709J0037J0219J0536J0721R751
$$ 309531 315238 320359 325200 331018 338472 347119 356376 366085 376122 386341 396877 407598 417349
53867D17349P439N302M682M839M098K191K67q34r96o2J927L987N013N254N900
$$ 417349 424788 430090 434772 439611 443709 445900 446167 445333 444337 444275 446202 450189 455202 460456 466356
53852D66356P217Q238Q324Q024Q169R029J0464J2056J2934J2383J0911R845R562
$$ 466356 473573 481811 490135 498159 506328 515357 525821 537877 550811 563194 574105 583950 593512
53839E93512Q956P083M484K176O5k606n599p634q124p948q085q403q471q815j0312
$$ 593512 602468 609551 614035 616211 616276 613670 608071 600437 592313 584365 576280 567877 559406 550591 540279
53824E40279j2637j4390j4757j4225j3505j2838j2525j3002j3852j3669j1788
$$ 540279 527642 513252 498495 484270 470765 457927 445402 432400 418548 404879 393091
53813C93091r391q157q383r111r516r422q976q562q554q637q033o851o218o318
$$ 393091 383700 375543 367160 358049 348533 339111 330135 321573 313019 304382 296349 289498 283280 276962
53799B76962n678l541j704k281m559n969n569m654m359m610n231o158o466n032
$$ 276962 271284 267743 266039 263758 259199 253230 247661 243007 238648 234038 228807 222649 216183 211151
53785B11151k367j92P82J117Q92l57j965k498k046k140l022l062j419O78J977
$$ 211151 208784 208592 209374 210491 211383 211026 209061 206563 204517 202377 199355 196293 194874 195552 197529
53770A97529K525K432J305k60o53L68J192R86P17P41j12j827k135kK249K418J860
$$ 197529 200054 202486 203791 203531 202878 203246 204438 205424 206141 206882 206770 204943 202808 202806 205055 207473 209333
53753B09333K951N038N676M549L279K324R89j20N19K661M563N788P333Q970R093
$$ 209333 212284 217322 222998 227547 230826 233150 234139 234019 234538 237199 241762 247550 254883 263853 272946
53738B72946P570O401O819P858Q568R581J1330J2403J1151P996M972L492L402
$$ 272946 280516 286917 293736 301594 310162 319743 331073 343476 354627 362623 367595 371087 374489
53725C74489L707L642L228K992K943K085k10k670l148j302R25J691R93l23j852
$$ 374489 378196 381838 385066 388058 391001 393086 392876 390206 387058 385756 386681 388372 389365 389042 387190
53710C87190l202l478k493j791l172o362r142r903r133q222p575o653n437m851
$$ 387190 383988 380510 378017 376226 373054 366692 357550 347647 338514 330292 322717 316064 310627 305776
53696C05776n390o057n428l546j975j790k442l010l612m658n266l815k34L276
$$ 305776 300386 294329 288901 285355 283380 281590 279148 276138 272526 267868 262602 258787 258553 261829
53682B61829M369K884N99q27j070o30jL75O2q33j401r79k90n91j669j854m97Q83
$$ 261829 266198 269082 269681 268854 267784 267154 267153 267528 267590 266757 265356 264377 264087 263496 261827 259973 259476 260359
53664B60359R22N34J205K168J394r17k101n79K225M093M314L193J091r82j380
$$ 260359 261281 261815 263020 265188 266582 265665 263564 262985 265210 269303 273617 276810 277901 276919 275539
53649B75539K24K143K925L144L820M425L893K629J843J628J233P64J094K275L259
$$ 275539 275763 277906 280831 283975 287795 292220 296113 298742 300585 302213 303446 304210 305304 307579 310838
53634C10838L210K185Q03j9O54K801N017N826N121L837K706K079K209K881L258
$$ 310838 314048 316233 317036 317017 317671 320472 325489 331315 336436 340273 342979 345058 347267 350148 353406
53619C53406K986K871L713N046N836N808N327M620L898L489L197K320R80K78M03
$$ 353406 356392 359263 362976 368022 373858 379666 384993 389613 393511 397000 400197 402517 403497 403775 404178
53604D04178K2j327j979p81N92P6j430j574m38j90j466k810l562m450n096l846
$$ 404178 404200 402873 400894 400113 400705 400781 399351 397777 397339 397149 395683 392873 389311 384861 379765 375919
53588C75919q71J132N79p54n38P55R08p89k824l417k106J78J919K288J947K149
$$ 375919 375048 376180 376759 376005 375467 376222 377130 376341 373517 370100 367994 368172 370091 372379 374326 376475
53572C76475L041L603L331K866K725K490J821J219J273J795K235K374K308K292
$$ 376475 379516 383119 386450 389316 392041 394531 396352 397571 398844 400639 402874 405248 407556 409848
53558D09848K704L610M351M265L740L780M549N282N614N960O559P040P048O500
$$ 409848 412552 416162 420513 424778 428518 432298 436847 442129 447743 453703 460262 467302 474350 480850
53544D80850N348M017L799N520P998R222Q980Q770R071Q534O412M107L344M111
$$ 480850 486198 490215 494014 499534 507532 516754 525734 534504 543575 552109 558521 562628 565972 570083
53530E70083N255O092O551O643O537O535O542O255N965O229O571N879M337L526
$$ 570083 575338 581430 587981 594624 601161 607696 614238 620493 626458 632687 639258 645137 649474 653000
53516F53000M071M640M007K702J691Q30j60m25Q44K767L601K892J758J331J825
$$ 653000 657071 661711 665718 668420 670111 670941 670781 670356 671200 673967 677568 680460 682218 683549 685374
53501F85374K849L866M473M608M390L734K717K136K749L888M102L335L051L686
$$ 685374 688223 692089 696562 701170 705560 709294 712011 714147 716896 720784 724886 728221 731272 734958
53487G34958L650J846l12o24J237L935O348P863P943O820O016O671P970Q492Q415
$$ 734958 738608 740454 740142 739518 740755 744690 751038 758901 766844 773664 779680 786351 794321 802813 811228
53472H11228Q865R673R625Q771Q645R855J1090J1246J1244J2637J5209J7039J6921
$$ 811228 820093 829766 839391 848162 856807 866662 877752 888998 900242 912879 928088 945127 962048
53459I62048J5956J6223J8245K0383K1072K0962K1876K4039K5735K5986K6001
$$ 962048 978004 994227 1012472 1032855 1053927 1074889 1096765 1120804 1146539 1172525 1198526
53448A198526K7182K9021L0209L0802L1763L3058L3819L4137L5123L7096L9079
$$ 1198526 1225708 1254729 1284938 1315740 1347503 1380561 1414380 1448517 1483640 1520736 1559815
53437A559815M0341M1360M2750M4206M5022M5112M5017M5263M5894M6406M6107
$$ 1559815 1600156 1641516 1684266 1728472 1773494 1818606 1863623 1908886 1954780 2001186 2047293
53426B047293M4923M3661M3103M2982M2444M1425M0823M1190M1948M2240M2024
$$ 2047293 2092216 2135877 2178980 2221962 2264406 2305831 2346654 2387844 2429792 2472032 2514056
53415B514056M1891M2060M2034M1246L9741L8079L6590L5064L3185L1049K8899
$$ 2514056 2555947 2598007 2640041 2681287 2721028 2759107 2795697 2830761 2863946 2894995 2923894
53404B923894K6581K3803K0872J8548J6917J4971J1708P333L078%j879l524o095
$$ 2923894 2950475 2974278 2995150 3013698 3030615 3045586 3057294 3064627 3067705 3067705 3065826 3062302 3056207
53391C056207r890j4074j7758k1049k4411k7253k8304k7666k7328k9072l2614
$$ 3056207 3046317 3032243 3014485 2993436 2969025 2941772 2913468 2885802 2858474 2829402 2796788
53380B796788l6365l9164m0696m1046m0693m0410m0397l9889l8290l6195l4641
$$ 2796788 2760423 2721259 2680563 2639517 2598824 2558414 2518017 2478128 2439838 2403643 2369002
53369B369002l3829l3172l2226l0908k9134k6856k4195k1239j8120j5509j4228
$$ 2369002 2335173 2302001 2269775 2238867 2209733 2182877 2158682 2137443 2119323 2103814 2089586
53358B089586j3914j2850r843n674k073J87J583K981N158Q469J2255J5256J7289
$$ 2089586 2075672 2062822 2052979 2047305 2045232 2045419 2047002 2049983 2055141 2063610 2075865 2091121 2108410
53345B108410J9634K3034K6463K8922L1294L4826L8808M1596M3362M5761M9078
$$ 2108410 2128044 2151078 2177541 2206463 2237757 2272583 2311391 2352987 2396349 2442110 2491188
53334B491188N1863N3644N5968N9944O4364O7438O9190P0999P3499P6010P7888
$$ 2491188 2543051 2596695 2652663 2712607 2776971 2844409 2913599 2984598 3058097 3134107 3211995
53323C211995P9483Q1634Q4463Q6968Q7998Q7649Q7241Q7582Q7990Q7615Q6914
$$ 3211995 3291478 3373112 3457575 3544543 3632541 3720190 3807431 3895013 3983003 4070618 4157532
53312D157532Q6609Q5788Q2693P7465P2518O9502O7246O3495N7749N1324M5212
$$ 4157532 4244141 4329929 4412622 4490087 4562605 4632107 4699353 4762848 4820597 4871921 4917133
53301D917133L8996L1919K4189J6841J0567M960j071q291j6615k5356l3600m0446
$$ 4917133 4956129 4988048 5012237 5029078 5039645 5044605 5043534 5035243 5018628 4993272 4959672 4919226
53289D919226m5595m9879n4532n9590o3767o6389o8666p2183p6806q0889q3094
$$ 4919226 4873631 4823752 4769220 4709630 4645863 4579474 4510808 4438625 4361819 4280930 4197836
53278D197836q3242q2008q0607q0176q0486p9929p7840p5839p5629p6413p6204
$$ 4197836 4114594 4032586 3951979 3871803 3791317 3711388 3633548 3557709 3482080 3405667 3329463
53267C329463p4959p4107p3480p1190o6853o2510n9619n7256n4112n0393m6724
$$ 3329463 3254504 3180397 3106917 3035727 2968874 2906364 2846745 2789489 2735377 2684984 2638260
53256B638260m3101l9953l8358l7864l5927l1314k6513k4741k5689k6289k4902
$$ 2638260 2595159 2555206 2516848 2478984 2443057 2411743 2385230 2360489 2334800 2308511 2283609
53245B283609k2520k0187j7546j4218j0861q201o146m278k309K14L740P920J1682
$$ 2283609 2261089 2240902 2223356 2209138 2198277 2190076 2183930 2179652 2177343 2177557 2181297 2189217 2200899
53232B200899J4315J6024J7368J8794K0678K3199K6066K8840L1481L4072L6238
$$ 2200899 2215214 2231238 2248606 2267400 2288078 2311277 2337343 2366183 2397664 2431736 2467974
53221B467974L7518L8218L9191M0840M2804M4479M5279M4581M2276L9309L7013
$$ 2467974 2505492 2543710 2582901 2623741 2666545 2711024 2756303 2800884 2843160 2882469 2919482
53210B919482L5827L5091L3923L1695K8072K3440J9019J5667J2717R059M957J560
$$ 2919482 2955309 2990400 3024323 3056018 3084090 3107530 3126549 3142216 3154933 3163992 3168949 3170509
53198C170509j257m873r364j2767j3853j4249j6482k0843k5565k9315l2132l4259
$$ 3170509 3169252 3164379 3155015 3142248 3128395 3114146 3097664 3076821 3051256 3021941 2989809 2955550
53186B955550l5600l6428l7505l9117m0813m2235m3483m4540m5054m4914m4401
$$ 2955550 2919950 2883522 2846017 2806900 2766087 2723852 2680369 2635829 2590775 2545861 2501460
53175B501460m3586m2290m0883m0393m1254m2460m2567m1271l9469l7886l6254
$$ 2501460 2457874 2415584 2374701 2334308 2293054 2250594 2208027 2166756 2127287 2089401 2053147
53164B053147l4065l1656l0010k9463k9093k7785k5749k4325k4164k4339k3628
$$ 2053147 2019082 1987426 1957416 1927953 1898860 1871075 1845326 1821001 1796837 1772498 1748870
53153A748870k2061k0590j9771j9420j9176j8564j7001j4767j3577j4847j7596
$$ 1748870 1726809 1706219 1686448 1667028 1647852 1629288 1612287 1597520 1583943 1569096 1551500
53142A551500j9463j9818k0119k1017k1173j9813j8536j8990k0327k0700k0174
$$ 1551500 1532037 1512219 1492100 1471083 1449910 1430097 1411561 1392571 1372244 1351544 1331370
53131A331370k0182k0914k1362k1373k1665k1901k0955j9142j8237j8920j9989
$$ 1331370 1311188 1290274 1268912 1247539 1225874 1203973 1183018 1163876 1145639 1126719 1106730
53120A106730k0507k0882k1286k0936j9808j9365k0409k1638k1517k0264j8843
$$ 1106730 1086223 1065341 1044055 1023119 1003311 983946 963537 941899 920382 900118 881275
53109H81275j7367j5857j5322j6417j7773j7384j5215j3092j2318j2733j3678
$$ 881275 863908 848051 832729 816312 798539 781155 765940 752848 740530 727797 714119
53098G14119j4518j4504j3371j2096j1908j2529j2507j1235r684q989r147r247
$$ 714119 699601 685097 671726 659630 647722 635193 622686 611451 601767 592778 583631 574384
53086E74384q430o668n090n151o912q560q504p352o819p171p103n897m308l217
$$ 574384 565954 559286 554196 549045 542133 533573 525069 517717 510898 503727 496624 490727 486419 483202
53072D83202k727k795l610m786n193m209k590j667j936k713k833j791l52K22k50
$$ 483202 480475 477680 474070 469284 464091 459882 457292 455625 453689 450976 448143 446352 446000 446222 445972
53057D45972o51k77J10k52p05m63l62j483k667j608J624M295M578L396K108N64
$$ 445972 445321 445044 445154 444902 444197 443734 443372 441889 439222 437614 439238 443533 448111 451507 453615 454179
53041D54179j388k391j324O29J225j07k091l520m150m236m301n069o617p900p895
$$ 454179 452791 450400 449076 449705 450930 450823 448732 445212 441062 436826 432525 427456 420839 412939 405044
53026D05044o916o072n849o003o426p140p639p252o067m833l933l216k847l475
$$ 405044 398128 392056 386207 380204 373778 366638 358999 351747 345680 340847 336914 333698 330851 327376
53012C27376n150o615o263l892j263n64k234m588n731n359m274k917j428p34j822
$$ 327376 322226 315611 309348 305456 304193 303629 301395 296807 291076 285717 281443 278526 277098 276364 274542
52997B74542l828m374k454K95J921K337K211J243q10k457j804P46K775K835J711
$$ 274542 270714 266340 263886 264181 266102 268439 270650 271893 271083 268626 266822 267568 270343 273178 274889
52982B74889O64q6q59j666k441l168l492l005k208k256l327m142l663k468j728
$$ 274889 275553 275467 274608 272942 270501 267333 263841 260836 258628 256372 253045 248903 245240 242772 241044
52967B41044j477p46Q45K460K988K090L21j340k093j817j109o22m19j82J6l99
$$ 241044 239567 238821 239666 242126 245114 247204 247525 246185 244092 242275 241166 240544 240125 239943 239959 239560
52951B39560j707l231l922l457k398j306q1J440K679K641J133p96j831j576o20
$$ 239560 237853 234622 230700 227243 224845 223539 223458 224898 227577 230218 231351 230555 228724 227148 226528
52936B26528L25J050J698K235K246J344j90j367j352k66J017J795K032K004J923
$$ 226528 226853 227903 229601 231836 234082 235426 235236 233869 232517 232251 233268 235063 237095 239099 241022
52921B41022J933K176K609K978L018K636J944J283J103J509K094K452K710L186
$$ 241022 242955 245131 247740 250718 253736 256372 258316 259599 260702 262211 264305 266757 269467 272653
52907B72653L753M015L954L862L782L552L349L613M544O059P950R452R255P085
$$ 272653 276406 280421 284375 288237 292019 295571 298920 302533 307077 313136 321086 330538 339793 346878
52893C46878M776M329N044M412K041N46J633L382L101J296N21J268J438j58k066
$$ 346878 351654 355983 361027 365439 367480 368026 369659 373041 376142 377438 377959 379227 380665 380507 378441
52878C78441k519j768j299j893l305m855n692n171l768k972l517m200l294r05
$$ 378441 375922 374154 372855 370962 367657 362802 357110 351939 348171 345199 341682 337482 334188 333283
52864C33283J005J022p2n14Q3L41q20k492k803j339K59L79o09j081l43P90J394
$$ 333283 334288 335310 335238 334724 334807 335148 334328 331836 329033 327694 327953 328332 327723 326642 326299 327089 328483
52847C28483J539J611J241k32k361l524k752j116m81j043j120L25K114K672K303
$$ 328483 330022 331633 332874 332642 330281 326757 324005 322889 322408 321365 320245 320570 322684 325356 327659
52832C27659K375K881K624J534Q87R35M41o89m61K094M655M493K373J304K108
$$ 327659 330034 332915 335539 337073 337960 338895 339336 338647 338186 340280 344935 349428 351801 353105 355213
52817C55213K741J873P09O10J043R81P11J016J623J705J221O35n1r74j581j195
$$ 355213 357954 359827 360536 361146 362189 363170 363881 364897 366520 368225 369446 370081 370030 369056 367475 366280
52801C66280k31J80j49k27N56J438J357M24k69l2Q48J825K755L658M298M385M039
$$ 366280 366049 366229 366080 365853 366409 367847 369204 369628 369359 369327 370175 372000 374755 378413 382711 387096 391135
52784C91135L640L379L256L370L846M478M915N140N372N477N052M196L554L356
$$ 391135 394775 398154 401410 404780 408626 413104 418019 423159 428531 434008 439060 443256 446810 450166
52770D50166K976J790N6j438k175k172j920k342m142o775q595q579p466o631o395
$$ 450166 453142 454932 454988 453550 451375 449203 447283 444941 440799 434024 425429 416850 409384 402753 396358
52755C96358o073n278m400m043m485n439n924m911k826j685k856n052n770m428
$$ 396358 390285 385007 380607 376564 372079 366640 360716 355805 352979 351294 348438 343386 337616 333188
52741C33188k866k653l189l046k106j550k122l256l890l682l189k907k467j094
$$ 333188 330322 327669 324480 321434 319328 317778 315656 312400 308510 304828 301639 298732 296265 295171
52727B95171J013K388J810k65k271l297l626l812l949l936l839l674l256k483
$$ 295171 296184 298572 300382 300117 297846 294549 290923 287111 283162 279226 275387 271713 268457 265974
52713B65974j646j194j213j173m45P63J204q6k460m282m751m262l174j585m34
$$ 265974 264328 263134 261921 260748 260303 261066 262270 262184 259724 255442 250691 246429 243255 241670 241236
52698B41236j094l131m108k816j133j287k691l466l748n011o832p078n264l221
$$ 241236 240142 237011 232903 230087 228954 227667 224976 221510 217762 212751 205919 198841 193577 190356
52684A90356k019o82J274K261R46j466k750k418j746j831k538k986k365o86R91
$$ 190356 188337 187655 188929 191190 192136 190670 187920 185502 183756 181925 179387 176401 174036 173350 174341
52669A74341J606J294Q00P8j278k359j607N85J829R90k84k32N77P32K59o9l77
$$ 174341 175947 177241 178041 178119 176841 174482 172875 173460 175289 176279 175995 175763 176340 177072 177331 177262 176885
52652A76885j038j390q16k03o92j564j059J136L652N219N282L464J46k643k761
$$ 176885 175847 174457 173641 173438 172746 171182 170123 171259 174911 180130 185412 188876 189022 186379 183618
52637A83618n70J430J722J059N05o1p99p33J032L679N407N518M986M953N265M793
$$ 183618 183048 184478 186200 187259 187764 187703 186904 186171 187203 190882 196289 201807 206793 211746 217011 221804
52621B21804L089J310J048K209K715Q24k800n874o980o505n442m250k989j850
$$ 221804 224893 226203 227251 229460 232175 232999 230199 224325 217345 210840 205398 201148 198159 196309
52607A96309j199j347k236l236l517l061k853l569m535m603l676k602j918j559
$$ 196309 195110 193763 191527 188291 184774 181713 178860 175291 170756 166153 162477 159875 157957 156398
52593A56398j499j713j669r19j8M8o66j244j469j923k417j853k21P31j56j478
$$ 156398 154899 153186 151517 150598 150580 150628 149962 148718 147249 145326 142909 141056 140835 141566 141410 139932
52577A39932r45J442L277K753P07n99r1J243J804J229N13M81O68J96o99q59O1
$$ 139932 138987 140429 143706 146459 147166 146567 146476 147719 149523 150752 151265 151746 152414 152610 151911 151052 151113
52560A51113R60Q47J89PK78J33n85r62m30K91K02m65m71P30K067K072P05n87o14
$$ 151113 152073 152920 153109 153116 153394 153527 152942 151980 151550 151841 152043 151578 151107 151837 153904 155976 156681 156094 155480
52541A55480L25J174J538J811K216K493K470K365K284J925J042l3n65j25R13J528
$$ 155480 155805 156979 158517 160328 162544 165037 167507 169872 172156 174081 175123 175090 174525 174400 175313 176841
52525A76841J025k2j77J170K958L840L875L902L754K392j39k186k456j372l6J140
$$ 176841 177866 177844 177667 178837 181795 185635 189510 193412 197166 199558 199419 197233 194777 193405 193369 194509
52509A94509K153K720K757K757K882K574J881K115L941N655N078K666J012J302
$$ 194509 196662 199382 202139 204896 207778 210352 212233 214348 218289 223944 229022 231688 232700 234002
52495B34002K107J945J275J098J136N12o14j237p49P38K700M199M303L346L056
$$ 234002 236109 238054 239329 240427 241563 242075 241461 240224 239475 240213 242913 247112 251415 254761 257817
52480B57817M453O254O380M582K437J092L37j97j91O28J912L126L889L812K771
$$ 257817 262270 268524 274904 279486 281923 283015 283352 283155 282964 283592 285504 288630 292519 296331 299102
52465B99102J480Q71Q18L82n29q75k18M59L01j13M2K95l14j530k134j664p71J0
$$ 299102 300582 301453 302271 302653 302124 301249 301031 301490 301791 301678 301720 302015 301701 300171 298037 296373 295602 295612
52447B95612Q20J745K341K190J428N60N4L1J27r7l50K57J750K631J507r95k889
$$ 295612 296432 298177 300518 302708 304136 304696 304750 304781 304908 304811 304461 304718 306468 309099 310606 309611 306722
52430C06722l129k307j404r59j230j998k116n91J714K732J935J108J737K985L184
$$ 306722 303593 301286 299882 298923 297693 295695 293579 292988 294702 297434 299369 300477 302214 305199 308383
52415C08383K232J304R34O50J04m90q73p22N57L017N254N437L392R44r4M08J347
$$ 308383 310615 311919 312853 313503 313607 313117 312244 311522 312079 315096 320350 325787 329179 330123 330029 330437 331784
52398C31784J727J328N52O4K63Q18J030P79O99J134J422P32n18q31N53K491L116
$$ 331784 333511 334839 335391 335455 335718 336536 337566 338345 339044 340178 341600 342332 341814 340983 341536 344027 347143
52381C47143K016O44M82J340J885J427N32R2L43R08J271J053L27l00k36L18N62
$$ 347143 349159 349803 350285 351625 353510 354937 355469 355561 355904 356812 358083 359136 359463 359163 358927 359245 359807
52364C59807J32n31r17j090j226j097l23J028K409L173K901J697K57o55q66p20
$$ 359807 359939 359408 358491 357401 356175 355078 354755 355783 358192 361365 364266 365963 366220 365565 364699 363979
52348C63979m61j27J09J19K55Q13J252Q30j5q5O11O90l71j297j076m84m87n11
$$ 363979 363518 363391 363500 363619 363874 364687 365939 366769 366754 366669 367280 367970 367599 366302 365226 364742 364255 363744
52330C63744K28R04M35k72M51K010J944l80k588k385k04J951K937K877K230J550
$$ 363744 363972 364876 365311 365039 365490 367500 369444 369064 366476 364091 363887 365838 368775 371652 373882 375432
52314C75432J459K020K533K449J970J448R19O08J108K434L601L775L243K768K591
$$ 375432 376891 378911 381444 383893 385863 387311 388230 388838 389946 392380 395981 399756 402999 405767 408358
52299D08358K601K891L392L573L224L018L634M704N506O124O939P379O411M279
$$ 408358 410959 413850 417242 420815 424039 427057 430691 435395 440901 447025 453964 461343 467754 472033
52285D72033K618K535L523M565N364N945N976N390N081N935P327P713O819O186
$$ 472033 474651 477186 480709 485274 490638 496583 502559 507949 513030 518965 526292 534005 540824 547010
52271E47010P043Q504Q747P495O199N863N923N653N606O715Q622J0034J0451J0532
$$ 547010 554053 562557 571304 578799 584998 590861 596784 602437 608043 614758 623380 633414 643865 654397
52257F54397J0677J0390R469Q880R606J1153J2007J1573J0857J1167J2629J4348
$$ 654397 665074 675464 684933 693813 703419 714572 726579 738152 749009 760176 772805 787153
52245G87153J5596J6492J7510J8809K0088K0986K1415K1653K2269K3778K5986
$$ 787153 802749 819241 836751 855560 875648 896634 918049 939702 961971 985749 1011735
52234A011735K7766K7936K6591K5086K4561K4834K5068K4985K4924K5010K4989
$$ 1011735 1039501 1067437 1094028 1119114 1143675 1168509 1193577 1218562 1243486 1268496 1293485
52223A293485K4710K4186K3272K1889K0615K0289K0904K1346K0625J8910J7193
$$ 1293485 1318195 1342381 1365653 1387542 1408157 1428446 1449350 1470696 1491321 1510231 1527424
52212A527424J6224J5874J5339J3878J1583R328P706O330M738L514L588M534M824
$$ 1527424 1543648 1559522 1574861 1588739 1600322 1609650 1617356 1623686 1628424 1631938 1635526 1640060 1644884
52199A644884M058L622M494N606N416M218L511L654L685L290L514N037O988Q070
$$ 1644884 1648942 1652564 1657058 1662664 1668080 1672298 1675809 1679463 1683148 1686438 1689952 1694989 1701977 1710047
52185A710047Q209Q364R283J0994J3204J5524J7517J8974K0140K1290K2106K1816
$$ 1710047 1718256 1726620 1735903 1746897 1760101 1775625 1793142 1812116 1832256 1853546 1875652 1897468
52173A897468K0143J7940J6741J7452J9378K0614J9643J6626J3075J0395Q956
$$ 1897468 1917611 1935551 1952292 1969744 1989122 2009736 2029379 2046005 2059080 2069475 2078431
52162B078431Q322P748O474M169J567M2k0M1j287l609n017m578l528l670n329
$$ 2078431 2086753 2094501 2100975 2105144 2106711 2106753 2106733 2106774 2105487 2101878 2096861 2092283 2088755 2085085 2079756
52147B079756p469r222j0563j1728j2683j3196j2970j1764r875q261p659p550
$$ 2079756 2072287 2063065 2052502 2040774 2028091 2014895 2001925 1990161 1980286 1972025 1964366 1956816
52135A956816o767n088l520k822k570k133j741j837j975j356k04M10J61p5M19
$$ 1956816 1950049 1944961 1941441 1938619 1936049 1933916 1932175 1930338 1928363 1927007 1926803 1927213 1927374 1927299 1927718
52120A927718J124J054K9j315k438l273l950m624n399o052n961m916l924m482
$$ 1927718 1928842 1929896 1929925 1928610 1926172 1922899 1918949 1914325 1908926 1902874 1896913 1891997 1888073 1883591
52106A883591o799r286j0290r804q959q199p013n443m717n661p229p657o784o159
$$ 1883591 1876792 1867506 1857216 1847412 1838453 1830254 1823241 1817798 1813081 1807420 1800191 1792534 1785750 1779591
52092A779591o685p276o516m935m555o216q273q455o537m522m254n512o750p076
$$ 1779591 1772906 1765630 1759114 1754179 1749624 1743408 1735135 1726680 1720143 1715621 1711367 1705855 1699105 1692029
52078A692029o740n965m614l290l566n929q300q054n336k938k723l591l555k527
$$ 1692029 1685289 1679324 1674710 1671420 1667854 1661925 1653625 1645571 1640235 1637297 1634574 1630983 1627428 1624901
52064A624901j967k757m576o753q547q887p215m627l074l063l071j646P42K628
$$ 1624901 1622934 1620177 1615601 1608848 1600301 1591414 1584199 1579572 1576498 1573435 1570364 1568718 1569460 1572088
52050A572088L673M865O713Q329Q871R153J0769J3774J6375J7386J7858J9361
$$ 1572088 1575761 1580626 1587339 1595668 1604539 1613692 1624461 1638235 1654610 1671996 1689854 1709215
52038A709215K1531K2840K3255K4400K6797K8878K9518K9920L1681L4184L5414
$$ 1709215 1730746 1753586 1776841 1801241 1828038 1856916 1886434 1916354 1948035 1982219 2017633
52027B017633L4695L3159L1869L0883K9992K9077K7609K4980K1612J8844J7355
$$ 2017633 2052328 2085487 2117356 2148239 2178231 2207308 2234917 2259897 2281509 2300353 2317708
52016B317708J6345J4587J1830Q916O783N506M278K511O69n45j750m366q127j0522
$$ 2317708 2334053 2348640 2360470 2369386 2376169 2381675 2385953 2388464 2389133 2388588 2386838 2382472 2374345 2363823
52002B363823r829p591o644p584q743q883q047o232l414r42p84k831m686m726
$$ 2363823 2353994 2346403 2339759 2332175 2323432 2314549 2306502 2300270 2296856 2295914 2295130 2292299 2287613 2282887
51988B282887l811l283k862j566M73K275L286L521L004J845M67o43j041k69J566
$$ 2282887 2279076 2275793 2272931 2271365 2271838 2274113 2277399 2280920 2283924 2285769 2286236 2285593 2284552 2284283 2285849
51973B285849L229L449K580J964J700O32j348k901l711n203p865r859r936r809
$$ 2285849 2289078 2292527 2295107 2297071 2298771 2299403 2298055 2295154 2291443 2286240 2278375 2268516 2258580 2248771
51959B248771j1570j4253j5343j4833j5115j7085j8853j8845j8130j8686k0741
$$ 2248771 2237201 2222948 2207605 2192772 2177657 2160572 2141719 2122874 2104744 2086058 2065317
51948B065317k2866k4037k4612k5588k7309k9065k9998l0370l1293l3022l4366
$$ 2065317 2042451 2018414 1993802 1968214 1940905 1911840 1881842 1851472 1820179 1787157 1752791
51937A752791l4412l3965l4213l4800l4505l3423l2968l3915l5712l7771l9979
$$ 1752791 1718379 1684414 1650201 1615401 1580896 1547473 1514505 1480590 1444878 1407107 1367128
51926A367128m1718m1749l9608l6368l3605l2215l2355l3498l4401l3893l2026
$$ 1367128 1325410 1283661 1244053 1207685 1174080 1141865 1109510 1076012 1041611 1007718 975692
51915I75692k9844k7900k5929k3989k2772k2347k1700k0129j8230j6874j6069
$$ 975692 945848 917948 892019 868030 845258 822911 801211 781082 762852 745978 729909
51904G29909j5454j5058j4762j3842j2069j0684j1062j2643j3356j2108r878q255
$$ 729909 714455 699397 684635 670793 658724 648040 636978 624335 610979 598871 588993 580738
51892E80738p831q337r325j0129r802q014n745m405m356m906n619o742q153q820
$$ 580738 572907 564570 555245 545116 535314 527300 521555 517150 512794 507888 502269 495527 487374 478554
51878D78554q079o788o288o455n854l905j912j354k058k630k234j164j03N07N43
$$ 478554 470475 463687 457399 450944 445090 441185 439273 437919 435861 433231 430997 429833 429730 430237 430780
51863D30780L18M27R61J044j22j905k765k236j570k070l344l889l094k019k060
$$ 430780 431098 431525 432486 433530 433408 431503 428738 426502 424932 422862 419518 415629 412535 410516 408456
51848D08456l335m737n442n771o260o416n241l012j578k263m057m742l524j749
$$ 408456 405121 400384 394942 389171 382911 376495 371254 368242 366664 364401 360344 355602 352078 350329
51834C50329j129j946l084l258k088m29K47p62k489l230k490j436j250j606j373
$$ 350329 349200 347254 344170 340912 338824 338395 338642 337880 335391 332161 329671 328235 326985 325379 324006
51819C24006m13J24n89j809k113j230k70j15k92L2O11N79J2j20K80J9j384k356
$$ 324006 323593 323717 323128 321319 319206 317976 317706 317591 317299 317331 317942 318521 318533 318413 318693 318712 317328 314972
51801C14972j088J823L775L168J032m68l86N08R90Q06Q55K051L952N006M343K887
$$ 314972 313884 315707 319482 322650 323682 323214 322828 323336 324326 325132 325987 328038 331990 336996 341339 344226
51785C44226K128K239K293J990K036K815L719M148M243M123L286J506k40p31k05
$$ 344226 346354 348593 350886 352876 354912 357727 361446 365594 369837 373960 377246 378752 378512 377781 377576
51770C77576j61j338k625k494j094k51j285l318m120k566J31J781J468K24m11
$$ 377576 377415 376077 373452 370958 369864 369613 368328 365010 360890 358324 358455 360236 361704 361928 361517
51755C61517p7L25Lp07q39l3J111J908K218K126J586Q91Q71J740K194P33k094
$$ 361517 361440 361765 361768 361061 360222 360189 361300 363208 365426 367552 369138 370029 370900 372640 374834 375567 373473
51738C73473l971l514j722k88M55J234K390L489L873K970P31j708k610j623m12
$$ 373473 369502 365988 364266 363978 364433 365667 368057 371546 375419 378389 379120 377412 374802 373179 372767
51723C72767m48j011n06J032K155K345K476K964K923J636k33j407j254M7J925
$$ 372767 372319 371308 370802 371834 373989 376334 378810 381774 384697 386333 386100 384693 383439 383486 385411
51708C85411L594M404M328L837L310K929K979L524L901L301J878O56L30R35K590
$$ 385411 389005 393409 397737 401574 404884 407813 410792 414316 418217 421518 423396 424052 424382 425317 427907
51693D27907N458Q594R966Q486N604M063N167P730R618R934R525R607J0309J0804
$$ 427907 433365 441959 451925 460411 466015 470078 475245 482975 492593 502527 512052 521659 531968 542772
51679E42772J0667J0533J1205J2674J4420J6232J8282K0546K2695K4326K5130
$$ 542772 553439 563972 575177 587851 602271 618503 636785 657331 680026 704352 729482
51668G29482K5120K4796K4676K4424K3078K0288J6435J1423M652l189r849j4074
$$ 729482 754602 779398 804074 828498 851576 871864 888299 899722 904374 901185 891336 877262
51656H77262j7039j9863k1227j9428j5689j3079j2655j2866j2398j1361r874p952
$$ 877262 860223 840360 819133 799705 784016 770937 758282 745416 733018 721657 711783 703831
51644G03831o791p751r617r426o616l984l689m716n370n785o393o235m771l543
$$ 703831 697040 689289 679672 670246 663630 659646 655957 651241 645871 640086 633693 627458 622687 619144
51630F19144l848m196k404R01L059K950J700L40j017j816j072Q58K104J433m52
$$ 619144 615296 611100 608696 609597 612656 615606 617306 617646 616629 614813 613741 614599 616703 618136 617684
51615F17684k145l146l957n087o168n916l375M30K827K284K38o29O44K847M345
$$ 617684 615539 612393 608436 603349 597181 591265 587890 588320 591147 593431 593669 593040 593684 596531 600876
51600F00876M193K241m71j875o75K029L993M368L938L313K294Q93l77j455k887
$$ 600876 605069 607310 606839 604964 604289 606318 610311 614679 618617 621930 624224 625117 624740 623285 620398
51585F20398m901p118r087j0356j0336r147q187q637r693r677q547p743p612p003
$$ 620398 615497 608379 599292 588936 578600 569453 561266 552629 542936 533259 524712 516969 509357 502354
51571E02354n696n238o435p750p406n868m876n029n520n616n198m263k993k088
$$ 502354 496658 491420 484985 477235 469829 463961 459085 454056 448536 442920 437722 433459 430466 428378
51557D28378k041k340k141j508j211j523j973k178k242k323k435k602k659k112
$$ 428378 426337 423997 421856 420348 419137 417614 415641 413463 411221 408898 406463 403861 401202 399090
51543C99090p85N01O89o3n00N0Q60R86M99N6j50l26l90j26K07J84J09P08J889
$$ 399090 398305 398806 399495 399432 398932 398982 399842 400828 401327 401383 401233 400907 400517 400391 400598 400782 400891 401599 403488
51524D03488K622K492K521L750N642O811O919O900P398Q078Q551Q956R211Q687
$$ 403488 406110 408602 411123 414873 420515 427326 434245 441145 448543 456621 465172 474128 483339 492026
51510D92026P245N980O140P574Q840Q649O821M058J197j358l645n514o198n212
$$ 492026 499271 505251 511391 518965 527805 536454 543275 547333 548530 547172 543527 538013 531815 526603
51496E26603l533k953l879m861m789m443m903n465m512j886J002L052M117M068
$$ 526603 523070 520117 516238 511377 506588 502145 497242 491777 487265 485379 486381 489433 493550 497618
51482D97618K804J365J479L504N863O965O757O090N651N996P412R069R272P437
$$ 497618 500422 501787 503266 506770 512633 519598 526355 532445 538096 544092 551504 560573 569845 577282
51468E77282N083M054M407M835M340K654j82l438n391m856k888j733k004k164
$$ 577282 582365 586419 590826 595661 600001 602655 602473 599035 593644 588788 585900 584167 582163 579999
51454E79999j051L72M65q21j956j670j7K087L734M521M629M491M207L354J568
$$ 579999 578948 579320 579785 578964 577008 575338 575321 577408 581142 585663 590292 594783 598990 602344 603912
51439F03912r59l598n611o363n776m797m775n863o654n937m372l544l831m160
$$ 603912 602953 599355 593744 587381 581605 576808 572033 566170 559516 553579 549207 545663 541832 537672
51425E37672l701k757j894j171n42k29l21n76q23r95p41K36J357J736J690K480
$$ 537672 533971 531214 529320 528149 527607 527378 527057 526481 525658 524663 523922 524158 525515 527251 528941 531421
51409E31421M145N050M339L526M397O493Q072Q651R033R444R312Q625P984P556
$$ 531421 535566 540616 544955 548481 552878 559371 567443 576094 585127 594571 603883 612508 620492 628048
51395F28048P321P894R544J0839J0113Q212P675Q979R765Q307N708L750K500J376
$$ 628048 635369 643263 652807 663646 673759 681971 689646 698625 708390 716697 722405 726155 728655 730031
51381G30031Q39J516K623K782J764L71p60j397j480j396j662j795n91J738L146
$$ 730031 730870 732386 735009 737791 739555 739926 739166 737769 736289 734893 733231 731436 730845 732583 735729
51366G35729K494J229J028J224L71r05r05m7o28l282n835o263n165m582n475p146
$$ 735729 738223 739452 740480 741704 742075 741170 740265 740218 739590 736308 730473 724210 719045 714463 708988 701842
51350G01842q408q814q963r702j0818j0994r619p966p560q017p792o674n973o189
$$ 701842 693434 684620 675657 665955 655137 644143 634524 626558 618998 610981 603189 596515 590542 584353
51336E84353o050m450k164r20j379k582l035k164q44l68n97J81K805N474N738
$$ 584353 578303 573853 571689 570769 569390 566808 563773 561609 560765 560397 559800 559981 562786 568260 573998
51321E73998L821K206K043J817J64j818k307j621j755l595n931p342p969q959
$$ 573998 577819 580025 582068 583885 584049 582231 579924 578303 576548 572953 567022 559680 551711 542752
51307E42752j0810j2828j4085j4361j3984j3118j1803j0458r729r623r392q529
$$ 542752 531942 519114 505029 490668 476684 463566 451763 441305 431576 421953 412561 404032
51295D04032p316o189n230m634m857n756o299n822m891m260l821l414l654m801
$$ 404032 396716 390527 385297 380663 375806 370050 363751 357929 353038 348778 344957 341543 337889 333088
51281C33088n570m556k400j060j204j723j768j682j822j810j467j311j645j946
$$ 333088 327518 322962 320562 319502 318298 316575 314807 313125 311303 309493 308026 306715 305070 303124
51267C03124j650r66n37o05o68J13J911L546L556K240J586K585L833L796L134
$$ 303124 301474 300508 299971 299366 298698 298811 300722 304268 307824 310064 311650 314235 318068 321864 324998
51252C24998L257L815L564K704K255J985J324J611M426P991Q490N581L434N046
$$ 324998 328255 332070 335634 338338 340593 342578 343902 345513 349939 357930 366420 372001 375435 380481
51238C80481Q281R300P526N137L397J814m0j820l098l492k747j673k068m545p325
$$ 380481 388762 398062 405588 410725 414122 415936 415896 414076 410978 407486 404739 403066 400998 396453 389128
51223C89128q395p981p687p992q116p787p550p393o501m725l361l871o064p956
$$ 389128 380733 372752 365065 357073 348957 341170 333620 326227 319726 315001 311640 307769 301705 293749
51209B93749p611n205k900k248k415j726l40J50n42r01k13K73n75k078l089l507
$$ 293749 286138 280933 278033 275785 273370 271644 271304 271454 270912 270011 269798 270071 269496 267418 264329 260822
51193B60822l480k530o43Q09O38m96j060n74L85J301J840J577N42l97l91N95K099
$$ 260822 257342 254812 254169 254978 255616 255120 254060 253486 253871 255172 257012 258589 259131 258734 258343 258938 261037
51176B61037L522M010L051J518Q19P72m8j528j708r0J000j90k128k519j658j218
$$ 261037 264559 268569 271620 273138 273957 274729 274681 273153 271445 271355 272355 272165 270037 267518 265860 264642
51160B64642j286r48n68r78j462r18l29j402l321l443j166J306K225K152K276
$$ 264642 263356 262408 261840 260862 259400 258482 258153 256751 253430 249987 248821 250127 252352 254504 256780
51145B56780K852L701M503M293K344j86j125j17R13M46j027k290k744k118m58
$$ 256780 259632 263333 267836 272129 274473 274287 273162 273045 273958 274404 273377 271087 268343 266225 265767
51130B65767J136J241J63k58N78R29o64l015l711k106J23R63r6j891k756k020
$$ 265767 266903 268144 268307 268049 268627 269556 268892 265877 262166 260060 260183 261146 261050 259159 256403 254383
51114B54383n84K29Q0m62r76j305j120m37k62j398k787k466l29J581J816J122
$$ 254383 253799 254028 254108 253646 252670 251365 250245 249808 249546 248148 245361 242895 242566 244147 245963 247085
51098B47085Q32J055J202J160J096R18O64P14J012P71m43j906k544k068r64J21
$$ 247085 247917 248972 250174 251334 252430 253348 254012 254726 255738 256509 256066 254160 251616 249548 248584 248705
51082B48705O23K16r03k217l450m459m753l882k331j147o44k23M29R05R39P36
$$ 248705 249328 249544 248641 246424 242974 238515 233762 229880 227549 226402 225758 225535 225964 226869 227808 228544
51066B28544L58k61o05P2J469K534L128M077N193N052L424K242K822L598K396
$$ 228544 228902 228641 228036 228108 229577 232111 235239 239316 244509 249561 252985 255227 258049 261647 264043
51051B64043p4r86P50L251M424M220L645K993J937N68o25j420j821j598n97N52
$$ 264043 263969 262983 263733 266984 271408 275628 279273 282266 284203 284771 284146 282726 280905 279307 278710 279262
51035B79262O84n55k011k077l94J811L087L083K486J974J549Q00l65j273j037
$$ 279262 279946 279391 277380 275303 274909 276720 279807 282890 285376 287350 288899 289699 289334 288061 287024
51020B87024K22J058L14j209j598m30O91N94K05R05K366L308L402L174K627J565
$$ 287024 287246 288304 288618 287409 285811 285381 286072 286666 286871 287776 290142 293450 296852 300026 302653 304218
$$ [...]
##END NTUPLES=NMR SPECTRUM
##END=
