
##TITLE=AC1129_Armenia-Quindio-El_5906567_m79TL81VAd
##JCAMPDX= 6.0         $$ Bruker NMR JCAMP-DX V2.0
##DATA TYPE= NMR SPECTRUM
##DATA CLASS= NTUPLES
##ORIGIN= BRUKER
##OWNER= Administrator
$$ 1.72 TOPSPIN		Version 2.1
$$ 2012-04-10 10:14:35.531 -0500  Administrator@TOPSPIN
$$ Compression mode = diff/dup
##.OBSERVE FREQUENCY= 400.13188235
##.OBSERVE NUCLEUS= ^1H
##.ACQUISITION MODE= SIMULTANEOUS (DQD)
##.ACQUISITION SCHEME= undefined
##.AVERAGES= 8
##.DIGITISER RES= 22
##SPECTROMETER/DATA SYSTEM= spect
##.PULSE SEQUENCE= zg30
##.SOLVENT NAME= COFFEE_meoh
##.SHIFT REFERENCE= INTERNAL, COFFEE_meoh, 1, 14.98061
##AUDIT TRAIL= $$ (NUMBER, WHEN, WHO, WHERE, PROCESS, VERSION, WHAT)
$$ ##TITLE= Audit trail, TOPSPIN		Version 2.1
$$ ##JCAMPDX= 5.01
$$ ##ORIGIN= Bruker BioSpin GmbH
$$ ##OWNER= Administrator
$$ $$ C:\Bruker\TOPSPIN/data/COFFEE/nmr/AC1129_Armenia-Quindio-El_5906567_m79TL81VAd/20/pdata/1/auditp.txt
$$ ##AUDIT TRAIL=  $$ (NUMBER, WHEN, WHO, WHERE, PROCESS, VERSION, WHAT)
(   1,<2012-04-04 14:27:26.468 -0500>,<Administrator>,<TOPSPIN>,<go>,<TOPSPIN 2.1>,
      <created by zg
	started at 2012-04-04 14:26:19.625 -0500,
	POWCHK enabled, PULCHK disabled,
       configuration hash MD5:
       1A 1E CE 29 27 FD 77 03 67 4E F0 E3 C4 B2 CB 90
       data hash MD5: 64K
       B1 3E 55 F4 A6 D1 91 ED F1 7F E6 AC 21 10 46 9B>)
(   2,<2012-04-04 14:27:29.843 -0500>,<Administrator>,<TOPSPIN>,<proc1d>,<TOPSPIN 2.1>,
      <Start of raw data processing
       efp LB = 0 FT_mod = 6 PKNL = 1 PHC0 = 0 PHC1 = 0 SI = 32K 
       data hash MD5: 32K
       BB 57 7C F0 EA 0E 7A 4B B1 79 E6 4B C6 75 64 EA>)
(   3,<2012-04-04 14:27:30.250 -0500>,<Administrator>,<TOPSPIN>,<proc1d>,<TOPSPIN 2.1>,
      <pk PHC0 = 210.3278 PHC1 = 0 
       data hash MD5: 32K
       48 4B B6 D7 2A 53 3C 44 D6 E4 51 82 EE 34 A6 15>)
(   4,<2012-04-04 14:27:30.312 -0500>,<Administrator>,<TOPSPIN>,<proc1d>,<TOPSPIN 2.1>,
      <abs ABSG = 1 
       data hash MD5: 32K
       54 1A 1F A5 F5 51 9E CA 8A 6B ED 99 42 74 70 72>)
(   5,<2012-04-04 14:27:30.343 -0500>,<Administrator>,<TOPSPIN>,<proc1d>,<TOPSPIN 2.1>,
      <abs ABSG = 2 
       data hash MD5: 32K
       CC EA 50 6A 6F 4E 62 2E 68 4B 03 0C B6 A2 4D 19>)
(   6,<2012-04-04 14:27:30.375 -0500>,<Administrator>,<TOPSPIN>,<proc1d>,<TOPSPIN 2.1>,
      <abs ABSG = 3 
       data hash MD5: 32K
       34 80 ED 61 6A 12 DF 24 DF 40 CC 40 82 38 8E 55>)
(   7,<2012-04-04 14:27:30.390 -0500>,<Administrator>,<TOPSPIN>,<proc1d>,<TOPSPIN 2.1>,
      <abs ABSG = 4 
       data hash MD5: 32K
       2E C4 DE 19 20 EF 76 42 ED A3 47 46 0A 52 A7 70>)
(   8,<2012-04-04 14:27:30.421 -0500>,<Administrator>,<TOPSPIN>,<proc1d>,<TOPSPIN 2.1>,
      <abs ABSG = 5 
       data hash MD5: 32K
       24 BB 92 77 3A C0 10 B6 CB E3 E1 EE DE EA 2C D5>)
(   9,<2012-04-04 14:27:34.734 -0500>,<Administrator>,<TOPSPIN>,<audit>,<TOPSPIN 2.1>,
      <user comment:
       ICON-NMR User ID: COFFEE
       data hash MD5: 32K
$$ [...]
##$TP= (0..7)
150 150 150 150 150 150 150 150
##$TP07= 0
##$TPNAME0= <>
##$TPNAME1= <>
##$TPNAME2= <>
##$TPNAME3= <>
##$TPNAME4= <>
##$TPNAME5= <>
##$TPNAME6= <>
##$TPNAME7= <>
##$TPOAL= (0..7)
0.5 0.5 0.5 0.5 0.5 0.5 0.5 0.5
##$TPOFFS= (0..7)
0 0 0 0 0 0 0 0
##$TUNHIN= 0
##$TUNHOUT= 0
##$TUNXOUT= 0
##$USERA1= <user>
##$USERA2= <user>
##$USERA3= <user>
##$USERA4= <user>
##$USERA5= <user>
##$V9= 5
##$VALIST= <valist>
##$VCLIST= <CCCCCCCCCCCCCCC>
##$VD= 0
##$VDLIST= <DDDDDDDDDDDDDDD>
##$VPLIST= <PPPPPPPPPPPPPPP>
##$VTLIST= <TTTTTTTTTTTTTTT>
##$WBST= 2048
##$WBSW= 25
##$XGAIN= (0..3)
0 0 0 0
##$XL= 0
##$YL= 0
##$YMAX_a= 531562
##$YMIN_a= -661606
##$ZGOPTNS= <>
##$ZL1= 120
##$ZL2= 120
##$ZL3= 120
##$ZL4= 120
##$ABSF1= 14.98061
##$ABSF2= -5.57192
##$ABSG= 5
##$ABSL= 3
##$ALPHA= 0
##$AQORDER= 0
##$ASSFAC= 0
##$ASSFACI= 0
##$ASSFACX= 0
##$ASSWID= 0
##$AUNMP= <proc_prof1d_extract_pilot.lims>
##$AXLEFT= 0
##$AXNAME= <>
##$AXNUC= <1H>
##$AXRIGHT= 0
##$AXTYPE= 0
##$AXUNIT= <>
##$AZFE= 0.1
##$AZFW= 0.1
##$BCFW= 0
##$BC_mod= 0
##$BYTORDP= 0
##$COROFFS= 0
##$CY= 15
##$DATMOD= 1
##$DC= 0
##$DFILT= <>
##$DTYPP= 0
##$F1P= 0
##$F2P= 0
##$FCOR= 0.5
##$FTSIZE= 32768
##$FT_mod= 6
##$GAMMA= 0
##$GB= 0
##$INTBC= 1
##$INTSCL= 1
##$ISEN= 128
##$LB= 0
##$LEV0= 0
##$LPBIN= 0
##$MAXI= 10000
##$MC2= 0
##$MEAN= 0
##$ME_mod= 0
##$MI= 0
##$NCOEF= 0
##$NC_proc= -8
##$NLEV= 6
##$NOISF1= 0
##$NOISF2= 0
##$NSP= 0
##$NTH_PI= 0
##$NZP= 0
##$OFFSET= 14.98061
##$PC= 1
##$PHC0= 210.3278
##$PHC1= 0
##$PH_mod= 1
##$PKNL= yes
##$PPARMOD= 0
##$PPDIAG= 0
##$PPIPTYP= 0
##$PPMPNUM= 2147483647
##$PPRESOL= 1
##$PSCAL= 4
##$PSIGN= 0
##$PYNMP= <proc.py>
##$REVERSE= no
##$SF= 400.13
##$SI= 32768
##$SIGF1= 0
##$SIGF2= 0
##$SINO= 400
##$SIOLD= 32768
##$SPECTYP= <>
##$SREGLST= <1H.CDCl3>
##$SSB= 0
##$STSI= 32768
##$STSR= 0
##$SW_p= 8223.68421052632
##$SYMM= 0
##$S_DEV= 0
##$TDeff= 65536
##$TDoff= 0
##$TI= <>
##$TILT= no
##$TM1= 0
##$TM2= 0
##$TOPLEV= 0
##$USERP1= <user>
##$USERP2= <user>
##$USERP3= <user>
##$USERP4= <user>
##$USERP5= <user>
##$WDW= 1
##$XDIM= 32768
##$YMAX_p= 473673026
##$YMIN_p= -765431
##$CURPLOT= <Network HP LaserJet P1505>
##$CURPRIN= <$Network HP LaserJet P1505>
##$DFORMAT= <normdp>
##$LAYOUT= <+/1D_H.xwp>
##$LFORMAT= <normlp>
##$PFORMAT= <normpl>
##$SURQMSG= 1
$$ End of Bruker specific parameters
$$ ---------------------------------
##NTUPLES= NMR SPECTRUM
##VAR_NAME=  FREQUENCY,     SPECTRUM/REAL,   SPECTRUM/IMAG
##SYMBOL=    X,             R,               I
##VAR_TYPE=  INDEPENDENT,   DEPENDENT,       DEPENDENT
##VAR_FORM=  AFFN,          ASDF,            ASDF
##VAR_DIM=   32768,         32768,           32768
##UNITS=     HZ,            ARBITRARY UNITS, ARBITRARY UNITS
##FACTOR=    0.250966925370066, 1,           1
##FIRST=     8223.43324360095, -198629,      -126014
##LAST=      0,             220855,          61107
##MIN=       0,             -765431,         0
##MAX=       8223.43324360095, 473673026,    0
$$ Real data points
##PAGE= N=1
##DATA TABLE= (X++(R..R)), XYDATA
$$ [...]
23764 -73366 -20970 -76058 68582 11721 180479 -22775 299880 67469 -200218 -110324 139867
23752 194701 287645 109883 -111635 -38840 228570 -47052 -191942 310527 -64644 -88778
23742 -88778 163452 -33462 242877 9750 96144 -23210 -64007 -166218 -275178 265086 -301113
23730 -47564 -178341 -47006 -136879 121629 -137373 19828 78415 -440174 -220558 227350
23719 -152473 -161442 259572 -43697 165714 -169522 -178092 -69218 -273217 -270180 -215215 116280
23707 -363311 -150807 -187058 -3775 -289449 -142 66361 94619 -65151 -201208 -237415 -18084
23695 -115327 37016 49385 -69496 55198 -65181 313026 71820 -119574 90181 84712 -103120
23683 -71637 59245 -241334 -157333 -149290 -167900 -28677 -100771 -178822 -122080 -19268 -74122 228666
23670 21972 97736 -242902 -155729 289722 -337284 189378 -25867 -132433 226644 -122493
23659 114190 6544 66655 -309783 -88316 -147633 181395 -183899 -40885 -95343 21892 -99240
23647 23481 -241560 -81982 167132 208316 26687 -99142 -220197 -38731 -182116 115282 59695
23636 59695 51321 -291281 129512 -160927 -14788 -283033 -36905 -104335 135703 -169017 -55948
23624 25755 -278960 36283 126348 276720 -42448 278721 60041 134099 -64731 349123 110866
23612 -299658 258129 -84084 -3136 -31681 -178416 75368 117711 -116791 -36370 31863 -105036
23600 -36916 149606 84817 -21172 86945 365409 -126509 233611 -306799 98224 36545 14586
23588 78070 224838 27587 -45145 163869 349580 -68162 -80269 69965 421315 157877 131918
23577 131918 -120789 103483 97633 159288 93557 163881 147646 109528 306424 239155 -125105
23565 236675 -183830 -32217 -157599 -213003 324999 -200697 92218 -182243 2388 -138894
23554 64941 -54202 -185868 239411 32186 199222 70429 -280833 -112468 -235390 325184
23543 -20969 -130634 -36464 -36880 -53193 42905 -82043 148085 -36605 -73414 52751 -86186 -173060
23531 -173060 247076 102774 -49586 186697 254879 -259647 196288 26584 -157242 74708
23520 143360 240233 -79527 69084 27972 -29057 -92801 -140732 -88517 -255474 114938 47463
23508 -114152 -299188 45172 -96004 -188514 -59275 -22579 139482 46812 -195521 -72177 -299910
23497 -299910 35132 141101 25049 -459941 -112320 78772 84205 173241 -108206 81603 -120983
23485 -59313 120394 9396 183897 -142468 -57187 -253128 131212 -77625 -84476 126068 -134096
23473 -94415 146998 248942 102035 -206406 361045 -20066 -10538 -434749 -9605 -9685 -38638
23462 -38638 -231252 95322 286014 30329 -50997 198604 -183656 148874 -196148 117680
23451 91196 85816 223024 -60086 -144584 -183712 7081 136326 -147208 -239766 -88801 28082
23439 87115 -152167 246145 -6246 120488 -56474 -160682 -33449 135057 54210 -267139 277465
23427 -112877 87074 -20102 -141975 -169377 301604 108728 -70219 137519 6184 -275026 -51321
23415 -29428 63722 -237051 27037 -249149 -261886 -35938 42502 -78745 -66969 -115619 300754
23403 128318 -71621 8651 -151339 -41034 -117075 -285451 120387 116508 -18437 85580 117765
23392 117765 101202 -220212 -178109 116590 -314764 -266135 -84428 -95390 -227677 -328142
23382 -328142 -299 -259869 -238158 -41351 -40830 -326272 182785 144348 -45937 73305 -355957
23370 39595 171594 -122896 353202 115164 -29720 -139404 132404 11405 -175591 -35691
23359 -189419 92643 145459 -24165 -79752 338736 68022 -105072 -126792 -228395 -212236 81110
23347 65334 -12250 72189 237893 59126 193043 -234040 138003 280086 -171725 -409089
23337 -409089 68265 -172127 173482 -156219 -33540 28739 96207 -183500 256690 111579
23326 -36910 222363 -4398 316914 165995 59609 -12757 336594 -8858 -50838 10801 -190562
23314 -110190 -43350 215674 93549 -13789 -70 -7196 -129279 260743 -97505 -79738 1388 40866
23302 40866 108458 36226 -189832 -158718 -21369 50321 -320831 -56506 -61643 3686 -190444
23290 -20316 -60356 -324142 -4896 128789 320137 -153070 -89330 88635 -131475 -116476 -13602
23278 156683 -55647 -193133 153437 -157964 -111464 -49496 -111333 -14921 166877 -207112
23267 -243341 192430 -522643 -1399 -92156 79122 192299 56930 -122973 -58290 122034 -98157
23255 183011 -299786 63073 132564 61503 106248 -62596 19210 -57923 -69743 -93030 -454689
23244 -454689 -262836 -98383 -243954 -28832 1524 -103125 -240218 -137216 -25724 -131336
23234 -131336 267741 234203 -48332 -146188 -15961 -180158 95429 22527 -60141 -213643 -45905
23222 32904 280102 -71437 -287071 -152262 -10374 -141775 -136233 153731 -237365 40064 -89346
23210 180465 -132156 -204098 143144 84310 39874 25984 85094 -82320 15405 -253235 -234889
23199 -234889 -113479 -72991 50837 -139671 198909 71525 -177560 285819 -134795 -168283
23189 -168283 -283494 -234453 -244982 -52335 -29279 -163811 -4883 -275858 -118335 65244 -46406
23177 130592 -69796 -118492 50925 82323 -125755 -67678 -45130 -200959 26182 -125095 126486
23165 51110 -137464 182134 -276333 -238587 229013 -264724 211318 99939 422280 -69167
23154 -70545 -116930 300707 328360 185780 45158 -255098 -114993 19252 -104344 19549 24622
23143 24622 -15793 37601 167850 -68737 -248129 -199781 -277920 -58884 -25844 271348 205308
23132 205308 -56411 -114316 118591 372134 234816 -168111 4749 -102003 -240358 127083
23121 -247198 -311965 -101656 -63090 8389 113213 -30005 319038 9728 61955 -281841 128979
23109 44011 204 91949 -11477 -286447 -132040 140046 -65064 144315 -39243 -99108 223360
23097 -151476 102328 127131 54216 183704 -469790 -265659 -307021 35362 180401 164068
23087 164068 50575 44745 -245170 344673 122759 -144516 284833 -301463 427678 122917
23076 -169261 -59539 -99169 142101 -387787 96041 -71723 -169138 23198 305253 81152 99492
23065 99492 -140638 -229841 -247904 114690 -156321 -238409 126663 -401495 178322 -28643
23054 -304845 53717 -214698 -215042 -46530 80606 -253595 -113137 -378794 70089 -139393 58925
23042 277014 222289 73988 -92076 -100352 -46779 -121797 71087 -88847 -98993 116597 -3763 61310
23029 -71844 68493 -462527 298349 106088 183779 142837 48379 393415 198903 -1089 313431
23017 138839 76780 461050 167647 30386 -105197 -144430 -9365 47082 304245 -81625 206191
23005 -162445 -38701 124295 260113 -206611 134998 256454 -38060 325830 190642 -119608
22994 76635 -71838 -42820 7616 -199413 114274 113348 283649 42180 -90391 -285369 -311516
22983 -311516 62393 8386 -178429 -192599 -134331 -181338 2509 96788 -13112 200947 -123982
22971 -270455 -155591 -95901 134253 -262401 -169150 64103 182918 -36211 -118060 -130449 177849
22959 39781 -331843 -320819 -200587 57460 -50991 -160518 37813 -118659 -43217 -7426 74307
22947 -307566 66881 -218123 -20 9716 -250273 143618 -141481 -218785 340678 -191297 -333649
22936 -333649 -47782 436413 -49306 -203059 -87062 -6593 -20068 52085 70780 268022 303979
22925 303979 36269 -162967 -20735 -34677 -185440 -69032 -48155 22860 52031 -15558 19677
22913 -18686 -591 -18597 -213023 152745 -47442 -190233 -84466 -35012 32192 -90843 -23282
22901 90606 77773 -22745 -144779 60718 -203830 -102578 87938 -258258 52686 281731 21708
22889 -313623 -165282 79178 -82889 -21025 64181 47410 -61676 -44320 -82221 -258365 -33637
22877 -206930 -169260 -285529 43943 -40303 -48968 -37966 -32239 21277 112087 -195055 -9342 -144581
22865 -144581 141844 -133625 -192053 -171 158186 79434 -25117 97173 -320111 -166250 -245821
22854 -245821 166450 -70464 -153270 277360 56927 -182286 188343 2367 278421 259616 -274636
22842 37340 -3766 -345091 -68606 -140058 207103 136184 156071 190458 406346 138016 9921
22830 -5441 72951 106948 -24344 415564 -224066 35842 -122377 -95419 68655 -272979 12778
22818 45832 25760 91877 242479 -7053 -169455 120596 -2551 -34686 -81500 -1791 -73254 -139017
22806 -139017 -311395 -265696 -98025 -103806 -265444 -100070 336518 -256850 -436376 58680
22795 -188377 -58451 -29766 255148 192216 99208 -237779 -240733 26520 79554 -236242 -192351
22784 -192351 -304728 -274975 -341178 148908 126523 4740 -142052 -345837 -71230 157707 -191498
22772 64179 -221603 -568344 116355 31946 87810 -46519 -292768 -310159 115839 -277925
22761 3948 37232 41788 244718 -284794 -74228 274061 14379 28357 -14446 366885 178551
22749 -343013 -126804 13242 21027 104946 73237 -139136 43477 -234874 -370487 -319093 167484
22737 186884 177831 28727 170285 -133921 -163591 -8729 -256146 139906 4860 49338 93599
22726 93599 136037 -16014 -66364 -105351 49600 208624 175805 -180856 -7508 15984 -48372
22714 127039 -217812 -107602 65092 -91224 -408373 -97959 -87698 89471 -213721 -234643 -352481
22703 -352481 -48975 -91410 47041 -213429 9841 28806 -167547 -108144 70442 30930 -121879
22691 -188733 310278 -139813 -224611 104934 122023 -49103 -73038 -163031 -87173 -8366 -108247
22680 -108247 -426626 -164599 213426 135420 122346 155562 -125314 -223620 -39065 -11216 33292
22668 -507315 -117643 -122218 194468 -316445 -159870 -283470 -155109 -27574 266 -213897 -127644
22657 -127644 14667 -172363 -23755 -221266 -145028 128281 -109359 264272 -139467 -15574
22646 -243467 -74771 143141 18231 30868 214 -136622 -45568 151711 -177273 142811 -36107
22634 -245064 -166277 190968 -458881 -245900 148511 32787 -196042 167622 457668 -59784
22623 -163169 59761 53948 35675 262737 18375 -316583 -311673 109730 179550 -127926 -208950
22612 -208950 94037 -554 -49307 -25135 -71550 186369 -91511 -311625 -32251 189459 -91428
22600 -171558 -166084 -193232 -282222 -106400 30378 287708 -82641 -236970 -101269 -188392 2157
22588 30729 167634 -242148 -135892 187951 321130 -114906 -187384 193925 -213603 -119648
22578 -119648 -258187 -256171 -140374 80589 18933 112228 -46598 -248432 379120 128259 12791
22566 112943 40068 27279 22997 -151588 114807 90878 -129346 56968 -161499 -144914 -295522
22555 -295522 256073 -31195 4321 -117726 -441949 -336771 15790 -158667 -358872 -223354
22545 -223354 -364755 -28138 -273577 -16153 34064 -118218 -185500 -70169 -145992 -27450 -328933
22534 -328933 -162222 -11801 -80060 -266341 -152144 21808 208306 -444536 140973 -133526
22523 -360343 153513 -139444 -209187 -256556 20923 140278 47185 147657 -240477 90600
22512 -48443 -2514 -171207 117123 63273 -353847 -243773 -132306 -158071 184511 -409737
22501 -45252 -60913 -10146 -185945 146757 -173196 345059 -77728 -338616 167 27431 35826
22490 35826 -223627 -177053 -253008 -64401 51659 118981 90350 36216 75478 -113830 -44983
22478 -49019 148035 -60866 -449987 106542 -6389 -205250 56092 -272342 187994 -119447
22467 197783 -34583 -12172 -106068 129220 -9720 426307 49419 -319511 -133510 -210628 -182102
22456 -182102 -221301 139090 112606 253492 -157194 -70174 -371602 -303934 168176 -57859
22445 -29043 -79429 -155463 117549 -44720 -118540 167267 -125875 -171082 -310685 195666 180524
22434 180524 52049 78968 115209 -339526 -380034 -120602 -134528 -85320 -81667 -3310 -132346
22423 -132346 30400 65967 -56041 -394041 -197723 -148721 329522 40818 -113484 -255403
22413 -255403 -127419 -122739 -12852 151095 -20109 -68068 -16057 -198746 -206449 -6597 -193276
22402 -193276 253057 -92561 45728 10890 -27446 -125881 -197046 -109373 156617 -260868 -40063
22390 80588 44949 -167090 -33591 1751 -445975 28218 134736 155632 287475 83611 137159
22379 137159 -230537 46278 -138128 239358 -16955 28260 166339 -260627 29175 -138863
22368 -74959 -179467 -33213 -189284 95167 -288335 -111623 -17148 -136214 137290 -177513
22357 -51732 -148867 12115 -72239 -44077 41228 -177012 107771 -49011 129458 -225475 -185523
22346 -185523 190778 227227 -35120 83149 -148008 -25142 -259122 -35563 -283174 79412 5928
22334 -20898 76906 -85162 -148217 463634 -7732 -126042 -345019 -94150 -197832 -214237 -393602
22323 -393602 -25076 -374402 18034 -145643 242039 -39185 302083 -79096 -328524 -377791
22313 -377791 -234932 130489 200497 89227 -5337 160803 8065 -81079 129264 242599 -88635
22301 -24510 192264 -89852 -203951 -228419 12481 107916 -203332 -404464 175994 -389435
22290 62280 101602 114041 -81243 12531 -80593 -138964 -165658 82177 -66317 -131925 129438
22278 -35369 47907 -170460 -85428 -97965 -399223 -123233 7566 -136425 -329797 -129342 -20028
22266 290359 -7018 -222499 -5034 -369094 40548 -333679 24216 -69988 17211 7144 -222154
22254 -538693 38160 -91694 -164725 -377086 18151 155475 -262947 -93636 106959 59029 259588
22243 259588 88067 202583 -198563 3687 -159185 -217259 1649 -42234 -12919 356104 110474
22231 -130929 44654 -232096 137060 -68014 -170108 -4274 -221389 -87404 -143842 367 -65729
22219 97139 -203798 -99855 -308926 -242444 76553 61509 -76776 -52295 -61535 10547 -223396
22207 -18070 371322 142067 1525 -3976 -236916 -323597 231630 -226735 -11678 -6812 12088
22195 -1644 -98670 -32774 -71673 -88757 -19039 -44448 -143217 57007 -53711 -142245 -139934 2231
22182 -317650 -120565 -19368 152368 -263531 366268 172657 -379237 -50683 7193 102211
22172 102211 -219298 110449 -174203 -108398 371592 34471 -64822 -219977 -238875 -198512
22162 -198512 -143397 172210 -372273 -31679 83374 12077 -173750 204689 -71727 182509
22151 -9091 282743 -288135 -41167 -316259 -121778 402929 -35160 -48193 -203330 -279868 -121784
22139 42540 -401706 16730 170284 -183721 -253371 92764 16685 63852 13909 -151622 -135003
22128 -135003 -212746 -153733 -147486 -17765 97938 69656 35623 12299 306636 -217861 185347
22116 262602 -256913 24171 -113074 168239 -54260 -168935 32650 -270999 -213797 44730
22105 11983 254722 -262935 -321757 99723 35464 154398 -109964 -15587 -179315 -29917 -227268
22094 -227268 -157486 -136961 2597 -121011 170223 -212307 -21009 39511 -199977 -14786 -221342
22083 -221342 152551 198630 -147600 -52942 8383 -419933 -355352 -4595 -206992 9382 -93351
22071 24017 141482 -164629 236464 -279208 76411 -240972 307702 -267533 219464 193616
22061 193616 -249644 -12592 -219595 231687 -250621 135642 -159125 123693 481713 -97765
22050 -230066 -303746 -209845 -44043 -419294 -207867 -22111 -250300 193557 -213378 37966
22039 128368 -162886 -208327 -143332 227514 -74666 -433617 -92565 -25512 -153768 160982
22028 -127668 -242507 -280944 -111043 -101239 -210069 -231310 -170285 -224786 140184 131068 176499
22017 176499 60971 256866 -240509 -253072 -450762 257444 60671 -236495 -43465 -46156 60845
22005 -131691 -73080 173877 -85673 -26386 -74646 -173957 52128 -15786 28106 -247883 -185629
21994 -185629 114939 -213502 -124077 223015 -9908 -279319 -123630 94685 -259086 -158181
21984 -158181 -250642 30113 218893 13177 -218461 -126946 30795 -328985 26015 43793 -207778
21972 -78178 -136821 28924 -361932 -67930 -2836 344633 -237810 -294310 -42376 -317656 -255704
21961 -255704 21310 -17120 289804 112582 -78830 -198950 -219101 -151941 -99896 -123535 58082
21949 9345 -19994 177472 -81316 -33778 288117 -91617 -170465 -215552 -114854 -59535 -1460
21937 -365319 24994 184780 47267 69683 -161724 -263478 -8393 57599 76723 9424 202039
21926 202039 49685 -159179 -233802 -370815 -166088 -335620 187618 -246823 -143369 -140076
21916 -140076 102252 181746 -74801 -170286 192881 177702 -56830 -287961 183208 -99640 -47295
21904 -61891 187585 -125345 -110635 78547 -117033 71170 156959 -40168 -69797 -12525 58320
21892 -171188 26908 -150995 -106426 3621 -20939 118122 -119312 -146055 -105612 -189783 50435
21880 102294 243358 -16988 43271 -194055 -394673 -72639 -38100 -130582 -369557 -52772 -168920
21869 -168920 -272858 167050 122068 32663 -246421 -16833 243426 25763 -164161 -113513
21859 -113513 134821 -20407 13837 24255 -19532 42437 351074 64517 -141460 -42466 -124827
21848 -124827 -12597 237047 211694 -51270 -301960 -209535 -121893 -24945 -209453 -69834 98806
21836 -135727 -231086 36195 -227602 64722 279451 -207750 -509046 -188354 -84021 -133098
21826 -133098 76429 -171392 292380 -107739 -348633 14049 -14381 61922 144647 -37389 6306
21814 9133 127402 -27009 -48932 -215548 -41386 -8015 -114746 218696 147349 -15246 3856
21802 7535 172311 -48662 -437689 -155894 159983 53831 -288450 -328079 -20834 74515 52800
21791 52800 -155784 -266085 20856 66399 -163291 -122361 402334 -191803 -84282 -11837 -137915
21780 -137915 -229061 -367452 -124165 -86300 200553 16814 83206 -130077 -208265 2389 162038
21769 162038 -236781 -38960 360937 -196716 -267219 47550 3706 114907 -263772 94347 117762
21758 117762 -246562 -89924 -218670 -58800 -107499 -21860 138577 80269 61426 -375303 57791
21746 142394 98815 168892 175283 -29457 -93303 119558 -189021 -172179 -80182 123590 143152
21735 143152 -29626 148522 46090 -399346 111218 -414909 -99031 -56733 237555 -78468
21724 -176750 -91513 -302369 299963 -38007 -99449 290005 -84295 -30879 -299310 -77390 -84976
21713 -84976 48543 129202 53857 136925 -200808 -305814 -34457 151811 199485 173909 -135027
21701 -27656 26165 -54460 28004 -184857 -100766 -186182 141565 -190750 -133140 53539 -12768
21689 12336 -134120 -77422 336817 -5281 -186628 -151507 -50943 -232011 -67993 -159453 258602
21677 -112557 -88130 -33713 -87364 39462 169411 -84470 23778 16228 -211420 330474 82448
21665 181030 -16448 -16955 399573 78514 18436 -98682 239573 -18100 -167270 -37284 -19428
21654 -19428 -113939 71877 -308783 -56253 -299276 -140190 -9635 28379 12737 -169857 13184
21642 235715 -332687 -295959 161480 -7268 -142057 -32191 -2953 73951 -252854 -5762 62842
21630 418292 131537 -167528 466990 -484177 189148 -42054 -46537 219685 -313381 -479818
21620 -479818 -146408 -320445 -226609 98563 -32112 -17604 -298184 -87574 -80170 -210882 -121547
21609 -121547 -6804 4381 -65994 -237188 -177496 16572 -164323 3157 -184214 -254385 -387607
21598 -387607 59930 192117 -75775 90829 -10716 -165906 3624 -382400 -75591 85710 -1892
21586 -89556 64051 -210306 120783 -133448 -63776 85756 -97240 -308968 59223 307469 -403494
21574 -23002 -164394 -6219 -449307 -97303 -9994 268364 -251645 168450 84155 157432 134818
21563 134818 132175 -354630 -156376 -272098 16858 121719 -157485 -534149 -211460 -181520
21553 -181520 -144844 114278 -280545 -378116 -112460 66785 -303087 -10465 132645 -22414
21542 27443 -319230 106812 -236566 176442 -145231 61556 -149921 -444289 -678762 -235663
21531 -134698 24439 231834 -199773 -29392 199012 -114438 -329112 -314443 -89442 149433
21520 -259514 12260 -475642 16171 -9448 237159 -218132 -109332 55039 -204667 5771 -89537
21508 19465 -362292 135844 -167649 -282338 -275279 80923 34368 121313 -40982 -113265 2922
21496 -171271 -26680 -39232 -50989 4317 -96178 52010 117988 -206889 2776 -67931 -167514 -140862
21484 -140862 -205053 -253338 32699 35692 -71762 -7315 134233 -146437 56899 -330460 94238
21472 99320 -135326 -145159 -320578 214263 59282 6107 -9231 -228378 -425959 -65857 165046
21460 24040 41968 -56046 24927 -5422 173198 41479 -30769 37690 -214570 244082 216140
21449 216140 -114026 -149439 8760 -146925 -55390 82728 -191341 -63649 -111957 -31878 -224752
21438 -224752 -162237 56984 -285110 230637 95402 12267 -183607 45426 325478 -184397
21427 33658 -82314 320319 209498 195850 411995 297692 242274 435841 450840 -228894
21416 143040 266353 278277 -100045 -30891 105530 -110334 137103 37635 215422 246713
21406 246713 -134504 7572 -140373 21627 -137360 -114149 -18809 108017 -43236 -173227 -117718
21395 -117718 127024 81163 123778 197150 -50959 168402 -119273 -105687 -176558 234916 -132705
21383 -141150 -6440 154494 -177386 -22793 -191491 158042 -94436 -115247 -200413 -131547 -49729
21371 -355401 -17865 -195976 55035 -191037 -52670 -332953 88244 19762 162547 28279 -193897
21359 50134 -260712 -78478 64936 -243332 -139674 196888 -160456 166990 166187 -252869 -319410
21348 -319410 314044 -47380 -26314 115816 -209244 -244927 -112194 81242 219163 -94591
21337 -276347 39717 -430210 180254 26068 -173152 214709 -209443 -75084 -214605 377629
21326 -147359 -104549 87189 -8876 30240 11764 23687 -14443 -240357 27157 -237316 95608
21314 -179011 -87457 -69680 -43037 20070 -44867 -44045 53882 -521355 458630 -79170 321089
21302 -231747 -140740 -32775 47820 -320467 -281491 29593 -93827 -304850 45278 161173 169796
21291 169796 326846 4791 -45945 286966 -216145 -134801 -199142 285253 -265906 -346074 -142265
21279 -17702 -286573 -267873 -7790 -156939 -296316 -219634 397443 -14112 -125102 169876 -125604
21267 -1772 2976 127223 69171 -43465 -121471 62199 -585623 150649 -167242 -306375 -189566
21256 -189566 -120059 84815 -81435 97480 -316554 -40458 -174451 -312056 -146481 -315314
21246 -315314 60110 -269718 99944 194624 -301585 -165483 137406 -10340 75343 20465 22448
21235 22448 60543 -118706 -65104 13188 -201326 -264927 93538 -21350 -7302 -10717 -195067
21224 -195067 -139883 -277975 201680 352385 339876 -54076 -165897 -137801 6927 -106546 57363
21212 -104302 -122886 -146775 57429 34232 178518 -240935 -152646 109692 -208413 -120754 -18589
21200 -134532 -80803 -118569 -348230 -67413 -382714 142655 85192 80756 91986 -495421 258901
21188 233065 -265912 -6625 -192611 112025 -264476 -286748 213338 151212 -113042 -168936
21178 -168936 -140222 -155755 -382794 -110573 92427 -119914 -7338 -110887 -174183 -126635 -83245
21167 -83245 -53607 110135 -288476 -372706 -12908 -401875 -196921 -176546 140380 -254 -25347
21156 -25347 -155983 -158701 295219 -6279 -16234 295536 -254265 -213460 -94242 -163434 -330449
21145 -330449 -81468 -135819 210194 -351031 -385100 -5196 16473 -30176 -272277 146404 -215158
21133 5091 83931 -76547 15783 -132104 -11646 -191884 101008 -309033 15876 25460 -243387
21121 -138930 -179454 -172307 -380468 -27037 -21443 246221 -330455 94746 -2975 42784 183729
21110 183729 -107891 412015 -113626 -120712 -243777 -162675 15236 -107354 23634 86629 -93559
21098 -20425 -197711 15505 -275501 -90424 -121779 -464519 296654 132024 -154603 -129211
21088 -129211 121514 277559 -349832 -41160 -72178 -47630 76829 -42524 -73760 162969 197723
21077 197723 -194692 101448 16620 -86805 40619 139816 -67496 -148027 -446493 -112782 -7210
21065 904 -99292 -190405 -113418 -243221 -259436 53549 -6386 180926 72840 291248 39118 -81759
21052 -92124 -307833 -5171 -71888 43028 -310234 -51285 78978 -268825 -156475 264268 -27934
21040 -350457 -28408 -281545 76978 -185481 -5758 -70148 204198 -110414 -220403 101977
21029 -89669 76982 -249039 32669 168589 -140472 28847 3907 -350600 76039 24258 117626
21018 117626 -338531 72044 232207 -6725 188363 -265827 -282484 -59735 11513 106904 -33879
21006 -157694 76627 -310076 200051 -56435 -54251 -290793 -296962 -236774 260515 140783 160355
20995 160355 82008 220656 504953 414914 296879 532978 -18670 1877 -184463 -188688 139232
20983 127044 112672 -76099 -15516 -46126 -185545 43200 -110886 -313886 -8860 98897 -375624
20971 -265612 -85366 88714 -118686 235203 -61033 107625 194473 337234 59492 82340 -267900
20959 128445 -321402 147192 -7419 -408864 17965 17102 42687 170073 71584 -120410 -40572
20947 191314 -117710 190032 -18720 -49846 120205 42425 23949 -504820 -541332 -2397 63460
20935 -22087 202453 104580 202787 -93776 -169426 271728 232763 165604 182880 497835 266413
20924 266413 223636 62037 77321 -8555 5206 157412 21814 -94372 -42265 186471 -84095
20912 149312 210756 -43318 -36484 -94631 95066 -149347 -57524 -81811 44072 -232404 -105593
20900 8161 -6439 136406 -293323 -206982 -393707 233813 -196333 207182 117915 -200964 2341
20888 192541 67530 -184002 85673 -288142 157140 -405455 -163039 191273 50374 -208357
20877 121476 69858 127655 -144572 -116842 63988 -160295 -228344 69632 100725 -128836 -114797
20866 -114797 -293098 82213 -275924 -9076 -69064 -86764 -66173 -20368 67307 -313654 -157193
20855 -157193 -325556 -212767 -364961 116423 -47786 93390 255173 -166583 -309341 60386
20844 -221050 -33960 -364704 -77023 38489 143535 -76644 -243821 -62632 136540 -255811
20833 -263298 -100875 -288483 -153160 -7018 93737 -189794 -100869 -435018 -451717 -115099
20822 -210323 3618 -428445 65675 -29137 -457 -482716 32 83119 63409 74325 127610 129041
20810 129041 96988 -494814 -72908 48536 74089 -63322 -152845 245084 -128138 -155229 -133895
20799 -133895 -159469 -112057 -173134 -15711 58950 -193568 -111234 -40535 -84866 -39505 -109071
20788 -109071 -180173 80482 -48362 -127181 87473 -91727 -140442 61557 -181736 -294551 184895
20776 -249251 -45630 -181104 37180 13910 32425 38774 -113959 -345552 52683 586 -435042
20764 97110 75462 -12160 -16230 -237821 126455 -283908 -73338 -230877 -11755 8453 -93952
20752 -80783 14493 -49755 195600 -149306 -232837 146882 -164240 31995 8953 2056 -63596
20740 -76535 -6060 -159657 322859 51302 121091 -334710 84806 218322 -264713 -384080 -12893
20728 93175 -211709 -517228 274860 2424 -37825 -57691 -209530 339099 6783 159899 -460599
20716 233285 -127163 -252765 -174592 82033 -261940 -326467 -15595 139894 232822 13948 -141174
20704 -163427 20096 -12614 -9614 -404621 -136926 -279168 -86938 157572 -37880 -149913 -110512
20693 -110512 111994 79247 -82313 -10752 246137 -54854 121648 166262 -391808 99311 -34855
20681 19534 -21559 17493 131852 114833 -445768 -163753 33859 -207020 -158427 -48318 140161
20669 -9175 -338758 -270658 83855 -18908 -124145 16207 -118674 -283253 -177555 36921 -461211
20657 111076 -52273 -160097 -58542 -142696 -281957 -186738 -94826 -154356 -498486 -291932 -37793
20645 -309688 73452 83348 -224398 -63161 -200595 -280129 -194530 -213008 38245 -60723 -218482
20634 -218482 47114 143897 346909 -293205 -148713 -141689 206127 -30334 -46659 -18365 -104842
20623 -104842 -23642 27422 -178227 -242002 86977 59267 -58588 -162454 -84307 -79639 31995
20611 39769 -250751 -79551 13192 -225436 -255279 50596 254276 -138891 -530118 102875
20600 -121844 371250 -49313 -337468 -259192 -233393 134982 -79593 -581804 -83161 193540
20589 196482 -32449 152472 -257358 -168067 104008 -459063 -101603 111710 43465 -229162
20578 -195600 -135990 83235 431708 -205845 57 117575 -630 -13450 35974 14225 -110202 93199
20565 -85980 331074 318546 -21265 -39732 -206605 -17066 103879 -210877 -365678 83602 -95590
20553 -113176 -70277 -254409 157973 127768 -26393 266693 -64002 -9331 96890 178228 127576
20542 127576 -67820 -187503 238703 -48852 140118 15408 219215 -206381 118486 -100465
20531 82895 72511 207529 -11993 227133 47648 -280494 -104418 175332 -97505 -158567 89381
20519 -223798 -407383 -113848 -92714 -357779 -98233 59200 -278651 -168831 -439881 -125831
20508 -102259 -260728 84740 135056 -122366 -119361 463079 -40382 -135093 -53754 -95714 -316557
20497 -316557 27196 -346523 -33761 -126327 -217188 -157079 -132214 -224502 -77415 195382 -127908
20485 13444 -81400 91377 17176 -399331 174150 10967 -219214 -111517 194076 -173871
20474 223156 -167816 -360042 -279281 -287000 122629 -103060 -28241 -9106 -17841 -61202 69420
20462 152367 -191780 -4660 -66588 -184025 38481 -133864 -360630 19105 -151195 -14970 12710
20450 -26703 -208438 247019 -15572 118473 -66007 108957 43929 152594 -280752 126489
20439 -171719 -203674 68756 -6703 -189492 317130 124588 -331263 -232898 208189 -2129 217872
20427 75073 101543 137737 -64643 15737 -115192 -97517 57607 27850 96281 -95323 54635
20415 -141106 -10795 -98553 -78909 204458 274746 69328 -12392 -145759 -222176 -140775 -86639
20404 -86639 88710 -92767 -13056 -150928 66743 -136745 -87934 -410148 -201066 -387486 -74818
20392 -40565 -76877 -225389 57115 -182064 180295 -133475 -99988 -54027 -67011 -44747 205372
20380 -259184 2734 -135416 10758 -242134 -68209 100744 111891 181307 59549 -87966 -204856
20369 -204856 45555 -240602 220160 -131952 137955 50909 198175 -71558 -13424 -339173
20359 -339173 -53600 -332778 -113743 -14112 -160082 246753 198899 -186012 136017 -45367
20348 102494 61678 -50987 -171693 99871 -24135 136230 5725 -20048 -213404 -24658 116348
20336 -141134 -281742 6874 -242243 -315580 -96355 -249736 83517 176914 -20948 -557127 -28869
20324 -111488 -90601 -198241 -392512 -40139 -292610 16079 -287689 -175486 -163206 -8803 -157548
20313 -157548 -107606 22045 -96476 -209941 -58992 -134251 -337982 -71682 319603 -372255 167731
20301 -47406 -41778 39223 -80464 -275236 88943 -183392 -192130 -193714 -183683 150112 -251066
20289 163506 239751 -107115 -85892 272078 297290 -160120 -110356 -105451 251719 -286096 -137709
20277 151629 -108977 142062 -114191 12965 113771 -109575 35638 -765431 42853 -537424
20266 -36115 -224570 12789 297939 426748 100590 -107430 -212354 -88241 30442 -65837
20255 -190188 -270881 -188623 70838 -165086 17632 -257 71970 -246629 -210073 -379968 -88780
20243 175865 -149129 -94662 203570 3053 75681 -97457 66790 -423225 35542 -217798 142158
20231 24167 -131779 56652 -193274 -451387 83289 -285010 -94130 62376 238762 -322830
20220 9257 -310259 -278536 128190 79649 30362 -220782 254868 -2977 38628 -100849 30548
20208 -332659 -59523 -59944 -340027 -58096 -218181 95618 -111084 24114 -145857 -48224 -18111
20196 83977 -61313 264257 -58331 206736 7934 -129200 127289 -3523 -230637 -246122 -310379
20185 -310379 -162408 161072 -159254 -240732 302913 -112145 -163399 -212089 -175259 -314286
20175 -314286 -110436 -100292 64086 275459 -190552 -192880 136062 -190339 -177923 17700 107849
20164 107849 -108528 138751 -193303 -203714 279001 -3146 -264067 58172 -64289 409086
20153 -281105 103905 -259959 -48684 89564 159988 66783 70870 -20618 56064 152529 201010
20142 201010 -359517 -159940 54987 -173810 -67910 96508 67863 149802 203769 401237 198503
20130 487257 288809 389323 378974 37668 29262 191273 620958 621760 555019 362952 134192
20118 44966 -93857 -211881 -176167 345122 52998 -169178 101568 53753 110425 74896 -174834
20106 -112251 66714 -206680 -53978 -86203 -321088 -291875 -209679 -228953 -129442 -27208 -179646
20095 -179646 103983 84389 -418070 149073 -283340 79551 -214612 -313408 136463 -163085
20084 93463 -5195 404745 284746 -92202 -234817 -191595 196547 221587 56994 -127774 -148584
20073 -148584 -174631 -123906 -19939 -393935 29675 20571 -103442 49191 -78485 -37615 -250275
20062 -250275 41187 57314 44595 184573 -7430 -92533 -63084 46346 12507 -178701 -149968
20051 -149968 -80619 -116696 -224918 -189077 -54718 100938 -69000 -178429 62924 -232786 146363
20039 -148219 230350 138010 -260570 -6793 69110 -158352 176974 -205006 43227 -85451 120239
20027 -14225 -244133 -356778 -54115 170088 41628 -99236 -47840 -37351 -80891 109131 98738
20016 98738 -198921 -42270 285273 218857 77875 60552 -316763 24592 -258542 -281442 -128070
20004 377023 -269968 75101 23331 235170 71342 -225628 -14771 -88603 -89789 -83780 -146127
19993 -146127 -180822 16849 -78156 -141631 119937 -47863 -48172 186827 -131036 148821 57353
19981 139857 57702 149446 217544 129355 87779 -87792 46507 -140822 247681 390323 -165011
19969 -157952 -174902 -22736 186319 253635 4332 19200 32786 -177237 68525 -97391 -247746
19958 -247746 -58687 -146365 -137473 39963 50953 127076 -69206 175739 154503 412689 356401
19947 356401 445300 292457 -104363 11696 432390 132551 149627 78787 304673 228097
19937 228097 -10060 -47746 -207390 202274 263066 201271 -622503 100464 41260 -336855
19926 25726 -260079 -141821 59945 144690 -243636 155108 -444 -6932 54513 -118871 91675
19914 28148 -242133 -43926 -216433 10594 -9581 -220344 321965 -285199 -202823 -20686 -95373
19903 -95373 -25194 251309 63076 26195 -124097 -385421 -38875 -343287 -7288 -50303 23438
19891 -52394 -141661 -327012 -46783 -109850 -179287 -49742 206721 -12261 -108492 -330050 44268
19879 -56142 -146908 -76296 -116702 -158231 -126254 -22062 159173 -210448 -241445 -418654 -188824
19867 307831 -172340 281341 138876 -494614 -226618 -388493 -115570 -104627 30462 98120
19857 98120 64054 -139671 111655 -256213 133111 -24718 -98953 183451 50733 319510
19847 319510 13226 65583 -39976 272568 139119 -57468 79967 -9260 -144970 -292779 -456193
19836 -456193 -133775 112318 -312909 -210717 178079 66475 -278254 -136114 31060 -233717
19825 296398 -511409 84542 -170229 -53393 -157240 -55562 -78396 108037 -425624 -42574
19814 -208545 -277338 194197 -115728 -275101 -268511 -8553 -145611 194836 146457 -107737 -118589
19803 -118589 143487 -75701 -55944 -102667 -163995 -138996 -74512 -108035 -44338 -263694 -81918
19791 203673 -121430 189695 -196829 72031 101694 -130163 -433890 -88561 -37006 -194412
19781 -194412 -56704 -36384 266389 34365 -88205 147899 -78491 -268156 66708 -85349 -109023
19770 -109023 92406 28696 -27806 -39229 -61934 -41004 -256456 -87956 -399954 -133049 267272
19758 36463 155015 45719 73622 -287543 -77133 50368 -213065 53829 -344412 50362 -461306
19746 -350194 -18671 171612 -9061 -93839 -27058 -78069 -184977 -56443 -24206 -292199 -42073
19734 -98055 61281 -37437 23954 1039 -45186 28139 -26437 328586 443921 172877 12822
19722 205879 222701 21019 108316 225148 231633 116673 450153 698606 449839 -31223 15649
19710 39656 -124765 59062 52629 196224 132847 21054 -85584 52034 -390887 3549 -167297
19698 10184 100859 98700 -18925 319594 -78415 74590 21343 156222 276726 135846 269863
19687 269863 116381 216882 235500 181045 -1313 208530 217101 -120813 -60865 128924 -52431
19675 9451 171871 -186526 228481 17928 -374607 -356219 -75052 -340694 -34313 -217481 95708
19663 82386 -121394 -187227 -131950 -242544 344014 127230 175504 79297 58203 -47573 -123646
19652 -123646 -141446 -160504 117290 176225 92894 153481 -425500 -123877 9967 -143111 92440
19640 191561 -379029 32983 49696 -57242 -66622 -13893 -256858 86879 82756 167036 -64054
19628 -291126 -316643 -108063 -15536 350068 -299286 -256225 -331930 295024 58940 -179195
19617 4992 -293391 171898 7542 -248456 -89806 61358 -251213 56063 -207207 -35438 -418877
19606 -418877 -283972 -262931 -160488 -182804 116945 -538664 -110824 -148240 -65068 -196517
19596 -196517 -130107 190970 156525 18824 246726 16553 14592 -18634 -281985 -86140 -183656
19585 -183656 -55778 -289976 -80128 101504 -187095 -136918 -46804 144490 -133019 -289924
19575 -289924 -87700 -297602 -169121 8316 118235 -15365 -8432 -182478 75056 136449 -97731
19563 -262320 -111554 -170454 -158073 88640 132541 9478 480993 -143171 61131 141029 -73124
19551 64010 -35473 56451 1060 7502 233804 -145291 -83635 -124829 -119270 175988 133539 377200
19539 377200 -222808 -389629 62551 64357 -287968 -426912 -103087 139520 -25007 -26425 -29223
19528 -29223 -34427 -44086 -259769 -263959 102143 -76265 -561960 46755 -48691 24476 89855 27069
19515 -77490 15949 329434 217782 -42654 49318 -303860 89272 -279698 -207049 22725 29622
19504 29622 -255096 -205414 -376021 -144126 41692 28247 -17291 7506 -91538 -122448 191285
19492 18962 170474 -253456 -171905 -289133 76642 67693 -137197 -243135 94992 -53920 -11978
19480 -85421 54687 -62765 -215458 -98816 68420 -47153 61763 39990 -99803 -180212 -139039
19469 -139039 -89380 -100493 -25445 -75757 -146423 -99629 -89111 73849 -113321 129369 106005
19458 106005 -204967 -137266 -16891 6905 -19621 -81868 -309498 37875 -9090 -211346 -300188
19447 -300188 95900 -78233 -392704 -111659 -325464 144204 -39635 145607 -111781 123151
19436 -110099 225571 -173974 -162686 -128784 185168 -183717 -404823 -104013 -134796 202611
19425 -148271 -26495 21779 -262596 186119 -116366 -176333 -311123 -147686 21685 -231749
19414 -237110 65358 -341602 14416 127933 94644 97852 -70972 -139909 41023 -75889 153244
19402 82665 -136043 71356 -178164 -134387 -119959 80062 160163 -46437 -262672 259165 -72137
19390 227007 -147319 -169486 -42630 82038 277586 -231917 -238752 79926 -58342 46392 -106458
19378 -132943 24931 273933 -163412 -39257 -221503 -264994 63279 172353 147266 89066 639
19366 -120907 278707 -156814 -349256 1759 138584 -190892 -471888 -123466 102294 -103668
19355 -260569 -185768 -321956 -117973 23907 105485 -237811 123869 -129669 116545 -86259
19344 13718 89377 -128746 231161 -188515 -381526 125371 -127983 -47775 -58130 -120219
19334 -120219 206390 -29316 -250983 6725 -168947 -214562 -227583 -123469 58929 -237214 -59369
19322 113116 -87496 -516478 119940 -304956 -161894 -69794 -264239 47367 -247228 -246552 -245636
19311 -245636 59472 253752 -165504 -187113 215649 -52585 -137772 93015 -9771 -156881 -133233
19300 -133233 85135 -214650 -247689 13093 -281205 322941 195090 73037 -85374 -230063
19290 -230063 -222144 37094 -88208 -79990 -84716 121385 -235282 263550 -157399 257609 74256
19278 -18098 182278 -138181 -225629 -88710 -67055 -288928 238348 -60410 294355 282102 55036
19266 3503 -230609 -255343 -147074 20777 -98618 -93263 -103965 20219 -80959 -200688 297973
19254 -117589 -116912 294297 -294328 112226 28600 -523865 -16579 267928 -176133 -251069 192585
19242 -74359 -240496 -374068 -369773 -958 -157076 -20525 -43815 296372 71599 -50256 -134143
19231 -134143 103798 -142046 36759 -236025 121857 -220493 379127 109472 -313819 -75368
19220 -124151 -101524 14180 -391354 102248 89570 147664 -132374 69562 138995 46709 127967
19209 127967 -91038 -9532 67310 41333 -245378 -30442 -442158 -112157 -91913 -59490 -136701
19198 -136701 63533 -172987 -40996 -350369 132125 -148399 -34653 46830 44023 -236245 -147921
19187 -147921 136248 -274295 -203170 51528 -90319 182440 -285323 75049 245499 -279575
19176 86065 -158669 1455 -261714 -182508 -118081 87006 -130711 -135962 -174971 -106898 153539
19164 -280744 -102833 -423529 116083 113190 53647 -33812 -234388 122822 -41053 154612
19153 -282257 180684 159112 -316695 31075 -328974 180183 -80453 57470 167150 172462 12965
19141 76368 30016 -284362 191248 -87297 310024 -114167 -387282 123614 -99163 -293334
19131 -293334 -130185 -38698 27485 -236605 -305138 -208194 -328736 -246169 52079 -115977 -241616
19120 -241616 -141067 -152276 -103108 21953 -178282 -152751 -240951 -35984 -251123 -89151 147088
19108 -147681 57625 37633 -165471 -393939 -179195 -118556 -364509 219265 -212618 117067
19097 -89626 16291 -494218 -365264 -111333 298985 -207343 43353 -106558 -30051 -133261
19087 -133261 61091 -216960 16662 -229532 -22891 198952 24880 -115449 -270806 36894
19076 -74327 -138447 184253 42325 -124570 50618 58749 -376742 -84595 -143618 -191692 16200
19064 60727 -115028 -78566 -534677 -70939 143700 271329 -99771 116650 107386 17340 -63544
19052 -115735 -59874 156065 57130 -132604 -187460 -164180 -202469 -53219 201757 -389296 -279550
19041 -279550 168776 75554 -243066 -153307 -103307 -245839 -172797 -63151 -6531 27947 -135710
19029 -9343 265142 -194889 205803 19630 34881 51234 62583 -123389 -34365 -206091 -146465
19018 -146465 55137 -186875 -93945 79053 -204166 124859 48149 231600 -105391 -222818
19008 -222818 40739 -18653 -40795 -334588 91737 -46362 -206186 276490 210105 -142882 -129886
18997 -129886 207689 -360033 -290220 -59904 27594 -389081 -174102 709 299822 235048 -84386
18985 25120 -117585 -69098 -176455 172716 -122292 -54796 -249431 -178133 117719 -150316
18974 -157768 44818 -317025 -61179 -51911 -105325 333919 -165159 101530 -82778 -163085 -290101
18963 -290101 200262 -110101 -111764 219778 442359 305128 333253 224293 181669 -26275
18952 280334 -79360 -162914 -257532 -222272 231546 -270556 122990 -177852 34110 -35995 -186510
18941 -186510 209005 -324081 -388221 119160 247313 43445 -193472 -183609 147911 -80310
18930 -452045 -198159 -208932 160353 -241405 130995 38919 -57004 -247309 32642 -321372
18919 255837 191225 331306 -91819 134607 154577 -290660 -25617 -6306 57343 -61287 -168413
18908 -168413 157394 -256123 50001 306935 83767 -219121 65939 119139 -265979 24609
18897 -161002 -57707 198257 168100 763231 390134 149358 74841 192618 -154530 9904
18886 9087 -75205 50948 78865 -11642 -273661 -248569 107338 -11706 -442146 -211320 -49403
18874 105486 90066 -325849 -159046 -286013 31883 254720 -286670 -62723 -149336 -87064
18864 -87064 -165887 -9000 130721 -179255 136145 24234 -215624 21558 -458832 214534 -173451
18852 44417 -271632 -79738 109390 -196391 -209930 -41680 58759 -57791 -168001 -280025 184463
18840 -49440 41281 -277182 -25691 71769 -74930 116547 -95231 143385 -34300 112242 199921
18829 199921 32430 184583 -130851 30972 170425 -168236 -54677 6620 -104977 57892 56383
18818 56383 34835 -97904 -63322 53882 284253 -279140 -78076 -96310 -85437 71177 17180
18806 8181 1102 -123355 -26755 -38551 93757 199400 -5756 -8106 101473 -4439 41713 -161875
18793 308360 244990 305915 225124 -176115 -5311 168016 -99074 -55420 -42006 218317 -237359
18781 -162055 -210600 55900 -125609 -84002 -91265 -299120 -139471 -106811 -109424 -244733 -258686
18770 -258686 253177 -169356 164454 -247829 -291934 -47761 169373 9814 18917 -63811 -104499
18759 -104499 47209 -15209 182421 144379 -337793 54442 82545 94380 210672 67506 -177205
18747 -217622 -57387 127486 -39487 112368 -125252 -68917 -44146 331826 5583 -238905 334258
18735 288229 296175 -67674 -196222 -47683 -101023 -142439 128059 -312972 72216 -131949 -69843
18724 -69843 -94097 31389 -153577 94584 -82416 27290 -112406 37568 -27794 -169693 -94685
18713 -94685 -27089 75189 -222727 24629 -448134 -502748 143104 -46226 81939 -184557 52364
18701 -78519 -229974 -279358 67171 -118316 -250377 88464 -239874 4060 -158650 -243910 -71109
18689 -227116 116403 -282972 -388155 -24115 -311291 -191201 25498 -63987 -127628 -110452
18679 -110452 -150418 213446 43304 -270324 187780 -86282 -163060 -70554 281117 -6007 51032
18667 -83258 272787 -124580 -41054 -169328 -187853 -164400 67683 -101651 268178 84193 -187100
18655 -158554 131882 47916 -84625 104004 -10116 79679 -236108 91389 123711 240702 144116
18644 144116 98341 -15356 6943 -38520 2012 -252200 -10608 -168334 -360826 177671 31978
18632 -47895 26986 -148095 19059 -42580 -250985 -167347 22381 53226 -1861 -46226 -144701
18621 -144701 183648 -98196 -281109 -120348 196557 -138823 175403 119465 -201426 -222337
18611 -222337 -254283 189945 142433 -92831 77887 -144146 -99013 -92062 -117798 -175850 95920
18599 -31001 -135131 -2228 -166084 -158871 -35644 -230597 -79286 -12129 128226 66320 -65430
18587 4511 239407 -87716 -108683 -65344 -34286 -6058 119289 67920 -313084 -261584 -101361
18575 -38458 -324999 145146 -105807 400269 -11113 303453 122595 -56772 112830 -49857
18564 36515 175716 5301 505903 -112880 -302336 -86979 22561 -243727 -110555 51142 -64177
18552 -241708 -297614 -203383 -93239 -96505 104110 -163002 -228528 -7507 82780 30063 -125262
18540 292745 -221842 -277347 -22142 18009 -490 42231 236467 -79317 -324813 -98474 229998
18528 20776 -64261 -248309 -179791 -140378 -69639 -72266 -13643 -90478 141170 -9091 407698
18516 122138 7221 -163222 218691 -32365 -3063 44236 -53362 -15504 -11868 134881 -218470
18504 12879 48353 37454 179873 -20469 -162454 -229431 -338955 -504715 42959 -258102 -194704
18493 -194704 -201522 -252312 -93330 -110975 -81101 -42432 20532 -398791 -159248 80929 51739
18482 51739 99372 -227786 -276638 168211 -240614 130988 44073 -157605 267712 -19057
18471 -385277 -194592 -132725 6679 191016 70779 128196 2395 -111890 15400 -245368 13978
18459 8015 284396 1890 -41467 -166478 -38917 137972 -46965 -147592 93710 -137831 50623
18447 -58779 154603 -99287 27098 111284 31574 61987 2547 -338061 130501 29099 344443
18436 344443 -154483 1201 177308 -120468 269128 -145922 -349491 76945 -120685 -16469
18425 -52242 -164302 -68781 182290 14243 69808 100196 163802 -114741 -7249 121273 -32400
18413 17734 12244 51949 -26566 -144057 -55086 -99633 274120 -233181 1507 189894 -251958
18401 191109 120580 -24959 -100918 93030 -208850 -186705 52890 162034 -74798 -117234 -168629
18390 -168629 -220692 300812 365653 38148 -100876 41948 205351 22262 -108979 120398
18379 -54328 30882 -207521 -118342 -350292 86998 314306 292220 111520 106679 118320 228183
18368 228183 -20137 -189048 187741 143224 221360 -278077 -273603 -41026 -127086 -80659 34605
18356 -207243 192323 -251290 35738 34045 -7890 89344 -192406 -27520 39288 93446 -423540
18344 -104828 -60033 119147 83363 76806 -63771 227971 215919 185817 87600 81665 84959 94803
18332 94803 -25775 -127878 119229 23786 14641 -188527 146980 -268596 -98447 84489 171721
18321 171721 160790 -104230 -87192 -433959 116426 -110032 175483 -165624 -56255 -37044
18311 -37044 32073 -89733 -75415 -267445 132034 74109 -301723 -136827 -116229 313137 125746
18299 -138640 123517 -134430 -51405 -11630 197161 -111925 -331539 -117266 33788 -60246
18288 198442 -190940 129345 497961 101397 -155363 82443 -122673 -37519 -106657 92764
18277 -187603 209082 -97326 -5624 -166377 138978 36960 -467138 180460 -12284 -537499
18267 -537499 28064 -163286 -325467 -211973 11925 -6695 -201632 220829 -146872 68563
18256 114371 3137 -45352 -113095 -361327 -54708 -165436 4323 -321783 138355 207485 -34174
18244 168622 119097 88367 -44003 110244 45379 816 -82146 -251318 151480 -136874 498218
18232 186405 -104513 106576 146996 -232814 153927 -110701 -259148 184203 82439 13501
18221 163392 -340533 -455588 -52260 64839 -203393 258019 22387 -66258 -188139 -71986
18210 182033 -20151 -61253 89805 -269804 247300 -7140 21998 -18507 54824 124897 -90137
18198 -21586 -178934 -175632 154611 70010 140689 -147332 -157399 329287 -112561 -113683 222333
18186 -38694 -199089 31199 163611 518242 -81362 -103778 78036 67498 28418 69683 -95363
18174 -331127 61649 -162104 199781 39350 52072 240338 173718 -227322 14869 -252976
18163 -101434 172343 451 -152978 -158329 -174858 160472 -34798 325231 3318 13787 243213
18152 243213 291659 86988 -278810 173840 24243 6302 255865 -311569 70680 7131 -35696
18140 24305 323031 -10969 28688 55174 -87484 633 -316364 195486 9111 34409 137585
18129 137585 -196865 170398 -24440 -314530 118903 235006 -2649 -327519 -140770 -303934
18119 -303934 -90415 -165855 61018 157595 169182 -232895 119966 -126961 326076 31991 -86348
18107 79243 203515 106777 51996 232237 -47310 -122441 288550 -86677 88759 -124187 96292
18095 28917 -1648 210790 -456266 -43399 -111837 198727 -5545 37013 17890 -67066 66777
18083 211076 70313 89525 67234 329105 39044 -6944 -78846 -199326 -250639 91333 -109688
18071 -108046 -294985 41749 159776 -133971 -115011 109070 -216284 -13956 78906 56140
18061 56140 79719 13620 -124220 -239426 -56132 -133361 105442 -153825 -260512 -134131
18051 -134131 -130252 170917 161778 -104907 -92429 -261366 36230 -194558 -256841 199186 -125257
18039 -8050 -9739 -48554 104558 71740 -106045 30153 81710 -138529 -102590 16132 -91800
18027 -9681 -254942 179892 -23639 16343 -431087 -196076 17110 161694 -274763 -104038
18016 23964 134246 -148565 28690 75712 -83804 221316 -16480 90620 96519 -79167 349425
18004 -44248 107284 -135471 23323 313998 151885 194532 -10400 -220824 -112651 -100753
17994 -100753 -43579 211357 385547 -59248 56526 -88019 191567 2462 -188396 62199 -38853
17982 -63898 233056 -47143 53922 -145060 49610 -251752 52367 144208 58297 -14671 23799
17970 -339115 45084 -81553 -177211 150217 36740 168573 43623 260542 41863 161034 -141191
17958 -132273 41270 -28892 -36329 250648 -137900 90500 52316 79089 230089 293252 80327
17946 13379 -52136 -73505 39933 52542 230573 -36469 44629 228963 355609 -242459 -44941
17934 26922 -32664 105185 -124968 157071 223304 112713 -30503 163148 426060 94271
17923 105470 765 139049 -181564 -125400 230738 -197410 31370 251853 89259 -262568 111496
17911 -103526 -55673 -131782 -53937 2404 -185501 -160222 -24731 61668 145177 -39915 109877
17899 81388 10001 19739 -146637 -55753 268727 155346 233671 39822 -253538 -18507 -101521
17888 -101521 -157915 47756 -49701 -372861 52437 105063 -17541 -12842 63130 55147 -213250
17876 174379 -197554 -7423 -49291 -48626 -123426 -5041 -321475 131607 -32658 322266 231293
17865 231293 -220251 -210785 -12472 302166 128527 319367 -6924 86029 326656 165709 -241528
17853 -76012 -85571 -48190 -187505 -114014 -3543 127222 118997 86486 -324888 -85024 -26526 329861
17840 -30978 -81593 127397 151109 55901 93499 133370 153177 -175735 -3569 370725 -20562
17828 142327 82524 79784 -254048 -111926 292165 -9130 66404 31126 235910 -57462 98605
17816 -201736 143512 -173566 -14700 138545 -118830 -135226 -282151 49272 72680 -52152
17805 95708 -116172 -21814 80458 360299 -6894 45010 143046 -79370 140549 282179 -72380
17793 289334 73025 56130 -55932 367962 193302 103231 -117 107830 184462 155696 -11673
17781 255630 121252 -12294 192188 -13026 -367 298619 148019 134550 -64692 -74597 200367
17769 -193981 139302 145010 -155528 -177468 -49585 -120725 162743 -111608 -22748 -171590 -326343
17758 -326343 -64429 -172824 137782 142921 182681 -257862 514714 216435 141693 92383 409854
17747 409854 94288 25908 -11333 127922 -179873 206032 18206 -37229 332327 -128483
17736 147142 109605 479759 -284405 92518 54436 237965 198778 -3471 45745 478715 -146628
17724 94765 -97748 334250 143033 111966 149407 108386 97007 41114 112337 243175 -188698
17712 -64179 -187528 -34642 -142463 4713 -336650 111301 233421 437497 84327 -116779
17701 24135 138256 105533 -196718 204563 -79490 -40465 -193273 385707 152286 21060
17690 233703 128789 261624 267608 -28649 -2608 57011 102789 89715 115959 66108 360886
17679 360886 244362 191692 244934 -158694 225111 295332 243455 220144 -36484 181388 -142091
17667 188851 39292 79835 213596 17511 160999 -21678 115026 165819 31638 -179664 49403
17655 202919 -64256 76335 207591 -124638 110875 -78163 215432 192143 58005 -27066 117846
17643 184835 97603 -131318 55002 25496 335687 91378 -18564 -123795 132053 -81551 152719
17631 72951 95688 19849 63868 108472 -19125 -30871 -11720 -45848 -5716 54302 228448 297361
17619 297361 86507 302972 -2606 148569 47450 -241562 83258 -81990 -59625 -121732 104528
17607 112116 180937 134179 372217 221848 406504 92945 109148 60301 -75172 360149 158805
17595 151575 157175 -188087 22856 248092 60873 -98557 -106276 146311 33776 96032 257072
17584 257072 40021 282934 -70709 42627 322160 42585 96145 132097 97205 1498 310125
17573 310125 17406 529686 289637 -159151 224870 -151588 224584 257267 195640 -102609
17562 126376 298680 269770 148407 121187 54154 108296 -87002 344415 219319 173776 46622
17550 438209 377154 -2246 22258 371237 91467 -106285 168625 116253 48449 -71130 77583
17538 177625 224340 218231 48337 414775 -46639 222815 28907 184086 47975 94616 271628
17527 271628 243632 241497 4489 443295 324362 35375 132900 530225 122110 373837 299403
17516 299403 291540 400170 413624 489042 668532 905539 697800 890698 759476 720945
17506 720945 712761 792677 492171 707345 459326 272356 276196 614823 848526 740687
17496 740687 924567 872424 961823 990360 957101 880898 659379 517195 178108 285102
17486 285102 295085 405534 347061 382276 269117 2773 452887 53178 336434 -61254 184919
17474 345207 -31415 601770 725287 269988 472455 366528 95018 272293 240295 176653
17464 176653 -27267 320223 723770 182489 108806 544650 280901 321691 300698 345118
17454 345118 237901 161532 -78770 218277 596424 -38325 522848 344462 447158 117973
17443 117498 139999 21660 443529 552158 198485 347365 322647 166190 600345 557750
17433 557750 537544 284206 417601 109473 515310 486575 476473 591775 509971 350348
17423 350348 355747 264981 296048 167001 509231 451632 158660 476649 600228 238338
17412 300188 58524 418039 222094 194810 731677 300031 221911 526441 504897 606112
17402 606112 342231 482439 433952 552366 348492 596457 550663 79351 408842 117083
17391 335071 240728 584775 535672 362891 334610 268889 161650 207955 143071 106865 169101
17380 169101 394141 175050 80661 43302 307048 230046 284821 211786 67614 276110 292353
17369 292353 189738 170055 9099 229716 150703 119741 495184 182672 246315 653954 180193
17357 -143625 -151600 576582 227530 296661 250061 443876 292692 209825 168066 492043 384120
17346 384120 112904 532252 90057 143430 319983 97988 275747 -69094 495800 338850
17336 338850 64969 433563 71392 -107581 -59677 53355 302237 231784 21480 203452 656396
17325 656396 91365 178266 417942 427469 295911 495025 274669 471635 404966 479668 164036
17313 -22985 264629 247580 7841 122874 322432 194108 129397 390037 613400 16473 263984
17302 263984 192647 574501 295690 247414 548538 359126 229919 40910 303208 -121076
17291 401173 479708 248862 297236 563473 360839 183054 125195 217325 287181 281615 350828
17280 350828 212125 199800 277589 186000 226725 556326 89646 403633 309543 294078 257342
17269 257342 191436 251904 315060 135498 319477 169053 191197 126571 394321 286873
17259 286873 354339 443411 565323 791353 658504 253083 381609 642795 220537 371744
17249 371744 219607 315575 468819 524407 503999 313095 335143 724307 197277 316725
17239 316725 148799 319594 334836 289542 604681 245691 208725 226762 406306 161970
17228 566390 270766 -104048 391171 431446 556727 128374 293970 637923 269217 428254
17218 428254 456595 609720 415832 223363 240421 360373 420984 372784 315325 261732 518756
17207 518756 264839 330643 446661 304487 538708 395595 356920 415483 281059 218074
17197 218074 573489 799462 10730 435935 637198 618010 320112 360193 636347 581891
17187 581891 42448 214323 529760 737982 383412 671981 293331 285519 428341 613481
17177 613481 223460 367475 493978 203304 961668 247559 415820 441876 639090 520997
17167 520997 387863 431627 566219 399862 533057 464647 519690 716661 523449 473562
17157 473562 495137 539608 484308 520452 490401 238697 347557 458010 652295 530672
17147 530672 770019 549981 544539 580947 655443 411218 794943 411391 546158 458012
17137 458012 270756 514464 725247 330236 433260 484511 466810 352006 540406 337653
17127 337653 627780 283132 648212 813951 821406 405931 939017 729585 586832 531316
17117 531316 902089 382266 873436 541114 390285 393613 649038 699976 799949 696133
17107 696133 646863 617549 475219 429158 662386 677153 835323 830822 647627 1090523 453920
17095 647183 870317 491031 313159 672688 767752 536446 517056 618915 1106290 326514
17084 852789 651814 539021 772098 592441 528088 612717 538740 772471 743152 808938
17074 808938 875200 744224 976795 672730 746136 421168 443805 696263 1217716 1229862
17064 1229862 949306 757895 851437 637348 592197 575684 684206 704803 940266 955683
17054 955683 854498 1030774 1008970 905091 1170240 574246 678122 852871 868395 1030028
17044 1030028 991501 841573 894327 1090226 762717 1120022 974040 1151017 874920 1030098
17034 1030098 832652 576608 804911 1239828 783356 1022302 935023 1226548 1019794 837974
17024 837974 979513 1113968 920609 914832 1121277 896755 997869 869938 784096 684606
17014 684606 1285529 973142 969669 1146062 1001145 985178 1030978 1318315 1236437 1511206
17004 1511206 1114649 948338 1166102 968655 1121747 1088005 1266629 1091776 870311 1222581
16994 1222581 1509916 998853 1282752 1620341 1106815 1551511 1232701 1064443 1573128
16985 1573128 1491852 1335009 1392414 1280409 1448255 1555296 1467449 1422280 1544059 1180609
16975 1180609 1191452 1541474 1569767 1591006 1285092 1129075 1369687 1566388 1430712 1223253
16965 1223253 1285345 1309071 1430103 1533974 1300369 1142727 1441311 1794021 1636334 1420562
16955 1420562 1831885 1562332 1781684 1867643 1414043 1486938 1761051 1787366 1620401 1793358
16945 1793358 2108354 1543786 1741433 1456038 1773522 1985559 1782221 1536097 1881862
16936 1881862 1838665 1945873 1764002 1803889 1719070 1566360 2041850 1847090 1822860 1881364
16926 1881364 2267703 2192971 2043819 1797068 1921321 2085271 2117851 2218609 1869250 2133148
16916 2133148 2288085 2274775 2444546 2290144 1915756 2348666 2315951 2067227 2555202 2405860
16906 2405860 2337947 2417395 2258345 2610272 2718750 2589338 2778031 2657529 2421951 2680044
16896 2680044 2268825 2652560 2597035 2674721 2786497 2704907 3050983 3073766 2671167 2815354
16886 2815354 2997281 3008300 3020414 3364778 2976859 3220562 3300412 3241180 3037930 3249755
16876 3249755 3319001 3374411 3285140 3534651 3346919 3620117 3654321 3597727 3612124 3368214
16866 3368214 3620123 3938224 4163300 3684210 3894241 3558384 3840359 3999369 4234873
16857 4234873 4248453 4196329 4380790 4419343 4340359 4507884 4606341 4418203 4633326 4837338
16847 4837338 4863248 4555470 4711631 4768976 5103180 4864398 5102612 5174392 4738112 5093007
16837 5093007 5309497 5464014 5680371 5405443 5798790 5691931 5940683 5794601 6213821
16828 6213821 6348271 5922908 6264637 6307439 6469729 6526849 6894247 7094129 6804183 7049107
16818 7049107 6956645 7307889 7290561 7625999 7937428 7906445 8071273 7926395 8345244 8642851
16808 8642851 8612022 8628304 8799498 8987787 9411853 9415019 10018523 9516572 10148054 10538843
16798 10538843 10252789 10505838 10927877 10941298 11225610 11476879 11709111 12320376 12140091
16789 12140091 12329949 12638831 13438227 13404810 13619342 14101880 14408646 15031127 15316005
16780 15316005 15385201 16047274 15906659 16511844 17065365 17447251 17857801 18310063 18716557
16771 18716557 19839243 19972672 20037490 20903165 21725212 22094440 22478921 23701873 24238120
16762 24238120 25015934 25559105 26231161 27013822 27855346 28919036 29638387 30758154 31414956
16753 31414956 32522810 33472080 34702561 35831148 37162150 38368083 39457482 41094257
16745 41094257 42333352 44016518 45473637 47124423 49022638 50631385 52318502 54628741
16737 54628741 56310401 58361041 60690987 62467669 65489187 67196118 69890749 72559925
16729 72559925 75045270 77725906 80857095 83517684 86594349 89214154 92213950 95256269
16721 95256269 98214990 101358975 103781728 106868671 109507185 112392798 114538086 116876117
16713 116876117 119003731 120831306 122689974 124041880 125013704 125877255 126127594 126274476
16705 126274476 126222653 125766417 124764044 123814406 122209710 120498919 118472781 116637974
16697 116637974 114197224 111697083 109217936 106213348 103613046 100363950 97245912 94112525
16689 94112525 91509341 88165305 85566556 82618467 79674213 76845515 74366393 71560427
16681 71560427 68990668 66645034 64089114 61544122 59509751 57204901 55036892 53417070
16673 53417070 51234767 49592915 47508121 45937992 44427955 42699783 41314243 39627834
16665 39627834 38677091 37329745 36024862 34958353 33492541 32504411 31628022 30555334
16657 30555334 29287849 28450878 28043081 26791664 26010012 25372612 24392756 23660354 23253584
16648 23253584 22571337 22099249 21222592 20648972 19972664 19307466 18954354 18331169 17938157
16639 17938157 17404955 16985868 16763874 16309385 15876695 15574935 15025553 14685543 14618704
16630 14618704 14310413 13561190 13261146 13133584 12681540 12553356 12059102 11935777 11666323
16621 11666323 11489730 11106356 11024162 10543632 10584384 10452468 9775268 10087990 9851972 9694537
16611 9694537 9225860 8859178 8924691 8206751 8685190 8346784 8026751 8392481 7842075 7745663
16601 7745663 7615949 7268157 7255497 7292331 7017803 6907879 6893695 6532533 6635660 6395754
16591 6395754 6451506 6124361 6192615 6026596 6202733 5695898 5863897 5852345 5559751 5479570
16581 5479570 5603085 5381094 5535164 4939239 5316328 5101489 4805711 4785986 4797802 5022902
16571 5022902 4856476 4821221 4448175 4411146 4467778 4419834 4111066 4250121 4108070 3945057
16561 3945057 4124191 4089935 4078939 3687568 3918510 3932958 4075926 3619811 3830781 3552566
16551 3552566 3544365 3442614 3610131 3551651 3242355 3654213 2882979 3387724 3244998 3248376
16541 3248376 3094316 3194119 3218052 2862988 3253946 2921261 3155731 2873885 2930808 2940927
16531 2940927 2662568 2629149 2820378 2627439 3032251 2599849 2778023 2638952 2852364 2541706
16521 2541706 2314554 2373871 2501179 2739653 2681202 2471554 2285816 2438239 2474352 2257101
16511 2257101 2252210 2348361 2315114 2184228 2099048 2245835 2059276 2284166 2217238 2097437
16501 2097437 1985594 2313139 1806824 1973172 1956108 1947081 2115249 1790002 2432633 1959121
16491 1959121 2093015 1691081 1925894 1894994 1767598 2086392 1983161 1892631 1707275 1479434
16481 1479434 1504248 1765544 1432978 1777287 1586608 1619076 1425280 1672199 1575681 1658647
16471 1658647 1636175 1707825 1500005 1333827 1509115 1453337 1437602 1349218 1344969 1503303 1602420
16460 1602420 1490042 1334637 1569198 1210057 1405022 1430651 1256802 1367846 1230540 1238646
16450 1238646 977731 1415289 1256793 1228778 1202229 1354139 1362000 1433747 1227483 1424689
16440 1424689 1269402 1215002 1288927 1405281 1510750 1029704 1279594 1291377 843689 1044928
16430 1044928 882719 1193865 970333 1246103 1247323 889404 988650 1551919 953810 1088838
16420 1088838 1098148 1191871 1177253 906297 902556 1032531 1329685 927666 1080370 800919
16410 800919 995114 791254 824100 917891 718225 1158159 978681 871704 725787 847316
16400 847316 813784 1151863 862519 1031602 1202419 745186 930840 1016611 630304 831133
16390 831133 657004 731978 991231 890734 696520 1099606 885257 535216 1036407 766695
16380 766695 549888 824271 731634 889085 756534 407756 815292 760622 860602 846996
16370 846996 1016108 467499 470254 731758 819394 537623 717474 538356 571320 1044345
16360 1044345 547967 940778 839488 423677 657437 784320 723517 526489 584939 471310
16350 471310 822467 587391 780193 887856 686991 543760 762834 779005 709087 679403
16340 679403 276950 335701 405565 456430 383483 288136 667722 523707 834713 841510 739438
16329 739438 458849 374427 660377 528919 763811 468025 753496 442614 540547 409143
16319 409143 564520 459007 617112 664158 502657 584583 622342 650915 615261 241894
16308 27083 858547 690834 493591 491750 255002 201972 373952 648888 700751 239230
16297 453094 583141 252429 107203 646088 290283 337874 550041 766139 376836 724500
16287 724500 349071 574008 382430 43965 420945 720959 154411 505682 206233 257445
16277 257445 524537 558417 519107 385384 210385 814190 440662 406052 213954 461798
16267 461798 499164 372941 203709 318522 438041 664305 539203 461464 193027 502663
16257 502663 389803 573649 602089 422150 459478 760 250657 427061 460442 484680 144262
16245 548128 431957 147523 617005 572736 317246 470333 141516 678832 398863 452428
16235 452428 304603 609360 229272 515805 410966 358855 254309 374670 478255 389266
16225 389266 316030 359265 402493 298371 412430 161801 213132 696391 111215 286606
16215 286606 262040 156502 464478 453674 359436 160309 183972 479044 3855 356333 571597
16204 571597 314708 22967 392775 538889 448716 152549 454467 304011 -7633 215560
16193 145486 236799 242459 68755 163059 11459 238082 288241 368924 51236 659754 186770
16181 311299 502326 119729 116792 80832 303826 163593 195361 188665 311379 -192226 155938
16169 186634 373479 458080 211171 95174 58385 41574 279475 415501 515778 51674
16158 43829 307982 514350 42698 5807 102693 -119434 265666 101594 143561 26040 279587
16147 279587 119310 109636 -116449 272847 64622 -1069 441836 -225041 237200 274332 -14054
16135 55456 -8946 103286 19486 -80151 11307 134874 187135 -111141 447495 109815 364125
16124 364125 5759 -1956 154011 -159889 66629 -27234 230604 145917 7955 87446 63267
16113 63267 106272 386715 377492 138384 344229 58723 333965 251402 -244241 59848 304543
16102 304543 -131236 17449 214260 -77011 -135638 314345 23373 355258 74586 60404 25402
16090 214659 204426 -63588 412362 72191 65641 -84220 -3264 34191 92854 46567 -167904
16078 136796 342796 -58853 -111429 -30585 196886 414201 71848 -149597 -16732 -76814 121431
16066 549873 50134 197021 103278 16765 -121119 108371 119764 -267670 42872 21046 125908
16055 125908 289813 65336 112591 -75314 -30924 243284 325166 44268 16548 119503 -137080
16043 199418 -170557 72487 208763 184794 135657 192957 309279 18671 -6682 -52138 -109037
16032 -109037 84431 -88253 95003 82267 99649 -43646 22772 172187 136049 -10396 383003
16020 156758 162699 12480 223418 -45671 -176892 -150785 -169988 41193 -21307 64428 -45102
16008 70310 39946 139196 -3137 304411 38240 465440 -50964 -37448 538820 121860 -151361
15996 20418 397224 -9541 24295 118147 188363 -27400 -32334 -148451 251631 238554 29438
15984 -46532 -118013 100797 364315 78605 -178616 -135983 224990 152147 598194 353488
15974 353488 225963 130555 604370 984978 712720 828499 1209071 907314 860813 375119
15963 92200 137847 -95818 -14796 334182 256136 -59754 92503 61059 263715 161847 -276455
15951 129008 -16773 96020 -13138 210349 -428314 9696 223015 31709 -121259 102784 9157
15939 190868 -138606 -59411 203204 221276 146787 58496 -95511 -2633 -209955 -290739 122982
15927 155563 198976 265059 -59422 187026 10956 -371649 185300 -38989 186831 -122420
15916 74554 -101290 116610 -99664 -45248 66130 -77283 -154762 -90167 -5728 128820 211885
15905 211885 -177757 -142353 -95874 -26977 -133119 -12615 -106639 8449 -70432 -147892 74873
15893 -6367 298537 82392 -250380 55447 -154790 26557 -22364 -359511 307426 -24095 130653
15881 10665 46838 49903 261989 -97765 -21398 16518 -12086 348087 16019 -132467 189354
15869 -175755 236048 -101392 -285887 -273903 -123117 -392734 115520 327747 -443671 77304
15858 75152 -290436 -20067 -41306 37174 -162911 31946 -220160 50728 -224020 258490 161914
15847 161914 -95313 -242500 2433 25236 -142846 163068 132340 -273648 43395 125435 96542
15836 96542 -130554 -30861 365421 -142716 2908 105099 6696 -58491 231457 38556 310687
15825 310687 24647 51162 -130503 181738 -87209 30866 129314 126002 20385 -298077 -124106
15813 158846 -14674 224560 -44252 -952 27860 -5014 220946 -95137 58344 63379 -214138 -49625
15800 23429 -9865 46348 -80050 235655 97609 82758 -127182 215687 -89455 -78736 -14875
15788 -64944 73159 -90967 -56357 318569 8669 -132992 -76653 -139588 -101824 34904 75951
15777 75951 103999 -88212 97223 212227 66021 112599 -182707 7920 -96130 -10191 63426
15765 341823 -87370 -251016 -225493 -159617 -32775 -293614 151251 -101173 -28570 -301395
15755 -301395 -10941 -122869 9171 121736 -29505 55046 217370 -154577 2877 2126 -89921
15743 127600 -172498 64771 28804 296835 28419 127300 -207505 101989 -139798 -163733
15733 -163733 79579 65429 -162892 -175950 49287 -55493 5231 63743 -6657 127974 -75916
15721 -117901 -390844 -9287 -99748 -13318 322275 12266 64778 3747 -64828 413474 -413851
15709 -304904 -213544 -209811 -179762 26352 -58567 16234 47086 332623 -428830 -157157 -223492
15698 -223492 -105407 18623 -46384 -164304 38289 44539 -266504 -91408 -83766 -62319 -358516
15687 -358516 336350 -234951 -125633 39118 -273358 -155551 -226628 -215076 -82809 -99449
15677 -99449 99678 -72385 81818 -49769 -63156 -399670 101446 -41369 -98568 104352 351009
15666 351009 -168633 -294356 83575 46604 -125498 235302 40485 46135 41550 -50033 117411
15654 165064 -240828 38427 135872 -287492 57077 32410 -242111 -57954 -33164 -144733 -469235
15643 -469235 45663 -163924 -69741 97259 258749 35706 115551 131455 78249 -21859 -158974
15632 -158974 31466 -301629 -11697 -12769 97143 6560 24074 13921 -59909 24533 132675
15621 132675 27602 20573 -207397 32025 -276148 -137349 -158580 103329 -51146 -105631 186597
15609 -259798 137367 105233 -106547 131633 -48977 -277984 -14946 -29182 -16138 -562553
15599 -562553 121885 38608 24862 -299331 373785 -296706 -155314 -64105 284286 12658
15588 -16080 -56475 144055 -234527 61245 216234 -236143 -134523 -86975 40262 -279435
15577 20510 -243736 -21864 -257687 175705 -65288 893 69117 -128678 158286 191488 28711
15565 -131846 -166050 -115382 232409 313775 202415 -72445 141956 -96252 317236 43350 79204
15554 79204 304980 -115668 18037 11351 112837 106446 -198660 321350 123568 -92700 84944
15542 -20753 -308605 -29176 -93183 -74010 -43782 -18241 -29508 5780 -174777 -134634 11036
15530 80898 38236 204805 184264 120653 18719 184847 -274375 49368 -137551 -254825 -8528
15518 -156368 -129914 295144 28509 228133 138553 -65265 64135 309149 -202993 23799 161186
15507 161186 -256467 -138994 -192586 128337 184852 -29612 -75702 196168 261488 197191 248691
15496 248691 -28948 -311517 201737 -8790 -81248 -71033 7165 210710 94543 22889 358388
15485 358388 219155 -76976 279531 367788 106831 41563 37377 501457 260523 129241
15474 561853 116439 223681 406262 178046 99729 143657 480609 471991 -15313 344843
15463 83206 -66005 225775 475988 421558 565336 689918 613722 307191 248326 111939
15452 74974 328941 55950 340202 16715 66990 -114435 406077 -146478 -64240 -53860 -182476
15441 -182476 4036 -130234 -17574 -28748 269252 215948 70376 -20030 249079 -1685 -305508
15430 -305508 43488 397004 569063 838295 741470 1041743 1028986 794653 714972 547483
15420 547483 -9795 519725 1157 271040 178577 -104868 213867 -150655 123935 165463 197057
15409 197057 129730 58978 34443 355456 -38869 -44851 190790 -257995 -249836 -79939 -282172
15398 -282172 -127920 -1178 41952 248111 -155089 14781 -88301 48340 -136510 58842 -46088
15386 106139 130653 -23990 282020 -3514 156901 -54968 -8839 46768 -33409 -58068 -144377
15375 -144377 -176122 -100946 198752 -216342 -297184 -373188 489931 849 -24466 175096 239001
15364 239001 -152879 110260 97086 520201 125706 34705 225382 319711 -68466 71202
15353 33936 229032 -76233 86965 325956 18613 -232622 -163499 483640 -192181 192242
15342 158332 370708 84090 2602 139771 159135 351067 148411 472299 132937 239156
15332 239156 146917 315262 236608 384315 352668 301938 145575 182309 197380 404248 9407
15320 367953 233828 210389 81067 366274 157460 135877 -39591 148901 280204 233288
15310 233288 62665 -138863 348124 283787 -288728 173231 282274 194763 123854 356576
15300 356576 -377864 55926 348017 89281 123446 287294 207288 216024 123457 228837 160099
15289 160099 28888 25692 -42409 -252438 262774 189059 89776 -93618 172840 -58888 -184641
15278 -184641 -174317 -245380 205388 195315 -25793 285572 -109878 -138703 5841 32352 -96059
15266 -137380 -233935 -2755 -57143 28050 -118363 -33471 10314 63312 139308 236204 168522
15255 168522 17667 247060 51603 -2419 157844 121526 -24118 -109836 -366802 43373 207128
15244 207128 67305 355797 -248069 113467 340067 -203667 407274 -51944 -27846 17801
15233 -10821 341234 46689 389391 206110 452129 1131273 1254514 1354855 1442465 1491156
15223 1491156 1386486 593569 370363 371790 -270868 21706 408624 255070 166371 204364
15213 204364 -121967 -60025 -104517 176819 -92177 -29292 -150559 183696 -27134 -84319 -148699
15202 -148699 75975 132133 13061 -54419 138541 189521 126853 126610 13418 39672 416335
15191 416335 167204 272994 310597 -149328 60777 -70161 120012 -70848 240126 -106658
15180 77025 528858 -194729 212197 90996 4544 6852 150530 188041 391373 -126318 633688
15168 184238 304900 397547 87708 98763 77183 111050 378188 217823 221107 -26704 38127
15156 334870 269817 -249164 204148 126003 -72314 314117 111648 -2839 -202832 -109593 30078
15144 -101469 16517 26604 69149 42681 -66806 396593 -60047 31544 119234 -172721 58024
15132 -10012 516278 82826 10375 89585 27071 68573 34765 199502 270253 208867 70657
15120 -260141 -54688 258283 -37261 468206 -88570 -187121 154639 315508 167784 432705
15110 432705 -15940 139291 229002 243142 280679 256379 481340 474098 472520 228255 95981
15098 183190 212779 139585 -57729 245088 246560 154785 -134095 256135 192400 185480 -81207
15086 -38954 99019 14345 -11809 99800 256428 110954 133756 -26609 122028 121528 -10558
15074 143588 -159428 141559 234893 300635 145116 56742 151054 394303 279890 31899
15063 225560 143228 367278 185853 78374 182783 69384 518538 145615 -79224 268008
15052 423068 336485 140659 -11813 -242403 133169 192227 106780 539390 -51917 214799
15041 350471 -82489 384652 -24319 434821 361233 451079 297435 609727 361127 363735 445570
15030 445570 240282 147631 295427 322938 314419 168469 369188 403769 246872 737686
15020 737686 461653 70396 570210 556348 944683 824267 528299 878386 670313 555353
15010 555353 842698 430135 312595 192291 551241 459285 862846 757365 714242 824030
15000 824030 266560 362684 634373 449405 695355 157705 538629 312652 523188 602750
14990 602750 607279 85256 493988 275155 414392 446754 147699 614307 242526 618609
14980 618609 442797 280253 392549 -14150 98699 680462 399040 512705 513420 327333
14970 327333 268215 875224 512682 807207 1064485 822542 347023 1008163 754033 507848
14960 507848 569162 663897 726220 799095 604870 654876 452496 558888 304941 262287 443185
14949 443185 419905 427990 497075 323890 304134 592183 618940 299336 321023 541594 752153
14938 752153 380675 608604 503955 265367 76462 288829 569675 315531 665578 572793
14928 572793 373801 529887 428898 697502 816132 792449 496289 665245 562136 584153
14918 584153 833123 707942 746852 1043655 1075082 822970 1417541 1475575 1534703 1699820
14908 1699820 2047776 1658163 1516551 1472772 1638083 1767910 1916984 2374039 2018468 1779348
14898 1779348 1421939 1528159 1288550 949577 404348 846296 425957 343754 740721 651954
14888 651954 757342 654487 422331 631325 107705 327074 690901 394888 784411 185913
14877 216030 58225 773100 648560 620535 678475 972134 414408 914604 960965 935363
14867 935363 815761 964928 854044 951475 801654 520681 602574 806140 719824 264848
14856 491274 494977 693850 712530 535568 511245 779879 767312 1000892 518312 453421 682909
14845 682909 302076 594864 311741 759589 527826 455682 427134 693790 398533 144991
14834 590439 309621 323156 215422 915519 795369 1115624 1031354 722959 1202342 1101310
14824 1101310 1181053 1067240 1068920 720012 705662 475750 469892 609642 520040 515789 477416
14813 477416 689083 394337 372028 702009 728188 662403 706312 1210145 886962 617426
14803 617426 540814 976767 975972 963852 1080892 536733 967535 501001 798094 644167
14793 644167 602522 572086 886755 872960 1135351 915648 844436 921114 794943 448047
14783 448047 452655 873729 782794 606534 597455 741452 773974 742510 874074 286372 416432
14772 416432 572913 723194 525042 837784 510477 725655 703187 1025570 733550 897337
14762 897337 777241 1017710 901077 887257 925544 797241 1026518 697975 916315 675424
14752 675424 762943 892218 883525 766142 545072 828550 682799 286327 669637 695659
14742 695659 736367 539343 734359 765218 593100 626221 598729 733281 741611 618650 950010
14731 950010 371085 776561 860268 642539 1010575 1014407 1014061 1067475 716214 1127214 1000523
14720 1000523 848332 893840 984051 896813 1084423 1177488 1642110 1619031 1939308 1939627 1593351
14709 1593351 1548046 1068753 1603538 1265987 1358955 991765 1313469 1148371 950304 987651
14699 987651 1233928 1246233 815217 1072983 923300 958050 752609 1015282 1348174 1345437
14689 1345437 1317160 1378635 1374887 1713459 1652234 1731525 1402774 1510807 982152 1323558
14679 1323558 1458558 1159122 927083 1031817 775897 1190282 827761 1118336 851336
14670 851336 1003257 670042 965098 726179 647837 1170875 1424161 1239993 1131741 1126879
14660 1126879 987316 942166 1020504 972386 1078230 1295479 1079550 926775 1092553 1253080
14650 1253080 1294594 1120810 1154477 770272 1187768 1362748 987741 1198801 1255339 1097473
14640 1097473 1328471 1143707 1354345 1390574 1515392 1487948 1216723 1429394 1051055 1200777
14630 1200777 1578653 1449680 1251762 1268324 1252223 1128236 1360648 1374386 1032797 1225054
14620 1225054 1224076 1219256 1094826 1483842 1427090 1315042 1437670 1505349 1410516 1222453 1143154
14609 1143154 1071908 1374149 1131198 1224699 1567500 1583087 1166776 1023787 1258395 1198079
14599 1198079 1719358 1172328 1290809 1306945 1587007 1421981 1434245 1993460 1089767 1718174
14589 1718174 1580939 1370456 1559267 1641130 1552743 1394810 1960301 1739394 1927817 1652585
14579 1652585 2140193 1604165 2049466 1956228 2144106 1925867 2055162 1799407 1854586 1825959
14569 1825959 1860341 2074781 1878402 1983369 1748763 1841233 2248009 2244480 2276003 2040745
14559 2040745 1917829 1999323 2468684 2301525 2278616 2053791 2215521 2484854 2545453 2448274
14549 2448274 2464954 2951756 2817907 3060739 2481706 3367485 3053793 3004213 3576848 3590600
14539 3590600 4336840 4577270 5232063 6085746 7402562 9424860 12320548 19325171 31014229
14530 31014229 33715710 19511255 12682761 8410149 5937365 4473014 3899669 4477848
14522 4477848 5171830 4534285 3810835 3278018 2764503 2540850 2420124 2413719 2470010 2680958
14512 2680958 2388753 2504912 2310681 2470091 2589910 2829821 2419235 2561166 2497815 2471055
14502 2471055 2831461 2296762 2849644 2975561 2831776 2880376 2840943 2987916 2883817 3160687
14492 3160687 2852476 3269779 3108955 3021228 3037986 3134154 2913944 3094307 3266888 3397654
14482 3397654 3132681 3169412 3463060 3413234 3598118 3269725 3523292 3591060 3214819 4068481
14472 4068481 3916602 3702584 4078021 3801564 3819043 3858625 4171186 4060164 3810451 3904644
14462 3904644 3988709 4305501 3976950 4511339 4306034 4272207 4466229 4564080 4370707 4571408
14452 4571408 4395702 4553363 4504817 4667011 4740368 5213276 5172053 4725962 5013574 4918278
14442 4918278 4637584 5328512 5194917 5253414 5325937 5366702 5168893 5663926 5702562 5682404
14432 5682404 5517425 5926753 5948677 6008750 6032316 6237839 6103860 6212091 6436357 6624593
14422 6624593 6522838 6379040 6713084 6793660 6981569 6989823 7262277 7207558 7175220 7209434
14412 7209434 7461463 7280355 7683533 7830751 8004766 8120765 8419114 8350194 9028526 8920780
14402 8920780 8658324 9185420 9340320 8916598 9199239 9219999 9500544 9578583 9787074 9548538
14392 9548538 10237282 10446965 10499052 10444273 10638242 10959797 10691388 10901142 11260013 11465304
14382 11465304 11150954 11760413 12035891 12038421 12077700 12609578 12699773 12845333 13047475 13316728
14372 13316728 13842814 13782072 14415929 14407912 14896300 14906302 15414627 15733345 15795444 16188889
14362 16188889 16359882 16735317 17145257 17409402 17885186 17978575 18269990 18630422 18988526
14353 18988526 19554839 19930756 20095200 20728011 21266483 21577132 22058944 22491805 23159212
14344 23159212 23567471 23940943 24534194 25063587 25643119 26188283 26635582 27485740 28051774
14335 28051774 28642638 29743278 30495502 31153465 32038053 32737129 33373273 35006601 35269349
14326 35269349 36245171 37606441 38545622 39798709 40869425 41988828 43488242 44334782
14318 44334782 45978421 47525779 49092393 50526396 51820826 53480029 55455712 57253492
14310 57253492 59186461 61326277 63644443 65520527 68368316 70919084 73563504 76309124
14302 76309124 78968468 81990715 84943430 88312749 91884739 95518412 99885364 104221546
14294 104221546 108229618 112944450 118511967 123741535 129009347 135331336 141539772 148232909
14286 148232909 155817459 163461736 171523503 179958062 188813155 198190300 208330048 219251015
14278 219251015 230346621 242534908 254942308 268108629 281809602 296344791 311073754
14271 311073754 326522613 341931381 356759090 371541553 385734090 399516301 412589108
14264 412589108 424486090 435659328 445016346 453312402 460685674 466972673 471613044 473673026
14256 473673026 473662924 473030688 467621281 457309883 449778504 442999486 434349671 424609776
14248 424609776 411696443 397389521 382657312 368711464 355583080 340617525 326103842
14241 326103842 312134112 297960662 284505787 271060064 258271638 246213742 234847250
14234 234847250 223518793 212741976 203040532 192731306 183122060 173571372 165081219
14227 165081219 156481735 148973050 142052397 135577833 129604602 123687479 118192050 112586954
14219 112586954 108045599 103615186 99412794 95855032 91718914 87965276 84550671 81628613
14211 81628613 78131534 75423354 72734228 69803424 67564466 65063803 62987929 61001907
14203 61001907 58794177 56850582 55086908 53188694 51821469 50156816 48783444 47042850
14195 47042850 45575371 44672247 43296101 42266666 41126875 40099969 38490122 37793874
14187 37793874 36602754 35696336 35079340 34161865 33375721 32165887 31358558 30658108 29826243
14178 29826243 29171701 28362435 27599473 26942777 26593798 25858248 25026263 24030702 23772309
14169 23772309 23415238 22899003 22595269 21940932 21625588 20777573 20852963 20295061 19893450
14160 19893450 19122400 18971938 19029643 17959666 18137115 17537591 17363868 17192024 16659500
14151 16659500 16400197 16286475 15746103 15368340 15226945 14771083 14241885 14277935 14258149 14090781
14141 14090781 13791797 13424238 13414862 13276789 12885701 12880380 12494817 12202339 12086406 11716974
14131 11716974 11896275 11547690 11334944 10916773 11043686 10488689 10753216 10549366 10517947
14122 10517947 10258716 10264852 9760570 9907510 9745012 9470095 9520718 9395643 9458566 8858523
14112 8858523 8744911 8705273 8759616 8486956 8156214 8221683 8007683 7885729 7874270 7879226
14102 7879226 7742726 7417507 7523366 7580311 6699099 7137111 7024226 6495102 7150538 6965994
14092 6965994 6561785 6420826 6504078 6412617 6202932 6243851 6254416 6411786 6108202 6163119
14082 6163119 6101694 5675904 5991976 5946182 5702208 5754512 5764270 5294781 5316278 4935220
14072 4935220 5086313 5320156 5102987 5375700 5135620 4969640 5066181 4652693 5178396 5042835
14062 5042835 4526858 5042027 4604680 4523367 4701326 4401308 4235416 4707085 4180377 4278493
14052 4278493 4500538 4405611 4344621 4406137 4148964 4527027 4525523 4330560 4101492 3970700
14042 3970700 4121106 4180785 4021327 3993070 3778552 3452479 3766099 3840384 3775153 3643349
14032 3643349 3395346 3612662 3367844 3528316 3612668 3688106 3356327 3506575 3264779 3317022
14022 3317022 3286633 3174123 3051515 3190890 3273080 3100725 3162211 3124659 3145940 2993843
14012 2993843 3180049 2807629 2802331 2604348 2941270 2875049 2836624 2993958 2157605 2703691
14002 2703691 2794616 2496980 2873902 2442116 2454763 2528000 2496677 2292782 2666242 2589268
13992 2589268 2577240 2656157 2460493 2126474 2161301 2470812 2399854 2462377 2078281 2413304
13982 2413304 2253220 2450391 2630974 2604590 2781341 3035519 3715568 4715026 5471816 8514386
13972 8514386 13972475 24968730 34823717 23213291 16200940 11503192 8521655 6172825
13964 6172825 5424334 4578877 4290362 3633997 3674330 3190967 3208594 2736216 3099969 2913592
13954 2913592 2495898 2372584 2696252 2516979 2312499 2406536 2496096 2471090 2265980 2142790
13944 2142790 1837533 2089002 2249845 2036173 1683376 2181845 2215535 2163641 1981305 1897329
13934 1897329 2169251 2048983 1994923 1613141 1991693 1919495 1840796 1651568 2044711 2113010
13924 2113010 1986067 1464823 1674394 1729269 1856180 1881466 1472999 1934941 1791125 1557968
13914 1557968 1731575 1525151 1469096 1580727 1573366 1901403 1919782 1466971 1695826 1650101
13904 1650101 1287411 1688119 1543969 1506304 1753168 1509025 1751417 1555927 1333768 1708875
13894 1708875 1418661 1546614 1365420 1305143 1458265 1371495 1517053 1374273 1325940 1430364
13884 1430364 1456166 1210601 1529224 900440 1115633 1415261 1150591 1352892 1131943 1289910
13874 1289910 1197730 1390953 1145453 1357943 1432299 1256418 1260257 1458354 1144794 1139054
13864 1139054 1344370 976842 1038022 1205903 1141325 1203014 1310209 1539617 1237233 1084768
13854 1084768 945611 995107 1052077 1011720 983010 1172923 1072246 1115637 1013980 995036
13844 995036 952994 1150331 1073745 1517022 1092618 1178584 843968 896843 1116009 870659
13834 870659 1250957 680317 1320812 838875 1128319 1410880 1066450 1009875 1162749 890316
13824 890316 1135913 1039430 1281690 855025 1090810 942389 869835 831606 1039312 960326
13814 960326 879690 762423 1183815 475215 885150 935407 800587 1044673 1054815 976311
13804 976311 734359 844630 682161 1136048 891221 1113349 1003995 893286 685736 800939
13794 800939 657420 998867 620292 1023770 776633 603708 849580 880691 915074 627191
13784 627191 875677 505406 892150 690915 577939 485778 773211 574934 994760 664829
13774 664829 1064911 824976 744036 846660 700812 881753 532699 656548 663625 755013
13764 755013 493624 843239 601984 809109 532845 661191 795089 746305 501708 392426
13754 392426 1140463 861219 696047 745115 894025 887525 528481 639852 618262 532024
13744 532024 525758 693961 506428 588036 644170 915555 492651 601599 632367 692447 675845
13733 675845 676009 889424 585143 621393 374994 627466 581893 441888 567252 426127
13723 426127 641326 786321 491847 609663 699163 499591 898044 795978 534517 825122
13713 825122 396892 380859 262341 514183 552699 431044 647200 492950 640303 350535
13703 350535 641320 571672 493045 796326 371979 565447 625325 726848 826797 461246
13693 461246 616946 629618 567055 680037 633434 677933 465644 662712 192829 548665
13683 548665 389462 620004 437137 460524 597718 423093 669811 589404 671010 623061
13673 623061 501192 608128 510011 393687 743070 663925 483633 492605 490645 397163 430002
13662 430002 624721 593515 541890 225504 378729 525327 370091 191723 385113 192583
13652 192583 576154 289748 241275 432444 847551 705567 703248 534179 664269 451408
13642 451408 573580 213098 327590 421072 617613 568336 571823 300409 358646 622443
13632 622443 545751 71525 577706 566430 153958 415294 481947 329313 334455 387514 464820
13621 464820 341428 291960 589663 155647 439261 473456 565321 275649 303167 277335
13611 277335 436059 107890 558192 329112 637288 610836 315536 528041 306529 382674
13601 382674 770755 364388 526006 740299 319223 83299 668931 300003 390845 321521
13591 321521 448397 154153 220466 150383 365318 205641 160769 480935 1095 344551
13581 344551 214738 381746 441171 449762 128578 122541 213845 701613 228443 185004 284238
13570 284238 445860 507871 125496 -141009 251032 330767 513476 445411 319475 457826
13560 457826 102390 -32671 293835 384967 144638 483555 17376 420458 338974 408842
13550 408842 294689 247323 242803 95619 39660 588184 342240 440877 332698 240451 329895
13539 329895 139106 625043 214941 614867 352931 91391 210745 314191 366287 210273
13529 210273 173279 201764 39887 511080 401589 242721 526532 448784 384296 250917
13519 250917 172550 574516 314689 83314 540730 387172 44894 446586 180423 276033
13509 276033 65486 229743 280711 63274 468470 200283 257511 414350 64550 426584
13499 426584 419091 99355 26126 159 231344 370213 193002 239566 -25525 -4843 228292
13487 -102957 189327 286618 552747 486383 17029 219784 310460 419956 152235 160223 282194
13476 282194 376008 344515 -153354 245238 -42399 594837 141194 40794 441134 554128
13466 554128 154730 131495 193422 -764 126669 337197 296159 251190 386530 201131 409920
13455 409920 292980 39860 169799 245073 433298 105332 75648 243955 263851 334474
13445 334474 271879 101602 328042 85521 158116 523502 237335 397712 113354 233750
13435 233750 160254 309713 189609 -39834 166239 51453 182910 181591 162995 502539 189370
13423 -43471 32532 620903 129777 156057 158866 136344 -83421 109765 6166 74230 146086
13412 146086 67262 244263 145288 165510 -277802 68159 462241 73095 227351 107016
13401 -9049 86534 406187 81485 -86134 272858 252085 306950 289611 -54879 174789 150383
13390 150383 297568 176856 114596 -4646 341926 406573 246848 -34023 171547 365933
13380 365933 381130 194031 -18118 334408 318460 511283 155790 164101 87277 144084 44211
13368 146773 207583 67699 159512 328134 109882 289830 368647 207011 171674 296637
13358 296637 -309176 410430 79570 155668 111712 100698 -23694 180366 87043 101889 193825
13347 193825 223545 171748 249770 137516 7192 312871 141095 310888 114917 457622
13337 457622 135643 103120 26824 203370 187810 172228 273552 261188 317881 202943 212255
13326 212255 111904 250650 352425 391968 372551 199761 561147 31100 339632 521157
13316 521157 249810 250251 130514 416713 421802 277885 218126 383532 151843 6900 186842
13305 186842 424923 344365 280653 502607 241419 468935 346526 152606 196939 466480
13295 466480 254730 316847 123567 34985 101975 248345 119411 259632 177751 93929
13285 93929 60557 188632 222630 163738 186311 -26134 99007 304115 38018 300312 54502
13273 282396 280474 -176909 15847 236939 -247597 359411 174390 -131626 -50078 97596
13262 -90610 472121 147411 168766 332852 18232 270477 -438233 165006 -126955 -167706
13252 -167706 148734 243724 -14941 342431 31017 -96919 271855 357281 -143026 -97607 100254
13240 586 190304 277915 70593 286899 121664 148997 29050 60978 147199 383738 191626
13228 176179 218220 -44118 146545 131509 436019 283070 162578 278956 259364 320337
13218 320337 -129882 171319 11140 -35513 1979 41780 137451 -314108 368125 -98553 357455
13206 -58289 128995 -9441 -388520 42631 -49016 139320 356921 48379 -67406 112252 -53957
13194 -43744 242947 -158951 180240 -259410 419534 -189613 -278320 -52643 -20178 -118796
13184 -118796 -85944 13460 146942 105762 -405103 14306 -134449 -279377 343171 214357
13174 214357 -34647 112641 259226 -264844 -102624 -128699 191695 52341 -113513 163437
13163 283464 190467 -68456 -19346 -107227 66512 109407 -7349 291865 -47779 -40863 -171948
13152 -171948 -37101 32225 -190422 131901 450074 237727 68966 -118332 -515408 159368
13141 102168 130706 38511 -40853 6912 63681 -21668 -83941 258237 -86183 11200 345666
13130 345666 106471 29774 228345 -15457 -126151 79929 -8149 79747 -99102 -5051 -69392
13119 -69392 -250602 -146851 125852 -38413 239063 284830 112681 160123 13500 -21577 -86180
13108 -86180 22901 46121 112919 201328 43862 -132942 324982 394505 -84973 281399 -150347
13096 346200 23224 289595 -43019 -19125 249565 -62455 -132123 -101237 284000 157775 -17371
13084 -170866 222922 109586 -98801 395186 249597 58363 281085 44872 40960 -7191 51708
13072 -91317 12424 522396 -148431 389586 -88138 -83849 -127275 140090 143245 4926 330387
13061 330387 -30813 -530010 36276 280950 -106583 -170039 34263 581 207826 341995 -124826
13049 139930 -49924 248853 -68453 108343 74642 219198 -143997 118310 49747 23733
13038 153952 145079 24973 276210 280944 201053 267193 -373730 14156 333391 -108826 -84072
13027 -84072 316351 301566 -29893 -73445 61905 98924 -23062 -106707 277165 -170281 -116262
13016 -116262 420388 12761 190468 -95783 187358 315531 -119980 76463 42039 346699
13006 346699 211229 160264 -17474 36677 -241214 -21924 101804 702 253125 88390 197267
12995 197267 128207 236823 -46903 309093 77299 134307 -10644 66788 49941 34601 68243
12984 68243 38291 286488 -318285 122172 -211086 235558 67821 46491 321506 -79511
12973 175116 -228560 167187 117996 -33401 178 127478 -265261 171311 -193112 -156949 -394664
12962 -394664 -151375 -253395 -221040 182723 -109024 442788 -157051 -106295 94917 -18464
12951 116012 -159139 26993 -135009 -50227 394893 563240 -29833 -185797 -81766 -25188
12940 83113 82516 -83407 -26989 -222576 -117257 352304 -65203 -384386 137761 100739 -3754
12928 919 -207835 87846 -99957 440510 69483 173996 -79493 177683 75168 85353 182133
12917 182133 453273 -159240 -302214 -161132 -350552 19515 -191971 194073 81808 354900
12907 354900 -273611 360526 10336 -33076 -50750 441209 92337 -149121 -99909 2907 124187
12896 124187 -187213 167394 121074 42262 106494 251305 384854 442804 -30121 -160787
12886 -160787 116567 41641 -126942 -107266 258074 16061 328230 56623 207657 -12889
12875 59008 -126449 129431 43991 222713 -86013 692 246741 113605 220401 264186 32431
12863 311507 1552 128643 -168022 449262 48328 -241051 42567 -25878 -287523 -257541 171688
12851 404645 70935 123490 -79524 230348 -33179 -305252 -74835 -178674 6193 -103419 78151
12839 37064 -69999 129153 117808 -46458 318719 -192569 94875 67557 112655 -17015 95994
12827 131034 -23391 -124264 37193 14979 -48568 -85494 121917 30224 158876 -96175 35165
12815 22298 -205453 176085 -288520 -100473 204131 141646 -122184 -234856 -210817 -78141
12804 83337 -362796 109370 172875 -19389 -223455 -119679 64312 -125352 -173898 76241 -139279
12792 -136945 71968 -255935 61792 221802 111640 127697 162851 4452 110941 -172834 -115534
12781 -115534 -238361 -54820 -118280 -279909 -75337 218759 74539 -15982 -107622 -322297 98996
12769 11531 28342 -125093 46270 -106567 -234242 450476 -23300 34802 63304 123373 266045
12758 266045 181743 -47650 -75597 -55645 248154 58823 171562 -24409 -28499 -99152 57870
12746 -1224 -171679 2830 -49121 83286 -72918 51176 41219 -159019 18034 -123682 -89220 250746
12733 -235857 145721 58741 -39768 130813 -271653 -253197 265988 -127890 203700 -7490
12722 -26419 405747 134044 -134373 294828 216046 -100088 138504 5520 -171578 11830
12711 231788 -144169 -199793 -434406 137554 41593 -141989 -6473 -74791 40476 -199221 127945
12699 -336401 258537 284109 -34007 125426 19559 -171337 -83933 -171554 294394 154929
12689 154929 -52530 68837 229517 -46280 27716 246957 21713 -121613 -276038 -100547
12678 79904 -238685 106335 -123449 283692 125289 111529 12522 -109831 30463 240543
12668 240543 183359 -33073 -48874 98654 73679 54968 -117627 20986 -72319 130326 26786
12656 166121 122221 187704 63838 156892 339758 -50966 100164 17216 -125929 -61369 -97264
12645 -97264 88239 -85959 255968 157576 172695 130372 54071 195638 73041 333074 285622
12634 285622 311094 57857 307203 -13901 56915 38923 -39458 12308 -58621 36666 -135515
12622 262735 310551 46547 130463 -173871 466084 -224935 446000 -57136 228120 -80076
12611 95034 208376 -29022 157104 268605 -167877 181241 111533 213762 -540352 331467
12600 178648 -75467 -26834 96489 43998 56020 184814 21231 -263918 116664 11011 108886
12589 108886 -195198 123893 -62943 157357 -46851 255495 222594 199417 -173564 -31682
12578 -143646 27578 -232209 1533 20791 191861 -12014 108495 -123609 -99583 162938 208421
12567 208421 -88427 -129506 252873 43856 106941 135739 212379 -31309 -151933 196566 -157267
12555 -174587 -143989 59579 88876 470705 150156 55409 -95634 -169869 110483 65890 -5143
12543 105278 39820 -64426 188233 200481 -138432 -167576 84558 -31230 -185905 -237243 -112203
12531 -52635 -132179 247792 -116768 139364 -8526 -24698 58184 81087 265332 63811 120669
12520 120669 -45863 -218981 -54965 61359 -38328 59197 131292 84201 -8722 -57378 -89264
12509 -89264 -1779 -251165 -191738 40948 -78420 -287751 64428 81924 -199780 -27588 -265940
12498 -265940 -139571 18039 -45667 45633 297163 201830 -24016 -56872 -201756 71941 -70731
12486 117887 -44946 90729 -61319 251793 -60522 -349091 -264363 -128562 10645 -60119 106622
12474 24562 -50449 25745 -73284 31675 -936 -8929 69017 -56453 27196 -288742 -305830 -211722
12462 -211722 -126495 184824 51046 237127 -1882 70305 -78450 163988 -360089 123290 -212176
12450 150957 27101 -81682 -45659 76071 -192828 -61311 -125508 -46987 -28875 -75460 366292
12438 124973 -53099 76576 -446786 34968 13023 -119302 -80056 41731 170551 24614 -17288
12426 -238619 -105437 48414 38725 74176 -142696 -230055 -256514 170221 289995 143297 -41719
12414 161992 -3521 283197 -7778 145883 159996 -97994 115765 -108224 -133105 -76422 238144
12402 -98386 -122954 -95803 -92781 -61896 -214057 -109193 93482 -156962 -86159 199811 -180968
12390 -228919 -13218 -250716 -326099 101519 100097 240966 -110112 -239353 -206004 -155698 -183895
12379 -183895 173793 -39052 210420 134876 -36376 175358 239547 -38292 188901 -54939 149881
12367 152696 -140759 218941 115528 96246 -18258 241921 268659 309626 200052 164604
12357 164604 -5302 -159328 -100725 305988 60092 115211 132548 183047 -238099 -114359 -240233
12346 -240233 88009 108122 133571 182297 89014 232813 -163820 -48038 224153 -118641 -104410
12335 -104410 -125297 289045 -271283 233925 -225132 -154822 -67051 -88814 116812 145591
12325 145591 197031 548537 178241 48768 -114145 133239 -139547 -164662 -259201 79101
12314 27942 240081 50966 279330 384460 327812 323130 61978 171553 100449 415948 -43111
12302 173428 300671 139245 179239 218042 254265 -291902 -64044 579898 178217 209649
12292 209649 173795 -31101 12871 174467 243155 967 98899 -331694 -66771 112745 300947
12281 300947 120101 -174389 163638 -220047 -221833 240327 -65470 -38771 130994 441883
12271 441883 110808 -32974 214253 86108 -44458 -33673 -417906 80854 235116 9870 371776
12260 371776 83250 111027 -155475 208214 241790 99060 342205 -111651 -85968 45644 327915
12249 327915 -83918 124392 137341 -57119 154293 385835 79616 369228 266222 -2639 172154
12237 140447 119119 310077 536355 -111380 169898 658867 188408 255548 158189 220034
12227 220034 112464 42499 60522 -26016 416995 136050 190859 369410 -62608 -71756 29025
12215 60687 157614 121824 135272 213858 304415 2292 201191 211001 131546 52027 -181802 204764
12202 113733 86068 68198 132274 255492 93799 -97336 256959 418685 -20255 68121 -55714
12190 -147044 386969 75611 -31691 324468 72276 -21617 336186 106037 263573 356887
12180 356887 109183 184189 47072 -105836 -32235 302726 242832 199124 233513 366184 170867
12168 175020 -106481 -54347 363881 174132 -1745 63796 -66067 159 212883 493381 358368
12157 358368 202570 -5781 -5635 36547 214246 185430 102832 111346 -85668 47614 425844 327762
12145 327762 344955 147733 413593 80413 143672 501857 315496 107336 111144 331406
12135 331406 153375 197154 171911 13916 -78541 22606 157807 161623 153959 86294 155712
12124 155712 484665 188215 160388 177267 74064 12121 11372 -3185 -55551 143866 24180
12112 347748 -200526 280373 303691 134513 127964 172192 178679 103843 523688 218788 -18669
12100 284099 213985 201303 -128344 84281 -83662 -26733 121627 -29682 -8143 -110043 60987
12088 239886 59903 -77619 -150359 228913 351522 44719 133529 34733 -156277 94161 -76297
12076 370567 211037 -78127 -203105 -44492 122456 454502 -130406 245342 122341 116513
12066 116513 199912 5348 55018 288539 48517 428212 -196289 -7179 182670 -146137 255304
12054 239536 110870 140527 94412 262001 22253 444665 252690 319047 -36452 109893
12043 233080 -30764 32519 116185 69650 30355 419477 191447 212704 -56315 116239 180801
12032 180801 -119613 110118 99047 -386368 178390 64506 -62172 -240886 34542 -92512
12021 -173811 -33554 108833 183937 -188372 -82460 -112066 70337 30010 422398 -129866 18466
12009 -44406 -56987 -104027 -75569 134985 106911 74334 91425 -18811 -36588 55849 69960
11998 69960 -74023 25710 38444 112604 119331 -140470 -99334 319089 260922 116646 244029
11987 244029 233073 -7155 7037 175839 82962 125975 213906 227291 -199566 -198889 204519 193724
11975 193724 -54880 -150556 -297289 -9956 -14245 -111325 -44048 202638 26971 -223678 13969
11963 -212168 -282392 -239169 -122796 -156954 77076 -292919 80360 -160615 -15273 280495 -284960
11951 192592 287022 140415 -18857 -374745 151895 -345374 -284470 -48594 380314 -466670
11940 -49089 -20124 -238236 -181610 71112 -52612 -157342 147457 -212016 -445891 -214967
11929 -163661 -40104 3522 -19255 181383 -130217 -85026 76465 -228750 214356 -21164 19629
11917 225914 -79065 -181085 64268 -350256 -83854 -132147 66231 -320591 -165031 303528
11906 92870 -131494 -81514 -302940 178474 -32773 39228 -25545 -5193 -356261 -4959 -136152
11895 -136152 -53768 124383 -130666 -185143 -742 -213103 -211468 -41937 438045 -165250 313155
11883 140103 363489 -183284 36182 53806 54862 -242965 -160941 -301203 71165 242122 192914
11872 192914 -363607 -69481 66778 -281841 -108883 -42634 228329 11859 -70908 -225505
11862 -225505 97493 -325967 -232907 -40754 -94810 -221189 127183 -11626 83796 -217113 232456
11850 -55411 -69285 -60452 107077 182122 48023 160064 -242822 61985 -87488 34251 40574
11839 40574 47796 63595 249362 -105492 252094 -93556 57059 -330520 -54505 105714 -25447
11827 28643 184768 -278642 -427310 61494 -69691 400254 -401917 -124178 236827 24241
11816 -62401 -88127 -95235 -182712 28894 -132169 -74886 117972 172361 24425 -244690 -342255
11805 -342255 157495 -263562 -354995 -74935 29151 109985 143772 -316798 32618 163371 -137418
11793 55194 -32335 144013 275242 40284 -236904 -48053 141844 57154 -39187 -159738 124014
11781 17928 30563 -180617 -151511 308002 321680 27625 -300619 -119411 -342971 238062
11770 -241605 278025 69710 -112555 108398 210429 -67280 137226 57498 20907 -227369
11759 -66040 -5117 -230386 184003 342852 -115655 258883 -175095 89006 -268386 46592
11748 79654 -41354 -83496 136980 -126765 135443 126042 -9943 -130256 -198092 -235115 481901
11736 -62832 -505236 -188356 -273706 148418 286 22402 -85039 -95533 -265804 -245138 128378
11724 108777 -102969 -466305 -1334 191328 177993 122774 261399 161502 393196 -15810 66527
11712 21270 -130523 118046 -15375 111742 62766 -67668 246179 -180900 -248111 -97959 -13060
11700 -54347 109439 510907 -55934 -221392 1331 140779 85966 155936 51671 58697 -268900
11688 207683 -199560 194679 -362201 45354 -280252 -290860 95924 189510 105998 18176 92048
11677 92048 109663 -139166 136287 -203367 33560 107023 -23921 13835 -225402 7268 33995
11666 33995 -232111 -364098 -168359 145338 358967 11847 116850 17699 -105791 98430
11655 33779 255230 -118947 571232 -15076 -186192 192809 -143013 -43706 27173 -122556
11644 82894 210477 98147 -55538 44167 -138340 -170800 -36774 -56490 -23876 380164 -121469
11632 -266362 243542 248762 -258478 -50455 129475 246160 52880 -309139 -32039 136721
11621 17252 -111970 -100011 -100148 111448 186359 26164 7748 58355 -74861 48760 143391 281723
11609 281723 54351 55000 243924 -5844 319032 -72170 147127 189153 -141779 -106484 -100955
11598 -100955 91626 -11449 92898 -221407 -195576 166298 88632 -249730 -133469 159536
11587 -318726 -286254 7674 372485 -239438 188175 447601 -24360 -8554 48608 139902 234658
11576 234658 216773 23585 -152158 96270 -71959 -188865 -115932 -19871 101025 -96236 7906
11564 106080 157430 107800 -2596 -65320 191539 343140 -4459 -136632 85195 88506 7579 151315
11552 151315 -96511 254622 360326 382492 196996 -54571 -66981 35592 156592 66576 -138341
11540 21268 -113463 -12193 -203525 -49670 -222817 21101 189914 -277489 78580 218369
11530 218369 2852 14617 -10389 -277926 70514 364191 186887 147926 -27314 -88298 68063
11518 -135153 -171018 110124 64139 -29531 83400 108633 -131852 191271 165992 -34587 159851
11506 56221 -311431 -67905 69137 -76035 -98063 264033 322272 -280780 116716 78923 -18131
11494 -142030 169116 237781 285630 21867 148752 236014 136158 1492 106616 336929 13418
11482 282383 447566 -73852 137771 -42135 140737 154313 60628 -118209 199402 288030
11472 288030 -125631 108039 113145 -88285 -45348 -4542 91476 -105911 70363 -491549 303333
11460 156394 -143506 -20050 368946 -244356 -120214 356402 172117 37033 281967 -11519
11449 74181 -25128 380651 -231227 159560 44856 119044 -34263 315442 165262 330307
11439 330307 -27985 190893 11440 133770 536105 367959 -71978 14953 -18788 3472 86692
11428 86692 40153 151434 16559 10864 228852 -7196 -263460 182699 -6216 -85902 337981
11416 -233943 8102 -6103 -144463 164791 -257161 -173786 168537 -42699 -187471 91248 -23218
11404 130376 -38678 -21148 32344 -102942 -306382 -77959 169343 -102269 -215489 -410856
11394 -410856 -388258 -78006 150951 -268273 180973 244083 211546 71776 -222125 -33443 -3732
11382 2920 102785 -251939 -248354 147901 -77586 -93270 142998 -109538 18234 -461444 -10002
11370 22072 -102227 -130101 -582355 85666 73436 -154931 -19590 -253178 -70185 -166847 -646396
11359 -646396 -51604 251958 -2829 50647 17943 1380 -145784 129273 -207921 -81296 2314
11347 287752 -332197 -192493 -26099 -82905 -120902 7605 -334740 -177910 136502 -54324 -226323
11336 -226323 28867 143982 -202877 81342 -21329 -211434 -371328 -147878 -47209 97826
11325 36115 204843 -188661 -148021 49117 -385947 351684 195575 -133851 -42878 144109
11314 19210 89371 -38962 -127379 -132000 -414921 89923 -47573 109772 -171850 -41860 29510
11302 21104 72045 401465 241483 15657 -92932 223101 6732 -76831 -82904 165158 -96642
11290 80471 -238313 -144057 -134175 -337069 -203511 90220 24394 -183054 175976 -26740 -237963
11279 -237963 74326 -285770 88720 23000 171387 173984 222690 -151764 -22290 -17499 -291252
11268 -291252 -270625 152409 18166 39328 151414 -59385 -213975 -386144 -137203 -100587
11258 -100587 194339 -463279 -217279 22158 -116001 -611090 -8309 2204 -74562 81035 119528
11247 119528 19289 -197651 372030 -104377 -54758 -174227 76930 -47188 -127725 167639
11236 -369038 -465977 -420759 128702 134163 -304134 -139549 -20053 -19614 -184244 -234772 83797
11224 -33693 -59793 -69720 -118970 151713 -67479 17579 -4003 -59916 -375556 131758 13020
11212 -50473 127609 324080 -148637 -81453 -79636 27937 -71093 -148069 -271022 -270156 241457
11200 50643 -172612 -247961 -2474 -314758 335903 -37401 42129 10134 192500 -226953 155207
11188 -63729 -329110 -61574 -190393 -182222 -146010 -317653 272685 -87907 164170 -80402 -71577
11177 -71577 -260496 -18841 51314 -100724 245536 -19363 233916 365116 -226881 -126572
11167 -126572 -27533 -148136 210136 -73705 98771 -69176 -375427 187468 120701 125682 -391652
11155 -196113 -37614 167764 -165247 -204176 -336754 -162525 266995 -445154 -276766 -334855
11145 -334855 -249046 -24251 -94995 39025 35514 -157052 -18732 288884 331290 14412 -154517
11133 -284918 91524 -362024 165259 -216738 396984 -124617 -381692 103298 144930 -202186
11122 263923 -140410 15460 -141998 91822 263001 -15982 138217 -31000 106097 -44110
11111 -64353 68257 340863 -110869 -120598 135625 -215249 -19611 -73016 -231223 208500 135726
11100 135726 328638 261180 -84229 103195 -52433 5902 35992 66375 138400 12911 125178
11089 125178 -75657 -126378 -18390 274546 172790 -72562 79800 82920 68427 429166 -121994
11077 370204 305957 30318 -64290 25682 207086 -70960 145812 268927 133025 278389
11067 278389 232065 154496 70699 -113157 92018 288610 173820 172759 446868 184376 102832
11056 102832 152415 459245 116230 -70601 454051 181581 232109 257679 395308 269038
11046 269038 390850 278084 528340 301555 238721 294056 688698 596015 550528 423476
11036 423476 252863 610580 742538 401121 641355 897412 686277 461036 679150 544269
11026 544269 635653 614869 991901 618677 849639 569174 534783 544235 559620 491587 733506
11015 733506 821613 289820 651639 816664 405096 660563 562181 510344 374387 488340
11005 488340 677743 391231 723504 444140 251783 675917 482411 409604 277117 364347
10995 364347 579781 357561 581707 385143 500689 461678 356795 652224 481712 542848
10985 542848 620241 559401 441038 569017 522127 688738 484506 461827 517286 437746 782411
10974 782411 644224 577253 449220 890143 546951 618034 844636 775814 678267 599531
10964 599531 655730 1030409 945387 1138031 1242815 1007762 1390991 1191354 1502034 1989255
10954 1989255 2021053 2105603 2088412 2141856 1976887 2224269 1965388 1944232 2029874 1729246
10944 1729246 1609856 1287753 1686822 1397224 1320130 1524868 1648093 1600872 1447806 1372366
10934 1372366 1627646 1445918 1180880 1050967 959092 386877 338743 631943 515418 313426
10924 313426 258296 319976 32080 180786 27716 60575 159606 -50996 56128 203321 258562
10913 258562 148676 -221755 -187211 -32569 336995 -187769 -92058 -58660 -21592 59773 338780
10902 338780 -125513 82057 236193 44437 254015 -331744 54581 -54228 -45996 119196 -229122
10890 -118841 135746 -230121 -7751 237073 -101856 -191488 7088 10277 187088 -6391 -452641
10879 -452641 404338 -16168 90048 78381 279836 126320 -325857 81074 -26954 215732
10868 -273408 -15609 198921 -37476 151728 -240600 41838 207858 219023 104713 8055 127566
10857 127566 -41821 -97868 -33741 -166903 37527 -39219 25312 -54846 -219676 -329324 -126121
10845 65340 -124813 -151484 66991 -326057 -30032 45101 -23266 -180742 12495 -74790 97125
10833 -75486 -39728 18458 -26769 -263605 231277 -186072 78120 163670 346593 215374 -88886
10821 177518 -7127 203200 -25448 -32347 179888 66662 -248988 -227930 92905 -163587 -105712
10810 -105712 107203 -131518 -105094 -94639 6513 143404 -59831 -128637 -57589 -15828 -24154
10799 -24154 -26363 -1705 -45766 102950 314584 -29519 -62500 -224305 -85795 204701 100737
10787 34544 -209117 62075 38203 170518 55006 -205557 169161 162589 -85263 -113724 224255
10775 174767 -150302 153807 -470244 20191 -177899 -91036 -179169 315232 -331817 -208091
10765 -208091 -171268 116109 21908 -230689 47158 -154552 -197866 -49707 56329 -152967 -48757
10753 -5291 -275140 -48159 66253 67745 -92117 -231381 -85736 -428962 -232 -141343 53163 -351045
10740 -143746 -145084 -81389 -521441 222682 242853 25469 -124943 -142817 -94321 57099 111318
10729 111318 -130426 60459 92605 -9146 -92415 -81114 160592 109449 88361 -286647 72986
10717 161602 -186658 -74600 -365685 231625 -416025 -171629 -68246 215480 140843 -389424
10706 4947 -67371 -217932 167474 -849 149314 -45326 161307 14953 -324467 -196156 -280583
10695 -280583 -306208 192917 -93719 121188 -139339 -412750 195155 41236 -201479 -82173
10684 -252005 19122 -77397 -17863 190795 -32839 195544 -142927 135994 -279997 -412408
10674 -412408 -109724 149587 -220096 -232492 216698 36271 251496 -66819 -3840 -812 -108620
10663 -108620 -79236 415037 -15867 -305 -5939 -169841 -125950 3418 42353 -100292 -944 27213
10650 -149927 73337 -45668 -473661 -292152 -187354 -370180 -207541 235684 -165706 -27250
10639 -185758 -229704 -3290 -223428 109851 116989 -131407 -155207 -311769 -141133 -105804 380338
10627 -95285 -3273 -12024 179714 45111 -100270 -35339 -333029 -253578 -70968 -139424 -65630
10615 114214 -10533 18117 -105187 -205916 196307 19342 -328079 -58824 148064 65601
10604 -52885 -281994 -78262 -58572 154117 -231572 -71368 222917 101614 -44865 19886 50471
10593 50471 -128073 -169494 147999 -376225 33821 -148368 -96164 33465 -81588 21640 -303318
10581 -190458 -41319 7281 -11522 -86779 154173 -68919 -384020 -206678 -37509 21641 -125833
10569 -358399 66838 -62371 -205566 -112865 61438 -32533 126496 27845 4237 -126823 -46542
10557 37025 -170879 -97477 -74425 172624 37773 320727 46648 95996 -6439 93025 202435
10546 202435 -72725 -309375 -59647 76360 70897 -91116 -175066 9677 -101801 178274 -24346
10534 -131557 68159 -200659 142618 40181 61990 -323773 -227588 231089 104134 146617
10524 146617 -107354 109494 -232395 -244065 -17599 17221 -109723 -169133 12501 146743
10514 146743 -39990 -159948 182124 -49293 -157187 16370 305620 -2137 19426 -26784 15137
10502 -101708 -34449 -44570 150890 325274 -199796 -232489 -191090 -106979 -72890 -98785 -440898
10491 -440898 -110727 -30412 281617 -180274 -212105 103629 -99382 7932 -133556 -55376 135480
10479 68745 54896 -46633 -53362 268595 52212 -82405 -128749 62949 24028 101724 -140102
10467 253790 -10382 -94374 154655 -245383 -276251 120758 226872 205113 666482 464153
10457 464153 325033 215564 -85941 -39909 72585 180092 -361675 -59806 84163 -80187 -21933
10445 55386 135125 -95945 -308252 116087 -39425 -33330 106575 262782 -6184 148349 -247248
10433 -8256 -326510 -268786 -33377 -272494 89780 -373670 32647 -23343 -32749 -72148 -155187
10422 -155187 -99022 9869 -90745 9008 31676 -211202 -366116 -183247 53497 -225879 -19934
10410 -217645 -62889 -192980 42904 -171099 181536 -50785 -48788 71120 -120081 -349052 306068
10398 31679 -95686 -289523 -5144 54280 33791 249138 63759 1481 278489 190576 -60459
10386 159450 -72061 77876 -59107 -215849 -242687 -188775 -69663 115316 -152968 -144983 90554
10374 7559 -201577 108130 103653 -6265 67211 97353 38680 116349 327161 49305 152143
10363 152143 243607 156648 41736 -61512 213267 9780 156954 166613 355679 43183 54842
10352 54842 235105 120587 214421 447604 331073 231072 590482 242148 254576 217438
10342 217438 366643 165550 426815 181131 429270 -95489 -61102 366710 76001 353019
10332 353019 331620 382380 392194 -282660 259529 273307 -134536 569542 4458 57342 181202
10321 181202 113437 549429 198226 -161535 -28824 351966 -302629 -56457 40604 -11370
10310 155660 29581 104009 185176 301631 441961 58662 208333 63585 286005 152136
10300 152136 336762 315953 154458 -195089 336584 -92962 234113 54533 -22385 -178228
10290 -178228 -75650 -128774 -162422 -105923 74359 -217175 63411 5864 -100767 -410994 -2654
10278 127563 -9000 -182626 -68689 -197860 -35343 -101639 -282465 -194104 68014 56724 -193337
10266 173271 -40249 56367 88301 -103768 123107 171266 -49677 237783 -87897 180190 74321
10254 -182558 -141149 -97901 -31938 -152556 -71490 74618 53467 -58780 258878 -27806 -175448
10243 -175448 99721 63297 37733 146400 214511 78516 218806 244740 446294 229225 446466
10232 446466 201291 259878 172725 -103241 137555 22741 -182435 -5176 66204 9533 279057
10221 279057 100855 -22262 -98899 -405146 -13403 184027 -28310 14572 -57466 -91606 -201081
10210 -201081 57100 -457078 -166524 -183478 63532 59514 -202573 -118787 154065 -179655 -230594
10199 -230594 52449 38618 -348033 -31979 -49915 20708 -268689 166904 -388164 -182198
10188 -211673 -182845 254559 38284 -279069 -223668 -213813 8926 201441 -129878 69570 83989
10177 83989 -78797 -327626 210720 -141027 -426790 -134503 -265090 -218105 41298 7842 -112427
10165 -2721 -62395 -57242 57843 50402 129621 -68544 -343371 75449 -85275 -213142 -178437 -131153
10153 -131153 -109308 251617 -92805 -135168 476031 -417731 97686 136684 66022 149250 -193645
10141 -212380 -63466 -118347 15302 14281 -9290 -253896 81166 22934 124339 269921 -311433
10129 -352911 -211100 -80524 -104689 -95355 71570 212300 -287089 -117595 157538 -189006
10118 188409 -39723 44240 307604 66822 -58138 -7307 -130075 46131 -48137 123537 -8126
10106 2869 -113813 -19216 -64127 51133 -33465 -240129 -16896 -61454 -110959 364831 -178715
10094 -360993 -53306 54208 -55537 110160 -271107 -243763 -299276 292126 -126070 7758 -20136
10082 9687 -440119 -233494 -256481 22835 -145519 -132340 53569 -130439 -162120 -197208 -87902
10070 -95738 177570 -220913 -165656 120389 -197417 70540 -284877 -294999 -131209 137929
10059 96755 -212609 -57121 -55123 148553 113214 6684 -111246 -13884 -763 27914 -111108 19279
10046 125263 173980 -235596 -207307 -355091 127859 -88168 141730 -100837 -257488 -121024
10035 -37427 -243237 -108538 505103 86673 97618 172269 -31903 122491 -25681 -66897 -78201
10024 -78201 -134405 -47590 117371 -232392 252496 90994 126337 -19353 -32358 -218223 138419
10012 -172155 -33371 -161210 183179 -83387 -411040 -501850 25526 -95831 284023 121133
10001 114669 -362314 50001 24291 -5248 -372076 -107634 -217748 -57298 -46746 -186096 -48796
9989 -201660 -107444 -159524 -289773 -264582 -54270 123164 76524 -321060 78973 64067 -72264
9977 40520 -126123 -36033 31954 86531 181865 108124 -154792 188436 -285819 -330260 124245
9965 -157442 -83963 -274523 -109037 -103359 -246664 77343 444343 11738 -182535 -129158 60619
9953 16230 -511728 393544 123323 -122464 -31872 162059 100236 -60371 -231034 19855 -294819
9941 46995 97409 282406 -80213 -169915 -103010 -222122 303824 78178 95959 -332258 -115320
9929 -495968 -27458 115660 -84627 46964 -86272 -19833 121592 74069 114641 -264388 -227686
9918 -227686 -120586 -275844 217525 -330839 -59694 -36925 -1916 -61079 -10620 -27610 -181527
9907 -181527 18892 -346054 -114682 -284732 -215608 -150696 -409924 -108758 253287 -207180
9896 -379651 -20986 146264 -114779 56966 -85828 -210242 -108738 -124887 7296 -270946 -7114
9884 334935 -360484 69702 -2731 252278 80108 -207685 108311 -21926 112128 157029 209003
9873 209003 -186088 -78323 -151339 59805 -283480 -107104 -229255 -134149 53914 77194 -273839
9861 195018 -110440 -56389 3213 30268 -236596 -90564 122393 -55152 -101176 -3600 184209
9849 -88674 -192147 7595 -206896 -109356 -185624 190761 -207174 -154041 -119852 10724 -85980
9837 -189394 -228187 129238 -31959 -155880 -268446 -147479 22739 -47764 -8619 -115516 -159364
9826 -159364 -53229 -48683 -33234 45485 -40186 262290 -140921 88328 -95316 98316 213728
9815 213728 109804 119498 52032 2209 -228612 187412 -127924 100149 -108727 139072 204020
9804 204020 -152668 75666 -49168 -99377 45645 44418 -196654 31145 -127123 -38302 -532483
9793 -532483 -185907 32860 -309300 -203348 -205136 -201685 -287704 -198002 -341144 -8892 -177147
9782 -177147 -86482 133043 113717 -50648 -229228 -191503 -176303 -133530 -107234 -47742 -82454
9771 -82454 102971 -249890 -217743 -103097 -371194 -94674 46227 -76602 -324744 -54342 66144
9759 727 -43893 -5277 2807 291376 -111833 60323 -100167 12775 36640 -77405 70183 -60259
9746 -209341 -107392 19258 -185215 -37836 -65847 -86460 -186512 62730 -294213 193858 -322771
9734 6040 240078 -199960 -500449 -138575 -45391 141915 -115730 -9625 -242689 -34002 85538
9722 -38768 -325762 105458 217679 -584155 -177183 -16836 49441 -178481 -212620 4224 -14098
9710 298234 -608081 -131403 75959 10122 -20648 -83116 -203895 -232864 84711 3502 -250898
9698 -202733 -325851 147504 -155037 -157147 -144001 -147670 -56811 -325743 167635 -16511 -93741
9687 -93741 -329315 120647 -123044 -42618 -262071 65662 -40835 43162 187280 -188261 -335723
9676 -335723 -83103 -154217 -39082 -246699 49489 -134014 -185369 -13202 -405195 -353048 -52659
9664 -158870 -190057 -334495 73433 100653 -139467 236841 -101544 -31632 -75346 -48636 -496671
9653 -496671 66705 30954 -388042 -134128 -194195 272813 -206829 13726 -142230 128557
9642 192559 -196704 -167149 127582 -160101 -190613 -118758 -211308 167372 97885 -267216 184471
9630 35974 -20873 -53975 277061 160428 -366474 39805 -151056 217454 199591 -10168 205362
9618 100448 -158457 -240465 -20089 -43951 466763 143424 -266529 -223877 -33719 36141 -283284
9606 26585 -297575 165996 -190811 -125845 78193 -103984 363713 158375 -80814 -128202 -27947
9594 -315594 -89054 90051 45188 85933 -123457 -108886 12835 96160 -164520 -338426 225735
9582 81720 -528326 -26819 -423286 65233 174137 290005 31822 -352602 -185826 -163360 -104959
9571 -104959 -38022 -111399 -185291 -25426 -80917 -284918 97604 -308476 -486742 225042 -45049
9559 254057 -187609 156996 -389764 -94840 101862 -67523 -248886 274146 -211201 -81078
9548 168199 79627 -173988 237418 -247637 -483325 -196245 -153733 -442565 -149646 56804
9537 -51246 -320780 -78458 162071 -180153 96623 201290 -20362 -127379 -215791 340312 -330637
9525 -291391 41548 116866 119394 -247026 -102801 21502 -299044 200820 99548 -101415 91915
9513 -83763 176859 -14191 5880 54373 -339831 -191065 17080 -237051 -126441 67700 -196141
9501 145291 -228309 -67654 -24028 -282138 -93635 241041 132635 -151381 -105063 -190339 -57282
9489 -51929 -109603 -70390 -131773 -7719 -290928 -149076 27694 -93981 64369 -150137 198307
9477 -248787 -97226 -133081 -146593 206650 -115302 -102583 165326 29820 287991 -182398 105804
9465 -103836 28133 -45529 56197 47182 -223145 -236768 -62467 -170448 -57445 -183237 180853
9453 -39752 -8249 -335663 51316 25346 256228 -271062 -299115 77158 147751 63128 -318934
9441 -284409 -191862 -94214 -162199 198993 184086 45597 41225 380022 -61550 214397 -205175
9429 64158 -127783 -115368 11841 -126340 -61180 -191599 14402 349846 -198473 -258729 -245880
9418 -245880 -96486 -193014 -473768 307703 -94448 -274151 49950 214341 17144 128588 303310
9407 303310 99070 -208455 3247 119137 19456 74657 -26144 -183274 -238237 155538 -176374
9395 -231780 -611748 -345898 -250090 443909 -220515 -87933 -5058 153557 -208029 -115445 -237141
9384 -237141 108660 -59666 26601 -68710 177008 -456659 72174 -222820 -179766 -398094 238683
9372 46900 -55891 10087 -69957 -376778 -164237 -125773 -222527 -73512 -157431 -26271 -76747
9361 -76747 -4097 -382740 -27333 -162851 283448 192174 -107978 -157952 -180306 65578 136508
9350 136508 -27468 -8107 -176023 68903 130526 -374991 132934 -304244 226365 133229 39126
9338 56995 -29487 -97716 -6010 -497725 32697 -60977 66302 128258 -52007 -221888 -123018 -244113
9326 -244113 -335255 -60106 129878 -336797 -149287 12248 59517 -158636 -41913 88751 202730
9315 202730 79694 55511 -267301 -112735 -123002 -207925 -58995 -111622 -256716 -222034 -43464
9303 -291572 50285 -109764 -246931 -10209 -177719 -139669 122243 -49150 -329386 -68167 -59684
9292 -59684 -35003 -86458 -410603 168561 77458 -166593 -26236 -134808 -57469 45739 -45676
9280 303490 -57719 -204361 -294292 -149626 -72330 -90528 16173 -306434 74308 141157 24432
9268 -418658 -429062 136564 198868 55528 -205580 -111581 82800 -215891 -194396 -299976 -212967
9257 -212967 -75090 -284922 -133871 116156 -15267 -169147 20159 42205 -98048 121842 137902
9246 137902 77513 197405 -8715 -344755 -282036 -267488 209583 -268340 35682 -360384 -109562
9234 -322158 137689 59249 41318 -50248 -141385 -23823 518284 110430 128473 -34736 258710
9222 -18057 -189811 156680 -1592 111387 -106019 -198983 -75000 -258933 -81981 80159 -169753
9210 122575 122882 -295878 -38825 -151164 110336 15020 173253 96996 69552 116328 171139
9199 171139 -83554 -260541 8873 -266659 -1632 163349 -204477 -87711 44533 -141452 -141165
9188 -141165 171531 -199424 -181227 74170 -89681 -3660 120447 -82736 -222675 -19811 -99960
9177 -99960 -208169 -39957 -230847 -130171 -329699 -274597 -138128 -170836 -198093 -144197 44506
9165 138161 3969 -238560 16059 -411491 -223716 255755 -205569 -120052 -147469 -135667 423712
9153 -252844 262485 -286722 -64136 -123673 -192614 129669 66215 98082 54476 80416 -316916
9141 -104282 -161364 -249143 -274999 42389 98997 4065 -9584 -265479 -39840 -212567 -68539 -54033
9129 -54033 4995 -147816 -401941 -194968 22099 -166814 -63081 37148 -53337 -141733 -235375
9118 -235375 -88891 35071 -163442 115471 -293090 126600 -207874 18006 25113 -69787 -10758
9106 196409 52303 32096 -85564 -101886 -172379 -36390 47799 -30957 58713 -92223 -137635 -176005
9094 -176005 -22365 50585 -322925 -293180 -41430 -117150 38230 -58494 196304 -8707 -149034
9083 -149034 -127616 70177 307569 -328845 12539 -12514 41529 -163356 -285995 -213195 185574
9071 -39899 -6358 -43781 213342 -115601 121643 -79664 -238028 65147 -269571 31968 -9529
9059 27479 -297731 -156969 84004 -145164 -24750 209348 145045 17548 -77705 -106425 -142807
9048 -142807 -157705 -19641 224371 -180173 189780 -12889 -62173 -49342 -3587 57014 -247943
9036 -204558 -151272 -87776 71326 282062 -187853 -280787 -159228 -172827 40959 40240 -127359
9024 -415604 -129283 -125269 -41916 -330787 -111372 -218691 -40723 -296584 -196 -130115 176114
9012 -78849 72884 -17400 240914 -193416 118326 -350915 56994 197930 -222100 -180829 259608
9000 -219866 -131024 -47411 337574 -210688 -74176 56916 8042 -210147 -178920 -124846 -131618
8989 -131618 -328777 -76149 -70932 -293148 -95186 -32624 -125533 -31701 -148949 -364664 -239395
8978 -239395 -116733 -7894 -273365 -29137 196661 -10617 -292206 -20487 -28390 118253 -76105
8966 -31296 -15297 -94254 254263 170717 -367244 -78067 -88097 147304 -17039 -157141 -109117
8955 -109117 303543 -303800 -47815 7987 34513 -198107 -46167 -330165 -81760 -37376 -318929
8944 -318929 32375 -20276 244105 289588 -135527 -189683 164584 185729 -251762 -334025 70002
8932 -215547 286154 -245601 -119548 -245301 -85956 -388354 201995 -50514 268245 34452
8921 -56545 -333363 140283 28455 335934 215994 -4633 349114 -157643 283806 487174
8911 487174 103602 323950 261860 525434 551879 889207 967954 2609102 5293746 5861262
8901 5861262 3136108 1914947 913157 601125 497393 562135 183529 162298 261791 -204899
8890 246527 72739 261381 74411 -193970 -167892 140364 94270 295966 12638 182164 449903
8879 449903 -54185 -76126 4988 -7378 35907 -211656 -117711 370402 39502 -99643 97521 -237700
8866 -204677 165177 67907 220847 -13680 -390232 -205178 35314 -45851 -379059 158894
8855 -93085 -71115 -160232 -1816 163833 -245682 -57170 -249003 212756 244561 -296424 180112
8843 31153 73914 -387450 -264464 -86790 -135495 301780 115852 -181999 -62587 113964 29522
8831 -162557 259954 -106988 -64375 42198 -105551 197538 -96955 48451 -124135 -376000
8821 -376000 150844 90801 16376 -407600 -138007 -18952 94263 -282092 8258 18465 -108234
8809 -105116 -79079 -29729 -141512 -177039 -137290 10106 -247807 -287269 -166412 84047 -355030
8797 32051 -277631 92448 29681 -195357 -152959 -128510 -308109 -263695 -347982 13976 -167983
8785 21432 -9074 -280956 100742 188415 -257230 -236570 155207 -434504 -69055 -279970 -307977
8774 -307977 42174 142378 -38337 55455 -144862 154036 126447 10238 75963 -57103 26738
8762 -238463 52131 -211234 98178 -53723 -264334 -135632 22014 -78066 -67929 281459 43043
8750 105678 179020 -60207 -250211 82043 -154551 -221976 27429 108957 -296305 -229156 97218
8738 153034 -40566 -233277 72817 -86769 -51192 255719 -64943 -142893 191458 -42798 -105725
8727 -105725 149401 70582 -151524 9114 355293 116661 63042 -319281 93321 40558 -264671
8715 -82992 5297 51491 -184002 472966 -44039 -3154 -249448 149694 -76708 140046 -82879
8703 -441879 -24300 -417209 -467460 -380959 161689 -116679 -28732 1064 -74171 -251851 -234190
8692 -234190 61313 -492998 -11736 26233 -145522 -48634 -60787 123129 -8976 -155134 -412038
8681 -412038 -311356 107400 239520 271318 -49988 -47979 34713 -175911 -354863 -168184 -43022
8669 65036 -47392 205261 237560 261662 -267021 -90059 45489 7700 273508 -214031 -421766
8658 -421766 -76450 -282593 -164153 153427 -51975 -115804 -49247 388527 -399836 -163852
8647 -41335 -4875 -209850 111410 -155085 -157775 230719 -369824 6675 -101329 -37864 -357559
8636 -357559 -230888 -33766 -86948 60237 235505 35798 -202058 10882 -275538 102736 1697
8624 -141528 -62035 -35993 -338539 25228 -417325 98412 659503 212131 -166651 256441
8613 294698 -146537 352296 143816 315927 160416 -70059 105598 80784 100382 -77987
8602 95261 -39530 -54674 47627 -166215 -70517 -214854 -91286 -109876 -169025 -206823 -232129
8591 -232129 -37914 -357468 -247573 300801 49124 -226240 -142555 -82149 72471 56082 32959
8580 32959 175063 -5305 72390 -175150 18445 104140 -23655 -255704 -403 -491216 -149338
8568 -294445 -94727 -153807 -588794 -4479 -54218 342 39869 -51842 103962 -226520 -281240 13038
8555 -75632 115970 -279392 -304071 12030 -178695 52610 -7075 72415 -51193 -242047 -233912
8544 -233912 -580798 -52440 -18728 55202 -55838 -40532 -149300 -363828 -48569 -303911 -7763
8532 -345210 -84954 -127738 102272 -175033 134423 -139711 317247 107970 -228696 -200559
8522 -200559 -285352 -131509 37862 112295 21791 32040 110275 47362 417334 -505860 -198210
8510 37846 -471156 179382 -28409 -326631 -116888 151533 162165 -65083 -236725 43183 -66344
8498 348516 -178600 -238224 27320 -122251 -288450 96464 131615 72857 96537 -317134 -228455
8487 -228455 -98580 29543 -147185 2653 -125248 191845 141465 -137357 -191620 -101447 -192394
8476 -192394 -299260 57381 -103173 -67311 108405 -27630 242148 21555 140815 -56516 18342
8464 -44714 74121 -86699 214075 -338307 -115511 -26806 -88436 -77967 -69009 4756 6078 -210315
8451 -105927 -16694 45308 18915 -184656 -459611 -197950 -102198 -71782 -98487 -209748 -12636
8439 -191032 -49059 -186730 8097 -160877 75042 110737 -31898 -10037 -171125 -202234 -169522
8428 -169522 68648 270757 -236829 223378 6718 -30388 -182226 -436534 -153756 42132 -158355
8416 -108348 107059 -308532 145837 -202922 -15891 -9661 -96465 91270 -161319 -187708 -97583
8405 -97583 32029 5021 -58067 -144969 -89588 -184762 30969 30407 20909 -54581 -209892 -107911
8393 -107911 29848 208355 297224 -3027 -3336 -170341 -206804 -513745 72911 -188254 -1970 -98369
8381 -98369 -271833 -26109 234458 167003 276064 -211349 -5680 -306109 78968 -118683 81430
8369 -136104 -75595 26504 212727 -123075 -294381 -170954 116670 -310132 143473 -155526
8358 -52788 -136710 -134934 -44310 -11461 -67800 -232373 -303541 -41071 183260 -148328 240722
8346 -78444 157438 147680 -162030 113951 -81862 -192409 161853 -341804 -253595 328361 117620
8334 -502092 -404327 101503 -6539 442049 178059 49475 -90794 -117392 -239223 226589 223227
8323 223227 -117472 -83359 -22416 128793 -235241 -80514 31218 -355050 149015 31292 110318
8312 110318 -78823 39022 -110889 94526 -28089 73545 27463 -20812 -446832 130336 18792
8300 -478630 -165454 -95779 78398 -76468 235199 -110271 17479 20912 144019 -51712 -180697
8289 -180697 69921 -5676 213274 -170053 202109 -212896 90326 -264665 215546 -439250
8278 129074 129072 -135699 -18256 -120804 117948 -199792 153780 160133 129825 -230382 17431
8266 159960 -118437 -109453 -128311 -75621 95759 -33758 -32250 62266 -193943 96163 -81081 83001
8253 -183044 -48409 -204337 -112806 -258980 22359 -200186 -51159 96528 -257787 -132111 130035
8241 11532 -245056 314994 273171 -60967 -120959 200694 -200220 -130135 -259452 -141395 -26122
8229 -24742 -282537 -28044 -9317 107956 224135 -78219 44263 127279 -133583 34564 -168638
8217 225162 -102727 134740 -248466 10427 -295302 210113 20280 114739 69710 58296 -209804
8205 -304122 -298245 -40832 -199489 155905 -100284 -332672 6214 -277953 -56766 -170094 376618
8193 -352760 227623 -61009 -190314 69252 -209908 -9594 111580 -234 295577 -122556 21737
8181 -28832 43919 43170 -72097 -124019 43181 -193758 -120865 178413 108481 126114 -177637 -102131
8169 -102131 -187081 -281139 -77128 -3120 210334 -228462 -540223 -475172 -66126 -77329 11885
8157 -94839 -223621 -14138 54080 342617 314881 146137 -468397 -373390 -162741 151812 98221
8146 98221 -205493 119611 -89820 -233207 -133130 -109281 -219514 148357 -345425 -27377
8135 74989 -189168 81850 -263657 -152623 357222 178728 -126101 -147433 -21556 39087 74770
8124 74770 -169237 45627 -143753 176874 -47345 -295749 -231041 65027 11349 118272 -127802
8112 -61168 200026 34774 -4766 150835 -11359 -64954 241618 -203384 -164976 -446503 -993
8100 41456 271361 -41324 136334 -221944 -198121 -164944 -249264 -167608 69354 39683 -493267
8088 205640 287658 44862 -144192 232383 -62943 163070 -326641 -382156 -71381 -193987 79363
8076 169693 -72276 -227899 185707 -502760 -116577 209080 96274 -32868 -209314 -1081 324420
8064 -245990 -24561 43247 -295545 238356 -75603 -178267 -139103 89989 -70551 45322 -3716
8052 99661 55836 -209780 -148901 125675 -93501 -90191 -336530 -320902 -45451 64660 62805 -260537
8039 16371 -143175 33268 -95567 -64139 -285194 -143429 5199 9662 209349 -15272 -148513
8028 -148513 -192867 -137033 942 142486 -425162 54790 47318 -236016 156872 -111534 39731
8016 -17161 -188579 -290694 -272094 -84499 65793 -177248 -99000 -24942 91110 -34418 179006
8004 -54236 33748 -109416 -85687 141326 97247 -114887 -41941 -127825 154270 -65918 -253852
7993 -253852 97833 68137 222029 9490 -51983 76435 -59578 -145076 92355 -134134 85094
7981 -134478 27787 -2078 -316773 132275 -193492 -268252 160504 77150 31189 -203801 -122993
7970 -122993 5544 -159351 40252 -37155 138274 -7865 -43410 -119921 69812 99414 -159417
7958 -135893 -138021 -175146 -43631 97497 -271590 -193320 -95595 -162715 22314 -223502 152814
7946 -120473 -64415 338086 -628106 -239156 103359 248907 85828 240947 -216141 106171
7935 -581734 -189185 -92888 -210219 -127737 74743 9635 187425 -119126 -150091 142562 -137832
7923 -253130 -30281 -68276 -188381 -80126 197024 226576 -49187 27210 -194043 239289 65769
7911 -10183 148704 -219288 84202 160125 128839 38877 -119366 100590 143401 108039 28807
7899 -298823 2752 201359 144126 31477 -12838 -91423 -19342 33216 -205147 27575 473190
7888 473190 -102117 -188526 -238249 282319 37431 10544 -200921 -179088 -393428 120865 21654
7876 22142 105727 113462 -98396 -92154 -278741 35316 204075 125455 -143072 9369 -33808 -247682
7864 -247682 -170302 5309 -197901 32127 326179 -63014 -101911 -272464 79545 -126096 39153
7852 -21145 86639 -26192 138782 -40858 -137418 -134327 62588 213339 -108728 135958 122307
7841 122307 -247201 -35868 74693 176383 -292665 -107286 -11278 -88073 -47266 -140962 273417
7829 -310853 367387 -247997 -31486 -36706 -324915 -184364 161180 112582 -97510 -92370 -95059
7818 -95059 65127 -195556 171588 37516 7834 -239798 -304693 -28702 -97732 64246 7407 23329
7806 23329 143390 -85066 -334559 141008 -111274 -152175 -189655 -159648 -106232 -160685 -85172
7795 -85172 -7495 180019 -221968 75057 -109354 22168 216740 -299579 -105720 69319 -301034
7783 -3952 -99257 -4498 158751 -168487 158060 85711 -122005 -108240 177470 373268 262180
7772 262180 -23264 14447 96697 -144750 118661 -7614 -127356 -133209 119861 -282042 -136522
7760 77092 42574 -27074 -39574 -88725 -70230 -139303 -199203 -101229 -156286 61353 -318941 125533
7747 123114 -21563 -176075 446 -393190 111177 -100465 213002 -226083 -236707 -39170 169342
7735 -253668 -222710 -213376 6163 145301 41429 219834 -12648 -49946 123765 -22506 -44435
7724 -44435 -210948 -91218 325794 -60932 -125757 -382368 186882 237746 109553 -159080 61737
7712 68235 -93066 32933 1784 14073 195838 33205 -194498 -412574 -270203 -5297 21633
7700 195565 -150641 479225 -186599 -2948 -127411 214366 -147355 -165332 266966 97036
7689 -16284 -272030 52158 201260 57186 -204161 36424 -7490 175903 -34054 -182264 -10680
7677 99520 152483 -312615 -276322 -427510 146620 -155165 290212 -230735 -28811 240367
7666 175949 -309084 -272591 -64143 189957 -117908 -284796 -96507 -110550 117032 -168732
7655 49586 -236489 53751 -11382 -24162 -74083 -301444 -100544 -133012 -263747 -34287 -3126
7643 225343 -27006 -271974 -170187 42966 187967 273620 -143985 176124 -120754 -1228 53542
7631 120415 -159163 -101641 -47169 52539 -148549 -390418 294319 -119197 -343046 70575
7620 195071 -2396 -131329 -16605 -279080 261644 -179243 53615 82321 173040 -156130 264628
7608 219296 63529 -373075 219553 -129567 -98115 -70444 196046 2933 -137546 57449 -14577
7596 -200993 -219798 221463 7401 -229923 115571 -188928 -264969 -38708 186237 2439 162801
7585 162801 106141 289998 -268468 81892 1786 -71923 341236 -49112 -5805 -193047 164583
7573 -186577 -134986 -209199 264596 47335 -276683 -104530 7742 -110629 73262 -147111 -212406
7562 -212406 -219636 235901 179081 -108522 88998 -383153 -21744 -74850 199706 -181017 135242
7550 278012 -226913 -84176 86780 174190 75834 -156023 241090 -224603 -305139 149371 83307
7539 83307 -5758 45633 44776 178428 -22284 -103257 -49387 26881 -31620 -302165 -57538 63962
7526 115603 180948 -169021 -304087 390889 155060 5435 85095 -49163 79965 356716 -7483
7514 204461 93931 -162040 -344410 70587 119017 131691 -203749 -223217 77247 -163733 318317
7502 178725 42088 86066 -131396 -6576 -264343 -206147 48224 -237609 -113561 20640 -93495
7490 -196673 28364 -59713 -56544 125508 -42699 141428 18932 -33949 75987 -147606 101932
7478 -146884 -295068 -3336 109740 -99902 154831 -120458 74384 250295 -48794 -308650 -267813
7467 -267813 -142874 -402317 400834 164801 -325910 16850 67266 -141476 -135547 64282 205207
7456 205207 -12457 162992 -118742 100232 -242597 -50441 510100 -239578 305021 -10638
7445 -24294 51650 359530 -19509 -492394 133555 21446 245431 -182093 -76846 92083 45693
7433 -28428 -31436 -164919 -134796 -213104 -408871 -169933 -176660 8441 165441 -131792 78459
7421 -128845 -185369 -350522 -30462 -82778 -158803 -102032 102174 4705 -37295 -13356 -192310
7410 -192310 25624 -232996 165706 -18517 295458 -32557 -133139 -185410 -138125 -179846 -130863
7399 -130863 -332432 117646 -439559 -1707 -8574 -245531 -189785 110139 -318320 89647 -87457
7387 -41166 25243 -360413 -70210 56283 -117314 -116301 124617 324985 -113741 175628 -394845
7375 85477 -251883 -86706 -52754 3186 203851 -30755 -68284 -286196 -96458 -142339 96065
7363 -94247 -200739 -157240 -129361 145809 -23636 36235 163276 -113411 4978 98302 -37476
7351 -279387 -109377 -87383 -61801 -163266 -102542 59549 -237978 46643 -319975 -270624 -23990
7339 106400 70081 -102626 131155 -33051 62167 63754 -32167 -154219 -119261 -153988 67423
7327 -148166 337256 16032 -106307 -99484 -206837 196954 -306790 -65671 -282761 219684
7316 -247756 175431 -72539 -117384 266479 34127 138594 -239057 -427770 -201265 53581
7305 -124397 594969 179318 -41765 130569 -142261 97291 14327 -140912 -245877 19991
7294 -63140 -248873 -173381 -150101 -179551 72096 37825 -180650 -56122 -285509 -156200 402515
7282 -12140 -355084 -114467 -308525 135458 -213688 74725 -100424 67798 460 108762 -163922
7270 -360248 40331 32072 -178318 -28222 -52589 -125980 74255 -203417 -71963 294292 65981
7258 53809 -308526 34886 -145204 -148642 57102 -37439 -208674 -439689 95247 78139 -451823
7246 -8242 9451 -37149 87014 24113 -226937 -243076 260542 -149952 -33285 64709 68236 -244830
7233 71121 -12005 -215775 76104 -398102 -272599 256673 294412 -444 -83388 -17972 115805
7221 247061 -150875 -7556 18199 -116325 306025 135534 -179976 10008 -223142 -52627 -42533
7210 -42533 43352 -117653 3591 -294496 88790 -64553 310524 249899 -160663 -291746 -183657
7199 -183657 -147533 -47646 -55037 -247820 185865 37998 -133489 129579 -241310 141515 -43905
7187 -140212 -146777 -57870 -100565 -88523 -90423 -14976 -30767 -260875 -20532 -101320 97432 87981
7175 87981 -260445 -83607 123733 -256931 -311276 -3490 -448700 241438 -196127 -45045 277086
7163 -192219 -232412 39417 61803 42211 255182 160645 -73074 -172116 162685 -36384 219313
7151 54358 -375115 -142324 93521 109434 40929 -25501 337829 -1970 79069 -32132 209915
7139 -315730 -82524 -26097 50433 -194114 -29779 -289855 -60960 -84075 19535 -74486 53476
7127 16535 -266826 -149641 -13917 7217 -221214 -65610 -186158 171329 -200767 141634 54137
7115 89372 2834 -11079 -183506 -212405 65832 108289 -68238 -220558 147169 -131036 10168
7103 -190239 -360882 29756 -85861 -149609 -93902 -365758 -122266 376145 -94605 151310 17487
7091 232261 -131492 -196799 89759 277742 -8307 -151503 -106665 49950 330833 -161609 245660
7079 32989 7055 126706 17714 -264573 33770 132002 60951 -205878 -305531 158440 60272
7067 140529 -27216 -228521 144263 393561 109854 -154813 90559 24311 -174858 -164711
7057 -164711 -116330 -295786 -37648 22768 115902 141479 -95020 -50750 -41886 2563 -174355 -156316
7045 -156316 -62101 -206952 245003 -70115 -22706 -175207 19411 -86620 155749 -93335 48625
7033 -300439 208843 -321637 4233 -161899 178199 -40904 -112795 325321 72054 -159398 -102956
7022 -102956 540 -16735 157850 -173720 -128389 99157 159801 225379 108474 -149913 11031
7010 -203073 -79071 64780 -147076 -87490 2472 89307 54837 -94196 42111 -134981 80810
6998 -84917 215398 16076 -222345 -68875 24791 120086 -134303 103006 8066 -221773 -37682
6986 255777 3281 14335 174639 9703 128074 -4325 164892 -43889 65833 284597 -26193
6974 -117288 -148756 -23154 43009 -13737 106327 224877 -153800 77232 -422598 291745 -85175
6962 213504 -211199 349527 132229 189617 -120515 93743 -67058 136254 -10472 171253
6951 -159695 -51538 -189898 -163525 -110039 -9804 258902 -348262 281288 -132398 -109197 93531
6939 -157793 352528 139413 -8814 -277301 -16764 67053 -50539 -120600 -34056 -4802 -2546 252190
6926 177903 -147750 39946 142775 104894 193357 -33906 -45985 85626 -85207 436867 2714
6914 61624 -379965 -13963 93171 -136538 -155679 -93604 -423726 156475 -87402 337266 41218
6902 169712 48292 -328490 -208305 -42327 -177583 -97428 -153470 295633 -203280 -181100 35131
6890 -10451 65824 -62014 186108 -133786 -270297 4245 235726 185880 46029 4752 56984
6879 56984 252993 -29817 -13586 -118510 -87150 -7893 -148111 222046 -301461 -313462 60512
6867 -178170 -346264 120702 -21592 408293 -39645 237503 40439 -169781 -124011 -41450 -326788
6856 -326788 -108075 -98796 73494 83002 -168696 139976 -30953 -98248 198582 -422134 -289805
6845 -289805 -343631 -30726 -368099 121668 -123675 -63425 -76863 -66247 -60711 -94578 -166714
6834 -166714 -75311 378891 -110127 259681 -225124 3986 -101013 15284 -175675 -290375
6824 -290375 -139143 46908 -23616 -36720 164621 -155431 -77276 -2677 -203316 312326 -224954
6812 -85876 -43960 -17139 -107462 -103045 -206249 17323 241281 -34900 -142790 -96217 -57526
6801 -57526 -99464 225215 -65464 -283435 -87837 112624 -36313 -113894 29955 -167090 -207312
6790 -207312 -331457 126663 -38541 36170 47887 7436 -156751 48497 310806 -124957 25266
6778 93133 100392 -356517 -263957 -226763 -331074 -136922 -81017 40038 -3079 67484 -181236
6766 -21502 -100167 334910 -26266 138024 274410 -178782 -38160 187625 -1508 -112484 21245
6754 -283886 68043 -421991 -152067 18559 16550 64212 363716 78253 125047 116378 394353
6743 394353 176782 228789 -77304 -85605 158365 160071 -4879 -162459 -172729 92610 216236
6732 216236 17356 -255628 -156006 21259 122530 195151 -161903 -75879 -88337 -86118 -294459
6721 -294459 -31652 157814 -153478 -261886 -321671 -50946 157420 -274727 102783 18270
6710 -116035 -195192 91774 -2283 76965 138219 9158 59535 126437 107761 200821 23314 -270922
6697 128083 151040 -107392 180684 -252749 106268 183257 -86138 63020 -49363 -155575 302427
6685 223246 113001 9654 20754 184 213448 -127393 -204345 242001 81795 -138365 -173968
6674 -173968 -150256 -33408 65263 71741 -58248 -129073 -100647 -245131 -82826 217213 95989
6662 258218 -45573 -89307 87342 308102 37075 -429090 217529 -43609 45498 229801 -202629
6650 41310 141312 -368599 122116 95650 -263648 -142601 -108450 121034 -100984 65856
6639 59202 -280852 129069 66374 -270400 140737 -171802 -234777 -7092 -354495 -13475 167022
6627 14513 73753 79031 -19750 -164698 260701 35218 -38248 -11182 189002 -15046 31666
6615 -198470 84449 -68896 99460 110297 -5535 12154 96867 114224 -243825 79703 18623 75415
6603 75415 136584 -283486 -182352 -31002 148815 -5067 -205792 156042 225610 -84267 9986
6591 -176790 -15125 -19283 127554 -134604 130020 -195248 -56968 43821 542310 -295891 178621
6579 136875 -73163 -276995 -128222 -236211 -31071 108318 -135901 13172 211243 -417735
6568 55899 63489 -31944 175743 121504 29732 -72375 -200684 -118933 -262145 67086 241543
6557 241543 -194735 182744 29276 -212939 -11617 -135668 -5220 -263553 194420 191756 12478
6545 -157517 88898 -126067 91149 -4076 -30266 -121014 -186292 -99401 46472 13171 -155653
6533 105654 -101403 -330637 71096 84785 164969 53594 47817 -1219 -137330 36131 -2120 -120502
6521 -120502 137927 -33658 312819 -51085 102017 112568 -128480 140710 -1944 -83751 218170
6509 -184130 -149796 183207 -184784 39514 -128357 342637 -51721 109127 11695 152915
6499 152915 164773 -1178 -228426 164400 -167979 52243 -206770 -146827 -128575 237674 -123912
6487 -185926 11427 17231 -81585 -117987 -205062 -107422 5947 -84630 278522 -103497 281685
6475 -178908 131248 -376558 30982 -137690 -154590 -42896 -36295 -153765 -179627 253295 -265705
6463 -154544 -53596 62796 -233361 -104589 150481 -54096 112149 68900 241927 68317 266203
6452 266203 -290291 181886 161162 -113370 254194 -65534 95657 141995 -122088 -411972
6442 -411972 240950 -123704 214160 -68951 -192479 -310328 276327 -113857 66515 -58968
6431 108065 14544 102984 -53056 46898 -113609 15074 118939 -156792 168662 -477005 158046
6419 27282 243239 -110988 16276 -32535 -11808 177671 -246013 -17944 6263 -158873 59624
6407 61468 105283 -169204 48583 -231562 15705 189914 105914 -39936 -148232 -57135 -41392
6396 -41392 -48637 -133777 -31378 27973 172327 210976 -202164 -131220 110015 153404 -255437
6384 162284 -20795 -36667 80319 -127558 343048 340417 -11748 33725 136527 152090 -200585
6372 254839 -129237 85140 -197006 -325504 96363 98933 250424 -24846 -192648 -90640 -222629
6361 -222629 248 -155299 270121 -27475 -11294 -280500 -90122 -11710 -5333 -374358 -210068
6350 -210068 -142556 -161414 157182 -166853 48945 77851 159502 -17180 35980 300886 77093
6338 -44014 183438 -59395 7439 195628 -221280 103026 48153 174181 138402 -79814 219806
6326 -109119 -86406 -132927 -33795 243441 220023 293823 -238176 -120206 -103188 -32050 -165713
6315 -165713 -47729 4153 6669 52809 134459 -172665 -1560 -255474 24269 46467 -307416 79770
6302 102928 -161776 -52366 182421 -195511 -156297 -245539 -64668 76654 -116797 52155 109662
6291 109662 11960 -193595 236559 -80297 57218 231823 -46239 -159863 -7590 113031 277290
6280 277290 -219516 -33212 -56390 -252352 261254 201349 -100070 -61724 -191956 179523
6269 -264679 -260297 233758 -202152 -288596 -161340 -65410 -12985 198015 141418 -32221 -73904
6258 -73904 -169216 85733 24875 173680 -173771 130306 -106924 -30293 -78115 73583 69764
6247 69764 65147 -128316 78752 -154066 100609 -97100 216168 -308134 -180311 326105 446916
6236 446916 -95611 246431 -214570 355556 6838 180779 -123398 -185296 -354014 -263791 -201952
6225 -201952 310357 182127 15121 148943 -39309 91993 -108274 -158305 227760 145708 -90272
6213 -183109 -110714 191304 159900 339550 27499 -174537 180624 -123931 -212547 54615 202446
6202 202446 -202758 -77985 -115144 170179 409547 -213170 106407 -205213 2472 64655 306830
6191 306830 128537 -168081 145874 -131137 -200279 -30091 -366595 52982 38584 -191564
6180 -48691 153885 36185 -156133 -23549 -7087 123155 -92107 141613 -107070 -16235 -35534
6169 -35534 -108242 -15382 -71094 -81624 199656 192327 170727 -66038 58032 9704 80617 -172447
6156 58963 303481 -212026 81914 -289175 -104248 -51736 -183077 -176816 -235172 260374 1045
6144 78198 -161662 -100060 -75559 -228312 41706 -48405 -132326 100833 110760 17313 -109596
6132 49787 -40937 230161 108963 29928 66165 -57850 376095 -40965 21868 203680 -163671
6120 378109 2959 3328 -107092 -276545 240774 -140200 131945 258111 -166865 -276622 66932
6108 14253 -172142 77513 -55487 271369 131614 350792 -29458 -91454 -63893 14371 -415673
6096 -166840 206003 -39962 281375 -171684 60404 -38392 -258256 -27866 24489 -165695 324629
6084 -18577 -169582 -32759 -161735 -198781 -20218 -71766 -65845 -25084 54912 -256539 170013
6072 -316924 -20849 -72897 -26280 150969 -48620 99156 16661 -99727 -160380 -148369 -111729
6061 -111729 -42592 121772 53049 245290 226898 -84163 -194259 53437 -165753 -216762 55353
6049 -233122 -202359 297957 63380 -107268 -272582 -593 78887 189618 -46120 -105024 -157698
6038 -157698 158650 61433 -256681 1542 89182 212673 117209 -29953 196526 25694 -129131
6026 122877 252474 -208924 -102151 391074 36467 13661 -341002 14237 -253079 218049
6015 -191941 15676 -47725 221468 -147967 -170207 -54085 36300 -76524 104430 -165604 -167311
6004 -167311 82430 -134153 26747 551 3526 -95069 -170474 -35440 -24162 145761 -104384 45802
5991 -177417 -143464 188641 -235517 -229223 14470 52606 495452 -43132 -247661 -98219 -157721
5980 -157721 45971 128382 -107912 3615 -36366 310475 123344 38557 -99570 -54084 1100
5968 212898 -143180 -118372 230584 -100192 -146687 211719 -20835 40010 -16943 116514 -4437
5956 11163 -120566 -112426 -145015 -161552 216826 -271127 151809 232981 -195946 47541 -50932
5944 84320 -88947 43067 -110377 -11583 -141071 130939 142365 -194917 124993 200992 -69929
5932 153337 265340 36214 -41114 -277902 -92655 36404 -251906 -3321 -129408 344859 48726
5920 -3175 -20219 -152904 61376 16077 -130719 -103058 43192 -35167 187153 -144190 147832
5908 -102558 119434 36577 79380 122438 -212072 -8822 -335251 -23155 249932 61774 9419
5896 -1556 130938 -38760 -65177 69492 132056 -197094 -198168 122157 96771 167337 -117883
5884 -405396 -170248 249229 -42250 -178613 -12808 -68731 -185260 -32091 219856 -201137
5873 -257794 3204 -262156 -215246 -32568 -97202 81858 309736 -14968 -16645 104596 13196
5861 -260146 -235584 136584 478408 -142982 -244705 46367 62320 -101129 -13695 -2897 -43915
5850 -43915 -52790 19626 -35637 -125221 -98126 156718 -96606 -116145 221260 41620 58301 334238
5838 334238 -190086 -238670 -162701 -410555 36908 357136 287017 -52085 156317 -362595 -54703
5826 83803 -530793 -210229 162517 -202073 203560 -85153 -12542 -141405 205057 46584
5815 37295 -130640 -39940 40996 123476 -285451 -38985 -160122 79993 -33714 162635 90745
5804 90745 -235342 -304103 -103026 53729 49516 -171416 -171066 -74220 -165277 19750 -90229 47651
5791 -23377 -123050 -222052 53886 -140018 58209 276078 348079 167393 -275263 45100 133483
5780 133483 -486970 -87012 -100360 -374644 -117308 270176 179349 -384098 136838 -13465
5769 153778 -152565 -84778 305700 184114 -40368 259528 -408775 8350 21648 -291637 282129
5757 166242 -87906 72279 -304974 165006 104430 -354802 185017 -137461 -71363 107025
5746 267015 -178590 -98814 -477903 -215908 4355 238219 208188 463772 327198 212427
5736 212427 -150256 169745 39210 -4186 76135 305 -52808 209070 287133 60207 -161262
5724 17022 217385 -183475 -78126 -43663 118844 29592 28313 -11227 -34450 -3657 447831
5712 4314 204699 205421 -118149 214139 -180591 153813 -122931 -83873 189589 -5133 -94594
5701 -94594 -270539 -153624 -162447 -40647 -179376 148052 14241 192044 199992 32669 6311
5689 -31336 149515 -333988 225254 199317 -107628 148132 162858 -86068 -181480 -128406 -185029
5678 -185029 -273221 -166331 168148 -30922 -294804 115071 -316971 -276248 -272729 -62779 50646
5666 182389 -178272 -10894 27464 -125620 -228994 -65652 298248 26344 140528 -43359 293365
5654 -7819 76549 22587 50549 -177445 -242226 204884 43479 104740 -317474 91578 375246
5643 375246 -195703 -166743 -39227 -27415 317416 -73559 -120572 76865 -64655 224981 -15910
5631 -12890 73506 8928 -76081 222512 233247 191501 -38340 -138272 248227 -210722 -27534
5619 124296 -60790 120897 2612 122308 58997 -279750 -78958 80820 -176451 -199214 434456
5607 147634 158860 -134073 1218 -42392 -195232 75381 -77755 -13519 -108039 -94226 -134060
5596 -134060 -132816 79342 -98904 -37845 -45546 55848 -226515 -102706 -27492 5313 97908 73492
5584 73492 -224866 -88277 178638 338409 189484 243159 134218 -159404 -305380 73688
5573 253988 221533 -86692 156995 -24165 231500 333275 -158024 -9161 -127963 -37749 157910
5561 -91080 126941 15838 -112322 41689 -215287 -126953 -59385 -146665 232548 -42947 -103878
5550 -103878 142379 52519 193716 -64448 -158536 -148889 -140315 12376 80443 -43367 183906
5538 -48741 81148 173857 -271078 -88080 178135 76566 376417 -90449 76923 152078 -114163
5526 -341048 -9996 -138255 241477 260603 183093 5992 -45150 -57575 69981 315491 -213868
5514 95760 -174614 -34488 -173146 390716 -5974 105180 -143506 -82188 -193515 14249 -168720
5502 -61396 87618 -241510 220020 170240 -26560 135248 123616 -30488 -168429 338521 -249789
5490 170005 -56761 -209806 -130327 -149824 92287 52312 -399742 -457210 63307 202495 -184077
5478 -31912 63252 179940 -123451 115708 62284 -80555 -157223 37687 -362332 173705 -44333
5466 259866 94892 129418 -6268 71001 187581 -125919 -21026 164458 38245 -233476 174706
5454 175273 -224172 149096 -151056 -228948 82410 13601 98062 -12255 44191 131437 -234949
5442 223700 -42791 98005 46658 337766 -213601 -301992 221815 43373 -8743 -123788 53653
5430 216371 43996 82615 7711 347847 -57815 8085 -191858 -35026 80154 47311 86692 -47863
5417 62426 35879 -116724 98425 -133574 -41973 335258 76063 -31110 18969 209260 -221716
5405 -184475 251814 -7302 474617 276380 -26695 -184362 7127 -87905 -126618 17050 -116509
5393 -121150 -66082 -3731 66007 34830 95891 92658 117215 -276970 476798 -78319 -80487 -36492
5380 276673 -55965 58819 191720 -256163 -87029 -27843 98137 245575 224591 -122997 -86514
5369 -86514 -86225 90919 26604 -80822 43005 40546 -233853 110146 -11229 129182 76518 178015
5357 178015 -267732 171097 114989 -108682 47331 38671 81805 -191695 124669 -72733 116539
5345 -170448 92555 -4051 15916 -228642 -144743 -117515 -121419 -3505 -18828 -205250 53299 -118755
5332 -154398 -97457 71179 57853 -79583 404066 147777 128357 148789 -230777 47163 -369110
5320 75904 -99574 -202169 -29336 -117547 104152 285034 -54097 -19447 -33683 122287 151338
5309 151338 -235149 -54947 105649 -43354 -63019 -52134 6805 183652 -160217 -35658 115754
5297 -53201 100095 -77180 -52919 -13795 69811 -50708 -126904 129641 271800 -206538 224369
5285 -75564 -28051 271768 58977 -185202 -23292 -36537 -142487 -125184 184536 -21233 -154065
5274 -154065 232967 -248762 61652 179857 -172042 62306 -68051 -5237 146841 -134795 -45977
5262 -99687 114610 345939 -21096 -138662 243545 -274261 39025 -113493 277098 -135833
5251 194627 178180 63032 296849 254694 -79713 84059 147668 -272588 -152045 19714 44823
5240 44823 275719 97174 250990 64800 -100104 54261 72278 320499 258528 111010 166235
5229 166235 359819 249075 -12094 21933 -183810 -304649 -147824 -299666 565000 -248756
5218 -221403 43233 331213 75653 266661 151821 10110 -229795 311183 128761 171672
5208 171672 90732 72544 -238066 287402 -15857 163 141694 -210832 146202 -99349 -110240
5197 -110240 -448815 223381 21650 -259307 26532 -127235 240691 6824 113164 252824
5187 252824 -201816 -272441 -251938 -63184 -412975 116347 -284885 -71832 -34515 -314128 -98324
5175 4375 27098 1681 86512 218141 36060 76496 -78949 -254421 216744 -24689 -117182 -277668
5163 -277668 -31753 -204197 -277843 257920 -76523 -23414 19564 -11819 51578 117453 50342
5151 60899 173142 -5478 -58153 642 24943 384604 -109216 342402 75816 -77273 -208962
5140 -208962 -139702 64444 -244644 76852 258020 108772 -41315 -214243 604300 72806 94141
5129 94141 281070 -132129 -109328 -119910 -9498 -142100 101474 -270543 -198875 -212613 83646
5117 63056 -139930 -149258 -189887 -79694 -125181 27818 57913 -123415 81745 227673 121420
5106 121420 -106444 5833 -246925 67822 -10075 -131145 -357269 -124156 128203 158665 182047
5095 182047 85648 -409755 -172416 161114 79439 95865 34254 -32015 -71611 -8937 278670
5083 -92611 -100632 -335074 -19761 188723 -130343 66168 -244634 18480 41347 52187 103019
5072 103019 86426 149140 -27813 -42269 -78065 -56755 188167 13292 192950 68068 42704
5061 42704 -76881 149630 469850 -10470 120320 -65403 77914 -46908 150205 237538 -80909
5049 119287 -167761 85020 54593 -23391 215449 292412 79374 -231897 69812 223163 203947
5038 203947 126114 -121096 165228 27370 -25626 -272936 -8301 146491 -174589 184772 34137
5026 288015 -37084 323693 -271770 235219 62736 165750 325681 51222 6110 -42073 -117149
5015 -117149 -105394 -233945 -129854 -125803 170092 381117 -157878 141704 95748 -40958 -159968
5004 -159968 89438 9596 344374 192937 -137939 -18174 144575 -44545 295523 -181157 -405736
4993 -405736 -21684 33469 -183861 175761 295361 -223031 -313033 153830 214389 -145331
4982 174769 -46072 -6165 34251 3102 -118416 -376157 173962 -253079 220631 -146636 44595
4970 -112982 -232758 171807 84042 114571 -302217 339554 38104 -12849 -71555 -13447 102552
4958 -80393 113287 -25859 65199 -2240 -105619 151565 -83110 -177376 115244 -158800 -23197
4946 81782 59779 19895 71659 257160 -230646 -26809 -102375 -225 279546 -22089 353970
4934 -306823 -253598 -46551 30664 -334124 -199328 14437 136637 31352 216293 83703 -133381
4922 215952 461094 -157269 68154 -221 -297790 -11503 120033 382 65051 184705 374206
4911 374206 211658 -70759 97230 -168136 -165665 -365476 -36582 17 12777 -107034 -11057 364295
4898 -414658 71422 85602 -61316 -151265 -177160 -286031 113380 69469 367005 -141369 45542
4886 -45913 210008 -37774 387928 83378 266748 145008 121810 387317 -229526 120505
4875 71475 -17807 -120601 -163850 -362744 178854 205673 5785 49384 -71196 652690 -231692
4863 -50171 -117244 68408 -8784 286355 -43256 70945 -30129 -329176 -64777 -247554 -232386
4852 -232386 242914 -154357 -145106 146147 126645 -24500 2869 520794 -273333 29953 -339080
4840 -115460 -197977 -36435 204696 -33693 -57569 275978 -8575 144495 -79416 93264 178282
4829 178282 95515 238077 26682 -105740 199114 -236807 -131274 268444 -58617 51315
4818 -165560 147155 -116453 33107 25694 486038 202728 -9670 138657 -126467 417359 -150548
4806 91710 54839 319962 -63324 -48419 -239947 -75275 206921 -61571 24229 238121 -224268
4794 88396 85567 -283740 -231572 -362822 209952 254647 96623 203821 10200 102490 142978
4783 142978 -1190 6242 -182936 45856 93421 88171 -275220 191060 -97679 -68298 70521 -222622
4770 -4388 -242786 -100898 249159 -116815 342257 -145614 5074 31425 -136891 152553 -31082
4758 235057 144065 58502 124949 216217 -61269 50319 188755 -98899 -148816 -313534 -172626
4747 -172626 -111500 -247036 294885 30739 -292454 230804 -89092 -303160 101454 -343124
4736 24919 -8509 259507 -187729 208477 176793 184672 48488 171223 57600 150494 -107572
4724 -91565 12555 -124113 72421 -18407 -92037 269335 45103 101029 235141 -109751 125848
4712 -153641 95292 168907 -58287 504 -374230 -162593 17573 121736 4721 -24018 -44374 -58480
4700 -58480 -2830 170652 6941 158471 -4641 -11808 73752 -255875 -65662 37737 -32041 -198379
4688 -198379 101072 60934 284087 148279 -26888 -147960 265727 90971 -148026 -262849
4678 -262849 -119757 388271 41088 259413 133989 408105 -90019 -306055 -232169 105615
4667 118952 -586168 -283560 310960 206521 191195 -156957 27033 119214 89504 -277483
4656 -220518 -56647 -174244 135296 78610 -196769 -240406 135644 265506 -114065 21935
4645 -17763 12686 87026 -104996 291264 297509 172426 -456276 243103 158950 56862 -86866
4633 -48003 27687 -9350 230131 -82810 205402 224519 324966 15283 20815 94040 -47640 192775
4620 -210080 113203 -166071 -3657 -122051 -97567 126881 -20145 111742 32389 -40305 128117
4608 20278 42374 238343 38645 -45602 78891 -33694 -263021 217049 -57136 -353392 -19030
4596 54676 253987 243702 226738 -153082 216448 151782 -96484 221149 -303191 -71674 329845
4584 121534 105347 382866 -241513 304100 -144204 -325773 188761 79867 112077 -200428
4573 -321963 80907 56703 76864 -157051 -298862 164059 80871 121438 70879 35327 330460
4562 330460 -225348 76065 85141 143119 -286942 324049 246197 -227461 -118061 282436 -2204
4550 -73656 -269641 205009 -464534 89999 200498 -184482 -31172 132782 -97928 301844
4539 -169827 234408 -24648 -407669 52154 250129 -58804 289184 123679 -149295 -174355
4529 -174355 139660 -177793 135251 158039 15903 63451 -16316 191813 290851 190769 47356
4517 -165932 51151 176499 -49852 -76811 39564 97759 -351871 151494 -136851 -80772 -122521
4506 -122521 97938 -268190 36821 -127460 81760 13385 14071 51840 72901 43268 128712 125249
4494 125249 -22775 -118518 151459 92308 -13158 -342849 -55192 -158006 -3563 125644 -90641
$$ [...]
##END NTUPLES=NMR SPECTRUM
##END=
