
##TITLE=AC1129_Armenia-Quindio-El_5906567_m79TL81VAd
##JCAMPDX= 6.0         $$ Bruker NMR JCAMP-DX V2.0
##DATA TYPE= NMR SPECTRUM
##DATA CLASS= NTUPLES
##ORIGIN= BRUKER
##OWNER= Administrator
$$ 1.72 TOPSPIN		Version 2.1
$$ 2012-04-10 10:14:43.500 -0500  Administrator@TOPSPIN
$$ Compression mode = diff/dup
##.OBSERVE FREQUENCY= 400.13188235
##.OBSERVE NUCLEUS= ^1H
##.ACQUISITION MODE= SIMULTANEOUS (DQD)
##.ACQUISITION SCHEME= undefined
##.AVERAGES= 64
##.DIGITISER RES= 22
##SPECTROMETER/DATA SYSTEM= spect
##.PULSE SEQUENCE= noesygpps1d.comp
##.SOLVENT NAME= COFFEE_meoh
##.SHIFT REFERENCE= INTERNAL, COFFEE_meoh, 1, 14.96869
##AUDIT TRAIL= $$ (NUMBER, WHEN, WHO, WHERE, PROCESS, VERSION, WHAT)
$$ ##TITLE= Audit trail, TOPSPIN		Version 2.1
$$ ##JCAMPDX= 5.01
$$ ##ORIGIN= Bruker BioSpin GmbH
$$ ##OWNER= Administrator
$$ $$ C:\Bruker\TOPSPIN/data/COFFEE/nmr/AC1129_Armenia-Quindio-El_5906567_m79TL81VAd/22/pdata/1/auditp.txt
$$ ##AUDIT TRAIL=  $$ (NUMBER, WHEN, WHO, WHERE, PROCESS, VERSION, WHAT)
(   1,<2012-04-04 14:41:03.671 -0500>,<Administrator>,<TOPSPIN>,<go>,<TOPSPIN 2.1>,
      <created by zg
	started at 2012-04-04 14:29:31.890 -0500,
	POWCHK enabled, PULCHK disabled,
       configuration hash MD5:
       1A 1E CE 29 27 FD 77 03 67 4E F0 E3 C4 B2 CB 90
       data hash MD5: 64K
       D2 A4 A5 DD 5F 4B 20 4A 5A 2F 88 D8 73 56 21 2E>)
(   2,<2012-04-04 14:41:06.531 -0500>,<Administrator>,<TOPSPIN>,<proc1d>,<TOPSPIN 2.1>,
      <Start of raw data processing
       efp LB = 0.3 FT_mod = 6 PKNL = 1 PHC0 = 0 PHC1 = 0 SI = 128K 
       data hash MD5: 128K
       6A 46 4D 0D D5 22 62 FF 37 E2 65 58 A1 30 79 69>)
(   3,<2012-04-04 14:41:07.718 -0500>,<Administrator>,<TOPSPIN>,<proc1d>,<TOPSPIN 2.1>,
      <pk PHC0 = 32.36572 PHC1 = 0 
       data hash MD5: 128K
       C5 42 CA 52 3E 48 69 97 A2 1D 95 CE 6B E6 0B A3>)
(   4,<2012-04-04 14:41:08.203 -0500>,<Administrator>,<TOPSPIN>,<proc1d>,<TOPSPIN 2.1>,
      <abs ABSG = 1 
       data hash MD5: 128K
       C2 E1 82 B6 0C 90 BA E3 68 57 69 41 62 06 34 61>)
(   5,<2012-04-04 14:41:08.281 -0500>,<Administrator>,<TOPSPIN>,<proc1d>,<TOPSPIN 2.1>,
      <abs ABSG = 2 
       data hash MD5: 128K
       61 BC 9A 4E C6 90 C7 EE 60 0C 74 E2 14 5A F5 C1>)
(   6,<2012-04-04 14:41:08.328 -0500>,<Administrator>,<TOPSPIN>,<proc1d>,<TOPSPIN 2.1>,
      <abs ABSG = 3 
       data hash MD5: 128K
       7A F0 E5 78 15 BF 3B 9E 3A BB 07 0E 78 ED ED 0E>)
(   7,<2012-04-04 14:41:08.375 -0500>,<Administrator>,<TOPSPIN>,<proc1d>,<TOPSPIN 2.1>,
      <abs ABSG = 4 
       data hash MD5: 128K
       F9 FA 97 3F CF A1 87 6D B9 A2 FD B1 F4 00 38 6D>)
(   8,<2012-04-04 14:41:08.437 -0500>,<Administrator>,<TOPSPIN>,<proc1d>,<TOPSPIN 2.1>,
      <abs ABSG = 5 
       data hash MD5: 128K
       92 81 D5 C8 FD 61 C2 DE D5 1A 06 19 92 80 0B A6>)
(   9,<2012-04-04 14:41:08.656 -0500>,<Administrator>,<TOPSPIN>,<audit>,<TOPSPIN 2.1>,
      <user comment:
       ICON-NMR User ID: COFFEE
       data hash MD5: 128K
$$ [...]
##$TP07= 0
##$TPNAME0= <>
##$TPNAME1= <>
##$TPNAME2= <>
##$TPNAME3= <>
##$TPNAME4= <>
##$TPNAME5= <>
##$TPNAME6= <>
##$TPNAME7= <>
##$TPOAL= (0..7)
0.5 0.5 0.5 0.5 0.5 0.5 0.5 0.5
##$TPOFFS= (0..7)
0 0 0 0 0 0 0 0
##$TUNHIN= 0
##$TUNHOUT= 0
##$TUNXOUT= 0
##$USERA1= <user>
##$USERA2= <user>
##$USERA3= <user>
##$USERA4= <user>
##$USERA5= <user>
##$V9= 5
##$VALIST= <valist>
##$VCLIST= <CCCCCCCCCCCCCCC>
##$VD= 0
##$VDLIST= <DDDDDDDDDDDDDDD>
##$VPLIST= <PPPPPPPPPPPPPPP>
##$VTLIST= <TTTTTTTTTTTTTTT>
##$WBST= 2048
##$WBSW= 25
##$XGAIN= (0..3)
0 0 0 0
##$XL= 0
##$YL= 0
##$YMAX_a= 14194763
##$YMIN_a= -6336196
##$ZGOPTNS= <>
##$ZL1= 120
##$ZL2= 120
##$ZL3= 120
##$ZL4= 120
##$ABSF1= 14.96869
##$ABSF2= -5.58384
##$ABSG= 5
##$ABSL= 3
##$ALPHA= 0
##$AQORDER= 0
##$ASSFAC= 0
##$ASSFACI= 0
##$ASSFACX= 0
##$ASSWID= 0
##$AUNMP= <proc_prof1d_extract.lims>
##$AXLEFT= 0
##$AXNAME= <>
##$AXNUC= <1H>
##$AXRIGHT= 0
##$AXTYPE= 0
##$AXUNIT= <>
##$AZFE= 0.1
##$AZFW= 0.1
##$BCFW= 0
##$BC_mod= 0
##$BYTORDP= 0
##$COROFFS= 0
##$CY= 15
##$DATMOD= 1
##$DC= 0
##$DFILT= <>
##$DTYPP= 0
##$F1P= 0
##$F2P= 0
##$FCOR= 0.5
##$FTSIZE= 131072
##$FT_mod= 6
##$GAMMA= 0
##$GB= 0
##$INTBC= 1
##$INTSCL= 1
##$ISEN= 128
##$LB= 0.3
##$LEV0= 0
##$LPBIN= 0
##$MAXI= 10000
##$MC2= 0
##$MEAN= 0
##$ME_mod= 0
##$MI= 0
##$NCOEF= 0
##$NC_proc= -3
##$NLEV= 6
##$NOISF1= 0
##$NOISF2= 0
##$NSP= 0
##$NTH_PI= 0
##$NZP= 0
##$OFFSET= 14.96869
##$PC= 1
##$PHC0= 32.36572
##$PHC1= 0
##$PH_mod= 1
##$PKNL= yes
##$PPARMOD= 0
##$PPDIAG= 0
##$PPIPTYP= 0
##$PPMPNUM= 2147483647
##$PPRESOL= 1
##$PSCAL= 4
##$PSIGN= 0
##$PYNMP= <proc.py>
##$REVERSE= no
##$SF= 400.130004770453
##$SI= 131072
##$SIGF1= 0
##$SIGF2= 0
##$SINO= 400
##$SIOLD= 131072
##$SPECTYP= <>
##$SREGLST= <1H.CDCl3>
##$SSB= 0
##$STSI= 131072
##$STSR= 0
##$SW_p= 8223.68421052632
##$SYMM= 0
##$S_DEV= 0
##$TDeff= 65536
##$TDoff= 0
##$TI= <>
##$TILT= no
##$TM1= 0
##$TM2= 0
##$TOPLEV= 0
##$USERP1= <user>
##$USERP2= <user>
##$USERP3= <user>
##$USERP4= <user>
##$USERP5= <user>
##$WDW= 1
##$XDIM= 131072
##$YMAX_p= 505070585
##$YMIN_p= -387412143
##$CURPLOT= <Network HP LaserJet P1505>
##$CURPRIN= <$Network HP LaserJet P1505>
##$DFORMAT= <normdp>
##$LAYOUT= <+/1D_H.xwp>
##$LFORMAT= <normlp>
##$PFORMAT= <normpl>
##$SURQMSG= 1
$$ End of Bruker specific parameters
$$ ---------------------------------
##NTUPLES= NMR SPECTRUM
##VAR_NAME=  FREQUENCY,     SPECTRUM/REAL,   SPECTRUM/IMAG
##SYMBOL=    X,             R,               I
##VAR_TYPE=  INDEPENDENT,   DEPENDENT,       DEPENDENT
##VAR_FORM=  AFFN,          ASDF,            ASDF
##VAR_DIM=   131072,        131072,          131072
##UNITS=     HZ,            ARBITRARY UNITS, ARBITRARY UNITS
##FACTOR=    0.0627417313425165, 1,          1
##FIRST=     8223.62146879498, 884,          -103258
##LAST=      0,             5066,            -102877
##MIN=       0,             -387412143,      0
##MAX=       8223.62146879498, 505070585,    0
$$ Real data points
##PAGE= N=1
##DATA TABLE= (X++(R..R)), XYDATA
$$ [...]
62880A700870j5847j4912j5337j5788j5540j5248j5654j6368j6250j4645j2096
62869A533185r953r218r588r830r246q490q719j0151j1636j1615r551o737n471
62856A412980o867r540j1011j0428r125q709r570j1245j2842j2893j0365o551
62844A293834m470n229o440n580l560l059m372n205m247k711k123k562l566n053
62830A235657o660p562p653p748q083p863o821n897n678n557n272n882p843r390
62816A137748q410n347k638j677j820k169k700l352l352k187n59K19n53k393l887
62801A096923l577j294J259J905K14k231l784m221m072l452k324j300j115j400
62787A071531r13Q24K735L393K499Q83m58q78p2J643L127L275K252J348J488K388
$$ plain form
62880 1700870 1685023 1670111 1654774 1638986 1623446 1608198 1592544 1576176 1559926 1545281 1533185
62869 1533185 1523232 1514014 1504426 1494596 1485350 1476860 1468141 1457990 1446354 1434739 1425188 1418451 1412980
62856 1412980 1406113 1396573 1385562 1375134 1366009 1357300 1347730 1336485 1323643 1310750 1300385 1293834
62844 1293834 1289364 1284135 1277695 1272115 1268555 1265496 1261124 1255919 1251672 1248961 1246838 1244276 1240710 1235657
62830 1235657 1228997 1221435 1213782 1206034 1197951 1190088 1183267 1177370 1171692 1166135 1160863 1154981 1147138 1137748
62816 1137748 1129338 1123991 1121353 1119676 1117856 1115687 1112987 1109635 1106283 1104096 1103537 1103756 1103203 1100810 1096923
62801 1096923 1093346 1092052 1093311 1095216 1095430 1093199 1089415 1085194 1081122 1077670 1075346 1074046 1072931 1071531
62787 1071531 1070618 1071442 1074177 1077570 1080069 1080952 1080494 1079616 1079544 1081187 1084314 1087589 1089841 1091189 1092677 1095065
62771A095065L211L405K679J130j69K34K227L624K717N02r02j361k384m023m292
62756A101663k276J38Q92N43J025K589L642L213K073J396J401J653J977K751M521
62741A127201P300J0161J1862J2154J2090J2710J3996J5499J7322J9757K2470
62730A282522K4872K7025K9472L2403L5660L9183M2822M5989M8337N0547N3697
62719A712529N8048O3127O8746P5001Q1509Q7617R3363R9275J05040J09276J10953
62708B664484J10345J08193J04537R8772R0555Q0245O8500N5483M0547K3052L632
62697C448345j5742l3372m8996o2938p4874q4261r1458r7239j01498j03525j03435
62686B631007j02256j00638r8477r5830r3068r0028q6042q0995p5417o9530o3299
$$ plain form
62771 1095065 1098276 1101681 1104360 1105490 1105321 1105555 1107782 1111406 1114123 1114625 1113723 1112362 1109978 1105955 1101663
62756 1101663 1099387 1099525 1100417 1100960 1101985 1104574 1108216 1111429 1113502 1114898 1116299 1117952 1119929 1122680 1127201
62741 1127201 1134501 1144662 1156524 1168678 1180768 1193478 1207474 1222973 1240295 1260052 1282522
62730 1282522 1307394 1334419 1363891 1396294 1431954 1471137 1513959 1559948 1608285 1658832 1712529
62719 1712529 1770577 1833704 1902450 1977451 2058960 2146577 2239940 2339215 2444255 2553531 2664484
62708 2664484 2774829 2883022 2987559 3086331 3176886 3257131 3325631 3381114 3421661 3444713 3448345
62697 3448345 3432603 3399231 3350235 3287297 3212423 3128162 3036704 2939465 2837967 2734442 2631007
62686 2631007 2528751 2428113 2329636 2233806 2140738 2050710 1964668 1883673 1808256 1738726 1675427
62675A675427n7387n2752m9061m5049m0745l7773l6598l5160l1416k6133k1704
62664A241649j9144j7599j6170j4725j3144j1089q640o185l683p72K405N153P067
62651A145123Q493J0256J3067J6845K0400K2503K3683K6054L0644L5889L9896
62640A392853M3220M7820N3930N9843O4706O9525P4968Q0071Q4084Q8136R3595
62629B152751R9578J03475J03709J00895R6423R0861Q3885P4943O3636M9948L4505
62618C054609J8373K222j4120l0967m7662o2647p4835q4531r2538r8693j01985
62607B467226j02299j01120j00038r9094r7212r3759q9104q3918p8786p4234p0377
62596A477285o6516o1936n7063n3033n0030m6992m3307l9740l7083l4780l1828
$$ plain form
62675 1675427 1618040 1565288 1516227 1471178 1430433 1392660 1356062 1320902 1289486 1263353 1241649
62664 1241649 1222505 1204906 1188736 1174011 1160867 1149778 1141138 1134953 1131270 1130498 1132903 1138056 1145123
62651 1145123 1153616 1163872 1176939 1193784 1214184 1236687 1260370 1286424 1317068 1352957 1392853
62640 1392853 1436073 1483893 1537823 1597666 1662372 1731897 1806865 1886936 1971020 2059156 2152751
62629 2152751 2252329 2355804 2459513 2560408 2656831 2747692 2831577 2906520 2970156 3020104 3054609
62618 3054609 3072982 3075204 3061084 3030117 2982455 2919808 2844973 2760442 2667904 2569211 2467226
62607 2467226 2364927 2263807 2163769 2064675 1967463 1873704 1784600 1700682 1621896 1547662 1477285
62596 1477285 1410769 1348833 1291770 1238737 1188707 1141715 1098408 1058668 1021585 986805 954977
62585I54977k8486k5900k4244k2500k0276j8621j8309j8200j6562j3584j1351
62574G36944j1128j1917j2199j2015j2193j2378j1332r023o939n989n457m582
62562F21792l931m162m508l763k216j301j454j535l73K067N117Q084J0242J1022
62548F35081J0592R753R072Q656Q778R983J2219J4565J6148J7033J7888J9315
62536G89083K1662K4995K8807L2188L4723L7099M0401M4910M9695N3432N5548
62525A212543N6569N7264N7425N5964N2368M7504M2294L6130K7635J6949O199
62514A668844k572r172j4771k0474k6678l2971l8081m0653m0702l9936m0075m1173
62502A321586m1913m1177l8922l5949l3283l1558l0685l0173k9768k9324k8219
$$ plain form
62585 954977 926491 900591 876347 853847 833571 814950 796641 778441 761879 748295 736944
62574 736944 725816 713899 701700 689685 677492 665114 653782 644759 637820 631831 626374 621792
62562 621792 617861 613699 609191 605428 603212 601911 600457 598922 598549 600616 605733 613817 624059 635081
62548 635081 645673 655426 664498 673154 681932 691915 704134 718699 734847 751880 769768 789083
62536 789083 810745 835740 864547 896735 931458 968557 1008958 1053868 1103563 1156995 1212543
62525 1212543 1269112 1326376 1383801 1439765 1492133 1539637 1581931 1618061 1645696 1662645 1668844
62514 1668844 1666272 1657100 1642329 1621855 1595177 1562206 1524125 1483472 1442770 1402834 1362759 1321586
62502 1321586 1279673 1238496 1199574 1163625 1130342 1098784 1068099 1037926 1008158 978834 950615
62491I50615k5740k2388j9844j9056j9048j8348j6899j5658j4862j3792j2171
62480G52809j0774j0394j0771j0808r597p147m333k032k53J621L684N160N629
62467G02794N940P206R299J1061J1863J2179J2705J3699J5269J7618K0607K3540
62455H63780K5806K7649K9992L3322L6923L9594M1362M3839M8228N3361N6895
62444A300751N8221N8788N9235N7974N3583M7045M0198L3158K4997J6104P809
62433A757863P9q443j7994k7149l4841m1242m6242m8901m9118m8332m7734m7068
62421A340878m5901m4615m3190m0459l5946l1347k8559k7019k4625k0918j7700
62410I80599j6363j6054j4892j2081q373n117l172k390j806n61J370L568N913
$$ plain form
62491 950615 924875 902487 882643 863587 844539 826191 809292 793634 778772 764980 752809
62480 752809 742035 731641 720870 710062 700465 693318 688985 686953 686700 688321 692005 697165 702794
62467 702794 708734 715940 725239 736300 748163 760342 773047 786746 802015 819633 840240 863780
62455 863780 889586 917235 947227 980549 1017472 1057066 1098428 1142267 1190495 1243856 1300751
62444 1300751 1358972 1417760 1476995 1534969 1588552 1635597 1675795 1708953 1733950 1750054 1757863
62433 1757863 1757942 1749499 1731505 1704356 1669515 1628273 1582031 1533130 1484012 1435680 1387946 1340878
62421 1340878 1294977 1250362 1207172 1166713 1130767 1099420 1070861 1043842 1019217 998299 980599
62410 980599 964236 948182 933290 921209 912836 907719 904547 902157 900351 899790 901160 904728 910641
62397I10641Q479J0800J2078J2211J2057J2418J3149J3608J3611J3543J3669J3778
62385A060042J3589J3144J2420J0784P463K712k120o088r624j3488j7293k0023
62373A051518k1637k2956k4078k4155k3038k1819k1251k0775j9689j8247j6794
62362H17079j4869j2232r759q227o941m862k474j133r06m60R47K694M134N521
62348G68512P262R193J0914J2121J2504J1985J1243J1213J1885J2232J1439R649
62336I00152P477N456L930K791J267j247m125o010o336n635m468l036j736r69
62322H87511l06J002K674L879N101P828J1925J5260J6905J8844K3002K8183L1979
62309A053787L4510L7921M2849M7859N2341N7531O4002P0298P4974P8356Q1177
$$ plain form
62397 910641 919120 929920 941998 954209 966266 978684 991833 1005441 1019052 1032595 1046264 1060042
62385 1060042 1073631 1086775 1099195 1109979 1117442 1120154 1118034 1111946 1102322 1088834 1071541 1051518
62373 1051518 1029881 1006925 982847 958692 935654 913835 892584 871809 852120 833873 817079
62362 817079 802210 789978 780219 771992 765051 760189 757715 756582 755676 755216 756163 758857 762991 768512
62348 768512 775774 784967 795881 808002 820506 832491 843734 854947 866832 879064 890503 900152
62336 900152 907629 913085 917015 919806 921073 919826 915701 909691 903355 897720 893252 890216 888480 887511
62322 887511 887205 888207 890881 894760 899861 907689 919614 934874 951779 970623 993625 1021808 1053787
62309 1053787 1088297 1126218 1169067 1216926 1269267 1326798 1390800 1461098 1536072 1614428 1695605
62298A695605Q2924Q2854Q1455P9348P5584O8660N8931M8447L8437K8329J7504
62287B358078O762k606j0429j7691k5374l3667m1798m8443n2720n5140n7060n8981
62275A960931n9980n9274n7502n5707n3750n0846m7375m4911m4269m4517m4187
62264A398613m2588l9653l5544l1049k7522k5603k4424k2724k0330j8019j6358
62253A094799j5422j5085j4871j3917j1968j0091r552j0259j1191j2041j3185
62242I57217j4246j4039j2311j0313r142q455p425o108n072m297l144j229J162
62229H62598L292M422M451M324N252P336R437J0743J1749J3322J5431J7332J8620
62216I88309J9625K1111K3671K7033K9833L0888L0829L1600L3986L6778L8809
$$ plain form
62298 1695605 1778529 1861383 1942838 2022186 2097770 2166430 2225361 2273808 2312245 2340574 2358078
62287 2358078 2364840 2362234 2351805 2334114 2308740 2275073 2233275 2184832 2132112 2076972 2019912 1960931
62275 1960931 1900951 1841677 1784175 1728468 1674718 1623872 1576497 1531586 1487317 1442800 1398613
62264 1398613 1356025 1316372 1280828 1249779 1222257 1196654 1172230 1149506 1129176 1111157 1094799
62253 1094799 1079377 1064292 1049421 1035504 1023536 1013445 1003893 993634 982443 970402 957217
62242 957217 942971 928932 916621 906308 897166 888711 881286 875178 870106 865809 862665 861436 862598
62229 862598 865890 870312 874763 879087 884339 891675 901112 911855 923604 936926 952357 969689 988309
62216 988309 1007934 1029045 1052716 1079749 1109582 1140470 1171299 1202899 1236885 1273663 1312472
62205A312472M0585M3038M5972M8958N2722N7976O3573O7534O9638P1387P3434
62194A947289P4655P3855P0871O5563N7306M6228L3900K1927J0603m74j1155k0871
62182B369697k9520l7616m5771n4113o1809o7142o8832o7573o5560o4131o2602
62171A745028n9743n5549n0951m6600m2694l9439l6781l3993l0392k6313k2763
62160A299810k0113j7876j5662j3771j2646j2223j2031j1637j0790r300p077m462
62148A152222k310j446j734j936q36J543M206O417Q181R617J0686J1738J3492
62135A209840J5993J8209J9238J9562K0606K3300K7378L1628L4451L4749L2935
62124A487889L0764K9616K9194K8396K6917K5204K3331K1069J9104J8967K1349
$$ plain form
62205 1312472 1353057 1396095 1442067 1491025 1543747 1601723 1665296 1732830 1802468 1873855 1947289
62194 1947289 2021944 2095799 2166670 2232233 2289539 2335767 2369667 2391594 2402197 2401723 2390568 2369697
62182 2369697 2340177 2302561 2256790 2202677 2140868 2073726 2004894 1937321 1871761 1807630 1745028
62171 1745028 1685285 1629736 1578785 1532185 1489491 1450052 1413271 1379278 1348886 1322573 1299810
62160 1299810 1279697 1261821 1246159 1232388 1219742 1207519 1195488 1183851 1173061 1163761 1156684 1152222
62148 1152222 1149912 1148466 1146732 1144796 1143960 1145503 1149709 1156126 1164307 1173924 1184610 1196348 1209840
62135 1209840 1225833 1244042 1263280 1282842 1303448 1326748 1354126 1385754 1420205 1454954 1487889
62124 1487889 1518653 1548269 1577463 1605859 1632776 1657980 1681311 1702380 1721484 1740451 1761800
62113A761800K5272K9407L3443L7626M1670M5033M7907N0998N4203N6254N5980
62102B239593N3514M9956M6107M1811L6435K9752K2457J5953J1337Q285N125L60
62090B560685n797j1703j6029j8816k0881k2734k4368k5525k5722k4471k2094
62079B342545k0077j9863k1333k2985k3657k3498k3161k2728k1811k0388j9008
62068B104036j8152j7503j6040j3090r366o510n244m444k632O2K414M195O516
62055B024242R803J2798J4351J5211J6938J9544K1470K1918K2155K4016K7643
62044B230089L1321L3515L4644L6434L9695M3387M6178M8235N0731N4065N7721
62033B706015O1625O6327P1444P5191P6155P4733P2361P0296O9719P1785P6401
$$ plain form
62113 1761800 1787072 1816479 1849922 1887548 1929218 1974251 2022158 2073156 2127359 2183613 2239593
62102 2239593 2293107 2343063 2389170 2430981 2467416 2497168 2519625 2535578 2546915 2555200 2560325 2560685
62090 2560685 2554888 2543185 2527156 2508340 2487459 2464725 2440357 2414832 2389110 2364639 2342545
62079 2342545 2322468 2302605 2281272 2258287 2234630 2211132 2187971 2165243 2143432 2123044 2104036
62068 2104036 2085884 2068381 2052341 2039251 2029885 2023375 2018131 2013687 2011055 2011117 2013531 2017726 2024242
62055 2024242 2034045 2046843 2061194 2076405 2093343 2112887 2134357 2156275 2178430 2202446 2230089
62044 2230089 2261410 2294925 2329569 2366003 2405698 2449085 2495263 2543498 2594229 2648294 2706015
62033 2706015 2767640 2833967 2905411 2980602 3056757 3131490 3203851 3274147 3343866 3415651 3492052
62022C492052Q1636Q5381Q7203Q7698Q6798Q3892P9236P4142O9947O7597O7724
62011D363306O9932P2453P3737P4305P5890P8884Q1861Q3518Q3750Q2744Q0334
62000E220714P6684P2425O7753O2316N6388N1006M6557M2202L7238L2149K7737
61989E793169K4071K0920J8462J6985J6525J7206J9231K2113K4771K7000K9912
61978F030365L4130L8385M0809M1194M1117M2241M5161M9332N3262N5227N4687
61967F525910N2915N1549N0835M9933M8452M6718M4744M1984L8197L3874K9638
61956G014749K5844K2635J9845J6785J2861Q540N175L594L104K132k46l430n829
61943G125759o420n729n038m782m368l584l125l221k833j249L28P9j976m078m990
$$ plain form
62022 3492052 3573688 3659069 3746272 3833970 3920768 4004660 4083896 4158038 4227985 4295582 4363306
62011 4363306 4433238 4505691 4579428 4653733 4729623 4808507 4890368 4973886 5057636 5140380 5220714
62000 5220714 5297398 5369823 5437576 5499892 5556280 5607286 5653843 5696045 5733283 5765432 5793169
61989 5793169 5817240 5838160 5856622 5873607 5890132 5907338 5926569 5948682 5973453 6000453 6030365
61978 6030365 6064495 6102880 6143689 6184883 6226000 6268241 6313402 6362734 6415996 6471223 6525910
61967 6525910 6578825 6630374 6681209 6731142 6779594 6826312 6871056 6913040 6951237 6985111 7014749
61956 7014749 7040593 7063228 7083073 7099858 7112719 7121259 7126434 7130028 7133132 7135264 7135018 7131588 7125759
61943 7125759 7119339 7113610 7108572 7103790 7099422 7095838 7092713 7089492 7086659 7085410 7085738 7085817 7083841 7079763 7074773
61928G074773m913m268l037j626r93j354j720j282m08L12J175K807N015O851P486
61913G078818O664M791K915K038J949J169j449n448r495j2842j5558j7803j9696
61900G016053k1721k4563k8309l2113l4822l6049l6744l8430m1443m4120m4532
61889F633207m2855m1086m0158l8737l5511l1358k7982k5338k1985j7612j3527
61878F297058j0510p554l269K420Q499J4096J9128K4227L0184L7154M4346N1119
61866F506898N8217O7036P7705Q8922R9809J10822J22535J34819J47867J62754
61856G577384J79903J98116K16604K37191K62809K93997L28589L65100M04828
61847A0064521M50037N01449N58412O20348O86719P56150Q26701Q96364R61754
$$ plain form
61928 7074773 7069860 7065592 7062555 7060929 7059936 7058582 7056862 7055580 7055172 7055484 7056659 7059466 7064481 7071332 7078818
61913 7078818 7085482 7090273 7093188 7095226 7097175 7098344 7096895 7091447 7081952 7069110 7053552 7035749 7016053
61900 7016053 6994332 6969769 6941460 6909347 6874525 6838476 6801732 6763302 6721859 6677739 6633207
61889 6633207 6590352 6549266 6509108 6470371 6434860 6403502 6375520 6350182 6328197 6310585 6297058
61878 6297058 6286548 6278994 6275725 6278145 6286644 6300740 6319868 6344095 6374279 6411433 6455779 6506898
61866 6506898 6565115 6632151 6709856 6798778 6898587 7009409 7131944 7266763 7414630 7577384
61856 7577384 7757287 7955403 8172007 8409198 8672007 8966004 9294593 9659693 10064521
61847 10064521 10514558 11016007 11574419 12194767 12881486 13637636 14464337 15360701 16322455
61838A6322455J016106J049621J052134J014866R30319P93353O05072L76072J24922
61829B3284920j27277l61742n64257p26284q45711r25828r72330r90902r87126
61820A6783463r66998r36038q98013q55176q09355p61924p13266o63621o14540
61811I564532n68285n25507m84826m45169m07458l73056l41628l11814k83433
61802E823356k57618k34885k14418j95427j78098j62753j49059j36638j25603
61793D168857j15734j05764r4599q3046p3330o6599o1650n6467n0500m4899m0843
61782C375426l8176l5754l2608k8659k4533k0979j8268j5971j3439j0557p858
61771C128624n762l908j533J621N056Q028R957J0606J0400J0618J2544J6208K0337
$$ plain form
61838 16322455 17338561 18388182 19440316 20455182 21385501 22178854 22783926 23159998 23284920
61829 23284920 23157643 22795901 22231644 21505360 20659649 19733821 18761491 17770589 16783463
61820 16783463 15816465 14880427 13982414 13127238 12317883 11555959 10842693 10179072 9564532
61811 9564532 8996247 8470740 7985914 7540745 7133287 6760231 6418603 6106789 5823356
61802 5823356 5565738 5330853 5116435 4921008 4742910 4580157 4431098 4294460 4168857
61793 4168857 4053123 3947359 3852760 3769714 3696384 3629785 3568135 3511668 3461168 3416269 3375426
61782 3375426 3337250 3301496 3268888 3240229 3215696 3194717 3176449 3160478 3147039 3136482 3128624
61771 3128624 3122862 3118954 3117421 3119042 3124098 3132126 3142083 3152689 3163089 3173707 3186251 3202459 3222796
61758C222796K3780K6570K9406L2709L6518M0796M5316M9669N3998N9288O6349
61747C687195P4739Q3211R1103R8702J06590J15290J25303J36753J49018J61382
61737D829286J73981J87419K01594K15780K30003K45457K63284K83620L06044
61728F936468L30247L56072L83696M14130M48735M87826N30531N76580O27516
61719A1091801O85518P51701Q26329R09933J003183J105958J217444J336676J461841
61710B0390384J588765J710759J819559J905195J954485J950842J876895J718465
61702C4915349J468356J130046P20708K70710j82524o03857r67634j259810j476505
61693C4014839j621776j705324j739351j735182j701649j645922j574856j494842
$$ plain form
61758 3222796 3246576 3273146 3302552 3335261 3371779 3412575 3457891 3507560 3561558 3620846 3687195
61747 3687195 3761934 3845145 3936248 4034950 4141540 4256830 4382133 4518886 4667904 4829286
61737 4829286 5003267 5190686 5392280 5608060 5838063 6083520 6346804 6630424 6936468
61728 6936468 7266715 7622787 8006483 8420613 8869348 9357174 9887705 10464285 11091801
61719 11091801 11777319 12529020 13355349 14265282 15268465 16374423 17591867 18928543 20390384
61710 20390384 21979149 23689908 25509467 27414662 29369147 31319989 33196884 34915349
61702 34915349 36383705 37513751 38234459 38505169 38322645 37718788 36751154 35491344 34014839
61693 34014839 32393063 30687739 28948388 27213206 25511557 23865635 22290779 20795937
61685B0795937j410649j325106j239902j156286j075055r96494r20480q46651
61677A1825314p74998p06926o45102n91006n42756m96815m52061m10740l74773
61668F830137l42853l12535k83877k59059k38838k21242k04012j86954j71410
61659D609357j58420j47828j38491j28947j18403j07363r7053q8248q0942p4828
61649C468834o9453o4123n8491n3164m8929m5460m1664l7457l4212l3142l3860
61638B948879l4893l5215l5042l5440l7059l8923l8987l6578l3848l3530l5502
61627B553862l6970l6228l4617l4151l4695l4635l3379l1809l0737l0011k9113
61616B187517k7822k6181k4254k1926j8944j5487j2603j1283j0942r738p006m481
$$ plain form
61685 20795937 19385288 18060182 16820280 15663994 14588939 13592445 12671965 11825314
61677 11825314 11050316 10343390 9698288 9107282 8564526 8067711 7615650 7204910 6830137
61668 6830137 6487284 6174749 5890872 5631813 5392975 5171733 4967721 4780767 4609357
61659 4609357 4450937 4303109 4164618 4035671 3917268 3809905 3712852 3624604 3543662 3468834
61649 3468834 3399381 3335258 3276767 3223603 3174674 3129214 3087550 3050093 3015881 2982739 2948879
61638 2948879 2913986 2878771 2843729 2808289 2771230 2732307 2693320 2656742 2622894 2589364 2553862
61627 2553862 2516892 2480664 2446047 2411896 2377201 2342566 2309187 2277378 2246641 2216630 2187517
61616 2187517 2159695 2133514 2109260 2087334 2068390 2052903 2040300 2029017 2018075 2008337 2001331 1996850
61604A996850m322o398q334p932n014j346P37K03j546j876J14K458K777J159m17
61589A967113p95n34m02m13n31j123k320l688m807n546n631m737l281k425k912
61574A927968m244n289n320m316k712j162j77K60N71J036J554J957K257K595L115
61559A918093L825M420M408L760L191L362L974M132L573K970K983L445L655L243
61545A969034K588K510L325M147L575J469n44j054q23j789m284o528p107o718
61531A957801o828p474p342n691l300j596j321k051k631j955L53L865P808J1457
61517A941095J4245J6016J7466J9891K3984K8947L3304L6572L9659M3432M7462
61506B262073N0736N3202N5742N8489O0177N9798N8135N6695N5632N3916N1373
$$ plain form
61604 1996850 1992528 1986130 1977796 1969864 1964850 1963504 1964241 1964444 1962898 1961022 1961136 1963594 1966371 1967530 1967113
61589 1967113 1966318 1965784 1965382 1964969 1964438 1963315 1960995 1957307 1952500 1946954 1941323 1936586 1933305 1930880 1927968
61574 1927968 1923724 1918435 1913115 1908799 1906087 1904925 1904748 1905008 1905579 1906615 1908169 1910126 1912383 1914978 1918093
61559 1918093 1921918 1926338 1930746 1934506 1937697 1941059 1945033 1949165 1952738 1955708 1958691 1962136 1965791 1969034
61545 1969034 1971622 1974132 1977457 1981604 1985179 1986648 1986104 1985050 1984227 1982438 1978154 1971626 1964519 1957801
61531 1957801 1950973 1943499 1936157 1930466 1927166 1925570 1924249 1922198 1919567 1917612 1917965 1921830 1929638 1941095
61517 1941095 1955340 1971356 1988822 2008713 2032697 2061644 2094948 2131520 2171179 2214611 2262073
61506 2262073 2312809 2366011 2421753 2480242 2540419 2600217 2658352 2715047 2770679 2824595 2875968
61495B875968M9167M7979M7017M5330M2951M0121L6532L2252K8218K4722K0392
61484C290649J4010O710Q08l043o133r399j2412j4632j6222j7467j8329j8741
61472C195799j8401j6550j3007r105o260l879k56M666R303J3225J7947K4474L2039
61459C229995L9940M8654N8166O7187P5381Q4639R6525J09894J22811J35598J50086
61448D218876J66784J84791K03887K24775K47424K70882K94620L18449L41243
61439F471731L61081L76739L87582L91946L86914L69842L39162K94275K36525
61430I615797J70486J02482L7090k3954p9499j27515j66603j97248k20388k35900
61420H874748k43670k45093k42124k35494k25229k12381j98708j84574j68609
$$ plain form
61495 2875968 2925135 2973114 3020131 3065461 3108412 3148533 3185065 3217317 3245535 3270257 3290649
61484 3290649 3304659 3311369 3312177 3309134 3303001 3293602 3281190 3266558 3250336 3232869 3214540 3195799
61472 3195799 3177398 3160848 3147841 3138736 3132476 3128597 3128341 3133007 3142310 3155535 3173482 3197956 3229995
61459 3229995 3269935 3318589 3376755 3443942 3519323 3603962 3700487 3810381 3933192 4068790 4218876
61448 4218876 4385660 4570451 4774338 4999113 5246537 5517419 5812039 6130488 6471731
61439 6471731 6832812 7209551 7597133 7989079 8375993 8745835 9084997 9379272 9615797
61430 9615797 9786283 9888765 9925855 9901901 9822402 9694887 9528284 9331036 9110648 8874748
61420 8874748 8631078 8385985 8143861 7908367 7683138 7470757 7272049 7087475 6918866
61411F918866j49969j29884j10382r2045p3819n4666l4740j5013L528K0080L4060
61400F316016M5504N5279O4249P2275P8490Q2576Q5137Q6664Q6875Q5546Q3346
61389G141957Q1237P9528P8249P7905P8903Q0470Q1189Q0693P9956P9696P9403
61378H019186P8202P5903P2538O7553O0360N1556M2761L4978K7488J8897R024
61367H558446r00j0044j9135k8977l8393m5030m8307n0116n2068n3393n2518m9466
61355H110099m5337m0508l4933k9473k4981k0465j4123o406j87K471K148M18k019
61342G896704m884p639j0148j2799j5183j5838j4063j0743o491k93Q985K0996
61330G828604L5003N1412P0712R1874J13552J36320J62067J91255K22257K53317
$$ plain form
61411 6918866 6768897 6639013 6528631 6436586 6362767 6308101 6273361 6258348 6261876 6281956 6316016
61400 6316016 6361520 6416799 6481048 6553323 6631813 6714389 6799526 6886190 6973065 7058611 7141957
61389 7141957 7223194 7302722 7380971 7458876 7537779 7618249 7699438 7780131 7860087 7939783 8019186
61378 8019186 8097388 8173291 8245829 8313382 8373742 8425298 8468059 8503037 8530525 8549422 8558446
61367 8558446 8557546 8547502 8528367 8499390 8460997 8415967 8367660 8317544 8265476 8212083 8159565 8110099
61355 8110099 8064762 8024254 7989321 7959848 7934867 7914402 7900279 7893873 7893686 7896157 7898305 7898723 7896704
61342 7896704 7891820 7884181 7874033 7861234 7846051 7830213 7816150 7805407 7798916 7798623 7807608 7828604
61330 7828604 7863607 7915019 7985731 8077605 8191157 8327477 8489544 8680799 8903056 9156373
61320I156373K83902L13953L42863L69403L91913M08474M17472M17619M06922
61311A2508894L82411L42336K88577K25813J58492Q9548K1597m2629j01624j55599
61301A3717816k04996k49331k87941l20829l48169l69666l84994l94282l97778
61292A0759830l95748l89132l79518l67814l53529l36133l16528k96245k75519
61283G649664k53302k29392k05610j84156j65085j46190j25562j03757q2990o4615
61273F089005m8083l2324j7078k515J1550K5199L7759M8389N6994O3789O8400
61262F301085P0453P0790P0951P1345P0901O8694O5036O0779N6337N1779M7152
61251G005302M2405L7502L2694K8188K3463J7590J0267K000o639j5313k3661l1699
$$ plain form
61320 9156373 9440275 9754228 10097091 10466494 10858407 11266881 11684353 12101972 12508894
61311 12508894 12891305 13233641 13522218 13748031 13906523 13996071 14017668 13975039 13873415 13717816
61301 13717816 13512820 13263489 12975548 12654719 12306550 11936884 11551890 11157608 10759830
61292 10759830 10364082 9974950 9595432 9227618 8874089 8537956 8221428 7925183 7649664
61283 7649664 7396362 7166970 6961360 6777204 6612119 6465929 6340367 6236610 6153620 6089005
61273 6089005 6040922 6008598 5991520 5989005 6000555 6025754 6063513 6111902 6168896 6232685 6301085
61262 6301085 6371538 6442328 6513279 6584624 6655525 6724219 6789255 6850034 6906371 6958150 7005302
61251 7005302 7047707 7085209 7117903 7146091 7169554 7187144 7197411 7199411 7192772 7177459 7153798 7122099
61239G122099m0163m9397n8191o5023p0392p6169q2550q7541r0046r1448r3074
61228F318105r3926r2418q8812q4244p8647p1574o4127n8002n3073m7805m1779
61217E543698l6137l1738k8601k7057k7615k9458l0713l0536k9722k8985k8129
61206E215007k7081k6144k4701k1187j5143q148j936L415Q917J5507K4092L5457
61194E178055M9129O3247P6683R0508J06333J23847J41002J56040J68290J77314
61184F330448J82330J82421J76436J62808J40215J08590O9263K4533k2515o8343
61174G286186j10041j46103j75883j98751k14297k22925k25566k23303k17738
61165E551579k10954k03860j95090j82922j68331j54702j44229j35831j27184
$$ plain form
61239 7122099 7081936 7032539 6974348 6909325 6838933 6762764 6680214 6592673 6502627 6411179 6318105
61228 6318105 6224179 6131761 6042949 5958705 5880058 5808484 5744357 5686355 5633282 5585477 5543698
61217 5543698 5507561 5475823 5447222 5420165 5392550 5363092 5332379 5301843 5272121 5243136 5215007
61206 5215007 5187926 5161782 5137081 5115894 5100751 5092603 5090667 5094082 5102999 5118506 5142598 5178055
61194 5178055 5227184 5290431 5367114 5457622 5563955 5687802 5828804 5984844 6153134 6330448
61184 6330448 6512778 6695199 6871635 7034443 7174658 7283248 7352511 7377044 7354529 7286186
61174 7286186 7176145 7030042 6854159 6655408 6441111 6218186 5992620 5769317 5551579
61165 5551579 5340625 5136765 4941675 4758753 4590422 4435720 4291491 4155660 4028476
61156D028476j17635j08102r9012q9674p9625o9470o0092n1718m4158l7411l1469
61145C240110k5663j9007j1416m202J048M032N883P930J0644J3552J5670J6024
61133C254605J4329J1315P876L929j182p093j2239j5701j8321k1241k4254k6591
61121C165432k8579l1101l3789l5226l5064l4593l4905l5708l6331l6898l7777
61110B785461l8720l9318l9724m0270m0891m1478m2414m4079m6155m7909m8943
61099B315560m9269m8999m8319m7445m6234m4390m2405m1627m2555m3705m3196
61088A817416m1214l9761l9965m0703m0206l7963l4613l0812k7027k3805k1363
61077A439984j9091j6176j2759r887q244p360o174m055j134K060N079P761J0091
$$ plain form
61156 4028476 3910841 3802739 3703727 3614053 3534428 3464958 3404866 3353148 3308990 3271579 3240110
61145 3240110 3214447 3195440 3184024 3179822 3180870 3184902 3190785 3198715 3209359 3222911 3238581 3254605
61133 3254605 3268934 3280249 3288125 3292054 3290872 3283779 3271540 3255839 3237518 3216277 3192023 3165432
61121 3165432 3136853 3105752 3071963 3036737 3001673 2967080 2932175 2896467 2860136 2823238 2785461
61110 2785461 2746741 2707423 2667699 2627429 2586538 2545060 2502646 2458567 2412412 2364503 2315560
61099 2315560 2266291 2217292 2168973 2121528 2075294 2030904 1988499 1946872 1904317 1860612 1817416
61088 1817416 1776202 1736441 1696476 1655773 1615567 1577604 1542991 1512179 1485152 1461347 1439984
61077 1439984 1420893 1404717 1391958 1382071 1373827 1366467 1360293 1356238 1355104 1357164 1362243 1370004 1380095
61064A380095J1933J2963J3098J2875J3127J4105J5190J5638J5587J5981J7472
61053A538064J9523K0752K0257J8670J7762J8683K0453K0585J7641J2957R245
61042A734592P568O475M354J601l26j204k083l315m095m272n203p811j0930j2702
61028A702649j3024j3378j4624j6233j7605j8769j9530j9167j7581j5835j4891
61017A522012j4497j3937j3189j2735j2667j2646j2274j1133r076o933o149o913
61005A389863p537o622m999m283m325l762k538j844j615l10K234L961L685L075
60991A364983M006N544N556M268L914N339P073P933Q580J0007J2103J4390J6968
60978A470664J9845K2283K3655K4382K5457K7437L0304L3682L6811L8895M0013
$$ plain form
61064 1380095 1392028 1404991 1418089 1430964 1444091 1458196 1473386 1489024 1504611 1520592 1538064
61053 1538064 1557587 1578339 1598596 1617266 1635028 1653711 1674164 1694749 1712390 1725347 1734592
61042 1734592 1742160 1748635 1752989 1754590 1754264 1753060 1750977 1747662 1743567 1739295 1734092 1726281 1715351 1702649
61028 1702649 1689625 1676247 1661623 1645390 1627785 1609016 1589486 1570319 1552738 1536903 1522012
61017 1522012 1507515 1493578 1480389 1467654 1454987 1442341 1430067 1418934 1409858 1402925 1396776 1389863
61005 1389863 1382326 1375704 1370705 1366422 1362097 1358335 1355797 1353953 1352338 1352028 1354262 1358223 1361908 1364983
60991 1364983 1368989 1374533 1380089 1384357 1388271 1393610 1400683 1408616 1417196 1427203 1439306 1453696 1470664
60978 1470664 1490509 1512792 1536447 1560829 1586286 1613723 1644027 1677709 1714520 1753415 1793428
60967A793428M1237M3360M5845M7450M7643M7045M6706M7267M8752N1033N4358
60956B314124N9095O4713O9666P3142P6657Q2711R1723J01418J09602J16591J24323
60945C283765J33964J45160J57046J69067J80968J92560K03684K14458K25918
60936D906590K40107K58811K82028L08252L36282L65938L97177M29673M63627
60927G988485N00067N40433N87109O44366P17070Q08049R18307J050022J207292
60918A4961200J393371J609309J855855K134472K446873K795589L176619L549843
60910C3923131L804359L775842L346061K558414J631440Q36130L43508J74377
60902E0393262K58330M93984P41720Q07643N09134j99425j165907k122522k844182
$$ plain form
60967 1793428 1834665 1878025 1923870 1971320 2018963 2066008 2112714 2159981 2208733 2259766 2314124
60956 2314124 2373219 2437932 2507598 2580740 2657397 2740108 2831831 2933249 3042851 3159442 3283765
60945 3283765 3417729 3562889 3719935 3889002 4069970 4262530 4466214 4680672 4906590
60936 4906590 5146697 5405508 5687536 5995788 6332070 6698008 7095185 7524858 7988485
60927 7988485 8488552 9028985 9616094 10260460 10977530 11785579 12703886 13753908 14961200
60918 14961200 16354571 17963880 19819735 21954207 24401080 27196669 30373288 33923131
60910 33923131 37727490 41503332 44849393 47407807 49039247 49875377 50218885 50393262
60902 50393262 50651592 51145576 51887296 52694939 53204073 53004648 51838741 49716219 46872037
60893D6872037l248398l377773l321145l156270k937935k703713k475175k258725
60885B3392903k053048j857308j672969j501870j345627j205765j082670r74923
60877A1698723q80339p96771p21686o52688n89358n33118m84444m41505m02339
60868F196475l66727l34828l05651k78551k54947k36666k23180k12192k02297
60859C781436j93356j84506j73817j60496j46257j33762j24165j16451j08828
60850B439798j00676r3071q7217q2489p6948o9982o3273n8518n5242n1869m7938
60839A652575m4017m0240l6382l2944l0664k9082k6861k3550k0012j7141j5094
60828A336588j3669j2527j1207r682q642q319p541n193k163l83r0L38J752L145
$$ plain form
60893 46872037 43623639 40245866 36924721 33768451 30830516 28126803 25651628 23392903
60885 23392903 21339855 19482547 17809578 16307708 14962081 13756316 12673646 11698723
60877 11698723 10818384 10021613 9299927 8647239 8057881 7524763 7040319 6598814 6196475
60868 6196475 5829748 5494920 5189269 4910718 4655771 4419105 4195925 3983733 3781436
60859 3781436 3588080 3403574 3229757 3069261 2923004 2789242 2665077 2548626 2439798
60850 2439798 2339122 2246051 2158834 2076345 1999397 1929415 1866142 1807624 1752382 1700513 1652575
60839 1652575 1608558 1568318 1531936 1498992 1468328 1439246 1412385 1388835 1368823 1351682 1336588
60828 1336588 1322919 1310392 1299185 1289503 1280861 1272542 1265001 1259808 1257645 1257262 1257172 1257510 1259262 1262407
60814A262407L661M138N751Q227J0352J1455J1617J0985R716Q258P099O311N592
60801A365569M546K969J247K16M1n40k891o482r178r576q092n756l304j667j761
60786A325341k907k698L80M971Q494J0090J0884J1830J2585J2410J1304R979R226
60773A421889R354R995J0690J1655J3497J5886J7338J6898J5407J4404J4328J4639
60761A585980J5162J6202J7440J7824J6857J5290J4218J3926J3908J3623J2904
60750A753334J1773J0055P404L917O41j024p00M14N83j210n062j0340j5667j9362
60736A734756k0811k1056k1424k2027k2239k2100k2126k1922k0398j7471j4503
60725A508679j2566j1137r005n820k239Q78K941L868M369N560P854J0632J3261
$$ plain form
60814 1262407 1266068 1270206 1275957 1284184 1294536 1305991 1317608 1328593 1338309 1346567 1353666 1359977 1365569
60801 1365569 1370115 1373084 1374331 1374547 1374588 1374048 1371157 1364675 1355497 1345921 1337829 1332073 1328769 1327102 1325341
60786 1325341 1322434 1319736 1320116 1325087 1333581 1343671 1354555 1366385 1378970 1391380 1402684 1412663 1421889
60773 1421889 1431243 1441238 1451928 1463583 1477080 1492966 1510304 1527202 1542609 1557013 1571341 1585980
60761 1585980 1601142 1617344 1634784 1652608 1669465 1684755 1698973 1712899 1726807 1740430 1753334
60750 1753334 1765107 1775162 1782566 1786483 1787124 1786100 1785400 1785814 1786397 1785187 1780125 1769785 1754118 1734756
60736 1734756 1713945 1692889 1671465 1649438 1627199 1605099 1582973 1561051 1540653 1523182 1508679
60725 1508679 1496113 1484976 1475971 1470151 1467912 1468790 1471731 1475599 1479968 1485528 1493382 1504014 1517275
60712A517275J5773J8077J9370J9316J9133K0251K2058K2365K0321J7585J6064
60701A727588J5594J4661J2583R906P245M903L506L806N585P578Q907R960J1464
60688A843286J3267J4586J5143J5478J6068J6549J6018J4077J1473R420Q263P151
60676B000779N397L664L056L244K555Q0l142n476o303n969n072m612n883r028
60662A973290j2183j3223j2171j0915j0758j1382j2071j2675j3094j3029j2734
60651A839055j3063j4170j4963j4567j3682j3727j5041j6674j7696j8045j8109
60640A669318j8040j7597j6445j4531j2251j0106q216o354m424k541o09J710M407
60627A564321O858Q456R047Q659P225N025K839J158n22l070o538j0106j3118j5635
$$ plain form
60712 1517275 1533048 1551125 1570495 1589811 1608944 1629195 1651253 1673618 1693939 1711524 1727588
60701 1727588 1743182 1757843 1770426 1780332 1787577 1792480 1795986 1799792 1805377 1812955 1821862 1831822 1843286
60688 1843286 1856553 1871139 1886282 1901760 1917828 1934377 1950395 1964472 1975945 1985365 1993628 2000779
60676 2000779 2006176 2009840 2012896 2016140 2018695 2018775 2015633 2010157 2003854 1997885 1992813 1988201 1982318 1973290
60662 1973290 1961107 1947884 1935713 1924798 1914040 1902658 1890587 1877912 1864818 1851789 1839055
60651 1839055 1825992 1811822 1796859 1782292 1768610 1754883 1739842 1723168 1705472 1687427 1669318
60640 1669318 1651278 1633681 1617236 1602705 1590454 1580348 1572132 1565778 1561354 1558813 1558204 1559914 1564321
60627 1564321 1571179 1579635 1588682 1597341 1604566 1609591 1612430 1613588 1613066 1609996 1603458 1593352 1580234 1564599
60613A564599j7898j9668k0374j9826j8673j8097j8825k0257k0715j8877j5101
60602A356288j1080q221o509n131l946l859n499p841q908p943o261n343m730k769
60588A268248O36L209K784j33l018m100l738l236l143k948j948j1K287M062M782
60573A263733M790N056O133P391P686O969O730Q387J1485J4213J5716J7072J9675
60560A395036K3409K6947K9322L0587L1441L2836L5451L8793M1200M1605M0940
60549A767567M0791M1054M0108L7310L3760L0267K5833J9148J0671K384m230r256
60537B035407j3722j8472k3442k7774l0740l2547l3775l4070l2251k8071k3090
60526A737453j9300j7327j6389j5529j4350j3037j2128j1990j2200j1911j1026
$$ plain form
60613 1564599 1546701 1527033 1506659 1486833 1468160 1450063 1431238 1410981 1390266 1371389 1356288
60602 1356288 1345208 1336987 1330478 1325347 1321401 1317542 1312043 1304202 1295294 1287351 1281090 1275747 1271017 1268248
60588 1268248 1268884 1272093 1274877 1274744 1271726 1267626 1263888 1260652 1257509 1254561 1252613 1252602 1254889 1258951 1263733
60573 1263733 1268523 1273579 1279712 1287103 1294789 1301758 1308488 1316875 1328360 1342573 1358289 1375361 1395036
60560 1395036 1418445 1445392 1474714 1505301 1536742 1569578 1605029 1643822 1685022 1726627 1767567
60549 1767567 1808358 1849412 1889520 1926830 1960590 1990857 2016690 2035838 2046509 2048893 2044663 2035407
60537 2035407 2021685 2003213 1979771 1951997 1921257 1888710 1854935 1820865 1788614 1760543 1737453
60526 1737453 1718153 1700826 1684437 1668908 1654558 1641521 1629393 1617403 1605203 1593292 1582266
60515A582266j0453j0745j1162j0634r107p330n678l917j836M50K753M930O930
60502A526467Q955J1234J3348J4295J3730J2678J2487J3289J4052J3912J2978
60491A667425J2086J2138J3542J5845J8056J9587K0716K2032K3903K6643L0669
60480A882642L5998M1983M7860N3142N7159N8804N7298N2740M5578L5934K3987
60469B393125J0625k714j4563k3631k9172l1525l1748l0383k7207k2308j6484
60458B174015j0204l382L386Q772J2785J7371K3586K9587L3227L5375L8394M2213
60446B405125M4777M6324N0259N8731O9710Q0054Q9780J01522J16750J34410J52994
60435C350436J72525J94197K18964K46826K77112L09065L42109L75581M08460
$$ plain form
60515 1582266 1571813 1561068 1549906 1539272 1530165 1522835 1517157 1513240 1511404 1511854 1514607 1519537 1526467
60502 1526467 1535422 1546656 1560004 1574299 1588029 1600707 1613194 1626483 1640535 1654447 1667425
60491 1667425 1679511 1691649 1705191 1721036 1739092 1758679 1779395 1801427 1825330 1851973 1882642
60480 1882642 1918640 1960623 2008483 2061625 2118784 2177588 2234886 2287626 2333204 2369138 2393125
60469 2393125 2403750 2401036 2386473 2362842 2333670 2302145 2270397 2240014 2212807 2190499 2174015
60458 2174015 2163811 2160429 2163815 2172587 2185372 2202743 2226329 2255916 2289143 2324518 2362912 2405125
60446 2405125 2449902 2496226 2546485 2605216 2674926 2754980 2844760 2946282 3063032 3197442 3350436
60435 3350436 3522961 3717158 3936122 4182948 4460060 4769125 5111234 5486815 5895275
60426E895275M39595M67544M89072M97720M85117M44845L75342K79587J63334
60417I537431L4566r6288k17502l18814l94015m41850m65333m69993m61749m45147
60407F261306m22979l97232l70144l43923l19447k95922k72447k49658k28992
60398C360562k10569j92861j74767j56941j40563j25885j12710j01272r1619q2902
60388A970473p4420o6760o0767n6024n1668m8007m5764m4077m1088l6664l2717
60377A412517l0466k8916k6789k4509k3239k2967k2547k1158j8963j6650j4804
60366A161509j3404j1770r459p141n974n988n921m769k676k64J902L028K473R82
60352A102528M66J939M443O503P631P888P133N652M652M926N673N658N111N317
$$ plain form
60426 5895275 6334870 6802414 7291486 7789206 8274323 8719168 9094510 9374097 9537431
60417 9537431 9571997 9475709 9258207 8939393 8545378 8103528 7638195 7168202 6706453 6261306
60407 6261306 5838327 5441095 5070951 4727028 4407581 4111659 3839212 3589554 3360562
60398 3360562 3149993 2957132 2782365 2625424 2484861 2358976 2246266 2144994 2053375 1970473
60388 1970473 1896053 1829293 1768526 1712502 1660834 1612827 1567063 1522986 1481898 1445234 1412517
60377 1412517 1382051 1353135 1326346 1301837 1278598 1255631 1233084 1211926 1192963 1176313 1161509
60366 1161509 1148105 1136335 1126876 1119735 1113761 1107773 1101852 1097083 1094407 1094143 1096045 1099073 1101546 1102528
60352 1102528 1102994 1104933 1109376 1115879 1123510 1131398 1138531 1144183 1148835 1153761 1159434 1165092 1170203 1175520
60338A175520O642Q155R138R890J0686J0912R904Q216P311P928R081R041P195
60325A289619M646L002K918L865M643L833O32l912p036o869m502k566k075j976
60311A284222j410q04n79m55m26q32j013M05L195N240N571N881P581R129Q323
60296A324028N990N063O568Q740R920J0163R921R184Q495R024J0812J2292J2349
60283A442549J1657J1199J0685R447P967P277P364P299O652N856N319N041N088
60270A543400N575O142O257O263P354J0073J3430J5883J6620J5358J1741O134
60258A664230O17k374k882l745p193j1986j4915j4625j2772j1547j1250j0698
60246A560860r143p100n503m524l503k016p23n58j206j181K78K249L561M177M516
$$ plain form
60338 1175520 1182162 1190317 1199455 1209345 1220031 1230943 1240847 1249063 1256374 1264302 1273383 1282424 1289619
60325 1289619 1294265 1297267 1300185 1304050 1308693 1312526 1313158 1309246 1302210 1295341 1290839 1288273 1286198 1284222
60311 1284222 1282812 1282008 1281429 1280974 1280548 1279716 1278703 1279108 1282303 1287543 1293114 1298995 1306576 1315705 1324028
60296 1324028 1330018 1335081 1341649 1350389 1360309 1370472 1380393 1389577 1398072 1407096 1417908 1430200 1442549
60283 1442549 1454206 1465405 1476090 1485537 1493504 1500781 1508145 1515444 1522096 1527952 1533271 1538312 1543400
60270 1543400 1548975 1555117 1561374 1567637 1574991 1585064 1598494 1614377 1630997 1646355 1658096 1664230
60258 1664230 1664847 1662473 1659591 1655846 1648653 1636667 1621752 1607127 1594355 1582808 1571558 1560860
60246 1560860 1551717 1544617 1539114 1534590 1531087 1529071 1528348 1527790 1526584 1525403 1525681 1527930 1531491 1535668 1540184
60231A540184M481M327N274P745R801R342P290O501P748R017Q920Q387Q395Q347
60217A645759P777P667Q775J0296J1494J3050J5519J7917J9289K0311K1832K3240
60205A822926K3991K5510K9560L5450M0794M4437M7009M9249N1746N5774O2360
60194B288806P0510P8078Q4390R0456R6961J03804J11446J20625J30449J38880
60184C314405J45809J53760J64492J76479J86917J94963K01474K06413K08198
60175D952910K05673J99484J91113J81155J68984J53909J36255J17142R7378P7046
60165F481049N6392L6556J8788L212j0945k3890l4604m1764m4794m3910l9548
60154F356542l2139k2315j0974J231J4498K9516M6194O3333Q0281R8216J18355
$$ plain form
60231 1540184 1544665 1548992 1554266 1562011 1571812 1581154 1588444 1594945 1602693 1611710 1620630 1629017 1637412 1645759
60217 1645759 1653536 1661203 1669978 1680274 1691768 1704818 1720337 1738254 1757543 1777854 1799686 1822926
60205 1822926 1846917 1872427 1901987 1937437 1978231 2022668 2069677 2118926 2170672 2226446 2288806
60194 2288806 2359316 2437394 2521784 2612240 2709201 2813005 2924451 3045076 3175525 3314405
60184 3314405 3460214 3613974 3778466 3954945 4141862 4336825 4538299 4744712 4952910
60175 4952910 5158583 5358067 5549180 5730335 5899319 6053228 6189483 6306625 6404003 6481049
60165 6481049 6537441 6573997 6592785 6595997 6585052 6561162 6526558 6484794 6440000 6396090 6356542
60154 6356542 6324403 6302088 6291114 6292345 6306843 6336359 6382553 6445886 6526167 6624383 6742738
60143F742738J39149J57085J70532J80903J89258J93876J92683J86243J76356
60134H328823J63008J45064J23147R9432P4772M8295J9866q979l6703o2467q4949
60123H809309j02410j14639j23239j29226j31675j29267j21896j10100r4217p4996
60113G677644n4123l3092j2145R182L0880N2241P2290R0176J05528J18378J28187
60102H185146J33279J32191J25537J15420J03061Q8217P1062N3273L6742K2199
60092I066127R725k23o829r453p882k381O625J9406L6880N8924Q3443J08509J34804
60079I497675J64216J96490K29452K62498K97508L35695L75758M15983M56058
60070A2231333M95664N33136N66890N96573O21520O39522O48529O48120O38045
$$ plain form
60143 6742738 6881887 7038972 7209504 7390407 7579665 7773541 7966224 8152467 8328823
60134 8328823 8491831 8636895 8760042 8859474 8934246 8982541 9002407 8993428 8956725 8894258 8809309
60123 8809309 8706899 8592260 8469021 8339795 8208120 8078853 7956957 7846857 7752640 7677644
60113 7677644 7623521 7590429 7578284 7587466 7618346 7670587 7742877 7833053 7938581 8056959 8185146
60102 8185146 8318425 8450616 8576153 8691573 8794634 8882851 8953913 9007186 9043928 9066127
60092 9066127 9075852 9075629 9068800 9059347 9051465 9049084 9055709 9075115 9111995 9170919 9254362 9362871 9497675
60079 9497675 9661891 9858381 10087833 10350331 10647839 10983534 11359292 11775275 12231333
60070 12231333 12726997 13260133 13827023 14423596 15045116 15684638 16333167 16981287 17619332
60061A7619332O16963N84337N42116M92555M35397L69199K94586K14203J30090
60052B1298778M3260m4481j30425k12656k89916l59652m18061m62601m93039n09805
60042A8421402n13119n04446m87136m64067m35348l99537l56786l09807k61627
60033A4689529k13263j64092j14190o5690k1552J6478M8172P3391R1321J01166
60023A4441270J02655R5696Q0540N8718L2754M364k6012n7313q7080j13922j39462
60012A4392208j65957j92679k16611k36411k53529k69215k82342k90918k94216
60003A2190330k92555k86212k75566k61480k44593k24693k01576j76049j49410
59994A0078196j22265r4402o5608l6001n770K4843N5231Q4424J11486J35681J56214
$$ plain form
60061 17619332 18236295 18820632 19362748 19855303 20290700 20659899 20954485 21168688 21298778
60052 21298778 21342038 21297557 21167132 20954476 20664560 20304908 19886847 19424246 18931207 18421402
60042 18421402 17908283 17403837 16916701 16452634 16017286 15617749 15260963 14951156 14689529
60033 14689529 14476266 14312174 14197984 14132294 14110742 14127220 14175392 14248783 14340104 14441270
60023 14441270 14543925 14639621 14720161 14778879 14811633 14815997 14789985 14732672 14645592 14531670 14392208
60012 14392208 14226251 14033572 13816961 13580550 13327021 13057806 12775464 12484546 12190330
60003 12190330 11897775 11611563 11335997 11074517 10829924 10605231 10403655 10227606 10078196
59994 10078196 9955931 9861529 9795921 9759920 9754150 9778993 9834224 9918648 10030134 10165815 10322029
59983A0322029J71933J81607J84568J80996J71416J56018J34881J08753P9076
59974A1691277M6948J2668k3399n9998r5482j28644j58497j83673k02866k15644
59964A0682690k22334k23309k18972k10057j97298j81077j61997j41330j19949
59955I006367r7198p1952m4726j7431R056L5938O4605R4849J25503J55890J85764
59944I446665K14366K40308K62056K78001K86523K86789K79219K64716K43745
59935A1802388K16683J84709J49406J11617P1427K9372j3167n4917r5176j32851
59925A2269491j65635j91079k08275k17780k20150k15519k04763j89813j71941
59916A0484536j50487j24492r5280o5986l8323j1021J7770M7448P5418R9999J21790
$$ plain form
59983 10322029 10493962 10675569 10860137 11041133 11212549 11368567 11503448 11612201 11691277
59974 11691277 11738225 11750893 11727494 11667496 11572014 11443370 11284873 11101200 10898334 10682690
59964 10682690 10460356 10237047 10018075 9808018 9610720 9429643 9267646 9126316 9006367
59955 9006367 8909169 8837217 8792491 8775060 8784116 8820054 8884659 8979508 9105011 9260901 9446665
59944 9446665 9661031 9901339 10163395 10441396 10727919 11014708 11293927 11558643 11802388
59935 11802388 12019071 12203780 12353186 12464803 12536230 12565602 12552435 12497518 12402342 12269491
59925 12269491 12103856 11912777 11704502 11486722 11266572 11051053 10846290 10656477 10484536
59916 10484536 10334049 10209557 10114277 10048291 10009968 9998947 10016717 10064165 10139583 10239582 10361372
59905A0361372J41962J60183J74673J84012J88485J89586J88282J83907J75110
59896A1947572J61892J46297J30832J16652J03644R1784Q1811P4785P1586P2795
59886A2999650P8701Q9574J06268J30059J61181J97769K37207K78574L23081L71801
59876A4973865M23768M76445N27341N74542O16049O49262O70894O77077O63829
59867B0253072O28158N69031M87421L85772K67857J39117O606j22104k40529l44412
59857B2029989m31593n01070n52331n85624o02380o04803n94855n74089n44407
59848A7038837n08320m67884m23732l75737l24507k71628k18483j65564j13089
59839A4169893o1621j1631L6916Q3784J27528J65894J96911K19002K30363K29243
$$ plain form
59905 10361372 10503334 10663517 10838190 11022202 11210687 11400273 11588555 11772462 11947572
59896 11947572 12109464 12255761 12386593 12503245 12606889 12698673 12780484 12855269 12926855 12999650
59886 12999650 13078351 13167925 13274193 13404252 13565433 13763202 14000409 14278983 14602064 14973865
59876 14973865 15397633 15874078 16401419 16975961 17592010 18241272 18912166 19589243 20253072
59867 20253072 20881230 21450261 21937682 22323454 22591311 22730428 22737034 22614930 22374401 22029989
59857 22029989 21598396 21097326 20544995 19959371 19356991 18752188 18157333 17583244 17038837
59848 17038837 16530517 16062633 15638901 15263164 14938657 14667029 14448546 14282982 14169893
59839 14169893 14108272 14096641 14133557 14217341 14344869 14510763 14707674 14926676 15157039 15386282
59829A5386282K14961J87688J47221R3189K7188m6249j21664j95088k63974l25816
59819A5103738l78230m20055m51263m72025m82769m84767m79466m67532m49770
59810A1017861m28616m06921l85004l60675l32805l03367k75042k48351k22414
59801H054666j97433j74733j55013j38095j24356j14780j09308j06156j03339
59792F831453j00166r6776r2764q7077p9380p0921o3431n7145n0594m2881l5620
59781F054698l1760l2663l7236m3736n1169n8754o5424p0609p4505p6814p6242
59770E435786p2117o5629n8283n0024m0146k9355j9284r948N30J3051K5706L5729
59758E166016M2660M8584N5504O3422P1370P9381Q8487R8668J07861J13615J15139
$$ plain form
59829 15386282 15601243 15788931 15936152 16029341 16056529 16010280 15888616 15693528 15429554 15103738
59819 15103738 14725508 14305453 13854190 13382165 12899396 12414629 11935163 11467631 11017861
59810 11017861 10589245 10182324 9797320 9436645 9103840 8800473 8525431 8277080 8054666
59801 8054666 7857233 7682500 7527487 7389392 7265036 7150256 7040948 6934792 6831453
59792 6831453 6731287 6634511 6541747 6454670 6375290 6304369 6240938 6183793 6133199 6090318 6054698
59781 6054698 6022938 5990275 5953039 5909303 5858134 5799380 5733956 5663347 5588842 5512028 5435786
59770 5435786 5363669 5298040 5239757 5189733 5149587 5120232 5100948 5091000 5091530 5104581 5130287 5166016
59758 5166016 5208676 5257260 5312764 5376186 5447556 5526937 5615424 5714092 5821953 5935568 6050707
59747F050707J12979J07388R8291Q6757P5063O4894N6286M8639M1719L5513L0214
59736F808450K6840K6819L0509L7046M5898N7302P0869Q5498J01438J20697J44179
59725G555545J70153J97018K26123K59920K98545L40244L84175M30562M78412
59716A0340697N25154N67995O03216O23865O20332N84393N12528M06628K74290
59707A5059098J28991j2618j36111k33096l01261l42724l62366l65529l55916
59698A3078468l36000l09022k78926k48006k16197j83198j49769j16291q1834
59689A1159225m5832r565K5285N8742R2136J26336J61294J96858K33004K69534
59679A2267017L06319L43746L82547M23298M66253N11185N57471O05028O55295
$$ plain form
59747 6050707 6163686 6271074 6369365 6456122 6531185 6596079 6652365 6701004 6742723 6778236 6808450
59736 6808450 6835290 6862109 6892618 6929664 6975562 7032864 7103733 7189231 7290669 7411366 7555545
59725 7555545 7725698 7922716 8148839 8408759 8707304 9047548 9431723 9862285 10340697
59716 10340697 10865851 11433846 12037062 12660927 13281259 13865652 14378180 14784808 15059098
59707 15059098 15188089 15175471 15039360 14806264 14505003 14162279 13799913 13434384 13078468
59698 13078468 12742468 12433446 12154520 11906514 11690317 11507119 11357350 11241059 11159225
59689 11159225 11113393 11103828 11129113 11187855 11279991 11406327 11567621 11764479 11997483 12267017
59679 12267017 12573336 12917082 13299629 13722927 14189180 14700365 15257836 15862864 16518159
59670A6518159P10275P70125Q32458Q94652R55993J016812J076026J130483J176424
59661B5081407J210918J232041J238499J229614J205761J169071J123824J076018
59653C4567153J032218R98247R78025R72823R81521J001904J031397J066236J100506
59644D3730030J127027J139163J131486J099546J040474R54169Q43158P11516
59636E1776569N64758M10448K57347J13475j4535j20730k00317k51468k75582
59627E2259965k75238k52425k08603j45274o4064L2892J42724K63173L93965N35337
59617E2682452O84881Q37462R88448J134696J271115J387917J472831J514880
59609F1974682J504769J433346J292683J079696P98614M60986Q4794l06989o89320
$$ plain form
59670 16518159 17228434 17998559 18831017 19725669 20681662 21698474 22774500 23904983 25081407
59661 25081407 26292325 27524366 28762865 29992479 31198240 32367311 33491135 34567153
59653 34567153 35599371 36597618 37575643 38548466 39529987 40531891 41563288 42629524 43730030
59644 43730030 44857057 45996220 47127706 48227252 49267726 50221895 51065053 51776569
59636 51776569 52341327 52751775 53009122 53122597 53108062 52987332 52787015 52535547 52259965
59627 52259965 51984727 51732302 51523699 51378425 51314361 51347253 51489977 51753150 52147115 52682452
59617 52682452 53367333 54204795 55193243 56327939 57599054 58986971 60459802 61974682
59609 61974682 63479451 64912797 66205480 67285176 68083790 68544776 68629570 68322581 67633261
59600F7633261j038992j337940j575362j748306j859891j916092j924105j893164
59592E4339409j834721j760112j678911j600716j537152j499575j493817j517661
59584D1416744j562544j616197j664485j694159j696972j672122j624727j561872
59576B8323666j489439j411130j329245j245804j162913j082241j004704r30868
59568A8667322q61142p95289p32386o71995o14995n62587n14717m70115m27610
59559A3016486l86873l48186l12390k80847k54497k32773k14178j98238j86179
59550A0602325j79259j76855j76862j77775j79726j83265j87715j91451j93644
59541H955773j94799j95130j93343j88025j79731j70425j60860j49933j36922
$$ plain form
59600 67633261 66594269 65256329 63680967 61932661 60072770 58156678 56232573 54339409
59592 54339409 52504688 50744576 49065665 47464949 45927797 44428222 42934405 41416744
59584 41416744 39854200 38238003 36573518 34879359 33182387 31510265 29885538 28323666
59576 28323666 26834227 25423097 24093852 22848048 21685135 20602894 19598190 18667322
59568 18667322 17806180 17010891 16278505 15606510 14991515 14428928 13914211 13444096 13016486
59559 13016486 12629613 12281427 11969037 11688190 11433693 11200920 10986742 10788504 10602325
59550 10602325 10423066 10246211 10069349 9891574 9711848 9528583 9340868 9149417 8955773
59541 8955773 8760974 8565844 8372501 8184476 8004745 7834320 7673460 7523527 7386605
59532G386605j23088j10259r8645q7032p4569o1606m8944l6974k5575j4472l752
59521F701689O111J4981K3549L2471M1143M8263N3583N8085O2370O6213P0068
59510G178526P5454Q2940R1024R8263J05636J15481J28686J44149J60510J77239
59500H357908J94315K12001K30933K51584K73725K96969L21507L47544L74452
59491A0860938M01295M27840M54124M79181N01202N18806N31390N38408N39275
59482A5252459N34121N23749N08689M88907M64677M37097M07464L76306L43264
59473A9336733L07947K71121K35190K03212J77235J57818J45100J39542J41035
59464B1114933J47915J57546J67594J76269J81524J80479J69441J44540J03315
$$ plain form
59532 7386605 7263517 7153258 7054613 6967581 6893012 6831406 6782462 6745488 6719913 6705441 6701689
59521 6701689 6707800 6722781 6746330 6778801 6819944 6868207 6921790 6979875 7042245 7108458 7178526
59510 7178526 7253980 7336920 7427944 7526207 7631843 7747324 7876010 8020159 8180669 8357908
59500 8357908 8552223 8764224 8995157 9246741 9520466 9817435 10138942 10486486 10860938
59491 10860938 11262233 11690073 12144197 12623378 13124580 13643386 14174776 14713184 15252459
59482 15252459 15786580 16310329 16819018 17307925 17772602 18209699 18617163 18993469 19336733
59473 19336733 19644680 19915801 20150991 20354203 20531438 20689256 20834356 20973898 21114933
59464 21114933 21262848 21420394 21587988 21764257 21945781 22126260 22295701 22440241 22543556
59455B2543556M6498k2268r8982j81165k66898l52978m35178n09960n75003o28399
59445A9519223o68388o94047p05682p04548o92606o72397o46514o16859n84302
59436A3533880n48794n09971m68331m25867l84895l46242l09276k73599k39351
59427A0027554k05838j71700j37208j04648p5148m6659j6581J4941M6045P6242
59417I407000J06446J36794J66591J96094K26215K56628K86006L14025L40971
59408A1436770L65260L83525L93896L97202L93917L81552L56370L16710K63603
59399A4688805J99225J26190M7989l1305j08320j81156k48779l09782l61757m02257
59389A3418853m30606m48569m58691m62267m59402m50647m37560m21627m03474
$$ plain form
59455 22543556 22590054 22567786 22468804 22287639 22020741 21667763 21232585 20722625 20147622 19519223
59445 19519223 18850835 18156788 17451106 16746558 16053952 15381555 14735041 14118182 13533880
59436 13533880 12985086 12475115 12006784 11580917 11196022 10849780 10540504 10266905 10027554
59427 10027554 9821716 9650016 9512808 9408160 9333012 9286353 9269772 9284713 9330758 9407000
59417 9407000 9513446 9650240 9816831 10012925 10239140 10495768 10781774 11095799 11436770
59408 11436770 11802030 12185555 12579451 12976653 13370570 13752122 14108492 14425202 14688805
59399 14688805 14888030 15014220 15062209 15030904 14922584 14741428 14492649 14182867 13821110 13418853
59389 13418853 12988247 12539678 12080987 11618720 11159318 10708671 10271111 9849484 9446010
59380I446010l83351l61679l38867l15142k90927k67172k44950k24727k05925
59371F813270j87264j67912j48461j30359j14235r9272q4362o9225n4250m0060
59361E717870k7484j6920p355K862J3752K3475L1048L7987M6340N6500O7739P9031
59349F024845Q8036R1444Q8697Q4088Q2874Q6522R3774J04682J20325J39605J59924
59338G164816J80744K02949K24739K42114K54501K66669K83677L06716L35086
59329I462011L69117M08897M52645M98777N48106O01936O59244P17558P75396
59320A4493687Q31978Q85358R32418R69990R94871J003748R94595R67874R25736
59311B3000255Q71006Q07493P39529O69894N99225N28444M60067L95645L33252
$$ plain form
59380 9446010 9062659 8700980 8362113 8046971 7756044 7488872 7243922 7019195 6813270
59371 6813270 6626006 6458094 6309633 6179274 6065039 5965767 5881405 5812180 5757930 5717870
59361 5717870 5690386 5673466 5666111 5668973 5682725 5706200 5737248 5775235 5821575 5878075 5945814 6024845
59349 6024845 6112881 6204325 6293022 6377110 6459984 6546506 6640280 6744962 6865287 7004892 7164816
59338 7164816 7345560 7548509 7773248 8015362 8269863 8536532 8820209 9126925 9462011
59329 9462011 9831128 10240025 10692670 11191447 11739553 12341489 13000733 13718291 14493687
59320 14493687 15325665 16211023 17143441 18113431 19108302 20112050 21106645 22074519 23000255
59311 23000255 23871261 24678754 25418283 26088177 26687402 27215846 27675913 28071558 28404810
59302B8404810K69419K02575J32965O0199j6918r8401j82513k66777l48130m22454
59292B7734775m85730n35864n72796n97471o12048o20493o27345o35476o45719
59283B2401833o58089o72328o87666p03052p17281p28202p32763p29209p18635
59274A6054608p03069o82756o56917o26434n93796n60464n26234m91238m56673
59265A0757027m23171l90138l57436l26244k97495k70622k44700k19750j96123
59256H031348j73426j50976j28931j08160q9247p1930n5397l8885k2339o584P663
59245G193136K0923L4586M9236O3995P7782R0623J03434J16919J31068J45392
59235H027094J59415J73067J86681K00321K13194K24107K32456K38325K41834
$$ plain form
59302 28404810 28674229 28876804 29009769 29069968 29053050 28954649 28772136 28505359 28157229 27734775
59292 27734775 27249045 26713181 26140385 25542914 24930866 24310373 23683028 23047552 22401833
59283 22401833 21743744 21071416 20383750 19680698 18963417 18235215 17502452 16773243 16054608
59274 16054608 15351539 14668783 14011866 13385432 12791636 12231172 11704938 11213700 10757027
59265 10757027 10333856 9943718 9586282 9260038 8962543 8691921 8447221 8227471 8031348
59256 8031348 7857922 7706946 7578015 7469855 7380608 7308678 7253281 7214396 7192057 7185473 7193136
59245 7193136 7214059 7248645 7297881 7361876 7439658 7530281 7633715 7750634 7881702 8027094
59235 8027094 8186509 8359576 8546257 8746578 8959772 9183879 9416335 9654660 9896494
59226I896494K43030K42299K39970K35505K28070K18362K08881K01580J95999
59217A1910190J90493J84633J79229J74075J67053J55906J40243J21203R9508
59208A3322533P4286M3603O031l7747q4265j28368j65703j94458k14788k27106
59198A2394018k31645k29428k22407k11970j98002j80015j58788j35913j12112
59189A0713738q6916o0116l2578n247K1935M9503P7320J04589J30805J56075J80484
59178A1249592K03693K25374K45680K64883K82958L00032L17202L36069L57154
59169A3782637L79489M02245M26032M51531M77456N00949N19549N31033N31485
59160A8002406N15681M80426M25969L53516K63351J56990L9389q3186k06441l27227
$$ plain form
59226 9896494 10139524 10381823 10621793 10857298 11085368 11303730 11512611 11714191 11910190
59217 11910190 12100683 12285316 12464545 12638620 12805673 12961579 13101822 13223025 13322533
59208 13322533 13396819 13440422 13446453 13408706 13324441 13196073 13030370 12835912 12621124 12394018
59198 12394018 12162373 11932945 11710538 11498568 11300566 11120551 10961763 10825850 10713738
59189 10713738 10626822 10566706 10534128 10528881 10550816 10600319 10677639 10782228 10913033 11069108 11249592
59178 11249592 11453285 11678659 11924339 12189222 12472180 12772212 13089414 13425483 13782637
59169 13782637 14162126 14564371 14990403 15441934 15919390 16420339 16939888 17470921 18002406
59160 18002406 18518087 18998513 19424482 19777998 20041349 20198339 20237728 20154542 19948101 19620874
59150A9620874m40523n40040o21842o85365p30916p58399p68759p64730p49450
59141A3560850p25681o96262o63545o28114n89810n50084n11495m74813m38897
59132H282149m03759l71205l41820l13976k87057k62989k42851k24461k05516
59123E628515j87088j71434j57993j44326j30246j18133j09376j02684r6033q8522
59113D322680q0174p1447o3082n5462m8195m1106l4825k9315k2817j3925m096
59102C858236L813R162J4032K0249K7732L5698M3713N1274N7876O3945P0423P7289
59090D333442Q3737Q9905R6871J04640J11763J17693J24007J32270J41725J50317
59080E486370J57324J63911J71333J79552J87671J95002K01369K06657K10348
$$ plain form
59150 19620874 19180351 18640311 18018469 17333104 16602188 15843789 15075030 14310300 13560850
59141 13560850 12835169 12138907 11475362 10847248 10257438 9707354 9195859 8721046 8282149
59132 8282149 7878390 7507185 7165365 6851389 6564332 6301343 6058492 5834031 5628515
59123 5628515 5441427 5269993 5112000 4967674 4837428 4719295 4609919 4507235 4411202 4322680
59113 4322680 4242506 4171059 4107977 4052515 4004320 3963214 3928389 3899074 3876257 3862332 3858236
59102 3858236 3862049 3871211 3885243 3905492 3933224 3968922 4012635 4063909 4121785 4185730 4256153 4333442
59090 4333442 4417179 4507084 4603955 4708595 4820358 4938051 5062058 5194328 5336053 5486370
59080 5486370 5643694 5807605 5978938 6158490 6346161 6541163 6742532 6949189 7159537
59071G159537K11801K10892K08067K03596J97153J88451J77964J66761J55887
59062H880109J46272J38842J34220J32559J33946J38570J46224J56239J68487
59053A0175468J83776K02429K22841K42325K59127K72894K83202K88228K84821
59044A2415111K69678K40931J99172J46762Q6243K0250m7015j09871j64124k09148
59034A2847989k45876k73701k90921k97696k96686k90624k80678k67333k51528
59025A0352946k34349k16539j98754j81762j66200j52586j41596j33891j29737
59016H797532j29257j32629j39436j48185j57372j66799j77048j87865j97815
59007G361126k05465k10315k12829k13966k14314k13230k09488k03336j96707
$$ plain form
59071 7159537 7371338 7582230 7790297 7993893 8191046 8379497 8557461 8724222 8880109
59062 8880109 9026381 9165223 9299443 9432002 9565948 9704518 9850742 10006981 10175468
59053 10175468 10359244 10561673 10784514 11026839 11285966 11558860 11842062 12130290 12415111
59044 12415111 12684789 12925720 13124892 13271654 13357897 13378147 13331132 13221261 13057137 12847989
59034 12847989 12602113 12328412 12037491 11739795 11443109 11152485 10871807 10604474 10352946
59025 10352946 10118597 9902058 9703304 9521542 9355342 9202756 9061160 8927269 8797532
59016 8797532 8668275 8535646 8396210 8248025 8090653 7923854 7746806 7558941 7361126
59007 7361126 7155661 6945346 6732517 6518551 6304237 6091007 5881519 5678183 5481476
58998E481476j90708j84031j75276j65569j57030j49730j42289j34873j29011
58989D052959j24618j19757j13728j07980j03309r8438r2405q6200q0769p5283
58979C050472o8920o2736n7916n3440m7562m0876l5789l2976l0224k5276j8513
58968B576244j2230p998n412l111m23K027L184K814J669N14o28k103l875n352
58954B545320n807m724k084J460M865P361Q993J0411J2140J4040J5506J6311J7017
58941B640809J8137J9077J8651J6796J4960J4356J4595J4656J4466J4731J5730
58930B816964J7117J8501J9560K0130K0774K2542K5381K7634K8197K8229K9371
58919C074400L1131L1843L1670L2503L4953L7573L9500M1875M5799N0467N4444
$$ plain form
58998 5481476 5290768 5106737 4931461 4765892 4608862 4459132 4316843 4181970 4052959
58989 4052959 3928341 3808584 3694856 3586876 3483567 3385129 3292724 3206524 3125755 3050472
58979 3050472 2981552 2918816 2860900 2807460 2759898 2719022 2683233 2650257 2620033 2594757 2576244
58968 2576244 2564014 2556016 2550604 2547493 2547070 2549097 2552281 2555095 2556764 2557278 2556650 2554547 2550672 2545320
58954 2545320 2539513 2534789 2532705 2534165 2539030 2546391 2555384 2565795 2577935 2591975 2607481 2623792 2640809
58941 2640809 2658946 2678023 2696674 2713470 2728430 2742786 2757381 2772037 2786503 2801234 2816964
58930 2816964 2834081 2852582 2872142 2892272 2913046 2935588 2960969 2988603 3016800 3045029 3074400
58919 3074400 3105531 3137374 3169044 3201547 3236500 3274073 3313573 3355448 3401247 3451714 3506158
58908C506158N7616O0808O4266O7555P0406P3076P6121Q0134Q5097Q9761R2639
58897D323637R3985R5876R9791J04950J09846J14603J20677J28500J36707J44114
58887E472686J51618J61202J73237J85827J97409K09055K22977K39280K55890
58878G269181K71895K88964L08691L30523L53541L78425M05750M34078M62155
58869A0503203M91803N26031N65038O06767O50741O98261P49093Q01379Q55271
58860A6447587R13247R75669J039027J099960J158007J212312J258182J289381
58852B5393372J301905J292968J257833J190755J088766R52632P85078N90628
58844C3853937L77052J54512o7546k81583m80584o57612q07718r29341j023346
$$ plain form
58908 3506158 3563774 3624582 3688848 3756403 3826809 3899885 3976006 4056140 4141237 4230998 4323637
58897 4323637 4417622 4513498 4613289 4718239 4828085 4942688 5063365 5191865 5328572 5472686
58887 5472686 5624304 5785506 5958743 6144570 6341979 6551034 6774011 7013291 7269181
58878 7269181 7541076 7830040 8138731 8469254 8822795 9201220 9606970 10041048 10503203
58869 10503203 10995006 11521037 12086075 12692842 13343583 14041844 14790937 15592316 16447587
58860 16447587 17360834 18336503 19375530 20475490 21633497 22845809 24103991 25393372
58852 25393372 26695277 27988245 29246078 30436833 31525599 32478231 33263309 33853937
58844 33853937 34230989 34385501 34317955 34036372 33555788 32898176 32090458 31161117 30137771
58835C0137771j091384j135447j158152j162744j152776j131618j101724j064319
58827B1139607j020148r70636r18168q65281q13614p63456p14297o66078o19913
58818A3788016n77194n38190n02193m68881m38612m11120l85005l59061l33397
58809I774363l08801k85648k63950k43772k25015k07228j90132j73819j58175
58800G717823j42696j27247j12315r8080q4001o9858n6392m4176l2357j9514n428
58789F925759Q719K1893L4329M7079O0881P5576R0438J04860J18835J32892J47858
58778G769119J64527J83048K02370K20910K38290K55916K75418K97081L20270
58769I926949L44545L69631L95237M22009M51727M85344N21720N59768O00820
$$ plain form
58835 30137771 29046387 27910940 26752788 25590044 24437268 23305650 22203926 21139607
58827 21139607 20119459 19148823 18230655 17365374 16551760 15788304 15074007 14407929 13788016
58818 13788016 13210822 12672632 12170439 11701558 11262946 10851826 10466821 10107760 9774363
58809 9774363 9465562 9179914 8915964 8672192 8447177 8239949 8049817 7875998 7717823
58800 7717823 7575127 7447880 7335565 7237485 7153484 7083626 7027234 6983058 6950701 6931187 6925759
58789 6925759 6934478 6956371 6990700 7037779 7098660 7174236 7264674 7369534 7488369 7621261 7769119
58778 7769119 7933646 8116694 8319064 8539974 8778264 9034180 9309598 9606679 9926949
58769 9926949 10271494 10641125 11036362 11458371 11910098 12395442 12917162 13476930 14077750
58760A4077750O46951O97875P51695Q08033Q67712R29523R90178J047805J102670
58751B1920192J153592J196016J224405J234054J219663J175135J096877R85525
58743C1205459Q43175O71200M72912K56511L3057j87586l97455n89052p55974
58734C1552247q94742j004583j086122j141529j174804j189959j189227j174126
58726B2697155j147383j112349j071320j025781r77563r28250q78116q27187p76895
58717A3952311p29271o84669o41631n99017n57554n19436m86634m58975m33497
58708H841627m06891l79057l53072l31051l11652k92662k74059k56888k40707
58699E995588k24229k07574j91858j77241j63168j49858j37872j26714j15631
$$ plain form
58760 14077750 14724701 15422576 16174271 16982304 17850016 18779539 19769717 20817522 21920192
58751 21920192 23073784 24269800 25494205 26728259 27947922 29123057 30219934 31205459
58743 31205459 32048634 32719834 33192746 33449257 33482314 33294728 32897273 32308221 31552247
58734 31552247 30657505 29652922 28566800 27425271 26250467 25060508 23871281 22697155
58726 22697155 21549772 20437423 19366103 18340322 17362759 16434509 15556393 14729206 13952311
58717 13952311 13223040 12538371 11896740 11297723 10740169 10220733 9734099 9275124 8841627
58708 8841627 8434736 8055679 7702607 7371556 7059904 6767242 6493183 6236295 5995588
58699 5995588 5771359 5563785 5371927 5194686 5031518 4881660 4743788 4617074 4501443
58690D501443j05303r7029r0599q4547p8300p2533o7709o3641o0336n7875n5671
58679C667900n3041n0292m8127m6374m4458m2602m1417m0724m0134m0128m1148
58668C179455m2119m1557l9899l9216m0587m3049m5111m6202m6791m8002n0821
58657B696101n4630n7045n6403n3884n1903n1035n0035m8395m6946m6012m4658
58646B135155m2116l8671l4886l1092k7830k5644k4269k2961k1719k1250k1604
58635A823113k1875k1365k0360j9492j8861j8022j6493j4447j2798j2107j1444
58624A635849r377o251m082l668l495k404j547k223l522m027m330n681p241p220
58610A570781n940n248n303m529k613j104p19l73O95J781K346K976M013M878N362
$$ plain form
58690 4501443 4396140 4299111 4208512 4123965 4045665 3973132 3905423 3841782 3781446 3723571 3667900
58679 3667900 3614859 3564567 3516440 3470066 3425608 3383006 3341589 3300865 3260731 3220603 3179455
58668 3179455 3137336 3095779 3055880 3016664 2976077 2933028 2887917 2841715 2794924 2746922 2696101
58657 2696101 2641471 2584426 2528023 2474139 2422236 2371201 2321166 2272771 2225825 2179813 2135155
58646 2135155 2093039 2054368 2019482 1988390 1960560 1934916 1910647 1887686 1865967 1844717 1823113
58635 1823113 1801238 1779873 1759513 1740021 1721160 1703138 1686645 1672198 1659400 1647293 1635849
58624 1635849 1626472 1620221 1616139 1612471 1608976 1606572 1605025 1602802 1599280 1595253 1590923 1585242 1578001 1570781
58610 1570781 1564841 1559593 1554290 1549761 1547148 1546044 1545325 1544952 1545647 1547428 1549774 1552750 1556763 1561641 1567003
58595A567003O207P839R711J1493J3685J6565J9628K2587K5851K9498L2744L4992
58583A797803L6741L8969M2184M6314N1016N5887O0726O5619P0514P5162P9855
58572B420790Q5605R2867J00706J08046J15207J23310J32856J43882J56872J72331
58562C652472J89853K08642K28509K49555K71448K93886L16861L39404L58963
58553F109593L73205L81327L82239L72743L49568L12392K62972K02318J31293
58544H877650N3720k3727r5317j58337k11418k53033k82447l00773l10317l13485
58534F982516l12157l07113k98077k85174k69998k54366k38647k22470k06329
58525D588185j91005j76077j60595j44846j29980j16348j03616r1950q1644p2213
$$ plain form
58595 1567003 1573210 1581049 1590760 1602253 1615938 1632503 1652131 1674718 1700569 1730067 1762811 1797803
58583 1797803 1834544 1873513 1915697 1962011 2013027 2068914 2129640 2195259 2265773 2340935 2420790
58572 2420790 2506395 2599262 2699968 2808014 2923221 3046531 3179387 3323269 3480141 3652472
58562 3652472 3842325 4050967 4279476 4529031 4800479 5094365 5411226 5750630 6109593
58553 6109593 6482798 6864125 7246364 7619107 7968675 8281067 8544039 8746357 8877650
58544 8877650 8931370 8907643 8812326 8653989 8442571 8189538 7907091 7606318 7296001 6982516
58534 6982516 6670359 6363246 6065169 5779995 5509997 5255631 5016984 4794514 4588185
58525 4588185 4397180 4221103 4060508 3915662 3785682 3669334 3565718 3473768 3392124 3319911
58515C319911o3451n6723n3415n2710n2565n2231n1981n1308m9551m7830m7926
58504B740220m9525n0686n0861n1326n2734n4413n5975n7548n8359n7091n3896
58493B147806n0431m7797m5765m3789m1423l8303l5045l3267l3106l2112k8599
58482A718169k4667k3225k3447k2222j9139j6542j5341j4361j3532j4012j4945
58471A516736j3778j0357p408o296n546m287l878n009o101n855m898l878k399
58458A437046p57m27j877l953n970q294j0575j1798j2403j3837j5708j6045j4633
58445A320769j3352j2924j2194j0945j0344j0205r087p539p855r895j0735r337
58433A196357p987p955p500n666m465n379o957p654p977q114o763m219l345n260
$$ plain form
58515 3319911 3256460 3199737 3146322 3093612 3041047 2988816 2936835 2885527 2835976 2788146 2740220
58504 2740220 2690695 2640009 2589148 2537822 2485088 2430675 2374700 2317152 2258793 2201702 2147806
58493 2147806 2097375 2049578 2003813 1960024 1918601 1880298 1845253 1811986 1778880 1746768 1718169
58482 1718169 1693502 1670277 1646830 1624608 1605469 1588927 1573586 1559225 1545693 1531681 1516736
58471 1516736 1502958 1492601 1485193 1478897 1473351 1469064 1465186 1460177 1454076 1448221 1443323 1439445 1437046
58458 1437046 1436289 1435862 1433985 1430032 1424062 1415768 1405193 1393395 1380992 1367155 1351447 1335402 1320769
58445 1320769 1307417 1294493 1282299 1271354 1261010 1250805 1241718 1234179 1226324 1216429 1205694 1196357
58433 1196357 1188370 1180415 1172915 1167249 1162784 1157405 1150448 1142794 1134817 1126703 1119940 1115721 1112376 1107116
58419A107116p073o235m255l585l503j863J199L791M866M340K344j6j048r24j603
58404A093551l242l389j112J120J501J847M304P804J0095J0904J1012J0532J0100
58391A155027J1253J3590J4138J1602Q526P005N216Q67m594q207r721j0723j1482
58378A182497j1474j1290j1544j1462j0690j0628j1943j2845j1934j0547j0107
58367A058033r518p592n673n211m945l158p17O79J241J661J146n28j122J122M527
58352A029945O503P132P815Q571R125J0559J3198J4964J4480J3623J4505J6186
58340A166606J6963J7391J8245J8155J6311J4976J5926J6963J5440J2786J1665
58329A341427J0958P792K874n14j584k216k973k666j188L31J501K218J448r12
$$ plain form
58419 1107116 1100043 1093808 1089553 1085968 1082465 1080602 1081801 1085592 1090458 1094798 1097142 1097126 1096078 1095154 1093551
58404 1093551 1090309 1086920 1085808 1086928 1088429 1090276 1094580 1102384 1112479 1123383 1134395 1144927 1155027
58391 1155027 1166280 1179870 1194008 1205610 1214136 1221141 1226357 1227224 1222630 1214423 1204702 1193979 1182497
58378 1182497 1171023 1159733 1148189 1136727 1126037 1115409 1103466 1090621 1078687 1068140 1058033
58367 1058033 1048515 1040923 1035250 1030039 1025094 1021936 1021219 1021898 1023139 1024800 1025946 1025418 1024296 1025418 1029945
58352 1029945 1036448 1043580 1051395 1059966 1069091 1079650 1092848 1107812 1122292 1135915 1150420 1166606
58340 1166606 1183569 1200960 1219205 1237360 1253671 1268647 1284573 1301536 1316976 1329762 1341427
58329 1341427 1352385 1360177 1363051 1362537 1360953 1358737 1355764 1353098 1351910 1352241 1353742 1355960 1357408 1356496
58315A356496k594k050j121j773k372n86K197L127K767L598N168M852K618J046
58301A371373J069J150L69o20j258j300j00K140L663L744M197O166P737P257O484
58286A412071P468Q836Q525P712Q428R613R351Q757R810J1477J1873J2204J4507
58273A540632J7477J8565J8295J8593J8791J7331J5388J4786J4415J2769J1727
58262A718769J3491J6117J6586J5988J7028J8781J8920J8787K0917K3530K3043
58251A921957K0462J9865K1878K3791K4874K6487K8153K8463K8591L0334L2161
58240B207016L1805L0763L1431L2117L0094K7376K7882L0867L2783L3541L5316
58229B550991L7278L7385L7322L9861M3420M5134M6777N1369N6532N8013N7369
$$ plain form
58315 1356496 1353902 1351852 1350731 1348958 1346586 1346000 1348197 1351324 1354091 1357689 1362857 1367709 1370327 1371373
58301 1371373 1372442 1373592 1373961 1373341 1372083 1370783 1370683 1372823 1376486 1380230 1384427 1390593 1398330 1405587 1412071
58286 1412071 1419539 1428375 1436900 1444612 1453040 1462653 1472004 1480761 1490571 1502048 1513921 1526125 1540632
58273 1540632 1558109 1576674 1594969 1613562 1632353 1649684 1665072 1679858 1694273 1707042 1718769
58262 1718769 1732260 1748377 1764963 1780951 1797979 1816760 1835680 1854467 1875384 1898914 1921957
58251 1921957 1942419 1962284 1984162 2007953 2032827 2059314 2087467 2115930 2144521 2174855 2207016
58240 2207016 2238821 2269584 2301015 2333132 2363226 2390602 2418484 2449351 2482134 2515675 2550991
58229 2550991 2588269 2625654 2662976 2702837 2746257 2791391 2838168 2889537 2946069 3004082 3061451
58218C061451N9223O3180O5595O7149P1225P6750Q0108Q2227Q6473R1622R4428
58207C899431R6742J02217J08499J11047J12101J17012J24095J27473J28037J31920
58197E058574J39778J47256J54449J65172J78299J89677K01140K17627K36993
58188F688965K52962K66379K82996L02047L18209L32990L52485L75565L96285
58179I568883M16105M41236M69784M94761N18009N47314N81428O12460O41711
58170A4291691O77947P21273P64331Q08332Q61503R22668R83414J045719J119738
58161B2196616J205175J293324J386125J493093J610668J726471J843438J976730
58153C4731640K126935K280824K438857K616009K815115L027782L263171L545886
$$ plain form
58218 3061451 3120674 3183854 3249449 3316598 3387823 3464573 3544681 3626908 3713381 3805003 3899431
58207 3899431 3996173 4098390 4206889 4317936 4430037 4547049 4671144 4798617 4926654 5058574
58197 5058574 5198352 5345608 5500057 5665229 5843528 6033205 6234345 6451972 6688965
58188 6688965 6941927 7208306 7491302 7793349 8111558 8444548 8797033 9172598 9568883
58179 9568883 9984988 10426224 10896008 11390769 11908778 12456092 13037520 13649980 14291691
58170 14291691 14969638 15690911 16455242 17263574 18125077 19047745 20031159 21076878 22196616
58161 22196616 23401791 24695115 26081240 27574333 29185001 30911472 32754910 34731640
58153 34731640 36858575 39139399 41578256 44194265 47009380 50037162 53300333 56846219
58145E6846219L882768M262322M688365N181408N748048O389625P143558Q072500
58137A02214813R209541J0563158J2181994J4159896J6561980J9384175K2571621
58130B06847178K6024538K9641298L3452515L7544669M1417199M3249524M0300386
58123D58477307L0800502J5792776j064650j5728747k5942003l1610939l3759931
58116C96964315l3523974l1841284k9456105k6863716k4305060k1898484j9731340
58109B09344352j7826449j6133197j4608134j3249046j2031647j0884466r757077
58102A14854336q655355p584204o512380n421124m335178l279573k255621j278694
58094G5532207l74981M86132J362046K149213K482743J962390N36819j374045
$$ plain form
58145 56846219 60728987 64991309 69679674 74861082 80609130 86998755 94142313 102214813
58137 102214813 111424354 121987512 134169506 148329402 164891382 184275557 206847178
58130 206847178 232871716 262513014 295965529 333510198 374927397 418176921 458477307
58123 458477307 489277809 505070585 504005935 488277188 462335185 430724246 396964315
58116 396964315 363440341 331599057 302142952 275279236 250974176 229075692 209344352
58109 209344352 191517903 175384706 160776572 147527526 135495879 124611413 114854336
58102 114854336 106198981 98614777 92102397 86681273 82346095 79066522 76810901 75532207
58094 75532207 75157226 75643358 77005404 79154617 81637360 83599750 84136569 82762524
58086H2762524l160832m411959n056116n233267n113218m819679m439539m037477
58078D6490437l652799l300421k984100k706321k466264k256674k069095j899739
58070B5155024j746513j604151j468062j340318j225367j121450j022873r29413
58062A4696877q46093p73920p08088o45908n89707n41064m98584m62190m33268
58053I198055m09561l85899l61065l38568l20261l04750k92079k83618k77037
58044F225217k67663k55397k44224k34641k23147k09472j97407j87658j76957
58035D228651j65270j56842j52397j47207j38843j30374j23807j16774j07989
58026B989148j00000r4026q7758q0531p5210p2735p0237o6656o4696o5019o4025
$$ plain form
58086 82762524 79601692 75189733 70133617 64900350 59787132 54967453 50527914 46490437
58078 46490437 42837638 39537217 36553117 33846796 31380532 29123858 27054763 25155024
58070 25155024 23408511 21804360 20336298 18995980 17770613 16649163 15626290 14696877
58062 14696877 13850784 13076864 12368776 11722868 11133161 10592097 10093513 9631323 9198055
58053 9198055 8788494 8402595 8041530 7702962 7382701 7077951 6785872 6502254 6225217
58044 6225217 5957554 5702157 5457933 5223292 5000145 4790673 4593266 4405608 4228651
58035 4228651 4063381 3906539 3754142 3606935 3468092 3337718 3213911 3097137 2989148
58026 2989148 2889148 2795122 2707364 2626833 2551623 2478888 2408651 2341995 2277299 2212280 2148255
58015B148255n9925n5726n3633n1677m8446m5953m5013m2733l7681l3000l1259
58004A643209l0304k7295k3149k0094j8272j7087j6789j6776j5675j4500j6009
57993A427259j9573k0940j8628j6094j5778j5677j4040j2718j3128j3145j1006
57982A256532q506p561p175o197n502n071k791J407M080L537K692L976N422M824
57968A239667L841M366M437J649k333m462n034o131p618q205q546r919j1406j1434
57954A178872j0762j1233j2866j4428j5516j6106j5502j3691j2161j1834j1822
57943A032951j1534j1828j2646j2103r559p115o168n202k932q51l25N8J711L166
57929I57623K812K174L490N906P146P240P671Q137P081M553K025J27j385k236
$$ plain form
58015 2148255 2088330 2032604 1978971 1927294 1878848 1832895 1787882 1745149 1707468 1674468 1643209
58004 1643209 1612905 1585610 1562461 1542367 1524095 1507008 1490219 1473443 1457768 1443268 1427259
57993 1427259 1407686 1386746 1368118 1352024 1336246 1320569 1306529 1293811 1280683 1267538 1256532
57982 1256532 1248026 1240465 1233290 1227093 1221591 1216520 1213729 1215136 1219216 1222753 1225445 1229421 1234843 1239667
57968 1239667 1243508 1247874 1252311 1253960 1251627 1247165 1242131 1236000 1228382 1220177 1211631 1201712 1190306 1178872
57954 1178872 1168110 1156877 1144011 1129583 1114067 1097961 1082459 1068768 1056607 1044773 1032951
57943 1032951 1021417 1009589 996943 984840 975281 968166 961998 956796 953864 953013 952688 952746 954457 957623
57929 957623 960435 962609 966099 972005 979151 986391 994062 1002199 1009280 1013833 1015858 1015985 1014600 1012364
57915A012364k183k043k571l321l988n493q256j0815j1760j1598j1295j0540q998
57902I19503p593o964o318n291n139o456p705p797q040r538j0784j0180r007r199
57888H09492r789q487n622l700l652m005l490k383j362p15l99Q6J303K570K236
57873G72083J90j487j567j583l196n415o419o589p442q724q749o951m249j529
57859G08373P00J894K158K630L977N389O101O668P550P868P008O130O485P414
57845G80345P554O992O757P201P998Q704Q219N254M37l524m982n082n354n597
57831H14922n439n845p193q000p534p688j0031j2830j3341j1475q980o641m547
57818G05378l545l905l977k510r18r06j526j049j8M33J585N095R202J0529Q923
$$ plain form
57915 1012364 1010181 1008138 1005567 1002246 998258 992765 984509 973694 961934 950336 939041 928501 919503
57902 919503 911910 904946 898628 893337 888198 881742 874037 866240 858200 848662 837878 827698 818691 809492
57888 809492 799703 791216 785594 781894 778242 774237 770747 768364 767002 766287 765888 765974 767277 769847 772083
57873 772083 772273 770786 769219 767636 764440 759025 752606 746017 738575 729851 721102 714151 709902 708373
57859 708373 709073 710967 713125 715755 719732 725121 731222 737890 745440 753308 760316 766446 772931 780345
57845 780345 787899 794891 801648 808849 816847 825551 833770 839024 839461 835937 830955 825873 820519 814922
57831 814922 809483 803638 796445 788445 780911 773223 763192 750362 737021 725546 716566 709925 705378
57818 705378 701833 697928 693951 691441 690523 689617 688091 687042 687024 687457 689042 694137 703339 713868 722791
57803G22791P215O741O402N862O189P138O894M996K960J653M04j074k131k829
57789G73211m008n665p178q967j1698j4063j3849j1284q947q260q294q207q438
57776F54353q994q808p470n956n201n375o448p917q395p335o647q374j1275j2407
57762E43751j1603j1370j2280j1932r238o525n999o916p619p932p949o798m472
57749D33118k965l679n202n333l996k474j091N64K004K315J814J854L157N268
57735D25354P319Q627Q929Q617Q386Q178P194N246L370K585K805L380L873L824
57721E07687K668N89j273k095k276k590l069l298l206k967k539j849j172r05j108
57706D82597j382j134q1J265J980J969K275L563M930N104M332L929M378N140O039
$$ plain form
57803 722791 730006 736747 743149 749011 755200 762338 769232 774228 777188 778841 779245 778171 776040 773211
57789 773211 769203 763538 756360 747393 735695 721632 707783 696499 687552 679292 670998 662791 654353
57776 654353 645359 636551 629081 623125 617924 612549 606101 598184 589789 582454 575807 567433 556158 543751
57762 543751 532148 520778 508498 496566 487328 480803 474804 467888 460269 452337 444388 437590 433118
57749 433118 430153 426474 421272 415939 411943 409469 408378 408942 410946 413261 415075 416929 420086 425354
57735 425354 432673 441300 450229 458846 467232 475410 482604 487850 491220 493805 496610 499990 503863 507687
57721 507687 510355 510944 509671 507576 505300 502710 499641 496343 493137 490170 487631 485782 484610 483705 482597
57706 482597 481215 480081 480000 481265 483245 485214 487489 491052 495982 501086 505418 509347 513725 518865 524904
57691E24904P417Q944R669R295Q308O967N441M681N529P001P238O346O376P981
57677F26097R163Q276O547O344Q248J1066J3550J4880J4500J2920J2012J3192
57665G56795J5783J8171J9964K1827K3652K4448K4174K4401K6449K9578L1755
57654A016997L2151L2236L4050L7608M0758M1914M2169M3952M8085N3284N8307
57643A481511O3261O8467P3352P7278Q0777Q5213R1496R9550J08781J18715J29440
57632B477841J41563J55446J70664J86519K03020K20733K39767K59628K79879
57623D335060K99996L18301L31997L38678L37240L27019L06772K75285K32915
57614G103263J82397J28285P5503K7961j1846m2400o3602p8486r3676j16272j49152
$$ plain form
57691 524904 532321 541265 550934 560229 568537 575504 580945 585626 591155 598156 605394 611740 618116 626097
57677 626097 635260 643536 650083 656427 664675 675741 689291 704171 718671 731591 743603 756795
57665 756795 772578 790749 810713 832540 856192 880640 904814 929215 955664 985242 1016997
57654 1016997 1049148 1081384 1115434 1153042 1193800 1235714 1277883 1321835 1369920 1423204 1481511
57643 1481511 1544772 1613239 1686591 1763869 1844646 1929859 2021355 2120905 2229686 2348401 2477841
57632 2477841 2619404 2774850 2945514 3132033 3335053 3555786 3795553 4055181 4335060
57623 4335060 4635056 4953357 5285354 5624032 5961272 6288291 6595063 6870348 7103263
57614 7103263 7285660 7413945 7489448 7517409 7505563 7463163 7399561 7321075 7227399 7111127 6961975
57603F961975j89187k29453k62824k84525k93383k91377k81404k65407k44895
57594D619520k22364k00630j80889j62851j46478j31975j18166j03064q6605p1070
57584C195428n7929m6089l4216k2862j2762k709Q812K0921L1585M1135N2276O6346
57572C239936Q1521R5578J08900J23533J40104J57107J73134J88752K05495K23381
57562D737441K39971K52033K57770K57074K49762K34161K07807J69577J21075
57553F726671O6125R029m6769r8776j44950j83700k14336k36846k51251k57769
57543E367428k57878k54218k48715k41368k31625k20254k08894j98212j87644
57534C318620j76754j65745j54689j43373j32125j21871j13098j05296r7538q9161
$$ plain form
57603 6961975 6772788 6543335 6280511 5995986 5702603 5411226 5129822 4864415 4619520
57594 4619520 4397156 4196526 4015637 3852786 3706308 3574333 3456167 3353103 3266498 3195428
57584 3195428 3137499 3091410 3057194 3034332 3021570 3018861 3027673 3048594 3080179 3121314 3173590 3239936
57572 3239936 3321457 3417035 3525935 3649468 3789572 3946679 4119813 4308565 4514060 4737441
57562 4737441 4977412 5229445 5487215 5744289 5994051 6228212 6436019 6605596 6726671
57553 6726671 6792796 6801825 6755056 6656280 6511330 6327630 6113294 5876448 5625197 5367428
57543 5367428 5109550 4855332 4606617 4365249 4133624 3913370 3704476 3506264 3318620
57534 3318620 3141866 2976121 2821432 2678059 2545934 2424063 2310965 2205669 2108131 2018970
57524B018970q0085p1164o3957n9225n5800n1827m7012m2619l9458l7047l4733
57513A436043l2318k9446k5673k1594j8655j7255j6009j3452r630n534j942O59
57501A245194K001K630L922O806J0848J4999J8620K1517K3814K6267K9927L4759
57489A441304L9219M1939M3428M5512M9311N4208N8668O1826O4422O8262P4503
57478B042602Q2573R1094R9520J08281J17806J28318J40243J53424J66068J76016
57468C305945J83441J90698J98726K04782K04663J96198J79714J55996J25203
57459D945366Q7707M5159O24m2345q1059j14338j41552j61653j74088j80383j83088
57448D000350j82886j78343j69228j58439j49372j42469j35639j27271j17493
$$ plain form
57524 2018970 1938885 1867721 1803764 1744539 1688739 1636912 1589900 1547281 1507823 1470776 1436043
57513 1436043 1403725 1374279 1348606 1327012 1308357 1291102 1275093 1261641 1252011 1246477 1244535 1245194
57501 1245194 1247195 1249825 1253747 1260553 1271401 1286400 1305020 1326537 1350351 1376618 1406545 1441304
57489 1441304 1480523 1522462 1565890 1611402 1660713 1714921 1773589 1835415 1899837 1968099 2042602
57478 2042602 2125175 2216269 2315789 2424070 2541876 2670194 2810437 2963861 3129929 3305945
57468 3305945 3489386 3680084 3878810 4083592 4288255 4484453 4664167 4820163 4945366
57459 4945366 5033073 5078232 5078856 5036511 4955452 4841114 4699562 4537909 4363821 4183438 4000350
57448 4000350 3817464 3639121 3469893 3311454 3162082 3019613 2883974 2756703 2639210
57439B639210j07037r6365q5844p5845o6509n7908n0213m3284l6408k8897k0740
57428A970160j2516n076P65N042R311J5490K3707L2315M0238M8012N6045O3661
57416B247154P0848P9298R0284J02656J14564J25994J37842J49555J59812J68887
57406C446894J77921J85876J89348J85767J74946J57105J31374R7315N6556J1990
57396D815092l3519p6995j15224j46214j70158j88024j99797k05098k04945k01655
57386C273463j96926j90919j83240j74039j63959j53724j44061j35420j27331
57377A803844j18608j08800r9182r1577q6193q1304p5287o8293o1523n5558n0219
57366I07300m5588m2209m0049l8180l5813l3195l1187l0234k9981k9510k7952
$$ plain form
57439 2639210 2532173 2435808 2349964 2274119 2207610 2149702 2099489 2056205 2019797 1990900 1970160
57428 1970160 1957644 1952568 1953333 1958375 1967686 1983176 2006883 2039198 2079436 2127448 2183493 2247154
57416 2247154 2318002 2397300 2487584 2590240 2704804 2830798 2968640 3118195 3278007 3446894
57406 3446894 3624815 3810691 4000039 4185806 4360752 4517857 4649231 4746546 4803102 4815092
57396 4815092 4781573 4704578 4589354 4443140 4272982 4084958 3885161 3680063 3475118 3273463
57386 3273463 3076537 2885618 2702378 2528339 2364380 2210656 2066595 1931175 1803844
57377 1803844 1685236 1576436 1477254 1385677 1299484 1218180 1142893 1074600 1013077 957519 907300
57366 907300 861712 819503 779454 741274 705461 672266 641079 610845 580864 551354 523402
57355E23402k5176k2026j9658j8560j8378j8384j7757j5839j2903j0412r638j0133
57343C24538j0524j0528j0910j1495j0802q321n691m604m664m393l485k755k512
57330B33854k182j465o99j77K12O07J046J604K140K149J366L78J15P87J702K008
57314B43445J414L87j49L00J067R08l81j548j427k45R82J705J959J911J938K621
57298B54887L958N165N875O892Q942J1214J2190J1600J0531R762Q966P654O063
57285C63699M888M541M845N171N089N042O005P992R480R088P484O806Q169J0462
57271D58761J1688J0999R291Q183Q562R992J1458J2503J3307J3726J3190J1848
57259E93508J1041J1944J4221J6663J8668K0510K2453K4294K5548K5788K5072
$$ plain form
57355 523402 498226 476200 456542 437982 419604 401220 383463 367624 354721 344309 334671 324538
57343 324538 314014 303486 292576 281081 270279 261958 256267 251663 246999 242606 239121 236366 233854
57330 233854 231672 230207 229508 229331 229543 230150 231196 232800 234940 237089 238455 238833 238948 239735 241437 243445
57314 243445 244859 245246 245097 245397 246464 247372 246991 245443 244016 243771 244753 246458 248417 250328 252266 254887
57298 254887 258845 264010 269885 276777 285719 296933 309123 320723 331254 341016 349982 357636 363699
57285 363699 368587 373128 377973 383144 388233 393275 399280 407272 416752 425840 433324 440130 448299 458761
57271 458761 470449 481448 490739 498922 507484 517476 528934 541437 554744 568470 581660 593508
57259 593508 604549 616493 630714 647377 666045 686555 709008 733302 758850 784638 809710
57248H09710K4251K4244K4879K5303K5738K7499L0564L2661L2122L0354K9764
57237A117089L0296L0108K9136K9348L1311L2943L2629L1622L2060L4130L6656
57226A467328L9273M2365M5322M6701M6363M6139M7744N0689N2828N2697N0718
57215A988167M8094M5103M0984L5247K8249K0351J1393J767o686j1984j4171j5196
57203B171318j6542j7793j7740j6061j3508j1061r405q857r272j0165j1030j1375
57191B018509j0508p963m334j026J170K804M829P490J0591J4261J8656K3222K7106
57178B104807L0186L2983L5522L7134L7578L7522L7531L7166L5667L3049K9928
57167B489073K6665K3393K0545J8599J7372J6389J5917J6860J9651K4001K9777
$$ plain form
57248 809710 833961 858205 883084 908387 934125 961624 992188 1024849 1056971 1087325 1117089
57237 1117089 1147385 1177493 1206629 1235977 1267288 1300231 1332860 1364482 1396542 1430672 1467328
57226 1467328 1506601 1548966 1594288 1640989 1687352 1733491 1781235 1831924 1884752 1937449 1988167
57215 1988167 2036261 2081364 2122348 2157595 2185844 2206195 2217588 2219355 2212669 2200685 2186514 2171318
57203 2171318 2154776 2136983 2119243 2103182 2089674 2078613 2069208 2060351 2051079 2040914 2029884 2018509
57191 2018509 2008001 2000038 1995704 1994678 1995848 1998652 2003481 2010971 2021562 2035823 2054479 2077701 2104807
57178 2104807 2134993 2167976 2203498 2240632 2278210 2315732 2353263 2390429 2426096 2459145 2489073
57167 2489073 2515738 2539131 2559676 2578275 2595647 2612036 2627953 2644813 2664464 2688465 2718242
57156B718242L6987M4688N1168N5843N9948O4534O8776P1281P2106P2249P1869
57145C387691P0540O8723O7394O6288O4154O0860N7791N5801N4163N2136N0157
57134D055698M8559M6147M1313L4347K7644K3454K1738K0426J7693J3897J1038
57123D361954J0323J0873J1110J0610R831Q815P290N637M429L208J015j971m522
57110D438602o232p920r965j1453j1623j1267j2075j5015j9636k4543k8670l2457
57098D247746l7714m5734n5825o6196p5831q4706r2754r9476j04348j06906j06997
57087C371259j05504j03946j02694j00763r8204r7068r8521j00778j01933j03202
57077B358646j06968j12882j18589j23421j28735j35413j43735j54975j70444
$$ plain form
57156 2718242 2755229 2799917 2851085 2906928 2966876 3031410 3100186 3171467 3243573 3315822 3387691
57145 3387691 3458231 3526954 3594348 3660636 3724790 3785650 3843441 3899242 3953405 4005541 4055698
57134 4055698 4104257 4150404 4191717 4226064 4253708 4277162 4298900 4319326 4337019 4350916 4361954
57123 4361954 4372277 4383150 4394260 4404870 4414701 4423516 4430806 4436443 4440872 4444080 4445095 4443124 4438602
57110 4438602 4432370 4424450 4414485 4403032 4391409 4380142 4368067 4353052 4333416 4308873 4280203 4247746
57098 4247746 4210032 4164298 4108473 4042277 3966446 3881740 3788986 3689510 3585162 3478256 3371259
57087 3371259 3265755 3161809 3059115 2958352 2860148 2763080 2664559 2563781 2461848 2358646
57077 2358646 2251678 2138796 2020207 1896786 1768051 1632638 1488903 1333928 1163484
57068A163484j89434k10670k34966k64099c3863l36793l81140m32035m87311n45015
57058b216157o07472o78325p57290q42298r34989j039068j154807j280681j418987
57049a0930074j574157j747374j939547k158069k413552k711362l054165l451303
57041b9979603l917106m461533n091487n819019o657847p615361q701361r940681
57033h2183998j1360579j2969439j4765351j6749810j8887168k1044726k3025744
57026b00986815k4686199k5953911k6661861k6406742k4706261k1384589j6793421
57019c67579799j1622434o492806j717104K630715O516199R855707J2592419J4805123
57011c41011980J6695922J8439170K0033009K1307413K2078504K2284333K1982036
$$ plain form
57068 1163484 974050 763380 528414 264315 -33863 -370656 -751796 -1183831 -1671142 -2216157
57058 -2216157 -2823629 -3501954 -4259244 -5101542 -6036531 -7075599 -8230406 -9511087 -10930074
57049 -10930074 -12504231 -14251605 -16191152 -18349221 -20762773 -23474135 -26528300 -29979603
57041 -29979603 -33896709 -38358242 -43449729 -49268748 -55926595 -63541956 -72243317 -82183998
57033 -82183998 -93544577 -106514016 -121279367 -138029177 -156916345 -177961071 -200986815
57026 -200986815 -225673014 -251626925 -278288786 -304695528 -329401789 -350786378 -367579799
57019 -367579799 -379202233 -385695039 -387412143 -384781428 -378265229 -368409522 -355817103 -341011980
57011 -341011980 -324316058 -305876888 -285843879 -264536466 -242457962 -220173629 -198191593
57004a98191593K1259686K0185591J8823456J7252006J5556179J3816104J2109795
56997g9188776J0510155R069209P810025O734330N830076N072967M433334L887952
56989b5840728L421913L020867K669879K360320K089898J854305J645166J456449
56981g321931J286128J131264R88564Q60436P53287O68036N98260d97413i174
56971D36640M06272L66705L29132K95586K65198K37711K14823J96084J77839J58238
56961C084228J39320J22824J08146R5673Q7868Q5229Q5034Q5308Q6119Q5921Q1137
56950D146807P1239O0106N0394M0419K8619J7045P822n06r985j9036k3921k2857
56938D346146j6519n983P368J9521K1824K521m6012j17920j93270k51211k84308
$$ plain form
57004 -198191593 -176931907 -156746316 -137922860 -120670854 -105114675 -91298571 -79188776
56997 -79188776 -68678621 -59609412 -51799387 -45065057 -39234981 -34162014 -29728680 -25840728
56989 -25840728 -22418815 -19397948 -16728069 -14367749 -12277851 -10423546 -8778380 -7321931
56981 -7321931 -6035803 -4904539 -3915975 -3055539 -2302252 -1634216 -1035956 -497413 -9174
56971 436640 842912 1209617 1538749 1834335 2099533 2337244 2552067 2748151 2925990 3084228
56961 3084228 3223548 3346372 3454518 3550191 3638059 3723288 3808322 3893630 3979749 4065670 4146807
56950 4146807 4218046 4278152 4328546 4368965 4397584 4414629 4422451 4421945 4411960 4392924 4369003 4346146
56938 4346146 4329627 4323644 4331012 4350533 4372357 4374878 4328866 4210946 4017676 3766465 3482157
56927C482157k98077k99277k90368k74228k56432k40071k23459k05732j90109
56918A204404j78678j68190j54530j38270j22518j08003r3579p9505o7153C7220
56907a0431l9440l1319k2065j2180m043J516O637J2940J9069K3410K6813A235
56894C3620L0576K4865J6956Q151l16o437r099r509r372q886p955p722r013j0462
56880C5397r934o960k513K443O952R927J1475J3360J6977K1727K5990K8396K7445
56867A80682K1842J2431K411n663j1766j6622j9701k0281j8930j6801j4645j3300
56855G9657j3542j4639j4663j3107j1482A627g713p130n230m372l231r16J137
56842b7455J459R43J186K144L185M754f620B710J0511J1805J4250J6808J8118
$$ plain form
56927 3482157 3184080 2884803 2594435 2320207 2063775 1823704 1600245 1394513 1204404
56918 1204404 1025726 857536 703006 564736 442218 334215 240636 161131 93978 37220
56907 -10431 -49871 -81190 -103255 -115435 -119478 -117962 -111325 -98385 -79316 -55906 -29093 1235
56894 33620 64196 89061 106017 114168 113852 107415 98316 88807 79435 70549 62594 54872 45859 35397
56880 35397 25463 18503 15990 18433 25385 35312 46787 60147 77124 98851 124841 153237 180682
56867 180682 202524 214955 217366 211703 199937 183315 163614 143333 124403 107602 92957 79657
56855 79657 66115 51476 36813 23706 12224 1627 -7713 -14843 -20073 -24445 -27676 -28592 -27455
56842 -27455 -25996 -25053 -23867 -21723 -18538 -13784 -6620 2710 13221 25026 39276 56084 74202
56829G4202J8728J9817K1125K2045K3376K5740K7422K5967K1332J5604J0378O012
56817C11748K791J128R51K030M278O844Q054P483O912Q128J0801J3642J6333J9124
56803D20247K1918K5064K9632L5550M0684M2984M2038L7499K8180J4660Q43r339
56791G29960j5551j9557k1814k1887k0677j9508j7840j4327r475m944q13M288
56779E67855J0818J8060K5648L3627M1642M9643N8337O6749P0449O4714M9233
56768A056775K7811M424j8017l6003m6154m8430m6336m3064l9001l3379k6622
56757G52004k0233j5362j1890q341k973M279J1498J7351K3094L0630L9196M5463
56745H64716M6413M0825K8988J2827m034j8180k8423l5037l8033l7751l6011l4498
$$ plain form
56829 74202 92930 112747 133872 155917 179293 205033 232455 258422 279754 295358 305736 311748
56817 311748 314539 315667 316618 318648 322926 329770 337824 345307 352219 360347 371148 384790 401123 420247
56803 420247 442165 467229 496861 532411 573095 616079 658117 695616 723796 738456 739299 729960
56791 729960 714409 694852 673038 651151 630474 610966 593126 578799 569324 564380 563567 567855
56779 567855 578673 596733 622381 656008 697650 747293 805630 872379 942828 1007542 1056775
56768 1056775 1084586 1089010 1070993 1034990 988836 940406 894070 851006 812005 778626 752004
56757 752004 731771 716409 704519 696178 693205 697484 708982 726333 749427 780057 819253 864716
56745 864716 911129 951954 980942 993769 989735 971555 943132 908095 870062 832311 796300 761802
56733G61802l2513k8462k3031j8685j6173j3882j0666p027l251J432P014J1938
56721F28496J5033J6764J7698J6899J2821N217m325j3302j9693k3036k4367k4824
56709F03381k4644k3700k2279k0600j8439j6059j4604j4485j4285j2454r503p279
56697D05050o733p450q605r184q239o122m661m809n148l972j751k7P74Q44k78
56682C39689k448l777l079k230l515n719n775l595k031k369k970k638k305k630
56668B94608k668j794q76o39p42j048j965l007k806j289j10l59j254j705j649
56653B72697j442j197j180j643k161k168k092k620l158k548j059j26k61q12j466
56638B48764k322k859k580k208k423k123j64J919J592o61j967j430q64j063o81
$$ plain form
56733 761802 729289 700827 677796 659111 642938 629056 618390 611363 608112 609544 616558 628496
56721 628496 643529 660293 677991 694890 707711 712928 708603 695301 675608 652572 628205 603381
56709 603381 578737 555037 532758 512158 493719 477660 463056 448571 434286 421832 412329 405050
56697 405050 398317 390867 382262 373078 364839 358717 354056 349247 344099 340127 338376 338349 339123 339967 339689
56682 339689 337241 333464 330385 328155 324640 318921 313146 309551 307520 305151 302181 299543 297238 294608
56668 294608 291940 290146 289270 288631 287889 286841 284876 281869 279063 277774 277664 277305 276051 274346 272697
56653 272697 271255 270058 268878 267235 265074 262906 260814 258194 255036 252488 251429 251303 251042 250230 248764
56638 248764 246442 243583 241003 238795 236372 234249 234085 236004 237596 236935 234968 233538 232674 231611 230930
56623B30930N03N79j016j940l88K299L871L979L410K526J662J328J026l94k474
56608B45901l287k532k167l129l866l239k383k274j924o47K15l44r97l38P50Q92
56592B20631N50O05L21j130k660k839k187j790j017J100L346L632K163R68O64
56577B22357j7j519k380j358Q36K573L081K694J984J117O5p65o63J62J05j932
56561B26340m511n056l265j377q10m60R79K917M062M159L550K508J872K777M745
56546B38430N577M240K290J470J523J560J807K469K568J583Q54J571K637K377
56532B70956J242R53J778K495K468K058J472O90J86N39J666L299N470P630Q337
56517C11239P075N452N298O328O896O430N831O038P218Q862R984R938R641J0928
$$ plain form
56623 230930 231433 232012 230996 229056 228668 230967 234838 238817 242227 244753 246415 247743 248769 248375 245901
56608 245901 242614 240082 237915 234786 230920 227681 225298 223024 221100 220453 220668 220324 219327 218989 219739 220631
56592 220631 221181 221786 222107 220977 218317 215478 213291 211501 210484 211584 214930 218562 220725 221693 222357
56577 222357 222340 220821 218441 217083 217919 220492 223573 226267 228251 229368 229433 228668 228005 228167 228272 226340
56561 226340 221829 216773 213508 212131 211321 210861 211840 214757 218819 222978 226528 229036 230908 233685 238430
56546 238430 244007 248247 250537 252007 253530 255090 256897 259366 261934 263517 264371 265942 268579 270956
56532 270956 272198 273151 274929 277424 279892 281950 283422 284112 284298 284837 286503 289802 295272 302902 311239
56517 311239 318314 323766 329064 335392 342288 348718 354549 360587 367805 376667 386651 396589 406230 417158
56503D17158J4017J6941J8290J8919J9856K0285J9320J8211J8799K0720K1976
56492F24492K1526J9726J7044J3986J1486R834P902M869J718m57k441n275p804
56479G16606q238p461q306j1548j4949j6577j6959j7421j8053j8305j8325j8652
56467E41812j9117j8749j6821j3815j1243j0247j0367j0316r781r487r523r098
56455C93248q272q133q574p816n316l219l261m043l439k120k267l792m557l881
56441C24558l316l768m082k986p76J426K838K991J691m93k302k695j560K83J541
56426C13350J507Q99J066K163L097L417L804M317L958K764K503L953N297M757
56412C56852L196K360K060J128q7l15L93J041J613K748M076M590M225L673L218
$$ plain form
56503 417158 431175 448116 466406 485325 505181 525466 544786 562997 581796 602516 624492
56492 624492 646018 665744 682788 696774 708260 718094 725996 730865 732583 732126 729685 724410 716606
56479 716606 708368 700907 692601 681053 666104 649527 632568 615147 597094 578789 560464 541812
56467 541812 522695 503946 487125 473310 462067 451820 441453 431137 421356 411869 402346 393248
56455 393248 384976 376843 368269 360453 355137 351918 348657 344614 341175 339055 336788 332996 328439 324558
56441 324558 321242 317474 313392 310406 309630 311056 313894 316885 318576 318083 315781 313086 311526 311809 313350
56426 313350 314857 315756 316822 318985 322082 325499 329303 333620 337578 340342 342845 346798 352095 356852
56412 356852 360048 362408 364468 365596 365509 365194 365587 366628 368241 370989 375065 379655 383880 387553 390771
56397C90771K948L189L557K750P38l20R91K903K898J268R3j31m86j250j810k190
56381D05919k555k018r9J513R79p80j499r96q15j255j350j172j488j642m87R63
56365C93218N64j533l156l634m293n383n327l551j634j029j573k588l528l380
56351C53173j438J025J715K82j304j276M33K921M772M250R94k720m125l094j504
56336C54104l36O71J412J744K580M253M834K735j3k40J462J843M15m5J491K714
56320C79624K053Q13K69q5l74O35K994M681M438L285K326J357M19M36J491K522
56304D06884L244M314N333N170M447N006O519O471M137J709P99O38N74J388L083
56289D59716M084L820L654M309M844N018N905P298P275N439L796L314K511P73
$$ plain form
56397 390771 393719 396908 400465 403215 403953 403633 404624 407527 410425 411693 411786 411655 411169 409919 408109 405919
56381 405919 403364 401346 401247 402760 403739 402959 401460 400464 399649 398394 397044 395872 394384 392742 392255 393218
56365 393218 393782 392249 389093 385459 381166 375783 370456 366905 365271 364242 362669 360081 356553 353173
56351 353173 351735 352760 354475 354757 353453 352177 352610 355531 360303 364553 365547 362827 358702 355608 354104
56336 354104 353768 354439 355851 357595 360175 364428 369262 371997 371984 371744 373206 375049 375464 375419 376910 379624
56320 379624 381677 382490 382759 382674 382300 382935 385929 390610 395048 398333 400659 402016 402435 402871 404362 406884
56304 406884 410128 414442 419775 424945 429392 434398 440917 447388 451525 453234 454033 454671 455245 456633 459716
56289 459716 463800 467620 471274 475583 480427 485445 491350 498648 505923 511362 515158 518472 520983 521756
56275E21756J77K269N461P346P527O895O162O325Q319J1175J2605J2249J2024
56262F20290J2680J2814J2155J2655J5026J7149J7353J6498J5572J4141J2525
56251G78858J2400J3605J3466J0942Q385P385O209L532J428K025L960M928N166
56238H72289N893O608O556O746Q074R508J0369J2106J5518J8603J9697K0480K3117
56225A035564K6523K8323K8816L0225L3377L7512M2059M6543N0148N3087N6783
56214A468960O1301O4743O6880P0671P8104Q7023R4431J00568J07293J15019J23796
56203B438789J34864J48222J61110J71967J83635J99319K17498K34310K49089
56194D138803K63865K78654K90970K99234L03709L04473L00870K92309K77725
$$ plain form
56275 521756 521933 524202 529663 537009 544536 551431 557593 563918 572237 583412 596017 608266 620290
56262 620290 632970 645784 657939 670594 685620 702769 720122 736620 752192 766333 778858
56251 778858 791258 804863 818329 829271 837656 845041 851250 854782 856210 858235 862195 867123 872289
56238 872289 878182 884790 891346 898092 906166 915674 926043 938149 953667 972270 991967 1012447 1035564
56225 1035564 1062087 1090410 1119226 1149451 1182828 1220340 1262399 1308942 1359090 1412177 1468960
56214 1468960 1530261 1595004 1661884 1732555 1810659 1897682 1992113 2092681 2199974 2314993 2438789
56203 2438789 2573653 2721875 2882985 3054952 3238587 3437906 3655404 3889714 4138803
56194 4138803 4402668 4681322 4972292 5271526 5575235 5879708 6180578 6472887 6750612
56185F750612K55530K25876J91387J54072J13716P1180L0363n924l9199p1367
56175G676246j00202j22503j39242j53448j64876j71287j73721j76086j79953
56166F294928j83628j86053j88197j90790j93667j96956k00315k01649j99391
56157D554282j95194j91866j89527j86314j81625j75962j68932j60267j51510
56148B953085j43961j36325j27277j18543j12177j06585r8854q9611q1767p5813
56138A862172p0255o5467o2911o1226n7315n1084m5392m1417l7619l3171k8989
56127A307326k5405k1852j8762j7059j6054j4470j2797j1998j0931p986m276k120
56115A143616j404m37Q47J699L199O562J0109J1445J1366J2025J2730J1547R687
$$ plain form
56185 6750612 7006142 7232018 7423405 7577477 7691193 7762373 7792736 7786812 7747613 7676246
56175 7676246 7576044 7453541 7314299 7160851 6995975 6824688 6650967 6474881 6294928
56166 6294928 6111300 5925247 5737050 5546260 5352593 5155637 4955322 4753673 4554282
56157 4554282 4359088 4167222 3977695 3791381 3609756 3433794 3264862 3104595 2953085
56148 2953085 2809124 2672799 2545522 2426979 2314802 2208217 2109363 2019752 1937985 1862172
56138 1862172 1791917 1726450 1663539 1602313 1544998 1493914 1448522 1407105 1369486 1336315 1307326
56127 1307326 1281921 1260069 1241307 1224248 1208194 1193724 1180927 1168929 1157998 1150012 1145736 1143616
56115 1143616 1142212 1141775 1142622 1144321 1147520 1154082 1164191 1175636 1187002 1199027 1211757 1223304 1232991
56102A232991R880J1504J1626R988Q628P509N154K783L078N310O391O365Q002
56089A329209J1238J3048J2988J3953J7070K0556K4127K9805L7590M4829N0816
56078A605229N7865O6952P6298Q5030R4217J03491J10465J14305J16179J15686
56068B545717J10769J01930R2894Q6170Q1169P6904P3076O8067N9440M6965L2388
56057C375489J6640M80j3078k1162k5380k9868l5767m1870m9489o1257p5435q6663
56045B952640r2724r5642r6212r2805q5960p8961p3052o6703n9971n4853n1220
56034B104537m7153m3191m1212l9523l4760k8397k5286k5665k4965k1887j9958
56023A752540k0227j9346j6217j3900j3178j0830o256l299l196j987K552P321
$$ plain form
56102 1232991 1242871 1254375 1266001 1275989 1284617 1292126 1297280 1300063 1303141 1308451 1314842 1321207 1329209
56089 1329209 1340447 1353495 1366483 1380436 1397506 1418062 1442189 1471994 1509584 1554413 1605229
56078 1605229 1663094 1730046 1806344 1891374 1985591 2089082 2199547 2313852 2430031 2545717
56068 2545717 2656486 2758416 2851310 2937480 3018649 3095553 3168629 3236696 3296136 3343101 3375489
56057 3375489 3392129 3392609 3379531 3358369 3332989 3303121 3267354 3225484 3175995 3114738 3039303 2952640
56045 2952640 2859916 2764274 2668062 2575257 2489297 2410336 2337284 2270581 2210610 2155757 2104537
56034 2104537 2057384 2014193 1972981 1933458 1898698 1870301 1845015 1819350 1794385 1772498 1752540
56023 1752540 1732313 1712967 1696750 1682850 1669672 1658842 1652586 1649287 1646091 1644104 1646656 1653977
56011A653977R706J1365J3776J5499J6173J7959K0911K2117K1266K1586K3689
56000A848024K4232K2458K1993K4294K6282K6508K7519L0110L1406L0732L1236
55989B144794L3752L5290L5452L7696M2284M4833M4055M3944M6204M7763M7946
55978B604013N0599N6384O0621O1573O3362O7895P1594P2911P5203P9368Q1877
55967C345400Q2870Q7489R6034J01891J02823J04894J11289J16925J18739J21558
55957D389912J28652J35894J40626J47076J57529J67566J75442J86646K03420
55948E832763K19410K30690K42440K58666K75186K88930L04121L22960L40418
55939H315584L54628L71977L95462M18939M39315M62878M92677N21798N46537
$$ plain form
56011 1653977 1663683 1675048 1688824 1704323 1720496 1738455 1759366 1781483 1802749 1824335 1848024
56000 1848024 1872256 1894714 1916707 1941001 1967283 1993791 2021310 2051420 2082826 2113558 2144794
55989 2144794 2178546 2213836 2249288 2286984 2329268 2374101 2418156 2462100 2508304 2556067 2604013
55978 2604013 2654612 2710996 2771617 2833190 2896552 2964447 3036041 3108952 3184155 3263523 3345400
55967 3345400 3428270 3515759 3611793 3713684 3816507 3921401 4032690 4149615 4268354 4389912
55957 4389912 4518564 4654458 4795084 4942160 5099689 5267255 5442697 5629343 5832763
55948 5832763 6052173 6282863 6525303 6783969 7059155 7348085 7652206 7975166 8315584
55939 8315584 8670212 9042189 9437651 9856590 10295905 10758783 11251460 11773258 12319795
55930A2319795N73839O08251O44331O79589P21008P70731Q19961Q65865R19240
55921A8922610R86136J058110J130481J212718J309692J411042J511262J621248
55913B9163299J746803J876240K003846K144247K307620K483604K668137K883015
55905D7276811L148839L461242L813002M213997M669983N173058N738508O419401
55897H3914841P258497Q261648R447329J0879415J2614333J4660658J7029981
55890A64066702J9780940K2984773K6704568L0945986L5292169L8307854L7573900
55883C75656892L1035186J8840935L827694j0082611k0149835k5792317k7912293
55876C45423651k7761434k6365218k4456903k2487284k0635959j8928410j7369361
$$ plain form
55930 12319795 12893634 13501885 14146216 14825805 15546813 16317544 17137505 18003370 18922610
55921 18922610 19908746 20966856 22097337 23310055 24619747 26030789 27542051 29163299
55913 29163299 30910102 32786342 34790188 36934435 39242055 41725659 44393796 47276811
55905 47276811 50425650 53886892 57699894 61913891 66583874 71756932 77495440 83914841
55897 83914841 91173338 99434986 108882315 119761730 132376063 147036721 164066702
55890 164066702 183847642 206832415 233536983 264482969 299775138 338082992 375656892
55883 375656892 406692078 425533013 429360707 419278096 399128261 373335944 345423651
55876 345423651 317662217 291296999 266840096 244352812 223716853 204788443 187419082
55869A87419082j5961814j4679230j3495687j2418885j1452904j0560940r702210
55862I9147412q875645q093478p341889o603061n891603n235784m641645m103243
55854D8361064l628456l226042k882807k579291k315178k097417j917061j759368
55846B7955444j624225j515984j424167j333490j243338j160190j080904j000080
55838A7573066r24211q61993q08930p56290p06559o65503o27838n85703n43637
55829A1092402n10651m84325m56530m28316m05583l85938l62941l38282l17621
55820G402215k99236k78345k57892k43847k34257k23510k12909k06660k01905
55811E243654j93031j81972j74451j69721j63329j56078j51189j46483j38287
$$ plain form
55869 187419082 171457268 156778038 143282351 130863466 119410562 108849622 99147412
55862 99147412 90271767 82178289 74836400 68233339 62341736 57105952 52464307 48361064
55854 48361064 44732608 41506566 38623759 36044468 33729290 31631873 29714812 27955444
55846 27955444 26331219 24815235 23391068 22057578 20814240 19654050 18573146 17573066
55838 17573066 16648855 15786862 14977932 14221642 13515083 12849580 12221742 11636039 11092402
55829 11092402 10581751 10097426 9640896 9212580 8806997 8421059 8058118 7719836 7402215
55820 7402215 7102979 6824634 6566742 6322895 6088638 5865128 5652219 5445559 5243654
55811 5243654 5050623 4868651 4694200 4524479 4361150 4205072 4053883 3907400 3769113
55802C769113j29242j23503j18259j08859r8217r2072q8661q2403p4413o9880
55792B783604o8035o4210n9689o0003o4852o8344o8314o7365o5748o0958n3793
55781B082293m7818m3375l8429l4197l3604l5408l5961l5553l7060l9766m0438
55770A660684l9215l8689l8647l7235l5504l5266l4510l0804k7031k7461l0100
55759A286222k9446k5333k2441k2253k2026k0905k0566k0287j7581j3576j1997
55748A059811j2906j2780j0527q262o587m292k195k136k701j129J223O01k648
55735I95472m849n651q042j1908j3612j2491j1982j3390j3910j2214j0932j1997
55723H64494j3821j4553j4352j3275j0615p284n477n162m354l309m753r241j3836
$$ plain form
55802 3769113 3639871 3516368 3398109 3289250 3191033 3098961 3010300 2927897 2853484 2783604
55792 2783604 2715569 2651359 2591670 2531667 2466815 2398471 2330157 2262792 2197044 2136086 2082293
55781 2082293 2034475 1991100 1952671 1918474 1884870 1849462 1813501 1777948 1740888 1701122 1660684
55770 1660684 1621469 1582780 1544133 1506898 1471394 1436128 1401618 1370814 1343783 1316322 1286222
55759 1286222 1256776 1231443 1209002 1186749 1164723 1143818 1123252 1102965 1085384 1071808 1059811
55748 1059811 1046905 1034125 1023598 1015336 1008749 1004457 1002262 1000126 997425 996296 997519 998120 995472
55735 995472 990623 984972 976930 965022 951410 938919 926937 913547 899637 887423 876491 864494
55723 864494 850673 836120 821768 808493 797878 790594 785117 779955 775601 772292 767539 758298 744462
55710G44462j6229j6973j6985j6166j5133j5210j5898j5208j2950j0996j0147
55699E82567r628r700j1485j3966j4457j2585j0671r840q742o809n646o337p878
55686D54823q996r288q295n814l336k900m235n158m622l247j422O29J447j05k295
55671C97186k340m99N18k33j352k358m180o324o944n972n203m973l835j736n41
55656C51214q69j336j320j735k587k544j406m51Q8J324L325M934O140P875R387
55641C72039Q633N714L081K084J926K204L417M632L831J358K5J037K559L045L139
55626D18724L357K812J423P54J352J551K52j276j487n82N34J575K306K299J888
55611D35482J857J945J321N41R72K304K825K199J691J715J598J693K884L993K782
$$ plain form
55710 744462 728233 711260 694275 678109 662976 647766 631868 616660 603710 592714 582567
55699 582567 572939 563239 551754 537788 523331 510746 500075 490235 481493 474684 469038 462701 454823
55686 454823 445827 436539 428244 422430 419094 416194 411959 406801 402179 398932 397510 398139 399586 399481 397186
55671 397186 394846 394347 394865 394632 393280 390922 386742 380418 373474 367502 362299 357326 353491 351755 351214
55656 351214 350345 349009 347689 345954 343367 340823 339417 338966 339054 340378 343703 348637 354777 362652 372039
55641 372039 380672 386386 389467 391551 393477 395681 399098 403730 407561 408919 408944 409981 412540 415585 418724
55626 418724 422081 424893 426316 427070 428422 429973 430225 428949 427462 426880 427414 428989 431295 433594 435482
55611 435482 437339 439284 440605 441146 442118 444422 447247 449446 451137 452852 454450 456143 459027 463020 465802
55596D65802k20k061j879j616j710o7L324M734J883k572n277o890r654j2743j3454
55581D17600j1679j0069j0298j1577j2587j2895j2463j1285r688q271p575q026
55569B91187r572j1204j1653j0786r527q418p381o575o125n223l217j425j789
55556A98292l625m030j988J25J3j654k833k800k140j500j304j653j889j345p19
55541A70950j244k463k528r90M81N57l54j399k099j669M37K877L375J729q0j036
55525A66544k028l352l829l177k667k551j342J182K797K028K87n84q74j458j793
55510A49183j144k60r1j29N89J800K528K337J495Q75J758M182N630L591n42k698
55494A69104j621k00n94j414j061n67r53p69J211L237L142J759J257J766K021
$$ plain form
55596 465802 465582 463521 461642 460026 458316 458249 461573 466307 468190 465618 460341 453451 443797 431054 417600
55581 417600 405921 395852 385554 373977 361390 348495 336032 324747 315059 306788 299213 291187
55569 291187 281615 270411 258758 247972 238445 230027 222646 216071 209946 204723 201506 200081 198292
55556 198292 194667 190637 188649 188774 188787 187133 184300 181500 179360 177860 176556 174903 173014 171669 170950
55541 170950 169706 167243 164715 163725 164206 164763 164409 163010 160911 159242 159679 162556 165931 167660 167580 166544
55525 166544 164516 161164 157335 154158 151491 148940 147598 148780 151577 153605 153892 153308 152434 150976 149183
55510 149183 148039 147779 147688 147559 148148 149948 152476 154813 156308 157183 158941 163123 168753 172344 171802 169104
55494 169104 167483 167283 166689 165275 164214 163647 162694 161925 163136 166373 169515 171274 172531 174297 176318
55479A76318J973K424L284M163N405O829O898N021L144L048L650L133K110K277
55465B29677L200L192K435K592L784M184K572n47m013o715p706p058o149o022
55451B13426o220o143o203o471n771l819k576l549n149n036l748l555m755n717
55437A44714o001o675p733p702o047l979k610j881j415j043n12J23O9j060k256
55422I5992k505k437l136l991l408j206J332L186L902K878K47k101k290j101q96
55407H4466k269l571l588k803j878p61L69Q63O77M54L32j76j030j633j952k469
55391F5031k961k524j005O28J511J583J114M27J30P03J819K614K541J558p2j641
55375G1456k281j995j702j769j502p23n06j202j247N14K627K960J818J116J264
$$ plain form
55479 176318 178291 180715 183999 188162 193567 200396 207294 212315 215459 218507 222157 225290 227400 229677
55465 229677 232877 236069 238504 241096 244880 249064 251636 251089 247076 240361 232655 225597 219448 213426
55451 213426 207206 201063 194860 188389 182618 178799 176223 172674 167525 162489 158741 155186 150431 144714
55437 144714 138713 132038 124305 116603 110556 106577 103967 102086 100671 99628 99116 99239 99308 98248 95992
55422 95992 93487 91050 87914 83923 80515 79309 80641 83827 87729 90607 90854 88753 86463 85362 84466
55407 84466 82197 78626 75038 72235 70357 69596 69965 70828 71505 71959 72291 72115 71085 69452 67500 65031
55391 65031 62070 59546 58541 59169 60680 62263 63377 63804 63934 64637 66456 69070 71611 73169 73097 71456
55375 71456 69175 67180 65478 63709 62207 61484 60978 59776 58529 59043 61670 64630 66448 67564 68828
55360F8828J028k0j010j550k011k121j145N35J545J297K70j091k273k001M10L280
55344F3971M088K721J285P83J02j405k620k576j825j017J78J802K632J656l86
55329F9389j773j600k83R96J157J26r24q81j40J09k99m75j36Km14q84j115j404
55311F1451j721j568r88o81q77j011p80n52n93p75j086j566j761j224m90m44o88
55294D4646L3J675K499J462k07n45P17K081K162J097J26Q6M91L67k38l63R7J5
55276E6201j026j699r11M22Q86O58N18p5j846l572l346j492oN68J276K043J587
55259E0186K71L53K416L985K929K81j595j997j759j478j236j145j091o65%J50
55243D9605l06m61J42P88Q47O57O35O74Q91J722K670K271K20j671j627j71P21
$$ plain form
55360 68828 69856 69836 68826 67276 65265 63144 61999 62534 64079 65376 65646 64555 62282 60281 60691 63971
55344 63971 68059 70780 72065 72848 72950 71545 68925 66349 64524 63507 63685 65487 68119 69775 69389
55329 69389 67616 66016 65733 66729 67886 68012 67088 66207 66067 66176 65877 65402 65266 65268 64854 63970 62855 61451
55311 61451 59730 58162 57174 56493 55616 54605 53825 53273 52680 51905 50819 49253 47492 46268 45778 45334 44646
55294 44646 44679 46354 48853 50315 50108 49563 50280 52361 54523 55620 55746 55832 56323 56690 56452 56089 56186 56201
55276 56201 55175 53476 52565 52987 53873 54531 55049 54974 53128 49556 46210 44718 44712 45280 46556 48599 50186
55259 50186 50457 50810 53226 57211 60140 60421 58826 56829 55070 53592 52356 51211 50120 49455 49455 49605
55243 49605 49299 48838 48980 49768 50615 51272 51907 52581 53472 55194 57864 60135 60355 58684 57057 56886 57607
55226E7607J11j033j038P97L287M099K223m81j292q9P40j48j452j684j256j138
55210E9253j107o07J0L41R03K003K682K050P66k0l87j032j724j701j134q97j073
55193E8326q32K68J561J929Q27j121k417k190j398j703k983l243j443R69K116
55178D8666J993J644J299O74J80L36N81M5r35j315r73o56o15m83l30o08j155j262
55160D7086q33n23o29o64j29Q90J958K580K365J421N57N17J100J432J057K71m02
55143E8054o28k46O36J489J691J061n7j058j414r89k37J92J04k06m89o13k43P63
55125E7810J676J490M06k38J44O47M92J96M06O34K35k78p1N39O49L04J53K0p47
55106F4467j667j397J28J256Q55k14n85l61n15j005p49M97J473J032k99j178j305
$$ plain form
55226 57607 57718 56685 55647 56444 59731 63830 66053 65572 64280 64191 64931 64783 63331 61647 60391 59253
55210 59253 58146 57539 57549 57890 58793 60796 63478 65528 66294 66274 65887 64855 63131 61430 60296 59399 58326
55193 58326 57494 57762 59323 61252 62079 60958 58541 56351 54953 53250 50267 47024 45581 46550 48666
55178 48666 50659 52303 53602 54276 54456 54792 55373 55418 54483 53168 52195 51539 50924 50441 50111 49503 48348 47086
55160 47086 46253 45730 45101 44437 44308 45198 47156 49736 52101 53522 54079 54596 55696 57128 58185 58456 58054
55143 58054 57426 57180 57816 59305 60996 62057 62000 60942 59528 58539 58302 58494 58598 58392 57903 57290 57047 57810
55125 57810 59486 60976 61382 61144 61288 61935 62427 62623 63029 63663 63898 63620 63549 64088 64737 65041 65194 65214 64467
55106 64467 62800 61403 61531 62787 63642 63428 62843 62482 61967 60962 60213 60710 62183 63215 62916 61738 60433
55089F0433j543k298k812k422j618j202r36L0J659K853K818J943J217J183J519
55074F0824J358K12j146j222L51K024K193J233Q06J529K472K627J726j3j771k070
55058G1133l11J759J694m60k187j876m53N72R05O95k04j366j657q98k84l90k60
55041F6412O58J374J247J265K004K000K2k354k516l14K106L391L911M019L398
55026H6623K217J274P84K61k79j66P28J732K372K773K978K757K216J845J949K386
55010A12450K723K300O89j287j803j91J832K162Q64l95r30j490k373k700j794
54995A10057j57J226J742J247J31p20q24q60j700k919l255k453j479r40m23L30
54979I9003P47L60m14r31j124j240j212p57J80J271J999K014J373L63r09k380
$$ plain form
55089 60433 58890 56592 53780 51358 49740 48538 47602 47632 49291 52144 54962 56905 58122 59305 60824
55074 60824 62182 62394 61248 60026 60377 62401 64594 65827 66633 68162 70634 73261 74987 74974 73203 71133
55058 71133 70822 72581 74275 73815 71628 69752 69299 69871 70776 71471 71267 69901 68244 67346 67062 66672 66412
55041 66412 67070 68444 69691 70956 72960 74960 74982 72628 70112 69798 71904 75295 79206 83225 86623
55026 86623 88840 90114 90898 91159 90880 90714 91442 93174 95546 98319 101297 104054 106270 108115 110064 112450
55010 112450 115173 117473 118162 116875 115072 114881 116713 118875 119739 119344 118414 116924 114551 111851 110057
54995 110057 109900 111126 112868 114115 114246 113526 112702 111842 110142 107223 103968 101515 100036 99096 98673 99003
54979 99003 99750 100110 99696 98765 97641 96401 95189 94432 94612 95883 97882 99896 101269 101632 100723 98343
54963I8343l391l049j481MO08R52J674K151J698J040J195J663J340O24Q69K004
54947A06244K572K156J866K138J899N70p46j012p50q72j097o53K92R56J065Q10
54931A15438J97o43j070o97j82m68j365j722r33L66J183J267J083J073J177J089
54915A15793P29L37K16N59J409K393K634J641M74R75L256N039M557L078L049M381
54899A50520M719L289K166L011M653N335N678P510J0750J3423J4627J5595J7472
54886B58748J9521K0148J8798J6091J2783R215N514J785j835m982p185q425r367
54873C30809j0670j2272j3596j4262j4182j3240j1506r719q724q261p190n358
54861B01829m303n200o789o631m118j021J001K082L071M070M787N443O439P751
$$ plain form
54963 98343 94952 91903 90422 90426 91034 91986 93660 95811 97509 98549 99744 101407 102747 103371 104240 106244
54947 106244 108816 110972 112838 114976 116875 117445 116699 115687 114937 114065 112968 112315 112607 113563 114628 115438
54931 115438 115635 114992 113922 113225 113043 112575 111210 109488 108555 108921 110104 111371 112454 113527 114704 115793
54915 115793 116522 116859 117075 117634 119043 121436 124070 125711 126185 127160 130416 135455 140012 143090 146139 150520
54899 150520 155239 158528 160694 163705 168358 173693 179371 186881 197631 211054 225681 241276 258748
54886 258748 278269 298417 317215 333306 346089 355304 360818 362603 360768 355786 348601 340176 330809
54873 330809 320139 307867 294271 280009 265827 252587 241081 231362 222638 214377 207187 201829
54861 201829 197526 192326 185537 178906 174788 173767 174768 176850 179921 183991 188778 194221 200660 208411
54847B08411R240J1042J3111J4896J6007J6525J6324J4812J1934Q569N208J195
54835C47274l799q514j1546j3312j5099j6627j6252j3615j0576r043r036r394
54823B10461r446r220q658p419n575m039l976n529p257p377n699l712k564j840
54809A28150q35R0L29L37Q59J393P74r11k238k181j066J22M73m58j980k393r28
54792A19537O80l1l004n577n751m174k528j305NJ479K295J536p76l226l872k296
54776I2992l61j07j228j759r15K55R86J745K695K876J833O92O53J272J312N78
54760A03519kK34J084J999K608K843K913L058L263L354L302L073K540J968K264
54745A38020L773N304N446M632M637N990P446Q271R411J1665J4009J4979J4712
$$ plain form
54847 208411 217651 228693 241804 256700 272707 289232 305556 320368 332302 340871 346079 347274
54835 347274 343475 334961 323415 310103 295004 278377 262125 248510 237934 228891 219855 210461
54823 210461 201015 191795 183137 175718 170143 166104 162128 156599 149342 141965 136266 132554 129990 128150
54809 128150 127315 127405 127734 128071 128930 130323 131097 130186 127948 125767 124701 124823 125296 124838 122858 120465 119537
54792 119537 120217 120186 117182 111605 105854 101680 99152 97847 97852 99331 101626 103162 102386 99160 95288 92992
54776 92992 92631 92524 91296 89537 88622 88877 89863 91608 94303 97179 99012 99704 100357 101629 102941 103519
54760 103519 103517 103751 104835 106834 109442 112285 115198 118256 121519 124873 128175 131248 133788 135756 138020
54745 138020 141793 147097 152543 157175 161812 167802 175248 183519 192930 204595 218604 233583 248295
54732B48295J4592J5317J6346J6885J6592J5376J3058R456M772j9l526n195n958
54719C55991p027q349r090r223r462r905j0143j0457j1293j1459q970m274o62
54706B45677l99k113l140k834k101j156L42J897K823L644N211O898P407P119P909
54691B77184J0459J3306J4915J5457J5984J6740J6820J5066J1097N897J338j503
54679D12760l480o195r694j2220j2472j1288j0554j1046j2076j2881j3483j3951
54667B83420j3564j1547q459o110n685o454o824o171n117m397m202m388m558m100
54653A91844l002k320k894l830l526k143j584k635l691l014j051N47J212J627
54639A65540K163K253J305m27j795j540M33K523K909J700O97Q14R89J57j008j250
$$ plain form
54732 248295 262887 278204 294550 311435 328027 343403 356461 365917 370689 370670 367144 361949 355991
54719 355991 348964 340615 331525 322302 312840 302935 292792 282335 271042 259583 250613 246339 245677
54706 245677 245278 243165 240025 237191 235090 233934 234276 236173 238996 242640 247851 254749 262156 269275 277184
54691 277184 287643 300949 315864 331321 347305 364045 380865 395931 407028 412925 414263 412760
54679 412760 409280 403085 393391 381171 368699 357411 346857 335811 323735 310854 297371 283420
54667 283420 269856 258309 249850 243740 238055 231601 224777 218606 213489 209092 204890 200502 195944 191844
54653 191844 188842 186522 183628 179798 176272 174129 172545 169910 166219 163205 162154 162701 163913 165540
54639 165540 167703 169956 171261 170834 169039 167499 167932 170455 173364 175064 175761 176575 177564 177721 176713 175463
54623A75463n66K35J043K287L704M362L720K010r1j612j630j69J648K895L763
54608A97062M655N153M607L331K348K385L551N465P132P415O297N095M797M887
54594B64180M332L000J418j7q57n45O10J360J319J754L477N000M305J745l57n01
54578B90223Q23K345L060K630J889K446M604O379N990M490M181N032M807K522
54564C41421l97k594m303n894o710o307n463n134n385n914o581o935o310m884
54550B68610l695l164k577j502n88l75k90M20J613K698L482L855L343J731k85
54535B73276j678k111k073k348l474n273o730o854n829m738m107l506k674k170
54521B19711k460l139l589l792m032m273m373m413m399m048l368l044l686m839
$$ plain form
54623 175463 174897 175132 176175 178462 182166 186528 190248 192258 192167 190555 188925 188756 190404 193299 197062
54608 197062 201717 206870 211477 214808 217156 219541 223092 228557 235689 243104 249401 254496 259293 264180
54594 264180 268512 271512 272930 272913 272056 271511 272121 273481 274800 276554 280031 285031 289336 291081 290724 290223
54578 290223 291046 293391 296451 299081 300970 303416 308020 314399 320389 324879 329060 334092 338899 341421
54564 341421 341024 338430 334127 328233 321523 315216 309753 304619 299234 293320 286739 279804 273494 268610
54550 268610 264915 261751 259174 257672 257084 256709 256419 256839 258452 261150 264632 268487 271830 273561 273276
54535 273276 271598 269487 267414 265066 261592 256319 249589 242735 236906 232168 228061 224555 221881 219711
54521 219711 217251 214112 210523 206731 202699 198426 194053 189640 185241 181193 177825 174781 171095 166256
54507A66256n205l931j601J44L9j511k774k513j185j22M7m88j544k903l670k938
54491A36101j183jj05o77q74r27j175j136l42P07J254J310J190P05j78m27J013
54474A35255L328M256K787M62n82j14N03O24J180L037N465O951O944N991M532
54459A80619K601Q00K88J297K437K257Q56o84j779k457k607k130j565j587k116
54444A76230k672l234l785l493j760P0k17k501l855k219P55J846M30j094p95N41
54428A54247J155R91J396K782M041M436M703N524N968M890L120K503K946K399
54414B01101K43j358n35J667L216M067N293O454O005L885J670M58K64J104K737
54399B36271L599K187m69j796j285r70j995l042k947k581k893l121k378j415j240
$$ plain form
54507 166256 161051 157120 155519 155663 155702 154191 151417 148904 147719 147597 147644 147156 145612 142709 139039 136101
54491 136101 134918 134917 134812 134135 133261 132334 131159 130023 129681 130388 131642 132952 134142 134847 134669 134242 135255
54474 135255 138583 142839 145626 146088 145506 145392 145895 146519 147699 150736 156201 163152 170096 176087 180619
54459 180619 183220 184020 184308 185605 188042 190299 191155 190471 188692 186235 183628 181498 179933 178346 176230
54444 176230 173558 170324 166539 163046 161286 161356 161139 158638 154783 152564 153319 155165 155595 154501 153706 154247
54428 154247 155402 156393 157789 160571 164612 169048 173751 179275 185243 190133 193253 195756 198702 201101
54414 201101 201344 199986 199451 201118 204334 208401 213694 220148 226153 230038 231708 232166 232430 233534 236271
54399 236271 239870 242057 241588 239792 238507 237537 235542 232500 229553 226972 224079 220958 218580 217165 215925
54384B15925j431j329j651l195m956n314m338l332k618j510j06M74k87j626k458
54369A82248k228j040J28j41j964l332k343J13J447R67O11J738L043K769J528
54354A83544J385K819M231M437M219M811N822N658L626Q25j059j248p5J622L000
54339B23617L594L644L748M012L988L593L361L365K848J715J410K985M961M806
54325B71647K333j5m61J95L49k93j129j908k589k939l076l670m858n793n884n648
54309B36261n681n623m988m170l779l689l607l823m494m834m100k878k381k789
54295A79425l229l073k428j542o01N2K20L61J118K473L754M240L555J879K47J31
54279A86582K026M744O571O866O103M970L938L349L271L563M220N095N207L353
$$ plain form
54384 215925 214494 213165 211514 208319 203363 198049 193711 190379 187761 186251 186145 186619 186332 184706 182248
54369 182248 180020 178980 179108 178967 177003 173671 171328 171441 172888 173855 174466 176204 179247 182016 183544
54354 183544 184929 187748 191979 196416 200635 205446 211268 216926 220552 221377 220318 219070 218995 220617 223617
54339 223617 227211 230855 234603 238615 242603 246196 249557 252922 255770 257485 258895 261880 266841 271647
54325 271647 273980 273965 273504 273699 274048 273755 272626 270718 268129 265190 262114 258444 253586 247793 241909 236261
54309 236261 230580 224957 219969 215799 212020 208331 204724 200901 196407 191573 187473 184595 182214 179425
54295 179425 176196 173123 170695 169153 168552 168604 168824 169185 170303 172776 176530 180770 184325 186204 186451 186582
54279 186582 188608 193352 199923 206789 212892 217862 221800 225149 228420 231983 236203 241298 246505 249858
54265B49858j3k714l474l482m378n819o461o313o245n933m409k460k261m158n725
54250A86013m970k866j723k169l078l610l995m511m897m933m830m711m222l036
54236A32462j484k59L39N42M72o1q63j080l24M15kr78q07P84K068J843J043R87
54218A35097J338J133P05R59J408O95j024j843n97J733L496M209M405M418M015
54203A60147L007J809J307J962K990K959J513k6l40L19Q47Q72O27j01j596l081
54187A73215l350k408j372p74k46Q7o21k315l412k587m75J048P93q31k420k778
54171A51554j931j015q42q87k55P29R56L71J78R62J847J843J100L37n5J47J072
54154A56111K111K103Q99k0O61K255K964K154Q48Q2k78q95j803k333k042j337
$$ plain form
54265 249858 249845 247131 243657 240175 235797 229978 223517 217204 210959 205026 200617 198157 195896 191738 186013
54250 186013 181043 178177 176454 174285 171207 167597 163602 159091 154194 149261 144431 139720 135498 132462
54236 132462 130978 130719 131058 131600 132072 132011 131148 130068 129744 130159 130157 129179 128372 129156 131224 133067 134110 135097
54218 135097 136435 137568 138273 139232 140640 141335 140311 138468 137871 139604 143100 147309 151714 156132 160147
54203 160147 163154 164963 166270 168232 171222 174181 175694 175668 175328 175647 176494 177366 177993 177892 176296 173215
54187 173215 169865 167457 166085 165311 165065 165152 164531 162216 158804 156217 155742 156790 157583 156752 154332 151554
54171 151554 149623 148608 147766 146879 146624 147353 148309 148680 148858 149820 151667 153510 154610 154947 154892 155039 156111
54154 156111 158222 160325 161224 161204 161865 164120 167084 169238 170086 170168 169890 168995 167192 164859 162817 161480
54138A61480j077j638k488k730j970o48J97m26k489m429m347k285n91j137k940
54123A32482l701l038k527k685k081m0J619J028q07j184O22K430J957n89l056
54108A20430l673k431o31M72N97L07J67K94O28J257K059K326J262r65k931l106
54092A16062j388O87J495J004N29Q95J509J534J140R49Q14Q2j192k262k824l192
54076A15842l308k521p14J164K023J636M94o95j241q65j66j53j001j841j929j466
54060A05259q93j36J017K138K409J414n09k535l775l758k772j604q75o65o13j13
54044I3989J201K717K987J427m34m39J473L107K739R05q42j769j870j150M7O89
54028A04777J34p93p99R2O39K89rP82K188K662J555M9k11Q23J584J019j14o13
$$ plain form
54138 161480 160403 158765 156277 153547 151577 150929 151126 150700 148211 143782 139435 137150 136559 135422 132482
54123 132482 128781 125743 123216 120531 118450 118410 120029 121057 120250 119066 119688 122118 124075 123486 120430
54108 120430 116757 114326 113695 114167 114764 115071 115238 115532 116160 117417 119476 121802 123064 122099 119168 116062
54092 116062 114674 115361 116856 117860 118389 119284 120793 122327 123467 124416 125230 125312 124120 121858 119034 115842
54076 115842 112534 110013 109299 110463 112486 114122 114616 113921 112680 111815 111649 111496 110495 108654 106725 105259
54060 105259 104366 104230 105247 107385 109794 111208 110699 108164 104389 100631 97859 96255 95380 94715 94102 93989
54044 93989 95190 97907 100894 102321 101887 101448 102921 106028 108767 109672 108830 107061 105191 104041 104088 104777
54028 104777 104911 104118 103319 103411 104050 104339 104330 105112 107300 109962 111517 111566 111355 112178 113762 114781 114667 114054
54010A14054o75j276k152j884q0J810K316J606P29K32J43O49J957L718N083N242
53994A31472L911J822N21R35K116K382J664J554K745L854L396J805O14N59J338
53979A60688K374L129L471M154O005Q093Q229O098M285M897O717P399O988P016
53965B39543P197N913L639L007M888O804O394M525L693M741O474P607P762P045
53951C19232N684M001K247O43m46r26j506k947m662n144m072k909k879l542m022
53936B98752m457n204n627m978l765k899k135p74N02K53j359k506k324j968k464
53921B59047l134l194l374m436n160l843j333m41k126m152m191k598j050j0R63
53906B20968J472P16p34j323p63l40p90j293r66m6J008K308L634L926K688J070
$$ plain form
54010 114054 113379 112103 109951 108067 107987 109797 112113 113719 114448 114680 114823 115472 117429 121147 126230 131472
53994 131472 135383 137205 137726 138661 140777 143159 144823 146377 149122 152976 156372 158177 158791 159350 160688
53979 160688 163062 166191 169662 173816 179821 187914 196143 202241 206526 211423 218140 225539 232527 239543
53965 239543 246740 252653 256292 259299 264187 270991 277385 281910 285603 290344 296818 304425 312187 319232
53951 319232 324916 328917 331164 331807 331361 330435 328929 325982 321320 316176 312104 309195 306316 302774 298752
53936 298752 294295 289091 283464 278486 274721 271822 269687 268913 269415 269668 268309 265803 263479 261511 259047
53921 259047 255913 252719 249345 244909 239749 235906 234573 234132 232006 227854 223663 221065 220015 220005 220968
53906 220968 222440 223156 222422 221099 220336 219996 219206 217913 216947 216901 217909 220217 223851 227777 230465 231535
53890B31535M72P25P79N21O70J254J627J939L167N388P254P769P610P963Q891
53875B87564R696J0392J1653J3357J4203J3249J1211R608Q807P635N102J892l89
53862D03980j133j194j428j568r09M27J599K157K487L112L978M587M524L796K822
53847D27237K241K647M309O909R398J0433R420P176N161L997L150K040R13K51
53833D95282j37q81k162l465m133l955l314l020l777n577p644r092r529r130q485
53818D20981q331q990r949j0401j0250j0012r758r020p900p372p797q139p405
53805C05657o244o007o645o724n574m411m819o585p611o154k974q11j429l646
53791B36023n027n104n534o985p702o046l066j055n24j95O11J124N48j033l041
$$ plain form
53890 231535 232007 232732 233511 234032 234702 235956 237583 239522 242689 248077 255331 263100 270710 278673 287564
53875 287564 297260 307652 319305 332662 346865 360114 371325 380933 389740 397375 402477 404369 403980
53862 403980 402847 401653 400225 398657 397748 398175 399774 401931 404418 407530 411508 416095 420619 424415 427237
53847 427237 429478 432125 436434 443343 452741 463174 472594 479770 484931 488928 492078 494118 495031 495282
53833 495282 495145 494264 492102 488637 484504 480549 477235 474215 470438 464861 457217 448125 438596 429466 420981
53818 420981 412650 403660 393711 383310 373060 363048 353290 344270 336370 328998 321201 313062 305657
53805 305657 299413 293406 286761 280037 274463 270052 265233 258648 251037 244883 241909 241098 239669 236023
53791 236023 230996 225892 220358 213373 205671 199625 196559 195504 194980 194785 195396 196520 197068 196035 192994
53776A92994m650m861l527k108k159l187l295j813P7J358K224K842K667J651Q72
53761A79085J116J843K230K235J964J038m65j309m46J399K550K399J742J329J087
53746A97797P81O82J182K177L108L624L934M477N223N705N808O085O787P109O230
53731B60709M752M109M627N261N331N319N709O195O474O675O472N051K765J488
53717C30937K124K891J649q91k074j112j31j092l306m772m801m277m054m104m182
53702C02805m399m967n743o218n948m900l476k237j580j556j818j797j254o98
53688B56214r95k296l701m249l942l507l398l445l319k840j936p71R5J26l73l15
53672B21348J034L093M430M119K447M01j258k182k049o80J385K869K962K188J600
$$ plain form
53776 192994 188344 183483 179956 177848 175689 172502 169207 167394 167471 168829 171053 173895 176562 178213 179085
53761 179085 180201 182044 184274 186509 188473 189511 189046 187737 187291 188690 191240 193639 195381 196710 197797
53746 197797 198578 199260 200442 202619 205727 209351 213285 217762 222985 228690 234498 240583 247370 254479 260709
53731 260709 265461 269570 274197 279458 284789 290108 295817 302012 308486 315161 321633 326684 329449 330937
53717 330937 333061 335952 337601 336710 334636 333524 333393 332301 328995 324223 319422 315145 311091 306987 302805
53702 302805 298406 293439 287696 281478 275530 270630 267154 264917 263337 261781 259963 258166 256912 256214
53688 256214 255219 252923 249222 244973 241031 237524 234126 230681 227362 224522 222586 221815 221910 222036 221663 221348
53672 221348 222382 225475 229905 234024 236471 236872 235614 233432 231383 230703 232088 234957 237919 240107 241707
53657B41707J359R74P50J819M269O302O177M315K543J689J075K44j82L73J426
53642B74840K202K624K878K654J672N80L62J006J584J731K023K559K349Q83m72
53627B99475l0J709K580J955J807L707O138O338M127K140K209L265L421K759K627
53612C44227L138K937J477J01J54R85Q20p42k152j988p26J64J49j16j02J12N90
53595C49028J664K887K981J572P8l1P15N94q72k476l148l025k617k003j245p40
53579C43362o80p63o60k44P11K248L526L291J525j89m35M90J236J074M22J82Q84
53562C55980K147K805K136R90R32K054K696J731J79k35Q53K633M517O308P577
53547C93303P998P903P616O743N099L832M326O139P312O857N761N372N820O542
$$ plain form
53657 241707 243066 244040 244790 246609 250878 257180 263357 267672 270215 271904 272979 273223 273041 273414 274840
53642 274840 277042 279666 282544 285198 286870 287450 287812 288818 290402 292133 294156 296715 299064 299947 299475
53627 299475 299445 301154 303734 305689 307496 311203 317341 323679 327806 329946 332155 335420 338841 341600 344227
53612 344227 347365 350302 351779 351880 352034 353019 353839 353097 350945 348957 348231 348395 348544 348428 348326 348438 349028
53595 349028 350692 353579 356560 358132 358210 358179 358894 359488 358616 356140 352992 349967 347350 345347 344102 343362
53579 343362 342682 341919 341259 341015 341726 343974 347500 350791 352316 352127 351692 352182 353418 354492 354914 355096 355980
53562 355980 358127 360932 363068 364058 364990 367044 369740 371471 371650 371415 372268 374901 379418 385726 393303
53547 393303 401301 409204 416820 423563 428662 432494 436820 442959 450271 457128 462889 468261 474081 480623
53533D80623P400Q579R753J0020Q644N842K944J611K384M053M914M502L660L040
53519E57969K392J404M82K62P35J298J496J521J963L021M008L947K864J952K086
53504E87400K773L174L458M075M325L097R80M5J069K496K825K721L621N266O069
53489F33394N481M704M985O275P720Q693R057Q921Q440P715O888O432O986Q551
53475G34242J0062J0416R759R230R516J0219J0703J0950J1336J2142J3471J5198
53463H67244J6686J6984J5823J4229J3674J4660J6423J7837J8355J8143J7758
53452A047816J7914J9208K1674K4549K6632K7158K6477K5871K6479K8223K9925
53441A321926L0667L0905L1917L4231L7001L9073M0163M0746M1174M1491M1894
$$ plain form
53533 480623 488023 496602 506355 516375 525019 530861 533805 535416 537800 541853 546767 551269 554929 557969
53519 557969 560361 561765 562247 562509 563244 564542 566038 567559 569522 572543 576551 580498 583362 585314 587400
53504 587400 590173 593347 596805 600880 605205 608302 609282 609327 610396 612892 615717 618438 622059 627325 633394
53489 633394 638875 643579 648564 654839 662559 671252 680309 689230 697670 705385 712273 718705 725691 734242
53475 734242 744304 754720 764479 773709 783225 793444 804147 815097 826433 838575 852046 867244
53463 867244 883930 900914 916737 930966 944640 959300 975723 993560 1011915 1030058 1047816
53452 1047816 1065730 1084938 1106612 1131161 1157793 1184951 1211428 1237299 1263778 1292001 1321926
53441 1321926 1352593 1383498 1415415 1449646 1486647 1525720 1565883 1606629 1647803 1689294 1731188
53430A731188M2693M3698M4187M3848M3316M3447M4222M4741M4224M2785M1258
53419B209607M0492M0729M1469M1909M1650M0913M0047L8992L7561L6054L5119
53408B644542L4876L4546L3187L0673K7621K4585K1663J8862J6415J4461J2684
53397B914115J0520P756M643J461j755n038q298j1399j4269j6824j8976k0686
53385B841250k1988k3013k4273k6605l0116l3321l4324l3354l3128l5739l9730
53374B505659m1506l9478l5691l3201l3020l3961l4521l4094l2839l1130k9125
53363B127093k6662k3625k0432j7745j5664j3672j1426r102o828m373j684Q13
53351A976693K728M213N729P603R800J1812J3102J4166J6761K1889K7854L1794
$$ plain form
53430 1731188 1773881 1817579 1861766 1905614 1948930 1992377 2036599 2081340 2125564 2168349 2209607
53419 2209607 2250099 2290828 2332297 2374206 2415856 2456769 2496816 2535808 2573369 2609423 2644542
53408 2644542 2679418 2713964 2747151 2777824 2805445 2830030 2851693 2870555 2886970 2901431 2914115
53397 2914115 2924635 2932391 2937034 2938495 2936740 2931702 2923404 2912005 2897736 2880912 2861936 2841250
53385 2841250 2819262 2796249 2771976 2745371 2715255 2681934 2647610 2614256 2581128 2545389 2505659
53374 2505659 2464153 2424675 2388984 2355783 2322763 2288802 2254281 2220187 2187348 2156218 2127093
53363 2127093 2100431 2076806 2056374 2038629 2022965 2009293 1997867 1988765 1981937 1977564 1975880 1976693
53351 1976693 1979421 1983634 1989363 1996966 2006766 2018578 2031680 2045846 2062607 2084496 2112350 2144144
53339B144144L3280L4679L7611M0892M2969M4514M6984N0098N2614N4671N7342
53328B639798O0532O3281O5658O8485P1437P3452P4895P7217Q0286Q2221Q2382
53317C439644Q2388Q3309Q3791Q2375Q0082P9072P9687Q0274P9311P6509P2289
53306D318731O7287O2130N6932N1230M4949L8870L3550K8326K2149J4842O976
53295D745972q97q245j4557k0202k6648l4748m3260n0071n4494n7494o0078o2623
53283D312655o5487o8910p2221p4191p4557p4347p4482p4892p5170p5296p5207
53272C507895p4366p2329o9500o6882o5178o4215o3199o1533n9396n7401n5675
53261B798221n3712n1325m9032m7018m4469m0831l7136l4758l3240l0828k7217
$$ plain form
53339 2144144 2177424 2212103 2249714 2290606 2333575 2378089 2425073 2475171 2527785 2582456 2639798
53328 2639798 2700330 2763611 2829269 2897754 2969191 3042643 3117538 3194755 3275041 3357262 3439644
53317 3439644 3522032 3605341 3689132 3771507 3851589 3930661 4010348 4090622 4169933 4246442 4318731
53306 4318731 4386018 4448148 4505080 4556310 4601259 4640129 4673679 4702005 4724154 4738996 4745972
53295 4745972 4745075 4736830 4722273 4702071 4675423 4640675 4597415 4547344 4492850 4435356 4375278 4312655
53283 4312655 4247168 4178258 4106037 4031846 3957289 3882942 3808460 3733568 3658398 3583102 3507895
53272 3507895 3433529 3361200 3291700 3224818 3159640 3095425 3032226 2970693 2911297 2853896 2798221
53261 2798221 2744509 2693184 2644152 2597134 2552665 2511834 2474698 2439940 2406700 2375872 2348655
53250B348655k4233k3200k3101k2230k0601j9451j9053j8352j6500j3685j0489
53239B137760p352m775l054j574R55M961R229J2108J3383J4425J6479J9196K1289
53226B233030K2448K3991K7163L1212L4031L4736L4754L5907L8232M0427M1840
53215B597771M2879M3708M3804M3138M2567M2407M1466L8462L3897K9490K5881
53204C025470K2045J7129J1959Q004N459L107j54m269q466j2104j5040j7599k0381
53191C015160k3693k7028k9534l1109l2534l4155l5174l4888l4332l5506l8865
53180B658342m2475m4151m3823m3017m2520m1555l9298l6278l3851l2748l2741
53169B225885l3319l4038l4315l3631l2211l0955l0224k9200k7076k4583k3351
$$ plain form
53250 2348655 2324422 2301222 2278121 2255891 2235290 2215839 2196786 2178434 2161934 2148249 2137760
53239 2137760 2130408 2125633 2122579 2121005 2121960 2126921 2136150 2148258 2161641 2176066 2192545 2211741 2233030
53226 2233030 2255478 2279469 2306632 2337844 2371875 2406611 2441365 2477272 2515504 2555931 2597771
53215 2597771 2640650 2684358 2728162 2771300 2813867 2856274 2897740 2936202 2970099 2999589 3025470
53204 3025470 3047515 3064644 3076603 3084607 3090066 3093173 3093019 3088750 3080284 3068180 3053140 3035541 3015160
53191 3015160 2991467 2964439 2934905 2903796 2871262 2837107 2801933 2767045 2732713 2697207 2658342
53180 2658342 2615867 2571716 2527893 2484876 2442356 2400801 2361503 2325225 2291374 2258626 2225885
53169 2225885 2192566 2158528 2124213 2090582 2058371 2027416 1997192 1967992 1940916 1916333 1892982
53158A892982k3654k3723k1952j8986j6680j5506j4222j2083j0132r795j1131
53147A715118j3143j5053j6534j7283j7318j7481j8639k0435k1539k1179j9725
53136A516789j7919j6284j5366j5576j6504j7039j6682j6202j6574j7802j9205
53125A331636k0373k1278k1792k1717k1189k0629k0382k0565k1083k1612k1987
53114A099029k2597k3855k5055k4739k2745k1004k1240k2565k2602k0729j8768
53103H53130j8377j9128j9667j9521j8932j7765j5676j3195j1668j1905j3231
53092F74065j4108j3603j2220j1133j0707j0087q587o973o727q180j0104j1139
53080E50497j0918r760q181p015p194q686j0058r717p460m573k542j827j667j079
$$ plain form
53158 1892982 1869328 1845605 1823653 1804667 1787987 1772481 1758259 1746176 1736044 1726249 1715118
53147 1715118 1701975 1686922 1670388 1653105 1635787 1618306 1599667 1579232 1557693 1536514 1516789
53136 1516789 1498870 1482586 1467220 1451644 1435140 1418101 1401419 1385217 1368643 1350841 1331636
53125 1331636 1311263 1289985 1268193 1246476 1225287 1204658 1184276 1163711 1142628 1121016 1099029
53114 1099029 1076432 1052577 1027522 1002783 980038 959034 937794 915229 892627 871898 853130
53103 853130 834753 815625 795958 776437 757505 739740 724064 710869 699201 687296 674065
53092 674065 659957 646354 634134 623001 612294 602207 593620 586647 579920 571740 561636 550497
53080 550497 539579 529819 521638 514623 507429 498743 488685 478968 471508 466935 464393 462566 460899 459820
53066D59820j55j56j860m172n220m523l216k244j607j344j762k337j848l39N48
53051D29585J04k03P96J741Q39j007j324J93J294N19j206k614l875n516p095p876
53035D04355p852p307o256m978m351m865n920o655o917o907o490n542m605m474
53021C21236n233o121o314n642m699m275m500m621l977l022k801l486m124l983
53007B58438l430l194l382l531l200k243r19Q6K05l00o91q20j138j591j372k76
52991B32642N39j52k079l807m289l564k237r89l98o19j069q23M10J801K113J036
52975B18515l41p49l50n32j831k972k645j456r32j136p54N54J457R52l83j502
52959B05895k036j885r01K97M41o30j472j095l91m92q64l72O67J010M82ko2j70
$$ plain form
53066 459820 459665 459509 457649 453477 448257 443734 440518 438274 436667 435323 433561 431224 429376 429037 429585
53051 429585 429689 429486 430282 432023 432862 431855 430531 430724 432018 432537 431331 428717 424842 419326 412231 404355
53035 404355 396503 389196 382940 377962 373611 368746 362826 356171 349254 342347 335857 330315 325710 321236
53021 321236 316003 309882 303568 297926 293227 288952 284452 279831 275854 272832 270031 266545 262421 258438
53007 258438 255008 251814 248432 244901 241701 239458 238539 238625 238830 238530 237839 237019 235881 234290 232918 232642
52991 232642 233181 233029 230950 227143 222854 219290 217053 216064 215666 215047 213978 213155 213565 215366 217479 218515
52975 218515 218174 217425 217075 216543 214712 211740 209095 207639 206707 205571 204817 205371 206828 207780 207397 205895
52959 205895 203859 201974 201073 201370 201811 201181 199709 198614 198223 197731 196867 196495 197162 198172 198654 198652 198590 198420
52941A98420m60m53J01J057K416L996M838M091K398J190P27Q9q69j077r5R55J045
52924B18369O64P80J324J684J974K664L344L065J912J156J554K326K377J971K380
52909B47544M054N963O974P142P142P045O441N450M657M173L759L842N129O826
52895C26141O671L751J67j387r36o25j328j775j051k08n21j554k065k001k281
52880C20998k964k936j659j87R1p58j448j197m72OJ33r2j091k853m105l602k013
52863B95851j200j472j060J119L586M119K540N78l31q0O97J137N92n32q02M80
52847C05222K128K607K066J682J693J444R25O93N71j4n59m0J030R44m93j354l89
52830C18156J183J597Q84K56K01L53N00O92Q01P26O84P44O11L09M68J315K125
$$ plain form
52941 198420 197960 197507 197608 198665 201081 205077 209915 214006 216404 217594 218321 218410 217541 216464 216369 217324 218369
52924 218369 219033 219813 221137 222821 224795 227459 230803 233868 235780 236936 238490 240816 243193 245164 247544
52909 247544 251598 257561 264535 271677 278819 285864 292305 297755 302412 306585 310344 314186 319315 326141
52895 326141 332812 336563 336730 335343 334407 333782 332454 330679 329628 329420 328899 327345 325280 323279 320998
52880 320998 318034 315098 313439 313252 313343 312585 311137 309940 309468 309474 309607 309515 308424 305571 301466 297864 295851
52863 295851 294651 293179 292119 293238 296824 300943 303483 304061 303730 303650 304347 305484 306076 305544 304742 305222
52847 305222 307350 309957 312023 313705 315398 316842 317767 318460 319031 319017 318458 318418 319448 320392 319899 318545 318156
52830 318156 319339 320936 321820 322076 322277 322630 323130 323822 324623 325349 326033 326777 327388 327697 328165 329480 331605
52813C31605K179J767J577J677J706J538J231P76L48L18O40Q16Q62J522K956L998
52797C55516L584K215J182Q52O01Q6l35l34R8Q71J773K398K702L365M889O590
52781C86053P169O284M916M139M105M262M132L702L226K696J640k20k141k933
52767D27030k538k343l408n110o110o052n517m928m434m470n260n968n425l857
52753C61610k948l728n146n173l018l0J498K86k806n534o233n167l937l834m738
52738C11102n484n078l733k681k706l069k580j459j058j574j488j3J252L63k205
52723B79589m259m747m437m072l449k493j817j841k218k433k286j705q63m33r20
52708B41616j813k155j874j657j727j764j911k635l543l627k858k233k038j453
$$ plain form
52813 331605 333784 335551 337128 338805 340511 342049 343280 344056 344404 344722 345362 346178 347040 348562 351518 355516
52797 355516 359100 361315 362497 363349 363950 364036 363701 363367 363465 364336 366109 368507 371209 374574 379463 386053
52781 386053 393222 399506 404422 408561 412666 416928 421060 424762 427988 430684 432324 432104 429963 427030
52767 427030 424492 422149 418741 413631 407521 401469 395952 391024 386590 382120 376860 370892 365467 361610
52753 361610 358662 354934 349788 344615 341597 341567 343065 343351 340545 335011 328778 323611 319674 315840 311102
52738 311102 305618 300540 296807 294126 291420 288351 285771 284312 283254 281680 280192 280179 281431 281794 279589
52723 279589 275330 270583 266146 262074 258625 256132 254315 252474 250256 247823 245537 243832 242969 242536 241616
52708 241616 239803 237648 235774 234117 232390 230626 228715 226080 222537 218910 216052 213819 211781 210328
52694B10328l37M4j186l088m243m469m441m373m081l668l397l262l211l209k789
52679A64618j536k60m71k036k804j550J88N41J48O52J450L79k662n125n079l130
52663A43323p11J536L005K636M84j432j199P19K284K323J306J65n81p91n99l51
52647A52117k60k77m20p76q84J78K467M501M697L211J614R80J060J197J240J323
52631A71968J434J599K058K951L889M215L609K404J194K15p16j596j878j190k11
52616A89945j40j163k175k331k070k059j990j314o83j323l193m868n426n375n350
52601A50485m929l528j680o22q34j656k193k072j484r55j004j627k113j728n83
52586A23477M56P16L68J09L73R58J305J152P26K24o16j934k942k435m16J601K316
$$ plain form
52694 210328 209991 210035 208849 205761 201518 197049 192608 188235 184154 180486 177089 173827 170616 167407 164618
52679 164618 163082 162822 162351 160315 157511 155961 156149 156690 156838 157490 158940 159319 156657 151532 146453 143323
52663 143323 142612 144148 147153 149789 150273 148841 147642 148361 150645 152968 154274 154439 153858 153067 152468 152117
52647 152117 151857 151580 151160 150384 149500 149678 152145 156646 161343 164554 166168 167148 168208 169405 170645 171968
52631 171968 173402 175001 177059 180010 183899 188114 191723 194127 195321 195536 194820 193224 191346 190156 189945
52616 189945 189805 188642 186467 184136 182066 180007 178017 176703 176020 174697 171504 166636 161210 155835 150485
52601 150485 145556 142028 140348 139726 138892 137236 135043 132971 131487 130532 129528 127901 125788 124060 123477
52586 123477 123933 124649 125017 125126 125499 126457 127762 128914 129640 129864 129248 127314 124372 121937 121521 123122 125438
52569A25438K115K109K337J926P01m16o95m20k32m31j080k077k834k640j645p80
52553A21376l74K85J536K461K315J968K664L845L623J496p56j237p7J128J204
52538A41457K02j021j498q67J38L01n95j352p62J017K875L965L984K972J509O14
52522A52939O37P40K96J82J459L245L523K051P49Q50J331J026O10J150K009J892
52506A74689J120J050J611J327p3q89J87K193L218K658J435O76Q52J785K915L751
52490A98505M134L808K044j319m612n317k884N62K795L762M546N283N273M474
52476B21054L518K669J860J489K022K898K904J805O63M75J206K283L215L549K926
52461B54536J531J10o05k25J257L208M336L723J907L38k47l19n06q56j151j232
$$ plain form
52569 125438 127553 129662 131999 133925 134626 134210 133515 133095 132863 132432 131352 129275 126441 123801 122156 121376
52553 121376 121002 121287 122823 125284 127599 129567 132231 136076 139699 141195 140439 139202 139125 140253 141457
52538 141457 141659 140638 139140 138273 138411 138712 138117 136765 136003 137020 139895 143860 147844 150816 152325 152939
52522 152939 153576 154316 154612 154794 156253 159498 163021 165072 165821 166671 168002 169028 169638 170788 172797 174689
52506 174689 175809 176859 178470 179797 179724 178835 179022 181215 184433 187091 188526 189202 190054 191839 194754 198505
52490 198505 202639 206447 208491 207172 202560 197243 194359 194921 197716 201478 206024 211307 216580 221054
52476 221054 224572 227241 229101 230590 232612 235510 238414 240219 240882 241357 242563 244846 248061 251610 254536
52461 254536 256067 256177 255572 255347 256604 259812 264148 267871 269778 270116 269869 269550 269044 268188 267037 265805
52445B65805q03L65J827K621K286J267L01j50L4M85L91o34j840k301k321k772
52429B64561l197k153L24K146J884N79p1m6k40n16j46M28Mj341k056j192N25J951
52411B61444K718K826K004K59j496k084j280M6J006J579K307L180L262J779n62
52396B76988j965j435K74J750K371K273J630O05l81r89j203q52O24L155N369N841
52380B94055M736L334K190Q93n07j091n15K23Kr14j265k82J553K972K946J508
52364C09838k31j069p92j18K64K26r5n17o59j76P19J350J342Q30l1j202k280k557
52346C04842j880q97k03K18M32R5q64j564r93O62K116K383J613O31J93O14J627
$$ plain form
52445 265805 265002 265367 267194 269815 272101 273368 273669 273519 273553 274038 274429 273795 271955 269654 267333 264561
52429 264561 261364 259211 259535 261681 263565 264144 264073 264027 263787 263271 263125 263553 263557 262216 260160 258968 259493 261444
52411 261444 264162 266988 268992 269251 267755 265671 264391 264437 265443 267022 269329 272509 275771 277550 276988
52396 276988 275023 273588 273862 275612 277983 280256 281886 282491 282110 281121 279918 279066 279690 282845 288214 294055
52380 294055 298791 302125 304315 305208 304701 303610 303095 303318 303320 302406 301141 300859 302412 305384 308330 309838
52364 309838 309607 308538 307746 307628 307892 308118 308023 307506 306847 306671 307390 308740 310082 310912 310881 309679 307399 304842
52346 304842 302962 302065 301862 302080 302512 302607 301743 300179 299186 299848 301964 304347 305960 306591 306784 307398 309025
$$ [...]
##END NTUPLES=NMR SPECTRUM
##END=
