
##TITLE=AC1129_Armenia-Quindio-El_5906567_m79TL81VAd
##JCAMPDX= 6.0         $$ Bruker NMR JCAMP-DX V2.0
##DATA TYPE= NMR SPECTRUM
##DATA CLASS= NTUPLES
##ORIGIN= BRUKER
##OWNER= Administrator
$$ 1.72 TOPSPIN		Version 2.1
$$ 2012-04-10 10:14:23.515 -0500  Administrator@TOPSPIN
$$ Compression mode = diff/dup
##.OBSERVE FREQUENCY= 400.13188235
##.OBSERVE NUCLEUS= ^1H
##.ACQUISITION MODE= SIMULTANEOUS (DQD)
##.ACQUISITION SCHEME= undefined
##.AVERAGES= 8
##.DIGITISER RES= 22
##SPECTROMETER/DATA SYSTEM= spect
##.PULSE SEQUENCE= zg30
##.SOLVENT NAME= COFFEE_meoh
##.SHIFT REFERENCE= INTERNAL, COFFEE_meoh, 1, 14.98061
##AUDIT TRAIL= $$ (NUMBER, WHEN, WHO, WHERE, PROCESS, VERSION, WHAT)
$$ ##TITLE= Audit trail, TOPSPIN		Version 2.1
$$ ##JCAMPDX= 5.01
$$ ##ORIGIN= Bruker BioSpin GmbH
$$ ##OWNER= Administrator
$$ $$ C:\Bruker\TOPSPIN/data/COFFEE/nmr/AC1129_Armenia-Quindio-El_5906567_m79TL81VAd/10/pdata/1/auditp.txt
$$ ##AUDIT TRAIL=  $$ (NUMBER, WHEN, WHO, WHERE, PROCESS, VERSION, WHAT)
(   1,<2012-04-04 19:02:23.406 -0500>,<Administrator>,<TOPSPIN>,<go>,<TOPSPIN 2.1>,
      <created by zg
	started at 2012-04-04 19:01:16.843 -0500,
	POWCHK enabled, PULCHK disabled,
       configuration hash MD5:
       1A 1E CE 29 27 FD 77 03 67 4E F0 E3 C4 B2 CB 90
       data hash MD5: 64K
       1C 0F 29 10 8D FF B7 F8 7D 86 40 B9 22 C9 C5 53>)
(   2,<2012-04-04 19:02:26.156 -0500>,<Administrator>,<TOPSPIN>,<proc1d>,<TOPSPIN 2.1>,
      <Start of raw data processing
       efp LB = 0 FT_mod = 6 PKNL = 1 PHC0 = 0 PHC1 = 0 SI = 32K 
       data hash MD5: 32K
       65 0A AA C7 D7 5F 33 85 C2 5F B8 33 25 B9 1A 55>)
(   3,<2012-04-04 19:02:26.500 -0500>,<Administrator>,<TOPSPIN>,<proc1d>,<TOPSPIN 2.1>,
      <pk PHC0 = 213.0359 PHC1 = 0 
       data hash MD5: 32K
       B2 A6 25 EE 4C E7 67 D7 64 8A CB 78 19 38 8B FE>)
(   4,<2012-04-04 19:02:26.562 -0500>,<Administrator>,<TOPSPIN>,<proc1d>,<TOPSPIN 2.1>,
      <abs ABSG = 1 
       data hash MD5: 32K
       6B E4 83 17 80 5C 8D 62 BB 7F 03 21 E0 CC B4 A3>)
(   5,<2012-04-04 19:02:26.593 -0500>,<Administrator>,<TOPSPIN>,<proc1d>,<TOPSPIN 2.1>,
      <abs ABSG = 2 
       data hash MD5: 32K
       72 55 E5 D2 23 B9 8A B1 4A 09 B1 FB 6A F8 DC 3F>)
(   6,<2012-04-04 19:02:26.625 -0500>,<Administrator>,<TOPSPIN>,<proc1d>,<TOPSPIN 2.1>,
      <abs ABSG = 3 
       data hash MD5: 32K
       55 D6 8B 87 91 4D E6 96 7D 3B A3 42 44 D1 B5 60>)
(   7,<2012-04-04 19:02:26.671 -0500>,<Administrator>,<TOPSPIN>,<proc1d>,<TOPSPIN 2.1>,
      <abs ABSG = 4 
       data hash MD5: 32K
       8E B8 C8 E5 15 53 7B C3 66 00 D9 B6 C5 50 49 EB>)
(   8,<2012-04-04 19:02:26.718 -0500>,<Administrator>,<TOPSPIN>,<proc1d>,<TOPSPIN 2.1>,
      <abs ABSG = 5 
       data hash MD5: 32K
       C3 B2 19 22 05 8E B7 DB B7 F1 ED A8 06 7D 6F 95>)
(   9,<2012-04-04 19:02:30.671 -0500>,<Administrator>,<TOPSPIN>,<audit>,<TOPSPIN 2.1>,
      <user comment:
       ICON-NMR User ID: COFFEE
       data hash MD5: 32K
$$ [...]
##$TP= (0..7)
150 150 150 150 150 150 150 150
##$TP07= 0
##$TPNAME0= <>
##$TPNAME1= <>
##$TPNAME2= <>
##$TPNAME3= <>
##$TPNAME4= <>
##$TPNAME5= <>
##$TPNAME6= <>
##$TPNAME7= <>
##$TPOAL= (0..7)
0.5 0.5 0.5 0.5 0.5 0.5 0.5 0.5
##$TPOFFS= (0..7)
0 0 0 0 0 0 0 0
##$TUNHIN= 0
##$TUNHOUT= 0
##$TUNXOUT= 0
##$USERA1= <user>
##$USERA2= <user>
##$USERA3= <user>
##$USERA4= <user>
##$USERA5= <user>
##$V9= 5
##$VALIST= <valist>
##$VCLIST= <CCCCCCCCCCCCCCC>
##$VD= 0
##$VDLIST= <DDDDDDDDDDDDDDD>
##$VPLIST= <PPPPPPPPPPPPPPP>
##$VTLIST= <TTTTTTTTTTTTTTT>
##$WBST= 2048
##$WBSW= 25
##$XGAIN= (0..3)
0 0 0 0
##$XL= 0
##$YL= 0
##$YMAX_a= 525681
##$YMIN_a= -646342
##$ZGOPTNS= <>
##$ZL1= 120
##$ZL2= 120
##$ZL3= 120
##$ZL4= 120
##$ABSF1= 14.98061
##$ABSF2= -5.57192
##$ABSG= 5
##$ABSL= 3
##$ALPHA= 0
##$AQORDER= 0
##$ASSFAC= 0
##$ASSFACI= 0
##$ASSFACX= 0
##$ASSWID= 0
##$AUNMP= <proc_prof1d_extract_pilot.lims>
##$AXLEFT= 0
##$AXNAME= <>
##$AXNUC= <1H>
##$AXRIGHT= 0
##$AXTYPE= 0
##$AXUNIT= <>
##$AZFE= 0.1
##$AZFW= 0.1
##$BCFW= 0
##$BC_mod= 0
##$BYTORDP= 0
##$COROFFS= 0
##$CY= 15
##$DATMOD= 1
##$DC= 0
##$DFILT= <>
##$DTYPP= 0
##$F1P= 0
##$F2P= 0
##$FCOR= 0.5
##$FTSIZE= 32768
##$FT_mod= 6
##$GAMMA= 0
##$GB= 0
##$INTBC= 1
##$INTSCL= 1
##$ISEN= 128
##$LB= 0
##$LEV0= 0
##$LPBIN= 0
##$MAXI= 10000
##$MC2= 0
##$MEAN= 0
##$ME_mod= 0
##$MI= 0
##$NCOEF= 0
##$NC_proc= -8
##$NLEV= 6
##$NOISF1= 0
##$NOISF2= 0
##$NSP= 0
##$NTH_PI= 0
##$NZP= 0
##$OFFSET= 14.98061
##$PC= 1
##$PHC0= 213.0359
##$PHC1= 0
##$PH_mod= 1
##$PKNL= yes
##$PPARMOD= 0
##$PPDIAG= 0
##$PPIPTYP= 0
##$PPMPNUM= 2147483647
##$PPRESOL= 1
##$PSCAL= 4
##$PSIGN= 0
##$PYNMP= <proc.py>
##$REVERSE= no
##$SF= 400.13
##$SI= 32768
##$SIGF1= 0
##$SIGF2= 0
##$SINO= 400
##$SIOLD= 32768
##$SPECTYP= <>
##$SREGLST= <1H.CDCl3>
##$SSB= 0
##$STSI= 32768
##$STSR= 0
##$SW_p= 8223.68421052632
##$SYMM= 0
##$S_DEV= 0
##$TDeff= 65536
##$TDoff= 0
##$TI= <>
##$TILT= no
##$TM1= 0
##$TM2= 0
##$TOPLEV= 0
##$USERP1= <user>
##$USERP2= <user>
##$USERP3= <user>
##$USERP4= <user>
##$USERP5= <user>
##$WDW= 1
##$XDIM= 32768
##$YMAX_p= 461600327
##$YMIN_p= -767885
##$CURPLOT= <Network HP LaserJet P1505>
##$CURPRIN= <$Network HP LaserJet P1505>
##$DFORMAT= <normdp>
##$LAYOUT= <+/1D_H.xwp>
##$LFORMAT= <normlp>
##$PFORMAT= <normpl>
##$SURQMSG= 1
$$ End of Bruker specific parameters
$$ ---------------------------------
##NTUPLES= NMR SPECTRUM
##VAR_NAME=  FREQUENCY,     SPECTRUM/REAL,   SPECTRUM/IMAG
##SYMBOL=    X,             R,               I
##VAR_TYPE=  INDEPENDENT,   DEPENDENT,       DEPENDENT
##VAR_FORM=  AFFN,          ASDF,            ASDF
##VAR_DIM=   32768,         32768,           32768
##UNITS=     HZ,            ARBITRARY UNITS, ARBITRARY UNITS
##FACTOR=    0.250966925370066, 1,           1
##FIRST=     8223.43324360095, -192084,      87336
##LAST=      0,             -197318,         165110
##MIN=       0,             -767885,         0
##MAX=       8223.43324360095, 461600327,    0
$$ Real data points
##PAGE= N=1
##DATA TABLE= (X++(R..R)), XYDATA
$$ [...]
19446a82565r9963A03026c9475o508A24046k0211L9146a55464q922A18133h6274
$$ -182565 -282528 103026 -39475 -45983 124046 103835 142981 -155464 -164386 118133 -86274
19434b35909A32939M1241O4026h0573j98627b2239j56477C87368b76580M6052
$$ -235909 132939 174180 238206 -80573 -279200 -22239 -178716 387368 -276580 -230528
19424b30528F9636J29529f6961j42102K5173k21j34269B5941a803I6151e8845
$$ -230528 69636 199165 -66961 -209063 -183890 -184111 -318380 25941 -1803 96151 -58845
19412c3739j65153C52071A4360P5533b44957k8902d2110F0474b18399n6145a03025
$$ -33739 -198892 352071 14360 89893 -244957 -273859 -42110 60474 -218399 -274544 -103025
19400D6153b093j91076A40768a37952N8634H0983h882F7328a10731b3326l34998
$$ 46153 -2093 -193169 140768 -137952 -79318 80983 -8882 67328 -110731 -23326 -358324
19389c58324c2871o2897j01880g3708A65876B80a99866m6043L0463j97187a79180
$$ -358324 -32871 -95768 -197648 -73708 165876 280 -199866 -245909 -215446 -412633 -179180
19377a05002n3076J2807N0524b6518q2839j58768L0718a12216n8189A22163k8986
$$ -105002 -158078 -145271 -94747 -26518 -109357 -268125 -237407 -112216 -170405 122163 93177
19366I3177N11a36453c3302j69848e1069A16940c45828a18401r0526a9350k52009
$$ 93177 93688 -136453 -33302 -203150 -51069 116940 -345828 -118401 -208927 -19350 -271359
19355b71359a02158C7664a37365C3438c53308d3202A12095J30857a36859I7433
$$ -271359 -102158 37664 -137365 33438 -353308 -43202 112095 242952 -136859 97433
19344f7854l4370B61139a22395g523j19514c4325m08554B55697b5795j56603f7327
$$ -67854 -102224 261139 -122395 -7523 -127037 -34325 -442879 255697 -25795 -182398 -67327
19332b28431g1041A85142n8908a94703l12763H0593d48383b5217k34256c7603
$$ -228431 -71041 185142 126234 -194703 -507466 80593 -448383 -25217 -259473 -37603
19321a75865B04034E2780B6149K78301H440a38307l9529e5297A13570E1082b41859
$$ -175865 204034 52780 26149 304450 8440 -138307 -177836 -55297 113570 51082 -241859
19309e1988j51043f1679a6535C88349b46908a18380k40270D54d1235A37254b54105
$$ -51988 -203031 -61679 -16535 388349 -246908 -118380 -358650 454 -41235 137254 -254105
19297c30837a45806A86662a69497A8720a01281g881A1646e4476F4458A6867J62176
$$ -330837 -145806 186662 -169497 18720 -101281 -7881 11646 -54476 64458 16867 179043
19286A79043o226C7276b53167C4529a18344k92330a50271j81967L1096a35201
$$ 179043 172817 37276 -253167 34529 -118344 -410674 -150271 -332238 -301142 -135201
19275i9078j04990k2461g4885D149a91892D8357a44061j45239f9008j483j80445
$$ -99078 -204068 -226529 -74885 4149 -191892 48357 -144061 -289300 -69008 -70491 -250936
19264b50936B27416O3723B8557e5405j13010O2418j9933b7149k00501J13073j8069
$$ -250936 227416 291139 28557 -55405 -168415 -105997 -125930 -27149 -227650 -114577 -132646
19253a32646N5264k08511P3322f034A87140H0229j3683R06J3480h4723o200C6835
$$ -132646 -77382 -285893 -212571 -6034 187140 80229 66546 67452 80932 -84723 -90923 36835
19240g3128B44636F0829J90408i2615b2905l07738A71105l958i8825M2580A62752
$$ -73128 244636 60829 251237 -92615 -22905 -330643 171105 167147 -98825 -56245 162752
19228a2141B3394a5400l01182J50363L177q5389d2940a2789o5307I0434c6601
$$ -12141 23394 -15400 -316582 -166219 -163042 -248431 -42940 -12789 -78096 90434 -36601
19216C364L13736b95052L6255b7723f683j6213j18560C1295d6253n2372D33493
$$ 3364 317100 -295052 -258797 -27723 -6683 -22896 -141456 31295 -46253 -98625 433493
19204a89059Q9150k6451C1350c19379i0706j83422A68921g9503A38185N2789R1730
$$ -189059 -99909 -126360 31350 -319379 -90706 -274128 168921 -79503 138185 190974 282704
19193B82704c40252L067b5317k10161K9300e2696A8943d6855I2071h3025A62635
$$ 282704 -340252 -337185 -25317 -235478 -206178 -52696 18943 -46855 92071 -83025 162635
19181c26k42472C0671R0561b05356I4976J35529c3601A66484l8994n2756a11505
$$ -326 -242798 30671 121232 -205356 94976 230505 -33601 166484 127490 74734 -111505
19169a28109j35206c9853B0818e6302k15246h6189j32395P2400I6140a21516J5673
$$ -128109 -263315 -39853 20818 -56302 -271548 -86189 -218584 -146184 96140 -121516 -105843
19158a05843A25500a40239l5927H9778c03878f0484c970C1991K6829a71691C1736
$$ -105843 125500 -140239 -176166 89778 -303878 -60484 -3970 31991 58820 -171691 31736
19146a37478Q282J6922J7601j34067C58780a30854n2025f1319C529c2229h686
$$ -137478 -129196 -112274 -94673 -228740 358780 -130854 -182879 -61319 3529 -32229 -8686
19134a47530f5769p2753A97829F9743p140e455j77839H2026f8992q8760B0826
$$ -147530 -65769 -138522 197829 69743 62603 -5455 -183294 82026 -68992 -157752 20826
19122d1095j7832N562l6674H8238l1266P98B0719a45615e0856j43512L0287L7262
$$ -41095 -58927 -53365 -90039 88238 56972 57770 20719 -145615 -50856 -194368 -164081 -126819
19110a26819h624j19871M6635D8393M2911Q2665i5241C9689a01129k7992j09662
$$ -126819 -8624 -128495 -81860 48393 91304 173969 -95241 39689 -101129 -129121 -238783
19099b38783f4656m8783B2996b24233R4597j31730H8246r330b2867j44212B65768
$$ -238783 -64656 -113439 22996 -224233 -129636 -261366 88246 78916 -22867 -167079 265768
19087H4805h4837n230H0858K12538A06871m3574i8939j03251A49612n10b07510
$$ 84805 -84837 -90067 80858 293396 106871 63297 -98939 -202190 149612 149102 -207510
19075F5556J1090Q4316C5107b45758b0163A47229a15552k57007i7066A70865c29007
$$ 65556 76646 160962 35107 -245758 -20163 147229 -115552 -372559 -97066 170865 -329007
19063c14558j54642J31370A5272a4881j7783A13721g0164I1170J14067f3192I768
$$ -314558 -469200 -337830 15272 -14881 -32664 113721 -70164 91170 205237 -63192 9768
19051E3579b31900N4058k9135g1914j65272A94022A6222a48242A16004b85345
$$ 53579 -231900 -177842 -206977 -71914 -237186 194022 16222 -148242 116004 -285345
19040b23522j00645a21413A67091j9301b0568l0698j21399J0395g196B15667b87307
$$ -223522 -324167 -121413 167091 147790 -20568 -51266 -172665 -162270 -7196 215667 -287307
19028A29799b98809L1665B07896a27539m4701q9195R6365j12475D8868j7796a94845
$$ 129799 -298809 -267144 207896 -127539 -172240 -261435 -165070 -277545 48868 31072 -194845
19016c90601J7736a4091C9955j9301b8754B04075K3437m998b4695C82062j18902
$$ -390601 -372865 -14091 39955 20654 -28754 204075 227512 222514 -24695 382062 263160
19005B63160g5646C7718K7927k0586f1468A999b93414Q5881C43146b165A75197
$$ 263160 -75646 37718 65645 45059 -61468 1999 -293414 -207533 343146 -2165 175197
18993F8431d9293j9240l1591n2814B91977d235j73729A08814a08243j49081A17487
$$ 68431 -49293 -68533 -100124 -152938 291977 -4235 -177964 108814 -108243 -257324 117487
18981A1482O0328k4338j2286b65336A80900E5710a08081j70116A03822m9026a88350
$$ 11482 71810 47472 35186 -265336 180900 55710 -108081 -278197 103822 54796 -188350
18969B13686a31989A20074O7486a52550C1581b43497N6699D1955K21544D9371
$$ 213686 -131989 120074 187560 -152550 31581 -243497 -186798 41955 263499 49371
18958A71876M35454Q4383k70320O1146A37141a54687a1554k1239j02923A76942
$$ 171876 607330 691713 421393 482539 137141 -154687 -11554 -32793 -135716 176942
18947C8868c43633m5101A0967i5530d6467j83772B4184a14322j33169d8645j68470
$$ 38868 -343633 -388734 10967 -95530 -46467 -230239 24184 -114322 -247491 -48645 -217115
18936b17115a1279B14310c20108F9019J31520b9159f820l47438d365k05770j37778
$$ -217115 -11279 214310 -320108 69019 200539 -29159 -6820 -354258 -4365 -210135 -347913
18925c47913b9909B47837a27509B94079L7502G9365p433N4303b09503c4040C9092
$$ -347913 -29909 247837 -127509 294079 331581 79365 71932 126235 -209503 -34040 39092
18913a73459A88396e6124g580B18223a86580h5440l39271g1765c1131C880a38526
$$ -173459 188396 -56124 -7580 218223 -186580 -85440 -424711 -71765 -31131 3880 -138526
18901B03095j0284a26131A18106E5745J13376O0934L34019j38422f317B28514
$$ 203095 192811 -126131 118106 55745 169121 230055 564074 425652 -6317 228514
18890b7248B6700e7126G2413b33537d4823C7878h6614A84220k2540b93743b9309
$$ -27248 26700 -57126 72413 -233537 -44823 37878 -86614 184220 161680 -293743 -29309
18878A8808b83776m3440I0270a10212n5669B9331a70855A79933E8157a99128C9202
$$ 18808 -283776 -327216 90270 -110212 -165881 29331 -170855 179933 58157 -199128 39202
18866F8757k8405L5218c1240E4368a5978A80186a99040Q4684K9109r7428A08252
$$ 68757 40352 75570 -31240 54368 -15978 180186 -199040 -114356 -85247 -182675 108252
18854H3651g5940q0845j51444e783l03585A6235b73093K0828L4192j42181B21884
$$ 83651 -75940 -156785 -308229 -5783 -309368 16235 -273093 -252265 -218073 -360254 221884
18842D6296a27867H4818c21565i1064H9301f5275J6112B9132d0791A33951a51857
$$ 46296 -127867 84818 -321565 -91064 89301 -65275 -49163 29132 -40791 133951 -151857
18830B14264b9952k38983d0440k02336R6219D7504E264c33602K5197a37027d9288
$$ 214264 -29952 -268935 -40440 -242776 -146557 47504 5264 -333602 -308405 -137027 -49288
18818D4409a10028c8394m06511C04746A03472j3579c95897f6197k57087A9255
$$ 44409 -110028 -38394 -444905 304746 103472 89893 -395897 -66197 -323284 19255
18807a9457F7918b71091c6991C24668d2576A8828a9521j47860j3066B30035p5474
$$ -19457 67918 -271091 -36991 324668 -42576 18828 -19521 -167381 -180447 230035 154561
18796A54561l2213j9571D6194J50478j2360c8560A21283J6626J14366F5095J14576
$$ 154561 122348 102777 46194 196672 184312 -38560 121283 137909 252275 65095 179671
18785A79671e4683I2326J65639b34403A51697e5327E0521d9027A5091a75304H0645
$$ 179671 -54683 92326 257965 -234403 151697 -55327 50521 -49027 15091 -175304 80645
18773b29889a8307D6565d05758a72321E5613i2532A69342b37412C9842A1364a00179
$$ -229889 -18307 46565 -405758 -172321 55613 -92532 169342 -237412 39842 11364 -100179
18761a92314A66948e7749q3049M3662A2965b60329a27926c0029k32585D0541b30126
$$ -192314 166948 -57749 -140798 -97136 12965 -260329 -127926 -30029 -262614 40541 -230126
18749C3710Q0414J33b28616e3572B06786b47706A01334c9373p8498B77610K902
$$ 33710 114124 114257 -228616 -53572 206786 -247706 101334 -39373 -117871 277610 280512
18738B80512p4700F8959K76205a83865L8538l5299J9237B07656D8062a07608H127
$$ 280512 205812 68959 345164 -183865 -145327 -180626 -161389 207656 48062 -107608 8127
18726A00264b66330a6909j18143l2566L3216E7466c36766P5600d6440j65783R530
$$ 100264 -266330 -16909 -135052 -167618 -134402 57466 -336766 -261166 -46440 -212223 -202693
18715b02693g7428B1937b62015E5537a70306A01592K1529b49136P8904L6370G8134
$$ -202693 -77428 21937 -262015 55537 -170306 101592 123121 -249136 -170232 -133862 78134
18703b31450d5280E1628j2806a28248c9813B36649a28460j2063d3947C51378g7929
$$ -231450 -45280 51628 38822 -128248 -39813 236649 -128460 -140523 -43947 351378 -77929
18691G8065j220J11397E8177b26683q8507C944O4500b70239b4608C4833g461j03673
$$ 78065 76845 188242 58177 -226683 -315190 3944 68444 -270239 -24608 34833 -7461 -111134
18679a11134M661F1847b9383r7727A04195l9202a15310E8266h2403n4852C8037
$$ -111134 -106473 61847 -29383 -127110 104195 64993 -115310 58266 -82403 -137255 38037
18667a03170A27118E1760L1585a07991q6079i40r5630A61607a25790j71530g1974
$$ -103170 127118 51760 83345 -107991 -194070 -940 -96570 161607 -125790 -297320 -71974
18655g3523B8d9886C0370a6617k12895A87441e79530d0957q1758A19753c93469
$$ -73523 28 -49886 30370 -16617 -229512 187441 -579530 -40957 -122715 119753 -393469
18643c16350C14456f3263F2948K12921A00061m6983b43479L1691B7434a47567
$$ -316350 314456 -63263 62948 275869 100061 53078 -243479 -211788 27434 -147567
18632a6155A79519j4854a9279j9632j62006n5336B62817b03416p187E3021b35
$$ -16155 179519 164665 -19279 -38911 -200917 -256253 262817 -203416 -210603 53021 -235
18620a23227k07331b8975C0024a69206k0684P5170r4806K4410j81769A50228J55764
$$ -123227 -330558 -28975 30024 -169206 -189890 -114720 -209526 -185116 -366885 150228 305992
18609C05992f7991k32239r3427e2276m2901K1646B2580i6892m4047j78887a43340
$$ 305992 -67991 -300230 -393657 -52276 -95177 -73531 22580 -96892 -140939 -319826 -143340
18597I8432m3822d4803B31431c79888A62354c1460A66638h5476G1702N0727k9874
$$ 98432 54610 -44803 231431 -379888 162354 -31460 166638 -85476 71702 122429 92555
18586I2555j8580a23635A1473a73726A8286b67060a4377j4522I5379B4417b33203
$$ 92555 73975 -123635 11473 -173726 18286 -267060 -14377 -28899 95379 24417 -233203
18574C0723c19511P0697M9607B90763A24894M2123a01205p5252G8768a17013p0861
$$ 30723 -319511 -248814 -199207 290763 124894 167017 -101205 -176457 78768 -117013 -187874
18563a87874c2104A4846b72717N9095j1390j5558g8316A18856d00913J74341A3712
$$ -187874 -32104 14846 -272717 -213622 -225012 -240570 -78316 118856 -400913 -226572 13712
18551A1629O786f9843b0061B59886c21267B03238g11k82877a17829G8178b40136
$$ 11629 18415 -69843 -20061 259886 -321267 203238 -711 -283588 -117829 78178 -240136
18539a72773A25015D3026D296J84644q3867J47235A0459g6411j76098E2364a37093
$$ -172773 125015 43026 4296 188940 105073 252308 10459 -76411 -252509 52364 -137093
18527A43489c10935D8975a75152h716k70122F179a8019A27703A157b40009A31270
$$ 143489 -310935 48975 -175152 -8716 -278838 6179 -18019 127703 1157 -240009 131270
18515c303j04580p2541E386g4501E8436k7641O4392a82089f8273J8749j68100
$$ -3303 -107883 -180424 5386 -74501 58436 30795 95187 -182089 -68273 -49524 -217624
18504b17624c8290n5030o6303e6716B71441A14533n1117c26773A36687a8242A04320
$$ -217624 -38290 -93320 -159623 -56716 271441 114533 63416 -326773 136687 -18242 104320
18492c53239f6136h604k13825L9171B06307c46453e6336p0930j33407m4399J34715
$$ -353239 -66136 -8604 -222429 -183258 206307 -346453 -56336 -127266 -260673 -305072 -170357
18481a70357b8408j36743c4106a4629m87964a39153A04377a81643k46319b08911
$$ -170357 -28408 -165151 -34106 -14629 -502593 -139153 104377 -181643 -427962 -208911
18470A8720d02981I2493h3484I4439e3141j90521d1650k0561l38462J91818i1326
$$ 18720 -402981 92493 -83484 94439 -53141 -243662 -41650 -62211 -400673 -208855 -91326
18458I2930a31497B70173A07044a84771f0149B43185Q663H1923b75073j59011
$$ 92930 -131497 270173 107044 -184771 -60149 243185 251848 81923 -275073 -434084
18448d34084a29513A63943F5498R3223i223j10271B51465E3538a41418e5964j97975
$$ -434084 -129513 163943 65498 158721 -9223 -119494 251465 53538 -141418 -55964 -253939
18437b53939a08876F1479b33725B9519f7243j22072D7451h9534A38920M1397e7755
$$ -253939 -108876 61479 -233725 29519 -67243 -189315 47451 -89534 138920 180317 -57755
18425g8964o502n7109o0833q1779b8475F8627a90956o0329D8448b28405j29019
$$ -78964 -85466 -142575 -203408 -285187 -28475 68627 -190956 -251285 48448 -228405 -357424
18414c57424J32579r1959C2253a33923B45691r5657b86272g8351I7232P4322H085
$$ -357424 -224845 -316804 32253 -133923 245691 150034 -286272 -78351 97232 171554 8085
18402B41193f9462k91542A96265a75720I6720a15372e3760j01735L5548n5104
$$ 241193 -69462 -361004 196265 -175720 96720 -115372 -53760 -155495 -119947 -175051
18392a75051r1021J06491B49546b8577B02923a80009b8846I7954L7524A8433K7750
$$ -175051 -266072 -159581 249546 -28577 202923 -180009 -28846 97954 135478 18433 46183
18381D6183b70289A0331i3498r5030c3313j51324B10743F8751k4364b8652A44606
$$ 46183 -270289 10331 -93498 -188528 -33313 -184637 210743 68751 44387 -28652 144606
18369A47769o1951h2038j4091B46171a9801j45828C44907d7070k46996g6843D13790
$$ 147769 85818 -82038 -96129 246171 -19801 -165629 344907 -47070 -294066 -76843 413790
18357a20483F0459A1078P6868H069b06212L2753A4659J66196f6178q6609e162
$$ -120483 60459 11078 87946 8069 -206212 -173459 14659 180855 -66178 -152787 -5162
18345a69412A78403a5229A80506J97994A60348G424J5085a97013j22660J25513
$$ -169412 178403 -15229 180506 378500 160348 7424 22509 -197013 -319673 -194160
18335a94160b9003G0120a98261o412B16567F2943b0699q6138B66283A6198h1985
$$ -194160 -29003 70120 -198261 -204673 216567 62943 -20699 -106837 266283 16198 -81985
18323b25238A5683R9531b7942A23632e9410A68784e2080H3140K01603d182j30121
$$ -225238 15683 115214 -27942 123632 -59410 168784 -52080 83140 284743 -4182 -134303
18312a34303N8655j61712g9175R260B99259A05966d9470j9311D5240l296a30344
$$ -134303 -75648 -237360 -79175 -69915 299259 105966 -49470 -68781 45240 41944 -130344
18300c0758I321M1906g3098d445A4430J83447a44914j07320a8430r3033B02519
$$ -30758 9321 51227 -73098 -4445 14430 197877 -144914 -252234 -18430 -111463 202519
18288A13889M2303a30383C5500j5020c76114A11349b78255e2314n020k38526h0254
$$ 113889 156192 -130383 35500 20480 -376114 111349 -278255 -52314 -57334 -295860 -80254
18276b85478A26902a13400n3362k652A51631a62991J7062j5186A04878a33840
$$ -285478 126902 -113400 -166762 -169414 151631 -162991 -145929 -161115 104878 -133840
18265a02631a7790j9451j83041C63755d801C46298A12543f2082J8316j47606c7295
$$ -102631 -17790 -37241 -220282 363755 -4801 346298 112543 -62082 -43766 -191372 -37295
18253a09747G8933K15372b54880F9810K7066a65502g8949j27838H2701a50820
$$ -109747 78933 294305 -254880 69810 96876 -165502 -78949 -206787 82701 -150820
18242b8621j48406N0498E3211L59634A85394a59944J9584j16898A16379M2882
$$ -28621 -177027 -126529 53211 412845 185394 -159944 -140360 -257258 116379 159261
18232A59261a80529e2907r7926a0360n3592k0393B30139L8455j28721E0052K36841
$$ 159261 -180529 -52907 -150833 -10360 -63952 -84345 230139 268594 139873 50052 286893
18221B86893b06519Q3163A04304b56303J19933A78673a15706L1945A84698a56672
$$ 286893 -206519 -123356 104304 -256303 -136370 178673 -115706 -83761 184698 -156672
18210A03041B517a41588K5408A90453E3015a76853A22430a34427k19276C66788
$$ 103041 2517 -141588 -116180 190453 53015 -176853 122430 -134427 -353703 366788
18199B63726a12993j52262R4904P6319j36560C4084J3148A485g9150C728J26098
$$ 263726 -112993 -265255 -170351 -94032 -230592 34084 47232 1485 -79150 3728 129826
18188A29826Q975A0821J88742F5725P0997n8658b13937N8312j63981G6210l2168
$$ 129826 138801 10821 199563 65725 136722 78064 -213937 -155625 -319606 76210 44042
18177D4042d42k79466l2269C5391e1299F0660a61253A34305O2878I7395J42584
$$ 44042 -442 -279908 -312177 35391 -51299 60660 -161253 134305 197183 97395 239979
18166B39979a64688A58968c41349E0163Q4696E9064a06061F5274c5614j58642
$$ 239979 -164688 158968 -341349 50163 134859 59064 -106061 65274 -35614 -194256
18156a94256f7360A01037f7681C7821b70155G8320J0411a90391B26264c8579l670
$$ -194256 -67360 101037 -67681 37821 -270155 78320 88731 -190391 226264 -38579 -42249
18145d2249j92930G8803b67478c5487r2040I7581J1787J5590C58J62406A7063
$$ -42249 -235179 78803 -267478 -35487 -127527 97581 109368 124958 358 162764 17063
18133i2503M927C59805a79268Q724J2552A32477b4539j04399A86516H5182b65090
$$ -92503 -87576 359805 -179268 -170544 -157992 132477 -24539 -128938 186516 85182 -265090
18121a82926e5514I7980K02008a68431E3758j8358b19300j25561A62875a15012
$$ -182926 -55514 97980 299988 -168431 53758 35400 -219300 -344861 162875 -115012
18110B5796a7918n1957j30372f6304E8970Q462b2244A62529a0953j68251l8639
$$ 25796 -17918 -69875 -200247 -66304 58970 67432 -22244 162529 -10953 -179204 -217843
18099b17843A17993a15057j54786h1313A77161F823L60999A6483b26543F0956
$$ -217843 117993 -115057 -269843 -81313 177161 6823 367822 16483 -226543 60956
18088A19182b24097D9963h278j80694l235A13849b97397P7556O1255G5532a30294
$$ 119182 -224097 49963 -8278 -188972 -192207 113849 -297397 -219841 -158586 75532 -130294
18076H6345J49518q0340g0644C2939a2728n9957A04016e8531Q190E17898C7009
$$ 86345 235863 155523 -70644 32939 -12728 -72685 104016 -58531 -50341 517898 37009
18064b53816H8568g2429A89821a46754j26249a2028A42053a7308k13098A00390
$$ -253816 88568 -72429 189821 -146754 -273003 -12028 142053 -17308 -230406 100390
18053i1857A46812B0539L9967c7016H1335l576c8627A44044a94386h4953k16624
$$ -91857 146812 20539 60506 -37016 81335 77759 -38627 144044 -194386 -84953 -301577
18042c01577A72441B5606b97984e5729A90291f433C0849a08214A79647a83845
$$ -301577 172441 25606 -297984 -55729 190291 -6433 30849 -108214 179647 -183845
18031A66888a9367E0213b54129B91338r8738k8688f264A96479a32732B3440a4433
$$ 166888 -19367 50213 -254129 291338 192600 163912 -6264 196479 -132732 23440 -14433
18019C60029D0930d93251b15814D40262A4065a74062b6190q5105A30020b57779
$$ 360029 40930 -493251 -215814 440262 14065 -174062 -26190 -111295 130020 -257779
18008b22787a3507j37199B4755N7307a82056i128j01783L4414l8941i656C90719
$$ -222787 -13507 -150706 24755 82062 -182056 -9128 -110911 -76497 -115438 -9656 390719
17996e6677p836B6687a2277C6959b03556g7933q6464Q0909H5616a32132j09309
$$ -56677 -64513 26687 -12277 36959 -203556 -77933 -164397 -83488 85616 -132132 -241441
17985b41441A84860c60111J37427C28948E8083K45244b58828J4539E8099K70134
$$ -241441 184860 -360111 -222684 328948 58083 303327 -258828 -244289 58099 328233
17975C28233n8983c38645i7561c9465o6k09672B93287m7158b13611j81156B35394
$$ 328233 269250 -338645 -97561 -39465 -39531 -249203 293287 246129 -213611 -394767 235394
17963a06837k26284j6524B31608e6862a3445A01800e0628A67360a58310C17543
$$ -106837 -333121 -349645 231608 -56862 -13445 101800 -50628 167360 -158310 317543
17952E0160b09428R1511B48536H6804L7809J2406J547a6883C3320J7378J47758
$$ 50160 -209428 -117917 248536 86804 124613 137019 138566 -16883 33320 50698 198456
17941A98456a0711b211G4578j1577B3326M9820C5773J15907a7998B3637L37889
$$ 198456 -10711 -2211 74578 63001 23326 73146 35773 151680 -17998 23637 361526
17930C61526G2132K01008O1511B0962M61774G3524f7492A56441a38038b4498p3021
$$ 361526 72132 273140 334651 20962 482736 73524 -67492 156441 -138038 -24498 -97519
17919i7519A12211B6147h8435g485A22152b40111C12133a05774d8403A18628e1565
$$ -97519 112211 26147 -88435 -7485 122152 -240111 312133 -105774 -48403 118628 -51565
17907A37339g3830r7192B12312l2684i9975B73331g1778F4780J67250a41141A22997
$$ 137339 -73830 -171022 212312 179628 -99975 273331 -71778 64780 232030 -141141 122997
17895H4794K6943a91732C07888b70680B57417F6207J98418B1703J50235R889F4652
$$ 84794 111737 -191732 307888 -270680 257417 66207 264625 21703 171938 181827 64652
17883D654a35730o2840B01145J06459h3763P682A7296i9789I5334k6839b78874
$$ 4654 -135730 -198570 201145 307604 -83763 -76081 17296 -99789 95334 68495 -278874
17871c93498B09041a6007B6001O3200f8832c0112k5061A86664F8993K36002h6869
$$ -393498 209041 -16007 26001 89201 -68832 -30112 -55173 186664 68993 304995 -86869
17859a72707A78667b4653A37123K3359e6684C42292b96621a22970A77369o3231
$$ -172707 178667 -24653 137123 160482 -56684 342292 -296621 -122970 177369 114138
17849A14138b81617b9950F8318J35472I5808J08810P178P1653B5186J30840b59155
$$ 114138 -281617 -29950 68318 203790 95808 204618 211796 283449 25186 156026 -259155
17837F33878C11999a28288B0090P2001L76408b2015A18767l6586a19542C1617
$$ 633878 311999 -128288 20090 92091 468499 -22015 118767 82181 -119542 31617
17826a656l6197A23308H028K90806I0947H933e2486A63045f0378b4424k477j70592
$$ -1656 -37853 123308 8028 298834 90947 8933 -52486 163045 -60378 -24424 -26901 -197493
17814a97493B3158K07061N13582B61439A02766m9291a39015j50309E8693Q660
$$ -197493 23158 230219 743801 261439 102766 53475 -139015 -289324 58693 67353
17804F7353H132K10979k7106K8118R9287a51933A66108a81217B30011F5333L914
$$ 67353 8132 219111 192005 220123 319410 -151933 166108 -181217 230011 65333 69247
17793F9247b48094A07164m7013M3613J67519a97698B3098a22323A70034c48941
$$ 69247 -248094 107164 60151 103764 271283 -197698 23098 -122323 170034 -348941
17782b4231p0758j70709e0765a3305l69718E7770J77893l2930k5716D8458K13840
$$ -24231 -94989 -265698 -50765 -13305 -383023 57770 235663 202733 177017 48458 262298
17771B62298a01202A83365b75816J02466A49750g2810l1727A43371J53244j43631
$$ 262298 -101202 183365 -275816 -173350 149750 -72810 -104537 143371 296615 152984
17761A52984D4347J52702m4200R4414b6206B45221d1856k6608A16270J02800b6106
$$ 152984 44347 197049 152849 247263 -26206 245221 -41856 -68464 116270 219070 -26106
17749B8039J76204b29573A47445J00918c0604j70572e596C7504a71841e7383A53234
$$ 28039 204243 -229573 147445 248363 -30604 -201176 -5596 37504 -171841 -57383 153234
17737B87579H7086M1291c8905G387P942N6578a71415B57953g320K920r9707j75715
$$ 287579 87086 128377 -38905 7387 15329 71907 -171415 257953 -7320 -4400 -104107 -279822
17725b79822D4916J74534f1756I2879M42397a24401B75216a00120A0504J19561
$$ -279822 44916 219450 -61756 92879 535276 -124401 275216 -100120 10504 130065
17715A30065J35485H2382g4431H3203J01047a37839b7420j577B20798F5066e8021
$$ 130065 265550 82382 -74431 83203 184250 -137839 -27420 -28997 220798 65066 -58021
17703B4701K10926c8465A8860K59865i3599C04564d6361D520b82828A66937j6218
$$ 24701 235627 -38465 18860 278725 -93599 304564 -46361 4520 -282828 166937 150719
17692A50719M3552o7258K65664c0524D23731h8999j04930A44613A5708J51821
$$ 150719 194271 127013 392677 -30524 423731 -88999 -193929 144613 15708 167529
17682A67529g4810B10693a31787C01272D9843c8437A14718K39748A36626K53116
$$ 167529 -74810 210693 -131787 301272 49843 -38437 114718 354466 136626 389742
17672C89742j46759A20018P8367J27265A26029a29161N6672C71082A52063m3744
$$ 389742 242983 120018 198385 325650 126029 -129161 -72489 371082 152063 108319
17662A08319f6172D2208c5097B91145r8250m3883N9950F0918M22389A28905P5732
$$ 108319 -66172 42208 -35097 291145 192895 149012 208962 60918 483307 128905 204637
17651B04637i4759j2521A15142B221K46467p1462M5655b11684A96186I6839B3607
$$ 204637 -94759 -107280 115142 2221 248688 177226 222881 -211684 196186 96839 23607
17639a11347M3525C32859A571K9906O7438Q729L1494L4312M8960a12632B65063
$$ -111347 -67822 332859 1571 31477 98915 107644 139138 173450 222410 -112632 265063
17627a33111n3882e0631l5561D8585K30398j13450K2779b67484R1138A40585a42093
$$ -133111 -186993 -50631 -86192 48585 278983 165533 188312 -267484 -176346 140585 -142093
17615A55312C41R7791d4711n7396C65962b17447c8080A10699A4018J82720o0462
$$ 155312 341 98132 -44711 -102107 365962 -217447 -38080 110699 14018 196738 136276
17604A36276e9365B84447F2039J76274m8128R2524o3749a23271A32455K32195
$$ 136276 -59365 284447 62039 238313 190185 282709 218960 -123271 132455 364650
17594C64650j28570b2751B03463M249p9527a87333D09170A90905o3952n0378J12053
$$ 364650 236080 -22751 203463 207712 128185 -187333 409170 190905 126953 76575 188628
17583A88628a46334C90737d9411C21508J76709C1575K83014e1815G3914M6193
$$ 188628 -146334 390737 -49411 321508 498217 31575 314589 -51815 73914 120107
17573A20107L9792K53699A27521e2806I3785Q2632J08818E7447k6704b53902d117
$$ 120107 159899 413598 127521 -52806 93785 176417 285235 57447 30743 -253902 -4117
17561e4706A34683n8837A5152N061p984L29103A19964E5555O889N05556E353J78284
$$ -54706 134683 75846 15152 20213 12229 341332 119964 55555 62444 568000 5353 183637
17549A83637h0513D3441K99691j07683h541A00183P7578O6356K93952B02173J33451
$$ 183637 -80513 43441 343132 235449 -8541 100183 177761 244117 538069 202173 335624
17538C35624A092K89437j12804K68575A85809j8023J71222r1645a14995B91422
$$ 335624 1092 290529 177725 446300 185809 167786 339008 247363 -114995 291422
17527B07620J83959K0309j76867j01317J93733P0552F4712M09019j22122J28059
$$ 207620 391579 411888 235021 133704 327437 397989 64712 473731 351609 479668
17517D79668r4896C2481K69073j42159M84314J31962K20382j88112J5081L01637
$$ 479668 384772 32481 301554 159395 643709 775671 996053 807941 823022 1124659
17507A124659l29725j48395k28006M58148D17714l0840K5825n0692L39694l25497
$$ 1124659 794934 646539 418533 876681 417714 386874 412699 362007 701701 376204
17497C76204L15974K23518N1159k53759K84385k23900L5848l24601J17163J1137
$$ 376204 692178 915696 966855 713096 997481 773581 809429 484828 601991 613128
17487F13128A60717J42183Q6727M7285J86261j84408h3905A67659M83171B77927
$$ 613128 160717 302900 389627 436912 623173 438765 -83905 167659 650830 277927
17476B26238j3834K34388O2434K69351F0075a37625D88444B37930j12941J72048
$$ 226238 212404 446792 509226 778577 60075 -137625 488444 237930 124989 297037
17466B97037Q0886r4169P333P4559a44290D6706M19768f9298H7170M6789K31434
$$ 297037 377923 283754 291087 365646 -144290 46706 466474 -69298 87170 133959 365393
17455C65393O7768j02290j5027P1483j35139A10601D1065K03940n807P3487K64127
$$ 365393 433161 330871 315844 387327 252188 110601 41065 245005 239198 312685 576812
17444E76812k67091K09144p6377A90271R7754B0621J2515J65948O6220Q5494r2759
$$ 576812 309721 518865 442488 190271 288025 20621 33136 199084 265304 350798 258039
17433B58039R6996K61302A48390L16057k28289K66052B14321K17316j82423K72326
$$ 258039 355035 616337 148390 464447 236158 502210 214321 431637 249214 521540
17423E21540j51777j55114J11431b8751C11134j6427j7575k8225I8541K48926
$$ 521540 369763 214649 326080 -28751 311134 294707 277132 248907 98541 347467
17413C47467K01235A18930K33056A36556J15810A19521K68172n5527D2088L30970
$$ 347467 548702 118930 351986 136556 252366 119521 387693 332166 42088 373058
17403C73058A76820N7237L37414B41888J72135J16453j21814K04786o0286Q9510
$$ 373058 176820 234057 571471 241888 414023 530476 408662 613448 553162 642672
17393F42672k97244r5081j17159J27295R9873K76200A26299d5761B18719k7880
$$ 642672 345428 250347 133188 260483 360356 636556 126299 -45761 218719 190839
17383A90839b6121E99179k89313n6966Q6520m6213J51369I9655K34553J51021
$$ 190839 -26121 599179 309866 252900 339420 293207 444576 99655 334208 485229
17373D85229A53965J77152J40845F6933M76758j68979j7669j15461o5967q4330
$$ 485229 153965 331117 471962 66933 543691 374712 357043 241582 175615 91285
17363I1285K49216n7085j06322J15569J61952B02921G227L84961j57977J62624
$$ 91285 340501 283416 177094 292663 454615 202921 7227 392188 234211 396835
17353C96835j12102J48830j62753L63836k17956j75318A14269J34129L5593m6773
$$ 396835 284733 433563 270810 634646 416690 241372 114269 248398 283991 237218
17343B37218b48612C72598J57530A39894K05054f4337E64468A92115q2239J74012
$$ 237218 -248612 372598 530128 139894 344948 -64337 564468 192115 109876 283888
17333B83888A31383K92667I8537K85590j11889C2826J37734b1897r0615A06834
$$ 283888 131383 424050 98537 384127 272238 32826 170560 -21897 -112512 106834
17322D71830P2430k43223F0785L10360L06500k02108k27709r0012M6644G5328
$$ 471830 544260 301037 60785 371145 677645 475537 247828 157816 204460 75328
17311C22099K43175A60750N57018A70958K22319j4456N0486r359K1197j1551o402
$$ 322099 565274 160750 717768 170958 393277 378821 429307 419948 441145 429594 423192
17300D23192J18862j70774j72476n6446J70251K97244I5238N03406B95866j14847
$$ 423192 542054 371280 198804 142358 312609 609853 95238 598644 295866 181019
17290A81019J68017j46871a71909A70506M20690k40820N9713A20472K06635P3424
$$ 181019 349036 202165 -171909 170506 591196 350376 410089 120472 327107 400531
17280D00531n2777A07202K02008O4065j15525K03054A18793K74144g8838C52727
$$ 400531 347754 107202 309210 373275 257750 460804 118793 392937 -78838 352727
17269A53237J50793P1446A58729R1286n25N6917c7034C50329J33111P9614j32367
$$ 153237 304030 375476 158729 250015 249490 306407 -37034 350329 483440 563054 430687
17258D30687j25279e3537A89473m6378m4578L37605K8631A45193K17108A77227
$$ 430687 305408 -53537 189473 143095 98517 436122 464753 145193 362301 177227
17247B97814Q9761J26823j33721j47659J32852o6816k1145f2158C6834L84910
$$ 297814 387575 514398 380677 233018 365870 299054 277909 -62158 36834 421744
17237D21744r5509J96315k25548N58701D11952p8278A06303J17379L04862j04450
$$ 421744 326235 522550 297002 855703 411952 333674 106303 223682 528544 424094
17227D24094j01043L1953P2673k472l7847J38070A52474J55935J88050j88692
$$ 424094 323051 355004 427677 425205 387358 525428 152474 308409 496459 307767
17217C07767j15610J54683r1291J72423r728R61k06724K08632j6960J82536n7930
$$ 307767 192157 346840 255549 427972 418244 419205 212481 421113 404153 586689 528759
17206E28759k01488J43308k24675R5797Q0772J38395k20262L18969r0704A47209
$$ 528759 327271 470579 245904 341701 422473 560868 340606 659575 568871 147209
17195F51133B18889m7314P422J04483M6454N40533C41152j51579K63664j48917
$$ 651133 218889 171575 178997 283480 329934 870467 341152 189573 453237 304320
17185C04320k0314A01231J9038K96618J41199R9550l01186J11692J89480L5818
$$ 304320 284006 101231 120269 416887 558086 657636 356450 468142 657622 693440
17175F93440B46928J50346j65142p4827J82583K15839l6053L29576l78576K45272
$$ 693440 246928 397274 232132 157305 339888 555727 519674 849250 470674 715946
17165G15946k91484j8974J57108l8533L8877N4298k3126A63948O72216l27074
$$ 715946 424462 405488 562596 524063 562940 617238 594112 163948 836164 509090
17155E09090M8496q3673R9811j47356F9262O47649k26790Q6367j80569l37K26973
$$ 509090 557586 473913 573724 426368 69262 716911 490121 576488 395919 395582 622555
17144F22555q8919j99057L29622j87047J75696l0161J95057k10368n3349J4746
$$ 622555 533636 334579 664201 477154 652850 622689 817746 607378 554029 568775
17134E68775j24968K65885k41343k9729J28091K09146B89850K84098q7828j163
$$ 568775 443807 709692 468349 438620 566711 775857 289850 573948 486120 484957
17124D84957J11491J25322k59735j51855N72935J62338D69778q005j75595M62070
$$ 484957 596448 721770 462035 310180 883115 1045453 469778 461773 286178 748248
17114G48248l12326j16581K14745J94814K4769k1071j2277M109j36544l2363K80444
$$ 748248 435922 319341 534086 728900 753669 732598 720321 724430 587886 555523 835967
17103H35967P0775l55741K29306k73151L13791l92664L84868j93548p4554k48328
$$ 835967 906742 551001 780307 507156 820947 428283 813151 619603 545049 296721
17093B96721K92709K64049m09078N5746m4960K39849J95768k09850k72591M00082
$$ 296721 589430 853479 444401 500147 455187 695036 890804 680954 408363 808445
17083H08445k143K14551j65445j06521k20667J23352R6607j11179J15686j10910
$$ 808445 806302 1020853 855408 748887 528220 651572 748179 637000 752686 641776
17073F41776P7367O8798L62241j87956k43186J09539k05202K80284k91973K69486
$$ 641776 719143 787941 1150182 962226 719040 828579 623377 903661 611688 881174
17063H81174J94932q7356p8926j14147p089P6676j34193j7974C16962L93734M38863
$$ 881174 1076106 988750 909824 795677 788588 865264 731071 713097 316962 710696 1149559
17052A149559j85120j58700K88977j62831l04988L18125p0852R2193k84914q4595
$$ 1149559 964439 805739 1094716 931885 626897 945022 874170 966363 681449 596854
17042E96854J13464l1150J68344j06988j49181M37049j98170J98206K6773l05830
$$ 596854 710318 679168 847512 740524 591343 1028392 830222 1028428 1055201 749371
17032G49371L44385p2110N3853k30590M70366m63098j45603J52493M84782k32662
$$ 749371 1093756 1021646 1075499 844909 1315275 852177 706574 859067 1343849 1111187
17022A111187P5068n769j86536P1959l82006K08740n2937M89569j54913J70260
$$ 1111187 1186255 1180486 993950 1065909 683903 892643 839706 1329275 1174362 1344622
17012A344622k59718r0241k19437L79538J4946N7360j39271P1357L39527n64656
$$ 1344622 1084904 994663 775226 1154764 1169710 1227070 1087799 1159156 1498683 934027
17002I34027L15244L85j56231j74747m6068K23111J59665k57012L52554j60082
$$ 934027 1249271 1249656 1093425 918678 872610 1095721 1255386 998374 1350928 1190846
16992A190846J18264k95553J65049K7957J57820O3600J35218m05124j42508L78964
$$ 1190846 1309110 1013557 1178606 1206563 1364383 1427983 1563201 1158077 1015569 1394533
16982A394533j64160m0638J14161j23229J83667J45654j69144j76021L50083P7089
$$ 1394533 1230373 1189735 1303896 1180667 1364334 1509988 1340844 1164823 1514906 1591995
16972A591995j80001l5388k03346M34861m37641N10736l85438L81042k07537N5169
$$ 1591995 1411994 1376606 1173260 1608121 1170480 1681216 1295778 1676820 1469283 1524452
16962A524452j71335M4326J29836L05670m83871L07246P680P9456O5606q7356
$$ 1524452 1353117 1397443 1527279 1832949 1349078 1656324 1664004 1743460 1809066 1721710
16952A721710j34106N6211J9973J45374n8686j67523J2210N87507m84334K27588
$$ 1721710 1587604 1643815 1663788 1809162 1750476 1582953 1595163 2182670 1698336 1925924
16942A925924m0195J12411j52253K2681l944K1405m02331O12106l00555J4423
$$ 1925924 1885729 1998140 1845887 1868568 1864624 1886029 1483698 2095804 1795249 1809672
16932A809672j27035J71918K80848j64800q6889q8222J88929L20559k01249k53548
$$ 1809672 1682637 1854555 2135403 1970603 1883714 1795492 1984421 2304980 2103731 1850183
16922A850183J55904J21949k17971r8269J03459R8947K53734j6613P9811m6158
$$ 1850183 2006087 2128036 1910065 1811796 1915255 2014202 2267936 2251323 2331134 2284976
16912B284976R2697k82991K72006L49669l78119M70134l01875K66707k28380J84762
$$ 2284976 2377673 2094682 2366688 2716357 2338238 2808372 2506497 2773204 2544824 2729586
16902B729586l97974N07663J09135m35416L42708j86106j050J12343j12026K84326
$$ 2729586 2331612 2839275 2948410 2512994 2855702 2669596 2668546 2780889 2668863 2953189
16892B953189k49248J77774J31901j34555L85005l99406J24751R2771J13501K6874
$$ 2953189 2703941 2881715 3013616 2879061 3264066 2864660 2989411 3082182 3195683 3222557
16882C222557l19608J49549J5979J18377k16133K92569J26828m6037J16170P199
$$ 3222557 2902949 3052498 3068477 3186854 2970721 3263290 3390118 3344081 3460251 3467450
16872C467450O256r2696P5161k77306N94076m3708j12580O310Q9612Q3658K90659
$$ 3467450 3473706 3381010 3456171 3178865 3772941 3729233 3616653 3622963 3712575 3796233 4086892
16861D086892L4295K6601m7624j56047q4624L99741o4430Q13997q44791N08012
$$ 4086892 4121187 4147788 4100164 3944117 3859493 4259234 4194804 5008801 4164010 4672022
16851D672022l62898M91951m733K5971j46220R8100K38694J6212j04210J67744
$$ 4672022 4309124 4801075 4796342 4822313 4676093 4774193 5012887 5029099 4924889 5092633
16841E092633J71443J45707p567K3329k16057K81639M88231j16833J60432j14447
$$ 5092633 5264076 5409783 5402216 5425545 5209488 5491127 5979358 5862525 6022957 5908510
16831E908510L59944J04584j33242P6341K66734j91657L43843J26288j03100m7816
$$ 5908510 6268454 6373038 6239796 6316137 6582871 6391214 6735057 6861345 6758245 6710429
16821F710429J35735M46478K16975j09701J69603r160j49354N72458j00541M42548
$$ 6710429 6846164 7292642 7509617 7399916 7569519 7560359 7411005 7983463 7882922 8325470
16811H325470k23894O29032J81221l99440Q38780l47749J89155L04880P9356L03512
$$ 8325470 8101576 8730608 8911829 8512389 9351169 9003420 9192575 9497455 9576811 9880323
16801I880323j82355O64788N0355j00328P84569j5414M58011P1840Q5904M7327
$$ 9880323 9697968 10362756 10413111 10312783 11097352 11081938 11539949 11611789 11697693 11745020
16791A1745020K44657P33142O50015j64855k47646Q08823J68819M49999M48139
$$ 11745020 11989677 12722819 13372834 13207979 12960333 13769156 13937975 14387974 14836113
16782A4836113K9958N13138K64483P49061J49323K73081O99563N04131M5022O11175
$$ 14836113 14866071 15379209 15643692 16392753 16542076 16815157 17514720 18018851 18063873 18675048
16772A8675048P27468K62329O91312N96734O84161K32462R58725M00579Q84846
$$ 18675048 19402516 19664845 20356157 20952891 21637052 21869514 22828239 23228818 24113664
16763B4113664O76014N87373P75046O74727R61258O58002J108883Q06285J112691
$$ 24113664 24789678 25377051 26152097 26826824 27788082 28446084 29554967 30361252 31473943
16754C1473943Q69289Q69652J003912J230027J394676J061008J302881J350737
$$ 31473943 32343232 33212884 34216796 35446823 36841499 37902507 39205388 40556125
16746D0556125J458010J350440J301041J717184J875019J756243J774491J515930
$$ 40556125 42014135 43364575 44665616 46382800 48257819 50014062 51788553 53304483
16738E3304483K260537K002660J893304K526706K138390K332797K320769K693026
$$ 53304483 55565020 57567680 59460984 61987690 64126080 66458877 68779646 71472672
16730G1472672K470543K500567K965070K769917K805633K828935K829035K667673
$$ 71472672 73943215 76443782 79408852 82178769 84984402 87813337 90642372 93310045
16722I3310045K810356K879981K782649L116783K383216K582983K359408K030563
$$ 93310045 96120401 99000382 101783031 104899814 107283030 109866013 112225421 114255984
16714A14255984K346021J675113J639521J173468J056115O46048O34359K57680
$$ 114255984 116602005 118277118 119916639 121090107 122146222 122792270 123426629 123684309
16706A23684309o89831k52916p29371r50401j572187j185957k130022k174644
$$ 123684309 122994478 122741562 122012191 121061790 119489603 118303646 116173624 113998980
16698A13998980k300403k338904k545302k992419k413110k744323l095113l096800
$$ 113998980 111698577 109359673 106814371 103821952 101408842 98664519 95569406 92472606
16690I2472606k578904k892216k724379l066499k825846k500234k344101k990416
$$ 92472606 89893702 87001486 84277107 81210608 78384762 75884528 73540427 70550011
16682G0550011k323184k591951k442267k047302k419629k164226k036365j658483
$$ 70550011 68226827 65634876 63192609 61145307 58725678 56561452 54525087 52866604
16674E2866604k077220j871959j458868j802938j729711j231850j941567j036989
$$ 52866604 50789384 48917425 47458557 45655619 43925908 42694058 40752491 39715502
16666C9715502j285697j243334j515176r25999j437575o57089j129505j211227
$$ 39715502 38429805 37186471 35671295 34745296 33307721 32650632 31521127 30309900
16658C0309900p78173r60866r76677q16068q90901n17632r00520o01679n43692
$$ 30309900 29531727 28570861 27594184 26778116 25887215 25369583 24469063 23867384 23323692
16649B3323692j057255o19406l80581n84781o53370o89518m15184n97047p4373
$$ 23323692 22266437 21647031 21266450 20681669 20028299 19338781 18923597 18326550 18252177
16640A8252177m95616q40355n4142j032190Q6684m03933o46196q2050j65737p68490
$$ 18252177 17756561 16916206 16862064 15829874 15916558 15512625 14866429 14784379 14618642 13850152
16630A3850152L2634o33341m64052n2468m27187J21727o40520l74480o1650j71890
$$ 13850152 13882786 13249445 12785393 12732925 12305738 12427465 11786945 11412465 11350815 11178925
16620A1178925m26152q0890l19787j68936o1919j51224k28838j47517n76404j03048
$$ 11178925 10752773 10671883 10352096 10183160 10121241 9970017 9741179 9593662 9017258 8914210
16610H914210K34334l19158j00640q4977m03660K61981p40612n0584j3829k52145
$$ 8914210 9148544 8829386 8728746 8643769 8240109 8502090 7761478 7710894 7697065 7444920
16600G444920K24247k61434l86333O4586n41585N05574m35452m1330j92881j9354
$$ 7444920 7669167 7407733 7021400 7085986 6544401 7049975 6614523 6573193 6380312 6360958
16590F360958j04749l7061k73857J2173j38365l70188J74202K62236j64337m30682
$$ 6360958 6256209 6219148 5945291 5957464 5819099 5448911 5623113 5885349 5721012 5290330
16580E290330L6345K20175K9986n09558j44050K09340k24329o3484j73153j46
$$ 5290330 5326675 5546850 5576836 5067278 4923228 5132568 4908239 4844755 4671602 4671456
16570D671456R5468l21437L0875m35973M81140k09770J36510m61554j00511L40234
$$ 4671456 4766924 4445487 4476362 4040389 4521529 4311759 4448269 3986715 3886204 4226438
16560D226438j72196K54565q9050j49341j85426k67823N0813j32025M17017l60031
$$ 4226438 4054242 4308807 4219757 4070416 3884990 3617167 3667980 3535955 3952972 3592941
16550C592941j40494K12327j96454p5584q0531J6618J41795k90871p7871M08660
$$ 3592941 3452447 3664774 3468320 3392736 3312205 3328823 3470618 3179747 3101876 3510536
16540C510536k54645j28010J02282j58151k29572Q2437J59175n83938K62986J22305
$$ 3510536 3255891 3127881 3230163 3072012 2842440 2924877 3084052 2500114 2763100 2885405
16530B885405p4060j89560L3816J63701k87121L44636L3921J07290o73016j03385
$$ 2885405 2811345 2621785 2655601 2819302 2532181 2876817 2910738 3018028 2345012 2241627
16520B241627M43322n16369N03328j60546k74459J41071J18773J28176k18098
$$ 2241627 2684949 2168580 2671908 2511362 2236903 2377974 2496747 2624923 2406825
16511B406825l1586P3037k09095L25724k17115k27366J38577l1262k00567j33886
$$ 2406825 2375239 2448276 2239181 2564905 2347790 2120424 2259001 2227739 2027172 1893286
16501A893286K29069k12980n0591J55748l7338K2199l6100k1524J95493m53119
$$ 1893286 2122355 1909375 1858784 2014532 1977194 1999393 1963293 1941769 2137262 1684143
16491A684143J66519N9848L34783l47708k69628P6143J78592k36869m2724P1547
$$ 1684143 1850662 1910510 2245293 1897585 1627957 1704100 1882692 1645823 1603099 1674646
16481A674646J29926k38310J27091R1679J9603l20720K26423l05949J04901J33780
$$ 1674646 1804572 1566262 1693353 1785032 1804635 1483915 1710338 1404389 1509290 1643070
16471A643070J67640k63023j2502L0583o9989J03071j20435K03471p2943J54939
$$ 1643070 1810710 1547687 1535185 1565768 1495779 1598850 1478415 1681886 1608943 1763882
16461A763882k02339q669J47821n03114j6412L83478k13860k7206P4059j50947
$$ 1763882 1561543 1552874 1700695 1197581 1181169 1564647 1350787 1323581 1397640 1246693
16451A246693k07960L80223j07431m65956N53755r6075N1389J50970l47098p5575
$$ 1246693 1038733 1418956 1311525 845569 1399324 1303249 1354638 1505608 1158510 1082935
16441A082935J20798p4509Q6368J36938j84062r07r1098m7902K12465J68465m56839
$$ 1082935 1203733 1129224 1215592 1352530 1168468 1167561 1076463 1028561 1241026 1409491 952652
16430I52652O3211K23007k64070m2228K99936l60788K85825l8295K28073p4276
$$ 952652 1015863 1238870 974800 932572 1232508 871720 1157545 1119250 1347323 1273047
16420A273047l40541J80610j21390J74779Q3015k71085R1492k8523K28241k95302
$$ 1273047 932506 1113116 991726 1166505 1249520 978435 1069927 1041404 1269645 974343
16410I74343M69399o29530Q1149L2185J26267j93954J27392j99158j0091J57065
$$ 974343 1443742 814212 895361 927546 1053813 859859 987251 788093 778002 935067
16400I35067J19182n8297R4510l9356m49501L94908j45454K44652q1815k54637
$$ 935067 1054249 995952 1090462 1051106 601605 996513 851059 1095711 1013896 759259
16390G59259J16115O8544L1013j13887r3782N5871k7438K27573n9006k0556q5134
$$ 759259 875374 943918 974931 861044 767262 823133 795695 1023268 964262 943706 858572
16379H58572L5067j29286J24334j38309J79902k68457j17623L16394l37551r8817
$$ 858572 893639 764353 888687 750378 930280 661823 544200 860594 523043 424226
16369D24226N33447l54962N95287E84855j3189L66536m50552J56414L6379j171
$$ 424226 957673 602711 1197998 584855 571666 938202 487650 644064 680443 679272
16359F79272j18965J60606J39607k27134K07725k73467K7307Q3581J877L8256
$$ 679272 560307 720913 860520 633386 841111 567644 594951 678532 680409 718665
16349G18665k1058q8752J32740l14413j19613M00175J29574j38166l162M7884
$$ 718665 697607 608855 741595 427182 307569 707744 837318 699152 695990 743874
16339G43874J14681k98410K30822r2803M5939j51896M7397Q5162C50935J86735
$$ 743874 858555 560145 790967 698164 744103 592207 639604 724766 350935 537670
16329E37670j25395j5959K77777l9186K58708m33528L61891B88256M08848j22489
$$ 537670 412275 396316 674093 634907 893615 460087 821978 288256 697104 574615
16319E74615j96675M65601k69022r3148M24963q2065C62288M15172C51462K0561
$$ 574615 377940 843541 574519 481371 906334 824269 362288 777460 351462 372023
16309C72023A48536K23207r5156O44571D39790j08262n7804L4929K78198j7579
$$ 372023 148536 371743 276587 921158 439790 331528 273724 308653 586851 569272
16299E69272J71492m1400j95250j78684K29345j12809N8092j39817J15732M55981
$$ 569272 740764 699364 504114 325430 554775 441966 500058 360241 475973 931954
16289I31954k41516k84483N8534q3748J76972J57690A96728L04124M874L3074
$$ 931954 690438 405955 464489 380741 557713 715403 196728 500852 505726 538800
16279E38800p4180K32986k81420q5774A31843J68433J92443A08799L77078A47496
$$ 538800 464620 697606 416186 330412 131843 300276 492719 108799 485877 147496
16268G88480C50004k314K64750B37894L59359J40757j61885B5538M91385j7623
$$ 788480 350004 347690 612440 237894 597253 738010 576125 25538 516923 499300
16258D99300A99969K49538k04704J39272j6952j46029J79144p0267L33254j98945
$$ 499300 199969 449507 244803 384075 367123 221094 400238 329971 663225 464280
16248D64280J26671A38654J43290K11318k19585L73604A31318o5307O33018C05067
$$ 464280 590951 138654 281944 493262 273677 647281 131318 66011 699029 305067
16237F44295A07878M22846A94209a5463F40650I0866C9849J7046j2132K33369
$$ 644295 107878 530724 194209 -15463 640650 90866 39849 56895 44763 278132
16227B78132K32608O7337q1212j13960C3018N05001B48265L2412M647q8942R4409
$$ 278132 510740 578077 496865 382905 33018 538019 248265 280677 285324 196382 290791
16216B90791Q3345j15550J19269A36211P7181q837e5927B68055q4660L05168j79599
$$ 290791 374136 258586 377855 136211 213392 204555 -55927 268055 183395 488563 308964
16205C08964k8876m6425K60328B32040J7718r1801M23631j15724A68880R7941
$$ 308964 280088 233663 493991 232040 249758 157957 581588 465864 168880 266821
16195B66821n4828k3125n9507Q9635J39071j7279j15671Q9903a11818E38322j70397
$$ 266821 211993 188868 129361 218996 358067 340788 225117 315020 -111818 538322 367925
16184C67925K12484I0440M42303k27387A02244O4223J74346j32606J27228m8297
$$ 367925 580409 90440 532743 305356 102244 166467 340813 208207 335435 287138
16174B87138Q9868J01305A72879J94902J73978k69703j18587L23566k27028g5171
$$ 287138 377006 478311 172879 367781 541759 272056 153469 477035 250007 -75171
16163B55029r695h0768D7210P102L28432J336a09321B16627k6751L05272A70013
$$ 255029 245334 -80768 47210 54312 382744 384080 -109321 216627 189876 495148 170013
16151B98967a63611C24478J36928j26414j25293J97247a73357C61200q8434J4437
$$ 298967 -163611 324478 461406 334992 209699 406946 -173357 361200 272766 287203
16141B87203f651C90739D4140K70481j41247R1357J76859A62339J33920B0917
$$ 287203 -6651 390739 44140 314621 173374 264731 441590 162339 296259 20917
16130B29515R073r3853N29022C33289A4092J42703K77906a04544C97044j34835
$$ 229515 238588 144735 673757 333289 14092 156795 434701 -104544 397044 262209
16120B62209K6779b29232A28015a4651G5900Q5534k4576D2540j7090j377c8325
$$ 262209 288988 -229232 128015 -14651 75900 161434 136858 42540 25450 24073 -38325
16108C95041A91707G2999c70471B69743d8926n8509E58416B09038a47730B74309
$$ 395041 191707 72999 -370471 269743 -48926 -107435 558416 209038 -147730 274309
16097B00072I0509L05011G8213K8285B0732a98629b6981C8121i4713C952J26912
$$ 200072 90509 395520 78213 106498 20732 -198629 -26981 38121 -94713 3952 130864
16086A30864L00734q1674j1144r8076i1799k9231C36352n2693o4053H2835J28261
$$ 130864 431598 349924 338780 240704 -91799 -121030 336352 283659 219606 82835 211096
16075B11096a41974B40453a40572C46672A38719K64664a51924H9543J37021o6357
$$ 211096 -141974 240453 -140572 346672 138719 403383 -151924 89543 226564 160207
16065A60207a34743C51391q1127b32385B55116c9226B64188k6865k2397J38869
$$ 160207 -134743 351391 270264 -232385 255116 -39226 264188 237323 214926 353795
16055C53795d46860A43969m1841L14547h7027D3729J82113R3655H5780L27940
$$ 353795 -446860 143969 102128 416675 -87027 43729 225842 319497 85780 413720
16045D13720D8823M0702a23171a2205k34329a156B76126d5641I375L17638l330
$$ 413720 48823 89525 -123171 -12205 -246534 -1156 276126 -45641 9375 327013 323683
16034C23683f7107a3783C37706a84528B04531E8465K8620b39758D3665L1393R1294
$$ 323683 -67107 -13783 337706 -184528 204531 58465 87085 -239758 43665 75058 166352
16023A66352M2574d1671A86393R1967a24742B2464d3620C7728b6519I3143K58380
$$ 166352 208926 -41671 186393 278360 -124742 22464 -43620 37728 -26519 93143 351523
16012C51523A63937h0686k28654i8773a62A72306A1454b3870C2451f5285G7057
$$ 351523 163937 -80686 -309340 -98773 -162 172306 11454 -23870 32451 -65285 77057
16000A05473J14495b11962A45243o4230L5641c3936k9478B04426E6891a52949
$$ 105473 219968 -211962 145243 81013 116654 -33936 -63414 204426 56891 -152949
15989A15875A0595J06184A9345K9438g4002J3311B06192J74854C749L7636K96802
$$ 115875 10595 116779 19345 48783 -74002 -60691 206192 381046 3749 41385 338187
15978C38187d1904H0527J77097j15010L71141j6317n3655K23058K37860j16200
$$ 338187 -41904 80527 257624 142614 513755 497438 443783 666841 904701 788501
15968G88501j59929j07808J25787B42962r7319k5761a88529D97408A43011J01168
$$ 788501 628572 520764 646551 242962 145643 119882 -188529 497408 143011 244179
15958B44179N6497q4665j01900D4834O4498r226d3969r5358A94668e8049A75782
$$ 244179 300676 216011 114111 44834 109332 100106 -43969 -139327 194668 -58049 175782
15946a73187Q4796j42481A22015o0847h6517m3170A18105K9488a14562B65730
$$ -173187 -88391 -230872 122015 61168 -86517 -129687 118105 147593 -114562 265730
15935f1414l0976b6386B69854A1354Q0780a48030F4037K08635G8390J35270k1547
$$ -61414 -92390 -26386 269854 11354 92134 -148030 64037 272672 78390 213660 192113
15924A92113J8885n5174r508b83335g0926B76220j23845N9182c7755A70158c6363
$$ 192113 210998 155824 146316 -283335 -70926 276220 152375 211557 -37755 170158 -36363
15912A82191a31878e9121J1894A9413e235k66l8056k9477E0443R249A0410b55173
$$ 182191 -131878 -59121 -47227 19413 -5235 -5501 -43557 -73034 50443 59692 10410 -255173
15899a96064i4424l6560b0703k14n682A48536b58339a12838B05025a28322F0871
$$ -196064 -94424 -130984 -20703 -20917 -26599 148536 -258339 -112838 205025 -128322 60871
15887c45419C2275M30952b60040A61514Q3784D6793J9286h852j05097N2036E6718
$$ -345419 32275 463227 -260040 161514 245298 46793 66079 -8852 -113949 -61913 56718
15875e8789p7960A2368J95437a91516f3125C6112b32406A49643E9891J73820b15670
$$ -58789 -136749 12368 207805 -191516 -63125 36112 -232406 149643 59891 233711 -215670
15863C9395J26107a35764b5382D1465Q2015k5932m874a22662j08827A39304c77967
$$ 39395 165502 -135764 -25382 41465 123480 97548 92674 -122662 -231489 139304 -377967
15851I224J59362b07120a4577p0849n0867c4641F8702J7109b1245j44404N9747
$$ 9224 168586 -207120 -14577 -85426 -136293 -34641 68702 85811 -21245 -165649 -105902
15840a05902D8745f3408j45604A16342g6432L0808A33719b67688G0813b08926
$$ -105902 48745 -63408 -209012 116342 -76432 -45624 133719 -267688 70813 -208926
15829A14928J02887d3007A53398n8718f1861A19670b11625A23414A2379c38758
$$ 114928 217815 -43007 153398 94680 -61861 119670 -211625 123414 12379 -338758
15818a85412Q5636p2m1872j24013E9929a07695m290c4651j35114P1530H8882a43853
$$ -185412 -99776 -99848 -141720 -265733 59929 -107695 -111985 -34651 -169765 -98235 88882 -143853
15805c7585j96518A9077b45257g5614H6447N1180J32819k7044J61470b93239H9826
$$ -37585 -234103 19077 -245257 -75614 86447 137627 270446 243402 404872 -293239 89826
15793D5588L813b9097A35169J683m0044m6255b49532D5769f3024A3591b54346
$$ 45588 49401 -29097 135169 136852 96808 50553 -249532 45769 -63024 13591 -254346
15781A9545K9626k0411d8749B4427P4045J94549g2773J7887f569j65758j1825
$$ 19545 49171 28760 -48749 24427 98472 293021 -72773 -54886 -6569 -172327 -184152
15770a84152j79137C2193h9661j56665M0300m7202a02464D11111F265J37328c64807
$$ -184152 -363289 32193 -89661 -246326 -206026 -253228 -102464 411111 6265 143593 -364807
15758E5108J48878a36552H6078f8218j69197A05693a02474A58057B078d13771
$$ 55108 203986 -136552 86078 -68218 -237415 105693 -102474 158057 2078 -413771
15747b0854j59948k19159C17514R0874A30984a46009A25936i577C34819F6494
$$ -20854 -180802 -399961 317514 408388 130984 -146009 125936 -9577 334819 66494
15736A46364a99746A42642a09919C09703a61048B901J68418J37781p9840O3878
$$ 146364 -199746 142642 -109919 309703 -161048 2901 171319 309100 229260 293138
15726B93138I3372J02070o4788J41885c385A19769A1291a47387f6424b8503a2308
$$ 293138 93372 195442 130654 272539 -3385 119769 11291 -147387 -66424 -28503 -12308
15714D6689N1697a81356E3066A1669b15940a2723J234B762c03052C76121j33614
$$ 46689 98386 -181356 53066 11669 -215940 -12723 -11489 2762 -303052 376121 242507
15703B42507f3630k8618B06003a6995E7500c04395i1874B3287J92718J5834c42385
$$ 242507 -63630 -92248 206003 -16995 57500 -304395 -91874 23287 216005 231839 -342385
15691B24580i271D3231J70758b33693a10174C44554b18861i2752J3676k9376k4160
$$ 224580 -9271 43231 213989 -233693 -110174 344554 -218861 -92752 -79076 -108452 -132612
15680a32612J7472B627K1020h3638A00803l7543M9208d7783B43264G0106b9878
$$ -132612 -115140 2627 23647 -83638 100803 63260 112468 -47783 243264 70106 -29878
15668D1144K5220Q8117B9870J26095D1207a82234h7570A82415i4542j55872p6489
$$ 41144 66364 154481 29870 155965 41207 -182234 -87570 182415 -94542 -250414 -326903
15657c26903H3745K12535j0354A27343a25638D4628K58021a1650G9186K1200b30382
$$ -326903 83745 296280 285926 127343 -125638 44628 302649 -11650 79186 100386 -230382
15645D8608c9303k74746i378j42054N5450b5573k1931E379J48499c50810a25097
$$ 48608 -39303 -314049 -9378 -151432 -95982 -25573 -47504 5379 153878 -350810 -125097
15633a1286B92234c45454E7154a75235C5458c80945a48136F3282a78687j70670
$$ -11286 292234 -345454 57154 -175235 35458 -380945 -148136 63282 -178687 -349357
15623c49357a36133B29805c08696b9A16685e1282A45555J4204K437J49022e7698
$$ -349357 -136133 229805 -308696 -29 116685 -51282 145555 159759 162196 311218 -57698
15611B0839N0332D256b31268N9308B07677e4794A64662e8699k68232a23701k297
$$ 20839 71171 4256 -231268 -171960 207677 -54794 164662 -58699 -326931 -123701 -125998
15600a25998M0864G9725b01707d4029A11249J21066G1838c14776b44k12371O5174
$$ -125998 -85134 79725 -201707 -44029 111249 232315 71838 -314776 -244 -212615 -147441
15589a47441A24515L4076a70983L4353j71985A90265c89654c80k00765d892A26829
$$ -147441 124515 158591 -170983 -136630 -308615 190265 -389654 -380 -201145 -4892 126829
15577B45962d41227A5245a6543m3514A93647A0285J44283l0110M3933d04011A55623
$$ 245962 -441227 15245 -16543 -60057 193647 10285 154568 124458 168391 -404011 155623
15565B04497a778C2445L6942P0264D5040K82689A23996a25603I4569c51905a57583
$$ 204497 -1778 32445 69387 139651 45040 327729 123996 -125603 94569 -351905 -157583
15553e2983m2103K5617A54499a08336a5095l9521A5644A855b21532A67493E7874
$$ -52983 -95086 -69469 154499 -108336 -15095 -54616 15644 1855 -221532 167493 57874
15541E5135c8791m0562k76116a59064B30301F9982P3879M1233a46964e5269n955
$$ 55135 -38791 -79353 -355469 -159064 230301 69982 143861 185094 -146964 -55269 -61224
15530f1224a508k54774R1946O9337M1481k6468A59462b58605B94322a1880H0684
$$ -61224 -1508 -256282 -164336 -94999 -53518 -79986 159462 -258605 294322 -11880 80684
15518D51326b22816d9509B69729c22201J12338i4274b4426C19730F4809M8101
$$ 451326 -222816 -49509 269729 -322201 -209863 -94274 -24426 319730 64809 112910
15508A12910k25m622J34716j16257A7728K93834H8355l5929P8429a98284B54116
$$ 112910 112685 108063 242779 126522 17728 311562 88355 52426 130855 -198284 254116
15496C31123m1670j17351C4327K09930k877p5594f0151A12856C9201J94286N0872
$$ 331123 289453 172102 34327 244257 241380 165786 -60151 112856 39201 233487 284359
15485B84359A05738P2065i5120C56918j36199F2924J61991j2710C3877K10706
$$ 284359 105738 177803 -95120 356918 220719 62924 224915 212205 33877 244583
15475B44583j1881O2323c7107B77270o8572k8282J0019J41040j34280J6377q8124
$$ 244583 232702 295025 -37107 277270 208698 180416 190435 331475 197195 213572 125448
15464A25448L32548H1450K81192r6509G6391M68675J13289J96196m22141l5321
$$ 125448 457996 81450 362642 266133 76391 545066 658355 854551 432410 397089
15454C97089G1512A0888N4223J0606A487M6325K40015j12433p9493a08177A19663
$$ 397089 71512 10888 65111 75717 1487 47812 287827 175394 95901 -108177 119663
15442c8850B91904A04786c9736m14435d1389n9939F1769K71847a6162C73126A47680
$$ -38850 291904 104786 -39736 -454171 -41389 -101328 61769 333616 -16162 373126 147680
15430C07545c1760D05220M87174l69192K25754K08996j90457C51559K75931A70396
$$ 307545 -31760 405220 892394 523202 748956 957952 767495 351559 627490 170396
15419D25160A48413d6377A87381a6892A40545o3035j1824a07452A10365c8440
$$ 425160 148413 -46377 187381 -16892 140545 77510 65686 -107452 110365 -38440
15408A69765q2914j7254B3452a87389B15731a1572j00476B66721N0136h0262B30069
$$ 169765 86851 69597 23452 -187389 215731 -11572 -112048 266721 316857 -80262 230069
15396a47820B2225h4354a1971j19052b7344B03571l099i3002A2436h4044H9883
$$ -147820 22225 -84354 -11971 -131023 -27344 203571 200472 -93002 12436 -84044 89883
15384D79066b57269d8321C23508a14234n1193B44058q265j06439a1630k2362H6646
$$ 479066 -257269 -48321 323508 -114234 -165427 244058 235793 129354 -11630 -33992 86646
15372A41937n5240d7457k43229G2692R1133a16867J9607D635K6608K97899A12816
$$ 141937 86697 -47457 -290686 72692 163825 -116867 -97260 4635 31243 329142 112816
15360B01196J89186A73332K13061j64035K4577J9750e038B51567o0348a9409B71922
$$ 201196 390382 173332 386393 222358 246935 266685 -5038 251567 191219 -19409 271922
15348B09584A4718M10204A49419m9498O5028J78661j63865P1596O4106F9423Q7411
$$ 209584 14718 424922 149419 99921 164949 343610 179745 251341 315447 69423 156834
15337A56834l3592L81922q0773A61072K6318f6931B91165L24992j34410A51082
$$ 156834 123242 505164 424391 161072 187390 -66931 291165 616157 481747 151082
15326A66281L21851j57580J3757f5038B38685b47049a14052I9318M45677A53100
$$ 166281 488132 330552 344309 -65038 238685 -247049 -114052 99318 544995 153100
15315B60686q7774D8106L07522I0940R1655K3875J7827f0992A66355m8252B5515
$$ 260686 172912 48106 355628 90940 182595 206470 224297 -60992 166355 118103 25515
15303A34613J4352A0463e6544D55551b379A82025J5770a12850B42905J32566F9240
$$ 134613 148965 10463 -56544 455551 -2379 182025 197795 -112850 242905 375471 69240
15291B32854P6853a49553A67211m0497m767a79558B94471A41267J5585J19744
$$ 232854 309707 -149553 167211 126714 121947 -179558 294471 141267 156852 276596
15281B76596b73048i6832B43025e1690E2128f4829B95684g7367I9458i6417j45845
$$ 276596 -273048 -96832 243025 -51690 52128 -64829 295684 -77367 99458 -96417 -242262
15270b42262C30154A25278d7103J1767j08195C72156A36774d042l9976A30715
$$ -242262 330154 125278 -47103 -35336 -143531 372156 136774 -4042 -44018 130715
15259D99855a6324A74340m0465K28617c0735G8748K82550b54249A86572k0483
$$ 499855 -16324 174340 133875 362492 -30735 78748 361298 -254249 186572 166089
15249A66089h5153C15029j55642K41042k2464E4975e6386B87694b38898J18663
$$ 166089 -85153 315029 159387 400429 377965 54975 -56386 287694 -238898 -120235
15239a20235J8722D1377J35674a25811A02138K04725b2474F66544r2945B64114
$$ -120235 -101513 41377 177051 -125811 102138 306863 -22474 666544 573599 264114
15228F88260L90746K87090K89009m31071J78042m26762l86492G6490N09683k00937
$$ 688260 1079006 1366096 1655105 1224034 1402076 975314 588822 76490 586173 385236
15218C85236B4451L50583B7056J2660J27355L5321A7883M8338b16410C63084p7061
$$ 385236 24451 375034 27056 39716 167071 202392 17883 66221 -216410 363084 286023
15207B86023a50129H0839a6589q9923B5347K36633E8894K33025f324A68096a38358
$$ 286023 -150129 80839 -16589 -106512 25347 261980 58894 291919 -6324 168096 -138358
15195A27781B9093M8242K24229k6148G3137J05715R7832j26655a37992p4806E5411
$$ 127781 29093 77335 301564 275416 73137 178852 276684 150029 -137992 -212798 55411
15183b099C48674G1939K13278P3510j73306L02871A26536i2182G4211i4798L7768
$$ -2099 348674 71939 285217 358727 185421 488292 126536 -92182 74211 -94798 -57030
15172e7030A83534H1365f4800E9379K80980j32147I8432J91093A31505o2341M8294
$$ -57030 183534 81365 -64800 59379 340359 208212 98432 289525 131505 69164 117458
15161A17458n0627J91825p1176L8709L7561g6199B37900D4283R5871a19714A52540
$$ 117458 66831 258656 187480 226189 263750 -76199 237900 44283 140154 -119714 152540
15149F6022a13807A91098K57396g6017E04224H0898M61103a5190D89732A61458
$$ 66022 -113807 191098 448494 -76017 504224 80898 542001 -15190 489732 161458
15138B97944j17847o2118J02693A06634J5758K4642k1146f3625q1367B74032F9749
$$ 297944 180097 117979 220672 106634 122392 147034 125888 -63625 -144992 274032 69749
15126C71066A85506k5518a31460C79094a61428A86687J58761G8133K47039b02519
$$ 371066 185506 159988 -131460 379094 -161428 186687 345448 78133 325172 -202519
15115f4787B4177J03670J56806k5576A06747Q0422m3656J90047l6428p4540r941
$$ -64787 24177 127847 284653 259077 106747 187169 143513 333560 297132 222592 212651
15104B12651J07047K44668B11639k1859E5197K70990j09418p208J70790A04994
$$ 212651 319698 564366 211639 189780 55197 326187 216769 209561 380351 104994
15093B76302p6340l0151G8160J43778B1667L25783a51119n0005A49561J01024
$$ 276302 199962 169811 78160 221938 21667 347450 -151119 -201124 149561 250585
15083B50585J30405o4108c8318A54829L35676d0664A85746K105g1461A90073J6194
$$ 250585 380990 316882 -38318 154829 490505 -40664 185746 187851 -71461 190073 206267
15072B06267J10130j48591a10491d9431B46846G5910R7406K21859B6976K48679
$$ 206267 316397 167806 -110491 -49431 246846 75910 173316 395175 26976 275655
15062B75655E492R9654O6610p2564K44022A49387B9127K42200P9384E9396J16026
$$ 275655 5492 105146 171756 99192 343214 149387 29127 271327 350711 59396 175422
15051A75422J6408o558K34363A10024L9088J19739Q1627O3530j54450K15583A69870
$$ 175422 191830 185272 419635 110024 149112 268851 350478 414008 259558 475141 169870
15039B06154M10548j88213A3516L21862J73506P2869j79212N9833K18726k42743
$$ 206154 616702 428489 13516 335378 508884 581753 402541 462374 681100 438357
15029D38357J60174k47223K14243k40084I165e9192F42824J71671j21351B24468
$$ 438357 598531 351308 565551 325467 9165 -59192 642824 814495 693144 224468
15018C72836j0157J74857J30023n6546j23082M07918j63656R783j81182R7196
$$ 372836 362679 537536 667559 611013 487931 895849 732193 741976 560794 657990
15008F57990j32666j3195k18113K12973O7625L0679A58374M73428J34685k98520
$$ 657990 525324 512129 294016 506989 574614 605293 158374 631802 766487 467967
14998D67967J34462k77895k1469J39059k11217L14899j33214N9276j79260J71125
$$ 467967 602429 324534 303065 442124 230907 545806 412592 471868 292608 463733
14988D63733j26821k43J18246r4538P2428J67641k58402L95881j82953j78344
$$ 463733 336912 336669 454915 360377 432805 600446 342044 737925 554972 376628
14978C76628J28274k3001L27811B21817j03934M88411j41242K06156k3174j45697
$$ 376628 504902 481901 809712 221817 117883 606294 465052 671208 648034 502337
14968E02337L49568L32069m48897J02031J04773l38638M593j73443J20857k045
$$ 502337 851905 1183974 735077 837108 941881 603243 607836 434393 555250 553205
14958E53205J29537C15664K37675j74213N07708k48085J1502A37990M12704j63449
$$ 553205 682742 315664 553339 379126 886834 638749 650251 137990 550694 387245
14948C87245j10650K12885B06297K15126J19625K5670k56568J43785O7448k60265
$$ 387245 276595 489480 206297 421423 541048 566718 310150 453935 521383 261118
14938B61118J52661A79852P6151d8293E21589j30727Q5357A54933J32157L75618
$$ 261118 413779 179852 256003 -48293 521589 390862 476219 154933 287090 662708
14928F62708P8939J17342m494C96762K3890L51776k65211P9607m4017r8990L13275
$$ 662708 741647 858989 854495 396762 420652 772428 507217 586824 542807 443817 757092
14917G57092j47793J91708J23607M18942J579o1713J82005j10716N19751m84468
$$ 757092 609299 801007 924614 1343556 1345135 1283422 1465427 1354711 1874462 1389994
14907A389994k38992O63666m17095L70465r7978N14200j1389N2282p10041j78090
$$ 1389994 1151002 1814668 1397573 1768038 1670060 2184260 2172871 2225153 1515112 1337022
14897A337022L37475l91445l09510Q0764m37907O3823C02901J48155K72616j420
$$ 1337022 1674497 1283052 973542 1054306 616399 680222 302901 451056 723672 722252
14887G22252k1156j34689n6348j2125M939B05211J60193m9284R0188j6487j86168
$$ 722252 701096 566407 510059 497934 502873 205211 365404 316120 406308 389821 203653
14876B03653N73080k72582j02925K67867j23704K49682l87358K78499j350K44080
$$ 203653 776733 504151 401226 669093 545389 795071 407713 686212 684862 928942
14866I28942O0310K537K2503m46711K28397j2977J13009l18071o2909D0601N32115
$$ 928942 989252 991789 1014292 567581 795978 783001 896010 577939 515030 40601 572716
14855E72716P3383R5926k2075M8482m8261j5693K20513l27602J1340J46661C18138
$$ 572716 646099 742025 719950 768432 720171 704478 924991 597389 608729 755390 318138
14843D35931Q7790J79565k19671m2819p1199l204L0013R5617K32514C13784J90577
$$ 435931 523721 703286 483615 440796 369597 366393 396406 492023 724537 313784 504361
14832E04361K55269L02982k34407j31186J73091J15539L13577m06766j49610K51524
$$ 504361 759630 1062612 828205 697019 870110 985649 1299226 892460 742850 994374
14822I94374j95718O5768j32821K7063k09228J92614n9620B83494L13038R6605
$$ 994374 798656 864424 731603 758666 549438 742052 682432 283494 596532 693137
14812F93137l02471N21626k87789J82952K4726l62886L3060M30811l72490J88536
$$ 693137 390666 912292 624503 807455 832181 469295 502355 933166 560676 749212
14802G49212K03554j47294R3220k54873J17360K12744r0697q6055k4366L46861
$$ 749212 952766 805472 898692 643819 761179 973923 883226 797171 772805 1119666
14792A119666j97829j51521N7249M24480k7914l88688J08599k20351L72289E29391
$$ 1119666 921837 770316 827565 1252045 1224131 835443 944042 723691 1095980 529391
14781F99696j20785J95856N8381A93042N20220q8645r7414R1556j90842M07456
$$ 699696 578911 774767 833148 193042 713262 624617 527203 618759 427917 835373
14771H35373m9911j48211J53296N7086M0296k21650M20387j45020l87564L11667
$$ 835373 785462 637251 790547 847633 887929 666279 1086666 941646 554082 865749
14761H65749K71930q5099k96368N6461J40827M7465k02609q5646M6732J50804
$$ 865749 1137679 1052580 756212 812673 953500 1000965 798356 712710 759442 910246
14751I10246k53405r1910L02204k04111K03960C27109K30338O0813K49050k43580
$$ 910246 656841 564931 867135 663024 866984 327109 557447 618260 867310 623730
14741F23730o5437K78661m3755q8074j29541K78806l51007J97901n1142K9905
$$ 623730 558293 836954 793199 705125 575584 854390 503383 701284 650142 680047
14731F80047J92947r9263J33093P5664m43868M00807j3672l44342J86750L02998
$$ 680047 872994 773731 906824 982488 538620 939427 925755 581413 768163 1071161
14721A071161k40083J55851j17032K10384j05812M34409m50140L41508K54779
$$ 1071161 831078 986929 869897 1080281 974469 1408878 958738 1300246 1555025
14712A555025P7169L5499N57747m21204m39711J44701m74480K31499j89083N0667
$$ 1555025 1632194 1667693 2225440 1804236 1364525 1509226 1034746 1266245 1077162 1127829
14702A127829k02087K0702j27396R4572q613K75578l0359J5156n9913k81259K14850
$$ 1127829 925742 946444 819048 913620 905007 1180585 1150226 1165382 1105469 824210 1039060
14691A039060K32289p4318L87039k620N6587M88095j64996R919l92952J74854
$$ 1039060 1271349 1197031 1584070 1581450 1638037 2126132 1961136 1971055 1578103 1752957
14681A752957p74395K32785k03084J29113r0363K0090R8466O2659j70272k30914
$$ 1752957 978562 1211347 1008263 1137376 1047013 1067103 1165569 1228228 1057956 827042
14671H27042J30453L25032k07036j38931J71752O9460n2026k17642L91725l08746
$$ 827042 957495 1282527 1075491 936560 1108312 1177772 1125746 908104 1299829 991083
14661I91083k00155J2196M50389j63635j35097r6448M98853o77715L21518L07091
$$ 991083 790928 803124 1253513 1089878 954781 858333 1357186 679471 1000989 1308080
14651A308080k77532N8771k24365O1592K20937R0048k59751K41703J06821p3460
$$ 1308080 1030548 1089319 864954 926546 1147483 1237531 977780 1219483 1326304 1252844
14641A252844j35193n4256J54784J10206L48717m56158L43796n4483j63588J78067
$$ 1252844 1117651 1063395 1218179 1328385 1677102 1220944 1564740 1510257 1346669 1524736
14631A524736m52146N8915J33525j67869L01847J51253k84832L20723k01511L7777
$$ 1524736 1072590 1131505 1265030 1097161 1399008 1550261 1265429 1586152 1384641 1422418
14621A422418m774K15874r3593J84748p46980K99966O7543k8126P0397j29871
$$ 1422418 1417644 1633518 1539925 1724673 977693 1277659 1345202 1317076 1387473 1257602
14611A257602J46350O4817Q2853r9613K50320k25614q0285J49618j96228J91351
$$ 1257602 1403952 1468769 1551622 1452009 1702329 1476715 1396430 1546048 1349820 1541171
14601A541171m5686K2268p3396L10163l11506K09112k39812K96175n6095p1952
$$ 1541171 1495485 1517753 1444357 1754520 1443014 1652126 1412314 1708489 1652394 1580442
14591A580442o2698j47033M60664k07991m57594M10109J981J09319K46733k31890
$$ 1580442 1517744 1370711 1831375 1623384 1165790 1575899 1577880 1687199 1933932 1702042
14581A702042J77071j90208p5150L6174L15791J61971R934j88406J30260j62878
$$ 1702042 1879113 1688905 1613755 1649929 1965720 2127691 2137625 1949219 2079479 1916601
14571A916601j51317L96653k53501K24366j89263O9040n3492J64862J48248k6566
$$ 1916601 1765284 2161937 1908436 2132802 1943539 2012579 1959087 2123949 2272197 2245631
14561B245631l33785K56698O303J16083J41225q2363J42351n7329j97289M18436
$$ 2245631 1911846 2168544 2174847 2290930 2432155 2349792 2492143 2434814 2237525 2655961
14551B655961j2645j89652K09966K26777r7362J9619J94641j90779M88546J3071
$$ 2655961 2643316 2453664 2663630 2890407 2793045 2812664 3007305 2816526 3305072 3318143
14541C318143J75433P93897J26439O14153L72015R12026J560031K584792L423709
$$ 3318143 3493576 4287473 4413912 5028065 5400080 6312106 7872137 10456929 13880638
14532A3880638M352843Q227321N586467j1733225q836165m346434k374921k15850
$$ 13880638 18233481 26460802 32047269 20314044 11477879 7131445 4756524 4540674
14524D540674k35972j50650J228701j130902q76361o91326P5399o6853J09610
$$ 4540674 4304702 4154052 5382753 4251851 3375490 2684164 2759563 2692710 2802320
14515B802320k58854L8209M06650l85227l64442K72147j62041L91785o8395n5305
$$ 2802320 2543466 2581675 2988325 2603098 2238656 2510803 2348762 2740547 2672152 2616847
14505B616847m4438J22664M5371J17676k31685j3002K26916j05440L61496m22862
$$ 2616847 2572409 2695073 2740444 2858120 2626435 2613433 2840349 2734909 3096405 2673543
14495B673543L16694j73485K51890k087K01086k08734j56559K86286L80602k09103
$$ 2673543 2990237 2816752 3068642 3066555 3267641 3058907 2902348 3188634 3569236 3360133
14485C360133k01062K20226R3161P0231r2860J65013K50824j27043j41995J37027
$$ 3360133 3159071 3379297 3472458 3542689 3449829 3614842 3865666 3738623 3596628 3733655
14475C733655l99583L70642J59460L0100J74938j25187J07929r0857j39139J65431
$$ 3733655 3334072 3704714 3864174 3894274 4069212 3944025 4051954 3961097 3821958 3987389
14465C987389K62174j79710J10811k5889O2156J94159j07120J78807O5685J21532
$$ 3987389 4249563 4069853 4180664 4154775 4216931 4411090 4303970 4482777 4548462 4669994
14455D669994k69544k72266O00320n9405J72718K41949l15226J27441L46053j95499
$$ 4669994 4400450 4128184 4728504 4669099 4841817 5083766 4768540 4895981 5242034 5046535
14445E046535M02788n79345L01043k4851K12045K95204j96733K12029j04184K13956
$$ 5046535 5449323 4869978 5171021 5146170 5358215 5653419 5456686 5668715 5564531 5778487
14435E778487J17684j3345M0501J39346m6924M14046k85655L95850k24366K63204
$$ 5778487 5896171 5882826 5923327 6062673 6015749 6429795 6144140 6539990 6315624 6578828
14425F578828M3813p5459J38364J90171J42670o2464J32817L8746k7338J72272
$$ 6578828 6622641 6547182 6685546 6875717 7018387 6955923 7088740 7127486 7100148 7272420
14415G272420K75719j13134Q464K51579J67336O9422J05672J92028K02747L74757
$$ 7272420 7548139 7435005 7443469 7695048 7862384 7931806 8037478 8229506 8432253 8807010
14405H807010J53211P9492m694K22185J12705o1791J34745K55774j95761L14651
$$ 8807010 8960221 9039713 9035019 9257204 9369909 9308118 9442863 9698637 9502876 9817527
14395I817527L6405Q1934j4077O43726k77359L69716O50477j68486n5122n2603
$$ 9817527 9853932 9935866 9921789 10565515 10288156 10657872 11308349 11139863 11084741 11032138
14385A1032138J90760K49680M1640M76685J24371M4148M26639j04990J49761K70435
$$ 11032138 11222898 11472578 11514218 11990903 12115274 12159422 12586061 12481071 12630832 12901267
14375A2901267L48335J81737M66365o3685L92348L01571K82107K71027M00086
$$ 12901267 13249602 13431339 13897704 13834019 14226367 14527938 14810045 15081072 15481158
14366A5481158P6035M55882J47556N81681q8647M42816J55085L44196L34508L13016
$$ 15481158 15557193 16013075 16160631 16742312 16653665 17096481 17251566 17595762 17930270 18243286
14356A8243286M72361N46730K01662P62538L24040N06285J07049P04506O7073
$$ 18243286 18715647 19262377 19464039 20226577 20550617 21056902 21163951 21868457 21935530
14347B1935530O54440O066O99215M55153M94818O92106L63076J001007N07949
$$ 21935530 22589970 22596036 23295251 23750404 24245222 24937328 25300404 26301411 26809360
14338B6809360N39589J83038Q22857Q50605N89474O49168J166593O88977R29445
$$ 26809360 27348949 27531987 28354844 29205449 29794923 30444091 31610684 32299661 33229106
14329C3229106Q25925P06354J219805R21362O22039J466634P90232J074337J446439
$$ 33229106 34055031 34761385 35981190 36902552 37524591 38991225 39781457 40855794 42302233
14320D2302233J021226J656254O71092J696375J518455J352136J533070J801031
$$ 42302233 43323459 44979713 45650805 47347180 48865635 50217771 51750841 53551872
14312E3551872J591870J780919K109930K030092K276403J853062K473047K301544
$$ 53551872 55143742 56924661 59034591 61064683 63341086 65194148 67667195 69968739
14304F9968739K479022K868415K773583K694571L253402L173571L161977M159163
$$ 69968739 72447761 75316176 78089759 80784330 84037732 87211303 90373280 94532443
14296I4532443L565470M303632M231273M566544M903106M868331N540688N508463
$$ 94532443 98097913 102401545 106632818 111199362 116102468 120970799 126511487 132019950
14288A32019950O171911O676283O879500P300084P666943Q115598Q933253R189076
$$ 132019950 138191861 144868144 151747644 159047728 166714671 174830269 183763522 192952598
14280A92952598R412894J0215808J0819362J1432170J1682157J2760234J3049538
$$ 192952598 202365492 212581300 223400662 234832832 246514989 259275223 272324761
14273B72324761J3640989J3849987J4349779J4481748J4148128J3742650J3898100
$$ 272324761 285965750 299815737 314165516 328647264 342795392 356538042 370436142
14266C70436142J3182193J3326370J2003479J0179297R337435R046069Q600745
$$ 370436142 383618335 396944705 408948184 419127481 428464916 437510985 446111730
14259D46111730O651962J781415R99088K144913L911219o6364o068530k538647
$$ 446111730 452763692 454545107 455544195 457689108 461600327 461533963 455465433 452926786
14251D52926786j0160865j1421830j3275492j3259512j3439491j3955321j4590461
$$ 452926786 442765921 431344091 418068599 404809087 391369596 377414275 362823814
14244C62823814j3957966j4367475j4009584j3525438j3355920j2408834j3068886
$$ 362823814 348865848 334498373 320488789 306963351 293607431 281198597 268129711
14237B68129711j1581723j1275159j2182814j1305842j0265067r948767r530222
$$ 268129711 256547988 245272829 233090015 221784173 211519106 201570339 192040117
14230A92040117r490882q933278q213386p742770p448559o941827o329418n727798
$$ 192040117 182549235 173615957 165402571 157659801 150211242 143269415 136939997 131212199
14222A31212199o082704n274627n297845m943598m248103m436491l751074l744303
$$ 131212199 125129495 119854868 114557023 109613425 105365322 100928831 97177757 93433454
14214I3433454m084581l490842k751226l455865k831090k625047l011792k518208
$$ 93433454 89348873 85858031 83106805 79650940 76819850 74194803 71183011 68664803
14206F8664803j934328k502936j993428k039006k150932j674836j731354j724302
$$ 68664803 66730475 64227539 62234111 60195105 58044173 56369337 54637983 52913681
14198E2913681j134696j870226j533672j669180j085509j385270r28965j172501
$$ 52913681 51778985 49908759 48375087 46705907 45620398 44235128 43306163 42133662
14190D2133662j472298j038752j284157p09976j051434q36034p94172j294574
$$ 42133662 40661364 39622612 38338455 37628479 36577045 35741011 34946839 33652265
14182C3652265n53093j139272m68602q13832p31793r61590m79412r23457n61512
$$ 33652265 33099172 31959900 31491298 30677466 29945673 28984083 28504671 27581214 27019702
14173B7019702l91615q70083m16598n45151n44915n09942o87156m40690o62471
$$ 27019702 26628087 25758004 25341406 24796255 24251340 23741398 23054242 22613552 21951081
14164B1951081k19925q90041J69994q26454k36046n75534l71480J7123n48126
$$ 21951081 21731156 20841115 21011109 20184655 19948609 19373075 19001595 19018718 18470592
14155A8470592l07931l13830l97188k99869j81803n10110m21821k237o67055n4491
$$ 18470592 18162661 17848831 17451643 17151774 16969971 16459861 16038040 16035803 15368748 15314257
14145A5314257k31731n1117n83402j05130O1186o61023j32776j73552m60909k10832
$$ 15314257 15082526 15031409 14448007 14342877 14404063 13743040 13610264 13436712 12975803 12764971
14135A2764971p5489R1447l93537j22890m41722J87401m38957J73138k08815p29161
$$ 12764971 12689482 12780929 12387392 12264502 11822780 12010181 11571224 11744362 11535547 10806386
14125A0806386K07895l37623k1394j63436j76562k0956n54405M8204J82614n83997
$$ 10806386 11014281 10676658 10655264 10491828 10315266 10294310 9739905 9788109 9970723 9386726
14115I386726J38295k48742j63108l2686J11383k90369m23998J16474m1890m36230
$$ 9386726 9525021 9276279 9113171 9080485 9191868 8901499 8477501 8593975 8552085 8115855
14105H115855m9076J19545k23089j52295K9414m9829j67728k89659J40630n03309
$$ 8115855 8066779 8186324 7963235 7810940 7840354 7790525 7622797 7333138 7473768 6970459
14095F970459O6587N05939j63075n18235J20342J44391l92826j83413K96332k85248
$$ 6970459 7037046 7542985 7379910 6861675 6982017 7126408 6733582 6550169 6846501 6561253
14085F561253k57732K39721k37238k01978M2211j75783J2358K795j64344O4301
$$ 6561253 6303521 6543242 6306004 6104026 6146237 5970454 5982812 5985607 5821263 5885564
14075E885564m61610K28363P0975n02344L07391j8443l67180O56461l53730p956
$$ 5885564 5423954 5652317 5723292 5220948 5528339 5509896 5142716 5799177 5445447 5437491
14065E437491n18862m4947M05829k99794J10K03424k29295O7716k56727o4666
$$ 5437491 4918629 4873682 5279511 4979717 4979827 5183251 4953956 5021672 4764945 4700279
14055D700279L92218o45495K53207J9340k51145O37079p64452M2706R0048J5660
$$ 4700279 5092497 4447002 4700209 4719549 4468404 5105483 4341031 4383737 4473785 4489445
14045D489445l33612J13798N4682N311q0900k19750J93788p4650l07370L56721
$$ 4489445 4155833 4269631 4324313 4329624 4248724 4028974 4222762 4148112 3840742 4197463
14035D197463J5673n28984k06017L40481k41220J49702n4244j2668k22761L00265
$$ 4197463 4213136 3684152 3478135 3818616 3577396 3727098 3672854 3660186 3437425 3737690
14025C737690K8243m89348J79732J46327k69276j10089J01643m3675J34970l35452
$$ 3737690 3765933 3276585 3456317 3602644 3333368 3223279 3324922 3281247 3416217 3080765
14015C080765L6326Q9881k38240K31825N6095j26902k59115J71234k08870k24258
$$ 3080765 3117091 3206972 2968732 3200557 3256652 3129750 2870635 3041869 2832999 2608741
14005B608741o7063K51482J3170J38857k15307l2775k2329J63704o6339J72551
$$ 2608741 2541678 2793160 2806330 2945187 2729880 2697105 2674776 2838480 2772141 2944692
13995B944692l40405Q701J95704k43444l8547k53213M69830l83998n28287P77098
$$ 2944692 2604287 2612988 2808692 2565248 2526701 2273488 2743318 2359320 1831033 2608131
13985B608131L61987m01239L6481j13722K47208K07035P5206M05180o9279N23846
$$ 2608131 2970118 2568879 2605360 2491638 2738846 2945881 3021087 3426267 3356988 3880834
13975C880834J174718K021590K747164M163941P654854J0677840p944189q778865
$$ 3880834 5055552 7077142 9824306 13988247 21643101 32320941 24376752 15597887
13967A5597887n663278k510274j443512r10871m32998o91574J74303q24434k30470
$$ 15597887 9934609 7424335 5980823 5069952 4636954 3945380 4119683 3295249 3064779
13958C064779M93450l46743o4129n33996J42055j99327N4868K35474m33733K3031
$$ 3064779 3558229 3211486 3147357 2613361 2755416 2556089 2610957 2846431 2412698 2435729
13948B435729j83063L54206j71059m9599R4818m09222K54888k62890r0147L49695
$$ 2435729 2252666 2606872 2435813 2386214 2481032 2071810 2326698 2063808 1973661 2323356
13938B323356j10511k79662L6324J33818k69045J51768j40603J65059l59409L43358
$$ 2323356 2212845 1933183 1969507 2103325 1834280 1986048 1845445 2010504 1651095 1994453
13928A994453m7853Q0455l27090K002K45304k084j40624n0263j00954M10484k82780
$$ 1994453 1946600 2027055 1699965 1701967 1947271 1945187 1804563 1754300 1653346 2063830 1781050
13917A781050r8908l35365N02390j8954k98267P1378M03030l76733j7730k14837
$$ 1781050 1682142 1346777 1849167 1830213 1531946 1603324 2006354 1629621 1611891 1397054
13907A397054O56769j25780j50729j87449k33230K6213L17723j02141J42080j66568
$$ 1397054 2053823 1928043 1777314 1589865 1356635 1382848 1700571 1598430 1740510 1573942
13897A573942K04754l11884J67736k65300J78860j62935K45588k93582K66812
$$ 1573942 1778696 1466812 1634548 1369248 1548108 1385173 1630761 1337179 1603991
13888A603991K9758l53548O6367K21707j41665j24750K30918j61561j49505J76324
$$ 1603991 1633749 1280201 1346568 1568275 1426610 1301860 1532778 1371217 1221712 1398036
13878A398036M9541l60877N53732o5451k47512J86559k97067L5458n8685J32915
$$ 1398036 1447577 1086700 1640432 1574981 1327469 1514028 1216961 1252419 1193734 1326649
13868A326649j52588K17693k03932n0600q059J11256j47537o5550K62163k11439
$$ 1326649 1174061 1391754 1187822 1137222 1129163 1240419 1092882 1027332 1289495 1078056
13858A078056J14396L938k87402L47990j12116o709M80120j70254n16263K00474
$$ 1078056 1192452 1196390 908988 1256978 1144862 1138153 1618273 1448019 931756 1132230
13848A132230M8144J66071m4071k18537n9673L8329K57671q0090k54412K66128
$$ 1132230 1180374 1346445 1302374 1083837 1024164 1062493 1320164 1240074 985662 1251790
13838A251790K75371k69081n3495j31289K64086K2015j11625n78852L94263p4973
$$ 1251790 1527161 1258080 1204585 1073296 1337382 1359397 1247772 668920 1063183 988210
13828I88210l8212k84338M51144l34241J83390J01095O3176J18598m83210K05645
$$ 988210 949998 665660 1116804 782563 965953 1067048 1130224 1248822 765612 971257
13818I71257k72260K64630q4534Q7619K27731K66539k09643l62917J03733D80536
$$ 971257 698997 963627 879093 966712 1194443 1460982 1251339 888422 992155 480536
13807I92286q0871j39713L01885j22121j48056P8676N7151k3287l6239L45378
$$ 992286 911415 771702 1073587 951466 803410 882086 939237 915950 879711 1225089
13797A225089j66021k61440M26532l96026M0305J73366j22721L1031L001j36677
$$ 1225089 1059068 797628 1224160 828134 868439 1041805 919084 950115 953116 816439
13787H16439k87435L95979K1587p3329j65006L52076k3897j67265k84650R1410
$$ 816439 529004 924983 946570 873241 708235 1060311 1036414 869149 584499 675909
13777F75909L44762l89331J58316L87459l50933k66611O2213J86685k8812l72546
$$ 675909 1020671 631340 789656 1177115 826182 559571 621784 808469 779657 407111
13767D07111K90696J56532K07673E28001J91703J49619r0611p8828K5366J92741
$$ 407111 697807 854339 1062012 528001 719704 869323 778712 699884 725250 917991
13757I17991j44097j78990j11145L02174j02697k54033M68093k99387L07035K1317
$$ 917991 773894 594904 483759 785933 683236 429203 897296 597909 904944 926261
13747I26261r7149J843j45909J64571j02464j71552K19058j84627l6052R354j67881
$$ 926261 829112 830955 685046 849617 747153 575601 794659 610032 573980 583334 415453
13736D15453M46488P4406p5239m19381L89274j43968j95875K62220P938l5220
$$ 415453 861941 936347 861108 441727 831001 687033 491158 753378 761316 726096
13726G26096K53117k32947j21845j57830L41295k0156n9968p7855k9943J8998
$$ 726096 979213 746266 624421 466591 807886 787730 727762 649907 619964 638962
13716F38962m7911N6311M07613j79324j60091J79289k42036k14707L52109r7911
$$ 638962 591051 647362 1054975 875651 715560 894849 652813 438106 790215 692304
13706F92304q1387k02812N963L6875J47L235L17911k83432n6742L73095l1850
$$ 692304 610917 408105 414068 450943 451090 454325 772236 488804 432062 805157 773307
13695G73307l05852r6697J34052n8722L84098l08458l4870j66946L27825k50207
$$ 773307 467455 370758 504810 446088 830186 521728 486858 319912 647737 397530
13685C97530J89831R7339m1118J67475Q6871B26670L42344o3910j5374k0082r8599
$$ 397530 587361 684700 643582 811057 897928 226670 569014 505104 489730 469648 371049
13674C71049q5597N40334k28794p0405j7044A33788K49128A81343N42071K23621
$$ 371049 285452 825786 596992 526587 509543 133788 382916 181343 723414 947035
13664I47035D03069J37526j9607Q590A42087M54949k14223J00801J1324j93215
$$ 947035 403069 540595 520988 529578 142087 597036 382813 483614 494938 301723
13654C01723K96366J492J35538k76928J84484k01887R518j2027q5644L4898J63764
$$ 301723 598089 599581 735119 458191 642675 440788 450306 438279 352635 387533 551297
13643E51297F1051N43140l4800M5495k41492K3815J99507J06438j65319K21475
$$ 551297 61051 604191 569391 614886 373394 397209 596716 703154 537835 759310
13633G59310l36444K78274j36962q984J70053l45173q8216N68786C11547L3360
$$ 759310 422866 701140 564178 555194 725247 380074 291858 860644 311547 344907
13623C44907J83793K2096B63915O6687J6623j44070r9632k5266J26769J67434
$$ 344907 528700 550796 263915 330602 347225 203155 103523 78257 205026 372460
13613C72460Q755o6054j16683K33762R609R9819p0908k296n1800j79691L70180
$$ 372460 381215 315161 198478 432240 441849 541668 470760 468464 416664 236973 607153
13602F07153B31530n3805M5711L39251C6157L94430M1627p5975p5283j56634L38633
$$ 607153 231530 177725 223436 562687 36157 430587 472214 396239 320956 164322 502955
13591E02955n4269L8808k7671M6662j77335J42928K02967j15000J14823D3495
$$ 502955 448686 487494 459823 506485 329150 472078 675045 560045 674868 43495
13580B29833K83812j16866J01607j51232H9059K83746J4994J66619L3272B91224
$$ 229833 513645 396779 498386 347154 89059 372805 387799 554418 587690 291224
13569B60044F8015O24921A77810J05209J34888A72263K74027L270j4128j00045
$$ 260044 68015 692936 177810 283019 417907 172263 446290 449560 435432 335387
13559C35387M2116A29923l2422O0605J849K72076L29679C15649j10887L70161
$$ 335387 377503 129923 97501 158106 159955 432031 761710 315649 204762 574923
13549E74923j47876j33466o2678J96854j38208J20886A93090R2450J71637j71678
$$ 574923 427047 293581 230903 427757 289549 410435 193090 285540 457177 285499
13539B85499J49358j82707N3679R4839J96724k01439k0641a00904D50881A59259
$$ 285499 434857 252150 305829 400668 597392 395953 375312 -100904 450881 159259
13528B50637H3290M02066B32320h8807C03232K62949k46573Q306j45421L63372
$$ 250637 83290 485356 232320 -88807 303232 566181 319608 327914 182493 545865
13518E45865j75652A45949L39534k38295p8499L6968O7107j15636P2147E6320
$$ 545865 370213 145949 485483 247188 168689 205657 272764 157128 229275 56320
13507A91165L43246B34399K58058J47645j03473G121L99673H5933K27983J95458
$$ 191165 534411 234399 492457 640102 536629 7121 406794 85933 313916 509374
13497E09374k4064B17193J13387l5919k0057L1975f6922B89483j13798o9910R4163
$$ 509374 485310 217193 330580 294661 274604 306579 -66922 289483 175685 105775 199938
13486A99938K2177J22266j67760K34912A25142K56323R2182j45628b9216F36120
$$ 199938 222115 344381 176621 411533 125142 381465 473647 328019 -29216 636120
13475H6038J60138J21517J22948A80370H7353J3366m574h3551C85473j17225G4072
$$ 86038 246176 367693 490641 180370 87353 100719 96145 -83551 385473 268248 74072
13463D60032k24927K81271A88530M6855P7158j23877R9613J24369A21104L06350
$$ 460032 235105 516376 188530 235385 312543 188666 288279 412648 121104 427454
13453D27454a20534B20307M21966B10578p7905J7289R0222L86602j10947o5074
$$ 427454 -120534 220307 642273 210578 132673 149962 240184 626786 515839 450765
13443D50765B7442K13458I5627Q0802J48012A51854J73849A39505O9997a2504
$$ 450765 27442 240900 95627 176429 324441 151854 325703 139505 209502 -12504
13432B39165K24384A74943n5203P7690n7580K53515I727P3492Q0607R3001N3696
$$ 239165 463549 174943 119740 197430 139850 393365 9727 83219 163826 256827 310523
13421C10523P6228j05534M01362A42406h563C80498j20780J83186A53713L12010
$$ 310523 386751 281217 682579 142406 -8563 380498 259718 442904 153713 465723
13411D65723A58510K1763e6617B66313A01025R0150N8956J19785m0748j47024
$$ 465723 158510 180273 -56617 266313 101025 191175 250131 369916 329168 182144
13401A82144j7997J55788m275G7811M38596j85839b0780C24877i8346B26149l3016
$$ 182144 164147 319935 315660 77811 516407 330568 -20780 324877 -98346 226149 193133
13390A93133o2529m7938K82347P0844j5372f57B20061J55735b71308C20387a06995
$$ 193133 130604 82666 365013 435857 420485 -657 220061 375796 -271308 320387 -106995
13378f1917n9316F7517f179D84381k40349m7032R4660O818n5484L43113G4122
$$ -61917 -121233 67517 -6179 484381 244032 197000 291660 298478 242994 586107 74122
13366A75545G1944g4048B75404m8055D9534L03918a86612G2815Q9292N2792n1330
$$ 175545 71944 -74048 275404 227349 49534 353452 -186612 72815 162107 214899 163569
13355A63569C8599N2378J29897J01399D3868K38749J91732k23604E3773j598J78997
$$ 163569 38599 90977 220874 322273 43868 282617 474349 250745 53773 52175 231172
13344B31172J28949f390C40305N0528j15219J10645D4474Q5817J29704p0058L99163
$$ 231172 360121 -6390 340305 390833 275614 386259 44474 130291 259995 189937 589100
13333E89100k24767C8126K99958r2451h1303C86330q2421j16697K62824j47387
$$ 589100 364333 38126 338084 245633 -81303 386330 303909 187212 450036 302649
13323C02649p0680L51395k14941A30467M54432k77938p1835A3264i1610A91982
$$ 302649 231969 583364 368423 130467 584899 306961 235126 13264 -91610 191982
13312D26155k6312k2428a78k7943D171P8911i2623C27516b38900B89522a4800
$$ 426155 399843 377415 -178 -28121 4171 83082 -92623 327516 -238900 289522 -14800
13300C89079c175F26112A35422L07041j75733e6242A49661E7200N14426E4572
$$ 389079 -3175 626112 135422 442463 266730 -56242 149661 57200 571626 54572
13289f2563A46182L10364A93765O8951H5702f9743C14500B8359d1273I2532m1608
$$ -62563 146182 456546 193765 262716 85702 -69743 314500 28359 -41273 92532 50924
13278E0924J66605b5282E13311k19015K83592A03734a22016a6893A04143n778
$$ 50924 217529 -25282 513311 294296 577888 103734 -122016 -16893 104143 98365
13268I8365K45789j12290L43857f7386G6541h4261A88433a05126H2565f8611A15608
$$ 98365 344154 231864 575721 -67386 76541 -84261 188433 -105126 82565 -68611 115608
13256A78834n8966b49457A20145D4453J61102L37565A29630J00547E8257J20602
$$ 178834 119868 -249457 120145 44453 205555 543120 129630 230177 58257 178859
13246A78859h5364G0346a38957A35441P6686J02598j47874K69716e117l0708H9270
$$ 178859 -85364 70346 -138957 135441 212127 314725 166851 436567 -5117 -35825 89270
13234a93543A2422J22390L38102g9904C01804b9715G417a91081A05881M8575L704
$$ -193543 12422 134812 472914 -79904 301804 -29715 7417 -191081 105881 154456 158160
13223A58160b9459E7589J25418K6155a4477A10450J03242k9184L7334a30546B81173
$$ 158160 -29459 57589 183007 209162 -14477 110450 213692 184508 221842 -130546 281173
13211B62084N4926K9713a0413B95547o5881k1050n6218K56858a90746I7024N00585
$$ 262084 317010 346723 -10413 295547 229666 208616 152398 409256 -190746 97024 597609
13200E97609I9696K09071n8082c31838A13592b29839d6196A79759c02526B74694
$$ 597609 99696 308767 250685 -331838 113592 -229839 -46196 179759 -302526 274694
13189B29569m6917J05870a29275A15054B236a12364B65278b0970A36626L68347
$$ 229569 182652 288522 -129275 115054 2236 -112364 265278 -20970 136626 504973
13179E04973k22219j05896c5183G3647a8280o0978B34040r3588a14794P104J0964
$$ 504973 282754 176858 -35183 73647 -18280 -79258 234040 140452 -114794 -107690 -96726
13168i6726F6629c1422Q575B62138J85106k03774i4941a4640j54139B45805F7219
$$ -96726 66629 -31422 -22847 262138 447244 243470 -94941 -14640 -168779 245805 67219
13156A09863L61446C9598j5315K66865Q0290p4454G8873J97000A25708f2334I4325
$$ 109863 471309 39598 24283 291148 371438 296984 78873 275873 125708 -62334 94325
13144b18370e8423C08015F0332K09689h7408m5817A67330i2643B12504D1840a96373
$$ -218370 -58423 308015 60332 270021 -87408 -133225 167330 -92643 212504 41840 -196373
13132F9791J4823a0029A78075K0229J59895j00673l5609Q093q0628h4893k24316
$$ 69791 84614 -10029 178075 198304 358199 257526 221917 230010 149382 -84893 -309209
13121c09209E442L50426c21207B88890J98476b06598b1411C2726c87600a83585
$$ -309209 5442 355868 -321207 288890 487366 -206598 -21411 32726 -387600 -183585
13110A68107Q3110c30158E0605J55189b24575P4650m9528A39053a17148o419N5718
$$ 168107 251217 -330158 50605 205794 -224575 -149925 -199453 139053 -117148 -123567 -67849
13099f7849E4598J20711H6764L89120F7922a09116C15055B0639J28522P7730d3217
$$ -67849 54598 175309 86764 475884 67922 -109116 315055 20639 149161 226891 -43217
13087C47720C1212M9925K7683i686q0573B75898e6750A21273A9151J42790K18504
$$ 347720 31212 81137 108820 -9686 -90259 275898 -56750 121273 19151 161941 380445
13076C80445j41328a7956C39707A61716b2220E0884I811J10322E6632a76498A00857
$$ 380445 239117 -17956 339707 161716 -22220 50884 9811 120133 56632 -176498 100857
13064C1240J21721a12706j8109A38978a15478L8773d760j42876j17858B19938
$$ 31240 152961 -112706 -130815 138978 -115478 -76705 -4760 -147636 -265494 219938
13053d0857A71314j8328D221J17371I548R732c09370A04372K15565j56247f0601
$$ -40857 171314 152986 4221 121592 9548 19280 -309370 104372 319937 163690 -60601
13041C41041j45097C4584N0522e4951A44947N91790f0682b7855C828b7187B54577
$$ 341041 195944 34584 85106 -54951 144947 736737 -60682 -27855 3828 -27187 254577
13029A98507F5035P5420O62e3632B18559a12034M3376B02539A9152J66873f5930
$$ 198507 65035 140455 141117 -53632 218559 -112034 -68658 202539 19152 186025 -65930
13017G2541H850a20607q330D71404c35881F779K69212h3804A11192l2914L5668
$$ 72541 8850 -120607 -128937 471404 -335881 6779 275991 -83804 111192 78278 113946
13006A13946J53262o8647a23607B33644a9136C7209O5807M5175h0705B85776o8712
$$ 113946 267208 198561 -123607 233644 -19136 37209 103016 148191 -80705 285776 217064
12995B17064g042A71896a25760C07645E8476K38469a22929j5611H0708b0767A87186
$$ 217064 -7042 171896 -125760 307645 58476 296945 -122929 -138540 80708 -20767 187186
12983C36532A34549f7780B1269a46044B81580J93978c6400A78504a35538A77878
$$ 336532 134549 -67780 21269 -146044 281580 475558 -36400 178504 -135538 177878
12972A03706A1669b41215C71590f236B24136r9119b47223B1134o014M2185L71018
$$ 103706 11669 -241215 371590 -6236 224136 125017 -247223 21134 15120 57305 428323
12961D28323f6785l8345N1989j98515Q8775B38471R3617J48819B9739b53802R708
$$ 428323 -66785 -105130 -53141 -251656 -162881 238471 332088 480907 29739 -253802 -244094
12950b44094F5365L5991J73202A11113k9566a02480m5575F9179a43058F7630b67410
$$ -244094 65365 101356 274558 111113 81547 -102480 -148055 69179 -143058 67630 -267410
12938a16152A6414f0081k28907A32312g2265r5569B16960e7764C67052d8793k0974
$$ -116152 16414 -60081 -288988 132312 -72265 -167834 216960 -57764 367052 -48793 -69767
12927f9767A51139K4141C1392L2544K87285j53509D8000J38439b06032B68824
$$ -69767 151139 175280 31392 63936 351221 197712 48000 186439 -206032 268824
12916B29712C4622R4448J34998n5268b7383I8112A2694Q2766J9352Q3553l9103
$$ 229712 34622 129070 264068 208800 -27383 98112 12694 95460 114812 198365 159262
12905A59262a72434I1185h4411j86060A2822a02275K527B03316J29232b09317
$$ 159262 -172434 91185 -84411 -270471 12822 -102275 -99748 203316 332548 -209317
12894A06035i3069I7923K9869P3862m0079G0260L29129j00499j32349a33689c6518
$$ 106035 -93069 97923 127792 201654 161575 70260 399389 298890 166541 -133689 -36518
12882a43767H2181J29714b82818n359I6594c41707a34384A03968a8666D1465i7327
$$ -143767 82181 211895 -282818 -288177 96594 -341707 -134384 103968 -18666 41465 -97327
12870c5623k66086B84355i233A63197Q4280i6868B8412N1833R1929a81056A32921
$$ -35623 -301709 284355 -9233 163197 247477 -96868 28412 80245 172174 -181056 132921
12858B01036c2771H7337K19214c36602c5913F7964d045A55557h2915M788c5090
$$ 201036 -32771 87337 306551 -336602 -35913 67964 -4045 155557 -82915 -78127 -35090
12846c36161J41725B4194b33896B48804b35410a07295c5453A7805b65410d3174
$$ -336161 -194436 24194 -233896 248804 -235410 -107295 -35453 17805 -265410 -43174
12835A16336a04079j5285B1297d8411b2789D7185J56692h3186q64c8453G1773
$$ 116336 -104079 -119364 21297 -48411 -22789 47185 203877 -83186 -84050 -38453 71773
12823a18948A85321k4076E3024K12509b36796G9837f6491k6270k56709D74761
$$ -118948 185321 161245 53024 265533 -236796 79837 -66491 -92761 -349470 474761
12812b08173J3478J592C3204K42065a768A59171J19381a16514j9248j15219c9428
$$ -208173 -194695 -193103 33204 275269 -1768 159171 278552 -116514 -135762 -250981 -39428
12800b65847d8433J0380m03879F6539d37646a49464A59932c02514a05457q2113
$$ -265847 -48433 -38053 -441932 66539 -437646 -149464 159932 -302514 -105457 -187570
12790a87570A05855b34476B44780D1757d05887A58178b12917C3938h1077c9246
$$ -187570 105855 -234476 244780 41757 -405887 158178 -212917 33938 -81077 -39246
12779A61615a37494d3109e76A69741a79988I1522P0943p9958a2782B72789r1533
$$ 161615 -137494 -43109 -576 169741 -179988 91522 162465 82507 -12782 272789 181256
12768A81256q6232J19565c5286A62413M3916e3615F2476a43759p0665B75342j26076
$$ 181256 95024 214589 -35286 162413 206329 -53615 62476 -143759 -214424 275342 149266
12757A49266B5833J16991g4495A05213J56978a9114k4711j51383c481q7848l2494
$$ 149266 25833 142824 -74495 105213 262191 -19114 -43825 -195208 -3481 -91329 -123823
12746a23823d3161j70874q0422A8981J72880K3683b61868C0438N6722a45167B70304
$$ -123823 -43161 -214035 -294457 18981 191861 215544 -261868 30438 87160 -145167 270304
12734e8603A44369h9389C0138a73003D7988f1692j37722E4770B5551J85763I1648
$$ -58603 144369 -89389 30138 -173003 47988 -61692 -199414 54770 25551 211314 91648
12722F7140K75438b21430B7882J30477a05705B31204c3382A017J41432h8798B25115
$$ 67140 342578 -221430 27882 158359 -105705 231204 -33382 1017 142449 -88798 225115
12710b7938p2550F9349K9659A3867a1358A70350b4169H6229J31853a48316D0541
$$ -27938 -100488 69349 99008 13867 -11358 170350 -24169 86229 218082 -148316 40541
12698C17016A26299J09945c3115D66507k03656e8967B04617a1910m5393C62479
$$ 317016 126299 236244 -33115 466507 262851 -58967 204617 -11910 -57303 362479
12687A00837N56606a20856G8009a13729p6517A91152C6093N1971M04354C9355
$$ 100837 657443 -120856 78009 -113729 -190246 191152 36093 88064 492418 39355
12676a89194A85004R1967d2057J3225j06202j2318B80780I2658P8787q1865c04285
$$ -189194 185004 276971 -42057 -28832 -135034 -147352 280780 92658 171445 89580 -304285
12664A26984f2476B46842H9595Q29f7139A00804L95063d251A98802b5570j56043
$$ 126984 -62476 246842 89595 90424 -67139 100804 495867 -4251 198802 -25570 -181613
12653a81613A59928M2021E8926d7959l19366a65435A85368g8223j07675c5667
$$ -181613 159928 201949 58926 -47959 -367325 -165435 185368 -78223 -185898 -35667
12642a50478M8867m4182C22237P1926q5310g077A66944g4207k52908B2959e7092
$$ -150478 -101611 -145793 322237 394163 308853 -7077 166944 -74207 -327115 22959 -57092
12630b60740B5113J28600b64811A54305a17984l6931A06910b37680A42531J87618
$$ -260740 25113 153713 -264811 154305 -117984 -154915 106910 -237680 142531 330149
12620C30149c4409A18647R2168K11745i0855G9295b32182E7633d6970A37924K88092
$$ 330149 -34409 118647 210815 422560 -90855 79295 -232182 57633 -46970 137924 426016
12609D26016k07609g254B1986a33886A47355L13558e453G5241a41216C5234J45866
$$ 426016 218407 -7254 21986 -133886 147355 460913 -5453 75241 -141216 35234 181100
12598A81100a69658f9109A59973J18707b19590h7017o1391C28313A3089c35536
$$ 181100 -169658 -69109 159973 278680 -219590 -87017 -148408 328313 13089 -335536
12587a014A71933l8738D7815M793K38251I5390J04095I3590d65138E9954L5216
$$ -1014 171933 133195 47815 52608 290859 95390 199485 93590 -465138 59954 95170
12576I5170d30631F3789a50735a1135j69440d2066l003J2193I5572a8088H5376
$$ 95170 -430631 63789 -150735 -11135 -180575 -42066 -45069 -32876 95572 -18088 85376
12564D3622J8052j3296J72133A05292e1391G9245L5455J91021h0734l73465a3927
$$ 43622 61674 48378 220511 105292 -51391 79245 114700 305721 -80734 -454199 -13927
12552a55409k9147A39228n7002a02770B4929a30303k34829i8057A14010a47560
$$ -155409 -184556 139228 82226 -102770 24929 -130303 -365132 -98057 114010 -147560
12541A98882a1150l36818i9692c9442B21956b49322A3607b24841j31745C07258
$$ 198882 -11150 -347968 -99692 -39442 221956 -249322 13607 -224841 -356586 307258
12530A63529k0903B8028J0814b38839i4433B12746j02861a4921A15896D6850A0605
$$ 163529 142626 28028 38842 -238839 -94433 212746 109885 -14921 115896 46850 10605
12518a05955q3619D72907D6326a05840A7539N7062b22557B12407d65512a59721
$$ -105955 -189574 472907 46326 -105840 17539 74601 -222557 212407 -465512 -159721
12507a7563A09729J70428d6747A32562j6713a21283j43164A53897D4856K03600
$$ -17563 109729 280157 -46747 132562 115849 -121283 -264447 153897 44856 248456
12497B48456a47728A04843a85879g6944B32903p1224P5769b04587K6365H5181
$$ 248456 -147728 104843 -185879 -76944 232903 161679 237448 -204587 -178222 85181
12486B946h7044n5504N7139j42288E5513J3982K31577Q8441G7640a77432F0095
$$ 2946 -87044 -142548 -85409 -227697 55513 69495 301072 389513 77640 -177432 60095
12474d4419I6206b6769j02212p634r1915j91880B19221L6585i4669A00422K14605
$$ -44419 96206 -26769 -128981 -136615 -228530 -420410 219221 255806 -94669 100422 315027
12463C15027a9852o8591J513i942q0740A3155K8901A0519K11120f4256K418j86268
$$ 315027 -19852 -88443 -86930 -9942 -90682 13155 42056 10519 221639 -64256 -61838 -248106
12451b48106H8344d0409a7853l7913c943k41431B84540j14154b630C3667a56067
$$ -248106 88344 -40409 -17853 -55766 -3943 -245374 284540 170386 -2630 33667 -156067
12439A67940g3804i425B05463K2690h165E13K14538L534r645b22486K1534k1875
$$ 167940 -73804 -9425 205463 228153 -8165 513 215051 218585 208940 -222486 -200952 -222827
12427b22827b2337m4171A4003b24622g7806j68367k1220h3057G204P4672e1853
$$ -222827 -22337 -66508 14003 -224622 -77806 -246173 -267393 -83057 7204 81876 -51853
12415b12680M3910A20433M864a28945o933D5296b06963A06231K9487c17496B46594
$$ -212680 -168770 120433 125297 -128945 -135878 45296 -206963 106231 135718 -317496 246594
12403e1023N188j10245B67869a29165A49916a05200D01867E6697h9681L7367n8853
$$ -51023 -45835 -156080 267869 -129165 149916 -105200 401867 56697 -89681 -52314 -111167
12392a11167L6423k34834D15592a51737P1424k15277g881C78216d2861j68194
$$ -111167 -74744 -309578 415592 -151737 -80313 -295590 -7881 378216 -42861 -211055
12382b11055O8010m90A55516o9480K26910i7831C7757N4817d9953G1867J27627
$$ -211055 -143045 -143535 155516 86036 312946 -97831 37757 92574 -49953 71867 199494
12371A99494r3107a32658k09634e5070d841m1722m5409A95298Q1963f37A77734
$$ 199494 106387 -132658 -342292 -55070 -4841 -46563 -91972 195298 277261 -637 177734
12359B23140J1730A16247n6211A6749J82728b43539c7929j59471A15644c9145
$$ 223140 234870 116247 60036 16749 199477 -243539 -37929 -197400 115644 -39145
12348h1100J4887m4759B3560a79252O0166L9273c2179j11903h926l8395n9433
$$ -81100 -66213 -110972 23560 -179252 -119086 -79813 -32179 -144082 -8926 -47321 -106754
12337a06754b2647B9405B163M9093a55855G1557K30245b00570A95187G5415a29232
$$ -106754 -22647 29405 2163 51256 -155855 71557 301802 -200570 195187 75415 -129232
12325B1077b14309I0644A646a48586g036M5B5090J9617J36744b0051B08199E6809
$$ 21077 -214309 90644 1646 -148586 -7036 -6991 25090 44707 181451 -20051 208199 56809
12312D97395p9028j66840q7850K56234e3917B84358A33468a70000B67679F4924
$$ 497395 418367 251527 163677 419911 -53917 284358 133468 -170000 267679 64924
12301A79253A1854K49579o7797m3730n2658A3170d0373j91223B06436p7762A1587
$$ 179253 11854 261433 193636 149906 97248 13170 -40373 -231596 206436 128674 11587
12289B473K6609J67250H6828k8363g4545m6363j86983M8476a27518e8213A60759
$$ 2473 29082 196332 86828 58465 -74545 -120908 -307891 -259415 -127518 -58213 160759
12277A84138j5358B0183g9929B63350f8926A61907b47010R71B46030j19423n5129
$$ 184138 168780 20183 -79929 263350 -68926 161907 -247010 -246039 246030 126607 71478
12266G1478n880l2703J581m802J23332J46851q1992P0015A37837m8784L07129
$$ 71478 65598 32895 34476 29674 153006 299857 217865 287880 137837 89053 396182
12255C96182C6531J56749F194J28143N8504N4003l8166G7820Q0224a43411D38826
$$ 396182 36531 193280 6194 134337 192841 246844 208678 77820 158044 -143411 438826
12243A78878o5330C6455d7198A48097a0424A43572i076l5088C90230A82783k5288
$$ 178878 113548 36455 -47198 148097 -10424 143572 -9076 -44164 390230 182783 157495
12232A57495e3631C43363A04165K76804m2473J36063d2309C71307b85012A25457
$$ 157495 -53631 343363 104165 380969 338496 474559 -42309 371307 -285012 125457
12221H4449k9006b90371B04693g8726j0909A05966C3028P8609J7129L40715A85785
$$ 84449 55443 -290371 204693 -78726 -89635 105966 33028 111637 128766 469481 185785
12209A52652a11647B72628K47942c6151B47439n4659K09950A17249J77374A38835
$$ 152652 -111647 272628 520570 -36151 247439 192780 402730 117249 294623 138835
12198A73279K541J30057J65114j78369j44925b74629F4424c4669H4971k4558R9420
$$ 173279 175820 305877 470991 292622 147697 -274629 64424 -34669 84971 60413 159833
12187A59833F6079a33795I0638c8608B4196L67242j76550H7045K18564r3491m6250
$$ 159833 66079 -133795 90638 -38608 24196 391438 214888 87045 305609 212118 165868
12176A65868l6514J52547j18814Q189n5503P0471a11912C01694j31575f7176k26826
$$ 165868 129354 281901 163087 171276 115773 186244 -111912 301694 170119 -67176 -294002
12165b94002A58948J30431k9575J83748A06928h5963B75988o92N1436C9494O0590
$$ -294002 158948 289379 259804 443552 106928 -85963 275988 275296 326732 39494 100084
12154A00084l2795J28946G9844K75745L02279A76178a27688C38361J01485p0353
$$ 100084 67289 196235 79844 355589 657868 176178 -127688 338361 439846 369493
12144C69493H7112M23234A90246b6959l807B43243m0510R9134g626A33102Q7448
$$ 369493 87112 510346 190246 -26959 -30766 243243 202733 301867 -7626 133102 220550
12133B20550a22610l8613j02765B82627l043A16983j1810K48763A7248R923j1020
$$ 220550 -122610 -161223 -263988 282627 279584 116983 105173 353936 17248 27171 16151
12122A6151Q8791D364J03836o908A1722b99389E361O515J69846K09070E2833K25275
$$ 16151 104942 4364 108200 101292 11722 -299389 5361 11876 181722 390792 52833 278108
12110B78108a1993I341N8422L23287A92019a6691B59747K2653E0500O1265R8346
$$ 278108 -11993 9341 67763 391050 192019 -16691 259747 282400 50500 111765 210111
12099B10111L0832P497P4446a58137m5788B37422e082k3788E1156a27619A20745
$$ 210111 240943 248440 322886 -158137 -203925 237422 -5082 -28870 51156 -127619 120745
12087B79441G305L75O8511K57317b29934I5091L14603b5356A95668I4385b23565
$$ 279441 7305 7680 76191 333508 -229934 95091 409694 -25356 195668 94385 -223565
12075A09101B3484q594a6082B66830e5384R251A08064b30755a4587B14931o8408
$$ 109101 23484 14890 -16082 266830 -55384 -46133 108064 -230755 -14587 214931 146523
12064A46523d8301p189C19361a31634C8968e9457D420J98424q5509b58972B90230
$$ 146523 -48301 -55490 319361 -131634 38968 -59457 4420 202844 117335 -258972 290230
12052e2599C3164O8015b1811B22226d7882j92601C5066b59431A42844e2458j83678
$$ -52599 33164 101179 -21811 222226 -47882 -240483 35066 -259431 142844 -52458 -236136
12041b36136A01236O0002d7270B81329d3491m3124B773N7816e1672C54220b85632
$$ -236136 101236 161238 -47270 281329 -43491 -86615 2773 60589 -51672 354220 -285632
12029b33068r5748A28586F0349a22542d2664G61O502K67549g2109A82064J55300
$$ -233068 -328816 128586 60349 -122542 -42664 761 7263 274812 -72109 182064 337364
12018C37364F8775A5135b34976A8162J56438a10109F8223c4255C0115J67859c25801
$$ 337364 68775 15135 -234976 18162 174600 -110109 68223 -34255 30115 197974 -325801
12006G9392L2691b51539B3819J07642m6224B7721R4625i9729A72697K4571e5835
$$ 79392 112083 -251539 23819 131461 85237 27721 122346 -99729 172697 197268 -55835
11994e6820E40579F224K29377m129K583R5449j51182d1750A28959a55294a813
$$ -56820 540579 6224 235601 231472 234055 329504 178322 -41750 128959 -155294 -1813
11982C24041D4365J14267a13693k12055G8002a04319j95433i4501A06149b9423
$$ 324041 44365 158632 -113693 -325748 78002 -104319 -299752 -94501 106149 -29423
11971E74504a6024j82707C77O393e1334j38575n919a4568A61210e8252B63546
$$ 574504 -16024 -198731 377 6770 -51334 -189909 -195828 -14568 161210 -58252 263546
11959g5365P844j42249E3338J01199B1432L5299a38716C13262b75431J29944E9542
$$ -75365 -67521 -209770 53338 154537 21432 56731 -138716 313262 -275431 -145487 59542
11947c57906b1814A43976o2500a28899b9957A38896b16730q6025j3725J12293
$$ -357906 -21814 143976 81476 -128899 -29957 138896 -216730 -302755 -316480 -204187
11937b04187I2775O8242a57721c1631l54995a09515j73411A06292m0359J613f075
$$ -204187 92775 161017 -157721 -31631 -386626 -109515 -282926 106292 65933 67546 -6075
11925B17761c92238A40519J92100A43911c1976B11921b24863k55394e9339B19285
$$ 217761 -392238 140519 332619 143911 -31976 211921 -224863 -480257 -59339 219285
11914a53531A51652n1499a69165A00948K64539j11202A08145J85531i2611j01953
$$ -153531 151652 100153 -169165 100948 365487 254285 108145 293676 -92611 -194564
11904a94564n0993F1364a64127k3835l0763A25918J96810c0989n321A91495F5046
$$ -194564 -245557 61364 -164127 -187962 -218725 125918 322728 -30989 -36310 191495 65046
11892a05965B20050a9672k93792a52619A26758c41050a21218B66694p4100a11807
$$ -105965 220050 -19672 -313464 -152619 126758 -341050 -121218 266694 192594 -111807
11881A1778L23029m1061a83882b866m9472D68531b44037A08784a57983A18956
$$ 11778 334807 293746 -183882 -2866 -52338 468531 -244037 108784 -157983 118956
11870b5382C22372a49665H7120J6855a48888d8555j67723c6577A47226g6012A59271
$$ -25382 322372 -149665 87120 103975 -148888 -48555 -216278 -36577 147226 -76012 159271
11858A6313d90417D0760J16115B6577i8001A12297j4980b564j0715H9888d4178
$$ 16313 -490417 40760 156875 26577 -98001 112297 97317 -2564 -13279 89888 -44178
11846a30747n7172F6389J83198c6130j24609f9551j22769A31235e9468b7344I167
$$ -130747 -187919 66389 249587 -36130 -160739 -69551 -192320 131235 -59468 -27344 9167
11834b58268A38228b87475f6774j30370p2684J25808F155J75068a08483D7382
$$ -258268 138228 -287475 -66774 -197144 -269828 -144020 6155 181223 -108483 47382
11823a69303n8743C2958b394k28600c9062p6242j0790o5974E6367p737c5446E4473
$$ -169303 -228046 32958 -2394 -230994 -39062 -115304 -126094 -192068 56367 48630 -35446 54473
11810a9715j60639h0162j67814c2158k0756j11167A4450b85641J01834B15871
$$ -19715 -180354 -80162 -247976 -32158 -52914 -164081 14450 -285641 -183807 215871
11799A10428h7899j57956A21187i8759j33513g5572A58313a10795b4717j19141
$$ 110428 -87899 -245855 121187 -98759 -232272 -75572 158313 -110795 -24717 -143858
11789a43858a3288G9639a16125k0241A1337K25329e3597A40474M2391a49586L9617
$$ -143858 -13288 79639 -116125 -136366 11337 236666 -53597 140474 182865 -149586 -109969
11778a09969k7099H6588a15993E7715c47905D5252a82093A36606a7053G7111P3997
$$ -109969 -137068 86588 -115993 57715 -347905 45252 -182093 136606 -17053 77111 151108
11767A51108f4415j67630I269f3737j54663A87319H7651a4922l9810H9982f7881
$$ 151108 -64415 -232045 9269 -63737 -218400 187319 87651 -14922 -54732 89982 -67881
11755d702o474A21534d84117K39631c6014j01458B8627r122K64126c05316D1976
$$ -4702 -11176 121534 -484117 -244486 -36014 -137472 28627 19505 283631 -305316 41976
11743e9130j19858o0780b2273j63328j88982G2712K59548b99402A30237m0625
$$ -59130 -178988 -239768 -22273 -185601 -374583 72712 332260 -299402 130237 89612
11733H9612a63338b4241k38648B13990a55454B1652l774K29589a80380C22789
$$ 89612 -163338 -24241 -262889 213990 -155454 21652 17878 247467 -180380 322789
11722g0110j66703B16206L5220O5363A07139R3732e932l216B6995c46797c7654
$$ -70110 -236813 216206 251426 316789 107139 200871 -5932 -9148 26995 -346797 -37654
11710a99991n4442B9053J09534C8035h3727F4011L6552f1646A70174k4921J7037
$$ -199991 -254433 29053 138587 38035 -83727 64011 100563 -61646 170174 145253 162290
11699A62290d52349g7076c500H360a38439J9829J275E0450f0646D1218b07063
$$ 162290 -452349 -77076 -3500 8360 -138439 -118610 -117335 50450 -60646 41218 -207063
11687a56564B63250a00927B97005K0626o8024E0296M1216O5504e1636j29586A73254
$$ -156564 263250 -100927 297005 317631 249607 50296 91512 157016 -51636 -181222 173254
11675B14375b95239I0244b7072j650E08504B3499c28516I8198R8334d9080A0658
$$ 214375 -295239 90244 -27072 -28722 508504 23499 -328516 98198 196532 -49080 10658
11663A84978e545G0644d6744A52356J36021i0503A99330a26199G6212j3483b80194
$$ 184978 -5545 70644 -46744 152356 288377 -90503 199330 -126199 76212 62729 -280194
11651e0432B5720a55498R031G2361K90997b6857D72086e57476A04029m9228g3011
$$ -50432 25720 -155498 -146467 72361 363358 -26857 472086 -557476 104029 54801 -73011
11639f7919A7105h6787A17618a15860F1962K05620c29822E756a99923A35467a36094
$$ -67919 17105 -86787 117618 -115860 61962 267582 -329822 5756 -199923 135467 -136094
11627A34226b57345a3299j8469M58A3835b09934A09159g339C76921c6439B0868
$$ 134226 -257345 -13299 -31768 -31310 13835 -209934 109159 -7339 376921 -36439 20868
11615B3126f084H8376C8120K32942I963N24595A07056J00771E5061a35657k50658
$$ 23126 -6084 88376 38120 271062 9963 534558 107056 207827 55061 -135657 -386315
11604c86315G3213d8796k88975E8666J25397f6909j51983c3588C1913c59228e0210
$$ -386315 73213 -48796 -337771 58666 184063 -66909 -218892 -33588 31913 -359228 -50210
11592A05440c2756A57594g5997P460D3284b41994A40154b2170A19271N6541l0590
$$ 105440 -32756 157594 -75997 -68537 43284 -241994 140154 -22170 119271 175812 145222
11581A45222J39783A29136b73460C9147a05775B29777C4385L77132a51635H0298
$$ 145222 285005 129136 -273460 39147 -105775 229777 34385 411517 -151635 80298
11570C01696b13527k810A59908a25685B10427K03843A39862J97669C1559a15458
$$ 301696 -213527 -216337 159908 -125685 210427 414270 139862 337531 31559 -115458
11559A19133K30216a48617d5182a5183B48991k420K0938A24548d1410j10920E6808
$$ 119133 349349 -148617 -45182 -15183 248991 246571 267509 124548 -41410 -152330 56808
11547A41497L0312c1520j07577E9351N8594c2509A37255M3662G5466O9752o6024
$$ 141497 171809 -31520 -139097 59351 117945 -32509 137255 180917 75466 145218 79194
11536G9194l8922K1837A5761d72095b01066B13070J5565H7637A6191K77591a45838
$$ 79194 40272 62109 15761 -472095 -201066 213070 228635 87637 16191 293782 -145838
11524d38994c5983B4225a92036A28282a74662A55014F4818J18637a58322A27192
$$ -438994 -35983 24225 -192036 128282 -174662 155014 64818 183455 -158322 127192
11513e2094j07512b6215B55505D1701J20722b26650K4205q8433J20024B52876
$$ -52094 -159606 -26215 255505 41701 162423 -226650 -202445 -290878 -170854 252876
11502a37338a7741A79768k6412i8590A08402b60223l4811a6444A61635K76586
$$ -137338 -17741 179768 153356 -98590 108402 -260223 -295034 -16444 161635 438221
11492D38221k5373f9453B58167G4085N9586a070A20445J3739l636J09685k2894
$$ 438221 412848 -69453 258167 74085 133671 -1070 120445 134184 130548 240233 217339
11481B17339N8540R828p6091g3780B66928D2266f7959D1113J69667P1330m4751
$$ 217339 275879 285707 209616 -73780 266928 42266 -67959 41113 210780 282110 237359
11470B37359f439A95368q5502a24039b202m7623d284C885b2707G0995b00255B1368
$$ 237359 -6439 195368 109866 -124039 -2202 -49825 -4284 3885 -22707 70995 -200255 21368
11457g4720l9883M4415D4488c2857B35941N2803d0114n1807B27968I724R1924
$$ -74720 -114603 -70188 44488 -32857 235941 288744 -40114 -91921 227968 9724 101648
11446A01648J3414J29638p5395a37742N7911F6180R2147b16142D81334B0786a32987
$$ 101648 115062 244700 169305 -137742 -79831 66180 158327 -216142 481334 20786 -132987
11434I6459a08421M9224A26282n440l9185l2590d023j4534j91031p4074A89221
$$ 96459 -108421 -59197 126282 120842 81657 49067 -4023 -18557 -209588 -283662 189221
11422f7873q9035P6999C1710b60309f3112C07307I1154J88362j25728K2963D0503
$$ -67873 -156908 -79909 31710 -260309 -63112 307307 91154 279516 153788 176751 40503
11410b18775R2114A14773E4676J70826L706b87108a00633d6795F6515a07389k1403
$$ -218775 -126661 114773 54676 225502 229208 -287108 -100633 -46795 66515 -107389 -128792
11399a28792j03047C40821a39162E178J7259J35207B4549R7563a37608A50619
$$ -128792 -231839 340821 -139162 5178 22437 157644 24549 122112 -137608 150619
11388G4627J75666j10998P1944L2078b04149N6761H8163J39546G1590e18981B00333
$$ 74627 250293 139295 211239 243317 -204149 -147388 88163 227709 71590 -518981 200333
11376B68755P6331d2768l0392B66376O3954j19137a59785O143b3608n0395m3460
$$ 268755 345086 -42768 -73160 266376 330330 211193 -159785 -153642 -23608 -74003 -117463
11365a17463D2821P3803a00509c6020f989A29144a36506A44913b51952B3506a62447
$$ -117463 42821 116624 -100509 -36020 -6989 129144 -136506 144913 -251952 23506 -162447
11353E4836b4934G4752J62161A16947b30776A61480J1668o6322J28266H8523J2277
$$ 54836 -24934 74752 236913 116947 -230776 161480 173148 106826 235092 88523 100800
11342A00800B2634K3229b27332e633A77528a09512b6964r9380J5315E599J19727
$$ 100800 22634 45863 -227332 -5633 177528 -109512 -26964 -126344 -111029 5599 125326
11331A25326a25108a2132l65082B03386O8547K3937i7935F8651c16574a26251
$$ 125326 -125108 -12132 -377214 203386 271933 295870 -97935 68651 -316574 -126251
11320E9641h4961j45137B16595a11731A03840b9565j31605J0347j09090H6038
$$ 59641 -84961 -230098 216595 -111731 103840 -29565 -161170 -150823 -259913 86038
11309a8790f435j91714g2476E8680J3973b29420M6980g2257E0358K45523a05477
$$ -18790 -6435 -198149 -72476 58680 72653 -229420 -182440 -72257 50358 295881 -105477
11297A2923J32093f0635A13913g5255p5356f7893K966k69351A06297J30532l9313
$$ 12923 145016 -60635 113913 -75255 -150611 -67893 -64927 -334278 106297 236829 197516
11286A97516F521J5188a5663j60011k0547G5144c1836A1129Q1605a61275p7761
$$ 197516 6521 21709 -15663 -175674 -196221 75144 -31836 11129 92734 -161275 -239036
11275b39036D2425M1980a08186k9926M1695o2846B44730b5063n7833n2832D1105
$$ -239036 42425 84405 -108186 -138112 -96417 -159263 244730 -25063 -82896 -135728 41105
11263F0578a6405j29830M0198j51695f6557j03762I7779K39772a48892c5256A19893
$$ 60578 -16405 -146235 -106037 -257732 -66557 -170319 97779 337551 -148892 -35256 119893
11251G5238c50156k9238A00097m3092a19406J4251I8047D582L36321c59584R5978
$$ 75238 -350156 -379394 100097 57005 -119406 -105155 98047 4582 340903 -359584 -263606
11240b63606d9858G7074c00011N8488F2453K22989h4866H2693d0945m1216B47464
$$ -263606 -49858 77074 -300011 -241523 62453 285442 -84866 82693 -40945 -82161 247464
11228a50850N4508j52266b7120l10181a23107k05566F5935a00014C74567f2261
$$ -150850 -96342 -248608 -27120 -337301 -123107 -328673 65935 -100014 374567 -62261
11217f8448c894B36075e4055j68294A94709b40519K5976J04728c8914A43689a16066
$$ -68448 -3894 236075 -54055 -222349 194709 -240519 -214543 -109815 -38914 143689 -116066
11205B8097a86654p8718O6184d0276D1731L083b23906b8735o1389J062k83349
$$ 28097 -186654 -265372 -199188 -40276 41731 44814 -223906 -28735 -90124 -89062 -372411
11194c72411h2867j22669a01839k516i620C70492c98147a96694j54893d5246j96364
$$ -372411 -82867 -205536 -101839 -104355 -9620 370492 -398147 -196694 -351587 -45246 -241610
11183b41610F1619b19489A97864f121j35790k80775I3366j5377i1692B9340b14252
$$ -241610 61619 -219489 197864 -6121 -141911 -422686 93366 77989 -91692 29340 -214252
11171d06638a21478A38332b26079j1968B8176b73743A95930f1270D03359a74901
$$ -406638 -121478 138332 -226079 -238047 28176 -273743 195930 -61270 403359 -174901
11160E1f4838k64492J17130E1999a21788j7392j8301l3609C34997C631i8220P754
$$ 51 -64838 -329330 -212200 51999 -121788 -139180 -157481 -191090 334997 3631 -98220 -90466
11148i0466B26433P0208k3667b1331j7252k17084k12845K29525I2884M3135D0773
$$ -90466 226433 296641 272974 -21331 -38583 -255667 -468512 -238987 92884 136019 40773
11136a22159E2607a46738n6108N9278E0086a85450A04317f4017j7810j97761c6619
$$ -122159 52607 -146738 -202846 -143568 50086 -185450 104317 -64017 -81827 -279588 -36619
11124b98683a16856A28756R6743b3736G4574K80185G6547a68993O5641m43B3331
$$ -298683 -116856 128756 225499 -23736 74574 354759 76547 -168993 -103352 -103795 23331
11112A26089a74034B21295d6989a4948F5326J88333b84493o6630E279J12016q01
$$ 126089 -174034 221295 -46989 -14948 65326 253659 -284493 -351123 5279 117295 116494
11101A16494g0390C30356A5570M2597J87051b76748I5972A0023J44453O8727A04129
$$ 116494 -70390 330356 15570 58167 245218 -276748 95972 10023 154476 223203 104129
11089B808J70070e1093n5461k502G9568A0363J96777J7098a84442D56241b2469
$$ 2808 172878 -51093 -106554 -109056 79568 10363 207140 224238 -184442 456241 -22469
11077E6006L98640f9516B32579i1265C93214f150C91063C7908r512P6058K26656
$$ 56006 454646 -69516 232579 -91265 393214 -6150 391063 37908 28396 104454 331110
11066C31110I2058J01981k243d0538r9906B68410K2667j537K42060D468J80758
$$ 331110 92058 194039 191796 -40538 -140444 268410 291077 289540 531600 4468 185226
11055A85226K0243J11297A16246K48498A17783M40370B70927q5466K66523j03086
$$ 185226 205469 316766 116246 364744 117783 558153 270927 185461 451984 348898
11045C48898K60324j07956n0849P862j74807J19156L22744k88528j6549J03140
$$ 348898 609222 501266 450417 458279 283472 402628 725372 436844 420295 523435
11035E23435K06930j25829o305K97799C58029L71148O5562k0016l75006L17058
$$ 523435 730365 604536 598231 896030 358029 729177 794739 774723 399717 716775
11025G16775C04267O32751j58689l60030K50118C33210J60964M19903k85908q9588
$$ 716775 304267 937018 778329 418299 668417 333210 494174 914077 628169 538581
11015E38581J68848o9925B10750M43387k82550J87012k9858N7627j7851k8391
$$ 538581 707429 637504 210750 654137 371587 558599 528741 586368 568517 540126
11005E40126q0414K56838j90577q4414J97354k2642k14663n7951R7368j9455L47395
$$ 540126 459712 716550 525973 441559 638913 616271 401608 343657 441025 421570 768965
10994G68965j64367O2895j22415j79722K01205H9016L99520J06075M221L18647
$$ 768965 604598 667493 545078 365356 566561 89016 488536 594611 598832 917479
10984I17479l64973P8854l08528Q0558n3697o8468M71760j3826k88096J39159
$$ 917479 552506 631360 322832 403390 349693 281225 752985 739159 451063 590222
10974E90222P545J11666j49503K24159C58732K67390J60450j98847M41578j93478
$$ 590222 597767 709433 559930 784089 358732 626122 786572 587725 1029303 835825
10964H35825k51338N17207l65137J1583M61038M3870N427J96750J22159J12984
$$ 835825 584487 1101694 736557 748140 1209178 1253048 1258475 1455225 1577384 1690368
10954A690368q146M45677k27295J74948j84568P5759j67674n6042m97032J76779
$$ 1690368 1682222 2127899 1900604 2075552 1890984 1966743 1799069 1743027 1245995 1422774
10944A422774J99274l07784k03594N58568l39346L9724j16130K17572J03237m77077
$$ 1422774 1622048 1314264 1110670 1669238 1329892 1369616 1253486 1471058 1574295 1097218
10934A097218J4582J56949k23417J04497E29918K78107k20666N8249B72935M15140
$$ 1097218 1111800 1268749 1045332 1149829 529918 808025 587359 645608 272935 688075
10924F88075l31764Q4319A66069A4918c5732A60300a18092A34825g9860G2388
$$ 688075 356311 440630 166069 14918 -35732 160300 -118092 134825 -79860 72388
10913A19300f1383B1801J34979l0017b84915A36327i3200B4824M4786c56256N5920
$$ 119300 -61383 21801 156780 126763 -284915 136327 -93200 24824 69610 -356256 -300336
10902c00336c7973j69931R4967k35743F6263J74012a92190O4842A7536K20666
$$ -300336 -37973 -207904 -112937 -348680 66263 240275 -192190 -127348 17536 238202
10892B38202C7820b58847J28812e5972A37793D4817K80550b28790i206H3534b53515
$$ 238202 37820 -258847 -130035 -55972 137793 44817 325367 -228790 -9206 83534 -253515
10880A35473o2091K09447e0933A28691E9370f4012j00750m1721A05382B7778b08096
$$ 135473 73382 282829 -50933 128691 59370 -64012 -164762 -206483 105382 27778 -208096
10868A201b45055e9981j11266l9061a01325A33049b76397A43098C8354a16609
$$ 1201 -245055 -59981 -171247 -210308 -101325 133049 -276397 143098 38354 -116609
10857a56203A12333a57147e3264J0824j22197k25156B69456q6212b73013h0225
$$ -156203 112333 -157147 -53264 -42440 -164637 -389793 269456 183244 -273013 -80225
10846a09862G2330N9647a04162j92168J2192B76750I9532f7015n3348j17317h8269
$$ -109862 72330 131977 -104162 -296330 -284138 276750 99532 -67015 -120363 -237680 -88269
10834b19605D21409j74067e4604k3372n9653H0769o038a50116J1292A99445b06089
$$ -219605 421409 247342 -54604 -77976 -137629 80769 74731 -150116 -138824 199445 -206089
10822A46994F6122c2778j79992P8843C5739a83525a9384l68599A52799a89662
$$ 146994 66122 -32778 -212770 -133927 35739 -183525 -19384 -387983 152799 -189662
10811a19719I4425J44592g430H6615a23457D436K40638c70327P7525C598b1818
$$ -119719 94425 239017 -7430 86615 -123457 4436 245074 -370327 -292802 3598 -21818
10799a3513k58052A80667a83448Q3783j54505D6783a89732P5525A19292O4613
$$ -13513 -271565 180667 -183448 -99665 -254170 46783 -189732 -114207 119292 183905
10789A83905h5095j3367l9101k31919G65J69158F7428R7145a00654J8863A89285
$$ 183905 -85095 -98462 -137563 -369482 765 169923 67428 164573 -100654 -81791 189285
10777a0455A10634c18346J05729Q6237n5518M5177A5088b52517C08372p4708b43635
$$ -10455 110634 -318346 -212617 -126380 -181898 -136721 15088 -252517 308372 233664 -243635
10765h0098c3918j18620r8956d5486p9301j14115A47450c29123e3333A33488J9786
$$ -80098 -33918 -152538 -251494 -45486 -124787 -238902 147450 -329123 -53333 133488 153274
10754A53274a42057b0325l15148B3054J17681C8085j1518b41145b7041B25149
$$ 153274 -142057 -20325 -335473 23054 140735 38085 26567 -241145 -27041 225149
10743b51094M4063F923f3252c0798G3896N6914a87146e7415I2388e6987j22598
$$ -251094 -207031 6923 -63252 -30798 73896 130810 -187146 -57415 92388 -56987 -179585
10732a79585k50890c6381j83108f0428r1299A27047a46440B92034A39598h6862
$$ -179585 -430475 -36381 -219489 -60428 -151727 127047 -146440 292034 139598 -86862
10721b99956a32529B79928j3163b94244a07849C45897c32293N3669E4530a29439
$$ -299956 -132529 279928 266765 -294244 -107849 345897 -332293 -278624 54530 -129439
10710A97454I6424a75227C1990b82560A84883i2006k79606J79916A65235b26963
$$ 197454 96424 -175227 31990 -282560 184883 -92006 -371612 -191696 165235 -226963
10699d980F9417c2878p8019L9779l5062B08678B0850J1039h739A65166f2119c146
$$ -4980 69417 -32878 -110897 -71118 -106180 208678 20850 31889 -8739 165166 -62119 -3146
10686c0664j16776n2789A09917h1854D9715a24449j51016m5512O6727h6439j25754
$$ -30664 -147440 -200229 109917 -81854 49715 -124449 -275465 -320977 -254250 -86439 -212193
10675b12193F7453N375a80522L7237r4700B4296G240a73836L0021B1082J6479
$$ -212193 67453 72828 -180522 -143285 -237985 24296 7240 -173836 -143815 21082 37561
10664C7561f6540A04837r262I806J00388a88555A49973b98376J5269B57045C187
$$ 37561 -66540 104837 95575 9806 110194 -188555 149973 -298376 -283107 257045 3187
10652a66854q5410J6662a33l01367O5206j113B29586f5983l51238A11918g73j07594
$$ -166854 -252264 -235602 -133 -301500 -236294 -237407 229586 -65983 -417221 111918 -773 -108367
10640a08367B68397b85849D6354p248h7793n8626k932l7130G162f7375A23489
$$ -108367 268397 -285849 46354 39106 -87793 -146419 -149351 -186481 7162 -67375 123489
10628c42690C78051b36380r6083P6999A37805a0259l56577A32654O8275b79888
$$ -342690 378051 -236380 -332463 -255464 137805 -10259 -366836 132654 200929 -279888
10617b30748c5227k2812j73038l38031I3628a98064E9667b5848Q845C25022j47927
$$ -230748 -35227 -58039 -231077 -569108 93628 -198064 59667 -25848 -17003 325022 177095
10606A77095a27641G6474b23190B72319b24016K643A52451a75748P3176A14778
$$ 177095 -127641 76474 -223190 272319 -224016 -221373 152451 -175748 -102572 114778
10595a95672a6487G8860A3291d35683h6519C2119a53948j35139f8783k57221i7477
$$ -195672 -16487 78860 13291 -435683 -86519 32119 -153948 -289087 -68783 -326004 -97477
10583C08610b74149A15305a66407f6628K0992j70409D9245a1703C6380a44935
$$ 308610 -274149 115305 -166407 -66628 -45636 -216045 49245 -11703 36380 -144935
10572b81531i8163q7978B77295a53795Q818A41266b39470g5945j99370c7314p8476
$$ -281531 -98163 -186141 277295 -153795 -144977 141266 -239470 -75945 -275315 -37314 -115790
10561a15790e6299b6950A00412J32552b42905B14039a07107A05902a475A57481
$$ -115790 -56299 -26950 100412 232964 -242905 214039 -107107 105902 -1475 157481
10550A05650L10189g222j5874A66844M5938c1387f753k44876h8035j07494N1407
$$ 105650 415839 -7222 -23096 166844 212782 -31387 -6753 -251629 -88035 -195529 -144122
10539a44122B8547c3471o6526l31669F6247K2664L0586d2573I0710a7939j68267
$$ -144122 28547 -33471 -99997 -431666 66247 88911 119497 -42573 90710 -17939 -186206
10528a86206f2080j67522A15934l6271b62435K358F181a86662e0493k137l6387
$$ -186206 -62080 -229602 115934 79663 -262435 -260077 6181 -186662 -50493 -52630 -89017
10517h9017L3730a1969j96987A91148K8718g6283j80972g7290m1194f057k86186
$$ -89017 -55287 -11969 -208956 191148 219866 -76283 -257255 -77290 -118484 -6057 -292243
10506b92243I4492C8473a63700h1628n6256I0113M8547b01674k47732B62882b55212
$$ -292243 94492 38473 -163700 -81628 -137884 90113 138660 -201674 -449406 262882 -255212
10494f6087k89699i9743n4892I7014g8048b7610n0244j46578a10539A91018l284
$$ -66087 -355786 -99743 -154635 97014 -78048 -27610 -77854 -224432 -110539 191018 187734
10483A87734a79257H0042a84427k6511A27169o1105K32871f3584M129q3994l863
$$ 187734 -179257 80042 -184427 -210938 127169 66064 298935 -63584 -59455 -143449 -147312
10472a47312b284k20063A84534c22917A38675l6974b48647h1612m2066d8124A77138
$$ -147312 -2284 -222347 184534 -322917 138675 101701 -248647 -81612 -123678 -48124 177138
10460A55711L3311J64345A72760d1585A06125O3754M6275a17666E5193A290d11823
$$ 155711 189022 353367 172760 -41585 106125 169879 216154 -117666 55193 1290 -411823
10448B64524b1474q7652i908B43285r7685M7202J6138a52147H0756a46085p7723
$$ 264524 -21474 -109126 -9908 243285 145600 192802 208940 -152147 80756 -146085 -223808
10437b23808J05057J4315b557r5212k43054h6821r5079M5703B4425a3078p0126
$$ -223808 -118751 -104436 -2557 -97769 -340823 -86821 -181900 -136197 24425 -13078 -83204
10426h3204j67409B163J60214K36858g6338j97094b0091A54614d08920H7117c24787
$$ -83204 -250613 2163 162377 399235 -76338 -273432 -20091 154614 -408920 87117 -324787
10414a15170B48441b14307c1758A56594h2346j39106l4166a17387m7253E5003
$$ -115170 248441 -214307 -31758 156594 -82346 -221452 -255618 -117387 -164640 55003
10403f5683q2523m6897F0776J78015b5282j46753B75347B6075J61582N0159a77291
$$ -65683 -148206 -195103 60776 238791 -25282 -172035 275347 26075 187657 237816 -177291
10391g7047k00604g0125j45174A30072b50649Q3369j05158a6515j49853e9275
$$ -77047 -277651 -70125 -215299 130072 -250649 -167280 -272438 -16515 -166368 -59275
10380a0153B2512b27675I0758A1205K94127J2207a68673A01265a67891A74199
$$ -10153 22512 -227675 90758 11205 305332 317539 -168673 101265 -167891 174199
10369H7164J55936b3848j7230B0716L3735D582e9956B31980q1143a06401E8011
$$ 87164 243100 -23848 -41078 20716 54451 4582 -59956 231980 150837 -106401 58011
10357D00301j23611M3585F4173J2765c2404E60136j93128B1898K13676K80777
$$ 400301 276690 320275 64173 76938 -32404 560136 367008 21898 235574 516351
10347E16351n4258j01960o4493M1904A16452R0330A4028K80662D744K77621q2868
$$ 516351 462093 360133 295640 337544 116452 206782 14028 294690 4744 282365 199497
10336A99497a0458G8253J54867K40667j38088r228p7049H3326J46663k0893n7538
$$ 199497 -10458 78253 233120 473787 335699 326471 249422 83326 229989 209096 151558
10325A51558m3261Q7967J10377J78640j9812A29820f6831A79174b41458B39624
$$ 151558 108297 196264 306641 485281 465469 129820 -66831 179174 -241458 239624
10314a07494A72763q0973c5741l8196A80599p7842O1196a6038p3465C47800E5931
$$ -107494 172763 91790 -35741 -73937 180599 102757 163953 -16038 -89503 347800 55931
10302b8126A47955j1198J99368a04906C6075J94000i4018C60721A05547c6656
$$ -28126 147955 136757 336125 -104906 36075 230075 -94018 360721 105547 -36656
10291b3249G1911g5947b116p648c680A84387b7218q7985I3633C041J74096a43578
$$ -23249 71911 -75947 -2116 -9764 -3680 184387 -27218 -115203 93633 3041 177137 -143578
10278a25713H6254d6094k0467n9913L2628B27234a09948I2572b17251B04398a59379
$$ -125713 86254 -46094 -66561 -126474 -93846 227234 -109948 92572 -217251 204398 -159379
10266e3944r8342N6470K374m8125j0329A99749d31166a32019A64756c8914L661
$$ -53944 -152286 -95816 -93442 -141567 -151896 199749 -431166 -132019 164756 -38914 -35253
10255c5253k40197F3538c82481A61652l6707k1115c03831A06305M9644d8177E5115
$$ -35253 -275450 63538 -382481 161652 124945 103830 -303831 106305 155949 -48177 55115
10243a3423C3599L1318g3639c611j0396D77989l7195L5718j29255G0459J85499
$$ -13423 33599 64917 -73639 -3611 -14007 477989 440794 476512 347257 70459 255958
10232B55958A04104L8463f780n0485l3879a5719j18176c9809B08716b41238Q5172
$$ 255958 104104 142567 -6780 -57265 -91144 -15719 -133895 -39809 208716 -241238 -156066
10221a56066J6457O6499A29496o2390c2454r5164d2093k621A42348a7755j37814
$$ -156066 -139609 -73110 129496 67106 -32454 -127618 -42093 -44714 142348 -17755 -155569
10210a55569F6897b42955C1758a4740l53012A42132d64288a99343g020k7463j03737
$$ -155569 66897 -242955 31758 -14740 -367752 142132 -464288 -199343 -7020 -34483 -138220
10199a38220j50375A97756H171L91000A17690b72678e345k63254B39399a15666
$$ -138220 -288595 197756 8171 399171 117690 -272678 -5345 -268599 239399 -115666
10188H010b56998a01189l85517b26974F4121L8127a20843D8824B15a70718P6882
$$ 8010 -256998 -101189 -486706 -226974 64121 102248 -120843 48824 215 -170718 -93836
10177i3836d0860q0487A55666d7863H4888b27143i7241q5447o7913C1981J1026
$$ -93836 -40860 -121347 155666 -47863 84888 -227143 -97241 -182688 -250601 31981 43007
10166D3007K9731a67457F8207J24354G8136a81539I5227l2055J843a73085B19338
$$ 43007 72738 -167457 68207 192561 78136 -181539 95227 63172 65015 -173085 219338
10154a94512a0853j58541m6400J3223n9727D191a83020B35073p2389f2452l220
$$ -194512 -10853 -169394 -215794 -202571 -262298 4191 -183020 235073 162684 -62452 -65672
10143f5672j2732A80393D9570J13416A4931J50213L8660a9694k20720R6677B16189
$$ -65672 -78404 180393 49570 162986 14931 165144 203804 -19694 -240414 -143737 216189
10131a20371e1105q2312c3256j17173A47001f308j85846k1530B5061b29634D4079
$$ -120371 -51105 -133417 -33256 -150429 147001 -6308 -192154 -213684 25061 -229634 44079
10119A64194b9665B2088b73822D9567R425b02310F6115M0151a40387B06482f7350
$$ 164194 -29665 22088 -273822 49567 58992 -202310 66115 106266 -140387 206482 -67350
10107F1630b6262n670j00832a8918j22748A16255H049c5095H2247N221e5323l03058
$$ 61630 -26262 -31932 -132764 -18918 -141666 116255 8049 -35095 82247 87468 -55323 -358381
10095c58381C8723a0964k0799D8945B1902f3073j01313e531o4725m1492j99553
$$ -358381 38723 -10964 -31763 48945 21902 -63073 -164386 -5531 -70256 -111748 -311301
10084c11301B07472M6226C3822i1700l12983B4944J31362b76070G7124d40575
$$ -311301 207472 253698 33822 -91700 -404683 24944 156306 -276070 77124 -440575
10073d26672F3442c29059h1856F1613b55119f3883L0454j32140a333k18806j54566
$$ -426672 63442 -329059 -81856 61613 -255119 -63883 -33429 -165569 -1333 -220139 -374705
10062c74705h7180l81254a368D7879J08113b56779c3352A19794a28575E4144N5192
$$ -374705 -87180 -468434 -1368 47879 155992 -256779 -33352 119794 -128575 54144 109336
10051A09336g797m59520C245b6363C63333b35570h6900b8380A93027e4683j49976
$$ 109336 -7797 -467317 3245 -26363 363333 -235570 -86900 -28380 193027 -54683 -204659
10040b04659l4906d2662q4742A62280a83680P4032I1936b10167B66251C465d14238
$$ -204659 -239565 -42662 -127404 162280 -183680 -109648 91936 -210167 266251 3465 -414238
10028F2592h1016n352A34221j9504g4804j76927M2700A5567a43088i04j25253
$$ 62592 -81016 -86368 134221 114717 -74804 -251731 -209031 15567 -143088 -904 -126157
10017a26157A49549c0147A35871K9396d46744F6781d7939J5190j03485A1766K93624
$$ -126157 149549 -30147 135871 165267 -446744 66781 -47939 -32749 -136234 11766 305390
10006C05390b98376P5412D8324a11088D4307K57837q6378a75433n3690m3876l1314
$$ 305390 -298376 -222964 48324 -111088 44307 302144 215766 -175433 -229123 -272999 -304313
9995c04313m17a29257e8245F5382a02295a4849k08349A64936J515m8945a94581
$$ -304313 -304730 -129257 -58245 65382 -102295 -14849 -223198 164936 166451 117506 -194581
9983E532a32914e51F552i6502b5221j59954C5601d366j67929j24488h4752B3796
$$ 5532 -132914 -551 6552 -96502 -25221 -185175 35601 -4366 -172295 -296783 -84752 23796
9970b66325E8073b44690h5296I1725c66316d1411J4796m525j78261Q8981q474
$$ -266325 58073 -244690 -85296 91725 -366316 -41411 -26615 -31140 -209401 -120420 -128894
9959a28894r5097O3629C3546h5549F0145h0893C7658h8791j8130g758q2337L057
$$ -128894 -223991 -160362 33546 -85549 60145 -80893 37658 -88791 -106921 -7758 -90095 -87038
9947h7038A44806b41186m4834M4405F3930b06861f0102a838H2148K134a4137k13981
$$ -87038 144806 -241186 -286020 -241615 63930 -206861 -60102 -1838 82148 84282 -14137 -228118
9935b28118B8319h6954n5516c8877j85550B43689f9520K9648l34310F0293a2890
$$ -228118 28319 -86954 -142470 -38877 -224427 243689 -69520 -39872 -374182 60293 -12890
9923D157g6536B21014h3397b1290L794I7412a7610o8887A6683i216I1431e4443
$$ 4157 -76536 221014 -83397 -21290 -17496 97412 -17610 -86497 16683 -9216 91431 -54443
9910D9071A7266c73567G8139d40452B6400a33918j2328B3986c2699n0888A51155
$$ 49071 17266 -373567 78139 -440452 26400 -133918 -146246 23986 -32699 -83587 151155
9898b41555C4477b91469J39072j54944Q1438J06821M669D103a05213J8269l214
$$ -241555 34477 -291469 -152397 -307341 -225903 -119082 -114413 4103 -105213 -86944 -90158
9887i0158C00910h8291J7669G3202a68388j51972A23454a33417A8074a58884d8148
$$ -90158 300910 -88291 -70622 73202 -168388 -320360 123454 -133417 18074 -158884 -48148
9875c11433J15056e7651B08289m9405a15655L6172a7338A08998L338h1270D53977
$$ -311433 -196377 -57651 208289 158884 -115655 -79483 -17338 108998 112336 -81270 453977
9863B8281b95169a17037A27046r676f5492j83229g1589j39801i1068K9865A24843
$$ 28281 -295169 -117037 127046 117370 -65492 -248721 -71589 -211390 -91068 -61203 124843
9851E9174K07249a33557M0154I3689f6231k412A27770M7570a91290B47530a87411
$$ 59174 266423 -133557 -93403 93689 -66231 -68643 127770 175340 -191290 247530 -187411
9839I6596a61478j78127A36310F7383h3817m07333J46509J52355j29120A02738
$$ 96596 -161478 -339605 136310 67383 -83817 -491150 -344641 -192286 -321406 102738
9828f9385A77282L9560c31477a65541E0192b75966b3897R683H9617b88548d1260
$$ -69385 177282 216842 -331477 -165541 50192 -275966 -23897 -14214 89617 -288548 -41260
9816b02856p3363r1250i9967F2100d79729d8492B70305i9493j6304k27140c2570
$$ -202856 -276219 -367469 -99967 62100 -479729 -48492 270305 -99493 -115797 -342937 -32570
9804b5290m13279a47037l4713b7443D15337b18685A05943J09001f0814r5924O0515
$$ -25290 -438569 -147037 -181750 -27443 415337 -218685 105943 214944 -60814 -156738 -96223
9793i6223C3422R3123E0446K9916b3863n8891l30324I2765b2473G257a34630A63844
$$ -96223 33422 126545 50446 80362 -23863 -82754 -413078 92765 -22473 7257 -134630 163844
9780D4177R9963b97416C9842b2316F916L8265A345a90153L2110G3441a53974K6176
$$ 44177 144140 -297416 39842 -22316 6916 45181 1345 -190153 -158043 73441 -153974 -127798
9768a27798j4929b8680E0595b24031j91396D02757E8172b07354B2562M2936j0728
$$ -127798 -142727 -28680 50595 -224031 -415427 402757 58172 -207354 22562 65498 54770
9757E4770f5947j99140B43393h8519D7181b58253F25a44727j20947c0714k06689
$$ 54770 -65947 -265087 243393 -88519 47181 -258253 625 -144727 -265674 -30714 -237403
9746b37403Q8153B8417M5330N034e9888j47789k29803b12070B3332c96562a08922
$$ -237403 -149250 28417 73747 78781 -59888 -207677 -437480 -212070 23332 -396562 -108922
9734a36553o8358o666C17991B4929a411k5283n1082G5211m654c90790b9380p5796
$$ -136553 -204911 -211577 317991 24929 -1411 -26694 -77776 75211 70557 -390790 -29380 -105176
9722a05176K1408A31572a07943N3227o9916k350j28635c5520j089j38829o1235
$$ -105176 -83768 131572 -107943 -54716 -124632 -126982 -255617 -35520 -36609 -175438 -236673
9711b36673g3223A58849K8386l0060i9901B45569A12066l5632h4375p5091A70580
$$ -236673 -73223 158849 187235 157175 -99901 245569 112066 76434 -84375 -159466 170580
9699c06980o5170A61880Q8707c00611H5850e4144k3272p2647i909H891a32245
$$ -306980 -372150 161880 250587 -300611 85850 -54144 -77416 -150063 -9909 8891 -132245
9687a9360f405B06407c0543m3562L1824H4833c32323f9939E22697a43074j869
$$ -19360 -6405 206407 -30543 -74105 -42281 84833 -332323 -69939 522697 -143074 -144943
9676a44943A21863d59919B98810b9138o581A38775a82101A57090a36297N1209
$$ -144943 121863 -459919 298810 -29138 -35719 138775 -182101 157090 -136297 -85088
9666h5088j51128A25458B5783a11166C0657f4727A22683a33004j25024c3179l04177
$$ -85088 -236216 125458 25783 -111166 30657 -64727 122683 -133004 -258028 -33179 -337356
9655c37356A2716J44896f0979A83014a31383f5633k73346F2008c43286J64930
$$ -337356 12716 157612 -60979 183014 -131383 -65633 -338979 62008 -343286 -178356
9645a78356b0126D9815a4258j11687J6806j90641A12500k9644a27612C7270L5039
$$ -178356 -20126 49815 -14258 -125945 -109139 -299780 112500 82856 -127612 37270 72309
9634G2309a21634A25623a0008C5919c71715p8084h144C2886h3897m1061c1979
$$ 72309 -121634 125623 -10008 35919 -371715 -449799 -8144 32886 -83897 -124958 -31979
9622a73711B7453d15669g0943j82262H9958a56952r4521R8632j98603a03287D51559
$$ -173711 27453 -415669 -70943 -253205 89958 -156952 -251473 -152841 -351444 -103287 451559
9610H413a03116d7657j87993j84656A8276K70046c42505b6641j95157r693F0242
$$ 8413 -103116 -47657 -235650 -420306 18276 288322 -342505 -26641 -221798 -231491 60242
9598b6326k14423P5835A32594h6502B84992F3201b96962j34317E9273a01131j91943
$$ -26326 -240749 -164914 132594 -86502 284992 63201 -296962 -431279 59273 -101131 -293074
9587b93074B27646b50862G3399c56062a35050e5791A49324a46909D9960B2144
$$ -293074 227646 -250862 73399 -356062 -135050 -55791 149324 -146909 49960 22144
9576f9681j19369j9517g8367C9288g7392j44484j27819A18616E8208j3417a82532
$$ -69681 -189050 -208567 -78367 39288 -77392 -221876 -349695 118616 58208 44791 -182532
9564E3776k2806b39151A51857c02067J30873B15516c05565C0407d94024a93361
$$ 53776 30970 -239151 151857 -302067 -171194 215516 -305565 30407 -494024 -193361
9553H3505b65325N6813A74169b45869a04606k64498h4645m1915d7277A83503L4001
$$ 83505 -265325 -208512 174169 -245869 -104606 -369104 -84645 -126560 -47277 183503 217504
9542B17504R4950a3896N858k37970A84654a9792r0845M7043F1755f8865B46275
$$ 217504 312454 -13896 -8038 -246008 184654 -19792 -110637 -63594 61755 -68865 246275
9530a8060C17689c14080H4590I596b05680k27118C7207a6038C5031a7051n159
$$ -18060 317689 -314080 84590 9596 -205680 -432798 37207 -16038 35031 -17051 -22210
9519b2210m394j82738a6247j13867q0458A49883C3671h9164H6154N0805G279K19298
$$ -22210 -26604 -209342 -16247 -130114 -210572 149883 33671 -89164 86154 136959 7279 226577
9507B26577q1193b4877I9433c72968R6269d3775A82931C77f7772D3632M8570a33785
$$ 226577 145384 -24877 99433 -372968 -276699 -43775 182931 377 -67772 43632 92202 -133785
9494A36188c5092k85609p1279J91434K3091r3999a24863j28720j9914R9091g5930
$$ 136188 -35092 -320701 -391980 -200546 -177455 -271454 -124863 -253583 -273497 -174406 -75930
9482b20279j05504A1197L15827c30852a33616M9371j07002A32281a35771B0641
$$ -220279 -325783 11197 327024 -330852 -133616 -84245 -191247 132281 -135771 20641
9471H3437C669Q4753b00072e7244A45742a3341N7B37580a41100N2633q5940H3781
$$ 83437 3669 88422 -200072 -57244 145742 -13341 -13284 237580 -141100 -88467 -174407 83781
9458c02920a37652q591p2197L1752j5715G0004a35518C4199a06907G2994d24841
$$ -302920 -137652 -146243 -218440 -186688 -202403 70004 -135518 34199 -106907 72994 -424841
9446c19044B54302g3536k50789H8046c7154j57307C88704b09082j3110C48190
$$ -319044 254302 -73536 -324325 88046 -37154 -194461 388704 -209082 -222192 348190
9435b50671B64663D8702K31786J5211b75462A23940f7952K2154E9901J78044A14665
$$ -250671 264663 48702 280488 295699 -275462 123940 -67952 -45798 59901 237945 114665
9423b04779B9929g7262r6684j84045J47477A79779L7383a65911Q1572p8470B15192
$$ -204779 29929 -77262 -173946 -357991 -210514 179779 217162 -165911 -84339 -162809 215192
9411b03183C2200b2000A040J47535P8471b54888d9721k1498A52297e5534j8856
$$ -203183 32200 -22000 1040 148575 227046 -254888 -49721 -71219 152297 -55534 -74390
9400g4390A10952b44748I4533b26364N4152k2044i4328I5246b78115E3757b98004
$$ -74390 110952 -244748 94533 -226364 -172212 -194256 -94328 95246 -278115 53757 -298004
9388A12191d8388k03052e9433A4122K7290b82682o5354F904J77548E5529a75549
$$ 112191 -48388 -251440 -59433 14122 41412 -282682 -348036 6904 184452 55529 -175549
9376A08900g7367k65881A04809b65738I2059b00065j43653E6293N3868b367A35809
$$ 108900 -77367 -343248 104809 -265738 92059 -200065 -343718 56293 110161 -2367 135809
9364A67635a81163a571B1149f4965r3369j15295i4720H9923R4224a91783C6446
$$ 167635 -181163 -1571 21149 -64965 -158334 -273629 -94720 89923 184147 -191783 36446
9352A83463o7992b05816c947F5873A9903J91551i2378G288a1712k71854i4359
$$ 183463 115471 -205816 -3947 65873 19903 211454 -92378 7288 -11712 -283566 -94359
9340e1096j71229A64453h0971j19800k70950a04756H9963f4344A6599a03473B81820
$$ -51096 -222325 164453 -80971 -200771 -471721 -104756 89963 -64344 16599 -103473 281820
9328c08311E8814O9835R0829G9040N0738B9483P7053a20657o2808D7570P5185
$$ -308311 58814 128649 219478 79040 129778 29483 106536 -120657 -183465 47570 122755
9317A22755D9099J60568a70635A99c52139Q4753A9366f8561m1831D2695A3540
$$ 122755 49099 209667 -170635 199 -352139 -267386 19366 -68561 -110392 42695 13540
9305F7441h3767l2181p4782N9961N3906m0025L4691B1668b63007N4900a6745m1537
$$ 67441 -83767 -115948 -190730 -130769 -76863 -116888 -82197 21668 -263007 -208107 -16745 -58282
9293e8282G1569b04818d3276j13735M910B056e0136A5670l128a79865g9352j32294
$$ -58282 71569 -204818 -43276 -157011 -152101 2056 -50136 15670 12542 -179865 -79352 -211646
9281b11646B77222e1786C7673K270A0499R273a61125D1356b46854n3002L5459
$$ -211646 277222 -51786 37673 39943 10499 19772 -161125 41356 -246854 -299856 -264397
9270b64397N6886R2061M3439k86809b2237A64694i2589A48102F1633i6378j7777
$$ -264397 -207511 -115450 -72011 -358820 -22237 164694 -92589 148102 61633 -96378 -114155
9259a14155C74492a42069L8113k7620r4298D6688b36319C59568H0887a46782e5618
$$ -114155 374492 -142069 -103956 -131576 -225874 46688 -236319 359568 80887 -146782 -55618
9247g2873m9703m9423C2875f6357C8438Q8220k8443b68678M9339C3008J68742
$$ -72873 -122576 -171999 32875 -66357 38438 126658 98215 -268678 -219339 33008 201750
9236B01750J1293b28145G3946a39590m8741Q2215q7784A56268B0031b41245k80689
$$ 201750 213043 -228145 73946 -139590 -188331 -106116 -193900 156268 20031 -241245 -521934
9225e21934h3867A31339c08415a50816A45349c30787A42895c0100F3782h4673
$$ -521934 -83867 131339 -308415 -150816 145349 -330787 142895 -30100 63782 -84673
9214c05709J05075I5518b18453N9581d9597j64346I9258M7881j8016C1610a24624
$$ -305709 -200634 95518 -218453 -158872 -49597 -213943 99258 147139 129123 31610 -124624
9202A54332a48382B2265a61843f7254K2139j20458B8715i3817l14727F9605J47001
$$ 154332 -148382 22265 -161843 -67254 -45115 -165573 28715 -93817 -408544 69605 216606
9191B16606c59741A00865b35404L4927j76309D6493Q124d9076k8571B97946C7700
$$ 216606 -359741 100865 -235404 -200477 -376786 46493 54617 -49076 -77647 297946 37700
9179b68978a10171A04875K68090d2389o025C892h6438o7494B09174Q7565f1313
$$ -268978 -110171 104875 372965 -42389 -48414 3892 -86438 -153932 209174 296739 -61313
9167E0712a27526C06739b7301j61772B26605d40543a38737k74554A43419l5217
$$ 50712 -127526 306739 -27301 -189073 226605 -440543 -138737 -413291 143419 108202
9157A08202h5601E335a05213A03476J54697A23977r102a90333M8724f5682j14038
$$ 108202 -85601 5335 -105213 103476 258173 123977 114875 -190333 -141609 -65682 -179720
9146a79720j87595a07442D3089b42449l3480l14302B05326c12930a35236j46253
$$ -179720 -367315 -107442 43089 -242449 -275929 -590231 205326 -312930 -135236 -281489
9136b81489i9655A92947C6123c56392e077I1331b7645A95882a2322F2802K0713
$$ -281489 -99655 192947 36123 -356392 -5077 91331 -27645 195882 -12322 62802 83515
9125H3515N2760g3010G1985a45807K9367k05274I5801l8491B0857b41255g7022
$$ 83515 136275 -73010 71985 -145807 -116440 -321714 95801 57310 20857 -241255 -77022
9113a64831C9217a49283C66173j39369G4027b7907j16662j45979J06808j36829
$$ -164831 39217 -149283 366173 226804 74027 -27907 -144569 -290548 -183740 -320569
9103c20569c8582A45752k0050a49003O9860A844d06856b1163l63119B356a38743
$$ -320569 -38582 145752 125702 -149003 -79143 1844 -406856 -21163 -384282 2356 -138743
9091a49280f1036j46931d2780l2745A45156a3899I5822D6941b12478j4564E9615
$$ -149280 -61036 -207967 -42780 -75525 145156 -13899 95822 46941 -212478 -227042 59615
9079f7729A84434i5126b3033A16522b17233d7060A58587b5591F9321a60313E1554
$$ -67729 184434 -95126 -23033 116522 -217233 -47060 158587 -25591 69321 -160313 51554
9067C78b04618j29263f90j87597j64735a04128H8128i8131A13611c37480g1532
$$ 378 -204618 -333881 -690 -188287 -353022 -104128 88128 -98131 113611 -337480 -71532
9055a38891d8954n38292e6462i319l3735J0726j09227a5410D9830K8375B8767
$$ -138891 -48954 -587246 -56462 -9319 -43054 -32328 -141555 -15410 49830 78205 28767
9043A76252k9843b27722J08926H6488b5758j7528C1557K0754b85269o6192o8892
$$ 176252 146409 -227722 -118796 86488 -25758 -43286 31557 52311 -285269 -351461 -420353
9032d20353a68211c2043A39699c4145b925o3797A58888h9839F0787c2695n566
$$ -420353 -168211 -32043 139699 -34145 -2925 -66722 158888 -89839 60787 -32695 -38261
9021c8261A02788k3684a46077A60461c5986n3459k03018f1563j58485C200O0257
$$ -38261 102788 79104 -146077 160461 -35986 -89445 -292463 -61563 -220048 3200 63457
9010F3457J26196o3351c44845J0366e7995a7726A03775b4063k5437C19141D6211
$$ 63457 189653 126302 -344845 -334479 -57995 -17726 103775 -24063 -49500 319141 46211
8998a27204M4462j7172A31254a2053j14989C891d05629f1498B26356g3592D678
$$ -127204 -82742 -99914 131254 -12053 -127042 3891 -405629 -61498 226356 -73592 4678
8986c04783A24048a00800A7756a80545g2994k02973F0626b24425J10909q5919
$$ -304783 124048 -100800 17756 -180545 -72994 -275967 60626 -224425 -113516 -199435
8976a99435c3903B08714d5002k18718a31822A80404Q6992b32596A93256b78129
$$ -199435 -33903 208714 -45002 -263720 -131822 180404 267396 -232596 193256 -278129
8965B02193b36699M2554J7417B630a63282j37784B221a4543H5647H986g7937A5664
$$ 202193 -236699 -194145 -176728 2630 -163282 -301066 2221 -14543 85647 8986 -77937 15664
8952a43682k90276G0732c04164B38790b61672A69982i395A18755m2697b54384
$$ -143682 -433958 70732 -304164 238790 -261672 169982 -9395 118755 76058 -254384
8941H9607J75200b12078A93201c21218I2916c18128B2090b0198O975A55773C3434
$$ 89607 264807 -212078 193201 -321218 92916 -318128 22090 -20198 -13223 155773 33434
8929A99457G521J39178I681J05198Q6814a99536e550E9727b82874r6588B65782
$$ 199457 7521 146699 9681 114879 201693 -199536 -5550 59727 -282874 -379462 265782
8917H9165M8818m0996M2921N4048N9553L7503A03204K9031M7542p6804P14845
$$ 89165 137983 96987 139908 193956 253509 291012 103204 132235 179777 102973 817818
8906H17818K13451L11401Q86007K050920J362896k806680A327834F20621p9647
$$ 817818 1031269 1342670 2228677 4279597 5642493 2835813 1327834 620621 540974
8897E40974j59339j69646r7594L29053D5621a22890M2177B39331J54403A73827
$$ 540974 381635 211989 114395 443448 45621 -122890 -80713 239331 393734 173827
8886A05319N1208J1150b4737A07127h5159c1769n3095k04601e2913A58425h7824
$$ 105319 156527 167677 -24737 107127 -85159 -31769 -84864 -289465 -52913 158425 -87824
8874b11640B37505b54173J8575j0921D9545b0558B18269m0412b72641R7851e8333
$$ -211640 237505 -254173 -235598 -246519 49545 -20558 218269 177857 -272641 -174790 -58333
8862b89496a02664A07527c51389d5369A22025a57167A27886b79158M1359c9575
$$ -289496 -102664 107527 -351389 -45369 122025 -157167 127886 -279158 -237799 -39575
8851e9290P504k58882a32129k55042a8613F4344j1415c6418A03892A0736a48567
$$ -59290 -51786 -310668 -132129 -387171 -18613 64344 52929 -36418 103892 10736 -148567
$$ [...]
##END NTUPLES=NMR SPECTRUM
##END=
