
##TITLE=AC1129_Armenia-Quindio-El_5906567_m79TL81VAd
##JCAMPDX= 6.0         $$ Bruker NMR JCAMP-DX V2.0
##DATA TYPE= NMR SPECTRUM
##DATA CLASS= NTUPLES
##ORIGIN= BRUKER
##OWNER= Administrator
$$ 1.72 TOPSPIN		Version 2.1
$$ 2012-04-10 10:14:31.328 -0500  Administrator@TOPSPIN
$$ Compression mode = diff/dup
##.OBSERVE FREQUENCY= 400.13188235
##.OBSERVE NUCLEUS= ^1H
##.ACQUISITION MODE= SIMULTANEOUS (DQD)
##.ACQUISITION SCHEME= undefined
##.AVERAGES= 64
##.DIGITISER RES= 22
##SPECTROMETER/DATA SYSTEM= spect
##.PULSE SEQUENCE= noesygpps1d.comp
##.SOLVENT NAME= COFFEE_meoh
##.SHIFT REFERENCE= INTERNAL, COFFEE_meoh, 1, 14.9688
##AUDIT TRAIL= $$ (NUMBER, WHEN, WHO, WHERE, PROCESS, VERSION, WHAT)
$$ ##TITLE= Audit trail, TOPSPIN		Version 2.1
$$ ##JCAMPDX= 5.01
$$ ##ORIGIN= Bruker BioSpin GmbH
$$ ##OWNER= Administrator
$$ $$ C:\Bruker\TOPSPIN/data/COFFEE/nmr/AC1129_Armenia-Quindio-El_5906567_m79TL81VAd/12/pdata/1/auditp.txt
$$ ##AUDIT TRAIL=  $$ (NUMBER, WHEN, WHO, WHERE, PROCESS, VERSION, WHAT)
(   1,<2012-04-04 19:16:01.796 -0500>,<Administrator>,<TOPSPIN>,<go>,<TOPSPIN 2.1>,
      <created by zg
	started at 2012-04-04 19:04:30.078 -0500,
	POWCHK enabled, PULCHK disabled,
       configuration hash MD5:
       1A 1E CE 29 27 FD 77 03 67 4E F0 E3 C4 B2 CB 90
       data hash MD5: 64K
       DD 22 9D B0 22 83 4D CF 9C D0 0E 23 B0 AD 58 D3>)
(   2,<2012-04-04 19:16:04.500 -0500>,<Administrator>,<TOPSPIN>,<proc1d>,<TOPSPIN 2.1>,
      <Start of raw data processing
       efp LB = 0.3 FT_mod = 6 PKNL = 1 PHC0 = 0 PHC1 = 0 SI = 128K 
       data hash MD5: 128K
       AC 9B 79 5D 4B 18 8C E2 FC 9C 26 B8 71 48 8E 36>)
(   3,<2012-04-04 19:16:05.828 -0500>,<Administrator>,<TOPSPIN>,<proc1d>,<TOPSPIN 2.1>,
      <pk PHC0 = 35.14526 PHC1 = 0 
       data hash MD5: 128K
       DA 61 B8 D5 BD 8B 27 C2 A4 E9 D1 7B 8B AF 7D FF>)
(   4,<2012-04-04 19:16:06.046 -0500>,<Administrator>,<TOPSPIN>,<proc1d>,<TOPSPIN 2.1>,
      <abs ABSG = 1 
       data hash MD5: 128K
       07 10 AF 2E D4 FB 5A 06 1F 9F C7 8B 99 9D 99 EF>)
(   5,<2012-04-04 19:16:06.125 -0500>,<Administrator>,<TOPSPIN>,<proc1d>,<TOPSPIN 2.1>,
      <abs ABSG = 2 
       data hash MD5: 128K
       26 57 76 C1 E6 A7 9B 13 57 43 FC 9E 35 61 FF 3F>)
(   6,<2012-04-04 19:16:06.171 -0500>,<Administrator>,<TOPSPIN>,<proc1d>,<TOPSPIN 2.1>,
      <abs ABSG = 3 
       data hash MD5: 128K
       82 64 E2 F6 CA E5 05 0F 13 93 FE 53 2C CC 93 1B>)
(   7,<2012-04-04 19:16:06.250 -0500>,<Administrator>,<TOPSPIN>,<proc1d>,<TOPSPIN 2.1>,
      <abs ABSG = 4 
       data hash MD5: 128K
       45 9F DA 92 21 5F 3B 38 AA CE F7 A0 8D 2C F7 7E>)
(   8,<2012-04-04 19:16:06.375 -0500>,<Administrator>,<TOPSPIN>,<proc1d>,<TOPSPIN 2.1>,
      <abs ABSG = 5 
       data hash MD5: 128K
       F5 60 35 9C 33 36 D4 06 7D 01 51 47 AB 14 3A 3B>)
(   9,<2012-04-04 19:16:06.718 -0500>,<Administrator>,<TOPSPIN>,<audit>,<TOPSPIN 2.1>,
      <user comment:
       ICON-NMR User ID: COFFEE
       data hash MD5: 128K
$$ [...]
##$TP07= 0
##$TPNAME0= <>
##$TPNAME1= <>
##$TPNAME2= <>
##$TPNAME3= <>
##$TPNAME4= <>
##$TPNAME5= <>
##$TPNAME6= <>
##$TPNAME7= <>
##$TPOAL= (0..7)
0.5 0.5 0.5 0.5 0.5 0.5 0.5 0.5
##$TPOFFS= (0..7)
0 0 0 0 0 0 0 0
##$TUNHIN= 0
##$TUNHOUT= 0
##$TUNXOUT= 0
##$USERA1= <user>
##$USERA2= <user>
##$USERA3= <user>
##$USERA4= <user>
##$USERA5= <user>
##$V9= 5
##$VALIST= <valist>
##$VCLIST= <CCCCCCCCCCCCCCC>
##$VD= 0
##$VDLIST= <DDDDDDDDDDDDDDD>
##$VPLIST= <PPPPPPPPPPPPPPP>
##$VTLIST= <TTTTTTTTTTTTTTT>
##$WBST= 2048
##$WBSW= 25
##$XGAIN= (0..3)
0 0 0 0
##$XL= 0
##$YL= 0
##$YMAX_a= 13889468
##$YMIN_a= -6036914
##$ZGOPTNS= <>
##$ZL1= 120
##$ZL2= 120
##$ZL3= 120
##$ZL4= 120
##$ABSF1= 14.9688
##$ABSF2= -5.583731
##$ABSG= 5
##$ABSL= 3
##$ALPHA= 0
##$AQORDER= 0
##$ASSFAC= 0
##$ASSFACI= 0
##$ASSFACX= 0
##$ASSWID= 0
##$AUNMP= <proc_prof1d_extract.lims>
##$AXLEFT= 0
##$AXNAME= <>
##$AXNUC= <1H>
##$AXRIGHT= 0
##$AXTYPE= 0
##$AXUNIT= <>
##$AZFE= 0.1
##$AZFW= 0.1
##$BCFW= 0
##$BC_mod= 0
##$BYTORDP= 0
##$COROFFS= 0
##$CY= 15
##$DATMOD= 1
##$DC= 0
##$DFILT= <>
##$DTYPP= 0
##$F1P= 0
##$F2P= 0
##$FCOR= 0.5
##$FTSIZE= 131072
##$FT_mod= 6
##$GAMMA= 0
##$GB= 0
##$INTBC= 1
##$INTSCL= 1
##$ISEN= 128
##$LB= 0.3
##$LEV0= 0
##$LPBIN= 0
##$MAXI= 10000
##$MC2= 0
##$MEAN= 0
##$ME_mod= 0
##$MI= 0
##$NCOEF= 0
##$NC_proc= -3
##$NLEV= 6
##$NOISF1= 0
##$NOISF2= 0
##$NSP= 0
##$NTH_PI= 0
##$NZP= 0
##$OFFSET= 14.9688
##$PC= 1
##$PHC0= 35.14526
##$PHC1= 0
##$PH_mod= 1
##$PKNL= yes
##$PPARMOD= 0
##$PPDIAG= 0
##$PPIPTYP= 0
##$PPMPNUM= 2147483647
##$PPRESOL= 1
##$PSCAL= 4
##$PSIGN= 0
##$PYNMP= <proc.py>
##$REVERSE= no
##$SF= 400.130004725357
##$SI= 131072
##$SIGF1= 0
##$SIGF2= 0
##$SINO= 400
##$SIOLD= 131072
##$SPECTYP= <>
##$SREGLST= <1H.CDCl3>
##$SSB= 0
##$STSI= 131072
##$STSR= 0
##$SW_p= 8223.68421052632
##$SYMM= 0
##$S_DEV= 0
##$TDeff= 65536
##$TDoff= 0
##$TI= <>
##$TILT= no
##$TM1= 0
##$TM2= 0
##$TOPLEV= 0
##$USERP1= <user>
##$USERP2= <user>
##$USERP3= <user>
##$USERP4= <user>
##$USERP5= <user>
##$WDW= 1
##$XDIM= 131072
##$YMAX_p= 473900297
##$YMIN_p= -414964510
##$CURPLOT= <Network HP LaserJet P1505>
##$CURPRIN= <$Network HP LaserJet P1505>
##$DFORMAT= <normdp>
##$LAYOUT= <+/1D_H.xwp>
##$LFORMAT= <normlp>
##$PFORMAT= <normpl>
##$SURQMSG= 1
$$ End of Bruker specific parameters
$$ ---------------------------------
##NTUPLES= NMR SPECTRUM
##VAR_NAME=  FREQUENCY,     SPECTRUM/REAL,   SPECTRUM/IMAG
##SYMBOL=    X,             R,               I
##VAR_TYPE=  INDEPENDENT,   DEPENDENT,       DEPENDENT
##VAR_FORM=  AFFN,          ASDF,            ASDF
##VAR_DIM=   131072,        131072,          131072
##UNITS=     HZ,            ARBITRARY UNITS, ARBITRARY UNITS
##FACTOR=    0.0627417313425165, 1,          1
##FIRST=     8223.62146879498, -352,         -98731
##LAST=      0,             2475,            -98611
##MIN=       0,             -414964510,      0
##MAX=       8223.62146879498, 473900297,    0
$$ Real data points
##PAGE= N=1
##DATA TABLE= (X++(R..R)), XYDATA
$$ [...]
60651A818782j1937j3596j4075j3496j3384j4671j6271j6376j4929j3882j4657
60640A661508j6080j5719j3019j0046q746q530p440m972k451q55K66J458K363
60627A577737K739L278M309M662L238J082L27J086J068j307m875p670r686j2330
60613A563658j5808j8558j9411j9075j8942j9225j8989j7681j5787j3992j2279
60602A373911j0252q052o465o028o333o360n485m093l226l607m835n601m936l187
60588A295451j515n39L2M87O19L79K19K58j03j001j367m40P42P68L17J451M425
60571A300183P152Q335R187J1050J3073J3871J4090J5389J7660J9352K0253K1883
60559A471478K4855K7709K9045K9417L0257L2043L4336L6731L8723L9218L7249
$$ plain form
60651 1818782 1806845 1793249 1779174 1765678 1752294 1737623 1721352 1704976 1690047 1676165 1661508
60640 1661508 1645428 1629709 1616690 1606644 1597898 1589368 1581928 1576956 1574505 1573650 1573916 1575374 1577737
60627 1577737 1580476 1583754 1588063 1592725 1595963 1597045 1597372 1598458 1599526 1598219 1593344 1585674 1575988 1563658
60613 1563658 1547850 1529292 1509881 1490806 1471864 1452639 1433650 1415969 1400182 1386190 1373911
60602 1373911 1363659 1355607 1349142 1343114 1336781 1330421 1324936 1320843 1317617 1314010 1309175 1303574 1298638 1295451
60588 1295451 1293936 1293397 1293429 1293916 1294535 1294914 1295133 1295391 1295288 1294287 1292920 1292480 1293222 1293990 1294307 1295758 1300183
60571 1300183 1307335 1315670 1324857 1335907 1348980 1362851 1376941 1392330 1409990 1429342 1449595 1471478
60559 1471478 1496333 1524042 1553087 1582504 1612761 1644804 1679140 1715871 1754594 1793812 1831061
60548A831061L3223K8826K5628K3864K2349J9488J4715R037L852p38n848j2066
60536A993391j8637k4525k9262l2349l2931l1061k8506k7121k6842k6216k4500
60525A691441k2030j8963j5083j1027q225p121o533n450m537m991o675q342r172
60512A563292r133q070n655k413J80J208J462K536M934P479Q700Q579Q665J0286
60498A592050J2805J4241J3775J3024J4126J6875J8816J8317J6631J6267J8075
60487A765002K0703K2563K3402K3892K4582K5661K7252K9456L2296L5856M0149
60476B070814M4525M7429M7378M4215L9105L3136K6295J8019Q353j889j1923k1263
60464B344194k9047l3869l4845l2437k7652k0747j1652j521P334J3646J8454K3463
$$ plain form
60548 1831061 1864284 1893110 1918738 1942602 1964951 1984439 1999154 2008191 2012043 2011305 2005457 1993391
60536 1993391 1974754 1950229 1920967 1888618 1855687 1824626 1796120 1768999 1742157 1715941 1691441
60525 1691441 1669411 1650448 1635365 1624338 1616113 1608992 1602459 1597009 1592472 1587481 1580806 1572464 1563292
60512 1563292 1554159 1546089 1540434 1538021 1538201 1539409 1540871 1543407 1548341 1555820 1564520 1573099 1581764 1592050
60498 1592050 1604855 1619096 1632871 1645895 1660021 1676896 1695712 1714029 1730660 1746927 1765002
60487 1765002 1785705 1808268 1831670 1855562 1880144 1905805 1933057 1962513 1994809 2030665 2070814
60476 2070814 2115339 2162768 2210146 2254361 2293466 2326602 2352897 2370916 2379269 2377380 2365457 2344194
60464 2344194 2315147 2281278 2246433 2213996 2186344 2165597 2153945 2152424 2159758 2173404 2191858 2215321
60452B215321K8870L3726L7825M1914M6150M9729N2494N5867O1467O9441P8863
60441B771667Q9287J01206J15168J31127J48593J66988J85820K04881K24192K43608
60431D382537K62617K80795K98338L15839L33683L51847L69865L86017L96164
60422G377702L93764L72001L26627K57462J67679O2393n1811j66431k71552l58247
60412H109587m21351m60296m77841m78218m65711m43672m14329l79797l43144
60403D225228l07725k75443k46402k20250j96950j76071j56642j38464j22663
60394B384618j10078r9798r0197q0729p1810o3646n6326n0565m6904m4401m1458
60383A628706l7968l5329l4133l3255l1620k9683k8399k7671k6686k5096k3115
$$ plain form
60452 2215321 2244191 2277917 2315742 2357656 2403806 2453535 2506029 2561896 2623363 2692804 2771667
60441 2771667 2860954 2962160 3077328 3208455 3357048 3524036 3709856 3914737 4138929 4382537
60431 4382537 4645154 4925949 5224287 5540126 5873809 6225656 6595521 6981538 7377702
60422 7377702 7771466 8143467 8470094 8727556 8895235 8957628 8905817 8739386 8467834 8109587
60412 8109587 7688236 7227940 6750099 6271881 5806170 5362498 4948169 4568372 4225228
60403 4225228 3917503 3642060 3395658 3175408 2978458 2802387 2645745 2507281 2384618
60394 2384618 2274540 2174742 2084545 2003816 1932006 1868360 1812034 1761469 1714565 1670164 1628706
60383 1628706 1590738 1555409 1521276 1488021 1456401 1426718 1398319 1370648 1343962 1318866 1295751
60372A295751k0860j8274j5499j2908j0899r861r828j0027r357p795o593o583
60360A157267o841n887l716j691n70L52J961M058N800O814P311P425P019O141
60346A185443N188M526M200M204M625N363N993O294O690P652Q780R127Q483P688
60332A274256P483P754Q198Q802R135Q030N160K301J794L870O474P616O756M179
60318A361808N02k809m021l119k208k957m489m788l524k216j865j750q09P62J940
60303A330457K350K676L642N110O480P574Q665R621R795R201R040J0242J1880
60290A426733J2158J0963J0112J0783J1933J2007J1232J0965J1391J1227R768
60279A549272Q008P140O809N774M192L981O180Q759Q571N571L528N478R807J2458
$$ plain form
60372 1295751 1274891 1256617 1241118 1228210 1217311 1207450 1197622 1187595 1178238 1170443 1163850 1157267
60360 1157267 1150426 1144539 1140823 1139132 1138562 1138914 1140875 1144933 1150733 1157547 1164858 1172283 1179302 1185443
60346 1185443 1190631 1195157 1199357 1203561 1208186 1213549 1219542 1225836 1232526 1240178 1248958 1258085 1266568 1274256
60332 1274256 1281739 1289493 1297691 1306493 1315628 1323658 1328818 1331119 1332913 1336783 1343257 1350873 1357629 1361808
60318 1361808 1362310 1359501 1355480 1352361 1350153 1347196 1342707 1337919 1334395 1332179 1330314 1328564 1327755 1328517 1330457
60303 1330457 1332807 1335483 1339125 1344235 1350715 1358289 1366954 1376575 1386370 1395571 1404611 1414853 1426733
60290 1426733 1438891 1449854 1459966 1470749 1482682 1494689 1505921 1516886 1528277 1539504 1549272
60279 1549272 1557280 1564420 1571229 1577003 1581195 1585176 1591356 1600115 1608686 1614257 1617785 1623263 1633070 1645528
60265A645528J2075J0978J1226J2078J1846J0292Q102N490K418q27m268q335j2412
60252A704191j4602j4097j2656j2397j3099j3141j2075j0616q814o213l493k095
60240A580893k177k430j958r05P46L357O355Q270Q524P993P451O793O149O395
60226A635456P780R197R631R444R500R869J0134J0204J0071R471Q649Q865J1138
60213A759409J4735J7743J9075J9390K0114K2017K4745K7342K9236L0826L3031
60202B017663L6233L9968M3638M7099N0558N4416N9284O5467P2168P8031Q2954
60191B647479Q8501R5840J03992J11217J17640J25109J34359J43672J51124J57138
60181C876071J63750J71764J79750J85812J89208J89902J87740J82980J76757
$$ plain form
60265 1645528 1657603 1668581 1679807 1691885 1703731 1714023 1722125 1727615 1730033 1729206 1724938 1716603 1704191
60252 1704191 1689589 1675492 1662836 1650439 1637340 1624199 1612124 1601508 1592694 1586481 1582988 1580893
60240 1580893 1578716 1576286 1574328 1573423 1574169 1577526 1583881 1592151 1600675 1608668 1616119 1622912 1629061 1635456
60226 1635456 1643236 1652433 1662064 1671508 1681008 1690877 1701011 1711215 1721286 1730757 1739406 1748271 1759409
60213 1759409 1774144 1791887 1810962 1830352 1850466 1872483 1897228 1924570 1953806 1984632 2017663
60202 2017663 2053896 2093864 2137502 2184601 2235159 2289575 2348859 2414326 2486494 2564525 2647479
60191 2647479 2735980 2831820 2935812 3047029 3164669 3289778 3424137 3567809 3718933 3876071
60181 3876071 4039821 4211585 4391335 4577147 4766355 4956257 5143997 5326977 5503734
60172E503734J69754J60746J47810J31004J12561R4207P5737N6747L8183K1094
60162F511577N188r867k2709l1515l6437l9057l9718l7091l0392k0445q386N173
60150F246321J9400L3247M6737O0989P6472R2370J08017J23561J38710J52249
60140G098073J63397J72151J77582J77618J71749J62350J51557J38252J20164
60131H532893R7960P4906N2688K9936N153k0823m5934o8789q8563j04304j15424
60120H349699j22199j24904j23003j15941j04353q9841p3638n5936l6375j5025
60110G488484P035K8059M6932O4054Q0526R6435J10476J21346J28614J32029J30746
60099H434736J24178J13118R9315Q3997O7529N0478L4318K0802J0939M777J978
$$ plain form
60172 5503734 5673488 5834234 5982044 6113048 6225609 6319816 6395553 6452300 6490483 6511577
60162 6511577 6516765 6506898 6484189 6452674 6416237 6377180 6337462 6300371 6269979 6249534 6241148 6246321
60150 6246321 6265721 6298968 6345705 6406694 6483166 6575536 6683553 6807114 6945824 7098073
60140 7098073 7261470 7433621 7611203 7788821 7960570 8122920 8274477 8412729 8532893
60131 8532893 8630853 8705759 8758447 8788383 8793536 8772713 8726779 8657990 8569427 8465123 8349699
60120 8349699 8227500 8102596 7979593 7863652 7759299 7669458 7595820 7539884 7503509 7488484
60110 7488484 7495519 7523578 7570510 7634564 7715090 7811525 7922001 8043347 8171961 8303990 8434736
60099 8434736 8558914 8672032 8771347 8855344 8922873 8973351 9007669 9028471 9039410 9044187 9046165
60088I046165K543P086J6328L0133M7332O6834Q8753J13753J41383J70037J98966
60077I929313K29388K62660K97943L32766L65757L97677M29573M61114M91206
60068A3197397N19213N44635N66179N81960N90359N90079N79909N59336N29211
60059A8258278M90991M45412L92417L32214K65684J93897J18011L9664l9279j17377
60049B0379912j93364k65267l30487l86830m32884m67503m89730m99372m97021
60040A6817454m83477m59814m27841l89613l46511k99744k51527k04376j58965
60031A3795586j14156o9740k7921Q757L9761O5784Q6562J00620J06514J03394
60021A4095161R1003P0359M4157J5374j4415m4801p5176j04650j32822j59578
$$ plain form
60088 9046165 9048708 9055794 9072122 9102255 9149587 9216421 9305174 9418927 9560310 9730347 9929313
60077 9929313 10158701 10421361 10719304 11052070 11417827 11815504 12245077 12706191 13197397
60068 13197397 13716610 14261245 14827424 15409384 15999743 16589822 17169731 17729067 18258278
60059 18258278 18749269 19194681 19587098 19919312 20184996 20378893 20496904 20536568 20497289 20379912
60049 20379912 20186548 19921281 19590794 19203964 18771080 18303577 17813847 17314475 16817454
60040 16817454 16333977 15874163 15446322 15056709 14710198 14410454 14158927 13954551 13795586
60031 13795586 13681430 13611690 13583769 13592526 13632287 13698071 13784633 13885253 13991767 14095161
60021 14095161 14186164 14256523 14300680 14316054 14301639 14256838 14181662 14077012 13944190 13784612
60011A3784612j84267k05990k24592k40457k53525k63384k70048k73621k73290
60002A1595438k67953k57981k45094k30027k11499j88308j61620j34149j07432
59993I791375q0958n3907k6789p43K4203M9140P4332R8062J18184J34314J47423
59982A0274636J57475J62815J62240J56247J45427J28961J06193P8744M9372J9069
59972A1441179j3040m7022q1013j12996j42028j67194j86953k00514k08743k12521
59962A0069155k11088k03268j89803j73088j54631j33930j10093q3701n6467k9587
59952H723499l150K2931M8103P1805R4656J18287J43513J69100J92817K13566
59942I795127K31693K47143K58139K62276K58537K47646K30640K07812J79326
$$ plain form
60011 13784612 13600345 13394355 13169763 12929306 12675781 12412397 12142349 11868728 11595438
60002 11595438 11327485 11069504 10824410 10594383 10382884 10194576 10032956 9898807 9791375
59993 9791375 9710417 9656510 9629721 9628978 9653181 9702321 9776653 9874715 9992899 10127213 10274636
59982 10274636 10432111 10594926 10757166 10913413 11058840 11187801 11293994 11372738 11422110 11441179
59972 11441179 11428139 11381117 11300104 11187108 11045080 10877886 10690933 10490419 10281676 10069155
59962 10069155 9858067 9654799 9464996 9291908 9137277 9003347 8893254 8809553 8753086 8723499
59952 8723499 8720349 8743280 8791383 8863188 8957844 9076131 9219644 9388744 9581561 9795127
59942 9795127 10026820 10273963 10532102 10794378 11052915 11300561 11531201 11739013 11918339
59933A1918339J46305J10629P3569L5188m472m3969q1015j14426j44562j71412
59923A1724174j93009k06662k11470k08819k00583j87614j70048j48241j23052
59914A0074676r5544o6644l6929o823K2819N0659P5892R8988J20683J40445J56820
59903A0535042J69221J78361J84684J87487J86128J81186J73675J63908J52075
59894A2111767J39501J28118J18626J10086J01612R3874Q8663Q7636R1870J02090
59884A3173843J18462J40143J65795J94823K27617K64124L02770L41666L80443
59875A5309686M19781M58946M95081N25571N49853N67665N76327N71310N49354
59866B0023574N09647M52017L75769K81406J72524N5052o5029j82619k92787l90404
$$ plain form
59933 11918339 12064644 12175273 12248842 12284030 12279558 12235589 12154574 12040148 11895586 11724174
59923 11724174 11531165 11324503 11113033 10904214 10703631 10516017 10345969 10197728 10074676
59914 10074676 9979132 9912488 9875559 9868736 9891555 9942214 10018106 10117094 10237777 10378222 10535042
59903 10535042 10704263 10882624 11067308 11254795 11440923 11622109 11795784 11959692 12111767
59894 12111767 12251268 12379386 12498012 12608098 12709710 12803584 12892247 12979883 13071753 13173843
59884 13173843 13292305 13432448 13598243 13793066 14020683 14284807 14587577 14929243 15309686
59875 15309686 15729467 16188413 16683494 17209065 17758918 18326583 18902910 19474220 20023574
59866 20023574 20533221 20985238 21361007 21642413 21814937 21869989 21804960 21622341 21329554 20939150
59856B0939150m71093n32537n74786n99228o07136n99353n77453n44574n04296
59847A5928694m58813m09019l56273l02875k50384j98616j47018r6350m8103k989
59837A3658254L9024P7472J11309J39981J63576J81572J92202J93479J84399J64788
59827A5106056J34506R3445M2199j7673q3974j53819k23258k87818l44260l91584
59817A3873820m29771m57841m74190m78848m74148m62601m45196m22650l97128
59808I831447l71102l44973l17438k88146k58619k30378k03732j78809j56520
59799G481730j37669j22072j09294r9381r2293q7318q3737q1331p9754p8134p5832
59788F434915p2789o8707o2964n5945m9280m3837l8755l3710l0825l2452l7745
$$ plain form
59856 20939150 20468057 19935520 19360734 18761506 18154370 17555017 16977564 16432990 15928694
59847 15928694 15469881 15060862 14704589 14401714 14151330 13952714 13805696 13709346 13661243 13658254
59837 13658254 13697278 13774750 13886059 14026040 14189616 14371188 14563390 14756869 14941268 15106056
59827 15106056 15240562 15334007 15376206 15358533 15274559 15120740 14897482 14609664 14265404 13873820
59817 13873820 13444049 12986208 12512018 12033170 11559022 11096421 10651225 10228575 9831447
59808 9831447 9460345 9115372 8797934 8509788 8251169 8020791 7817059 7638250 7481730
59799 7481730 7344061 7221989 7112695 7013314 6921021 6833703 6749966 6668635 6588881 6510747 6434915
59788 6434915 6362126 6293419 6230455 6174510 6125230 6081393 6042638 6008928 5978103 5945651 5907906
59777E907906m3447m7758n1559n5733n9420o1467o1892o0876n7705n1783m3887
59766E312379l5340k6535j6961o239N554J7978K9961L9918M6958N1819N6116O1030
59754E536638O7189P5121Q4719R4339J01489J04910J05525J04920J03311R9427
59744F477588R2390Q3086P3464O4745N6900M9808M4153M0647L9108L9104M1268
59733G102261M6861N6133O8133Q2382R9549J19966J42421J65350J88539K12835
59723H284430K38523K64899K91180L17179L43397L70973M01071M33334M65121
59714A1410107M92731N12735N20946N10737M74499M08016L13340J98002P2726
59705A4913839n0333j59792k48003l12270l53122l72210l72176l56983l30647
$$ plain form
59777 5907906 5864459 5816701 5765142 5709409 5649989 5588522 5526630 5465754 5408049 5356266 5312379
59766 5312379 5277039 5250504 5233543 5227304 5232858 5250836 5280797 5320715 5367673 5419492 5475608 5536638
59754 5536638 5603827 5678948 5763667 5858006 5959495 6064405 6169930 6274850 6378161 6477588
59744 6477588 6569978 6653064 6726528 6791273 6848173 6897981 6942134 6982781 7021889 7060993 7102261
59733 7102261 7149122 7205255 7273388 7355770 7455319 7575285 7717706 7883056 8071595 8284430
59723 8284430 8522953 8787852 9079032 9396211 9739608 10110581 10511652 10944986 11410107
59714 11410107 11902838 12415573 12936519 13447256 13921755 14329771 14643111 14841113 14913839
59705 14913839 14863506 14703714 14455711 14143441 13790319 13418109 13045933 12688950 12358303
59696A2358303k95925k55169k11678j68655j27016q5720m4437m585L2546O7421
59686A1265085J01412J35249J68989K02740K36675K70830L05452L41145L78139
59677A3405716M15860M53724M92034N31624N73085O16791O63185P12210P62659
59668A8626888Q12896Q62321R11584R61184J010336J057301J100231J137126J165261
59659B7645128J181514J183868J172514J149120J115331J072954J025926R80765
59651C6527120R43589R16797Q99680Q91853Q94258R06333R23891R40899R52312
59642D4796732R53982R41052R08438Q53138P75127O76246N59535M29887K94266
59633E1188403J60666L6934o9894j54374k13413k46016k52181k32471j88560j23471
$$ plain form
59696 12358303 12062378 11807209 11595531 11426876 11299860 11214140 11169703 11165118 11197664 11265085
59686 11265085 11366497 11501746 11670735 11873475 12110150 12380980 12686432 13027577 13405716
59677 13405716 13821576 14275300 14767334 15298958 15872043 16488834 17152019 17864229 18626888
59668 18626888 19439784 20302105 21213689 22174873 23185209 24242510 25342741 26479867 27645128
59659 27645128 28826642 30010510 31183024 32332144 33447475 34520429 35546355 36527120
59651 36527120 37470709 38387506 39287186 40179039 41073297 41979630 42903521 43844420 44796732
59642 44796732 45750714 46691766 47600204 48453342 49228469 49904715 50464250 50894137 51188403
59633 51188403 51349069 51386003 51316109 51161735 50948322 50702306 50450125 50217654 50029094 49905623
59623D9905623m0989N4906J60247K71501L86197N02892O20343P36819Q49978R56870
59613E4404387J053748J135952J197919J233057J233714J191558J098421R47893
59605F3496649P37764M72100J61223j79961n33139q77399j192167j461987j678550
59596E8944533j838148j939251j983943j979729j936944j864801j771810j669129
59588D3960778j570241j486752j426303j393759j390406j410321j440522j467558
59580C2374916j483516j485244j470476j437453j387153j323278j249927j170498
59572B1367371j088258j006241r26463q50137p78287p11399o48982n90543n36448
59563A4230613m87082m41968m00739l64083l32266l03456k75341k48183k24601
$$ plain form
59623 49905623 49864634 49919540 50079787 50351288 50737485 51240377 51860720 52597539 53447517 54404387
59613 54404387 55458135 56594087 57792006 59025063 60258777 61450335 62548756 63496649
59605 63496649 64234413 64706513 64867736 64687775 64154636 63277237 62085070 60623083 58944533
59596 58944533 57106385 55167134 53183191 51203462 49266518 47401717 45629907 43960778
59588 43960778 42390537 40903785 39477482 38083723 36693317 35282996 33842474 32374916
59580 32374916 30891400 29406156 27935680 26498227 25111074 23787796 22537869 21367371
59572 21367371 20279113 19272872 18346409 17496272 16717985 16006586 15357604 14767061 14230613
59563 14230613 13743531 13301563 12900824 12536741 12204475 11901019 11625678 11377495 11152894
59554A1152894k06112j91419j78527j67243j59033j55128j55242j57595j60044
59545I622551j61824j64195j68729j74880j79929j81379j78878j73731j67380
59536H071626j60507j52889j43714j32410j19449j06083r3196q0626o7669n4036
59526F961047m0422k8148j7971r063L02J0799K1336L0619L8646M5994N2483N7585
59514G123207O1691O5863P0553P5614Q1230Q7807R5084J02597J10952J21451J34335
59503H130384J48589J63608J79875J97604K15965K34285K53006K72736K93152
59494A0089204L13644L34449L56312L79273M02448M24609M44643M61742M75659
59485A3681983M86431M93419M95074M90286M79640M64637M45937M23254L97039
$$ plain form
59554 11152894 10946782 10755363 10576836 10409593 10250560 10095432 9940190 9782595 9622551
59545 9622551 9460727 9296532 9127803 8952923 8772994 8591615 8412737 8239006 8071626
59536 8071626 7911119 7758230 7614516 7482106 7362657 7256574 7163378 7082752 7015083 6961047
59526 6961047 6920625 6892477 6874506 6865443 6865745 6876544 6897880 6928499 6967145 7013139 7065622 7123207
59514 7123207 7184898 7250761 7321314 7396928 7478158 7565965 7661049 7763646 7874598 7996049 8130384
59503 8130384 8278973 8442581 8622456 8820060 9036025 9270310 9523316 9796052 10089204
59494 10089204 10402848 10737297 11093609 11472882 11875330 12299939 12744582 13206324 13681983
59485 13681983 14168414 14661833 15156907 15647193 16126833 16591470 17037407 17460661 17857700
59476A7857700L69110L40788L11129K78264K42660K07939J77747J52574J30651
59467B0068562J11349R6210Q6697Q2572Q3163Q8519R7801J07356J12092J08707
59457B1043028R6465P5043M3038r70n6890j22969j96444k73931l51853m26963
59447A9827554m96362n57134o06589o43062o66150o76143o73671o59867o36450
59438A4212126o05407n68748n28258m85285m40926l96622l54004l13761k75253
59429A0243862k37825k01825j67688j34955j03270p3464m6149j9886P507L6076
59419I302383O4066R0915J17808J45023J71089J95449K19696K44655K68139K87458
59409A1106681L02980L17005L29817L38751L40935L35151L20983K97882K65538
$$ plain form
59476 17857700 18226810 18567598 18878727 19156991 19399651 19607590 19785337 19937911 20068562
59467 20068562 20179911 20276121 20362818 20445390 20528553 20617072 20714873 20822229 20934321 21043028
59457 21043028 21139493 21214536 21257574 21256604 21199714 21076745 20880301 20606370 20254517 19827554
59447 19827554 19331192 18774058 18167469 17524407 16858257 16182114 15508443 14848576 14212126
59438 14212126 13606719 13037971 12509713 12024428 11583502 11186880 10832876 10519115 10243862
59429 10243862 10006037 9804212 9636524 9501569 9398299 9324835 9278686 9258800 9266307 9302383
59419 9302383 9366449 9457364 9575172 9720195 9891284 10086733 10306429 10551084 10819223 11106681
59409 11106681 11409661 11726666 12056483 12395234 12736169 13071320 13392303 13690185 13955723
59400A3955723K24037J73187J12804M4341k8581j01883j72809k39619l00202l52094
59390A3314904l93748m25067m46305m57198m57953m50751m39107m25108m08068
59381I411599l86717l62077l36905l12681k88687k64280k40424k18115j96831
59372F804882j75914j56420j39816j25317j10390r4084p8181o4501n2539m0755
59362E766965k9013j8321q736R71J1424K1754L0952L9188M7114N4837O2421P0647
59350F050203P9902Q8577R4019R5508R5228R5915R8677J03737J11960J24292J40333
59339G178351J58783J78939K00512K22181K41886K58965K75189K93336L15333
59330I323475L41733L72095M05470M41137M79096N19570N62288O06707O52611
$$ plain form
59400 13955723 14179760 14352947 14465751 14510092 14481511 14379628 14206819 13967200 13666998 13314904
59390 13314904 12921156 12496089 12049784 11592586 11134633 10683882 10244775 9819667 9411599
59381 9411599 9024882 8662805 8325900 8013219 7724532 7460252 7219828 7001713 6804882
59372 6804882 6628968 6472548 6332732 6207415 6097025 6002941 5924760 5860259 5807720 5766965
59362 5766965 5737952 5719631 5710895 5711866 5723290 5745044 5775996 5815184 5862298 5917135 5979556 6050203
59350 6050203 6130105 6218682 6312701 6408209 6503437 6599352 6698029 6801766 6913726 7038018 7178351
59339 7178351 7337134 7516073 7716585 7938766 8180652 8439617 8714806 9008142 9323475
59330 9323475 9665208 10037303 10442773 10883910 11363006 11882576 12444864 13051571 13704182
59321A3704182O99553P46104P90499Q31680Q68424Q97763R15706R19571R08395
59312B1281877Q81498Q38787P82800P18328O49048N76116N00708M25754L53779
59303B7008695K84842K18202J54388R3596L3366k9754r6840j66664k38230l10769
59293B6950832l81534m46222n02153n49266n87661o16310o34995o45894o52063
59284B1934734o55584o58086o61781o68275o76681o84009o87528o86343o80921
59275A5875526o71707o58294o39811o16002n87814n56669n23505m89013m54315
59266A0678396m20517l87647l55004l22717k91938k63289k36105k09723j84588
59257H006868j61533j40591j21148j02654q4697o7023n0081l4842k1433q519N156
$$ plain form
59321 13704182 14403735 15149839 15940338 16772018 17640442 18538205 19453911 20373482 21281877
59312 21281877 22163375 23002162 23784962 24503290 25152338 25728454 26229162 26654916 27008695
59303 27008695 27293537 27511739 27666127 27759723 27793089 27763335 27666495 27499831 27261601 26950832
59293 26950832 26569298 26123076 25620923 25071657 24483996 23867686 23232691 22586797 21934734
59284 21934734 21279150 20621064 19959283 19291008 18614327 17930318 17242790 16556447 15875526
59275 15875526 15203819 14545525 13905714 13289712 12701898 12145229 11621724 11132711 10678396
59266 10678396 10257879 9870232 9515228 9192511 8900573 8637284 8401179 8191456 8006868
59257 8006868 7845335 7704744 7583596 7480942 7396245 7329222 7279141 7244299 7222866 7214347 7219503
59246G219503J9282L2828M5797N8929P2008Q3827R4075J04097J15371J27961J40895
59235H114573J53410J65347J76826J87928J98414K07592K14769K19906K23286
59226I862051K24658K23551K20463K16488K11327K03168J91619J79536J70235
59217A1703096J63609J56780J48212J39061J30339J20905J09072R4436P6949N5618
59207A2898077K9490j104l5337p2589j10962j46270j74628j95539k10716k20325
59197A1760097k22495k16559k04610j89133j70811j49400j25363r9626p2801m5523
59187A0263776j8759P086L2617N8427Q4257J09648J34487J58251J79798J98842
59177A1208430K16883K35592K54704K72556K88276L02382L15537L27910L39909
$$ plain form
59246 7219503 7238785 7271613 7317410 7376339 7448347 7532174 7626249 7730346 7845717 7973678 8114573
59235 8114573 8267983 8433330 8610156 8798084 8996498 9204090 9418859 9638765 9862051
59226 9862051 10086709 10310260 10530723 10747211 10958538 11161706 11353325 11532861 11703096
59217 11703096 11866705 12023485 12171697 12310758 12441097 12562002 12671074 12765510 12842459 12898077
59207 12898077 12927567 12926463 12891126 12818537 12707575 12561305 12386677 12191138 11980422 11760097
59197 11760097 11537602 11321043 11116433 10927300 10756489 10607089 10481726 10382100 10309299 10263776
59187 10263776 10245017 10252103 10284720 10343147 10427404 10537052 10671539 10829790 11009588 11208430
59177 11208430 11425313 11660905 11915609 12188165 12476441 12778823 13094360 13422270 13762179
59168A3762179L52535L66519L81505L96373M09986M21327M28939M30427M22675
59159A7372465M02815L69059L20583K56990J78488Q6654j5478j24246k35825l45934
59149A8265571m49809n42924o21526o82638p24419p46999p52490p43896p24126
59140A2276744o95847o61330o22090n79382n35162m91805m50606m11454l74346
59131G454722l40190l09589k81824k55869k31792k10419j92136j76514j62625
59122E293764j49334j36073j23698j13666j05809r7987q8815p9516p1988o5975
59112D260903n9596n2063m4406l7732l1988k6390k0198j3151n933K06N107J0506
59100C985265J8088K7155L5335M1377M6134N1042N6779O3382P0515P7469Q3796
$$ plain form
59168 13762179 14114714 14481233 14862738 15259111 15669097 16090424 16519363 16949790 17372465
59159 17372465 17775280 18144339 18464922 18721912 18900400 18987054 18971576 18847330 18611505 18265571
59149 18265571 17815762 17272838 16651312 15968674 15244255 14497256 13744766 13000870 12276744
59140 12276744 11580897 10919567 10297477 9718095 9182933 8691128 8240522 7829068 7454722
59131 7454722 7114532 6804943 6523119 6267250 6035458 5825039 5632903 5456389 5293764
59122 5293764 5144430 5008357 4884659 4770993 4665184 4567197 4478382 4398866 4326878 4260903
59112 4260903 4201307 4149244 4104838 4067106 4035118 4008728 3988530 3975379 3969446 3969652 3974759 3985265
59100 3985265 4003353 4030508 4065843 4107220 4153354 4204396 4261175 4324557 4395072 4472541 4556337
59089D556337Q9994R6772J03801J10115J15711J21635J28409J35363J41746J47650
59079E747533J53586J59901J66698J73629J79695J83997J86734J88740J89970
59070G330483J89310J86063J80829J74600J67729J60114J51898J43644J36139
59061H820809J30181J26261J24453J24768J27435J32458J39308J47574J57626
59052A0030873J69833J83361J96474K08009K17799K25745K31015K32072K26842
59043A1922023K13166J89782J56908J15299O5351Q231n2358j10876j62847k06503
59033A2138176k41648k68045k85297k93603k94048k88245k77616k62862k44483
59024I682329k24119k04531j87485j72357j58005j45350j36592j32246j30737
$$ plain form
59089 4556337 4646331 4743103 4846904 4957019 5072730 5194365 5322774 5458137 5599883 5747533
59079 5747533 5901119 6061020 6227718 6401347 6581042 6765039 6951773 7140513 7330483
59070 7330483 7519793 7705856 7886685 8061285 8229014 8389128 8541026 8684670 8820809
59061 8820809 8950990 9077251 9201704 9326472 9453907 9586365 9725673 9873247 10030873
59052 10030873 10200706 10384067 10580541 10788550 11006349 11232094 11463109 11695181 11922023
59043 11922023 12135189 12324971 12481879 12597178 12662529 12670760 12618402 12507526 12344679 12138176
59033 12138176 11896528 11628483 11343186 11049583 10755535 10467290 10189674 9926812 9682329
59024 9682329 9458210 9253679 9066194 8893837 8735832 8590482 8453890 8321644 8190907
59015H190907j31020j33869j40021j48574j57989j67448j76487j84303j90365
59006F760831j94936j98192j99472j98214j95053j91299j87524j83248j77772
58997E035121j70888j62925j54486j46114j38089j30513j23345j16250j08878
58988C783633j01654r5818r1969q9024q5330q0466p5177p0070o5304o1042n7057
58977B910722n2329m6357m0498l6445l3645k9872k4368j8632j3938r997o482l991
58965B594168k593j160Q14K100J611J19q84j015o56O5R43J325J150J410K633L897
58949B603927M475N365P857J1371J4235J5939J7254J8400J8674J7808J6532J5618
58937B767455J5207J5071J4877J4364J3827J4189J5934J8365K0552K2503K4656
$$ plain form
59015 8190907 8059887 7926018 7785997 7637423 7479434 7311986 7135499 6951196 6760831
59006 6760831 6565895 6367703 6168231 5970017 5774964 5583665 5396141 5212893 5035121
58997 5035121 4864233 4701308 4546822 4400708 4262619 4132106 4008761 3892511 3783633
58988 3783633 3681979 3586161 3494192 3405168 3319838 3239372 3164195 3094125 3028821 2967779 2910722
58977 2910722 2858393 2812036 2771538 2735093 2701448 2671576 2647208 2628576 2614638 2604641 2598159 2594168
58965 2594168 2591575 2590415 2591229 2593329 2594940 2595059 2594175 2593160 2592504 2592569 2593512 2594837 2595987 2597397 2600030 2603927
58949 2603927 2608402 2613767 2621624 2632995 2647230 2663169 2680423 2698823 2717497 2735305 2751837 2767455
58937 2767455 2782662 2797733 2812610 2826974 2840801 2854990 2870924 2889289 2909841 2932344 2957000
58926B957000K6728K8123K9105L0430L1998L2914L2967L3104L4164L5895L7533
58915C309961L8797M0080M1964M4705M7964N1101N3925N6972O0798O5190O9348
58904C880805P2695P5272P7631Q0582Q4615Q9272R3411R6518R9317J02806J07169
58893D860093J12082J17540J23680J30197J36737J43739J52244J62787J74964
58884F114063J87916K00951K13798K26737K40495K55665K72278K90074L09050
58875H311027L29493L51575L75153L99932M25912M53776M84638N18907N55588
58866A2206001N93387O32346O73525P16902P60806Q03977Q47244Q92166R38497
58857A9064851R83793J025101J060299J088000J106880J115143J110070J087975
$$ plain form
58926 2957000 2983728 3011851 3040956 3071386 3103384 3136298 3169265 3202369 3236533 3272428 3309961
58915 3309961 3348758 3388838 3430802 3475507 3523471 3574572 3628497 3685469 3746267 3811457 3880805
58904 3880805 3953500 4028772 4106403 4186985 4271600 4360872 4454283 4550801 4650118 4752924 4860093
58893 4860093 4972175 5089715 5213395 5343592 5480329 5624068 5776312 5939099 6114063
58884 6114063 6301979 6502930 6716728 6943465 7183960 7439625 7711903 8001977 8311027
58875 8311027 8640520 8992095 9367248 9767180 10193092 10646868 11131506 11650413 12206001
58866 12206001 12799388 13431734 14105259 14822161 15582967 16386944 17234188 18126354 19064851
58857 19064851 20048644 21073745 22134044 23222044 24328924 25444067 26554137 27642112
58849B7642112J044736R76599Q81031P57613O08313M36507K46060M2335j66043
58840C2469263l68193n54819p20581q62526r77921j064827j123862j157808j169736
58831B4468990j162472j139326j103925j059169j007179r50226q90897q31376
58823A6324420p73119p17132o63968o13682n66463n23041m83965m48728m16358
58814A1117964l86614l59881l36022l14129k93323k73222k53662k34610k16289
58805H450212j98828j81820j64786j48138j33036j20157j08881r7720q5329p1288
58795G140229n6387m2104k9396j7890o357O010J8934L1565M3565N5620O8680Q2538
58783G295007R5652J07115J18422J32237J49394J68181J86690K04564K22060K39036
$$ plain form
58849 27642112 28686848 29663447 30544478 31302091 31910404 32346911 32592971 32635306 32469263
58840 32469263 32101070 31546251 30825670 29963144 28985223 27920396 26796534 25638726 24468990
58831 24468990 23306518 22167192 21063267 20004098 18996919 18046693 17155796 16324420
58823 16324420 15551301 14834169 14170201 13556519 12990056 12467015 11983050 11534322 11117964
58814 11117964 10731350 10371469 10035447 9721318 9427995 9154773 8901111 8666501 8450212
58805 8450212 8251384 8069564 7904778 7756640 7623604 7503447 7394566 7296846 7211517 7140229
58795 7140229 7083842 7041738 7012342 6994452 6988095 6994105 7013039 7044604 7088169 7143789 7212469 7295007
58783 7295007 7390659 7497774 7616196 7748433 7897827 8066008 8252698 8457262 8679322 8918358
58773H918358K55905K74239K95064L17380L39901L63445L89972M19670M50755
58764A2024689M82238N15181N50734N88471O27519O68233P11547P57095Q03067
58755A7728774Q47831Q90896R32076R70226J003105J028204J043315J046387J035104
58746B6525918J006493R56653Q81114P76550O42876M83556L03781J09135r3681
58737C1592395k96083m89131o65730q20736r49832j050083j121506j166650j188521
58728B3844123j189979j174609j146238j107303j059323j005042r48217q90938
58720A5322474q33323p76427p23086o74674o29251n84764n42280n04153m70442
58711I584074m39289m09882l82956l58902l37238l17531k99255k81174k62427
$$ plain form
58773 8918358 9174263 9448502 9743566 10060946 10400847 10764292 11154264 11573934 12024689
58764 12024689 12506927 13022108 13572842 14161313 14788832 15457065 16168612 16925707 17728774
58755 17728774 18576605 19467501 20399577 21369803 22372908 23401112 24444427 25490814 26525918
58746 26525918 27532411 28489064 29370178 30146728 30789604 31273160 31576941 31686076 31592395
58737 31592395 31296312 30807181 30141451 29320715 28370883 27320800 26199294 25032644 23844123
58728 23844123 22654144 21479535 20333297 19225994 18166671 17161629 16213412 15322474
58720 15322474 14489151 13712724 12989638 12314964 11685713 11100949 10558669 10054516 9584074
58711 9584074 9144785 8734903 8351947 7993045 7655807 7338276 7039021 6757847 6495420
58702F495420k43988k27517k13021j98900j84303j70086j57452j46639j37047
58693D816467j27911j18798j09865j01401r3113q4670p7042p1921o9274o6944
58683C895528o3530n9977n7259n4358n0380m6936m6070m6910m6744m4814m2816
58672C335734m2052m2130m2268m1945m0610l8598l7911m0063m3524m5388m5331
58661B875914m5633m7417m9289n0094n0588n1486n1860n0674m8445m6325m4605
58650B339498m2946m1223l9557l8138l7350l7304l7141l5639l2529k8560k4481
58639A944630k0917j8808j8580j9108j8852j7937j7805j8815j9650j9230j7852
58628A737076j6223j4608j3099j1666r740o786l409r07J05j24j287k876l807l576
$$ plain form
58702 6495420 6251432 6023915 5810894 5611994 5427691 5257605 5100153 4953514 4816467
58693 4816467 4688556 4569758 4459893 4358492 4265379 4180709 4103667 4031746 3962472 3895528
58683 3895528 3831998 3772021 3714762 3660404 3610024 3563088 3517018 3470108 3423364 3378550 3335734
58672 3335734 3293682 3251552 3209284 3167339 3126729 3088131 3050220 3010157 2966633 2921245 2875914
58661 2875914 2830281 2782864 2733575 2683481 2632893 2581407 2529547 2478873 2430428 2384103 2339498
58650 2339498 2296552 2255329 2215772 2177634 2140284 2102980 2065839 2030200 1997671 1969111 1944630
58639 1944630 1923713 1904905 1886325 1867217 1848365 1830428 1812623 1793808 1774158 1754928 1737076
58628 1737076 1720853 1706245 1693146 1681480 1671740 1664954 1661545 1660638 1660743 1660619 1659332 1656456 1652649 1649073
58614A649073l368m512o305o982o411n962o065n889n313m959m259j793J954M548
58600A593757N024N275O986R167J0044R786R963J1290J3246J5269J7271J9377
58588A726455K1742K4402K7136K9899L3222L7425M1709M5036M7673N0786N4762
58577B140247N9164O4014O9659P5537Q0768Q5882R2417J00611J09109J17201J25778
58566C120387J35796J47118J59204J71783J84761J98505K13919K30940K47559
58557D809972K61863K74565K87527L00301L10307L16112L17966L15019L04447
58548G498079K83743K51904K08453J53819R0926K4075m3946j11259j73742k25922
58538G956130k65648k94817l14690l23970l22749l14803l03813k90109k73193
$$ plain form
58614 1649073 1645705 1641193 1634888 1627906 1621495 1615533 1609468 1603579 1598266 1593307 1589048 1587255 1589209 1593757
58600 1593757 1598781 1604056 1611042 1620209 1630253 1640039 1650002 1661292 1674538 1689807 1707078 1726455
58588 1726455 1748197 1772599 1799735 1829634 1862856 1900281 1941990 1987026 2034699 2085485 2140247
58577 2140247 2199411 2263425 2333084 2408621 2489389 2575271 2667688 2768299 2877408 2994609 3120387
58566 3120387 3256183 3403301 3562505 3734288 3919049 4117554 4331473 4562413 4809972
58557 4809972 5071835 5346400 5633927 5934228 6244535 6560647 6878613 7193632 7498079
58548 7498079 7781822 8033726 8242179 8395998 8486924 8510999 8467053 8355794 8182052 7956130
58538 7956130 7690482 7395665 7080975 6757005 6434256 6119453 5815640 5525531 5252338
58529E252338k54735k36656k18532j99503j80937j64691j50187j35502j20386
58520C591209j06173r3666q2722p3086o4417n6517n0301m7038m5881m4259m1787
58509B885362m1223m3948m7099m7512m6214m6215m7711m8499m7914m7354m7511
58498B374162m7820m8325m9646n1142n1122m8972m5680m2381l9647l7763l6557
58487A875107l5324l3778l2343l0831k8260k4960k3152k3722k4169k1772j7565
58476A579231j4758j4236j4115j3171j2102j1357j0059p712n410m562n325o581
58464A459843o951n910m239l193k985k856k702l317m604n209m774m913o701q851
58450A392638r855j0380j1757j3424j3905j3372j3171j3460j3189j2187j1486
$$ plain form
58529 5252338 4997603 4760947 4542415 4342912 4161975 3997284 3847097 3711595 3591209
58520 3591209 3485036 3391370 3308648 3235562 3171145 3114628 3064327 3017289 2971408 2927149 2885362
58509 2885362 2844139 2800191 2753092 2705580 2659366 2613151 2565440 2516941 2469027 2421673 2374162
58498 2374162 2326342 2278017 2228371 2177229 2126107 2077135 2031455 1989074 1949427 1911664 1875107
58487 1875107 1839783 1806005 1773662 1742831 1714571 1689611 1666459 1642737 1618568 1596796 1579231
58476 1579231 1564473 1550237 1536122 1522951 1510849 1499492 1489433 1481721 1476311 1471749 1466424 1459843
58464 1459843 1452892 1446982 1442743 1439550 1436565 1433709 1431007 1427690 1423086 1417877 1413103 1408190 1401489 1392638
58450 1392638 1382783 1372403 1360646 1347222 1333317 1319945 1306774 1293314 1280125 1267938 1256452
58439A256452j1610j1910j1549j0334q696p516p470p993p650n974m060k952k597
58426A156141k887m199o111p157o742n880n244m157k383j056p18m13P8o44k810
58411A105818m033k681n93k41r89o58P49J465J122R81J666K646L492M114M401
58396A117259M838O477R143J1078J1421J1390J1845J1739J0441R272Q843P305
58384A231051L469o49k993m859q142j1413j2157j1204j1333j2611j2709j1080
58372A135370r474q770q365q318r183j0006r156o909m914l622k530k079k690k743
58358A046611l60L293N174M584L618L754M468N153O094P455R112J1185J3307J4098
58344A137546J2900J1092J0152R870R991J1577J4514J5825J3425R850R068J1060
$$ plain form
58439 1256452 1244842 1232932 1221383 1211049 1202353 1194837 1187367 1179374 1171724 1165750 1161690 1158738 1156141
58426 1156141 1153254 1149055 1142944 1135787 1129045 1123165 1117921 1113764 1111381 1110325 1109607 1109194 1109272 1108628 1105818
58411 1105818 1101785 1099104 1098511 1098270 1097281 1096623 1097372 1098837 1099959 1100940 1102606 1105252 1108744 1112858 1117259
58396 1117259 1122097 1128574 1137717 1148795 1160216 1171606 1183451 1195190 1205631 1214903 1223746 1231051
58384 1231051 1234520 1233871 1230878 1226019 1217877 1206464 1194307 1183103 1171770 1159159 1146450 1135370
58372 1135370 1125896 1117126 1108761 1100443 1091260 1081254 1072098 1065189 1060275 1056653 1054123 1052044 1049354 1046611
58358 1046611 1046251 1049544 1054718 1059302 1062920 1066674 1071142 1076295 1082389 1089844 1098956 1110141 1123448 1137546
58344 1137546 1150446 1161538 1171690 1181560 1191551 1203128 1217642 1233467 1246892 1256742 1265810 1276870
58332A276870J2683J2545J1723J0652Q697O234M261K595Q60P9Q06J246j06j779
58318A347366k156k659m651n679l113N93J225k67M72L684N335M181L420M786O153
58303A358690N987N569N747N476M778N375P336Q395P482N952M850L942L586M477
58289A437642N413M523K669K485M266N978O879P722P957O553N138O380R494J1258
58275A524357J1119J1302J2372J2948J3534J6058J9628K1202K0581K0404K1180
58264A704685K0877J9597J9884K1870K2607K1022J9372J9237J9896K0913K2472
58253A932432K3203K1684J9763K0260K1933K1434J9506K0067K3385K5605K5094
58242B174366K4141K4182K4534K5818K9399L3361L4322L3156L3689L6097L7221
$$ plain form
58332 1276870 1289553 1302098 1313821 1324473 1333170 1339404 1343665 1346260 1347120 1347199 1348005 1349251 1349145 1347366
58318 1347366 1345210 1342551 1337900 1332221 1329108 1329701 1330926 1330659 1331131 1334815 1340150 1344331 1347751 1352537 1358690
58303 1358690 1364677 1370246 1375993 1381469 1386247 1391622 1398958 1407353 1414835 1420787 1425637 1429579 1433165 1437642
58289 1437642 1443055 1447578 1450247 1452732 1456998 1462976 1469855 1477577 1485534 1492087 1497225 1503605 1513099 1524357
58275 1524357 1535476 1546778 1559150 1572098 1585632 1601690 1621318 1642520 1663101 1683505 1704685
58264 1704685 1725562 1745159 1765043 1786913 1809520 1830542 1849914 1869151 1889047 1909960 1932432
58253 1932432 1955635 1977319 1997082 2017342 2039275 2060709 2080215 2100282 2123667 2149272 2174366
58242 2174366 2198507 2222689 2247223 2273041 2302440 2335801 2370123 2403279 2436968 2473065 2510286
58231B510286L6925L8104M0753M2209M2919M5511M8718M8963M7507M8764N2175
58220C002834N3577N4131N9152O7872P3506P4451P6121Q0308Q2306Q0870Q1522
58209C786650Q6853R2337R5121R8617J05016J11177J15226J19729J25647J30690
58199D867063J35734J44764J56681J65902J72748J83607J98919K11455K19040
58190F455913K28092K41512K54408K65487K80944L02357L22269L36941L52332
58181I040255L72133L91353M07385M25837M49313M71710M90058N10852N38589
58172A3097485N69219O00804O38921O85533P34668P84891Q43276R11284R80513
58163A9846594J048455J123880J210346J300034J390528J490889J603712J718920
$$ plain form
58231 2510286 2547211 2585315 2626068 2668277 2711196 2756707 2805425 2854388 2901895 2950659 3002834
58220 3002834 3056411 3110542 3169694 3237566 3311072 3385523 3461644 3541952 3624258 3705128 3786650
58209 3786650 3873503 3965840 4060961 4159578 4264594 4375771 4490997 4610726 4736373 4867063
58199 4867063 5002797 5147561 5304242 5470144 5642892 5826499 6025418 6236873 6455913
58190 6455913 6684005 6925517 7179925 7445412 7726356 8028713 8350982 8687923 9040255
58181 9040255 9412388 9803741 10211126 10636963 11086276 11557986 12048044 12558896 13097485
58172 13097485 13666704 14267508 14906429 15591962 16326630 17111521 17954797 18866081 19846594
58163 19846594 20895049 22018929 23229275 24529309 25919837 27410726 29014438 30733358
58155C0733358J833069J955829K089385K222763K356876K513188K706390K931373
58147D9342231L188910L499489L879447M330686M866786N516363O281361P124119
58139H8029392Q016486Q969441R994628J1073893J2185665J3315796J4425340
58132A66010641J5479942J6565773J7936762J9925081K2848941K6896991L1705868
58125C17369999L5738634L6348167L1185775K0092199N626402q462816j9426845
58118D18471515k6488968l0253433l1665250l1477441l0211712k8227086k5778483
58111B14369142k3091445k0382159j7796326j5385579j3174910j1208186r506920
58104A03823617q038573o759056n649949m694117l857962l122092k491747j954194
$$ plain form
58155 30733358 32566427 34522256 36611641 38834404 41191280 43704468 46410858 49342231
58147 49342231 52531141 56030630 59910077 64240763 69107549 74623912 80905273 88029392
58139 88029392 96045878 105015319 115009947 126083840 138269505 151585301 166010641
58132 166010641 181490583 198056356 215993118 235918199 258767140 285664131 317369999
58125 317369999 353108633 389456800 420642575 440734774 446361176 437898360 418471515
58118 418471515 391982547 361729114 330063864 298586423 268374711 240147625 214369142
58111 214369142 191277697 170895538 153099212 137713633 124538723 113330537 103823617
58104 103823617 95785044 89025988 83376039 78681922 74823960 71701868 69210121 67255927
58096F7255927j456421r32935l16717M63147J392211K222355K501016J881583
58088G3010166M42469j334582k905126l972565m529936m713649m664471m474841
58080D6857465m193665l850800l477193l104239k751304k425169k130625j872041
58072B3052429j646836j448551j276248j132632j015045r16952q35793p70853
58064A4009519p16250o64972o17457n77820n44080n10519m77271m49116m26472
58055I025562m05112l83275l62019l40396l16972k94510k76923k63292k50318
58046F132745k38247k28810k20034k09059j97628j88986j81758j72541j62184
58037D333498j53810j46837j38575j29695j22614j16385j08444r9743r3291q9270
$$ plain form
58096 67255927 65799506 64866571 64549854 65013001 66405212 68627567 71128583 73010166
58088 73010166 73452635 72118053 69212927 65240362 60710426 55996777 51332306 46857465
58080 46857465 42663800 38813000 35335807 32231568 29480264 27055095 24924470 23052429
58072 23052429 21405593 19957042 18680794 17548162 16533117 15616165 14780372 14009519
58064 14009519 13293269 12628297 12010840 11433020 10888940 10378421 9901150 9452034 9025562
58055 9025562 8620450 8237175 7875156 7534760 7217788 6923278 6646355 6383063 6132745
58046 6132745 5894498 5665688 5445654 5236595 5038967 4849981 4668223 4495682 4333498
58037 4333498 4179688 4032851 3894276 3764581 3641967 3525582 3417138 3317395 3224104 3134834
58027C134834q6041q3850q3077q1200p6250p1022o9056o8729o6219o2077n9632
58016B327681n8670n6110n1816m8620m7235m5701m3319m1153l9123l6304l3442
58005A826188l1919l0990k9083k6698k5149k3691k0881j7427j5039j3910j3785
57994A577616j5552j8951k0866j9037j5662j4202j4511j4080j2259j0039p466
57983A414991m410k345k402l158k848j998j486m27J485K144M90r13L1J113m10
57968A399857l006l820l730n197p367p973q174j0678j4432j5925j4873j4095j4467
57955A276120j4392j3730j3886j4205j2469r196p600q825j0595j0931j0224r300
57943A140767q236p327o813n703l220j067j583m004n167l844j850r46r57j045
$$ plain form
58027 3134834 3048793 2964943 2881866 2800666 2724416 2653394 2584338 2515609 2449390 2387313 2327681
58016 2327681 2269011 2212901 2161085 2112465 2065230 2019529 1976210 1935057 1895934 1859630 1826188
58005 1826188 1794269 1763279 1734196 1707498 1682349 1658658 1637777 1620350 1605311 1591401 1577616
57994 1577616 1562064 1543113 1522247 1503210 1487548 1473346 1458835 1444755 1432496 1422457 1414991
57983 1414991 1410581 1408236 1405834 1402676 1399828 1397830 1396344 1395917 1397402 1399546 1400036 1399123 1399154 1400267 1399857
57968 1399857 1396851 1393031 1389301 1384104 1376737 1368764 1360590 1349912 1335480 1319555 1304682 1290587 1276120
57955 1276120 1261728 1247998 1234112 1219907 1207438 1198242 1190642 1181817 1171222 1160291 1150067 1140767
57943 1140767 1132531 1125204 1118391 1112688 1109468 1108401 1106818 1102814 1097647 1093803 1091953 1091007 1090050 1089005
57929A089005p87K0R86R25n47j911j791r90q98j218j214j647l239m645m340l186
57913A064523k758k645j970j951l960o594p716q054r523j1353j1475j0652j1315
57900I74557j2927j2540r794p562p367p769p720q081r039r233q376q027q777r057
57886H48288p667n484l758k669k154k441l101l005j731K03K305M066M295K217
57872H29364r78l238m001m066l838l367l390m388n242m797l960m171m581l239
57858G76108m62J536K112K726M136N506O321O971P329O859O098O094O500O236
57844H44070N721O205P117O517M249K279J667J311K5j979l995n559o217o109o495
57829H48807q119r605r288p961p706q609r077q867r110r483q236n244k554j414
$$ plain form
57929 1089005 1088218 1088238 1089224 1090149 1089602 1087691 1085900 1084910 1084012 1082794 1081580 1079933 1076694 1072049 1067709 1064523
57913 1064523 1061765 1059120 1057150 1055199 1051239 1044645 1036929 1028875 1019352 1007999 996524 985872 974557
57900 974557 961630 949090 939296 931734 924367 916598 908878 900797 891758 882525 874149 866122 857345 848288
57886 848288 840621 835137 831379 828710 826556 824115 821014 818009 816278 816481 818786 822852 827147 829364
57872 829364 828386 825148 821147 817081 813243 809876 806486 802098 796856 792059 788099 783928 779347 776108
57858 776108 775646 777182 779294 782020 786156 791662 797983 804954 812283 819142 825240 831334 837834 844070
57844 844070 849791 855996 863113 869630 873879 876158 877825 879136 879161 877182 873187 867628 861411 855302 848807
57829 848807 840688 831083 821795 813834 806128 797519 788442 779575 770465 760982 752746 747502 744948 743534
57815G43534r83l23M23J176K234L159L189K757K886L303L157L216M860P181P706
57800G87475O083M456L961L508K379J409J016M09o27j385k118l996o668q239q247
57785G79416q332r323r987r424q478p899p285o634o915q192r101q949q531q275
57771F62091p604o780p146q630r175p676n662n001n606o380o810o830o502o473
57757E65816p316q183p734o538o465p521p628n962m044k922j915r09j125k363
57743D95191k237J72K425K337J262J615L033L456K698K576M077O198P359O874
57729E37036N383M417M878N631M713K195K08j87l19j342k428k539k146j906j381
57714E52213m00m5r29j937k023j782j958j918j067l33n83q22L23K334L577L651
$$ plain form
57815 743534 742551 742228 742651 743827 746061 749220 752409 755166 758052 761355 764512 767728 772588 779769 787475
57800 787475 793558 798014 801975 805483 807862 809271 810287 810696 810069 808684 806566 802570 795902 787663 779416
57785 779416 771084 761761 751774 742350 733872 725973 718688 712054 705139 696947 687846 678897 670366 662091
57771 662091 654487 647707 640561 631931 622756 615080 609418 604417 598811 592431 585621 578791 572289 565816
57757 565816 558500 550317 542583 536045 529580 522059 514431 508469 504425 501503 499588 498679 497554 495191
57743 495191 492954 493126 495551 497888 499150 500765 503798 507254 509952 512528 516605 522803 530162 537036
57729 537036 542419 546836 551714 557345 562058 564253 564461 564274 563955 562613 560185 557646 555500 553594 552213
57714 552213 551813 551768 550839 548902 546879 545097 543139 541221 540154 539821 539238 538416 538739 541073 544650 548301
57698E48301L500L905M949O361P486P594O918O514O626O447O005O637Q654J0302
57684F40199J0300R827J0532J1969J2570J2012J1022R916Q841Q609R800J1618
57672G67215J2851J3354J3658J3939J4167J4512J4816J4733J4836J6203J8334
57661I28618J9357J9261K0657K4884K9451L1350L1093L1238L2544L4175L6327
57650A238955L9785M3616M6104M7762N0771N5494N9937O2950O5668O9287P3546
57639A853875P8211Q4319R2741J02624J12250J20850J28995J37727J47752J59132
57629C018476J71301J83571J95701K07922K20626K33973K47543K60217K70810
57620E010140K78685K82949K81202K70360K49145K18714J80768J36646Q9015M2494
$$ plain form
57698 548301 551801 555706 560655 567016 574502 582096 589014 595528 602154 608601 614606 621243 629897 640199
57684 640199 650499 660326 670858 682827 695397 707409 718431 728347 737188 745797 755597 767215
57672 767215 780066 793420 807078 821017 835184 849696 864512 879245 894081 910284 928618
57661 928618 947975 967236 987893 1012777 1042228 1073578 1104671 1135909 1168453 1202628 1238955
57650 1238955 1278740 1322356 1368460 1416222 1466993 1522487 1582424 1645374 1711042 1780329 1853875
57639 1853875 1932086 2016405 2109146 2211770 2324020 2444870 2573865 2711592 2859344 3018476
57629 3018476 3189777 3373348 3569049 3776971 3997597 4231570 4479113 4739330 5010140
57620 5010140 5288825 5571774 5852976 6123336 6372481 6591195 6771963 6908609 6997624 7040118
57610G040118R76l4711o5377r1186j12557j32406j55144j82713k12433k38737
57600E815830k56807k65171k65726k61074k51785k36903k17036j95169j73888
57591C692271j53377j33173j14092r6970q1007o5168n0098l7038k5877j5819o841
57580B912811J318J0322K1226L2250M0902M7896N6493O8082Q0728R2283J02781
57569C467092J13272J24109J35200J46577J57998J68881J79000J88437J96620
57560D877186K02274K04362K02198J94609J79848J56462J23841Q2439L4443j6117
57550F241545o5157j10505j51465j86914k14923k34255k45264k49454k48648k44262
57540D290698k36678k25729k12315j98682j86206j73861j60092j45419j31843
$$ plain form
57610 7040118 7041094 7006383 6941006 6849820 6737263 6604857 6449713 6267000 6054567 5815830
57600 5815830 5559023 5293852 5028126 4767052 4515267 4278364 4061328 3866159 3692271
57591 3692271 3538894 3405721 3291629 3194659 3113652 3048484 2998386 2961348 2935471 2919652 2912811
57580 2912811 2914129 2924451 2945677 2977927 3018829 3066725 3123218 3191300 3272028 3364311 3467092
57569 3467092 3580364 3704473 3839673 3986250 4144248 4313129 4492129 4680566 4877186
57560 4877186 5079460 5283822 5486020 5680629 5860477 6016939 6140780 6223219 6257662 6241545
57550 6241545 6176388 6065883 5914418 5727504 5512581 5278326 5033062 4783608 4534960 4290698
57540 4290698 4054020 3828291 3615976 3417294 3231088 3057227 2897135 2751716 2619873
57531B619873j20339j10388j01499r3571q6145p8789p2009o6458o1613n6539n1562
57520A720961m7677m4568m0813l5907l0687k5917k1840j8896j7335j6319j4805
57509A406197j3046j1734j0188p285l867j973j586l82K874O787R809J2142J4287
57496A402035J5818J6797J8611K1863K4889K6110K6825K9795L5460M1236M4655
57485A704094M6062M7842N1736N7414O3365O8753P4114Q0362Q7623R5434J03517
57474B480316J11751J19770J27314J34632J41779J47950J52504J56195J60086
57465C732297J63304J63248J58074J47679J32107J10533Q2579M9551J3592k3582
57455D729382o0430r4826j24431j47701j64197j74358j79237j80091j77772j72567
$$ plain form
57531 2619873 2499534 2389146 2287647 2194076 2107931 2029142 1957133 1890675 1829062 1772523 1720961
57520 1720961 1673284 1628716 1587903 1551996 1521309 1495392 1473552 1454656 1437321 1421002 1406197
57509 1406197 1393151 1381417 1371229 1363944 1360077 1358104 1356518 1356136 1359010 1365797 1375606 1387748 1402035
57496 1402035 1417853 1434650 1453261 1475124 1500013 1526123 1552948 1582743 1618203 1659439 1704094
57485 1704094 1750156 1797998 1849734 1907148 1970513 2039266 2113380 2193742 2281365 2376799 2480316
57474 2480316 2592067 2711837 2839151 2973783 3115562 3263512 3416016 3572211 3732297
57465 3732297 3895601 4058849 4216923 4364602 4496709 4607242 4689821 4739372 4752964 4729382
57455 4729382 4668952 4574126 4449695 4301994 4137797 3963439 3784202 3604111 3426339 3253772
57445C253772j64623j54437j42864j30822j18753j06396r3636q1581p1819o4157
57435B124684n6381m7173l7981l0621k4323j7099r121k343K874Q278J4674K0836
57423A946304K6030L1416L7920M4625N0435N5791O1522O7545P3879Q1497R0639
57412B567603R9424J05921J10824J16458J23566J30671J36358J40522J43140J43082
57402C817569J38743J28952J12912R0139O1212K8172o633m1935p7213j11004j40531
57391D000383j63602j80235j91539j97527j97492j92378j85034j77338j68562
57382B346676j57645j45585j34148j23432j12580j02069r3287q6233p9643p3118
57372A238936o7307o2049n6441n0850m6751m4146m1237l7294l3847l2159l1357
$$ plain form
57445 3253772 3089149 2934712 2791848 2661026 2542273 2435877 2342241 2260660 2188841 2124684
57435 2124684 2068303 2021130 1983149 1952528 1928205 1911106 1901985 1899642 1902516 1910794 1925468 1946304
57423 1946304 1972334 2003750 2041670 2086295 2136730 2192521 2254043 2321588 2395467 2476964 2567603
57412 2567603 2667027 2772948 2883772 3000230 3123796 3254467 3390825 3531347 3674487 3817569
57402 3817569 3956312 4085264 4198176 4288315 4349527 4377699 4371066 4329131 4251918 4140914 4000383
57391 4000383 3836781 3656546 3465007 3267480 3069988 2877610 2692576 2515238 2346676
57382 2346676 2189031 2043446 1909298 1785866 1673286 1571217 1477930 1391697 1312054 1238936
57372 1238936 1171629 1109580 1053139 1002289 955538 911392 870155 832861 799014 766855 735498
57361G35498l0178k8891k8183k7533k6109k4285k2997k2381k2014k1588k0456
57350D60883j7678j3653j0677j0434j1661j1705r891p990p625q639r925j0659
57338C30346j0390q870o381l968k908l585m890n045l606k279k872m662n047k872
57324B62971K37K131K367J639N27l52k47N51N70p50k005k042j945l181m887n040
57308B50544l785l388m770o116n477l253j328p83j288j977k197j837j319j108
57294B11918j032n66K02M34l19j362j656j014k49j52o09p67r3Q30Q74j83j072
57277B05184l67J832L913M460L554K392J880J837J410J90j264j993j534j39J697
57262B23052L402M198L496J782O64J561M341P365Q773P872N700M301N030P323
$$ plain form
57361 735498 705320 676429 648246 620713 594604 570319 547322 524941 502927 481339 460883
57350 460883 443205 429552 418875 408441 396780 385075 375184 367194 359569 350930 341005 330346
57338 330346 319956 311086 304705 300737 297829 294244 289354 284309 280703 278424 275552 270890 265843 262971
57324 262971 263208 265339 267706 269345 269872 269520 269273 269824 270394 269644 267639 265597 263652 260471 255584 250544
57308 250544 246759 243371 238601 232485 227008 223755 222427 221644 220356 218379 216182 214345 213026 211918
57294 211918 210886 210320 210522 210956 210637 209275 207619 206605 206356 206204 205595 204828 204735 205565 206439 206256 205184
57277 205184 204817 206649 210562 215022 218576 220968 222848 224685 226095 226285 225021 223028 221494 221355 223052
57262 223052 226454 230652 234148 235930 236594 238155 242496 249861 258634 266506 272206 276507 281537 288860
57248B88860R421J0271J0372J0811J2188J4530J7415J9763K0195J8396J5891J4872
57236D62985J6371J9729K3438K6128K7111K6727K6251K7057K9619L3236L6667
57225G55319L9113M0775M2589M5114M7844M9732N0261M9550M7609M4151L9157
57214A251214L3032K6075J8374J0415L040l508r903j6720k3516k9350l3784l7036
57202A188333l9436m1191m2457m3262m3465m2835m1105l8078l4042l0015k7065
57191G65382k5268k3839k2114j9720j5933j0076l060K556N029N354N916P688R656
57178F81571J0688J0800J0624J0625J1340J3494J7177K1243K4315K6278K8269
57167H66424L1063L4127L6548L8180L9264L9342L7624L4393L0977K8066K5080
$$ plain form
57248 288860 298281 308552 318924 329735 341923 356453 373868 393631 413826 432222 448113 462985
57236 462985 479356 499085 522523 548651 575762 602489 628740 655797 685416 718652 755319
57225 755319 794432 835207 877796 922910 970754 1020486 1070747 1120297 1167906 1212057 1251214
57214 1251214 1284246 1310321 1328695 1339110 1342150 1338642 1328739 1312019 1288503 1259153 1225369 1188333
57202 1188333 1148897 1107706 1065249 1021987 978522 935687 894582 856504 822462 792447 765382
57191 765382 740114 716275 694161 674441 658508 648432 645372 647928 652957 658311 664227 671915 681571
57178 681571 692259 703059 713683 724308 735648 749142 766319 787562 811877 838155 866424
57167 866424 897487 931614 968162 1006342 1045606 1084948 1122572 1156965 1187942 1216008 1241088
57156A241088K1772J9346J8930J9774K0258K0347K1656K5044K9346L2708L4322
57145A504591L4513L4073L3955L4897L6785L8721M0152M1547M3573M5918M7359
57134A936084M6929M4728M1659L8625L6015L3842L2160L1224L1363L2727L5004
57123B340360L7178L8020L7319L6333L6337L6993L6884L5516L3603L1550K8899
57112B728992K5566K2381J9899J7756J5616J3501J0778O179m69p689j4149j9699
57100B818662k4201k6926k7960k8563k9309k9487k9251l0343l3432l6685l8446
57089B484059l9374m0480m1166m1243m2736m7440n4405o2190p1652q3961r7702
57078A861710j10946j24767j41707j61901j83598k06395k30884k56058A65383
$$ plain form
57156 1241088 1262860 1282206 1301136 1320910 1341168 1361515 1383171 1408215 1437561 1470269 1504591
57145 1504591 1539104 1573177 1607132 1642029 1678814 1717535 1757687 1799234 1842807 1888725 1936084
57134 1936084 1983013 2027741 2069400 2108025 2144040 2177882 2210042 2241266 2272629 2305356 2340360
57123 2340360 2377538 2415558 2452877 2489210 2525547 2562540 2599424 2634940 2668543 2700093 2728992
57112 2728992 2754558 2776939 2796838 2814594 2830210 2843711 2854489 2860668 2860199 2852510 2838361 2818662
57100 2818662 2794461 2767535 2739575 2711012 2681703 2652216 2622965 2592622 2559190 2522505 2484059
57089 2484059 2444685 2404205 2363039 2321796 2279060 2231620 2177215 2115025 2043373 1959412 1861710
57078 1861710 1750764 1625997 1484290 1322389 1138791 932396 701512 445454 165383
57068a37623l26276l49874l72803l95106m17239m38559m58854m80122n04559n32671
57058d413686n65713o07562o61111p25113p97875q81642r79790j092523j219385
57049a1944400j363509j529475j719975j938528k191678k483975k815492l189848
57041b9176880l619904m119812m697743n363194o132052p011631p985839r027770
57033g7134825j0124060j1278829j2502521j3803715j5167958j6524967j7783592
57026a74320467j8982747k0410046k2446541k5144929k7906962k9622827k9218620
57019c48053139k6194650k0797040j3799897o119784J494325Q562353J4786646
57012c90121186J9926686K3778206K6250611K7419464K7486096K6701249K5322212
$$ plain form
57068 -137623 -463899 -813773 -1186576 -1581682 -1998921 -2437480 -2896334 -3376456 -3881015 -4413686
57058 -4413686 -4979399 -5586961 -6248072 -6973185 -7771060 -8652702 -9632492 -10725015 -11944400
57049 -11944400 -13307909 -14837384 -16557359 -18495887 -20687565 -23171540 -25987032 -29176880
57041 -29176880 -32796784 -36916596 -41614339 -46977533 -53109585 -60121216 -68107055 -77134825
57033 -77134825 -87258885 -98537714 -111040235 -124843950 -140011908 -156536875 -174320467
57026 -174320467 -193303214 -213713260 -236159801 -261304730 -289211692 -318834519 -348053139
57019 -348053139 -374247789 -395044829 -408844726 -414964510 -413470185 -404907832 -390121186
57012 -390121186 -370194500 -346416294 -320165683 -292746219 -265260123 -238558874 -213236662
57005b13236662K3592616K1710332J9800909J7928486J6127500J4418790J2811280
56998h6846749J1310384R927963Q676770P558806O567368N696555M940478M286871
56990b7881554L720635L232227K816055K463236K162733J907495J693129J512561
56982h373483J357784J225012J112771J016711R31401Q55183P88397c57606C14652
56972I33509N69308N22003M74833M28973L86531L46803L08884K75406K49215K28612
56962D724077K10029J92756J76725J58751J36409J13353R5238Q2030O9358N5494
56952F014220M1233K4287J20l1220o3893r2026j12736j24274j25914j20041j10422
56941E299334r8392q3550o6660m7915k4573L216K4295K0921j5448p5513j39992
$$ plain form
57005 -213236662 -189644046 -167933714 -148132805 -130204319 -114076819 -99658029 -86846749
56998 -86846749 -75536365 -65608402 -56931632 -49372826 -42805458 -37108903 -32168425 -27881554
56990 -27881554 -24160919 -20928692 -18112637 -15649401 -13486668 -11579173 -9886044 -8373483
56982 -8373483 -7015699 -5790687 -4677916 -3661205 -2729804 -1874621 -1086224 -357606 314652
56972 933509 1502817 2024820 2499653 2928626 3315157 3661960 3970844 4246250 4495465 4724077
56962 4724077 4934106 5126862 5303587 5462338 5598747 5712100 5807338 5889368 5958726 6014220
56952 6014220 6055453 6079740 6079860 6048640 5984747 5892721 5779985 5655711 5529797 5409756 5299334
56941 5299334 5200942 5117392 5050732 5002817 4978244 4981460 5005755 5026676 5011228 4935715 4795723
56930D795723j93062k28464k47948k57009k60195k58308k50488k38033k23922
56921B638294k09341j93826j78624j66411j57301j48387j37923j27121j17065
56912A202295j06741r5118q2856p0976n9808m9901m1895l4947k7125j7899q662
56901F06367o23O089J1316J4862J7707K1202K4814K6410K4808K0495J4150O472
56889G94069p30n483p957r987j2228j3459j2724j0452p547m902l489l393l183
56876F98535j731J87J720M128Q902J4817J9393K2214K3919K2909J6614N874n218
56863H32263j4005k0736k5490k7111k5977k4545k4010k2859j9744j5463j1287
56852F01036p576m779l522k981j308J562L616L894L774M474N449O060O817Q112
$$ plain form
56930 4795723 4602661 4374197 4126249 3869240 3609045 3350737 3100249 2862216 2638294
56921 2638294 2428953 2235127 2056503 1890092 1732791 1584404 1446481 1319360 1202295
56912 1202295 1095554 1000436 917580 846604 786796 736895 695000 660053 632928 615029 606367
56901 606367 605744 611833 623149 638011 655718 676920 701734 728144 752952 773447 787597 794069
56889 794069 793339 787856 779899 769912 757684 744225 731501 721049 713502 708600 705111 701718 698535
56876 698535 696804 696991 698711 702839 711741 726558 745951 768165 792084 814993 831607 837481 832263
56863 832263 818258 797522 772032 744921 718944 694399 670389 647530 627786 612323 601036
56852 601036 593460 588681 585159 582178 580870 582432 586048 589942 593716 598190 603639 609699 616516 624628
56838F24628R532J1032J3024J4888J5364J4855J5330J7464J9974K2120K4625K7548
56826H30384K9631L0557L1495L2452L1252K6257J8337R370P41o042r560j0498
56814A014376j1507j3858j5912j5733j3337r607m997l32L178N821R444J4666J9936
56801I82138K4341K9007L4440L8589L9118L5781K9065J8707N448p463j6724k1893
56789A190554k4314k4535k2568j9462j6544j3556r188l094L715J0005J4968J8564
56777A104545K1950K6727L3023L9339M4779M9752N3558N3051M5371L1084J3313
56766A516492n039k1925l5354m3990m8198m9123m7283m2966l7277l1421k5465
56755A128451j8972j2349o521j661K765P080J1361J5960K1188K6642L1136L2912
$$ plain form
56838 624628 634160 645192 658216 673104 688468 703323 718653 736117 756091 778211 802836 830384
56826 830384 860015 890572 922067 954519 985771 1012028 1030365 1039735 1040476 1034434 1024874 1014376
56814 1014376 1002869 989011 973099 957366 944029 934422 929425 929093 932271 938092 947536 962202 982138
56801 982138 1006479 1035486 1069926 1108515 1147633 1183414 1212479 1231186 1236634 1229171 1212447 1190554
56789 1190554 1166240 1141705 1119137 1099675 1083131 1069575 1060387 1057293 1061008 1071013 1085981 1104545
56777 1104545 1126495 1153222 1186245 1225584 1270363 1320115 1373673 1426724 1472095 1503179 1516492
56766 1516492 1511453 1489528 1454174 1410184 1361986 1312863 1265580 1222614 1185337 1153916 1128451
56755 1128451 1109479 1097130 1090609 1088948 1091713 1098793 1110154 1126114 1147302 1173944 1205080 1237992
56743A237992K9877K0789O862q488k2161l3009m0920m5571m6851m5465m2248l7544
56731I73263l1832k6063k0738j5465j0042n227j810L45J943L659O204R942J3997
56718H98176J6549J6230J2468M885n956j7061k4397k6683k6407k6386k6963k7156
56706G67299k6680k5513k3109j9508j6126j4168j3164j1999j0453q842p355o438
56694E83944o575o952n915l601k382l399m547l531j352p13k136l803m543m954
56680E29541n722o578p017o885o240n245m166l035j854j215j760k725k415o03
56666D74081Q71O44n37j438j879j843q51N13M51j233k108o83R31J06k291l460
56650D61274k907k382k518k390j933k194l074l254k492j925j930j610p03j37l25
$$ plain form
56743 1237992 1267869 1288658 1295520 1287032 1264871 1231862 1190942 1145371 1098520 1053055 1010807 973263
56731 973263 941431 915368 894630 879165 869123 863896 862086 862431 864374 868033 874237 884179 898176
56718 898176 914725 930955 943423 948308 942352 925291 900894 874211 847804 821418 794455 767299
56706 767299 740619 715106 691997 672489 656363 642195 629031 617032 606579 597737 590382 583944
56694 583944 577369 570417 564502 560901 558519 555120 550573 547042 545690 544977 542841 539038 534495 529541
56680 529541 523819 517241 510224 503339 497099 491854 487688 484653 482799 481584 479824 477099 474684 474081
56666 474081 474952 475596 475059 473621 471742 469899 469048 469561 470012 468779 466671 465988 466919 467025 464734 461274
56650 461274 458367 455985 453467 451077 449144 446950 443876 440622 438130 436205 434275 432665 431962 431825 431500
56635D31500n33l25k35o24j074j200r44%J987M482O403P432P965P899O707M769
56619D74209L418L310L630L202J693m27k415l606l823l506l185l037l155l671
56605D62637m221m048l238k961l767m540m057k700j575q87m77r87k817m460l800
56590D18102j049J177J000p47k015j889r53k8Q18J965L123L100J358n10k15K084
56574D25321L608K616N82j79M98J387K180L235M013L607K277R58j47j186j607
56559D47163r23J47O66R16J570K190J953J040n9j589l426m118k949j660k005k692
56543D36224j356J303K279R42j05Q66K486K852J976P88l14j001p50O4K36n11j108
56526D44871r66p43p40l4J988M355N602N431M683M299M631N318N711N790O260
$$ plain form
56635 431500 430967 430642 430407 429783 428709 427509 426565 426565 428552 433034 439437 446869 454834 462733 469440 474209
56619 474209 477627 480937 484567 487769 489462 489035 486620 483014 479191 475685 472500 469463 466308 462637
56605 462637 458416 454368 451130 448169 444402 439862 435805 433105 431530 430643 430166 429179 426362 421902 418102
56590 418102 417053 418230 419230 418483 416468 414579 413626 413598 414416 416381 419504 422604 423962 423452 423237 425321
56574 425321 428929 431545 432127 431948 432446 433833 436013 439248 443261 446868 449145 450103 449956 448770 447163
56559 447163 446240 446387 447053 447969 449539 451729 453682 454722 454663 453074 449648 445530 442581 440921 438916 436224
56543 436224 434868 436171 438450 439392 439287 440153 442639 445491 447467 448255 447941 446940 446190 446254 446490 445979 444871
56526 444871 443905 443162 442422 442388 444376 448731 454333 459764 464447 468746 473377 478695 484406 490196 496456
56511D96456P274P871P577P573Q926J0658J1322J1617J3334J6247J8346J8910
56499F36111J9050J9215J8638J7626J7884J9713K1078K0326J8093J5626J3027
56488H36387J0167P658N760L576M10l092n943p973r407j0341j1207j2790j5232
56475G87973j7836j9955k1121k0486j7694j4352j2843j3350j3810j3167j2669
56464F10690j3303j4067j3856j3195j2788j1961j0043p983p064p067p031o848
56452D85484o865o718n948n088m972n393n541n177m554l702k684k016j984k009
56438D22833j394k94N39N28n01k128l047k074J07J283O03k06N30J819J496n45
56422D19549k312k489j546j74J699L797M784L722J619P01K191N126P260O897M174
$$ plain form
56511 496456 503730 511601 519178 526751 535677 546335 557657 569274 582608 598855 617201 636111
56499 636111 655161 674376 693014 710640 728524 748237 769315 789641 807734 823360 836387
56488 836387 846554 854212 859972 863548 863958 860866 854923 846950 837543 827202 815995 803205 787973
56475 787973 770137 750182 729061 708575 690881 676529 663686 650336 636526 623359 610690
56464 610690 597387 583320 569464 556269 543481 531520 521477 513494 506430 499363 492332 485484
56452 485484 478619 471901 465953 460865 455893 450500 444959 439782 435228 431526 428842 426826 424842 422833
56438 422833 421439 421145 421684 422212 421711 419583 416536 414462 414569 415852 416455 416249 416779 418598 420094 419549
56422 419549 417237 414748 413202 413028 414727 418524 423308 427030 428649 429350 431541 436667 443927 450824 454998
56407D54998J026j56J501M388N794M689K706J861K013J647O83O32J822K424J275
56392D87303l0N40K357L112K058M41p05j404j735j733k088l280m207l301r69O83
56376D77042N77m16j220j535j165j36L72r23l065l463j420P47R19j33m03L72O80
56359D66830n14k583m041l961k786j910k181l027l460l319k847j725J40J574J424
56344D37614M38K91R99J095R0j014j632k091k208j323J20R65J499L119N514O443
56328D49919N004K962K012J660J016P43J812L716N242N986O106N571M617L998
56314E00364L993L955L345K407J477N43k57o63r74j623k048j191Q70K973M405
56299E17576N137M929L758K773K951L233K076M63Q15L041M524M234L874M436M631
$$ plain form
56407 454998 456024 455868 457369 461757 467551 472240 474946 476807 478820 480467 481150 481782 483604 486028 487303
56392 487303 487273 487813 490170 493282 495340 495781 495076 493672 491937 490204 488116 484836 480629 477328 476359 477042
56376 477042 477619 477203 475983 474448 473283 473147 473519 472596 469531 466068 464648 465395 466314 466181 465778 466150 466830
56359 466830 466316 463733 459692 455731 452945 451035 448854 445827 442367 439048 436201 434476 434616 436190 437614
56344 437614 438052 438343 439342 440437 440527 439513 437881 435790 433582 432259 432379 433344 434843 437962 443476 449919
56328 449919 454923 457885 459897 461557 462573 463316 465128 468844 474086 480072 486178 491749 496366 500364
56314 500364 504357 508312 511657 514064 515541 516084 515827 515164 514190 512567 510519 509328 510198 513171 517576
56299 517576 522713 527642 531400 534173 537124 540357 542433 542896 543711 546752 551276 555510 559384 563820 568451
56284E68451L751L149L526L548K677K849N437Q713J0213R813Q815P684O481O012
56270F51119O803Q036Q790R266R831J0142J0112J0409J1305J2339J3491J4972
56258G76615J5811J4745J2921J3058J5350J6939J6269J4960J4315J3170J0844
56247I34997R087R002Q788O796M403L651M277N176O469P990Q103O411N472P358
56233A027980J0619J3029J5151J8494K2152K4289K5332K6871K8745K9962L1305
56222A273929L4412L9062M3609M7236N0137N2662N5861O1241O8326P4288P7791
56211A878554Q1123Q6693R3749J00811J08641J17989J26885J33666J40725J51722
56201C020558J66393J81492J95541K09333K22824K34985K46161K57615K69049
$$ plain form
56284 568451 572202 575351 578877 582425 585102 587951 593388 602101 612314 622127 630942 638626 645107 651119
56270 651119 657922 665958 674748 684014 693845 703987 714099 724508 735813 748152 761643 776615
56258 776615 792426 807171 820092 833150 848500 865439 881708 896668 910983 924153 934997
56247 934997 944084 953086 961874 968670 973073 976724 981001 986177 992646 1000636 1008739 1015150 1020622 1027980
56233 1027980 1038599 1051628 1066779 1085273 1107425 1131714 1157046 1183917 1212662 1242624 1273929
56222 1273929 1308341 1347403 1391012 1438248 1488385 1541047 1596908 1658149 1726475 1800763 1878554
56211 1878554 1959677 2046370 2140119 2240930 2349571 2467560 2594445 2728111 2868836 3020558
56201 3020558 3186951 3368443 3563984 3773317 3996141 4231126 4477287 4734902 5003951
56192E003951K79000K86844K92158K93234K88719K79461K66292K47441K20912
56183G458012J88046J51925J13697P3396L2842n663m2263p7771j10108j36054
56173G646059j55703j71634j84400j92446j96044j97709j98722j98547j97628
56164E953226j97649j98759j99375j98784j97655j96247j94398j92718j91313
56155D186328j88262j82032j74537j68775j64264j58038j49492j40814j32916
56146B727198j24462j15062j06264r8933r2270q5628p9145p2540o5530n9112n4304
56135A773948n0289m5800m1444l8348l5733l2426k9352k7700k5972k2136j7384
56124A407364j4399j3123j1756j0564j0799j0888q084l348l37K29J084L473N732
$$ plain form
56192 5003951 5282951 5569795 5861953 6155187 6443906 6723367 6989659 7237100 7458012
56183 7458012 7646058 7797983 7911680 7985076 8017918 8012255 7969992 7892221 7782113 7646059
56173 7646059 7490356 7318722 7134322 6941876 6745832 6548123 6349401 6150854 5953226
56164 5953226 5755577 5556818 5357443 5158659 4961004 4764757 4570359 4377641 4186328
56155 4186328 3998066 3816034 3641497 3472722 3308458 3150420 3000928 2860114 2727198
56146 2727198 2602736 2487674 2381410 2282477 2190207 2104579 2025434 1952894 1887364 1828252 1773948
56135 1773948 1723659 1677859 1636415 1598067 1562334 1529908 1500556 1472856 1446884 1424748 1407364
56124 1407364 1392965 1379842 1368086 1357522 1346723 1335835 1327751 1324403 1324066 1324295 1325379 1328852 1334584
56111A334584O959Q238R876J0897J1467J2547J3303J2164J0159R637J0035Q709
56099A458575N696L753L786M195M622O372Q956J0241J0299J1352J3672J5359J6323
56086A573201J8658K2703K6502K9463L3063L7837M3129M9619N8345O7534P4383
56075B034437P9709Q6777R5861J04163J10666J16463J20471J19682J13923J05921
56065C088073R6781Q5987P5471O8328O3321N5847M4625L2339J9744M933j1033
56054C624416k3678l1457l7315m3199m8449n4231o3552p5595q5679r2045r7097
56043B972119j01012j00462r5064q8836q3403p5909o5610n6326n0131m4608l8556
56032B172202l4295l1981k7951k1459j6881j6315j6020j3235j0543j0184r811
$$ plain form
56111 1334584 1341543 1349781 1359657 1370554 1382021 1394568 1407871 1420035 1430194 1439831 1449866 1458575
56099 1458575 1464271 1468024 1471810 1476005 1480627 1486999 1495955 1506196 1516495 1527847 1541519 1556878 1573201
56086 1573201 1591859 1614562 1641064 1670527 1703590 1741427 1784556 1834175 1892520 1960054 2034437
56075 2034437 2114146 2200923 2296784 2400947 2511613 2628076 2748547 2868229 2982152 3088073
56065 3088073 3184854 3270841 3346312 3414640 3477961 3533808 3578433 3610772 3630516 3635449 3624416
56054 3624416 3600738 3569281 3531966 3488767 3440318 3386087 3322535 3246940 3161261 3069216 2972119
56043 2972119 2871107 2770645 2675581 2586745 2503342 2427433 2361823 2305497 2255366 2210758 2172202
56032 2172202 2137907 2105926 2077975 2056516 2039635 2023320 2007300 1994065 1983522 1973338 1963527
56021A963527p401m837l347p39L558O254O142O776J0064J2891J3345J4411J7883
56008B038527K0523K0061J9337K0575K1200J9412J8415K0959K4819K7519L0346
55997B281693L3941L5512L4153L3463L5201L6165L4968L5662M0375M4747M5208
55986B691088M4721M6625M8831M8959M9360N2266N5536N7766O1642O7901P2244
55975C296939P2792P4148P9309Q4428Q6401Q8647R4028R9202J01490J04286J09968
55964D291638J14815J16804J20919J30378J40095J45388J49758J57374J65578
55955E532747J71817J80159J93549K07185K17014K27138K41373K55547K65921
55946G492450K77120K93623L11566L27012L43846L65194L86013M02773M21234
$$ plain form
56021 1963527 1956126 1951289 1947942 1947203 1950761 1957015 1963157 1969933 1979997 1992888 2006233 2020644 2038527
56008 2038527 2059050 2079111 2098448 2119023 2140223 2159635 2178050 2199009 2223828 2251347 2281693
55997 2281693 2315634 2351146 2385299 2418762 2453963 2490128 2525096 2560758 2601133 2645880 2691088
55986 2691088 2735809 2782434 2831265 2880224 2929584 2981850 3037386 3095152 3156794 3224695 3296939
55975 3296939 3369731 3443879 3523188 3607616 3694017 3782664 3876692 3975894 4077384 4181670 4291638
55964 4291638 4406453 4523257 4644176 4774554 4914649 5060037 5209795 5367169 5532747
55955 5532747 5704564 5884723 6078272 6285457 6502471 6729609 6970982 7226529 7492450
55946 7492450 7769570 8063193 8374759 8701771 9045617 9410811 9796824 10199597 10620831
55937A0620831M45730M70399M90390N11484N38923N67538N93555O24886O68085
55928A5531821P16456P63264Q15019Q78739R48057J015800J088270J172328J260776
55919B4190530J346058J436144J540984J655945J774572J903423K046969K193629
55911C8088254K336732K494122K686850K915070L176632L491214L882362M355598
55903F3426834M919946N607329O437128P380268Q389253R441211J0521605J1602019
55895A27725593J2682221J3826225J5110998J6575725J8269734K0292168K2712902
55888B47195566K5523369K8728983L2264997L5443154L6475782L3084951K4168901
55881D62885703J1014594l293092j5758869k4893063l0685212l3755948l4734372
$$ plain form
55937 10620831 11066561 11536960 12027350 12538834 13077757 13645295 14238850 14863736 15531821
55928 15531821 16248277 17011541 17826560 18705299 19653356 20669156 21757426 22929754 24190530
55919 24190530 25536588 26972732 28513716 30169661 31944233 33847656 35894625 38088254
55911 38088254 40424986 42919108 45605958 48521028 51697660 55188874 59071236 63426834
55903 63426834 68346780 73954109 80391237 87771505 96160758 105601969 116123574 127725593
55895 127725593 140407814 154234039 169345037 185920762 204190496 224482664 247195566
55888 247195566 272718935 301447918 333712915 369156069 405631851 438716802 462885703
55881 462885703 473900297 470607205 454848336 429955273 399270061 365514113 330779741
55874C30779741l4134558l2399298k9906949k6986298k3936262k0987739j8258210
55867A44170427j5786490j3600384j1720781j0128819q778779p638277o686827
55860F9830070n889537n205472m614565m110796l678027l295851k959448k671073
55852C7405301k420412k193452j991597j822266j678779j547951j429341j329148
55844B2992355j242552j159340j080093j010529r46506q80307q15606p60974p14237
55835A4382211o67653o22796n86099n54869n21755m88544m62117m40801m17614
55826I619963l93274l73696l58020l40798l22746l08096k94648k77642k60419
55817F690624k50175k45616k39275k29780k21551k14491k04138j90791j79266
$$ plain form
55874 330779741 296645183 264245885 234338936 207352638 183416376 162428637 144170427
55867 144170427 128383937 114783553 103062772 92933953 84155174 76516897 69830070
55860 69830070 63940533 58735061 54120496 50009700 46331673 43035822 40076374 37405301
55852 37405301 34984889 32791437 30799840 28977574 27298795 25750844 24321503 22992355
55844 22992355 21749803 20590463 19510370 18499841 17553335 16673028 15857422 15096448 14382211
55835 14382211 13714558 13091762 12505663 11950794 11429039 10940495 10478378 10037577 9619963
55826 9619963 9226689 8852993 8494973 8154175 7831429 7523333 7228685 6951043 6690624
55817 6690624 6440449 6194833 5955558 5725778 5504227 5289736 5085598 4894807 4715541
55808D715541j70509j61602j52633j45752j39087j29311j18567j11588j07796
55799C478696j03106r7384r3075q8793q1416p2384o5220n9100n1653m5551m5259
55788B675755m9329n2677n4225n5773n6008n2667m8407m7316m7732m5298m1005
55777B125318l9149l9368l7973l5483l5602l7931l8591l7096l6140l5807l4368
55766A717810l3395l5588l8822l8829l6511l6130l7521l6829l3799l1473k9647
55755A329266k5576k0595j8924k0150j9646j6543j4484j4210j2214p729m537m432
55743A150226m541k745o01M11R13Q73q87l643n279o120q242j1117j2269j2008
55729A084971j2936j4973j5647j5148j6043j8022j8009j5833j4706j5502j5506
$$ plain form
55808 4715541 4545032 4383430 4230797 4085045 3945958 3816647 3698080 3586492 3478696
55799 3478696 3375590 3278206 3185131 3096338 3014922 2942538 2877318 2818218 2766565 2721014 2675755
55788 2675755 2626426 2573749 2519524 2463751 2407743 2355076 2306669 2259353 2211621 2166323 2125318
55777 2125318 2086169 2046801 2008828 1973345 1937743 1899812 1861221 1824125 1787985 1752178 1717810
55766 1717810 1684415 1648827 1610005 1571176 1534665 1498535 1461014 1424185 1390386 1358913 1329266
55755 1329266 1303690 1283095 1264171 1244021 1224375 1207832 1193348 1179138 1166924 1159195 1154658 1150226
55743 1150226 1145685 1142940 1142339 1142750 1143663 1144536 1143649 1140006 1134727 1128607 1120365 1109248 1096979 1084971
55729 1084971 1072035 1057062 1041415 1026267 1010224 992202 974193 958360 943654 928152 912646
55718I12646j3535j1575j0601r374q135r005j1918j4395j5955j8350k0983k0755
55706G48065j7423j4494j3806j3560j2585j2076j1967j0173o950n672p621r874
55694F11864j0033r309r401r822j0005j0637j1410j0593q252o818p266p806p421
55681D93091p412q283q348o782n074m219l371k307k233l060k790q34Q85J010K46
55666D40519r50l162n775o939o705p208r011j0218r886r128q203n919k793j276
55652C53346j840k177j312q12r66L56L424N241M347L392M638O309O031M795M668
55637C89440N083M224K242O33n1M3J075K664L613L784M491O005O648N450L531
55622D38875J844o5j896j843M95K832L326K719K060Q43r76j656k69J527K012J689
$$ plain form
55718 912646 899111 887536 876935 867561 859426 850421 838503 824108 808153 789803 768820 748065
55706 748065 730642 716148 702342 688782 676197 664121 652154 641981 635031 629359 621738 611864
55694 611864 601831 592522 583121 573299 563294 552657 541247 530654 522402 515584 508318 500512 493091
55681 493091 485679 477396 469048 462266 457192 452973 449602 447295 445062 442002 439212 438378 439263 440273 440519
55666 440519 439569 436407 430632 423693 416988 409780 400769 390551 380665 371537 363334 357415 354622 353346
55652 353346 351506 349329 348017 347205 346239 346595 350019 355260 359607 362999 367637 373946 379977 384772 389440
55637 389440 394523 398747 400989 401622 401571 401614 402689 405353 408966 412750 417241 423246 429894 435344 438875
55622 438875 440719 440654 438758 436915 437410 440242 443568 446287 448347 449190 448214 446558 446289 447816 449828 451517
55606D51517J485J054M08R54L050M686M367L191K440J447k31r86K22J526Q00j180
55590D74750k440k916l568m081l861l945n646q357j0594j2056j2909j2534j0915
55577C80928r793j0475j1729j1839j1314j1487j1761j0662q679p658p936q131
55565B59464p412o312n618n803p025q459q415o305l720k474k546k900l107k892
55551A86476j497R33K483J669m89j985k404k520k391j565m10K52L71L63L24M02
55535A80012J000J701J312j12p85m3J44j841m316m483k341k99J63n78j967l677
55519A63890m697l983k041m27J81L13N23J008J872K684K426R79k12r8J73j096
55503A61495l427m571l297n26J952K905K204R08L69O61O14k18q37o78o44j283
$$ plain form
55606 451517 453002 454056 454464 455418 458468 463154 467521 470712 473152 474599 474368 473382 473604 475130 475930 474750
55590 474750 472310 469394 465826 461745 457884 453939 448293 439936 429342 417286 404377 391843 380928
55577 380928 371135 360660 348931 337092 325778 314291 302530 291868 283189 275531 267595 259464
55565 259464 252052 245740 240122 234319 227294 218835 210420 204115 200395 197921 195375 192475 189368 186476
55551 186476 184979 185912 188395 190064 189575 187590 185186 182666 180275 178710 178300 178552 178923 179286 179610 180012
55535 180012 181012 182713 184025 183913 183128 183085 183229 181388 177072 172589 170248 169949 170112 169534 167567 163890
55519 163890 159193 155210 153169 152742 152923 153236 153759 154767 156639 159323 161749 162728 162516 162418 162591 161495
55503 161495 158068 153497 150200 149674 151626 154531 156735 157643 158012 158673 159287 159069 158232 157554 156910 155627
55487A55627j499m16R21J249J091J438J772J273Q67J936L851M715M099L205K839
55472A82968K873L248L892M063L264K333K284K669K469J866J592J247l3j760k654
55457B10321k640k749l325l811l986m147m345m601n385o859q278r063r483r335
55443A32314p441l943j473k025l990m536l711l565m193l669j590J51L24l98j251
55428I1004k149k488j548m31j187l605m991l803j466P2N84N75j6j052j599j202
55412F6698n68l13k13j78o50j405j310j00Q73N18l79m11M57J044O09m50j263j366
55394F1593r75n54j86L32P42L42q00j613j678j941k762k613m01K141K514J111
55378E5252L87Q59O10j122k586k384j375q04n50j82L5O4M76J127J116O52J102
$$ plain form
55487 155627 154128 153712 154633 155882 156973 158411 160183 161456 162323 164259 168110 172825 176924 180129 182968
55472 182968 185841 189089 192981 197044 200308 202641 204925 207594 210063 211929 213521 214768 214735 212975 210321
55457 210321 207681 204932 201607 197796 193810 189663 185318 180717 175332 168473 160195 151132 141649 132314
55443 132314 124873 120930 119457 117432 113442 108906 105195 101630 97437 93768 92178 92329 92653 92255 91004
55428 91004 88855 86367 84819 84388 83201 79596 74605 70802 69336 69408 69992 70567 70551 69499 67900 66698
55412 66698 66130 65817 65604 65426 64776 63371 62061 61961 62834 63352 62973 62562 63019 64063 64672 64222 62959 61593
55394 61593 60618 60064 59878 60210 60952 61294 60494 58881 57203 55262 52500 49887 49486 51627 54141 55252
55378 55252 55639 56498 57108 55986 53400 51016 49641 48837 48287 48105 48140 48204 48680 49807 50923 51575 52677
55361E2677K397K430K65k047k270q75M59J474K614L092J951J76m11J32J17j074
55345F1107k358k836k632j860l82J187J735J254J010J678K447K440J915J389N15
55330F6609j200l153m054l478k137p56N39J555J645O26n14o29L0J58p26j651j720
55313E1144j251r32p18l77k90p21r79m54Q8m13j281q62P74J590N19r30q50M69
55295D4526J259O74n77j494j662j099j38N90O86N17Q26J781K666K548J209n43
55279E1769j517j286o11m76r06j220j189j219j446j462j086o83m27mO51R94P28
55262D0610L29J92j32j159k390k807k298j781j885k093j426M49K861M697N152
55247C8319M179K456Q41k74j027j588j717j089K9P76N93j50p10q76q86p35k37
$$ plain form
55361 52677 55074 57504 57769 55722 53452 52577 53036 54510 57124 60216 62167 62343 61932 62064 62181 61107
55345 61107 58749 55913 53281 51421 51039 52226 53961 55215 56225 57903 60350 62790 64705 66094 66609
55330 66609 65409 62256 58202 54724 52587 51831 52370 53925 55570 56196 55682 55053 55083 55241 54515 52864 51144
55313 51144 49893 48961 48243 47866 47576 46855 45876 45422 45510 45097 43816 42954 43728 45318 45837 44907 44057 44526
55295 44526 45785 46459 45882 44388 42726 41627 41489 42079 42765 43282 44108 45889 48555 51103 52312 51769
55279 51769 50252 48966 48355 47879 46973 45753 44564 43345 41899 40437 39351 38668 38241 38237 38888 39882 40610
55262 40610 40939 41131 40999 39840 37450 34643 32345 30564 28679 26586 25160 25609 28470 33167 38319
55247 38319 42498 44954 45795 45521 44494 42906 41189 40100 40129 40905 41498 41348 40638 39762 38876 38141 37904
55230C7904L61N89P26J627L184L804K206p93l000l071j505K15R41N62j7K43J279
55213D5255J877J154k98j232j162m95K48O84M24n26j449j549q03K01R47J141P40
55196D5157K29L77J186J715J483J265J751K156J239p48k126j628M77K805L790
55181E9128K705M22j293j673j492j387q66K54Q39J93n22k29r2j688l887l962j546
55164D4904Q45J382Q95Q66J428K023K470K544J679j23j900k682k221p51J111K343
55148E4813K326J565Q81K32o19r84k33O86M23n03n22K42K18o55n89J022K425K113
55130F2841P48k99o37l73L93R19K34j177j719j151r12j395j131M55J655J242N97
55113F0290J361K586K176Kk132k875k180n52J168J867J220K29j28j16m54j179
$$ plain form
55230 37904 38265 38854 39580 41207 44391 48195 50401 49608 46608 43537 42032 42247 43188 43750 43733 43976 45255
55213 45255 47132 48286 47988 46756 45594 45099 45347 46031 46455 45929 44480 42931 42128 42329 43276 44417 45157
55196 45157 45386 45763 46949 48664 50147 51412 53163 55319 56558 55810 53684 52056 52533 55338 59128
55181 59128 61833 62255 60962 59289 57797 56410 55544 55798 56637 56830 56308 56079 55987 54299 50412 46450 44904
55164 44904 45749 47131 48026 48892 50320 52343 54813 57357 59036 58913 57013 54331 52110 51359 52470 54813
55148 54813 57139 58704 59585 59817 59198 58214 57981 58667 59090 58587 58065 58307 58525 57870 57281 58303 60728 62841
55130 62841 63589 63290 62653 62280 62673 63592 63826 62649 60930 59779 58867 57472 56341 56796 58451 59693 60290
55113 60290 61651 64237 66413 66415 64283 61408 59228 58676 59844 61711 62931 63160 63032 62916 62462 61283
55097F1283k038l045l823l465j933n69k64k44M65J497K051K160J916P07j504l196
55081D9998l037j754r44p97l70N72J376J740J936K105K142J979J410L45m64O4
55065E6301J569K241J187n18j712k448k632j381R49K132J198K73J362L085K990
55050F4596J521R27J457J505Q82R19J608J430J22q56p83l90R8J363L126L972L468
55033H4965K584J794P16k07K77J976L109K946K675K950K692J281j1o1K73k00q58
55016A06901l41J110J917J344K17l67k20M5j44o24o26J69J005R60J81n51j121
54999A09855j851k293j618k47L31l94j333j528j213q75m97k85p91j786k135j502
54983I1838j035j611k415k139p70O08J124O32m50j217r16L2L18m71j215r00L6
$$ plain form
55097 61283 59245 56200 52377 48912 46979 46410 46146 45902 46367 47864 49915 52075 53991 54698 53194 49998
55081 49998 46961 45207 44263 43466 43096 43668 45044 46784 48720 50825 52967 54946 56356 56701 56237 56301
55065 56301 57870 60111 61298 60780 59068 56620 53988 52607 53556 55688 56886 57159 58521 61606 64596
55050 64596 66117 67044 68501 70006 70888 71807 73415 74845 74967 74111 73328 72938 73036 74399 77525 81497 84965
55033 84965 87549 89343 90059 89852 90129 92105 95214 98160 100835 103785 106477 107758 107747 107686 107959 107759 106901
55016 106901 106560 107670 109587 110931 111148 110781 110561 110606 110462 109838 109212 109381 110386 111346 111527 110976 109855
54999 109855 108004 105711 104093 103846 104177 103783 102450 100922 99709 98834 98337 98052 97261 95475 93340 91838
54983 91838 90803 89192 86777 84638 83868 84476 85600 86232 85782 84565 83649 83681 83999 83528 82313 81413 81449
54966H1449O69R34J140J014K36o22o82M4Q93J597K279K685K387J629J215J460
54950I8327J920K196K385K519K120P78r61j794r35R32K335K524J920J148M37J75
54934A16026J065K905L993K824K1k487l671l753k950j480m96j147k475k080N94
54919A06889L277L960L172K295J333j58j327j042J66R32J244K050L081K964J682
54904A30518J165K645M811N492M401L206L305M447N561O158O559P078P646Q331
54890B01323R678J1898J4089J5056J4927J5014J5674J5373J2657Q392M835K800
54878C41716R24k100n760q728j0760j2616j4447j5291j4496j2890j1885j1721
54866B21946j1262r691p684o481o191n688m057j610N84J689J534N95j66J58J695
$$ plain form
54966 81449 82118 83052 84192 85206 85442 84820 84138 84182 85075 86672 88951 91636 94023 95652 96867 98327
54950 98327 100247 102443 104828 107347 109467 110245 109284 107490 106555 107487 109822 112346 114266 115414 115851 116026
54934 116026 117091 119996 123989 126813 126834 124347 120676 116923 113973 112493 111997 110850 108375 106295 106889
54919 106889 110166 114126 117298 119593 120926 120768 119441 118399 118565 119497 120741 122791 125872 128836 130518
54904 130518 131683 134328 139139 144631 149032 152238 155543 159990 165551 171709 178268 185346 192992 201323
54890 201323 211001 222899 236988 252044 266971 281985 297659 313032 325689 334081 338916 341716
54878 341716 342640 340540 334780 326052 315292 302676 288229 272938 258442 245552 233667 221946
54866 221946 210684 200993 193309 186828 180637 174949 170892 169282 169866 171555 173089 173684 173518 173676 175371
54851A75371L703N396O658P811Q937R730J0027J0244J1035J2453J3567J3259J1472
54838B99663R308P652O049L370o43m958q309j0217j1086j1708j2649j3829j4628
54825B38015j4650j4218j3882j3607j2832j1173q792o246m239l186k725j971o65
54812A29829L69L52l63q63p66j44J036K434K907J683l69j682j939j924j877j474
54796A27209j283k449m727o297o123n009l875k462o61M42Q9o07p8J365J971J001
54780I8506m02q78l77R4k21j084j573j126j88K96J3n10o61j65J117K944M280M039
54762A04104K560J408J413J853J870J645J600J560J457J868K922L565K969K016
54748A32810K202L543M746N131N289N919P064Q544J0197J1502J1774J1057J0336
$$ plain form
54851 175371 179074 184470 191128 198939 207876 217606 227633 237877 248912 261365 274932 288191 299663
54838 299663 308971 316623 322672 326042 325399 320441 312132 301915 290829 279121 266472 252643 238015
54825 238015 223365 209147 195265 181658 168826 157653 148861 142615 138376 135190 132465 130494 129829
54812 129829 130198 130550 130187 129324 128558 128414 129450 131884 134791 136474 136105 134423 132484 130560 128683 127209
54796 127209 125926 123477 118750 112453 106330 101321 97446 94984 94323 94765 94854 94247 94169 95534 97505 98506
54780 98506 98104 97226 96849 96943 96722 95638 94065 92939 92751 93047 93060 92550 91889 91724 92841 95785 100065 104104
54762 104104 106664 108072 109485 111338 113208 114853 116453 118013 119470 121338 124260 127825 130794 132810
54748 132810 135012 138555 143301 148432 153721 159640 166704 175248 185445 196947 208721 219778 230114
54735B30114J0498J1397J2143J2157J1787J1865J2690J3552J3416J1850R025N205
54723C65699R22k660m627n656p290r565j0645r466p552p097q157q991q549p300
54709B69066o028n107m827n129m948l034K17K760L229K460K113K443K295J156
54695B56666K43J159L973P273R995J2399J4783J6212J5522J3269J1353J0603R882
54682C83332P999N324K776J76l284p467j1148j3375j4295j4650j4943j5038j4464
54669B90943j3207j2165j2208j2800j2356j0271p817o587o722p096o567m700j981
54656A76466K37P57j04r06j075j436k355k761j771r8J095J575J368P0j912k659
54640A66491j008J439K210J188K80N12J165J442J252N17p64j835j861j127m20
$$ plain form
54735 230114 240612 252009 264152 276309 288096 299961 312651 326203 339619 351469 360494 365699
54723 365699 366621 363961 359334 353678 346388 336823 326178 316712 309160 302063 293906 284915 276366 269066
54709 269066 263038 257931 253104 247975 243027 239993 240210 242970 246199 248659 250772 253215 255510 256666
54695 256666 256909 258068 262041 269314 279309 291708 306491 322703 338225 351494 362847 373450 383332
54682 383332 391331 396655 399431 399607 396323 388856 377708 364333 350038 335388 320445 305407 290943
54669 290943 277736 265571 253363 240563 228207 217936 210119 203532 196810 189714 183147 178447 176466
54656 176466 176703 177460 177356 176450 175375 173939 171584 168823 167052 166954 168049 169624 170992 171062 169150 166491
54640 166491 165483 166922 169132 170320 170600 171112 172277 173719 174971 175488 174724 172889 171028 169901 169481
54625A69481K64J070J074m85k357k482q19R44J999K730K767J362k96N5K167L298
54609A80772K575K535M896P628Q114O927O057N264K961l35k116j154J471M286
54595B29881O470P239O144M203L222L624M141L759K801J937J244O27K55K72O40
54580B76459J369K447L626M687N638O098N190K997J484K502N142O538N474L649
54566C33300K884K626J122j933n195p452q599r082r207r064q518p288n397l507
54552B64690k459k545l326l985l649j893N48J907R83j339k722j814M94K351K967
54537B50208K828K363J239p59k801l610k889j728j411k104k958l354l583m216
54523B27225n170n789n751n354m921m414l936l971m649n200m900m206m085m433
$$ plain form
54625 169481 169745 170815 171889 171404 169047 166565 165746 166690 168689 171419 174186 175548 175252 175307 177474 180772
54609 180772 183347 185882 190778 198406 206520 213447 219504 224768 227729 227394 225278 224124 225595 229881
54595 229881 236351 243590 249734 253937 257159 260783 264924 268683 271484 273421 274665 275292 275547 275819 276459
54580 276459 277828 280275 283901 288588 294226 300324 305514 308511 309995 312497 317639 324177 329651 333300
54566 333300 336184 338810 339932 337999 332804 325352 316753 307671 298464 289400 280882 273594 268197 264690
54552 264690 262231 259686 256360 252375 248726 246833 247381 249288 250271 248932 246210 244396 244890 247241 250208
54537 250208 253036 255399 256638 255879 253078 249468 246579 244851 243440 241336 238378 235024 231441 227225
54523 227225 222055 216266 210515 205161 200240 195826 191890 187919 183270 178070 173170 168964 164879 160446
54509A60446m208l241k600k751k703j793j181k167l874m202k719j007j55M71J520
54494A29836K251J749N09j53K41J048J496J325P51L36O74J686K447K046N57j047
54478A45752j788j340j45R41J368J399J599J943K037K120K939M221M403K630L35
54463A68414k59J228L133M029M053L883L389J905n31k755l355j955K65J422N64
54448A83430j587l576m681n136n246m846l760k300j114o94j087j877k306j755
54434A43465k90J235J828J289N71R97K801M544M422K242l05j416p04J089L052
54419A64820M270L929K324J281K411M955O464N637L540J769P32K42O16K075L719
54404B08784M318L847L286L046K572J496K43o78j202j400j362j539k376l368l394
$$ plain form
54509 160446 156238 152997 150397 147646 144943 143150 141969 139802 135928 131726 129007 128000 127845 128316 129836
54494 129836 132087 133836 134345 134192 134433 135481 136977 138302 139053 139389 140063 141749 144196 146242 146799 145752
54478 145752 143964 142624 142479 143420 144788 146187 147786 149729 151766 153886 156825 161046 165449 168079 168414
54463 168414 168155 169383 172516 176545 180598 184481 187870 189775 189244 186489 183134 181179 181444 182866 183430
54448 183430 181843 178267 173586 168450 163204 158358 154598 152298 151184 150490 149403 147526 145220 143465
54434 143465 143175 144410 146238 147527 148098 149095 151896 156440 160862 163104 162799 161383 160679 161768 164820
54419 164820 169090 173019 175343 176624 179035 183990 190454 196091 199631 201400 202132 202374 202990 205065 208784
54404 208784 213102 216949 220235 223281 225853 227349 227592 226914 225712 224312 222950 221411 219035 215667 212273
54389B12273k490k303l943o082o299l949p48J258J405K47j261k135j897j141j023
54374A81912j949l190l863l665k587p92R52J602J122O98J184K016K264K009J806
54359A79519J393O1j838k785j688R33L542M876M693L756L126L155L203K680K089
54344B06715K437L664M434L818K566K164K923L679L538L203L863N062M813K330
54330B55209l93q30R25K531K583J818J143K88j021k163k854l834n264n748m314
54315B38076k190j273j805k871m105n218n018k883n69m04k130l575m030m589n317
54300A92099m698k432m78l40j295k042k398k434j798q88j080k594l559k415K7
54285A63675J968K806K894K408J714J792L002M350N034N569O411O566M983K366
$$ plain form
54389 212273 209783 207480 203537 197455 191156 187207 186459 187717 189122 189369 188108 185973 184076 182935 181912
54374 181912 179963 176773 172910 169245 166658 165866 166818 168420 169542 170240 171424 173440 175704 177713 179519
54359 179519 180912 180973 179135 176350 174662 175595 179137 184013 188706 192462 195588 198743 201946 204626 206715
54344 206715 209152 212816 217250 221068 223634 225798 228721 232400 235938 239141 243004 248066 252879 255209
54330 255209 254816 253986 254911 257442 260025 261843 262986 263274 262253 260090 257236 253402 248138 242390 238076
54315 238076 235886 234613 232808 229937 225832 220614 215596 212713 212144 211740 209610 206035 202005 197416 192099
54300 192099 187401 184969 184491 184151 182856 180814 178416 175982 174184 173296 172216 169622 166063 163648 163675
54285 163675 165643 168449 171343 173751 175465 177257 180259 184609 189643 195212 201623 208189 213172 215538
54271B15538K81o65o02O14K704M144L551J372j082l417n705p166p103o387o266
54256A89811o268n080l111k193k874l898m432m913n456n247m060k840k225j732
54242A35482r70m50o66j346k125l006l732l637k568j243l47J50O78J648L227M743
54226A25838M686K343p55k304j996j461j629j772j365j035j098q04K33J269J869
54211A22019K677L934M566L838K549J626P65k78m35J022K726K877J951J825K704
54196A54366K940J894J026J489K262J680j79j685j777j083q81j485k003j656j011
54181A53897j307k590l305k284l65O99M45j39k80j45J2L28P20O54o0q54j116q32
54163A43478l00K90P81R60Q17N37J66l82q56o76K97J331J513P33k03l59M33J358
$$ plain form
54271 215538 215819 215154 214552 215166 217870 222014 225565 226937 225855 222438 216733 209567 202464 196077 189811
54256 189811 183543 178463 175352 173159 170285 166387 161955 157042 151586 146339 142279 139439 137214 135482
54242 135482 134512 134062 133396 132050 129925 126919 123187 119550 116982 115739 115392 115542 116220 117868 121095 125838
54226 125838 130524 132867 132112 129808 127812 126351 124722 122950 121585 120550 119452 118648 118881 120150 122019
54211 122019 124696 128630 133196 137034 139583 141209 141974 141696 141261 142283 145009 147886 149837 151662 154366
54196 154366 157306 159200 160226 161715 163977 165657 165478 163793 162016 160933 160052 158567 156564 154908 153897
54181 153897 152590 150000 146695 144411 144046 144745 145190 145051 144771 144626 144638 144966 145686 146340 146280 145426 144310 143478
54163 143478 143178 143468 144249 145209 146026 146563 146729 146347 145491 144815 145112 146443 147956 148689 148486 148127 148560 149918
54145A49918J356L06p58r11n94r41j931k090n02J527J634q14l734m420k404J31
54129A35773P40q44k862l762l527k778j656k97L40o04k458l665l780l584l232
54114A03804j727J151L747M369L185J381n18k391l528l402k828k816k739j268
54100I6420J088K274J608N96M80P39O89P51J125R08k00p79K24J475J088m54j102
54083A06930l47L63L2q49j609k087j937q56L94P32N98J420L094L725K370K32j474
54066A10731k913m023l508r37J720K317J258L94J94k05r40j180p20k04Q4L55L81
54049A02804k54j225j915k445k981k522n9L180M501L043P21n15p08p07n63j44
54033A00211k7o42j343j326p40j10O75J876K995L272K663J685O07m67j201j380
$$ plain form
54145 149918 151274 151580 150822 149911 149317 148376 146445 144355 143853 145380 147014 146200 142466 138046 135642 135773
54129 135773 136513 135669 132807 129045 125518 122740 121084 120787 121127 120523 118065 114400 110620 107036 103804
54114 103804 102077 103228 106975 111344 114529 115910 115392 113001 109473 106071 103243 100427 97688 96420
54100 96420 97508 99782 101390 101986 102466 103205 103894 104645 105770 106678 106478 105699 105923 107398 108486 108032 106930
54083 106930 106583 106946 106978 106129 104520 102433 100496 99640 100034 100766 101364 102784 105878 109603 111973 112205 110731
54066 110731 107818 103795 100287 99350 101070 103387 104645 105039 105233 105028 104088 102908 102188 101984 102068 102423 102804
54049 102804 102550 101325 99410 96965 93984 91462 91403 94583 99084 102127 102848 102333 101625 100918 100355 100211
54033 100211 100184 99542 98199 96873 96133 96023 96698 98574 101569 104841 107504 109189 109796 109329 108128 106748
54017A06748j313j277j014m21j60o31q08P81L804O034N788L656J480L31k5k90
54001A22683p68j138o59J122L540M946M219K015J08l98K31J327K643L949M562
53986A48382M048K978K194J566M83n26P5K579N055N490M243L335L819M912N542
53971A94175N529N255N062N308O062O596O028M881N006P239R795R983P331M099
53957B82349K672L184M018L987L324K737K352J976J710J645J299K59q52j060p15
53942C08885j240k874m000l509k495k492l162l177k571k512l306m254n030n462
53928B62801m457j358J827K035o52k912l063l371n948q765q278m563j179m56j302
53913B20359j698j383j383k100k668j857N11K882L259J538j96l01M08J93r74j621
$$ plain form
54017 106748 105435 104158 103144 102723 102563 101932 101124 101905 105709 111743 117531 121187 122667 122998 122973 122683
54001 122683 121915 120777 120118 121240 124780 129726 133945 135960 136068 135670 135901 137228 139871 143820 148382
53986 148382 152430 155408 157602 159168 159651 159125 159200 161779 166834 172324 176567 179902 183721 188633 194175
53971 194175 199704 204959 210021 215329 221391 227987 234015 238896 243902 251141 260936 270919 278250 282349
53957 282349 285021 288205 292223 296210 299534 302271 304623 306599 308309 309954 311253 311512 310660 309600 308885
53942 308885 307645 304771 300771 297262 294767 292275 289113 285936 283365 280853 277547 273293 268263 262801
53928 262801 258344 256986 258813 260848 260196 257284 254221 250850 244902 236137 227859 223296 222117 221661 220359
53913 220359 218661 217278 215895 213795 211127 209270 209781 212663 215922 217460 217264 216963 217371 217564 216590 214969
53897B14969r27P23K800M709N230L611J165J83J106K216K379K450L510N179O479
53882B55782P197P491P174O344N985O888Q424R222Q873Q311Q661J0167J2009J2851
53868C75379J1785R053N740K778O17l66K3R63R40n37k112k205r25L22P27O64P10
53851D03556J022J778L320N376O849O940O328O546Q069R504R128O921M550L290
53837D83177K707J732K95r48k021l511n102n508m390l280l741n296o265o207o377
53822D35265p678r187r286p673n697m923n790p557r159r929r827r285q909r063
53808C21302r587r921r631q733p507o264n316m864m705m401m124m806o706q314
53794B26423p760n287l185k961l796m234m149l968l129r44J497J995J04k097k545
$$ plain form
53897 214969 214042 214765 217565 222274 227504 231115 232280 232463 233569 235785 238164 240614 244124 249303 255782
53882 255782 262979 270470 277644 283988 289973 296861 305285 314507 323380 331691 340352 350519 362528 375379
53868 375379 387164 396217 401957 404735 405352 404986 405009 405972 406912 406375 404263 402058 401133 401455 402182 402846 403556
53851 403556 404578 406356 409676 415052 421901 428841 435169 441715 449784 459288 468416 475337 479887 483177
53837 483177 485884 487616 487911 486963 484942 481431 476329 470821 466431 463151 459410 454114 447849 441642 435265
53822 435265 427587 418400 409114 401441 395744 390821 385031 377474 368315 358386 348559 339274 330365 321302
53808 321302 311715 301794 292163 283430 275923 269659 264343 259479 254774 250373 246249 241443 234737 226423
53794 226423 218663 213376 210191 207230 203434 199200 195051 191083 187954 187010 188507 190502 190606 188509 185964
53779A85964j367n2N19L85k47j078j474j149p70j117j782j638o19Ln38j252o33
53762A73155J300L018L307K362J167M60N72J541K843L395K562J075L10O18J059
53747A98744R89J048K000L251L551K847K335K644L141L386M054N609P068P187
53733B47854O338N940O367O671O415O353O953P416O856N629M617L956L199K235
53719C26799J274L31n33q04k51K02p01k845m635m775l562k331k173l283m944n880
53703B91889n250l607k533l002m404n324m896l343j622q28j423k690l271k629
53689B47067j733j862k982l802l452k510k045k103j705m11Q46R51J88j54L08N48
53673B27149k32j376j879j822j794j542m17J218K267K442K301J930J013K80J171
$$ plain form
53779 185964 184597 184545 185064 185449 185202 184124 182650 181501 180731 179614 177832 176194 175575 175578 175040 173788 173155
53762 173155 174455 177473 180780 183142 184309 184769 185341 186882 189725 193120 195682 196757 197067 197685 198744
53747 198744 199733 200781 202781 206032 209583 212430 214765 217409 220550 223936 227990 233599 240667 247854
53733 247854 254192 260132 266499 273170 279585 285938 292891 300307 307163 312792 317409 321365 324564 326799
53719 326799 328073 328404 327871 327067 326816 327018 326317 323472 318837 314062 310500 308169 305996 302713 297769 291889
53703 291889 286639 283032 280499 277497 273093 267769 262873 259530 257908 257080 255657 252967 249696 247067
53689 247067 245334 243472 240490 236688 233236 230726 228681 226578 224873 224462 225308 226259 226447 226293 226601 227149
53673 227149 226917 225541 223662 221840 220046 218504 218087 219305 221572 224014 226315 228245 229258 229538 230709
53658B30709L511N088M452K829K189K699L292L631L872L401J729J60N47K278K572
53643B72959K97k251k346j90J949K887L234L533L370K564J989K443L422L684K834
53628C00378J713J206J200Q99j4q28m84J310L565M698L909K130J315K461M423
53613C27881N088L754J834J155K009L150L221J865k40j946k397j592k80Q50J549
53598C45901J661Q72o85k049k276j545r25j116j893k703l221l168k160j55K142
53583C28680L592L485K030K30p50k70J303K653K388L37k015k888k129j196r52
53568C34498l74J629L952M260K100m67j511j036K55K305M751O023M948K526R00
53553C64759J021K323L996N291N260L763K457L313O044Q383Q836P955O963O578
$$ plain form
53658 230709 234220 239308 243760 246589 248778 251477 254769 258400 262272 265673 267402 267562 268109 270387 272959
53643 272959 273256 271005 268659 268469 270418 273305 276539 280072 283442 286006 287995 290438 293860 297544 300378
53628 300378 302091 303297 304497 305396 305382 304554 304070 305380 308945 313643 317552 319682 320997 323458 327881
53613 327881 332969 336723 338557 339712 341721 344871 348092 349957 349717 347771 345374 343782 343502 344352 345901
53598 345901 347562 348434 347749 345700 343424 341879 340954 339838 337945 335242 332021 328853 326693 326538 328680
53583 328680 332272 335757 337787 338017 337267 336997 338300 340953 343341 343678 341663 338775 336646 335450 334498
53568 334498 334124 335753 339705 343965 346065 345598 344087 343051 343306 345611 350362 356385 361333 363859 364759
53553 364759 365780 368103 372099 377390 382650 386413 388870 392183 398227 406610 415446 423401 430364 436942
53539D36942P300R127J0558R529O188L334L120M476M981M239L920N114P125Q756
53525E24709R402Q767O780M236K708L122M668N568M761K679N24q63j378j165k24
53510E74294J202K217J895N48k80N02K225L304L200K860L324M490N432N563N074
53495F15850M510M275M418M630M524M197M392N641P258P874P257O860P836R149
53481F98671Q859P021N818O528P879Q251Q162R131J1012J2139J1918J1505J1792
53468H18686J2242J2344J2810J4317J5935J6059J4593J3144J2972J3645J4049
53457I70796J4172J5100J7304J9647K0626K0303K0261K1588K3589K4881K5107
53446A193374K4995K5168K5672K6406K7324K8353K9737L2165L5776L9125M0192
$$ plain form
53539 436942 444242 453369 463927 473456 479644 482978 486098 490574 495555 499794 503714 508828 515953 524709
53525 524709 534111 542878 549658 553894 556602 559724 564392 569960 574721 577400 577924 577061 575683 574518 574294
53510 574294 575496 577713 579608 580156 579876 580378 582603 585907 589107 591967 595291 599781 605213 610776 615850
53495 615850 620360 624635 629053 633683 638207 642404 646796 652437 659695 667569 674826 681686 689522 698671
53481 698671 707530 714551 720369 726897 734776 743027 751189 760320 771332 783471 795389 806894 818686
53468 818686 830928 843272 856082 870399 886334 902393 916986 930130 943102 956747 970796
53457 970796 984968 1000068 1017372 1037019 1057645 1077948 1098209 1119797 1143386 1168267 1193374
53446 1193374 1218369 1243537 1269209 1295615 1322939 1351292 1381029 1413194 1448970 1488095 1528287
53435A528287L8662L6489L5873L7250L9568M1772M3409M4230M4035M3107M2219
53424A974901M1839M1534M0622L9393L8993L9762M0346L9393L7563L6604L6683
53413B407633L6324L5145L4632L5288L5113L2501K9062K7467K7643K7338K5580
53402B753726K3122K0054J5658J0816P729O586M968J547j903l540m459o949j1099
53389B816256j5066j7802j9880k2017k4111k5613k6083k5643k5363k6608k9542
53378B558528l2895l5475l7072l7577l6566l4460l2863l2700l2940l2159l0450
53367B183371k8815k7648k6828k6399k5975k4325k0780j6405j2632r498o433l944
53355A953689k804k228o19J976L917M624N520P879J1084J3799J5875J8251K1455
$$ plain form
53435 1528287 1566949 1603438 1639311 1676561 1716129 1757901 1801310 1845540 1889575 1932682 1974901
53424 1974901 2016740 2058274 2098896 2138289 2177282 2217044 2257390 2296783 2334346 2370950 2407633
53413 2407633 2443957 2479102 2513734 2549022 2584135 2616636 2645698 2673165 2700808 2728146 2753726
53402 2753726 2776848 2796902 2812560 2823376 2831105 2837691 2842659 2844206 2842303 2838763 2834304 2827355 2816256
53389 2816256 2801190 2783388 2763508 2741491 2717380 2691767 2665684 2640041 2614678 2588070 2558528
53378 2558528 2525633 2490158 2453086 2415509 2378943 2344483 2311620 2278920 2245980 2213821 2183371
53367 2183371 2154556 2126908 2100080 2073681 2047706 2023381 2002601 1986196 1973564 1964066 1957633 1953689
53355 1953689 1950885 1948657 1948038 1950014 1953931 1958555 1964075 1971954 1983038 1996837 2012712 2030963 2052418
53342B052418K5035K8339L1294L4231L7162L9657M1621M3822M6852M9860N1381
53331B481672N1624N2677N5858N9913O2818O4393O5954O8182P0625P2903P5100
53320C181719P6995P8011P7968P7308P6596P6182P6108P5872P4731P2746P0895
53309D015131O9686O8295O5664O1666N6620N0659M4385L8971L4562K9633K3077
53298D558349J5805Q901J647o745j4753k0411k4760l0728l8685m5953n0862n4608
53286D297197n8337o1216o2668o4110o6666o8995o9433o9052p0329p3351p5306
53275C557734p3967p0307o7247o6523o7193o6854o4197o0288n7283n6061n5603
53264B852211n4490n2335m9674m7237m5496m4262m2632l9889l6481l3415l0786
$$ plain form
53342 2052418 2077453 2105792 2137086 2171317 2208479 2248136 2289757 2333579 2380431 2430291 2481672
53331 2481672 2533296 2585973 2641831 2701744 2764562 2828955 2894909 2963091 3033716 3106619 3181719
53320 3181719 3258714 3336725 3414693 3492001 3568597 3644779 3720887 3796759 3871490 3944236 4015131
53309 4015131 4084817 4153112 4218776 4280442 4337062 4387721 4432106 4471077 4505639 4535272 4558349
53298 4558349 4574154 4583055 4584702 4577957 4563204 4542793 4518033 4487305 4448620 4402667 4351805 4297197
53286 4297197 4238860 4177644 4114976 4050866 3984200 3915205 3845772 3776720 3706391 3633040 3557734
53275 3557734 3483767 3413460 3346213 3279690 3212497 3145643 3081446 3021158 2963875 2907814 2852211
53264 2852211 2797721 2745386 2695712 2648475 2602979 2558717 2516085 2476196 2439715 2406300 2375514
53253B375514k7944k5054k3247k2875k2748k1702j9959j8419j7397j6616j5743
53242B143810j4336j1929q685n496l049j251L16K072M558P957J1347J3498J4677
53229B153489J6511J9671K2946K5102K6491K7972K9471L0635L1886L3740L5746
53218B453660L7185L8205L9379M0657M1484M1354L9721L6308L2322L0100L0305
53207B860680L0512K8079K3595J9598J6627J2750P092J491k091m172o608j0217
53195B977336j4491j8713k2168k4009k4149k4051k5521k8713l2089l4375l5692
53184B693365l6776l7864l8838l9735m0504m0705m0141l9393l9026l8502l6915
53173B264966l4826l4025l4950l5627l4236l1808l0805l1570l1876l0092k7158
$$ plain form
53253 2375514 2347570 2322516 2299269 2276394 2253646 2231944 2211985 2193566 2176169 2159553 2143810
53242 2143810 2129474 2117545 2108860 2103364 2100315 2099064 2099380 2101452 2106010 2113967 2125314 2138812 2153489
53229 2153489 2170000 2189671 2212617 2237719 2264210 2292182 2321653 2352288 2384174 2417914 2453660
53218 2453660 2490845 2529050 2568429 2609086 2650570 2691924 2731645 2767953 2800275 2830375 2860680
53207 2860680 2891192 2919271 2942866 2962464 2979091 2991841 2998933 3000424 2998333 2994161 2987553 2977336
53195 2977336 2962845 2944132 2921964 2897955 2873806 2849755 2824234 2795521 2763432 2729057 2693365
53184 2693365 2656589 2618725 2579887 2540152 2499648 2458943 2418802 2379409 2340383 2301881 2264966
53173 2264966 2230140 2196115 2161165 2125538 2091302 2059494 2028689 1997119 1965243 1935151 1907993
53162A907993k4864k3579k2493k1128j9674j8312j7030j5862j4819j3947j3598
53151A702687j4085j4866j4795j3622j2544j2712j3834j4849j5326j5595j5910
53140A544549j6117j5939j5260j4490j4667j6440j8721j9347j7688j5653j5354
53129A364873j6652j7942j8496j8834j9370j9944k0454k0870k0787j9976j9279
53118A152269j9963k2108k4376k5460k5144k4003k2768k1971k1662k1410k0854
53107I02550k0075j9150j7931j6669j6114j6395j6483j5761j5229j5928j6881
53096G15934j6197j3910j1928j1185j0697r782r349j0121j1092j0956j0012r529
53084E81176r943j0663j1124j1004r977q144o379n354m592l395k352k854n080
$$ plain form
53162 1907993 1883129 1859550 1837057 1815929 1796255 1777943 1760913 1745051 1730232 1716285 1702687
53151 1702687 1688602 1673736 1658941 1645319 1632775 1620063 1606229 1591380 1576054 1560459 1544549
53140 1544549 1528432 1512493 1497233 1482743 1468076 1451636 1432915 1413568 1395880 1380227 1364873
53129 1364873 1348221 1330279 1311783 1292949 1273579 1253635 1233181 1212311 1191524 1171548 1152269
53118 1152269 1132306 1110198 1085822 1060362 1035218 1011215 988447 966476 944814 923404 902550
53107 902550 882475 863325 845394 828725 812611 796216 779733 763972 748743 732815 715934
53096 715934 699737 685827 673899 662714 652017 642235 632886 622765 611673 600717 590705 581176
53084 581176 571233 560570 549446 538442 528465 520321 513942 508588 503996 500601 498249 495395 490315
53071D90315p468q456p893o486m658k674j385j795l675n312n139l410j691q66
53057D29407l24N62J053K7k071l440l175k214j601r88J96J067K53j736k626j306
53041D13084O28R68m46k097l161m198n571o429n843m329l503m365o309p845q077
53026C52507p324o387n503m467l704m355o620q698q507o234m002l165l264l767
53012B76510n006o613o736m378j292N6m36j188j777k971m330m159k145j0R51J131
52996B37607R46j68k186l719l883l436k989j819L22J852J504M52M55J024M19j298
52980B25083k445k422k203k229j861j094q91j411j574r56o27j431k636l047k502
52965A97754j671j116j034j237j137m23J90j77r05l82J519K873K345J082R43J887
$$ plain form
53071 490315 482847 474391 466498 460012 455354 452680 451295 449500 445825 440513 435374 431964 430273 429407
53057 429407 429083 429645 430698 430725 428654 425214 422039 419825 418224 417236 417432 418499 418752 417016 414390 413084
53041 413084 413712 414680 414234 412137 408976 404778 399207 392778 386935 382606 379103 374738 368429 360584 352507
53026 352507 345183 338796 333293 328826 325122 320767 314147 305449 296942 290708 286706 283541 280277 276510
53012 276510 271504 264891 258155 253777 252485 252541 252105 250917 249140 246169 241839 237680 235535 235525 236476 237607
52996 237607 238553 238385 236199 232480 228597 225161 222172 220353 220675 222527 224031 224483 224938 225962 226381 225083
52980 225083 222638 220216 218013 215784 213923 212829 211938 210527 208953 207997 207370 205939 203303 200256 197754
52965 197754 196083 194967 193933 192696 191559 191136 191326 191149 190244 189862 191381 194254 196599 197681 198624 200511
52949B00511K390J821J053R12J195J294R47K46m82p03j61O27Q52M89L80J102K157
52932B14630K548J890O78l35p25m13M96J720K790L234K901K069J238Q98J292K192
52916B37103K911K818J909P78J20M82K156M758O951P350N923M039K901K590K704
52901B85493L148L756M032L903M054M785N196M402K981K192K248K443K605L167
52887C34405L834L416J405j270l286m078l713k468r00J98L75j97j071j898k442
52872C22310k577k281j501l45M91J16j194j800o93R03J047k58j260r89j41M60
52856C12288Q84J233J171Q48J159K384L433L053J222j088k779l041j714K11J121
52841C20385L16j344k527k554j456L43K026K828K734K315J803J073M40N61J343
$$ plain form
52949 200511 202901 204722 205775 206687 207882 209176 210123 210369 209887 209184 209023 209650 210502 210991 211371 212473 214630
52932 214630 217178 219068 219746 219411 218686 218273 218769 220489 223279 226513 229414 231483 232721 233619 234911 237103
52916 237103 240014 242832 244741 245519 245639 246121 248277 253035 259986 267336 273259 277298 280199 282789 285493
52901 285493 288641 292397 296429 300332 304386 309171 314367 318769 321750 323942 326190 328633 331238 334405
52887 334405 338239 341655 343060 341790 338504 334426 330713 328245 327345 327543 327918 327721 326650 324752 322310
52872 322310 319733 317452 315951 315606 316097 316213 315019 313219 312526 313429 314476 314218 312958 311969 311828 312288
52856 312288 313172 314405 315576 316424 317583 319967 323400 326453 327675 326587 323808 320767 319053 319264 320385
52841 320385 320701 319357 316830 314276 312820 313163 315189 318017 320751 323066 324869 325942 326382 326943 328286
52826C28286J975K156K381K748K614J763Q60L72R9Q9Q41K047K336J042p44j594
52810C47271j241j47J278K296J930L96o33j75O53L77p29j376j104j68J404L172
52794C53204L678K158K53K08J709K361J201m0M02K022L038K580J271L70P94K485
52778C77694M429N745O528P184P330O272M407K922K120J170k45j287j480j792
52764D20997l298n467o714o348n259m718n111n994o889p660q123p781o305m209
52750C37121k535j820j716j742j853k078k277k638l724n328o005m605j995l10
52736B98495n82j881k789k977l156l900m801m725l043o24R03R20K13o27k061m206
52720B65159n772n510l907k197m55J762L484K955J66k931m875n643n183l091m51
$$ plain form
52826 328286 330261 332417 334798 337546 340160 341923 342783 343155 343254 343343 344184 346231 348567 349609 348865 347271
52810 347271 346030 345883 347161 349457 351387 351783 351150 350975 351628 352005 351276 349900 348796 348628 350032 353204
52794 353204 356882 359040 359293 359501 361210 363571 364772 364732 365134 367156 370194 372774 374045 374415 375209 377694
52778 377694 382123 387868 394396 401580 408910 415182 419589 422511 424631 425801 425556 424269 422789 420997
52764 420997 417699 412232 405518 399170 393911 389193 384082 378088 371199 363539 355416 347635 341330 337121
52750 337121 334586 332766 331050 329308 327455 325377 323100 320462 316738 311410 305405 300800 298805 298495
52736 298495 297913 296032 293243 290266 287110 283210 278409 273684 270641 270017 270920 271840 272053 271426 269365 265159
52720 265159 259387 253877 249970 247773 247318 249080 252564 255519 255685 252754 247879 242236 237053 233962 233511
52705B33511J78j979m209l599r48M36p52k513k712j696j126j634k590l388l903
52690B03076m041l778l631m196n107n097l660j952j363j658j481n56j95j220k491
52675A62650k308n65J323K137J629M4k089l829m337l678k590j618r10n49l71J59
52659A45098J165J705Q91o47j265k41J626L153L525K283k39k448k747j354J29
52644A50634R28J602K285K143J077M42J155K322K680K291J817J154P6m99O60L200
52628A73967N210N249L655J989J562K375L091K399N69q25r53o81j109k120l027
52613A91351l836m809n491n223m239l401l127l237l429l184j892J90J613J406
52599A52692L31l56p05j324j735j134k95p58k288l049k467j944k189j934k85J395
$$ plain form
52705 233511 233689 231710 227501 223902 222954 223390 222638 220125 217413 215717 214591 212957 210367 206979 203076
52690 203076 199035 195257 191626 187430 182323 177226 173566 171614 170251 168593 167112 166556 166361 165141 162650
52675 162650 160342 159777 161100 163237 164866 164910 162821 158992 154655 150977 148387 146769 145859 145310 144939 145098
52659 145098 146263 147968 148859 148212 146947 146706 148332 151485 155010 157293 157054 154606 151859 150505 150634
52644 150634 151562 153164 155449 157592 158669 159111 160266 162588 165268 167559 169376 170530 170606 170107 170767 173967
52628 173967 179177 184426 188081 190070 191632 194007 197098 199497 200066 199241 198288 197607 196498 194378 191351
52613 191351 187515 182706 177215 171992 167753 164352 161225 157988 154559 151375 149483 149673 151286 152692
52599 152692 153023 152667 151962 150638 148903 147769 147474 146716 144428 141379 138912 136968 134779 132845 132560 133955
52583A33955J394J31p76r03r48j103r58o62o60n87K45J425J825J369J013R10M4
52566A35714j838l317l038j365M40J756K489K295J128L0J68J163J422K25j450
52551A35822k311k009q10J045K935L555K107m36k064j903j067j019j652j507K70
52536A30956K774M257L911K390Q60n2m03n04o73j114j593j409n6K117M209N621
52520A51291O298O223N313L839K465J542P73j64r85j112l21J066K362K730J740
52505A83060J34n29M74K009K351J227k6j56Q26K089K832K611J495L30K88J788
52489B00803M041N763O174N235L457J709Q17R23J307J219O95M23P86J361J400
52474B36113P13j05k55N59K090L896N417N888M838K769Q84j40n91p43k34J074
$$ plain form
52583 133955 135349 135480 134704 133801 132853 131750 130792 130130 129470 128883 129128 130553 132378 133747 134760 135670 135714
52566 135714 133876 130559 127521 126156 126596 128352 130841 133136 134264 134294 134462 135625 137047 137272 135822
52551 135822 133511 131502 130692 131737 134672 138227 140334 139898 137834 135931 134864 133845 132193 130686 130956
52536 130956 133730 137987 141898 144288 145148 145096 144693 144189 143516 142402 140809 139400 139344 141461 145670 151291
52520 151291 157589 163812 169125 172964 175429 176971 177744 177580 176595 175483 175162 176228 178590 181320 183060
52505 183060 183194 182665 183139 185148 187499 188726 188700 188544 189370 191459 194291 196902 198397 198727 199015 200803
52489 200803 204844 210607 216781 222016 225473 227182 227999 228922 230229 231448 232143 232566 233352 234713 236113
52474 236113 236826 236721 236466 237025 239115 243011 248428 254316 259154 261923 262807 262667 262076 261333 261099 262173
52458B62173K318K567J997J310M83p40j598r32Q95K104J799Q75J54q08k272k984
52442B67341j730N04J419K06j684k518j992q86N5N57Q12J298K246L084K743R06
52426B72361j350k391j592k9N20n73k046k234j137l52p64j283n48R89J747J431
52410B62749J371K408L621L710K695J579R17M26k12q32r50n1J991M400N642M689
52394B94153K133m47k066k749k555j185J000K513K163O51j67M68J475J555P86
52379B97728K08M11J092J678J868J617J013K67l72p06p06o26q88j541k027j925
52363B97091j708k041k464j846k31R47R32O10P11N14m53r00M21K391L019K467
52347B99460K377K676J704m33j354p2J369J099J41K54J038J100O47Q37J562J855
$$ plain form
52458 262173 264491 267058 269055 270365 270848 270108 268510 267578 268473 270577 272376 273251 273405 272597 270325 267341
52442 267341 265611 266115 267534 267740 266056 263538 261546 260660 260715 261272 262084 263382 265628 268712 271455 272361
52426 272361 271011 268620 267028 266999 267519 266946 264900 262666 261529 261177 260413 259130 258582 259571 261318 262749
52410 262749 264120 266528 270149 273859 276554 278133 279050 279476 279264 278432 277482 277431 279422 283822 289464 294153
52394 294153 296286 295839 293773 291024 288469 287284 288284 290797 292960 293611 293444 293912 295387 296942 297728
52379 297728 297936 298347 299439 301117 302985 304602 305615 305882 305510 304804 304098 303472 302584 301043 299016 297091
52363 297091 295383 293342 290878 289032 288801 289748 290680 291290 292001 292515 292062 291162 291583 293974 296993 299460
52347 299460 301837 304513 306217 305784 304430 304358 305727 306826 306967 307221 308259 309359 310006 310843 312405 314260
52331C14260J838K299K794K171O87k05j90m39j458k295k313k241k734l140k559
52316C06475j230l2P78J550K232K182J140k5m7J095J768O40j172j127J298L694
52300C19219M066L484L993N258N333L975K800K376J591J66l90Q88K961M442N165
52285C65327N414N136M767N293O588P111O163N022M886N278N590O383P618P462
52271D48038M978K551L059N571O607N218L972M748O393P357Q041R174R912R282
52257E34901Q161Q112R081R763R715R775J0590J1828J2779J3060J2864J2937J3974
52244F77540J5639J6720J6723J6620J7357J8413J8748J8522J8826K0088K1765
52233H76961K3317K4447K4714K4024K3248K3215K3342K2574K1550K2111K4365
$$ plain form
52331 314260 316098 318397 321191 323362 324049 323844 323654 323215 321757 319462 317149 314908 312174 309034 306475
52316 306475 305245 305213 305991 307541 309773 311955 313095 313070 313023 314118 315886 316526 315354 314227 315525 319219
52300 319219 323285 326769 330762 336020 341353 345328 348128 350504 352095 352261 351871 352759 355720 360162 365327
52285 365327 370741 375877 380644 385937 392525 399636 405799 410821 415707 420985 426575 432958 440576 448038
52271 448038 453016 455567 458626 464197 470804 476022 479994 484742 491135 498492 506533 515707 525619 534901
52257 534901 543062 551174 560255 570018 579733 589508 600098 611926 624705 637765 650629 663566 677540
52244 677540 693179 709899 726622 743242 760599 779012 797760 816282 835108 855196 876961
52233 876961 900278 924725 949439 973463 996711 1019926 1043268 1065842 1087392 1109503 1133868
52222A133868K5960K5091K2825K1411K1458K2041K2613K3391K4231K4430K3647
52211A390966K2157K0398J8900J8229J8192J7539J5335J2342J0106R036Q362P617
52199A569179P007O541O022N760O165O621O083M809M190M657N246N482O125P452
52185A651339Q450Q636R100J0503J1369J0086P756P263R744J3427J5937J6631
52173A780241J6587J7238J9121K1364K2439K1866K0778K0273J9825J8274J5780
52162A993786J3603J2273J1152R753Q250O710M895L031J879J776K255K495J583
52149B073441j268n569r065r740q390p814r378j1815j3604j4802j5767j5882j4801
52136A935546j3738j4001j5036j5201j4007j2357j1080j0345j0152j0215r599
$$ plain form
52222 1133868 1159828 1184919 1207744 1229155 1250613 1272654 1295267 1318658 1342889 1367319 1390966
52211 1390966 1413123 1433521 1452421 1470650 1488842 1506381 1521716 1534058 1544164 1553200 1561562 1569179
52199 1569179 1576186 1582727 1588749 1594509 1600674 1607295 1613378 1618187 1622377 1627034 1632280 1637762 1643887 1651339
52185 1651339 1659789 1668425 1677525 1688028 1699397 1709483 1717239 1724502 1734246 1747673 1763610 1780241
52173 1780241 1796828 1814066 1833187 1854551 1876990 1898856 1919634 1939907 1959732 1978006 1993786
52162 1993786 2007389 2019662 2030814 2040567 2048817 2055527 2060422 2063453 2065332 2067108 2069363 2071858 2073441
52149 2073441 2072173 2066604 2057539 2047799 2039409 2031595 2022217 2010402 1996798 1981996 1966229 1950347 1935546
52136 1935546 1921808 1907807 1892771 1877570 1863563 1851206 1840126 1829781 1819629 1809414 1799815
52125A799815p700n421m241m170l926l245l557n630p813p824n638l448k879l384
52111A730939l567l189l149m049n519o867p745p967p313n979m871m932o098p384
52097A652310q043q306q810r549r743q702o726m965m315m535m725m637m968o135
52083A558151p296p229n856m232l205k863l131m017n031n230m372l520l952n637
52069A492580p177p078n065k437j132j944l591l995k684j313j616l421m982m848
52055A441297k971n65P17J06j198p53K527O807R154Q762P498P383Q503R846J1190
52040A508303J3193J5911J8216J9132J9165J9719K1351K3249K4507K5234K6060
52029A734040K7024K7721K8258K9226L0727L2078L2677L2568L1994L0959K9504
$$ plain form
52125 1799815 1792115 1786694 1782453 1778283 1774357 1771112 1767555 1761925 1754112 1746288 1740650 1737202 1734323 1730939
52111 1730939 1727372 1724183 1721034 1716985 1711466 1704599 1696854 1688887 1681574 1675595 1670724 1665792 1659694 1652310
52097 1652310 1644267 1635961 1627151 1617602 1607859 1599157 1592431 1587466 1583151 1578616 1573891 1569254 1564286 1558151
52083 1558151 1550855 1543626 1537770 1533538 1530333 1527470 1524339 1520322 1515291 1510061 1505689 1502169 1498217 1492580
52069 1492580 1485403 1478325 1473260 1470823 1469691 1467747 1464156 1460161 1457477 1456164 1454548 1451127 1446145 1441297
52055 1441297 1438326 1437761 1438478 1438584 1437386 1436633 1439160 1445967 1455121 1463883 1471381 1478764 1487267 1497113 1508303
52040 1508303 1521496 1537407 1555623 1574755 1593920 1613639 1634990 1658239 1682746 1707980 1734040
52029 1734040 1761064 1788785 1817043 1846269 1876996 1909074 1941751 1974319 2006313 2037272 2066776
52018B066776K7843K5912K3371K0410J7993J6748J6051J4766J2581R981P257M274
52006B263963J184j313k727l318l673m040m386m932o264q620j1206j2613j2192
51993B189863j0864j0223j0860j1920j2208j1350r787q121o651n244l603j784
51981B087248m39q4k90k13K18M48O40J823M110N786N094K454J01k86J085K824
51965B110519L600K796P06j680l497m682n657o526p075p422q157r631j1456j2835
51951B039003j3321j3258j3527j4762j6712j8559j9943k1386k3505k6138k8453
51940A829439k9776l0040k9777k9920l1286l3796l6229l7133l6073l3987l2379
51929A469043l2141l2988l3947l4410l4629l4960l5071l4404l3112l1888l0977
$$ plain form
52018 2066776 2094619 2120531 2143902 2164312 2182305 2199053 2215104 2229870 2242451 2252432 2259689 2263963
52006 2263963 2265147 2263834 2261107 2257789 2254116 2250076 2245690 2240758 2234494 2225874 2214668 2202055 2189863
51993 2189863 2178999 2168776 2157916 2145996 2133788 2122438 2112651 2104530 2097879 2092635 2089032 2087248
51981 2087248 2086809 2086725 2086435 2086222 2086440 2086888 2087528 2089351 2093461 2099247 2104341 2106795 2106896 2106610 2107695 2110519
51965 2110519 2114119 2116915 2117621 2115941 2112444 2107762 2102105 2095579 2088504 2081082 2072925 2063294 2051838 2039003
51951 2039003 2025682 2012424 1998897 1984135 1967423 1948864 1928921 1907535 1884030 1857892 1829439
51940 1829439 1799663 1769623 1739846 1709926 1678640 1644844 1608615 1571482 1535409 1501422 1469043
51929 1469043 1436902 1403914 1369967 1335557 1300928 1265968 1230897 1196493 1163381 1131493 1100516
51918A100516l0173k9567k9335k8751k6727k3689k1641k1684k2525k2313k0922
51907H23189j9407j8141j6671j4811j2728j0399q151p317q991j2217j4514j4311
51895F65531j2119r455p612p302q391r686r837q741p512o981o836o316n235m187
51881E55321m050n166o716p258o297m889m186m054l831l757m391n092m515k594
51867D88525q00k17n49j156j969k906l362k823j431K97J735K079Q20j438l292
51852D73513l953l743l228k592k072k154k930l863m433m587m435m074l758l653
51838D24038l380k517j545j537k748m302n349n798n730n082m140l633l749l651
51824C70877k438l05J442J503j73k004k190q96k55j404k574j580O89J334l39k007
$$ plain form
51918 1100516 1070343 1040776 1011441 982690 955963 932274 910633 888949 866424 844111 823189
51907 823189 803782 785641 768970 754159 741431 731032 722881 715564 706573 694356 679842 665531
51895 665531 653412 643957 636345 629043 620652 610966 601129 592388 584876 577895 571059 564743 559508 555321
51881 555321 551271 546105 539389 532131 525834 520945 516759 512705 508874 505117 500726 495634 491119 488525
51867 488525 487725 487508 486959 485803 483834 480928 477566 474743 473312 473609 475344 477423 478243 476805 473513
51852 473513 469560 465817 462589 459997 457925 455771 452841 448978 444545 439958 435523 431449 427691 424038
51838 424038 420658 418141 416596 415059 412311 408009 402660 396862 391132 386050 381910 378277 374528 370877
51824 370877 368439 368134 369576 371079 370906 368902 366712 365816 365561 364157 361583 360003 360692 362026 361687 359680
51808C59680j898q45l1R78K646L797L303K113J904K592K768J907P49j18p18r34
51792C77893l98R18K608M128M782M055K466J433J688K508K985L250L760M268M306
51777D20650L989L581K941K111J670J929K520L197L930L775J319k810n520m861
51763D38421k589j537j853j867j431j900l306l998l229k043j449j343j344j213
51749D09319m75R67K012J570L16l08l64q35j254l07J307J224p94k045p86J342
51733D10889K096J735J748K215K362K452L160L716K533m24l277m251l277j681
51719D19996r44j538k443k048L1K390L307K432P68m28n61K5L68J37L36J956M029
51702D27813M402K579M14m45k05M47J699L523M738M558L895L899M301M498M955
$$ plain form
51808 359680 357782 356937 356906 357884 360530 364327 367630 369743 371647 374239 377007 378914 379663 379545 378827 377893
51792 377893 377495 378413 381021 385149 389931 393986 396452 397885 399573 402081 405066 408316 412076 416344 420650
51777 420650 424639 428220 431161 433272 434942 436871 439391 442588 446518 450293 451612 448802 443282 438421
51763 438421 435832 434295 432442 430575 429144 427244 423938 419940 416711 414668 413219 411876 410532 409319
51749 409319 408844 409811 411823 413393 413709 413401 413037 412202 410948 410641 411948 413172 412378 410333 409547 410889
51733 410889 412985 414720 416468 418683 421045 423497 426657 430373 432906 432482 429205 424954 421677 419996
51719 419996 419052 417514 415071 413023 413054 415444 418751 421183 421951 421523 420962 420987 421355 421492 421828 423784 427813
51702 427813 432215 434794 435208 434763 434558 435005 436704 440227 444965 449523 453418 457317 461618 466116 471071
51687D71071N980O223M446K074J796L920O026O330N412M469L732L290L891N893
51673E34553Q385J0195J1059J1380J1502J1803J2759J4395J5976J6709J6418J5424
51661F90558J4250J3470J3309J3184J2205J0212P700M734Q39l671p283q948r486
51648G51073j0475j2049j2872j2267j1384j1696j2989j3742j3302j2664j2717
51637F14916j2509j0439o768l769l121m205n402n967n986n392m224l230l069l228
51623E37607k719j593p27m27l26n19j393k343k069o34J70p23k018j916p56m62
51607E19152j777l331l704l243l110l263k377Q1K707L783L555L805N198O331N926
51592E29733M790M541N218N568N117M504L861K487L56j394k039k135k347k585
$$ plain form
51687 471071 477051 483274 487720 489794 491590 495510 501536 507866 513278 517747 521479 524769 528660 534553
51673 534553 542938 553133 564192 575572 587074 598877 611636 626031 642007 658716 675134 690558
51661 690558 704808 718278 731587 744771 756976 767188 774888 779622 780461 776790 769507 760559 751073
51648 751073 740598 728549 715677 703410 692026 680330 667341 653599 640297 627633 614916
51637 614916 602407 591968 585200 581431 578310 574105 568703 562736 556750 551358 547134 543904 540835 537607
51623 537607 534888 533295 532568 532141 531815 531296 529903 527560 525491 524857 525027 524304 522286 520370 519614 519152
51607 519152 517375 514044 510340 507097 503987 500724 498347 498428 501135 504918 508473 512278 517476 523807 529733
51592 529733 534523 539064 544282 549850 554967 559471 563332 565819 566175 564781 562742 560607 558260 555675
51578E55675k919m150o553q870r625q889p932p585p781q245q790r186r292r204
51564D46654q908q190p264o806o912o700n629m328l412k428j094o05k052m096
51550C78230m174k074l25o22j625j341KQ70R96J216J205m64l667n802m658j296
51534C56471J151J201L84P71K253L037K228Q61M20J154K252L139L925M863N874
51519C89984O664P030O990O783O766P207Q052Q901R196Q657P763P598Q811J0665
51505E01067J1582J0658Q361N842M111L680M177M163K324p63l052l624l810m986
51491E39730o460o732n886n156m797m031k811j922j337j40J723L181L872M603
51477E13837N555N728M973M914O610Q771R647R556R833J0334R850Q544P885Q002
$$ plain form
51578 555675 552756 548606 542053 533183 523558 514669 506737 499152 491371 483126 474336 465150 455858 446654
51564 446654 437746 429556 422292 415486 408574 401874 396245 391917 388505 386077 384983 384378 382326 378230
51550 378230 374056 371982 371657 371035 369410 368069 368071 368941 369937 371153 372358 371894 368227 362425 357767 356471
51534 356471 357622 358823 359207 359978 362231 365268 367496 368357 368777 369931 372183 375322 379247 384110 389984
51519 389984 396648 403678 410668 417451 424217 431424 439476 448377 457573 466230 473993 481591 490402 501067
51505 501067 512649 523307 531668 537510 541621 545301 549478 553641 555965 555202 552150 548526 544716 539730
51491 539730 533270 526538 520652 515496 510699 506668 503857 501935 500598 500458 502181 505362 509234 513837
51477 513837 519392 525120 530093 535007 541617 550388 560035 569591 579424 589758 599608 608152 616037 624039
51463F24039P036L848rk047j762q18p98j553j840j035J04L33o11j695j728n23
51447F20941J106K073J643m2j681j676J93K450L770M394N006N188M191K498J143
51432F51197j60k413n062o254n732n563p051q648q253o216m616m491n280o191
51418E75267o675o057m314k848k942l705l176j386m08j108j655k94K122L585L736
51403E50142L735M175M629M999N863P421R093J0293J0833J0564R552Q574Q553
51390F48426R364R957R813R350Q847Q009O994O710P347P535N987L265Q44j022
51376G41426l180n572o850o279m935m326m617m811m225l168k393k271k365j755
51362F84679o2J839K738K668K876L842M331L080P34r19j281j429k344l746m942
$$ plain form
51463 624039 631075 634923 634914 632867 631105 630287 629489 627936 626096 625061 625165 625498 624887 623192 621464 620941
51447 620941 622047 624120 625763 625721 624040 622364 622557 625007 628777 633171 638177 643365 647556 650054 651197
51432 651197 651037 648624 643562 637308 631576 626013 618962 610314 602061 595845 591229 586738 581458 575267
51418 575267 568592 562535 558221 555373 552431 548726 545550 544164 543756 542648 540993 540699 542821 546406 550142
51403 550142 553877 558052 562681 567680 573543 580964 590057 600350 611183 621747 631299 639873 648426
51390 648426 657790 667747 677560 686910 695757 703766 710760 717470 724817 732352 738339 741604 742448 741426
51376 741426 738246 732674 725824 719545 714610 710284 705667 700856 696631 693463 691070 688799 686434 684679
51362 684679 684617 686456 689194 691862 694738 698580 702911 705991 706725 705806 704525 703096 700752 697006 692064
51347F92064n987p428r261j0839j1655j1915j2155j2504j2473j1623j0267r181
51335E66776q595p947o867n818n297m885l924k809k652l608m434m028k709j595
51321E01608j199j077m49J115L265M877M970L957L464M458N901N806L534M63j571
51306E39122k138k431l900o696r553j1179j1656j1999j2537j2483j1389j0195
51294D32966j0114j1038j1813j1777j1114r909p984n892m963n716o871o680m934
51281C24161l030k313k910m078m997n124m388l397l013l324l350k185k50J212
51267B83014J729K041K664K856J650m30j663j179P2P26O36N54P34P09L75L80J204
51250B96072K443L411L961M249M108L350K601K916M373N695N849N447N911P502
$$ plain form
51347 692064 686077 678649 669388 658549 646894 634979 622824 610320 597847 586224 575957 566776
51335 566776 558181 550234 543367 537549 532252 527367 523443 520634 517982 514374 509940 505912 503203 501608
51321 501608 500409 499332 498883 499998 503263 508140 513110 517067 520531 524989 530890 536696 540230 540693 539122
51306 539122 536984 534553 530653 523957 514404 503225 491569 479570 467033 454550 443161 432966
51294 432966 422852 411814 400001 388224 377110 367201 359217 353325 348362 342646 335775 329095 324161
51281 324161 321131 318818 315908 311830 306833 301709 297321 293924 290911 287587 284237 282052 281802 283014
51267 283014 284743 286784 289448 292304 293954 293524 291861 290682 290754 291480 292116 292670 293404 294113 294488 294868 296072
51250 296072 298515 301926 305887 310136 314244 317594 320195 323111 327484 333179 339028 344475 350386 357888
51236C57888R077R606R118Q043O674N585N650O821P636O767M592K482J001k48
51222D40692j557k955m782p145q966r020p946p794r210j0519j0250r100q446q252
51208C34750p725o997o752o824o584o227o306o340n317l458k041j477r58k22j21
51193B67401r42j521r82k78r22k778m232m222l169j927p08O54K033L013L408L430
51177B58258L253K688J529J59n11M3J395K641L197K889J726L7j407j922j514o23
51161B71838M22J346J714J389Q84O29K98m59j065q31k73m10r36o29M83R58M19
51144B75777L89J799L124K397M1j738j686m65O16O61o00k556l874l761k841k020
51128B65263j214j71K91o26j885j621J01J240O97l93p45o29p36q67q17j353k900
$$ plain form
51236 357888 366965 376571 385689 393732 400406 405991 411641 418462 426098 432865 437457 439939 440940 440692
51222 440692 439135 436180 431398 424253 415287 406267 398321 390527 381317 370798 360548 351448 343002 334750
51208 334750 327025 320028 313276 306452 299868 293641 287335 280995 275678 272220 270179 268702 267744 267522 267401
51193 267401 266459 264938 263956 263678 262756 259978 255746 251524 248355 246428 245720 246374 248407 251420 254828 258258
51177 258258 261511 264199 265728 265887 265376 265419 266814 269455 272652 275541 277267 277304 275897 273975 272461 271838
51161 271838 272260 273606 275320 276709 277593 278222 278520 278061 276996 276165 275892 275482 274546 273917 274400 275358 275777
51144 275777 276166 277965 281089 283486 283527 281789 280103 279638 280254 280915 280315 277759 273885 270124 267283 265263
51128 265263 264049 263878 264169 263543 261658 260037 260138 261378 262075 261682 260937 260308 259572 258705 257888 256535 253635
51111B53635m181l574j380M77P83l1j040j742j856j268l99J37L93R01J592J764
51095B44211J273Q43R36J130J039Q87P16r7j539k082m64K023K595M71k056k650
51079B47236j754j403k243l090l086k740k599k144p85Q54J550J054L70M44J085
51064B32749J421J063N38N91J170J453R85M43P58J756K443K650L349M892N931
51049B62192N078L021J809K273L316L807L924M219M430M072L410K979K516J228
51035C08274r06k903l879l810l108k027q27o6j34n59k81J117K696L071J985M89
51019B99132m61r54j328j090L53K160K565J198k32k60L46p5j444k038j022M45
51003B97295R42M91O5J46M69N82J69p99j774j942j283q29j329k067j729k82Q89
$$ plain form
51111 253635 249454 245880 244500 244977 245760 245729 244689 242947 241091 239823 239424 239561 239954 240855 242447 244211
51095 244211 245484 246327 247263 248393 249432 250319 251035 250938 249399 247317 246853 248876 251471 251942 249886 247236
51079 247236 245482 244079 241836 238746 235660 232920 230321 228177 227392 228246 229796 230850 231220 231664 232749
51064 232749 234170 235233 235771 236362 237532 238985 239970 240413 241171 242927 245370 248020 251369 256261 262192
51049 262192 267270 270291 272100 274373 277689 281496 285420 289639 294069 298141 301551 304530 307046 308274
51035 308274 307368 304465 300586 296776 293668 291641 290814 290748 290614 290055 289774 290891 293587 296658 298643 299132
51019 299132 298671 297717 296389 295299 295652 297812 300377 301575 301343 301083 301429 301354 299910 297872 296850 297295
51003 297295 298237 298728 298793 298939 299408 299990 300159 299360 297586 295644 294361 293532 292203 290136 288407 288125 289014
50986B89014P33k37o54J42J549K361J906O65j72Q9J045J967K726L536M121L945
50970C12736L205K720K766K859K913L703N579P453P866O668M966L731L136K958
50956C73259K937K846K774L210M219M886M285K889K040K076K021J444J425K904
50942D13215M890N466M291L085L564N718Q367J0657J2409J3388J3147J1774J0417
50929E20388J0497J2296J4537J5619J5302J4995J6272J9230K2457K4602K5726
50918G11921K6888K8673L0544L1811L2832L4743L8107M2269M6221M9697N3153
50907A126859N6944O0782O4039O6497O8791P1915P6111Q0446Q3848Q6280Q8208
50896A930720Q9262Q8514Q6069Q3086P9792P4926O7944O0410N3910M7730M0334
$$ plain form
50986 289014 289747 289510 288856 288998 290547 292908 294814 295479 295307 295396 296441 298408 301134 304670 308791 312736
50970 312736 315941 318661 321427 324286 327199 330902 336481 343934 351800 358468 363434 367165 370301 373259
50956 373259 376196 379042 381816 385026 389245 394131 398416 401305 403345 405421 407442 408886 410311 413215
50942 413215 418105 423571 427862 430947 434511 440229 448596 459253 471662 485050 498197 509971 520388
50929 520388 530885 543181 557718 573337 588639 603634 619906 639136 661593 686195 711921
50918 711921 738809 767482 798026 829837 862669 897412 935519 977788 1024009 1073706 1126859
50907 1126859 1183803 1244585 1308624 1375121 1443912 1515827 1591938 1672384 1756232 1842512 1930720
50896 1930720 2019982 2108496 2194565 2277651 2357443 2432369 2500313 2560723 2614633 2662363 2702697
50885B702697L2222K5295J9740J3796O808N26l264m750n112n176n706p442r905
50872B759729j1573j2203j3645j7367k2586k8039l3989m0883m7523n2628n7248
50861B422045o3335p0350p5632p8072p9369q1180q2907q2880q0409p6044p1027
50850A580840o6848o4189o1793n7569n1207m4724l9861l6125l2025k7248k2850
50839A076401j9840j8260j7171j5270j2100q829p064o731o051l846p98J876L808
50826I66125M993N114M267L354L062L239L944N898Q957J1412J2174J2643J4788
50813A059970J8086K0363K1203K2510K5431K8625L0443L1320L2921L5765L8910
50802A365547M1700M4777M9211N5081O1248O6595P1267P6414Q2728Q9834R7351
$$ plain form
50885 2702697 2734919 2760214 2779954 2793750 2800558 2801084 2797820 2793070 2787958 2782782 2777076 2769634 2759729
50872 2759729 2748156 2735953 2722308 2704941 2682355 2654316 2620327 2579444 2531921 2479293 2422045
50861 2422045 2358710 2288360 2212728 2134656 2055287 1974107 1891200 1808320 1727911 1651867 1580840
50850 1580840 1513992 1449803 1388010 1330441 1279234 1234510 1194649 1158524 1126499 1099251 1076401
50839 1076401 1056561 1038301 1021130 1005860 993760 984931 977867 971136 965085 961239 960441 962317 966125
50826 966125 971118 976232 980499 983853 986915 990154 994098 999996 1008953 1020365 1032539 1045182 1059970
50813 1059970 1078056 1098419 1119622 1142132 1167563 1196188 1226631 1257951 1290872 1326637 1365547
50802 1365547 1407247 1452024 1501235 1556316 1617564 1684159 1755426 1831840 1914568 2004402 2101753
50791B101753J05618J14677J23371J30700J37623J46003J55795J64840J71768
50782C352148J77479J82977J87277J88765J87577J85104J81651J75996J67063
50773D986037J54667J38712J19150R7261P5637N6019L7965K0439M115q972j7709
50762E663321k2823k5460k5889k4073k0842j7776j6137j6410j8798k3682l1420
50751E420011m2090n5433p0937q7790j05022j21902j38116j53440j67300j78721
50741D299260j86723j90874j91528j89469j85212j78660j69682j58952j47882
50732B700278j37498j27522j16782j04677r2131q0967p2203o5027n7742m9776
50722A795953m2332l6755l2793k9138k5243k1735j9099j7110j5800j5672j6358
$$ plain form
50791 2101753 2207371 2322048 2445419 2576119 2713742 2859745 3015540 3180380 3352148
50782 3352148 3529627 3712604 3899881 4088646 4276223 4461327 4642978 4818974 4986037
50773 4986037 5140704 5279416 5398566 5495827 5571464 5627483 5665448 5685887 5690002 5681030 5663321
50762 5663321 5640498 5615038 5589149 5565076 5544234 5526458 5510321 5493911 5475113 5451431 5420011
50751 5420011 5377921 5322488 5251551 5163761 5058739 4936837 4798721 4645281 4477981 4299260
50741 4299260 4112537 3921663 3730135 3540666 3355454 3176794 3007112 2848160 2700278
50732 2700278 2562780 2435258 2318476 2213799 2121668 2040701 1968498 1903471 1845729 1795953
50722 1795953 1753621 1716866 1684073 1654935 1629692 1607957 1588858 1571748 1555948 1540276 1523918
50711A523918j6140j3933j1031r563r663r596q584p902q744j0251j0597r146o739
50698A392029m377k524j226k4K080N657R818J2924J4512J5862J8388K2031K5705
50685A510855K8792L1593L4512L7567M0964M5433N1437N8139O3857O7723P0613
50674B041485P4194P9276Q5344R1456R7203J02782J08403J13733J17899J20201
50664C031976J20932J21156J21176J19449J13823J04025R2221Q0610O9032N5653
50654D030053L9649K2357N841q875k1837l3148m2451m9100n2497n2563n0161m6743
50642C740525m3120l8850l3397k7713k4029k3867k6786l1209l6068m1466m8325
50631C365695n7647o9663q3009r4995j03298j07616j09530j10722j11440j10462
$$ plain form
50711 1523918 1507778 1493845 1482814 1473251 1463588 1453992 1445408 1437506 1428762 1418511 1407914 1398768 1392029
50698 1392029 1387652 1385128 1383902 1383878 1385958 1391615 1401433 1414357 1428869 1444731 1463119 1485150 1510855
50685 1510855 1539647 1571240 1605752 1643319 1684283 1729716 1781153 1839292 1903149 1970872 2041485
50674 2041485 2115679 2194955 2280299 2371755 2468958 2571740 2680143 2793876 2911775 3031976
50664 3031976 3152908 3274064 3395240 3514689 3628512 3732537 3824758 3905368 3974400 4030053
50654 4030053 4069702 4092059 4097900 4089025 4067188 4034040 3991589 3942489 3889992 3837429 3787268 3740525
50642 3740525 3697405 3658555 3625158 3597445 3573416 3549549 3522763 3491554 3455486 3414020 3365695
50631 3365695 3308048 3238385 3155376 3060381 2957083 2849467 2739937 2629215 2517775 2407313
50621B407313j06359r9082r0448q2710p6323o9626o1238n2103m4227l7953l1720
50610A655524k4612j7639j2005p426l094P22L271M940P079J0204J3493J6064J7932
50597A664453J9406K0465K1154K2070K3900K6562K9129L0668L1141L1613L3409
50586A953970L6840M0797M3910M6127M8810N3143N8765O4070O7856P0430P3023
50575B557741P6208P9173Q0694Q0576P9725P8882P7939P6413P3909O9966O4261
50564C395487N7406N0673M4447L7845L0578K4163J9944J6828J2626P542M410N165
50552C707114Q618J2233J4731J6047J6080J4784J2900J1354J0158Q460N464P52
50540C838695n813j3825k2328l0714l9281m8568n8547o8924p9484q9421r7029
$$ plain form
50621 2407313 2300954 2201872 2111424 2028714 1952391 1882765 1821527 1769424 1725197 1687244 1655524
50610 1655524 1630912 1613273 1601268 1593842 1590748 1591470 1594741 1599681 1606760 1616964 1630457 1646521 1664453
50597 1664453 1683859 1704324 1725478 1747548 1771448 1798010 1827139 1857807 1888948 1920561 1953970
50586 1953970 1990810 2031607 2075517 2121644 2170454 2223597 2282362 2346432 2414288 2484718 2557741
50575 2557741 2633949 2713122 2793816 2874392 2954117 3032999 3110938 3187351 3261260 3331226 3395487
50564 3395487 3452893 3503566 3548013 3585858 3616436 3640599 3660543 3677371 3689997 3697539 3701949 3707114
50552 3707114 3715732 3727965 3742696 3758743 3774823 3789607 3802507 3813861 3824019 3832479 3837943 3838695
50540 3838695 3832882 3819057 3796729 3766015 3726734 3678166 3619619 3550695 3471211 3381790 3284761
50529C284761j01244j03077j04431j05672j05463j02934r8778r3963q8627q2795
50519B297777p7124p2072o6931o0759n3923m7859m3260l9189l4196k7896k1221
50508A753347j5459j1260q332n679k180K705Q427J3656J7395J9792K1799K4185
50496A818396K7218L1007L5386L9394M1738M2374M2887M4560M6649M7588M7479
50485B264676M8062N0141N2402N3366N3378N3693N4442N4624N3787N2666N2236
50474B843473N3073N5608O0034O5617P0981P5603Q0391Q6286R2872R9224J05632
50463C688794J13347J22492J31256J37639J41436J43767J45201J45123J42798
50454D911853J38154J31358J22239J10612R6753Q1128O3952M5439K6224P095j1708
$$ plain form
50529 3284761 3183517 3080440 2976009 2870337 2764874 2661940 2563162 2469199 2380572 2297777
50519 2297777 2220653 2148581 2081650 2020891 1966968 1919109 1875849 1836660 1802464 1774568 1753347
50508 1753347 1737888 1726628 1718296 1712617 1710437 1713142 1721569 1735225 1752620 1772412 1794211 1818396
50496 1818396 1845614 1876621 1912007 1951401 1993139 2035513 2078400 2122960 2169609 2217197 2264676
50485 2264676 2312738 2362879 2415281 2468647 2522025 2575718 2630160 2684784 2738571 2791237 2843473
50474 2843473 2896546 2952154 3012188 3077805 3148786 3224389 3304780 3391066 3483938 3583162 3688794
50463 3688794 3802141 3924633 4055889 4193528 4334964 4478731 4623932 4769055 4911853
50454 4911853 5050007 5181365 5303604 5414216 5510969 5592097 5656049 5701488 5727712 5734807 5723099
50443E723099l0425m8907o6085q0517r1293r8364j02172j03156j01443r6762q8662
50432D815313p7142o3266m8973l5908k4372j3680l560N151J1212J3956J3207Q759
50420D600697M76j1294k6017m3440o3024q3090j01505j17347j30938j42082j49385
50409C733051j51919j50620j47130j42081j35463j27917j20356j12659j03943
50400B540963r4207q4526p5656o7320n9056n0833m2682l4666k7315k1254j6102
50389A967346j0645m325K189Q081J3045J6698J8615J9571K1483K5267K9671L3129
50377B140125L5881L9035M2410M4713M5553M5748M5877M5745M5350M5063M4648
50366B620148M3288M0889L8283L5870L3064K9644K6481K4220K2229J9777J7418
$$ plain form
50443 5723099 5692674 5643767 5577682 5497165 5405872 5307508 5205336 5102180 5000737 4903975 4815313
50432 4815313 4738171 4674905 4625932 4590024 4565652 4551972 4548412 4553563 4564775 4578731 4591938 4600697
50420 4600697 4601173 4589879 4563862 4520422 4457398 4374308 4272803 4155456 4024518 3882436 3733051
50409 3733051 3581132 3430512 3283382 3141301 3005838 2877921 2757565 2644906 2540963
50400 2540963 2446756 2362230 2286574 2219254 2160198 2109365 2066683 2032017 2004702 1983448 1967346
50389 1967346 1956701 1952376 1954565 1962646 1975691 1992389 2011004 2030575 2052058 2077325 2106996 2140125
50377 2140125 2176006 2215041 2257451 2302164 2347717 2393465 2439342 2485087 2530437 2575500 2620148
50366 2620148 2663436 2704325 2742608 2778478 2811542 2841186 2867667 2891887 2914116 2933893 2951311
50355B951311J6097J5519J4695J3883J4615J7610K1798K5797K9357L2755L5748
50344C189185L8057M0156M2449M3950M3070L9912L6506L4110L1374K6117J8175
50333C583061R273M49q942j9584l1065m2773n4627o6034p5307q1342q5134q8324
50321C039651r0702r0637q7724q3385p8535p2344o3990n4359m4847l5422k5209
50310B312497j4476m801K714Q213J1958J3441J2108Q322L029l244j0510j8583
50298B320668k6667l3867l9939m5272n0056n3746n5664n6005n5644n4779n2505
50287A796524m8248m3105l8854l5804l2722k8936k5462k3373k1907j9295j5216
50276A463602j1312r091q165p063n161l003j005J267M216P346R814J1599J3413
$$ plain form
50355 2951311 2967408 2982927 2997622 3011505 3026120 3043730 3065528 3091325 3120682 3153437 3189185
50344 3189185 3227242 3267398 3309847 3353797 3396867 3436779 3473285 3507395 3538769 3564886 3583061
50333 3583061 3592334 3592783 3583841 3564257 3533192 3490419 3435792 3369758 3294451 3213109 3127975 3039651
50321 3039651 2948949 2858312 2770588 2687203 2608668 2536324 2472334 2417975 2373128 2337706 2312497
50310 2312497 2298021 2293220 2295934 2304147 2316105 2329546 2341654 2349976 2353005 2349761 2339251 2320668
50298 2320668 2294001 2260134 2220195 2174923 2124867 2071121 2015457 1959452 1903808 1849029 1796524
50287 1796524 1748276 1705171 1666317 1630513 1597791 1568855 1543393 1520020 1498113 1478818 1463602
50276 1463602 1452290 1443199 1435034 1427971 1422810 1419807 1418802 1420069 1424285 1431631 1441445 1453044 1466457
50263A466457J5512J7302J8370J9251K0661K2342K3436K3922K4829K6837K9218
50252A708137L0578L0320K8989K7532K6541K5868K4604K1820J7884J4728J3884
50241A970885J4434J3784J0740O764L788J769o74l865o599q002q700r868j1849
50228A972607j4101j5943j7046j7590j8280j9756k1740k3168k3514k3512k4297
50217A753660k6120k8321l0128l1093l1029l0036k8516k6766k4818k2869k1482
50206A452482k0901k0475j9373j7726j6469j6082j5941j5010j2824r834p009n039
50194A275799l711k271n04R83J765K276K931L335L190L330M644O392O975O267
50180A311401N687N702M927K287j250m019n629o478o316m742k772k472m663p796
$$ plain form
50263 1466457 1481969 1499271 1517641 1536892 1557553 1579895 1603331 1627253 1652082 1678919 1708137
50252 1708137 1738715 1769035 1798024 1825556 1852097 1877965 1902569 1924389 1942273 1957001 1970885
50241 1970885 1985319 1999103 2009843 2016607 2020395 2022164 2021490 2017625 2011026 2003024 1994324 1984456 1972607
50228 1972607 1958506 1942563 1925517 1907927 1889647 1869891 1848151 1824983 1801469 1777957 1753660
50217 1753660 1727540 1699219 1669091 1637998 1606969 1576933 1548417 1521651 1496833 1473964 1452482
50206 1452482 1431581 1411106 1391733 1374007 1357538 1341456 1325515 1310505 1297681 1287847 1280838 1275799
50194 1275799 1272088 1269817 1269313 1270296 1272061 1274337 1277268 1280603 1283793 1287123 1291767 1298159 1305134 1311401
50180 1311401 1317088 1322790 1327717 1330004 1328754 1324735 1319106 1312628 1306312 1301570 1298798 1296326 1291663 1283867
50166A283867r545r140p961p821q860r442q357o507n708o124o205n111l724k832
50152A186530j729M19K939M510M813M387L664K994K865L100K792J923J916L277
50138A224400L966J936j694m142m850n668p343q512q461q515r866j1843j3246
50125A146162j3724j3147j1363r373r101j0854j2519j2405j1463j1434j2200j2445
50113A006134j1961j1563j1445j1053j0157q859o998m640k705k063k502l376m573
50100I14239n853o154n019l974m817o946q052p318o306o388o980o849n957n156
50086H28470m884m959n197n641o250o744o754o245n703n534n265m034k058p46
50072G58456o79n84P97K762L791L767L592L352K646K311L743O461Q264Q309Q200
$$ plain form
50166 1283867 1274322 1265182 1257221 1249400 1240540 1231098 1222741 1216234 1210526 1204402 1198197 1193086 1189362 1186530
50152 1186530 1184801 1185220 1188159 1192669 1197482 1201869 1205533 1208527 1211392 1214492 1217284 1219207 1221123 1224400
50138 1224400 1228366 1230302 1228608 1224466 1219616 1213948 1206605 1198093 1189632 1181117 1171251 1159408 1146162
50125 1146162 1132438 1119291 1107928 1098555 1089454 1078600 1066081 1053676 1042213 1030779 1018579 1006134
50113 1006134 994173 982610 971165 960112 949955 941096 934098 929458 926753 924690 922188 918812 914239
50100 914239 908386 902232 897213 893239 888422 881476 873424 866106 859800 853412 846432 839583 833626 828470
50086 828470 823586 818627 813430 807789 801539 794795 788041 781796 776093 770559 765294 761260 759202 758456
50072 758456 757777 757193 757990 760752 764543 768310 771902 775254 777900 780211 783954 790415 798679 806988 815188
50057H15188R415J1267J2341J2534J2619J2865J3084J3259J3234J2637J1863J2138
50045I62444J3728J4954J4148J1992J0549J0372R917P982N566M652N661O826O253
50032A085044M193K667K807L367K676J302J441L859O931Q940R747R675Q442O299
50018A157390M857N262O516P050P205Q551J1127J3174J3718J3725J4316J5128
50006A278019J5255J4818J4716J5231J5737J5723J5604J6320J8223K0478K1706
49995A461830K1272J9811J8434J7735J7688J8073J8612J8792J8024J6121J3587
49984A659979J1466J0639J0817J0380P898L851J61k133l776n671p457q485r221
49971A678448j0699j3110j5914j8647k0775k1276j9639j7000j5221j4965j5533
$$ plain form
50057 815188 824603 835870 848211 860745 873364 886229 899313 912572 925806 938443 950306 962444
50045 962444 976172 991126 1005274 1017266 1027815 1038187 1048104 1056086 1061652 1066304 1071965 1078791 1085044
50032 1085044 1089237 1091904 1094711 1098078 1100754 1102056 1103497 1107356 1114287 1123227 1132974 1142649 1151091 1157390
50018 1157390 1162247 1167509 1174025 1181075 1188280 1196831 1207958 1221132 1234850 1248575 1262891 1278019
50006 1278019 1293274 1308092 1322808 1338039 1353776 1369499 1385103 1401423 1419646 1440124 1461830
49995 1461830 1483102 1502913 1521347 1539082 1556770 1574843 1593455 1612247 1630271 1646392 1659979
49984 1659979 1671445 1682084 1692901 1703281 1711179 1715030 1715191 1713058 1709282 1703611 1696154 1687669 1678448
49971 1678448 1667749 1654639 1638725 1620078 1599303 1578027 1558388 1541388 1526167 1511202 1495669
49960A495669j6220j6750j6629j5296j3037j0741q752o854n247m397l917k870
49948A374959j333m32n05m32P41K591M145M880M383K230r80l479m146l896m487
49933A374239o520r199j1457j2545j2291j1586j2042j4259j6842j7966j7406j6250
49921A215876j5123j3724j1794r489o964m542k955k414j722M18L274M798M679
49908A160318N154P935J1706J3914J4180J4529J6484J9292K1088K0739J8170J3871
49896A337380Q846M538K030J186P67n08l001n886p680p375n553m289n524r430
49882A305501j4396j8665k1676k3980k6257k8676l0893l2371l2796l2273l1072
$$ plain form
49960 1495669 1479449 1462699 1446070 1430774 1417737 1406996 1398244 1391390 1386143 1381746 1377829 1374959
49948 1374959 1373626 1373194 1372689 1372257 1372998 1375589 1379734 1384614 1388997 1391227 1390247 1386768 1382622 1378726 1374239
49933 1374239 1367719 1358520 1347063 1334518 1322227 1310641 1298599 1284340 1267498 1249532 1232126 1215876
49921 1215876 1200753 1187029 1175235 1165746 1158782 1154240 1151285 1148871 1147149 1147567 1150841 1155639 1160318
49908 1160318 1165472 1173407 1185113 1199027 1213207 1227736 1244220 1263512 1284600 1305339 1323509 1337380
49896 1337380 1346226 1350764 1352794 1353980 1354747 1354239 1351238 1345352 1337672 1330297 1324744 1320455 1314931 1305501
49882 1305501 1291105 1272440 1250764 1226784 1200527 1171851 1140958 1108587 1075791 1043518 1012446
$$ [...]
##END NTUPLES=NMR SPECTRUM
##END=
