
##TITLE=AC1131_Libano-tolima_5875227_odPQ01NecU
##JCAMPDX= 6.0         $$ Bruker NMR JCAMP-DX V2.0
##DATA TYPE= NMR SPECTRUM
##DATA CLASS= NTUPLES
##ORIGIN= BRUKER
##OWNER= Administrator
$$ 1.72 TOPSPIN		Version 2.1
$$ 2012-03-31 23:27:53.062 -0500  Administrator@TOPSPIN
$$ Compression mode = diff/dup
##.OBSERVE FREQUENCY= 400.13188235
##.OBSERVE NUCLEUS= ^1H
##.ACQUISITION MODE= SIMULTANEOUS (DQD)
##.ACQUISITION SCHEME= undefined
##.AVERAGES= 8
##.DIGITISER RES= 22
##SPECTROMETER/DATA SYSTEM= spect
##.PULSE SEQUENCE= zg30
##.SOLVENT NAME= COFFEE_meoh
##.SHIFT REFERENCE= INTERNAL, COFFEE_meoh, 1, 14.98061
##AUDIT TRAIL= $$ (NUMBER, WHEN, WHO, WHERE, PROCESS, VERSION, WHAT)
$$ ##TITLE= Audit trail, TOPSPIN		Version 2.1
$$ ##JCAMPDX= 5.01
$$ ##ORIGIN= Bruker BioSpin GmbH
$$ ##OWNER= Administrator
$$ $$ C:\Bruker\TOPSPIN/data/COFFEE/nmr/AC1131_Libano-tolima_5875227_odPQ01NecU/10/pdata/1/auditp.txt
$$ ##AUDIT TRAIL=  $$ (NUMBER, WHEN, WHO, WHERE, PROCESS, VERSION, WHAT)
(   1,<2012-03-31 23:27:44.375 -0500>,<Administrator>,<TOPSPIN>,<go>,<TOPSPIN 2.1>,
      <created by zg
	started at 2012-03-31 23:26:36.578 -0500,
	POWCHK enabled, PULCHK disabled,
       configuration hash MD5:
       1A 1E CE 29 27 FD 77 03 67 4E F0 E3 C4 B2 CB 90
       data hash MD5: 64K
       B2 E4 00 53 54 5F 2F 05 8F 73 0C 1D 0D 20 92 44>)
(   2,<2012-03-31 23:27:48.421 -0500>,<Administrator>,<TOPSPIN>,<proc1d>,<TOPSPIN 2.1>,
      <Start of raw data processing
       efp LB = 0 FT_mod = 6 PKNL = 1 PHC0 = 0 PHC1 = 0 SI = 32K 
       data hash MD5: 32K
       81 83 BA 3B 06 71 3A 7E E6 9A E6 A5 DF 89 54 AF>)
(   3,<2012-03-31 23:27:48.765 -0500>,<Administrator>,<TOPSPIN>,<proc1d>,<TOPSPIN 2.1>,
      <pk PHC0 = 215.8319 PHC1 = 0 
       data hash MD5: 32K
       FD 1C 14 86 FE D2 FE CA 11 FA 91 81 F6 22 0A A2>)
(   4,<2012-03-31 23:27:48.859 -0500>,<Administrator>,<TOPSPIN>,<proc1d>,<TOPSPIN 2.1>,
      <abs ABSG = 1 
       data hash MD5: 32K
       8C 57 13 12 78 DD C5 74 7D ED 8B EE 38 C5 A6 23>)
(   5,<2012-03-31 23:27:48.890 -0500>,<Administrator>,<TOPSPIN>,<proc1d>,<TOPSPIN 2.1>,
      <abs ABSG = 2 
       data hash MD5: 32K
       DF 86 94 B6 E2 06 D6 15 18 02 1D 63 5E 96 39 41>)
(   6,<2012-03-31 23:27:48.921 -0500>,<Administrator>,<TOPSPIN>,<proc1d>,<TOPSPIN 2.1>,
      <abs ABSG = 3 
       data hash MD5: 32K
       BB BA E5 58 10 74 DD F5 4F 87 C1 19 4E 43 FF 61>)
(   7,<2012-03-31 23:27:48.953 -0500>,<Administrator>,<TOPSPIN>,<proc1d>,<TOPSPIN 2.1>,
      <abs ABSG = 4 
       data hash MD5: 32K
       17 BC D1 49 ED 77 23 B7 57 3B 92 AB 03 73 67 2C>)
(   8,<2012-03-31 23:27:48.984 -0500>,<Administrator>,<TOPSPIN>,<proc1d>,<TOPSPIN 2.1>,
      <abs ABSG = 5 
       data hash MD5: 32K
       4E 6A F2 CD 80 0E C8 79 4E 18 20 F4 77 B0 F7 A8>)
$$ ##END=
$$ 
$$ $$ hash MD5
$$ $$ 13 0F EB 93 B3 8E 2C 3D B0 A2 06 77 49 22 C9 24
##$RELAX= 
##$RELAX= 
##$RELAX= 
##$RELAX= 
##$RELAX= 
##$RELAX= 
##$RELAX= 
$$ Bruker specific parameters
$$ --------------------------
$$ [...]
##$TP= (0..7)
150 150 150 150 150 150 150 150
##$TP07= 0
##$TPNAME0= <>
##$TPNAME1= <>
##$TPNAME2= <>
##$TPNAME3= <>
##$TPNAME4= <>
##$TPNAME5= <>
##$TPNAME6= <>
##$TPNAME7= <>
##$TPOAL= (0..7)
0.5 0.5 0.5 0.5 0.5 0.5 0.5 0.5
##$TPOFFS= (0..7)
0 0 0 0 0 0 0 0
##$TUNHIN= 0
##$TUNHOUT= 0
##$TUNXOUT= 0
##$USERA1= <user>
##$USERA2= <user>
##$USERA3= <user>
##$USERA4= <user>
##$USERA5= <user>
##$V9= 5
##$VALIST= <valist>
##$VCLIST= <CCCCCCCCCCCCCCC>
##$VD= 0
##$VDLIST= <DDDDDDDDDDDDDDD>
##$VPLIST= <PPPPPPPPPPPPPPP>
##$VTLIST= <TTTTTTTTTTTTTTT>
##$WBST= 2048
##$WBSW= 25
##$XGAIN= (0..3)
0 0 0 0
##$XL= 0
##$YL= 0
##$YMAX_a= 545908
##$YMIN_a= -654373
##$ZGOPTNS= <>
##$ZL1= 120
##$ZL2= 120
##$ZL3= 120
##$ZL4= 120
##$ABSF1= 14.98061
##$ABSF2= -5.57192
##$ABSG= 5
##$ABSL= 3
##$ALPHA= 0
##$AQORDER= 0
##$ASSFAC= 0
##$ASSFACI= 0
##$ASSFACX= 0
##$ASSWID= 0
##$AUNMP= <proc_prof1d_extract_pilot.lims>
##$AXLEFT= 0
##$AXNAME= <>
##$AXNUC= <1H>
##$AXRIGHT= 0
##$AXTYPE= 0
##$AXUNIT= <>
##$AZFE= 0.1
##$AZFW= 0.1
##$BCFW= 0
##$BC_mod= 0
##$BYTORDP= 0
##$COROFFS= 0
##$CY= 15
##$DATMOD= 1
##$DC= 0
##$DFILT= <>
##$DTYPP= 0
##$F1P= 0
##$F2P= 0
##$FCOR= 0.5
##$FTSIZE= 32768
##$FT_mod= 6
##$GAMMA= 0
##$GB= 0
##$INTBC= 1
##$INTSCL= 1
##$ISEN= 128
##$LB= 0
##$LEV0= 0
##$LPBIN= 0
##$MAXI= 10000
##$MC2= 0
##$MEAN= 0
##$ME_mod= 0
##$MI= 0
##$NCOEF= 0
##$NC_proc= -8
##$NLEV= 6
##$NOISF1= 0
##$NOISF2= 0
##$NSP= 0
##$NTH_PI= 0
##$NZP= 0
##$OFFSET= 14.98061
##$PC= 1
##$PHC0= 215.8319
##$PHC1= 0
##$PH_mod= 1
##$PKNL= yes
##$PPARMOD= 0
##$PPDIAG= 0
##$PPIPTYP= 0
##$PPMPNUM= 2147483647
##$PPRESOL= 1
##$PSCAL= 4
##$PSIGN= 0
##$PYNMP= <proc.py>
##$REVERSE= no
##$SF= 400.13
##$SI= 32768
##$SIGF1= 0
##$SIGF2= 0
##$SINO= 400
##$SIOLD= 32768
##$SPECTYP= <>
##$SREGLST= <1H.CDCl3>
##$SSB= 0
##$STSI= 32768
##$STSR= 0
##$SW_p= 8223.68421052632
##$SYMM= 0
##$S_DEV= 0
##$TDeff= 65536
##$TDoff= 0
##$TI= <>
##$TILT= no
##$TM1= 0
##$TM2= 0
##$TOPLEV= 0
##$USERP1= <user>
##$USERP2= <user>
##$USERP3= <user>
##$USERP4= <user>
##$USERP5= <user>
##$WDW= 1
##$XDIM= 32768
##$YMAX_p= 480896913
##$YMIN_p= -739562
##$CURPLOT= <Network HP LaserJet P1505>
##$CURPRIN= <$Network HP LaserJet P1505>
##$DFORMAT= <normdp>
##$LAYOUT= <+/1D_H.xwp>
##$LFORMAT= <normlp>
##$PFORMAT= <normpl>
##$SURQMSG= 1
$$ End of Bruker specific parameters
$$ ---------------------------------
##NTUPLES= NMR SPECTRUM
##VAR_NAME=  FREQUENCY,     SPECTRUM/REAL,   SPECTRUM/IMAG
##SYMBOL=    X,             R,               I
##VAR_TYPE=  INDEPENDENT,   DEPENDENT,       DEPENDENT
##VAR_FORM=  AFFN,          ASDF,            ASDF
##VAR_DIM=   32768,         32768,           32768
##UNITS=     HZ,            ARBITRARY UNITS, ARBITRARY UNITS
##FACTOR=    0.250966925370066, 1,           1
##FIRST=     8223.43324360095, 40928,        25705
##LAST=      0,             -147094,         122006
##MIN=       0,             -739562,         0
##MAX=       8223.43324360095, 480896913,    0
$$ Real data points
##PAGE= N=1
##DATA TABLE= (X++(R..R)), XYDATA
$$ [...]
19469B0848c059A47538c6265A41040a41078N7448o9155A42860a05724j41739A29348
19457f6714E5275a20365i932l25582J41744E9257b87852f6534j30248G9496N7967
19446A37463a36412G1990J53977c05942e6808n5189l0998O3477E8936b9722j78926
19435b08648f6764j90809a04975m43989A12708c53306r300J22256c7880k51218
19425b89098Q0385Q646b0175G7261a56284B779M4410d85326a3939l13378d3608
19413a94893R6932J2326j24290A2554d4811l91893A75256o2639b26792k01498
19403d28290G5000a04784b6069A92283a65700H0541d4010j19446G7625B6940J2413
19392C9353c09497E2689b87839j0671G5023b74952f2139k25668f6088G0379e0481
$$ y = [20848, -3059, 147538, -36265, 141040, -141078, -83630, -152785, 142860, -105724, -247463, 129348, -66714, 55275, -120365, -9932, -335514, -193770, 59257, -287852, -66534, -196782, 79496, 137463, -136412, 71990, 225967, -305942, -56808, -111997, -142995, -79518, 58936, -29722, -208648, -66764, -257573, -104975, -548964, 112708, -353306, -362606, -240350, -37880, -289098, -208713, -200067, -20175, 77261, -156284, 2779, 47189, -485326, -13939, -327317, -43608, -194893, -97961, -85635, -209925, 12554, -44811, -436704, 175256, 112617, -226792, -428290, 75000, -104784, -26069, 192283, -165700, 80541, -44010, -163456, 77625, 26940, 39353, -309497, 52689, -287839, -298510, 75023, -274952, -62139, -287807, -66088, 70379, -50481]
19380f8166r6321c9000k63674m1564E325O7966a63795A33640a19486J5218I4628
19368a60069D4298O5210O5446a50453I491N4752J69403F3198J24473l9003i7619
19356H9548b85597e9383J5656m0590A00662J5391c3291j01164p9701n5231a18136
19344I5909e7911A03811a56214D0262a66493G2358b79120J38719b343C49056a64719
19332B0513e07288A14872E0377g3567F4919b48903A6522J92227a90891l18910
19322e09801H1625f7823q7861A96879a15444j36048A67044J2352B7995g5720l25982
19311d01702a16032M9635J0547k96899D4317c19442k2005j3373b5194j56406j25914
19300c07514J17637b468k6936H6263e0614k44504O9948A93045a24039G2629d9998
$$ y = [-68166, -164487, -39000, -302674, -344238, 5325, 73291, -163795, 133640, -119486, -104268, 94628, -160069, 44298, 109508, 174954, -150453, 9491, 64243, 233646, 63198, 187671, 148668, -97619, 89548, -285597, -59383, -43727, -84317, 100662, 116053, -33291, -134455, -214156, -269387, -118136, 95909, -57911, 103811, -156214, 40262, -166493, 72358, -279120, -140401, -2343, 349056, -164719, 20513, -507288, 114872, 50377, -73567, 64919, -248903, 16522, 208749, -190891, -509801, 81625, -67823, -155684, 196879, -115444, -251492, 167044, 179396, 27995, -75720, -401702, -116032, -66397, -55850, -352749, 44317, -319442, -341447, -354820, -25194, -181600, -307514, -189877, -2468, -29404, 86263, -50614, -295118, -225170, 193045, -124039, 72629, -49998]
19288A23339d0041n2593C23090A9610K0338h2341A03450C5506O3511J49454a03732
19276D283K3793A3445a31367j09782J13881C1751d25006A98946r2049a42394C7394
19264a37884k29909A04533a96629Q900D9439b38184m5245a37468d9894A48848
19253c06478d4107A44174d8636j2198A73338c21308i32j2028p2002B6968a47601
19241b55090a02992k33640a47046a2131k50735J27969A12070K25859b00457M2911
19231a57546J3988l24120B941e8706E0320O5641a80979A21852a0451A31231b22973
19219A74520b17959E8503a90724B78787a68084A60084a35128j43007A01639k7257
19209G4382a4264j1540A0631b55310m9225E87933f8901b5776F4917f5406K7644
$$ y = [123339, -40041, -92634, 323090, 19610, 39948, -82341, 103450, 35506, 99017, 248471, -103732, 4283, 28076, 13445, -131367, -241149, -127268, 31751, -425006, 198946, 106897, -142394, 37394, -137884, -367793, 104533, -196629, -187729, 49439, -238184, -283429, -137468, -49894, 148848, -306478, -44107, 144174, -48636, -60834, 173338, -321308, -932, -12960, -84962, 26968, -147601, -255090, -102992, -336632, -147046, -12131, -262866, -134897, 112070, 337929, -200457, -157546, -143558, -467678, 2941, -58706, 50320, 115961, -180979, 121852, -10451, 131231, -222973, 174520, -217959, 58503, -190724, 278787, -168084, 160084, -135128, -278135, 101639, 74382, -14264, -25804, 10631, -255310, -304535, 587933, -68901, -25776, 64917, -65406, -37762]
19198c7762M584B65560q1647H4143i7559B467R064d6342n4173A28937J10030a52477
19185G9574j6419l1201J21518k2880a71758H1550d8589l4592j98395J24517n6061
19174b13120A70860e3603m08365a23704F374b25532M2652C29214a38610A89969
19163b45463F0394B4225e68504a77653j05876L8628f272j43988e1699k42661B2326
19151A04184J06119f6145A90744K4907a26484e6728k0174I9778b48321Q2527l7007
19140b02801C2884b50711A82359b23599B16104b6733l9989j06547g2364k75072
19130c47436a17908L8714j73751A14302N82i0360n8661E9619a03174j62969O129
19119b60014G253d900D8310L0537d8020A59737g3360j21641o578f1275k32501
$$ y = [-37762, -33178, 265560, 183913, 84143, -97559, 2467, 11531, -46342, -100515, 128937, 238967, -152477, 79574, 63155, 31954, 153472, 130592, -171758, 81550, -48589, -83181, -281576, -157059, -213120, 170860, -53603, -461968, -123704, 6374, -225532, -182880, 329214, -138610, 189969, -245463, 60394, 24225, -568504, -177653, -283529, -244901, -6272, -150260, -51699, -294360, 22326, 104184, 210303, -66145, 190744, 215651, -126484, -56728, -76902, 99778, -248321, -165794, -202801, 32884, -250711, 182359, -223599, 216104, -26733, -66722, -173269, -72364, -347436, -117908, -79194, -252945, 114302, 114884, -90360, -149021, 59619, -103174, -266143, -260014, 7253, -4900, 48310, 78847, -48020, 159737, -73360, -195001, -201579, -61275, -293776]
19108b93776i1733k19035A7615a63837a1632m0379k4673B85741i4271j31313C4921
19096c28201A26186b18228k73465A76625f4642B37843a28758M8661j42786h0736
19085a73436N4594H022i9550A64769c9150r907A03982i4235H2820j6323b87566
19073b44966C11814c6435l3448n5430f973j17757K5190A95302g1449A6703J32829
19062A49532i7211I2497b9239B79043D9465b6210B19497b87937c0254o6824K8986
19051f8092m6962j57714A04470g9058g581A633J93433a15664J4486j63198a9368
19039a71828r273e2464j56216L7494j6156l38379a74098q4584B77841i3300k9636
19028a22936C44230b8195m52298a26988A59051a61401k6645A46712f820k54098
$$ y = [-293776, -91733, -310768, 17615, -163837, -11632, -52011, -76684, 285741, -94271, -225584, 34921, -328201, 126186, -218228, -491693, 176625, -64642, 237843, -128758, -80097, -222883, -80736, -173436, -118842, 8022, -99550, 164769, -39150, -49057, 103982, -94235, 82820, 66497, -287566, -244966, 311814, -36435, -69883, -125313, -6973, -124730, -99540, 195302, -71449, 16703, 149532, -97211, 92497, -29239, 279043, 49465, -26210, 219497, -287937, -30254, -97078, -68092, -115054, -272768, 104470, -79058, -7581, 1633, 195066, -115664, -101178, -264376, -19368, -171828, -181101, -52464, -208680, -171186, -187342, -525721, -174098, -258682, 277841, -93300, -122936, 344230, -28195, -480493, -126988, 159051, -161401, -188046, 146712, -6820, -260918]
19018b60918j14383J85145c5845i393k25634i5919I8927b9776A2271a09693j5919
19007a25612a1156B25090k7641a84487f5476A04366a09607L5633A38790f7427
18996D0500K17481e0567a3428B7510f7265j1024I1523C8762J83244g2287I6574
18984d8429J6254j58106m4009C01159c68479i1414B7846M0291b59179q273R7221
18973a70231j83742B30340a89875A51720J68562b84888A22439Q427g3305B78134
18962A40233d0134B15355R699N6179P6750K20422i0110G7769M8342Q9249i755
18950A50850o7172l2822b5080n7304o0952C77089A33344J59007I6881a96130J6879
18939a79251j56054I2803a90250n9485A06239J98013a30378j26702B0174a97666
$$ y = [-260918, -375301, -190156, -35845, -9393, -235027, -95919, 98927, -29776, 12271, -109693, -125612, -11156, 225090, 197449, -184487, -65476, 104366, -109607, -73974, 138790, -67427, 40500, 257981, -50567, -13428, 27510, -67265, -78289, 91523, 38762, 222006, -72287, 96574, -48429, -32175, -190281, -234290, 301159, -368479, -91414, 27846, 68137, -259179, -267452, -170231, -353973, 230340, -189875, 151720, 320282, -284888, 122439, 130866, -73305, 278134, 140233, -40134, 215355, 225054, 281233, 357983, 578405, -90110, 77769, 126111, 215360, -9755, 150850, 83678, 50856, -25080, -82384, -143336, 377089, 133344, 292351, 96881, -196130, -179251, -335305, 92803, -190250, -249735, 106239, 304252, -130378, -257080, 20174, -197666]
18928d55964a39814H571b42888B93379F1499a30930M9135b0440j72282g3083B09428
18916b05653q1536I385N5758J34026b18098A6852c5492k1035B5411J67824f17
18904A45266N9483b71857I8609j8772b5394A03J07426O8612b01851C23421J66860
18893D90281K01581C11242a00106H7963J22139A4898K11553C2038K10363p0185
18883A72216l9745c89520J62455g0107j96156Q2397d3865j92646m2336l7118D2005
18871b22014f3555k76446a33235B95477b22151c3878k99919a13805E1437f3303
18860B68007a21016d8140l36316G6566c6631r8631m3644b3164k91252a48301b8420
18848A894Q08b49872B2843J51704f7966o3772B0924D882a27561G1099J4700I612
$$ y = [-455964, -139814, 8571, -242888, 293379, 61499, -130930, -81795, -20440, -192722, -73083, 209428, -205653, -287189, 9385, 65143, 199169, -218098, 16852, -35492, -56527, 25411, 193235, -617, 145266, 204749, -271857, 98609, 79837, -25394, 103, 107529, 176141, -201851, 323421, 490281, 691862, 311242, -100106, 87963, 210102, 14898, 226451, 32038, 242401, 172216, 132471, -389520, -227065, -70107, -266263, -183866, -43865, -236511, -278847, -315965, 42005, -222014, -63555, -340001, -133235, 295477, -222151, -33878, -333797, -113805, 51437, -63303, 268007, -121016, -48140, -384456, 76566, -36631, -135262, -178906, -23164, -314416, -148301, -28420, 1894, 2702, -249872, 22843, 174547, -67966, -131738, 20924, 4882, -127561, 71099, 85799, 9612]
18835g9887a0680A49627c837A38538K1879j4493M1582O4002N9203C0673b1177
18823i9480j29440A88358B6775O3598J45740a88677B58570b09804O9879o7049
18813b06974j49651f7190K3753r6669A14742a36959c8977A09774a52073A64616
18802a8299B92976e7478I640b00495j3798j78849C25219j12891r2594J25770C7810
18790A13693k3358b73589g4591q0118C766N014l086Q6745J15125a70820k02591
18779c73411b6832F3646B3028j0038a52526C1912a37725k13976A50656b22593
18768a8974m60053C8608J494O6580a05924B29754a33842j82328Q1368H1787b4175
18756a66814g3397A64361a72744d3170l0073A33785b20597c9919E6320b23725
$$ y = [-79887, -10680, 149627, -3837, 138538, 160417, 145924, 187506, 251508, 310711, 30673, -21177, -99480, -228920, 188358, 26775, 90373, 236113, -188677, 258570, -209804, -139925, -206974, -356625, -67190, -43437, -140106, 114742, -136959, -38977, 109774, -152073, 164616, -18299, 292976, -57478, 9640, -200495, -214293, -393142, 325219, 212328, 119734, 245504, 37810, 113693, 90335, -273589, -74591, -154709, 3766, 8780, 5694, 92439, 207564, -170820, -373411, -26832, 63646, 23028, 12990, -152526, 31912, -137725, -351701, 150656, -222593, -18974, -479027, 38608, 40102, 106682, -105924, 229754, -133842, -316170, -234802, 81787, -24175, -166814, -73397, 164361, -172744, -43170, -73243, 133785, -220597, -39919, 56320, -223725]
18745A10095d10238H5522h7484J8650j86534a20437A1398c53338A76057o2314
18735A13743D8248g8737A34741k1256b78159A00045i0953A29566b43179G3568
18724h6108j24005R7230C6093a88488o0604o2196K9845j62220i3328m0640B0514
18712e5325J2189m7631A50167a30860A0389a25235j77805E7923b49142j81387
18702d30529C08358a40224k35182J53032F3276b95279b0639l60755b5116k35785
18692b60901k8624a29902j98883a31011j21543R3969G2919g5683n9445A24687
18681A27642f8192l3524n9519G6501f3451A93376c37545A09860P7448n6623b14987
18669b24009O3746B04381a06633k5676I5410b69077J23344j66870d2863j96776
$$ y = [110095, -410238, 85522, -87484, -68834, -255368, -120437, 11398, -353338, 176057, 113743, 48248, -78737, 134741, 113485, -278159, 100045, -90953, 129566, -243179, 73568, -86108, -210113, -112883, 36093, -188488, -249092, -311288, -281443, -443663, -93328, -133968, 20514, -55325, -43136, -90767, 150167, -130860, 10389, -125235, -303040, 57923, -249142, -430529, 308358, -140224, -375406, -222374, 63276, -295279, -20639, -381394, -25116, -260901, -289525, -129902, -328785, -131011, -252554, -158585, 72919, -75683, -135128, 124687, 127642, -68192, -101716, -161235, 76501, -63451, 193376, -337545, 109860, 187308, 130685, -214987, -224009, -160263, 204381, -106633, -132309, 95410, -269077, -145733, -312603, -42863, -239639]
18659b39639j01255q0641A7321K0164c49812Q6257O4482b2399I3471c19642J46824
18648a72818n8715E3674J47340F7491h6013j75479B67552h8542c0878l42343A82285
18636b4497A0396c599B6447a09006a7385l1857j5519j07484j73312B16484F604
18624b7979o4324G6910f1237r8740M8028p1052q7826R2509Q179j27927A7423h5273
18611B18099I2854f5476I822N6451Q9194E5733g0762A9965M1891d099B04093E0036
18598b66248A51417a83894J2359j98207e9087D6752b44895C7160b10925j49609
18588c60534c5033B08144a79760o5067F1257E879B48d1090F0912b13827A13125
18576a29781D2092b12790A89388b91498O6107h5671q921A53104a48468j32166
$$ y = [-239639, -340894, -421535, 17321, 37485, -349812, -263555, -199073, -22399, 93471, -319642, -172818, -231533, 53674, 201014, 67491, -86013, -261492, 267552, -88542, -30878, -373221, 182285, -24497, 10396, -3599, 26447, -109006, -17385, -49242, -64761, -172245, -345557, 216484, 6604, -27979, -92303, 76910, -61237, -159977, -111949, -183001, -270827, -178318, -170139, -298066, 17423, -85273, 218099, 92854, -65476, 9822, 66273, 155467, 55733, -70762, 19965, 61856, -4099, 204093, 50036, -266248, 151417, -183894, -171535, -369742, -59087, 46752, -244895, 37160, -210925, -360534, -35033, 208144, -179760, -244827, 61257, 5879, 248, -41090, 60912, -213827, 113125, -129781, 42092, -212790, 189388, -291498, -225391, -85671, -94592, 153104, -148468, -280634]
18566b80634j76524J86643R560k3891B29072g5230F6104b58474A46490c76808
18555A11950M554e6389a8673B0112J08741g9665k23750N0393e8525C5166j7537
18544A7629b96175o2011P1665e534A26644C7672P9121a5629H6361C3558O5327
18533I8885b55548A9689M42139a39155O2129c1264k43147F7812b02472k25488
18523d27960g5934j67201K2529b4765H9057a50528B40450h3901l9114A42881B3886
18511a88224R0464A0972J44878a74295n4570H4223g052B47080b50721B45416j8865
18500B26551a50438F285N752i0950n186j54467A87196c22809G1089O8539c32854
18488B28630G8686J8988b28837O2033B8451c49120I9506h2320A51075a90261B76482
$$ y = [-280634, -457158, -270515, -260955, -284846, 229072, -75230, 66104, -258474, 146490, -376808, 111950, 116504, -56389, -18673, 20112, 128853, -79665, -303415, -253022, -58525, 35166, 17629, -296175, -358186, -286521, -5534, 126644, 37672, 116793, -15629, 86361, 33558, 98885, -255548, 19689, 461828, -139155, -77026, -31264, -274411, 67812, -202472, -427960, -75934, -243135, -220606, -24765, 89057, -150528, 240450, -83901, -123015, 142881, 23886, -188224, -97760, 10972, 155850, -174295, -228865, 84223, -7052, 247080, -250721, 245416, 226551, -150438, 6285, 12037, -90950, -96136, -250603, 187196, -322809, 71089, 139628, -332854, 228630, 78686, 97674, -228837, -166804, 28451, -349120, 99506, -82320, 151075, -190261, 276482]
18476h922l03416a05382J8504j06870R6k1317a01936A22470b58929h524A37850
18464c8564l40276a19849n58018a19601A31316o1694J3772J62256a25668D3464
18453i4171A53446J48640a12897A10545b46952B72318A02765a41435p1573d5122
18442c8489j10553B8789d4761B89562b86565H5526B5717b82761A14180c46653
18431b32408L6822L6337J9899J0255j29406C96K20152H7554b83334J32028A54497
18419A89023f2201l65489J65882A67859g6738J2443k32367k0503C8171a17073
18408a54437j4145H2223a96658L8849j42103C04017a96021Q8920B29343b33040
18397b18497j9644o6241A22463O2646B1780b79118A02458J12055b86654D3198
$$ y = [-8922, -312338, -105382, -86878, -193748, -193652, -214969, -101936, 122470, -258929, -8524, 137850, -38564, -378840, -119849, -677867, -119601, 131316, 69622, 83394, 245650, -125668, 43464, -94171, 153446, 302086, -112897, 110545, -246952, 272318, 102765, -141435, -213008, -45122, -38489, -149042, 28789, -44761, 289562, -286565, 85526, 25717, -282761, 114180, -346653, -232408, -195586, -159249, -139350, -129095, -258501, 396, 220548, 87554, -283334, -151306, 154497, 189023, -62201, -427690, -261808, 167859, -76738, -64295, -296662, -317165, 38171, -117073, -154437, -168582, 82223, -196658, -157809, -299912, 304017, -196021, -107101, 229343, -233040, -218497, -238141, -304382, 122463, 185109, 21780, -279118, 102458, 214513, -286654, 43198]
18386C14638c60634i1587A23928K7789N4956a52322B82463b4779j42697b2087
18375B90560i6416E4474a14936B314e599j48110c238j50764H6003j7131b15334
18363A21630c3887o1848j0145j16372A26328H773N7252l0436j5371L6565e6688
18351A73335i349q059n9774I1309a67520E6925k2527a30067N74A89799o8350B5532
18338b43091b1310j00466l636D8439J26016D105a06052d7989b2518m7355I0859
18326G6697k502g4769q244N635c8518E7670d4099k06151R4608b6398p0263A02486
18313i5669A3766O3243g7213a7276k10374A39100n6723i9579B21335P3757b12685
18301a2898l26380A19537c76863O3356A5345M2326J18507j4924a95445G7590a45997
$$ y = [314638, -360634, -91587, 123928, 151717, 206673, -152322, 282463, -24779, -167476, -22087, 290560, -96416, 54474, -114936, 2314, -5599, -153709, -3238, -154002, 86003, 68872, -215334, 121630, -33887, -95735, -105880, -222252, 126328, 8773, 66025, 35589, 20218, 56783, -56688, 173335, -9349, -17408, -77182, 91309, -167520, 56925, 34398, -130067, -129493, 189799, 121449, 25532, -243091, -21310, -121776, -125412, 48439, 174455, 4105, -106052, -47989, -22518, -69873, 90859, 76697, 74195, -74769, -83013, -77378, -38518, 57670, -44099, -250250, -155642, -26398, -96661, 102486, -95669, 13766, 77009, -77213, -17276, -227650, 139100, 82377, -99579, 221335, 295092, -212685, -12898, -339278, 119537, -376863, -313507, 15345, 57671, 176178, 161254, -195445, 77590, -145997]
18289b41990g486j33184O7578G906J03392a61641H6991c79815a20409A05779d35190
18277A14566m6647b6767G2085K04688a44805M9714D8508J63353a66486F2405J29188
18266A91593a98645m1363L1469h0669C45226j21254a86749h9242A92352a46078
18255H7595b99754P3511j5361N4150A97980P5112a98129A18693c29411B75563
18244A59016D4475a55816O1892n5617A28729c82032a67938a7500A01408K3132
18234A24540M2977o83E0237f6365j73979a03882k8315q3417l2418G324a58417
18222a88140D39939A12432a869k54175i4851b9204A04477b74996M7089C5599h9996
18210B7884b38261P4224A15081c03290i2823H9223K5733a69112D05961c5025B10161
$$ y = [-241990, -7486, -140670, -73092, 7906, 111298, -161641, 86991, -379815, -120409, 105779, -435190, 114566, 67919, -26767, 72085, 276773, -144805, -95091, 48508, 211861, -166486, 62405, 191593, -198645, -240008, -208539, -80669, 345226, 223972, -186749, -89242, 192352, -146078, 87595, -299754, -226243, -241604, -187454, 197980, 273092, -198129, 118693, -329411, 275563, 159016, 44475, -155816, -93924, -149541, 128729, -382032, -167938, -17500, 101408, 124540, 167517, 166834, 50237, -66365, -240344, -103882, -132197, -215614, -248032, 7324, -158417, -188140, 439939, 112432, -1869, -256044, -94851, -29204, 104477, -274996, -227907, 35599, -89996, 27884, -238261, -164037, 115081, -303290, -92823, 89223, 114956, -169112, 405961, -35025, 210161]
18198C63460A31989c6320j2930I4444C4443b44509A23565k4473a89585M4289c0695
18186a05915A70126a19271n5721j13922C262K28891b79387M8012L7577F3445J2319
18175G5764b18202E6507a57385F8637a01396C5418N6084G263b8981j61527A99384
18163B9641a82008A18860J84321a07259D9466c57378i8875A79030D0958b46098
18152A12513K6859b4275m1683D8001b683A81279a88578h8442C44690I7622K7514
18141A25136C751J8085J0019h8427b7450j6080k63617H8738a668p3658B8464K50465
18129B78929a36148j95549D5497h8409E5589K66299A49110h1535A41090i3006
18118B395J43010b44530e2158A30541M8173o2906a5846n26661a73126B85667J29568
$$ y = [363460, 131989, -36320, -49250, 94444, 34443, -244509, 123565, 99092, -189585, -145296, -30695, -105915, 170126, -119271, -174992, -288914, 3262, 232153, -279387, -231375, -193798, 63445, 75764, -218202, 56507, -157385, 68637, -101396, 35418, 91502, 7263, -28981, -190508, 199384, 29641, -182008, 118860, 303181, -107259, 49466, -357378, -98875, 179030, 40958, -246098, 112513, 139372, -24275, -65958, 48001, -2683, 181279, -188578, -88442, 344690, 97622, 125136, 3751, 21836, 31855, -88427, -27450, -43530, -307147, 88738, -1668, -75326, 28464, 278929, -136148, -331697, 45497, -88409, 55589, 321888, 149110, -81535, 141090, -93006, 2395, 145405, -244530, -52158, 130541, 178714, 115808, -15846, -542507, -173126, 285667, 415235]
18107D15235C4498a51064j09284a05061n23a8426F6863M743d0436j72860R9842
18096a13454K0332M2930o893m08499i550j27125e602l1537A59580j2439A2593
18084e0296A2945f0575l70339B3425M9492A9485J42058a82271j21602d1703o7069
18073a08772b0004k08377F9850P3345e17790C53068a3478B71488c93668B73367
18062a15718A55390J12172f3623A5270g5367B13112H237O0154a86324g212m4846
18051e2058B01891b98336C10484b6778j37028c9498j6409A56445f7912q2234A34169
18039a37050F8875J85834a9441k24538A04519K739E0925J38546d09033D4390a97685
18027H1839d3407m10794a93733F9359a90866d1422C70294c6445k78239g9602r3134
$$ y = [415235, 34498, -151064, -260348, -105061, -105584, -18426, 66863, 71606, -40436, -213296, -113454, -93122, -50192, -57085, -465584, -9550, -136675, -5602, -37139, 159580, 147141, 12593, -50296, 12945, -60575, -430914, 23425, 72917, 19485, 161543, -182271, -303873, -41703, -108772, -20004, -228381, 69850, 143195, -517790, 353068, -13478, 271488, -393668, 273367, -115718, 155390, 267562, -63623, 15270, -75367, 213112, 8237, 68391, -186324, -7212, -52058, 201891, -298336, 310484, -26778, -163806, -39498, -55907, 156445, -67912, -150146, 134169, -137050, 68875, 254709, -19441, -243979, 104519, 107258, 50925, 189471, -409033, 44390, -197685, 81839, -43407, -454201, -193733, 69359, -190866, -41422, 370294, -36445, -314684, -79602, -172736]
18016a72736J257P3896G1495L5521J47502h5314m6847A57208a39310D60175f6051
18004B0603i6424B06267h873E65K01009n7644a26971B86988l477H6357J9134M3733
17992A49224c38495B83184f7231m0022A73250J8239c2872l7292a6506j51839p0812
17981b39157j66636B0120N649O1296C2411R2718L4233E2782a43600C31505a7995
17969A11030a70312f5986j66381R597A17452i5078B23221n1742o4749Q3782n4093
17958A36419A4349d2876B75129B7924L17528A14220d2879j67014A45609B9020
17947F9398L70309A0061J70182j6883a11667j80318D1349j8743a9751C0813J38624
17936A69437c36714E1172f2480B80065a86853j207A32217e5716C0877a9909C272
$$ y = [-172736, -171479, -97583, 71495, 107016, 254518, -85314, -132161, 157208, -139310, 460175, -66051, 20603, -96424, 206267, -8873, 565, 201574, 143930, -126971, 286988, 283511, 86357, 105491, 149224, -338495, 283184, -67231, -107253, 173250, 191489, -32872, -70164, -16506, -168345, -239157, -405793, 20120, 25769, 87065, 32411, 125129, 159362, 52782, -143600, 331505, -17995, 111030, -170312, -65986, -232367, -222770, 117452, -95078, 223221, 171479, 106730, 190512, 136419, 14349, -42876, 275129, 27924, 345452, 114220, -42879, -209893, 145609, 29020, 69398, 439707, 10061, 180243, 163360, -111667, -291985, 41349, 22606, -19751, 30813, 169437, -336714, 51172, -62480, 280065, -186853, -188060, 132217, -55716, 30877, -19909, 3272]
17924I8941O178O0249a54408A52314b4269k45161d2416C00125M2539G8127a39381
17912d461j15684A28427a42784O9988H5269a41128C8632L5362j4393P9773A7963
17900a46924r5284A8219M1832B1004c4107k16357O766B32791j3705d0026F5426
17888C64208B4898R5281a05441d4162n3646K2091k1257k46468H6965a11849N1244
17877f0605H9013b70662A71838D2075f5845j18976D87809q6366b12107P9716B33487
17865A0438d13122D1046b90827A50337N7707k5079N3028a07811B3786L3456J44500
17854B01742A5696i82B10920a60476A00963e3366C22434b56510N5219Q7439G1675
17842B63113K2443b37107A53256b12078e4375C09338A34935A1241M2587K00067
$$ y = [98941, 105119, 165368, -154408, 152314, -24269, -269430, -42416, 300125, 342664, 78127, -139381, -4461, -120145, 128427, -142784, -72796, 85269, -141128, 38632, 73994, 59601, 139374, 17963, -146924, -242208, 18219, 60051, 21004, -34107, -250464, -243698, 232791, 219086, -40026, 65426, 364208, 24898, 120179, -105441, -44162, -97808, -75717, -96974, -343442, 86965, -111849, -60605, 89013, -270662, 171838, 42075, -65845, -184821, 487809, 401443, -212107, -132391, 233487, 10438, -413122, 41046, -290827, 150337, 208044, 182965, 235993, -107811, 23786, 57242, 201742, 15696, -982, 210920, -160476, 100963, -53366, 322434, -256510, -201291, -113852, 71675, 263113, 285556, -237107, 153256, -212078, -54375, 309338, 134935, 11241, 53828, 253895]
17832B53895b40969a15194b3390k9067A11105a75084F1284J82191I4612J20803
17822B15415d48286a08472p588B3623M3436i5234H0446d95879a8916C14440H2645
17810G3172N4190D2716h4774A15478b0687h802F76O9033b351E4362c43247c4349
17797C91636A83854K7413l1235a55014F1807J08288k5818F2669N0324C6373c9036
17785a89768P2566j64720C37825h2450m3496c8692E2785J7894J1378g5096k03633
17774b78729B41870R9832O6652a21791C04126i6333D3897J46368a22065I1103
17763a31498A90432H0568J26875G9016a55479I4095a56481j52623A97527L6137
17753B33664b08894f2168B0683K27879a97945A8173L5892O3212k8793b03134D2300
$$ y = [253895, -240969, -115194, -23390, -52457, 111105, -175084, 61284, 243475, 94612, 215415, -448286, -108472, -116060, 23623, 67059, -95234, 80446, -495879, -18916, 314440, 82645, 73172, 127362, 42716, -84774, 115478, -20687, -8802, 676, 69709, -2351, 54362, -343247, -34349, 391636, 183854, 211267, 180032, -155014, 61807, 170095, 144277, 62669, 112993, 36373, -39036, -189768, -117202, -281922, 337825, -82450, -125946, -38692, 52785, 70679, 82057, -75096, -278729, 241870, 341702, 408354, -121791, 304126, -96333, 43897, 190265, -122065, 91103, -131498, 190432, 80568, 207443, 79016, -155479, 94095, -156481, -309104, 197527, 233664, -208894, -62168, 20683, 248562, -197945, 18173, 54065, 117277, 88484, -203134, 42300]
17741A55563a01140C00256f2479A88086i882D793a40907B8373e7975k25365g1911
17729A12568Q4242D369h7586k1786q3481E9443k7079J81075j05576a01214c7835
17717b2109A55050o4056J25354j01469e6068p4290B82894K81123j07240G7923
17706G1697h6357B47264A15491a07730B02333b11109A19298n47J90940I4463J54513
17695B48976g6221b393j50465I3082J40978B4421J87840b6105I2284O6232a7778
17683C08879d84B02142c4853A10368F501a5657m6011A11948c7621A59329J15629
17672B74958b3451B62287K10806A80554n0237f4632L765j08197B95087e9206A480
17660h0034o6288A16529m1116K72211A19956K33546j19027E5870J96324A5403
$$ y = [155563, -101140, 300256, -62479, 188086, -9882, 4793, -140907, 28373, -57975, -283340, -71911, 112568, 196810, 4369, -87586, -109372, -192853, 59443, 32364, 213439, 107863, -101214, -37835, -22109, 155050, 90994, 216348, 114879, -56068, -130358, 282894, 564017, 456777, 77923, 71697, -86357, 247264, 115491, -107730, 202333, -211109, 119298, 118751, 309691, 94463, 248976, -76221, -2393, -152858, 93082, 234060, 24421, 212261, -26105, 92284, 158516, -17778, 308879, -484, 202142, -34853, 110368, 6501, -15657, -61668, 111948, -37621, 159329, 274958, -23451, 262287, 473093, 180554, 130317, -64632, -60867, -169064, 295087, -59206, 1480, -80034, -146322, 116529, 75413, 347624, 119956, 353502, 234475, 55870, 252194, 15403]
17649g4601F4831M23509a2027o5358B07659m5626L42234F7701B3244i4302C60405
17637B22042G9205J76659L5585r3644G1875O8422c1287C36040p1435a23970A93381
17625g9867H5659d353C29310f7100m6196A58834C6369a94583c2802C71888A73471
17613a6002j16099C73366K51697q7230A81372d6652E5737M5802c9461B0453M46438
17602D66891D3504J78863a1172C10886a30264A87701I0031J51891p7981a67498
17591B00383g4306A75788K21595q6447q7694b92894B72949i5445B57357k1900
17581B35457n4963F7084K08905E7796N5670b97996e3615A03672J92895K0330A56543
17569A99950P2223l9313a75381e7372A94004Q0276n6506L8348n8211O8343b528
$$ y = [-74601, 64831, 488340, -12027, -77385, 207659, 162033, 504267, 67701, 23244, -94302, 360405, 222042, 79205, 255864, 291449, 197805, 71875, 140297, -31287, 336040, 264605, -123970, 193381, -79867, 85659, -4353, 329310, -67100, -113296, 158834, 36369, -194583, -32802, 371888, 173471, -16002, -132101, 373366, 625063, 537833, 181372, -46652, 55737, 101539, -39461, 20453, 466891, 43504, 222367, -11172, 310886, -130264, 187701, 90031, 241922, 163941, -167498, 200383, -74306, 175788, 397383, 310936, 223242, -292894, 272949, -95445, 257357, 235457, 180494, 67084, 275989, 57796, 113466, -297996, -53615, 103672, 296567, 316897, 156543, 199950, 272173, 232860, -175381, -57372, 194004, 274280, 217774, 256122, 197911, 266254, -2528]
17557D07138A86615h5233B97376R9502A69608g0701H5761L11849B2542J97285
17547B19827b55457B4478K29844j12014p519j6475J17127H5017J05487j7311K1403
17536A94596l5123J16035a57708B78920A22537Q1318I4505K44761A63318L73749
17526E37067A24465A5844J84397p6598K02637M1310j16257J1600J0083p3908b6379
17514B08320K18164p7918J3845J18279K32122R6566M68322k79054l78363r2024
17504E28259M69816m49108k21360J29752J00927k52755J25560m546K84857K68887
17494I80289L1330r6070j41110L8257A89760M76174l23161j13376A1852L69328
17484C81180g7211B74761K81329B7391M69027F6676O8507K64127n2040N8407c8220
$$ y = [407138, 186615, -85233, 297376, 396878, 169608, -70701, 85761, 397610, 22542, 219827, -255457, 24478, 254322, 142308, 134789, 118314, 235441, 85017, 190504, 173193, 194596, 159473, 275508, -157708, 278920, 122537, 203855, 94505, 339266, 163318, 537067, 124465, 15844, 200241, 123643, 326280, 367590, 251333, 262933, 273016, 199108, -26379, 208320, 426484, 348566, 362411, 480690, 712812, 809378, 1277700, 998646, 620283, 528259, 998075, 548967, 327607, 457359, 558286, 305531, 431091, 426545, 711402, 980289, 1011619, 915549, 774439, 812696, 189760, 665934, 342773, 229397, 11852, 381180, -77211, 274761, 556090, 27391, 496418, 66676, 135183, 399310, 347270, 405677, -38220]
17472E20644j67737K20739q5758A62328K1869K66123I4005K54638m729J31842
17462D75756j35958m3673M9986p8194r7498F8914K41549J97182H6238K43748K02808
17451E32794g9048A13821g4634C85104G5311J28586J40610N935L8441j07950m1543
17440B39390N5985K7318q2391A00955Q9163K31594j45639L62809A48306K78295
17430D26601j92841J84590j47579N1570L8372O0428J6701j32163i7364C37922
17419D70983B33566q7569K55566r1347K04351p8770k3366j93388K2226M4563L22604
17408F08436k63522l8918j46108M14937m8588l2144Q510e3389D64250H6614N03241
17397E89855k92602K1501q2674A10636L83054n7014P9141k10515H3822R955b6090
$$ y = [520644, 352907, 573646, 487888, 162328, 184197, 450320, 94005, 348643, 343914, 475756, 339798, 296125, 346111, 267917, 170419, 68914, 310463, 507645, 86238, 329986, 532794, -79048, 113821, -74634, 385104, 75311, 203897, 344507, 350442, 388883, 280933, 239390, 295375, 322693, 240302, 100955, 190118, 421712, 276073, 638882, 148306, 426601, 233760, 418350, 270771, 322341, 360713, 421141, 437842, 305679, -97364, 337922, 470983, 233566, 145997, 401563, 310216, 514567, 435797, 412431, 219043, 241269, 285832, 608436, 344914, 305996, 159888, 574825, 526237, 494093, 502603, -53389, 464250, 86614, 589855, 297253, 318754, 236080, 110636, 493690, 436676, 515817, 305302, 83822, 93777, -26090]
17385i1950B13601P5529I7713K12395l6847a9567H9230M20499k7341K5634I9494
17373C84488o3770q0845l7965K51146B18587P8736O7888A26347a44931G9340K43008
17362C22348n9622A20429J40912J82198A56360K82206j71279K53789j51089A27946
17351C75773J72491K98411B60733g6177I1959K63995r8996N8528K29077B27837
17340C80246K6748I7093J32884m7176K11417J75788k07080M0461N9364o9568I6178
17328I9286J57743L28632A59789J62385L9363A73014a02341D02136K2389A77747
17317f411A93873L1842K85284j72147F3560M73099j50473q7960B1201a43384B77821
17305E96254B70312m8431M6694K25999D0681J98743L5664P5223A48988J26838
$$ y = [-91950, 213601, 289130, 97713, 310108, 273261, -19567, 89230, 509729, 482388, 508022, 99494, 384488, 320718, 239873, 201908, 453054, 218587, 297323, 365211, 126347, -144931, 79340, 322348, 262726, 120429, 261341, 443539, 156360, 438566, 267287, 521076, 369987, 127946, 375773, 548264, 846675, 260733, -76177, 91959, 355954, 256958, 315486, 544563, 227837, 380246, 406994, 97093, 229977, 182801, 394218, 570006, 362926, 403387, 462751, 393183, 96178, 99286, 257029, 585661, 159789, 322174, 361537, 173014, -102341, 402136, 424525, 177747, -6411, 193873, 225715, 510999, 338852, 63560, 536659, 386186, 298226, 21201, -143384, 277821, 596254, 270312, 221881, 268575, 494574, 40681, 239424, 275088, 350311, 148988, 275826]
17295B75826M7994A08205O58801l09150j24140p8421K8930j20799K16201A25634
17284B41022K83962d2812A42286R9133K51015j04989j68328R7221L71163D5651
17273C55241j77325K3574L34519j94224A19152J09887K87893A98908L99997A17795
17262D36899A42027P7792K91125j46646K33342k13206A81251M11771B20967K73000
17252D93967A00574J77867E8227K34917N542j17539L25224B47083j7749J12024
17242C41358K0384n2812L28011k09948m1506j81664L83508A46675K47692o7883
17232C26484l794m6148J60295A62879L04632j57706j01133J83289J7986j75276
17222B34671K97998B39853M66767k03221o5479A94831J26793M33098C75702M0891
$$ y = [275826, 323820, 108205, 767006, 457856, 333716, 255295, 284225, 163426, 379627, 125634, 241022, 524984, -42812, 142286, 241419, 492434, 387445, 219117, 316338, 687501, 45651, 355241, 177916, 201490, 536009, 341785, 119152, 229039, 516932, 198908, 598905, 117795, 436899, 142027, 219819, 510944, 364298, 597640, 384434, 181251, 593022, 220967, 493967, 100574, 278441, 58227, 293144, 298686, 181147, 506371, 247083, 229334, 341358, 361742, 308930, 636941, 426993, 385487, 203823, 587331, 146675, 394367, 326484, 322690, 276542, 436837, 162879, 467511, 309805, 208672, 391961, 409947, 234671, 532669, 239853, 706620, 503399, 437920, 194831, 321624, 754722, 375702, 416593]
17212D16593j20198F0496M99034J53071C51174o9235K18567k11565M6255J05816
17202D41012o8580r9193L32733j54036K16601B53951F9238M80878k66111N9034
17192C43039J17738j07815J12721K4678L2069j96885o8271K32698N3989k25171
17182C18790N3460r0477K61717n575j68062J37686A58781J27603J33778J79849
17172F00011K44524k22789N87k84077J89854l1689k0064q6918m1552R5595L3901
17161D77383K1625l2731k3991J47471p147k76914J36280J8626J9760Q5505j46911
17150D18956A48543K5475L82933l7063j36337j53150Q37458E19556J8010j06525
17140D31041B9494N19638P3932j09637J56013k4912j55046r7966m3355r7294N04004
$$ y = [416593, 296395, 60496, 559530, 712601, 351174, 281939, 500506, 288941, 335196, 441012, 372432, 273239, 605972, 451936, 668537, 253951, 69238, 550116, 284005, 343039, 460777, 352962, 465683, 490361, 522430, 325545, 257274, 489972, 543961, 318790, 372250, 281773, 543490, 537915, 369853, 507539, 158781, 286384, 420162, 600011, 844535, 621746, 622333, 338256, 528110, 496421, 476357, 389439, 347887, 443482, 477383, 499008, 466277, 442286, 589757, 582610, 305696, 441976, 460602, 480362, 565867, 418956, 148543, 174018, 556951, 519888, 383551, 230401, 1067859, 519556, 537566, 431041, 29494, 549132, 623064, 513427, 669440, 644528, 489482, 391516, 348161, 250867, 754871]
17129G54871j23895J71984m2316B55513K93555A14085Q38826H6577L50358M06984
17119H43919l15554r4536N13532m50011M3147K14203j17030j55157J14679j87759
17109D09433K71798l12083J27770n6694L41704j98043Q8325j89109J06330J5229
17099F04660m5050K07087j70458j70320K92131J25235l79350J90416l1636j36320
17089D86395J30990M4268O5449j21163r3228M57373l52758j19895B17592L61357
17079E78949K18816O7189p4534k004q5835M3724j41897K34595k13401l02893K60947
17068E83656M52088D81032M71653k72208k5730j17138J73052J02534J16834m10828
17058E19201L30428l42470K92088J18091O631m8301j78311M73121n48744n5095
$$ y = [754871, 630976, 802960, 760644, 255513, 549068, 114085, 952911, 86577, 436935, 843919, 528365, 433829, 947361, 497350, 540497, 754700, 637670, 482513, 597192, 409433, 681231, 369148, 496918, 440224, 781928, 583885, 672210, 483101, 589431, 604660, 559610, 766697, 596239, 425919, 718050, 843285, 463935, 654351, 622715, 486395, 617385, 661653, 727102, 605939, 512711, 970084, 617326, 497431, 217592, 578949, 797765, 864954, 790420, 788416, 702581, 746305, 604408, 839003, 625602, 322709, 583656, 1035744, 481032, 952685, 680477, 654747, 537609, 710661, 813195, 930029, 519201, 849629, 507159, 799247, 917338, 923969, 875668, 697357, 1170478, 621734, 566639]
17048E66639O31402m42727l4078q7907j13564N60958L1580m32721L34421m43832
17038E70171J45175J84916P5382m38478O25299j30162K456r6598K16723k49959
17028I04925J48461j90480K67359l05172J5434j16865L66248K30721k38770l94979
17018F86882J11858J17744j99678J49074M35403l33491k45598L87346k49127M07348
17008A267761n78349K11297J52086M33019k70611k97917L69227m02530K57416
16999A141399J95879l02404K89989k87216j98520J44274j16604M96676j44536
16990A218937j35122q2991K27143J6990j37116N6770L9304j02670K01771J19379
16980A422395l11464O8329K47382j41045k08674L19071L6981J2571m06624J99204
$$ y = [566639, 1198041, 755314, 721236, 633329, 519765, 1080723, 1112303, 679582, 1014003, 570171, 715346, 900262, 975644, 537166, 1162465, 1032303, 1034759, 938161, 1154884, 904925, 1053386, 862906, 1130265, 825093, 840527, 723662, 1089910, 1320631, 1081861, 686882, 798740, 916484, 716806, 865880, 1301283, 967792, 722194, 1109540, 860413, 1267761, 689412, 900709, 1052795, 1485814, 1215203, 917286, 1286513, 883983, 1141399, 1337278, 1034874, 1324863, 1037647, 839127, 983401, 866797, 1363473, 1218937, 1083815, 1000824, 1227967, 1244957, 1107841, 1164611, 1203915, 1101245, 1303016, 1422395, 1110931, 1179260, 1426642, 1285597, 1076923, 1395994, 1432975, 1445546, 1038922, 1238126]
16970A238126R1271L4808O9632J3618p5481J77824j70202J04410P582r1162K53859
16959A654285l09730K85630R9734J17799p07049N28005l41060K46680m59898O11405
16949A725801J63395j12104k10358P8400k91231K79407K14947l43826K41953J5289
16939A761673K69543l67249L23128k26092j96518J13833M43254k77939J88184
16930B031817L8966l83473K48582j25035J76423K450j56858L8600K11809n8837
16920B024444j32859o0798M52006q4419k55680J4379J48796K23117M0881k71944
16910B097923j21038K38944K60821o7182J27519k42121j9677K902M29438k2491
16900B685038l348j73244j66905n6837L47837N0837j1257k49095K52835j41351
$$ y = [1238126, 1329397, 1364205, 1433837, 1447455, 1371974, 1549798, 1379596, 1484006, 1491588, 1400426, 1654285, 1344555, 1630185, 1729919, 1847718, 1140669, 1668674, 1327614, 1574294, 1114396, 1725801, 1889196, 1777092, 1566734, 1645134, 1353903, 1633310, 1848257, 1504431, 1746384, 1761673, 2031216, 1663967, 1987095, 1761003, 1564485, 1678318, 2121572, 1843633, 2031817, 2070783, 1687310, 1935892, 1810857, 1987280, 1989730, 1832872, 1871472, 2083281, 2024444, 1891585, 1830787, 2282793, 2198374, 1942694, 1957073, 2105869, 2328986, 2369867, 2097923, 1976885, 2215829, 2476650, 2409468, 2536987, 2294866, 2275189, 2278091, 2707529, 2685038, 2681690, 2508446, 2341541, 2284704, 2632541, 2683378, 2672121, 2423026, 2675861, 2534510]
16890B534510L76712J31755r0155J08115L3246k85702J30593J29111J58481q1850
16880C144816l9576R2318R5895k12824J96020L08699k64470L888j71707N21669
16870C674728j46706o0695O4788j82604K11024M1528J55030k46903L22747j53753
16860C679184O6536J20905P6768L50817j97785J07394L6478J28106p7145k03557
16850D087701O17675J9442J8047K5326N4935j82302M48783l40361M51708J12135
16840E313089j66079J29473k24818L08984M089K75388p3497J86530k54980M65562
16830E963741Q7581M4725n9593J86377Q6855M32832l61121K91958M25381J9347
16820G118083j33094K18100J01091K0726J10291Q59501p64445M61700l07765P13663
$$ y = [2534510, 2911222, 3042977, 2952822, 3060937, 3094183, 2808481, 2939074, 3068185, 3226666, 3144816, 3105240, 3197558, 3293453, 3080629, 3276649, 3585348, 3320878, 3324766, 3153059, 3674728, 3528022, 3467327, 3532115, 3349511, 3560535, 3602063, 3757093, 3510190, 3832937, 3679184, 3745720, 3866625, 3943393, 4294210, 4096425, 4203819, 4240297, 4368403, 4291258, 4087701, 4705376, 4724818, 4742865, 4768191, 4823126, 4640824, 5089607, 4749246, 5200954, 5313089, 5147010, 5276483, 5051665, 5360649, 5364738, 5640126, 5566629, 5753159, 5498179, 5963741, 6051322, 6096047, 6036454, 6222831, 6309686, 6742518, 6381397, 6673355, 7098736, 7118083, 6984989, 7203089, 7304180, 7324906, 7435197, 8294698, 7530253, 7991953, 7684188, 8397851]
16810H397851K04498J67213J3194j70179O06194j08576N19844j2603K55417K75288
16800A0148141O3559K2872N93683N9941K40375k909L40383K33035J16470L89401
16790A2204951M80464R5547J65959O30119k4945O33871K89561N52743K42921L44552
16780A5615743K48297L38303L87930L63080P65959L4754M59997N75558N44494
16771A9334115M80070J165492K15423Q17245L34071Q10148P99148M50356M54378
16762B4860446Q84609J018733O97668J046542N17074R90319J202761P38350J217558
16753C3174060J217280Q46742J344827J239679R87026J655560J666467J547979
16745D3679620J422230J606715J897639J531293J983435K113084K137546K002877
$$ y = [8397851, 8602349, 8769562, 8782756, 8612577, 9218771, 9110195, 9630039, 9617436, 9872853, 10148141, 10211700, 10234572, 10828255, 10888196, 11128571, 11125662, 11466045, 11699080, 11815550, 12204951, 12685415, 12780962, 12946921, 13577040, 13552095, 14185966, 14475527, 15028270, 15271191, 15615743, 15864040, 16202343, 16590273, 16953353, 17719312, 17754066, 18214063, 18789621, 19334115, 19814185, 20979677, 21195100, 22012345, 22346416, 23156564, 23955712, 24406068, 24860446, 25745055, 26763788, 27461456, 28507998, 29025072, 30015391, 31218152, 31956502, 33174060, 34391340, 35238082, 36582909, 37822588, 38809614, 40465174, 42131641, 43679620, 45101850, 46708565, 48606204, 50137497, 52120932, 54234016, 56371562, 58374439]
16737E8374439K385266K477728K325064K217761K729220K815756K972622K775911
16729G9073767K881763K795998L534960L087578L218618L145199L263003L464695
16721A04465581L402127L282012K911970L033036K802142K613874K594861K130293
16713A27235896J764781K120884R40933J210556R39648j2441j18707o47886l89319
16704A33044345j612477j219013k360886k121908k432379k210816k818492k892899
16696A15375475l303740l169023l585443l113573l061446l591068k995672l248735
16688H9306775l402452k953121k810409k953858k861364l048346k800521k834166
16680F5642538k461927k236611k309085k156919k125373k089377k065592k009133
$$ y = [58374439, 60759705, 63237433, 65562497, 67780258, 70509478, 73325234, 76297856, 79073767, 81955530, 84751528, 88286488, 91374066, 94592684, 97737883, 101000886, 104465581, 107867708, 111149720, 114061690, 117094726, 119896868, 122510742, 125105603, 127235896, 129000677, 131121561, 132062494, 133273050, 134212698, 134200257, 134081550, 133433664, 133044345, 131431868, 130212855, 127851969, 125730061, 123297682, 121086866, 118268374, 115375475, 112071735, 108902712, 105317269, 102203696, 99142250, 95551182, 92555510, 89306775, 85904323, 82951202, 80140793, 77186935, 74325571, 71277225, 68476704, 65642538, 63180611, 60944000, 58634915, 56477996, 54352623, 52263246, 50197654, 48188521]
16672D8188521j513352j890523j629953j553393j252348j944852j013321j192847
16664C6197932j385228j143247j074173j037779j209864p44085j074790p83757
16656B7745009j011908p18721q98913o92193o29396j009974n74566n09262m78948
16647B1221128q74955n16633n19413n12911m70068q05812k58523o44316m84336
16638A6134161k41282m28169l27559k30865o98216j91198Q3656o06556p81257
16629A2712715J9327k67604N8176n04130m16515l87922J38417n04636J5248l25355
16619A0537721p2587m66055K03164m44416k06290l50625K4776o96323O2155J13254
16609H704774n16021N630k08335J06166n6084l64654j43816p0068n0423o78394
$$ y = [48188521, 46675169, 44784646, 43154693, 41601300, 40348952, 38404100, 37390779, 36197932, 34812704, 33669457, 32595284, 31557505, 30347641, 29603556, 28528766, 27745009, 26733101, 26014380, 25115467, 24423274, 23793878, 22783904, 22209338, 21700076, 21221128, 20346173, 19829540, 19310127, 18797216, 18327148, 17521336, 17262813, 16618497, 16134161, 15892879, 15464710, 15137151, 14906286, 14208070, 14016872, 14100528, 13493972, 12712715, 12732042, 12464438, 12522614, 12018484, 11601969, 11214047, 11352464, 10847828, 10863076, 10537721, 10465134, 9999079, 10202243, 9757827, 9551537, 9200912, 9225688, 8529365, 8591520, 8704774, 8188753, 8194383, 7986048, 8092214, 8036130, 7671476, 7527660, 7457592, 7407169, 6728775]
16599F728775P718L41391l15829R6571p84283K48825J19084k08964r556o17138
16589E606594K61534j11719k46024L88578k24384k80847K45043l82597j32907
16580E123271Q6429j63789k05706r4986J83733j4495j43371k07575j93434K51828
16570D621905l84335K1428j11800j66022K3731j01210k2644Q326k9903K61023
16560D120499k19487k08512L72301j56406J23131j69000k62101O0585p3594n4007
16550C533409J15258j65055l26084L02330k83628J33668k61481J20878P8712R2456
16540C340463l65225r8884K31209j35309l34463L73066k1841k05139m7155l9593
16530B697129l02943n6993N4445K38709j6953n7215k44640J66539k12500K35103
$$ y = [6728775, 6736493, 7077884, 6762055, 6858626, 6074343, 6323168, 6442252, 6233288, 6223732, 5606594, 5868128, 5756409, 5510385, 5898963, 5674579, 5393732, 5638775, 5256178, 5123271, 5209700, 5045911, 4840205, 4745219, 4928952, 4914457, 4771086, 4563511, 4370077, 4621905, 4237570, 4258998, 4147198, 3981176, 4004907, 3903697, 3881053, 3889379, 3859476, 4120499, 3901012, 3692500, 4064801, 3908395, 4031526, 3862526, 3600425, 3661010, 3587416, 3533409, 3648667, 3483612, 3157528, 3459858, 3176230, 3309898, 3048417, 3169295, 3248007, 3340463, 2975238, 2876354, 3107563, 2972254, 2637791, 3010857, 2989016, 2783877, 2736722, 2697129, 2394186, 2337193, 2391638, 2630347, 2613394, 2556179, 2311539, 2478078, 2265578, 2500681]
16520B500681k04112L56800l37151J19583j233j99794j46985J18883k79703M20478
16510B347447k71296J0165K14876k30637j17310Q1122J9461Q5252k47870L3625
16500A924835k18612Q2175J52470R8687k92834M35987P377o16837L30505L0970
16490A934723k46899P2601k78670K58942Q3398J4977k8701J25123k95736o6222
16480A573536N2335M4195l80821J67898J13551l55384L85199J42469j80346M2344
16470A604976K38517l89703l6420r1503p6274O0921j17145M05858o8983m22030
16460A108214j1505P2036J90038l3291k1463K71988Q5453j40387m22788p1453
16450A026842L60156l19388J84622j37322J74471j43350l5054J45555M8655K3470
$$ y = [2500681, 2296569, 2653369, 2316218, 2435801, 2434568, 2234774, 2087789, 2206672, 1926969, 2347447, 2076151, 2086316, 2301192, 2070555, 1953245, 2034367, 2053828, 2139080, 1891210, 1924835, 1706223, 1788398, 1940868, 2039555, 1746721, 2182708, 2190085, 1573248, 1903753, 1934723, 1687824, 1760425, 1481755, 1740697, 1824095, 1839072, 1810371, 1935494, 1639758, 1573536, 1625871, 1670066, 1289245, 1457143, 1570694, 1215310, 1600509, 1742978, 1562632, 1604976, 1843493, 1453790, 1417370, 1325867, 1249593, 1310514, 1193369, 1599227, 1530244, 1108214, 1096709, 1168745, 1358783, 1325492, 1304029, 1576017, 1661470, 1521083, 1098295, 1026842, 1386998, 1067610, 1252232, 1114910, 1289381, 1146031, 1110977, 1256532, 1305187, 1328657]
16440A328657J50955J1600l471J42245o86925p4347K68080r2259Q4152K62532
16430A391219k61178k65171L58362K49106n35779K20061N2802Q3020l77747J98358
16420A113053k54550P1709K20735J8819m9453l65201N33158m00730J00329j36610
16410H51259J57320J37263p2724k92150L61526j18958Q4983j22096j41886L11022
16400A155559j75457l599j37075J24831R1265l39282J20894R6472L2965k75059
16390F91514j44042K94295k69430q5308J75084q2578N01979p1946n9926k4167
16380I25475j37417l89419L51729l0727l11672J93288p9113L59527j32657J74423
16370I23437K1494J09451j84676k2529p7206j26101k87356M12554J76609l8443
$$ y = [1328657, 1479612, 1491212, 1487741, 1629986, 943061, 868714, 1136794, 1044535, 1128687, 1391219, 1130041, 864870, 1223232, 1472338, 936559, 1156620, 1209422, 1292442, 914695, 1113053, 858503, 930212, 1150947, 1169766, 1120313, 755112, 1288270, 887540, 987869, 851259, 1008579, 1145842, 1073118, 780968, 1142494, 1023536, 1108519, 986423, 844537, 1155559, 980102, 976503, 839428, 964259, 1055524, 716242, 837136, 933608, 966573, 691514, 547472, 841767, 572337, 487029, 662113, 579535, 1081514, 1009568, 949642, 925475, 788058, 398639, 750368, 719641, 407969, 601257, 522144, 881671, 749014, 923437, 944931, 1054382, 869706, 847177, 769971, 643870, 356514, 769068, 945677, 907234]
16360I07234l20960K56172p2725L09213j43533m56703K81609k21182m8962J29594
16350F19757Q4202k12397M6659n6632j32049K92819N2492o6710j5482M9586j47542
16339E14703J53707k30645K24999j92672J93356j03988K48274B03048K62250j24043
16329C41255N26565r6103A98572N02973k06998M2009j90330n4924O62358A71287
16318D88121L56944k59832k10600N1471K52243l34831J41066L36217l51810R7959
16308E66948P1188k09955P5960p2844J5258j33767m8201J66335O0871L5939n720
16297E22012A95132L72944l204K5976k8424n7412j40517J45109J42295j58745
16287D93154O0677l149j33989J52395o1849K42361l35997J65445k06611k6711
$$ y = [907234, 586274, 842446, 769721, 1078934, 935401, 478698, 760307, 539125, 490163, 619757, 703959, 491562, 538221, 481589, 349540, 642359, 694851, 628141, 612659, 662245, 514703, 668410, 437765, 662764, 470092, 663448, 559460, 807734, 203048, 465298, 341255, 867820, 771717, 198572, 701545, 494547, 536556, 346226, 291302, 953660, 171287, 488121, 845065, 585233, 374633, 426104, 678347, 343516, 484582, 820799, 468989, 566948, 638136, 428181, 504141, 431297, 446555, 312788, 264587, 430922, 491793, 527732, 522012, 195132, 568076, 564872, 590848, 562424, 505012, 364495, 509604, 651899, 493154, 553831, 550682, 416693, 569088, 507239, 749600, 413603, 579048, 372437, 345726]
16277C45726j50718j6243F3721K38131n8985J4409g5664D48915A95254M12908
16267F08162J80927l84860q1592K87275k72505J97669p8641q5292j11384j18513
16257A41246O5369K13312o644j47422m0534K25227A93100L03807k36962N5579
16247C15524j2232n1883J54252j39455r8034J41777M2084M1099j21436J07700
16237C79396N6681j85395K41196j19947n2664J7617K08824A97320P016n3530L38868
16226D89674r8377q1943J39857A88998N291J43335K8893j19958H2250L96705m1736
16215D37219M8033A30889Q8653K45595j00641j50982I6528J80763H4407J61330
16205B45737J906K02815j98621O1214H3955B8117R4658J07745J72592J49864k50677
$$ y = [345726, 195008, 178765, 63721, 301852, 242867, 257276, -75664, 448915, 195254, 608162, 789089, 404229, 322637, 609912, 337407, 535076, 456435, 371143, 259759, 141246, 206615, 419927, 413283, 265861, 225327, 450554, 193100, 496907, 259945, 315524, 303292, 251409, 405661, 266206, 168172, 309949, 352033, 393132, 271696, 379396, 436077, 250682, 491878, 371931, 319267, 336884, 545708, 197320, 204336, 150806, 489674, 391297, 309354, 449211, 188998, 194289, 337624, 366517, 246559, 82250, 478955, 437219, 485252, 130889, 219542, 465137, 364496, 213514, 96528, 277291, 84407, 245737, 247643, 450458, 251837, 313051, 83955, 28117, 122775, 230520, 403112, 552976, 302299]
16194C02299J23938j52740K4056q8771N4005r8619K05309I3939L7443J13313J05646
16183C50341A01703O2678H2006R2261J02745J39828B03412J50030k6106L0294
16173C57630k4507N6840r5340i3447C31040a68838A11072k8052J45745p8123P4790
16162B25432K50956r0233l5129n0177q1246a47715E26117j51553F0594J57853
16152B18447I4019J21190J55297E0451M7242a66308B85370n5918r7389C2715J06463
16141A39178J79798c475D08793b5830B84992o7661b2588r1157C45655j14563J01291
16130C32383B027L50124J3128i1083b5269D5258J2401g1220F3229N8306B9700
16118A25711C080L33368H453K05557B3309K76751B8078J2597L9833d8558A31494
$$ y = [302299, 426237, 273497, 297553, 208782, 262787, 164168, 369477, 93939, 131382, 244695, 350341, 101703, 164381, 82006, 174267, 277012, 416840, 203412, 353442, 327336, 357630, 333123, 389963, 294623, -93447, 331040, -168838, 111072, 83020, 228765, 150642, 225432, 476388, 386155, 351026, 300849, 219603, -147715, 526117, 374564, 60594, 218447, 94019, 215209, 370506, 50451, 97693, -166308, 285370, 229452, 132063, 32715, 139178, 318976, -3475, 408793, -25830, 284992, 217331, -22588, -113745, 345655, 231092, 332383, 2027, 352151, 365279, -91083, -25269, 45258, 57659, -71220, 63229, 121535, 29700, 125711, 3080, 336448, 8453, 214010, 23309, 300060, 28078, 40675, 80508, -48558, 131494]
16106D0913L08594l8816c02063i7122A26465b54603A83523q8945l788m3625J55453
16095B02618J58415A38457L9740C6173f3031A89273a81941B86671p9574q9842
16085A17255N6043J5865r2543N3273K05543i0997D36345E0837a80077I1260l1725
16074E9535J96229A22526M2941n6646j2043J83812K18446B38970H8187c0956k86224
16063c17180a2812C01405n0705j02987n7342N6659n5322K50131A01235A2175a23360
16051A76111J83421a15556I1079K05530K7269b97219i5003G2403B6080a80939
16040b37225A33005a15942B52388a0739A52106a16165b4564A88971p8048a32488
16029B76932H7009B6492a97916I9962Q0768E8319d4216C256J97861a50746B28653
$$ y = [40913, 349507, 310691, -302063, -97122, 126465, -254603, 183523, 94578, 90790, 47165, 202618, 361033, 138457, 178197, 36173, -63031, 189273, -181941, 286671, 207097, 117255, 173298, 189163, 96620, 149893, 355436, -90997, 436345, 50837, -180077, 91260, 59535, 255764, 122526, 165467, 108821, 96778, 280590, 499036, 238970, 88187, -30956, -317180, -12812, 301405, 250700, 147713, 90371, 147030, 91708, 341839, 101235, 12175, -123360, 176111, 359532, -115556, 91079, 296609, 323878, -297219, -95003, 72403, 26080, -180939, -237225, 133005, -115942, 252388, -10739, 152106, -116165, -24564, 188971, 110923, -132488, 276932, 87009, 26492, -197916, 99962, 180730, 58319, -44216, 3256, 201117, -150746, 228653]
16017A39648a33630L371C9654e9601A58729a75221M5187I9601M1577D33a87337
16005A47866d2962C0492f3446D3911J25535b7351k35648a16989A47100J14430
15995B61530G7196d07167A4159a15373B11523A3696f4644k8517a030j71945A68463
15983B5813l20a17534D5543O22991b95851A25925c4991C13635J24440j03649m2683
15972B91743M17277n2152K09027J14621k97486k16338J60711J1031A79247q8809
15962I0438f7319A79688g7236B96282n1389a59541B5146J16564L1351a21574q406
15951a29980A03328a20760D0217d6629A73869p4999e4117J0294B48683a61152
15940A05174a09049H9065L99088a5780j3431B46804a52546b2066H0152c1282I7741
$$ y = [139648, -133630, -130259, 39654, -59601, 158729, -175221, -130034, 99601, 141178, 433, -187337, 147866, -42962, 30492, -63446, 43911, 169446, -27351, -262999, -116989, 147100, 261530, 77196, -407167, 14159, -115373, 211523, 13696, -64644, -93161, -1030, -172975, 168463, 25813, 25493, -117534, 45543, 668534, -295851, 125925, -34991, 313635, 438075, 334426, 291743, 709020, 656868, 865895, 980516, 683030, 466692, 627403, 638434, 179247, 90438, -67319, 179688, -77236, 296282, 244893, -159541, 25146, 141710, 173061, -121574, -129980, 103328, -120760, 40217, -46629, 173869, 98870, -54117, -43823, 248683, -161152, 105174, -109049, 89065, 488153, -15780, -29211, 246804, -152546, -22066, 80152, -31282, 97741]
15928B35761J74773a2304B71320p9953O2177A9250M8981c0580j86495A54874e890
15916G3061a963j59665P0914H3766a53024I8687a69003k38421a90543H525a47436
15904a3859j2864k33795a5678l8589b709B16500B3865a73066I5210a08597A20609
15892E8722e7797n1243j630B65183b16061B00372P1024b09578A7897c67807a11299
15880a40493B4311c5705j40396l3122A51391D6448a22555b2420l0852A55870b24292
15868a32662l58032i3740D16448g647l5170A75257a57837a7214A97996a03948
15857A16240a03669m3489I8768a74034Q0768B66852b81791A66736a26718j03030
15847b29748j07922c2249k17508J20810N4543m3477j65475a11586r7065B33772
$$ y = [235761, 410534, -12304, 271320, 191367, 253544, 19250, 68231, -30580, -217075, 154874, -5890, 73061, -1963, -161628, -90714, 83766, -153024, 98687, -169003, -407424, -190543, 8525, -147436, -13859, -26723, -260518, -15678, -54267, -2709, 216500, 23865, -173066, 95210, -108597, 120609, 58722, -57797, -109040, -110670, 265183, -216061, 200372, 271396, -209578, 17897, -367807, -111299, -140493, 24311, -35705, -176101, -209223, 151391, 46448, -122555, -22420, -53272, 155870, -224292, -132662, -490694, -93740, 416448, -7647, -42817, 175257, -157837, -17214, 197996, -103948, 116240, -103669, -147158, 98768, -174034, -93266, 266852, -281791, 166736, -126718, -229748, -337670, -32249, -249757, -128947, -74404, -117881, -283356, -111586, -208651, 233772]
15836a45331B16642J00052q0997L7693c72051a15235A77973J35069F6516h626
15825i1530l1485A14535J32616A9182a93165H9080a42706d0194j20665O8343p7876
15814a70392A1782Q862a02956j4894F1043a98734c0984L551B4605a70944q9792
15803b60736J17073A67564H1782d69054h5376C8368b18586A35929D2795i293E8673
15791a26872A19108K09657r8805O5382F8560A7811b46655R4851d3730I2589a19690
15779A7320e7084p6542k8470n237L6667I7630A744J04220K6667a5374I4244a49394
15766h7772b648G3658a63930O3474j64611q722P653B21973a37844j99969f7113
15754A59863C8277a36988E7714O2661l9047j835J35205c3161j7555B98681a60348
$$ y = [-145331, 216642, 316694, 235697, 273390, -372051, -115235, 177973, 313042, 66516, -8626, -91530, -123015, 114535, 247151, 19182, -193165, 89080, -142706, -40194, -160859, -92516, -170392, 11782, 20644, -102956, -117850, 61043, -198734, -30984, -27433, 24605, -170944, -260736, -143663, 167564, 81782, -469054, -85376, 38368, -218586, 135929, 42795, -9293, 58673, -126872, 119108, 328765, 229960, 295342, 68560, 17811, -246655, -151804, -43730, 92589, -119690, 17320, -57084, -133626, -162096, -167333, -130666, 97630, 1744, 105964, 132631, -15374, 94244, -149394, -87772, -2648, 73658, -163930, -100456, -265067, -273789, -266136, 221973, -137844, -337813, -67113, 159863, 38277, -136988, 57714, 120375, 81328, 79493, 214698, -33161, -50716, 298681, -160348]
15742c08129C69449i8452A46125a9711H7009c8535C22413a71255C2642O7220b50490
15730E6691a11174C2867Q8932Q1305B9230J69717a69894D83968A51605c75537
15719a69049C44678A9579c0920j0600j82035F7789B5086Q7750A2685b78349I0032
15707c48969e375m08594H8998L8842g9169p6251M4222C15008a08868j70581e0048
15695b78055G6485g2445n7473k9845o127h0505j77092c231l9987b0931A64959
15683D0463i3947o6839H7587J43143i8928M4576A78756c28322C0982e2845A04944
15671I0711C1783N30J85616b05763A56711D5677a94429J3984Q4806d6385D7935
15659f5874B9889J0301L7734L9369P8080r238e798D5145d48847i5580C48352C6807
$$ y = [-308129, 369449, -98452, 146125, -19711, 87009, -38535, 322413, -171255, 32642, 99862, -250490, 56691, -111174, 32867, 121799, 203104, 29230, 198947, -169894, 483968, 151605, -375537, -169049, 344678, 19579, -30920, -41520, -223555, 67789, 25086, 112836, 12685, -278349, 90032, -348969, -5375, -413969, 88998, 127840, -79169, -155420, -111198, 315008, -108868, -279449, -50048, -278055, 76485, -72445, -129918, -159763, -165890, -80505, -257597, -3231, -43218, -20931, 164959, 40463, -93947, -160786, 87587, 230730, -98928, -54352, 178756, -328322, 30982, -52845, 104944, 90711, 31783, 32313, 217929, -205763, 156711, 45677, -194429, -180445, -95639, -46385, 47935, -65874, 29889, 40190, 77924, 117293, 195373, 186135, -5798, 45145, -448847, -95580, 348352, 36807]
15646c49854a8546A96867A9733b3544j29241J2329A0658b3443k94339A70313f7743
15634C80389a21054q5364A91456h535I558e1176H231f3817A3113f1368F2924K4182
15622H7106b11864i2082j44030i4816J2775H7825Q1362p0471e5299q6989A75058
15610a7235A02363a25346A58495c19513Q5315F7845a72071A01225c11309D1791
15599B9493O2868a44074G3508D765J12775J98806G4089e24528B23961b20134b0942
15587A25722d0037B13398a82084E7747b8243m0326r7854C17282B6386a89394A08515
15575h4836l6355b549k03112b066l24245B71792J60233a65694B24159h0768k41420
15564c22188a52977p4439K107O2596j11100B14204E3723A8578d4663l14842A82358
$$ y = [-349854, -18546, 196867, 19733, -23544, -152785, -140456, 10658, -23443, -317782, 170313, -67743, 380389, -121054, -206418, 191456, -8535, 9558, -51176, 8231, -63817, 13113, -61368, 62924, 87106, -211864, -92082, -236112, -94816, -82041, 87825, 169187, 98716, -55299, -142288, 175058, -17235, 102363, -125346, 158495, -319513, -234198, 67845, -172071, 101225, -311309, 41791, 29493, 92361, -144074, 73508, 4765, 117540, 316346, 74089, -524528, 223961, -220134, -20942, 125722, -40037, 213398, -182084, 57747, -28243, -68569, -166423, 317282, 26386, -189394, 108515, -84836, -121191, -2549, -205661, -2066, -326311, 271792, 432025, -165694, 224159, -80768, -322188, -152977, -227416, -225309, -162713, -273813, 214204, 53723, 18578, -44663, -359505, 182358]
15552A3993b41462r1798a33250B023i717A19219b39440f4615k73276a2210A54059
15540A52785L3618e2514m0158D44061A4583g4732B5377d01071B84129b76713n6836
15529c33549C40510a28281e1746j82422I0277f8172B31519a11257r533A35802
15518A22079R5923C7619b09801O443G52J40505B2850J06341K20612j41560o9439
15507A38804k9748M914K71085G0363b18053G7184a16346A99042N5109G1156J0904
15496H2060L1755j3842N7673o6330J88513a09022C91113b37964j43457A91370
15485B09199J36991j302E8750K7135J87919E9406J48438d8536k29052A80729Q402
15474A89131J6256Q3868A30452Q9057a87158A26957K15136a44203e2913B23708
$$ y = [13993, -241462, -333260, -133250, 2023, -9717, 119219, -239440, -64615, -337891, -12210, 154059, 152785, 186403, -52514, -92672, 444061, 14583, -74732, 25377, -401071, 284129, -276713, -333549, 340510, -128281, -51746, -234168, 90277, -68172, 231519, -111257, -120790, 135802, 122079, 218002, 37619, -209801, -203358, 752, 141257, 22850, 129191, 349803, 208243, 138804, 109056, 113970, 385055, 70363, -218053, 77184, -116346, 199042, 254151, 71156, 82060, 113815, 99973, 157646, 91316, 279829, -109022, 391113, -237964, -381421, 191370, 209199, 346190, 344888, 58750, 85885, 273804, 59406, 207844, -48536, -277588, 180729, 189131, 205387, 289255, 130452, 219509, -187158, 126957, 342093, -144203, -52913, 223708]
15463A27156d7303A91200K03556A57500O4371L50478J37096q02C02218A25797
15452C10285H0737a46674B25307b28857B0461Q2089a38954G1177P446f866k87663
15441b94529a4961A09064P6450a24998a0503B88006a58484B73536J88161G5353
15430C03642G3009L11849K389J62645L36446M0089l53889j73566Q5898F9517K74338
15419C43855o7301r5880J73219j55612N8367h9838C52159k9506q1294b1141H8315
15407A69969m0630J35301l4347b58784I418c3345j6715A14602h9273C25K2879
15396B3204b1713A43809F0211b78405A02292c18682L1925e197k66543o1322g3624
15384A84657b67620f8640c93A70377D6659c31093C27728c1253B4735d202A02667
$$ y = [127156, -47303, 191200, 394756, 157500, 221871, 572349, 709445, 708643, 302218, 125797, 310285, 80737, -146674, 225307, -228857, 20461, 102550, -138954, 71177, 78623, -6866, -294529, -14961, 109064, 185514, -124998, -10503, 288006, -158484, 273536, 461697, 75353, 303642, 73009, 384858, 387247, 549892, 886338, 926427, 572538, 398972, 484870, 69517, 343855, 276554, 180674, 353893, 198281, 256648, -89838, 352159, 322653, 241359, -21141, 88315, 169969, 129339, 264640, 230293, -258784, 9418, -33345, -50060, 114602, -89273, 325, 23204, -21713, 143809, 60211, -278405, 102292, -318682, -286757, -5197, -271740, -333062, -73624, 184657, -267620, -68640, -393, 170377, 46659, -331093, 327728, -31253, 24735, -4202, 102667]
15372B34026E899i8613J3373M414j02605C7763L35020H8053a38375B27078r6187
15361A30891e7004I7766K17331j25114J5725J91153j43926c3989A83600c7626
15350D27921k03519F0089L39651j93542E8874h983E6018N49419A73388j0773J75910
15339C38525A40972Q0528n9561J54663L1945A62533J35324N319J47169A62605
15328B23001e7287D56966K6208j81571J17869j50118K14628B00708J16011j53204
15318A63515k2004J17769j12659L13829A74370c463B65043l3495L7771I8298L4510
15307A32808P0721R5963J45195j92749d6861B81930a41694B8407R7414K11795
15297C37616a36109B04537E1020c8612J3237k6315J8824h289D55663a128B13008
$$ y = [234026, 5899, -98613, -85240, -80826, -183431, 37763, 372783, 88053, -138375, 227078, 130891, -57004, 97766, 315097, 189983, 205708, 396861, 252935, -33989, 183600, -37626, 427921, 224402, 60089, 399740, 206198, 58874, -8983, 56018, 605437, 173388, 162615, 338525, 140972, 221500, 161939, 316602, 348547, 162533, 297857, 303176, 450345, 162605, 223001, -57287, 456966, 483174, 301603, 419472, 269354, 483982, 200708, 316719, 163515, 141511, 259280, 146621, 460450, 174370, -3463, 265043, 231548, 269319, 98298, 132808, 203529, 299492, 444687, 251938, -46861, 281930, -141694, 28407, 125821, 337616, -136109, 204537, 51020, -38612, -25375, -51690, -32866, -8289, 455663, -1128, 213008]
15285g1308B81681E2745a78388N6194n731E5159J01779N6341b3697C9830N739
15274D5569c44205C9151J81090E190K53410a18943A49307J05496J1285f3791a4349
15262B86617E6129e2733b2929p0263k9662L8676l9941D5082a19334o9321e071
15250c500A08134C3348b3171I1685a63987j31178a39793l8754D52202f8695E4897
15238H213J44069i8506D28978A85513k3790J5206A5726M17226P2107L03733L01687
15227A110479J40080k68225P20361o73563n08723B51369K40040A74997Q0151l6843
15217B18305c1751j13233F6749a26436C49449b6793A33711a04009A25730J18331
15207B44061a8365A0279K93561D3898P7357k0172K44090F991K01403D647J77529
$$ y = [-71308, 281681, 52745, -178388, -122194, -127925, 55159, 156938, 213279, -23697, 39830, 45569, -344205, 39151, 220241, 5190, 258600, -118943, 149307, 254803, 266088, -63791, -14349, 286617, 56129, -52733, -22929, -93192, -122854, -84178, -124119, 45082, -119334, -188655, -5071, -3500, 108134, 33348, -23171, 91685, -163987, -295165, -139793, -178547, 452202, -68695, 54897, 8213, 152282, -98506, 428978, 185513, 161723, 176929, 15726, 432952, 505059, 808792, 1110479, 1250559, 982334, 1702695, 1029132, 520409, 251369, 491409, 174997, 255148, 218305, -31751, -144984, 66749, -126436, 349449, -26793, 133711, -104009, 125730, 244061, -18365, 10279, 303840, 43898, 121255, 101083, 345173, 6991, 208394, 4647, 182176]
15196A82176e5112A09861j6811c07148A9705K67694g7005m2835K2199L5266A3392
15184B95531P9200F3426O5179a0031B99570R5795G5602P0883l0292J5820c32834
15172H0233K871e6885k25438B26726h8464A38154R0076b381A21966J99345j12873
15161B08438E5528f388B59799g013D6330d572p9321J0197C50048i0825E6362Q3306
15149A39668m5452D2148J29045J96171I883K48020F3858B8287J38136J03198A19791
15137D01202j91748a4651A26782L3444D9323R9209K88429d6221E4851d7685C3232
15125A31759K5116O6363k9775J7838p6909A3535J65206L847c60889G4765K09286
15114B84051A28438J71534i4756H0518K10297N353h1775D2061J98086P6954R6844
$$ y = [182176, -55112, 109861, 93050, -307148, 19705, 287399, -77005, -119840, -97641, -62375, 13392, 295531, 374731, 63426, 128605, -10031, 299570, 395365, 75602, 146485, 116193, 132013, -332834, 80233, 83104, -56885, -282323, 226726, -88464, 138154, 228230, -2381, 121966, 321311, 208438, 55528, -6388, 259799, -7013, 46330, -4572, -83893, -73696, 350048, -90825, 56362, 139668, 94216, 42148, 171193, 367364, 9883, 257903, 63858, 28287, 166423, 269621, 119791, 401202, 209454, -14651, 126782, 160226, 49323, 148532, 436961, -46221, 54851, -47685, 33232, 131759, 156875, 223238, 193463, 211301, 134392, 13535, 178741, 182588, -360889, 74765, 284051, 128438, 299972, -94756, 80518, 290815, 296168, -81775, 42061, 240147, 317101, 413945]
15103D13945j14021P515R4111i301k49224B60521A6959M6132M5812d5880B61676
15091B25791C1060b57025G510J32647Q7320m6537J14610i939C4539a4198C70542
15079A85181J27435C4588J30410A2024M6747K53323j19154K9324C0329i970A65924
15067A45555B6700K54067b0293j8067A67429O1392n5169M1067l5322J53068j06919
15056B25546B1102L286J05336M4509L3691J646E9806j8509K06087I5735K39291
15045C35026k9153o5062p1163J15445j8653N5961l9119B8522M8087K37430N5673
15034C69712K71741C17386K65164B16540J41412R4189c1171D19687A14049k7978
15024H6071K02639m0111M63819B9726K67432o5163J72789J41240o9345O5410n1982
$$ y = [413945, 299924, 307439, 401550, -9301, -258525, 260521, 16959, 63091, 108903, -45880, 261676, 225791, 31060, -257025, 7510, 140157, 227477, 180940, 295550, -9939, 34539, -14198, 370542, 185181, 312616, 34588, 164998, 12024, 58771, 312094, 192940, 222264, 30329, -9970, 165924, 145555, 26700, 280767, -20293, -38360, 167429, 228821, 173652, 214719, 179397, 332465, 225546, 21102, 24388, 129724, 174233, 207924, 209570, 59806, 41297, 247384, 95735, 335026, 305873, 240811, 169648, 285093, 266440, 322401, 283282, 28522, 76609, 314039, 369712, 641453, 317386, 582550, 216540, 357952, 452141, -31171, 419687, 114049, 86071, 288710, 248599, 712418, 29726, 297158, 231995, 404784, 546024, 476679, 542089, 490107]
15013D90107L03223m6183J27148l87750J07626k62171K81968A98367j4021K79995
15003D64341B14562N0178M27958j04987j31347j16961O9738J4630L18384j53082
14993E89073j51986Q509j8340j31284J88459j00629L8765A75109O57891k14248
14983F18752j73197K887Q1811O0139j14772j64899K05875B22141L0360M75093
14973G27594k28590q5868M98510j80349B99478L82733J55897K5647P8020J60505
14963A102280k19612p7419j16540k23531P6460k2438M19511m04369o070k47383
14953B80889l5146r0765L13249F8176K66104q5423A18250J12167c9144A94281
14942D84733j37305A09593K62022r0147L23155A51443L25690K9535J9450j64661
$$ y = [490107, 793330, 747147, 874295, 486545, 594171, 332000, 613968, 198367, 184346, 464341, 214562, 264740, 692698, 587711, 456364, 339403, 409141, 423771, 742155, 589073, 437087, 445596, 427256, 295972, 484431, 383802, 422567, 175109, 833000, 618752, 445555, 448442, 530253, 590392, 475620, 310721, 516596, 222141, 252501, 727594, 499004, 413136, 911646, 731297, 299478, 682211, 838108, 863755, 941775, 1102280, 882668, 805249, 688709, 465178, 541638, 519200, 938711, 534342, 528272, 280889, 245743, 154978, 468227, 68176, 334280, 248857, 118250, 230417, -39144, 194281, 484733, 347428, 109593, 371615, 281468, 604623, 151443, 477133, 506668, 526118, 361457]
14932C61457m4848L7697L12373j74158L70066n045l04926j44000R0744K66429
14922G65789C27114K87968k07648K18212J13780Q2637j4613J30976r2671Q29483
14912A675238j8898j24233p1574K42802J94739l88471j53207M81564k52355K82992
14902A868597o3365M69548k97655K357k25385j76389k87661k09408j26926k83441
14892F70272o6318J11737j95020K48771l83272I1736M01033k1177k3362p493A46543
14880D61511j27142j59273K21011K103n6751j7083M07867k07140J74433j38234
14870E61302M4627K45344Q7922k04234K96334j12300j12960K55587j96438k09951
14860F55233K5152q9801j01147r910B16012K23949O302P2623Q4581k57001K65524
$$ y = [361457, 316609, 354306, 666679, 492521, 862587, 857542, 552616, 408616, 499360, 765789, 327114, 615082, 407434, 625646, 739426, 822063, 807450, 938426, 845755, 1675238, 1656340, 1532107, 1460533, 1703335, 1898074, 1509603, 1356396, 1837960, 1585605, 1868597, 1805232, 2274780, 1977125, 1979482, 1754097, 1577708, 1290047, 1080639, 953713, 670272, 603954, 715691, 520671, 769442, 386170, 91736, 492769, 471592, 448230, 440737, 146543, 461511, 334369, 175096, 396107, 398210, 341459, 324376, 732243, 525103, 699536, 561302, 605929, 851273, 939195, 734961, 1031295, 918995, 806035, 1061622, 865184, 655233, 680385, 590584, 489437, 479527, 216012, 439961, 446263, 518886, 603467, 346466, 611990]
14849F11990K23068N4831J5647m28031K8270j91062K56109k23742J66581n6278
14839D57383J02888J07600j17234l6606J44949j80521J02868j53185L27155j53985
14829F01312k0693M98769j84405N9844j13873K85287p8319J04001k32769l14997
14819F04157L51357j16666Q7619k81141O8312K4547o9345k32611J51759L70207
14809I58195k45772j11825J54900k14573q527M4384L09621J01554A89082N06893
14799F95975R3367J68469l58262j75814N41412k71784j83304K14557j32356P0938
14789F63198M24804k23217K69974j79274r1543l07456O3211C01134L19612P252
14779F27998l0362k17914M30073j95043J18669k25905J73261L9665J26543k33342
$$ y = [611990, 835058, 889889, 905536, 477505, 505775, 314713, 570822, 347080, 513661, 457383, 560271, 667871, 550637, 514031, 658980, 478459, 581327, 428142, 755297, 601312, 580619, 1079388, 894983, 954827, 840954, 1126241, 1047922, 1151923, 919154, 604157, 955514, 838848, 926467, 645326, 713638, 738185, 668840, 436229, 587988, 958195, 712423, 600598, 755498, 540925, 532398, 576782, 886403, 987957, 189082, 695975, 789342, 957811, 599549, 423735, 965147, 693363, 510059, 724616, 592260, 663198, 1088002, 864785, 1134759, 955485, 863942, 556486, 619697, 301134, 620746, 627998, 597636, 379722, 809795, 614752, 733421, 507516, 680777, 720442, 846985, 613643]
14769F13643O9510r0441L1947Q3277O8171j45091r8871l816M00860j68826J13707
14758H74070r6792J35874J58057m10876l01974M26988j96564L7495O430o3312
14748E69396n5180J12895J61128C53737o0691M65490j53260j52514L27262j07675
14738F72349m3405l0136k25448N28679k59225K3806P6215J66656j21065j56616
14728F31810K55971J98072D94056K98095L27069n36322K50848k76128M41612j53235
14718H45995m3955M05540p63l81407L71964O499N77012M8439k6090R7645m25028
14707A475851m35834J3654J48409J13840l73433J17902L3077j64626J17534j66493
14697H79881J89291j98020J44165o8538j06639K435L1669L77029J25665j0114
$$ y = [613643, 683153, 592712, 624659, 707936, 776107, 631016, 532145, 528329, 929189, 760363, 874070, 777278, 913152, 1071209, 660333, 358359, 785347, 588783, 626278, 632708, 569396, 514216, 627111, 788239, 353737, 293046, 758536, 605276, 452762, 780024, 672349, 628944, 598808, 373360, 902039, 642814, 666620, 742835, 909491, 788426, 631810, 887781, 1085853, 494056, 792151, 1119220, 582898, 833746, 557618, 999230, 845995, 802040, 1207580, 1206817, 825410, 1197374, 1203873, 1780885, 1829324, 1803234, 1900879, 1475851, 1040017, 1053671, 1202080, 1315920, 942487, 1060389, 1093466, 928840, 1046374, 879881, 1069172, 871152, 1015317, 946779, 840140, 842575, 874244, 1251273, 1376938, 1366824]
14687A366824k24040L38907M00181K38193l47818j76152o2735j46478P3746m55161
14677A005467L46592m58943q1417L08273k88945J77302J09251j85543o3123K25322
14667A094236l91161J12582Q3714j1250j57019L62225j51796q6519J03289J80199
14657A138500j60219l16371L15237L19926m7663J64548l48848j30887L23030k45649
14647A011604P1889N7189R4945l39132J40103o2726K53423J58174K62021k20682
14637A426808o0622N4809N2363j10237J20781j83094P0169j02002M874j74311
14627A099538R0700j36017K24285m1997J86917l29734J73045p6151q1239J56477
14617A265824j84983M18451m01911K86869O9598J57063k97489J87924L0969l96099
$$ y = [1366824, 1142784, 1481691, 1881872, 2120065, 1772247, 1596095, 1533360, 1386882, 1460628, 1005467, 1352059, 893116, 811699, 1119972, 831027, 1008329, 1117580, 932037, 868914, 1094236, 703075, 815657, 899371, 888121, 731102, 1093327, 941531, 855012, 958301, 1138500, 978281, 661910, 977147, 1297073, 1249410, 1413958, 1065110, 934223, 1257253, 1011604, 1083493, 1140682, 1235627, 896495, 1036598, 973872, 1227295, 1385469, 1647490, 1426808, 1366186, 1420995, 1473358, 1363121, 1483902, 1300808, 1370977, 1268975, 1273849, 1099538, 1190238, 1054221, 1278506, 1236509, 1423426, 1093692, 1266737, 1190586, 1109347, 1265824, 1080841, 1499292, 1097381, 1384250, 1453848, 1610911, 1313422, 1501346, 1532315, 1136216]
14607A136216L11910J5537L90151n11210M2861j098K9944j07554L68676m40188
14597A235245L14715j73558M5693K1684L46962l25402L72633J0176n6158l58984
14587A433006L69607l92499L45216j3453J86538k59392l36102L76724L3612J28569
14577A871826K0260j78645L46L30465k75525J83401j78151J95700J8040P2039
14567B059756j83119k7824P9817N0004j10467J49313J0591K23093J49021j15231
14557B284954J2527k39293j05125K98145L7769M72445k51588j42338q783K37292
14547B596005J82495R0604o2325Q614M92235J01526J23084J93445M25101P32531
14537D883315K14009J251606J282334K055301M724201O990485J2121831n90301
$$ y = [1136216, 1448126, 1463663, 1853814, 1342604, 1385465, 1384367, 1414311, 1306757, 1675433, 1235245, 1549960, 1376402, 1422095, 1443779, 1790741, 1465339, 1837972, 1848148, 1791990, 1433006, 1802613, 1410114, 1755330, 1741877, 1928415, 1669023, 1332921, 1709645, 1743257, 1871826, 1892086, 1713441, 1713787, 2044252, 1768727, 1952128, 1773977, 1969677, 1987717, 2059756, 1876637, 1848813, 1928630, 1978634, 1868167, 2017480, 2028071, 2251164, 2400185, 2284954, 2297481, 2058188, 1953063, 2251208, 2288977, 2761422, 2509834, 2367496, 2358713, 2596005, 2778500, 2869104, 2806779, 2815393, 3307628, 3409154, 3532238, 3725683, 4150784, 4883315, 5097324, 6348930, 7631264, 9686565, 14410766, 21401251, 33523082, 32932781]
14529C2932781j3728528q335448m322985j466829m06751m59485J288022j319962
14521D180815j358540O0935p0148K15962n64492q2910l79473L66827Q3152J87943
14511B640071P8033j64504n9344K33252m07738K04272J61052K3573o7872k2599
14501B618196J23245o2531j37042M034L49376R7290L1192O7140J21869m15916
14491B796853j73285K76197K91181K04260j71350Q9244K7908J28407L6197l57274
14481C148338Q5475K99621j61092o2941J9342L44578J06702l85182M91704j76870
14471C709675J20858J2637R7013j91866K8444R3664K32357p416o7276K15387l46643
14460C896834J74770J08219R0733K44084m18299M43007M6024m3895J7859K46345
$$ y = [32932781, 19204253, 10868805, 6545820, 5078991, 4672240, 4212755, 5500777, 4180815, 2822275, 2883210, 2813062, 3029024, 2464532, 2381622, 2002149, 2368976, 2452128, 2640071, 2718104, 2553600, 2494256, 2727508, 2319770, 2524042, 2685094, 2708667, 2640795, 2618196, 2741441, 2678910, 2541868, 2545902, 2895278, 2992568, 3023760, 3090900, 3212769, 2796853, 2623568, 2899765, 3190946, 3395206, 3223856, 3313100, 3341008, 3469415, 3505612, 3148338, 3233813, 3533434, 3372342, 3309401, 3328743, 3673321, 3780023, 3394841, 3886545, 3709675, 3830533, 3843170, 3940183, 3748317, 3776761, 3870425, 4102782, 4095366, 4028090, 4243477, 3896834, 4071604, 4179823, 4270556, 4514640, 4096341, 4539348, 4585372, 4541477, 4559336, 4805681]
14450D805681J57235M11279j22585l03489j34328K25500j04809J04878J25643
14441E165005o3687P39386p94404j05713J028159l30698O0820J83705j80346M47274
14431F149501o8360l65027L51882M37614m36417M02361k93765L51285P7188J86794
14421F793056j56637K42958j89356N50493r1284R3202M1543R7827R0829J07300
14411G579931J08247K89428J67119R016J44230L80000j96320M51530j2775O6065
14401H986471N01144k63362J59887m3591J8635M1680o8894K02869N36570M58712
14391A0530121m38995O07815o9148O63255r5128j62035L24685J66138j22427L75148
14381A1779429J63087k7871M24123M3360M36256J01203K62481J86560L34553j28805
$$ y = [4805681, 4962916, 5374195, 5251610, 4948121, 4813793, 5039293, 4934484, 5039362, 5165005, 5101318, 5840704, 5046300, 4940587, 5968746, 5638048, 5698868, 5882573, 5702227, 6149501, 6081141, 5716114, 6067996, 6505610, 6069193, 6471554, 6177789, 6529074, 6606262, 6793056, 6636419, 6879377, 6690021, 7240514, 7149230, 7242432, 7283975, 7381802, 7472631, 7579931, 7688178, 7977606, 8144725, 8153741, 8297971, 8677971, 8481651, 8933181, 8920406, 8986471, 9487615, 9224253, 9384140, 9340549, 9359184, 9400864, 9331970, 9534839, 10071409, 10530121, 10091126, 10698941, 10629793, 11293048, 11197920, 11035885, 11360570, 11526708, 11404281, 11779429, 11942516, 11914645, 12338768, 12382128, 12818384, 12919587, 13182068, 13368628, 13703181, 13574376]
14371A3574376K83448M54438O21894r9852K83922O98504K32776L78168J12473
14362A6540147O9390N67600k72051L97694R42174q9255O41127K21065P53878L73324
14352B0145093O5750O71365N08546M44908N2689N11548L48581Q87185L68733M28233
14342B4432631N62568P35654Q13783K86316O55469L64154Q17712R80914P83355
14333C0432556N38736P85894P29417J052742P28261Q60126P97975J331295R72200
14324C8229202J013721J043002J230981J145460J110560J696481J557638J266044
14316D8293089J349598J632961J755223J593878J732016J973092J621000K414152
14308F2365009J831137K558790K437935K328565K739097K582541K840562L081277
$$ y = [13574376, 13857824, 14312262, 14934156, 14834304, 15118226, 15816730, 16049506, 16427674, 16540147, 16609537, 17177137, 16905086, 17302780, 18244954, 18155699, 18796826, 19017891, 19771769, 20145093, 20210843, 20882208, 21390754, 21835662, 21888351, 22399899, 22748480, 23635665, 24004398, 24432631, 24995199, 25730853, 26544636, 26830952, 27486421, 27850575, 28668287, 29649201, 30432556, 30971292, 31757186, 32486603, 33539345, 34267606, 35127732, 35925707, 37257002, 38229202, 39242923, 40285925, 41516906, 42662366, 43772926, 45469407, 47027045, 48293089, 49642687, 51275648, 53030871, 54624749, 56356765, 58329857, 59950857, 62365009, 64196146, 66754936, 69192871, 71521436, 74260533, 76843074, 79683636, 82764913]
14300H2764913K787580L482212L302136L538979M192061M242877M385219M566088
14292A13262065M845373N481892N241663N815359O602425O428794P056384P207628
14284A61941583P805396Q355812Q545279R623534R642210J0579560J0921583J1330669
14276B38745626J2338860J2688028J3819460J3962468J4764552J5464744J5850203
14269C37633941J6212875J5197978J5057029J3410286J2494040J1860683J0591066
14262D32457898J0639853J0575587R310760P190554M368113K612306O31098L110744
14254D80896913j893275n234447n802898p148471j1157035j2733976j2532389
14247D24394422j3498807j3794125j3237725j4140910j5342407j4545213j4720372
$$ y = [82764913, 85552493, 89034705, 92336841, 95875820, 100067881, 104310758, 108695977, 113262065, 118107438, 123589330, 128830993, 134646352, 141248777, 147677571, 154733955, 161941583, 169746979, 178102791, 186648070, 196271604, 205913814, 216493374, 227414957, 238745626, 251084486, 263772514, 277591974, 291554442, 306318994, 321783738, 337633941, 353846816, 369044794, 384101823, 397512109, 410006149, 421866832, 432457898, 443097751, 453673338, 462984098, 470174652, 474542765, 477155071, 477786169, 480896913, 479003638, 473769191, 467966293, 460817822, 449660787, 436926811, 424394422, 410895615, 397101490, 383863765, 369722855, 354380448, 339835235, 325114863]
14240C25114863j4411734j3552361j3577717j3252633j2494263j2151428j1304742
14233B34369985j0351596j1274878j0411358r674059r676246r010376q450282
14226A65521190q148263p416811o996405o640419o002444n978279n496819n181485
14218A13660265m760073m380203m025574m080125l888242l679019l684727k890717
14210H2271585l100994k947563k814385k589860k597323k408756k161750k302330
14202F1348624j761327k267414j908525j490592j612743j447606j669251j450336
14194D7740830j346998j575006p32505j208334j193357j584874r15660r83367
14186C8200729p70584p89021j201859j118926q89470p19482p38663j168104r28086
$$ y = [325114863, 310703129, 297150768, 283573051, 270320418, 257826155, 245674727, 234369985, 224018389, 212743511, 202332153, 192658094, 182981848, 173971472, 165521190, 157372927, 149956116, 142959711, 136319292, 130316848, 124338569, 118841750, 113660265, 108900192, 104519989, 100494415, 96414290, 92526048, 88847029, 85162302, 82271585, 79170591, 76223028, 73408643, 70818783, 68221460, 65812704, 63650954, 61348624, 59587297, 57319883, 55411358, 53920766, 52308023, 50860417, 49191166, 47740830, 46393832, 44818826, 44086321, 42877987, 41684630, 40099756, 39184096, 38200729, 37430145, 36641124, 35439265, 34320339, 33430869, 32711387, 31972724, 30804620, 29876534]
14177B9876534n30699n59867k56935q02525r25772k89750r39399m32934n87654
14168B4550999m98332p50503k92678n92302j82347n45506o17333l07379m43613
14159B0321006m99883o8754o08373j80084l68617p99522k68978l30577l98132
14150A6798086j83521k19204k66377j41919n64378m97387P0745n33621J61625
14141A4624049n91849J86976k47387m78603k15684k50441p2133k45107l62769
14132A2347052J55462n24464j3987k47561K67934m90362j64975n05092J05061
14123A0929068k10561k03722m3993k12980j67370l34572q0670j4209l01286J61650
14113I521355k74734l04115N35241m65787J50931k83917k89633l4892J95520o38423
$$ y = [29876534, 29345835, 28785968, 28529033, 27726508, 26800736, 26510986, 25571587, 25138653, 24550999, 24052667, 23302164, 23009486, 22417184, 22234837, 21689331, 21071998, 20764619, 20321006, 19821123, 19752369, 19143996, 18963912, 18595295, 17795773, 17526795, 17196218, 16798086, 16614565, 16395361, 16128984, 15987065, 15422687, 14925300, 14996045, 14462424, 14624049, 14032200, 14219176, 13971789, 13493186, 13277502, 13027061, 12954928, 12709821, 12347052, 12502514, 11978050, 11964063, 11716502, 11984436, 11494074, 11329099, 10824007, 10929068, 10718507, 10514785, 10470792, 10257812, 10090442, 9755870, 9675200, 9660991, 9359705, 9521355, 9246621, 8942506, 9477747, 9011960, 9162891, 8878974, 8589341, 8554449, 8749969, 8111546]
14103H111546R1947J21650m98497L97929l43785l08229J85240m42743j523j37038
14093G176497K03172k22227n17785N69480q70857J99024M1053K01746k19369l5960
14083F524774j96956L2746k03937N7356j57814N6840k38417q2533o5827j56582
14073E569650j8122J65851k01112L4336l88141L73023k84035k38621J35949J38443
14063E287221l23597m3807K91717k15773k7584j78153o9059J35241l44016J5620
14053D527810O8374m563j41687l6574j26676K79415J91671j94183j82562o5402
14043D315623K77310l77682M7758L2748r929k31807j69766l8283J32046n18934
14033C459084K99825j4544r9933J12607n30185L20073o3749M29414k97283j45520
$$ y = [8111546, 8203493, 8325143, 7826646, 8224575, 7880790, 7572561, 7757801, 7315058, 7313535, 7176497, 7379669, 7157442, 6639657, 7209137, 6338280, 6537304, 6578357, 6780103, 6560734, 6524774, 6327818, 6360564, 6156627, 6213983, 6056169, 6113009, 5874592, 5792059, 5726232, 5569650, 5551528, 5717379, 5516267, 5550603, 5162462, 5535485, 5251450, 5012829, 5148778, 5287221, 4963624, 4919817, 5211534, 4995761, 4968177, 4790024, 4720965, 4856206, 4512190, 4527810, 4596184, 4591621, 4449934, 4413360, 4286684, 4566099, 4757770, 4563587, 4381025, 4315623, 4592933, 4215251, 4263009, 4295757, 4285828, 4054021, 3884255, 3845972, 3978018, 3459084, 3758909, 3744365, 3644432, 3757039, 3226854, 3546927, 3483178, 3912592, 3615309, 3469789]
14023C469789O8736O6238k50599k13483J22075J24765m22893M28951l52221L68472
14013C409830j92106k06080J68595L05827k83950k6245l5492l64310K26593j52315
14003B850347j61843k43819L73014j57133J26023M06847m99228K01584l97544
13994B498248J38588j79322L396q6197J68744j57673j10721K02297k57719J80529
13984B400170J05650J3059j29318L47852J23729K3117Q5227N26567Q5422J093375
13974D674850J662889L261710O586798J1878917Q026472j2102490q936960m764755
13966A0287431k706574j592416r08986n83042m55850l6131m21890j47062j28374
13957C307106K08404n41332k94723K41934j30847k01189k17804M99523m60945
$$ y = [3469789, 3538525, 3604763, 3354164, 3140681, 3262756, 3387521, 2964628, 3393579, 3041358, 3409830, 3217724, 3011644, 3180239, 3486066, 3202116, 3175871, 3140379, 2776069, 3002662, 2850347, 2688504, 2444685, 2817699, 2660566, 2786589, 3193436, 2694208, 2895792, 2498248, 2636836, 2457514, 2460910, 2374713, 2543457, 2385784, 2275063, 2477360, 2219641, 2400170, 2505820, 2518879, 2389561, 2737413, 2861142, 2884259, 2969486, 3496053, 3581475, 4674850, 6337739, 9599449, 16186247, 28065164, 36091636, 23989146, 15052186, 10287431, 7580857, 5988441, 5079455, 4496413, 4040563, 4004432, 3582542, 3435480, 3307106, 3515510, 2974178, 2679455, 2921389, 2790542, 2589353, 2371549, 2871072, 2410127]
13948B410127j50688K4078k21459J88856O9918k23519l3742L25845j41533l17464
13938A930419K47327j05077J04587m6210k02274J36729q5310n9453Q8733r4449
13928A915022J43884m00164O840L58709J11398k79467j83877O6392K62942K51670
13918B253349l78006m17939N44554j03468m33436K59812j653k53657J60975J56016
13908A786547o8137L15115l49461N5676j17507J81057j94907j31263K0605k3055
13898A474670N7403L25979j6253k89670j00604J96223k77185K5027K27800l43847
13888A279543K40974K08438l89438J53469k17306J83094r0749N4589l01313M67330
13878A588631m14455K36076l41834K59709L22219l59931r6640K34316l05257L21303
$$ y = [2410127, 2259439, 2283517, 2062058, 2250914, 2320832, 2097313, 2063571, 2389416, 2247883, 1930419, 2177746, 2072669, 2177256, 2131046, 1928772, 2065501, 1980191, 1920738, 2009471, 1915022, 2058906, 1658742, 1665582, 2024291, 2135689, 1856222, 1672345, 1738737, 2001679, 2253349, 1875343, 1457404, 2001958, 1898490, 1465054, 1724866, 1723213, 1469556, 1630531, 1786547, 1718410, 2033525, 1684064, 1739740, 1622233, 1803290, 1608383, 1477120, 1497725, 1474670, 1532073, 1858052, 1841799, 1552129, 1451525, 1647748, 1370563, 1395590, 1623390, 1279543, 1520517, 1728955, 1339517, 1492986, 1275680, 1458774, 1368025, 1422614, 1121301, 1588631, 1174176, 1410252, 1068418, 1328127, 1650346, 1290415, 1193775, 1428091, 1122834, 1444137]
13868A444137k7839k82680L9789Q3944N1496j28086N9337J55290k84824O2031
13858A172595j30745M6980P0591K29258J7847j77886l16047N89636l68570K44026
13848A377685n8606K09010l39309j77516k10162L88861o1561k21865M50788q3892
13838A273433l9363Q4280k62502o983P9809P0362K2219m13452L69122P2215k24863
13827A024277K6314N3757O7420j44032Q3736k01696k5611L36467k87731Q2354
13817A015255j5921l02604K10485j4525p1945K07931q8148Q786L10266j24990
13807A134590j35591j4207n0455J35820n4198l33685N3327J05492J30311k5845
13797I45559p7696l4192J95679J01147m46597J69477L9501k97316K49590K44526
$$ y = [1444137, 1416298, 1133618, 1173407, 1257351, 1308847, 1180761, 1240098, 1395388, 1110564, 1172595, 1041850, 1088830, 1159421, 1388679, 1406526, 1228640, 912593, 1502229, 1133659, 1377685, 1319079, 1528089, 1188780, 1011264, 801102, 1189963, 1128402, 906537, 1357325, 1273433, 1234070, 1318350, 1055848, 1048865, 1128674, 1199036, 1221255, 807803, 1176925, 1249140, 1024277, 1050591, 1104348, 1171768, 1027736, 1111472, 909776, 884165, 1220632, 932901, 1015255, 999334, 696730, 907215, 892690, 820745, 1028676, 940528, 949314, 1259580, 1134590, 998999, 984792, 934337, 1070157, 1015959, 682274, 735601, 841093, 971404, 945559, 867863, 833671, 1029350, 1130497, 683900, 853377, 892878, 595562, 845152, 1089678]
13787A089678j55444P377O426l26040J74418J2608K05178k19514j30744J41937
13777H05880K57968D75578L90511J41841l98617N54104n66810J66090L53708l49882
13767G66523R6962J7695K26577o5051l69486k4693K94181l62430m8683N11289
13757A042884l84383j50390M65207j19364P287j73606O8926m334Q997j6034R5546
13746H40736C93882K07109M9033J42433N4888K91947D80496J59325K70050J25174
13736A035045l72806K335j61113M18581m09605L33044j07037q8705J44632J30262
13726I24633j71789k23470N55559m59678J80711n8585P7802j49874J57155j17052
13716G15412o9827J26575Q8521N1796k44407j73978N6047o323K28846k32460N3944
$$ y = [1089678, 934234, 941611, 948037, 621997, 796415, 809023, 1014201, 794687, 663943, 805880, 1063848, 475578, 866089, 1007930, 609313, 1163417, 596607, 762697, 1116405, 766523, 863485, 881180, 1107757, 1042706, 673220, 648527, 942708, 580278, 531595, 1042884, 658501, 508111, 973318, 853954, 861241, 687635, 756561, 752227, 761224, 745190, 840736, 393882, 600991, 650024, 792457, 847345, 1139292, 480496, 639821, 909871, 1035045, 662239, 664574, 503461, 922042, 512437, 845481, 738444, 649739, 794371, 924633, 752844, 529374, 1084933, 625255, 805966, 747381, 825183, 675309, 832464, 715412, 645585, 772160, 860681, 912477, 668070, 494092, 550139, 543816, 772662, 540202, 594146]
13705E94146J67013j40676J19571j82134k04410J24587J38737o0598J53172j02668
13695F06740j3181J47066j07497J05397j07868j85524j06827K97786J5514k21822
13685D29784M3769r4198J22824j14118N2318J16119J15985J500p9619R0322M3820
13674G28506l61823O8774j16681M9903A49414M29223n1822k44830L06285j4012
13664E74258p2632k05692K12598J7635j45303A71160J36662J83935B18075N36483
13654G54558B17970M92465H3131M24762j5180J87883J45261l06993p2889J37644
13644E83619k89435J9764K71896m0405J39989k58051j4876O8364A18269L58260
13634D76529j5472N4394K5029j79473J75584L482j07381A83175M70880p3928N9648
$$ y = [594146, 761159, 620483, 740054, 557920, 353510, 478097, 616834, 556236, 709408, 606740, 593559, 740625, 633128, 738525, 630657, 445133, 338306, 636092, 651606, 429784, 473553, 379355, 502179, 388061, 440379, 556498, 672483, 673983, 594364, 684686, 728506, 366683, 435457, 318776, 368679, 149414, 578637, 526815, 281985, 588270, 574258, 501626, 295934, 508532, 526167, 380864, 171160, 307822, 491757, 218075, 754558, 217970, 710435, 83131, 507893, 492713, 680596, 825857, 518864, 445975, 583619, 294184, 313948, 585844, 545439, 685428, 427377, 412501, 480865, 118269, 476529, 461057, 515451, 540480, 361007, 536591, 540073, 432692, 183175, 654055, 580127, 639775]
13623F39775m0814q4518q1698B0295J86122M30159k57425L20951B24239J58066
13613C82305D5761L85989j83157N00235B47628K56682j81832J52136r4850p1799
13603C07965J14612n327K068j96610L07377B36315R8769j52588M8324J90663J08153
13592E29636K794k05489J5599J16385B09786P8153p6131N10360j26149B95530
13581D32201j57532p0398K77454j02421j7501P5647A31064L06791k16360M03519
13571F25014k58445p8873j0908m7441J21283N5483l7244L06701B71651L03415
13561E75066B10592K5131B8386L71508J31609A69060N27970C37682J10240K58875
13551G06797k32830A86913L32876a21213D46805A08818R7472Q5589J86543A50876
$$ y = [639775, 598961, 514443, 432745, 20295, 206417, 636576, 379151, 700102, 224239, 382305, 45761, 431750, 248593, 748828, 247628, 504310, 322478, 474614, 379764, 307965, 422577, 417250, 419318, 222708, 530085, 236315, 335084, 182496, 230820, 421483, 529636, 532430, 326941, 342540, 458925, 209786, 287939, 211808, 722168, 596019, 295530, 432201, 274669, 204271, 481725, 379304, 361803, 437450, 131064, 437855, 221495, 625014, 366569, 287696, 276788, 229347, 350630, 406113, 368869, 675570, 271651, 575066, 210592, 235723, 28386, 399894, 531503, 169060, 697030, 337682, 447922, 706797, 473967, 186913, 519789, -121213, 446805, 108818, 206290, 291879, 478422, 150876]
13540G08566A59474K33323L2791j33835j15396L60045p2701j18499j43176J09331
13530C11357L1696K77800k40427j46100b0111C19762K80034j93793J39444k41807
13520C03640j29562p7980Q3693O8786r2724K99180j25418J36941k3362j17749
13510C25445L77177C46344K1008I7448M06559P4888A55060J01244m9743M0424
13500B46985I2625K13185M3394j55457M386J16292r8991J51708M9361j04145K13707
13489E26065A27769J10781P8356j47349K45764q336n1512j8766n872j63594M1843
13478B09084K50652A13524J81798D33g5335C18321l5481K30100B28448a8041D79973
13466C44655K35522A64958l4685J76721j31495J83136r2384r1827g0235D61380
$$ y = [708566, 159474, 392797, 425588, 291753, 176357, 536402, 463701, 345202, 202026, 311357, 343053, 620853, 380426, 234326, -20111, 319762, 599796, 406003, 545447, 303640, 174078, 96098, 179791, 248577, 155853, 455033, 329615, 466556, 443194, 325445, 702622, 346344, 367352, 97448, 504007, 578895, 155060, 256304, 206561, 246985, 92625, 305810, 349204, 193747, 198133, 314425, 215434, 367142, 416503, 312358, 526065, 127769, 238550, 316906, 169557, 415321, 406985, 355473, 336707, 330835, 167241, 209084, 459736, 113524, 295322, 433, -75335, 318321, 282840, 512940, 228448, -18041, 479973, 344655, 580177, 164958, 130273, 306994, 175499, 358635, 266251, 174424, -70235, 461380]
13455B25349M0435M6869d0326A43211j8773P8852C1555K88382O5456A3153J2109
13444B5262L4880K22464J84547j6065j49938G7048J40180E6650L51886a11715
13433E27654k1092B47697E9060K28008o3555J0077K2482R7710Q2240L3098I3989
13421B62869K23229k09323D9410R230M5997J78622j08293j82L57995J2120B23049
13409C94961j41752l0470J54961a41512C01127O110J0238A09751P4713L44846
13399E29310A89699F6559L28763j74376J46638A03897K57446j29481o6508H0375
13388A6092M44162A20597K54574j05270J46571j46572A5729K68946L02599A6055
13377F4694L58193e2424B04040K4361c8734D50794A76128J81788A46013a84304
$$ y = [225349, 265784, 312653, -40326, 143211, 124438, 203290, 31555, 319937, 385393, 13153, 25262, 60142, 282606, 467153, 451088, 301150, 77048, 217228, 56650, 408536, -111715, 527654, 506562, 247697, 59060, 287068, 223513, 233590, 256072, 353782, 436022, 469120, 93989, 262869, 486098, 276775, 49410, 58640, 104637, 283259, 174966, 174784, 532779, 544899, 223049, 394961, 253209, 222739, 377700, -141512, 301127, 307237, 317475, 109751, 184464, 529310, 189699, 66559, 395322, 220946, 367584, 103897, 361343, 231862, 165354, 80375, 16092, 460254, 120597, 375171, 269901, 416472, 269900, 15729, 284675, 587274, 16055, 64694, 422887, -52424, 204040, 228401, -38734, 450794, 176128, 357916, 146013, -184304]
13366A73619R9577J14654a62843b9199B27048J950N6156j9893K11855A10341J89040
13355B99381j34597K99763A58309P1394K37772j69230j32332J5594a25876e0486
13344I8175J02565b57632D22726j93709G9258P5472O9820J14413j29540d1469
13333B32204L4641J78320A67890L98189k51030J57768k590k29850J67388F9916
13322F84176k73980A79063L0458O5241j12209K90538P8543k34379A4339P7478
13312I1817j8639K45378j56764a77958I1911J72250M6983q6034J38971K17011
13302E81092P3486A55681K00002a9438C10100j31570o47a3297j74528H6196K44483
13291C30679l3200o3964R1735f5898B98649a0051C01349J16617A09173g528o0737
$$ y = [173619, 273196, 387850, -162843, -29199, 227048, 228998, 285154, 265261, 477116, 110341, 299381, 164784, 464547, 158309, 229703, 467475, 298245, 165913, 181507, -125876, -50486, 98175, 200740, -257632, 422726, 229017, 79258, 154730, 224550, 338963, 209423, -41469, 232204, 266845, 445165, 167890, 566079, 315049, 472817, 470227, 240377, 407765, 69916, 684176, 410196, 179063, 209521, 274762, 162553, 453091, 531634, 297255, 14339, 91817, 73178, 318556, 161792, -177958, 91911, 264161, 311144, 225110, 364081, 581092, 654578, 155681, 355683, -19438, 310100, 178530, 177883, -13297, -187825, 86196, 330679, 297479, 233515, 325250, -65898, 298649, -10051, 301349, 417966, 109173, -7528, -68265]
13280f8265D38377A20209m3810O9390a73758D04205j18299H7886f240B93400j42100
13269A51300F4998N20747d3401A10722R6815o9896D0945L02770j4918J0529c73032
13257E6436K25114E745P4530N7983D7250J86873M921i2107c883A17778n6324L98264
13245D59718F5349c0826A25326J28178E8377c5882j878A69209J03610O489k4212
13234B55096A5440K98779a34522K2297K6373A82786A9909J73436I1019N7599d5459
13222i8242K3069I0400J78992m0871j7702b18621A68087l5168E8762a18476A0859
13210G2129J81326k3425a28721j23404l0713A1439Q7394J05142K64183j01163
13200C66995D5689J68143a41874A09119b3720b014H1777C7436c4628A85958J05952
$$ y = [-68265, 438377, 120209, 76399, 145789, -173758, 404205, 285906, 87886, -6240, 293400, 151300, 64998, 585745, -43401, 110722, 207537, 137641, 40945, 343715, 328797, 339326, -373032, 56436, 281550, 5745, 80275, 138258, 47250, 234123, 239044, -92107, -3883, 117778, 61454, 459718, 65349, -30826, 125326, 253504, 58377, -35882, -37760, 169209, 272819, 279308, 255096, 15440, 314219, -134522, -112225, -85852, 182786, 19909, 193345, 91019, 148618, -45459, -98242, -75173, 90400, 269392, 228521, 210819, -218621, 168087, 132919, 58762, -118476, 10859, 72129, 253455, 230030, -128721, -252125, -282838, 11439, 98833, 203975, 468158, 366995, 45689, 213832, -141874, 109119, -23720, -2014, 81777, 37436, -34628, 185958, 291910]
13189B91910L6908C7614K04217J15997H5554J41019g1286C6869M08402A31902
13178C99246F945f5627B22015B5269c8785B49510A0140O8044d5785C04929a82386
13166A77007a0199B90250M424j10059N2363J16688b27258A83406b143D26877e4264
13154C7635e0220n5806A44434E9733o215Q0352P8101j04675K25196p8414d3117
13142A41061K72712j90527j3260l9321J5867J11040j01359M2928j07572n1675
13132G9894a00202C07777R411O420F0993N7160a54464A64466N0272L0667a32802
13120b04889j1265f2441a6895B21486r8281P346P0507j2532j1833L17456a06878
13108E2096J04529J00900a58688A79456a48448A97421e8934C7651J12772c7543
$$ y = [291910, 328818, 37614, 241831, 357828, 85554, 226573, -71286, 36869, 445271, 131902, 399246, 6945, -65627, 222015, 25269, -38785, 249510, 10140, 78184, -45785, 304929, -182386, 177007, -10199, 290250, 294674, 184615, 236978, 353666, -227258, 183406, -2143, 426877, -54264, 37635, -50220, -106026, 144434, 59733, 53518, 133870, 211971, 107296, 332492, 254078, -43117, 141061, 413773, 223246, 209986, 170665, 186532, 297572, 196213, 239141, 131569, 79894, -100202, 307777, 317188, 323608, 60993, 118153, -154464, 164466, 214738, 245405, -132802, -204889, -216154, -62441, -16895, 221486, 123205, 130551, 201058, 188526, 176693, 494149, -106878, 52096, 156625, 257525, -158688, 179456, -148448, 197421, -58934, 37651, 150423, -37543]
13097a06483B03087P5196a59840A85553J14299E7216a26082A6152R5733K30B4549
13085I2216i5556C4023K43022e6005j31329A85310N328J93468A63448G853R9339
13074A07192R2587a00853N993k92500A10444g0129C5126J40217N9734a42034B07456
13062d29804a41983A08200i0857B47816D7071O6930j0939J78329D0340b84213
13051B89172e4959B31176P4630j50538N0195r4961J3319i6269q9870b5704p0738
13040i6442D70183A1004J31083L2168j311o7299a68077A11280K5206b7969n2435
13029h0404A35616J46189p2346G1606c03353a30175A358J67738R9693a0832k34651
13018b45483F7264b4214A07216c42041C16306c32437D8980M6049i4113c6555A00558
$$ y = [-106483, 203087, 278283, -159840, 185553, 299852, 57216, -126082, 16152, 111885, 112115, 24549, 92216, -95556, 34023, 277045, -56005, -187334, 185310, 190638, 384106, 163448, 7853, 107192, 199779, -100853, -94860, -387360, 110444, -70129, 35126, 175343, 235077, -142034, 207456, -429804, -141983, 108200, -90857, 247816, 47071, 114001, 103062, 281391, 40340, -284213, 289172, -54959, 231176, 305806, 155268, 205463, 110502, 123821, -96269, -186139, -25704, -96442, 470183, 11004, 142087, 174255, 172944, 105645, -168077, 111280, 136486, -27969, -80404, 135616, 281805, 209459, 71606, -303353, -130175, 1358, 169096, 268789, -10832, -245483, 67264, -24214, 107216, -342041, 316306, -332437, 48980, 95029, -94113, -36555, 100558]
13006A47182J45190A33960j4293a12867K9709k02571D17660n2290B8964J37274
12996A66238n6173J87775i0019l5736k6641B13114F9851R6043G2577f8753A84273
12984a20869H3874l9214a17716B56915a52581e528m2416l5063A63172D110M7900
12973E2010c8347B4761K777J16891k8340a54664A94775c44641a53307L8345j20561
12962b35523A37556l6428K85565I830b65611A50420J7990D1305J85612c59892
12951A45724n3682g8716A71849E1286J01851a20374K3331B05711B6836g8331j60058
12940b38389O6093C25835k3673n9267E7555a87371A0172a31389r8757p501B76682
12928E8879b08381j29819B11066a15732B26935f4055q5469B7482M4402F837K15127
$$ y = [147182, 292372, 133960, 119667, -112867, -83158, -285729, 417660, 365370, 28964, 166238, 110065, 297840, -90019, -125755, -152396, 213114, 69851, 165894, 72577, -68753, 184273, -120869, 83874, 44660, -117716, 256915, -152581, -5528, -47944, -83007, 163172, 4110, 52010, -38347, 24761, 27538, 144429, 116089, -154664, 194775, -344641, -153307, -114962, -235523, 137556, 101128, 386693, 9830, -265611, 150420, 168410, 41305, 226917, -359892, 145724, 92042, -78716, 171849, 51286, 153137, -120374, -97043, 205711, 26836, -78331, -238389, -172296, 325835, 302162, 242895, 57555, -187371, 10172, -131389, -230146, -237647, 276682, 58879, -208381, -338200, 211066, -115732, 226935, -64055, -149524, 27482, 71884, 6837, 221964]
12917B21964b41549F7319E245L44322j71672M0428b01431i4753m739B30584c9234
12905A17890J08169A10143B1636L53253j1067E1234J08614l0373a6907q3627m7658
12894a48192C69741A12264i4981A50346d5528p9318J6569I0780N1700o4026g3208
12882E013f9161e762B0439d09002g0350C901a86285K643B9764a5502G8557J34452
12870B13009B9687a40401C01284A1319b6202j57732C31250a11865j61686A56273
12859a48215B07869d4009A33856K5942D3200J0910J67212a3358k75246A70737
12848C6309c7708l4269n6799N0566j96728b9615E5466f4844m3673B27632I3050
12836A93939o7258P1571G3926M392J10633p1650i1749j39483d3430A19830b15582
$$ y = [221964, -241549, 67319, 5245, 349567, 177895, 218323, -201431, -94753, -99492, 230584, -39234, 117890, 226059, 110143, 21636, 374889, 363822, 51234, 159848, 129475, -16907, -100534, -148192, 369741, 112264, -94981, 150346, -45528, -124846, -108277, 90780, 142480, 78454, -73208, 5013, -69161, -5762, 20439, -409002, -70350, 3901, -186285, -183642, 29764, -15502, 78557, 213009, 29687, -140401, 301284, 11319, -26202, -183934, 331250, -111865, -273551, 156273, -148215, 207869, -44009, 133856, 159798, 43200, 54110, 221322, -13358, -288604, 170737, 36309, -37708, -71977, -128776, -78210, -274938, -29615, 55466, -64844, -108517, 227632, 93050, 193939, 126681, 198252, 73926, 78318, 188951, 117301, -91749, -231232, -43430, 119830, -215582]
12824F7087B3493K44890M5412a30368o5094D7200O3687a8711B08909o8044a21395
12812c52998a9584m755j14398A24915a33471A42486i3058C34721C3603b54851
12801A07233B7390N5598J39479d7026B96789c69687e1346C4340e5594j03901A16751
12789c05901J01763A11759Q8698c46836B33394I4929a33912a4007A59425E137
12778B46889n3114b69915A61097b23002E4648k3192h4597j1129j3877G0594e6378
12766G6526a83377A87489a6169o6498C07424b16497A35017a4701l27738a20677
12755f1380E3251n213N6907k3012b12645C19211G3976b509B84030A9977M21113
12744D41090G2119n594c07252C6481L32496a80951e5021A36066c82843J70670
$$ y = [67087, 23493, 268383, 313795, -130368, -195462, 47200, 110887, -18711, 208909, 140865, -121395, -352998, -19584, -24339, -138737, 124915, -133471, 142486, -93058, 334721, 33603, -254851, 107233, 27390, 82988, 222467, -47026, 296789, -369687, -51346, 34340, -55594, -159495, 116751, -305901, -204138, 111759, 200457, -346836, 233394, 94929, -133912, -14007, 159425, 5137, 246889, 193775, -269915, 161097, -223002, 54648, 31456, -84597, -95726, -109603, 70594, -56378, 76526, -183377, 187489, -16169, -82667, 307424, -216497, 135017, -14701, -342439, -120677, -61380, 53251, 48038, 104945, 81933, -212645, 319211, 73976, -2509, 284030, 19977, 441090, 72119, 66525, -307252, 36481, 368977, -180951, -55021, 136066, -382843, -212173]
12734b12173A37938b29710d5156i622n011A04634p567J92625b68954A22401P1935
12723A94336c01813B91280H6342b6586I8712N3123j0722N8186K20863A55330k7107
12712A28223e0901q3289C938M0278J51385K31150j25056A08649A9430e3580B82585
12700A90605B4769g2093C9340K78146a9752j94565F7033A0709M8953J42452b734
12688c28054A2174O5163c5767B1930M3478d3397C00568j15302j5471a66506h0599
12676b20368c0423F5684K31492b11876a3355o3825k7758A14566g0343l7577C36522
12664G2462C358i7824c7103B797P3867i8072B31225Q0114j26274C5228a50169
12652H9102K673j4429J98680j6706b7083c51A17668d6868a9533B75009a3947I2401
$$ y = [-212173, 137938, -229710, -45156, -9622, -14633, 104634, 97067, 289692, -268954, 122401, 194336, -301813, 291280, 86342, -26586, 98712, 151835, 141113, 199299, 420162, 155330, 128223, -50901, -134190, 3938, 44216, 195601, 426751, 301695, 108649, 19430, -53580, 282585, 190605, 24769, -72093, 39340, 317486, -19752, -214317, 67033, 10709, 59662, 202114, -2734, -328054, 12174, 77337, -35767, 21930, 65408, -43397, 300568, 185266, 169795, -166506, -80599, -220368, -30423, 65684, 297176, -211876, -13355, -77180, -104938, 114566, -70343, -107920, 336522, 72462, 3358, -97824, -37103, 2797, 76664, -98072, 231225, 311339, 185065, 35228, -150169, 89102, 91775, 77346, 276026, 259320, -27083, -351, 117668, -46868, -19533, 275009, -13947, 92401]
12639b6578p196A73220n5660K89826g9853F045L09085n7051a65458B32967f40200
12627G3174a77209j77396J10833C2315L68607A11205d381j49240B30956A12374
12616i168A76916E9066d2885F7328J95335r7998K08959a89134g8627B53761a4531
12604A92220D4890J10303E9218J96585N6965B7665M165j271L6324J4833a39145
12592C55594A19769i4545B7808K44603j17944l681c2192B58144o2799p9917J96296
12581C11724E6503J34942o5633J62617E0427Q3775h7227E9563k1364a37741b4809
12569a8841o9074B51599C995J51135f8283c1170j29974A61773B5260k298c59917
12557H0072c68552a1699C33728F697J4341O2369k0798K60051I328a75138D0140
$$ y = [-26578, -33774, 173220, 117560, 407386, -79853, 6045, 315130, 258079, -165458, 232967, -640200, 73174, -177209, -354605, -243772, 32315, 400922, 111205, -4381, -153621, 230956, 112374, -9168, 176916, 59066, -42885, 67328, 262663, 164665, 373624, -189134, -78627, 253761, -14531, 192220, 44890, 155193, 59218, 255803, 312768, 27665, 31830, 30559, 66883, 81716, -139145, 355594, 119769, -94545, 27808, 272411, 154467, 150786, -32192, 258144, 195345, 115428, 311724, 56503, 191445, 125812, 288429, 50427, 134202, -87227, 59563, 38199, -137741, -24809, -18841, -87915, 251599, 3995, 155130, -68283, -31170, -161144, 161773, 25260, 22962, -359917, 80072, -368552, -11699, 333728, 6697, 21038, 83407, 62609, 322660, 9328, -175138, 40140]
12545b7664k58424c5662A10061a67446j74239a10261M7899j52882A08420e7785
12534B4565J07466e69692d6735F12448f3976j79883A08686b708p2413B44512F2064
12522f7014A77769H713a56973J6189q7003A52871b18190A8346a82707D9626J07850
12511A57476b69756K9370f3162C6925K00843k4544c116I6030a53001a1846p6657
12500h8503k54896D2563g5698B4614b08126k3189A02321K88796F5744a67230g9682
12488A53551J65896G713M7738L61938j31937d66653f109D00861h9696A93355H5201
12476A39055a71892L1229A86060d8201M76n7914A36267b0508E8454b24374m8190
12465b72564B65862a24907A81874E7345b1083k92052Q8228d115A83060C7810M8233
$$ y = [-27664, -286088, -35662, 110061, -167446, -341685, -110261, -62362, -215244, 108420, -57785, 24565, 132031, -569692, -46735, 612448, -63976, -243859, 108686, -2708, -75121, 244512, 62064, -67014, 177769, 8713, -156973, -140784, -227787, 152871, -218190, 18346, -182707, 49626, 157476, -269756, -240386, -63162, 36925, 237768, 213224, -3116, 96030, -153001, -11846, -88503, -343399, 42563, -75698, 24614, -208126, -231315, 102321, 391117, 65744, -167230, -79682, 153551, 319447, 7713, 55451, 417389, 285452, -466653, -6109, 400861, -89696, 193355, 85201, 139055, -171892, -140663, 186060, -48201, -47725, -105639, 136267, -20508, 58454, -224374, -272564, 265862, -124907, 181874, 57345, -21083, -313135, -224907, -4115, 183060, 37810, 86043]
12454H6043J10663a45296H0441i5539I3232K79430A21756a06894A01972e5469
12443A62536l4815a8174o8701A45825B3244d5067k3038E1807r217J41527B5026
12431b2604j27004H9214d4767C24848b78242D92989h3860k1899J22C29882a48828
12419a68439G8692b6159l9759H0797K01972j8369f5203N45J255C78225a25760
12407a01689A15396b28467O9255A22633f8894j88581j20522B53352a87022G4668
12396f5895l31616a2779C444a0032j43946m03346G4002b18602f3523q8728n1293
12385b03544h5785b2232k07709O7324A58518b5457D8618M5444R3530o88a3090
12373B270a36374b379k16405H3890M6581a80087g0502a0291C0152A4601e8600
$$ y = [86043, 196706, -145296, 80441, -95539, 93232, 372662, 121756, -106894, 101972, -55469, 162536, 127721, -18174, -86875, 145825, 23244, -45067, -68105, 51807, 42590, 184117, 25026, -22604, -149608, 89214, -44767, 324848, -278242, 492989, -83860, -105759, -105637, 329882, -148828, -168439, 78692, -26159, -65918, 80797, 282769, 264400, -65203, -64658, -63403, 378225, -125760, -101689, 115396, -228467, -159212, 122633, -68894, -257475, -377997, 253352, -187022, 74668, -65895, -397511, -12779, 3444, -10032, -153978, -557324, 74002, -218602, -63523, -152251, -203544, -85785, -22232, -229941, -162617, 158518, -25457, 48618, 94062, 187592, 186904, -13090, 2270, -136374, -2379, -218784, 83890, 130471, -180087, -70502, -10291, 30152, 14601, -58600]
12361B82086r8630J20489i2875J6131j89643A79466b95702B16950J30631a48409
12350A20422B7777b24121J9034c2611G7553f9797n5019j9185r1747B49471G2746
12338h2567B6087J95877i9567C59969A12699J44532H0235e3517B1209j694K0138
12327C9653a18656j42G6156J00583a30575k0595r501m5879Q1892j97069E9528
12315c24525C36779j59089K12630m3327O3245L5264k0399A03971P2723J42372
12305C19066a1948l1480F4935J21104K34499j98420J00025I4976O4666K52471
12295D12113a59587N0288B8951L3436b64595B21358n8957o4747k9784A6044a52484
12283B1988K67363B6364c5253j76961F4041f692C8408K00713c9646B61410p2272
$$ y = [282086, 183456, 303945, -92875, -76744, -266387, 179466, -295702, 216950, 347581, -148409, 120422, 27777, -224121, -205087, -32611, 77553, -69797, -124816, -144001, -235748, 249471, 72746, -82567, 26087, 221964, -99567, 359969, 112699, 257231, 80235, -53517, 21209, 19515, 39653, -118656, -118798, 76156, 176739, -130575, -151170, -160671, -206550, -124658, -321727, 59528, -324525, 336779, 177690, 390320, 346993, 410238, 445502, 425103, 103971, 176694, 319066, -11948, -43428, 64935, 186039, 420538, 222118, 322143, 94976, 159642, 412113, -159587, -109299, 28951, 62387, -264595, 221358, 162401, 97654, 67870, 16044, -152484, 21988, 289351, 26364, -35253, -212214, 64041, -6692, 38408, 239121, -39646, 261410, 189138]
12272A89138J432h5568D4045a78327E4633B497L3197L982J56275c76B31166E7935
12259A86208F2445a16992M6917n1297M6577B38071b15418A23658D9518O3062k4404
12248H8176c31611a56483B59439j1865K21286I4585D5919K0021A3221e0049A09235
12236C66754M198b03218A56760J2013K78022B4462J3601Q9221d3162J4927A66465
12224b4489A64712L1191g4865G9717a54605b590A21003a13891A04432D3549K97597
12213C41146F8588d4612j79144A11715J6559b52970D87986J37709A25519J62079
12203B87598H4000M9194L0014g1437C23426A15802l4294J38792L040a75081I7243
12191a22648A56291a30720C05415g2157F7784h4927E8278J82208j3270M6565j29628
$$ y = [189138, 190570, -85568, 44045, -178327, 54633, 2497, 35694, 39676, 195951, -376, 231166, 57935, 186208, 62445, -116992, -70075, -121372, -74795, 238071, -215418, 123658, 49518, 112580, 88176, -331611, -156483, 259439, 247574, 468860, 94585, 45919, 65940, 13221, -50049, 109235, 366754, 370952, -203218, 156760, 168773, 446795, 24462, 38063, 127284, -43162, -28235, 166465, -24489, 164712, 195903, -74865, 79717, -154605, -2590, 121003, -113891, 104432, 43549, 341146, 68588, -44612, -223756, 111715, 128274, -252970, 487986, 625695, 125519, 287598, 84000, 133194, 163208, -71437, 323426, 115802, 81508, 220300, 223340, -175081, 97243, -122648, 156291, -130720, 305415, -72157, 67784, -84927, 58278, 240486, 227216, 273781, 144153]
12180A44153a72309B81879M2947K29096B065M33185j34961n6312j06032O6291
12170B04236P6898j36311J74867L6255A22744J01980J67236H5671L19810A97671
12159A19979J67672K8324e0046A6233R4586J12142J0007D6507J54224K81263b7316
12147a60725H4989B6998P5707J19600o3166K22666j58109b5875F13746a55880
12136A12019c6747j96004B39096a54482A02537d6000O011A6900K76454A4251f0752
12124B63917N4388a20005a9980D7535r442M9020J3785a62931C17908K59402a34247
12112G4285K21868B3373a4325A94887K32382E5614J08898N298p6540J16005J9592
12101B28867D6055i6775L9782A85842a14368A03777Q5586n8797N6659G9670L4411
$$ y = [144153, -172309, 281879, 324826, 553922, 2065, 435250, 300289, 243977, 137945, 204236, 281134, 144823, 319690, 355945, 122744, 224724, 391960, 85671, 405481, 197671, 119979, 287651, 315975, -50046, 16233, 110819, 222961, 232968, 46507, 200731, 481994, -27316, -160725, 84989, 26998, 102705, 222305, 159139, 381805, 223696, -25875, 613746, -155880, 112019, -36747, -232751, 239096, -154482, 102537, -46000, -39989, 16900, 293354, 14251, -60752, 263917, 318305, -120005, -19980, 47535, 38093, 87113, 100898, -162931, 317908, 577310, -134247, 74285, 296153, 23373, -14325, 194887, 427269, 55614, 164512, 169810, 93270, 209275, 228867, 46055, -96775, -56993, 185842, -114368, 103777, 189363, 130566, 187225, 79670, 114081]
12090A14081R6927g8616A87616j6080G3386C2725e395B27177K3524K03407r9932
12079C54176b62655k0174B50465h0500A02736K68232f238B32782d8254j89576
12069b37830A66767a84142H9981J85081e5644A34564q886j3055P2699J49448j05318
12058B29452J50173i5594C15164j36185d7154D01377b5261C74653A68964b38003
12047C81407A28396a39417b1319E1545K22185j09484o8562k3053e32094D49686
12036a35367C39421b90975e0144F2760J43391j8521a8250E2532g6039D8393d16576
12024d6925q2343I0177a52060N794I4043J73310G8184Q6776G7674N7501A6743
12012C28446q6136q5542a81885B11176a73901A40657a74318A67357O062h7638
$$ y = [114081, 211008, -78616, 187616, 171536, 73386, 32725, -5395, 227177, 250701, 454108, 354176, -262655, -282829, 250465, -80500, 102736, 370968, -6238, 232782, -48254, -237830, 166767, -184142, 89981, 275062, -55644, 134564, 125678, 112623, 185322, 334770, 229452, 379625, -95594, 315164, 178979, -47154, 401377, -25261, 374653, 168964, -238003, 381407, 128396, -139417, -21319, 51545, 273730, 164246, 95684, 72631, -532094, 449686, -135367, 339421, -290975, -50144, 62760, 206151, 187630, -18250, 52532, -76039, 48393, -416576, -46925, -129268, 90177, -152060, -146266, 94043, 267353, 78184, 164960, 77674, 135175, 16743, 328446, 242310, 156768, -181885, 211176, -173901, 140657, -174318, 167357, 173419, -87638]
12001d61325E6466K06721b12523C83746j46992e0689C66926C475J88633G9168
11990b3106B2615J85629a60329h794D1598b51118L3437n6632i8895o1878P2186
11979h8587l14579A50549a3699k19612q7641A28362C2422g7782L5061B7540G881
11967c27025d8137A61244c2765m6334A11169K0230l0329D331d76442B35428f2728
11955c28093J47119b0810b278j85011M0495b207l36899D2796a09294A23507b88149
11943h3805B260b33821D534J22146c56372A62929K01082j71986b89664d4649j42178
11932a86827h872B35621I2958Q7113A7718b39845C3864N5025J72330n6412n9078
11921A45729j8233J05997a19600A82905a21874C15708A11193D2916h8627j20108
$$ y = [-461325, 56466, 263187, -212523, 383746, 236754, -50689, 366926, 3475, 192108, 79168, -23106, 22615, 208244, -160329, -8794, 41598, -251118, -217681, -274313, -98895, -160773, -88587, -403166, 150549, -13699, -233311, -320952, 128362, 32422, -77782, -42721, 27540, 7881, -327025, -48137, 161244, -32765, -79099, 111169, 131399, 101070, 4331, -476442, 235428, -62728, -328093, -180974, -20810, -2278, -187289, -146794, -2207, -339106, 42796, -109294, 123507, -288149, -83805, 2260, -233821, 4534, 126680, -356372, 162929, 364011, 192025, -289664, -44649, -186827, -8872, 235621, 92958, 180071, 17718, -239845, 33864, 88889, 261219, 204807, 145729, 127496, 233493, -119600, 182905, -121874, 315708, 111193, 42916, -88627, -208735]
11911b08735E3160a13157D9704b6219I8726J12080a55770J235B96109c913A18791
11899a50599k27264i4263M1672d802j9520F8547r071a98929D1132e1299b0470
11887B2372b48008a21968n6064e0126A86693C0078a32520B59450A02415D2938
11876A61983J0679f4003j38903B21975g3622H204a16008A45079d3084A19720b57331
11864B01997h6455j1476o34Q715p9279A94075B2118K70918k7479b48574B56910
11852A20309D6525P4240b39892h703q8877q1062H9237b12124c0433J1638B10666
11840a94027j95408a10160B10999j8148m5768J15199d3762A5078a30113D815a7120
11828a32323M6504j34486i5059C9915b30788A2678J4946R7483h9820j3929C8947
$$ y = [-208735, 53160, -113157, 49704, -26219, 98726, 210806, -155770, -154535, 296109, -3913, 118791, -150599, -377863, -94263, -52591, -4802, -24322, 68547, 59476, -198929, 41132, -51299, -20470, 22372, -248008, -121968, -178032, -50126, 186693, 30078, -132520, 259450, 102415, 42938, 161983, 172662, -64003, -202906, 221975, -73622, 8204, -116008, 145079, -43084, 119720, -257331, 201997, -86455, -97931, -98565, -89850, -169129, 194075, 22118, 293036, 265557, -248574, 256910, 120309, 46525, 120765, -239892, -8703, -97580, -178642, 89237, -212124, -30433, -18795, 210666, -194027, -389435, -110160, 210999, 192851, 147083, 262282, -43762, 15078, -130113, 4815, -17120, -132323, -85819, -220305, -95059, 39915, -230788, 12678, 27624, 125107, -89820, -103749, 38947]
11816b80165j7487A27439c12204A09609e6694F8421b37604f0781k14390B08096
11805a96172j2101M5733G8352a48633C6753i5320r3693l1771k9713p9043e3407
11793a53290J1136I1240a02053H7360b10526R0259A33060e359j11423k32771A12655
11781a30626L9307G7594K08099b63063A06652a86602r1938M4186B35843F6989
11770A44367h0011l6906B02302d0607A74125k5676h8799B90880D7041a84908I8446
11758A76138K0603L7742c94054a49011F2921c1187l9599l88961a19152r4070D932
11746b07780a2670o5441j21150J7607B48296b127k02382l0020f7126C0909K06313
11735B37222E1675K1612c36865a02034d4024D9904E879a0631j06598a468l63736
$$ y = [-280165, -297652, 127439, -312204, 109609, -56694, 68421, -237604, -60781, -275171, 208096, -196172, -208273, -162540, 78352, -148633, 36753, -95320, -189013, -220784, -250497, -329540, -53407, -153290, -142154, 91240, -102053, 87360, -210526, -120267, 133060, -5359, -116782, -349553, 112655, -130626, -91319, 77594, 285693, -263063, 106652, -186602, -278540, -234354, 235843, 66989, 144367, -80011, -116917, 202302, -40607, 174125, 148449, -88799, 290880, 47041, -184908, 98446, 176138, 196741, 234483, -394054, -149011, 62921, -31187, -70786, -459747, -119152, -213222, 4932, -207780, -12670, -78111, -199261, -181654, 248296, -2127, -204509, -234529, -67126, 30909, 237222, 51675, 73287, -336865, -102034, -44024, 49904, 5879, -10631, -117229, -1468, -365204]
11724c65204B93051l7222a8623j41543B80997I057P1076b35515J12391n3005C88797
11712a4231A01849b1490B11989G9991b27603b4982r5129A96612d7556j53080f9909
11700c28820E2117B2226J50065F2844a58892D6882M0260d3181l775D75581j66372
11689C09209F1865i4144D59970A23270J1164g985j2567A9176h6675A44115e1197
11677A60044N4928e7003A61584h8118l6880H2955g8002D8984K86890G260J09654
11666A16914J42866A00615a67771i24k2649B26399j6835C4033a77715B12615h8888
11654D17380h7277c7784B4044c9808B59374A2736J7173b3253j42232l17974D4794
11642I27a40080q7888J2036B21523D879b1068A48206G1070J81536a20656H0492
$$ y = [-365204, 293051, 255829, -18623, -160166, 280997, 9057, 80133, -235515, -123124, -176129, 388797, -14231, 101849, -21490, 211989, 79991, -227603, -24982, -120111, 196612, -47556, -200636, -69909, -328820, 52117, 22226, 172291, 62844, -158892, 46882, 87142, -43181, -46956, 475581, 309209, 61865, -94144, 459970, 123270, 134434, -7985, -20552, 19176, -86675, 144115, -51197, 160044, 214972, -57003, 161584, -88118, -124998, 82955, -78002, 48984, 335874, 7260, 116914, 259780, 100615, -167771, -924, -23573, 226399, 209564, 34033, -177715, 212615, -88888, 417380, -87277, -37784, 24044, -39808, 259374, 12736, 29909, -23253, -165485, -483459, 44794, 927, -140080, -227968, -215932, 221523, 4879, -21068, 148206, 71070, 252606, -120656, 80492]
11630i5049A19064a67728H0917a39085j95510B58466a83290E3323L2226a21097
11619C57439d2889j60545h352A2499M0509j9984J10097d58464A14973O5978o2383
11608A18568n1682K88008a79339O3000a8225n0228B69826E1780L9548a15465M880
11597a10585O668l08502f6929L0185G4534a9966A84659i6429A22863a87784f9694
11585a57283E4962J79723k0599j05698i613D9856A9546J89969O0044j07119a82772
11573C449c39689a06606B30949b53641a7480B59999d36490A39154J74374n0149
11563B63379A27153b61224C76790D9583L6786L84784b32879R2948O592k3924N8547
11552i8716A97447R5155h13j24139I7792j5487M4556N7795b3870A55967d996n4659
$$ y = [-95049, 119064, -167728, 80917, -139085, -334595, 258466, -183290, 53323, 85549, -121097, 357439, -42889, -203434, -8352, 12499, 53008, 33024, 143121, -458464, 114973, 180951, 118568, 66886, 354894, -179339, -116339, -18225, -68453, 269826, 51780, 91328, -115465, -110585, -103917, -412419, -66929, -36744, 74534, -19966, 184659, -96429, 122863, -187784, -69694, -157283, 54962, 234685, 214086, 108388, -9613, 49856, 19546, 209515, 269559, 162440, -182772, 3449, -339689, -106606, 230949, -253641, -17480, 259999, -436490, 139154, 313528, 263379, 127153, -261224, 376790, 49583, 86369, 471153, -232879, -139931, -133339, -157263, -98716, 197447, 292602, -813, -124952, 97792, 82305, 126861, 184656, -23870, 155967, -4996, -59655]
11540e9655A56806m6705k5446R5245J70627b46387B94673F0851L7880O0572p4817
11529H4486j1945c4412B36813B052a73561A09530b76705J37081E6445c8026G0415
11517b3475B35976a7506D22792B009a73674a6361o5573B06844G2908c3312j83394
11506b16706E8762a47537A51179B8365J8290K30594a7950A6861N1790b45274j89550
11495d34824I2831J01049m6956j0724j8292M75A4070h4818k548A00684a35978
11483b7948a0392F9457L2633J49876i1992B20749H0611J58136r9466m9328J79623
11472B69576M7820A24715n5229o233J35814n5845a20034A08351f0639o7620J4181
11461a14078E4982A1285M9943K55300A30241J45492a12708i515j56559D78185
$$ y = [-59655, 156806, 110101, 84655, 179900, 350527, -246387, 294673, 60851, 98731, 159303, 84486, 72541, -34412, 236813, 2052, -173561, 109530, -276705, -139624, 56445, -38026, 70415, -23475, 235976, -17506, 422792, 2009, -173674, -16361, -81934, 206844, 72908, -33312, -216706, 58762, -147537, 151179, 28365, 46655, 277249, -17950, 16861, 68651, -245274, -434824, 92831, 193880, 146924, 136200, 117908, 118383, 14070, -84818, -87366, 100684, -135978, -27948, -10392, 69457, 102090, 251966, -91992, 220749, 80611, 238747, 139281, 89953, 269576, 317396, 124715, 69486, 63253, 199067, 143222, -120034, 108351, -60639, -128259, -114078, 54982, 11285, 61228, 316528, 130241, 275733, -112708, -9515, -166074, 478185]
11450G8967L17723r5453b75686B23033c07991A28071A35K36749j11400l0602d3382
11438a8634k53181A97586D0942c4316C78252A76102a2301j97783m0803A64698
11427C09763a53790k73790a19057E8757e6227o1450B89580a4814j10379D38544
11416D4085L6390J07865a03898F14147a62392e9182C7564c60534B8971a52645
11405B17218a18658A09005b12662j45520g0039A91269d6981j55055R2586k9333
11395a38783r8325A92951a69735A47392O2598e46448a21845n4553A32251e6342
11384A08681a36958b3264j83908K8360B69800a23981e902B62176H8049J92419
11374B80468a36973M1319K8831A43815a35349j37431A28927G837g630j5803m8244
$$ y = [78967, 396690, 301237, -275686, 223033, -307991, 128071, 135, 236884, 125484, 94882, -43382, -18634, -271815, 197586, 40942, -34316, 378252, 176102, -12301, -210084, -250887, 164698, 309763, -153790, -427580, -119057, 58757, -56227, -117677, 289580, -14814, -125193, 438544, 44085, 80475, 188340, -103898, 614147, -162392, -59182, 37564, -360534, 28971, -152645, 217218, -118658, 109005, -212662, -358182, -70039, 191269, -46981, -202036, -109450, -138783, -237108, 192951, -169735, 147392, 209990, -546448, -121845, -176398, 132251, -56342, 108681, -136958, -23264, -207172, -178812, 269800, -123981, -5902, 262176, 88049, 280468, -136973, -95654, -66823, 143815, -135349, -272780, 128927, 7837, -7630, -23433, -71677]
11363g1677G1305C1771a2688j16837B37584r1991B0907N8627A7141b5902E9763
11351F0979a12325L4467J9227n5362F1936Q6692L7181b8204K495j63918I0208
11339A71255A7476K57569b73474e2439a8554n1125I1434B7612a12675B52597b84084
11327B09366c6984l9856G6445c85770a38099n4416h3827j62799A64675b3614B69289
11315A1531b52102f4797a2921B68297B4133a34929F1562g4451q4994C97646a75950
11303A53769B0903a87851G1850a82808J1770b247p0370H1785A756b74393a27474
11291c73289a75267e8440A35752J33198A28365a58217a7145B1972b5585j6907
11281d2492b1042n9131q3069c8067A21463a24687G2688j4476J10883j6053a08941
$$ y = [-71677, 71305, 31771, -12688, -129525, 237584, 145593, 20907, 79534, 17141, -25902, 59763, 60979, -112325, -77858, -58631, -113993, 61936, 148628, 185809, -28204, -25709, -189627, 90208, 171255, 17476, 275045, -273474, -52439, -18554, -69679, 91434, 27612, -112675, 252597, -284084, 209366, -36984, -76840, 76445, -385770, -138099, -192515, -83827, -246626, 164675, -23614, 269289, 11531, -252102, -64797, -12921, 268297, 24133, -134929, 61562, -74451, -159445, 397646, -175950, 153769, 20903, -187851, 71850, -182808, -171038, -2247, -72617, 81785, 1756, -274393, -127474, -373289, -175267, -58440, 135752, 268950, 128365, -158217, -17145, 21972, -25585, -42492, -21042, -80173, -163242, -38067, 121463, -124687, 72688, 58212, 169095, 153042, -108941]
11269c32870J47511A15840a28056a4976N851B52367h832k54227c7834l05833f5877
11257a28642k71452f5222l56534P8789J37946A73017a69825q458e0960j72507
11247b23467h5545B47095c01573a25933E3459J25624b9329h670D3930f9538E0894
11235a83907F9194K29711a98919E8589d27897G4597J70095G424J24467c38580
11224h860A44057k5288c19891A97330H1893a286j02053p9640Q1419j44414B10898
11212b96129D0348b2726l14361a14743j25439D2713M3437M9242a242A3630h2829
11200h2628j46997j10481J37576F36O293b50429R1712j90499J43633l3298m908
11189b43789b6803B8411a53671c8055A61423o4833p898J29237c2788o6084d4615
$$ y = [-332870, -185359, 115840, -128056, -14976, -9125, 252367, -8832, -263059, -37834, -343667, -65877, -128642, -400094, -65222, -421756, -342967, -205021, 173017, -169825, -178283, -50960, -223467, -85545, 247095, -301573, -125933, 53459, 179083, -29329, -8670, 43930, -69538, 50894, -183907, 69194, 298905, -198919, 58589, -427897, 74597, 244692, 7424, 131891, -338580, -8860, 144057, 118769, -319891, 197330, 81893, -1286, -103339, -182979, -101560, -245974, 210898, -296129, 40348, -22726, -337087, -114743, -240182, 42713, 86150, 135392, -1242, 13630, -82829, -82628, -229625, -340106, -202530, 636, 6929, -250429, -158717, -349216, -205583, -238881, -243789, -26803, 28411, -153671, -38055, 161423, 96590, 88692, 217929, -32788, -98872, -44615]
11177a31615b0234k6102H1629a9664Q758k63892d1786l4977B061M29407A45978
11165B28882a67898j01358Q4839A2825g9729B12992n7952b54169B36173g5710
11154c84991a27190d2242k33501A04411a1888k1522D1681A2757a0400C0188g7188
11142A34395k1905a29107M1566A37911a28278j97350j52186H0856k8141Q5189
11132A37904A7314c02196J50027Q001B4613Q540g4956j66611A90047l7837b6030
11120a89094M4133C7075a17465A65165b01917d9572r8067Q132H8429b12401A18074
11108c56107A9615J96366n8636J17137b90537A88768A9768c36926B71052n9634
11098B11418N6846b21319B03311c9548A96396q3703r769M4516C6391b13249B47115
$$ y = [-131615, -20234, -46336, 81629, -19664, -10906, -274798, -41786, -76763, 2061, 431468, 145978, 228882, -167898, -269256, -184417, 12825, -79729, 212992, 155040, -254169, 236173, -75710, -384991, -127190, -42242, -275743, 104411, -11888, -33410, 41681, 12757, -10400, 30188, -77188, 134395, 112490, -129107, -87541, 137911, -128278, -325628, -477814, 80856, 52715, 137904, 17314, -302196, -152169, -144168, 24613, 33153, -74956, -241567, 190047, 152210, -26030, -189094, -144961, 37075, -117465, 165165, -201917, -49572, -147639, -139507, 88429, -212401, 118074, -356107, 19615, 215981, 157345, 274482, -290537, 188768, 19768, -336926, 271052, 211418, 268264, -221319, 203311, -39548, 196396, 112693, 102924, 147440, 36391, -213249, 247115]
11086A29541n2728J09188c31478A20560J13278a8077B35022J77937j81867A5947
11075D95330f0544G4821K28653j11353b4599A47315N343K8803D9178K67412C9848
11063h5522E35522B58563j432A8510L51047m142A65832o8375J5811K24558A12150
11051F84123p8413r9922j31308j79819P4284J01610L3486J08328J4986P244j20792
11040D13807j77L57282o7794l4623k43643K00271J393P4471J28595n0530j54461
11029F24591O659l11709N96786o3287D24410M53771l04867K41588K4880q3608
11019G56174Q9291l46251J44197J72145J15229l0356k74887j3222M2713k1995
11009F33038j76708J48650r0185K23524O0332j13076r7985P3779j78183M23570
$$ y = [129541, 76813, 186001, -331478, 120560, 233838, -18077, 235022, 412959, 231092, 15947, 495330, -60544, 74821, 303474, 192121, -24599, 147315, 152658, 181461, 49178, 316590, 39848, -85522, 535522, 258563, 257131, 18510, 369557, 365415, 165832, 97457, 113268, 337826, 112150, 684123, 605710, 505788, 374480, 194661, 268945, 370555, 404041, 512369, 527355, 534599, 413807, 413630, 770912, 703118, 668495, 424852, 625123, 626516, 700987, 829582, 779052, 624591, 631250, 319541, 916327, 853040, 424410, 878181, 573314, 814902, 839782, 756174, 845465, 499214, 643411, 815556, 930785, 900429, 625542, 612320, 655033, 633038, 456330, 604980, 514795, 738319, 798651, 685575, 587590, 661369, 483186, 906756]
10999I06756p5370B79330L98000J70316B79690N5196M41688B89955M17021J88691
10989H95667k05848k04829j02932M36176C08752J84446J31318j64097L73045l34349
10979D99115L5028J02438L7665J84068D02917n4186O49229k75899M1300o751k03353
10968E53257L21977K4354p5892l8430J95094M793K36105K0004r9207l9081L37229
10957A440203J1786O82746J32592j87946K63538J37983J61294k39434N2218j16344
10947B338636m9999l9961m76306j07268j46649r914k90449N46449k67887K36691
10937A733343j82016q7222j04839k86371J84817k18240j91853j79981j01776r1318
10927D74544k27449J7456K06946M7836j19397A46871i5567C76373j22463j7051
$$ y = [906756, 831386, 279330, 677330, 847646, 279690, 334886, 776574, 289955, 706976, 895667, 689819, 484990, 382058, 818234, 308752, 493198, 624516, 460419, 833464, 499115, 534143, 636581, 674246, 858314, 402917, 348731, 997960, 722061, 763361, 756610, 553257, 875234, 899588, 823696, 785266, 980360, 985153, 1221258, 1241262, 1142055, 1102974, 1440203, 1451989, 2134735, 2267327, 2079381, 2342919, 2480902, 2642196, 2402762, 2454980, 2338636, 2288637, 2248676, 1772370, 1665102, 1518453, 1508539, 1218090, 1764539, 1496652, 1733343, 1551327, 1464105, 1359266, 1072895, 1257712, 1039472, 847619, 667638, 565862, 474544, 247095, 264551, 471497, 519333, 399936, 146871, -95567, 376373, 253910, 236859]
10917B36859g0061A37146E3936L301J18781d1371k2492n264b9695A0512h7415
10905A0184e2853K0353A83596c6756F9230B0180J22935c6626A19921m42C2360
10893c118n2420B16824a28033e9590K2058I2310K3147L24165b21674l9760h8872
10881C70046a25252A5521a73967D65638c80832f8537A05782K6044i9461B54565
10870a56716J3957c7741n425B79364B8873a12162B04178C6054L5813K0411c01562
10858a06651d8264j5957j38930C8136M804b8472B27586b40411A3054c305k49640
10847b52945E2995B4552J07170a31051b2254A67506E2167b45512A81363d37626
10836c02852a32002b6697I1762a08748b2386B10491D2589a45931b1007p2335B5177
$$ y = [236859, -70061, 137146, 53936, 57237, 176018, -41371, -63863, -69127, -29695, 10512, -87415, 10184, -52853, -32500, 183596, -36756, 69230, 20180, 143115, -36626, 119921, 119479, 32360, -3118, -55538, 216824, -128033, -59590, -37532, 92310, 115457, 439622, -221674, -261434, -88872, 370046, -125252, 15521, -173967, 465638, -380832, -68537, 105782, 131826, -99461, 254565, -156716, -142759, -37741, -43166, 279364, 28873, -112162, 204178, 36054, 71867, 92278, -301562, -106651, -48264, -64221, -203151, 38136, 42940, -28472, 227586, -240411, 13054, -3305, -252945, 52995, 24552, 131722, -131051, -22254, 167506, 52167, -245512, 181363, -437626, -302852, -132002, -26697, 91762, -108748, -22386, 210491, 42589, -145931, -21007, -93342, 25177]
10824A39744e1276j5196o2463b8394j04548J2727c4582D7502h283j93182j9347
10813b20812A66233b60806C14396h78j57846q5777J0683A4193c06317B42152O5731
10802C07883b26439j90334h0626j86329O6759d3106k64328L2147B36013b36163
10791b28501R1021A30801a19737M0309k6776C1672M2621k0887M0460P0770o6560
10780I8076g959j03173m8862d6867j19108A0326e9722l09971H4108a67576A74852
10768c32892B2720a65796L4161O20j56274A82687G0372k6333f589A42454O6949
10757B09403d49530h3504b2330A21251B1659J08741c12816J30994G018J95871
10747B02889D2801O9684a08943j8898d5094j34815P4030N0919m479a1413F8239
$$ y = [139744, -51276, -66472, -128935, -28394, -132942, -120215, -34582, 47502, -8283, -201465, -220812, 166233, -260806, 314396, -878, -158724, -244501, -233818, 14193, -306317, 242152, 307883, -226439, -416773, -80626, -266955, -200196, -43106, -307434, -275287, 236013, -236163, -228501, -137480, 130801, -119737, -79428, -106204, 31672, 74293, 53406, 93866, 164636, 98076, -7959, -111132, -159994, -46867, -165975, 10326, -59722, -369693, 84108, -167576, 174852, -332892, 22720, -165796, -131635, -131015, -287289, 182687, 70372, 44039, -6589, 142454, 209403, -449530, -83504, -22330, 121251, 21659, 130400, -312816, -181822, 7018, 202889, 42801, 112485, -108943, -127841, -45094, -179909, -105879, -54960, -59439, -11413, 68239]
10735A1872i9183r6980i4909A17495O8831c90277A16434h6162j78213A6207g7939
10723D6417a95349D896a69789N1426j00605A428b77584f5997k43268A0544a95110
10711B53865d10838B2297c51805E9907J02110f54803A51102G67i0889H2371h2293
10699g3704l0214L0922B8749b9310C0774J48646h911B2952a77501D1239a35386
10687d08958a90504F2242L8587A4732f4473j35111q663j09391g0102k36134A73921
10675H1385a91817P4379k40985C22764j19082a6380m24622B34931I921a92442
10664A45762N436B7837b85733M0864B45984b68172f4572j49854A07204c36109
10653h081j68321L2260H572h3517b1014k27412d7650H7332a93368A22479a09295
$$ y = [11872, -99183, -196163, -94909, 117495, 186326, -390277, 116434, -86162, -264375, 16207, -77939, 46417, -195349, 4896, -169789, -118363, -218968, 1428, -277584, -65997, -309265, 10544, -195110, 253865, -410838, 22297, -351805, 59907, 162017, -654803, 151102, 767, -90889, 82371, -82293, -73704, -103918, -72996, 28749, -29310, 30774, 179420, -8911, 22952, -177501, 41239, -135386, -408958, -190504, 62242, 100829, 14732, -64473, -199584, -208247, -317638, -70102, -306236, 173921, 81385, -191817, -117438, -358423, 322764, 203682, -16380, -441002, 234931, 9921, -192442, 145762, 151198, 27837, -285733, -244869, 245984, -268172, -64572, -214426, 107204, -336109, -8081, -176402, -144142, 8572, -83517, -21014, -248426, -47650, 87332, -193368, 122479, -109295]
10641c21857J47943j34744h2657j46945H253J80186q6088E874J33183b10009k2864
10630b32873c4327j48579Q5808b2598r7767G0584a91589C39758d01496j6780J72455
10619b45821k06498b0153j5880C09988a08323a36C4636K76526A0729a99402B9320
10607a05037E0988b07376l8923e5506j59402d9291k33633J16500P5592o3746B59772
10595i9613d9520k7019A06783O2626a82659l32382a81892A3L72002f2946k7996
10584i0942c5826F2078a42768K3353o5499G977f1874A1582a32966B86440D48a28177
10571a99426B18984j05629A2000M015a3218k42598N2053A74752m0755E3068q965
10560D4103J23561G476g5777H5147a53921A95250B7259e88415A66885a57615E350
$$ y = [-321857, -173914, -308658, -82657, -229602, 8253, 188439, 102351, 5874, 139057, -210009, -232873, -34327, -182906, -97098, -22598, -120365, 70584, -191589, 339758, -401496, -418276, -245821, -452319, -20153, -36033, 309988, -108323, -136, 34636, 311162, 10729, -199402, 29320, -105037, 50988, -207376, -246299, -55506, -214908, -49291, -282924, -166424, -90832, -154578, 259772, -99613, -49520, -76539, 106783, 169409, -182659, -515041, -181892, 13, 372015, -62946, -90942, -35826, 62078, -142768, -119415, -184914, 7977, -61874, 11582, -132966, 286440, 448, -128177, -199426, 218984, 113355, 12000, 16015, -13218, -255816, -203763, 174752, 133997, 53068, 44103, 167664, 7476, -75777, 85147, -153921, 195250, 27259, -588415, 166885, -157615, 5350]
10548g722r9094F4604c5680D0987c44401B79060B6626O2663g266p5836B51523
10536A55466c14728G253a21961a7921E5003Q566k1182J68660a34081l36984a04179
10524g1584k21137A04863b14959j5832j0135o9125l43105b08346a00521J1997
10514h8524j00318n8203J17227C15757H3506m0614J1763d615B42763H1876K09382
10503B91258a22131j4988J2264B11948b16671B23467c04391J49399C8012c61118
10492a7608j17888b7749A50332f6049k594D2525J91521H0719m583b35355a01891
10480I8513i0611j3726A9166c84824A50370b46725B13697b44259A64120b13517
10469D1783b73018M2874J02870K1334l3841C00099A12692B1897L35314M8444Q6312
$$ y = [-7722, -106816, 64604, -35680, 40987, -344401, 279060, 26626, 89289, -7266, -83102, 251523, 155466, -314728, 7253, -121961, -17921, 55003, 63569, 42387, 211047, -134081, -471065, -104179, -71584, -292721, 104863, -214959, -230791, -240926, -310051, -653156, -208346, -100521, -88524, -188842, -247045, -129818, 315757, 83506, 42892, 54655, -4615, 242763, 81876, 291258, -122131, -137119, -124855, 211948, -216671, 223467, -304391, -154992, 38012, -361118, -17608, -135496, -27749, 150332, -66049, -68643, 42525, 234046, 80719, 76136, -235355, -101891, 98513, -90611, -104337, 19166, -384824, 150370, -246725, 213697, -244259, 164120, -213517, 41783, -273018, -230144, -127274, -105940, -139781, 300099, 112692, 21897, 357211, 405655, 491967]
10458D91967j91205I1944J32221K75453A22245P1921r5217g8734j3357A76636
10447c29448A58323b00499f4906k9318H6596a52515I7717R5105C1641c85560f1398
10435i5830k33866F024M9368f9620j07934E3038b03567j36281J30805A36919i8833
10423B86332f8115K3166r2377A98445c26387J04583k2132i0346b8569j89962M9295
10412a69236C0286Q8640p751A6175a71067p9408c8798A78910A4883e71687b29733
10400C0537b95538a18645C68787b8952l46357D21572a19706B44535d7103A08030
10389a939n9169j4077C0710Q3568C554a53645M7330E0776Q6384b59877J12400
10378a47477A30356f2238D56985F5005N8693a837D4430K79402A14875M9915d3520
$$ y = [491967, 300762, 91944, 224165, 499618, 122245, 194166, 98949, -78734, -92091, 176636, -329448, 158323, -200499, -64906, -94224, 86596, -152515, 97717, 192822, 31641, -385560, -61398, -95830, -329696, 6024, 55392, -69620, -177554, 53038, -203567, -339848, -209043, 136919, -98833, 286332, -68115, -44949, -137326, 198445, -326387, -221804, -243936, -90346, -28569, -218531, -169236, 30286, 118926, 111175, 16175, -171067, -250475, -38798, 178910, 14883, -571687, -229733, 30537, -295538, -118645, 368787, -28952, -375309, 421572, -119706, 244535, -47103, 108030, -1939, -61108, -75185, 30710, 114278, 3554, -153645, -106315, 50776, 137160, -259877, -147477, 130356, -62238, 456985, 65005, 123698, -1837, 44430, 323832, 114875, 164790, -43520]
10366a48722D30245A60154o5853a67225B51245D6418L25830a3310B94174l1598
10356B62576j29897n552J24068j05571J82776j38778K04381o5941j55385J92405
10346C65082J74983k45641J4280A47769N0504R3548L1328R2927a75680A31191
10335E5091A3391K82470Q4810M1682J04860B47982A13435K66457A4975L61602
10325C76577m7299N337a13546B79302R90q7738E3576J70291k459G2968a70688
10313A76465e0633C00464j25778f486E7090a74078b2796B20618a02250a8702A25315
10301h0878A04641a45535A77668J55007b8972C83795j69439b30668n2215A09663
10290e181A19358K823a33655J3200c8934A88321N1923k5798C9080c05262J34428
$$ y = [-148722, 430245, 160154, 94301, -167225, 251245, 46418, 372248, -13310, 294174, 262576, 132679, 127127, 251195, 145624, 328400, 189622, 394003, 328062, 172677, 365082, 540065, 294424, 308704, 147769, 198273, 291821, 323149, 416076, -175680, 131191, 55091, 13391, 295861, 380671, 422353, 527213, 247982, 113435, 379892, 14975, 376577, 329278, 334615, -113546, 279302, 280292, 192554, 53576, 223867, 221408, 72968, -170688, 176465, -50633, 300464, 174686, -6486, 57090, -174078, -22796, 220618, -102250, -18702, 125315, -80878, 104641, -145535, 177668, 332675, -28972, 383795, 214356, -230668, -282883, 109663, -5181, 119358, 122181, -133655, -120455, -38934, 188321, 240244, 214446, 39080, -305262, -170834]
10279a70834Q0091a4415A4190M1635B5368J08239b05312M3489m5480G2613b37449
10267a95901a5940C40503A21523i6479c1922G1181a18388I3295B5189e338l55869
10256c61207R3380J18429E0926K42199a42097A77824a31062j9901A76723b35159
10245B2738L11363I7677g8391B16562g1140h54m1036D2138K52408m0721M9466
10234C03291A34577F0939i41k0042A10628n2150J85087a95158O7356B2198i7292
10222b57434P7324o6326c4202C75272a22459A61246d9469k5303D44744a92068
10211b06339h9350p7127l03384a24071A04296a99952F2762P100A556c24994A88167
10199a05173F6963c77905A8101d5909G1275J62243a78787b1241p9871n1503B22278
$$ y = [-170834, -90743, -14415, 14190, 55825, 25368, 133607, -205312, -161823, -207303, 72613, -237449, -195901, -15940, 340503, 121523, -96479, -31922, 71181, -118388, 93295, 25189, -5338, -361207, -267827, -149398, 50926, 293125, -142097, 177824, -131062, -150963, 176723, -235159, 22738, 334101, 97677, -78391, 216562, -71140, -854, -41890, 42138, 294546, 253825, 303291, 134577, 60939, -941, -20983, 110628, 58478, 243565, -195158, -127802, 22198, -97292, -257434, -180110, -246436, -34202, 375272, -122459, 161246, -49469, -74772, 444744, -192068, -206339, -89350, -166477, -469861, -124071, 104296, -199952, 62762, 69862, 1556, -324994, 188167, -105173, 66963, -377905, 18101, -45909, 71275, 233518, -178787, -21241, -101112, -152615, 222278]
10187D1005J2604a38244J1109d9832j09949c0474C49499b07071A72615f6713k9776
10176i6489l00771B13115a91581c8239F5235b10802O1954d6433A33059F2177a33489
10164b98399a29880B92488h5071K4609H6280j4429b05844q9145h3033L7746k20764
10153b66051a22312m68370A28568B0619a68934D76484b47049L5807L9429A6496
10142e9789j47296I3678a19664m78958K79929J55999O1121A52280D588a82591
10131a11151e0797l589o9760G2509a40816K6653q2607D6550q115b44899j98202
10120d43101a02965j95548L4642a16600q6101h7466J9389j07065P4988D2580d287
10108a15896k0272B08472b41410f0024j52576L4721J5838l0884a5477j44083D9261
$$ y = [41005, 53609, -138244, -127135, -49832, -159781, -30474, 349499, -207071, 172615, -66713, -96489, -397260, 213115, -191581, -38239, 65235, -210802, -148848, -46433, 133059, 62177, -133489, -298399, -129880, 292488, -85071, -60462, 86280, 71851, -205844, -294989, -83033, -45287, -266051, -122312, -590682, 128568, 20619, -168934, 476484, -247049, -211242, -171813, 16496, -59789, -207085, 93678, -119664, -598622, -318693, -162694, -101573, 152280, 4588, -182591, -111151, -50797, -54386, -124146, 72509, -140816, -114163, -196770, 46550, 38435, -244899, -443101, -102965, -298513, -263871, -116600, -202701, -87466, -68077, -175142, -100154, 42580, -4287, -115896, -136168, 208472, -241410, -60024, -212600, -177879, -162041, -192925, -15477, -159560, 49261]
10096a77434N9767N6595B46690G1007j0579J38601d6125r6471e429l22277F4108
10084e9967A16326c5724k71289Q3121A30435n3914b6900l88742a17052K6346A67569
10072b06250N1403A1140N21902b31993h6891j86388P3179O4215b1049o495E4097
10060c1918j75158A4649c69582A54771e740j91926A3776a49915k06359D091L68707
10049C72798A171a0550r9245D782K6587a77326j31298J38475r7710G0787J06233
10038A77020D8784j1935b98765A14848b1082A36161l0313b89379A65057J3698
10028A78755b91273j20095J84568Q5798j04999K8774J7024m4333C9092b59068
10017a6210l69086l6438a10728A19506a53860j39226c0895A7821R2153g9066C01598
$$ y = [-177434, -117667, -61072, 246690, 71007, 60428, 199029, -46125, -142596, -5429, -327706, 64108, -59967, 116326, -35724, -307013, -223892, 130435, 76521, -26900, -415642, -117052, -90706, 167569, -206250, -154847, 11140, 533042, -231993, -86891, -273279, -200100, -135885, -21049, -27544, 54097, -31918, -207076, 14649, -369582, 154771, -5740, -197666, 13776, -149915, -356274, 4091, 372798, 1171, -10550, -109795, 4782, 31369, -177326, -308624, -170149, -267859, 70787, 177020, 48784, 36849, -298765, 114848, -21082, 136161, 105848, -289379, 165057, 178755, -291273, -411368, -226800, -141002, -246001, -217227, -200203, -244536, 39092, -259068, -16210, -385296, -421734, -110728, 119506, -153860, -293086, -30895, 17821, 109974, -79066, 301598]
10005h3061C6782c03272o1973J20960A09044h9766c3819D0525a15820B26504d9213
9993c12043d8704A23526m7586a36895d196n5768j7970B21026a86542a6928A21726
9981a64097C6057a20884a6179j27472o9498d712I5556b65700Q0381p3667I0535
9969f382l82399b6809A60223o8066i4024c2161D4439d1946l35930a27139A30463
9957F5646d5939j4732j31145O6806A4808R3416b2964j45429j98585B36005a62028
9945c5296n966A05492b7543j86501h011l0138k06056a16701N2453n1109a688F5729
9932d32715e9455j4929j29100F7792a50862O9357A44438q612f8070q4198I8151
9920a15177j60331B5011L031a11848R694A4906C917b67532C9904K2398b01940
$$ y = [-83061, 36782, -303272, -365245, -244285, 109044, -89766, -33819, 40525, -115820, 226504, -49213, -312043, -48704, 123526, 75940, -136895, -4196, -59964, -77934, 221026, -186542, -16928, 121726, -164097, 36057, -120884, -16179, -143651, -213149, -4712, 95556, -265700, -185319, -258986, 90535, -6382, -388781, -26809, 160223, 92157, -94024, -32161, 44439, -41946, -377876, -127139, 130463, 65646, -45939, -60671, -191816, -125010, 14808, 108224, -22964, -168393, -366978, 236005, -162028, -35296, -41262, 105492, -27543, -214044, -8011, -38149, -244205, -116701, -64248, -115357, -1688, 65729, -432715, -59455, -74384, -203484, 67792, -150862, -81505, 144438, 135826, -68070, -152268, 98151, -115177, -275508, 25011, 28042, -111848, -102154, 14906, 3917, -267532, 39904, 62302, -201940]
9908H6964O6631g441A02096g8204j9130I8303e9659q9308A30878d02761c8190
9896e534A49784f3877K0773D0741a82789d6054D8776c34238J63333L4751E6599
9884e1695K1035j82777A83164i4260P590E2347a87495a1625j39822D9873M3887
9873I3760a23l01975k5025h8239n5589A16883b40706f7655k80222h0641k48708
9862c29349f4954A64807b54316k2502k4634P0484k57625h7709k37304A79824a87606
9850b99631A5133L3065b74069A54191D6292c07238B11994g4060m0585I3937b07873
9838b8173k8495J7237p8510j82520a37236a3725j27852l39323b1762i512k690
9827a2202j35035G025h1677B1241a70823A40282c0091p231j04004H7911b67866
$$ y = [86964, 153595, -7441, 102096, -78204, -97334, 98303, -59659, -148967, 130878, -402761, -38190, -5534, 149784, -63877, -43104, 40741, -182789, -46054, 48776, -334238, -170905, -136154, 56599, -51695, -30660, -213437, 183164, -94260, -86670, 52347, -187495, -11625, -151447, 49873, 93760, -123, -302098, -327123, -88239, -143828, 116883, -240706, -67655, -347877, -80641, -329349, -64954, 164807, -254316, -276818, -301452, -230968, -488593, -87709, -325013, 179824, -187606, -299631, 15133, 48198, -274069, 154191, 46292, -307238, 211994, -74060, -114645, 93937, -207873, -28173, -56668, -39431, -117941, -300461, -137236, -13725, -141577, -480900, -21762, -9512, -12202, -147237, 7025, -81677, 21241, -170823, 140282, -30091, -37322, -141326, 87911, -267866]
9815a07577a3693l18934j70628b01073d6050K0613k57337C2592K7143a47156N8802
9804h8354A30216a66189B8418b9560l86143D0749J72610h699o7257C93609C1334
9792A71558c26586B03603m7237f6713A839J60075e14094b06119p2706P9017p9201
9781b79009D3837c04343Q3088I7982a311n1054j69023k47545J85296p6322A5342
9769a85464E5965K39484f3147j00042A03660b41077B12257C5661b82401a26605
9758G2987b44482A59548b69714F677P7624l1695b03208j36577J33602M7979F1288
9746f4684j678A57924a42923a355k69880I2267a13442j8191k03135f9985F6760
9734A22920N2411h2146F0019a29436o0804H1340l9857j7430c97601G9168i2285
$$ y = [-107577, -13693, -332627, -503255, -201073, -46050, -25437, -282774, 32592, 59735, -147156, -88354, 130216, -166189, 28418, -29560, -415703, 40749, 213359, -8699, -75956, 393609, 31334, 171558, -326586, 203603, 156366, -66713, 1839, 161914, -514094, -206119, -278825, -199808, -279009, 43837, -304343, -221255, 97982, -1311, -52365, -221388, -468933, -283637, -359959, 15342, -185464, 55965, 295449, -63147, -163189, 103660, -241077, 212257, 35661, -282401, -126605, 72987, -244482, 159548, -269714, 6677, 84301, 52606, -203208, -339785, -206183, -158204, 61288, -64684, -66362, 157924, -142923, -1355, -271235, 92267, -113442, -131633, -334768, -69985, 66760, 122920, 175331, -82146, 60019, -129436, -190240, 81340, 41483, 24053, -397601, 79168, -92285]
9722b18589j86008L2148a70177D2049J51847c3461F0506c24447a56085D2472b16568
9710b05729L2356C51648c25433c9886B166J81802O6259a67576j8833j48536b542
9698I7617g315j85142h3919j8675L7855j57410N7772k37338B91537b00903j88325
9687c89228M2499J47513E7787a94202A37415b78956A07415K4572k1912l7503J30389
9676B02961f3080A64020b41826a05186c5120D8101c9074F6009P8387G819K5203
9665C3022b91202H2638N1880a78887B1377e0035j11374a0795j62541P6234c746
9653b07926G898b08232A19380b2521H8321C2795e0785A10457K4980F395e03746
9641H3941d4017F8531c23857a60909I8075g3522D9194Q3256e125k30611j76983
$$ y = [-218589, -404597, -372449, -170177, 42049, 193896, -33461, 60506, -324447, -156085, 42472, -216568, -205729, -173373, 351648, -325433, -39886, 2166, 183968, 250227, -167576, -186409, -334945, -2542, 97617, -7315, -192457, -83919, -102594, -64739, -222149, -164377, -401715, 291537, -200903, -389228, -346729, -199216, 57787, -194202, 137415, -278956, 107415, 131987, 110075, 72572, 202961, -63080, 164020, -241826, -105186, -35120, 48101, -39074, 66009, 144396, 7819, 33022, -291202, 82638, 134518, -178887, 21377, -50035, -161409, -10795, -173336, -97102, -3746, -207926, 7898, -208232, 119380, -22521, 88321, 32795, -50785, 110457, 135437, 6395, -503746, 83941, -44017, 68531, -323857, -160909, 98075, -73522, 49194, 132450, -5125, -235736, -412719]
9630d12719A72192p6026a53018C131N6115c62507M0460A3219a22224j86597A08352
9618b56866g3577C230c14016C1172a36860j56212A85290C4609g4449k50741a25717
9606a67221A39107L4136a13298j02949E1424J06396D211a23216n3945j01321A2963
9594a61329I6463c6366H2977b35D8938a79595b1962j49024L5325o3139C05519
9582a25243G6566L0245a74193G6806l7804d8504M525F9055Q4279a42726k6049
9571a68775I5439b60589P1753D10394a75161O8547b740A16484d8972M718k94984
9560c39238a25656B53864r3386a84508A52007a04003j67857G2163b95302m6268
9550c41570B8767g8373K6841j10580K7104a6594k6133A9875f0836K2095A4270
$$ y = [-412719, 172192, 96166, -153018, 3131, 59246, -362507, -322047, 13219, -122224, -308821, 108352, -256866, -73577, 3230, -314016, 31172, -136860, -293072, 185290, 34609, -74449, -325190, -125717, -167221, 139107, 173243, -113298, -216247, 51424, 157820, 4211, -123216, -177161, -278482, 12963, -161329, 96463, -36366, 82977, -235, 48938, -179595, -21962, -170986, -135661, -198800, 305519, -125243, 76566, 106811, -174193, 76806, 39002, -48504, -43979, 69055, 153334, -142726, -168775, 95439, -260589, -188836, 410394, -175161, -106614, -2740, 116484, -48972, -44254, -339238, -125656, 253864, 160478, -184508, 152007, -104003, -271860, 72163, -295302, -341570, 28767, -78373, -51532, -162112, -135008, -16594, -42727, 19875, -60836, -38741, 14270]
9538i9447b7990A24666a19361a9996A22347b49998a10022j13774B83244a16801
9527b67924D5862a44326A53373b44202h5039n9395A73932a85936L7473l8813d5700
9515i0729k9212k85920J79833d3479k13266I4232d25273a12698L8618E1555j3502
9504C8053a75421L4715H8653c06053f0786j10354o5295A9496R0306a80538B28594
9492a39436n4500J1399g3416D940a948B0373h6491A74578p6640B4545b04790k22210
9480d27000A03034a68929A6903b93414B39073p2328E554i2649B1796L444j1762
9469A3478h0697B91930G0273b07808g2241O221k3525I5273L4020A2541a621j76641
9457a78262Q6821l7512p8917j92591h4069C17432b19529h5501A37344c589o362
$$ y = [-99447, -27990, 124666, -119361, -19996, 122347, -249998, -110022, -223796, 283244, -116801, -267924, 45862, -144326, 153373, -244202, -85039, -144434, 173932, -185936, -148463, -187276, -45700, -90729, -119941, -405861, -226028, -43479, -256745, 94232, -425273, -112698, -74080, 51555, 38053, -175421, -140706, 88653, -306053, -60786, -171140, -236435, 19496, 109802, -180538, 228594, -139436, -193936, -182537, -73416, 4940, -1948, 20373, -86491, 174578, 97938, 24545, -204790, -427000, 103034, -168929, 16903, -293414, 239073, 166745, 5554, -92649, 21796, 25240, 13478, -80697, 291930, 70273, -207808, -72241, -66020, -89545, 95273, 129293, 12541, -1621, -178262, -91441, -128953, -207870, -400461, -84069, 317432, -219529, -85501, 137344, -3589, -9951]
9446i951I7165a21083A02313J59077a52573A77095o6865D1371a66726P4191L1960
9435f0575o6835F3517b18674B42536M1252a34157H8360d53599h1184k30328A09265
9423A49446a16553a2268B99299g5429A82897b94373O8268Q1695C73467e50641
9412a35660M4180A8466J82340a00823l6187m2877j35716C9697l626a18390m6414
9401a64804c1461r0404B38256h4442l9937K1223L5206m415j86309I3624o665c1141
9388a1347B16312a01849B327K28003i5067k35167R2852p434N9262I8773A1070
9376e174q2213j06107A32390m6521h7216m18213a2435j38272F9650h8609h587
9364a13538k33003h5044j21285A39202o3344d266j99284q8633L2683h1503K9646
$$ y = [-9951, 97165, -121083, 102313, 261390, -152573, 177095, 110230, 41371, -166726, -92535, -60575, -127410, 63517, -218674, 242536, 283788, -134157, 88360, -453599, -81184, -311512, 109265, 149446, -116553, -12268, 299299, -75429, 182897, -294373, -226105, -144410, 373467, -550641, -135660, -91480, 18466, 200806, -100823, -137010, -179887, -315603, 39697, 36071, -118390, -164804, -31461, -121865, 238256, -84442, -124379, -103156, -67950, -72365, -258674, 93624, 86959, -31141, -11347, 216312, -101849, 2327, 230330, -95067, -330234, -237382, -244816, -185554, 98773, 11070, -5174, -87387, -193494, 132390, 85869, -87216, -505429, -12435, -150707, 69650, -88609, -8587, -113538, -346541, -85044, -206329, 139202, 75858, -4266, -203550, -292183, -259500, -81503, -51857]
9353e1857m9940K1997B69767C1931b71872g1137j76689A69201f13189b69429q0013
9342c49442C6597b67896k648B3792E358K48266a76512f8980k65979A2920J6164
9331B9084K77342b03520A46143c91014H7904J44888c18251A05535d1854a5101
9320e30510A60419a43424B68967b42916n631h1627L1733j99032C50005D8911P1931
9309A20842e0568l4182C67383g0833A39587l8276C1383i6370A54938a36874A75197
9297b06336b7685j53033M8838a0372o6118F8283c12707d1015B11272h9019r6277
9286a85296I648K00262a49937K1949b6453B9209a52479j1073M0756B54004a05032
9274A56472b4510l9681p5945r6906f89m06538g7650j44591Q8894l5334I4357e5780
$$ y = [-51857, -101797, -79800, 269767, 31931, -271872, -71137, -247826, 169201, -613189, -269429, -349442, 36597, -267896, -270544, 23792, 5358, 253624, -176512, -68980, -334959, 12920, 29084, 306426, -203520, 146143, -391014, 87904, 232792, -318251, 105535, -41854, -15101, -530510, 160419, -143424, 268967, -242916, -248547, -81627, -49894, -248926, 350005, 48911, 120842, -50568, -84750, 367383, -70833, 139587, 101311, 31383, -96370, 154938, -136874, 175197, -206336, -27685, -180718, -131880, -10372, -76490, 68283, -312707, -41015, 211272, -89019, -185296, 9648, 209910, -149937, -127988, -26453, 29209, -152479, -163552, -122796, 254004, -105032, 156472, -24510, -64191, -140136, -237042, -689, -407227, -77650, -222241, -133347, -168681, 94357, -55780]
9261d65212d9260D2205K63009a49302j31464J36948n1535G0194f353m3198m75728
9250e25279b21271E9800g9176K6953A15827a90938I3959C5240a53042j50862a27320
9238A34000a87896j01431C5626i2557j36250n6574Q652A78309Q1072d34700a61722
9226A45150E0568a1944l17139d4898B738J79496c64074a27300A36783b83861J00245
9215a83616d6490l82442a16815B71585q0856H7115g0547l71501b9953E3474b69420
9203C3272a3237A05436N3300J17002b61492R5960E4423a31537B8228a31685a265
9191a49392i903G1987P3031a67438A9285a16724k90469a82713J3812K6873k32962
9180c74990F3146b33604e6275a7318M81l2338l22107A16330f7287K2074A98378
$$ y = [-465212, -49260, 42205, 305214, -149302, -280766, -143818, -195353, 70194, -6353, -49551, -525279, -221271, 59800, -79176, -52223, 115827, -190938, 93959, 35240, -153042, -303904, -127320, 134000, -187896, -289327, 35626, -92557, -228807, -285381, -276729, 178309, 259381, -434700, -161722, 145150, 50568, -11944, -329083, -44898, 2738, 182234, -364074, -127300, 136783, -283861, -183616, -46490, -428932, -116815, 271585, 190729, 87115, -70547, -442048, -29953, 53474, -269420, 33272, -13237, 105436, 158736, 275738, -261492, -165532, 54423, -131537, 28228, -131685, -1265, -149392, -9903, 71987, 145018, -167438, 19285, -116724, -407193, -182713, -168901, -142028, -374990, 63146, -233604, -56275, -17318, -16837, -49175, -371282, 116330, -67287, -45213, 198378]
9168a21945b273B35807A07145c80862h1875J4859J6561F5330M261a7474j74002
9157a91476B60129C1040d19711b01131n4401A80104a02104B01066m7020b39970
9146c2882A00862a87027F6456b2518q4019j76561J34981b9519k47253N2477a09457
9134A85507R9911B2303b39740A46186J05937A22418c8244O140c109j76750d8382
9122c8607j36839O3331r9081O6064n159A90209c8858k01475B05905b35871C7750
9110b10596L0741c9856j36782F7118a33726K5257C60452a63815A64649d12810
9099I3261a07572k05817A87540n2976A6859a19k39358A97280o2195a49451B22447
9087e0781j94459D123b03512P1227A73105a20842n3919Q3580o7533j405N3319
$$ y = [-121945, -2273, 235807, 107145, -380862, -81875, -67016, -50455, 65330, 69591, -17474, -191476, 260129, 31040, -419711, -201131, -255532, 180104, -102104, 201066, 154046, -239970, -32882, 100862, -187027, 66456, -22518, -106537, -283098, -148117, -29519, -276772, -224295, -109457, 185507, 285418, 22303, -239740, 146186, 252123, 122418, -38244, -32104, -3109, -179859, -48382, -38607, -175446, -112115, -211196, -145132, -150291, 190209, -38858, -240333, 205905, -235871, 37750, -210596, -179855, -39856, -176638, 67118, -133726, -108469, 360452, -163815, 164649, -412810, 93261, -107572, -313389, 187540, 134564, 16859, -119, -239477, 197280, 135085, -149451, 222447, -50781, -245240, 4123, -203512, -132285, 173105, -120842, -174761, -91181, -158714, -160119, -106800]
9076a06800b0415A12309a82966I8972b64312D9693a81432l2795m9414J27798j05983
9065b41826A15897a17624M4266j7786D329L8675q177K57038d21531I4568c00924
9053F896O8694g0480k16947G6771b43356a17131j77884R7199J6119B5796c22024
9041H4054P4227b88933O4487A65339E8980J20072b37769P4119L4855A99494B6741
9029A28446a07676L2965D5509g7412C2546b7739G139e3485j68542j21693J7266
9018c26454i6213L4404K7708B62b21878c0806C4620K526a96971q9088h7101B88918
9005E06524b0629l53629C57647A66775A6280i530j30168J1728j9298B6028a54641
8993A09701B9540a70189D9563A8331N7789O4987l3815a45233I5953a18969j17071
$$ y = [-106800, -20415, 112309, -182966, 98972, -264312, 49693, -181432, -214227, -263641, -135843, -241826, 115897, -117624, -73358, -91144, 4329, 43004, 34827, 291865, -421531, 94568, -300924, 6896, 75590, -70480, -287427, 76771, -243356, -117131, -295015, -197816, -181697, 25796, -322024, 84054, 158281, -288933, -224446, 165339, 58980, 179052, -237769, -163650, -128795, 199494, 26741, 128446, -107676, -74711, 45509, -77412, 32546, -27739, 7139, -53485, -222027, -343720, -326454, -96213, -61809, -34101, 262, -221878, -30806, 34620, 37146, -196971, -286059, -87101, 288918, 506524, -20629, -374258, 357647, 166775, 16280, -9530, -139698, -127970, -147268, 26028, -154641, 109701, 29540, -170189, 49563, 18331, 76120, 141107, 107292, -145233, 95953, -118969, -236040]
8982b36040Q1458r8179c3263J5883G1107b6798l12108N897i4031A97518b74372
8970H4525M9108a29084A34453h3499k24303B485a17547j62250C9490K2243e9647
8958G4063a30115d2381H6064A0118a77489d8682j67318C4210e09486A05653C7018
8946C63274B3407e6559B4239b14598p5273a459C45322b13902P2586A98941h2687
8934a99426o6592j16889g1312A328L56516d2087l6672n3544d5217l3854H3451
8922b23871A37539i3166A1010a0492G2899L523R0775L1108q6687P6720a14733
8910D03816j91529r8884L78351O1719k02486N71995J190351K328323k16763A986104
8899I22645l18765B03348J21948A02347A4218J15606j3880f4577p619B38475D3330
$$ y = [-236040, -154582, -252761, -33263, -17380, 71107, -26798, -338906, -333009, -94031, 197518, -274372, 84525, 133633, -129084, 134453, -83499, -307802, 2485, -117547, -279797, 39490, 61733, -59647, 74063, -130115, -42381, 86064, 10118, -177489, -48682, -216000, 34210, -509486, 105653, 37018, 363274, 23407, -56559, 24239, -214598, -289871, -1459, 345322, -213902, -141316, 198941, -82687, -199426, -266018, -382907, -71312, 1328, 357844, -42087, -78759, -132303, -45217, -79071, 83451, -223871, 137539, -93166, 11010, -10492, 72899, 76422, 167197, 198305, 111618, 188338, -114733, 403816, 212287, 113403, 491754, 553473, 350987, 922982, 2113333, 4441656, 4224893, 1986104, 922645, 603880, 203348, 325296, 102347, 14218, 129824, 115944, -64577, -72196, 238475, 43330]
8887I1599a18283a6415k07045a4864F0644N5593O9566a56334N8965l71591d78
8875b0955j55618b5669I9809b08337D8052a78263o6629A22775c7078k11338D3643
8863B48498b7793C1545R7525J72237c61536D74755a53005G0187b01523C18105
8852C1553N4865c96353J21227a8930H7115J98158a74923E617c57393e8900p7685
8841a36585k18145A19989a44987M0296B9508b2232o5107k73455H0401K4115k6035
$$ y = [91599, -118283, -16415, -223460, -14864, 60644, 116237, 185803, -156334, -97369, -468960, -478, -20955, -176573, -25669, 99809, -208337, 48052, -178263, -244892, 122775, -37078, -248416, 43643, 248498, -27793, 31545, 129070, 301307, -361536, 474755, -153005, 70187, -201523, 318105, 31553, 86418, -396353, -275126, -18930, 87115, 285273, -174923, 5617, -357393, -58900, -136585, -354730, 119989, -144987, -104691, 29508, -22232, -87339, -360794, 80401, 104516, 78481]
$$ [...]
##END NTUPLES=NMR SPECTRUM
##END=
