
##TITLE=AC1131_Libano-tolima_5875227_odPQ01NecU
##JCAMPDX= 6.0         $$ Bruker NMR JCAMP-DX V2.0
##DATA TYPE= NMR SPECTRUM
##DATA CLASS= NTUPLES
##ORIGIN= BRUKER
##OWNER= Administrator
$$ 1.72 TOPSPIN		Version 2.1
$$ 2012-03-31 23:41:28.609 -0500  Administrator@TOPSPIN
$$ Compression mode = diff/dup
##.OBSERVE FREQUENCY= 400.13188235
##.OBSERVE NUCLEUS= ^1H
##.ACQUISITION MODE= SIMULTANEOUS (DQD)
##.ACQUISITION SCHEME= undefined
##.AVERAGES= 64
##.DIGITISER RES= 22
##SPECTROMETER/DATA SYSTEM= spect
##.PULSE SEQUENCE= noesygpps1d.comp
##.SOLVENT NAME= COFFEE_meoh
##.SHIFT REFERENCE= INTERNAL, COFFEE_meoh, 1, 14.96865
##AUDIT TRAIL= $$ (NUMBER, WHEN, WHO, WHERE, PROCESS, VERSION, WHAT)
$$ ##TITLE= Audit trail, TOPSPIN		Version 2.1
$$ ##JCAMPDX= 5.01
$$ ##ORIGIN= Bruker BioSpin GmbH
$$ ##OWNER= Administrator
$$ $$ C:\Bruker\TOPSPIN/data/COFFEE/nmr/AC1131_Libano-tolima_5875227_odPQ01NecU/12/pdata/1/auditp.txt
$$ ##AUDIT TRAIL=  $$ (NUMBER, WHEN, WHO, WHERE, PROCESS, VERSION, WHAT)
(   1,<2012-03-31 23:41:23.250 -0500>,<Administrator>,<TOPSPIN>,<go>,<TOPSPIN 2.1>,
      <created by zg
	started at 2012-03-31 23:29:51.515 -0500,
	POWCHK enabled, PULCHK disabled,
       configuration hash MD5:
       1A 1E CE 29 27 FD 77 03 67 4E F0 E3 C4 B2 CB 90
       data hash MD5: 64K
       CD B5 AA D6 99 4F 52 C5 77 35 3F 52 89 D7 BE E8>)
(   2,<2012-03-31 23:41:26.250 -0500>,<Administrator>,<TOPSPIN>,<proc1d>,<TOPSPIN 2.1>,
      <Start of raw data processing
       efp LB = 0.3 FT_mod = 6 PKNL = 1 PHC0 = 0 PHC1 = 0 SI = 128K 
       data hash MD5: 128K
       41 9F 9D 38 4B 3B 9B 06 28 2F 83 60 2B 6C 79 7D>)
(   3,<2012-03-31 23:41:27.656 -0500>,<Administrator>,<TOPSPIN>,<proc1d>,<TOPSPIN 2.1>,
      <pk PHC0 = 37.78748 PHC1 = 0 
       data hash MD5: 128K
       1A D6 6F 70 22 DC C8 DE 39 04 8E 51 B2 A6 FB 23>)
(   4,<2012-03-31 23:41:28.250 -0500>,<Administrator>,<TOPSPIN>,<proc1d>,<TOPSPIN 2.1>,
      <abs ABSG = 1 
       data hash MD5: 128K
       8F 15 D9 69 5B C4 64 23 AF BC 10 88 37 81 B2 EA>)
(   5,<2012-03-31 23:41:28.343 -0500>,<Administrator>,<TOPSPIN>,<proc1d>,<TOPSPIN 2.1>,
      <abs ABSG = 2 
       data hash MD5: 128K
       6D 65 9A BD FA 93 B8 C7 FA 70 73 0D F5 72 8D 4F>)
(   6,<2012-03-31 23:41:28.390 -0500>,<Administrator>,<TOPSPIN>,<proc1d>,<TOPSPIN 2.1>,
      <abs ABSG = 3 
       data hash MD5: 128K
       35 31 E2 18 C8 A5 09 C9 FD 70 96 02 FC C4 FB 0A>)
(   7,<2012-03-31 23:41:28.453 -0500>,<Administrator>,<TOPSPIN>,<proc1d>,<TOPSPIN 2.1>,
      <abs ABSG = 4 
       data hash MD5: 128K
       C1 5F 71 46 D1 09 4F 24 EF A9 F4 9F CC 51 C1 C5>)
(   8,<2012-03-31 23:41:28.515 -0500>,<Administrator>,<TOPSPIN>,<proc1d>,<TOPSPIN 2.1>,
      <abs ABSG = 5 
       data hash MD5: 128K
       E8 9C 94 66 BE B3 32 F3 AC 30 55 C1 28 3A D0 AB>)
$$ ##END=
$$ 
$$ $$ hash MD5
$$ $$ 70 10 00 74 E9 75 37 1C FC BD D0 FC 1D 99 40 84
##$RELAX= 
##$RELAX= 
##$RELAX= 
##$RELAX= 
##$RELAX= 
##$RELAX= 
##$RELAX= 
##$RELAX= 
$$ Bruker specific parameters
$$ [...]
##$TP07= 0
##$TPNAME0= <>
##$TPNAME1= <>
##$TPNAME2= <>
##$TPNAME3= <>
##$TPNAME4= <>
##$TPNAME5= <>
##$TPNAME6= <>
##$TPNAME7= <>
##$TPOAL= (0..7)
0.5 0.5 0.5 0.5 0.5 0.5 0.5 0.5
##$TPOFFS= (0..7)
0 0 0 0 0 0 0 0
##$TUNHIN= 0
##$TUNHOUT= 0
##$TUNXOUT= 0
##$USERA1= <user>
##$USERA2= <user>
##$USERA3= <user>
##$USERA4= <user>
##$USERA5= <user>
##$V9= 5
##$VALIST= <valist>
##$VCLIST= <CCCCCCCCCCCCCCC>
##$VD= 0
##$VDLIST= <DDDDDDDDDDDDDDD>
##$VPLIST= <PPPPPPPPPPPPPPP>
##$VTLIST= <TTTTTTTTTTTTTTT>
##$WBST= 2048
##$WBSW= 25
##$XGAIN= (0..3)
0 0 0 0
##$XL= 0
##$YL= 0
##$YMAX_a= 14264890
##$YMIN_a= -6754358
##$ZGOPTNS= <>
##$ZL1= 120
##$ZL2= 120
##$ZL3= 120
##$ZL4= 120
##$ABSF1= 14.96865
##$ABSF2= -5.58388
##$ABSG= 5
##$ABSL= 3
##$ALPHA= 0
##$AQORDER= 0
##$ASSFAC= 0
##$ASSFACI= 0
##$ASSFACX= 0
##$ASSWID= 0
##$AUNMP= <proc_prof1d_extract.lims>
##$AXLEFT= 0
##$AXNAME= <>
##$AXNUC= <1H>
##$AXRIGHT= 0
##$AXTYPE= 0
##$AXUNIT= <>
##$AZFE= 0.1
##$AZFW= 0.1
##$BCFW= 0
##$BC_mod= 0
##$BYTORDP= 0
##$COROFFS= 0
##$CY= 15
##$DATMOD= 1
##$DC= 0
##$DFILT= <>
##$DTYPP= 0
##$F1P= 0
##$F2P= 0
##$FCOR= 0.5
##$FTSIZE= 131072
##$FT_mod= 6
##$GAMMA= 0
##$GB= 0
##$INTBC= 1
##$INTSCL= 1
##$ISEN= 128
##$LB= 0.3
##$LEV0= 0
##$LPBIN= 0
##$MAXI= 10000
##$MC2= 0
##$MEAN= 0
##$ME_mod= 0
##$MI= 0
##$NCOEF= 0
##$NC_proc= -3
##$NLEV= 6
##$NOISF1= 0
##$NOISF2= 0
##$NSP= 0
##$NTH_PI= 0
##$NZP= 0
##$OFFSET= 14.96865
##$PC= 1
##$PHC0= 37.78748
##$PHC1= 0
##$PH_mod= 1
##$PKNL= yes
##$PPARMOD= 0
##$PPDIAG= 0
##$PPIPTYP= 0
##$PPMPNUM= 2147483647
##$PPRESOL= 1
##$PSCAL= 4
##$PSIGN= 0
##$PYNMP= <proc.py>
##$REVERSE= no
##$SF= 400.130004788099
##$SI= 131072
##$SIGF1= 0
##$SIGF2= 0
##$SINO= 400
##$SIOLD= 131072
##$SPECTYP= <>
##$SREGLST= <1H.CDCl3>
##$SSB= 0
##$STSI= 131072
##$STSR= 0
##$SW_p= 8223.68421052632
##$SYMM= 0
##$S_DEV= 0
##$TDeff= 65536
##$TDoff= 0
##$TI= <>
##$TILT= no
##$TM1= 0
##$TM2= 0
##$TOPLEV= 0
##$USERP1= <user>
##$USERP2= <user>
##$USERP3= <user>
##$USERP4= <user>
##$USERP5= <user>
##$WDW= 1
##$XDIM= 131072
##$YMAX_p= 559534652
##$YMIN_p= -469062023
##$CURPLOT= <Network HP LaserJet P1505>
##$CURPRIN= <$Network HP LaserJet P1505>
##$DFORMAT= <normdp>
##$LAYOUT= <+/1D_H.xwp>
##$LFORMAT= <normlp>
##$PFORMAT= <normpl>
##$SURQMSG= 1
$$ End of Bruker specific parameters
$$ ---------------------------------
##NTUPLES= NMR SPECTRUM
##VAR_NAME=  FREQUENCY,     SPECTRUM/REAL,   SPECTRUM/IMAG
##SYMBOL=    X,             R,               I
##VAR_TYPE=  INDEPENDENT,   DEPENDENT,       DEPENDENT
##VAR_FORM=  AFFN,          ASDF,            ASDF
##VAR_DIM=   131072,        131072,          131072
##UNITS=     HZ,            ARBITRARY UNITS, ARBITRARY UNITS
##FACTOR=    0.0627417313425165, 1,          1
##FIRST=     8223.62146879498, 3102,         -98015
##LAST=      0,             6656,            -97926
##MIN=       0,             -469062023,      0
##MAX=       8223.62146879498, 559534652,    0
$$ Real data points
##PAGE= N=1
##DATA TABLE= (X++(R..R)), XYDATA
$$ [...]
60637A596853m385l020j723J93K242K417J50k147k204j250k125n230q632j1330
60623A559809j3923j6599j8899k1256k4297k6653k5939k2260j8601j7146j7084
60612A337152j6635j5372j3786j2074j0189q092n432k008J311L219L741M167N097
60599A271099N783N649N148M768M298L556K908K726K957L390L744L601K957K566
60585A325150K986L605L520K918K696L087L706M343M748M341L409L721O477J0262
60571A384969J2675J3381J3916J5099J6551J8274K0640K2978K4150K4484K5331
60560A592448K6784K7654K7576K7240K6651K5146K3038K1222J9252J6033J2345
60549A845389J0211R417P355K983j519m150n870q689j2818j7155k1078k4421k6871
$$ plain form
60637 1596853 1592468 1589448 1587725 1587918 1590160 1592577 1592727 1590580 1588376 1587126 1585001 1579771 1571139 1559809
60623 1559809 1545886 1529287 1510388 1489132 1464835 1438182 1412243 1389983 1371382 1354236 1337152
60612 1337152 1320517 1305145 1291359 1279285 1269096 1261004 1255572 1253564 1254875 1258094 1261835 1266002 1271099
60599 1271099 1276882 1282531 1287679 1292447 1296745 1300301 1303209 1305935 1308892 1312282 1316026 1319627 1322584 1325150
60585 1325150 1328136 1331741 1335261 1338179 1340875 1343962 1347668 1352011 1356759 1361100 1364509 1368230 1374707 1384969
60571 1384969 1397644 1411025 1424941 1440040 1456591 1474865 1495505 1518483 1542633 1567117 1592448
60560 1592448 1619232 1646886 1674462 1701702 1728353 1753499 1776537 1797759 1817011 1833044 1845389
60549 1845389 1855600 1865017 1872372 1875355 1873836 1869686 1863816 1855127 1842309 1825154 1804076 1779655 1752784
60536A752784k8424k9560l0097k9016k6046k2378j9138j6250j3294j0321p404
60525A520856m533k280j378j312p87J79K41q86j756j484q82o86l73L37N37k29
60509A505564q43j87J427L326N622Q280J0245J0696J0177R581Q905P809O457N089
60495A592148L669K566K531L488M345M508M569N128O112P599R986J2913J5489
60482A675051J7906K1392K6126L0870L5144L9845M5079M9247N1109N0815M8050
60471B090634M1381L0826J9007Q127k371j3427k3420k9766l2127l1985l0070k6156
60459B000653k0678j4518p746j64P312J3368J7961K1898K5277K7652K9330L1150
60447B131495L3354L5803L8965M3484M9173N5457O2510P1030Q1311R3429J07769
$$ plain form
60536 1752784 1724360 1694800 1664703 1635687 1609641 1587263 1568125 1551875 1538581 1528260 1520856
60525 1520856 1516323 1514043 1512665 1511353 1510566 1510745 1510986 1510100 1508344 1506860 1505978 1505292 1504919 1505256 1505793 1505564
60509 1505564 1504721 1504534 1505961 1509287 1514909 1523189 1533434 1544130 1554307 1563888 1572793 1580602 1587059 1592148
60495 1592148 1595817 1598383 1600914 1604402 1608747 1613255 1617824 1622952 1629064 1636663 1646649 1659562 1675051
60482 1675051 1692957 1714349 1740475 1771345 1806489 1846334 1891413 1940660 1991769 2042584 2090634
60471 2090634 2132015 2162841 2181848 2189975 2187604 2174177 2150757 2120991 2088864 2056879 2026809 2000653
60459 2000653 1979975 1965457 1957711 1957547 1964859 1978227 1996188 2018086 2043363 2071015 2100345 2131495
60447 2131495 2164849 2200652 2239617 2283101 2332274 2387731 2450241 2521271 2602582 2696011 2803780
60436B803780J24306J41801J58814J75395J92835K11974K32477K53751K75873
60427D571006K99468L24849L51314L77644M03286M27799M47497M53481M35540
60418H091884L88687L14486K16616R8675l2298j63427k80503l74342m41799m82753
60408G335226m99026m95235m77704m51749m20865l87774l54600l22163k90490
60399C635620k59973k31400k05361j82337j62646j45552j29481j14012j00453
60390B104405q9524p9890p0333o1871n5895n1437m6408m0808l6664l5057l4910
60379A501608l4561l2990k9896k5953k2798k1611k1872k2346k2539k2189k0562
60368A224291j7716j5359j4722j4502j2799j0209q723q259o830m068k029j990
$$ plain form
60436 2803780 2928086 3069887 3228701 3404096 3596931 3808905 4041382 4295133 4571006
60427 4571006 4870474 5195323 5546637 5924281 6327567 6755366 7202863 7656344 8091884
60418 8091884 8480571 8795057 9011673 9110348 9078050 8914623 8634120 8259778 7817979 7335226
60408 7335226 6836200 6340965 5863261 5411512 4990647 4602873 4248273 3926110 3635620
60399 3635620 3375647 3144247 2938886 2756549 2593903 2448351 2318870 2204858 2104405
60390 2104405 2014881 1934991 1864658 1802787 1746892 1695455 1649047 1608239 1571575 1536518 1501608
60379 1501608 1467047 1434057 1404161 1378208 1355410 1333799 1311927 1289581 1267042 1244853 1224291
60368 1224291 1206575 1191216 1176494 1161992 1149193 1138984 1130261 1122002 1115172 1111104 1109075 1107085
60356A107085k660k341j076L05J877M180O821Q450Q041N986M015L691M706N186
60342A154266M196L116L700N726P657Q891R891J0710J0849J0353R733R018Q026
60329A256132P179O901O621N575M122L029K042N48q95j330j221j875l278m170
60315A279380m067l634l144k244j214r73j592k127j978j236J62K240M190N158
60301A268921N628O566P529P311O288O220P622R213J0108J0768J1413J1365J0590
60288A379542J0210J0797J1511J1541J1073J0401R444Q606Q713R465R355P712
60276A498370N493L532J446r06k388k042n50Q92K173L766N424O436O643O389N826
60261A540504M902L601J802o84l568o193q317j0168j1436j1146q990o083l867
$$ plain form
60356 1107085 1104425 1102084 1101008 1101313 1103190 1107370 1114191 1122641 1130682 1136668 1140683 1144374 1149080 1154266
60342 1154266 1158462 1161578 1165278 1171004 1178661 1187552 1197443 1208153 1219002 1229355 1239088 1248106 1256132
60329 1256132 1263311 1270212 1276833 1282408 1286530 1289559 1291601 1292149 1291254 1289924 1288703 1286828 1283550 1279380
60315 1279380 1275313 1271679 1268535 1266291 1265077 1264104 1262512 1260385 1258407 1257171 1257333 1259573 1263763 1268921
60301 1268921 1274549 1281115 1288644 1295955 1302243 1308463 1316085 1325298 1335406 1346174 1357587 1368952 1379542
60288 1379542 1389752 1400549 1412060 1423601 1434674 1445075 1454519 1463125 1471838 1481303 1490658 1498370
60276 1498370 1503863 1507395 1508841 1507935 1505547 1503505 1502955 1503847 1506020 1509786 1515210 1521646 1528289 1534678 1540504
60261 1540504 1545406 1549007 1550809 1550125 1546557 1540364 1532047 1521879 1510443 1499297 1490307 1484224 1480357
60248A480357k826k564k534k271j500l70Q31K175L692M583L952K473K246M337
60234A492581P359R120Q950P795O750O256O351O912P625Q071P903O995N790N301
60220A593759O212P931R114R278R248R911J1096J1973J2025J1383J0621J0471
60208A713022J1473J3637J6589J9942K3357K6437K8946L1102L3454L6596M0922
60197A995477M6165N1112N4633N7340O1241O7245P4054Q0377Q6892R4815J03601
60186B772952J11807J19452J27826J37423J47820J59110J71425J83189J91976
60177D122980J97494K01849K06358K09655K09531K05186J97076J85926J72554
60168E908609J57590J40740J21333R9886P8012N6527L5001J3524o436k3555l7696
$$ plain form
60248 1480357 1477531 1474967 1472433 1470162 1468662 1468292 1469123 1471298 1474990 1479573 1483525 1485998 1488244 1492581
60234 1492581 1499940 1509060 1518010 1525805 1532555 1538811 1545162 1552074 1559699 1567770 1575673 1582668 1588458 1593759
60220 1593759 1599971 1607902 1617016 1626294 1635542 1645453 1656549 1668522 1680547 1691930 1702551 1713022
60208 1713022 1724495 1738132 1754721 1774663 1798020 1824457 1853403 1884505 1917959 1954555 1995477
60197 1995477 2041642 2092754 2147387 2204727 2265968 2333213 2407267 2487644 2574536 2669351 2772952
60186 2772952 2884759 3004211 3132037 3269460 3417280 3576390 3747815 3931004 4122980
60177 4122980 4320474 4522323 4728681 4938336 5147867 5353053 5550129 5736055 5908609
60168 5908609 6066199 6206939 6328272 6428158 6506170 6562697 6597698 6611222 6604786 6581231 6543535
60157F543535m8771n5951n8893n8460n5238m8400l7235k2993p942P006K2717M0154
60145F219529N9192P8987R8804J18282J37181J55001J70865J83886J93544J99483
60135G614754K01154J98018J89754J76057J56793J32994J06989Q0509N3193K3926
60125H934141o797l6994o5008q9830j10167j25030j35091j41585j43916j40223
60115G939500j30529j17181j01629q2922o0415l6012j2127J1194L5383O0352Q3932
60104G589546J04064J20248J32797J41436J45040J42668J34796J23185J09208
60095H742988R2903P4405N5585L8945K5203J3413L270m293q604r470n754M247
60083I022838K0332M0113O1974Q6590J14584J44485J74497K05113K38365K75192
$$ plain form
60157 6543535 6494764 6438813 6379920 6321460 6266222 6217822 6180587 6157594 6149652 6156658 6179375 6219529
60145 6219529 6278721 6357708 6456512 6574794 6711975 6866976 7037841 7221727 7415271 7614754
60135 7614754 7815908 8013926 8203680 8379737 8536530 8669524 8776513 8857022 8910215 8934141
60125 8934141 8927344 8890350 8825342 8735512 8625345 8500315 8365224 8223639 8079723 7939500
60115 7939500 7808971 7691790 7590161 7507239 7446824 7410812 7398685 7409879 7445262 7505614 7589546
60104 7589546 7693610 7813858 7946655 8088091 8233131 8375799 8510595 8633780 8742988
60095 8742988 8835891 8910296 8965881 9004826 9030029 9043442 9046712 9042419 9033815 9024345 9018591 9022838
60083 9022838 9043170 9083283 9145257 9231847 9346431 9490916 9665413 9870526 10108891 10384083
60073A0384083L14664L55253L95969M36554M77250N17944N57236N92883O23247
60064A4655083O47421O63948O70726O66578O51723O26277N89622N41761M83931
60055B0197070M17256L41948K58461J68327P3491k3866j20574k13145k99664l79254
60045B0420050m49227n05089n44339n68190n78329n74343n56163n26747m89711
60036A5627912m45922l95099l39662k83991k30212j77310j24552p3413k5858J7098
60026A3548991N4320Q3718J03521J13553J14590J07298R2383P1236M5762J7536
60016A4352908j2717m4718p7533j09093j37411j62319j85261k07289k28119k47142
60006A2941306k64034k77930k87465k92368k93635k91277k83500k69433k51230
$$ plain form
60073 10384083 10698747 11054000 11449969 11886523 12363773 12881717 13438953 14031836 14655083
60064 14655083 15302504 15966452 16637178 17303756 17955479 18581756 19171378 19713139 20197070
60055 20197070 20614326 20956274 21214735 21383062 21456553 21432687 21312113 21098968 20799304 20420050
60045 20420050 19970823 19465734 18921395 18353205 17774876 17200533 16644370 16117623 15627912
60036 15627912 15181990 14786891 14447229 14163238 13933026 13755716 13631164 13557751 13531893 13548991
60026 13548991 13603311 13687029 13790550 13904103 14018693 14125991 14218374 14289610 14335372 14352908
60016 14352908 14340191 14295473 14217940 14108847 13971436 13809117 13623856 13416567 13188448 12941306
60006 12941306 12677272 12399342 12111877 11819509 11525874 11234597 10951097 10681664 10430434
59997A0430434k31748k11156j87584j60426j31187j01546p2297m3870j6229J1694
59987I286085M0904P0580R8711J24376J47988J69139J85801J96245K00550J99386
59977A0719765J92119J77105J53833J24177R1220N6794K0514j8383n8554r6826
59967A1361764j30986j61167j88004k10605k27206k36842k39422k34995k24141
59958I508396k08552j90069j69457j46828j22701r7639p1405m3535j4405J5232
59948H459037M5302P5962J06523J35999J64532J93086K21658K48597K71797K89782
59938A0212275L01660L06570L03386K90861K68635K38359K03102J65021J24238
59929A2414107Q0522L5042j0618n6149j01628j45293j83677k13967k35201k47353
$$ plain form
59997 10430434 10198686 9987530 9799946 9639520 9508333 9406787 9334490 9290620 9274391 9286085
59987 9286085 9326989 9397569 9496280 9620656 9768644 9937783 10123584 10319829 10520379 10719765
59977 10719765 10911884 11088989 11242822 11366999 11458219 11515013 11535527 11517144 11458590 11361764
59967 11361764 11230778 11069611 10881607 10671002 10443796 10206954 9967532 9732537 9508396
59958 9508396 9299844 9109775 8940318 8793490 8670789 8573150 8501745 8458210 8443805 8459037
59948 8459037 8504339 8580301 8686824 8822823 8987355 9180441 9402099 9650696 9922493 10212275
59938 10212275 10513935 10820505 11123891 11414752 11683387 11921746 12124848 12289869 12414107
59929 12414107 12494629 12529671 12519053 12462904 12361276 12215983 12032306 11818339 11583138 11335785
59919A1335785k50568k45496k33169k14274j89380j60083j28930r7727o6512l4613
59909I715033k135L0030O1136R0815J18415J42797J63168J79872J93772K04776
59899A0897679K11633K13383K10343K03127J91710J76542J59837J44295J30708
59890A2539257J18258J06880R7769R1691Q8711Q9812R6789J09957J27887J50240
59880A3617251J79007K15788K59295L06822L56747M08406M60649N11746N59762
59871A6875473O02098O35604O57779O66687O59179O30931N79188N04158M07318
59862B2218415K90746J59191K0563j17443k49327l69485m71058n49797o06903
59853B0324902o45257o64760o64494o47575o19864n84457n40900m89631m33721
$$ plain form
59919 11335785 11085217 10839721 10606552 10392278 10202898 10042815 9913885 9816158 9749646 9715033
59909 9715033 9712898 9742928 9804064 9894879 10013294 10156091 10319259 10499131 10692903 10897679
59899 10897679 11109312 11322695 11533038 11736165 11927875 12104417 12264254 12408549 12539257
59890 12539257 12657515 12764395 12862164 12953855 13042566 13132378 13229167 13339124 13467011 13617251
59880 13617251 13796258 14012046 14271341 14578163 14934910 15343316 15803965 16315711 16875473
59871 16875473 17477571 18113175 18770954 19437641 20096820 20727751 21306939 21811097 22218415
59862 22218415 22509161 22668352 22688915 22571472 22322145 21952660 21481602 20931805 20324902
59853 20324902 19679645 19014885 18350391 17702816 17082952 16498495 15957595 15467964 15034243
59844A5034243l75866l16652k56556j97162j39609q3922l0532J9322O5292J08389
59834A3826947J49020J85551K15046K34661K42685K39205K25239K00216J61499
59825A5680069J07886M2375l0290j07242j86338k63032l31982l91140m40898m79545
59815A3599863n03502n12564n11295n04037m91410m72805m49116m21531l90343
59806I343260l56885l24315k94491k65976k36884k08033j81538j57956j36708
59797G180474j18059j02772r0799q1961p6943p5849p6450p5692p2740o9177o6254
59786F273778o3161n8324n1547m4485l9242l6648l6092l7029m0003m5654n3264
59775E768329o1265o8635p4751p8410p8631p6096p2172o6585n7976m6779l5482
$$ plain form
59844 15034243 14658377 14341725 14085169 13888007 13748398 13664476 13633944 13653266 13718558 13826947
59834 13826947 13975967 14161518 14376564 14611225 14853910 15093115 15318354 15518570 15680069
59825 15680069 15787955 15830330 15800040 15692798 15506460 15243428 14911446 14520306 14079408 13599863
59815 13599863 13096361 12583797 12072502 11568465 11077055 10604250 10155134 9733603 9343260
59806 9343260 8986375 8662060 8367569 8101593 7864709 7656676 7475138 7317182 7180474
59797 7180474 7062415 6959643 6868844 6786883 6709940 6634091 6557641 6481949 6409209 6340032 6273778
59786 6273778 6210617 6152293 6100746 6056261 6017019 5980371 5944279 5907250 5867247 5821593 5768329
59775 5768329 5707064 5638429 5563678 5485268 5406637 5330541 5258369 5191784 5133808 5087029 5051547
59764E051547k5622j6539p765m37M951J0318J7910K7684L8154M8747N9665P0180
59752E278793P8769Q4882Q9470R3733R8028J01905J04623J05442J03752R9044
59742F238441R1185Q1064P0484O0743N1695M3017L5853L1878L1102L2171L4846
59731F802479M0591N0401O3533P8976R6741J17122J39833J64611J91702K21188
59721G967177K52684K86159L22189L61008M01975M44176M86606N27487N64045
59712A1613506N92732O08605O04479N72064N05044M01911K67842J15654l6467
59703A5245370j71567k80084l59658m10548m33776m33077m15053l85930l49563
59694A2006114l08680k65594k21012j74508j27198q1960m0241q59L7177P3100
$$ plain form
59764 5051547 5025925 5009386 5001621 5001184 5006135 5016453 5034363 5062047 5100201 5148948 5208613 5278793
59752 5278793 5357562 5442444 5531914 5625647 5723675 5825580 5930203 6035645 6139397 6238441
59742 6238441 6329626 6410690 6481174 6541917 6593612 6636629 6672482 6704360 6735462 6767633 6802479
59731 6802479 6843070 6893471 6957004 7035980 7132721 7249843 7389676 7554287 7745989 7967177
59721 7967177 8219861 8506020 8828209 9189217 9591192 10035368 10521974 11049461 11613506
59712 11613506 12206238 12814843 13419322 13991386 14496430 14898341 15166183 15281837 15245370
59703 15245370 15073803 14793719 14434061 14023513 13589737 13156660 12741607 12355677 12006114
59694 12006114 11697434 11431840 11210828 11036320 10909122 10827162 10786921 10786062 10823239 10896339
59684A0896339J06807J40339J75223K10365K44391K78305L13890L51210L89544
59675A3106413M29361M71421N15158N59910O06756O57271P11334P67791Q26341
59666A8651756Q87168R49450J011772J073059J131667J184532J228739J263050
59658B7381193J286179J294712J284934J256806J214721J164866J113177J065146
59650C7061734J025470R97247R81939R79661R88567J004521J022272J036455J041106
59641D6138972J029616R96788R40347Q59635P54443O26837M83138L32051J81342
59632E2343169L7800r0826j96695k75087l25096l47231l42062l11229k57707j84237
59622E0050799r2620J5038J35689K66459M05374N50351O98248Q45385R88337J123486
$$ plain form
59684 10896339 11003146 11143485 11318708 11529073 11773464 12051769 12365659 12716869 13106413
59675 13106413 13535774 14007195 14522353 15082263 15689019 16346290 17057624 17825415 18651756
59666 18651756 19538924 20488374 21500146 22573205 23704872 24889404 26118143 27381193
59658 27381193 28667372 29962084 31247018 32503824 33718545 34883411 35996588 37061734
59650 37061734 38087204 39084451 40066390 41046051 42034618 43039139 44061411 45097866 46138972
59641 46138972 47168588 48165376 49105723 49965358 50719801 51346638 51829776 52161827 52343169
59632 52343169 52380969 52290143 52093448 51818361 51493265 51146034 50803972 50492743 50235036 50050799
59622 50050799 49958179 49973217 50108906 50375365 50780739 51331090 52029338 52874723 53863060 54986546
59612E4986546J245906J348830J424014J462556J455552J394218J270328J078316
59604F5666266Q18616M99404J35374k54537o48359j022557j355418j631086j841307
59595F0366396j984557k064303k087398k062559j999279j907540j797819j680987
59587D4781954j568527j472628j404663j372038j375534j408705j459008j510508
59579C3210343j548277j562768j551048j514978j459107j389372j311175j227739
59571B1645879j141179j054758r71970q93310q16721p42185o73228o12330n57482
59562A4182716n05510m56689m13419l75820l41573l09224k79150k51762k27143
59553A1022426k06157j89822j77727j68851j63428j62080j63618j65851j68348
$$ plain form
59612 54986546 56232452 57581282 59005296 60467852 61923404 63317622 64587950 65666266
59604 65666266 66484882 66984286 67119660 66865123 66216764 65194207 63838789 62207703 60366396
59595 60366396 58381839 56317536 54230138 52167579 50168300 48260760 46462941 44781954
59587 44781954 43213427 41740799 40336136 38964098 37588564 36179859 34720851 33210343
59579 33210343 31662066 30099298 28548250 27033272 25574165 24184793 22873618 21645879
59571 21645879 20504700 19449942 18477972 17584662 16767941 16025756 15352528 14740198 14182716
59562 14182716 13677206 13220517 12807098 12431278 12089705 11780481 11501331 11249569 11022426
59553 11022426 10816269 10626447 10448720 10279869 10116441 9954361 9790743 9624892 9456544
59544I456544j72300j77742j83039j87086j89951j91006j88574j81998j72436
59535G812412j61184j48759j35977j24032j12824j00687q6742p2184n8443m5277
59525F766303l1741j8129n803M429J2961K0673K8223L5891M3599N0927N7224O1901
59513G026458O4983O7438P0501P4434P8606Q3167Q9689R9370J11358J23910J36651
59502H026565J50605J66494J84119K03077K22931K43028K63385K85350L09994
59493A0055548L36111L61279L84981M09025M34387M59081M79940M95426N05848
59484A3921626N11593N12151N06665M94608M75921M51084M21298L88348L53876
59475A8037170L18328K80876K40731J98818J57819J20592Q8939O3751M5518L4387
$$ plain form
59544 9456544 9284244 9106502 8923463 8736377 8546426 8355420 8166846 7984848 7812412
59535 7812412 7651228 7502469 7366492 7242460 7129636 7028949 6942207 6870023 6811580 6766303
59525 6766303 6734562 6716433 6710630 6715059 6728020 6748693 6776916 6812807 6856406 6907333 6964557 7026458
59513 7026458 7091441 7158879 7229380 7303814 7382420 7465587 7555276 7654646 7766004 7889914 8026565
59502 8026565 8177170 8343664 8527783 8730860 8953791 9196819 9460204 9745554 10055548
59493 10055548 10391659 10752938 11137919 11546944 11981331 12440412 12920352 13415778 13921626
59484 13921626 14433219 14945370 15452035 15946643 16422564 16873648 17294946 17683294 18037170
59475 18037170 18355498 18636374 18877105 19075923 19233742 19354334 19443273 19507024 19552542 19586929
59465A9586929L0423L4176M6352O6482R2486J21713J51603J78974J99475K08551
59455B0717164K02764J80298J41022Q6262J7737o3165j54098k50150l45199m35032
59445B0097603n17471n89474o46567o86030p08532p15734p08544o88867o60293
59436A4176091o25127n83062n34869m85042m37953l93286l48256l02826k59541
59427A0206129k19377j81272j45226j12268q1328m9423j5660J7701M8823P8527
59417I546626J08242J37901J66903J95430K23951K52619K81462L09803L35447
59408A1558384L55967L70884L80880L84828L79469L62351L33374K93158K41773
59399A4661068J79713J08683L0840n1335j34057k12670k83706l45545l96955m36550
$$ plain form
59465 19586929 19617352 19651528 19697880 19764362 19856848 19978561 20130164 20309138 20508613 20717164
59455 20717164 20919928 21100226 21241248 21327510 21345247 21282082 21127984 20877834 20532635 20097603
59445 20097603 19580132 18990658 18344091 17658061 16949529 16233795 15525251 14836384 14176091
59436 14176091 13550964 12967902 12433033 11947991 11510038 11116752 10768496 10465670 10206129
59427 10206129 9986752 9805480 9660254 9547986 9466658 9417235 9401575 9419276 9468099 9546626
59417 9546626 9654868 9792769 9959672 10155102 10379053 10631672 10913134 11222937 11558384
59408 11558384 11914351 12285235 12666115 13050943 13430412 13792763 14126137 14419295 14661068
59399 14661068 14840781 14949464 14980304 14928969 14794912 14582242 14298536 13952991 13556036 13119486
59389A3119486m64090m80991m88927m88890m81836m69049m51488m29860m05508
59380H958847l80170l54763l29253l03709k78473k53569k29102k06019j85376
59371F438413j67124j50620j35678j21744j06952r0027p2654n7913m6591l6886
59361E452224k7346j7900q376J602J1213J9382K7120L6461M6995N6233O3690P1342
59349E732640P9039Q2802P9848P3121O8736P0242P7042Q6895R8262J11102J26867
59338F686596J46909J69843J91299K07282K17442K24947K34330K49597K72559
59329H600804L01887L34709L69649M07400M48453M92224N38770N89282O43898
59320A2727076P00741P57946Q14888Q70356R21248R64266R97326J018208J023488
$$ plain form
59389 13119486 12655396 12174405 11685478 11196588 10714752 10245703 9794215 9364355 8958847
59380 8958847 8578677 8223914 7894661 7590952 7312479 7058910 6829808 6623789 6438413
59371 6438413 6271289 6120669 5984991 5863247 5756295 5666268 5593614 5535701 5489110 5452224
59361 5452224 5424878 5406978 5398602 5400204 5411417 5430799 5457919 5494380 5541375 5597608 5661298 5732640
59349 5732640 5811679 5894481 5974329 6047450 6116186 6186428 6263470 6350365 6448627 6559729 6686596
59338 6686596 6833505 7003348 7194647 7401929 7619371 7844318 8078648 8328245 8600804
59329 8600804 8902691 9237400 9607049 10014449 10462902 10955126 11493896 12083178 12727076
59320 12727076 13427817 14185763 15000651 15871007 16792255 17756521 18753847 19772055 20795543
59311B0795543J010561R79677R33074Q73291Q03386P27359O48917N70468M94014
59302B7836290M21552L53583K88543K24698J61222R6518K7416m8127j28711k11470
59292B9021514k95140l79380m61856n37978o03546o56681o97906p29632p55166
59283B3904229p76856p95116q09593q20539q28196q31442q28062q16284p95766
59274A6602375p67714p34430o98036o59355o18496n76414n34677m93766m53137
59265A1066350m13162l75202l39435l04512k70084k37720k08332j80751j54089
59256H583063j29518j08079q8469o8875m9581l1844j5423Q07J6751L1585M5609
59245H186026N9741P3586Q5748R5734J04220J11750J18235J23347J26303J25954
$$ plain form
59311 20795543 21806104 22785781 23718855 24592146 25395532 26122891 26771808 27342276 27836290
59302 27836290 28257842 28611425 28899968 29124666 29285888 29382406 29409822 29361695 29232984 29021514
59292 29021514 28726374 28346994 27885138 27347160 26743614 26086933 25389027 24659395 23904229
59283 23904229 23127373 22332257 21522664 20702125 19873929 19042487 18214425 17398141 16602375
59274 16602375 15834661 15100231 14402195 13742840 13124344 12547930 12013253 11519487 11066350
59265 11066350 10653188 10277986 9938551 9634039 9363955 9126235 8917903 8737152 8583063
59256 8583063 8453545 8345466 8256997 8188122 8138541 8106697 8091274 8092081 8108832 8140417 8186026
59245 8186026 8245767 8319353 8405101 8500835 8605055 8716805 8835040 8958387 9084690 9210644
59235I210644J22166J16415J10051J02752R3882Q4436P6241P0040O5693O3553
59225A0115873O4137O7098P1914P9107Q9404J02177J16019J30320J44901J58708
59215A1139658J70374J79686J86744J89621J84419J68290J41832J08410P1681
59206A2540715L3653n265m4321q0866j11696j35944j55046j69318j76565j75317
59196A1520030j67697j57175j44759j29378j11092r1677p2562n4124l6867k1567
59186A0533132q341L036J2214J8973K4305K9203L2961L4596L5597L9212M6938
59175A0801826N7566O9940Q4882J03873J27472J55660J88377K25064K64652L06542
59165A2385854L50715L96342M41142M82440N18118N46173N63994N68347N55676
$$ plain form
59235 9210644 9332810 9449225 9559276 9662028 9755910 9840346 9916587 9986627 10052320 10115873
59225 10115873 10180010 10247108 10319022 10398129 10487533 10589710 10705729 10836049 10980950 11139658
59215 11139658 11310032 11489718 11676462 11866083 12050502 12218792 12360624 12469034 12540715
59206 12540715 12574368 12569103 12524782 12443916 12332220 12196276 12041230 11871912 11695347 11520030
59196 11520030 11352333 11195158 11050399 10921021 10809929 10718252 10645690 10591566 10554699 10533132
59186 10533132 10524791 10527827 10540041 10559014 10583319 10612522 10645483 10680079 10715676 10754888 10801826
59175 10801826 10859392 10929332 11014214 11118087 11245559 11401219 11589596 11814660 12079312 12385854
59165 12385854 12736569 13132911 13574053 14056493 14574611 15120784 15684778 16253125 16808801
59156A6808801N22671M67534L91028K95905J85523O3568o5309j95819l23049m42268
59146A7708585n47949o34462o98536p40444p62548p67207p56247p31675o96315
59137A1373202o53945o08698n63717n20082m77422m35635l95666l58702l25098
59128G034237k94377k65982k39892k16596j96414j78855j62815j47573j33301
59119E198432j20506j09156r8606q8137p7559o7543n9210n2898m7272m0363l1470
59108D405712k1555j1843k916M941J1720J8249K5641L3734M1228M7714N4359O2030
59096D669014O9990P7275Q4102R1032R7896J04575J11753J19645J26914J32148
59086E684344J35869J39712J44057J47527J48663J47197J43756J38893J32364
$$ plain form
59156 16808801 17331472 17799006 18190034 18485939 18671462 18735030 18669721 18473902 18150853 17708585
59146 17708585 17160636 16526174 15827638 15087194 14324646 13557439 12801192 12069517 11373202
59137 11373202 10719257 10110559 9546842 9026760 8549338 8113703 7718037 7359335 7034237
59128 7034237 6739860 6473878 6233986 6017390 5820976 5642121 5479306 5331733 5198432
59119 5198432 5077926 4968770 4870164 4782027 4704468 4636925 4577715 4524817 4477545 4437182 4405712
59108 4405712 4384157 4372314 4369398 4374339 4386059 4404308 4429949 4463683 4504911 4552625 4606984 4669014
59096 4669014 4739004 4816279 4900381 4991413 5089309 5193884 5305637 5425282 5552196 5684344
59086 5684344 5820213 5959925 6103982 6251509 6400172 6547369 6691125 6830018 6962382
59077F962382J23236J11102R7178Q3297O9975N6641M3804L3212K5369J8915J3451
59066G638562J1077J3654K0100K8139L7454M9344O4286Q1671J01129J22311J43858
59055H311585J64244J83433K02541K22387K43363K65796K89010L10668L28524
59046A0521551L42241L52226L57466L55988L46712L29285L02637K65369K17502
59037A3390977J60692R7355L0720l5066r6552j52324k01741k43212k75497k99897
59027A2375455l19281l35075l46835l54424l58755l60484l59613l56689l53062
59018I231237l49591l45865l40710l32908l21994l09219k96986k86296k75448
59009F372220k62407k47654k33283k20048k06916j93160j79315j66275j54693
$$ plain form
59077 6962382 7085618 7196720 7293898 7377195 7447170 7503811 7547615 7580827 7606196 7625111 7638562
59066 7638562 7649639 7663293 7683393 7711532 7748986 7798330 7862616 7944287 8045416 8167727 8311585
59055 8311585 8475829 8659262 8861803 9084190 9327553 9593349 9882359 10193027 10521551
59046 10521551 10863792 11216018 11573484 11929472 12276184 12605469 12908106 13173475 13390977
59037 13390977 13551669 13649024 13679744 13644678 13548126 13395802 13194061 12950849 12675352 12375455
59027 12375455 12056174 11721099 11374264 11019840 10661085 10300601 9940988 9584299 9231237
59018 9231237 8881646 8535781 8195071 7862163 7540169 7230950 6933964 6647668 6372220
59009 6372220 6109813 5862159 5628876 5408828 5201912 5008752 4829437 4663162 4508469
59000D508469j44980j36805j28921j20520j12191j04765r8042r1624q5866q0838
58990C403917p5585o9852o5278o3181o2447o1308n9802n8416n5834n0750m4806
58979B736658m0812l8622l5663l1129k6611k2634j7691j1265n120p02K532N492
58967B514433Q101J0259J2385J4334J5359J5533J5633J5302J2982Q195K531j850
58955B643197l572k189J381M667N725N491O500R464J2864J5609J8000K0011K0810
58942B757958K0319J9336J7876J5171J1397P541L626p67m317m819k644p60n77
58929B839340j35K542O585R966J2176J3912J5559J7272J9318K1442K2908K3782
58917C004667K4977K6622K7818K8490K9901L2711L5934L8598M1067M4098M7722
$$ plain form
59000 4508469 4363489 4226684 4097763 3977243 3865052 3760287 3662245 3570621 3484755 3403917
58990 3403917 3328332 3258480 3193202 3130021 3067574 3006266 2946464 2888048 2832214 2781464 2736658
58979 2736658 2695846 2657224 2621561 2590432 2563821 2541187 2523496 2512231 2507111 2506409 2508941 2514433
58967 2514433 2522534 2532793 2545178 2559512 2574871 2590404 2606037 2621339 2634321 2642516 2645047 2643197
58955 2643197 2639625 2637436 2638817 2643484 2649209 2654700 2661200 2670664 2683528 2699137 2717137 2737148 2757958
58942 2757958 2778277 2797613 2815489 2830660 2842057 2849598 2853224 2852457 2848140 2843321 2840677 2839917 2839340
58929 2839340 2839205 2841747 2848332 2858298 2870474 2884386 2899945 2917217 2936535 2957977 2980885 3004667
58917 3004667 3029644 3056266 3084084 3112574 3142475 3175186 3211120 3249718 3290785 3334883 3382605
58906C382605N1668N5766N9540O2461O4899O7722P0933P3933P7010Q1015Q5543
58895D133095Q9141R1568R4272R8510J04324J11354J19021J26172J32433J39596
58885E239486J49509J60859J70616J78743J88548K01837K16584K30416K43708
58876F980306K57975K73596K90649L09915L31589L54673L78871M05390M34767
58867A0017731M65824M97983N32764N71566O13652O57817P04493P54643Q07738
58858A5624211Q62158R16753R70956J024309J076452J126363J170993J205861
58850B3978056J227396J233117J219416J181333J115336J020302Q95187P38588
58842C2608731N52539L44841J25799r5979l13197n17541p00532q56568r83746
$$ plain form
58906 3382605 3434273 3490039 3549579 3612040 3676939 3744661 3815594 3889527 3966537 4047552 4133095
58895 4133095 4222236 4313804 4408076 4506586 4610910 4722264 4841285 4967457 5099890 5239486
58885 5239486 5388995 5549854 5720470 5899213 6087761 6289598 6506182 6736598 6980306
58876 6980306 7238281 7511877 7802526 8112441 8444030 8798703 9177574 9582964 10017731
58867 10017731 10483555 10981538 11514302 12085868 12699520 13357337 14061830 14816473 15624211
58858 15624211 16486369 17403122 18374078 19398387 20474839 21601202 22772195 23978056
58850 23978056 25205452 26438569 27657985 28839318 29954654 30974956 31870143 32608731
58842 32608731 33161270 33506111 33631910 33535931 33222734 32705193 32004661 31148093 30164347
58833C0164347j082076j151984j194305j211021j206058j184768j151521j107991
58825B0874623j055226r96724r37254q78854q20703p63114p08643o58544o11333
58816A3444228n66137n24672m88244m55535m25111l97620l73459l50704l27490
58807I535256l04505k83027k62526k42283k23285k06213j89471j71731j54670
58798G497545j40399j27684j13475r7302q1441o7434n4808m2797l1012j8732n337
58787F717124Q780K2977L7411N1978O5461P7299Q9108J02669J17396J31724J45995
58776G567922J61824J79323J96976K13998K30942K48345K66381K85534L06255
58767I657500L28270L51446L76726M04937M35413M67259N01168N38542N79334
$$ plain form
58833 30164347 29082271 27930287 26735982 25524961 24318903 23134135 21982614 20874623
58825 20874623 19819397 18822673 17885419 17006565 16185862 15422748 14714105 14055561 13444228
58816 13444228 12878091 12353419 11865175 11409640 10984529 10586909 10213450 9862746 9535256
58807 9535256 9230751 8947724 8685198 8442915 8219630 8013417 7823946 7652215 7497545
58798 7497545 7357146 7229462 7115987 7018685 6937244 6869810 6815002 6772205 6741193 6722461 6717124
58787 6717124 6725904 6748881 6786292 6838270 6903731 6981030 7070138 7172807 7290203 7421927 7567922
58776 7567922 7729746 7909069 8106045 8320043 8550985 8799330 9065711 9351245 9657500
58767 9657500 9985770 10337216 10713942 11118879 11554292 12021551 12522719 13061261 13640595
58758A3640595O22454O67899P16944P70263Q26871Q84762R41871R96687J048381
58749B1116727J095550J134582J160558J170294J162817J135882J083864J000809
58741C0061083Q84481P36440N60180L61169J47424p2155k89539m96780o85323
58732C1206980q48394r83232j089319j165669j212057j231899j231349j215336
58724B2229725j186083j145153j095279j039979r82435r24619q67011q09731p54263
58715A3425172p02928o56176o12186n70025n31229m96974m65862m36301m09022
58706H544469l84965l62431l39019l15171k93144k73476k55070k37971k23208
58697E860014k10138j96555j81618j66723j53424j42031j32152j23051j13782
$$ plain form
58758 13640595 14263049 14930948 15647892 16418155 17245026 18129788 19071659 20068346 21116727
58749 21116727 22212277 23346859 24507417 25677711 26840528 27976410 29060274 30061083
58741 30061083 30945564 31682004 32242184 32603353 32750777 32678622 32389083 31892303 31206980
58732 31206980 30358586 29375354 28286035 27120366 25908309 24676410 23445061 22229725
58724 22229725 21043642 19898489 18803210 17763231 16780796 15856177 14989166 14179435 13425172
58715 13425172 12722244 12066068 11453882 10883857 10352628 9855654 9389792 8953491 8544469
58706 8544469 8159504 7797073 7458054 7142883 6849739 6576263 6321193 6083222 5860014
58697 5860014 5649876 5453321 5271703 5104980 4951556 4809525 4677373 4554322 4440540
58688D440540j04300r5940q9488q3586p6620o9310o3652o0041n7278n4734n2683
58677C632908n1007m9403m8392m8374m8307m7086m5508m5014m5095m4043m1895
58666C118784m0517m0887m2238m3911m6096m8651n0765n2151n3341n4562n5318
58655B590347n5205n4365n3317n2696n2644n2093m9691m5913m2922m1630m0513
58644B049358l8295l5875l4213l2312k9257k6470k5722k6141k5535k3546k1463
58633A730529j9898j8732j8441j9361k0358j9968j8061j5051j0826o016k655j527
58621A559635n77J933M436M666L445K911K655P60k441m918o298p559q283p364
58607A543001n830n743o763o750n258l478j482J229L115K185n8K5K770M793M519
$$ plain form
58688 4440540 4336240 4240300 4150812 4067226 3990606 3921296 3857644 3797603 3740325 3685591 3632908
58677 3632908 3581901 3532498 3484106 3435732 3387425 3340339 3294831 3249817 3204722 3160679 3118784
58666 3118784 3078267 3037380 2995142 2951231 2905135 2856484 2805719 2753568 2700227 2645665 2590347
58655 2590347 2535142 2480777 2427460 2374764 2322120 2270027 2220336 2174423 2131501 2089871 2049358
58644 2049358 2011063 1975188 1940975 1908663 1879406 1852936 1827214 1801073 1775538 1751992 1730529
58633 1730529 1710631 1691899 1673458 1654097 1633739 1613771 1595710 1580659 1569833 1563817 1561162 1559635
58621 1559635 1559058 1560991 1565427 1570093 1573538 1576449 1579104 1579864 1577423 1572505 1566207 1558648 1550365 1543001
58607 1543001 1537171 1531428 1524665 1517915 1512657 1509179 1507697 1508926 1512041 1514226 1514168 1514193 1516963 1521756 1526275
58592A526275M399O663J0142J2796J4737J7138K0170K3415K6842L0431L3931L7428
58580A764367M1087M4452M7200N0077N3723N7308O0246O4145P0758P8866Q5817
58569B418046R1473R7889J05705J13887J22657J33464J46048J58600J71136J85716
58559C744621K02945K21164K39542K59164K80292L01110L19933L36335L49531
58550F254637L57796L59989L55455L42149L17084K79180K29814J70557J02751
58541H769412K9463m4447j14681j78122k31486k71941k99344l15807l23073l22380
58531F697594l16174l07097k95345k79816k61574k43249k25192k05649j85013
58522D378485j66371j51207j37793j24778j13255j04120r6201q8380q1183p5208
$$ plain form
58592 1526275 1530674 1537337 1547479 1560275 1575012 1592150 1612320 1635735 1662577 1693008 1726939 1764367
58580 1764367 1805454 1849906 1897106 1947183 2000906 2058214 2118460 2182605 2253363 2332229 2418046
58569 2418046 2509519 2607408 2713113 2827000 2949657 3083121 3229169 3387769 3558905 3744621
58559 3744621 3947566 4168730 4408272 4667436 4947728 5248838 5568771 5905106 6254637
58550 6254637 6612433 6972422 7327877 7670026 7987110 8266290 8496104 8666661 8769412
58541 8769412 8798875 8754428 8639747 8461625 8230139 7958198 7658854 7343047 7019974 6697594
58531 6697594 6381420 6074323 5778978 5499162 5237588 4994339 4769147 4563498 4378485
58522 4378485 4212114 4060907 3923114 3798336 3685081 3580961 3484760 3396380 3315197 3239989
58512C239989p0059o5646o2416n9789n6528n3034n0985n0336m9267m7392m6326
58501B628211m6566m6672m6264m6990m9578n2434n4167n5115n5461n4264n1378
58490B069322m8167m5443m2524l8946l5203l1460k7566k4473k3378k3326k2021
58479A706815j9107j6168j3695j0873q315p681q346p760n646m479n113n438m494
58466A589700m477p054j0686j3399j5670j8686k1873k3845k4376k4182k3962k4203
58454A377287k4725k4348k2394k0110j8870j7816j5438j2616j1284j1005r854
58443A188827p845o162m069l61K927K628j75j350j43L10j028j608m65J23p61j064
58427A169784r5J4j401k167j607j863l267k908K24K921K700J248Q24R26O83J110
$$ plain form
58512 3239989 3169930 3104284 3041868 2982079 2925551 2872517 2821532 2771196 2721929 2674537 2628211
58501 2628211 2581645 2534973 2488709 2441719 2392141 2339707 2285540 2230425 2174964 2120700 2069322
58490 2069322 2021155 1975712 1933188 1894242 1859039 1827579 1800013 1775540 1752162 1728836 1706815
58479 1706815 1687708 1671540 1657845 1646972 1638657 1630976 1622630 1614870 1609224 1604745 1599632 1594194 1589700
58466 1589700 1585223 1578169 1567483 1554084 1538414 1519728 1497855 1474010 1449634 1425452 1401490 1377287
58454 1377287 1352562 1328214 1305820 1285710 1266840 1249024 1233586 1220970 1209686 1198681 1188827
58443 1188827 1180982 1174820 1170751 1170390 1173317 1175945 1175770 1174420 1174277 1174587 1173559 1171951 1171486 1171609 1170848 1169784
58427 1169784 1169689 1169703 1168302 1166135 1164528 1162665 1159398 1156490 1156714 1159635 1162335 1163583 1164407 1165333 1166016 1167126
58411A167126K749M021L824L162K910K688K715L822N065M556K957K568L103K380
58397A213646Q45O76P08k162o574p779n645n026p215q013n950n087p104p778m673
58382A142869j495j085o45J924L343J224q26P83L761M849N305O721O465K470j926
58367A173737l072k742m005n527m896l572l651l382o23K752M307N312P488R339
58353A171465R769J1238J5131J8269J8274J8038K0352K2808K2747K2522K4577
58342A375190K5889K2904J7761J3986J0125L543l517p632j0256j4010j6577j4558
58330A402848j0222q159p999o406l710k691l102k837k276k513j901Q52L198K936
58316A358018K502M340N931M599L104M843P508P593P194R894J3652J4391J3385
$$ plain form
58411 1167126 1169875 1173896 1177720 1180882 1183792 1186480 1189195 1193017 1198082 1202638 1205595 1208163 1211266 1213646
58397 1213646 1214491 1215167 1215875 1213713 1207139 1199360 1193715 1188689 1181474 1173461 1167511 1162424 1155320 1147542 1142869
58382 1142869 1141374 1140289 1139644 1141568 1144911 1146135 1145309 1146092 1149853 1154702 1160007 1166728 1173193 1175663 1173737
58367 1173737 1170665 1167923 1163918 1158391 1153495 1149923 1146272 1142890 1142267 1145019 1149326 1154638 1162126 1171465
58353 1171465 1181234 1192472 1207603 1225872 1244146 1262184 1282536 1305344 1328091 1350613 1375190
58342 1375190 1401079 1423983 1441744 1455730 1465855 1469398 1465881 1458249 1447993 1433983 1417406 1402848
58330 1402848 1392626 1384467 1376468 1370062 1366352 1363661 1360559 1357722 1355446 1352933 1351032 1351884 1355082 1358018
58316 1358018 1360520 1364860 1370791 1375390 1378494 1383337 1390845 1398438 1405632 1415526 1429178 1443569 1456954
58303A456954J4487J7085J8104J7915J8150J7121J3553J1178J3120J5577J3864
58292A627108J0704J1100J3121J1757Q461Q346J0638J0314O965M062J652k310
58280A721918n494l994K74K409K709M666P286P220O219Q484J2607J3981J3340
58267A791625J5052J8814K0744K0832K1924K3341K2917K2792K5751K8748K7709
58256B040249K5434K6472K7951K4549J8995J7809J9743J8682J5336J5434J8557
58245B269211J9412J8382K0204K3694K3475K0661K1284K5185K6857K6204K8033
58234B522602L2028L3586L3504L6370M0730M1445M0353M3512M9394N1081M8891
58223B973496M9249N2344N2714N0958N2870N7923O0577O1858O7425P5371P8635
$$ plain form
58303 1456954 1471441 1488526 1506630 1524545 1542695 1559816 1573369 1584547 1597667 1613244 1627108
58292 1627108 1637812 1648912 1662033 1673790 1682251 1690597 1701235 1711549 1718514 1722576 1724228 1721918
58280 1721918 1716424 1712430 1712704 1715113 1717822 1722488 1729774 1736994 1743213 1751697 1764304 1778285 1791625
58267 1791625 1806677 1825491 1846235 1867067 1888991 1912332 1935249 1958041 1983792 2012540 2040249
58256 2040249 2065683 2092155 2120106 2144655 2163650 2181459 2201202 2219884 2235220 2250654 2269211
58245 2269211 2288623 2307005 2327209 2350903 2374378 2395039 2416323 2441508 2468365 2494569 2522602
58234 2522602 2554630 2588216 2621720 2658090 2698820 2740265 2780618 2824130 2873524 2924605 2973496
58223 2973496 3022745 3075089 3127803 3178761 3231631 3289554 3350131 3411989 3479414 3554785 3633420
58212C633420P8382Q1937Q8645R1168Q9739R1390R6031R7388R6764J01337J09749
58201D655950J14173J15710J22275J32412J37548J39376J47691J61363J69359
58192E895857J71137J77755J91789K04609K14748K30207K51019K68519K83714
58183G889354L07128L38965L69241L98673M38189M85892N26912N58879N94836
58174A1908069O37968O76927P09857P48903P96640Q42619Q87467R44930J015379
58165A9168759J083380J145837J215232J290996J357424J415008J482692J563602
58157B9722930J641432J716525J810332J927758K052989K190066K366783K589287
58149D6018102K835916L105931L428077L810230M231089M693772N232772N856105
$$ plain form
58212 3633420 3711802 3793739 3882384 3973552 4063291 4154681 4250712 4348100 4444864 4546201 4655950
58201 4655950 4770123 4885833 5008108 5140520 5278068 5417444 5565135 5726498 5895857
58192 5895857 6066994 6244749 6436538 6641147 6855895 7086102 7337121 7605640 7889354
58183 7889354 8196482 8535447 8904688 9303361 9741550 10227442 10754354 11313233 11908069
58174 11908069 12546037 13222964 13932821 14681724 15478364 16320983 17208450 18153380 19168759
58165 19168759 20252139 21397976 22613208 23904204 25261628 26676636 28159328 29722930
58157 29722930 31364362 33080887 34891219 36818977 38871966 41062032 43428815 46018102
58149 46018102 48854018 51959949 55388026 59198256 63429345 68123117 73355889 79211994
58141G9211994O544583P325216Q275993R439166J0806344J2403766J4288815J6425975
58133A64721852J8675302K0953736K3316029K5894513K8955607L2948181L7907290
58126C53372510M2305016M2843383L6360130K2561013M784233j2150171k4865362
58119D65210752l2537382l5997247l6487248l5133232l2837203l0157882k7316819
58112B34743739k4429056k1652567j9091535j6717721j4487977j2443293j0622702
58105A15298888q979275p460356o088254m887335l811733k825649j973034j263344
58097G8009908n61912K47890R84993J193064N32008q80973k544405l941665m821971
58088F8216937n203923n222008n007863m662343m261768l853745l455758l074041
$$ plain form
58141 79211994 85756577 93081793 101357786 110796952 121603296 134007062 148295877 164721852
58133 164721852 183397154 204350890 227666919 253561432 282517039 315465220 353372510
58126 353372510 395677526 438520909 474881039 497442052 502226285 490076114 465210752
58119 465210752 432673370 396676123 360188875 325055643 292218440 262060558 234743739
58112 234743739 210314683 188662116 169570581 152852860 138364883 125921590 115298888
58105 115298888 106319613 98859257 92771003 87883668 84071935 81246286 79273252 78009908
58097 78009908 77447996 77695886 78680879 79873943 80405951 79524978 76980573 73038908 68216937
58088 68216937 63013014 57791006 52783143 48120800 43859032 40005287 36549529 33475488
58080C3475488k721922k412685k143647j902385j685915j500167j343087j203874
58072A8561806j079122r74746q90440q16825p50411o97089o57550o22772n87511
58063A1485340n55215n26154m93910m57691m25393m00049l75210l47829l23663
58054G580226l05762k89665k74120k64390k60259k52798k38255k23722k14070
58045E257185k04617j92074j81335j75439j69519j60662j53537j50297j45085
58036C724620j34671j24852j20031j15806j08202j01150r8409r6654r2881r0488
58026B641476r1717r2069q8313q4321q3006q0184p2672o5024o1888o0608n7397
58015A804277n4200n3366n2045m7745m3508m2027m0563l6761l3464l2768l1483
$$ plain form
58080 33475488 30753566 28340881 26197234 24294849 22608934 21108767 19765680 18561806
58072 18561806 17482684 16507938 15617498 14800673 14050262 13353173 12695623 12072851 11485340
58063 11485340 10930125 10403971 9910061 9452370 9026977 8626928 8251718 7903889 7580226
58054 7580226 7274464 6984799 6710679 6446289 6186030 5933232 5694977 5471255 5257185
58045 5257185 5052568 4860494 4679159 4503720 4334201 4173539 4020002 3869705 3724620
58036 3724620 3589949 3465097 3345066 3229260 3121058 3019908 2921499 2824845 2731964 2641476
58026 2641476 2549759 2457690 2369377 2285056 2202050 2121866 2049194 1984170 1922282 1861674 1804277
58015 1804277 1750077 1696711 1644666 1596921 1553413 1511386 1470823 1434062 1400598 1367830 1336347
58004A336347k7380k3748k2911k1684j8075j5993j8073k0408j9606j8552j9886
57993A110031k0374j7448j4732j5216j5361j2207r864j2263j5479j4235j0586
57982I52266r161q929o817m714n537o540l720P07K181J625K753M778M376K124
57968I25392P03o83m085p539p752n692m349l585k273k447n863r313q909o358n622
57953H51625o218n420m335n803q542r147q056q047q819q431q083r900j1806j0186
57939G38832o263m347n014n234m036k938j868L72K479K276J022J528L000K324
57925G22133m69k584l344m224m860l514q76Q23J743L444M904L866J419Q05K067
57910G21333K005p72m560p874j0384j1109r352p015o538p100o312m752m980o840
$$ plain form
58004 1336347 1308967 1285219 1262308 1240624 1222549 1206556 1188483 1168075 1148469 1129917 1110031
57993 1110031 1089657 1072209 1057477 1042261 1026900 1014693 1004829 992566 977087 962852 952266
57982 952266 943105 934176 927359 922645 917108 910568 906848 907555 909736 911361 914114 918892 923268 925392
57968 925392 926095 925412 921327 913788 906036 900344 895995 892410 890137 887690 881827 872514 863605 857247 851625
57953 851625 845407 839987 835652 829849 821307 812160 804104 796057 787238 778807 770724 760824 749018 738832
57939 738832 732569 728222 723208 717974 713938 711000 709132 709504 711983 714259 715281 716809 719809 722133
57925 722133 721664 719080 715736 711512 706652 703138 702262 703085 704828 708272 713176 717042 718461 719266 721333
57910 721333 723338 722566 718006 710132 699748 688639 679287 672272 665734 658634 652322 647570 642590 635750
57896F35750p727p135p121q402r557r971j0181r648p499n123m670n292m261j498
57882E37665L66K29n08r86j744k606k749k804m043n671n770m595m200n148o346
57867D91090p477q851r452q097n976n178n314m381k242k38J697M350O553O515
57853D52999N172M858N457N310N088O878R863J0957R645Q491Q726R058Q931R233
57839E60666R579Q358N941M352L601J772j035k628k882m115o613p715o474n562
57825E57245p037r507j0967j1473j1444j0164p598n308m124l052j655j181k076
57812D71659k679j714j22Q69J598K721L745M083M233M912O051P096P442O564M839
57797E21297L798M127M276K767Q41M05M64j276m092n136m349m632o863q613q568
$$ plain form
57896 635750 628023 620888 613767 605365 595808 585837 575656 566008 558509 553386 548716 543424 539163 537665
57882 537665 538031 538260 537752 536766 535022 532416 529667 526863 522820 517149 511379 506784 502584 497436 491090
57867 491090 483613 474762 465310 457213 451237 446059 440745 436364 434122 433884 435581 439931 446484 452999
57853 452999 458171 463029 468486 473796 478884 485762 495625 506582 516227 524718 533444 542502 551433 560666
57839 560666 570245 578603 584544 588896 592497 594269 593234 590606 587724 583609 576996 569281 562807 557245
57825 557245 550208 540701 529734 518261 506817 496653 489055 483747 479623 476571 474916 473735 471659
57812 471659 468980 467266 467144 468013 469611 472332 476077 480160 484393 489305 495356 502452 509894 516458 521297
57797 521297 525095 529222 533498 536265 537106 537511 537975 536699 532607 527471 523122 518490 511627 503014 494446
57782D94446q390r060r005p412n997n749n176l675l528o140r042r238p455o523
57768C98056p302q572r589j0403j0662j0119r590r946j0724j0921j0344r325q074
57755B72485p051o853p089o572n100l712k768j551k97m53k021k780j380O94J636
57740B27188J891K656L604L916M164N174O122N547L652J959J238J031P87L48k75
57725B69002p43m45N87J421J464J152R28L72r08k308k914k678k254k128k260k248
57709B56040j769j142j108j603j470k15R04R18J135L166N938P185P209Q295J0554
57694B94037J1548J0455R427R887J0505J0104R671R886R380P318N451N455O177
57681D09301N687M369L932M664N688O799Q170R237R544R879J1039J2297J2450
$$ plain form
57782 494446 486056 476996 467991 460579 454582 448833 443657 439982 436454 430314 421272 412034 404579 398056
57768 398056 390754 382182 372593 362190 351528 341409 331819 321873 311149 300228 289884 280559 272485
57755 272485 265434 258581 251492 244920 239820 236108 233340 231789 231492 231039 229018 226238 224858 225552 227188
57740 227188 229079 231735 235339 239255 243419 248593 254715 260262 263914 265873 267111 268142 268929 269277 269002
57725 269002 268259 267814 268401 269822 271286 272438 273366 273738 272830 270522 267608 264930 262676 260548 258288 256040
57709 256040 254271 253129 252021 250418 248948 248733 249637 250555 251690 254856 260794 267979 275188 283483 294037
57694 294037 305585 316040 325467 335354 345859 355963 365634 375520 384900 392218 397669 403124 409301
57681 409301 414988 419357 423289 427953 433641 440440 448610 457847 467391 477270 488309 500606 513056
57668E13056J1566J0567R996J0289J2126J5315J8418K0577K2582K5001K6692K6631
57656G22816K5967K6627K8742L1020L2872L4713L6706L8558M0235M2029M4232
57645A104517M7179N0882N4437N6988N9431O3527O9021P3876P7949Q3773R2176
57634A833756R9958J04360J07703J14638J26164J39285J51751J64187J77856J92954
57624C212612K09486K27532K46185K63778K79487K93377L04636L10980L09907
57615E657980K99797K79860K50159K11800J66676J17389O7731K1978j7831n3806
57605G001733r0431j30950j75277k20050k59632k88406l03906l07764l03094k91800
57595D630423k75011k54635k32708k09992j86614j63586j42368j23417j06233
$$ plain form
57668 513056 524622 535189 545185 555474 567600 582915 601333 621910 644492 669493 696185 722816
57656 722816 748783 775410 804152 835172 868044 902757 939463 978021 1018256 1060285 1104517
57645 1104517 1151696 1202578 1257015 1314003 1373434 1436961 1505982 1579858 1657807 1741580 1833756
57634 1833756 1933714 2038074 2145777 2260415 2386579 2525864 2677615 2841802 3019658 3212612
57624 3212612 3422098 3649630 3895815 4159593 4439080 4732457 5037093 5348073 5657980
57615 5657980 5957777 6237637 6487796 6699596 6866272 6983661 7051392 7073370 7055539 7001733
57605 7001733 6911302 6780352 6605075 6385025 6125393 5836987 5533081 5225317 4922223 4630423
57595 4630423 4355412 4100777 3868069 3658077 3471463 3307877 3165509 3042092 2935859
57586B935859r0400p5631o1521m8305l7123k8486k1114j3231m326N234J5292K5608
57574B601856L5503M4930N4907O5905P6907Q7365R8702J12420J27735J42678J56533
57563C605441J69758J82498J94766K06988K18729K27806K31998K30411K21618
57554E490013K02437J71003J29835Q3288L3184k0208p3965j22878j64109j98384
57544E530216k26267k46194k56945k59620k56240k48453k38241k27662k16865
57535C353729k04215j89263j73937j60038j47367j35259j24240j14835j06204
57526A998371r7324q8590q0971p4313o7674o0938n5069n0948m8448m6533m3931
57515A283632l9929l4868k9802k5688k2934k1331k0007j7787j4236j0184o837
$$ plain form
57586 2935859 2845459 2769828 2708307 2660002 2622879 2594393 2573279 2560048 2555722 2560956 2576248 2601856
57574 2601856 2637359 2682289 2737196 2803101 2880008 2967373 3066075 3178495 3306230 3448908 3605441
57563 3605441 3775199 3957697 4152463 4359451 4578180 4805986 5037984 5268395 5490013
57554 5490013 5692450 5863453 5993288 6076576 6109760 6089552 6015587 5892709 5728600 5530216
57544 5530216 5303949 5057755 4800810 4541190 4284950 4036497 3798256 3570594 3353729
57535 3353729 3149514 2960251 2786314 2626276 2478909 2343650 2219410 2104575 1998371
57526 1998371 1901047 1812457 1731486 1657173 1589499 1528561 1473492 1422544 1374096 1327563 1283632
57515 1283632 1243703 1208835 1179033 1153345 1130411 1109080 1089073 1071286 1057050 1046866 1040029
57504A040029m640l315k437j426L25K687M756O164P743J0157J2746J4586J5922
57491A103297J7659K0197K3579K7915L2693L6709L9597M2345M5330M7415M8363
57480A485099N0569N6310O4494P2108P8052Q3551Q9772R7138J06076J16285J26017
57469B425471J34273J42780J53442J64754J73457J78895J82587J83922J79693
57460C919274J68114J50167J26466R6010N9103J8826k1580o0586r6808j27897
57450D231089j52284j70288j82429j88258j87689j82010j72992j62293j51774
57441B681072j42478j33181j21944j09287r7740q8074p8488o8002n7993m9606
57431A734279m2103l4791k8288k2804j7347j1486n844j25O922J4763K1119K5703
$$ plain form
57504 1040029 1035389 1032074 1029637 1028211 1028536 1031223 1035979 1042143 1049886 1060043 1072789 1087375 1103297
57491 1103297 1120956 1141153 1164732 1192647 1225340 1262049 1301646 1343991 1389321 1436736 1485099
57480 1485099 1535668 1591978 1656472 1728580 1806632 1890183 1979955 2077093 2183169 2299454 2425471
57469 2425471 2559744 2702524 2855966 3020720 3194177 3373072 3555659 3739581 3919274
57460 3919274 4087388 4237555 4364021 4460031 4519134 4537960 4516380 4455794 4358986 4231089
57450 4231089 4078805 3908517 3726088 3537830 3350141 3168131 2995139 2832846 2681072
57441 2681072 2538594 2405413 2283469 2174182 2076442 1988368 1909880 1841878 1783885 1734279
57431 1734279 1692176 1657385 1629097 1606293 1588946 1577460 1571616 1571491 1578413 1593176 1614295 1639998
57419A639998L1049L8256M5062N0022N5549O4164P4354Q3135R0739R9640J10356
57408B382324J21267J31602J41824J51457J59115J64325J67320J67189J62014
57399C748437J50554J32259J06217P1967L1325j1910n4078r2673j26053j53454
57389C802591j74947j90420j99118k00987j97727j91686j84329j76348j67978
57380B119051j58454j46534j32806j20106j10444j02643r4400q5351p6802o9628
57370A021883o3956n9767n6253n1688m5523l9572l5723l3629l2162l1566l2102
57359E39942l1934k8953k4052k0180j8479j7593j6554j6010j6324j6386j5008
57348C18469j2288r422p954q843j1228j2621j1545r362q245q123p312n514m173
$$ plain form
57419 1639998 1671047 1709303 1754365 1804387 1859936 1924100 1998454 2081589 2172328 2271968 2382324
57408 2382324 2503591 2635193 2777017 2928474 3087589 3251914 3419234 3586423 3748437
57399 3748437 3898991 4031250 4137467 4209434 4240759 4228849 4174771 4082098 3956045 3802591
57389 3802591 3627644 3437224 3238106 3037119 2839392 2647706 2463377 2287029 2119051
57380 2119051 1960597 1814063 1681257 1561151 1450707 1348064 1253664 1168313 1091511 1021883
57370 1021883 957927 898160 841907 790219 744696 705124 669401 635772 603610 572044 539942
57359 539942 508008 479055 455003 434823 416344 398751 382197 366187 349863 333477 318469
57348 318469 306181 296759 288805 279962 268734 256113 244568 235206 226961 218838 211526 206012 201839
57335B01839m027m150l627k532j075P36K338K804K135J349J105J195J363J648
57321B01101J780J196j64j648k510k317r82J003K709L644M043L980L029J465P55
57306B17084J817L607M517M405M222M354M568N063O307Q254J0526J2837J4455
57293C02016J4220J2227J0570J1160J3478J5646J6917J7775J8352J8219J7329
57282D67909J5967J4123J1912J0036R076Q853R208J0416J2139J3239J3485J3971
57270F10334J4922J4897J3480J2753J4284J6465J7055J6633J7197J8716J9757
57259G86493K0365K1584K2982K3351K3192K4003K5608K6640K7044K7730K8391
57248A057383K8175K7853K8687K9871K9800K9253L0304L2619L4009L4393L5820
$$ plain form
57335 201839 197812 193662 190035 187503 186428 187164 189502 192306 194441 195790 196895 198090 199453 201101
57321 201101 202881 204077 203913 202265 199755 197438 196456 197459 200168 203812 207855 211835 214864 216329 217084
57306 217084 218901 222508 227025 231430 235652 240006 244574 249637 255944 264198 274724 287561 302016
57293 302016 316236 328463 339033 350193 363671 379317 396234 414009 432361 450580 467909
57282 467909 483876 497999 509911 519947 529023 537876 547084 557500 569639 582878 596363 610334
57270 610334 625256 640153 653633 666386 680670 697135 714190 730823 748020 766736 786493
57259 786493 806858 828442 851424 874775 897967 921970 947578 974218 1001262 1028992 1057383
57248 1057383 1085558 1113411 1142098 1171969 1201769 1231022 1261326 1293945 1327954 1362347 1398167
57237A398167L8548M0603M1673M3871M7806N1125N2286N2833N4490N6583N7941
57226A935926N9093O0820O2356O2716O2406O2394O2358O1108N7996N3281M7785
57215B588239M2322L6733K9703K0636J1040K650m978j3073k0803k6429l0695l6035
57203B599310m2246m6039m5456m2109l8370l4858l1426k8183k4649j9942j4565
57192B231467j0085o592k633K125O449J0042J3884J7716J9854K0129K0463K1804
57180B344623K3150K4233K6309K9367L1286L0907K9351K7499K4796K1502J9228
57169B632251J8108J6354J3841J3094J5257J8134J9888K1673K4677K7504K8856
57158B849637L0118L2748L5254L5426L3846L2879L3554L5334L7513L9070L8632
$$ plain form
57237 1398167 1436715 1477318 1518991 1562862 1610668 1661793 1714079 1766912 1821402 1877985 1935926
57226 1935926 1995019 2055839 2118195 2180911 2243317 2305711 2368069 2429177 2487173 2540454 2588239
57215 2588239 2630561 2667294 2696997 2717633 2728673 2731323 2726345 2713272 2692469 2666040 2635345 2599310
57203 2599310 2557064 2511025 2465569 2423460 2385090 2350232 2318806 2290623 2265974 2246032 2231467
57192 2231467 2221382 2214790 2212157 2214282 2220731 2230773 2244657 2262373 2282227 2302356 2322819 2344623
57180 2344623 2367773 2392006 2418315 2447682 2478968 2509875 2539226 2566725 2591521 2613023 2632251
57169 2632251 2650359 2666713 2680554 2693648 2708905 2727039 2746927 2768600 2793277 2820781 2849637
57158 2849637 2879755 2912503 2947757 2983183 3017029 3049908 3083462 3118796 3156309 3195379 3234011
57147C234011L6215L3625L1898K9902K6508K2278J7936J3288Q715N501L406L22
57135C463605m430q936j2084j5322j9475k2820k4339k5969k9284l2553l3621l3322
57123C201450l3640l4497l4906l5264l6258l7212l7533l7973l8745l8550l7198
57112B799674l6793l8493m0592m1704m3146m6105m9250n1413n3940n8006o2404
57101B277828o6385p1841q0138q9568r8349j07223j16619j24633j30566j37086
57091A255420j45777j54102j59946j65679j73988j83304H1408a17471k07879k16028
57081e41378k21030k25034k30951k37140k40609k42912k48050k57046k69051k85134
57071b998335l06386l31052l58226l91360m33353m81391n31610n85242o44683
$$ plain form
57147 3234011 3270226 3303851 3335749 3365651 3392159 3414437 3432373 3445661 3454376 3459877 3463283 3463605
57135 3463605 3459175 3450239 3438155 3422833 3403358 3380538 3356199 3330230 3300946 3268393 3234772 3201450
57123 3201450 3167810 3133313 3098407 3063143 3026885 2989673 2952140 2914167 2875422 2836872 2799674
57112 2799674 2762881 2724388 2683796 2642092 2598946 2552841 2503591 2452178 2398238 2340232 2277828
57101 2277828 2211443 2139602 2059464 1969896 1871547 1764324 1647705 1523072 1392506 1255420
57091 1255420 1109643 955541 795595 629916 455928 272624 81408 -117471 -325350 -541378
57081 -541378 -762408 -987442 -1218393 -1455533 -1696142 -1939054 -2187104 -2444150 -2713201 -2998335
57071 -2998335 -3304721 -3635773 -3993999 -4385359 -4818712 -5300103 -5831713 -6416955 -7061638
57062g061638p07528p70793q37380r11446r90640j070135j151429j239786j335892
57053a6076667j437661j547768j671570j810097j963048k136536k340280k579853
57045c1563480k859766l190825l585503m049032m584143n201408n915521o735375
57037f7685053p668363q730492r940446j1305096j2817553j4461340j6205628
57030a48813971j8002376j9790543k1484899k2971451k4193911k5303523k6626566
57023c07187240k8277130k9707388k9768761k7419276k2468750j5654444q058657
57016d68541646n20377O483186J2635326J7655304K1364999K3779046K5092987
57009c62051175K5601439K5606695K5336343K4895322K4284770K3467164K2418226
$$ plain form
57062 -7061638 -7769166 -8539959 -9377339 -10288785 -11279425 -12349560 -13500989 -14740775 -16076667
57053 -16076667 -17514328 -19062096 -20733666 -22543763 -24506811 -26643347 -28983627 -31563480
57045 -31563480 -34423246 -37614071 -41199574 -45248606 -49832749 -55034157 -60949678 -67685053
57037 -67685053 -75353416 -84083908 -94024354 -105329450 -118147003 -132608343 -148813971
57030 -148813971 -166816347 -186606890 -208091789 -231063240 -255257151 -280560674 -307187240
57023 -307187240 -335464370 -365171758 -394940519 -422359795 -444828545 -460482989 -468541646
57016 -468541646 -469062023 -462578837 -449943511 -432288207 -410923208 -387144162 -362051175
57009 -362051175 -336449736 -310843041 -285506698 -260611376 -236326606 -212859442 -190441216
57002a90441216K1142607J9675297J8079538J6430152J4789343J3198990J1690271
56995g5435018J0288487R007877P851703O820173N912391N121089M433333L838101
56987b2161864L327816K892464K518547K195040J915738J675512J469145J293949
56979d873653J148416J027226R21867Q26869b07325D60309O02439N44566M92823
56970B100137M45204M00002L58851L25545L01049K82163K65395K49584K34320
56961D962250K18490K01297J82988J64157J45780J29620J16918J06899R8076R0204
56951F416679Q3297P5726O5643N3607M1597L0218J9311J0971R676J9343M0664
56940F866732O8479Q9071Q3634M1342k9208j04953j65874k05850k28201k36958
$$ plain form
57002 -190441216 -169298609 -149623312 -131543774 -115113622 -100324279 -87125289 -75435018
56995 -75435018 -65146531 -56138654 -48286951 -41466778 -35554387 -30433298 -25999965 -22161864
56987 -22161864 -18834048 -15941584 -13423037 -11227997 -9312259 -7636747 -6167602 -4873653
56979 -4873653 -3725237 -2698011 -1776144 -949275 -207325 460309 1062748 1607314 2100137
56970 2100137 2545341 2945343 3304194 3629739 3930788 4212951 4478346 4727930 4962250
56961 4962250 5180740 5382037 5565025 5729182 5874962 6004582 6121500 6228399 6326475 6416679
56951 6416679 6499976 6575702 6641345 6694952 6736549 6766767 6786078 6797049 6806725 6826068 6866732
56940 6866732 6935211 7024282 7107916 7149258 7120050 7015097 6849223 6643373 6415172 6178214
56930F178214k35000k26234k15114k04832j97611j95090j96811k00028k02868
56921D304626k06342k11873k18356k23180k24725k22384k15609k04778j91799
56912B385580j78164j63350j46660j29497j14043j00722q8887p9178p2779o8625
56902A243675o3659n6241m7511l9108l1267k3838j7602j3578j1991j2540j4844
56891I11496j7924k0227k0964k0803k0579k0018j8562j6665j5186j3908j1838
56880G14822q892o063l747j142K110M838O047P129J0877J7876K4847K7260K3294
56867H19256J4756M694m991j3516k0005k3502k4123k3318k2392k1154j8653j5069
56855F51983j2044j0851j0923j0756r789q554p255n355k870j064j006k011k445
$$ plain form
56930 6178214 5943214 5716980 5501866 5297034 5099423 4904333 4707522 4507494 4304626
56921 4304626 4098284 3886411 3668055 3444875 3220150 2997766 2782157 2577379 2385580
56912 2385580 2207416 2044066 1897406 1767909 1653866 1553144 1464257 1385079 1312300 1243675
56902 1243675 1180016 1123775 1076264 1037156 1005889 982051 964449 950871 938880 926340 911496
56891 911496 893572 873345 852381 831578 810999 790981 772419 755754 740568 726660 714822
56880 714822 705930 699867 696120 694978 697088 701926 707973 715102 725979 743855 768702 795962 819256
56867 819256 834012 838706 833715 820199 800194 776692 752569 729251 706859 685705 667052 651983
56855 651983 639939 629088 618165 607409 597620 589066 581811 576456 573586 572522 571516 569505 567060
56842E67060j768r45p57q15n18j37k19m81o5J265K940M548O389Q940J2214J5728
56826F13379J8727K0453K0535J9212J6735J2787P217J377k334k892j767j030r65
56813G21434m84Q80K628M599P178J0101J2468J4436J7618K2867K8593L2397L3996
56800I08711L5303L7527L9009L6470K8201J5818K944p758j6103k2941k7827k9128
56788A000226k6493k2093j8431j5565j1544n359J746Q043J3324J8551K4325L0492
56776I97222L6892M3512M9773N4245N5228N1372M1855K6883Q417j0217k6096l7944
56764A291142m5402m7998m5806m0632l5041l0045k4937j9538j5032j1851q198
56753I66662k041O247J4488K1294K6822L1495L5233L7581L7240L1901K0185L906
$$ plain form
56842 567060 565292 564347 563590 562775 562257 562120 561901 561420 561355 562620 565560 570108 576497 585437 597651 613379
56826 613379 632106 652559 673094 692306 709041 721828 729045 730422 728088 725196 723429 722399 721434
56813 721434 720950 721830 724458 729057 736235 746336 758804 773240 790858 813725 842318 874715 908711
56800 908711 944014 981541 1020550 1057020 1085221 1101039 1103983 1096225 1080122 1057181 1029354 1000226
56788 1000226 973733 951640 933209 917644 906100 900741 902487 910530 923854 942405 966730 997222
56776 997222 1034114 1077626 1127399 1181644 1236872 1288244 1330099 1356982 1365399 1355182 1329086 1291142
56764 1291142 1245740 1197742 1151936 1111304 1076263 1046218 1021281 1001743 986711 974860 966662
56753 966662 964621 970868 985356 1006650 1033472 1064967 1100200 1137781 1175021 1206922 1227107 1231013
56741A231013j2765k6545l6460m2631m5223m4867m2531l8631l3346k7837k3635
56730H56542k0531j6731j1542o325k152J832O752J2222J7309K1867K5609K6890
56718I11742K3910J6622O599m271j4145k1270k4996k6281k6462k6071k5373k4895
56706G65109k4431k2665j9072j5375j3777j4403j5572j5898j4914j2457r077o417
56694E81051n576n358l673n16J967K308J198o9j142k166k909k950k187q04P67
56679E59941J793J747R41J78k33p11j661k955l996m207l646l204l650m346l786
56664E32205j798j44l35j866l342m241m535l764j962n79q99k078k301j318l61
56649E02682j38n10j588l301m255l078q93k90j640k535j422K36M65m93j240j612
$$ plain form
56741 1231013 1218248 1191703 1155243 1112612 1067389 1022522 979991 941360 908014 880177 856542
56730 856542 836011 819280 807738 801413 799261 801093 807845 820067 837376 859243 884852 911742
56718 911742 935652 952274 958873 954602 940457 919187 894191 867910 841448 815377 790004 765109
56706 765109 740678 718013 698941 683566 669789 655386 639814 623916 609002 596545 587468 581051
56694 581051 575475 570117 566444 565928 567895 570203 571401 571332 570190 568024 565115 562165 559978 559174 559941
56679 559941 561734 563481 564422 564600 564367 563656 561995 559040 555044 550837 547191 543987 540337 535991 532205
56664 532205 530407 530263 529928 528062 524720 520479 515944 512180 510218 509639 508740 506662 504361 503043 502682
56649 502682 502544 502034 500446 497145 492890 489812 488919 488629 486989 484454 483032 483268 483733 483240 482000 480388
56633D80388k390l522m113l872l405l272l479l775l824l283k197j136n77l34J34
56618D41343J058K247L217L325K282Q36L78J350K527K496J491R81J517K016J559
56603D68623R84J720L459M216K968R92m6k14m39m21R29L280M846M640L411K070
56587E01018O65p29j612k098k929l860l625k219j455k305l394l467l466m440n080
56572D61004l609r95K02n07j396j600j936k696k980k580k458k777k344p93K69
56557D34804o09k561l468k489o81N43P95O75Q08J171J428J625K006K233J660N69
56541D38509M7L00K94k92k84R50K212K588L191N026O546N764L717L121M096M044
56525D79829J945J1K63J753K379J788J183J480K765M785O990Q528Q863Q222P219
$$ plain form
56633 480388 477998 474476 470363 466491 463086 459814 456335 452560 448736 445453 443256 442120 441543 441209 441343
56618 441343 442401 444648 447865 451190 453472 454308 454686 456036 458563 461059 462550 463531 465048 467064 468623
56603 468623 469607 471327 474786 479002 481970 482962 482916 482702 482263 481842 482771 486051 490897 495537 498948 501018
56587 501018 501683 500954 499342 497244 494315 490455 486830 484611 483156 480851 477457 473990 470524 466084 461004
56572 461004 457395 456400 456602 456095 454699 453099 451163 448467 445487 442907 440449 437672 435328 434535 434804
56557 434804 434195 431634 428166 425677 424996 425539 426334 427009 427817 428988 430416 432041 434047 436280 437940 438509
56541 438509 438556 438856 439150 438858 438574 439524 441736 444324 447515 452541 459087 464851 468568 471689 475785 479829
56525 479829 481774 481785 482048 483801 486180 487968 489151 490631 493396 498181 505171 513699 522562 530784 538003
56510E38003O413O197O740P927R610J1549J3096J3616J3702J4885J7492J9806
56498F79036K0342J9840J9770J9985J9375J7919J6380J4741J2643J0694R618Q597
56486H68940O279K929l2k202m263o361q202j0207j2749j4763j5047j4463j4858
56473G75001j6201j6966j6892j6998j7072j5660j2785j0360r519r536r682j0086
56461F13244j0474j0045r070q695q824q090o270m872m820n398n879o451p021o823
56447E10512n755m715m112l414k362j328m64J66j45j734l131k508l90J011R03
56432D82534L37r1o31o16J111L631M353K509J99n79N6J161K186K630K316K301
56416E03407L560M900M319K422J936L641N376N558N130N283N508M776K956O94
$$ plain form
56510 538003 544416 550613 557353 565280 574890 586439 599535 613151 626853 641738 659230 679036
56498 679036 699378 719218 738988 758973 778348 796267 812647 827388 840031 850725 860343 868940
56486 868940 875219 878148 878116 875914 871651 865290 857088 846881 834132 819369 804322 789859 775001
56473 775001 758800 741834 724942 707944 690872 675212 662427 652067 642548 633012 623330 613244
56461 613244 602770 592725 583655 574960 566136 558046 551776 546904 542084 536686 530807 524356 517335 510512
56447 510512 504757 500042 495930 492516 490154 488826 488362 488528 488383 486649 483518 481010 480620 481631 482534
56432 482534 482871 482780 482149 481533 482644 486275 490628 493137 493336 492757 492813 493974 496160 498790 501106 503407
56416 503407 506967 511867 516186 518608 520544 524185 529561 535119 540249 545532 551040 555816 558772 559466
56402E59466n57J177N908J0022R791O164L246K507J890L94m99l71p87j846j633
56387E94872l16q32m006o600o011l550j333O68K503K515K08j947j963j232j781
56372E71195k984l119k177j194n15k59q51j962k788l785n831p387n790j944j6
56357E30593j398k909k339j589k318k774j512k85m15n8J785K244r04m845n637
56342E07639l694j832n22J224K546K142J186J409J963J218j06n56o94j330j055
56327E09538J295L776M101L392L901M899M217K283J288J666K411L492N011N560
56313E56830M319L296M510O506O639N183M224M095L919M066M947M994L005R85
56299F17518J580L986N511N574N143L919J522p2J215L970N207M666M098L667K422
$$ plain form
56402 559466 558909 560086 565994 576016 585807 591971 595217 597724 599614 600008 599509 599138 598351 596505 594872
56387 594872 594556 593724 589718 583118 577107 573557 572224 572892 575395 577910 578118 576171 574208 572976 571195
56372 571195 568211 565092 562915 561721 561206 560947 560096 558134 555346 551561 545730 538343 532553 530609 530593
56357 530593 529195 526286 523947 522358 520040 517266 515754 515469 515054 514996 516781 519025 518121 513276 507639
56342 507639 503945 502113 501591 502815 505361 507503 508689 510098 512061 513279 513173 512617 511923 510593 509538
56327 509538 510833 514609 518710 522102 526003 530902 535119 537402 538690 540356 542767 546259 551270 556830
56313 556830 561149 564445 568955 575461 582100 587283 591507 595602 599521 603587 608534 613528 616533 617518
56299 617518 619098 623084 628595 634169 639312 643231 644753 644681 645896 649866 655073 659739 663837 667504 669926
56284F69926J076R29J150L66j20J852N335P356P222O625O328N832N531O360P914
56269G33682R304J0787J2417J2695J1098R968J1189J2942J2772J1616J1660J2535
56257H72665J3130J4685J8028K0125J7979J4089J3279J5577J6919J5613J3361
56246A045450J0924P659M674L800L935K767J447K994O605Q313P178O253P410R422
56232A128831J1262J3233J4792J5133J5820J8996K3385K5995K7149K9616L3258
56221A357470L5265L5690L7845M2746M7650N0880N4024N8454O3443O8508P4333
56210A926308Q0704Q6573R2418R9590J07666J15614J24899J37770J53003J67227
56200C091772J80062J94010K09612K24920K39475K54573K69505K81633K90333
$$ plain form
56284 669926 671002 671931 673081 673447 673327 675179 680514 687870 695092 701717 708045 713877 719408 725768 733682
56269 733682 742986 753773 766190 778885 789983 799951 811140 824082 836854 848470 860130 872665
56257 872665 885795 900480 918508 938633 956612 970701 983980 999557 1016476 1032089 1045450
56246 1045450 1056374 1064033 1068707 1072507 1076442 1079209 1080656 1083650 1090255 1098568 1105746 1111999 1119409 1128831
56232 1128831 1140093 1153326 1168118 1183251 1199071 1218067 1241452 1267447 1294596 1324212 1357470
56221 1357470 1392735 1428425 1466270 1509016 1556666 1607546 1661570 1720024 1783467 1851975 1926308
56210 1926308 2007012 2093585 2186003 2285593 2393259 2508873 2633772 2771542 2924545 3091772
56200 3091772 3271834 3465844 3675456 3900376 4139851 4394424 4663929 4945562 5235895
56191E235895K97051L01612L02296K99077K92536K80117K58142K27596J93327
56182G687649J57534J18628P6586L4629m887m1712p4471j00812j21360j39106
56172G592678j54319j64456j69576j73291j77604j81197j83553j86416j90198
56163F012068j93176j95153j97978k01716k04131k04494k04145k03030j99708
56154D208537j94752j90023j84588j75966j65402j57019j51307j44252j33658
56145B711570j21771j10957j01170r2376q5222p8741p1417o4596o0782n8828n5211
56134A810499m9503m4025l8963l3029k7962k6434k6288k3202j8458j7138j8884
56123A486613j7919j2824q575p627o500l157l97M56K456O966J0941J2718J4490
$$ plain form
56191 5235895 5532946 5834558 6136854 6435931 6728467 7008584 7266726 7494322 7687649
56182 7687649 7845183 7963811 8040397 8075026 8070139 8028427 7953956 7853144 7731784 7592678
56172 7592678 7438359 7273903 7104327 6931036 6753432 6572235 6388682 6202266 6012068
56163 6012068 5818892 5623739 5425761 5224045 5019914 4815420 4611275 4408245 4208537
56154 4208537 4013785 3823762 3639174 3463208 3297806 3140787 2989480 2845228 2711570
56145 2711570 2589799 2478842 2377672 2285296 2200074 2121333 2049916 1985320 1924538 1865710 1810499
56134 1810499 1760996 1716971 1678008 1644979 1617017 1590583 1564295 1541093 1522635 1505497 1486613
56123 1486613 1468694 1455870 1447295 1439668 1433168 1430011 1429614 1430070 1432526 1439492 1450433 1463151 1477641
56110A477641J6853J7156J5491J6089K0139K3289K2729K0872J9733J7816J4848
56099A682656J3365J3114J0241M699J912M222P185P442P769J0860J4506J6724
56087A794695J9596K4258K7884K9440L2782M0220M8487N4843O1713P1535Q2302
56076B287755R1950J02083J13596J23491J29500J33060J34738J31814J23523J13718
56066C485228J05437R7761R0312Q5101Q1285P3952O0952M5267K8457Q508j3247
56055D149013l0355m0171m7976n8670p0859q2511r5238j08817j18313j21146j20899
56044C254058j20227j16486j08265r9439r2370q3718p1273n8610m8856m0293l2028
56033B382493k7043k5623k2859j7027j3247j4520j6431j5283j4014j5231j5752
$$ plain form
56110 1477641 1494494 1511650 1527141 1543230 1563369 1586658 1609387 1630259 1649992 1667808 1682656
56099 1682656 1696021 1709135 1719376 1724075 1725987 1730209 1737394 1744836 1752605 1763465 1777971 1794695
56087 1794695 1814291 1838549 1866433 1895873 1928655 1968875 2017362 2072205 2133918 2205453 2287755
56076 2287755 2379705 2481788 2595384 2718875 2848375 2981435 3116173 3247987 3371510 3485228
56066 3485228 3590665 3688426 3778738 3863839 3945124 4019076 4080028 4125295 4153752 4162260 4149013
56055 4149013 4118658 4078487 4030511 3971841 3900982 3818471 3723233 3614416 3496103 3374957 3254058
56044 3254058 3133831 3017345 2909080 2809641 2717271 2633553 2562280 2503670 2454814 2414521 2382493
56033 2382493 2355450 2329827 2306968 2289941 2276694 2262174 2245743 2230460 2216446 2201215 2185463
56022B185463j3057j0049q649n775l31L243K855K704N136O536N493O425J0620
56009B190614J2711J0857J1022J6071K0429K1051K3315K9908L4302L2296K9753
55998B432329L1617L3449L1481L0770L5263L9625L9330L9067M3009M6584M6137
55987B848661M6675N1510N4574N1739M9328N2527N6186N6101N7991O5505P1103
55976C461900O9452O8331P4963Q2962Q4528Q4298Q9092R4930R6556R8957J06861
55965D412830J13728J13723J13765J21161J30326J34398J38312J47360J54954
55956E580557J55341J56290J65165J75018J78615J83122J96097K10538K19318
55947G220061K30437K51675K74590K90729L08989L39081L73034M01675M33774
$$ plain form
56022 2185463 2172406 2162357 2153708 2147933 2147602 2150845 2153700 2156404 2161540 2168076 2173569 2179994 2190614
56009 2190614 2203325 2214182 2225204 2241275 2261704 2282755 2306070 2335978 2370280 2402576 2432329
55998 2432329 2463946 2497395 2528876 2559646 2594909 2634534 2673864 2712931 2755940 2802524 2848661
55987 2848661 2895336 2946846 3001420 3053159 3102487 3155014 3211200 3267301 3325292 3390797 3461900
55976 3461900 3531352 3599683 3674646 3757608 3842136 3926434 4015526 4110456 4207012 4305969 4412830
55965 4412830 4526558 4640281 4754046 4875207 5005533 5139931 5278243 5425603 5580557
55956 5580557 5735898 5892188 6057353 6232371 6410986 6594108 6790205 7000743 7220061
55947 7220061 7450498 7702173 7976763 8267492 8576481 8915562 9288596 9690271 10124045
55938A0124045M78883N26927N65580O02066O46582O90711P24827P59847Q08051
55929A5927519Q59594R02854R50074J016436J091700J159834J228013J307613
55921B4443637J386313J449981J512584J592449J679303J758233J844396J958595
55913C7625491K091766K231608K399640K620680K881367L162721L486295L881285
55905F0380853M336347M835434N408540O091087O870562P737240Q747716R967539
55897A14375318J1396362J3029165J4935393J7179564J9724234K2525661K5652080
55890B38817777K9173209L3038519L7223285M1709965M5741899M7042496M2551713
55883E15298863L0764676J3471113n099482k0930557l2090676l8596799m1321525
$$ plain form
55938 10124045 10602928 11129855 11695435 12297501 12944083 13634794 14359621 15119468 15927519
55929 15927519 16787113 17689967 18640041 19656477 20748177 21908011 23136024 24443637
55921 24443637 25829950 27279931 28792515 30384964 32064267 33822500 35666896 37625491
55913 37625491 39717257 41948865 44348505 46969185 49850552 53013273 56499568 60380853
55905 60380853 64717200 69552634 74961174 81052261 87922823 95660063 104407779 114375318
55897 114375318 125771680 138800845 153736238 170915802 190640036 213165697 238817777
55890 238817777 267990986 301029505 338252790 379962755 425704654 472747150 515298863
55883 515298863 546063539 559534652 554435170 533504613 501413937 462817138 421495613
55876D21495613m1301821l9547563l6866878l3719822l0339333k6944071k3737851
55869A89038274k0797722j8112033j5701938j3610994j1817982j0258993q912991
55862H9825621p788580o852425o044490n345047m763100m277235l846466l462748
55854D7445530l139038k861022k600490k361782k167591k011192j865875j729067
55846B8709473j615553j518620j417670j314645j226080j148497j066255r84079
55838A8418074r18239q64496q06769p48700p05286o71584o30371n83530n46483
55829A1942616n18411m86453m52816m29922m14350l92360l66098l48505l37327
55820H196374l19434k96178k79957k69872k54832k36703k26709k22281k10728
$$ plain form
55876 421495613 380193792 340646229 303779351 270059529 239720196 212776125 189038274
55869 189038274 168240552 150128519 134426581 120815587 108997605 98738612 89825621
55862 89825621 82037041 75184616 69140126 63795079 59031979 54754744 50908278 47445530
55854 47445530 44306492 41445470 38844980 36483198 34315607 32304415 30438540 28709473
55846 28709473 27093920 25575300 24157630 22842985 21616905 20468408 19402153 18418074
55838 18418074 17499835 16635339 15828570 15079870 14374584 13703000 13072629 12489099 11942616
55829 11942616 11424205 10937752 10484936 10055014 9640664 9248304 8882206 8533701 8196374
55820 8196374 7876940 7580762 7300805 7030933 6776101 6539398 6312689 6090408 5879680
55811E879680j93096j81948j77771j69472j56308j48051j44801j37213j25794
55802D445226j20262j20501j16834j08385j03026j00376r2995q3398q1938q8258
55792C429253r2049r1474r3934r9377r9927r5828r4962r6502r1506p9987p1422
55781B422285o7711o1265n0798m3721m1729l8617l3576l2443l4757l3509k8862
55770A955297k8531l3399l6129l4882l5319l8131l7864l5058l6312m1173m2071
55759A556428l8595l8478m2835m3732l8751l4843l4867l2961k6717k2033k1901
55748A180715k1239j6819j2336j0192p661m073k802l551j650K858M372J686j89
55735A109119K17j461o313r913j0955j3152j6860j7887j6209j6795k0119k0958
$$ plain form
55811 5879680 5686584 5504636 5326865 5157393 5001085 4853034 4708233 4571020 4445226
55802 4445226 4324964 4204463 4087629 3979244 3876218 3775842 3682847 3599449 3517511 3429253
55792 3429253 3337204 3245730 3151796 3052419 2952492 2856664 2761702 2665200 2573694 2493707 2422285
55781 2422285 2354574 2293309 2242511 2198790 2157061 2118444 2084868 2052425 2017668 1984159 1955297
55770 1955297 1926766 1893367 1857238 1822356 1787037 1748906 1711042 1675984 1639672 1598499 1556428
55759 1556428 1517833 1479355 1436520 1392788 1354037 1319194 1284327 1251366 1224649 1202616 1180715
55748 1180715 1159476 1142657 1130321 1120129 1112468 1108395 1105593 1102042 1100392 1103250 1107622 1109308 1109119
55735 1109119 1109336 1107875 1101562 1091649 1080694 1067542 1050682 1032795 1016586 999791 979672 958714
55723I58714j8256j6831j7698j6076j1064p825p897o726l362l185q063j2800j4539
55710H14392j6934k1647k4256k2311j9568j8617j6735j2338q480o778m847k439
55698F39442l121p230j0159j0097j0429j2230j1902q668o978q602r799q961r586
55685E21680j2742j4113j1803r762j0131r558o557n251p653r291o778l371k627
55672D12043k609p99Q14m1j575j830k316m306n931n989o183p047o373l971k954
55657C60933m131m341k509j711k935k771J50K325J792J428K968L753K577K694
55643C60222N566P483O168M861O025O627L962Q20L87R47J06l84J518L700L814
55628D11822L728N810Q320Q526P138O113N179L841L507M605M949L665L040L986
$$ plain form
55723 958714 940458 923627 905929 889853 878789 870964 863067 856341 852979 849794 841731 828931 814392
55710 814392 797458 775811 751555 729244 709676 691059 674324 661986 653506 646728 641881 639442
55698 639442 636321 629091 618932 608835 598406 586176 574274 565606 558628 550026 540227 531266 521680
55685 521680 508938 494825 483022 473260 463129 453571 447014 441763 434110 424819 418041 414670 412043
55672 412043 409434 408635 409449 409408 407833 406003 403687 399381 393450 387461 381278 374231 367858 363887 360933
55657 360933 356802 352461 349952 348241 345306 342535 342685 345010 346802 348230 351198 354951 357528 360222
55643 360222 365788 373271 379439 384300 390325 396952 400914 401734 402121 403068 403174 402790 404308 408008 411822
55628 411822 415550 421360 429680 438206 445344 451457 456636 460477 463984 468589 473538 477203 480243 484229
55614D84229L783J117r91m01L80r45k210j003Q81J077R44K362L748L188K306L214
55598E01679M495L869K174J347R96n2j196j661k137k712k096p51j280l796m961
55583D93918l691l423o131q804q961q944j1051j2959j2166j0813j1677j3073j2331
55570C69894j0885j1307j2329j1494j0014j0311j1158r827p077n565n090l655
55558B61182j736j459k639l303l139l318l929m208m149l639j761R34J712m50k639
55543B27459k155m11M7l11J52P54J31p67n06j6p13j629j289m51m13o00l20n64
55525B18398j543j168J286K833J278p59J78K881L842K878K493L433M649O282R086
55510B56047J2032J3694J4726J6218J7185J6584J5940J6846J7614J5691J1714
$$ plain form
55614 484229 488012 489129 488138 487737 488117 487172 484962 483959 484840 485917 486861 489223 492971 496159 498465 501679
55598 501679 506174 510043 512217 513564 514560 514508 513312 511651 509514 506802 504706 503955 502675 498879 493918
55583 493918 490227 486804 480673 471869 462908 453964 442913 429954 417788 406975 395298 382225 369894
55570 369894 359009 347702 335373 323879 313865 303554 292396 282569 275492 269927 264837 261182
55558 261182 259446 257987 255348 252045 248906 245588 241659 237451 233302 229663 227902 228836 230548 230098 227459
55543 227459 225304 224893 224940 224629 224781 225535 225666 224899 224393 224377 223664 222035 220746 220295 219882 219282 218962 218398
55525 218398 216855 215687 216973 219806 221084 220325 220503 223384 227226 230104 232597 236030 240679 246961 256047
55510 256047 268079 281773 296499 312717 329902 346486 362426 379272 396886 412577 424291
55499D24291P980M434l88n866j0177j3383j6436j8281j7354j4915j3732j4112
55487C12061j4174j3203j1991j0743r200p993p457o146k888Q24K771L000K742
55474B37603J948M18l59P21J971J330k67o33J16N15P96K000L366L484K858K613
55458B58480J989p1k227k529j733j884k806k839j952j405j354j513k851n912q724
55443B22669r212q426q508q870p475m797l267l665m807n855o234m678j296Q00
55429A46379q54m023m697k779j333j280q77J74J40j197k024j833k128l466m513
55414A15689m446l739k563p06R37J016k90j844l448n165n672l817r63P38J454
55399H7181K524L273K024m89j895j858j966k399j808k79N56L23J83M50M43L56
$$ plain form
55499 424291 432271 436705 436317 430451 420274 406891 390455 372174 354820 339905 326173 312061
55487 312061 297887 284684 272693 261950 252750 244757 237300 231154 228266 229090 231861 234861 237603
55474 237603 239551 239969 239610 240331 242302 243632 243365 242732 242848 243363 244159 246159 249525 253009 255867 258480
55458 258480 260469 260398 258171 255642 253909 252025 249219 246380 244428 243023 241669 240156 237305 231393 222669
55443 222669 213457 205031 196523 187653 180178 175381 172114 168449 163642 157787 151553 146875 145579 146379
55429 146379 145525 141502 136805 134026 132693 131413 130536 130710 130850 129653 127629 125796 123668 120202 115689
55414 115689 111243 107504 104941 104235 105172 106188 105898 104054 100606 95441 89769 85952 84989 85727 87181
55399 87181 89705 92978 95002 94513 92618 90760 88794 86395 84587 84308 84864 85187 85370 85820 86263 86619
55383H6619Q50J302R21P76J996K946J421j274j963o71l14j627k402j884j887k872
55367H1937k783q57Q04P79L48P06R95M85J12N60J022R64R68Q80m45k577l165j417
55349G9316M60P71J013L138O005O809M990K618J309N45p65k351k918k083j110
55334I7747j273j899j232P31J778N66j477k344j970j150L55K697M250L313O82
55319A00774j372j901j301K33K200K837J049j440k176j411j166j715j647q34o81
55304I1449j614k662l270l404k379O3K039J419r05k008r35O19J201Q61j97j730
55288G8547k519j608j49P7n66n74k31q05j682j226O5M05J23Q68J840O25k076k527
55270F8587L03K778J797j122k541j502M74J815J912J005l9o68j413k496k469k24
$$ plain form
55383 86619 87469 88771 89692 90468 92464 95410 96831 95557 93594 92923 92609 90982 88580 86696 84809 81937
55367 81937 79154 78297 79101 79880 80228 80934 81929 82414 82526 83086 84108 85072 86040 86920 86475 83898 80733 79316
55349 79316 79776 80547 81560 84698 90703 97512 102502 105120 106429 106974 106209 103858 100940 98857 97747
55334 97747 96474 94575 93343 94074 95852 96418 94941 92597 90627 89477 89832 92529 96779 100092 100774
55319 100774 99402 97501 96200 96433 98633 101470 102519 101079 98903 97492 96326 94611 92964 92130 91449
55304 91449 89835 87173 83903 80499 78120 78183 80222 81641 80736 78728 77793 78412 79613 80474 80277 78547
55288 78547 76028 74420 74271 74348 73782 73208 72977 72172 70490 69264 69329 69734 69857 70725 72565 73190 71114 68587
55270 68587 68890 71668 73465 72343 69802 68300 68774 70589 72501 73506 73467 72799 71386 68890 66421 66197
55254F6197K352K361J06j417r85j73RL59R81P60r8K00J937L204K971K230J577
55237H2571L48j147j338p7R33J025J265J738J055o86j436o75m00j517k178j086
55221G8395L32N68K90M17L58j81J2J444K508J883M81l60p21q76j73J346K054Q68
55203H8645j168k502k820k389j440q76j671k874k336j22J198N11j72Q23K233K235
55187G7275J193L63j51o02n50j2P6l56q2J016J355L60l94j18l12j819k828j698
55169G2716M33J739K325K814K473R67j7P65J709P65j218j935j099j96J85M64M79
55152H3369p2k76Q59K449K710J477J02o18r50j040o65J31J119K178K806K169M13
55135I6161j070j525j861k779l210j980k9N80o71k281k563j086J183K613K300
$$ plain form
55254 66197 68549 70910 71016 69599 68614 68441 68450 68809 69790 70550 70452 70652 72589 75793 78764 80994 82571
55237 82571 82919 81772 80434 80357 81290 82315 83580 85318 86373 85687 84251 83576 83176 81659 79481 78395
55221 78395 78727 79295 79585 80002 80360 80179 80191 81635 84143 86026 86507 86147 85426 84550 84377 85723 87777 88645
55203 88645 87477 84975 82155 79766 78326 77450 75779 72905 70569 70447 71645 72156 71984 72807 75040 77275
55187 77275 78468 78831 78680 78078 77528 77516 77592 77236 77154 78170 79525 79885 79491 79373 79061 77242 74414 72716
55169 72716 73149 74888 77213 80027 82500 83467 83450 84215 85924 86689 85471 83536 82437 82241 82426 82890 83369
55152 83369 83297 83021 83880 86329 89039 90516 90618 90000 89050 88010 87345 87476 88595 90773 93579 95748 96161
55135 96161 95091 93566 91705 88926 85716 83736 83707 84287 83616 81335 78772 77686 78869 81482 83782
55120H3782J117P35J478K280K642L009L036J539j116k626j820l13k8p68j521k423
55104H9003l787m551l463j051Q87J201J24j091q64J277L522L431J134q12j054
55089H3906q37j257j553j203j266k104k083k86J425J052o01j542j556j552j394
55074F9149m10R04J627J965K459K554J526P3n04%Q18J355J292O21J54Q58K078
55057H6519J993M92m00K90J121J107J510L156M378L672K235J699J392K61m54Q19
55041A09790K853L220K041J405J899K127J293J21m87o5J464L070K950R42o41k76
55025A31706L45p74k348j777N50J963J761J761K783L371K426Q18j88m52m73n95
55009A40877q74r48j94J256K320K418K183K001J288J86J97J596K087M3k679l444
$$ plain form
55120 83782 84899 85634 87112 89392 92034 95043 98079 99618 98502 95876 94056 93743 93715 92947 91426 89003
55104 89003 85216 80665 77202 76151 77038 78239 78363 77272 76408 77685 81207 84638 85772 84960 83906
55089 83906 83069 81812 80259 79056 77790 75686 73603 73317 74742 75794 75193 73651 72095 70543 69149
55074 69149 68739 69643 71270 73235 75694 78248 79774 79847 79343 79343 80161 81516 82808 83429 83583 84441 86519
55057 86519 88512 89004 88604 88894 90015 91122 92632 95788 100166 103838 106073 107772 109164 109425 108971 109790
55041 109790 112643 115863 117904 119309 121208 123335 124628 124749 124262 124197 125661 128731 131681 132623 131982 131706
55025 131706 132051 131277 128929 127152 127702 129665 131426 133187 135970 139341 141767 142585 142397 141945 141472 140877
55009 140877 140003 139055 138861 140117 142437 144855 147038 149039 150327 150513 150710 152306 154393 154436 151757 148313
54993A48313k708k562k840j834J7N01n55j042l07j64j451k368j405J58J83j228
54977A30708j941n91J738K679J206j144k103j509j166j865k297j597r74j446j805
54962A17893n80J394K318K087J799J703J514J674K421K688J696N46M58O91J89
54947A38491k37M26J016N7j282r74K00j08j566j478P68K660K352R73N36J560L137
54930A46531L776K277p88k897k439q69k63j14J033K092Q59j829k806j412k41p49
54914A42161j258o8K158M040N091N027L619J931J672K714L169K181P59k99j094
54899A71803j103O64L543N540O186O924Q263Q990Q674Q611R424J0044R989J0551
54885B68103J2699J5480J7450J8124J7469J5524J2973J0398O792Q53o080j0696
$$ plain form
54993 148313 145605 143043 140203 138369 138386 138887 138332 137290 136983 136819 135368 133000 131595 131753 131936 130708
54977 130708 128767 128176 129914 132593 133799 132655 130552 129043 127877 126012 123715 122118 121144 119698 117893
54962 117893 117313 118707 121025 123112 124911 126614 128128 129802 132223 134911 136607 137153 137611 138302 138491
54947 138491 138254 138680 139696 139753 138471 137497 137697 137589 136023 134545 135313 137973 140325 141298 141834 143394 146531
54930 146531 150307 152584 151796 148899 146460 145591 145328 145214 146247 148339 149198 147369 144563 143151 142910 142161
54914 142161 140903 140835 142993 147033 152124 157151 160770 162701 164373 167087 170256 172437 173196 172897 171803
54899 171803 170700 171364 174907 180447 186633 193557 201820 210810 219484 228095 237519 247563 257552 268103
54885 268103 280802 296282 313732 331856 349325 364849 377822 388220 395012 395865 389785 379089
54873C79089j1924j2161j3485j5104j5516j4948j4192j2992j1100r394q579q035
54861B31659p114o308o075n758m592k794q93R72K461L050L140L878N434O765P557
54846B31382Q804J0861J2500J2735J2224J2135J2718J3585J4185J3603J1091P290
54834C73113L676O04k749o421r350j1221j2922j4802j6076j6379j6150j5297j3317
54821B42709j1057j0238j0756j0547q752o819n696m321k072n22j162l023m093
54808A63651l760k701j542p38n19k89Q05K174K269J061J42p5r06k391k384m1K225
54791A56981K110N86k20l71j083j985j861j062r75j732k324k390k222j702p83
54776A40967l39r86j738j287p3M66O8l50n12j066k192l107l021j771L30K606M195
$$ plain form
54873 379089 367165 355004 341519 326415 310899 295951 281759 268767 257667 248273 239694 231659
54861 231659 224545 218237 212162 206404 201812 199018 198125 199097 201558 204608 207748 211626 217060 223825 231382
54846 231382 240186 251047 263547 276282 288506 300641 313359 326944 341129 354732 365823 373113
54834 373113 376789 377393 374644 368223 358873 347652 334730 319928 303852 287473 271323 256026 242709
54821 242709 231652 221414 210658 200111 191359 184540 178844 174523 172451 171929 170767 167744 163651
54808 163651 159891 157190 155648 154910 154391 154102 154907 157081 159350 160411 160553 160478 159572 157181 154797 154756 156981
54791 156981 159091 159677 159457 159086 158003 156018 154157 153095 152120 150388 148064 145674 143452 141750 140967
54776 140967 140628 139642 137904 136617 136544 137010 137078 136728 136216 135150 132958 129851 126830 125059 125389 127995 132190
54759A32190M643M152L077J741P98Q43J368J171J67k90O97K487M121N359O019
54744A68543N704M867M756N612O221N978N954P154R133J1142J3178J5012J5770
54731B79024J5410J5092J5225J4836J3834J3715J4630J3913R684L991J07j970
54719D07491m741q921j2569j4090j3796j2514j0638q772p713p362o759n349l501
54706B90766j943j318j951l324m281m260l681k756r42J833M669P147R766J2152
54692C01877J2619J1036J0230J2531J6267J8010J7352J6958J8360K0074K0002
54681D75316J7683J3840R125L789k278r084j5531j9590k0543k0188k0496k0949
54669C91094j9785j7187j5133j4520j4329j3619j2513j1158r405p746p070p179
$$ plain form
54759 132190 136833 140985 144062 145803 146601 147444 148812 149983 150150 149860 150557 153044 157165 162524 168543
54744 168543 174247 179114 183870 189482 195703 201681 207635 214789 223922 235064 248242 263254 279024
54731 279024 294434 309526 324751 339587 353421 367136 381766 395679 405363 409354 409461 407491
54719 407491 402750 393829 381260 367170 353374 340860 330222 321450 313737 306375 299616 294267 290766
54706 290766 288823 287505 285554 282230 277949 273689 270008 267252 266310 268143 272812 279959 289725 301877
54692 301877 314496 325532 335762 348293 364560 382570 399922 416880 435240 455314 475316
54681 475316 492999 506839 515964 519753 517475 508391 492860 473270 452727 432539 412043 391094
54669 391094 371309 354122 338989 324469 310140 296521 284008 272850 263445 255699 248629 241450
54657B41450o986o311o090o470o202m479k269j077j240j937k314k021j165j41
54643A92748O53J051J003N22k3m2N13R51Q24L81k97j616l188l401j465R98J914
54626A91526J506J499K183K259J435J102J926K493J342q50k165j695j08J590K947
54611B06990L922M469M471L975L380L296L981N032N762N841N490N185N214N395
54597B72403N232M598L962L680L337K530J809J974K714L140L402M320N463N468
54583C24032M552M731O741Q688Q900Q449R174J0746J1486J1020J0381J0045R577
54570D38522Q736P453N105J189l447p279r726j1339j2635j3695j4530j5100j5261
54557C57993j5006j4156j1781p328k684j093k973m746l457p41o0j582k482j366
$$ plain form
54657 241450 234464 228153 222063 215593 209391 204912 202643 201566 200326 198389 196075 194054 192889 192748
54643 192748 193401 194452 195455 195977 195954 195912 196425 197376 198200 198581 198284 196668 193480 190079 188614 189612 191526
54626 191526 193032 194531 196714 198973 200408 201510 203436 205929 207271 206421 204256 202561 202453 204043 206990
54611 206990 210912 215381 219852 223827 227207 230503 234484 239516 245278 251119 256609 261794 267008 272403
54597 272403 277635 282233 286195 289875 293212 295742 297551 299525 302239 305379 308781 313101 318564 324032
54583 324032 328584 333315 340056 348744 357644 366093 375267 386013 397499 408519 418900 428945 438522
54570 438522 447258 454711 459816 461005 457558 450279 440553 429214 416579 402884 388354 373254 357993
54557 357993 342987 328831 317050 309722 307038 305945 302972 298226 294769 294028 293968 292386 289904 288538
54543B88538L51J108P76l96k063k942j828J80M25j909m844o409o677o451n636
54528B52223m032k613k814m801p036p540n704l021j653k039k560j987j196j593
54514B03634k948m074m657m991m700l428k267k669m193m861l624j115J605L678
54500A65390M184K915J159L17R8m70q25L63K580L668K777J247M09K16K77N40N93
54483A85438j44j247j620j089l09P63K579M277M252K682J539J713K100K049K581
54468B05564M227N668N814N674O673Q264Q678P316N155L180J408p02l377n915
54454B57627o954n954m296m039n459o823o727n542m363l674l469l660l895l705
54440A89067l195k815k398j343J85J309J768K161K665K700K077J373R24N04J49
$$ plain form
54543 288538 288889 289997 290773 290377 288314 285372 283544 283724 284149 282240 277396 270987 264310 257859 252223
54528 252223 248191 245578 242764 237963 230927 223387 217683 214662 213009 210970 208410 206423 205227 203634
54514 203634 200686 196612 191955 186964 182264 178836 176569 173900 169707 164846 161222 160107 161712 165390
54500 165390 169574 172489 173648 173965 174063 173593 172768 173131 175711 179379 182156 183403 183812 184028 184305 184845 185438
54483 185438 185294 184047 182427 181338 181029 181792 184371 188648 192900 195582 197121 198834 200934 202983 205564
54468 205564 209791 215459 221273 226947 233620 241884 250562 257878 263033 266213 267621 266919 263542 257627
54454 257627 250673 244719 240423 236384 230925 224102 217375 211833 207470 203796 200327 196667 192772 189067
54440 189067 185872 183057 180659 179316 179501 180810 182578 184739 187404 190104 192181 193554 194478 194982 195131
54425A95131K14N30O82J137K617M347M618L517L210M806O629O647N088L550K794
54410B45517K739L533N123O400O065M111J671k44j267j476j390j612j951j466
54396B65753O9J379J050q60l126m657m949l939k180q21o43j349k143k634k828
54381B38122k744k548k636l079l369l077k516k186j856p87J058K465K000k62k326
54366B16259k167j14J406Q43n56n75R64K275K277J785J917K524K588J460n45k309
54350B28032k577j046J243K973L733L682K755J234N84K287N774Q582Q812O717
54336B72785M047K515K788M065M814M456L979M203M333L277J483J7j376l613o198
54321C01575p702q014q235q416p353m761k024m81l51j375k996m032l694k882k876
$$ plain form
54425 195131 195345 195875 196557 197694 200311 204658 209276 212793 216003 220809 227438 234085 239173 242723 245517
54410 245517 248256 251789 256912 263312 269377 273488 275159 274915 273648 272172 270782 269170 267219 265753
54396 265753 265822 267201 268251 267391 264265 259608 254659 250720 248540 247719 247076 245727 243584 240950 238122
54381 238122 235378 232830 230194 227115 223746 220669 218153 215967 214111 213324 214382 216847 218847 218585 216259
54366 216259 214092 213978 215384 216227 215671 215096 216060 218335 220612 222397 224314 226838 229426 230886 230341 228032
54350 228032 225455 224409 225652 228625 232358 236040 238795 240029 240613 242900 248674 257256 266068 272785
54336 272785 276832 279347 282135 286200 291014 295470 299449 303652 307985 311262 312745 312762 311386 307773 301575
54321 301575 293873 285859 277624 269208 261855 257094 255070 254589 254238 252863 249867 245835 242141 239259 236383
54306B36383l178k433j157j176k504l183k437j533j177o08J62j84j575j916k59
54291B13225J572J814J036M65J30N6J113L119M015K698R21Q05K006L002L495L854
54275B43326L655K677K099K806L610K809O39j367k481k815k316j216n74r85j640
54260B48227j904k599m412o245o808o617o824p071o338m952l995l459k725k069
54246A82209k094k338k129k076l006m072l779k359j288q88l34K18n11k626m334
54231A50593m020j973K39J301R15j26n45K33J602K639K834J798o21l248l878j844
54215A45899P59J643J161J204K266L206L258K687J877J244J608L221M768M706
54201A79507L269J935J255N63m17j081j016n07%J47l25j140j480j085p20q98r90
$$ plain form
54306 236383 233205 230772 229615 228439 225935 222752 220315 218782 217605 216997 217159 216975 215400 213484 213225
54291 213225 214797 216611 217647 218112 218242 218298 219411 222530 226545 229243 230164 230969 232975 235977 239472 243326
54275 243326 246981 249658 251757 254563 258173 260982 261621 260254 257773 254958 252642 251426 250852 249867 248227
54260 248227 246323 243724 239312 233067 226259 219642 212818 205747 199409 194457 190462 187003 184278 182209
54246 182209 180115 177777 175648 173572 170566 166494 162715 160356 159068 158180 157846 158064 157553 154927 150593
54231 150593 146573 144600 144839 146140 147055 146929 146384 146617 148219 150858 153692 155490 154869 151621 147743 145899
54215 145899 146658 148301 149462 150666 152932 156138 159396 162083 163960 165204 166812 170033 174801 179507
54201 179507 182776 184711 185966 186529 186112 185031 184015 183508 183508 183655 183330 182190 180710 179625 178905 178007 177017
54184A77017n06j66n73r21k90P05R97P92P64M85o18j608j155K15Q31L45j93l18
54166A75803m78o98n88m18o46p82j63N96N21M9K44Q18P45K37K26M70J80K2J111
54147A77249K461K013L2j144q89r75k073k368q15P68K61j969m222n640o033n019
54131A51637k739l59J129J657J145o71k818l292j746l52p46j648j027P41J720
54116A42631J442J090J067L69j498l401l895k803j055M14J259J528J276N87j66
54101A38845m21j09J11j83m12R0P39L62r32j694j165k42o8o11j187j503j619j473
54083A28528r59j20R17J823J954J080J25K27J004Q02r49k755k903j500o8K31n37
54066A26900j441j597j015o42j082j546r27L73Q93L57KM07O50J62j49K75K43j283
$$ plain form
54184 177017 176511 176345 175772 174851 174561 175266 176263 177055 177819 178304 177686 176078 174923 175138 175969 176314 176121 175803
54166 175803 175325 174627 174039 173621 172975 172193 172030 172626 173147 173196 173440 174258 175003 175240 175466 175936 176116 176138 177249
54147 177249 179710 181723 181755 180611 179722 178747 176674 174306 173491 174259 174520 172551 168329 162689 156656 151637
54131 151637 148898 148539 149668 151325 152470 151799 148981 145689 143943 143591 142845 141197 140170 140911 142631
54116 142631 144073 145163 146230 146599 145101 141700 137805 135002 133947 134361 135620 137148 138424 139011 138845
54101 138845 138424 138315 138426 138243 137831 137921 138660 139022 138090 136396 135231 134989 134921 134310 133123 131620 130001 128528
54083 128528 127569 127449 128366 130189 132143 133223 133348 133575 134579 135381 134432 131677 128774 127274 127206 127437 126900
54066 126900 125459 123862 122847 122205 121123 119577 118650 119023 119916 120273 120275 120682 121332 121494 121345 121620 121863 120580
54048A20580k995k732o27J041J032N42J021K046K189J186K21L29J272K131K397
54033A29633K220J866J328N24m10j197j595j440p61M0M81O59J202K202K673J686
54017A39111k24j457j154K5R37J168J022P57K81l58n72L48K108L199K355J66j502
54000A46210j652q86o3O33R64L87o64n16J620M173N115M548M085M288M230L341
53984A75813K303J954K289K727K768K454K460L351M564N025N061O192Q287Q740
53970B33988O083K782K277M422O216O230N757N988O749P983R968J1648J1099Q243
53956C29433N198L510K891K879L563M202L428J609Q42J670J868l34l732o206p530
53941C43291q702r780r997r074p242m868k870k459l495m256l728k978l333m460
$$ plain form
54048 120580 117585 114853 114226 115267 116299 116841 117862 119908 122097 123283 123504 123833 125105 127236 129633
54033 129633 131853 133719 135047 135571 135161 133964 132369 130929 130168 130208 130689 131348 132550 134752 137425 139111
54017 139111 138887 137430 136276 136301 137238 138406 139428 140185 140466 140108 139536 139884 141992 145191 147546 147712 146210
54000 146210 144558 143672 143609 144242 145206 145593 144929 144413 146033 150206 155321 159869 163954 168242 172472 175813
53984 175813 178116 180070 182359 185086 187854 190308 192768 196119 200683 205708 210769 216961 225248 233988
53970 233988 240071 242853 245130 249552 255768 261998 267755 273743 280492 288475 298443 310091 321190 329433
53956 329433 334631 338141 341032 343911 347474 351676 355104 356713 357555 359225 361093 360759 357027 350821 343291
53941 343291 334589 324809 314812 305738 298496 293628 290758 288299 284804 280548 276820 273842 270509 266049
53927B66049n341n840o071n404l583j934j851k677k635j420m58o69j311j204j07
53912B25544J360K586L280L180J886n49k838l024o55K216L115J814p4j483k221
53897B34137j584J096M457N919N048L969L906L627K292J377K233L674L880L037
53883B77068K360J969J572K009M133P080R308J0400J0463R018O430N017O474Q988
53869C62289R270O904M273K651R97j148k250j213O97J631J556J818L062M536N089
53854D00162M346K991J986J530J195J236K820O168R334J0222R265Q661R243R633
53840D78792Q512O200L697J507j08q95j243k137l795n121n194m709n099o507p543
53825D56357p182o354o938r351j1750j2128j0685r282q851q597p880p402p698
$$ plain form
53927 266049 260708 254868 248797 243393 239810 237876 236025 233348 230713 229293 228835 228166 226855 225651 225544
53912 225544 226904 229490 232770 235950 237836 237287 234449 231425 230770 232986 236101 237915 237841 236358 234137
53897 234137 232553 233649 238106 244025 249073 253042 256948 260575 262867 264244 266477 270151 274031 277068
53883 277068 279428 281397 282969 284978 289111 296191 305499 315899 326362 335380 341810 346827 353301 362289
53869 362289 371559 378463 382736 385387 386384 385236 382986 381773 382470 384101 385657 387475 390537 395073 400162
53854 400162 404508 407499 409485 411015 412210 413446 416266 422434 431768 441990 451255 459916 469159 478792
53840 478792 487304 493504 497201 498708 498600 497705 496462 494325 490530 485409 480215 475506 470407 463900 456357
53825 456357 449175 442821 435883 426532 414782 402654 391969 382687 373836 365239 357359 349957 342259
53812C42259p794o666n176n098o529p790p850p397p185o705n257l550l122m324
53798B57816n674n601m357l624m276n382n730n493n317m620k317Q49K488J558
53784B10320k86j101r66j009j426j689j694j516q38K72P96J56o41m77N6l88j691
53767A97878k497k175j187J57J873L353L594K555J241N51P40J722K853K867J203
53752B14728q32j472p85k83n50o60M1J167K367L729M845M993M688N502P632R033
53736B54143Q060N884N007O068P385P404O381N471N082M674L825K969K937L842
53722C29132M716M422K902J387J230K594M215M463K773L8k377l852m499m362l365
53707C39417k065j559k255l361l950l906l514k783j811j170j303j936k538k944
$$ plain form
53812 342259 334465 327799 322623 317525 310996 303206 295356 287959 280774 274069 268812 265262 262140 257816
53798 257816 252142 246541 242184 238560 234284 228902 223172 217679 212362 207742 205425 206274 208762 210320
53784 210320 210034 208933 207967 206958 205532 203843 202149 200633 199795 200067 200863 201019 200378 199901 199957 199569 197878
53767 197878 195381 193206 192019 192176 194049 197402 200996 203551 204792 205343 206083 207805 210658 213525 214728
53752 214728 213896 212424 211639 211356 210806 210146 210187 211354 213721 217450 222295 227288 231976 237478 245110 254143
53736 254143 262203 268087 273094 279162 286547 293951 300332 305803 310885 315559 319384 322353 325290 329132
53722 329132 333848 338270 341172 342559 343789 346383 350598 355061 357834 357872 355495 351643 347144 342782 339417
53707 339417 337352 335793 333538 330177 326227 322321 318807 316024 314213 313043 311740 309804 307266 304322
53693C04322l137k995k732k963l776m383m220l649l082k284j356j343k717m035
53679B61650l516j559k38m42q68q3J567K521J793j31j723j678j42J363J513M35
53663B60462q58j771k271k206j342RJ101J572J737K084K702L148K852J948J467
53648B70634K114L002K724J620J564L162M673M563L598L318L773M159M500N209
53634C18613N802N596N014M859M939M665M377M792N719O553P193P368O183L834
53620C95507K532L803N873N880L887K306K011J701J034J403L067M057K998J092
53606D37151J99M86R06P77Qj133j948j915j739k667m523n621m967l386k154j639
53590D07835j624j806j728j201r36j605k408j848o3J227J140M52j40q13j293n79
$$ plain form
53693 304322 301185 298190 295458 292495 288719 284336 280116 276467 273385 271101 269745 268402 265685 261650
53679 261650 258134 256575 256337 255895 255027 254944 256511 259032 260825 260694 258971 257293 257151 258514 260027 260462
53663 260462 259604 257833 255562 253356 252014 252023 253124 254696 256433 258517 261219 264367 267219 269167 270634
53648 270634 272748 275750 278474 280094 281658 284820 289493 294056 297654 300972 304745 308904 313404 318613
53634 318613 324415 330011 335025 339884 344823 349488 353865 358657 364376 370929 378122 385490 391673 395507
53620 395507 398039 401842 407715 413595 417482 419788 421799 423500 424534 425937 429004 433061 436059 437151
53606 437151 437350 437836 438742 439519 439527 438394 436446 434531 432792 430125 425602 419981 415014 411628 409474 407835
53590 407835 406211 404405 402677 401476 400540 398935 396527 394679 394616 395843 396983 397435 397295 396482 395189 394610
53574C94610J305K945L469L420L148K152Q96J235L697N941N606L489K257K830
53560D37000L747L660K871K382K561L017L294L483M217N739P100P097O104N951
53546D98223P538R590J0430J0075R733R852R626Q287O263M925N311O983Q395Q629
53532F13860Q409Q777R383R090P827O536N552M530L821M288N536N969N135M409
53518G03122M808N544N466M685L922L420L135L049K743J681L13k09K91Q82J224
53503G44076J905K711K445J108M11J091J596P04k79M77K542M070M374M128L848
53488G75207L678L880M235L694J903K10m2N79P80P34J595L471N387O763P594P597
53472H27265O623N646O015P734R446J0002R424Q793R714J3015J7151J9021J7624
$$ plain form
53574 394610 395915 398860 402329 405749 408897 411049 411945 413180 416877 422818 428424 431913 434170 437000
53560 437000 440747 444407 447278 449660 452221 455238 458532 462015 466232 471971 479071 486168 492272 498223
53546 498223 505761 515351 525781 535856 545589 555441 565067 573354 579617 584542 589853 596836 605231 613860
53532 613860 622269 631046 640429 649519 657346 663882 669434 673964 677785 682073 687609 693578 698713 703122
53518 703122 707930 713474 718940 723625 727547 730967 734102 737151 739894 741575 741888 741679 741970 742852 744076
53503 744076 745981 748692 751137 752245 752656 753747 755343 756047 755768 756245 758787 762857 767231 771359 775207
53488 775207 778885 782765 787000 790694 792597 792807 792765 793344 794124 794858 796453 799924 805311 812074 819668 827265
53472 827265 833888 839534 845549 853283 862729 872731 882155 890948 900662 913677 930828 949849 967473
53459I67473J5722J6388J9010K0780K1198K2466K5475K8149K8677K8156K8616
53448A222110L0004L0829L1015L2252L5477L9332M1777M2613M3469M5433M7552
53437A641863M8345M8160M8820N1022N3350N4392N4603N5201N6187N6591N6163
53426B224697N5624N5429N5270N4879N4543N4626N4957N4818N3458N0928M8452
53415B817681M7475M8126M9042M8921M7586M5416M2717L9999L7955L6465L4476
53404C295859L1464K8208K5455K2702J9194J5369J2293J0062P716M371n0m934
53392C467709r395j3011j6328j9977k3380k5511k7021k9925l4538l8519m0095
53381C190009m0579m2167m4728m6564m7230m7609m7899m7503m6609m6157m6398
$$ plain form
53459 967473 983195 999583 1018593 1039373 1060571 1083037 1108512 1136661 1165338 1193494 1222110
53448 1222110 1252114 1282943 1313958 1346210 1381687 1421019 1462796 1505409 1548878 1594311 1641863
53437 1641863 1690208 1738368 1787188 1838210 1891560 1945952 2000555 2055756 2111943 2168534 2224697
53426 2224697 2280321 2335750 2391020 2445899 2500442 2555068 2610025 2664843 2718301 2769229 2817681
53415 2817681 2865156 2913282 2962324 3011245 3058831 3104247 3146964 3186963 3224918 3261383 3295859
53404 3295859 3327323 3355531 3380986 3403688 3422882 3438251 3450544 3460606 3468322 3472693 3472643 3467709
53392 3467709 3458314 3445303 3428975 3408998 3385618 3360107 3333086 3303161 3268623 3230104 3190009
53381 3190009 3149430 3107263 3062535 3015971 2968741 2921132 2873233 2825730 2779121 2732964 2686566
53370B686566m6730m6697m5873m3364l8864l3804l0054k7826k6101k4480k3099
53359B299674k1282j8173j4503j1957j0731r262o415k415K331P695J2941J6894
53347B244797J9505K2106K5783L0316L4772L8381M0963M3323M6790N1387N5225
53336B653348N6987N8136O0987O5327O9113P1907P5129P9026Q2114Q4155Q7079
53325C443308R1869R6746R9627J00670J01250J02164J03875J06854J10399J12539
53315D469301J12396J11298J10430J08894J05575J01412R8010R5102R1258Q6328
53305E490004Q1233P5888O9246O1289N3237M5626L7665K8764J9392J0096Q39q240
53293E965039j6500k3802l1068l9173m7710n5410o1486o6339p1234p7411q5079
$$ plain form
53370 2686566 2639836 2593139 2547266 2503902 2465038 2431234 2401180 2373354 2347253 2322773 2299674
53359 2299674 2278392 2260219 2245716 2233759 2223028 2213766 2207351 2204936 2207267 2214962 2227903 2244797
53347 2244797 2264302 2286408 2312191 2342507 2377279 2415660 2456623 2499946 2546736 2598123 2653348
53336 2653348 2710335 2768471 2829458 2894785 2963898 3035805 3110934 3189960 3272074 3356229 3443308
53325 3443308 3535177 3631923 3731550 3832220 3933470 4035634 4139509 4246363 4356762 4469301
53315 4469301 4581697 4692995 4803425 4912319 5017894 5119306 5217316 5312418 5403676 5490004
53305 5490004 5571237 5647125 5716371 5777660 5830897 5876523 5914188 5942952 5962344 5972440 5973279 5965039
53293 5965039 5948539 5924737 5893669 5854496 5806786 5751376 5689890 5623551 5552317 5474906 5389827
53282E389827r2914r9024j02781j05287j07544j08770j07558j04487j02239j02456
53272D356767j03656j03379j01493r9803r8786r6763r2751q8232q4998q2671p9826
53261C324409p6452p3654p1565o9109o5568o1021n5673n0102m5719m3341m1638
53250B670567l8672l4717l1550k9164k5615k0604j6530j4777j3413j0380o829
53239B428316n010m251j887K508O529Q663J0146J2626J6003J9487K2899K5839
53227B541868K7189K6996K7681L1535L7390M1619M2547M2310M3874M7548N1314
53216B961871N3496N3966N3238N1734M9962M8316M6384M3293L9130L5252L2631
53205C469273L0483K7169K2214J6804J2327Q922N619J615k802o669r644j2510
$$ plain form
53282 5389827 5296913 5197889 5095108 4989821 4882277 4773507 4665949 4561462 4459223 4356767
53272 4356767 4253111 4149732 4048239 3948436 3849650 3752887 3660136 3571904 3486906 3404235 3324409
53261 3324409 3247957 3174303 3102738 3033629 2968061 2907040 2851367 2801265 2755546 2712205 2670567
53250 2670567 2631895 2597178 2565628 2536464 2510849 2490245 2473715 2458938 2445525 2435145 2428316
53239 2428316 2423306 2419055 2417168 2419676 2426205 2434868 2445014 2457640 2473643 2493130 2516029 2541868
53227 2541868 2569057 2596053 2623734 2655269 2692659 2734278 2776825 2819135 2863009 2910557 2961871
53216 2961871 3015367 3069333 3122571 3174305 3224267 3272583 3318967 3362260 3401390 3436642 3469273
53205 3469273 3499756 3526925 3549139 3565943 3578270 3587192 3592811 3594426 3591624 3584955 3575311 3562801
53193C562801j6152k0308k3900k6537k8990l2197l6345m0939m5119m7968m9371
53182C194975n0656n3311n6808n8878n8405n6883n6353n7051n7968n8579n8728
53171B571355n7672n4793n0932m7801m6130m5298m4487m3362m1877m0204l8711
53160B060088l7396l5781l3840l2361l1685l0981k9646k8502k8418k8618k7682
53149A715178k5610k3508k1919k0881k0884k2043k2905k2001k0275k0043k1592
53138A473517k2921k2888k2505k2647k2553k1503k0288j9843j9814j9491j9204
53127A239860j9737k1052k2479k3641k4533k4996k4707k3590k2122k1189k1331
53116I90483k1871k1547k0445k0274k1688k2645k1051j7967j6152j6132j6113
$$ plain form
53193 3562801 3546649 3526341 3502441 3475904 3446914 3414717 3378372 3337433 3292314 3244346 3194975
53182 3194975 3144319 3091008 3034200 2975322 2916917 2860034 2803681 2746630 2688662 2630083 2571355
53171 2571355 2513683 2458890 2407958 2360157 2314027 2268729 2224242 2180880 2139003 2098799 2060088
53160 2060088 2022692 1986911 1953071 1920710 1889025 1858044 1828398 1799896 1771478 1742860 1715178
53149 1715178 1689568 1666060 1644141 1623260 1602376 1580333 1557428 1535427 1515152 1495109 1473517
53138 1473517 1450596 1427708 1405203 1382556 1360003 1338500 1318212 1298369 1278555 1259064 1239860
53127 1239860 1220123 1199071 1176592 1152951 1128418 1103422 1078715 1055125 1033003 1011814 990483
53116 990483 968612 947065 926620 906346 884658 862013 840962 822995 806843 790711 774598
53105G74598j5353j4926j5049j4479j3204j3077j4634j5741j4686j2609j1357
53094F19483j0908j0408j0050j0149r754q002n849m855n172o024p116q150q100
53081E14946o531m881m810n880o335n669m879m672m761m767m583m069l324l067
53067D46718l685m359l965k629j426q26l77K86Q91R49J57j372k856l262k425j358
53051D20461j010j277j600j798j794j297l83K96N13R16J947L016L442L342K999
53036D27773K228J153O36J048J367M62j422l316m861o083o589o052n023m401m476
53021C92444n088o081o975p003o063m942m118l317k692l045m190m675m063l857
53007C26335m892n596m511k862k566l111k818k066k558m027m416l255k298k561
$$ plain form
53105 774598 759245 744319 729270 714791 701587 688510 673876 658135 643449 630840 619483
53094 619483 608575 598167 588117 577968 568214 560212 554363 549508 544336 538312 531196 523046 514946
53081 514946 508415 503534 498724 492844 486509 480840 475961 471289 466528 461761 457178 453109 449785 446718
53067 446718 443033 438674 434709 432080 430654 429828 429451 429737 430628 431577 431734 430362 427506 424244 421819 420461
53051 420461 419451 418174 416574 414776 412982 411685 411302 411598 412111 413027 414974 417990 421432 424774 427773
53036 427773 430001 431154 431790 432838 434205 434667 433245 429929 425068 418985 412396 406344 401321 396920 392444
53021 392444 387356 381275 374300 367297 361234 356292 352174 348857 346165 343120 338930 334255 330192 326335
53007 326335 321443 315847 311336 308474 305908 302797 299979 297913 295355 291328 286912 283657 281359 278798
52993B78798l044k786k168j555n66P52J508J374R95O10k89j571k155j661j009
52978B67233q70p83l60j04l89q10j097j650k521k866k111q54j13k17p76j060l82
52961B50270J042J603j40l302n320n052l842l093k369q55O28N30j215l048l531
52946B22306k352q9K202L364K899J418N1m79p5Q99J792K121K075K103K010J213
52930B41458rn35p3K02n67j564j620j033q53r45k10J467K850L169L025L069K843
52913B50674J745L13l49q4L82P87J674L241M659N108M849M763N129N483N348M657
52897B98379L654K922L276M921O822P596O983N807M655L537K741K873L710M033
52883C61909L036J132r96l014m179l306n68J606Q32k405n214n414l352r06M14
$$ plain form
52993 278798 275754 272968 270800 269245 268679 269431 270939 272313 273308 273918 273629 272058 269903 268242 267233
52978 267233 266363 265580 265220 265116 264727 263917 262820 261170 258649 255783 253672 252818 252705 252488 251712 250652 250270
52961 250270 251312 252915 252775 249473 244153 239101 235259 232166 229797 228942 229570 230100 228885 225837 222306
52946 222306 219954 219865 222067 225431 228330 229748 229799 229320 229245 230144 231936 234057 236132 238235 240245 241458
52930 241458 241449 240914 240841 241043 240476 238912 237292 236259 235406 234461 234251 235718 238568 241737 244762 247831 250674
52913 250674 252419 252732 252383 252299 252681 253468 255142 258383 263042 268150 272999 277762 282891 288374 293722 298379
52897 298379 302033 304955 308231 313152 319974 327570 334553 340360 345015 348552 351293 354166 357876 361909
52883 361909 364945 366077 365081 362067 357888 354582 354014 355620 356452 354047 348833 343419 340067 339161 339575
52868C39575M38j5k87p27j977l499l808k542j164r67j433j405q52m13j7P31J479
52851C23117J594J238R46O82K11j72k48m22q01o92j5J4j016j379K22K060J657
52834C26996l00r42N28K274L173L822M038K460o03k637k377j495j676k196j733
52819C29332n94L36J053J564J194K58N89K707M194K946N78J89J685K035jk048
52803C46017j545J002L205L802L352K650J724L96q68j207m86L34K66m23o07J87
52787C57799J405K527L546M202L891K837K384L272M438M396L284K650L414M920
52773D04965N788N193L375J386K72K80R38J783K544K640J432q18k835l691l706
52758D19546l751m259n082n710n382l909k540k993n110o656o154m870m953o459
$$ plain form
52868 339575 340013 339998 339711 338984 337007 333508 329700 327158 325994 325027 323594 322189 321337 320924 320907 321638 323117
52851 323117 324711 325949 326895 327577 327788 327616 327368 326946 326145 325453 325438 325452 324436 323057 323279 325339 326996
52834 326996 326696 325754 326282 328556 331729 335551 339589 342049 341446 338809 336432 334937 333261 331065 329332
52819 329332 328738 329074 330127 331691 332885 333143 333732 336439 340633 343579 344157 344346 346031 348066 348065 346017
52803 346017 344472 345474 348679 352481 355833 358483 360207 360603 359735 358528 358042 358376 358642 358219 357612 357799
52787 357799 359204 361731 365277 369479 373370 376207 378591 381863 386301 390697 393981 396631 400045 404965
52773 404965 410753 415946 419321 420707 420979 421259 422197 423980 426524 429164 430596 429778 426943 423252 419546
52758 419546 415795 411536 406454 400744 395362 391453 388913 385920 380810 374154 368000 363130 358177 351718
52744C51718p507o914n386m217l867l991m175m353m751n384n563m395k061j12
52730B89042j2j654l642m596l960k139l20K86m66j646k467k953l183k808j863
52715B57619j250j647k545k997k777k115j046K27P65k54k325l965m090k769j054
52700B29777m59j832m081m835l161r05l39j256j677r41m21j369l421n454o719
52685A92907o780n559l895l099l384l514k515j022k68m13o63o52p75j162j230
52670A57976o39j22o89k180l215k688q65J230K876L666L188J522k52j012r75j133
52654A56688j417p41Q79J676M50j625k645k455k278k482k196r56O65K162L607
52639A49332M685M376K368M2p60K90J877K739K861K961L365L810M130M540N118
$$ plain form
52744 351718 344211 337297 331911 327694 323827 319836 315661 311308 306557 301173 295610 291215 289154 289042
52730 289042 289030 287376 283734 279138 275178 273039 272719 273005 272539 270893 268426 265473 262290 259482 257619
52715 257619 256369 254722 252177 249180 246403 244288 243242 243469 244234 243980 241655 237690 233600 230831 229777
52700 229777 229318 227486 223405 218570 215409 214504 214165 212909 211232 210291 209870 208501 205080 199626 192907
52685 192907 186127 180568 176673 173574 170190 166676 164161 163139 162871 162458 161795 161143 160368 159206 157976
52670 157976 157337 157215 156526 154346 151131 148443 147578 148808 151684 155350 158538 160060 159808 158796 157821 156688
52654 156688 155271 154530 155409 157085 157535 155910 153265 150810 148532 146050 143854 142898 143563 145725 149332
52639 149332 154017 158393 160761 160803 160043 160333 162210 164949 167810 170771 174136 177946 182076 186616 191734
52624A91734N487N273M635L949L288K621K227K346K570K197J139q4j164k216l252
52609B20750m027m407m271l303j688o83j448l349m602m570m179l907l024j325
52595A75967m0m6m60j66M38L56j93l53l21j097k733m018l916k534q82r1o27j670
52577A57614j746m63R43J261P41J79m64j494k227j530O53L176M767M562K271j163
52561A67080l673l986k958k105j520m37Q09J101N44M92J348J794O79j485l265
52546A54418l696k675q27P80J475J691K196K709K253R11Q9O74J819K102J301M85
52530A65705P24K021L343L557K458Q65m05j231j603j046O31K478L153K421J224
52515A84295N53Q78K278M199N366M860L215J608L76p72j432p87Q54K018J903J124
$$ plain form
52624 191734 197221 202494 207129 211078 214366 216987 219214 221560 224130 226327 227466 227382 226218 224002 220750
52609 220750 216723 212316 208045 204742 203054 202371 200923 197574 192972 188402 184223 180316 177292 175967
52595 175967 175927 175881 175421 175255 175693 176049 175856 175503 175182 174085 171352 167334 163418 160884 160002 159911 159284 157614
52577 157614 155868 155405 156348 157609 158350 158529 158065 156571 154344 152814 153467 156643 161410 165972 168243 167080
52561 167080 163407 159421 156463 154358 152838 152401 153210 154311 154855 155347 156695 158489 159168 157683 154418
52546 154418 150722 148047 147220 148000 149475 151166 153362 156071 158324 159235 159324 159998 161817 163919 165220 165705
52530 165705 166429 168450 171793 175350 177808 178673 178268 177037 175434 174388 175019 177497 180650 183071 184295
52515 184295 184848 185726 188004 192203 197569 202429 205644 207252 207628 206856 205424 204637 205491 207509 209412 210536
52499B10536N55M05O88J587K922M007M370M153L710L420L688M360M360K873P77
52484B52411k42K27J265K451M104N558N132K557j38j057m72M16J370K509L093
52469B79184K445J345J021J267R76J76LO71R00k31j880k394r84J709M172M899
52453B93279L407P65j329k141k250k275k017j205m27m72j064j102k87K80n08k215
52437B80439l290k831j458m94o17j344j599q37K60N61J42M67K244L781K830j45
52421B78109k128j282R80K300K263J892J576J020M91O09J240J877K732M189N426
52406C01294N014K872M79r45j382j124k14R53J537J218N34j7m87q66p17J90J313
52389C09652J754J058l47j381j280n64l78o82j12J645K738J793M70J314L750M590
$$ plain form
52499 210536 211091 211496 212184 213771 216693 220700 225070 229223 232933 236353 240041 244401 248761 251634 252411
52484 252411 252169 252396 253661 256112 260216 265774 270906 273463 273325 272268 271796 272212 273582 276091 279184
52469 279184 281629 282974 283995 285262 286238 286414 286417 287088 287988 287757 285877 283483 282499 284208 288380 293279
52453 293279 296686 297451 296122 293981 291731 289456 287439 286234 285807 285335 284271 283169 282882 283162 282654 280439
52437 280439 277149 274318 272860 272366 271749 270405 268806 267969 268229 268790 268932 269399 271643 275424 278254 278109
52421 278109 275981 274699 275679 277979 280242 282134 283710 284730 285221 285830 287070 288947 291679 295868 301294
52406 301294 306308 309180 309659 308714 307332 306208 305994 306947 308484 309702 310236 310219 309732 308866 308149 308339 309652
52389 309652 311406 312464 312117 310736 309456 308892 308514 307832 307720 309365 312103 313896 314366 315680 319430 324020
52373C24020K433p03k575l247l681l789l251k739k892l003j955R3J884K438J798
52358C04831R07J046K513L734K796J32j689j326k60k79r52p95L09J404K190K870
52342C17431K907J561m72j341j39K021L206K421L45j308j342l02K69j99q04q01
52326C23453n66m10K66J591K253J217l92o96K42P04J25n7J337L412M269L216J373
52309C41337M47J134K507L096K603K211K829L791L924L335L036L283L569M058
52295C81160N611P881Q811P021L959K495L624N602O377N891N347N135M646L873
52281D57433L826M920O061O135N511N135M953M500M303N057N799M797K461J386
52267E22277K951N589P184P540P405O701N242M062M337N602O488O748P255Q373
$$ plain form
52373 324020 326453 325750 323175 319928 316247 312458 309207 306468 303576 300573 298618 298711 300595 303033 304831
52358 304831 305738 306784 309297 313031 315827 315959 314270 312944 312684 312405 311453 310658 310967 312371 314561 317431
52342 317431 320338 321899 321427 320086 319947 321968 325174 327595 327940 326632 325290 324988 325257 325058 324254 323453
52326 323453 322887 322477 322743 324334 326587 327804 327412 326716 326958 327662 327787 327730 329067 332479 336748 339964 341337
52309 341337 341784 342918 345425 348521 351124 353335 356164 359955 363879 367214 370250 373533 377102 381160
52295 381160 386771 394652 403463 410484 414443 416938 420562 426164 432541 438432 443779 448914 453560 457433
52281 457433 461259 466179 472240 478375 483886 489021 493974 498474 502777 507834 513633 518430 520891 522277
52267 522277 525228 530817 538001 545541 552946 559647 564889 568951 573288 578890 585378 592126 599381 607754
52253F07754R598J0567J1377J2066J2656J3490J4700J5723J6145J6500J7331J8062
52241G75969J7940J7616J8429K0315K1725K1736K1058K0815K1303K2239K3323
52230A002468K4310K5060K5682K6235K6416K6142K6113K6952K7972K7750K5956
52219A291056K3774K2343K1571K0665J9179J7220J5138J3346J2185J1812J2066
52208A480355J2218J1020P872M195K554L603M927M064J746O64J622K817K810K168
52194A542635J786J307K59o16k61J199K826M189N486O778P858Q685R449J0377
52180A601957J1747J3692J5708J6698J6086J4676J3986J4811J6631J8187J8464
52169A772643J7279J5325J3575J2484J1692J0613R128P562O075M315J913q39l029
$$ plain form
52253 607754 617352 627919 639296 651362 664018 677508 692208 707931 724076 740576 757907 775969
52241 775969 793909 811525 829954 850269 871994 893730 914788 935603 956906 979145 1002468
52230 1002468 1026778 1051838 1077520 1103755 1130171 1156313 1182426 1209378 1237350 1265100 1291056
52219 1291056 1314830 1337173 1358744 1379409 1398588 1415808 1430946 1444292 1456477 1468289 1480355
52208 1480355 1492573 1503593 1511465 1515660 1518214 1521817 1526744 1530808 1532554 1533218 1534840 1537657 1540467 1542635
52194 1542635 1544421 1545728 1545987 1545371 1545110 1546309 1549135 1553324 1558810 1565588 1573446 1582131 1591580 1601957
52180 1601957 1613704 1627396 1643104 1659802 1675888 1690564 1704550 1719361 1735992 1754179 1772643
52169 1772643 1789922 1805247 1818822 1831306 1842998 1853611 1862739 1870301 1876376 1880691 1882604 1881765 1878736
52156A878736m098m482n047o119p482r055j0926j2719j3711j3724j3335j2996
52144A765042j2638j2323j2515j3401j4573j5684j6521j6373j4453j1416r154
52133A615991q319p407n254l035k319k530k234j877k863m474m261j845N1p96l294
52118A565534m853m526l281k222j762j932k464k877l042l351m014m637m827m723
52104A517023m586m399m163m141m471m921n211n264n146n083n434o123o315n343
52090A446423l853l181l688m563n192n670n906n336m005l009l352m939o925q283
52076A378521q030n869k975j155q42q39m35m85j798l508m212l924l773m261m869
52061A331546n128n066m615l563k224j479j727k219j764K6K409M428N919P380
$$ plain form
52156 1878736 1874638 1870156 1865109 1858990 1851508 1842453 1831527 1818808 1805097 1791373 1778038 1765042
52144 1765042 1752404 1740081 1727566 1714165 1699592 1683908 1667387 1651014 1636561 1625145 1615991
52133 1615991 1607672 1600265 1595011 1591976 1589657 1587127 1584893 1583016 1580153 1575679 1571418 1569573 1569624 1568828 1565534
52118 1565534 1560681 1556155 1552874 1550652 1548890 1546958 1544494 1541617 1538575 1535224 1531210 1526573 1521746 1517023
52104 1517023 1512437 1508038 1503875 1499734 1495263 1490342 1485131 1479867 1474721 1469638 1464204 1458081 1451766 1446423
52090 1446423 1442570 1439389 1435701 1431138 1425946 1420276 1414370 1409034 1405029 1402020 1398668 1393729 1386804 1378521
52076 1378521 1370491 1364622 1361647 1360492 1359650 1358811 1358376 1357891 1356093 1352585 1348373 1344449 1340676 1336415 1331546
52061 1331546 1326418 1321352 1316737 1313174 1310950 1309471 1307744 1305525 1303761 1303787 1306196 1310624 1316543 1323923
52047A323923R062J0602J1731J2712J3748J4560J5107J6204J8480K1154K2840
52036A490123K3475K4378K6394K8879L0681L1260L0820L0107L0209L1583L3165
52025A811074L3323L1709K9362K7052K4687K2359K0616J9337J7628J5261J2936
52014B065344J0747P815M129J230J09l53j653l577n110o396q245j0285j1165j0572
52000B032018r684r595j0143j0468j0006q856p576o610n832m842l803l305l141
51987A938157k045O94L999O016N976M727L895M703O790Q000O453L203J485K752
51973A994805M960N725N434N629N860M436J484r70j829j961k511l802n903q613
51959B002744j0855j1663j1809j3011j5519j7945j9459k0466k1064k0822k0396
$$ plain form
52047 1323923 1332985 1343587 1355318 1368030 1381778 1396338 1411445 1427649 1446129 1467283 1490123
52036 1490123 1513598 1537976 1564370 1593249 1623930 1655190 1686010 1716117 1746326 1777909 1811074
52025 1811074 1844397 1876106 1905468 1932520 1957207 1979566 2000182 2019519 2037147 2052408 2065344
52014 2065344 2076091 2083906 2088035 2089265 2089374 2089021 2087368 2083791 2078681 2072285 2064040 2053755 2042590 2032018
52000 2032018 2022334 2012739 2002596 1992128 1982122 1973266 1965690 1959080 1953248 1948406 1944603 1941298 1938157
51987 1938157 1936112 1936806 1940805 1946821 1952797 1957524 1961419 1966122 1972912 1980912 1987365 1990568 1992053 1994805
51973 1994805 1999765 2005490 2010924 2016553 2022413 2026849 2028333 2027363 2025534 2023573 2021062 2017260 2011357 2002744
51959 2002744 1991889 1980226 1968417 1955406 1939887 1921942 1902483 1882017 1860953 1840131 1819735
51948A819735k1341k3560k4966k4606k4298k5792k8050k9018k8766k8930k9952
51937A530456l0763l0843l0769l0853l0741l0464l0641l1440l2347l2980l3164
51926A185451l2426l0544k8636k8337k9666l0894l0848l0055k9172k7717k5273
51915H61883k2831k1599k1260k0664j9714j9236j9243j8757j7389j5855j4671
51904F50664j3483j2084j1082j0956j1300j1506j1492j1273j0677r984r951j0500
51892E16376j0367q910p333o933p019n979l823k063j487j666k477m187n849n679
51878D42604l633j861j735k117j568p02q15j530j603j197j497k526l043k551j886
51863D14340j718j777j815k098k649l007l150l739n004o123o237n491m586l748
$$ plain form
51948 1819735 1798394 1774834 1749868 1725262 1700964 1675172 1647122 1618104 1589338 1560408 1530456
51937 1530456 1499693 1468850 1438081 1407228 1376487 1346023 1315382 1283942 1251595 1218615 1185451
51926 1185451 1153025 1122481 1093845 1065508 1035842 1004948 974100 944045 914873 887156 861883
51915 861883 839052 817453 796193 775529 755815 736579 717336 698579 681190 665335 650664
51904 650664 637181 625097 614015 603059 591759 580253 568761 557488 546811 536827 526876 516376
51892 516376 506009 497099 489766 482833 475814 469835 466012 463949 462462 460796 458319 454132 448283 442604
51878 442604 438971 437110 435375 433258 431690 430988 430173 428643 427040 425843 424346 421820 418777 416226 414340
51863 414340 412622 410845 409030 406932 404283 401276 398126 394387 389383 383260 377023 371532 366946 363198
51849C63198k674j344m70r03k593m279m546l326j958j548j772j639r85m46l85
51834C34330n48p12r28j162j263j268j324j374j370j575k119k441j850n42N28
51819C16382P36K12o61j517j862j369m36J23j1m18n37k8J143K368K448Q67j122
51802C16318j685o90J95j58r50q63J30J084J569K057L050M418N569N967N495M472
51786C45978L298K171J227P67R33J323J376J013N28R3j44K74J508K656K451Q69
51770C66321p25j228q76m76l32k67q3K94P20P52K21j81M47J802K523J903O91q3
51752C71423k13M7N46R65P90J05k81lL64M02N93J260J602P33r09k140k480k255
51734C70549j658o60M26J173J637K044K173J709J040R21J590K716L874M492L872
$$ plain form
51849 363198 360524 359180 358710 357807 355214 350935 346389 343063 341105 339557 337785 336146 335161 334715 334330
51834 334330 333782 333070 332142 330980 329717 328449 327125 325751 324381 322806 320687 318246 316396 315854 316382
51819 316382 317118 317330 316669 315152 313290 311921 311485 311608 311597 311179 310642 310614 311757 314125 316573 317440 316318
51802 316318 314633 313943 314138 313980 313030 312167 312297 313381 314950 317007 320057 324475 330044 336011 341506 345978
51786 345978 349276 351447 352674 353441 354374 355697 357073 358086 358614 358707 358563 358837 360345 363001 365452 366321
51770 366321 365596 364368 363492 363016 362684 362417 362334 362628 363348 364100 364321 364140 364587 366389 368912 370815 371506 371423
51752 371423 371210 371257 371803 372768 373558 373663 373382 373379 373743 374145 374738 375998 377600 378333 377424 375284 372804 370549
51734 370549 368891 368231 368657 369830 371467 373511 375684 377393 378433 379354 380944 383660 387534 392026 395898
51719C95898K152P77J021K351L223L117K583J665n1j792j676Q23L858N411N465
51704D24825N222N146M856M190L392K673K427L378N629P961Q957Q525P532O447
51690E01160N388N105O520R198J1530J2772J3755J5222J6555J6960J6872J7351
51678F48388J8628K0196K1662K2489K1390J7287J0906M417o61m273o677p743p901
51665G58108q583j0652j3014j3737j2246r684p396n818m778m120l913m473o123
51652F53571q421r887r236o922m742l767l407k832k361k823m030m865m806m540
51638E80932m845n344m960l399j758j353k213l060k815j685n80J41Q82J891K763
51623E54597L045K955L240M314N654O095M866K440J30j330k426l713m580l916
$$ plain form
51719 395898 398050 398827 399848 402199 405422 408539 411122 412787 412736 410944 409268 410091 413949 419360 424825
51704 424825 430047 435193 440049 444239 447631 450304 452731 456109 461738 469699 478656 487181 494713 501160
51690 501160 506548 511653 518173 527371 538901 551673 565428 580650 597205 614165 631037 648388
51678 648388 667016 687212 708874 731363 752753 770040 780946 785363 784702 780429 773752 766009 758108
51665 758108 749525 738873 725859 712122 699876 690192 682796 676978 672200 668080 664167 659694 653571
51652 653571 645150 635263 626027 619105 614363 610596 607189 604357 601996 599173 595143 590278 585472 580932
51638 580932 576087 570743 565783 562384 560626 559273 557060 554000 551185 549500 548920 549061 549943 551834 554597
51623 554597 557642 560597 563837 568151 573805 579900 584766 587206 587336 586006 583580 579867 575287 571371
51609E71371j838K08J140J213J087Q31L29m3J96R98K008K930L236K124n17l497
51593E81776n495o504p423q436q745p897o449n174m263l654l523m060n160o621
51579D98372q269r658r999q829o624m522l424l441m006m424m404m131l837l499
51565D19305l118l072l731m772n338m852l427j525K54J168P55n50j730k276k427
51550C84664k262j391R6J251J449J213J117N52j273l512m094k131J054L467M171
51535C84371L463K281J796K678M249M964M195L054L050M516O615Q273Q759Q064
51521D50328P249P666R266J0406R868Q232O621N192L989M061N859P280N544J108
51507E42669k483l085k311k579l887m814n086n243m983l755k360j991k027o74
$$ plain form
51609 571371 569533 569741 570881 572094 573181 574012 574341 574298 574494 575492 577500 580430 583666 585790 585273 581776
51593 581776 576281 569777 562354 553918 545173 537276 530827 525653 521390 517736 514213 510153 504993 498372
51579 498372 490103 480445 470446 461617 454993 450471 447047 443606 439600 435176 430772 426641 422804 419305
51565 419305 416187 413115 409384 404612 399274 394422 390995 389470 389724 390892 391647 391097 389367 387091 384664
51550 384664 382402 381011 381107 382358 383807 385020 386137 386689 385416 381904 377810 375679 376733 380200 384371
51535 384371 387834 390115 391911 394589 398838 403802 407997 411051 414101 418617 425232 433505 442264 450328
51521 450328 457577 465243 474509 484915 494783 503015 509636 514828 518817 522878 528737 536017 541561 542669
51507 542669 540186 537101 534790 532211 528324 523510 518424 513181 508198 504443 502083 500092 498065 497391
51493D97391K078M131M340M160N219O700O577M798L671N119Q466J1347J2086J0836
51479E86919Q757O727M946L378K059R00l32j532k021j284K03J321J498J173J013
51464F13725J103J115J061J489K754M250M746L753K276J684J888J526K3j550k181
51449F37662k440l318m413m663m329m686n823o412n938n629o396p297p026n839
51435E63453m850m253l558l005l297m109m176l047j653q50l90J70N22L24J52R14
51419E32347K503L821M039L264K055J033R71K463M982O940P355P124P892R845
51405E96634J1462J1449J0197R006Q583Q817R409J0069J0350R892Q906Q039P805
51392G20618Q178Q585Q189O547M127J918L98o48j229j000l07m22j990l883m542
$$ plain form
51493 497391 499469 503600 507940 512100 517319 524019 530596 535394 539065 544184 552650 563997 576083 586919
51479 586919 595676 602403 607349 610727 612786 613686 613354 611822 609801 608517 608720 610041 611539 612712 613725
51464 613725 614828 615943 617004 618493 621247 625497 630243 633996 636272 637956 639844 641370 641393 639843 637662
51449 637662 635222 631904 627491 622828 618499 613813 607990 601578 595640 590011 583615 576318 569292 563453
51435 563453 558603 554350 550792 547787 544490 540381 536205 533158 531505 530655 530265 530435 530957 531281 531433 532347
51419 532347 534850 538671 542710 545974 548029 549062 550033 552496 557478 564418 571773 578897 586789 596634
51405 596634 608096 619545 629742 638748 647331 656148 665557 675626 685976 695868 704774 712813 720618
51392 720618 728796 737381 745570 752117 756244 758162 758560 757912 756683 755683 755376 754954 752964 749081 744539
51377G44539l716k041K54K948M746M286K076J6j069j945l049l695l653l942n307
51362G30448p135q620r869j0993j1293j0446r565r892j0957j1222j0181q888q488
51349F02899r051r707r380p478m509j873p20r32j320o19J494L957N023M091K657
51334E74532K524L428L805L654M501O120N830K401j500k838k456l322n835p703
51320E83141q061q672j0695j2807j3396j2688j1798j1249j1265j2136j3363j3652
51308D43359j2516j0927r781q935q328q580r492r329o957l796k292l003m410n112
51294C39901m939m187l183k555k888l718l711k203m4J312J236K54p58j415j895
51279C11207k194j728j02J820K410J177n43j195p03j1L67N37N35M14P89K244M168
$$ plain form
51377 744539 740823 738782 739036 741984 746730 751016 753092 753108 752039 750094 747045 743350 739697 735755 730448
51362 730448 723313 714693 704824 693831 682538 672092 662527 652635 641678 630456 620275 611387 602899
51349 602899 593848 584141 574761 567283 562774 560901 560181 559249 557929 557310 558804 562761 567784 571875 574532
51334 574532 577056 580484 584289 587943 592444 598564 604394 606795 605295 602457 600001 596679 590844 583141
51320 583141 575080 566408 555713 542906 529510 516822 505024 493775 482510 470374 457011 443359
51308 443359 430843 419916 410135 401200 392872 384292 374800 365471 358514 354718 352426 349423 345013 339901
51294 339901 334962 330775 327592 325037 322149 318431 314720 312517 312473 313785 315021 315275 314517 313102 311207
51279 311207 309013 307285 307183 309003 311413 312590 312047 310852 310149 310138 310505 311042 311577 311991 312780 315024 319192
51262C19192N114M540L463L169L910N109O244P064P338O944O142N464N375N945
51248C95013O779P262P093O499N716M466K395j70k365l708m322m371m089m297
51234D11901n901q362r724r007p800q254r945j0228p806m563l154l874m911n038
51220C13334m784m991n394n167m182l115k517k298k087j685j099m50o5m41j743
51205B73316l393m462m545m048l455k684j384L22J897L004L643L681K856J407
51191B66155K33N7P26J544K007J921J218N3j107j864k253k465k413j884r13K00
51175B61215J109J440R44Kl77L91J640K108J358J98k62K76R92O17j139k799k434
51158B65279q8K065K526K145K058J426q14l023k410N50K058K41k059j280K025
$$ plain form
51262 319192 324306 328846 332309 335478 339388 344497 350741 357805 365143 372087 378229 383693 389068 395013
51248 395013 401792 409054 416147 422646 428362 432828 435223 435053 432688 428980 424658 420287 416198 411901
51234 411901 406000 397638 387914 378907 371107 362853 352908 342680 334874 330311 327157 323283 318372 313334
51220 313334 308550 303559 298165 292998 288816 285701 283184 280886 278799 277114 276015 275565 275500 275059 273316
51205 273316 269923 265461 260916 256868 253413 250729 249345 249667 251564 254568 258211 261892 264748 266155
51191 266155 266388 266445 267171 268715 270722 272643 273861 273914 272807 270943 268690 266225 263812 261928 261015 261215
51175 261215 262324 263764 264708 264710 264333 264724 266364 268472 269830 270028 269766 270042 271034 271651 270512 267713 265279
51158 265279 265191 267256 269782 271927 273985 275411 274597 271574 269164 269714 271772 272013 269954 268674 270699
51143B70699M404M191K819K065K136K473K746K596J669L13o42j021j526k583l720
51128B86619m361m544m473l828k072O05K976L665K369J52j634k512k797k672j951
51113B65542o62P46J742J822O37j287k368j697n73q85k169k211o79K07o48j361
51097B56156l97O16m25k457k914j745j064j582k124k250k752l493l282k107j252
51082B28928r07M3J596K271J711J380J939K131J222M12O51R91N43K54J156K371
51066B46692K503J848J612J916K127K278K700K969K574K019J937J812Q84l54q83
51051B72634q47j117j656j670j138p55n82q8N51N01k87q31n66p4p2m11l94L97
51033B63595J668K518K052M34q46l08J942M255M930L510J081m18J34J675J941
$$ plain form
51143 270699 275103 279294 282113 284178 286314 288787 291533 294129 295798 296111 295469 294448 292922 290339 286619
51128 286619 282258 277714 273241 269413 267341 267946 270922 274587 276956 277108 275474 272962 270165 267493 265542
51113 265542 264880 265626 267368 269190 269827 268540 266172 264475 263902 263017 260848 258637 257958 258165 257517 256156
51097 256156 255759 256375 255950 253493 250579 248834 247770 246188 244064 241814 239062 235569 232287 230180 228928
51082 228928 228021 228064 229660 231931 233642 235022 236961 239092 240314 240726 241377 242368 242911 243165 244321 246692
51066 246692 249195 251043 252655 254571 256698 258976 261676 264645 267219 269238 271175 272987 273871 273517 272634
51051 272634 271787 270670 269014 267344 266206 265451 264869 264781 265332 265833 265546 264715 264149 264075 264003 263592 263198 263595
51033 263595 265263 267781 269833 270267 269421 269113 271055 275310 280240 283750 284831 284413 284547 286222 288163
51018B88163K59j502j481j33J091K198L970N621N261K777L32n00m06m92l50R22
51002C05730K790L602K495J85j864k574j919j012j135k301l004j942L29J939J747
50987C03066M31m97k77N80J147J113R20J100J800K850L884M252L391J716P18J502
50971C27696L367M383L363R16j350k174j342L10J494J531R76R26J690K565K886
50956C47237K847L058L577L730K870J212j51j97J033K498L141K717J782J344K338
50941C79036M823P530Q915Q788Q350Q433Q694Q695Q695Q767Q458Q198R709J3525
50927E00616J7267J8147J6610J5467J5831J6198J5693J5812J7985K1296K4037
50916F94959K6199K8930L2417L5722L8287M0485M2856M5813M9719N4408N8762
$$ plain form
51018 288163 288422 286920 285439 285306 286397 288595 292565 298186 303447 306224 306556 306056 305650 305158 304808 305730
51002 305730 308520 312122 314617 314802 312938 310364 308445 307433 306298 303997 300993 299051 299380 301319 303066
50987 303066 303497 303000 302723 303303 304450 305563 306483 307583 309383 312233 316117 320369 323760 325476 326194 327696
50971 327696 331063 335446 338809 339725 338375 336201 334859 335169 336663 338194 339170 340096 341786 344351 347237
50956 347237 350084 353142 356719 360449 363319 364531 364380 364183 365216 367714 370855 373572 375354 376698 379036
50941 379036 383859 391389 400304 409092 417442 425875 434569 443264 451959 460726 469184 477382 487091 500616
50927 500616 517883 536030 552640 568107 583938 600136 615829 631641 649626 670922 694959
50916 694959 721158 750088 782505 818227 856514 896999 939855 985668 1035387 1089795 1148557
50905A148557O1793O4114O7483P2623P8150Q2097Q4015Q5143Q6756Q8774R0059
50894B009564Q9497Q6614Q1551P5094O8537O2725N7037N0115M1847L3759K6900
50883B683240K0418J3207O087R08k016m033n900o979o884o460o653p623r366j2161
50869B655785j5911k0129k4905l0817l7575m4028m9893n6026o2499o7968p1772
50858B174262p4953p7986p9315p7714p4664p2285p0128o6265o0888n6352n3719
50847A409993n1488m8004m3150l7413l1231k5768k2429k0820j8809j5416j2062
50836A083403j0049q493o085l483k145j768o15J887M371N336M601L075K031K427
50822A074493M082N632O160O500P979J0228J1545J1348J0929J1638J3447J5666
$$ plain form
50905 1148557 1210350 1274464 1341947 1414570 1492720 1574817 1658832 1743975 1830731 1919505 2009564
50894 2009564 2099061 2185675 2267226 2342320 2410857 2473582 2530619 2580734 2622581 2656340 2683240
50883 2683240 2703658 2716865 2722952 2723860 2721844 2717811 2711911 2704932 2698048 2691588 2684935 2677312 2667946 2655785
50869 2655785 2639874 2619745 2594840 2564023 2526448 2482420 2432527 2376501 2314002 2246034 2174262
50858 2174262 2099309 2021323 1942008 1864294 1789630 1717345 1647217 1580952 1520064 1463712 1409993
50847 1409993 1358505 1310501 1267351 1229938 1198707 1172939 1150510 1129690 1110881 1095465 1083403
50836 1083403 1073354 1064861 1058776 1055293 1053148 1051380 1050765 1052652 1057023 1062359 1066960 1070035 1072066 1074493
50822 1074493 1078575 1084207 1090367 1096867 1104846 1115074 1126619 1137967 1148896 1160534 1173981 1189647
50810A189647J7851J9595K0617K1603K3777K6903K9043K9394L0157L3964M0206
50799A482757M5831M9542N3255N9018O6360P3572Q0212Q7108R4765J03099J12192
50788B307711J22144J32406J42328J52141J62362J72266J80163J85504J89588
50779C746613J93637J96872J97255J93474J85434J73251J56961J37291J15897
50770E296685R4341P3231N2761L3654J7010L319p826j6835k3266k6187k5341k1720
50758E449826j6968j2415q864p055q046j2768k1234l2480m5564o0458p7566r6254
50746E050154j14588j30886j45056j57609j67833j74081j76043j75445j73949
50737C634664j71138j65418j56173j44089j30028j14884j00312q7992p7725o7473
$$ plain form
50810 1189647 1207498 1227093 1247710 1269313 1293090 1319993 1349036 1378430 1408587 1442551 1482757
50799 1482757 1528588 1578130 1631385 1690403 1756763 1830335 1910547 1997655 2092420 2195519 2307711
50788 2307711 2429855 2562261 2704589 2856730 3019092 3191358 3371521 3557025 3746613
50779 3746613 3940250 4137122 4334377 4527851 4713285 4886536 5043497 5180788 5296685
50770 5296685 5391026 5464257 5517018 5550672 5567682 5571001 5563175 5546340 5523074 5496887 5471546 5449826
50758 5449826 5432858 5420443 5411579 5404524 5396478 5383710 5362476 5329996 5284432 5223974 5146408 5050154
50746 5050154 4935566 4804680 4659624 4502015 4334182 4160101 3984058 3808613 3634664
50737 3634664 3463526 3298108 3141935 2997846 2867818 2752934 2652622 2564630 2486905 2419432
50727B419432n5960m4322l4415k6320j8662j0954m392k16J808K931M042N164N755
50714B243891N203L272M11k629n666r100j2753j5348j6079j6327j8606k3355k7903
50701B105011k9419k8176k6894k7286k8377k8183k5940k2413j8947j6496j4895
50690A837985j2677q359k231L815Q555J2663J7350K2745K8324L3903L9335M4082
50678B025490M8174N2977N9723O7803P5547Q2300Q8574R4653J00410J06110J11941
50667B913702J17040J20522J23156J26080J27993J25843J18881J09662J00116
50658C982995Q8884P4178N7277M0809K4980Q102r639k5539l7762m7128n4860o0268
50646D042029o1832n9535n4952m9543m3724l7396l0817k4840k0477j8310j8388
$$ plain form
50727 2419432 2363472 2319150 2284735 2258415 2239753 2228799 2224407 2224191 2225999 2228930 2232972 2238136 2243891
50714 2243891 2249094 2252366 2252777 2250148 2244482 2235382 2222629 2207281 2191202 2174875 2156269 2132914 2105011
50701 2105011 2075592 2047416 2020522 1993236 1964859 1936676 1910736 1888323 1869376 1852880 1837985
50690 1837985 1825308 1816949 1814718 1818533 1827088 1839751 1857101 1879846 1908170 1942073 1981408 2025490
50678 2025490 2073664 2126641 2186364 2254167 2329714 2412014 2500588 2595241 2695651 2801761 2913702
50667 2913702 3030742 3151264 3274420 3400500 3528493 3654336 3773217 3882879 3982995
50658 3982995 4071879 4146057 4203334 4244143 4269123 4277225 4267586 4242047 4204285 4157157 4102297 4042029
50646 4042029 3980197 3920662 3865710 3816167 3772443 3735047 3704230 3679390 3658913 3640603 3622215
50635C622215k0734k5647l3171m2618n3126o4354p6020q6944r5427j00620j02910
50624B920644j02894j00696r6454r0644q3568p5082o5360n5495m6735l9215l1698
50613B132803k2630j1450P52J1886K0525K7235L3945M1710M9466N5298N8624O0479
50601B458643O1691O1509N8613N3169M7172M2543L9433L6779L3963L1150K8244
50590B952909K4699K0766J7888J7101J7754J8617J9599K1334K3658K5922K8625
50579C188872L3090L9266M5449N0927N7160O5069P2507P6441P6934P6747P6919
50568C859381P5082O9071O0289N1935M5078L8284L0504K2385J4947Q658M214K539
50556D282367L262M455M860N364P454J1147J5453J9924K4326K7379K7405K4237
$$ plain form
50635 3622215 3601481 3575834 3542663 3500045 3446919 3382565 3306545 3219601 3124174 3023554 2920644
50624 2920644 2817750 2717054 2620600 2529956 2446388 2371306 2305946 2250451 2203716 2164501 2132803
50613 2132803 2110173 2098723 2099475 2111361 2131886 2159121 2193066 2234776 2284242 2339540 2398164 2458643
50601 2458643 2520334 2581843 2640456 2693625 2740797 2783340 2822773 2859552 2893515 2924665 2952909
50590 2952909 2977608 2998374 3016262 3033363 3051117 3069734 3089333 3110667 3134325 3160247 3188872
50579 3188872 3221962 3261228 3306677 3357604 3414764 3479833 3552340 3628781 3705715 3782462 3859381
50568 3859381 3934463 4003534 4063823 4115758 4160836 4199120 4229624 4252009 4266956 4275614 4279828 4282367
50556 4282367 4285629 4290084 4294944 4300308 4307762 4318909 4334362 4354286 4378612 4405991 4433396 4457633
50544D457633J9265J3596P228j08q521j8418l0180m3181n6283o9340q2887r6270
50532D092534j07594j16087j22842j28484j31728j31497j29005j26107j22675
50523B976515j17386j10492j03842r8254r2573q5660p8037p0978o4900n9138n2823
50512B042432m5653l8120l0924k4064j6898r495l228Q40L660P276J2423J8035
50500A916284K2899K6866L0417L3975L7768M1765M5784M9973N4703N9521O3030
50489B382985O4923O7123P1423P6703Q0333Q1874Q3175Q4820Q4956Q2290P8103
50478C238708P4255P1072O8377O6875O7001O7844O8811P1176P6271Q3040Q9167
50467D042597R4111R9405J06204J14044J21949J29512J36747J43757J50467J55980
$$ plain form
50544 4457633 4476898 4490494 4497722 4497614 4489093 4470675 4440495 4397314 4341031 4271691 4188804 4092534
50532 4092534 3984940 3868853 3746011 3617527 3485799 3354302 3225297 3099190 2976515
50523 2976515 2859129 2748637 2644795 2546541 2453968 2368308 2290271 2219293 2154393 2095255 2042432
50512 2042432 1996779 1958659 1927735 1903671 1886773 1877278 1874050 1874890 1878550 1885826 1898249 1916284
50500 1916284 1939183 1966049 1996466 2030441 2068209 2109974 2155758 2205731 2260434 2319955 2382985
50489 2382985 2447908 2515031 2586454 2663157 2743490 2825364 2908539 2993359 3078315 3160605 3238708
50478 3238708 3312963 3384035 3452412 3519287 3586288 3654132 3722943 3794119 3870390 3953430 4042597
50467 4042597 4136708 4236113 4342317 4456361 4578310 4707822 4844569 4988326 5138793 5294773
50457E294773J58579J57323J53226J47819J40880J30720J16394R8550P8259N6305
50447F532828L3532J0718j2099l5052n7261p7274r4666j09912j22417j30225j32187
50436E805985j29268j22950j13437j00255q3731o4983m5185k5662q169N963J6627
50425E134935K4163K8207K8005K3423J4674J325j7320m0565o5881r0521j13126
50414D927319j33538j51611j66603j77483j83484j84444j81016j74569j66610
50405C407961j58120j49328j40159j30747j21283j11435j00418q8148p6027o5920
50395B266376n8204n1357m3746l5309k7088j9751j3123o986j518L146P256J1170
50383B030866J5052J8950K2948K7033L0971L4448L7242L9372M1225M3465M6497
$$ plain form
50457 5294773 5453352 5610675 5763901 5911720 6052600 6183320 6299714 6398264 6476523 6532828
50447 6532828 6566360 6577078 6564979 6529927 6472666 6395392 6300726 6190814 6068397 5938172 5805985
50436 5805985 5676717 5553767 5440330 5340075 5256344 5191361 5146176 5120514 5112345 5118308 5134935
50425 5134935 5159098 5187305 5215310 5238733 5253407 5254732 5237412 5196847 5130966 5040445 4927319
50414 4927319 4793781 4642170 4475567 4298084 4114600 3930156 3749140 3574571 3407961
50405 3407961 3249841 3100513 2960354 2829607 2708324 2596889 2496471 2408323 2332296 2266376
50395 2266376 2208172 2156815 2113069 2077760 2050672 2030921 2017798 2010812 2009294 2012440 2019696 2030866
50383 2030866 2045918 2064868 2087816 2114849 2145820 2180268 2217510 2256882 2298107 2341572 2388069
50372B388069M9979N3037N4955N5530N4864N3259N1324M9696M8475M7288M6058
50361B952534M5245M5016M4601M3056M0473L7978L6577L6456L7212L8244L9046
50350C396438L9795M1660M5774N1563N6792N9687O0365N9852N8518N6358N4003
50339C980805N2011M9284M3665L4547K3756J3266L083p826j9583l1594m4071n7749
50327D039594p2157q5582r6993j06637j14262j18251j17733j14383j10470j05616
50317B997510r7347q4961p1074n8537m7307l5550k2818j0577j14Q447J4878J8123
50305B610673J7564J4120R266L481l818j3104k3945l5035m4729n1928n6908o0851
50293B364786o4329o6620o6838o5122o2287n8921n5423n2324m9831m7389m4501
$$ plain form
50372 2388069 2438048 2491085 2546040 2601570 2656434 2709693 2761017 2810713 2859188 2906476 2952534
50361 2952534 2997779 3042795 3087396 3130452 3170925 3208903 3245480 3281936 3319148 3357392 3396438
50350 3396438 3436233 3477893 3523667 3575230 3632022 3691709 3752074 3811926 3870444 3926802 3980805
50339 3980805 4032816 4082100 4125765 4160312 4184068 4197334 4200417 4192591 4173008 4141414 4097343 4039594
50327 4039594 3967437 3881855 3784862 3678225 3563963 3445712 3327979 3213596 3103126 2997510
50317 2997510 2900163 2815202 2744128 2685591 2638284 2602734 2579916 2569339 2569225 2577672 2592550 2610673
50305 2610673 2628237 2642357 2651623 2655104 2651286 2638182 2614237 2579202 2534473 2482545 2425637 2364786
50293 2364786 2300457 2233837 2166999 2101877 2039590 1980669 1925246 1872922 1823091 1775702 1731201
50282A731201m1454l8591l5377l1213k6700k2933j9868j6703j3527j1115r074
50271A464646n969j708J805L271L784N156P633J0402J3170J6091J8849K1024K2756
50258A580910K4112K4636K4560K5415K8037L0795L1569L0885L1141L3001L4627
50247A899688L4683L3964L3408L2513L0834K9321K8657K7479K3978J8659J3938
50236B207122J1231R753Q142N850K621k075q095j3682j6714j7095j7231j9605
50224B150222k4208k8955l2428l5293l8681m2118m3994m3605m1755l9578l7778
50213A741829l6918l7284l8131l7999l6219l3441l0570k7967k5825k4266k2682
50202A390527k0132j6913j4585j3669j2565r867o604m709m088k980r57L37j75
$$ plain form
50282 1731201 1689747 1651156 1615779 1584566 1557866 1534933 1515065 1498362 1484835 1473720 1464646
50271 1464646 1458677 1456969 1458774 1462045 1465829 1470985 1478618 1489020 1502190 1518281 1537130 1558154 1580910
50258 1580910 1605022 1629658 1654218 1679633 1707670 1738465 1770034 1800919 1832060 1865061 1899688
50247 1899688 1934371 1968335 2001743 2034256 2065090 2094411 2123068 2150547 2174525 2193184 2207122
50236 2207122 2218353 2228106 2236248 2242098 2244719 2242644 2234549 2220867 2204153 2187058 2169827 2150222
50224 2150222 2126014 2097059 2064631 2029338 1990657 1948539 1904545 1860940 1819185 1779607 1741829
50213 1741829 1704911 1667627 1629496 1591497 1555278 1521837 1491267 1463300 1437475 1413209 1390527
50202 1390527 1370395 1353482 1338897 1325228 1312663 1302796 1296192 1291483 1287395 1284415 1283458 1283795 1283620
50189A283620j246r77O74J914J165j356l845m527l395k321l058n203o867p084
50175A247494o662o529o448n955n593o181p441q271q296q305q958r668r136o872
50161A143179l812j437m05l32p57j715k899k972p32K980N651N838M787M679N907
50146A157960O880O185M047J689L0q31j420k572m870p968j0592j1545j0878r840
50132A116275r675j0489j1463j1905j1845j1594j1173j0506r880r699r848r651
50120I88547q640p099n829n532o290p455q168q215q170q321p896o087l577j987
50106H95281j748j549l36J164J606R30J66k29r12k637n381q396j0641j1342j0668
50091H45308r632q895p961o128l833k292k120k990m446n967o462m985k386r48
$$ plain form
50189 1283620 1282374 1281397 1282071 1283985 1285150 1283794 1279949 1275422 1272027 1269706 1266648 1261445 1254578 1247494
50175 1247494 1240832 1234303 1227855 1221900 1216307 1210126 1202685 1194414 1186118 1177813 1168855 1159187 1150051 1143179
50161 1143179 1139367 1137930 1137525 1137193 1136436 1134721 1131822 1128850 1128118 1131098 1136749 1142587 1147374 1152053 1157960
50146 1157960 1164840 1171025 1175072 1176761 1176791 1175960 1174540 1171968 1167098 1159130 1148538 1136993 1126115 1116275
50132 1116275 1106600 1096111 1084648 1072743 1060898 1049304 1038131 1027625 1017745 1008046 998198 988547
50120 988547 979907 972808 966979 961447 955157 947702 939534 931319 923149 914828 906932 900845 897268 895281
50106 895281 893533 891984 891648 892812 894418 895348 895514 895285 894373 891736 886355 877959 867318 855976 845308
50091 845308 835676 826781 818820 812692 808859 806567 804447 801457 797011 791044 784582 779597 777211 776263
50077G76263j737l199l211j774o02n05m58O53K506M161N600P500R732J1007J0434
50062H16370Q815P829Q124Q843R063Q972R412J0764J2716J4639J5727J5193J3186
50049I59653J1180J0698J1549J2068J1212R663Q641Q347Q073P424O750O474O430
50036A078162N952M623K901J914K365L752M827M779L804K763K665M008O011O851
50022A135377N589L689L657O077R079J0826J1236J0939J0000Q732Q483J0210J2816
50009A246710J4374J4590J4804J5748J6684J6987J7351J8855K1507K4225K5781
49998A447616K5655K4316K2932K2347K2328K2101K1488K0896K0235J8797J6394
49987A685105J3882J2077J0721R019O818M717L155J796j11k928o188q930j0567
$$ plain form
50077 776263 774526 771327 768116 766342 765740 765235 764777 765430 767936 772097 777697 785197 794929 805936 816370
50062 816370 825185 833014 841138 849981 859044 868016 877428 888192 900908 915547 931274 946467 959653
50049 959653 970833 981531 993080 1005148 1016360 1026023 1034664 1043011 1051084 1058508 1065258 1071732 1078162
50036 1078162 1084114 1088737 1091638 1093552 1095917 1099669 1104496 1109275 1113079 1115842 1118507 1122515 1128526 1135377
50022 1135377 1140966 1144655 1148312 1154389 1163468 1174294 1185530 1196469 1206469 1215201 1223684 1233894 1246710
50009 1246710 1261084 1275674 1290478 1306226 1322910 1339897 1357248 1376103 1397610 1421835 1447616
49998 1447616 1473271 1497587 1520519 1542866 1565194 1587295 1608783 1629679 1649914 1668711 1685105
49987 1685105 1698987 1711064 1721785 1730804 1737622 1742339 1745494 1747290 1747179 1744251 1738063 1729133 1718566
49974A718566j1239j1299j0787r736q642q004p550o587n089l726k697j287J138
49961A633061M226P148R593J1986J5031J9188K4229K9232L3534L7691M2807M8841
49949A916567N4505N9258O4231P0168P5300P6647P3182O6562N8789N0318M0758
49938B606285L0271J9582R347K05o941j1374j3295j3716j3807j4483j6366j9730
49926B555978k4585l1106l9601m9662n9696o7996p4277p9350q3209q4414q2077
49915A880005p7685p3855p1406o8621o3607n6473m8901m2352l7338l3801l1376
49904A274590k9420k7423k5405k3497k1553j9559j8112j7664j7528j6524j4615
49893A043290j2963j2196j1661j0851j0559j1659j3350j3813j2435j0405q894
$$ plain form
49974 1718566 1707327 1696028 1685241 1675505 1666863 1658859 1651309 1644722 1639633 1635907 1633210 1631923 1633061
49961 1633061 1637287 1644435 1654028 1666014 1681045 1700233 1724462 1753694 1787228 1824919 1867726 1916567
49949 1916567 1971072 2030330 2094561 2164729 2240029 2316676 2389858 2456420 2515209 2565527 2606285
49938 2606285 2636556 2656138 2665485 2665690 2658749 2647375 2634080 2620364 2606557 2592074 2575708 2555978
49926 2555978 2531393 2500287 2460686 2411024 2351328 2283332 2209055 2129705 2046496 1962082 1880005
49915 1880005 1802320 1728465 1657059 1588438 1524831 1468358 1419457 1377105 1339767 1305966 1274590
49904 1274590 1245170 1217747 1192342 1168845 1147292 1127733 1109621 1091957 1074429 1057905 1043290
49893 1043290 1030327 1018131 1006470 995619 985060 973401 960051 946238 933803 923398 914504
$$ [...]
##END NTUPLES=NMR SPECTRUM
##END=
