
##TITLE=AC1138_hibrido_5898882_BZGNScSlqF
##JCAMPDX= 6.0         $$ Bruker NMR JCAMP-DX V2.0
##DATA TYPE= NMR SPECTRUM
##DATA CLASS= NTUPLES
##ORIGIN= BRUKER
##OWNER= Administrator
$$ 1.72 TOPSPIN		Version 2.1
$$ 2012-04-10 10:22:48.234 -0500  Administrator@TOPSPIN
$$ Compression mode = diff/dup
##.OBSERVE FREQUENCY= 400.13188235
##.OBSERVE NUCLEUS= ^1H
##.ACQUISITION MODE= SIMULTANEOUS (DQD)
##.ACQUISITION SCHEME= undefined
##.AVERAGES= 8
##.DIGITISER RES= 22
##SPECTROMETER/DATA SYSTEM= spect
##.PULSE SEQUENCE= zg30
##.SOLVENT NAME= COFFEE_meoh
##.SHIFT REFERENCE= INTERNAL, COFFEE_meoh, 1, 14.98061
##AUDIT TRAIL= $$ (NUMBER, WHEN, WHO, WHERE, PROCESS, VERSION, WHAT)
$$ ##TITLE= Audit trail, TOPSPIN		Version 2.1
$$ ##JCAMPDX= 5.01
$$ ##ORIGIN= Bruker BioSpin GmbH
$$ ##OWNER= Administrator
$$ $$ C:\Bruker\TOPSPIN/data/COFFEE/nmr/AC1138_hibrido_5898882_BZGNScSlqF/10/pdata/1/auditp.txt
$$ ##AUDIT TRAIL=  $$ (NUMBER, WHEN, WHO, WHERE, PROCESS, VERSION, WHAT)
(   1,<2012-04-04 09:24:35.359 -0500>,<Administrator>,<TOPSPIN>,<go>,<TOPSPIN 2.1>,
      <created by zg
	started at 2012-04-04 09:23:28.484 -0500,
	POWCHK enabled, PULCHK disabled,
       configuration hash MD5:
       1A 1E CE 29 27 FD 77 03 67 4E F0 E3 C4 B2 CB 90
       data hash MD5: 64K
       3C 74 68 23 86 BF 6F EC 11 84 4E 51 4B CA A3 88>)
(   2,<2012-04-04 09:24:37.953 -0500>,<Administrator>,<TOPSPIN>,<proc1d>,<TOPSPIN 2.1>,
      <Start of raw data processing
       efp LB = 0 FT_mod = 6 PKNL = 1 PHC0 = 0 PHC1 = 0 SI = 32K 
       data hash MD5: 32K
       97 FA E0 1B 84 91 09 55 1D 48 A2 7A 78 B1 46 F0>)
(   3,<2012-04-04 09:24:38.390 -0500>,<Administrator>,<TOPSPIN>,<proc1d>,<TOPSPIN 2.1>,
      <pk PHC0 = 212.8107 PHC1 = 0 
       data hash MD5: 32K
       B1 D8 DC 77 C2 6A E3 72 B2 17 3A 06 30 76 92 C3>)
(   4,<2012-04-04 09:24:38.531 -0500>,<Administrator>,<TOPSPIN>,<proc1d>,<TOPSPIN 2.1>,
      <abs ABSG = 1 
       data hash MD5: 32K
       6E 25 EC 91 62 27 90 FB 94 A9 79 08 6A EF 7D 04>)
(   5,<2012-04-04 09:24:38.562 -0500>,<Administrator>,<TOPSPIN>,<proc1d>,<TOPSPIN 2.1>,
      <abs ABSG = 2 
       data hash MD5: 32K
       0C 0C AE AC 43 E9 3F 9B E1 0C 40 84 F1 A6 C5 BB>)
(   6,<2012-04-04 09:24:38.593 -0500>,<Administrator>,<TOPSPIN>,<proc1d>,<TOPSPIN 2.1>,
      <abs ABSG = 3 
       data hash MD5: 32K
       D8 8E 98 C9 6C 24 93 E5 7F D8 18 05 BC F7 C1 F3>)
(   7,<2012-04-04 09:24:38.625 -0500>,<Administrator>,<TOPSPIN>,<proc1d>,<TOPSPIN 2.1>,
      <abs ABSG = 4 
       data hash MD5: 32K
       05 65 A1 47 DB CF 06 34 88 24 F9 3A 0C C4 E1 24>)
(   8,<2012-04-04 09:24:38.656 -0500>,<Administrator>,<TOPSPIN>,<proc1d>,<TOPSPIN 2.1>,
      <abs ABSG = 5 
       data hash MD5: 32K
       37 68 1C 22 DD 63 BE E2 4F F9 6D 0D 26 61 DB BA>)
(   9,<2012-04-04 09:24:42.375 -0500>,<Administrator>,<TOPSPIN>,<audit>,<TOPSPIN 2.1>,
      <user comment:
       ICON-NMR User ID: COFFEE
       data hash MD5: 32K
       37 68 1C 22 DD 63 BE E2 4F F9 6D 0D 26 61 DB BA>)
$$ ##END=
$$ 
$$ [...]
150 150 150 150 150 150 150 150
##$TP07= 0
##$TPNAME0= <>
##$TPNAME1= <>
##$TPNAME2= <>
##$TPNAME3= <>
##$TPNAME4= <>
##$TPNAME5= <>
##$TPNAME6= <>
##$TPNAME7= <>
##$TPOAL= (0..7)
0.5 0.5 0.5 0.5 0.5 0.5 0.5 0.5
##$TPOFFS= (0..7)
0 0 0 0 0 0 0 0
##$TUNHIN= 0
##$TUNHOUT= 0
##$TUNXOUT= 0
##$USERA1= <user>
##$USERA2= <user>
##$USERA3= <user>
##$USERA4= <user>
##$USERA5= <user>
##$V9= 5
##$VALIST= <valist>
##$VCLIST= <CCCCCCCCCCCCCCC>
##$VD= 0
##$VDLIST= <DDDDDDDDDDDDDDD>
##$VPLIST= <PPPPPPPPPPPPPPP>
##$VTLIST= <TTTTTTTTTTTTTTT>
##$WBST= 2048
##$WBSW= 25
##$XGAIN= (0..3)
0 0 0 0
##$XL= 0
##$YL= 0
##$YMAX_a= 534323
##$YMIN_a= -650852
##$ZGOPTNS= <>
##$ZL1= 120
##$ZL2= 120
##$ZL3= 120
##$ZL4= 120
##$ABSF1= 14.98061
##$ABSF2= -5.57192
##$ABSG= 5
##$ABSL= 3
##$ALPHA= 0
##$AQORDER= 0
##$ASSFAC= 0
##$ASSFACI= 0
##$ASSFACX= 0
##$ASSWID= 0
##$AUNMP= <proc_prof1d_extract_pilot.lims>
##$AXLEFT= 0
##$AXNAME= <>
##$AXNUC= <1H>
##$AXRIGHT= 0
##$AXTYPE= 0
##$AXUNIT= <>
##$AZFE= 0.1
##$AZFW= 0.1
##$BCFW= 0
##$BC_mod= 0
##$BYTORDP= 0
##$COROFFS= 0
##$CY= 15
##$DATMOD= 1
##$DC= 0
##$DFILT= <>
##$DTYPP= 0
##$F1P= 0
##$F2P= 0
##$FCOR= 0.5
##$FTSIZE= 32768
##$FT_mod= 6
##$GAMMA= 0
##$GB= 0
##$INTBC= 1
##$INTSCL= 1
##$ISEN= 128
##$LB= 0
##$LEV0= 0
##$LPBIN= 0
##$MAXI= 10000
##$MC2= 0
##$MEAN= 0
##$ME_mod= 0
##$MI= 0
##$NCOEF= 0
##$NC_proc= -8
##$NLEV= 6
##$NOISF1= 0
##$NOISF2= 0
##$NSP= 0
##$NTH_PI= 0
##$NZP= 0
##$OFFSET= 14.98061
##$PC= 1
##$PHC0= 212.8107
##$PHC1= 0
##$PH_mod= 1
##$PKNL= yes
##$PPARMOD= 0
##$PPDIAG= 0
##$PPIPTYP= 0
##$PPMPNUM= 2147483647
##$PPRESOL= 1
##$PSCAL= 4
##$PSIGN= 0
##$PYNMP= <proc.py>
##$REVERSE= no
##$SF= 400.13
##$SI= 32768
##$SIGF1= 0
##$SIGF2= 0
##$SINO= 400
##$SIOLD= 32768
##$SPECTYP= <>
##$SREGLST= <1H.CDCl3>
##$SSB= 0
##$STSI= 32768
##$STSR= 0
##$SW_p= 8223.68421052632
##$SYMM= 0
##$S_DEV= 0
##$TDeff= 65536
##$TDoff= 0
##$TI= <>
##$TILT= no
##$TM1= 0
##$TM2= 0
##$TOPLEV= 0
##$USERP1= <user>
##$USERP2= <user>
##$USERP3= <user>
##$USERP4= <user>
##$USERP5= <user>
##$WDW= 1
##$XDIM= 32768
##$YMAX_p= 468054160
##$YMIN_p= -730840
##$CURPLOT= <Network HP LaserJet P1505>
##$CURPRIN= <$Network HP LaserJet P1505>
##$DFORMAT= <normdp>
##$LAYOUT= <+/1D_H.xwp>
##$LFORMAT= <normlp>
##$PFORMAT= <normpl>
##$SURQMSG= 1
$$ End of Bruker specific parameters
$$ ---------------------------------
##NTUPLES= NMR SPECTRUM
##VAR_NAME=  FREQUENCY,     SPECTRUM/REAL,   SPECTRUM/IMAG
##SYMBOL=    X,             R,               I
##VAR_TYPE=  INDEPENDENT,   DEPENDENT,       DEPENDENT
##VAR_FORM=  AFFN,          ASDF,            ASDF
##VAR_DIM=   32768,         32768,           32768
##UNITS=     HZ,            ARBITRARY UNITS, ARBITRARY UNITS
##FACTOR=    0.250966925370066, 1,           1
##FIRST=     8223.43324360095, -83466,       -21645
##LAST=      0,             -17812,          -201518
##MIN=       0,             -730840,         0
##MAX=       8223.43324360095, 468054160,    0
$$ Real data points
##PAGE= N=1
##DATA TABLE= (X++(R..R)), XYDATA
$$ [...]
23765 -331143 -93853 -146516 138312 86133 -230286 76863 220260 -132828 -21019 -221187
23755 -221187 -471839 -83485 -112534 146462 -8709 -281087 -90212 34430 21844 40725 67431
23744 67431 89558 -67855 57868 -367059 142923 54992 -33394 -112769 -216944 74675 -56488
23732 -268700 188482 -171183 45702 -86787 47883 -3525 59689 258822 171980 130310 -131095
23720 -80069 233825 32040 23015 -389203 -273615 -343159 -60218 38973 -213632 -126027 1738
23708 -227114 -245982 156831 103587 -175465 -249051 159430 -168930 774 -144364 59558 -65127
23696 -332634 159112 -36058 153240 -34423 36163 -67235 -218878 287658 112927 234978
23686 234978 -84664 -108154 -231723 -13646 -82313 144703 31106 -293206 -108735 36626 -41003
23674 139938 33250 -355676 -24288 -193906 -97613 114101 240399 -585147 -193136 147553
23663 12555 -103389 34938 172475 -31884 -142119 -246702 -201940 56093 -220630 -50446 -266062
23652 -266062 128248 132731 -130749 9484 -174686 -284399 83437 23850 299501 -45513 142422
23640 136553 37113 -166894 18496 -175362 -266096 86928 -49193 -252991 -133221 -168623 117699
23628 136705 -48562 -392171 -55677 -61834 -233360 223064 -6046 150076 -441607 36461 -132329
23616 -169924 -271986 119689 185145 -237354 20181 94937 -148025 -136119 22818 54457 110823
23605 110823 40645 -112834 -289136 -184692 -92276 111978 -170385 132826 146917 59332
23594 113017 15072 227610 121560 -16293 102271 -152950 176860 57100 -156850 331940
23583 -370906 -16718 -58444 98473 9231 -73799 -27106 278579 21368 326668 -135317 287440
23571 133217 100510 -67151 304823 -165576 68459 180126 118856 61392 210878 -181739
23560 247002 -21807 -237543 32632 -90440 -59761 -149691 135977 -70476 11149 212404 -283644
23548 -16692 89395 -97409 222742 386883 297550 87854 -170433 68872 137377 72318 6057
23536 -70012 -32556 -184774 30204 44848 166575 32557 334092 -139845 215087 139381 -43746
23524 -12257 -201542 -137734 -164236 -19838 112818 -78552 -91094 -132560 23799 69296 -95802
23512 322598 87400 -40109 -256945 -189549 -88645 172429 -128237 161828 -331284 -351458
23502 -351458 -6414 -28491 -239141 21453 -237187 -518612 49157 189074 82295 31699 -95339
23490 2322 283594 -169079 -105057 24444 -124749 -18430 -154067 -208529 86944 -163106 -247969
23479 -247969 -107267 -76840 115926 -87812 -196062 -216822 158603 192641 160377 -193939
23468 -25170 -130725 -109551 -220364 6413 -155193 -101680 48284 -462128 -59725 -64162 305284
23456 -237926 65110 105492 299077 -376752 121315 -360960 175083 73036 -70976 -79535 -160270
23445 -160270 -193233 -65176 117481 358288 -65524 -60569 16251 87992 -15746 193083 -172263
23433 182578 115524 -124292 15728 -85376 94643 -175300 -142460 151482 214245 -157981 -98426
23422 -98426 -108869 -44217 38812 -190041 221787 -214413 42831 -147322 -168198 139 63224
23411 63224 -131608 24333 -83218 -178523 37668 161335 112021 -228109 16812 14451 179332
23400 179332 54492 -243176 208523 37971 -18627 47675 -220239 -263859 -205147 -143138 110319
23388 12439 114026 -380821 -154234 119161 -365539 -475483 -291066 -231127 -19495 -192682
23378 -192682 183055 -62402 -47921 -326003 -61772 -220524 -257165 -92977 21473 -242225 74627
23366 201592 240826 -2174 8991 -260609 135453 117773 69799 -48232 -96049 -138062 83161
23354 -41427 71392 -20359 205843 417330 -169355 224336 110595 -405036 -5007 141656
23343 58990 -161624 167068 300366 -234590 -54462 -94765 107408 -207813 -59255 389777
23332 164028 -39160 184400 31247 -122233 -75059 138882 -162182 -6552 120967 24868 9467
23320 -83068 193050 22474 -185538 -19502 -54878 27475 -257640 -239551 488403 -432945 12350
23308 -120131 -112606 353552 -171565 -9029 104583 -63174 -7175 -29898 -245053 -311621 -71151
23296 141420 10608 204173 -315174 -2274 201860 70367 -25929 -3553 -181755 -222470 59440
23284 -147944 -256043 91979 238751 18433 73255 -132507 -282452 -44146 84464 -201172
23273 -115900 171605 252538 -26185 -211897 127614 -36365 71112 -27483 48225 174760 -60527
23261 285373 -407400 -222717 152958 -341213 28025 -126062 -238373 -68459 -188812 -445580
23251 -445580 9497 -74997 -131389 18863 19654 -160534 169974 125737 -344340 -101710 -172479
23240 -172479 64716 -16868 154977 -226772 115420 53540 -31929 51563 -62753 213470 -261053
23228 162418 -121566 160366 215891 -49280 -236401 -139311 -186164 186272 -227621 -1562 -86991
23217 -86991 127137 141867 -17303 -281484 -78876 -87025 -36444 -269515 -57439 18407 -262627
23205 54014 63091 8879 1381 -50513 58671 -109191 106812 -466814 -44999 -35298 299939 -152556
23192 26210 -151990 28362 -24323 133078 -83000 -296661 -28698 -132539 -288966 -117880
23181 -36977 49165 -90941 30900 92881 -300601 -257235 -155561 -334776 114073 -225127 -85643
23169 125111 -139376 -243701 21569 -438491 -250486 110107 -9050 -189261 -14881 -1377 -135467
23158 -135467 121916 -119041 -118261 -101725 -329518 -48848 -74898 -121126 -26335 -21842 102206
23146 -253432 -189814 27933 218026 157122 -53094 171525 29510 347823 276780 -146892 219286
23134 -217159 -136797 -55563 125893 89757 -48208 246314 32604 400218 298872 -5021 -103192
23123 -103192 -83917 67999 19545 98388 -250223 -220867 85682 172282 57634 93919 188960
23112 188960 400339 12818 52263 -108894 296889 -75408 160147 70544 226102 551 225441
23101 225441 -92126 283275 -98959 86531 134367 -53620 -55209 178749 -188243 -15436 -13518
23090 -13518 -173581 -38548 28730 -89707 -208663 -154754 -157442 275992 55832 157323 33314
23078 35663 -52970 252711 129961 107362 -272970 42646 -11245 79084 80278 -65289 61157
23066 -40191 5581 15970 -150639 383614 -251222 -40842 25698 102246 11991 160601 -202753
23054 145735 21771 -127045 -214635 -138951 327276 101970 225312 503010 -234684 45589
23043 -121877 -98835 45895 130351 39690 -132666 136790 -285452 -152363 110838 -135026
23032 47454 124374 -334533 -262617 55446 294745 -80145 23647 237585 -453671 121353 58047
23020 13231 159041 -85044 -124485 -201851 43539 -4729 -36547 91403 -33728 492472 45544
23008 529922 167940 114278 50348 -145541 -113183 -112607 110319 62086 -135178 -24514 -5372
22996 -214760 83596 227747 -23709 -5143 1438 -112828 53483 -261034 -169454 113366 57668
22985 57668 44422 -154013 1651 -122760 359699 382069 -180826 312197 -99224 -76930 -242354
22974 -242354 80753 -224158 60501 -159678 -192775 -25940 16668 -76406 -189401 387554 81484
22962 124927 107107 71387 -113909 157567 -132651 -179558 -139887 -139660 -57772 120146 33124
22950 -145316 -73713 96846 135275 68884 -157653 87262 161388 -4613 -342463 -62891 -209495
22939 -209495 -185471 181523 -270571 -195283 -94403 -286437 -28999 -106899 -263865 89893 134447
22928 134447 135807 -101003 -192526 -29576 -69423 -56093 -159189 -22983 45641 80552 67997
22917 67997 -25228 -184756 -278335 -40984 -187707 142986 116371 -204430 263010 161279
22907 161279 -3665 353302 4970 92237 -183525 -383226 183285 -80440 -79978 -213814 73179
22895 -263788 86944 -184242 -58273 -233556 180313 126459 32254 -227145 -165108 -193842 -91442
22883 -73366 -266378 -130407 -168632 125601 120939 -240034 -38029 -202410 -362040 -168372
22872 56081 -343706 -113061 -14148 75826 -71976 -181272 47027 3982 77674 -102861 -331729
22861 -331729 -218793 -119499 -90125 31194 -204678 264353 65283 111246 156006 -37611 -56571
22850 -56571 -349562 -64545 -240925 416006 90022 220300 -155141 -341383 113327 -54080
22839 379356 -116335 86894 128997 -169956 25605 -132584 -285744 -73832 153608 -28254
22828 -103579 -195577 34144 24993 -28174 -136850 -117233 18261 -23086 246611 -138033 49342
22816 332027 -10485 -186208 249252 16067 -51951 -92087 -132230 24163 -2772 -30336 -149857
22805 -149857 -357720 -64504 47091 460655 -144098 -95350 -70438 -104818 69775 93201 72365
22794 72365 -13130 -187599 -51168 35740 -141800 -103373 -230304 210822 -267098 48401 49876
22783 49876 -48782 -77356 -266262 211743 -390626 -163064 19326 -42033 -45390 -125561 -355807
22772 -355807 -1929 -155585 -19854 -311716 2390 -184163 113757 -147531 -26877 -58719 -35973
22761 -35973 101177 -25238 380665 -139202 -206640 181842 -273509 3400 7898 -39248 108195
22749 -110207 41067 267053 -84229 -72457 61614 -56204 -96854 92675 62225 274515 -149290
22737 128686 291020 53339 55141 76767 -172266 -349825 222809 -168141 -34612 95106 -111036
22725 -383796 -28984 -215940 6622 -176676 -55648 143018 287118 -203203 158507 -171040
22714 -128782 -369387 -191449 -148160 -44974 21122 -17711 -261739 -44113 19501 -217089 158314
22702 79662 161484 -424116 163474 13891 209033 120400 -116319 -57584 162770 -196879
22691 -262662 85424 -167800 -177874 400501 36452 20976 -39554 343988 25110 -293847 -408894
22680 -408894 -17081 64723 -43833 -179779 47862 29748 -234718 -185630 -374024 -250923 -531493
22669 -531493 -239127 103063 -186671 211239 36800 -162988 -132580 247597 117481 -137499
22658 -167114 186655 46663 283543 114730 -304339 -145296 -244171 -13559 -269443 62324
22647 -157922 -303334 -181086 252079 -120988 -44991 -241345 -225177 -43595 -117975 138743
22636 -3107 152987 -479062 -35268 26884 -25915 -334076 -111663 95261 71556 58473 151073
22625 151073 -186955 354148 -68197 -422533 363393 16840 -71034 -305219 221378 -78367
22614 179892 -1346 -68607 -7890 -29591 -140306 -178349 15788 240327 -47957 -42830 90864 -109135
22601 -65800 40057 125635 -227011 -61876 -262542 -277135 249577 -34415 -124119 -110407 -22429
22589 -123804 -37580 258193 -331913 -171816 -248535 -169787 -34330 135425 71653 -290220
22578 -41396 -48612 -194373 -151062 137411 87887 18922 169365 188943 -149509 29900 -127879
22566 -72507 -346720 -95262 154118 -145562 -45478 11433 94220 -190960 -107150 -130632 16036
22554 83475 168115 541066 226183 62323 170915 -65840 -82442 228148 -10429 -39475 -218352
22543 -218352 42686 -124952 -204191 80292 -323978 143413 356265 -116418 256221 -190182
22532 -40775 -436527 -222 -331337 36615 10669 181663 -287582 245742 -92147 7879 181114
22521 181114 171657 5796 99171 12665 -280345 -275124 -208637 64043 80336 186051 -333082
22509 89134 -307587 147424 204193 85067 -24789 -411864 -108648 108857 90237 -309891
22498 8339 11215 -17275 85266 -175911 53448 -152898 -142481 -113571 -19951 -40032 -166175
22487 -166175 253698 -283726 -103316 -132269 -32576 103421 -262581 23748 -237120 277735
22476 -30042 75504 86133 -47625 10038 -233111 85031 -50471 -344476 214806 -61357 -288989
22465 -288989 -80138 -123970 187205 54805 -23054 138823 311801 -87422 101751 208262
22455 208262 16565 -89032 185539 -25344 -34389 76845 -123141 -317073 -278542 -112763 90522
22443 -170669 -162297 -20276 87826 16851 -255099 19915 -22374 174830 157308 134972 -72950
22431 -56504 -230203 71289 -29770 151249 -25446 -97629 -41974 212781 -270293 -93869 108718
22419 -174161 -162092 -287063 27060 -77402 -111145 -40369 29382 -146748 -60594 -59505 -180429
22408 -180429 57449 135555 34165 219731 236349 286058 -399652 32776 -38917 -153228 -210182
22397 -210182 -325527 -186166 -221111 -201651 45524 32838 -81025 -156221 -233414 31713 299134
22386 299134 -83881 170104 188030 218145 280434 -212010 -220456 -44212 -20459 -295915 -92081
22374 184156 46439 39987 -73198 251347 -62233 -88318 -115576 -35150 190178 -203799 -8251
22362 -165791 211917 -182434 -265659 -332514 123575 -33550 57648 -154270 -78623 -95505 -91282
22351 -91282 124063 26635 130587 -161713 14272 -174679 -72652 36835 78773 -137795 135269
22339 -203598 308 257473 -159457 153151 -32641 27761 -165941 116999 -89270 274200 -341069
22327 -374302 -68507 25834 -77271 -21809 49295 289544 -521348 -95277 -141468 74139 166722
22316 166722 -453896 -200544 -294772 92377 27418 -66119 64768 104904 11110 150133 -160211
22304 -242176 -249363 159448 -88694 121140 -44685 -320350 -61491 -125025 -92034 -145404 -280989
22293 -280989 -90101 126863 52004 304145 -82672 -179097 19267 19552 -187088 79420 -119833
22281 -138917 346447 -428021 43614 -16272 -201177 -112506 124843 -315381 -90429 166206
22270 280200 -93166 263431 110930 209740 -244603 170786 54241 -192136 -223913 17926
22259 56191 -29459 -203553 6827 46774 3151 -205783 132578 -128297 -17434 -295463 -166932
22248 -166932 122170 -213033 -362671 -246904 37892 -248529 188983 -272414 -85537 -139942
22238 -139942 -49032 322945 17206 38422 9066 -167324 233933 -372549 -37536 81970 -29543
22226 -427375 -15404 19213 -44716 130905 19062 -290759 1417 -72865 31973 -227461 -276895
22215 -276895 -264055 107067 72876 73289 -36413 -102546 226760 -47497 -97952 -145310 -347612
22204 -347612 -122258 14859 -253783 -201442 -28097 -200326 -125645 -221573 -395107 -270383
22194 -270383 -24835 -108468 -199884 -78419 169123 -83733 -125714 -130655 185865 102292 -10749
22182 203334 -21607 36890 -372773 -153310 -192666 -52665 -19299 12183 -14410 72876 -239434
22170 -164688 -9425 -3240 -55835 -171350 -237078 -127780 -429140 -120838 133066 -65771 -149603
22159 -149603 95093 -210197 -104050 -180521 123766 -100140 -62926 230283 -209134 -3560
22148 150377 -221712 211600 242763 5390 -205718 -126837 36257 3390 -107158 -168379 -205166
22137 -205166 -85900 52812 -178223 -265905 252395 18346 132893 -8807 -18563 -82903 67673
22125 130249 393383 -211825 80625 7251 -127022 60444 108736 305734 -104642 -125954 -275686
22114 -275686 -32818 -21736 -2742 -201547 -328804 160671 -97226 61679 573431 10935 356872
22103 356872 -252475 -17425 -154236 218321 52352 211085 74389 -172143 46511 -53180
22092 -41662 -91665 19978 194225 -69318 11062 -68571 -241801 158731 -85275 -18204 -191750
22081 -191750 15208 111640 228279 -113060 41482 111770 158049 275193 -151819 115125
22070 305033 -2823 -183711 5232 -211411 182971 73198 205836 177524 -245986 220226 -246119
22058 -54796 -30308 -31989 59373 -97238 -66862 -183532 -16527 -24958 145709 -301066 188190
22046 -96441 -144864 243824 93004 -144716 -375098 65036 -63075 60166 -226992 47622 -156242
22034 26298 276760 114106 57189 -295014 -360763 123998 111812 -221538 188988 -17990
22023 235578 96825 261128 -156815 -30690 -173923 -120473 80224 93525 -239589 -280150 -139043
22011 65628 315777 42659 129950 -40982 -41491 -213951 -117722 -263128 29859 255755 59446
21999 -21336 103553 -233517 -19727 317815 -383221 228801 -141574 -146581 441550 -216524
21988 156302 -190665 78876 36381 40745 -279602 -27754 -260001 5391 -117855 -15756 2501
21976 -41812 -66956 227981 -56275 76839 109332 64823 -113942 -254728 -47728 18836 -150708
21964 -172344 -330219 -21829 -230732 -6660 88895 -169745 -204779 -117039 -71643 -278386 -115928
21952 -250303 -436638 -20045 -301107 -83946 -133988 -183623 -16007 1393 -116869 -81236 3422
21940 -173283 -343440 -127045 -215364 -38801 -122443 -367869 -23392 135605 38334 -395762
21929 -17169 -250712 35019 116124 -277386 -217727 36007 -77468 121672 -75371 -172567 196697
21917 207064 -265940 112874 -50587 132300 -17965 285076 -213111 -16135 76790 -192770
21906 -25017 -103260 13770 -115445 -59166 -102807 -66942 -491103 136623 -264403 -12744 80596
21894 328025 -68031 -60962 -90078 157935 -138996 -114711 -155485 181651 -69279 98271 51654
21883 51654 -44397 -176746 105991 -80096 -85627 -77713 -11083 253019 -7759 -29596 -97325 79109
21870 -117718 -271189 -41166 -207242 -54984 -180746 -127254 163565 76306 169591 -173916
21859 -78317 121672 -70686 -48616 87445 -35057 -385133 -250330 -169214 -4319 -374382 -18589
21847 -314844 -369497 -65094 -55422 51191 -124419 76425 -66233 -105987 -178730 -137556 -212844
21836 -212844 152 -179587 23337 -284037 -297624 -107951 -41154 118889 -21260 -183172 -171936
21825 -171936 -14143 250347 -48086 -231771 302801 264372 -214602 -219905 -90958 -140871 212863
21813 158769 48653 -116398 179260 -134294 -123507 -106997 153742 -81595 -14964 70303 -59513
21801 172575 498683 24766 109941 45615 -235764 -253802 -129839 208420 -25281 54393 286
21789 -118671 169999 -59920 -75879 182988 183009 -243682 -179182 -24789 -40258 -32244 -28799 -38888
21777 -38888 -139220 47487 -214593 119269 -295257 -319280 276613 30873 114945 -122651
21766 -44167 2890 -195942 69985 -294535 191318 70313 285206 139062 -3804 128883 37073
21754 82017 -47148 82142 -129191 6000 132887 109122 -192179 194817 121041 -58983 -134010
21743 -134010 -226271 65554 65666 -70453 68707 -30594 111425 -3746 126323 -73874 74910 26219
21730 47064 28091 -134138 81918 -23957 -141137 362571 52614 -334899 13700 74742 201715
21719 201715 152672 378683 108460 -204957 -57262 200121 -463733 264909 -36716 114152
21708 18435 66060 65162 -50819 95821 -207789 -1112 -88234 80074 68275 -197214 110110 125371
21696 125371 -73470 -157404 -56797 103814 -300357 -91494 -139847 -105426 48576 65379 -134573
21684 129335 -37755 -231190 216758 -260375 -236416 97449 -47628 -155048 -302633 -342699
21674 -342699 243289 -190866 -288493 -3240 134558 -55525 47365 200324 -35605 -33921 63370
21662 -215247 -60921 -247028 80966 127135 210927 28502 -6114 -31530 -7740 -112590 145346
21650 -169501 -172737 135392 -111458 35106 -11637 -95091 -264470 139285 -86871 -162321 62839
21638 158451 -154221 22577 -333859 -224936 63543 -127264 214293 -253291 52973 -50027
21627 -334639 -54833 -15968 -218839 117694 -148622 -221197 309051 152325 -126127 -105013
21617 -105013 -118187 137590 204607 195499 27275 -245302 -283712 -145682 -47964 63439 29296
21605 -151724 -421850 -333029 157662 -93 -303577 249384 -41353 -166270 -106453 -300340 -43034
21593 173777 -121647 3347 -84196 154752 -16591 14816 -178544 -370683 -203241 173900
21582 -344638 -87337 -272787 16560 165674 44164 -210445 -125520 115055 -317157 -226581
21572 -226581 200055 79373 71925 259049 -38703 -309722 -128643 -110203 52817 -68024 -269496
21561 -269496 -454430 -178008 -288937 105196 -162668 -174370 107454 -163049 -296791 -143137
21550 17678 -89386 -303994 142026 155783 -174949 -48396 -160478 -132673 -62301 -139429 -169513
21539 -169513 -53511 199306 110618 127354 -255660 -120647 7441 -399411 -171920 99192 -325620
21527 7644 -114593 -100830 -194002 -7986 -166654 98030 -148858 43498 -79701 84814 126712
21516 126712 -44148 39190 195221 364710 123005 62793 98678 158131 -97910 -4928 250323
21504 -348860 -533415 -252260 -47397 -256000 14715 82973 -339934 -449841 -237537 -199801
21494 -199801 -53807 -154 143821 -63672 -147371 88164 -24561 -338579 23727 -348493 -59627
21482 -302427 351353 130857 -90082 160785 -137015 -47 -161624 -293827 179598 -46848 -126297
21471 -126297 138938 -221478 -360607 205015 -11515 -176930 20059 -169516 52014 -386296
21460 107242 -56709 -130472 197913 -140795 12234 -154392 79558 71882 103207 -338977 -88638
21448 141612 248497 -133031 -209187 -26164 379154 -195743 -116667 -40427 -151034 -95689
21438 -95689 -94487 -400523 75195 -34672 -27570 -226637 -85506 -137383 -2138 55137 93632 62797
21426 62797 210539 -194185 229981 294489 113199 117469 514584 179793 98494 22155 219610
21415 219610 68280 156082 354830 -28494 -120455 -9468 -187519 165389 -192943 -187258 240988
21403 -401168 -11476 -134077 94489 112424 2468 247837 -178065 -22219 -180058 -83834 381469
21391 -49272 -224861 -418844 -148599 -192983 -308427 -182620 137610 229465 -29453 -361956
21381 -361956 -261212 -27901 71275 -63985 13053 -154580 134213 -740 -171337 39189 -70284
21369 351607 -204755 892 -64518 -102460 -136003 -286510 151436 -16360 8765 -307722 8568
21357 -137386 -341360 145398 -36644 50499 -456332 -280136 -138154 -134431 -192112 -72163 -149071
21346 -149071 -173666 59861 -58111 -60034 -120661 61122 -28364 266992 103646 93357 -67438
21334 -395851 -13233 62580 94961 33036 88807 9468 -158861 -124389 -3578 244133 -116966
21322 -19308 18097 -183819 -281753 -342263 23884 -87792 104288 195310 -106118 -2738 -211349
21311 -211349 12664 80201 -176774 -226153 36471 59058 3272 -276592 45202 -207044 -303038
21300 -303038 206312 -405961 7963 -166457 148435 87073 22899 -188094 -44023 -22349 -222587
21289 -222587 62318 -296061 -56653 -132343 -139611 127668 -120394 -195301 4821 44114 -108420
21277 157294 -107546 66012 -127473 97440 34390 -374572 79793 -166501 -265692 -220389 -91367
21265 -386521 262096 71897 -59660 143053 97896 1480 35770 23800 84685 48406 -169366
21253 40888 -284132 -113089 -161705 -250190 -98305 -127884 -117786 47269 -24765 84009 352368
21242 352368 -174880 90249 -122525 -166218 173182 -524618 -519798 173876 -351393 51609
21231 -254717 -131943 -235569 -210805 133823 359903 -75929 369831 70385 -142531 1325
21220 -67942 76356 -98298 -30009 -83283 7924 217378 -208781 -110107 -154564 -297453 -243824
21209 -243824 -73067 -148683 124969 -212236 78488 28329 -30278 -73224 -287283 211472 -10614
21197 92033 -101756 -186665 -100982 133132 9619 -245005 18655 -45596 -48596 -223210 -248872
21186 -248872 -180560 -172181 212124 -332352 -261218 -100122 -202005 -183137 -212205 204990 -338312
21174 -38836 -97352 81502 -231852 -445386 35181 -101231 23024 -121945 -210767 -25146 -206194
21163 -206194 -81193 -23027 -73948 8832 -160698 117978 -186246 123636 -276322 -78393 -321788
21152 -321788 -49994 183613 -4260 -25279 7018 -45238 -194922 -124006 43188 -102525 -9834
21140 -161756 -25714 -248199 -237159 64406 -171057 90566 -114635 -65678 73203 10093 -33557
21128 352127 -166970 118158 67556 -218566 139093 246466 -266705 28020 906 -95276 30112
21116 99394 -100768 -218604 -131363 -223236 -71363 -209896 -238760 -102351 -23240 -20351 -27764
21105 -27764 -67610 -54749 -41637 -76171 207886 -58370 -113201 145885 60389 1020 63666
21094 63666 188060 -17107 68219 -494301 -42623 -80302 35556 -54445 -57863 -16160 -222900
21083 -222900 173080 274166 36683 112766 -87974 1130 -83557 -255028 6093 -195453 8456
21071 -115577 115640 -87196 -67985 126429 -222960 11054 -23374 14734 -217242 -330292
21061 -330292 -35634 121925 -191537 26804 13406 94405 50582 -103346 47929 -193793 153736
21049 -90838 60719 -497709 -227338 -219632 92093 62805 -129027 89380 -163380 -139581 321875
21037 -135096 17266 250518 120549 -62695 -4121 64121 183929 -26961 -55504 234977 228570
21026 228570 92984 -79260 52761 48238 29021 52627 -68697 -123504 -61209 -398827 64612
21014 235791 -192762 -133868 -148643 161067 -263699 -81364 161859 -149286 -209782 -99905
21003 -150517 -149010 -297981 166646 227951 -113321 -42583 267454 215129 359275 324215 33661
20991 840789 96658 411041 167550 42812 151581 -105244 35500 -103258 183146 -208460
20980 -347494 53794 23038 -173344 -178489 -139864 -224744 -280438 -179016 -310800 239668 -109040
20968 -219453 208908 -65634 -38614 215031 118396 -44736 -2242 275154 24219 -154950 126566
20956 -93102 196713 -123708 -136057 -222126 -389067 157564 164296 -89704 -142685 89942 -87911
20944 -149965 40455 -85047 -148329 49303 -36769 136147 187068 -167295 135330 249357 -195272
20932 64692 -55473 427784 126187 302218 401747 142569 -157498 -149456 6825 -76355 28669
20920 -110559 108560 -81488 114890 -52822 101193 86341 -230417 -36636 -122476 -107573 209094
20908 -172998 177044 40576 -123206 -100 -32718 -161402 -135711 220647 73159 -296820 -80413
20896 -103999 187072 -20340 176963 -82230 -58130 -128228 128517 7313 41554 -191251 140397
20884 -74190 -98275 -340748 -330070 233189 8314 119588 -75570 4616 63282 -95575 28265
20872 -439300 -535171 25356 -159256 -81176 296102 -201553 -54524 -164857 -225147 228651
20861 -271570 168223 7242 -103503 -138250 104148 -51765 10838 -500467 101005 147587 46459
20849 -287537 -196453 -377240 149956 -23115 -70395 -69241 -191849 -85623 156198 -104671 -154923
20838 -154923 272343 -212003 68477 -174415 287627 -321233 149889 -122749 -223589 -457233
20828 -457233 -134951 -324606 118004 -186052 -42974 48127 -22642 253421 -254707 6808
20817 -222174 -322370 -324707 -152833 74076 -238679 -133024 37017 -68860 -54178 -41984 -266352
20806 -266352 -76852 -230608 230046 208169 -247650 163627 103397 136184 -436559 369467
20795 84793 -84513 -170351 -396588 54544 -314155 162872 402518 190864 -122700 98465
20784 29066 -81283 -342651 24202 -122185 -132558 381922 90758 269749 -61903 110012 -16459
20772 -193122 70847 -111542 -42536 -48539 -277269 32454 -150637 136062 -66034 -100616 -120195
20761 -120195 -296045 -301292 -180694 177048 -33755 -79521 -79852 -195842 8937 -144258 -213924
20750 -213924 -356327 242243 186680 -191464 -101346 -272622 100733 -61519 -304091 -218030
20740 -218030 77936 -195174 -214955 64272 -122473 -115437 282470 294640 230554 306743 152228
20728 -151615 -80060 -138501 -143833 228475 -253254 -68503 -18212 13495 -216207 56094 -11825
20716 -150627 -54979 155572 -303340 -26988 -116725 -97017 69781 61576 -468283 -367087 169576
20704 274756 -176642 -66264 12594 -79506 -103306 -42957 -6981 -31112 -141269 -120991 180775
20692 -2805 -208678 -112592 172527 -214318 -17659 103054 -91535 56764 182291 334273 -266584
20680 169803 13702 345325 -89291 -151961 -302953 -37021 379 -173907 -26462 -75963 304246
20668 -233040 201449 -107211 -63756 -284672 -242398 -246661 213273 -7241 -394554 2470 -33770
20656 -4520 -235966 44803 -82113 -93074 -173927 -119791 -64037 -54270 245637 -245510 -224036
20645 -224036 37840 -8174 642 -95314 76581 -101163 -177259 7723 -46646 -273019 -49463 43365
20632 116029 -102658 -48546 -44840 269864 -118527 -180104 97006 211080 -89609 -2025 21589
20620 -35006 -98347 82860 -348303 -88544 -390583 146762 -66797 53956 -34494 -40991 -116931
20609 -116931 -292282 -179980 -293310 90663 -193286 8902 79466 -99211 -79100 276446 -212896
20597 25727 15179 105274 -160763 -60873 124837 -267741 -133989 -106536 -168125 128909 -271114
20585 -20821 -165649 -280385 -172114 -30482 -24192 -376359 -70910 -378177 -12721 -307616 -41311
20573 56111 202242 119860 114049 -35621 149558 87640 273528 209528 204501 -234023 302677
20561 -157405 -150318 -181631 67324 -2558 -158685 54706 -307416 51417 145284 -21729 72991
20549 142089 -257499 -123445 422150 105392 28755 -153808 -33890 -116560 -243680 -59813
20538 -57472 -86535 -7779 -173588 82853 -452552 136748 -37518 -28813 122205 -152970 78701
20526 -299611 -115398 198542 -254448 -65407 -45540 42937 22349 30828 -43030 81418 -124277
20514 -140366 326558 -128368 -284843 -109833 -153939 26137 148313 61829 -297598 -99930
20503 -317620 -132335 -354029 -163106 -115640 3050 23528 27712 -405036 -309881 205494 300262
20492 300262 -143060 -120913 110234 153566 -124138 132210 105074 -74499 45667 -221171
20481 -150818 -18163 307892 -260498 -7698 67236 -94801 -90981 75854 -168040 -95948 -224537
20470 -224537 -198343 -275032 -164808 147498 208432 -295240 -118552 20109 -18216 171082
20459 108763 42912 -182562 -262058 -477193 -64513 22672 -10707 -284324 166217 127845 -183862
20447 626 282638 233854 89455 -188592 -132408 -263633 147445 -33571 -254515 -104431 -24303
20435 55919 3692 7110 146695 -366364 -9169 -420442 -145194 101362 21220 -142589 -66261
20423 -177345 103085 -358749 84235 -132043 -139088 -116551 -275877 -26073 -94986 -54673 -30587
20412 -30587 43719 232345 -231139 -110389 -187969 205192 53656 -225076 124421 -217040
20401 -58642 -177924 -189837 92034 -27581 88629 -107399 -171956 47214 150229 401537 328415
20390 328415 -282790 -197647 -60027 -272141 -7473 -288823 360008 192356 -230598 -18261
20379 -9661 209469 -104306 -30717 107321 -44185 -12474 161846 -25507 -257435 -97992 40099
20367 100412 -174989 -311343 -309051 -126382 -181902 -68111 -14741 46650 -111378 283299 -157486
20355 226586 -2076 -225230 -4512 150039 -158326 300529 -165535 -64023 -389906 684 -85731
20343 -173139 -95578 -52348 -7873 -302854 -128396 -112458 -43474 -126338 -5629 -193651 167143
20331 87330 -207026 9778 -35677 -250015 -371731 92029 -42439 -270180 -310766 -190469 -196754
20320 -196754 -162779 75524 -216332 -119208 -157033 -211388 -177954 44450 34628 -267117 -126285
20308 -199420 -223727 169417 -15709 118101 -154837 92531 53812 123620 -86268 -158371 -162039
20297 -162039 112359 121457 -156599 271065 -173373 -147289 140675 69137 -135863 -102598
20287 -102598 -215693 -224207 -141072 -214136 -125949 -57394 -142372 -32423 -246264 -327826 -54723
20275 1609 -441510 114818 88730 74241 -96267 -5006 134276 309346 69611 -229743 64503
20263 -230 -171641 11220 -38859 -295514 105629 14574 133551 -66513 -46049 -133738 -24910
20251 302233 20590 -373769 -33441 -72535 61575 -86646 -385246 148049 21981 -243236 -139308
20240 -139308 117113 -37155 -28292 -381213 259281 -327401 -224013 -93408 73160 129565 -194140
20228 -267922 86796 192211 -117814 119062 -277428 -290720 355531 164433 -79640 -190253
20218 -190253 -26403 -76164 212324 -250622 27469 -304356 -394955 -183850 2137 -108718 -181031
20207 -181031 -306281 -200145 234201 1613 13715 -35036 -305134 -182902 -5478 -138343 -36693
20195 87572 123696 62664 -84026 -104144 59194 -47867 -166630 63747 -233136 -168778 104734
20183 -7302 28444 132955 -11299 32566 -5540 35614 -83907 -169980 -74315 308719 -54707 -59991
20171 -59991 105149 241717 134097 -238195 45641 -69005 465538 -154219 69994 -166537
20160 98372 16537 111792 -62540 -110006 -103203 46464 22216 65324 -60605 334991 -73968 206444
20147 109919 73069 52323 226455 -176283 1111 112054 -281384 198146 -54167 -106936 106438
20135 231272 341168 642548 169506 217353 680338 -18484 432997 353743 163782 44519
20124 454188 561124 257481 162163 -43014 5777 -23648 -137977 23153 54345 22244 63123
20113 63123 122110 23244 -98935 87660 145683 -77886 -54910 -66824 234655 -111550 -86118
20102 -86118 -259672 173192 -116945 -120554 -101883 -144461 -107325 57110 -207716 -326672 -49846
20090 80105 -153152 -102377 -225032 -196521 -23190 -19302 -134243 194586 -83040 -97654 -196111
20079 -196111 19594 -147474 109510 24643 21223 25632 336207 192040 368188 152939 32260
20067 -354837 172051 13594 362181 -272795 122014 -134462 261790 -244572 -139171 -171382
20057 -171382 -110196 363621 -9283 196436 -232829 -19801 -37800 9270 160327 352010 -305409
20045 -23721 -215333 -38173 29453 5428 50582 -108560 -442624 -55964 -168555 -78436 -135831
20034 -135831 -128082 -342775 -88851 -253798 -297557 -54822 176363 41153 19053 9301 59631
20023 59631 -207025 83242 289402 -223206 -96962 82963 -60251 -140121 -273958 332897 77969
20011 -171512 -443733 -38551 -12662 221130 227419 80990 193099 16263 183615 -231828 14052
19999 -364991 -13731 -158458 -2791 126468 131271 -99581 149104 -41565 -112711 4358 234325
19988 234325 -202082 398457 312868 -105975 68549 42653 260245 -154266 47273 165666
19978 165666 -170928 310917 11546 30454 105470 30590 237 226231 -156187 -142734 7674
19966 -66075 -316164 80684 -218678 17920 -8143 169655 74004 -71202 -116659 70449 231789
19955 231789 169630 -269320 -193122 -121471 -88009 218966 345614 -199883 -113145 211260
19944 -177491 -314808 73811 349814 239422 319528 -63403 -111204 -94065 26199 124374 -160233
19932 221026 146268 -452361 -138467 17107 -9569 -6697 -128504 -85198 18665 -92129 210060
19920 -54818 -171222 32167 -199517 -83046 -103834 16597 -76848 -186737 -245818 -196915 126605
19908 -132992 -292753 40045 77330 -479082 -357304 -210905 -107758 -235921 -504055 6694
19897 188706 -194944 33077 -144212 -232925 87012 -285327 -15435 199039 13152 148431
19887 148431 75831 44934 77385 217015 -19552 -278884 -76087 -7664 -151652 -67627 212287
19875 -236451 -170930 1482 -58608 410720 3582 210130 -218910 135073 -21111 -100761 -14605
19863 79615 105256 -13132 -243864 67842 -164680 -78770 122398 -235467 -102823 -423004
19853 -423004 301646 39476 -99130 -65840 -377910 -166637 96356 -47795 -32373 -166313 -229721
19842 -229721 234051 -294303 -193870 -204186 -85505 -54716 -45673 106144 -99815 -18013 -103539
19831 -103539 -214847 12797 -173242 -57557 79516 181256 85333 105327 197388 -421073 -56245
19819 155253 62805 -22111 -314340 1252 -60166 5775 116514 57663 -309587 -97170 -83434
19808 -83434 -274775 -2054 64883 -16091 -10792 -289021 -59664 -117979 46869 -19914 -297658
19797 -297658 -222085 -240193 -56277 -32875 -58140 120557 19032 -132414 191350 108190 261818
19786 261818 -121842 -39648 70114 -155372 224596 -195672 115051 -5620 -136339 -123390
19776 -123390 -239767 -66226 -128947 -47845 -81668 168044 191823 -51156 -37032 -106986 -219790
19765 -219790 -382004 -138111 42190 14735 167439 -99613 301490 356612 -72727 -34370 307618
19753 279819 -22192 -195370 -114578 -2308 44162 -52352 123204 -67068 -55583 -41423 -135437
19742 -135437 193622 142522 -101167 -187395 239625 264479 3754 -200929 -155316 -57443 266496
19730 184833 -162256 114223 2270 34011 -260407 -246021 -125547 -542277 -1391 24916 -4128
19718 294591 -40499 179563 60333 280055 585628 431427 98399 -139378 194363 107619
19708 107619 61880 -99828 52676 -93536 85866 11143 -202760 -81386 -106652 -138463 174544
19696 -66342 178411 -243318 315642 80830 34619 -46825 113061 409343 128401 -98156
19685 130681 40881 74803 -70144 36220 -31934 490294 148365 -237628 -13232 211278 -63629
19673 200718 -147031 -85751 79559 32905 -134682 -239086 -228909 23097 -231607 -297183 115727
19661 8811 -51971 -4775 -215412 -225233 42069 -310390 -115523 -21289 75693 -214302 -29552
19649 55606 -28833 -149056 80059 -239790 88862 -127044 351124 -196943 -7695 -148493 -16249
19637 60219 287962 -25148 77039 196330 -92154 153372 -162874 166810 -264069 -23897
19626 7423 95540 -223412 104184 -18711 -232548 -137380 -99305 -24285 -65013 47421 65539
19615 65539 -74137 255396 5737 -138723 -223171 28790 69809 -119763 -49859 452757 -93329
19603 187379 34488 -250924 -343353 -199106 -209946 -23837 19750 61506 -87687 -61802 -448608
19592 -448608 -138794 203917 17056 -138881 77652 59688 -179638 15639 -223082 -11589
19581 -81724 -71752 -51107 -85703 -15219 -145095 364412 -95094 -144192 27159 -53790 -63963
19570 -63963 -7876 -129670 -23859 -164878 265829 -106703 107523 121833 -200275 275587
19559 -208969 -236709 -234923 -323995 156780 -111689 -166429 -41649 62066 117369 44564 -485393
19547 90812 89256 -86417 -56476 87629 -153452 116896 -150360 56841 -311715 -257529 -52363
19535 -170340 -287683 -10693 -43277 4624 -230254 -119929 83560 -324406 159239 51441 149756
19524 149756 -16748 118613 18013 48083 -328351 -260714 -327736 -117013 165536 66969 -192424
19512 64078 -132191 -285863 -452354 77376 -192103 -17130 -381857 186892 -6324 -73042 91058
19500 131005 -284 -32879 -126941 -407780 142720 88431 -8136 65873 130472 -259653 -135994
19489 -135994 -125536 -186700 105392 141550 -144665 -112548 -358635 -23185 -127575 177337
19478 61520 72683 -348695 -16339 191920 -400669 -124382 -93496 -50047 -414528 59991 -20952
19466 -238031 -120694 260769 31529 -135162 161517 90824 73185 -64902 -261273 -63512
19455 -46631 243111 -147652 183459 22933 68431 -23880 -65501 -2342 -155133 -337813 -87421
19443 -304663 19566 -291761 204556 201252 281055 23985 -208061 890 73381 64371 -69551 -126300
19431 -126300 48335 146909 -177862 -75606 144487 -293719 -213877 -115387 -71048 211298 37310
19419 -149287 -33757 -34995 148214 -171995 -86457 -30741 -36160 -279230 163945 -174459 -138045
19408 -138045 -91963 98825 148882 237414 50695 -250408 191552 -39657 -306880 54117 -45963
19396 239170 -65817 -138464 26114 -82560 -168546 -163192 -254682 124021 -116190 -75035 -406623
19385 -406623 -15515 58180 202117 -176493 -241881 -286599 -147198 -126482 -306562 -72684 -513860
19374 -513860 -309205 -438837 -237838 -370295 -59079 -101165 -252443 -74635 -270065 -573156
19364 -573156 144178 -207623 -169224 101398 182558 -40940 66261 -116835 -392943 125256
19353 -58403 -33214 416260 -526878 -341509 -158989 253158 -340289 -161948 -27706 -92916
19343 -92916 -9237 -38774 -236718 -48494 148495 -195364 -13170 -50841 -69840 52407 24734
19331 -16947 99572 -96141 -71183 91101 98252 -41308 101510 23322 -52297 -202762 202561
19319 -92959 -48959 120752 -337232 -123036 -35684 218286 19514 49425 -83258 -28708 -41032
19308 -41032 -15883 40387 89809 -353508 -188298 -207881 -45855 51597 33817 -208652 -282301
19297 -282301 -65913 143215 132916 -289664 -149653 38803 -162683 -92538 -79239 157498
19286 -167149 207128 943 54438 -76936 40061 -444347 120012 134406 90421 -197538 52768
19274 -2731 -154884 -3731 -172154 39492 291157 -112183 141348 -252159 16286 -119283 -57324
19262 -246096 255411 -4399 -313079 -87109 -64918 -275468 -174350 31723 211321 -223656
19251 -82278 -47961 76922 40507 -13825 -63927 -124816 -34871 34086 -258684 -177643 38318
19239 47034 22390 237123 219782 -244265 -231740 260399 -162709 -195417 -123540 243893 -117008
19227 -21840 -101751 37515 -362684 19833 -411192 -11959 -383382 -299322 -214661 -151263 268367
19215 12705 -261408 203404 -338934 149732 -223890 -32615 -152858 -311341 -257857 -169295
19205 -169295 -131077 -79731 -184910 -325850 -129138 -190491 176629 139768 255892 -25724
19194 -141396 14215 314129 -122793 102648 -217750 84667 171501 167912 -243166 -145975 -177296
19183 -177296 -190691 60983 -157489 -18668 -341582 64619 21649 -112951 -241005 -59382 -12061
19171 -532175 -63986 -221923 121785 -149188 3429 21383 90086 144735 -272140 -83780 -131919
19160 -131919 -259802 -227249 -216635 4747 -147263 -350915 -179649 -191183 169493 -21255 -101184
19149 -101184 24421 -244540 91411 -407674 229241 -276245 -36686 -1369 -17933 -134725 -123078
19138 -123078 -25141 -42636 -281857 -70578 -221438 -256935 430694 -158350 36985 -180834
19127 184641 -48643 -108587 -131433 -46820 36318 -24663 7454 107188 -397491 -110451 -5627
19115 314786 -73427 -48042 264169 139622 157284 166795 -125863 4713 -118799 -132361 -414005
19104 -414005 208221 -73657 17174 -228293 -62433 -95711 -205108 96245 -58902 77431 51887
19093 51887 4676 -159806 -240893 -304625 19735 81843 4896 -119638 75312 -82784 -191654
19082 -191654 141962 -7045 -59155 58529 -12045 -2469 192610 -16859 83366 -199276 61756
19070 -213074 86985 -133008 -273833 -462476 -154304 37296 -155644 409536 -7768 -233223
19060 -233223 35754 200088 143279 175668 39736 117036 -113413 126902 44557 -141022 -69363
19048 -241919 13817 -131257 116878 -159358 -244670 23576 -65664 -186726 272154 -145881
19037 -79448 -36298 -202372 63352 102966 -143152 146620 -163698 -132444 -316075 -191098
19027 -191098 99922 -77097 -16558 -63411 -88015 -210442 -136396 -186986 -80981 213953 87598
19015 169601 -201203 8463 -300383 148736 120000 174330 -124148 224902 390587 -178588
19004 77166 57963 31905 36821 -103274 148206 -16797 46668 112965 147863 46428 -14283
18992 21592 -278561 -279090 -153469 130914 -181954 278888 33696 57231 -44701 -63950 51956
18980 350659 549 -91189 143907 86502 148148 111954 -68584 -108391 -330166 93947 -146372
18968 -89104 -235723 -183124 188591 185533 165923 -231475 81241 154231 403256 563181 281103
18956 190693 225504 338506 40508 12474 176513 78079 -104578 -156975 117643 20780 -103580
18944 6587 86152 -212133 93122 75380 -271195 123259 -311403 -300530 -469951 135237 -185179
18932 -162228 -26755 -394743 -140322 -10090 277385 81252 96853 -170657 -47356 -24939 -38112
18921 -38112 -138626 -164580 210329 7211 248915 49829 -155272 -354076 -247652 -286835 19734
18909 256682 432215 -58415 -83255 -30582 -26210 -148643 -15434 67285 79572 339277 -298405
18897 139884 29374 -38636 7973 513564 302106 315428 139175 223340 172605 -189094 70895
18885 9860 -230289 -28768 -15661 -96173 -103818 -181516 44096 -106381 -201501 -271717 -224250 -45708
18872 18305 -73783 -201682 -170718 252487 72330 -560263 -136659 -54584 -128633 -23068 -14750
18861 -14750 20895 -155250 175454 -410751 49439 253617 -24436 -341483 -208865 125419
18850 -197437 134207 -66331 -18425 -33277 214705 90940 222878 190988 -54930 41136 -114307
18838 228908 -150501 -73769 -78671 398316 -180179 41654 -94588 -68989 10362 5922 15802
18827 15802 250928 -3626 -44494 101640 -106324 38160 3830 -398530 -205805 -261760 221659
18815 141242 -143873 -64840 -256681 -36152 40621 -3918 172432 -233827 68611 -3038 -336737
18804 -336737 192399 -37825 -53580 -247580 -37211 -68068 195246 66571 102554 119255 -100182
18792 -93170 173019 -119452 3481 14782 194475 -40378 87641 -197247 -91556 -25316 212684
18780 -59148 -88023 365885 -264480 -245951 -177432 -178183 6784 279658 -184478 -173655 -314514
18769 -314514 -188465 -182540 248631 -71336 -268777 358 -102132 -207669 -113385 -287404 114352
18757 116447 -293492 -231971 87948 138615 -174708 -249016 365310 41158 167031 -171729
18746 141085 -72672 -155626 -166166 64506 138328 -165739 -144598 16236 18763 -63762 17239
18734 129224 83539 -519426 1078 -262620 -222800 -223546 -208956 -59438 -330139 -125977 -374926
18723 -374926 -155422 26637 -109128 40559 3316 -583217 -81432 45986 70629 -85189 -166497
18712 -166497 -125775 38126 -413796 -106176 -339862 134084 -239277 209569 77290 -43667
18701 -143872 -70623 -298922 -241999 -113840 -73306 -255914 -73274 -391625 387858 -98511
18690 9979 115444 -266868 142787 -158602 -130530 -19661 -178984 17796 -53267 -142104 -96145
18679 -96145 -40700 57733 18044 7241 142328 -136368 149726 42823 -57419 -283966 -55223
18667 123909 69404 22237 -49539 -72090 -96702 -50764 -69349 -35859 -191418 -68881 78457
18655 84029 -4393 188471 8629 402 73347 29676 41782 110370 -174551 -66366 -84433 455076
18642 -60950 -123124 -72142 -162763 -168108 7570 -14169 -172846 -363706 9229 233415 -242899
18630 -131343 51854 209094 -29780 13240 -202632 -55409 92107 -97848 -90115 -96105 -114616
18619 -114616 95189 300132 -19115 -154188 -87971 127510 255522 85961 -286666 -175619
18609 -175619 -168241 50061 -59697 -76679 -331423 -19129 94967 345361 206374 209870 -104073
18597 2830 -211531 -67443 46929 -185170 -66365 -348455 91202 -121136 -103824 113175 156390
18586 156390 266315 2263 -192723 46039 -23040 -447360 -12060 -409952 187201 -203661
18575 -191538 -261754 137767 -112476 -160187 -13173 -157376 -2454 -238832 -356213 6686 -515208
18563 -112756 -249373 123000 -384790 -52058 -151575 -144447 -97829 -140336 122466 72268 -200035
18551 93320 -176753 -200431 -168035 97600 -345667 -283170 -121499 -68848 146262 -249845 -129906
18540 -129906 -121340 -24032 77022 -7880 -156269 323653 53977 311731 -89664 58173 -27970
18528 225442 182712 9294 -188740 204481 10850 -130803 197533 30655 167870 -70162 -149455
18517 -149455 -194959 -55132 109034 -425 -97583 65100 -443960 -80987 4115 -118472 259688
18505 67145 -67125 24390 -187112 255492 -103969 -395717 -142528 200172 42657 -166211
18494 -85473 -23354 166196 18522 -367383 -244513 84524 -74708 -334308 -48968 251242 -282131
18482 117349 -362174 145207 99297 -226536 33280 -93580 -141161 171719 108574 -476592
18471 89903 -156448 -27348 -66838 13662 -125341 -384581 -29361 58995 -260118 -105351 83286
18459 -59712 182501 175460 -364566 -172308 -105475 355636 183207 25076 76729 -399629 228030
18447 -88883 45426 -15918 245213 -192778 32808 35654 -86035 25023 -242281 -143345 33301
18435 96129 114749 51078 -18823 -281556 16967 -113488 -217824 275463 -323577 -14142 155617
18423 201311 -205325 -458176 -152178 -108483 76040 184650 166549 -42527 -47269 162951 -286060
18411 -43755 -195871 171311 -43912 30927 -196017 207678 -25465 100338 2104 -196268 62700
18399 -263071 114573 51279 -7066 -135618 349820 130134 -121007 136740 -306005 237711
18388 -160758 245119 28696 78161 47423 -114932 -32827 201941 46002 -100647 65390 -200197
18376 168603 9015 -264107 101129 439365 -136976 -39267 55302 -289849 5159 53314 -300874
18364 367848 -154904 -97896 2526 102791 -25241 -24319 -95505 112897 -97717 240909 -115540
18352 -60298 -76948 -42483 -18726 -302304 127204 101746 39266 290642 40645 378044 8524
18340 -71588 16465 39395 12716 -182494 -24467 172248 -45071 247397 -185129 -84790 184095
18328 -137462 212309 -23284 -216380 108594 18490 -48087 -10570 -136253 -185981 92202 -206957
18316 44734 273498 308510 -97819 -224497 -51650 -312644 328500 -130011 -226639 17893 50465
18305 50465 -190267 98122 127320 -112717 274475 -12924 172508 211763 -35910 -11496 85211
18293 -465542 -146332 -354396 19917 -144999 -257739 -96649 171774 235380 110527 226159
18283 226159 -127689 -108453 -98340 -367342 -143165 -28771 -187331 8781 -115129 -130368 -394621
18272 -394621 -194920 -18113 -134320 -54509 -164988 -79384 147482 -17856 48896 -195312
18261 336515 -185595 -163671 214062 -219711 31055 -32878 -47764 -163727 -57776 -147355 477832
18249 231683 8024 -51270 184830 -172296 195778 -15646 -54997 -118002 -132806 -52818 43005
18237 3370 -43120 199582 80619 -68596 -151140 -248542 -371270 -175274 231701 -179031 -168088
18226 -168088 -22963 -148194 190513 -177107 -153620 15236 -212247 86164 255140 -51720
18215 24387 -43154 86725 -24409 117413 65481 -57501 -322962 121631 -39596 -53243 -74358
18204 -74358 -43983 131136 27348 77362 85 11734 -32518 84314 -15758 186638 243080 101310
18191 74333 20718 -166824 192824 -32246 153647 416031 -26228 60847 -204497 -31511 -199774
18180 -199774 9229 227725 129085 43891 153890 58238 -213698 128390 -174856 296998
18169 -379937 41545 173656 51367 -68979 -65760 188085 201750 56889 -46750 114314 -192784
18157 -3780 218002 -35929 173004 -175857 -95063 136727 -18378 30170 -271313 311738 -16698
18145 -357437 134390 28064 198294 69776 -104577 -134095 53249 -126788 -42190 -251200
18135 -251200 -15619 109121 270216 79387 289145 5584 -126774 -17564 113453 100830 -26608
18123 118580 187862 -140180 303186 -117874 87843 -239118 108871 95038 150306 -231227
18112 284507 -58013 -4720 -76455 -65859 -69353 225188 -93139 241440 234456 217930 -71133 -15735
18099 -39774 90839 3310 32634 -109131 328501 17520 -69033 -78275 205199 -62442 11856
18087 -30093 56000 -134775 -189420 -101204 -41268 7884 -140748 -217365 -33317 -58781 -173451
18076 -173451 -9604 278785 41296 -57571 -79037 -354307 101757 29573 -114570 -439525 137231
18064 -162523 -96469 60118 140102 195586 -268581 219383 196698 75364 54674 15493 357543
18053 357543 -29481 236659 179150 -82719 -396789 225310 -105767 219530 86312 6096 -102352
18041 -372525 75009 -57405 -136619 3493 -13938 -150981 -201715 85098 -242775 193191 -165333
18029 16244 234605 522147 -177971 149238 -15922 -181025 37178 -63314 46566 -142904
18018 43190 -111381 168030 -284159 -828 4867 53324 -189675 -288221 49489 -270255 -32388
18006 219879 134623 69672 -15158 -71606 -42029 -22169 -152365 18235 -261515 334272 -129988
17994 8914 -337432 160059 72763 324793 -109604 260521 -186308 -271969 155189 -226811
17983 -475825 -75494 -22099 -216412 -84399 -2367 137096 -302331 204061 24971 -459540 265931
17971 -29014 2466 40888 -109295 367174 -28065 -420877 104022 -112105 30778 -122676 -84458
17960 -84458 201954 -37703 115888 183300 -367196 84130 53824 64616 -123804 -132404 -35401
17948 60732 44775 257347 40625 73677 14173 3186 256172 -41853 -26944 254031 56212
17936 -345014 -148270 -2486 -143321 433 -87372 199011 268696 -60015 -71469 4203 -284825
17924 -119945 110275 -128861 171312 -57852 100806 135927 -75616 -196378 162560 365376
17914 365376 -188030 132111 472197 -14185 88843 -256407 182638 -62871 -99316 -75412
17904 -75412 212922 293027 4868 325158 -123487 46189 128563 -79212 65793 56202 -99534
17892 99121 -18522 -92756 24361 167955 -286437 -67188 78230 56592 36443 134818 218577
17881 218577 332710 50555 -200133 102334 -230356 60684 339506 36683 75043 20109
17870 49188 136164 258072 -202424 348229 66250 148637 43173 -195388 -64166 -21776 -186722
17859 -186722 278034 76742 162014 173444 -114655 147314 127652 376437 156139 292575
17849 292575 -28704 64298 -6019 -204288 17006 380448 189630 277390 339316 -304594 455486
17837 42109 141479 270752 35438 205417 -122804 212544 -62878 64990 75371 -96248 -69183
17826 -69183 -283719 296564 -59789 -172598 -117949 -115853 -167486 -235053 114253 395743 69598
17814 -115434 1193 -181807 77478 25368 -34616 165386 -213533 174474 65912 -324759 294784
17802 70163 65359 -4939 434093 353499 -180749 152278 196928 -155219 181896 889 7627 -151254
17789 187141 -67149 78510 11126 57025 274914 584010 -69927 -99165 29594 186445 205309
17778 205309 -125259 113513 -131613 9284 34133 227634 4958 -68099 296756 397963 176311
17766 173384 122150 -263274 24670 351436 -60897 340246 404543 -243622 -175030 -278557
17756 -278557 90083 232767 62039 -305564 175524 -114450 11213 288995 -42666 40444
17745 114748 18871 -23746 306329 -63678 27761 -156957 -36192 -127715 357641 -165202 166849
17733 156644 -48902 83192 -57608 -23943 189062 182179 288295 290860 351603 406716 172302
17721 176946 82248 105746 137503 323617 51706 -144331 -55150 215120 132742 -250993 161704
17709 14892 194363 96567 -81337 222184 -57493 62321 -216991 220441 165234 212780 193355
17698 193355 -144268 230569 937 44729 275149 -257164 -84609 221297 94630 236427 471604
17687 471604 -144881 12903 -73423 179420 116844 225833 -2611 -182751 13962 177464 115474
17676 115474 -200332 243436 155679 -126626 240344 265865 256402 -20438 133777 157509 -203133
17664 166114 -33159 -85118 99081 280908 -18517 -144547 -215535 315205 -22728 -96517 135386
17652 -83976 238634 106981 -172672 -71262 196388 -192742 -140717 276529 409189 258028
17642 258028 -61246 194451 -23672 -27999 47324 168002 198170 15804 352785 250059 329831
17631 329831 367119 -72391 96579 103578 203995 91714 300543 36124 125363 237874 236675
17620 236675 244841 457033 161409 274770 417873 31818 30427 357878 133872 355716
17610 355716 91070 66430 -58783 127551 343076 134546 203153 207096 357039 172308 175754
17599 175754 105873 4439 87163 164138 73087 173353 285803 317276 -66931 47486 207597
17588 207597 -133250 380352 457032 213116 146106 197176 3647 102777 -18085 55642 50187
17577 50187 291553 68148 105244 174784 40002 146268 7 -38136 123009 57053 344985 323418
17565 323418 -69752 -56319 126526 37157 150244 108920 343361 303941 134240 268341
17555 268341 252777 -50403 385267 320294 198704 470856 418944 181556 185525 130109 148197
17544 148197 213407 157896 171685 -35363 209446 152925 215524 129162 273016 267587 -18557
17532 411018 381744 137352 437403 84524 273157 295394 95965 138418 57669 296653 370557
17521 370557 623910 365541 332881 25335 347329 484871 310982 437406 666286 100437
17510 798882 991597 783519 1087399 942147 673225 811043 578370 436309 60249 480279
17500 480279 397749 504590 528993 444989 602452 513887 988117 964625 1094630 1021583 499839
17488 480223 541798 207080 179910 483690 420710 312503 -6338 105099 351285 158120
17477 336524 150283 -88743 315816 159334 423130 433280 549909 55003 331037 386256
17467 386256 172576 109559 -56849 394518 137413 198314 -112564 306355 158130 193022
17457 193022 477051 280457 285109 548472 315073 368240 164024 558935 134667 119166
17447 119166 293213 372193 315376 -27851 325066 236401 329274 182393 367045 129585
17436 382151 262355 307520 280560 390025 230272 279017 254870 293079 232832 302302 560506
17425 560506 396761 401725 31016 413540 162951 -45728 304534 286629 661907 673360 375465
17414 375465 413304 174593 111882 589650 435058 119155 87359 341097 626691 30318
17403 244630 440672 465361 236505 394155 -70854 60379 441976 175068 405753 178315
17392 367896 434926 274995 105872 189844 74698 40178 153076 163460 369866 397859 474722
17381 474722 123438 325364 254350 129483 297385 207040 428615 246004 470996 361838
17371 361838 253114 483080 210973 237937 199428 -100845 114976 263072 362473 450183
17361 450183 128189 305672 328918 573848 104463 44134 300973 446233 149393 299172
17351 299172 52151 231141 325646 72669 -88182 269915 311918 424081 322376 -1387 443467
17339 -22581 202078 289670 144550 418042 469018 219016 102208 416155 285003 -33441
17328 308379 331200 432577 225209 509378 331549 84697 376770 70337 370598 254035
17318 254035 345110 -89089 194953 202484 237750 443559 262066 217214 273723 184898 131866
17307 131866 328949 407196 302549 56100 336390 238625 347458 282175 476469 198581
17296 728306 237001 308668 143125 68984 543284 424467 706012 53247 -25105 285574
17285 212537 -1549 -135320 194920 221308 284349 -50354 724539 347538 138490 258250
17275 258250 227612 152415 519850 121036 376710 158766 428299 158141 125808 480236
17265 480236 249093 398855 240906 384230 287440 655804 232528 272477 245126 578713
17255 578713 481409 340110 21198 485173 276908 96964 148669 337447 321341 385057 -40381
17243 347008 -20500 436913 292153 340373 568750 279752 439580 480684 415216 204691
17232 447948 16482 483466 484039 200761 206018 402718 398606 459141 463434 341031 174706
17221 174706 338911 351412 487473 191798 538153 505691 352793 209579 416236 297324
17211 297324 320840 560338 63039 548440 463792 598219 370171 666426 467144 338863
17201 338863 107045 485504 692360 355329 440599 186983 164277 569678 211321 376606
17191 376606 508364 545417 369421 577575 349462 334988 514011 235118 579095 623224
17181 623224 419720 466107 486915 484489 131287 386086 691604 417551 304908 464123
17171 464123 653183 311491 363257 376552 320418 535186 505423 808134 556043 11465
17160 542996 608129 300389 378949 459450 362067 290619 427256 484477 357830 413660 454376
17149 454376 502411 518275 496244 507093 364873 527421 433920 348108 645428 178244 761036
17138 761036 581960 776694 706881 690711 392777 772712 678519 588310 483604 557943
17128 557943 589013 439412 347120 441597 281272 673875 629288 278995 309724 460801
17118 460801 497394 675809 572283 841925 447179 508073 351347 797985 459339 426393
17108 426393 744561 709813 717975 78843 492709 421184 352404 656341 698211 684132 424720
17097 424720 410290 512314 569169 703648 254195 649372 851256 654012 410601 639821
17087 639821 566239 617444 600129 504085 646206 583900 874676 725574 872537 682574
17077 682574 710067 679803 744348 679296 299639 537478 604768 541350 759671 963850 550774
17066 550774 588280 813517 716076 769414 533212 683782 588360 575021 958038 901007 805697
17055 805697 859901 666471 772612 743511 1018367 939107 981049 593791 884596 842684
17045 842684 792971 900447 851001 857808 813103 811338 675472 970041 748159 1098724 818683
17034 818683 877992 784800 1212112 960164 746387 1218284 509340 571843 1249999 870608
17024 870608 855671 767652 501484 476174 697198 966645 1137881 1181451 1253386 872122
17014 872122 1063961 1501301 984687 719409 1078352 667993 1289370 818531 1126241 1088642
17004 1088642 1038060 537657 1160877 893272 928603 1041530 968514 1095969 843543 1227173
16994 1227173 989385 945035 893122 708923 1120610 1249396 1160516 1121199 1123916 1572711
16984 1572711 1133501 1129997 1151473 1196739 1155924 1347573 1459718 1627606 1036284 1342364
16974 1342364 1018657 1279218 1014162 1396680 1142354 1252235 1121490 1363741 1298767 1308516
16964 1308516 1167833 1300526 1247821 1282835 1400835 1457656 1395333 1273394 1798347 1565243
16954 1565243 1341928 1509275 1575691 1197117 1442082 1579730 1455107 1498917 1776692 1601364
16944 1601364 1622661 1218335 1498648 1715290 1216683 1700941 1583341 1589201 1653493 1789592
16934 1789592 1641290 1495156 1621897 1604384 1659582 1786822 1602554 1755546 1622423 1964658
16924 1964658 1716935 1729283 1705063 1933127 2233003 2007565 1950986 1969121 1904103 2218201
16914 2218201 2511760 1997440 1833012 2009512 2019028 1879563 2264763 2277903 2261577 2432114
16904 2432114 2107602 2407458 2121982 2124356 2241298 2161666 2350697 2771403 2519467 2353758
16894 2353758 2683381 2414909 2611272 2312200 2392271 2439905 2749994 2312508 2700072 2510227
16884 2510227 2648160 2430007 2916717 2735292 2790479 2866840 2710855 2972911 2872017 2749505
16874 2749505 2891628 3018727 2905626 2933278 3424195 3134297 3321097 3288648 3516900 3501461
16864 3501461 3482915 3438004 3386171 3753003 3397951 3581617 3640692 3603456 3607255 3890706 3799108
16853 3799108 3720340 3722782 4097027 4064924 3967813 4121378 4199612 4272258 4177907 4074094 4802060
16842 4802060 4594764 4520377 4931514 4941914 4594567 4605140 4690918 4997059 4827900 5108905
16832 5108905 4684347 5347080 5380525 5411796 5649602 5730587 5830681 5861920 5962252 5888187
16822 5888187 6028760 6231236 6159636 6575569 6364956 6445967 6899713 6834523 7159689 7038516
16812 7038516 7250840 7341475 7573724 7739808 7570705 7987916 7949670 8007945 8322504 8626409
16802 8626409 8524459 8739867 9310669 9086882 9404091 9723643 9936276 9708163 10166094
16793 10166094 10182076 10332697 11111859 11025362 11229086 11506193 12127035 12042506 12373834 12505260
16783 12505260 13160728 13179721 13611090 14114795 14134225 14912718 14781709 15005723 15527206 16213672
16773 16213672 16619265 17162099 17426459 18180908 18365575 18753500 19378290 19974945 20501850
16764 20501850 21177565 21620250 22448591 23301406 23613893 24450246 25027245 25968652 27016658
16755 27016658 27692719 28641834 29731976 31025135 31981769 32904381 34203058 35675894 36563258
16746 36563258 37936287 39367333 40979570 42339562 44087104 45740761 47507854 49580456
16738 49580456 51426455 53434651 55479238 57965660 60155688 62578458 65138004 67931093
16730 67931093 70921348 73651050 76860124 79955336 83098892 86298756 89833511 93223940
16722 93223940 96796332 100520503 103686917 107633007 111190705 114580699 117997592 121021201
16714 121021201 124326882 127147180 129426210 131938827 134290971 135550639 137290004 138142134
16706 138142134 138466889 138257214 138002831 137122833 135732426 134144856 132505702 129902950
16698 129902950 127814796 124807675 121877253 118398747 114767914 111181106 107974095 104039488
16690 104039488 100815967 96693070 93316591 90152427 86627960 83503225 80054880 76623706
16682 76623706 73744302 70415688 67889500 65268535 62438024 60413609 57638939 55603354
16674 55603354 53050349 50935355 49031103 47262035 45201162 43687733 41943215 39942631
16666 39942631 39091939 37769987 35929559 34645795 33624785 32433384 31072677 29909436
16658 29909436 28856932 28106026 27266054 26163406 25089287 24727267 23787668 23075112 22667434
16649 22667434 21636454 21156084 20500532 19865539 19324794 19063696 18395049 17647684 17364846
16640 17364846 16797819 16026588 15976456 15427011 15105043 14760073 14549445 13844872 13554187
16631 13554187 13114497 13026634 12486486 11960152 11909999 11883291 11775382 11039026 10691806 10349837
16621 10349837 10496720 9998757 9751860 9611927 9482580 9065465 8762507 9355922 9012486
16612 9012486 8545955 8291431 8176227 7948773 8047230 7787155 7583636 7319845 7313943 7405945
16602 7405945 6943684 6934098 7114528 6724885 6522987 6261580 6556836 5986795 6144734 5937255
16592 5937255 5834128 5714477 5977473 5302888 5395485 5116529 5046900 4944714 5122254 5236828
16582 5236828 5051475 4655209 4680781 4906500 4556484 4747752 4422357 4070185 4685834 4505484
16572 4505484 4307519 4166206 4126964 4050908 4092146 3960226 4187581 3853178 4132136 3874508
16562 3874508 3857338 3942357 3408188 3906558 3267280 3584337 3134503 3454968 3405724 3202522
16552 3202522 3155549 3281894 3233532 2723446 3174721 2950866 3008613 2936532 2829380 2819748
16542 2819748 2394284 2695233 2906979 2708103 2752678 2687378 2812188 2265458 2649941 2411058
16532 2411058 2755126 2879942 2239042 2395397 2348557 2514497 2582865 2183110 2271902 2317743
16522 2317743 2375834 2299702 2134540 1936585 2234178 2463016 1911656 2253588 2019878 2080585
16512 2080585 2179905 1964872 1857710 2166136 2149363 1846554 2093625 1932125 1609324 2079424
16502 2079424 1729516 1838136 1731428 1905472 1758397 1870230 1599272 1575277 1180186 1929611
16492 1929611 1455469 1650679 1587622 1538474 1729709 1811191 1787461 1483581 1597328 1358786
16482 1358786 910208 1375947 1719926 1430038 1527951 1660532 1243815 1611044 1694396 1252043
16472 1252043 1156471 1452310 1242235 974771 1418414 1226841 1397309 1245755 1264618 1208700
16462 1208700 1283604 924958 1000081 1284843 1259287 1596594 1020089 1058453 1187515 1164256
16452 1164256 1289139 1066587 1172619 1042109 1106419 1166172 1249014 671057 1065828 1196267
16442 1196267 1208485 1029263 1145659 1060237 1044930 1196925 1059491 1200494 980991 1020047
16432 1020047 1153244 1021750 1014731 937586 1294299 930616 678432 755533 696879 660688
16422 660688 1044855 607526 1219572 866989 891975 877341 711930 559487 912218 755138
16412 755138 902402 994836 1002761 1025007 694989 781543 880415 699499 914578 560154 745417
16401 745417 926247 751879 546306 993253 360481 1156632 1151861 607573 884876 915580
16391 915580 709726 684027 895532 487609 680569 905496 578997 728730 637051 723089
16381 723089 833063 702467 1134799 721582 763025 465644 485217 433718 752569 815479
16371 815479 693320 296733 595118 580883 565879 798668 509252 726317 397311 821622
16361 821622 634317 722205 657908 424509 676390 241175 795903 720526 760426 365997
16350 488335 266419 602993 611321 536705 725336 550476 707808 481794 758978 450718
16340 450718 437040 436823 674989 472656 723439 457824 439921 327026 569469 410324
16330 410324 724962 433059 385373 689947 523689 607868 753149 486742 349631 802305
16320 802305 315782 595518 728504 364613 508058 477051 373210 416208 793588 426259
16310 426259 314898 687629 477949 879232 650375 509761 314031 353501 465914 448922
16300 448922 520323 585442 460526 425890 186445 550990 619495 272013 399285 707938
16290 707938 388508 275133 463299 518205 556167 264497 366290 377979 374180 636086
16280 636086 731613 482725 281844 207625 291531 543764 347586 378260 420505 273627
16270 273627 691375 457885 466506 331874 136301 294954 178466 125357 356484 110140
16259 351597 765365 531769 263432 377186 386700 377057 451602 330264 237643 141957 213390
16248 213390 531689 252834 30610 414116 220383 388754 195692 215097 362089 176602
16237 513746 438074 69784 115739 358375 218789 448890 131930 475162 303694 103696
16226 132407 84164 103621 -40083 772316 196225 268638 528795 110087 196468 219056 47129
16214 733140 222769 262477 24715 -177522 394605 7324 356797 266882 329245 168128 332682
16203 332682 321822 385278 111694 148293 92549 698461 366440 415076 319763 174091 249583
16192 249583 -99084 281971 233270 203712 259185 288677 446506 342251 100505 132410 -221238
16180 391507 73578 411906 -64809 64897 257682 153231 369207 416870 -116147 -23060
16169 -290116 111454 85482 348616 282595 399612 364059 310852 317600 373385 4533 10939
16158 10939 -172579 111648 317692 103193 -96458 -31057 65378 389113 10776 268565
16148 268565 59623 60926 180204 227656 20000 207502 80599 171636 338611 163835 393223
16137 393223 202202 373669 200851 -122029 215844 -43607 105188 6783 292526 -175905
16126 237745 117496 366792 -83938 206630 14585 23400 218588 198612 73944 264561 -169055
16114 -141571 -98031 357413 53104 178056 109683 139518 -71859 232320 81387 99036 188509
16103 188509 248477 100786 108683 45006 436310 -297337 24189 -28565 -207323 225601 -105948
16091 384330 -246963 36424 5821 -105636 -201354 290586 84266 220776 8986 323845 173879
16080 173879 278583 -126336 -28979 -99422 -123611 96417 -32529 94777 166683 -861 217257
16068 57552 249316 -200091 301656 -261943 -54596 117455 359999 140530 94891 83265
16058 83265 153001 -132113 96617 46352 30478 -24066 32994 -159759 491602 -61051 -154684
16047 -154684 140489 44993 -93350 109830 -67099 76121 62947 164198 125202 -164150 297665
16035 418354 145804 137330 142954 -10808 -99300 187535 23256 120899 229734 -307105 73256
16023 86113 149189 307672 54690 438780 232999 -122113 93481 -212106 127979 238069
16013 238069 433082 166239 -162511 -200877 -230214 93431 -163701 151442 396591 -83239
16002 30513 132081 -53126 -15996 -164877 -17465 60232 62180 39031 -55128 290732 134568
15990 -182865 9090 169523 284664 93666 323765 74982 117503 -173309 -3133 -94011 78597
15978 -284158 -94624 -106376 36661 190568 498773 424173 532408 607581 759263 584738
15968 584738 822064 829276 664233 1025721 255567 360169 317871 351455 127016 163574
15958 163574 187789 138333 155534 -51769 -194283 -245254 -18011 -8145 20313 -106771 -100244
15947 -100244 253487 11157 -72068 33731 282669 -177738 -119730 3620 -102061 -126021 -280032
15936 -280032 -218901 5480 70695 -92261 128932 215062 -122887 -124257 -55383 -385600 105591
15924 -173416 -245986 199353 155432 9966 -7198 16887 119388 46178 -93257 -122769 25396
15912 73863 242736 -250261 -474275 8472 35550 -274097 392 40705 -76783 1530 -39259 53980
15899 -161510 241142 110882 32660 225885 111029 53040 -84437 63689 275787 1631 -2724
15887 -75076 -250096 -62510 -261033 -30569 -150387 190389 129975 256290 -272617 93503
15876 82116 -12970 -100756 -103170 107363 50525 -39140 -182650 77164 -83044 71062 35636
15865 35636 -182763 416617 165140 137311 331365 2799 103304 -320256 -51540 221028
15854 -76971 -54175 -328506 -90437 59994 -433056 86386 -150759 -7359 135177 -248513 76804
15842 -111107 215387 162148 -140250 -187617 -119029 -116660 70712 -163213 -202667 -334669 -112416
15830 -404760 104551 -268639 332226 150016 107086 53386 16307 201844 212023 119452
15820 119452 234974 -245226 62881 81335 -23544 292541 -62869 45620 -136323 241051
15809 -112471 -189255 -94045 -61810 -199222 -140143 12684 247604 -157097 290912 112350
15798 288383 -151672 198763 81697 65116 -23906 295017 25562 -78309 -27945 -141711 6837
15786 46909 -123181 -78693 25187 -355612 194313 -3803 -199045 169405 -9756 -148172 -10135
15774 11847 128953 -54333 -107872 -149904 104402 2025 -83219 26657 -261414 -52232 -316115
15763 -316115 86007 -148175 77763 264616 -54260 -346541 -132649 122863 -27383 -45115
15753 -45115 9628 -171885 -425005 -195 -90571 -225796 105280 -357 52085 100323 -376802 -185901
15740 224395 -72638 327421 79800 93235 119075 132438 22855 -106300 -74717 -198470 -246658
15729 -246658 128960 -96127 164256 -205019 71824 10205 134779 -4336 173413 -100584
15718 -210331 242618 -66141 -136864 -142973 -209833 -110987 -308237 20359 -89473 66612 -178430
15706 52336 -71691 43406 -192247 51574 -313222 -122202 -393112 -102301 -154551 34112 227406
15695 227406 -155473 364178 -202840 -90954 -44247 27181 178249 88166 24768 -320759
15684 -198596 -67668 -132520 35676 -46782 -364937 176726 186606 112683 179067 -125490 -231428
15673 -231428 184447 -134675 20240 -110414 43388 -163094 -95788 -181914 114354 -177112
15662 -209584 -203551 -179379 176109 -106797 86852 2390 9132 -36941 124960 205898 -64827
15650 367515 210656 -90902 293704 -343139 89271 252062 -24994 20183 -337025 -19029
15639 -244411 216516 189206 -114100 -368305 -38737 -220317 -1517 209769 -103517 -38467
15628 -172676 -229431 84896 -308856 173908 32871 -18706 128776 -106349 108417 -43727
15617 51780 -56100 -48154 16807 192467 -272339 -16258 74892 -334115 -122846 135741 -283087
15605 -243555 118447 29025 -30692 -23773 -175312 -84620 -90654 -123327 113539 -166664 122000
15593 -60866 -150329 361461 -20234 -1588 178954 -82107 -85587 -181044 -24815 -319446 192233
15581 315339 133875 -178290 -207764 -36561 -460555 -249628 131315 144599 -31211 -127513
15571 -127513 174062 -114366 5631 157001 -82289 -176755 114333 -169488 3203 -119330 65231
15559 -95416 -68517 -156529 -152707 199635 -63443 -52023 -298742 -217071 -21847 -87340 -55420
15548 -55420 151495 201555 88831 39897 -20853 -209865 20015 -56807 -591 -2876 -155971 -20433
15535 10005 -154080 -175587 -147335 -39888 -117543 243815 16194 -57210 416602 -153196 99852
15523 278039 31371 -70502 -64898 -98545 126997 -62258 -37305 118877 379018 -108467 -2340
15511 -207346 -54528 134885 110179 6730 -34171 349367 308946 -79568 -84345 -89238 17656 354551
15499 354551 325072 293395 175303 -46580 401031 51119 79433 -232363 300254 13467 295948
15488 295948 92834 14806 75893 -55951 46121 -51161 267609 449608 51449 340706 62888
15476 141770 125576 35943 -122945 252741 176585 -162667 112375 124179 147964 64750 240391
15465 240391 -90715 84602 362575 195040 135520 319509 -146251 499133 539659 696957
15455 696957 565188 136040 118571 254150 146897 -131564 80949 -35347 -164570 -132407
15445 -132407 -12141 38403 -14728 -58862 170589 119040 234085 -84004 -252493 31709 362401
15434 362401 43844 87974 -32576 81580 507240 252349 458174 311123 387299 827011
15424 827011 1128664 654769 765362 535801 404713 361071 -191575 251574 -284100 125199
15413 198921 -10173 16015 63885 61840 279194 2631 213270 82568 99635 -52388 22119
15401 245937 119679 -193685 3242 26457 -236979 -309123 43389 233977 -166187 -110290 148614
15389 523071 241082 -253359 -55662 58805 39322 -24936 160575 132473 64053 -56320 180707
15377 87335 174471 -294820 -18124 -74519 37497 219148 176216 39816 32376 -132179 -16131
15365 -128100 156579 -61361 -274384 133796 592158 378845 522286 172815 455810 128985
15354 135641 -28322 138674 264595 324149 45826 293693 -67727 56011 204040 569587
15344 569587 -46939 351748 166838 83006 351103 142288 -18669 -70768 278772 293222
15334 293222 36481 353252 150152 16082 26570 59654 121564 447163 169253 426464
15324 426464 395417 181909 177237 137184 501004 228673 -305305 271008 51948 102205 217583
15313 217583 136255 140367 316079 187511 106216 90337 -158460 232337 89842 15362 -107206
15301 256308 605783 154504 -61077 151591 -81288 80277 553711 286795 383616 -279147
15290 170252 -208685 131905 -76848 -149794 -55998 253642 24959 285089 108757 99848 -104672
15278 10685 176536 191917 -94301 5510 -303317 188026 -144008 369200 -97012 23854 -139066
15266 -184882 359600 77706 119500 -118803 -121003 216455 -21713 25927 194619 -66760 -241664
15255 -241664 114102 66491 -9051 -34806 206169 -179060 289533 81857 111791 121123 -250156
15243 -246496 325985 68188 338574 55518 -142480 203429 40517 233933 8002 -430083
15232 324747 57345 164153 288898 567225 1261032 1842681 1374583 1122798 1341464 623474
15221 533632 83585 -64994 494539 140745 224008 -119981 36623 -312048 10560 55005 91661
15210 91661 63175 156950 25046 69966 340941 69343 204200 -93819 42624 85475 -27500
15198 -64352 415911 132789 -239683 147972 96632 169169 318817 -18531 73819 269528
15188 269528 205136 12102 269368 -49070 235002 -85934 236207 327514 264455 103944 234667
15177 234667 247313 -5345 209265 -161384 243774 181900 170940 77911 117638 -29674 198236
15165 398029 193606 -148959 -14246 -48286 153569 -47475 -30725 1446 265310 -86695 328541
15153 -163874 437345 -169166 2950 203076 84741 82827 270933 41749 -211405 19935 261198
15142 261198 313971 187259 391770 51938 57475 -96412 485147 45308 201430 76340 -8463
15130 -17113 164298 -6417 177488 456223 70401 51477 187869 203879 306133 362199 130144
15118 230143 109331 436902 -18512 -29308 154740 52699 203193 410381 149349 347626
15108 347626 214046 346776 37102 402186 636876 69820 161304 3166 185221 10889 50809
15097 50809 206443 -35761 143759 -31415 410216 314176 -199438 224118 -31396 314208
15086 44516 326272 310254 79472 308867 225395 225039 211642 -129635 220296 -156167 21316
15074 273027 350772 64190 220431 10435 -182263 198970 -7386 556668 -177044 87439 147085
15063 147085 60672 26484 401594 4144 148183 93010 235199 309209 409303 61481 461066
15052 461066 288530 98562 -35063 411242 177954 193303 158053 578653 320070 99973
15041 465133 278981 591716 253784 501744 329637 154183 208400 320228 457437 254510
15031 254510 389005 365570 315721 332511 518903 487192 423435 462939 355301 278859 217832
15020 217832 536856 350131 499736 277393 347560 735615 1102166 691327 516194 819800
15010 819800 606341 584884 670786 372707 448541 367719 449549 505015 406111 375261 557603
14999 557603 260549 363778 205098 372341 606593 436199 781110 644344 510330 569379
14989 569379 194625 435102 232133 589841 347308 321153 233874 499280 522181 458357
14979 458357 511879 623668 342932 363355 308930 547488 127527 625791 310267 370509
14969 370509 892568 562901 588955 632451 1108043 485619 1221331 697049 337068 314930
14959 314930 364755 526045 527388 749610 790026 340341 473085 360434 383865 466365 303795
14948 303795 449769 436286 213907 130189 562687 298767 274401 351561 728548 322709
14937 329830 250292 577385 288390 335584 314298 608744 348959 411371 477454 357473
14927 357473 668824 700732 386513 482165 201614 341757 676254 580887 505912 442132
14917 442132 633356 655512 600796 1049257 1027557 1044534 1352073 1475907 1889672 1435548
14907 1435548 1730176 1489331 1671960 1280811 1200374 1783164 1631804 2165722 2008251 2092267
14897 2092267 1209300 1367461 1288180 1189328 638131 653041 558103 511392 648730 602787
14887 602787 401052 246138 354904 334374 468275 500025 585799 362863 602447 505095
14877 505095 196652 416432 685180 509492 366831 554827 608005 904577 639479 543307
14867 543307 858359 740213 512751 878682 850708 835689 668355 724439 589485 326605
14857 326605 980531 803974 834299 386001 510861 769217 727451 921238 720907 492164
14847 492164 792740 434594 399558 430107 461739 641894 464693 449710 263443 797092
14837 797092 679283 509935 549224 541130 649754 572999 524206 919770 633917 937257
14827 937257 1005810 1399510 1114086 1333595 1248598 853715 669137 878516 905761 826973
14817 826973 577028 676294 727243 402602 329889 342654 368781 726261 686312 671413 386499
14806 386499 697452 630872 867573 763810 446434 957840 557518 1040210 915421 849107
14796 849107 761397 603684 938238 877009 957568 939124 959528 651732 840034 1012046
14786 1012046 1024051 941987 672265 658109 659867 945432 608911 676094 622571 649609 587222
14775 587222 827349 569701 683577 758030 611667 416777 803957 843032 1145446 622280
14765 622280 680844 776524 640997 580057 1190847 1215611 720883 1146661 965086 1090375
14755 1090375 913793 802076 825301 793080 825881 586690 634551 494892 444932 434030
14745 434030 479990 817619 620778 733073 492942 816331 644397 834707 514551 671580
14735 671580 778876 795925 466680 469384 645232 439489 888168 734632 723221 619488
14725 619488 871693 770574 594352 967286 1085310 846717 849173 905860 658645 939001
14715 939001 1144999 1116218 1143096 1403946 1474971 1663801 1551772 1760529 1549285 968943
14705 968943 1072657 949087 900439 1107878 1093854 1296730 794475 1010529 1014871 691904
14695 691904 975932 947359 933340 1122980 1050705 1011750 1371940 1140134 1420766 1708022
14685 1708022 1797425 2285682 1479637 1386118 1311190 1244727 1482180 1222816 1093179 1305196
14675 1305196 1046391 1303431 1054418 807024 1488906 914910 1247841 1053785 1008645 1035297
14665 1035297 1031273 932172 1027571 974570 1098644 1032465 1083387 1100108 1302868 922194 987255
14654 987255 809965 792798 1070508 1008082 1201274 1254812 1013603 1056740 1036724 1253467
14644 1253467 955715 1150897 1195543 1169774 1167587 1294489 1251812 1355700 1617641 1369705
14634 1369705 1670897 1265496 1289021 1368644 1244854 952857 1238957 1342677 1470190 1319444
14624 1319444 1575237 1626297 1401734 1495649 1064115 1466216 1087004 990867 1461748 1547968
14614 1547968 1625021 1264036 1551922 1210487 1648797 1413645 1309908 988066 1254152 1177960
14604 1177960 1581624 1491227 1165708 1709744 1362021 1639942 1546634 1279301 1383840 1445051
14594 1445051 1811960 1360608 1252295 1321948 1632266 1545404 1980823 1503272 1608105 1636100
14584 1636100 1477043 1751908 1837884 1560805 1775859 1818065 1628435 1702078 2118863 1799317
14574 1799317 2013813 1864467 1874711 1679803 2176979 1894819 1712496 1623305 1816380 2014992
14564 2014992 1933261 2062477 2425252 2317416 2003394 1918732 2152089 2173019 2194458 2313422
14554 2313422 2216062 2222380 2477045 2188213 2054644 2375640 2409767 3113289 2793868 3079828
14544 3079828 3097447 3346694 3349427 3817971 3736751 4098665 4970833 5335595 6330309 7472360
14534 7472360 9896963 13741770 19645671 29934039 33757258 19500435 11733698 7172266
14526 7172266 5384942 4629788 4470709 5064026 4677091 3650526 2954148 2652341 2866350
14517 2866350 2600531 2441516 2748951 2731749 2171675 2616921 2213945 2740623 2651753 2572359
14507 2572359 2203479 2680357 2639516 2431448 2723376 2664021 2886314 3077796 2898817 3089857
14497 3089857 2729502 2940033 3228766 2914250 2921331 3241683 3044234 2914247 3149389 3040001
14487 3040001 3034805 3059247 3730836 3055710 3193734 2996081 3429465 3513905 3300220 3615352
14477 3615352 3356139 3616365 3397158 3516673 3949441 4097864 3758603 3609661 3785933
14468 3785933 3765819 4031915 4087296 4009061 3984850 4144389 4247510 4251687 4387936 4016857
14458 4016857 4271132 4225973 4382874 4565422 4493554 4661720 4272381 4528177 4622910 4998118
14448 4998118 5045966 4785064 4857035 4851229 5095805 5131876 5412319 5106129 5442049 5443638 5116673
14437 5116673 5296918 5586150 5392698 5431615 5560292 5899923 5634841 6023581 6128413 6662154
14427 6662154 5994846 6458654 6071681 6361634 6471936 6632046 6411209 6649167 6819336
14418 6819336 6913340 6905618 7191684 7041159 7524903 7710458 7709641 7439899 7603193 7877379
14408 7877379 7966926 8203854 8466464 8443995 8956564 8698776 8948382 9049011 8991574 8790051
14398 8790051 8929197 9399168 9640841 9426731 9876678 9705162 9815700 9664354 10270648
14389 10270648 10443271 10815795 10955331 11341737 11186636 11238700 11070648 11680656 11622786 11739533
14379 11739533 12222306 12292962 12466837 12845271 12956434 13166247 13527815 13256722 13563141
14370 13563141 13986805 14383721 14580636 14887197 15497891 15830585 15874823 16190994 16648016
14361 16648016 16831083 17065532 17156884 17185173 17803584 18114512 18756057 18666921 19510710 19702011
14351 19702011 20235762 20759389 20924964 21564092 22540216 22401433 22900424 23459009 23716091
14342 23716091 24182424 24880787 25020558 26090156 27064007 27473621 27780737 28697015 29413332
14333 29413332 30083982 30902430 31820060 32484959 33375793 34187500 35334617 35888646 37337143
14324 37337143 38019147 38982771 40215880 41428144 42586023 44282177 45231169 46635410
14316 46635410 48202054 49801991 51270727 52801786 54551348 56457109 58779310 60270502
14308 60270502 62401534 64631916 67066048 69654389 72323547 74788228 77448860 80453145
14300 80453145 83527212 86817136 90121015 93971783 98121676 102460793 106831709 111479226
14292 111479226 116321905 121730677 127003258 133174474 139470252 146232478 153019608 160661980
14284 160661980 168221434 176988276 185697960 194980690 205045733 215719732 226786656
14277 226786656 238450206 250802686 263628646 277554416 291909782 306075222 320199016
14270 320199016 334858137 349693003 364144784 378317281 391771327 403872835 415260451
14263 415260451 425240729 434527668 443262068 451937997 459012120 462921572 465161049 466460311
14255 466460311 468054160 466858325 459801568 453539958 447775021 438181379 425997589 412980053
14247 412980053 400189223 386841334 372933500 358614324 344305882 330343896 316316688
14240 316316688 302248184 288890996 276213887 263877371 251751069 240029773 229285316
14233 229285316 219181342 208185943 197536666 187388453 178193403 169316034 161453783
14226 161453783 153576861 146499192 139782105 133416989 127414461 122009588 116639642 111336484
14218 111336484 106884147 102528276 98688947 94494485 90815032 87179714 83813200 80797987
14210 80797987 77586772 74547268 71853710 69772352 67138753 65078714 62969735 60554839
14202 60554839 58606827 56662151 54976355 53273638 51704652 50239028 48769669 46988026
14194 46988026 45906607 44681638 43573362 42508891 41133038 39410474 38811560 37650997
14186 37650997 36827788 35603928 34746094 34070211 32941027 32004767 31408770 30869116 29915703
14177 29915703 29355042 28573646 28015703 26950737 26396299 25859410 25234266 24343572 23749539
14168 23749539 23529563 23155546 22736516 21719821 21551621 21193293 20738512 20320453 20201356
14159 20201356 19854734 19173502 18727600 18524393 18263317 17895330 17378641 17191843 16984229
14150 16984229 16516263 16118665 15729350 15501353 15358529 15288199 14581712 14346597 14440374 13821017
14140 13821017 13914187 13427566 13385036 13122987 12887274 12677815 12427111 12536358 11819090 11671559
14130 11671559 11595552 11626457 11258723 11337520 10809166 10730033 10887055 10689384 10533033 10035939
14120 10035939 9914296 10121435 9581646 9721356 9404871 9295627 9096699 9201131 8759146
14111 8759146 8930601 8814745 8866064 8350471 8144648 8163556 8084691 7995828 7833493 7726369
14101 7726369 7449421 7759101 7675311 7476025 7438638 6898105 6752465 6985880 6760312 6679724
14091 6679724 7053915 6798804 6662572 6647598 6246800 6414614 6429668 6200917 6269697 6430731
14081 6430731 6140610 6051868 5533724 6077476 5892208 5029440 5629234 5720771 5302261 5418018
14071 5418018 5514701 5242765 5490816 4918315 5234491 5033085 5338741 4876675 4795109 4952347
14061 4952347 4863941 4672322 4576958 4240441 4605889 4321077 4777806 4334520 4393576 4654658
14051 4654658 4477597 4495538 4569154 4639711 4008510 4025056 4354960 4222794 4346740 4438140
14041 4438140 3764040 3975169 3997642 3868201 3911017 3752739 3943877 3918592 3555948 3431775
14031 3431775 3439456 3775703 3340472 3612678 3546126 3505790 3511851 3253077 3317297 3428022 3341696
14020 3341696 3336931 3222735 3202250 3031177 2896307 3268608 3165226 3087389 3319972 2902505
14010 2902505 3100598 3167372 3055464 3008895 2747569 2659363 2815503 2434358 2615241 2636866
14000 2636866 2851375 2770714 2575938 2555405 2308091 2553565 2747045 2476840 2070700 2554243
13990 2554243 2604702 2744820 2457137 2478493 2027029 2209039 2366326 2459498 2165935 2450663
13980 2450663 2422137 2843159 2925194 3668604 3971014 4278541 6274528 9218170 14850099
13971 14850099 24999789 35342573 23437360 15815908 10530941 7639513 6093930 5139949
13963 5139949 4521247 3750876 3656921 3369926 3275624 3206646 3051631 2993841 3009295 2698529
13953 2698529 2589170 2759297 2618058 2236892 2568128 2598111 2395872 2526902 2378026 2295415
13943 2295415 2067206 2137342 1929771 1972244 2245928 2198383 2231640 2002806 2320260 2174361
13933 2174361 2041665 1984129 2125046 2108855 1977334 2000640 1911377 1398688 2129163 1888684
13923 1888684 1609241 2060455 1930581 1869052 1779432 1777253 2035511 1648992 1448244 1731452
13913 1731452 1860608 1777346 2171779 1525760 1298817 1485903 1602785 1813675 1379089 1616645
13903 1616645 1726693 1703099 1370905 1761487 1731445 1343883 1477994 1804733 1768960 1236837
13893 1236837 1336415 1552205 1579264 1762610 1240845 1379820 1366743 1238528 1535474 1467381
13883 1467381 1543862 1241805 1499349 1386402 1429542 1298775 1483527 1145224 1330479 1151460
13873 1151460 1490947 1438310 1383326 1414673 902580 1173071 1451657 1317843 1186903 1297287
13863 1297287 1211944 1336897 1281892 1366531 1225286 1014156 1012603 1034436 1330930 905044
13853 905044 1125120 1283900 1053550 1118195 914270 1109814 1013923 815137 1284425 1086813
13843 1086813 960661 1570732 944236 1109534 1111457 834103 1199673 1056795 902888 1023252
13833 1023252 1294181 941107 916407 837916 592834 1216889 1183656 869470 1202068 1276935
13823 1276935 984025 973831 850810 1200622 1003063 1013098 901401 1096768 1240590 897933
13813 897933 1002253 985317 724835 899934 782058 874723 894269 975065 818176 692185
13803 692185 885771 1055440 646414 851561 890784 988866 817529 864335 981165 1062961
13793 1062961 906856 907262 921543 840965 941391 1119948 1041439 833104 752092 571140 617117
13782 617117 722000 875564 699878 767707 679209 629584 680950 662006 794634 561358
13772 561358 683026 632357 645483 694702 596317 806509 620401 923839 896503 878612 585819
13761 585819 972464 921671 460315 783317 881407 745998 834831 849280 871351 865865 824543
13750 824543 534901 747047 767941 1110799 622590 1193201 879144 623418 918967 493833
13740 493833 551529 649265 530560 711030 765066 787157 512624 1025276 573927 457944
13730 457944 699377 698322 648786 735648 466329 692112 809519 907997 673000 557548
13720 557548 541877 624264 917978 656521 594573 380678 567498 599173 506459 475821 557791
13709 557791 565170 335358 154368 826041 453182 994177 770765 718467 610557 418183
13699 418183 291516 539281 540320 665949 562029 501182 552540 494104 287680 729417
13689 729417 754404 447034 555495 643827 311764 425180 479420 732957 575899 731909
13679 731909 410744 858420 547685 637390 511828 232853 175528 621841 600239 553408
13669 553408 618539 472836 425063 431674 508337 472278 471637 821432 472955 652344 598211
13658 598211 672526 540837 663895 435129 337059 263772 484334 414936 411256 385459 458332
13647 458332 546850 664119 394680 474478 606759 501686 442118 180225 560144 349004
13637 349004 423459 172571 410829 443013 325200 595586 402786 325246 515853 318989
13627 318989 820631 406064 543057 403266 361407 600743 356969 466138 390017 353855
13617 353855 495160 401021 189316 286313 158788 379333 484682 472240 224314 227336
13607 227336 482934 56900 230549 708776 463584 140525 347985 343596 353581 552724
13597 552724 467184 241541 491566 407282 471886 532580 218905 640253 199427 261410
13587 261410 576497 409651 323185 398739 499710 359649 167644 263296 218527 235199
13577 235199 335975 124878 173801 610456 420601 187556 477105 346873 134787 241148
13567 241148 216612 500338 70256 124724 -72555 470128 256228 169108 159058 202540 -64474
13555 334528 111312 709597 546433 48955 456917 389243 226143 474946 538902 320063
13545 320063 -13143 76657 436685 490190 347704 329969 106400 220544 412264 -268982
13534 589204 436058 503057 462556 338179 -65255 426798 151302 375628 475528 429573
13524 429573 -409 129744 246780 85694 479629 641884 118965 33646 203812 489323
13514 489323 454797 387869 616925 231932 93966 176221 276588 330509 1668 150003 36823
13502 332603 578625 304213 793031 161747 165716 109899 133221 6652 26681 198544 82277
13490 547816 346195 120460 422176 233464 -47159 94459 340105 206568 158421 446457
13480 446457 236163 249633 301866 162024 160326 96175 452969 34873 466012 638295 156990
13468 139398 479960 408582 378758 -34108 -18139 -247613 311838 136597 66473 148990 351180
13457 351180 306542 178518 361887 312198 -296646 194753 238696 316767 365247 259078
13447 259078 245616 93802 -11540 246890 217996 210508 323626 267389 113592 -17070 263164
13435 322902 163025 262923 209663 144011 372273 291862 305991 453219 173163 29350 -26715
13423 205799 267151 10964 357696 561820 431136 206029 244948 175763 264659 410088
13413 410088 332350 -27559 310726 607883 236791 12678 242910 111516 290402 145932
13403 145932 383127 -4266 221804 384357 200782 130505 78316 91839 204681 -65837 -37342
13392 -37342 484615 -64864 64281 59072 -160001 58261 243786 52651 177055 316740 190993
13381 190993 39172 -82937 95229 108437 279221 71393 221865 223412 430471 -55351 203024
13369 368846 204870 73786 314898 257463 83896 245758 168288 22433 260977 218125 446632
13358 446632 -138677 74144 264700 365462 346134 81194 525082 558428 82777 273303
13348 273303 220046 174268 445823 -978 258113 202181 10022 60731 -53257 351754 373671
13337 373671 132791 118223 297742 15451 -36684 44144 191373 130235 322729 432987
13327 432987 452994 161922 345903 248991 368388 -357956 299752 108215 249664 178732
13317 178732 234598 -204610 235704 527615 287892 110679 155901 386007 393975 324107
13307 324107 342428 325114 179794 -20175 413648 149013 205147 40383 -31167 409815 -5363
13295 -118817 117903 -108504 -215852 -169028 89984 131513 -158717 223057 406934 159417
13284 90295 408434 -118695 256694 156701 122324 204318 131757 124712 91769 281753 137318
13272 104075 541733 144298 162295 -38162 160348 -145954 -270594 162125 59083 361936
13262 361936 142792 -5829 174796 356206 165213 429897 30720 52595 -12978 -8982 -44528
13251 -44528 21711 11532 160344 -284233 162391 58359 33941 179576 319381 92031 124440
13240 124440 407170 106552 45213 142823 -7604 -228486 -190085 -908 52435 54165 289817
13229 289817 339567 158023 329227 54872 92503 -163340 99303 -75558 118924 254763
13219 254763 229024 177423 11404 172547 -302076 224726 -289047 341353 250724 392410
13209 392410 125109 -93153 -194062 295996 146920 238141 -32575 -73126 9871 228236 -91807
13197 -154915 -254957 418136 49937 292496 111663 -15953 157016 123929 200861 295814
13187 295814 393051 311090 -201653 -102216 -169618 -135373 -9596 -196285 104358 125404 -25761
13175 -36818 -191028 145071 86991 209625 31595 -101316 158870 195640 -55941 -102946 423518
13163 128630 -141052 352570 -59100 91391 104442 -72675 -14943 169705 -66999 236950 404638
13152 404638 46449 187573 65750 58690 -2928 113777 376543 -82500 -257830 445608 -147245
13140 -672 64148 -117503 354023 -111573 166073 -34868 91363 286472 186111 417176 110259
13128 148721 -46725 42930 -171726 406087 287238 298516 330466 198817 191425 311449 264476
13117 264476 -34336 213805 200578 206102 378944 72349 -251083 352778 -143821 -269670
13107 -269670 22039 364493 197173 161108 48414 30619 147929 -185476 -136694 -19900 -81677
13096 -81677 246812 -16604 -169221 -23356 302255 77426 272740 25001 -65375 -89157 291190
13084 -90088 -231015 69489 -163786 -210498 241071 168305 -158995 174205 -28010 9956 315129
13073 315129 319924 -377053 20258 64004 -181366 117099 -20424 50856 -10146 -52931 -3287
13061 -385850 257260 273569 4506 183030 66180 6488 65135 19117 -106488 31217 -27175
13049 -214552 -12640 -30955 5338 205977 258817 105844 41981 40737 124159 105007 -57972
13037 -166706 -88857 812 28777 11093 288511 -16128 -247603 111807 78755 -363849 320818
13025 -237071 253164 43202 -73725 -198567 -354542 -198674 20767 95355 -209009 54013
13014 -113651 573565 308253 97544 136385 108899 -195573 -40058 128786 -60991 107188
13003 100586 427363 -21377 -30013 144594 -292905 239042 63303 -209665 40886 323114
12993 323114 223370 24663 -282133 -39635 257879 -227524 161587 159697 244549 38379 380707
12982 380707 117070 -153226 -22431 274563 -166351 -135878 99272 73940 389227 270600
12972 270600 -103159 65175 -189104 135590 152523 -191991 -1458 -89712 97095 -82114 -306302
12961 -306302 195070 273621 -42553 10127 104102 122757 252640 -40975 -5510 -316792 191325
12949 -220374 -132499 316495 -23810 188761 37537 -149632 -165719 -51813 76698 158497 314415
12938 314415 27003 233240 113099 184483 23894 203868 32886 37830 63890 87172 239678
12927 239678 -35034 291782 187616 -38506 124947 -62749 96347 -156121 -239896 -60064 251206
12915 -25582 11524 204624 121831 -52445 160732 -12388 -130354 -200955 148516 -8220 -65297
12904 -65297 327988 106449 -34698 -71643 30588 115371 164408 -244130 -188690 -85715 115304
12892 71272 27165 10091 -10403 -70710 -191694 16595 -147597 -168755 -140435 -73898 233122
12880 -141641 197933 -115427 -225485 -214991 -79848 -142142 177071 -54687 -64848 -6749 267357
12868 -231895 -141598 101931 343202 121254 115735 -102547 -11428 88382 141020 72043 -26092
12856 -127281 -65295 37714 108042 265537 -132445 63852 -212891 -186567 233446 -147404
12845 -35586 358515 94405 -207810 31251 -82204 -366766 -17195 322753 74423 -165304 -178995
12834 -178995 141726 -11076 -38339 -138479 353943 -59193 -35508 -236001 -61411 127696
12823 -174269 59843 177279 24395 -228195 -52673 91826 110545 -147416 259631 -35184 165199
12811 154503 -240220 -101513 399664 -277667 -61818 33027 -21789 192777 209677 -178270
12800 286956 -54907 -251894 -86085 -201074 -19967 100051 353085 4848 -23911 12314 162847
12789 162847 -115303 169990 -124234 -155297 18363 281568 34383 -99674 215842 167988
12779 167988 237574 93663 4204 403317 104526 200086 -132968 -243234 -99450 116692 296535
12768 296535 156048 -77749 1399 -87378 -13958 70641 146582 -3160 -149317 -200528 181348
12756 -200342 44068 62361 -206400 -29888 -80927 -165514 -141875 -32655 191384 -34762 -423598
12745 -423598 -87544 46742 -151566 114205 -325702 11659 -4814 40760 -118170 282643 -268504
12733 -226657 286318 158922 -158583 17169 -283456 -379677 -106568 115113 -130991 -321471
12723 -321471 29659 272537 278557 216011 -149650 24977 -826 -84532 -87936 -34402 -8805 -337107
12711 -337107 -11658 76384 -16011 -420333 -404693 139291 -162003 -383062 145181 154250 392469
12700 392469 133281 289797 155601 130544 -113943 196299 170068 83196 -186562 290678
12689 266785 232154 71365 40148 152209 -108995 -159499 -37030 -262526 302504 84799 52632
12678 52632 -49183 -60517 204899 150731 106401 -157191 -14201 153599 27916 169312 -69122
12666 -235275 81370 -106629 260148 288867 91587 -60155 401073 -124923 51717 -288825
12655 -256634 119914 323386 -187873 -55394 -13645 277604 208196 35223 395083 -173169
12644 109195 -147947 -376375 357550 314860 19681 -22591 62360 -239439 125662 -39970
12633 431896 1653 -76767 -62159 -41784 -11713 -70608 -95831 135049 -167566 55390 -118863
12621 -273199 -43629 212556 251911 197643 3731 115860 301765 -117506 -74916 34968 88225
12610 88225 142788 523673 341262 279591 -101942 153483 169141 -66359 -6856 353681 -224209
12598 185713 434301 -145883 -282560 47683 213720 141839 113940 -77051 185291 -132050
12587 -117389 233822 83464 317617 -30432 50228 22837 116414 134305 122906 283916 45945
12575 -159807 -31400 -78222 345670 275469 109438 -64162 -156288 -246496 -77660 -124944 -132136
12564 -132136 283189 -3282 -44917 119848 88952 22247 57466 93897 43495 -92496 -98388
12553 -98388 537773 88032 190535 113074 -116994 155586 141999 294154 43444 -107603
12542 219141 -94086 212162 -100810 16121 65239 -21160 -102851 -45588 76922 449750 72005
12530 -63165 243156 200070 150926 101906 -352826 -40778 -107236 85174 76598 -134226 -61884
12518 -32226 -47792 103154 -99653 32296 -120042 7559 28377 -92587 68780 -42963 -292115
12507 -292115 -345283 -123940 27715 -53563 -102295 188868 -255126 123474 -40236 124915
12496 113210 119191 -3758 -106882 -61153 79404 -5949 -205255 -230049 27140 85769 -8717 -112084
12484 -112084 -291916 -181628 -298686 -112413 326572 -11354 -37146 -157267 -52357 80680
12473 -92949 25051 48115 64208 -127462 -264966 94782 -77462 19179 -19777 -123245 -55410
12461 -79966 100911 194538 327372 19884 -88768 -424094 -107244 177493 -235792 65125
12450 -6400 -133015 168645 -78702 45726 124014 49641 37498 -10068 116851 -29550 -29151 -177150
12438 -177150 -79817 -48359 -72307 -34068 -159092 -142999 -297813 -149298 4184 -214924 20361
12426 108369 -118585 -179845 256978 155192 -46661 -68220 -262821 -7730 7087 -216428 40912
12414 100498 88557 -98519 54817 217419 -27878 43888 -72182 -92020 -105081 -39662 167257
12402 163408 -59087 287275 -153523 -41945 -17740 108614 -34460 49703 87350 62501 79546
12391 79546 21365 -40056 1834 -394800 293135 92317 166725 -89958 -143204 -67786 -206952
12380 -206952 -100928 -34681 -153766 -6391 -224528 70123 245544 123768 -58884 249229
12369 301412 258531 49274 212448 79379 -139894 459878 288826 159773 268276 231965
12359 231965 -47169 124769 62493 206882 333593 -14472 35405 32863 231374 10475 48224
12348 48224 122680 134171 79376 46890 -185723 -87424 14406 15246 -259066 219557 -61623
12336 65855 -259635 6692 216957 -13981 12252 -355338 412446 187286 56293 -329474 -326232
12325 -326232 172517 -123452 173215 69716 221527 -32623 89618 331292 311763 33100
12314 78690 318134 321495 171998 271720 529722 130687 355304 215374 -67137 167135
12303 61131 440202 -54709 259498 163869 293225 -83172 156141 173176 -105601 197622
12292 35449 209645 71157 264626 52190 -70927 173857 267541 109038 -78420 115396 61113
12281 61113 -95120 432486 -436365 -118705 -104122 66412 -111580 100406 -109025 11852
12270 189263 180797 101732 -48963 -135300 -76887 103191 157496 258275 363295 153846 -440656
12258 15266 264676 195688 209384 150230 153074 95532 52905 270355 145577 235263 134553
12247 134553 30216 292874 262808 192566 53731 255696 351557 -69763 116876 139319 117698
12236 117698 69097 40088 253147 32724 54269 26825 -10446 56886 577589 43917 52862
12225 52862 31035 53519 123660 -26352 172169 109905 55401 200794 176022 -30894 174596
12213 65065 342625 -127052 348968 202567 99211 278755 132131 265118 -134241 148245
12202 -17993 -92675 383662 25151 101339 -282924 -83306 222423 119197 -193596 400651
12191 340999 -246360 343960 142807 112588 21182 180590 -19536 263523 27938 -14778
12180 30039 293109 94147 183033 338993 -46177 -36839 111383 -833 150058 202335 -209045
12168 201937 237262 154373 187786 -107227 134000 11485 -152969 -109886 436280 -13288 34156
12156 320253 166866 356701 -41081 104761 149113 201095 90179 160337 31515 -10665 515506
12144 354129 374518 -106037 103934 113186 98684 -59915 395343 104431 93741 17249 83286
12133 83286 104365 40279 -56779 147384 41102 -63118 285357 99194 206720 130243 125693
12122 125693 69006 -201246 56911 31237 -311203 108113 269148 393380 29046 25499 -147848
12110 402035 518262 272510 -132336 224126 187230 108328 9741 46722 164623 95243 339790
12099 339790 13912 320330 27986 153654 92459 42310 280043 161045 189903 -150271
12088 -30607 25730 -40627 15496 60537 -196244 317804 66507 -171244 190472 83914 41581
12076 -95171 204699 171220 -220921 148413 60591 -89259 400739 339380 319777 64410 195716
12065 195716 -14428 27552 565622 328882 -108578 38730 -37019 20844 55734 -5351 -1991
12053 289753 -29924 168202 107991 293970 296941 -14747 360735 88214 -105007 -24176 -75555
12042 -75555 360557 38274 205317 -42190 151861 -191429 -175716 -30057 -235872 42891 172664
12031 172664 329238 44424 117622 -125315 216801 109655 -46897 -23629 149470 195239
12021 195239 58387 -94148 14653 189079 173125 183392 -7457 86061 249081 10497 16158
12010 16158 910 -34299 -308246 -240439 86416 5902 -246174 -203599 102007 206626 472138
11999 472138 -156254 142000 9918 122802 383345 -14139 72618 -123811 -136492 -60791 314043
11987 -124176 -150873 199743 153119 -176500 241871 217242 -72853 -63819 302528 -85927 -26423
11975 -104560 -159241 105630 535827 156134 393742 142426 -280716 33069 346984 -85180
11964 114483 -123750 -127986 -15533 -214480 -72073 -343001 85498 222808 204566 86362 183547
11953 183547 117959 -180018 -258002 -27933 237967 93011 -57008 -125953 488294 -341157 -68180
11941 -104950 -185550 -200607 -70273 -103799 -58047 2289 -70752 -340141 -29721 -170289 -13760
11929 -74757 51522 69220 -98133 150642 18693 12600 181286 -51756 -209222 -196528 -38592
11917 -8730 4902 316783 352909 -104080 -94684 -294114 26363 -120153 -29583 100054 111188
11906 111188 -90049 -43736 120927 158059 -14678 198892 202783 148761 -66441 63758 -131024
11894 -227117 -129387 -222457 -288954 223840 65295 135787 68045 155318 -121018 42768 165512
11883 165512 178244 -127028 -154510 250706 -160078 -11326 45423 64815 118234 100096 -122005
11871 -51324 -128550 84047 39108 -135398 -179533 -300202 -130600 18359 -132806 117790 -23839
11859 246277 -91389 951 180641 159827 -85191 -60265 192735 -204905 156937 -192392 -359769
11848 -359769 159999 91667 64060 52297 90380 138219 -246346 -475569 180887 -133035
11837 97324 -5366 -136297 -24901 -14411 172644 -223391 -224106 14238 -148912 168762 33235
11825 89213 -180826 81028 -217804 -1493 -433358 138554 137930 -259706 -261878 -132193 321626
11813 -62517 -17172 -48390 22614 227934 169925 -30047 -173502 -14773 83835 104959 -95372
11801 -17884 -50220 288044 -47525 32056 198907 -9668 -319162 272470 43809 -34020 123634
11789 -153543 -436248 -260814 149686 14315 112371 154872 -327137 -79928 -162912 -122806 -293409
11778 -293409 -82630 63853 -225870 -68627 125227 180140 77959 54283 -334932 368051 221728
11767 221728 107631 91705 -9075 323032 -289574 -155816 131450 43993 -325048 -199687
11757 -199687 -143103 -81236 -8472 123537 -158714 149663 65752 256813 -32187 -37594 13214
11745 168031 87485 178424 122668 -184482 -355876 -268089 104536 -255373 34792 -41858 47281
11733 -112020 -33887 363433 -250562 35236 -235737 235659 -48089 198012 158921 134023
11723 134023 -310296 -129080 -38975 171727 -57503 113969 109747 -174964 47298 226767
11713 226767 -85408 -64870 -65440 -45795 -60679 1743 -120576 202668 -74172 -32950 19479 -309212
11700 172775 -86666 44475 -6446 386485 251810 113838 64482 31648 -238394 6262 5995
11689 5995 193187 48094 53941 -48087 123228 -150248 106032 -64624 -19797 208190 -24889
11677 -195014 -26820 241050 -41905 46369 -101589 -219026 -60931 -41088 286413 -81893 -178061
11666 -178061 -262233 184251 -74164 -173365 -254763 44366 164230 130789 294726 12851 -23138
11654 -37226 -152186 -175649 -131981 178290 -135496 -63339 28494 163995 130867 -106685 161106
11642 144891 30320 -202746 -144173 -326943 317707 -88143 -251410 -256053 78751 -267785 -40341
11630 -140416 17135 -58206 236781 52920 102013 220021 -21124 -100907 60600 -83776 14657
11618 149691 60413 -33430 -142654 252278 148669 150175 18786 -140432 -130477 -50834 -33476
11607 -33476 -134869 69632 239739 134541 -116804 283822 -171397 -155727 -113931 134272
11596 -225860 78109 139478 -208603 -13886 265238 -555611 117856 74574 -200357 153803
11585 253500 -123791 -38791 94925 -65600 18995 193369 255607 190922 -128580 118716 -73888
11573 -114664 -120037 -199306 -16439 -254973 209502 171211 183403 -10541 13096 -17571 100732
11561 25273 249314 69190 -198407 -209273 99211 5866 -440444 338634 11585 75642 3220
11549 -231117 243155 -316998 218185 -170819 -86200 82309 150054 68228 -20536 -171968
11539 -171968 356749 -210500 267530 7043 -69575 165965 188114 -45194 75541 207998 -206758
11527 -150105 543576 130124 89432 14068 223390 -766 -100735 -65522 9258 158532 191 63272
11515 63272 149782 -160172 -87090 -8606 -194874 -46286 182672 -96111 19782 -63520 -205192
11504 -205192 -302032 136729 -13786 224073 294635 -7929 -178298 145768 -279507 -165118
11494 -165118 -53843 357561 119833 154427 -185054 237833 147465 427956 427536 -62035 120120
11482 -173822 -47196 368877 -294950 191592 -30838 92681 100594 364038 220823 216510 117470
11471 117470 395054 259920 98495 -36008 14028 121002 6168 125104 212025 368460 118120
11459 -196955 153446 -75757 -208697 20776 423054 400322 -174130 31160 -24244 291474
11448 150185 -117185 -24326 427495 -309536 182011 -200416 -133063 -28196 -181954 15698
11437 133578 -43380 63478 -105446 142399 -97771 -61755 296916 -22951 -12026 -67187 -165616
11426 -165616 -251582 635 94118 87293 -110006 139452 -103730 -19817 138965 207807 388275
11415 388275 -62146 56425 -54420 -104533 204111 -40103 -157504 177725 37041 -15822 -54521
11404 -54521 27292 298844 98192 117934 85761 77866 -45896 19493 -287733 90934 140760
11393 140760 -168411 154636 -424122 45912 -249296 159407 -126174 -60216 -218735 -18422
11382 94616 1600 297222 -68201 -752 -402755 -168998 264941 -268932 -292209 117504 122973
11371 122973 -355219 -50337 171471 -36955 -233491 -79794 -180044 50461 179834 -129486
11360 -322383 205324 -64334 167537 273373 -140222 58301 152411 -38448 -38598 4026 45636
11349 45636 -209832 -19308 451061 -71159 67683 -289827 -102442 57738 -199624 -239750 -200011
11338 -200011 -8164 174310 24798 147895 -204204 244823 -358951 202942 -8403 -5995 -81653
11327 -81653 -154044 -278589 -253335 -122712 84583 -47787 24688 -3050 12823 -37834 123030
11315 3246 -280607 -211785 -242086 -115780 91289 -60172 -315522 -110098 -333292 42887 -203230
11303 -227886 -89997 -336660 -330210 -196039 -73648 -89251 218873 -190084 -130456 29894 -50582
11291 1953 145591 105172 -61020 -30918 76926 -136083 5949 106302 9503 -39508 -74238 -99697
11279 -99697 122503 -65578 237693 -117222 -145512 10319 -79712 -51805 -61029 -133065 -49704
11267 96047 -144584 207438 133563 -474270 -226387 -34196 -183557 -194725 -72396 -133463 -323036
11256 -323036 -340826 103284 103194 -246450 -84219 -81439 -79427 -180571 -147411 -95945 -63906 -206764
11244 -206764 96558 -53850 124856 199233 -115458 -103510 -382935 -349885 -2811 -26715 -170717
11233 -170717 3182 -54003 -78856 -5597 -177357 -124311 -242105 -148297 -139935 -63650 -126370 141326
11220 136961 35003 -71392 -103349 191771 114224 -207995 -90911 -125447 189222 -117971 -316930
11209 -316930 126438 -346892 -106346 -175540 25763 79105 134609 202565 20573 -57494 -26794
11197 20838 104454 -75966 80875 -208849 -154269 -3653 -14027 -271562 -234645 78297 -261685
11185 139921 -86602 -137875 -101637 -212624 -364384 -347578 -439179 57173 -147544 -443424 246080
11173 107225 -146792 158366 -214529 -280338 -62879 148354 -114492 -187402 -48604 80612
11162 -76458 -28459 -88126 -179743 144831 158504 -72795 -141378 14028 -217668 -196766 154850
11150 12123 -40107 -218590 -257051 55776 -348 -270071 -208392 138759 -257654 -71685 232138
11138 -64636 282233 -112248 -119040 -268175 -83229 120427 -99299 -365957 -127973 20462 -231157
11126 -147269 -250656 216800 43543 -46378 -15662 -59528 -53529 -48029 79526 251986 -141526
11114 -44447 -222724 108506 -266378 186698 -149348 -101207 -183768 53273 225280 -214944
11103 -103634 32634 -159789 105905 -11885 -2401 92790 28091 209278 101414 322346 307051
11092 307051 -114050 268199 39708 433224 156826 263926 -10582 246524 320196 214389
11082 214389 288132 14096 128071 -64884 116848 151580 45881 -62867 137295 4009 -60448
11070 -200624 358987 247288 435616 298798 12621 248830 153640 314711 126451 -159450
11059 334012 174808 163459 58909 83889 159400 382434 307151 216923 284581 246972 90439
11047 396432 205024 397576 81158 316401 226041 285750 429082 172186 455317 579282
11037 579282 485656 473731 597722 131071 535625 411546 442506 424203 633513 368585
11027 368585 695016 269716 627675 443502 518793 609164 464139 508019 502548 429785 548981
11016 548981 732710 266500 639253 495404 886678 388659 495809 859566 532374 627480
11006 627480 453269 846142 377100 607197 2239 305129 462287 58482 217799 193169
10996 193169 461660 91206 -32222 471826 91735 105495 132708 375262 526816 300081
10986 300081 209313 307915 112481 667869 535138 473670 373135 324618 149794 614633
10976 614633 328205 459324 641267 651209 612007 543955 528143 1060719 645945 785444
10966 785444 570504 512694 846804 806321 916879 852836 1356066 1071379 1701161 1516159
10956 1516159 1464695 1777793 1886457 1919412 2201013 1534925 1734020 1393210 1161224 1639878
10946 1639878 1371111 1140381 1124277 1308737 1219485 1171980 1080523 1476145 1373023 1217211
10936 1217211 1200570 1143715 979746 947959 704380 1081163 346975 375028 107817 703233
10926 703233 143383 541075 170534 145800 -139674 286723 -148063 37691 276830 -47209
10915 277818 56080 -179155 185584 -238051 -270839 -131939 -262942 48932 -174702 -42403
10904 -247856 -203589 -24232 -337050 90381 -30800 111 -249941 17950 -154718 167382 -104685
10892 273999 344489 376869 -219702 96522 -265846 30431 -162558 -109369 212210 97423 239186
10881 239186 -48885 -23093 131630 137731 -246836 -210760 -317068 -10165 -168665 -84179 -220853
10870 -220853 -248253 -320115 -11695 -61507 -83723 2125 -141626 -279183 -85666 -53223 11276
10858 53280 141266 -22256 -24722 31721 205723 73000 6077 262057 72242 215751 -260818
10846 91550 -157221 80097 -142745 27998 -235727 -207711 -48601 201696 -47146 -50211 66468
10834 -194910 -235197 -17752 -57017 -43213 88076 925 -169393 -43543 -207337 -150810 -145468 51146
10821 -73403 -78344 -55669 -188044 -209388 -285820 66212 -73235 -90103 219390 -110952 200387
10809 84963 -390307 70336 -421472 -160593 78716 -178010 -364974 -326291 330443 110108
10798 51077 102345 106646 64656 -249014 72683 49513 -206536 -195116 54701 6096 134180
10787 134180 -47311 26022 -170888 76091 -103037 211233 79784 231676 -22943 -47154 -112892
10776 -112892 48807 269006 112493 -409214 -131074 230116 -35101 -119803 -179118 -229283
10766 -229283 -99451 -36356 -214226 -261198 -198310 -12274 -4089 113321 162320 -170944 -71030
10754 -109185 20162 -19687 86576 -258485 -44885 -1908 -283892 149783 -77859 97066 221338
10743 221338 257826 -497121 327837 102911 262655 -231550 341499 -260599 -157132 128353
10732 202776 -468632 -203759 249137 -95293 106597 -650478 -70186 -263838 -46238 -164174
10722 -164174 179817 -95754 63220 57114 -406940 18879 -297458 -194769 -49720 99814 -33211
10710 -16205 -79760 -183035 -60615 8577 -42886 -79448 -99259 -211930 -108873 61781 -76815
10698 -347056 112208 67903 -78291 -164142 -364429 -31652 -169333 198628 39523 -316940
10687 -80161 -49843 108326 79754 -116010 -165988 76272 -289727 -84500 182299 -596338 144081
10675 -138466 -29548 204151 -190266 -108119 -200844 -51232 89063 -406942 18268 -269174 155598
10663 -154202 -171576 -67650 78610 -309388 -97228 -157199 -276123 253493 -189349 -136140 45764
10651 55058 163996 -38376 -25697 268394 -341260 -230670 -399107 -430330 26695 -125417
10640 -119682 26472 18341 -159129 60500 -133699 -87140 -73735 134959 181305 -100073 -14508
10628 -278592 21969 150051 -253540 -87774 -295709 -15684 -70174 17432 -38963 63501 -91314
10616 379868 -78756 -45725 71529 -197732 88121 -162376 -266339 -36232 118237 -82304 -176990
10605 -176990 63207 -6599 8321 82316 -69155 145285 -327068 208577 -285101 229624 -29826
10593 -193690 -144366 -233222 58139 44697 -284715 -105824 -205954 -408379 -127541 -123248 -162036
10582 -162036 281756 279519 410644 -88072 66620 156064 -327584 -196892 -67569 -55904 198655
10570 -177341 -33455 -337365 123695 -320146 -101642 -42082 134662 -163325 -229008 -267356
10560 -267356 -326010 -159780 299875 -360475 110896 120683 -49420 82466 -165733 -10545 -102815
10549 -102815 249101 21698 -218527 99790 -54280 -214610 -62746 354248 -292099 -94278
10538 -115387 52197 14815 -100556 200423 -12647 96797 -22283 182630 -293531 25259 -75715
10526 -89068 352511 -200503 205677 171605 -102237 70968 140682 100451 -93346 -480070 10754
10514 -77924 -126023 -129594 -1260 -5051 256979 -106169 124458 68730 16 -313767 175442 -161314
10501 -99875 -163116 -292222 54957 -193797 -23020 193708 -6942 1415 36295 -295699 -231032
10490 -231032 -38020 58011 -191858 -128089 -175863 26768 -183367 -159087 -7148 -38278 -4505
10478 -29357 -285066 -305074 -100045 -55025 -274402 -288181 -163852 135776 -92097 -2121 -154575
10467 -154575 355428 30387 -101139 59663 63499 156910 317183 656754 441971 36898 264739
10456 264739 161287 140736 80182 -297594 -68531 25206 128522 -269733 74203 -8105 251291
10444 -81909 151750 2077 -12221 -160725 67125 117444 -97813 -56150 -319348 14225 -232630
10432 -331739 -179948 157496 18138 9005 101306 159005 -413604 -114252 -9426 -219344 -114313
10421 -114313 3421 -169502 -240468 121497 155242 -92488 -85839 -242881 -47593 126799 -356448
10409 -10864 -129217 -424918 -409661 59073 -156699 9090 -425606 216310 121187 166449 96858
10398 96858 -163983 -51326 -47356 106127 -270089 13388 -75661 146586 350128 -229208 -83724
10386 26124 17729 -3498 -120566 81298 -213529 88839 -89815 -243109 192664 64191 93277
10375 93277 277931 -257235 304316 197682 -241518 -89184 958 279602 285546 163171 -190007
10363 -44368 114405 -150224 -80102 -90581 325034 -61128 -137152 161090 165332 135262 -94157
10351 293951 111458 293741 432528 9069 260892 30574 194933 -108906 249577 488583
10341 488583 231614 -112086 388582 104096 -88616 285641 1971 -52708 517171 392555
10331 392555 242369 417984 5338 -77885 96447 170466 60082 49030 308248 134514 41208
10319 498639 -34216 291629 46660 -231097 -140629 240534 152800 389054 -1573 -250831 125815
10307 -231239 160971 258777 166402 242753 -18926 -159081 43373 83208 378644 35201 -108776
10295 297350 245673 100824 122874 6481 -149146 111220 162498 -82900 -184178 -303943 -342840
10284 -342840 185166 264012 190326 31716 171358 -335191 127472 -125169 -153248 -7157 179991
10272 -408885 75064 -46957 -9128 -327520 -222322 30027 67289 -151129 -52100 90233 -397603
10260 -235560 -130929 -323183 95984 206870 45400 99700 -130789 -82386 252794 255073 -12555
10248 70407 60696 -256667 135052 -189240 -159952 -212706 -92707 -39566 -179777 438419 -213344
10236 200534 304469 361961 160281 -98033 -144802 212075 -211308 9169 110353 -171461
10225 -156730 -43773 -26570 -218038 -87904 438290 34643 -116108 156185 -74824 -20127 -317048
10214 -317048 -94472 181772 -313954 -51651 105728 76911 29668 -292539 126096 -8118 -167833
10203 -167833 -10365 -87927 -11854 -306494 -53468 133037 -137363 -75777 31363 -52565 -232383
10192 -232383 69175 -329893 -100792 35091 171795 211477 32330 -138935 -52106 -103806 192039
10180 -150846 190335 -73336 -74177 26114 -79399 -120006 43542 -110953 430794 91864 -240128
10168 -320176 -174063 -117660 -119287 -216453 -107009 -447946 -233885 -207050 -95386 112065 -59789
10156 10926 -108197 -236419 95421 -94936 91630 14359 -3272 142390 276303 152163 -111275
10144 -252090 -87386 -142412 -116728 -112399 55787 -46813 -121892 91704 144961 -23867 -10007 -364467
10132 -364467 57158 112352 95270 -205453 -105001 -199767 100417 -304693 -25876 57868 -157886
10120 -434560 -28424 162595 58153 -220276 -64009 -86567 164800 -392907 -115723 211900
10109 -377424 -379514 -38063 -127573 -216137 -399406 -170377 196406 -105503 -267433 6934 -187846
10097 -92462 -287008 -323770 -8080 -106352 112247 -87835 -106459 -18803 -269471 -93064 73420
10085 19781 -2946 -116261 30860 -95890 -305851 -182387 138891 -125407 37831 43879 -90682
10073 -227444 -299335 214823 -163480 13944 -51259 -51599 -18259 -19766 -176571 -276010 34540
10061 -236439 -82473 -279291 -101363 -36654 161213 -140355 80136 -203073 -165649 80758
10050 64668 -182901 -98103 36824 -641 -9708 -258245 -201438 206935 175292 -196790 192630
10038 -210997 32490 37854 -9581 -318555 -199983 -264136 38358 128568 -15356 -82526 221132
10026 -112923 98937 219501 132238 -120054 19180 -146045 -134272 61992 -129709 -52582 177989
10014 -148571 -231903 -99984 -155088 -71551 -240384 63535 -279973 -206893 -28402 178423 6423
10002 -86925 -517731 122649 -168668 100029 -102898 6110 -92666 -43839 -396822 144496
9991 78387 17244 -25866 -95999 12798 -200162 -259787 -178223 -394939 -129283 -272929 -315853
9980 -315853 107811 -315891 100098 -82710 -217620 -258452 -31967 -189621 -2952 -91911 -124775
9969 -124775 -109585 59937 96710 -13032 -148707 -184472 -287759 -186549 -173978 17486 -254388
9957 223262 55228 -63014 210442 -66562 -259041 -141876 87681 -241875 -192337 -207597 -115508
9946 -115508 -147124 -86900 172474 -25963 142866 -34207 -158036 -30533 -66047 74496 -125585
9934 -10404 108614 162403 75051 199778 -302368 -13374 -65447 -31611 311533 195118 -43925
9922 -313019 -16790 -56507 -24002 -217003 -102479 -299695 194459 145262 -82463 -12096 186324
9910 226745 108305 -198045 48713 -143579 -152002 -169060 -28136 -206241 -281520 -69967 -36765
9899 -36765 -30252 2282 -32437 359838 -360367 -98975 59022 2766 -334702 96279 -132499 116833
9886 -261873 -270557 -73798 -274114 55336 -590792 -198987 -144657 -48768 84996 41344 -258872
9874 9511 -99296 103313 -37867 -343202 -21524 54146 99217 -165086 -3888 -73892 -275006
9863 -275006 -116231 -33799 -72399 147541 -159960 -162431 93843 -144348 -409269 -115315 9612
9851 229356 -298753 136650 -85078 119374 53663 103721 -184818 218434 -429637 78600
9840 -370475 -102428 -135879 23227 -22742 -227788 88067 394282 51928 -98151 80646 -273496
9828 -70522 -38228 32297 -123571 89137 -62383 391091 -32071 18563 161938 98191 -355371
9816 66120 -40559 -669 80862 159615 27895 89835 288944 -69429 40785 115121 -114849 -119527
9804 -119527 -144831 -86465 -257034 -72284 -56247 -194761 229709 -200883 -176092 -286409 -97818
9792 -44528 -321037 -351318 4283 -307541 -71319 -186567 30976 59741 -40474 -33806 -232531
9781 -232531 65395 -115034 -17059 -209552 -166279 61941 -208496 210819 -50278 -181585 62603
9769 -111150 -60182 -14986 -142948 38319 1320 -42985 -178883 -211517 -33824 -229113 -25832
9757 -167150 -102798 225150 -119498 86699 138385 -293261 -256945 -198301 132451 -226578 -264868
9746 -264868 69399 740 -33308 -267927 -37593 -113857 -191378 -204416 -108561 -253101 -134912
9735 -134912 186328 -283969 -100416 219351 -180364 -284403 -148645 -233538 -123205 -82664
9725 -82664 -261089 -176210 -117307 145198 -220977 -158545 -103243 2658 -166456 -368754 152905
9713 -358927 -71575 -274056 -89519 -370872 125131 -86888 -159814 125612 -48107 185734 -13927
9701 -57432 -105279 137974 -154182 -239198 76602 190646 -207204 81802 28565 91493 348144
9690 348144 26654 150617 -150755 233114 417645 -86979 200457 -42210 -155763 -89099
9680 -89099 -97012 52118 12089 -181358 60478 38988 6212 -300989 17115 -28139 157776 -334239
9667 31385 -140892 77004 -127920 93468 -276551 122000 -391375 31958 -310083 153334
9656 -400214 11916 -19644 -131631 -98747 -282408 -27597 -320377 -169349 197542 90247 36589
9644 155384 73279 19784 350968 4976 -220686 -133799 51747 -215875 187624 49809 -167753
9632 76083 -152856 45557 -77751 -163968 -315256 -354557 41112 208907 -139413 72710 -33462
9620 11250 -167155 -28442 -93451 -129822 -159520 91431 108721 -361016 183792 143405 -252806
9608 53196 82853 -238174 333189 255279 -221494 -81 -8861 -435131 -155117 66936 -326256
9596 -158958 -281984 102163 -217971 102646 -189113 125797 -82155 179449 -165083 -320507
9586 -320507 47375 34267 -64921 183035 138561 -415251 -693 -386565 -297050 -228965 -178161
9575 -178161 -49992 263645 -22401 -234884 129552 134384 -541447 -319574 -180425 40567 -144017
9563 -348476 410357 -154578 -111105 21750 43762 73630 -98662 231233 -366999 158793 132767
9552 132767 174923 -471723 396889 -58907 -12209 -428722 -132469 -4019 -283422 -236299 252038
9540 -15058 140118 -144000 -201365 107003 184928 11136 33303 -229614 -347151 75588 -204685
9528 -83230 -214637 -64950 236397 -3639 315153 -48131 -61043 22725 131922 94748 -195543
9516 136238 166993 -69520 -13975 -161296 137922 137987 -254023 -76988 -284874 67472 -53817
9504 -83196 -129362 -146067 17434 -10676 52447 -108426 218903 105127 -48231 -285813 26104
9492 15017 -69880 110247 -181691 -48790 -80116 8106 -106827 327607 -181656 -82262 -1493
9480 -94935 -56748 254475 -195979 219371 -449681 109224 30553 166393 -177661 -34474
9469 -258798 -53642 -42980 -123863 -58660 -231972 -99962 307578 202607 -348902 -167354 -265345
9458 -265345 -66114 338632 115796 -86297 37012 -25027 -45076 -104238 -135545 -215683 1337
9446 57598 35822 -23395 -287477 42732 142068 -153217 77333 5179 -166462 -211642 65996
9434 136198 -154683 124706 -35770 -110208 85993 8668 -29720 -171435 -42565 -54218 -177131
9423 -177131 41929 -7870 -156900 -215558 -164957 221048 26714 30176 155031 -78308 -170321
9412 -170321 197562 114705 26298 -9494 -132855 36738 -226310 6399 -91257 48182 -294971
9400 -288294 53963 -420834 -275093 -260340 69289 -86284 -39891 -112023 -52601 -162452 -287867
9389 -287867 18790 -196144 -362161 342104 31944 -54257 -5493 -101089 128300 131850 -121164
9377 199382 -55250 -63473 25224 -81690 38423 -199977 194680 -57005 157392 -398917 -82697
9365 114670 -14462 -180780 -304774 -137202 109453 370958 105763 81410 -264935 48718
9354 -283228 206298 124539 -92852 80935 -158908 -196139 -36409 39526 -52969 -327902 -163776
9342 -149051 192497 -209966 -120908 390381 -150136 -37841 75968 -163450 -125214 26128 -94524
9330 202827 -14899 -61403 -197118 -307679 -122412 -63620 -158148 -296550 -269039 -234702 16676
9318 416492 11661 -330294 57871 -26548 -278479 -49335 -74576 -215901 -54168 -88850 22040
9306 594 -157668 -27017 32871 -5405 -404291 64074 63716 -127852 -148985 149042 -49836 244305
9293 157820 -96855 -192031 84515 -249354 316348 -424325 -211398 -109852 -33394 -106180 -50099
9281 101214 11191 -194145 -50347 -209303 -77970 -354901 26236 37999 -326844 313805 -97945
9269 208418 -442758 -178855 8212 -177338 179047 8410 12897 86818 -326166 -226021 -308474
9258 -308474 -173832 -258498 135474 -105860 125552 -275037 32507 -364528 94074 -51006
9247 245911 -25317 180805 -106891 -99196 29615 -109533 6919 -156715 -189264 -250587 369203
9235 -249386 174053 -71312 -239307 -42399 -229115 -238005 -238676 -190445 -171412 -232114 77693 -278455
9222 -193229 -525431 71154 -296716 -194027 -185752 -123311 281 -195785 217927 -105230 -139478
9211 -139478 -176365 -100505 -35601 -515464 -92160 -176315 -68324 69089 -318766 -323951 127959
9199 -312641 118136 -132031 -174614 87530 -210203 -257620 -398847 -217529 121964 -157357
9188 -268834 124781 74512 251196 211509 51727 92684 14555 11378 -26169 -185143 -79518
9176 -129313 -253245 -318762 207620 -3681 22877 -86614 254648 -32690 -45379 -122698 -48074
9164 -326817 308241 -14958 -14265 104919 133677 -81831 -137960 77992 218820 -144113 31162
9152 -212031 -102427 -225889 -30336 -380569 42219 389644 -86538 -72732 -73677 -42979 -220906
9141 -220906 166295 -146702 14981 156604 15414 -433656 2605 -32125 -32909 -133371 -384925
9130 -384925 140945 93746 175660 -192586 -66414 -101992 410168 -151613 -128943 -106200 -196674
9119 -196674 362875 169387 10418 194225 -99524 -297617 -79846 165659 -13695 -102765 -157297
9108 -157297 49797 84976 27237 -179724 -77374 -22776 45364 -19071 -94255 125959 -132967
9096 15899 28546 -168903 -56408 -158895 42214 -88566 101069 -301381 -23380 -368070 -287775
9085 -287775 96856 124442 -157176 60410 -147242 -72175 73361 -69291 -120459 166361 -28838
9073 -302888 -182907 -156960 285450 -479256 27470 71486 -6231 -181165 -309067 -107852 -70149
9062 -70149 107020 -292569 -302748 -356109 -54753 6195 -112712 190116 18864 -94440 -57922
9051 -57922 -195066 -94919 -15773 -492582 -47469 -108191 -99764 -85688 -188602 30868 221105
9040 221105 -119053 -340632 72684 -203345 -38849 53137 -96511 -136310 -129304 -127178 -225995
9029 -225995 19484 -134014 184479 -140358 -159737 -178117 48975 -119723 -6997 -49407 -227929
9018 -227929 -185456 -219731 -19652 -197081 -142683 79046 212864 136219 -189785 -104019 -19471
9006 345186 22612 44107 -192846 -265869 -245744 -205208 -167306 -44532 135909 438930 -308294
8994 66532 -338846 -138361 -378160 -9511 53342 -55374 -42205 -50679 -86474 204274 -352107
8982 307118 -41543 54344 -66350 -122055 -87249 76311 92336 -140915 281204 -103603 431533
8970 -109819 105564 -15594 -156054 -6889 -196521 -93022 -35160 -269561 -278763 -30141 -364361
8959 -364361 110950 14852 216617 140161 -132376 20094 -174640 20289 -126949 7233 -175860
8947 -84089 -327062 146655 -59436 -263921 -80744 7039 -63641 -20877 -79262 -55779 50410
8935 133933 -46816 -381507 33349 -399661 192867 -99884 201526 34869 1439 53854 -117794
8923 -281007 56087 -103327 50474 -52069 -152068 244602 -17389 -33554 346313 202922 26625
8911 -109563 -104392 308725 421849 636457 892972 1153200 2093062 3540806 8054787 4201485
8901 4201485 2105438 1299781 579547 325159 639181 309644 204803 208458 215972 187556
8891 187556 -110523 96324 113110 -247627 -235783 421826 82795 -312453 -161104 43950 -172568
8879 -112849 89974 238568 -95108 -222146 -118150 56468 250978 -167209 8722 -140473 108542
8867 -92791 -392422 -216059 -103375 -117007 9728 -309272 136910 -405308 -289500 1609 -198979
8855 308521 173690 -201223 -165156 -22772 -49156 -36694 -141777 62199 140489 -303659 -194076
8844 -194076 -248511 -118668 317127 -151962 -397 19365 -78097 -75280 4246 -331984 200238
8832 -109989 -103867 -81246 -74720 11904 33173 7325 188836 114357 154725 -106333 -15332 38100
8819 263665 93675 -376809 -162330 -214976 -190617 -724927 -124700 -332032 58704 60538 180990
8808 180990 66208 212164 310811 -101186 258027 -463373 -29433 -251068 126779 154723
8798 154723 -133430 123841 -57920 -385745 -86867 165725 69071 107701 -109703 1168 18711
8787 18711 -29195 253012 -33507 -56698 262964 -18948 115644 -207748 -111968 -214827 15546
8775 -11728 40010 -76614 -165317 -23640 -150899 33604 -33434 79060 179585 -197944 -111634
8764 -111634 20691 -71004 -72396 -319756 24737 -138991 -237539 -499233 8346 -88775 -60916
8753 -60916 75968 -34505 -35980 -240111 109294 -15064 -91999 -164300 259928 18266 -112061
8741 -350042 128922 -8346 169054 299091 -419102 60843 59260 -85604 116278 -45866 161775
8729 28374 -56906 -269315 -150989 95580 -369675 127334 -139154 -199728 93048 64059 -414953
8717 -212965 -102268 -147731 -475833 -295556 -56456 -35358 -373272 78875 -35659 177907 104999
8706 104999 124386 112627 -113990 -302067 128053 8159 -256308 -72204 124279 -285589 -157520
8695 -157520 15283 -270917 -81306 -108726 -126487 -285626 -38975 -147668 -29206 26377 -133821
8683 172963 -70619 -29582 132169 -25151 -207232 -145378 -219241 240011 -312434 30023 -27093
8671 113607 52529 19867 -141088 -255518 -83419 -263545 -153248 -100113 -53408 -469657 -250326
8660 -250326 -140575 7401 -91483 -19481 279052 30988 -77940 -289477 -88498 -81981 -153516
8649 -153516 -166669 -103096 -212189 -179963 25819 1926 -32542 -98727 224778 104776 -278107
8637 239763 76338 -273705 59312 -392627 9063 123357 -59830 239608 -107498 49056 -104492
8625 -294870 -146603 -74219 210910 -77236 38738 311697 122847 48099 -77552 -12599 -141178
8614 -141178 -279324 -21966 41441 44366 -372591 34068 -20399 95372 278471 -251788 -35855
8602 -28089 -288906 186151 -276192 -104070 -250770 -21260 -74852 -225107 -129732 103331
8591 126207 -285256 10932 163375 -309760 184082 75886 142135 -191740 -46697 41906 110706
8580 110706 38911 -196312 -76551 24472 287312 -176998 145634 -3128 -54454 -72396 70610
8568 83490 -93169 -188477 210054 60359 -159071 -184511 -61699 -43642 -27033 -180687 -85260
8556 47201 -196957 148010 34064 -43372 -87578 -19624 -470049 26990 -546829 172290 -139768
8544 196130 29411 194647 16158 -57807 167941 -27062 82543 -157731 -147657 74438 -169295
8532 28210 -257217 -19080 -89386 -10010 -72312 -154854 -176070 51905 -384516 -146018 -50126
8520 139333 -197174 -317869 -111294 -189231 -138391 -71527 -132954 -77068 -10696 142439 299658
8509 299658 -70596 48895 -313787 -119642 -251739 -192947 -186666 -17779 -337911 -114332 83296
8497 -362845 68338 -256958 -146940 149465 -133813 -158143 -192051 -292131 316531 -114485
8486 96290 12526 157414 93393 97656 10224 -138915 -25542 -284110 275210 -22785 -224489
8475 -224489 -248357 206932 -94 27756 72895 25194 195976 410327 -125239 81206 -29813
8463 -142324 -141485 -229446 -259573 55953 113541 -93465 221749 -174587 -71045 100141 -468674
8451 -268434 -186564 -196980 -115300 -151884 38322 -5756 118361 -54462 308160 -214564 94583
8439 388875 -17597 306968 -279682 -136815 28870 -179319 94395 63743 -19702 -199406 161184
8427 -32046 -97391 119506 -35851 96050 -36888 52500 -132708 -129848 -90865 -184773 115312
8415 -71146 -131001 -43825 -216691 -166269 116307 -344101 251753 -229160 -254770 -260862 257641
8403 -149242 320069 -192979 144472 -17509 103078 -297988 -64973 -81913 44904 -206475
8392 203609 -372836 -39896 -210504 -275155 -131245 20416 33674 -4203 99264 171098 -78620
8380 -96834 -240178 -106655 -285104 -140243 -49172 143367 150154 -209171 -152276 18893 -147780
8368 -278728 -444882 36065 -90464 76014 -136880 128622 -58552 -31017 -109408 -137882 431409
8356 -39597 -25473 -229803 59297 365081 -42009 -300978 156354 -2385 49066 139806 -104842
8344 45311 -207032 -11061 224713 -215160 116197 -182764 162078 153684 -96244 61624 -236895
8332 132979 -100299 -171859 191700 88709 -69952 109712 -64273 80373 -112400 -95764 276357
8320 44786 -166899 -228570 5861 37999 -143042 9697 92037 -359036 -365737 22247 132556 -252056
8307 -265458 1302 -22207 68571 7353 -140132 109217 5748 -261818 21683 50206 95877 37916
8294 -89426 103633 -134921 254668 -134862 -93026 -226513 -199274 137979 -298184 -173961
8284 -173961 213162 133100 86660 -207808 181269 -119697 46506 52382 -212198 -246411 69653
8272 204804 -389336 -205536 -101319 -19358 397383 -348568 -51282 4429 -142252 116667
8261 -378340 95122 -150814 -287885 89010 199907 104637 41492 106724 364774 135327 16428
8249 -104758 -67955 -281778 -90884 99834 108332 -172489 183722 -233884 40493 -157025 3029
8237 -161609 -249305 -142685 -36222 -16200 -36851 8420 -400034 93442 -18875 83495 119153
8226 119153 62730 -45886 104709 -42651 -36308 -57117 -17542 36796 -77533 48141 389922
8215 389922 6041 -61499 -153232 -12471 90454 179018 68933 -128997 106913 -145617 -282347
8204 -282347 110266 -67015 20353 154882 -44836 -202018 -65213 263182 -25145 -49260 371903
8192 41090 -57840 212011 -218021 -235129 98721 -205709 244598 200255 -284020 202186 -87856
8180 -154533 -104985 -70374 -34698 282788 -189700 19629 -105994 43521 -145964 -34753 14613
8168 178752 -200978 79266 -178836 -121749 -18957 -28968 -32310 -132150 175256 -299917 -40571
8156 -305937 -127569 59875 -297102 -97101 -225676 277491 102770 -162138 -26704 -195947
8146 -195947 -148634 38574 -64631 88947 -174446 -25192 -53257 60649 54991 -128988 -241342
8135 -241342 -91206 -51727 -122162 54144 32848 148942 -1146 -165737 -180583 -81775 -284598
8124 -284598 -34821 210797 -328850 204783 477533 -50051 -19337 -403484 288028 256628
8114 256628 -120300 -308709 -229221 48642 -2593 5778 -352438 48752 -321216 244566 -60246
8102 -126986 -85227 222313 -8754 -11061 38172 -191114 -189152 240384 -192569 55494 76907
8091 76907 -118997 239048 110458 -135811 293491 12373 -103942 -26179 180833 -123970
8080 -320452 -152517 366611 -203220 -235515 -149612 159304 68883 28618 155358 99077 -236918
8068 107323 201973 -110734 -184173 -327227 788 186709 -79638 376190 -419247 -228828 149141
8056 85667 -45851 142527 -188222 -85131 223858 -92595 -57027 24911 -159827 -90182 246171
8044 -122455 54924 79674 -72112 -25285 30701 19303 446499 164816 -74968 7352 -252680
8032 199447 -149642 182901 -71723 -79072 110984 80184 68819 -72413 -289384 -120517 -101571
8021 -101571 65361 -2753 -16931 415504 -2185 35565 -44604 -171516 -428840 -413039 -170943
8009 45852 -73543 -12236 -297321 -299985 -65226 -250546 -15567 -384613 -171264 -337924 -235537
7998 -235537 131813 159916 -250215 -216855 54956 -24060 -110327 -90917 -131182 464991 125498
7986 -267308 -396957 -123908 -56372 -52860 -91038 -158542 84388 230012 339114 -128512 -188397
7975 -188397 73841 -9750 9521 -207186 -200882 66290 -230036 122714 -221759 58830 72381
7964 72381 -147688 -37904 -103865 -98289 178082 -31580 -189389 44292 -124112 -38815 -618 -8210
7952 -8210 -200880 -87798 -92239 -141016 394150 157898 -108369 -87068 163829 281534 -124347
7940 -199338 -92099 113072 198946 -65441 6815 -33180 -93226 -187868 120707 86368 -203772
7928 147628 78025 -148137 232824 -137581 202733 64781 -28514 -97112 -245401 -80951 -101488
7917 -101488 61680 -107264 -28779 121370 -288357 -182400 -149086 161234 140408 -156875
7906 -96700 -36067 -393561 182238 205777 -103427 -328733 -238521 95459 -257316 -121214 -29672
7894 87024 57643 202758 -116661 189870 172206 -99473 -175325 215727 -263882 -212 319460
7882 121274 -256775 -55102 -167549 -274865 68490 -321642 -36582 -246130 107176 -111064
7871 216745 15963 -229073 -170665 111245 43638 70565 -126658 -104890 142385 -89223 -52657
7860 -52657 -164922 80355 212292 224365 -53017 33060 105905 -141924 289877 62282 4764
7848 45603 79711 -101178 81800 -182539 -135139 73844 -150441 236823 -34602 -224308 59046
7836 -35509 281880 -15314 123633 325443 -75462 -244233 -287033 -273402 67421 84852 40113
7824 -11830 -118263 233432 25197 381075 -59913 -329189 -138923 -92899 111182 -27041 65926
7812 -204685 2895 -76037 -89934 -19259 -164351 -107474 -253260 -130278 62625 47365 -68702
7800 155556 -78995 -278993 -346873 -108149 20940 -170881 235253 31735 -44190 -39908 158700
7788 228257 -199554 -216754 -142033 23669 344173 -110967 -12489 20335 -227797 114329 -99604
7776 -45940 129385 -46518 259056 118743 -98780 415556 -213491 272670 260625 49862 127650
7765 127650 203008 -240530 153747 202857 -253593 270275 -208599 -185887 143708 80395
7755 80395 10221 -170439 45968 -133861 -145754 -124187 180 -391991 -45812 -243269 -197145
7744 -197145 176680 -124254 -35578 -96537 135591 108362 -149942 -156142 213072 44726 7592
7732 -223846 -162987 -128356 -53698 74071 24075 180860 -160880 -86324 -256486 -94160 25858
7720 -110841 -122821 216615 -180286 -287387 181073 120795 -118947 -64139 12079 -93927 71989
7708 184881 -115032 -402213 -264677 424201 126775 206108 -257131 22068 -119062 -108826
7698 -108826 146564 -30857 -172219 158512 -138295 -212027 255719 76892 206489 -246886
7687 13523 -93228 -180445 -166665 -111710 -188962 -47969 228401 57911 105418 -24461 -480537
7676 -480537 -50931 82532 46194 105987 -11108 -148413 -97887 -234154 -145598 65394 69019
7665 69019 -88336 -116311 -62797 38554 -147131 333135 101840 -45904 7111 -336750 155146
7653 -99727 217154 -97533 75306 -339569 -23501 11985 120715 -133975 27286 -91538 -241783
7642 -241783 49584 150774 29237 33923 -97912 -84447 41137 79302 -41306 133318 21588
7630 -12235 -473700 -127559 2167 -100332 507703 -231013 -30386 -33919 -160926 54571 -38277
7618 -125582 -240833 238155 130765 218505 -204294 -218978 10849 54182 -98479 98167 -387244
7606 10583 -161206 -99015 -91038 223064 -50827 -402199 -308909 -141510 -261001 -38173 -112504
7595 -112504 -101252 -25411 62911 183514 -318208 49659 -211435 -141656 78078 84286 -57339
7583 -193181 101575 -113387 -239664 65495 -77277 -30788 33885 -74239 -175535 -74179 -50422
7572 -50422 201998 -43424 4444 -59537 -46411 267478 98023 -166533 -257693 -85256 -198307
7561 -198307 61869 -210033 -169244 -196584 -123667 -194202 11572 105158 248622 -179195 -167462
7550 -167462 -77719 109878 -172954 90767 43311 114243 -98537 -135078 140986 -400592 159801
7538 240270 -16931 -228239 -118257 -124037 31219 -43061 -320545 402769 -106532 114506 -284261
7526 -164385 235366 -199569 -403136 -57579 150696 66069 -66687 27861 -350426 -201655
7516 -201655 -59274 -441511 -82721 -120313 105004 28 157537 -40351 199189 215973 -6576 -122306
7504 -122306 -186175 -371760 -86077 81859 23258 -196321 -301370 -275261 39146 -235612 201676
7492 -80965 -3390 12008 259281 -23622 -116831 9736 -63634 -49753 -134701 -108999 -67622 -110691
7480 -110691 -59563 -382959 -89286 48228 138480 140134 254794 5946 -99389 145125 33921
7468 507398 165875 48702 67016 153510 2108 -14371 130666 326868 235229 105826 -92126
7456 2260 149581 -82897 -46146 -13517 -172770 -64653 -78876 38989 167793 80250 -327162
7444 311630 99655 120217 -55199 47924 -163210 299914 117026 -58591 -70973 96565 -150547
7432 -52622 -29130 -56243 285609 210803 -144470 12863 141399 -232329 2989 -68000 -88691
7421 -88691 -197362 -238322 -145149 -413540 -132001 108442 284984 -39559 151701 -10806 -16467
7410 -16467 -168320 31672 99076 -159367 -136935 72546 -271815 144995 203832 -2345 -35859
7399 -35859 102628 144232 12839 -265977 135025 -195948 148137 -122472 -216822 -83727 13482
7387 82990 -63407 159664 180229 200377 -157512 378366 11395 -23100 66609 193873 -128867
7375 102384 -175538 85210 -11374 -287664 -44596 147505 308639 -31354 111874 313802
7365 313802 231180 -158829 -128108 35114 7396 -128036 177964 -22539 -77453 -289450 55215
7353 -25306 -176637 93730 -33706 195270 -161463 35981 177017 -73078 -179422 -81875 94292
7341 -84899 29566 -64823 -102883 -285217 134552 -42687 76114 30744 113994 78547 -264775
7329 -69957 -430848 3076 106464 -161972 -271808 -91155 236995 -350929 500048 -237064
7318 -42665 -66852 7453 -197742 106182 406274 -196927 -109631 107074 -155817 60117 202659
7307 202659 -209702 74569 -99108 308870 -78527 144282 -84932 157111 -184636 102967
7296 204630 -396365 -75498 -143736 72542 9341 203296 7555 185223 -55832 -36450 -43162 -135050
7284 -135050 131993 246010 232794 -287034 13386 -125617 -125596 -187633 186342 173569 -327503
7272 -118573 -242328 19470 -229944 -89280 203526 -88212 12268 -23431 161548 15012 -15527
7260 113817 -3218 109970 159639 240875 -266213 -215270 -265350 -78528 112644 -176046 -31182
7248 94059 -44993 -145574 305202 -19429 -68890 -220856 -138223 87410 -390049 197067 -52958
7236 473737 -127892 27 111257 245058 -61210 9525 -45438 -233807 97931 -397030 227596
7224 -13278 -157165 92402 46424 -2265 137725 -118061 98539 -371643 -286751 -383251 -186818
7212 59340 -84097 85510 -113135 -222117 -156161 -494444 129167 107565 -70473 154152 113713
7201 113713 -106676 79148 391542 -3652 -461224 -134052 -121254 137050 -25797 -31445 135585
7189 -49393 67378 116945 -109197 36248 162409 -41364 -167780 -167893 -90906 -16565 55917 -70201
7176 34049 -31931 144149 160122 -195293 -357776 -68085 157809 91081 -105986 276745 41944
7164 231299 -340302 15188 -22934 135340 155836 75295 -1047 209447 -31271 -94206 -139251
7153 -139251 -370619 6440 -71215 161817 93659 -74224 202319 -118144 -299346 15596 31436
7142 31436 -313816 191845 265684 16985 -280021 19388 64335 -36221 -83004 -98208 -121891
7131 -121891 24753 -167209 126186 103197 -277105 -327506 -44941 -357939 264935 -304032
7120 -103104 97724 16751 189035 -49657 -22129 197878 -165612 51324 -206410 137559 -25311
7108 -85064 -177576 164282 201215 -108144 18477 -103286 -55427 153203 -184807 106560 480236
7097 480236 97289 -343346 309858 95328 238853 -29462 73973 -113506 -131242 143438 147631
7086 147631 -283507 19508 -104933 54735 40092 -10439 260611 -168052 -58923 -272098 95257
7074 -106530 -107942 -151490 58030 -150314 -196521 147397 86430 84640 -52944 336340 14886
7062 239007 -346467 -277982 -98662 -382337 10187 -252637 -37559 -112985 -104483 138956 245710
7051 245710 -422525 114452 88586 131176 47773 -133595 61291 258924 -77062 -2542 36021
7039 -137587 -18891 -170975 187896 -68744 -176342 49761 -175246 -86758 -203814 -7162 -193388
7028 -193388 -290283 -217016 141060 -200347 292275 -156336 76477 4343 55896 -178664 -100339
7017 -100339 -266132 -85469 210112 -100509 148387 190986 -287560 254278 153905 192026
7007 192026 64796 -9912 240845 -50244 -453432 -170757 -68667 -222043 6619 68635 165951
6996 165951 201653 -48645 -78085 162271 36880 -158843 106820 -101178 111604 314015
6986 314015 169792 -192504 41557 -44080 -55782 -15932 56631 81051 -264341 54363 35627
6975 35627 122864 -122663 16687 -65165 266018 97338 -30649 -131447 42787 -280067 5955
6963 121421 25601 -28565 -98970 81438 46655 -169204 231270 29906 -199059 -18722 -60998
6952 -60998 80751 -57357 -261104 -3268 133188 14230 -50486 -140470 -11945 261137 -312363
6940 120869 143114 96504 -90159 -27526 44220 186616 -82572 -170429 -192602 -285647 -114584
6928 -258093 112630 48969 128242 71569 106434 -16014 -127277 -544497 -245397 -233113 -337880
6917 -337880 102287 208385 41451 39410 -315909 176665 -25155 -379589 -35880 211118 -161983
6905 15022 -32899 -157636 -268821 -331627 81658 170835 -286820 -209115 105786 -329971 -21055
6893 265131 195287 -221702 -70096 -164375 -221387 78040 164635 -82138 -155257 101755 42679
6881 -362518 -19900 112625 -303123 -173491 -408951 -111063 -107311 -27602 215852 -188075
6870 -57474 -236120 286424 -145081 280133 267060 313788 224716 89036 105937 23556 -237081
6858 -128422 -42167 -47956 27418 402212 289685 -158060 264485 -202884 -12280 -158046 -129401
6847 -129401 90405 -167253 -90122 -87463 -18076 -125332 39842 -173298 -234341 33080 -376985
6835 -188821 160084 22913 -1657 -226676 -57182 -183110 -137981 -23853 283759 68407 -169046
6823 -150392 224696 -321714 22436 147684 -49351 -181749 216515 -144810 -18625 -9697 -84160
6812 -84160 -36925 85977 -357043 -62473 -12991 -221320 -62365 257955 167742 42658 95927
6801 95927 -77479 72342 138462 329686 -36706 -124111 28183 -227518 36238 80768 -105887
6789 -180663 -147056 162132 46242 274268 -139303 162272 -32448 333566 3692 56189 75750
6778 75750 -44475 -188278 15783 -323968 192594 -169950 -133632 146203 -117229 61324 -44680
6766 64333 333018 81275 58869 83584 139778 -107507 -134782 93487 314093 341524 -228907
6754 -45909 114096 -225873 14240 137624 -217016 3762 62669 271150 172981 -249773 -135836
6743 -135836 -54654 -59990 -68059 -240219 78211 -219592 -215782 205194 80203 -221822 136818
6731 -54787 318493 439169 -182087 -501893 -72013 -1128 -644 -93315 2514 -116364 -60650 233360
6718 -105240 -137749 -2961 44202 -178399 248340 67430 -76514 -215898 41455 -253785 -18397
6706 -124639 25219 28139 189764 -246736 117505 -209058 -200315 193541 -104119 -16880 -30434
6695 -30434 72061 -11310 -39928 -165913 -174470 348533 -16915 24855 -41088 -337745 -24230
6683 -297337 -295173 361476 -17280 13698 160386 257869 308797 -22946 127381 88764 -12999
6671 86036 89392 -11867 -31928 -301941 454663 -185609 18461 113609 234808 -1308 -273702
6660 -273702 -66052 -135195 334186 68809 99258 34626 -370802 104149 -67867 94532 -23559
6648 87563 52901 -20840 -228382 265879 -114052 -100330 -62361 163299 -145244 82321 -100966
6636 -20873 18304 -77110 -6607 -348786 -63091 57752 -21936 -118525 -30902 -73528 8677 180950
6624 180950 -194810 202443 -57564 -73861 25379 14035 -131404 291629 121056 48916 -76030
6612 -211522 219147 -29921 -69684 93345 -135782 -242071 -164087 -183978 -85460 -158403 -239423
6601 -239423 227392 -52437 -103345 84581 -60487 -80990 126109 -132006 -502774 114543 -141886
6589 4493 248467 17894 283591 -164175 321544 -53276 -106455 270548 -203174 -206934 -224387
6578 -224387 -311122 127594 -337294 -6394 -204442 87419 101024 39465 127566 -94785 190573
6566 12112 30730 239666 -189123 -206115 6370 51962 -44300 -199854 40719 -396045 597 -101465
6553 238036 125710 25309 -182899 529346 213439 -183466 -13752 26342 -265554 -95429
6542 -70403 -167573 242967 74503 196462 -205662 24208 107307 93423 -109465 -274 252555
6530 66275 -117374 -162862 -85842 -90404 -18240 58288 23180 -307383 -218249 -206620 91847 120251
6518 120251 116718 287279 -289969 -52772 -129622 -67093 -109402 293306 32059 -134437 192486
6506 -406085 -44875 55832 403833 27880 -49974 -241759 26357 -101987 -105637 67262 122687
6495 122687 -182404 264704 344919 -153513 239378 -76574 -5598 -12944 56350 144863 -243186
6483 -38137 -230430 -370979 293005 -72508 87991 166750 194193 -128407 -159122 206205 -140125
6471 229571 -246440 118567 234279 189079 199856 70567 120566 22920 -207536 88288 323135
6460 323135 -380732 369010 -120216 -311560 90766 -37685 346553 121138 -95240 44623
6449 26110 -26591 65307 1528 51226 -3205 -216563 -30674 -268666 41168 -79257 357579 -92784
6436 87096 73217 -217134 95197 -25215 -99664 -102909 -23104 -118135 371063 -274074 -76214
6424 -128471 -79688 -120357 -108906 50325 114110 -34052 -59149 187669 -61503 121932 314241
6413 314241 95704 -45953 -64434 -129313 -36473 10964 203481 164919 105638 78130 7223 -236166
6400 -263907 -227901 129782 -118250 205018 320356 55509 177558 27591 182430 -87260
6389 -99417 -145503 -69927 -62633 -197680 37451 121673 -73187 28963 -431353 223031 89404
6377 -24262 -166723 123234 -167711 -56328 510168 67699 -82849 -111100 66382 156653 -97239
6365 9845 -107743 -30690 -5449 -12259 -120470 -261529 -21556 156105 32956 -327276 -70943
6353 27985 -240648 139294 267687 -8885 21014 -284052 170021 210738 59135 -110057 -1330
6341 129388 -63560 176634 -149651 -218228 114438 -145779 -164194 -83513 -46554 122866 -225294
6329 -56658 -215439 -152982 -2591 -194878 56811 -179197 -421283 89193 -111395 58008 18525
6317 -334485 108433 278971 384343 26975 220072 -320933 -128737 -161684 -38061 100517
6306 -157271 67188 -37880 -110816 2592 -48607 25878 145636 42810 50749 249861 106815
6294 114670 120888 -92380 113995 -6115 96675 -313721 -114637 38914 -100748 -278978 -144862
6283 -144862 294877 189639 104736 -6065 73658 165868 366040 -44931 -249046 -22563 -86075
6272 -86075 116955 225648 10250 -28221 -110249 -441761 182648 -65387 184288 -191802 -164545
6261 -164545 293327 -186619 -306258 -249470 210561 -72441 138844 299534 -25068 78960
6250 -72043 -108737 -55935 -288119 44883 -145003 283546 -114184 198183 197443 -68264 -465505
6239 -465505 56907 14905 -49946 54849 -27940 -76776 92342 40028 346434 195305 14911
6227 294749 50253 191422 306422 370231 153045 -152659 298649 209801 239311 -60987 -12156
6215 137732 272329 -133282 170796 -76391 278667 2246 79160 85456 113926 235563 -110638
6203 -89006 -60513 -26381 -179551 -40683 133817 372302 232444 272552 -272032 -53084 -7986
6191 -114105 50728 188745 96212 -279478 -71510 74591 155889 157209 -66243 -108132 25613
6179 152225 -242681 -60157 -147492 -224896 47253 -47154 9242 -104175 51177 135173 19617
6167 108142 47073 -121159 85586 9323 -191998 -178190 -376900 32374 -38076 81155 107294
6156 107294 371550 16512 -58095 -92854 205931 -100805 -21439 -49269 196813 210284 124854
6145 124854 -181811 -157854 -254658 -93831 -196081 -123930 196351 202527 73195 -94431 -28448
6133 64524 -54113 59123 175837 -116201 -190470 -117309 -9796 -3919 -117262 -90505 34036 133336
6121 133336 -12682 -170870 -104580 295331 -235654 -119655 -234117 238484 128781 109119
6111 109119 125254 -2699 -77560 -229827 -460018 130365 127018 34773 -10770 242381 2352
6099 424462 20957 -116347 274230 -23393 -54406 -264862 -9615 -32899 -2852 -210091 58176
6087 1253 219159 -69487 -123188 -12179 -274951 -137426 61520 50406 -14859 133267 -211496
6075 63124 -188011 -69134 188818 1269 -208338 -18959 -363452 -165986 -4766 243315 -155695
6063 150217 240020 -323809 213888 128694 -219763 -50505 203274 138353 -233348 63388 -183116
6051 -323040 -150449 235440 -78825 324403 -67554 -14444 102416 -122759 312363 -47962
6040 -131953 379420 -68133 148258 -163381 328693 94760 297329 219736 159848 -299635
6029 -23636 -92815 -235984 -16089 -70216 -72195 -79435 -26475 45252 325093 236549 -81705 23060
6016 147078 74562 43098 -31287 -589328 296668 186408 41995 -244697 -75352 69607 31658
6004 -46686 -213894 -278716 202240 60589 178375 -68946 178789 -110435 -228234 -15420 -163890
5993 -163890 -59937 -12064 48115 -60994 -82720 -194871 69178 135558 110728 233247 102178
5981 9070 192015 -92915 277954 -210474 88391 289844 -66998 -201259 130559 -452825 247538
5969 -52315 150762 -191701 -171026 102727 -91552 -155707 78594 -238275 52254 -276261 -287704
5958 -287704 -213229 -84687 24527 -34820 -151189 -102197 -86751 52257 -193792 260253 -73191
5946 -236366 -19868 175341 38106 243991 -33232 97498 32002 26045 -3345 -97040 -2442 219252
5933 363985 -40352 -135153 85231 -110283 -140288 -125726 16262 -382224 -74309 -286649 75775
5921 155603 -189142 188176 188753 -222417 174638 -179521 70941 211367 262895 -253697 -69183
5909 143342 53167 -124699 41555 -170756 112536 -75255 -150200 -177354 114362 168326 -67386
5897 16241 103144 48487 191400 -25305 17458 -193079 3589 262321 89783 185028 -56726
5885 -26235 -108173 -89316 -210395 -113463 60010 439089 -126282 20661 85535 -72758 -61115
5874 -61115 -315869 -171537 -214051 -64538 91529 -127007 -394147 -106166 2757 -15829 226551
5862 -23741 152611 -41481 -164640 -55798 106265 43931 -66617 126364 -210025 144651 -45849
5850 61173 22534 -191609 312018 -1549 13897 93658 18767 -137955 299696 159294 -61114
5838 -208364 22576 -63600 -84533 352236 143363 90533 169740 33826 -35335 -40043 101542
5826 -161807 78204 -11537 179569 508348 -99353 333765 87079 176516 54876 -63812 -166244
5815 -166244 141795 -142679 16481 -190447 -216965 54487 182419 -61714 118860 38871 -20422
5803 -146763 124734 -150546 118438 28058 -372776 -39216 5137 373221 -80466 -171195 216279
5791 -138367 -88640 -14412 126959 271681 -20015 14594 -33149 -219110 -42159 -110543 45619
5779 247526 -101200 -39402 215276 147440 -51375 202319 -111067 278444 56381 270752
5769 270752 -226356 193246 -72815 61303 129258 86261 -127183 46281 192147 -103372 -392497
5758 -392497 144638 107886 -61660 511905 33302 -215141 304128 158085 -7427 -167581 31973
5746 -120257 213727 342603 -27028 101995 -31790 247170 164783 100348 208666 -137262
5735 233405 128760 197712 -111473 -82397 101586 240025 -356513 106107 -18097 -61757
5725 -61757 52118 24065 -7082 76965 14074 64343 -116698 -146457 159160 -208933 192435
5713 -12616 -143156 69319 -72048 185951 20645 63454 33193 19922 -39758 91176 -139180
5701 -77783 -100628 -88662 -19777 16463 -105698 -55773 -191925 -95190 89969 -202762 -72319
5689 367882 264293 -76903 -136492 51539 54662 -40173 83431 -352370 74040 -119864 -86370
5678 -86370 128329 -118527 -207033 -128017 -217669 -155552 -63364 -139718 -352529 -365590 395454
5666 -16691 -146990 -260850 -27665 21781 53129 86379 124888 98819 44001 -67523 -368780
5655 -368780 -90283 -67445 97283 -111159 198413 56077 -349952 -206996 31907 150047 -313233
5643 77880 -147535 -60189 -3654 93769 -100258 494916 436605 301115 -274463 -118370 -206607
5632 -206607 49712 -158385 -159074 110612 164471 56635 -151286 -186252 93305 75233 184151
5621 184151 15127 41651 -124470 -175703 -200721 -143310 -8966 -19534 -225977 66149 -39091
5609 94658 168377 292994 -103838 157461 226089 -154424 -74919 70896 155599 -36046 -178305
5598 -178305 124459 -63668 -159779 -226181 106695 -212421 295677 60278 -8355 -11539 -57624
5587 -57624 59414 164237 87624 132442 -87253 24248 -217150 -276122 98128 28655 -198234
5575 345877 -281380 -89197 -189519 56889 -263254 77746 36091 63856 157733 15732 -64553
5563 406561 283706 423274 -87733 -121886 189759 20318 71974 108548 9648 32155 -109806
5551 7972 -40117 140792 -208888 -95742 -89323 -106265 299308 160481 -43041 19435 230468
5540 230468 65242 171465 30966 -120715 130273 -85431 -275221 10916 -91390 -174521 -26961
5528 -148516 -41019 -157093 2784 -105339 193800 -116724 -284919 367372 4958 261744 -92054
5516 1424 7298 -116482 376088 -283799 150291 -357099 153799 191166 293990 105385 -74074
5504 35343 -5642 -138640 132134 -252597 11906 -27018 817 381831 188204 54486 49179 48619
5492 48619 10142 210860 175612 -41076 130395 -48379 -73801 -180382 -123203 9706 -459876
5480 -353286 56635 34208 123597 -160960 77394 -3053 -177953 150510 -63727 388448 360549
5469 360549 44483 -45914 170131 -86877 -193821 -178903 -213895 121290 354128 104891 152596
5458 152596 66054 -157302 278191 337165 19157 31539 185241 21365 -121629 -38137 -79208
5447 -79208 28290 -135390 288630 131858 -29065 14454 -97125 47781 -54581 -258593 21587
5435 -17666 -60810 -93098 29995 -90554 -44932 -228340 -161764 -283723 156229 -369073 44458
5423 -348938 96023 182494 -126409 37623 -225810 -57799 -27066 63329 125606 -182049 33794
5411 -190102 -29803 251460 -79548 -247059 144784 339208 48971 186364 82737 -69325 -24623
5399 -5717 -14682 471711 240885 -88085 53283 -21914 72590 36012 346262 134215 184184
5388 184184 137435 7313 265720 -77664 50820 169944 -232698 521191 -99261 144367 -74261
5376 -172969 -12373 -8028 20471 -139991 -65850 176003 -15974 -105685 -246602 185059 -206617
5364 -31069 32654 187068 -54935 -229041 164227 -31516 -14633 -71669 11429 -114237 92898
5352 7721 -178533 21119 -35915 20944 402243 -175623 33470 -91124 103821 -162579 24768
5340 72731 -105867 292285 -250291 -189715 -111204 -270282 -131465 -121068 89467 -200715 72673
5328 194960 -283736 -145719 -180065 144481 128255 -76273 164940 -152838 -119302 -69201 404167
5316 76907 59793 -49875 -76 141513 50762 27098 -61064 -115572 12956 -441806 16566 55702
5304 55702 -46994 -47914 299737 293220 -18433 -500550 -22698 -406357 -39079 214316 129816 219941
5292 219941 181585 -268929 189060 -138835 -422662 151328 161200 -189057 204071 66039
5281 -87481 -20655 -65885 -33933 -135513 105398 -15341 213810 66847 373408 -191937 21427
5269 -302905 26827 -29345 -106732 -98798 265455 94997 63252 -33326 283624 256707 14962
5257 210553 282419 -41612 5235 237411 -6456 261678 62895 -143223 76483 -91226 -53429
5246 -53429 74823 35200 39987 189921 37844 93499 143490 79644 -418733 65471 56728 122022
5234 122022 25038 -177860 -153175 22356 154019 -218365 -110133 -1251 67382 -72154 102736
5222 -331141 158298 164151 110680 -295740 -280161 -13462 -60205 -96177 -160700 319881 -19686
5210 -104772 120170 90712 -148341 -107952 362493 94581 252413 173836 233625 463255 147896
5198 -47788 30203 182909 150382 -258530 -36911 105840 20483 -210932 284801 5557 -297096
5186 1468 -9052 -131814 -207554 -347995 60428 15803 -97555 -34089 151678 403689 97275
5174 46187 101309 130423 260299 -90917 185370 -316739 -13701 111953 -63252 -196745 75900
5162 123626 5291 57634 166307 -76553 132763 48698 58281 -197783 256668 -178421 247205
5150 61364 -5469 88667 -125722 88779 -110865 58143 155295 -60989 56017 -1702 -56928 167100
5137 124532 -204065 -43280 140739 -122705 138876 -41750 49873 65783 118108 -246692 -8554
5125 -139164 124693 76150 -28496 66173 112676 273865 487354 -41368 -110686 -173939 -212667
5114 -212667 39811 196159 167697 312857 86115 140055 210584 73038 216955 -417859 -123106
5102 -39424 244994 72114 277103 32420 -59146 -36688 -68666 -149893 283398 51596 -78351
5090 308547 65884 -71923 -90861 -83804 378486 7546 -6777 -292250 188455 -181442 -24192
5078 59343 31619 70620 -16991 -12870 -165977 168954 -4957 40159 -215070 29530 264247
5067 264247 3668 -133167 -31912 -13619 60638 -260810 132577 45398 161221 -131341 -38651
5055 131786 78026 -104404 52582 383573 -121893 -75659 -142706 -65719 -177326 72364 -449298
5043 -278432 48818 2735 133126 179078 228081 132104 15505 -94596 36352 23594 -77642 275371
5030 255219 -43906 -137594 -383514 268812 -140751 -180276 153949 -312223 233233 -127050
5019 187825 -299428 274202 -19483 -15122 -54160 -730840 147374 -93663 -20006 -183617 352071
5007 6157 64965 -30810 -98258 364989 -121687 92070 -256941 344298 15504 152228 212099
4996 212099 178170 -1544 202603 412011 -324500 179248 250516 -58603 75198 142847 -205938
4984 152175 179148 -32329 1752 -156004 -19609 -271023 -188306 -169458 277762 225062 18853
4972 -190245 -17126 339232 207848 24253 -61523 141814 -68147 392722 -330877 -268837 38052
4960 -88642 36563 -258822 247712 44293 -106425 95404 -37472 92295 -245992 -66429 177835
4948 -176695 -307041 323469 25834 238544 -394399 -41707 -294934 205209 -143060 -12237
4937 -16190 331437 -352999 385896 -60355 -69995 83113 82738 -7309 -29616 209266 309649 -111497
4924 -8666 -178766 186554 -74773 -61621 -44180 69437 388223 106689 -45737 -330389 102655
4912 -151072 301296 -150701 -316502 23859 66498 78992 -70796 -152595 109134 -37498 10892
4900 180523 -193854 77948 -3812 168963 -33590 -122094 196148 -55320 5795 149088 223098
4889 223098 -21398 9171 211930 -132626 -102330 77671 -133873 66039 -185098 -168705 -97814
4878 -97814 -62951 72357 -266069 211129 15217 -3757 -239793 23661 68238 83808 390102
4867 390102 -65388 -7734 170579 -60884 46757 -239052 104424 -113675 63291 27500 89969
4856 89969 -132341 323361 47780 71551 -18281 195359 122883 243868 79163 22367 -18211
4844 -51702 95726 375830 -47968 37634 113685 -48756 197337 -89096 311231 261378 -140271
4832 -163832 -167056 184289 13668 -7999 5033 -6117 33543 -118114 -234426 282399 -70700 -175930
4820 -175930 22982 134825 82666 -72790 237225 -24233 55656 -172287 91842 13600 -219910
4808 -141720 -27618 33211 43478 107940 -331627 53241 287822 216268 116915 -56386 -92632
4797 -92632 -118147 337208 -115786 -337557 401 -26710 -69605 237013 -371720 -30989 -115381
4786 -115381 34234 29031 -5252 -238367 -73349 81512 231093 50736 -115293 16605 140747
4775 140747 -89350 -29016 -130812 16310 94172 11442 199479 -313664 20841 75120 162231
4764 162231 38519 -199919 279142 102737 198648 136711 -27171 93776 535268 -64729 -197175
4753 -197175 180014 25623 164717 -130585 -85164 183745 -72104 -208523 -82226 229543
4742 346290 -310021 -125382 -146324 -14589 114003 168652 38896 344359 155330 43179 104184
4731 104184 214911 64254 -357936 -73496 -234978 212358 -94605 54298 271768 146024
4721 146024 -17200 219875 177833 19495 -25055 158288 95913 63789 -96993 -137688 -374598
4710 -374598 194322 136238 49854 -192665 68908 -199379 126026 -29252 -10896 495848 43851
4698 -100071 187777 -18571 146063 -475901 106703 79131 -398761 -130010 -36091 -201079
4688 -201079 114231 -245701 -168321 -60027 -118293 339300 -226981 131734 141842 79659 -66966
4676 22794 355412 -198097 165633 -233155 189895 -142827 88408 15228 -95894 205756
4665 98273 43120 -74132 -32727 -128869 -70482 136475 -128235 16090 139903 157263 38769
4653 -72517 -206346 92154 98328 -70976 80874 -34957 158436 268538 -28600 -163582 119034
4641 -71857 -31263 69958 90051 98452 -2855 64984 246581 -153875 4445 -45687 296622 150779
4629 150779 -130125 -205534 -85739 53544 -353883 -211569 31672 -86948 4130 106165 -18651
4617 -107013 -56874 10270 -169244 -35108 77089 347863 131959 10464 -81592 129509 70540
4606 70540 96331 214743 259356 37901 167905 -135237 188294 -191111 300899 184377
4596 184377 32670 94017 90765 66604 -99470 19926 130285 -51829 68269 -154623 -223023
4585 -223023 -655 211606 470392 272759 114685 -217409 -145859 308804 148493 -27377 241639
4573 201109 -213903 308 223897 128851 286212 -249951 -148861 37564 2319 373669 33671
4561 197928 59785 149287 -44659 113843 -268104 -70375 68371 -60975 -66554 130824 171602
4550 171602 68242 59771 -299014 -66441 -299677 -41015 -167072 -171525 183057 57537 -65192
4538 -311927 188753 132440 15345 -118741 3482 198429 -122827 -272359 -213604 -100510 -426982
4527 -426982 -38376 21802 -132355 -200756 -167102 -109956 115234 47921 36825 -75719 200178
4515 91993 109681 -105482 -404306 158497 -10537 27231 -140628 -276182 217619 -290295
4504 326641 4241 -288717 71567 86837 120642 -380293 -283866 181659 -86572 71959 213334
4493 213334 -72399 -135088 -168064 357608 -288715 514895 -96114 -84128 144173 161357 47056
4481 123910 208721 253692 167642 -434208 25483 -115706 166679 -147842 192532 180970 19679
$$ [...]
##END NTUPLES=NMR SPECTRUM
##END=
