
##TITLE=AC1138_hibrido_5898882_BZGNScSlqF
##JCAMPDX= 6.0         $$ Bruker NMR JCAMP-DX V2.0
##DATA TYPE= NMR SPECTRUM
##DATA CLASS= NTUPLES
##ORIGIN= BRUKER
##OWNER= Administrator
$$ 1.72 TOPSPIN		Version 2.1
$$ 2012-04-10 10:22:56.531 -0500  Administrator@TOPSPIN
$$ Compression mode = diff/dup
##.OBSERVE FREQUENCY= 400.13188235
##.OBSERVE NUCLEUS= ^1H
##.ACQUISITION MODE= SIMULTANEOUS (DQD)
##.ACQUISITION SCHEME= undefined
##.AVERAGES= 64
##.DIGITISER RES= 22
##SPECTROMETER/DATA SYSTEM= spect
##.PULSE SEQUENCE= noesygpps1d.comp
##.SOLVENT NAME= COFFEE_meoh
##.SHIFT REFERENCE= INTERNAL, COFFEE_meoh, 1, 14.96845
##AUDIT TRAIL= $$ (NUMBER, WHEN, WHO, WHERE, PROCESS, VERSION, WHAT)
$$ ##TITLE= Audit trail, TOPSPIN		Version 2.1
$$ ##JCAMPDX= 5.01
$$ ##ORIGIN= Bruker BioSpin GmbH
$$ ##OWNER= Administrator
$$ $$ C:\Bruker\TOPSPIN/data/COFFEE/nmr/AC1138_hibrido_5898882_BZGNScSlqF/12/pdata/1/auditp.txt
$$ ##AUDIT TRAIL=  $$ (NUMBER, WHEN, WHO, WHERE, PROCESS, VERSION, WHAT)
(   1,<2012-04-04 09:38:13.109 -0500>,<Administrator>,<TOPSPIN>,<go>,<TOPSPIN 2.1>,
      <created by zg
	started at 2012-04-04 09:26:41.328 -0500,
	POWCHK enabled, PULCHK disabled,
       configuration hash MD5:
       1A 1E CE 29 27 FD 77 03 67 4E F0 E3 C4 B2 CB 90
       data hash MD5: 64K
       2E 1B 5D C3 E1 1E 08 20 B7 86 D7 2B 55 76 73 B1>)
(   2,<2012-04-04 09:38:15.921 -0500>,<Administrator>,<TOPSPIN>,<proc1d>,<TOPSPIN 2.1>,
      <Start of raw data processing
       efp LB = 0.3 FT_mod = 6 PKNL = 1 PHC0 = 0 PHC1 = 0 SI = 128K 
       data hash MD5: 128K
       94 E6 DB 5B 99 0F 0D 17 7F 54 85 18 74 0C 71 DA>)
(   3,<2012-04-04 09:38:17.125 -0500>,<Administrator>,<TOPSPIN>,<proc1d>,<TOPSPIN 2.1>,
      <pk PHC0 = 35.26611 PHC1 = 0 
       data hash MD5: 128K
       C3 93 CC 68 63 D6 52 8E 19 DB A4 DC 8A 5A 26 83>)
(   4,<2012-04-04 09:38:17.562 -0500>,<Administrator>,<TOPSPIN>,<proc1d>,<TOPSPIN 2.1>,
      <abs ABSG = 1 
       data hash MD5: 128K
       91 3E 18 11 96 EE 13 17 00 A7 F4 37 1E EF 2F E3>)
(   5,<2012-04-04 09:38:17.625 -0500>,<Administrator>,<TOPSPIN>,<proc1d>,<TOPSPIN 2.1>,
      <abs ABSG = 2 
       data hash MD5: 128K
       A0 3F 4C 3C 6E 5E 2C 6F 91 EB 20 1F BA 48 AD C1>)
(   6,<2012-04-04 09:38:17.671 -0500>,<Administrator>,<TOPSPIN>,<proc1d>,<TOPSPIN 2.1>,
      <abs ABSG = 3 
       data hash MD5: 128K
       87 FD 84 0A 4B 4B F2 CB 88 EC 3D 71 F8 EC F2 BF>)
(   7,<2012-04-04 09:38:17.734 -0500>,<Administrator>,<TOPSPIN>,<proc1d>,<TOPSPIN 2.1>,
      <abs ABSG = 4 
       data hash MD5: 128K
       96 94 1B 00 E2 81 F4 41 C5 81 37 79 AF 55 7E 73>)
(   8,<2012-04-04 09:38:17.781 -0500>,<Administrator>,<TOPSPIN>,<proc1d>,<TOPSPIN 2.1>,
      <abs ABSG = 5 
       data hash MD5: 128K
       EA C7 49 2E C2 1A B1 8E 06 DE 7E 1C B4 D6 80 B0>)
(   9,<2012-04-04 09:38:18.015 -0500>,<Administrator>,<TOPSPIN>,<audit>,<TOPSPIN 2.1>,
      <user comment:
       ICON-NMR User ID: COFFEE
       data hash MD5: 128K
$$ [...]
##$TP07= 0
##$TPNAME0= <>
##$TPNAME1= <>
##$TPNAME2= <>
##$TPNAME3= <>
##$TPNAME4= <>
##$TPNAME5= <>
##$TPNAME6= <>
##$TPNAME7= <>
##$TPOAL= (0..7)
0.5 0.5 0.5 0.5 0.5 0.5 0.5 0.5
##$TPOFFS= (0..7)
0 0 0 0 0 0 0 0
##$TUNHIN= 0
##$TUNHOUT= 0
##$TUNXOUT= 0
##$USERA1= <user>
##$USERA2= <user>
##$USERA3= <user>
##$USERA4= <user>
##$USERA5= <user>
##$V9= 5
##$VALIST= <valist>
##$VCLIST= <CCCCCCCCCCCCCCC>
##$VD= 0
##$VDLIST= <DDDDDDDDDDDDDDD>
##$VPLIST= <PPPPPPPPPPPPPPP>
##$VTLIST= <TTTTTTTTTTTTTTT>
##$WBST= 2048
##$WBSW= 25
##$XGAIN= (0..3)
0 0 0 0
##$XL= 0
##$YL= 0
##$YMAX_a= 12766812
##$YMIN_a= -5965651
##$ZGOPTNS= <>
##$ZL1= 120
##$ZL2= 120
##$ZL3= 120
##$ZL4= 120
##$ABSF1= 14.96845
##$ABSF2= -5.584081
##$ABSG= 5
##$ABSL= 3
##$ALPHA= 0
##$AQORDER= 0
##$ASSFAC= 0
##$ASSFACI= 0
##$ASSFACX= 0
##$ASSWID= 0
##$AUNMP= <proc_prof1d_extract.lims>
##$AXLEFT= 0
##$AXNAME= <>
##$AXNUC= <1H>
##$AXRIGHT= 0
##$AXTYPE= 0
##$AXUNIT= <>
##$AZFE= 0.1
##$AZFW= 0.1
##$BCFW= 0
##$BC_mod= 0
##$BYTORDP= 0
##$COROFFS= 0
##$CY= 15
##$DATMOD= 1
##$DC= 0
##$DFILT= <>
##$DTYPP= 0
##$F1P= 0
##$F2P= 0
##$FCOR= 0.5
##$FTSIZE= 131072
##$FT_mod= 6
##$GAMMA= 0
##$GB= 0
##$INTBC= 1
##$INTSCL= 1
##$ISEN= 128
##$LB= 0.3
##$LEV0= 0
##$LPBIN= 0
##$MAXI= 10000
##$MC2= 0
##$MEAN= 0
##$ME_mod= 0
##$MI= 0
##$NCOEF= 0
##$NC_proc= -3
##$NLEV= 6
##$NOISF1= 0
##$NOISF2= 0
##$NSP= 0
##$NTH_PI= 0
##$NZP= 0
##$OFFSET= 14.96845
##$PC= 1
##$PHC0= 35.26611
##$PHC1= 0
##$PH_mod= 1
##$PKNL= yes
##$PPARMOD= 0
##$PPDIAG= 0
##$PPIPTYP= 0
##$PPMPNUM= 2147483647
##$PPRESOL= 1
##$PSCAL= 4
##$PSIGN= 0
##$PYNMP= <proc.py>
##$REVERSE= no
##$SF= 400.130004866036
##$SI= 131072
##$SIGF1= 0
##$SIGF2= 0
##$SINO= 400
##$SIOLD= 131072
##$SPECTYP= <>
##$SREGLST= <1H.CDCl3>
##$SSB= 0
##$STSI= 131072
##$STSR= 0
##$SW_p= 8223.68421052632
##$SYMM= 0
##$S_DEV= 0
##$TDeff= 65536
##$TDoff= 0
##$TI= <>
##$TILT= no
##$TM1= 0
##$TM2= 0
##$TOPLEV= 0
##$USERP1= <user>
##$USERP2= <user>
##$USERP3= <user>
##$USERP4= <user>
##$USERP5= <user>
##$WDW= 1
##$XDIM= 131072
##$YMAX_p= 511294143
##$YMIN_p= -413298594
##$CURPLOT= <Network HP LaserJet P1505>
##$CURPRIN= <$Network HP LaserJet P1505>
##$DFORMAT= <normdp>
##$LAYOUT= <+/1D_H.xwp>
##$LFORMAT= <normlp>
##$PFORMAT= <normpl>
##$SURQMSG= 1
$$ End of Bruker specific parameters
$$ ---------------------------------
##NTUPLES= NMR SPECTRUM
##VAR_NAME=  FREQUENCY,     SPECTRUM/REAL,   SPECTRUM/IMAG
##SYMBOL=    X,             R,               I
##VAR_TYPE=  INDEPENDENT,   DEPENDENT,       DEPENDENT
##VAR_FORM=  AFFN,          ASDF,            ASDF
##VAR_DIM=   131072,        131072,          131072
##UNITS=     HZ,            ARBITRARY UNITS, ARBITRARY UNITS
##FACTOR=    0.0627417313425165, 1,          1
##FIRST=     8223.62146879498, 5394,         -89015
##LAST=      0,             7287,            -88215
##MIN=       0,             -413298594,      0
##MAX=       8223.62146879498, 511294143,    0
$$ Real data points
##PAGE= N=1
##DATA TABLE= (X++(R..R)), XYDATA
$$ [...]
60663A862495j4166j4885j5622j6019j5802j5255j4572j3483j1725r595p855p195
$$ 1862495 1848329 1833444 1817822 1801803 1786001 1770746 1756174 1742691 1730966 1721371 1713516 1706321
60651A706321p601q236q379q458r504j1481j3012j3129j2424j1945j1831j1702
$$ 1706321 1698720 1690484 1682105 1673647 1664143 1652662 1639650 1626521 1614097 1602152 1590321 1578619
60639A578619j1560j1564j1564j1426j1122j0065p381l514m16P94J315K786N042
$$ 1578619 1567059 1555495 1543931 1532505 1521383 1511318 1503937 1500423 1500007 1500801 1502116 1504902 1509944
60626A509944O848P835Q311Q128P132N934M800K741p02l865n203o238r823j5746
$$ 1509944 1516792 1524627 1532938 1541066 1548198 1554132 1558932 1561673 1560971 1557106 1551903 1545665 1535842 1520096
60612A520096k0582k2131k1684k1409k1634k1593k1032k0074j8740j7375j6392
$$ 1520096 1499514 1477383 1455699 1434290 1412656 1391063 1370031 1349957 1331217 1313842 1297450
60601A297450j5134j2329q219m764l181k721k582l177m332m097j184K518L885
$$ 1297450 1282316 1269987 1261768 1257004 1253823 1251102 1248520 1245343 1241011 1236914 1235730 1238248 1242133
60588A242133K475O06q7j86l52J50J749K843J483j716l790k725M42L119L841L060
$$ 1242133 1244608 1245214 1245127 1244941 1244589 1244739 1246488 1249331 1250814 1249098 1245308 1242583 1243025 1246144 1249985 1253045
60572A253045K073J991L292N488P343Q142Q642J0015J2105J3719J4608J6032J8972
$$ 1253045 1255118 1257109 1260401 1265889 1273232 1281374 1290016 1300031 1312136 1325855 1340463 1356495 1375467
60559A375467K2863K6438K8910L0002K9912K9765L0991L3621L6182L7768L9061
$$ 1375467 1398330 1424768 1453678 1483680 1513592 1543357 1574348 1607969 1644151 1681919 1720980
60548A720980M0594M1300L9972L6916L2969K7879K1103J3361N958r15p851j4680
$$ 1720980 1761574 1802874 1842846 1879762 1912731 1940610 1961713 1975074 1981032 1980117 1972266 1957586
60536A957586k0558k5193k8802l1294l2525l2842l2395l0653k7655k4792k3011
$$ 1957586 1937028 1911835 1883033 1851739 1819214 1786372 1753977 1723324 1695669 1670877 1647866
60525A647866k1105j7545j3208j0414r623r079p638o120n684o284p024o911n425
$$ 1647866 1626761 1609216 1596008 1585594 1575971 1566892 1559254 1553134 1547450 1541166 1534142 1527231 1521806
60512A521806l341k472l371l949k039J351L357L472M059O475R107J0053R835J0352
$$ 1521806 1518465 1515993 1512622 1508673 1506634 1507985 1511342 1514814 1518873 1525348 1534455 1544508 1554343 1564695
60498A564695J2377J5048J7057J7759J7780J8736K1534K5045K7299K7989K8694
$$ 1564695 1577072 1592120 1609177 1626936 1644716 1663452 1684986 1710031 1737330 1765319 1794013
60487A794013L0734L3878L7145L9919M2339M5371N0135N6396O2422O7197P1509
$$ 1794013 1824747 1858625 1895770 1935689 1978028 2023399 2073534 2129930 2192352 2259549 2331058
60476B331058P5373P5954P0311N9209M5709L0928J4194l100j7333k6779l2846
$$ 2331058 2406431 2482385 2552696 2611905 2657614 2688542 2702736 2699636 2682303 2655524 2622678
60465B622678l6656l7376l4781l0463k5184j7778q179R61P548J2790J8850K5514
$$ 2622678 2586022 2548646 2513865 2483402 2458218 2440440 2432261 2433222 2440770 2453560 2472410 2497924
60453B497924L1093L5087L8162M0602M2547M4869M8439N3266N9365O7564P8446
$$ 2497924 2529017 2564104 2602266 2642868 2685415 2730284 2778723 2831989 2891354 2958918 3037364
60442C037364R1490J06099J22522J41027J61163J82697K06328K32780K62035K93562
$$ 3037364 3128854 3234953 3357475 3498502 3659665 3842362 4048690 4281470 4543505 4837067
60432D837067L26103L57275L85109M10374M35595M61494M86137N07055N20743
$$ 4837067 5163170 5520445 5905554 6315928 6751523 7213017 7699154 8206209 8726952
60423H726952N19187M90773M27723L31137K07633O4333q9919k41224l73428m75200
$$ 8726952 9246139 9736912 10164635 10495772 10703405 10767738 10677819 10436595 10063167 9587967
60413I587967n43080n79023n87763n76139n51746n20543m85870m49300m11600
$$ 9587967 9044887 8465864 7878101 7301962 6750216 6229673 5743803 5294503 4882903
60404D882903l73536l36576l02191k70176k39270k10187j85981j67887j52850
$$ 4882903 4509367 4172791 3870600 3600424 3361154 3150967 2964986 2797099 2644249
60395B644249j37252j21421j08129r8152q9943q2669p6657p1340o5524n9657n5374
$$ 2644249 2506997 2385576 2277447 2179295 2089352 2006683 1930026 1858686 1793162 1733505 1678131
60384A678131n2669m9633m5264m0651l7055l4476l2331l0132k7364k4021k1207
$$ 1678131 1625462 1575829 1530565 1489914 1452859 1418383 1386052 1355920 1328556 1304535 1283328
60373A283328j9868j9241j8025j6659j6601j7552j7545j5958j4389j3911j3419
$$ 1283328 1263460 1244219 1226194 1209535 1192934 1175382 1157837 1141879 1127490 1113579 1100160
60362A100160j1637r240p744p331o907n673l729j578L22J668K510L276M289N261
$$ 1100160 1088523 1079283 1071539 1064208 1057301 1051628 1047899 1046321 1046643 1048311 1050821 1054097 1058386 1063647
60348A063647N373M085K026R21K015M568O589P126O906O640O060N174M988N853
$$ 1063647 1069020 1073105 1075131 1076052 1078067 1082635 1089224 1096350 1103256 1109896 1115956 1121130 1126118 1131971
60334A131971O453N761M912N477O784O796N137L388K550K064J571J925L721N944
$$ 1131971 1138424 1144185 1149097 1154574 1161358 1168154 1173291 1176679 1179229 1181293 1182864 1184789 1188510 1194454
60320A194454O801N510K920P39L5J55n88k803n088n807n143m549m753n300n645
$$ 1194454 1201255 1206765 1209685 1210424 1210459 1210614 1210026 1207223 1202135 1196328 1191185 1186636 1181883 1176583 1170938
60305A170938n581m772k863p7K884N400O982P295O700O262O587P197P611Q250
$$ 1170938 1165357 1160585 1157722 1157645 1160529 1165929 1172911 1180206 1186906 1193168 1199755 1206952 1214563 1222813
60291A222813R448J0514J0703J0486J0792J1623J2341J2646J2361J1092R116P733
$$ 1222813 1232261 1242775 1253478 1263964 1274756 1286379 1298720 1311366 1323727 1334819 1343935 1351668
60279A351668P628P799P248O719P330Q607R509J0493J2508J4775J5769J5994J7443
$$ 1351668 1359296 1367095 1374343 1381062 1388392 1396999 1406508 1417001 1429509 1444284 1460053 1476047 1493490
60266A493490K0212K1860K0563J6997J2562P471J493m714r976j3652j5826j7064
$$ 1493490 1513702 1535562 1556125 1573122 1585684 1593155 1594648 1589934 1579958 1566306 1550480 1533416
60254A533416j8035j8774j8436j6581j4380j3460j3738j3610j2200j0200q357
$$ 1533416 1515381 1496607 1478171 1461590 1447210 1433750 1420012 1406402 1394202 1384002 1375645
60243A375645o547m703l551l676m485m665l433j141J119K492L017L211L183K858
$$ 1375645 1369098 1364395 1360844 1357168 1352683 1348018 1344585 1343444 1344563 1347055 1350072 1353283 1356466 1359324
60229A359324K919M279O381P506P435Q121J0648J3209J3737J2988J3073J4160
$$ 1359324 1362243 1366522 1372903 1380409 1387844 1395965 1406613 1419822 1433559 1446547 1459620 1473780
60217A473780J4852J4940J5412J6309J6775J7028J8059J9538K0107J9720J9786
$$ 1473780 1488632 1503572 1518984 1535293 1552068 1569096 1587155 1606693 1626800 1646520 1666306
60206A666306K0949K2616K4668K7703L1395L4498L6805L9452M3054M7089N1174
$$ 1666306 1687255 1709871 1734539 1762242 1793637 1828135 1864940 1904392 1947446 1994535 2045709
60195B045709N5263N8638O0521O1900O4945P0389P7113Q4300R2080J00006J07164
$$ 2045709 2100972 2159610 2220131 2282031 2346976 2417365 2494478 2578778 2670858 2770864 2878028
60184B878028J14217J23126J33982J44255J52185J59105J67136J76108J83997
$$ 2878028 2992245 3115371 3249353 3393608 3545793 3704898 3872034 4048142 4232139
60175D232139J89259J91616J91386J88961J84296J76360J64065J48069J30637
$$ 4232139 4421398 4613014 4804400 4993361 5177657 5354017 5518082 5666151 5796788
60166E796788J13289R5546P6482N6400L6415J7386j55j5682k8617l8214m3621
$$ 5796788 5910077 6005623 6082105 6138505 6174920 6192306 6192151 6176469 6147852 6109638 6066017
60155F066017m4761m2801l8843l2695k3915j3264j599J1832K7987M5450O1532
$$ 6066017 6021256 5978455 5939612 5906917 5883002 5869738 5868139 5879971 5907958 5953408 6014940
60144F014940P5889R0733J07391J24799J41510J56809J69473J77903J82189J83791
$$ 6014940 6090829 6181562 6288953 6413752 6555262 6712071 6881544 7059447 7241636 7425427
60134G425427J82582J76432J64428J48136J28901J06383Q0814N4218K7863Q64
$$ 7425427 7608009 7784441 7948869 8097005 8225906 8332289 8413103 8467321 8495184 8496048
60124H496048k7056n3515p5985r4617j10738j23981j32650j35649j32644j23657
$$ 8496048 8468992 8415477 8339492 8244875 8134137 8010156 7877506 7741857 7609213 7485556
60114G485556j10068r4747p9675o4419m7943l0420j2122P716K9204N0441O9511
$$ 7485556 7375488 7280741 7201066 7136647 7088704 7058284 7046162 7053878 7083082 7133523 7203034
60103G203034Q6431J01467J12981J18918J19362J15796J08784R8287Q5298P1318
$$ 7203034 7289465 7390932 7503913 7622831 7742193 7857989 7966773 8065060 8150358 8221676
60093H221676N6858M2114K8313J6741P187q18n920n856oJ0554K4917M2716O3222
$$ 8221676 8278534 8320648 8348961 8365702 8372889 8372071 8366151 8360295 8360289 8370843 8395760 8438476 8501698
60080H501698Q5783J10754J38418J67535J96626K26203K57905K91721L25931L59743
$$ 8501698 8587481 8698235 8836653 9004188 9200814 9427017 9684922 9976643 10302574 10662317
60070A0662317L94025M29152M63810M96431N26396N53130N75090N90396N97900
$$ 10662317 11056342 11485494 11949304 12445735 12972131 13525261 14100351 14690747 15288647
60061A5288647N97088N87406N68074N38449M98535M49152L91507L26650K55615
$$ 15288647 15885735 16473141 17041215 17579664 18078199 18527351 18918858 19245508 19501123
60052A9501123J79776J00301J7613o7382j51598k30919l03256l68546m25236m69124
$$ 19501123 19680899 19781200 19798813 19731431 19579833 19348914 19045658 18677112 18251876 17782752
60042A7782752m97121n10206n10999n00266m78008m46387m08875l67212l21525
$$ 17782752 17285631 16775425 16264426 15764160 15286152 14839765 14430890 14063678 13742153
60033A3742153k72768k22925j73253j24537p8455l6473K058L8059O9279R1579
$$ 13742153 13469385 13246460 13073207 12948670 12870215 12833742 12835800 12873859 12943138 13034717
60023A3034717J03889J08995J08709J01153Q4317N9920L1888K732k6682n5245
$$ 13034717 13138606 13247601 13356310 13457463 13541780 13601700 13633588 13636320 13609638 13554393
60013A3554393q1755j06498j30883j55389j79034k00745k20161k37129k51246
$$ 13554393 13472638 13366140 13235257 13079868 12900834 12700089 12479928 12242799 11991553
60004A1991553k62153k69633k73296k72564k67091k56996k42716k24932k04591
$$ 11991553 11729400 11459767 11186471 10913907 10646816 10389820 10147104 9922172 9717581
59995I717581j82686j59727j35481j09408q1476n2537k3760M343L2189O0331Q8448
$$ 9717581 9534895 9375168 9239687 9130279 9048803 8996266 8972506 8976849 9009038 9069369 9157817
59984I157817J15106J38402J57079J71130J81180J86897J86470J78184J62294
$$ 9157817 9272923 9411325 9568404 9739534 9920714 10107611 10294081 10472265 10634559
59975A0634559J40658J14881Q5751N4171K1128j3347m9685q6597j20808j49759
$$ 10634559 10775217 10890098 10975849 11030020 11051148 11037801 10988116 10901519 10780711 10630952
59965A0630952j73529j93229k08767k19128k23848k22980k16339k03958j86784
$$ 10630952 10457423 10264194 10055427 9836299 9612451 9389471 9173132 8969174 8782390
59956H782390j66082j42742j17816r2663o7609m1530j3843J4122M1048O7710R5511
$$ 8782390 8616308 8473566 8355750 8263087 8195478 8153948 8140105 8154227 8195275 8262985 8358496
59945H358496J23863J51016J76727K01907K25818K45811K60113K68917K72275
$$ 8358496 8482359 8633375 8810102 9012009 9237827 9483638 9743751 10012668 10284943
59936A0284943K68823K57425K38678K13890J83671J48416J09389O8438K7042j3909
$$ 10284943 10553766 10811191 11049869 11263759 11447430 11595846 11705235 11773673 11800715 11786806
59926A1786806n3792r2063j27947j60078j86722k06483k18500k22265k17795k05887
$$ 11786806 11733014 11640951 11513004 11352926 11166204 10959721 10741221 10518956 10301161 10095274
59916A0095274j87734j64523j37891j10069q2509n4714k5580M344L3156O0091
$$ 10095274 9907540 9743017 9605126 9495057 9412548 9357834 9332254 9336598 9369754 9429845
59906I429845Q6139J11832J35749J55947J71839J83796J91652J94651J92681J86778
$$ 9429845 9515984 9627816 9763565 9919512 10091351 10275147 10466799 10661450 10854131 11040909
59896A1040909J78417J68594J57597J45386J32091J18241J04592R2058Q1825P5081
$$ 11040909 11219326 11387920 11545517 11690903 11822994 11941235 12045827 12137885 12219710 12294791
59886A2294791P2269P3131P7887Q7937J04595J27549J55332J87115K23101K63260
$$ 12294791 12367060 12440191 12518078 12606015 12710610 12838159 12993491 13180606 13403707 13666967
59876A3666967L06629L52062L98763M45699M91107N32878N68938N96869O13567
$$ 13666967 13973596 14325658 14724421 15170120 15661227 16194105 16763043 17359912 17973479
59867A7973479O15677O00240N65060N09024M32545L37574K27158J05378k2069
$$ 17973479 18589156 19189396 19754456 20263480 20696025 21033599 21260757 21366135 21344066
59858B1344066j47857k64520l66547m51181n17354n64436n92463o03194n99812
$$ 21344066 21196209 20931689 20565142 20113961 19596607 19032171 18439708 17836514 17236702
59849A7236702n85060n60162n26018m84673m38699l89641l38109k85033k31648
$$ 17236702 16651642 16091480 15565462 15080789 14642090 14252449 13914340 13629307 13397659
59840A3397659j78455j25495p3637k4270K2348O6890J08776J45652J75555J98150
$$ 13397659 13219204 13093709 13020072 12995802 13018150 13085040 13193816 13339468 13515023 13713173
59830A3713173K13259K19645K15936K01236J74136J33011P8558J4664n4510j26726
$$ 13713173 13926432 14146077 14362013 14563249 14737385 14870396 14948954 14963618 14909108 14782382
59820A4782382j99698k68894l29612l80179m21020m51651m71010m80009m81146
$$ 14782382 14582684 14313790 13984178 13603999 13182979 12731328 12260318 11780309 11299163
59811A1299163m75513m62474m42612m18774l93543l67261l39281l09854k80126
$$ 11299163 10823650 10361176 9918564 9499790 9106247 8738986 8399705 8089851 7809725
59802G809725k51297k24304j99501j76324j53942j32454j12826r5855q1984p1806
$$ 7809725 7558428 7334124 7134623 6958299 6804357 6671903 6559077 6463222 6381238 6309432
59792F309432o5602o2283n9952n7687n5865n4716n3517n1483m8611m5344m2020
$$ 6309432 6243830 6181547 6121595 6063908 6008043 5953327 5899810 5848327 5799716 5754372 5712352
59781E712352l8781l5670l2849l1109l1782l5568m1778m9190n7016o4369o9620
$$ 5712352 5673571 5637901 5605052 5573943 5542161 5506593 5464815 5415625 5358609 5294240 5224620
59770E224620p1476p0239o7026o2196n5516m7302l8260k8722j9207j1081n369
$$ 5224620 5153144 5082905 5015879 4953683 4898167 4850865 4812605 4783883 4764676 4753595 4748226
59759D748226j219L139Q455J4728K2555L2407M2905N1879N9181O6623P4935Q2585
$$ 4748226 4747007 4750146 4758601 4773329 4795884 4828291 4871196 4923075 4982256 5048879 5123814 5206399
59747E206399Q7967R1179R3075R3978R3900R2871R0472Q6028P9589P1907O3376
$$ 5206399 5294366 5385545 5478620 5572598 5666498 5759369 5849841 5935869 6015458 6087365 6150741
59736F150741N4128M5289L8786L5495L4597L5083L7083M1440M8918N9958P4374
$$ 6150741 6204869 6250158 6288944 6324439 6359036 6394119 6431202 6472642 6521560 6581518 6655892
59725F655892R1196J09569J29672J51965J76063K01457K28851K59195K91816L25215
$$ 6655892 6747088 6856657 6986329 7138294 7314357 7515814 7744665 8003860 8295676 8620891
59715H620891L59641L96803M36823M77175N14974N48218N73651N84645N72151
$$ 8620891 8980532 9377335 9814158 10291333 10806307 11354525 11928176 12512821 13084972
59706A3084972N27564M45894L29424J89732M4469q9927k02951k89288l46832l77138
$$ 13084972 13612536 14058430 14387854 14577586 14622055 14532128 14329177 14039889 13693057 13315919
59696A3315919l85552l78298l59534l31902k98436k62107k24137j84561j44165
$$ 13315919 12930367 12552069 12192535 11860633 11562197 11300090 11075953 10891392 10747227
59687A0747227j04489o6023k7857J0588M8448Q4378J17925J49641J80473K11521
$$ 10747227 10642738 10576715 10548858 10559446 10607894 10692272 10810197 10959838 11140311 11351832
59677A1351832K44033K78841L15623L53260L91298M30695M72490N16236N60796
$$ 11351832 11595865 11874706 12190329 12543589 12934887 13365582 13838072 14354308 14915104
59668A4915104O06528O55153P07149P60945Q15430Q71521R29792R88163J043742
$$ 14915104 15521632 16176785 16883934 17644879 18460309 19331830 20261622 21249785 22293527
59659B2293527J095572J143191J183403J211159J223576J220851J203616J172186
$$ 22293527 23389099 24532290 25715693 26926852 28150428 29371279 30574895 31747081
59651C1747081J129142J080323J032261R89980R57420R37502R30338R32699R40277
$$ 31747081 32876223 33956546 34988807 35978787 36936207 37873709 38804047 39736746 40677023
59642D0677023R49522R56792R57103R44673R14188Q61582P85029O85902N68092
$$ 40677023 41626545 42583337 43540440 44485113 45399301 46260883 47045912 47731814 48299906
59633D8299906M36555K97460J58854K8923q6796j84869k61026l10422l31380l26484
$$ 48299906 48736461 49033921 49192775 49221698 49134902 48950033 48689007 48378585 48047205 47720721
59623D7720721k99077k50811j83547j01009o578R8910K15350L40607M71118O04133
$$ 47720721 47421644 47170833 46987286 46886277 46879699 46978609 47193959 47534566 48005684 48609817
59613D8609817P37723Q69168R94456J108652J205730J278565J319651J321110
$$ 48609817 49347540 50216708 51211164 52319816 53525546 54804111 56123762 57444872
59605E7444872J274091J170134J004627P78606M97548J71042j85033n48206q94245
$$ 57444872 58718963 59889097 60893724 61672330 62169878 62340920 62155887 61607681 60713436
59596F0713436j203228j461784j662229j801974j883267j911924j896004j845276
$$ 60713436 59510208 58048424 56386195 54584221 52700954 50789030 48893026 47047750
59588D7047750j769945j678440j577411j474816j381748j309998j268252j260284
$$ 47047750 45277805 43599365 42021954 40547138 39165390 37855392 36587140 35326856
59580C5326856j283889j329359j380879j422574j444398j442719j417627j371829
$$ 35326856 34042967 32713608 31332729 29910155 28465757 27023038 25605411 24233582
59572B4233582j310690j240355j165032j086913j008070r30957q57229p87283
$$ 24233582 22922892 21682537 20517505 19430592 18422522 17491565 16634336 15847053
59564A5847053p20947o57943n98169n42282m91411m45584m03272l63310l26309
$$ 15847053 15126106 14468163 13869994 13327712 12836301 12390717 11987445 11624135 11297826
59555A1297826k93364k64373k38796k16927j99044j84132j70912j59632j51512
$$ 11297826 11004462 10740089 10501293 10284366 10085322 9901190 9730278 9570646 9419134
59546I419134j46989j45652j47235j51377j56770j61868j66099j69464j71475
$$ 9419134 9272145 9126493 8979258 8827881 8671111 8509243 8343144 8173680 8002205
59537H002205j71499j69689j66505j61777j55106j46606j36365j23964j09663
$$ 8002205 7830706 7661017 7494512 7332735 7177629 7031023 6894658 6770694 6661031
59528F661031r5323q2761p1648o0190m7572l4615k2389j1285j247Q009J6927K5636
$$ 6661031 6565708 6482947 6411299 6351109 6303537 6268922 6246533 6235248 6234001 6242010 6258937 6284573
59516F284573L3818M1347M8384N4533N8955O1893O4948O8995P3165P6756Q0768
$$ 6284573 6318391 6359738 6408122 6462655 6521610 6583503 6648451 6717446 6790611 6867367 6948135
59505F948135Q6225R2528R9123J07473J19283J33589J47852J61434J76049J92978
$$ 6948135 7034360 7126888 7226011 7333484 7452767 7586356 7734208 7895642 8071691 8264669
59495H264669K11776K31676K52501K74074K96212L19311L43591L67892L90646
$$ 8264669 8476445 8708121 8960622 9234696 9530908 9850219 10193810 10561702 10952348
59486A0952348M11869M32484M51655M66643M75712M79559M79145M73618M61436
$$ 10952348 11364217 11796701 12248356 12714999 13190711 13670270 14149415 14623033 15084469
59477A5084469M42576M18597L90829L59403L23942K84727K43220K01732J62665
$$ 15084469 15527045 15945642 16336471 16695874 17019816 17304543 17547763 17749495 17912160
59468A7912160J27988R8963P5853N7857M4059L4816L1820L6677M9757P0272R6422
$$ 17912160 18040148 18139111 18214964 18272821 18316880 18351696 18383516 18420193 18469950 18540222 18636644
59457A8636644J25252J53309J77779J96124K04683J99244J77821J41479R1821
$$ 18636644 18761896 18915205 19092984 19289108 19493791 19693035 19870856 20012335 20104156
59448B0104156K9112m6042j30625k20156l10554l97898m77668n45907o00537o40403
$$ 20104156 20133268 20087226 19956601 19736445 19425891 19027993 18550325 18004418 17403881 16763478
59438A6763478o64130o71374o64207o45772o18237n83371n43884n02361m59575
$$ 16763478 16099348 15427974 14763767 14117995 13499758 12916387 12372503 11870142 11410567
59429A1410567m15584l71830l30374k91533k54102k17578j82428j48454j14728
$$ 11410567 10994983 10623153 10292779 10001246 9747144 9529566 9347138 9198684 9083956
59420I083956q1190m8741j7744J2345M1895P0840R9395J27813J55675J82511K08837
$$ 9083956 9002766 8954025 8936281 8948626 8990521 9061361 9160756 9288569 9444244 9626755 9835592
59409I835592K35468K62041K87152L09512L27944L41078L48176L49478L44376
$$ 9835592 10071060 10333101 10620253 10929765 11257709 11598787 11946963 12296441 12640817
59400A2640817L30097L03812K65276K15905J56371Q7454J2543o3239j36502k06039
$$ 12640817 12970914 13274726 13540002 13755907 13912278 13999732 14012275 13949036 13812534 13606495
59390A3606495k69957l24939l68963m02664m27179m42347m47994m45546m37337
$$ 13606495 13336538 13011599 12642636 12239972 11812793 11370446 10922452 10476906 10039569
59381A0039569m25161m10082l92691l73010l50829l26639l01830k77875k55649
$$ 10039569 9614408 9204326 8811635 8438625 8087796 7761157 7459327 7181452 6925803
59372F925803k35200k15540j95237j74105j53943j36613j21835j07756r3197p8338
$$ 6925803 6690603 6475063 6279826 6105721 5951778 5815165 5693330 5585574 5492377 5414039
59362E414039o3913n0769l9484k9317j8326n785O446J6341K4264L1605L8419M4651
$$ 5414039 5350126 5299357 5259873 5230556 5212230 5206445 5212891 5229232 5253496 5285101 5323520 5368171
59350E368171N2129O2022P1032P3662O8689O0660N4774N3142N6260O4481P6534
$$ 5368171 5420300 5482322 5553354 5627016 5695705 5756365 5811139 5864281 5920541 5985022 6061556
59339F061556Q9474J02122J16371J33285J49748J61232J67001J70870J77531J89305
$$ 6061556 6151030 6253152 6369523 6502808 6652556 6813788 6980789 7151659 7329190 7518495
59329G518495K05877K25870K48759K75587L07456L43424L81074M19272M59175
$$ 7518495 7724372 7950242 8199001 8474588 8782044 9125468 9506542 9925814 10384989
59320A0384989N02281N48799N98307O50424P04081P57380Q08782Q57315R00913
$$ 10384989 10887270 11436069 12034376 12684800 13388881 14146261 14955043 15812358 16713271
59311A6713271R35730R57800R64499R54230R26278Q81943Q24724P58607O86983
$$ 16713271 17649001 18606801 19571300 20525530 21451808 22333751 23158475 23917082 24604065
59302B4604065O13496N42185M75376M12232L50457K88923K27898J67288J05539
$$ 24604065 25217561 25759746 26235122 26647354 26997811 27286734 27514632 27681920 27787459
59293B7787459M0195l0706j07397j88205k70915l53876m35132n11022n77375o32354
$$ 27787459 27827654 27796948 27689551 27501346 27230431 26876555 26441423 25930401 25353026 24720672
59283B4720672o77066p13237p41756p63802p81579p96637q08157q13824q11922
$$ 24720672 24043606 23330369 22588613 21824811 21043232 20246595 19438438 18624614 17812692
59274A7812692q02268p85877p64256p38521p08816o74942o37570n98193n58072
$$ 17812692 17010424 16224547 15460291 14721770 14012954 13338012 12700442 12102249 11544177
59265A1544177n18046m79172m42394m07425l73015l38637l05168k73859k45424
$$ 11544177 11026131 10546959 10104565 9697140 9324125 8985488 8680320 8406461 8161037
59256H161037k19998j97040j75392j54303j34342j16390j00135q4623o9759n5917
$$ 8161037 7941039 7743999 7568607 7414304 7279962 7163572 7063437 6978814 6909055 6853138
59246F853138m2485k8329j3502J039J5088K8948M2017N3523O4557P7243R1843
$$ 6853138 6810653 6782324 6768822 6769861 6784949 6813897 6855914 6909437 6973994 7051237 7143080
59235G143080J06575J20433J34124J48051J61456J74019J86303J98214K08980
$$ 7143080 7249655 7370088 7504212 7652263 7813719 7987738 8174041 8372255 8581235
59226H581235K18875K28720K37458K42744K44572K45608K46958K46262K41474
$$ 8581235 8800110 9028830 9266288 9509032 9753604 9999212 10246170 10492432 10733906
59217A0733906K33931K25949K17561K07738J96971J86352J75202J61376J43042
$$ 10733906 10967837 11193786 11411347 11619085 11816056 12002408 12177610 12338986 12482028
59208A2482028J18942Q8296N2002J2853k6737o5980j03832j37824j66423j90763
$$ 12482028 12600970 12689266 12741268 12754121 12727384 12661404 12557572 12419748 12253325 12062562
59198A2062562k11916k27990k36343k37434k33980k26998k15399j99103j79985
$$ 12062562 11850646 11622656 11386313 11148879 10914899 10687901 10472502 10273399 10093414
59189A0093414j59355j36731j11876q6336o2030l9302j7097N716K9592N4225P8658
$$ 10093414 9934059 9797328 9685452 9599116 9537086 9497784 9480687 9486403 9515995 9570220 9648878
59178I648878J01691J22643J41719J59769J77553J94968K11089K25386K38727
$$ 9648878 9750569 9873212 10014931 10174700 10352253 10547221 10758310 10983696 11222423
59169A1222423K52473K66728K80564K94034L08724L25955L45619L67279L91022
$$ 11222423 11474896 11741624 12022188 12316222 12624946 12950901 13296520 13663799 14054821
59160A4054821M16352M41143M62640M78655M86960M84280M66833M31730L77753
$$ 14054821 14471173 14912316 15374956 15853611 16340571 16824851 17291684 17723414 18101167
59151A8101167L05593K17707J17112O084j12934k35086l53341m61702n56873o36232
$$ 18101167 18406760 18624467 18741579 18747663 18634729 18399643 18046302 17584600 17027727 16391495
59141A6391495o96205p34448p52539p54745p44441p23019o91857o53870o12752
$$ 16391495 15695290 14960842 14208303 13453558 12709117 11986098 11294241 10640371 10027619
59132A0027619n71246n30181m89053m47748m07801l71398l39324l10658k84414
$$ 10027619 9456373 8926192 8437139 7989391 7581590 7210192 6870868 6560210 6275796
59123F275796k60404k38329k17504j97839j79987j64113j49692j36687j25421
$$ 6275796 6015392 5777063 5559559 5361720 5181733 5017620 4867928 4731241 4605820
59114D605820j15033j03883r2212q2433p5662o9741o2182n3524m6017m0102l4101
$$ 4605820 4490787 4386904 4294692 4212259 4136597 4066856 4004674 3951150 3905133 3865031 3830930
59103C830930k6877j9123j2117o294j007M885J1907J9150K5291L0563L6634M4080
$$ 3830930 3804053 3784930 3772813 3766519 3765512 3770397 3782304 3801454 3826745 3857308 3893942 3938022
59091C938022N1444N7529O3160O9555P6288Q2316Q7953R4280J01241J07745J13302
$$ 3938022 3989466 4046995 4110155 4179710 4255998 4338314 4426267 4520547 4621788 4729533 4842835
59080D842835J18422J23683J29293J35369J41921J48715J55523J62171J68210
$$ 4842835 4961257 5084940 5214233 5349602 5491523 5640238 5795761 5957932 6126142
59071F126142J73229J77498J81412J84229J84514J82079J78163J73461J67417
$$ 6126142 6299371 6476869 6658281 6842510 7027024 7209103 7387266 7560727 7728144
59062G728144J59800J51449J42946J34118J25435J18162J12439J07080J02224
$$ 7728144 7887944 8039393 8182339 8316457 8441892 8560054 8672493 8779573 8881797
59053H881797J00344J03361J10309J19055J28826J39896J52357J66443J82435
$$ 8881797 8982141 9085502 9195811 9314866 9443692 9583588 9735945 9902388 10084823
59044A0084823J98839K12170K19927K22348K19871K10579J91919J63445J26089
$$ 10084823 10283662 10495832 10715759 10938107 11157978 11368557 11560476 11723921 11850010
59035A1850010Q0148K6302l2162r0125j43305j88975k25202k51204k67896k76558
$$ 11850010 11930158 11956460 11924298 11834173 11690868 11501893 11276691 11025487 10757591 10481033
59025A0481033k77368k70356k57048k39840k20441k00017j79992j61557j45156
$$ 10481033 10203665 9933309 9676261 9436421 9215980 9015963 8835971 8674414 8529258
59016H529258j31361j21233j14950j11305j09642j10975j16097j24021j33409
$$ 8529258 8397897 8276664 8161714 8050409 7940767 7829792 7713695 7589674 7456265
59007G456265j43903j54841j64459j72020j78997j86236j91705j93268j92080
$$ 7456265 7312362 7157521 6993062 6821042 6642045 6455809 6264104 6070836 5878756
58998E878756j90780j89443j85912j79379j71162j62410j53334j44453j36653
$$ 5878756 5687976 5498533 5312621 5133242 4962080 4799670 4646336 4501883 4365230
58989D365230j29953j23599j17175j10648j04044r8118r4256r2463r0775q8041
$$ 4365230 4235277 4111678 3994503 3883855 3779811 3681693 3587437 3494974 3404199 3316158
58979C316158q5605q4534q3016p8941p3538o9629o7266o3974n8820n3474m9280
$$ 3316158 3230553 3146019 3063003 2984062 2910524 2840895 2773629 2709655 2650835 2597361 2548081
58968B548081m5595m1217l5724k9436k3548j9794j8571j8045j6562j4768j3763
$$ 2548081 2502486 2461269 2425545 2396109 2372561 2352767 2334196 2316151 2299589 2284821 2271058
58957B271058j2621j0130p517o722o899n643l073j620j981k345j718j120j059
$$ 2271058 2258437 2248307 2240790 2234068 2227169 2221526 2218453 2216833 2214852 2212507 2210789 2209669 2208610
58944B208610m62J213L010M280N517O887P802Q393R666J1773J3702J4912J5855
$$ 2208610 2208148 2209361 2212371 2216651 2222168 2229055 2236857 2245250 2254916 2266689 2280391 2295303 2311158
58931B311158J6794J7673J9058K1616K4639K6718K7767K8818L0022L0723L1353
$$ 2311158 2327952 2345625 2364683 2386299 2410938 2437656 2465423 2494241 2524263 2554986 2586339
58920B586339L3155L5976L8200L9236M0161M1576M2696M3100M3823M5915M9017
$$ 2586339 2619494 2655470 2693670 2732906 2773067 2814643 2857339 2900439 2944262 2990177 3039194
58909C039194N1919N3828N4858N5901N7887O0585O2780O4219O6445P0398P4365
$$ 3039194 3091113 3144941 3199799 3255700 3313587 3374172 3436952 3501171 3567616 3638014 3712379
58898C712379P5933P5234P4628P5780P8585Q2285Q6046Q9052R1605R5465J01646
$$ 3712379 3788312 3863546 3938174 4013954 4092539 4174824 4260870 4349922 4441527 4536992 4638638
58887D638638J08791J15236J21525J29112J37910J47079J57019J68321J79954
$$ 4638638 4747429 4862665 4984190 5113302 5251212 5398291 5555310 5723631 5903585
58878E903585J90973K02841K17396K33534K48697K62857K78216K95824L15331
$$ 5903585 6094558 6297399 6514795 6748329 6997026 7259883 7538099 7833923 8149254
58869H149254L37162L61736L87309M12099M38095M69068N05017N42287N79385
$$ 8149254 8486416 8848152 9235461 9647560 10085655 10554723 11059740 11602027 12181412
58860A2181412O18798O62505P09437P58429Q10015Q63813R17069R67555J015354
$$ 12181412 12800210 13462715 14172152 14930581 15740596 16604409 17521478 18489033 19504387
58851A9504387J060282J099742J130408J150004J155943J144008J109424J048221
$$ 19504387 20564669 21664411 22794819 23944823 25100766 26244774 27354198 28402419
58843B8402419R57379Q35641O84894N09483L14434J06264j05190l08853m96989
$$ 28402419 29359798 30195439 30880333 31389816 31704250 31810514 31705324 31396471 30899482
58834C0899482o65668q11163r29204j018286j080585j118733j134360j130326
$$ 30899482 30233814 29422651 28493447 27475161 26394576 25275843 24141483 23011157
58826B3011157j111177j080103j038158r87555r32835q77479q21896p66114p11879
$$ 23011157 21899980 20819877 19781719 18794164 17861329 16983850 16161954 15395840 14683961
58817A4683961o60710o12397n67023n26032m89802m56408m24587l95750l71321
$$ 14683961 14023251 13410854 12843831 12317799 11827997 11371589 10947002 10551252 10179931
58808A0179931l49970l29400l09198k90056k71536k52499k32820k13345j94756
$$ 10179931 9829961 9500561 9191363 8901307 8629771 8377272 8144452 7931107 7736351
58799G736351j77478j61720j46907j31995j16836j02383q9349p7784o7621n8106
$$ 7736351 7558873 7397153 7250246 7118251 7001415 6899032 6809683 6731899 6664278 6606172
58789F606172m7073l3029j7878n139M722J4818K7410M1676N6201P0875Q5348R8445
$$ 6606172 6559099 6526070 6508192 6503053 6507775 6522593 6550003 6591679 6647880 6718755 6804103 6902548
58777F902548J10310J22889J37198J52287J67648J84125K01545K18174K33867
$$ 6902548 7012858 7135747 7272945 7425232 7592880 7777005 7978550 8196724 8430591
58768H430591K51233K72103K95106L18209L41542L66179L92264M19963M50423
$$ 8430591 8681824 8953927 9249033 9567242 9908784 10274963 10667227 11087190 11537613
58759A1537613M84164N20041N57056N95699O36622O79730P25517P75217Q28445
$$ 11537613 12021777 12541818 13098874 13694573 14331195 15010925 15736442 16511659 17340104
58750A7340104Q82365R34070R81963J024138J057641J080224J090376J084623
$$ 17340104 18222469 19156539 20138502 21162640 22220281 23300505 24390881 25475504
58742B5475504J057221J003840R23348Q14994O76975N10013L20430J17768q9071
$$ 25475504 26532725 27536565 28459913 29274907 29951882 30461895 30782325 30900093 30811022
58733C0811022k92079m83156o55361q04335r27225j021768j087662j127515j145143
$$ 30811022 30518943 30035787 29380426 28576091 27648866 26627098 25539436 24411921 23266778
58724B3266778j143995j127513j099126j061040j014883r63936r12537q62520
$$ 23266778 22122783 20995270 19896144 18835104 17820221 16856285 15943748 15081228
58716A5081228q12648p62319p13262o66776o22222n79552n40607n06220m74468
$$ 15081228 14268580 13506261 12792999 12126223 11504001 10924449 10383842 9877622 9403154
58707I403154m43511m13853l86433l60755l36491l14583k95138k76349k56990
$$ 9403154 8959643 8545790 8159357 7798602 7462111 7147528 6852390 6576041 6319051
58698F319051k38038k20721k05075j91252j79633j68669j55646j40830j27807
$$ 6319051 6081013 5860292 5655217 5463965 5284332 5115663 4960017 4819187 4691380
58689D691380j18258j09685r9944r0643q3772p8327p2730o7683o3970o0145n5170
$$ 4691380 4573122 4463437 4363493 4272850 4189078 4110751 4038021 3970338 3906368 3846223 3791053
58678C791053n0924m9385m9502m9277m8718m8388m7366m5093m3116m2667m2684
$$ 3791053 3740129 3690744 3641242 3591965 3543247 3494859 3447493 3402400 3359284 3316617 3273933
58667C273933m2239m2411m3669m4083m2666m1769m3572m6680m8849n0445n2508
$$ 3273933 3231694 3189283 3145614 3101531 3058865 3017096 2973524 2926844 2877995 2827550 2775042
58656B775042n4097n4487n5308n7458n8416n5916n1782m8925m6981m4364m2079
$$ 2775042 2720945 2666458 2611150 2553692 2495276 2439360 2387578 2338653 2291672 2247308 2205229
58645B205229m1644m1371l8742l4718l1852k9825k6792k3648k2924k4339k5239
$$ 2205229 2163585 2122214 2083472 2048754 2016902 1987077 1960285 1936637 1913713 1889374 1864135
58634A864135k4735k4130k4020k4005k4276k4665k3417j9897j6957j7293j8968
$$ 1864135 1839400 1815270 1791250 1767245 1742969 1718304 1694887 1674990 1658033 1640740 1621772
58623A621772j8101j4690j1934j0850r537p314n668n026l993k109n74N6N85J617
$$ 1621772 1603671 1588981 1577047 1566197 1556660 1549346 1543678 1538652 1534659 1532550 1531976 1532032 1532617 1534234
58609A534234L023M486M960K840j584n275o068n396n330n076l168r93p74j706
$$ 1534234 1537257 1541743 1546703 1549543 1547959 1542684 1536616 1531220 1525890 1520814 1517646 1516653 1515879 1514173
58595A514173j368M49K402M497P045Q467P716P339J0395J5575J9106K0347K1763
$$ 1514173 1512805 1513254 1515656 1520153 1527198 1535665 1543381 1550720 1561115 1576690 1595796 1616143 1637906
58582A637906K4441K7509L1021L5618L9951M2281M3944M7558N2565N6375N9210
$$ 1637906 1662347 1689856 1720877 1756495 1796446 1838727 1882671 1930229 1982794 2039169 2098379
58571B098379O3792P0513P6916Q1947Q7142R3458J00333J07830J16569J25759
$$ 2098379 2162171 2232684 2309600 2391547 2478689 2572147 2672480 2780310 2896879 3022638
58561C022638J34401J44050J57087J72739J88236K03463K20671K39825K58066
$$ 3022638 3157039 3301089 3458176 3630915 3819151 4022614 4243285 4483110 4741176
58552D741176K74055K89299L04572L18042L27367L30990L27234L14682K93135
$$ 4741176 5015231 5304530 5609102 5927144 6254511 6585501 6912735 7227417 7520552
58543G520552K61849K17791J59104Q9797J7768n1479j16118j74001k21586k57046
$$ 7520552 7782401 8000192 8159296 8249093 8266861 8215382 8099264 7925263 7703677 7446631
58533G446631k81240k95431l00946l00683k97475k91060k79649k64187k47849
$$ 7446631 7165391 6869960 6569014 6268331 5970856 5679796 5400147 5135960 4888111
58524D888111k31731k14529j96114j77939j60260j42454j25853j12669j02277
$$ 4888111 4656380 4441851 4245737 4067798 3907538 3765084 3639231 3526562 3424285
58515C424285r2028q1609p2961o6272n9944n4449n2085n2543n2570n0597m8304
$$ 3424285 3332257 3250648 3177687 3111415 3051471 2997022 2944937 2892394 2839824 2789227 2740923
58504B740923m7270m7357m8468n0445n1172m8456m3926m1437m1579m1655m0940
$$ 2740923 2693653 2646296 2597828 2547383 2496211 2447755 2403829 2362392 2320813 2279158 2238218
58493B238218m1646m4123m5596m4824m3959m4386m4340m2145l8729l5475l2396
$$ 2238218 2196572 2152449 2106853 2062029 2018070 1973684 1929344 1887199 1848470 1812995 1780599
58482A780599k9630k8122k7857k7605k6915k6201k4948k2468k0086j9678k0287
$$ 1780599 1750969 1722847 1694990 1667385 1640470 1614269 1589321 1566853 1546767 1527089 1506802
58471A506802j9297j6647j4599j3655j2303j0505r701r459q032o202o456q257
$$ 1506802 1487505 1470858 1456259 1442604 1430301 1419796 1410095 1400636 1392604 1386402 1379946 1371689
58459A371689q275n774l601l245l040k075j777k624l070k819l575n605o965o999
$$ 1371689 1363414 1357640 1354039 1350794 1347754 1345679 1343902 1341278 1338208 1335389 1331814 1326209 1319244 1312245
58445A312245p185p886p794p119p669r072q800o821o351q841j1726j2406j1163
$$ 1312245 1305060 1297174 1289380 1282261 1274592 1265520 1256720 1249899 1243548 1234707 1222981 1210575 1199412
58432A199412r206o999n492n856p149p045n399m294m433m613m642n388o079n195
$$ 1199412 1190206 1183207 1177715 1171859 1164710 1157665 1152266 1147972 1143539 1138926 1134284 1128896 1122817 1117622
58418A117622l853m459o212o007l726k311k584k499j610j734k734k339o29j69
$$ 1117622 1113769 1109310 1103098 1097091 1093365 1091054 1088470 1085971 1084361 1082627 1079893 1077554 1076925 1076756
58404A076756j207j350m87j152l289l617j221R74J419J944L490M513M767O216
$$ 1076756 1075549 1074199 1073712 1072560 1069271 1065654 1064433 1065407 1066826 1068770 1072260 1076773 1081540 1087756
58390A087756Q904J0264R629R234R897R852Q548P408O413M271J963J501J372j550
$$ 1087756 1096660 1106924 1116553 1125787 1135684 1145536 1154084 1161492 1167905 1172176 1174139 1175640 1177012 1175462
58376A175462n996p965p999j0259j4363j5333j2428j0585j1614j1497q493o517
$$ 1175462 1169466 1161501 1153502 1143243 1128880 1113547 1101119 1090534 1078920 1067423 1058930 1052413
58364A052413p540p751m629j458j195j747p40M78P79J906M291N408M827N596Q230
$$ 1052413 1044873 1037122 1032493 1031035 1029840 1028093 1027353 1027831 1028610 1030516 1034807 1040215 1045042 1050638 1058868
58349A058868R058O973N814P461Q726P844P794J0011J1244R982R821J2782J5394
$$ 1058868 1067926 1074899 1080713 1088174 1096900 1104744 1112538 1122549 1133793 1143775 1153596 1166378 1181772
58336A181772J5052J4344J5293J5333J2869J1036J1994J3128J2624J2912J4796
$$ 1181772 1196824 1211168 1226461 1241794 1254663 1265699 1277693 1290821 1303445 1316357 1331153
58325A331153J4230R108L472Q32r66m192o545o275o105p684p813m511j070J69
$$ 1331153 1345383 1354491 1357963 1358795 1357829 1353637 1347092 1340817 1334712 1327028 1319215 1314704 1313634 1313803
58311A313803K128O658R964R073P043P093P329N888N354P266Q222O272N220P684
$$ 1313803 1315931 1322589 1332553 1341626 1348669 1355762 1363091 1368979 1374333 1381599 1389821 1396093 1401313 1408997
58297A408997R934Q648O743P347Q110O701N903P792Q956O865M968O107P177N665
$$ 1408997 1418931 1427579 1434322 1441669 1449779 1456480 1462383 1470175 1479131 1485996 1490964 1497071 1504248 1509913
58283A509913N007P640R479P381N555Q164J1912J2447J1802J3009J3648J1488
$$ 1509913 1514920 1522560 1532039 1539420 1544975 1553139 1565051 1577498 1589300 1602309 1615957 1627445
58271A627445J0245J2939J5718J4918J3861J5917J7528J5363J3668J6810K0958
$$ 1627445 1637690 1650629 1666347 1681265 1695126 1711043 1728571 1743934 1757602 1774412 1795370
58260A795370K1009J9569K1028K2915K1302J9056K0504K3383K3790K3590K5328
$$ 1795370 1816379 1835948 1856976 1879891 1901193 1920249 1940753 1964136 1987926 2011516 2036844
58249B036844K5834K2517J9898K2141K5296K4718K3511K5676K7892K6569K5998
$$ 2036844 2062678 2085195 2105093 2127234 2152530 2177248 2200759 2226435 2254327 2280896 2306894
58238B306894L0613L6056L7067L7192M1393M6145M6574M6395N0660N5565N5689
$$ 2306894 2337507 2373563 2410630 2447822 2489215 2535360 2581934 2628329 2678989 2734554 2790243
58227B790243N4580N7788O2143O2309O1125O3057O4587O1875O0390O5719P2256
$$ 2790243 2844823 2902611 2964754 3027063 3088188 3151245 3215832 3277707 3338097 3403816 3476072
58216C476072P2670P1031P4519P9818Q0497Q0385Q6319R4651R8390J00824J08557
$$ 3476072 3548742 3619773 3694292 3774110 3854607 3934992 4021311 4115962 4214352 4315176 4423733
58205D423733J17852J21781J24243J32896J44783J53001J60903J75333J92413
$$ 4423733 4541585 4663366 4787609 4920505 5065288 5218289 5379192 5554525 5746938
58196E746938K04326K13582K26388K39196K46332K53165K66742K81392K89016
$$ 5746938 5951264 6164846 6391234 6630430 6876762 7129927 7396669 7678061 7967077
58187G967077K95021L08163L23709L33586L43755L63834L88777M09018M28972
$$ 7967077 8262098 8570261 8893970 9227556 9571311 9935145 10323922 10732940 11161912
58178A1161912M56831M86678N10678N37950N80223O30041O75197P22460P83099
$$ 11161912 11618743 12105421 12616099 13154049 13734272 14364313 15039510 15761970 16545069
58169A6545069Q47646R01261R52027J016288J087798J150748J211800J288117
$$ 16545069 17392715 18293976 19246003 20262291 21350089 22500837 23712637 25000754
58161B5000754J374742J456148J539252J641164J754875J862122J969349K094777
$$ 25000754 26375496 27831644 29370896 31012060 32766935 34629057 36598406 38693183
58153C8693183K232480K368668K520338K714791K943786L183767L447763L767863
$$ 38693183 40925663 43294331 45814669 48529460 51473246 54657013 58104776 61872639
58145F1872639M141880M553829N033589N634719O364844P201446Q160566R277923
$$ 61872639 66014519 70568348 75601937 81236656 87601500 94802946 102963512 112241435
58137A12241435J0541489J1928104J3486927J5285065J7286724J9401890K1641184
$$ 112241435 122782924 134711028 148197955 163483020 180769744 200171634 221812818
58130B21812818K4106234K6892703L0188612L4293253L8936703M2271362M1076234
$$ 221812818 245919052 272811755 303000367 337293620 376230323 418501685 459577919
58123D59577919L2862230J8177601O76393j5225801k6792553l3531678l6242066
$$ 459577919 492440149 510617750 511294143 496068342 469275789 435744111 399502045
58116C99502045l6063448l4144754l1498912k8773058k6185707k3737207k1410237
$$ 399502045 363438597 329293843 297794931 269021873 242836166 219098959 197688722
58109A97688722j9184539j7019415j4917230j2947447j1161511r536509q037518
$$ 197688722 178504183 161484768 146567538 133620091 122458580 112922071 104884553
58102A04884553o677949n472817m383506l369575k459066j687824r78129j86965
$$ 104884553 98206604 92733787 88350281 84980706 82521640 80833816 79855687 79668722
58094G9668722O46228J153416Q67748l33691k048979l647827m722409n237889
$$ 79668722 80314950 81468366 82336114 82002423 79953444 76305617 71583208 66345319
58086F6345319n342517n165647m803460m367539l950439l573399l218838k889867
$$ 66345319 61002802 55837155 51033695 46666156 42715717 39142318 35923480 33033613
58078C3033613k601311k342244k092004j857041j656192j484560j324759j180195
$$ 33033613 30432302 28090058 25998054 24141013 22484821 21000261 19675502 18495307
58070A8495307j065389r74698q90683q13862p56027p12590o68519o24294n90421
$$ 18495307 17429918 16455220 15564537 14750675 13994648 13282058 12613539 11989245 11398824
58061A1398824n62710n27734m87203m53519m26172l94912l61640l37296l20998
$$ 11398824 10836114 10308380 9821177 9367658 8941486 8546574 8184934 7847638 7526640
58052G526640l03138k85398k77214k75546k67900k53166k40954k32762k21855
$$ 7526640 7223502 6938104 6660890 6385344 6117444 5864278 5623324 5390562 5168707
58043E168707k09446k03121k00895j93664j81827j73485j68112j58010j44176
$$ 5168707 4959261 4756140 4555245 4361581 4179754 4006269 3838157 3680147 3535971
58034C535971j34979j30402j22680j11288j02818r7392q9447q0519p7334p8404
$$ 3535971 3400992 3270590 3147910 3036622 2933804 2836412 2746965 2666446 2589112 2510708
58024B510708p6045p0072o6504o4769n9548n3048n1756n3077m9030m1348l8807
$$ 2510708 2434663 2364591 2298087 2233318 2173770 2120722 2068966 2015889 1966859 1925511 1886704
58013A886704m1100l9576l3140k9283k9640k8364k4824k4523k7082k6282k2425
$$ 1886704 1845604 1806028 1772888 1743605 1713965 1685601 1660777 1636254 1609172 1582890 1560465
58002A560465k1925k4403k2993j7805j6266j9269j9728j6038j4458j6638j6841
$$ 1560465 1538540 1514137 1491144 1473339 1457073 1437804 1418076 1402038 1387580 1370942 1354101
57991A354101j3481j1712j2622j1121o608m858p277q670p369p372r077q278n636
$$ 1354101 1340620 1328908 1316286 1305165 1298557 1293699 1286422 1277752 1270383 1263011 1253934 1245656 1240020
57978A240020o592j0548j0750o325l549l794j546L623M711j10l765k474j182l161
$$ 1240020 1233428 1222880 1212130 1205805 1202256 1198462 1196916 1200539 1205250 1205140 1201375 1198901 1197719 1194558
57964A194558m472k816k176m457n584l838l323n446n795l147k747o698r759q912
$$ 1194558 1190086 1187270 1185094 1180637 1175053 1171215 1167892 1162446 1156651 1153504 1150757 1144059 1134300 1125388
57950A125388q519j1615j4327j3616j2689j3944j3913j0153o223n128m377j873
$$ 1125388 1116869 1105254 1090927 1077311 1064622 1050678 1036765 1026612 1020389 1015261 1010884 1009011
57938A009011l69j482j617J818N774P127P186P159N033N72k456k650l642o998
$$ 1009011 1008642 1007160 1005543 1007361 1013135 1020262 1027448 1034607 1039640 1040212 1037756 1035106 1031464 1024466
57924A024466q647o178l400l581m135k432j018k423m092l288k200l501n310m995
$$ 1024466 1015819 1009641 1006241 1002660 998525 996093 995075 992652 988560 985272 983072 979571 974261 969266
57910I69266l996m624n805n948o393q443j0368j0532j0142j0221r530p950p910
$$ 969266 965270 960646 954841 948893 942500 934057 923689 913157 903015 892794 883264 875314 867404
57897H67404j0009j1245j0015q627q597p988n867m672n436n391l164j656k764
$$ 867404 857395 846150 836135 827508 818911 810923 805056 800384 794948 789557 786393 784737 781973
57884G81973l858k596p66k07O94L217N347N687O196Q003Q711P001N509N937N594
$$ 781973 778115 775519 774753 774546 775240 778457 783804 789491 795687 803690 812401 819402 824911 830848 836442
57869H36442K144k215m760o441q835j0753j1169j1759j3381j3695j1367q761p535
$$ 836442 838586 836371 831611 825170 816335 805582 794413 782654 769273 755578 744211 735450 727915
57856G27915n605j614J810K607L042N301P256O471M724M806O097O866P672R076
$$ 727915 722310 720696 722506 725113 728155 733456 740712 747183 751907 756713 762810 769676 777348 786424
57842G86424R305P562O401P496Q379O584L690K052J020m36r90j84p12l952o844
$$ 786424 795729 803291 809692 817188 825567 832151 835841 837893 838913 838477 837487 837303 836591 832639 825795
57827H25795o726n648o355p711p918q382j0292j1127q893o410o891q595q312o903
$$ 825795 819069 813421 807066 799355 791437 783055 772763 761636 752743 746333 739442 730847 722535 715632
57813G15632o691o471m089j256q22j541l38K430M531O424R555J2238J1982J0183
$$ 715632 708941 702470 698381 697125 696303 694762 694424 696854 701385 707809 717364 729602 741584 751767
57799G51767R854J0473R637Q059Q209R442R083P125N370L268q95n694q040q179
$$ 751767 761621 772094 781731 789790 797999 807441 816524 823649 829019 832287 831392 825698 817658 809479
57785H09479q924j0669j1353j0815j0940j1824j1680j0488j0090j0802j1106j0559
$$ 809479 800555 789886 778533 767718 756778 744954 733274 722786 712696 701894 690788 680229
57773F80229r993r238p471n432m645n057n727o790q426r241q284p132p390p855
$$ 680229 670236 660998 653527 648095 643450 638393 632666 625876 617450 608209 599925 592793 585403 577548
57759E77548p084o650q491j0996j1439j0608j1121j2587j2438j0377q208o350
$$ 577548 570464 563814 555323 544327 532888 522280 511159 498572 486134 475757 467549 461199
57747D61199m212k850l365l849j870J129K024J405K406N059O402N810N564O269
$$ 461199 456987 454137 450772 446923 445053 446182 448206 449611 452017 457076 463478 469288 474852 481121
57733D81121O077M683L806L531K202K90L00K363L881M011M691O532P562O891O006
$$ 481121 487198 491881 495687 499218 501420 501710 502010 504373 508254 512265 516956 523488 531050 537941 543947
57718E43947N542M269K199J185J362M74k090l862l400k677l799n899p026o830
$$ 543947 549489 553758 555957 557142 558504 558978 556888 553026 549626 546949 543150 537251 530225 523395
57704E23395n911m546l305l169l878l802k318p15j32k03j69K63J485L707N853
$$ 523395 517484 512938 509633 506464 502586 498784 496466 495751 495619 495416 495247 495510 496995 500702 506555
57689E06555O457N756N316N692O217O686P239P078N555M110M549N975O093N278
$$ 506555 513012 518768 524084 529776 535993 542679 549918 556996 562551 566661 571210 577185 583278 588556
57675E88556N906P864Q323O580N539P130R492J0293J0073J0472J1436J2051J2516
$$ 588556 594462 602326 610649 617229 622768 629898 639390 649683 659756 670228 681664 693715 706231
57662G06231J3569J5129J6647J7795J8230J7864J7696J9018K1533K3794K5475
$$ 706231 719800 734929 751576 769371 787601 805465 823161 842179 863712 887506 912981
57651I12981K7425K9461L0277K9845K9842L1234L3346L5675L8512M1433M3324
$$ 912981 940406 969867 1000144 1029989 1059831 1091065 1124411 1160086 1198598 1240031 1283355
57640A283355M4459M6515N0038N3981N8094O3399O9663P4950P8744Q3262R0473
$$ 1283355 1327814 1374329 1424367 1478348 1536442 1599841 1669504 1744454 1823198 1906460 1996933
57629A996933R9747J09632J20070J31602J43952J56787J70679J86347K03899K23204
$$ 1996933 2096680 2206312 2326382 2457984 2601936 2758723 2929402 3115749 3319648 3542852
57619C542852K43669K63402K80380K94861L08801L22246L32144L35397L31010
$$ 3542852 3786521 4049923 4330303 4625164 4933965 5256211 5588355 5923752 6254762
57610F254762L18561K96833K65238K24677J75254J14772M1560m1552j27010k05653
$$ 6254762 6573323 6870156 7135394 7360071 7535325 7650097 7691657 7650105 7523095 7317442
57600G317442k69749l14673l39787l47995l43900l31898l15135k95126k72319
$$ 7317442 7047693 6733020 6393233 6045238 5701338 5369440 5054305 4759179 4486860
57591D486860k47719k23509k01209j80095j58896j38362j20360j05117r1366p8729
$$ 4486860 4239141 4015632 3814423 3634328 3475432 3337070 3216710 3111593 3020227 2941498
57581B941498o7665n7432m6570l5345k5278j6355p205J949R375J5170K1690L0076
$$ 2941498 2873833 2816401 2769831 2734486 2709208 2692853 2685648 2687597 2696972 2712142 2733832 2763908
57569B763908L9256M8839N9982P2438Q3906R3724J04232J16991J30436J43069
$$ 2763908 2803164 2852003 2911985 2984423 3068329 3162053 3266285 3383276 3513712 3656781
57559C656781J56209J71252J86546J99374K09300K17179K22142K21656K13514
$$ 3656781 3812990 3984242 4170788 4370162 4579462 4796641 5018783 5240439 5453953
57550E453953J96353J69468J33604R0902M2979r308o3139j12929j54243j86985
$$ 5453953 5650306 5819774 5953378 6044280 6087259 6077951 6014812 5901883 5747640 5560655
57540E560655k13063k32424k43537k46570k43933k38117k30391k21003k09587
$$ 5560655 5347592 5115168 4871631 4625061 4381128 4143011 3912620 3691617 3482030
57531C482030j96128j82248j70226j60003j48976j35892j23010j12798j04426
$$ 3482030 3285902 3103654 2933428 2773425 2624449 2488557 2365547 2252749 2148323
57522B148323r5623q6464p8900p3494o8872o3984n8934n3900m8752m3627l8813
$$ 2148323 2052700 1966236 1887336 1813842 1744970 1680986 1622052 1568152 1519400 1475773 1436960
57511A436960l4413l0757k8336k6641k4244k0825j7789j5903j3974j1056q289
$$ 1436960 1402547 1371790 1343454 1316813 1292569 1271744 1253955 1238052 1224078 1213022 1204733
57500A204733o866n763l370j65K199L506M836O620Q567J0837J3705J6598J8850
$$ 1204733 1197867 1192104 1188734 1188569 1190768 1194274 1199110 1205730 1214297 1225134 1238839 1255437 1274287
57487A274287K0684K2455K3952K5494K8275L2293L5542L7036L8961M3678N0008
$$ 1274287 1294971 1317426 1341378 1366872 1395147 1427440 1462982 1500018 1538979 1582657 1632665
57476A632665N5030N8485O2757O9072P6288Q3202Q9788R6230J02763J10411J20042
$$ 1632665 1687695 1746180 1808937 1878009 1954297 2037499 2127287 2223517 2326280 2436691 2556733
57465B556733J30819J41085J50530J59848J68708J75682J79697J79948J75035
$$ 2556733 2687552 2828637 2979167 3139015 3307723 3483405 3663102 3843050 4018085
57456D018085J64039J47785J26924R9585O3623K1151k1769o0324r3712j22533
$$ 4018085 4182124 4329909 4456833 4556418 4620041 4641192 4619423 4559099 4465387 4342854
57446D342854j45920j62442j72248j77089j78798j78145j74454j66536j54686
$$ 4342854 4196934 4034492 3862244 3685155 3506357 3328212 3153758 2987222 2832536
57437B832536j41310j28665j16740j04640r2894q2637p3478o4369n5822m8847
$$ 2832536 2691226 2562561 2445821 2341181 2248287 2165650 2092172 2027803 1971981 1923134
57427A923134m2223l3726k3944j6026j1269p676l408J077N214R966J5995K2403
$$ 1923134 1880911 1847185 1823241 1807215 1795946 1788270 1784862 1785939 1791153 1801119 1817114 1839517
57415A839517K8518L4931M1707M7724N3050N9762O8731P7809Q5189R2634J02718
$$ 1839517 1868035 1902966 1944673 1992397 2045447 2105209 2173940 2251749 2336938 2429572 2532290
57404B532290J14304J23654J29652J35140J42654J50862J56095J55970J50452
$$ 2532290 2646594 2770248 2899900 3035040 3177694 3328556 3484651 3640621 3791073
57395C791073J40060J24063J00714O9106L0749j0795n1817q9861j23480j51394
$$ 3791073 3931133 4055196 4155910 4225016 4255765 4244970 4193153 4103292 3979812 3828418
57385C828418j72348j85685j91962j92986j90910j86772j80253j71260j61178
$$ 3828418 3656070 3470385 3278423 3085437 2894527 2707755 2527502 2356242 2195064
57376B195064j51683j42873j33623j23528j13279j03463r4362q6712q0981p5870
$$ 2195064 2043381 1900508 1766885 1643357 1530078 1426615 1332253 1245541 1164560 1088690
57366A088690o9284o1172n3856m8991m5847m3064m0453l8120l5485l2385k9880
$$ 1088690 1019406 958234 904378 855387 809540 766476 726023 687903 652418 620033 590153
57355E90153k8708k7932k6298k3911k1526j9217j6954j5661j6229j7993j9343
$$ 590153 561445 533513 507215 483304 461778 442561 425607 409946 393717 375724 356381
57344C56381j9447j8479j6737j4679j3250j2971j2906j1642r152o801n657n633
$$ 356381 336934 318455 301718 287039 273789 260818 247912 236270 227118 220317 214660 209027
57332B09027o072o341n990n122m531m788n312n051l911k796k318k180j939j684
$$ 209027 202955 196614 190624 185502 180971 176183 170871 165820 161909 159113 156795 154615 152676 150992
57318A50992j675j837j966k215k986m200m912m074j845J96N55q13k928n162p298
$$ 150992 149317 147480 145514 143299 140313 136113 131201 127127 125282 125478 126033 125220 122292 117130 109832
57303A09832q672q404o645m629l333k870l224m408n687n815m607l339l109l706
$$ 109832 101160 92756 86111 81482 78149 75279 72055 67647 61960 56145 51538 48199 45090 41384
57289D1384m454n081n241m367k699j442j119q28J28R40O36l19r09j149j553j718
$$ 41384 36930 31849 26608 22241 19542 18100 16981 16153 16281 17221 17857 17538 16629 15480 13927 12209
57273A2209q57P20J881K203K191K132J750Q85k19j250j939k114k102k528l140
$$ 12209 11352 12072 13953 16156 18347 20479 22229 23114 22895 21645 19706 17592 15490 12962 9822
57258I822k563m4L141M988N054M550M559N073N517N383M484L295K787L456M828
$$ 9822 7259 7215 10356 15344 20398 24948 29507 34580 40097 45480 49964 53259 56046 59502 64330
57243F4330O396Q299J0515J2143J2445J2007J1945J2465J3126J4017J5586J7660
$$ 64330 70726 79025 89540 101683 114128 126135 138080 150545 163671 177688 193274 210934
57231B10934J9562K0955K1953K2775K3943K6195K9511L2835L5448L7793M0182
$$ 210934 230496 251451 273404 296179 320122 346317 375828 408663 444111 481904 522086
57220E22086M1778M2031M2224M4039M7161M9493M9409M6741M2227L7052L2199
$$ 522086 563864 605895 648119 692158 739319 788812 838221 884962 927189 964241 996440
57209I96440K7170K0151J0579N36p764j4669k1718k8786l4511l8532m1081m1406
$$ 996440 1023610 1043761 1054340 1054876 1047112 1032443 1010725 981939 947428 908896 867815 826409
57197H26409l9117l6383l5889l6850l5878l1946k7595k4836k2655j9401j5038
$$ 826409 787292 750909 715020 678170 642292 610346 582751 557915 535260 515859 500821
57186E00821j0007m221J552N575P756J0461J5180K0118K2689K3035K3280K4318
$$ 500821 490814 486593 488145 493720 501476 511937 527117 547235 569924 592959 616239 640557
57174F40557K4999K4116K1873J9543J8383J8769K0077K1638K3683K6724L0328
$$ 640557 665556 689672 711545 731088 749471 768240 788317 809955 833638 860362 890690
57163H90690L3519L6169L8764M1039M2196M2347M2287M1924M0572L8657L7438
$$ 890690 924209 960378 999142 1040181 1082377 1124724 1167011 1208935 1249507 1288164 1325602
57152A325602L7025L6421L5607L5665L6809L8168L9727M2373M5927M9219N2213
$$ 1325602 1362627 1399048 1434655 1470320 1507129 1545297 1585024 1627397 1673324 1722543 1774756
57141A774756N5785N9209O0483N9580N8720N8889N8714N7398N5856N4088N0485
$$ 1774756 1830541 1889750 1950233 2009813 2068533 2127422 2186136 2243534 2299390 2353478 2403963
57130B403963M5098M0664L8751L7551L5130L2321L0626K9718K8827K8409K8722
$$ 2403963 2449061 2489725 2528476 2566027 2601157 2633478 2664104 2693822 2722649 2751058 2779780
57119B779780K8838K8652K9590L1862L3396L2909L1526K9980K7153K3001J9731
$$ 2779780 2808618 2837270 2866860 2898722 2932118 2965027 2996553 3026533 3053686 3076687 3096418
57108C096418J8035J5467J0967P754Q888J2932J6916K0756K5654L0819L5135L9623
$$ 3096418 3114453 3129920 3140887 3148641 3157529 3170461 3187377 3208133 3233787 3264606 3299741 3339364
57096C339364M5107M9902N3013N7021O4206P2033P6006P4759O9174N8995M4265
$$ 3339364 3384471 3434373 3487386 3544407 3608613 3680646 3756652 3831411 3900585 3959580 4003845
57085D003845K7814J2474k510j8944l5805n1217o5849q0892r5279j08450j23027
$$ 4003845 4031659 4044133 4041623 4022679 3986874 3935657 3869808 3788916 3693637 3585187 3462160
57074C462160j40850j59329j75703j91568k08878k25178k37910k50093k66262
$$ 3462160 3321310 3161981 2986278 2794710 2585832 2360654 2122744 1872651 1606389
57065A606389k86237l08502l36084C02748a14258m65417n20119n84776o57488
$$ 1606389 1320152 1011650 675566 302748 -114258 -579675 -1099794 -1684570 -2342058
57056b342058p34818q19410r15815j022068j133949j254420j389960j540498j702227
$$ -2342058 -3076876 -3896286 -4812101 -5834169 -6968118 -8222538 -9612498 -11152996 -12855223
57047a2855223j877290k070876k281702k506091k749227l022469l333335l689748
$$ -12855223 -14732513 -16803389 -19085091 -21591182 -24340409 -27362878 -30696213 -34385961
57039c4385961m110496m618749n228549n949989o801611p800350q941084j0200362
$$ -34385961 -38496457 -43115206 -48343755 -54293744 -61095355 -68895705 -77836789 -88037151
57031h8037151j1555661j2986476j4462313j5937740j7338604j8551736j9510667
$$ -88037151 -99592812 -112579288 -127041601 -142979341 -160317945 -178869681 -198380348
57024a98380348k0380335k1588081k3455369k5664935k7184668k6894582k4356877
$$ -198380348 -218760683 -240348764 -263804133 -289469068 -316653736 -343548318 -367905195
57017c67905195j9976118j4504150q525628k387503L603575R100101J3803835
$$ -367905195 -387881313 -402385463 -410911091 -413298594 -409695019 -400594918 -386791083
57010c86791083J7538221K0239431K1952511K2843678K3149074K3067287K2702230
$$ -386791083 -369252862 -349013431 -327060920 -304217242 -281068168 -258000881 -235298651
57003b35298651K2095250K1273577K0260128J9071029J7728742J6271363J4743986
$$ -235298651 -213203401 -191929824 -171669696 -152598667 -134869925 -118598562 -103854576
56996a03854576J3192038J1665876J0217804Q886870P692281O641463N734458
$$ -103854576 -90662538 -78996662 -68778858 -59891988 -52199707 -45558244 -39823786
56989c9823786M959913M298452L734575L259034K859870K520387K227796J976097
$$ -39823786 -34863873 -30565421 -26830846 -23571812 -20711942 -18191555 -15963759 -13987662
56981a3987662J759385J569876J403518J259980J135822J024559R24209Q37601
$$ -13987662 -12228277 -10658401 -9254883 -7994903 -6859081 -5834522 -4910313 -4072712
56973d072712P64058O97818O35927N81128N35374c61651A02604M39186M19996
$$ -4072712 -3308654 -2610836 -1974909 -1393781 -858407 -361651 102604 541790 961786
56964I61786M01687L82162L63947L47857L30436L09647K87857K66995K45423K21969
$$ 961786 1363473 1745635 2109582 2457439 2787875 3097522 3385379 3652374 3897797 4119766
56954D119766J98498J76012J52223J25730R9311P6507N7709M1747K8952K0292
$$ 4119766 4318264 4494276 4646499 4772229 4871540 4948047 5005756 5047503 5076455 5096747
56944E096747J5137J1902J0690J4656K7542M6707N7099L7144k2825j08291j90960
$$ 5096747 5111884 5123786 5134476 5149132 5176674 5223381 5280480 5317624 5294799 5186508 4995548
56933D995548k51086k86470l03357l06783l00607k89139k74578k56635k36593
$$ 4995548 4744462 4457992 4154635 3847852 3547245 3258106 2983528 2726893 2490300
56924B490300k17899k01326j84111j65795j50658j41959j37634j34028j30295
$$ 2490300 2272401 2071075 1886964 1721169 1570511 1428552 1290918 1156890 1026595
56915A026595j26701j21987j15250j07877j01247r4762q7799q0964p3810E1886
$$ 1026595 899894 777907 662657 554780 453533 358771 270972 190008 116198 51886
56904e94m1627l3973k7648k0229j2355n594O10P157J2605J4867J4004J1190O621
$$ -594 -42221 -76194 -103842 -124071 -136426 -142020 -141410 -134253 -121648 -106781 -92777 -81587 -74966
56891g4966N87m894p666p617n840l040o8J652J927K600N138Q742J1933J4530J6925
$$ -74966 -74379 -79273 -86939 -94556 -100396 -103436 -103504 -101852 -99925 -97325 -92187 -83445 -71512 -56982 -40057
56876d0057J9051I1K3668K6371K8189K9724L2670L5990L5362K8127J6493M291
$$ -40057 -21006 91 23759 50130 78319 108043 140713 176703 212065 240192 256685 260976
56864B60976o873j6485k2865k4856k3999k2731k1669k0409j9213j8070j5881j2618
$$ 260976 254103 237618 214753 189897 165898 143167 121498 101089 81876 63806 47925 35307
56852C5307j0448j0617C229e899n872l938l937m355m217l358j198K304N334N992
$$ 35307 24859 14242 3229 -5899 -11771 -15709 -19646 -24001 -28218 -31576 -32774 -30470 -25136 -19144
56838a9144M807L750L736b230D260R046J0946J1613J2387J4144J5384J4747J3788
$$ -19144 -14337 -10587 -6851 -2230 4260 13306 24252 35865 48252 62396 77780 92527 106315
56825A06315J4702J6632J6935J4959J1876P898K677k287m769n027n086n199l795
$$ 106315 121017 137649 154584 169543 181419 189317 191994 189707 184938 179911 174825 169626 165831
56812A65831q11J908L699N846Q994J2276J5462J9447K4053K7717L0110L2980L7525
$$ 165831 165020 166928 170627 176473 185467 197743 213205 232652 256705 284422 314532 347512 385037
56799C85037M2583M5901M5558L9994K8849J4610J521q041j4735j9571k2055k1765
$$ 385037 427620 473521 519079 559073 587922 602532 604053 596012 581277 561706 539651 517886
56787E17886j9780j7267j3998r493m430K26M686R861J6024K2652K9101L4961M0304
$$ 517886 498106 480839 466841 457348 452918 453144 457830 467691 483715 506367 535468 570429 610733
56774F10733M5748N1487N5916N6044M9684L6813J8971j441k1110l6469m5483m8556
$$ 610733 656481 707968 763884 819928 869612 906425 925396 923955 902845 866376 820893 772337
56762G72337m7481m3994l9310l4126k8648k3019j7787j3346q994l375L987J2162
$$ 772337 724856 680862 641552 607426 578778 555759 537972 524626 515632 512257 516244 528406
56750E28406J9826K6172L0990L4522L7108L8196L5881K8370J6042J576j1887k2336
$$ 528406 548232 574404 605394 639916 677024 715220 751101 779471 795513 797089 785202 762866
56738G62866k9232l3242l5414l6027l4628l1611k8616k6373k3370j8168j2037
$$ 762866 733634 700392 664978 628951 594323 562712 534096 507723 484353 466185 454148
56727D54148p384m339j152K480N029O242Q088J1761J5624J7049J4822R050M31
$$ 454148 446764 442425 441273 443753 448782 455024 463112 474873 490497 507546 522368 531418 531849
56714E31849r357j7803k3213k5603k5660k3933k1459j9802j9656k0189k0212j9196
$$ 531849 522492 504689 481476 455873 430213 406280 384821 365019 345363 325174 304962 285766
56702B85766j6955j3654j0455q813q700q643p911p206o869n980m151k635k530
$$ 285766 268811 255157 244702 235889 227189 218546 210635 203429 196560 190580 186429 183794 181264
56689A81264l082k954k291k259l145l929l510j855j69m7j811l665l468j379M17
$$ 181264 178182 175228 172937 170678 167533 163604 160094 158239 158070 158023 156212 152547 149079 147700 148117
56674A48117O44J35j5J16K13L98K31j251l550m398k685k77M22n21j395j555j642
$$ 148117 148761 148896 148881 148997 149210 149608 149839 148588 145038 140640 137955 137678 138100 137579 136184 134629 132987
56657A32987j863j713j222j220k264l949n159m793k862r11n04j194j277n81p02
$$ 132987 131124 129411 128189 126969 124705 120756 115597 110804 107942 107031 106527 105333 104056 103475 102773
56642A02773j994k557j277J81j07j571k597k961l079k469j046l59j207j506Q11
$$ 102773 100779 98222 96945 97126 97019 95448 92851 89890 86811 84342 83296 82937 81730 80224 81035
56627H1035L960M443K374J352K996M833M430K804K395L678N242N844N207L792
$$ 81035 84995 89438 91812 93164 96160 100993 105423 108227 110622 114300 119542 125386 130593 134385
56613A34385K627K553L091K921J841J152J747K917L533L466L192K861K306J414
$$ 134385 137012 139565 142656 145577 147418 148570 150317 153234 156767 160233 163425 166286 168592 170006
56599A70006J43j321k326k199j082J67P74L58j105k832l297j767N75K070K590
$$ 170006 170149 168828 166502 164303 163221 163388 164162 164520 163415 160583 157286 155519 156094 158164 160754
56584A60754K823K342K78k213k473Q6K770K929J019o20q60l60P9N25J375K511
$$ 160754 163577 165919 166197 163984 161511 161597 164367 167296 168315 167695 166835 166475 166554 167079 168454 170965
56568A70965L123K381M92j187j629j466j946k938l077j882m33K04J73J67N75J462
$$ 170965 174088 176469 176961 175774 174145 172679 170733 167795 164718 162836 162403 162607 162780 162947 163522 164984
56552A64984K530L008K522J980K402L038K209J17q81N52K864L750K967K033K013
$$ 164984 167514 170522 173044 175024 177426 180464 182673 182790 181909 182461 185325 189075 192042 194075 196088
56537A96088K552K582J454k33q77M20K493L405K874K123J611P10l10j88Q57P68
$$ 196088 198640 201222 202676 202443 201566 201986 204479 207884 210758 212881 214492 215202 214892 214704 215561 216329
56521B16329j148k754k274j015j052j768r58J564L660L932L059K152J375N82Q4
$$ 216329 215181 212427 210153 209138 208086 206318 205360 206924 210584 214516 217575 219727 221102 221684 221768
56506B21768L49J536L390N156N901N436M643M313M240M042M165N125O204N990
$$ 221768 222117 223653 227043 232199 238100 243536 248179 252492 256732 260774 264939 270064 276268 282258
56492B82258M163J999J055J762L247M101L585K271J312J075J054R75J009P94m75
$$ 282258 286421 288420 289475 291237 294484 298585 302170 304441 305753 306828 307882 308857 309866 310660 310185
56477C10185k416l310k318p84l04o74q52r61j828l152l668k889j498j28J117J916
$$ 310185 307769 304459 302141 301357 301053 300379 299527 298566 296738 293586 289918 287029 285531 285403 286520 288436
56461B88436J555k58k842m941n467m163j921j47M34M4r59k425l854m455m065l220
$$ 288436 289991 289733 286891 281950 276483 272320 270399 270252 270686 270730 269771 267346 263492 259037 254972 251752
56445B51752k155q44Kn33j776k020j381k017m475o110m821k311j410j825j174
$$ 251752 249597 248753 248755 248222 246446 244426 243045 241028 236553 230443 225622 223311 221901 220076 218902
56430B18902Q32K064J414J07n04k46P69K389L569L127J640R34J499K041J871J980
$$ 218902 219734 221798 223212 223319 222815 222569 223338 225727 229296 232423 234063 234997 236496 238537 240408 242388
56414B42388L151M532M915M394L938M061M427M391L707L016L512N499P612Q264
$$ 242388 245539 250071 254986 259380 263318 267379 271806 276197 279904 282920 286432 291931 299543 307807
56400C07807P535O814O901P493Q196Q818Q780P445N242L502K998L320L682L645
$$ 307807 315342 322156 329057 336550 344746 353564 362344 369789 375031 378533 381531 384851 388533 392178
56386C92178L037J975R40L24L2j96m53r83k134l485l866k989k110k282k950l168
$$ 392178 395215 397190 398130 398454 398486 398290 397837 396854 394720 391235 387369 384380 382270 379988 377038 373870
56370C73870l138l343l305k621k121k537k947k292j429j804k980l452l266l621
$$ 373870 370732 367389 364084 361463 359342 356805 353858 351566 350137 348333 345353 341901 338635 335014
56356C35014m283l699j660J30L35q42k658m379m942l713j613j11N33P55K71j134
$$ 335014 330731 327032 325372 325502 325837 324995 322337 317958 313016 309303 307690 307579 308112 308867 309138 308004
56340C08004k233j947j540k789m570m056j117J330J680J455K241L426L916L852
$$ 308004 305771 303824 302284 299495 294925 290869 289752 291082 292762 294217 296458 299884 303800 307652
56326C07652L573K765J501N61J56r1K42J926M066M677L599K590K265J384k28o84
$$ 307652 311225 313990 315491 316052 316208 316117 316359 318285 322351 327028 330627 333217 335482 336866 336638 335954
56310C35954J004L296M622N346O058N987M580K949K308K417K656L217M177M780
$$ 335954 336958 340254 344876 350222 356280 362267 366847 369796 372104 374521 377177 380394 384571 389351
56296C89351M626M233L698K362N22k57N92J634J686J412J784K475K806K923L087
$$ 389351 393977 398210 401908 404270 404792 404535 405127 406761 408447 409859 411643 414118 416924 419847 422934
56281D22934L084L058L598M400M219K757J185M31M61J596M502Q376J1021J1415
$$ 422934 426018 429076 432674 437074 441293 444050 445235 445666 446127 447723 452225 460601 471622 483037
56267D83037J0539R328P785O436O386P384P974Q061Q946J0426J0755J0141J1108
$$ 483037 493576 502904 510689 517125 523511 530895 538869 546930 555876 566302 577057 587198 598306
56254E98306J4161J6201J4985J2270J0680J0110R418R129J0084J1338J1599J1218
$$ 598306 612467 628668 643653 655923 666603 676713 686131 695260 705344 716682 728281 739499
56242G39499J0915J0276R031Q118P893P262N981N580O496O765N343M210N098O719
$$ 739499 750414 760690 769721 777839 785732 792994 798975 804555 811051 817816 823159 827369 832467 839186
56228H39186P586Q874J1719J4112J3814J2514J3658J7431K1045K3125K4881K7390
$$ 839186 846772 855646 867365 881477 895291 907805 921463 938894 959939 983064 1007945 1035335
56216A035335L0332L3124L5443L7086L8761M2028M7056N1837N5159N8616O3842
$$ 1035335 1065667 1098791 1134234 1171320 1210081 1252109 1299165 1351002 1406161 1464777 1528619
56205A528619O9675P4367P8800Q4963R2626J00184J07639J16249J26133J36550
$$ 1528619 1598294 1672661 1751461 1836424 1929050 2029234 2136873 2253122 2379255 2515805
56195B515805J47594J59403J70690J80190J88715J97593K06121K12517K16404
$$ 2515805 2663399 2822802 2993492 3173682 3362397 3559990 3766111 3978628 4195032
56186D195032K18239K17222K11862K01822J87527J68840J45860J19956R2496O3751
$$ 4195032 4413271 4630493 4842355 5044177 5231704 5400544 5546404 5666360 5758856 5822607
56176E822607L4415O597j8321m1003o1768p8824r0835r9272j06227j11910j16275
$$ 5822607 5857022 5863619 5845298 5804295 5742527 5663703 5572868 5473596 5367369 5255459 5139184
56165E139184j20693j25662j29213j30357j31726j35759j40475j42495j42348
$$ 5139184 5018491 4892829 4763616 4633259 4501533 4365774 4225299 4082804 3940456
56156C940456j43168j45563j47403j47629j46865j45034j41450j36638j31452
$$ 3940456 3797288 3651725 3504322 3356693 3209828 3064794 2923344 2786706 2655254
56147B655254j25395j18206j11657j07109j02805r6515q9228q3147p7620p0467
$$ 2655254 2529859 2411653 2299996 2192887 2090082 1993567 1904339 1821192 1743572 1673105
56137A673105o2064n4673m8847m3698l9592l7283l5534l2790l0031k8748k7509
$$ 1673105 1611041 1556368 1507521 1463823 1424231 1386948 1351414 1318624 1288593 1259845 1232336
56126A232336k4024j9372j6411j5138j3311j0683q779p328m806j993j165k022
$$ 1232336 1208312 1188940 1172529 1157391 1144080 1133397 1124618 1117290 1112484 1110491 1109326 1107304
56114A107304j962j91J733L103M690O468P751R161J1729J4560J6056J6526J7083
$$ 1107304 1105342 1105151 1106884 1109987 1114677 1121145 1128896 1138057 1149786 1164346 1180402 1196928 1214011
56101A214011J7295J6592J6447J8053J9632J9232J8332J9210K0712K0570J9858
$$ 1214011 1231306 1247898 1264345 1282398 1302030 1321262 1339594 1358804 1379516 1400086 1419944
56090A419944K0826K2205K1308J9382J9920K2859K5272K6945L0430L6035M1541
$$ 1419944 1440770 1462975 1484283 1503665 1523585 1546444 1571716 1598661 1629091 1665126 1706667
56079A706667M6562N2934O1057O9927Q0201R3273J08000J22100J35720J49763
$$ 1706667 1753229 1806163 1867220 1937147 2017348 2110621 2218621 2340721 2476441 2626204
56069B626204J62145J69885J73238J73447J68556J56561J40935J27511J17307
$$ 2626204 2788349 2958234 3131472 3304919 3473475 3630036 3770971 3898482 4015789
56060D015789J07668R8400R0499Q0462O2933L8572J3184j0160l1759m9211n8538
$$ 4015789 4123457 4221857 4312356 4392818 4455751 4494323 4507507 4497347 4465588 4416377 4357839
56049D357839o1724o6246p6072q9233j04301j22201j40528j53119j57300j56045
$$ 4357839 4296115 4229869 4153797 4064564 3960263 3838062 3697534 3544415 3387115 3231070
56039C231070j51679j43067j30272j16460j03671r1415q0208p1616o4429n5853
$$ 3231070 3079391 2936324 2806052 2689592 2585921 2494506 2414298 2342682 2278253 2222400
56029B222400m6687m0259l6479l2387k8070k6195k6057k4351k1393k0220j9900
$$ 2222400 2175713 2135454 2098975 2066588 2038518 2012323 1986266 1961915 1940522 1920302 1900402
56018A900402j6451j0255n725l792j542J063J333L26J751M659N018M016O614J2045
$$ 1900402 1883951 1873696 1867971 1864179 1862637 1863700 1865033 1865359 1867110 1871769 1876787 1880803 1887417 1899462
56004A899462J4579J3820J5157J9476K1863K1536K3448K8472L1488L1208L2587
$$ 1899462 1914041 1927861 1943018 1962494 1984357 2005893 2029341 2057813 2089301 2120509 2153096
55993B153096L7213M0362L9995M0016M2324M4177M5313M8876N3585N4037N0522
$$ 2153096 2190309 2230671 2270666 2310682 2353006 2397183 2442496 2491372 2544957 2598994 2649516
55982B649516M9350N1918N3127N2092N4044N9736O3502O4005O6345P1389P3916
$$ 2649516 2698866 2750784 2803911 2856003 2910047 2969783 3033285 3097290 3163635 3235024 3308940
55971C308940P3619P6736Q4241Q9808R2005R6689J04882J10576J13269J19954
$$ 3308940 3382559 3459295 3543536 3633344 3725349 3822038 3926920 4037496 4150765 4270719
55961D270719J31673J41296J47669J58235J74081J86767J93874K02956K15925
$$ 4270719 4402392 4543688 4691357 4849592 5023673 5210440 5404314 5607270 5823195
55952E823195K24978K28886K37138K52123K63443K66537K70767K82008K93684
$$ 5823195 6048173 6277059 6514197 6766320 7029763 7296300 7567067 7849075 8142759
55943H142759L02583L16922L40330L63971L82941M04367M31572M57175M80082
$$ 8142759 8445342 8762264 9102594 9466565 9849506 10253873 10685445 11142620 11622702
55934A1622702N11627N56035O02453O44694O90420P42477P91288Q34775Q84914
$$ 11622702 12134329 12690364 13292817 13937511 14627931 15370408 16161696 16996471 17881385
55925A7881385R45187J003383J056428J118770J195626J272969J345382J427239
$$ 17881385 18826572 19829955 20886383 22005153 23200779 24473748 25819130 27246369
55917B7246369J523848J619846J709982J811785J933125K059408K189012K346981
$$ 27246369 28770217 30390063 32100045 33911830 35844955 37904363 40093375 42440356
55909D2440356K545023K764213K997227L269035L594826L961330M375310M884286
$$ 42440356 44985379 47749592 50746819 54015854 57610680 61572010 65947320 70831606
55901G0831606N520169O269863P129069Q128186R273904J0534410J1925087J3534678
$$ 70831606 76351775 82621638 89750707 97878893 107152797 117687207 129612294 143146972
55893A43146972J5420107J7564723J9995170K2824387K6103644K9768072L3770630
$$ 143146972 158567079 176131802 196126972 218951359 245055003 274823075 308593705
55886C08593705L7890666M0979787M0612904L4301547K1652318N273738j0714956
$$ 308593705 346484371 387464158 428077062 462378609 484030927 489304665 478589709
55879D78589709k3143261l0978203l4759167l5542828l4382018l2200302k9651165
$$ 478589709 455446448 424468245 389709078 354166250 319784232 287583930 257932765
55872B57932765k7035432k4442067k1931986j9559039j7329342j5244975j3350326
$$ 257932765 230897333 206455266 184523280 164964241 147634899 132389924 119039598
55865A19039598j1682335j0220087q928494p808104o861882o055750n352615m750347
$$ 119039598 107357263 97137176 88208682 80400578 73538696 67482946 62130331 57379984
55857E7379984m251607l829591l455895l131603k861076k623703k399452k195532
$$ 57379984 53128377 49298786 45842891 42711288 39850212 37226509 34827057 32631525
55849C2631525k021682j864308j709569j567883j451297j348841j246834j152496
$$ 32631525 30609843 28745535 27035966 25468083 24016786 22667945 21421111 20268615
55841B0268615j075740j007510r36919q71108q18377p69719p15954o65850o28968
$$ 20268615 19192875 18185365 17248446 16377338 15558961 14789242 14073288 13407438 12778470
55832A2778470n97261n61011n26597n01323m76800m44655m13287l92111l73865
$$ 12778470 12181209 11620198 11093601 10592278 10115478 9670823 9257536 8865425 8491560
55823H491560l49278l25059l10442k99144k81428k61752k48294k36613k19459
$$ 8491560 8142282 7817223 7506781 7207637 6926209 6664457 6416163 6179550 5960091
55814E960091k01881j91213j82467j68496j54646j48809j46521j40108j33429
$$ 5960091 5758210 5566997 5384530 5216034 5061388 4912579 4766058 4625950 4492521
55805D492521j33611j36929j36457j35283j38774j41803j36883j27547j21098
$$ 4492521 4358910 4221981 4085524 3950241 3811467 3669664 3532781 3405234 3284136
55796C284136j15519j05958r6902r5281r7901r7396r4478r3159r0564q2869p4971
$$ 3284136 3168617 3062659 2965757 2870476 2772575 2675179 2580701 2487542 2396978 2314109 2239138
55785B239138p2921p2571o6602n7110n0621m6352m0013l3682l1413l0113k4875
$$ 2239138 2166217 2093646 2027044 1969934 1919313 1872961 1832948 1799266 1767853 1737740 1712865
55774A712865j8494j6093j5412j1857q003q584j1111j0794r828j2724j7463k0233
$$ 1712865 1694371 1678278 1662866 1651009 1643006 1634422 1623311 1612517 1602689 1589965 1572502 1552269
55762A552269k3557l0577l6751l6729l4324l5938l9152l7687l3095l1348l1888
$$ 1552269 1528712 1498135 1461384 1424655 1390331 1354393 1315241 1277554 1244459 1213111 1181223
55751A181223k9956k6229k4591k3703j9981j5728j5295j6408j4128j0069q895
$$ 1181223 1151267 1125038 1100447 1076744 1056763 1041035 1025740 1009332 995204 985135 976240
55740I76240r070o146k047j997m843n292l456l689o178p789r010j2144j5063j4496
$$ 976240 967170 961024 958977 956980 952137 946845 943389 939700 933522 925733 916723 904579 889516 875020
55726H75020j2843j4131j6106j4284j0723j0417j1798r541m509k130k789k401
$$ 875020 862177 848046 831940 817656 806933 796516 784718 775177 770668 768538 765749 763348
55714G63348r95k234n549o894o486q150j1749j3569j3212j3182j2745r188m013
$$ 763348 762353 760119 754570 747676 741190 733040 721291 707722 694510 681328 668583 659395 655382
55701F55382j149l61R60J376k236p666r949r358r736j0688q952o007o488r990
$$ 655382 654233 653872 654832 656208 653972 646306 636357 626999 617263 606575 597623 591616 585128 575138
55687E75138j1942j1798j2949j5261j5257j3181j2653j3585j2519r706q827r899
$$ 575138 563196 551398 538449 523188 507931 494750 482097 468512 455993 446287 437460 427561
55675D27561r354p008o236p302p107n430m930n200l403o26r44m237o336o202o483
$$ 427561 418207 411199 404963 397661 390554 385124 380194 374994 371591 370965 370021 365784 359448 353246 346763
55660C46763p245n918l396l412n578n671l209k110l463m167l374l726n336m863
$$ 346763 339518 333600 330204 326792 321214 315543 312334 310224 306761 302594 299220 295494 290158 285295
55646B85295j616J376L118N628Q620R094O950N199M056P63m181o776o154n410
$$ 285295 283679 285055 288173 293801 302421 311515 318465 323664 327720 328483 324302 317526 311372 305962
55632C05962n177k809J254K842J226O14K861M755M336L968N075N492M229L658
$$ 305962 300785 297976 299230 302072 303298 303912 306773 311528 315864 319832 324907 330399 334628 338286
55618C38286M753N022L137R31p73l588p282q935q000p527q746r087p113m882l926
$$ 338286 343039 348061 351198 352129 351356 347768 340486 331551 323551 316024 307278 298191 291078 286196 282270
55603B82270l215k435k855l892l192j004J59O14L018O273N788J090k742k922k384
$$ 282270 279055 276620 273765 269873 266681 265677 265836 266450 269468 275741 281529 282619 279877 276955 274571
55588B74571l480m066k561j307k073l022k838l152m475m466k784k745n498p395
$$ 274571 271091 267025 264464 263157 261084 258062 255224 252072 247597 243131 240347 237602 232104 224709
55574B24709o111m532n432o892o540o015p382q886q011n739m367l824l125k733
$$ 224709 218598 214066 208634 201742 195202 189187 181805 172919 164908 159169 154802 150978 147853 145120
55560A45120k897k323p76j77j098j330R5R64mp10L53J338P12J30R53J446K04r77
$$ 145120 142223 139900 139124 138947 137849 136519 136614 137578 137574 136864 137217 138555 139267 139397 140350 141796 142000 141023
55542A41023n55k53j654k981k288r39q56j153n29j77j199j728O1K389K462N96
$$ 141023 140468 140215 138561 135580 133292 132353 131497 130344 129815 129638 128439 126711 126772 129161 131623 132219
55526A32219j115k241l261l411k055o63o13p49M43J809J203j195l333l910k861
$$ 132219 131104 128863 125602 122191 120136 119473 118860 118111 118554 120363 121566 120371 117038 113128 110267
55511A10267p09J074P78j011j556J11J671J333N38J007J675Q96n59j075r55j344
$$ 110267 109558 110632 111410 110399 108843 108954 110625 111958 112496 113503 115178 116074 115515 114440 113485 112141
55495A12141j974j985j556j180p32m78j284k706k948j770j111j746j895n33O91
$$ 112141 110167 108182 106626 105446 104714 104236 102952 100246 97298 95528 94417 92671 90776 90243 90934
55480I0934N48M34J692L231L679L494L144J807l46j154J71J280L58j030q63R7
$$ 90934 91482 91916 93608 96839 100518 104012 107156 108963 108617 107463 107634 108914 109272 108242 107379 107476
55464A07476K71ON5l01j272j181N63J465n03l522m735m217l577k727j001M04J05
$$ 107476 107747 107753 107808 107507 106235 105054 105617 107082 106579 103057 98322 94105 90528 87801 86800 87204 87309
55447H7309q42p41k67j016k392k615j822j575k069k150j502p55o5P99J413J162
$$ 87309 86467 85726 85459 84443 82051 79436 77614 76039 73970 71820 70318 69563 69498 70297 71710 72872
55431G2872J19j374k991l835l006j304n72q31l61R21J017l68p73P65J715K63j536
$$ 72872 72991 71617 68626 64791 61785 60481 59909 59078 58717 59638 60655 60287 59514 60279 61994 62257 60721
55414F0721j213K55O32l0o12j541l381m767m216k466r61J86J010O36p58j259l67
$$ 60721 59508 59763 60395 60365 59753 58212 54831 50064 45848 43382 42421 42607 43617 44253 43495 42236 41869
55397D1869k77k058l397k466r91q75o76J341L490L404K105J829K040J096k08l11
$$ 41869 41592 39534 36137 33671 32680 31805 31129 32470 35960 39364 41469 43298 45338 46434 46226 45915
55381D5915j56j212k103q97R71R60q9L35J635J213o09j014M71J560J399J453K262
$$ 45915 45759 44547 42444 41547 42518 43478 43389 43724 45359 46572 45963 44949 45420 46980 48379 49832 52094
55364E2094K664K375K323K395J580K35m68r73k540m360m330k441p62k38k9L92
$$ 52094 54758 57133 59456 61851 63431 63666 63198 62225 59685 55325 50995 48554 47792 47554 47525 47917
55348D7917Q78J842L293L342M95l104l721j167J114R86k25o92l72J42O24N15q28
$$ 47917 48795 50637 53930 57272 57767 54663 50942 49775 50889 51875 51650 50958 50586 50728 51352 51867 51039
55331E1039k734l695l240j948j06J940K814J539o17j803k310l480m698m137j919
$$ 51039 48305 44610 41370 39422 39316 41256 44070 45609 44992 43189 40879 37399 32701 28564 26645
55316B6645P2J262K631M001L775J630p84k142k454j831k20J518K248K220K406
$$ 26645 26717 27979 30610 34611 38386 40016 39232 37090 34636 32805 32585 34103 36351 38571 40977
55301D0977K425J086j177k334j401N32J814J548j85k090k431j233o16j581k151
$$ 40977 43402 44488 43311 40977 39576 40108 41922 43470 43285 41195 38764 37531 36915 35334 33183
55286C3183o44J081L98j591j691K98J545P98l20n54m68m59j85k33j643l540l665
$$ 33183 32539 33620 34018 32427 30736 31034 32579 33377 33057 32503 32035 31576 31391 31158 29515 25975 22310
55269B2310j683L96J275J624K130K462K314J605j48k675l772j776J241J549j176
$$ 22310 20627 21023 22298 23922 26052 28514 30828 32433 32285 29610 25838 24062 25303 26852 25676
55254B5676l668l828k626j162Q27K854L150J497J37O32J826J904P16o87j337o91
$$ 25676 22008 18180 15554 14392 15219 18073 21223 22720 22857 23489 25315 27219 27935 27248 25911 25220
55238B5220P53J244k11j868j424K97M81j048j421O38K883L185K261J567J047M17
$$ 25220 25973 27217 27006 25138 23714 24011 24492 23444 22023 22661 25544 28729 30990 32557 33604 34021
55222C4021M53J410J951J146l1l63j87l84q97j251j448j421o62R04K428L021K420
$$ 34021 34474 35884 37835 38981 38950 38587 38400 38016 37119 35868 34420 32999 32337 33241 35669 38690 41110
55205D1110Q49q72j421m68L64m43j802j522J91J047L25l24LJ60n70j101n70K17
$$ 41110 41959 41087 39666 39198 39562 39119 37317 35795 35986 37033 37358 37034 37037 37197 36627 35526 34956 35173
55187C5173L86K41J03m85j539k104j642p18N4M43m2j527k496j133J865L744L359
$$ 35173 35559 35800 35903 35418 33879 31775 30133 29415 29469 29912 29870 28343 25847 24714 26579 30323 33682
55170C3682K188J480O66n81j099j84J014J192M30o96k000k878k300m48J122J613
$$ 33682 35870 37350 38016 37435 36336 36152 37166 38358 38788 38092 36092 33214 30914 30466 31588 33201
55154C3201J724J854J407N42N76J659J970L85j606j909m16J474K658K651J386
$$ 33201 34925 36779 38186 38728 39304 40963 42933 43318 41712 39803 39387 40861 43519 46170 47556
55139D7556l25j079m13P40J472J672J147m27k202k358l74K098L212K701J306j79
$$ 47556 47231 46152 45739 46479 47951 49623 50770 50343 48141 45783 45409 47507 50719 53420 54726 54547
55123E4547r71p69n20j389k772k878j453j36J10N2K58J68l08k59L09Q3j135j459
$$ 54547 53576 52807 52287 50898 48126 45248 43795 43659 43769 43821 44079 44247 43939 43680 43989 44072 42937 41478
55105D1478L39K798L683K534L29j936l252k639n58Q70J70j739k995k998k377j732
$$ 41478 41817 44615 48298 50832 51161 49225 45973 43334 42776 43646 43816 42077 39082 36084 33707 31975
55089C1975j216p21J01J309K036J327k89j181p04K48P96Q89N68n6j74Q83K062
$$ 31975 30759 30038 30139 31448 33484 34811 34522 33341 32637 32885 33681 34570 35138 35082 34908 35791 37853
55072C7853J588m42k146k470j908p72J010K405J971M36J35J494K449J863R06N07
$$ 37853 39441 38999 36853 34383 32475 31703 32713 35118 37089 37525 37660 39154 41603 43466 44372 44879
55056D4879J11k05P33K458K529M23j041J23J998J889K25q46p47j40R96K683L599
$$ 44879 44990 44785 45518 47976 50505 50928 49887 50010 52008 53897 54122 53276 52529 52389 53385 56068 59667
55039E9667K517K36j456j845j157L32J848K203J442R88J191O26j035j654J78K616
$$ 59667 62184 62420 60964 59119 57962 58294 60142 62345 63787 64775 65966 66592 65557 63903 64081 66697
55023F6697L146J890L86r83k146j800O08K693J749j286l005k083j84J174K173
$$ 66697 69843 71733 72119 71136 68990 67190 67798 70491 72240 70954 67949 65866 65682 66856 69029
55008F9029L101L408K862K106J692J540J342P41o59k624m001l811k252j47J760
$$ 69029 72130 75538 78400 80506 82198 83738 85080 85821 85162 82538 78537 74726 72474 72327 74087
54993G4087K569J503p70k301k245j808j966j804l19J530K256K049J912J624L02
$$ 74087 76656 78159 77389 75088 72843 71035 69069 67265 66946 68476 70732 72781 74693 76317 76619
54978G6619j692k964k831j682j66J006J107K24p06j241j798k090q51J880L925
$$ 76619 74927 71963 69132 67450 67284 68290 69397 69621 68915 67674 65876 63786 62935 64815 68740
54963F8740L809K813K612K544J153r23j769r76L36J476K323K318J201R9J56P46
$$ 68740 72549 75362 77974 80518 81671 80748 78979 78003 78339 79815 82138 84456 85657 85756 85912 86658
54947H6658N80j80o16j003k093l147k777j295k55N3O91J810K259J572O17J04j22
$$ 86658 87238 87058 86442 85439 83346 80199 77422 76127 75872 75925 76616 78426 80685 82257 82874 82978 82856
54930H2856j16M80J496K114J909J133Lj376k413k361j346l61j64o90j358j500
$$ 82856 82740 83220 84716 86830 88739 89872 89875 88499 86086 83725 82379 82018 81854 81164 79806 78306
54914G8306p84L75J118J181J077J202J537K337L922N505N712M728M318M951M721
$$ 78306 77522 77897 79015 80196 81273 82475 84012 86349 90271 95776 101488 106216 110534 115485 120206
54899A20206K384l75j267n09K36Q63K660N805Q875J0627J0931J0299R603R761
$$ 120206 122590 122215 120948 120439 120675 121538 124198 130003 138878 149505 160436 170735 180338 190099
54885A90099J0753J1600J2113J3553J6489J9242J9841J8557J7036J5783J3966
$$ 190099 200852 212452 224565 238118 254607 273849 293690 312247 329283 345066 359032
54874C59032J0857O190j63p409j3565j7222j8887j9524j8894j6652j3932j2167
$$ 359032 369889 376079 375916 368507 354942 337720 318833 299309 280415 263763 249831 237664
54862B37664j1162r947q645p958p540o572n297m562m295l804k983k140j189l7
$$ 237664 226502 216555 207910 199952 192412 185840 180543 175981 171686 167882 164899 162759 161570 161533
54848A61533J025K091L692N386N777M975N218P793J1099J3238J4568J5876J6226
$$ 161533 162558 164649 168341 173727 179504 184479 189697 197490 208589 221827 236395 252271 268497
54835B68497J4824J3142J2608J1839Q809M253J24l800q677j3206j4939j4321j4179
$$ 268497 283321 296463 309071 320910 329719 333972 334096 330296 321619 308413 293474 279153 264974
54822B64974j5460j6471j6168j5213j3812j1379q554o984o848o821o474o439o476
$$ 264974 249514 233043 216875 201662 187850 176471 167917 160933 154085 147264 140790 134351 127875
54809A27875n728m741m719m902l345l45J523J066l06j163j540j544r47n06j379
$$ 127875 122147 117406 112687 107785 104440 104095 105618 106684 106378 105215 103675 102131 101184 100678 99299
54794I9299k847k842j064N80Q90M89j91j563l111l329k039p06qP14J289M59j571
$$ 99299 96452 93610 92546 93126 94016 94505 94314 92751 89640 86311 84272 83566 83558 84272 85561 86020 84449
54777H4449k693j888n25M4J13Q0n04j534j991j900k621m175m335j690K071M247
$$ 84449 81756 79868 79343 79387 79500 79580 79076 77542 75551 73651 71030 66855 62520 60830 62901 67148
54761F7148M201L246K650K790L297L280K235J054J120K350L352L491L252K606
$$ 67148 71349 74595 77245 80035 83332 86612 88847 89901 91021 93371 96723 100214 103466 106072
54747A06072Q66j447k461j182J527M399O671P465O316M602M590O543Q478R041
$$ 106072 106938 105491 103030 101848 103375 107774 114445 121910 128226 132828 137418 143961 152439 161480
54733A61480Q907R040R553J0571J2322J3991J4507J4656J6192J8624J9447J8030
$$ 161480 170387 179427 188980 199551 211873 225864 240371 255027 271219 289843 309290 327320
54721C27320J6443J5513J3070P702J676k044l748n868r358j3033j5497j6189j5328
$$ 327320 343763 359276 372346 380048 381724 379680 375932 370064 360706 347673 332176 315987 300659
54708C00659j3915j3027j2384j0634p542m509k511j199n28j213k728k895p25K122
$$ 300659 286744 273717 261333 250699 243157 238648 236137 234938 234410 233197 230469 227574 226849 228971
54694B28971L826M634N400N928O212P480J0301J3114J4400J4956J6388J8577K0311
$$ 228971 232797 237431 242831 248759 254971 262451 272752 285866 300266 315222 331610 350187 370498
54681C70498K1301K1941K1948K0743J8493J5465J1190N375j143p384j3124j7933
$$ 370498 391799 413740 435688 456431 474924 490389 501579 506954 505811 498427 485303 467370
54669D67370k0610k0914k0549k1062k1706k0899j8761j6665j5050j3342j1546
$$ 467370 446760 425846 405297 384235 362529 341630 322869 306204 291154 277812 266266
54658B66266j0465j0406j0802j0916j0287q833p138o089n700n063l879l120l412
$$ 266266 255801 245395 234593 223677 213390 204557 197419 191330 185630 180567 176688 173568 170156
54645A70156l867l310j830l00P67J161O66l62r43o96k83p9N48J939L052K592N37
$$ 170156 166289 162979 161149 160849 161616 162777 163443 163081 162138 161442 161159 161080 161628 163567 166619 169211 169748
54628A69748j914l240k290O81L417L517J319n03m26M92J054J589K228J773j18
$$ 169748 167834 164594 162304 162985 166402 169919 171238 170735 170309 170801 171855 173444 175672 177445 177327
54613A77327j422k16K675N029O011O074N377M088L299L963N384O166O072N865
$$ 177327 175905 175689 178364 183393 189404 195478 200855 204943 208242 212205 217589 223755 229827 235692
54599B35692N902N936N695M929L549K228J881K217K110J726K426L981M192K429
$$ 235692 241594 247530 253225 258154 261703 263931 265812 268029 270139 271865 274291 278272 282464 284893
54585B84893J097J873K842J711j22N12L734O596P262O798P000Q487J0799J2846
$$ 284893 285990 287863 290705 292416 292294 292806 296540 303136 310398 317196 324196 332683 343482 356328
54571C56328J3565J3338J4039J6327J8011J6682J2912Q918N178O54m495q889j2212
$$ 356328 369893 383231 397270 413597 431608 448290 461202 470120 475298 475952 471457 462568 450356
54558D50356j5175j7298j7158j5095j3527j3930j5060j4804j2636r832q023p704
$$ 450356 435181 417883 400725 385630 372103 358173 343113 328309 315673 305841 297818 290114
54546B90114p594n849k540j44n97k887m663n141m978m365l184k169j938j656o13
$$ 290114 282520 276671 274131 273987 273390 270503 265840 260699 255721 251356 248172 246003 244065 242409 241796
54531B41796k43k221n272o615o163o319p637p877o074m473n022o482o679n633
$$ 241796 241553 239332 234060 227445 221282 214963 207326 199449 193375 188902 183880 177398 170719 165086
54517A65086m650l963k985j910j382j351j423j595j777j489r44j347k984m106
$$ 165086 160436 156473 153488 151578 150196 148845 147422 145827 144050 142561 141617 140270 137286 133180
54503A33180l118j042k04j034j841j507p73o43j078j683k455l104k739j117N93
$$ 133180 130062 129020 128816 127782 125941 124434 123661 123018 121940 120257 117802 114698 111959 110842 111435
54488A11435J184J013J163J527J068j11m66O94J993J978J332J839L715N308N263
$$ 111435 112619 113632 114795 116322 117390 117279 116813 117507 119500 121478 122810 124649 128364 133672 138935
54473A38935L885K346J576J913K864L236K436J703K944O165R113R861Q822P890
$$ 138935 142820 145166 146742 148655 151519 154755 157191 158894 161838 168003 177116 186977 195799 203689
54459B03689Q250R407R773Q062M584J137r28k146l727n619o958p849r078j0326
$$ 203689 211939 221346 231119 239181 243765 244902 243974 241828 238101 232482 225524 217675 208597 198271
54445A98271j0394r175p729o471n134m312m928n928n003k056L58O94J44j86j092
$$ 198271 187877 178702 170973 164502 159368 155056 150128 144200 139197 137141 137499 138193 138337 138151 137059
54430A37059k914l854k531k84R19J235J771K212J528k3j254j529p84P78K148K098
$$ 137059 134145 130291 127760 127476 128395 129630 131401 133613 135141 135118 133864 132335 131551 132329 134477 136575
54414A36575J177J333K655K739N29j662j597j39R99J956K980K629M41j004J94
$$ 136575 137752 139085 141740 144479 145008 143346 141749 141610 142609 144565 147545 150174 150615 149611 149805
54399A49805J660K43k784l724k103n10J01R02J642O98j332j830l00R84P47N8m13
$$ 149805 151465 151708 148924 145200 143097 142587 142688 143590 145232 145930 144598 142768 142468 143452 144199 144257 143844
54382A43844j391k784l341l044l174l586k748q66p2q11j008L72J685J587J045
$$ 143844 142453 139669 136328 133284 130110 126524 123776 122910 122838 122027 121019 121391 123076 124663 125708
54367A25708J082J025K87k47K4J75m34q41k51N12M62n8l37k83L16J963L952M354
$$ 125708 126790 127815 128102 127855 127879 128054 127620 126779 126528 127040 127502 127444 127107 126824 127140 129103 133055 137409
54349A37409K542L94n6J063K408L370L998M081L469K732K663L547N148O804P535
$$ 137409 139951 140345 140289 141352 143760 147130 151128 155209 158678 161410 164073 167620 172768 179572 187107
54334A87107O938O010O164P464Q741R135Q405O302L110M21m12j79n72j579k108
$$ 187107 194045 200055 206219 213683 222424 231559 239964 246266 249376 249797 249385 249206 248634 247055 244947
54319B44947k475l706m779l701j403j293m200o917o984n881n816o165n298l767
$$ 244947 242472 238766 233987 230286 228883 227590 223390 216473 209489 203608 197792 191627 186329 182562
54305A82562l167l429l385l025l123l455l078j999j198j353k305l260l071j229
$$ 182562 179395 175966 172581 169556 166433 162978 159900 157901 156703 155350 153045 149785 146714 145485
54291A45485J004J634N63j81O58K044K746L128L816M214L731L173L506M251M403
$$ 145485 146489 148123 148686 148505 149163 151207 153953 157081 160897 165111 168842 172015 175521 179772 184175
54276A84175M043L908M090M147L783K820J247j62m16J22K9r14j363j021j623m140
$$ 184175 188218 192126 196216 200363 204146 206966 208213 208051 207635 207757 207786 206872 205509 204488 202865 198725
54260A98725o679o817m790k937k836m272o131p187o798n756n605o483o755n430
$$ 198725 192046 185229 180439 177502 174666 170394 164263 157076 150278 144522 138917 132434 125679 120249
54246A20249l459j897m59R64J223j37j531j609j464k636m206m056k063m9Q88J053
$$ 120249 116790 114893 114434 115398 116621 116484 114953 113344 111880 109244 105038 100982 98919 98870 99758 100811
54230A00811P00k14j086j188r72j371k057j831n68N91Q39L51l42n14P35L227M833
$$ 100811 101511 101297 100211 99023 98051 96680 94623 92792 92224 92815 93654 94005 93663 93149 93884 97111 101944
54213A01944L514N9k510k324k48J760K478J621k85j801j526K70J767J752Q96N68
$$ 101944 105458 105517 103007 100683 100435 102195 104673 106294 106009 104208 102682 102952 104719 106471 107367 107935
54197A07935J071J599J422N59n29j467k069k121j475m77%m46r44l98P16O19j331
$$ 107935 109006 110605 112027 112586 112057 110590 108521 106400 104925 104448 104448 104002 103058 102660 103376 103995 102664
54180A02664l473l762k071K00K066L448M159L594J779o1n55K54Q12j41j835k213
$$ 102664 99191 95429 93358 93558 95624 99072 103231 106825 108604 108543 107988 108242 109054 108913 107078 104865
54164A04865o18J175J334M45L65J239J383j2j649j985r01P14J943K149J541J333
$$ 104865 104247 105422 106756 107201 107566 108805 110188 110176 108527 106542 105641 106355 108298 110447 111988 113321
54148A13321K113K251j58l847n127k668P92K283J954J388Q75L4o01n27m83j039
$$ 113321 115434 117685 117527 113680 108553 105885 106677 108960 110914 112302 113177 113211 112610 112083 111600 110561
54132A10561j263m11L72j57j016m16J352K397J949Q00m36j670k268j536j98J71
$$ 110561 109298 108887 109259 109102 108086 107670 109022 111419 113368 114168 113732 112062 109794 108258 108060 108231
54116A08231p82j949k517k657k463j518J27J502J670O94m79q18j05P93Q00j13
$$ 108231 107449 105500 102983 100326 97863 96345 96472 97974 99644 100338 99859 99041 98936 99729 100529 100416
54100A00416j062j493j455o64J300L583M381L288J861J185N07q46j954k077k169
$$ 100416 99354 97861 96406 95742 97042 100625 105006 108294 110155 111340 111847 111001 109047 106970 104801
54085A04801l053l640k819j677j858k775k584j097L06J029J468J520R14N99J695
$$ 104801 101748 98108 95289 93612 91754 88979 86395 85298 85604 86633 88101 89621 90535 91134 92829
54070I2829L306L341J501l82r64o15r7K74O6j020k233k539k277k549l087k588
$$ 92829 96135 99476 100977 100595 99631 99016 98919 99193 99259 98239 96006 93467 91190 88641 85554 82966
54054H2966j119l11o81p77K63J116M09r28r27N99J777J129p08j788q71J492L676
$$ 82966 81847 81536 80855 80078 80341 81457 81866 80938 80011 80610 82387 83516 82808 81020 80149 81641 85317
54037H5317M430L594J707m21j763j593l76N24M39m3l49p09j082n99Q80J880J263
$$ 85317 89747 93341 95048 94627 92864 91271 90895 91419 91858 91815 91466 90757 89675 89076 89956 91836 93099
54020I3099J16R8Q21N81p49j423l98J402K604K786K165J033j57r65j390j557j192
$$ 93099 93215 93313 94134 94715 93966 92543 92145 93547 96151 98937 101102 102135 101978 101013 99623 98066 96874
54003I6874j11J046J476J345J360J558J488J324J739K711L402L220K388J562J364
$$ 96874 96763 97809 99285 100630 101990 103548 105036 106360 108099 110810 114212 117432 119820 121382 122746
53988A22746J935K460J783J12o46R18L816N885O168N188L739K611K690M005N164
$$ 122746 124681 127141 128924 129036 128390 129308 133124 139009 145177 150365 154104 156715 159405 163410 168574
53973A68574N049M476M931O262P141P290P678Q694R550R525Q671P442O461O321
$$ 168574 173623 178099 183030 189292 196433 203723 211401 220095 229645 239170 247841 255283 261744 268065
53959B68065O780O698N604M480M078L605K419J713K754M487M950M215L762L589
$$ 268065 274845 281543 287147 291627 295705 299310 301729 303442 306196 310683 315633 319848 323610 327199
53945C27199K285k42k502l807m862n838n976n358n200n975o895p353p306o269
$$ 327199 329484 329242 326740 322933 318071 312233 306257 300899 295699 289724 282829 275476 268170 261901
53931B61901l843j259n10j728l146l797m298m790m266k584j224j250k057k792
$$ 261901 258058 256799 256289 254561 251415 247618 243320 238530 234264 231680 230456 229206 227149 224357
53917B24357l433l905l652k787k287k425k327j490m58M19J444K421K490J575O04
$$ 224357 220924 217019 213367 210580 208293 205868 203541 202051 201593 202012 203456 205877 208367 209942 210546
53902B10546Jn74q36Q4J772K581K104J799K355K491J391N37J512L367L886K659
$$ 210546 210547 209973 209137 209221 210993 213574 215678 217477 219832 222323 223714 224251 225763 229130 233016 235675
53886B35675J382J456K488L092K507J365R75J579J760M26j013M2L778P297Q009
$$ 235675 237057 238513 241001 244093 246600 247965 248940 250519 252279 252705 251692 251734 255512 262809 270818
53871B70818O380M673M159M403M399L617K347J422J207J133P30O37J490K518K708
$$ 270818 277198 281871 286030 290433 294832 298449 300796 302218 303425 304558 305288 305925 307415 309933 312641
53856C12641K805M202O203O634N298M532N760P681Q585Q518Q271Q008P832Q091
$$ 312641 315446 319648 325851 332485 337783 342315 348075 355756 364341 372859 381130 389138 396970 405061
53842D05061Q249P042M524K375J550J250Q48P89Q09m62k906m176l199k370m163
$$ 405061 413310 420352 424876 427251 428801 430051 430899 431688 432497 432035 429129 424953 421754 419384 415221
53827D15221p351q868q185p401p703q182p953p454p286p288p141o959o986p183
$$ 415221 407870 399002 390817 383416 375713 367531 359578 352124 344838 337550 330409 323450 316464 309281
53813C09281p210o728n966n885p049q391q267o754n501n067m200k451j605l196
$$ 309281 302071 295343 289377 283492 276443 268052 259785 253031 247530 242463 238263 235812 234207 231011
53799B31011o054p827p803o921n901m824l829k987j989q09j14j91m05m38j051
$$ 231011 224957 217130 209327 202406 196505 191681 187852 184865 182876 182067 181953 181762 181357 180919 179868
53784A79868k645m098m211l352k596k101j462q78q03j082j403j837k083j238P08
$$ 179868 177223 173125 168914 165562 162966 160865 159403 158525 157722 156640 155237 153400 151317 150079 150787
53769A50787K159J928R56O95P12l96k358l237k025J26J395J056k63j329j337n51
$$ 150787 152946 154874 155830 156525 157237 156841 154483 151246 149221 149347 150742 151798 151535 150206 148869 148318
53753A48318K81J180K845N085O439O000M574L388K748K620L277M422M841M085
$$ 148318 148599 149779 152624 157709 164148 170148 174722 178110 180858 183478 186755 191177 196018 200103
53739B00103L462M190N539N984N289M285L508L259M084N862P229P161O296N595
$$ 200103 203565 207755 213294 219278 224567 228852 232360 235619 239703 245565 252794 259955 266251 271846
53725B71846M673K976J464J416K150J907O15J6R97K343K354O42j861l849m560
$$ 271846 276519 279495 280959 282375 284525 286432 287047 287063 288060 290403 292757 293399 291538 287689 283129
53710B83129m368m268m504m331l572l247l912m554m281l915m493n205m515k646
$$ 283129 278761 274493 269989 265658 262086 258839 254927 250373 246092 242177 237684 232479 227964 225318
53696B25318j248r84j115j116j218j444j449j286j210r34j30P28J014J061J541
$$ 225318 224070 223086 221971 220855 219637 218193 216744 215458 214248 213314 213184 213912 214926 215987 217528
53681B17528K227K508K658L355M294M502L628K020Q8j401j302L49J638J075k58
$$ 217528 219755 222263 224921 228276 232570 237072 240700 242720 242808 241407 240105 240454 242092 243167 242909
53666B42909n51k76j195l025l583k182m80L23P89J148K15k362m541m081j328J386
$$ 242909 242358 242082 240887 237862 234279 232097 231617 231940 232729 233877 234092 231730 227189 223108 221780 223166
53650B23166K412J915R02J24j53P6Q01K000L369M327M615M511M142L116J478L67
$$ 223166 225578 227493 228395 228519 228366 228442 229243 231243 234612 238939 243554 248065 252207 255323 256801 257168
53634B57168P78K084K828K728K847L832N006N308M401K854J730J809K699L064
$$ 257168 257946 260030 262858 265586 268433 272265 277271 282579 286980 289834 291564 293373 296072 299136
53620B99136K287J434J854L365M521M209K332l57k327j989N13K906L230J940N79
$$ 299136 301423 302857 304711 308076 312597 316806 319138 318781 316454 314465 314978 317884 321114 323054 323633
53605C23633o33k384m210m734l730k429j886k212l139m097m189l374l092m264
$$ 323633 323000 320616 316406 311672 307942 305513 303627 301415 298276 294179 289990 286616 283524 279260
53591B79260n382m342j623L31N99M90P85O23m22j262j140q67j257j705j281j61
$$ 279260 273878 269536 267913 268244 268843 269333 270118 270741 270319 269057 267917 267050 265793 264088 262807 262646
53575B62646Q29J371J657J843K003K227K538K981L535L675K720J317J437L648
$$ 262646 263475 264846 266503 268346 270349 272576 275114 278095 281630 285305 288025 289342 290779 294427
53561B94427N500M528K098J810M436O903O747N098M335M815N208M747L854L370
$$ 294427 299927 304455 306553 308363 312799 319702 326449 331547 335882 340697 345905 350652 354506 357876
53547C57876L871N050N604M685L444L791N528O366N154L405K950L700M538N001
$$ 357876 361747 366797 372401 377086 380530 384321 389849 396215 401369 404774 407724 411424 415962 420963
53533D20963N056M533L730L632M582N597N746N329M984M559L711K786K341K346
$$ 420963 426019 430552 434282 437914 442496 448093 453839 459168 464152 468711 472422 475208 477549 479895
53519D79895K445K405J941R09KK68J512K104R14j302k886k852j247J040K521K241
$$ 479895 482340 484745 486686 487595 487597 487865 489377 491481 492395 491093 488207 485355 484108 485148 487669 489910
53503D89910J122J109K631M090M238L791L950M557M736M278L575K945K751L345
$$ 489910 491032 492141 494772 498862 503100 506891 510841 515398 520134 524412 527987 530932 533683 537028
53489E37028M254M413L824L881N274O723O914O591P329R033J0081R598Q266P052
$$ 537028 541282 545695 549519 553400 558674 565397 572311 578902 586231 595264 605345 614943 623209 630261
53475F30261O307O152O756P915Q949R224Q657P807P664Q898J1004J2558J2756
$$ 630261 636568 642720 649476 657391 666340 675564 684221 692028 699692 708590 719594 732152 744908
53462G44908J2371J2754J4207J5855J6814J7049J7041J7115J7263J7586J8649
$$ 744908 757279 770033 784240 800095 816909 833958 850999 868114 885377 902963 921612
53451I21612K0863K3441K4700K4018K2953K3450K5415K7153K7993K9006L0945
$$ 921612 942475 965916 990616 1014634 1037587 1061037 1086452 1113605 1141598 1170604 1201549
53440A201549L2878L3559L3162L2903L3585L5100L6864L8196L8604L7987L6506
$$ 1201549 1234427 1267986 1301148 1334051 1367636 1402736 1439600 1477796 1516400 1554387 1590893
53429A590893L4348L2041L0618L0739L1851L2885L3559L4051L3842L2165K9581
$$ 1590893 1625241 1657282 1687900 1718639 1750490 1783375 1816934 1850985 1884827 1916992 1946573
53418A946573K7761K7539K8306K9376L0559L1126K9847K6733K3519K1655K0852
$$ 1946573 1974334 2001873 2030179 2059555 2090114 2121240 2151087 2177820 2201339 2222994 2243846
53407B243846K0182J9496J8839J7464J4488J0242O139L313J576m37l954q461j1849
$$ 2243846 2264028 2283524 2302363 2319827 2334315 2344557 2350696 2354009 2355585 2355148 2351194 2342733 2330884
53394B330884j2841j2821j4138j7002j9559k0749k1422k2545k4057k5816k8012
$$ 2330884 2318043 2305222 2291084 2274082 2254523 2233774 2212352 2189807 2165750 2139934 2111922
53383B111922l0156l1312l1749l2678l3841l3379l0927k8850k9023l0122k9578
$$ 2111922 2081766 2050454 2018705 1986027 1952186 1918807 1887880 1859030 1830007 1799885 1770307
53372A770307k6897k3496k0501j8256j7030j6550j5561j3276j0702r261q695p559
$$ 1770307 1743410 1719914 1699413 1681157 1664127 1647577 1632016 1618740 1608038 1598777 1590082 1582523
53360A582523n257k369N40L172N028N885O564Q077J0133J1504J1820J2133J3654
$$ 1582523 1577266 1574897 1575437 1578609 1583637 1589522 1596086 1604163 1614296 1625800 1637620 1649753 1663407
53347A663407J6579K0291K4099K7549L0213L1592L1639L1341L2157L4327L6498
$$ 1663407 1679986 1700277 1724376 1751925 1782138 1813730 1845369 1876710 1908867 1943194 1979692
53336A979692L7787L9359M2639M6755M9549N0672N1736N3549N5471N7515O0522
$$ 1979692 2017479 2056838 2099477 2146232 2195781 2246453 2298189 2351738 2407209 2464724 2525246
53325B525246O3786O5136O4300O3698O4695O5658O5123O4306O4429O4064O1584
$$ 2525246 2589032 2654168 2718468 2782166 2846861 2912519 2977642 3041948 3106377 3170441 3232025
53314C232025N8283N6250N4792N1869M7845M4744M2492L8950L3526K7893K2911
$$ 3232025 3290308 3346558 3401350 3453219 3501064 3545808 3588300 3627250 3660776 3688669 3711580
53303C711580J7452J0788L999j825p150j2990j9508k6171l2333l7498m1769m5929
$$ 3711580 3729032 3739820 3743819 3741994 3734844 3721854 3702346 3676175 3643842 3606344 3564575 3518646
53291C518646n0242n3600n5024n5473n6835n9450o2025o3673o4439o4138o2355
$$ 3518646 3468404 3414804 3359780 3304307 3247472 3188022 3125997 3062324 2997885 2933747 2871392
53280B871392n9765n7838n7014n6424n5516n4524n3264n1000m7919m5270m3570
$$ 2871392 2811627 2753789 2696775 2640351 2584835 2530311 2477047 2426047 2378128 2332858 2289288
53269B289288m1917l9718l7778l6768l5626l2604k7596k2561j9594j8877j8673
$$ 2289288 2247371 2207653 2169875 2133107 2097481 2064877 2037281 2014720 1995126 1976249 1957576
53258A957576j7328j5131j3718j3609j3243j1161q288o855p513q752r129q804
$$ 1957576 1940248 1925117 1911399 1897790 1884547 1873386 1865098 1858243 1850730 1841978 1832849 1824045
53246A824045q561q355p366n083j957P78J990J702J219J901L996O838R806J2602
$$ 1824045 1815484 1807129 1799763 1794680 1792723 1793501 1795491 1797193 1798412 1800313 1804309 1811147 1820953 1833555
53232A833555J4987J6825J8161J9067J9727K0786K2891K5573K7531K8400K9273
$$ 1833555 1848542 1865367 1883528 1902595 1922322 1943108 1965999 1991572 2019103 2047503 2076776
53221B076776L0848L2224L2351L1574L0703K9624K8059K6704K6066K4965K1804
$$ 2076776 2107624 2139848 2172199 2203773 2234476 2264100 2292159 2318863 2344929 2369894 2391698
53210B391698J6912J2205Q798O264L913J415j523m904p963j0124j2002j4389j6782
$$ 2391698 2408610 2420815 2429613 2435877 2439790 2441205 2439682 2434778 2426815 2416691 2404689 2390300 2373518
53197B373518j8310j9612k2104k5655k8597l0022l0513l0609l0270l0136l1518
$$ 2373518 2355208 2335596 2313492 2287837 2259240 2229218 2198705 2168096 2137826 2107690 2076172
53186B076172l4462l7017l7353l5777l4018l3141l2681l1464k8974k6064k4197
$$ 2076172 2041710 2004693 1967340 1931563 1897545 1864404 1831723 1800259 1771285 1745221 1721024
53175A721024k3784k3735k3112k2412k2381k2287k0576j7014j3084j0413r622
$$ 1721024 1697240 1673505 1650393 1627981 1605600 1583313 1562737 1545723 1532639 1522226 1512604
53164A512604j0225j0908j0406r065q721j0051j1025r509o380m244l761l488k885
$$ 1512604 1502379 1491471 1481065 1472000 1463279 1453228 1442203 1432694 1426314 1422070 1418309 1414821 1411936
53151A411936l024m206n340o161p886j0805j3246j3880j3496j3416j3641j3670
$$ 1411936 1408912 1404706 1399366 1393205 1385319 1374514 1361268 1347388 1333892 1320476 1306835 1293165
53139A293165j3810j4360j4546j3639j2486j2659j4404j6421j7569j7992j8567
$$ 1293165 1279355 1264995 1250449 1236810 1224324 1211665 1197261 1180840 1163271 1145279 1126712
53128A126712j9822k1531k3051k3783k3336k1583j9069j7266j7540j9562k1472
$$ 1126712 1106890 1085359 1062308 1038525 1015189 993606 974537 957271 939731 920169 898697
53117H98697k2019k1631k1013k0043j8925j8820j9933k0388j8917j7342j7929
$$ 898697 876678 855047 834034 813991 795066 776246 756313 735925 717008 699666 681737
53106F81737j9278j7762j3108r465j0107j3488j5709j5112j3116j1770j1721j1972
$$ 681737 662459 644697 631589 622124 612017 598529 582820 567708 554592 542822 531101 519129
53094E19129j1090r092p920r050j1078j1219r024o762o128o515o829o968o964
$$ 519129 508039 498947 491027 481977 470899 459680 450656 443894 437766 431251 424422 417454 410490
53081D10490o519o031o343o886o131m479m409o550q015o347l163j673k125k187
$$ 410490 403971 397940 391597 384711 378580 374101 369692 363142 355127 348780 345617 343944 341819 339632
53067C39632j027m37j818m054n090m352l000k264k166j850j021n91j410k752l013
$$ 339632 338605 338168 336350 332296 327206 322854 319854 317590 315424 313574 312553 311962 310552 307800 304787
53052C04787j872o54n10j333k555l678l772j973R30K770K562J490Q09K17p33j136
$$ 304787 302915 302261 301751 300418 297863 294185 290413 288440 289370 292140 294702 296192 297001 297218 296485 295349
53036B95349j8J975L465M168M561M537L665K346J526J502J871K326K700K504J259
$$ 295349 295331 297306 300771 304939 309500 314037 317702 320048 321574 323076 324947 327273 329973 332477 333736
53021C33736p23k466l272l361l650m809o342o928o208n565o206p151o635n074
$$ 333736 333013 330547 327275 323914 320264 315455 309113 302185 295977 290412 284206 277055 270420 265346
53007B65346m634n760o348m980k951k098k389k822l164l497l416k914k907l760
$$ 265346 260712 254952 248604 243624 240673 238575 236186 233364 230200 226703 223287 220373 217466 213706
52993B13706m446m242l881l957l594k165q58r03j394p87L36j7k149m092m109k422
$$ 213706 209260 205018 201137 197180 193586 191421 190563 189660 188266 187479 187815 187798 185649 181557 177448 175026
52977A75026n71pj095k680k946j458L17J098J342J799J802M96j226j795j335j227
$$ 175026 174455 174448 173353 170673 167727 166269 166586 167684 169026 170825 172627 173123 171897 170102 168767 167540
52961A67540j696j590m86O00Q31N54L57J87j89n61m83J85R27Q56k10r88j24J581
$$ 167540 165844 164254 163768 164368 165199 165753 166110 166297 166108 165547 165064 165249 166176 167032 166822 165834 165710 167291
52943A67291J815K72m00J532L849L371O28r30O0J432J119j13l77P06K092K858
$$ 167291 169106 169378 168978 170510 174359 177730 178358 177428 177488 178920 180039 179926 179549 180255 182347 185205
52927A85205K690J587j69j993l259l517k639j117J99J012J718K227J576m80k413
$$ 185205 187895 189482 189313 187320 184061 180544 177905 176788 176987 177999 179717 181944 183520 183040 180627
52912A80627k671j639o13L53J881L198K706N94r12k41J979M209N441N156L382
$$ 180627 177956 176317 175704 176057 177938 181136 183842 184436 183524 183283 185262 189471 194912 200068 203450
52897B03450J258L47R81K158L307M828O625P498O760N484N321O611Q243Q913Q321
$$ 203450 204708 205055 206036 208194 211501 216329 222954 230452 237212 242696 248017 254628 262871 271784 280105
52882B80105P402P359Q043P735N357K298P22M24p71l420n206m142j353N22M39
$$ 280105 287507 294866 302909 310644 316001 318299 319021 319445 318674 315254 310048 305906 304553 305075 305514
52867C05514q18k460m256n716o178n741n166m749m068k837j422m00j06n85j583
$$ 305514 304696 302236 297980 292264 286086 280345 275179 270430 266362 263525 262103 261703 261597 261012 259429
52852B59429k425k471j837j358j574k024j898j259j087j939l037l228k450j576
$$ 259429 257004 254533 252696 251338 249764 247740 245842 244583 243496 241557 238520 235292 232842 231266
52838B31266r90k62O06P33j71q91j59J544K604K363J518P76J38m53q16j075j705
$$ 231266 230276 230014 230620 231353 231182 230291 230132 231676 234280 236643 238161 238937 239075 238622 237806 236731 235026
52821B35026k664l157k593j393n76q14j898k703j912O60L394M226K880J168P60
$$ 235026 232362 229205 226612 225219 224643 223829 221931 219228 217316 217976 221370 225596 228476 229644 230404
52806B30404J335J354J87j325k190k256j708m21J412K517J665l07q37J195L668
$$ 230404 231739 233093 233280 231955 229765 227509 225801 225380 226792 229309 230974 230667 229830 231025 234693
52791B34693L765J559m78r92q64p82K5J739K654J494k90k09K028M537N984O677
$$ 234693 238458 240017 239539 238547 237683 236901 236926 238665 241319 242813 242523 242314 244342 248879 254863 261540
52775B61540P181P266O575N303L934K800J935J111J79l76J98J698K878L054L000
$$ 261540 268721 275987 282562 287865 291799 294599 296534 297645 297824 297448 297646 299344 302222 305276 308276
52760C08276L532M177M065L293K337J036p46k228k787l168m247n326n137l982
$$ 308276 311808 315985 320050 323343 325680 326716 325970 323742 320955 317787 313540 308214 303077 299095
52746B99095l322l569l937m176m755n516n725n539n795o275n906m826m524n360
$$ 299095 295773 292204 288267 284091 279336 273820 268095 262556 256761 250486 244580 239754 235230 229870
52732B29870n679m228k078j101j556k121j762p00M6m45k183m077m846m216k820
$$ 229870 224191 219963 217885 216784 215228 213107 211345 210645 210691 210246 208063 203986 199140 194924 192104
52717A92104j208K95J004L08j141j739r01J98J36j167k695l435k927j413J41P63
$$ 192104 190896 191191 192195 192503 191362 189623 188722 188920 189056 187889 185194 181759 178832 177419 177560 178323
52701A78323M45M9R9L39M38M11P9j127l278n284n650l932j381J8o78k435l520
$$ 178323 178768 178817 178916 179255 179693 180104 180183 179056 175778 170494 164844 160912 159531 159549 158871 156436 152916
52684A52916l594l739m217l614j114J568K031K71j613k309k262k059j560q64o18
$$ 152916 149322 145583 141366 137752 136638 138206 140237 140508 138895 136586 134324 132265 130705 129841 129223
52669A29223r73j338j456j658j872j392L2J709K739K638J311p03k174k258j464
$$ 129223 128250 126912 125456 123798 121926 120534 120566 122275 125014 127652 128963 128260 126086 123828 122364
52654A22364p22j9R29J380M12j265k044j736j422j238l11J076J441P11P63K523
$$ 122364 121642 121623 122552 123932 124344 123079 121035 119299 117877 116639 116328 117404 118845 119556 120319 122842
52638A22842M391M524L184J634R6j860l814m564l424q71J704K921K749K765M052
$$ 122842 127233 131757 134941 136575 136671 134811 130997 126433 123009 122138 123842 126763 129512 132277 136329
52623A36329N343M747K841K042K926L644L367L591N015N862M984M244N454O948
$$ 136329 141672 146419 149260 151302 154228 157872 161239 164830 169845 175707 180691 184935 190389 197337
52609A97337N904K801P32P61P27j108l626m857m682m392m621m884m821m870n456
$$ 197337 203241 206042 206774 207535 208262 207154 203528 198671 193989 189597 184976 180092 175271 170401 164945
52594A64945o064n787m694l814l475k710j150l29j531l177k556Q4J578L06j748
$$ 164945 158881 153094 148400 144586 141111 138401 137251 136922 135391 132214 129658 129742 131320 131626 129878
52579A29878k275j647j346j488j572k022l157l820k867j094j25j27j28K05N24
$$ 129878 127603 125956 124610 123122 121550 119528 116371 112551 109684 108590 108465 108338 108210 108415 108939
52564A08939R17J562J875J237J14p04j351k163k436j287O70J869J756J035L44
$$ 108939 109856 111418 113293 114530 114644 113940 112589 110426 107990 106703 107373 109242 110998 112033 112377
52549A12377k07m77l12j20m76j359k276k793k538j313K21Q27K57l03j2M54L25
$$ 112377 112170 111693 111381 111261 110785 109426 107150 104357 101819 100506 100727 101554 101811 101508 101496 101950 102275
52532A02275J52O71J371J427J117J125J331J468J929K620K242L16j269n71J429
$$ 102275 102427 103098 104469 105896 107013 108138 109469 110937 112866 115486 117728 118044 116775 116204 117633
52517A17633K252J576J233J910K227J211l65j398j661j234k70M13n0j239j801
$$ 117633 119885 121461 122694 124604 126831 128042 127677 126279 124618 123384 123114 123527 123477 122238 120437
52502A20437j338p25n93p09q22q31k06J417L091L443K644K113K300K228J461R07
$$ 120437 119099 118374 117781 117072 116250 115419 115213 116630 119721 123164 125808 127921 130221 132449 133910 134817
52486A34817J305K217K935L220K790J352n39j740j992k048k157j607j56J260J690
$$ 134817 136122 138339 141274 144494 147284 148636 148097 146357 144365 142317 140160 138553 138397 139657 141347
52471A41347J222M57j66l19J20P14J020J334K049K486J671Q5p92n93k22J36J339
$$ 141347 142569 143026 142860 142541 142661 143375 144395 145729 147778 150264 151935 152020 151228 150635 150413 150549 151888
52454A51888L240M207L426K167J814J993J637P02j38n65n34PN35R8j319k485k674
$$ 151888 155128 159335 162761 164928 166742 168735 170372 171074 170936 170371 169837 169844 170379 170477 169158 166673 163999
52437A63999k549k610k088n38P03J40j577k462j838p42j3O08J427K060K128J813
$$ 163999 161450 158840 156752 156214 156917 157057 155480 153018 151180 150438 150425 151033 152460 154520 156648 158461
52421A58461J396P64k49j358j871j306L9J208J462J016O05M26J13k64qJ177K577
$$ 158461 159857 160621 160372 159014 157143 155837 155876 157084 158546 159562 160167 160593 160706 160442 160434 161611 164188
52404A64188L339L353L066K834K669K200Q84j118k429j805KQ54L0q93m31Q74J649
$$ 164188 167527 170880 173946 176780 179449 181649 182533 181415 178986 177181 177183 178037 178067 177174 176743 177617 179266
52387A79266J606J214N83j43j91P87J733J542P60O62J276J623J434J156P50K6
$$ 179266 180872 182086 182669 182526 182335 183122 184855 186397 187157 187819 189095 190718 192152 193308 194058 194084
52371A94084j59J104K679K297j10j978j692o06l92k73J275L383L664J761j21m20
$$ 194084 193925 195029 197708 200005 199895 197917 196225 195619 195227 194954 196229 199612 203276 205037 204916 204496
52355B04496n3n28j667k241j812q63L23J808L264M006L833L200K529J881J433
$$ 204496 204443 203915 202248 200007 198195 197332 197655 199463 202727 206733 210566 213766 216295 218176 219609
52340B19609J644K626L766M304M111L600L060K495K042K120K844L443K722M09
$$ 219609 221253 223879 227645 231949 236060 239660 242720 245215 247257 249377 252221 255664 258386 258795
52326B58795k057k610o98J960L026J843l28k078l183m060m569m038k397o83j44
$$ 258795 256738 254128 253430 255390 258416 260259 259931 257853 254670 250610 246041 242003 239606 238923 238779
52311B38779r31j918j923r01L18J229J925K181J278o35j848q81J430K890K815
$$ 238779 237848 235930 234007 233106 233424 234653 236578 238759 240037 239402 237554 236673 238103 240993 243808
52296B43808K643L545M826N220M598L648K731J881J305J130J190J404J776J749
$$ 243808 246451 249996 254822 260042 264640 268288 271019 272900 274205 275335 276525 277929 279705 281454
52282B81454O14q97o82K166N871Q073Q504Q315P778O307M290L111L343M200M778
$$ 281454 282068 281171 280489 282655 288526 296599 305103 313418 321196 327503 331793 334904 338247 342447 347225
52267C47225M762M051K946K577L847N867O786O283N885O579P592Q122Q814J0429
$$ 347225 351987 356038 358984 361561 365408 371275 378061 384344 390229 396808 404400 412522 421336 431765
52253D31765J2061J2013J0153Q300Q205R807J1781J3250J4438J5711J6673J6802
$$ 431765 443826 455839 465992 474292 482497 492304 504085 517335 531773 547484 564157 580959
52241E80959J6565J6966J8008J8783J9325K0863K3506K5223K4474K2676K2320
$$ 580959 597524 614490 632498 651281 670606 691469 714975 740198 764672 787348 809668
52230H09668K3541K4552K4811K5503K6984K8032K8054K7964K8198K7687K5789
$$ 809668 833209 857761 882572 908075 935059 963091 991145 1019109 1047307 1074994 1100783
52219A100783K3689K2693K2312K1225J9296J7566J6733J6402J5594J3612J0806
$$ 1100783 1124472 1147165 1169477 1190702 1209998 1227564 1244297 1260699 1276293 1289905 1300711
52208A300711Q486P471O811M905J818o99j636j794k175k688l088l758m735m974
$$ 1300711 1309197 1316668 1323479 1328384 1330202 1329503 1327867 1326073 1323898 1321210 1318122 1314364 1309629 1304655
52194A304655l545r38J463K662K594K244L214O117R300J0521R994J0140J2090
$$ 1304655 1301110 1300172 1301635 1304297 1306891 1309135 1312349 1318466 1327766 1338287 1348281 1358421 1370511
52181A370511J4375J5659J6659J8262J9813K0662K1540K2776K2835K0641J7814
$$ 1370511 1384886 1400545 1417204 1435466 1455279 1475941 1497481 1520257 1543092 1563733 1581547
52170A581547J6615J6722J6120J4121J1498Q557N325K838J866Q50k482p634j1835
$$ 1581547 1598162 1614884 1631004 1645125 1656623 1665180 1670505 1673343 1675209 1676059 1673577 1665943 1654108
52157A654108j3919j5398j7458j9322k0240k0946k2200k3538k4401k5139k6003
$$ 1654108 1640189 1624791 1607333 1588011 1567771 1546825 1524625 1501087 1476686 1451547 1425544
52146A425544k6379k5780k4677k3808k3539k4055k5160k5802k5075k3693k2972
$$ 1425544 1399165 1373385 1348708 1324900 1301361 1277306 1252146 1226344 1201269 1177576 1154604
52135A154604k2324j9832j5609j2333j1551j1697j1082j0591j1462j2289j0894
$$ 1154604 1132280 1112448 1096839 1084506 1072955 1061258 1050176 1039585 1028123 1015834 1004940
52124A004940p988o298o505o628n501m370m468n066m999m555m638n172n468n506
$$ 1004940 996952 990654 984149 977521 972020 967650 963182 958116 953117 948562 943924 938752 933284 927778
52110I27778n746o018n565m204k810k412l095l922m045l777m162n269n576l877
$$ 927778 922032 916014 910449 906245 903435 901023 897928 894006 889961 886184 882022 876753 871177 867300
52096H67300j365n52k066l761l579k035j029j225j889k607l607m497m214k609
$$ 867300 865935 865383 863317 859556 855977 853942 852913 851688 849799 847192 843585 839088 834874 832265
52082H32265q98M2P48J799K341J200r73k040r74Q96J717J335J060J810L355N174
$$ 832265 831367 831409 832157 833956 836297 837497 836524 834484 833510 834406 836123 837458 838518 840328 843683 848857
52066H48857P042Q485Q491O525L566J365P24J090J859L201N232P274Q698R851
$$ 848857 855899 864384 872875 879400 882966 884331 885055 886145 888004 891205 896437 903711 912409 922260
52052I22260J1229J2152J1486R628Q512R283J1142J2962J4830J7166J9357K0532
$$ 922260 933489 945641 957127 966755 975267 984550 995692 1008654 1023484 1040650 1060007 1080539
52040A080539K1082K2078K3465K4078K3534K2991K3698K5684K8078L0027L1008
$$ 1080539 1101621 1123699 1147164 1171242 1194776 1217767 1241465 1267149 1295227 1325254 1356262
52029A356262L0954L0399K9973K9596K8627K7011K5534K4551K3132K0074J5563
$$ 1356262 1387216 1417615 1447588 1477184 1505811 1532822 1558356 1582907 1606039 1626113 1641676
52018A641676J1233Q591P650P075N595L160N81j900n067r374j3675j6219j6845
$$ 1641676 1652909 1661500 1669150 1676225 1681820 1684980 1685561 1683661 1678594 1669220 1655545 1639326 1622481
52005A622481j7089j7882j8156j6522j3641j1894j2630j4535j5205j4036j2847
$$ 1622481 1605392 1587510 1569354 1552832 1539191 1527297 1514667 1500132 1484927 1470891 1458044
51994A458044j3396j4841j4525j1190o337k135Q78L124M316M017L305M026O326
$$ 1458044 1444648 1429807 1415282 1404092 1397755 1395620 1396498 1399622 1403938 1407955 1411260 1415286 1421612
51981A421612Q491R540J0424J2049J3605J3882J3240J3050J3776J4557J4376J2988
$$ 1421612 1430103 1439643 1450067 1462116 1475721 1489603 1502843 1515893 1529669 1544226 1558602 1571590
51969A571590J0933R145Q114P089M627M92l552n468n120m238m593o733j0003j3238
$$ 1571590 1582523 1591668 1599782 1606871 1611498 1611990 1608438 1602970 1597850 1593612 1589019 1582286 1572283 1559045
51955A559045j5610j7290j9179k1801k4736k7318k9311l0621l0935l0171k8939
$$ 1559045 1543435 1526145 1506966 1485165 1460429 1433111 1403800 1373179 1342244 1312073 1283134
51944A283134k8117k8173k9021l0145l0748l0394k9640k9392k9486k8749k6801
$$ 1283134 1255017 1226844 1197823 1167678 1136930 1106536 1076896 1047504 1018018 989269 962468
51933I62468k4837k4050k4194k4256k3875k3200k2060k0220j8093j6512j5956
$$ 962468 937631 913581 889387 865131 841256 818056 795996 775776 757683 741171 725215
51922G25215j6384j7271j7631j6713j5093j4078j3700j2533j0241q785r712j1636
$$ 725215 708831 691560 673929 657216 642123 628045 614345 601812 591571 582786 573074 561438
51910E61438j2123j1133j0428j0079q153m154n45K69j155k554k915k930l274l781
$$ 561438 549315 538182 527754 517675 509522 505368 504823 505092 503937 501383 498468 495538 492264 488483
51896D88483m217m652m937m530l391k554l243n331p247p660o881o106n748n328
$$ 488483 484266 479614 474677 470147 466756 464202 460959 455628 448381 440721 433840 427734 421986 416658
51882D16658m847n026n923o485o070n381n052m389k597m64N14K18j72o7rl86q40
$$ 416658 411811 406785 400862 394377 388307 382926 377874 373485 370888 370424 370938 371156 370984 370917 370908 370522 369682
51865C69682j153j646k476l234l482l223k693k175j891j664j005p4K6j288k811
$$ 369682 368529 366883 364407 361173 357691 354468 351775 349600 347709 346045 345040 344966 344992 343704 340893
51850C40893k883j659q71j459k656l523m072m489m379l463k268j552j479j695
$$ 340893 338010 336351 335480 334021 331365 327842 323770 319281 314902 311439 309171 307619 306140 304445
51836C04445j798j550r81m29j03J95N42M55k82p72l4J299J504J12j416j642p11
$$ 304445 302647 301097 300116 299687 299584 299779 300321 300776 300494 299722 299688 300987 302491 302603 301187 299545 298834
51819B98834M12J203J585J480J095J022J533K224K662K790K489J486M6q70o72
$$ 298834 299246 300449 302034 303514 304609 305631 307164 309388 312050 314840 317329 318815 318861 317991 317319
51804C17319K48J188J792J713O16r82j651o71J011K175K935M019N095N165M393
$$ 317319 317567 318755 320547 322260 322876 321894 320243 319572 320583 322758 325693 329712 334807 339972 344365
51789C44365M118M796N299M812M235M560M799L184K87q71J284M301M463J423j633
$$ 344365 348483 353279 358578 363390 367625 372185 376984 380168 380455 379584 380868 385169 389632 391055 389422
51774C89422k270j391j079j691k293k594k780k276m79J512J669k74k358k941k405
$$ 389422 387152 385761 384682 382991 380698 378104 375324 373048 372569 374081 375750 375476 373118 370177 367772
51759C67772j790j123K6J240J695J455J340J636J728J176N22O93J814L037L494
$$ 367772 365982 364859 364885 366125 367820 369275 370615 372251 373979 375155 375677 376370 378184 381221 384715
51744C84715L114K289J186r9r11n22O10R88j3j268j540j138j065j410j601j556
$$ 384715 387829 390118 391304 391205 390294 389772 390382 391370 391357 390089 388549 387411 386346 384936 383335 381779
51728C81779j325k95J724L067J737j518l421j989J223L224K795R46o50q68L99
$$ 381779 380454 380159 381883 384950 386687 385169 381748 379759 380982 384206 387001 387947 387297 386429 386828
51713C86828K100K839K334J699J990K973L639L353K266J034L54K76J15m50m86
$$ 386828 388928 391767 394101 395800 397790 400763 404402 407755 410021 411055 411409 411685 411800 411350 410864
51698D10864R83L159M174L634L054L365L547K473Q52K69J127K498L459L825M029
$$ 410864 411847 415006 419180 422814 425868 429233 432780 435253 436105 436374 437501 439999 443458 447283 451312
51683D51312M709N953O785O234M959M616N361N486M201L157L935N602O246N891
$$ 451312 456021 461974 468759 474993 479952 484568 489929 495415 499616 502773 506708 512310 518556 524447
51669E24447N929O462O178M753L411K803K038M54j035j374j224k249m765p047
$$ 524447 530376 536838 543016 547769 551180 553983 556021 556475 555440 554066 552842 550593 545828 538781
51655E38781p311n859m668m930n743n705n079n253o379o976o177m982m599m760
$$ 538781 531470 525611 520943 516013 510270 504565 499486 494233 487854 480878 474701 469719 465120 460360
51641D60360m610m090l505k712j907k117l533m277k632J98J479P62J96R21J471
$$ 460360 455750 451660 448155 445443 443536 441419 437886 433609 430977 431175 432654 433416 433612 434533 436004
51626D36004M73j058j465r26o60n71N57K896N051N724M945L499K095J231J098
$$ 436004 436477 435419 433954 433028 432368 431797 432354 435250 440301 446025 450970 454469 456564 457795 458893
51611D58893J247R08Nn47R8J676L212M199M965N743N976M904K682N63k44L34J355
$$ 458893 460140 461048 461053 460506 460604 462280 465492 469691 474656 480399 486375 491279 493961 494524 494280 494614 495969
51594D95969J859J478K07j812m038n469n484m760m709n828p002o980o016n494
$$ 495969 497828 499306 499513 497701 493663 488194 482710 477950 473241 467413 460411 453431 447415 441921
51580D41921o190p613q940r628r125p051m165k166j915k513k864l115l688l869
$$ 441921 435731 428118 419178 409550 400425 393374 389209 387043 385128 382615 379751 376636 372948 369079
51566C69079k872j669j993l632m484l602k513k875m231n060m822l933k658j119
$$ 369079 366207 364538 362545 358913 354429 350827 348314 345439 341208 336148 331326 327393 324735 323616
51552C23616J17N80O80J060J490J328P61O86J351J961J766R28M7o73j399k137
$$ 323616 323733 324313 324993 326053 327543 328871 329632 330318 331669 333630 335396 336324 336371 335698 334299 332162
51536C32162k447j793q0K153M105N211N287M519L568L412M527O304P681Q333Q662
$$ 332162 329715 327922 327842 329995 334100 339311 344598 349117 352685 356097 360624 366928 374609 382942 391604
51521C91604Q816Q507P851P596Q121Q866R198R213R245R089Q249O699M777K553
$$ 391604 400420 408927 416778 424374 432495 441361 450559 459772 469017 478106 486355 493054 497831 500384
51507E00384k07l283n576n852m200k517k877n205p167o875m945l226k267j321
$$ 500384 500177 496894 491318 485466 481266 478749 475872 470667 463500 456625 451680 448454 446187 444866
51493D44866k44K47J54N23J794L140L817M079M375M838N882Q030J0636J1954J1192
$$ 444866 444622 444869 445023 445546 447340 450480 454297 458376 462751 467589 473471 481501 492137 504091 515283
51478E15283R360P624N986M310L275L296L466K649Q96j001k517l265k883j844
$$ 515283 524643 532267 538253 542563 545838 549134 552600 555249 556145 555144 552627 549362 546479 544635
51464E44635j483k264l008k635j543l73J245L379M503L363J266P25K145L589L614
$$ 544635 543152 540888 537880 535245 533702 533329 534574 537953 542456 545819 547085 547810 549955 553544 557158
51449E57158K815K414K756L367L523K578N60j644l287m699o455q121q698q010
$$ 557158 559973 562387 565143 568510 572033 574611 575171 573527 570240 565541 559086 550965 542267 534257
51435E34257o704n338m325m211m886n100l978k581k585l728m100k871j225m31
$$ 534257 527553 522215 517890 513679 508793 503693 499715 497134 494549 490821 486721 483850 482625 482194
51421D82194l76l33K6O71J352J360J61j465j837l08J992L663M591N604P142Q652
$$ 482194 481818 481485 481511 482182 483534 484894 485055 483590 481753 481445 483437 487100 491691 497295 504437 513089
51405E13089R088P991O225N374O091P352P901P841Q093Q751Q993Q414P510O808
$$ 513089 522177 530168 536393 541767 547858 555210 563111 570952 579045 587796 596789 605203 612713 619521
51391F19521O234N357L875J986M77j25p82l220p196r718q350m413j418j009j980
$$ 619521 625755 631112 634987 636973 637450 637325 636543 633323 626127 616409 608059 603646 602228 601219 599239
51376E99239k668k437j074J240L215L359J958P28M00Nj199k551l047k471j285
$$ 599239 596571 594134 593060 594300 597515 600874 602832 603560 603960 603965 602766 600215 597168 594697 593412
51361E93412n05j544m836q641j0587j0359r400q332o661m967m993o909q722r141
$$ 593412 592907 591363 586527 577886 567299 556940 547540 539208 532547 527580 522587 515678 506956 497815
51347D97815r072r267q780p031n492n526o194n936n039m500l690j446J256K133
$$ 497815 488743 479476 470696 463665 458173 452647 446453 440517 435478 430978 427288 425842 427098 429231
51333D29231R53M2J052L001M076L945L541L559M107N217O744P828P238M611J050
$$ 429231 430184 430226 431278 434279 438355 442300 445841 449400 453507 458724 465468 473296 480534 485145 486195
51318D86195j985m186o262q315r271q600p599p869r060r608r346r681j1053j1978
$$ 486195 484210 480024 473762 465447 456176 447576 439977 432108 423048 413440 404094 394413 383360 371382
51304C71382j1298r826q946q793q764q689q513p770o388n201m735m253k957j427
$$ 371382 360084 350258 341312 332519 323755 315066 306553 298783 292395 287194 282459 278206 275249 273822
51290B73822q32j356k253k913l051k457j487j167k001l171l619l257k370q83P77
$$ 273822 272990 271634 269381 266468 263417 260960 259473 258306 256305 253134 249515 246258 243888 243005 243782
51275B43782J156m29k297k290p48J18n15j243r62l02lN52K135M143N251M989L907
$$ 243782 244938 244509 242212 239922 239174 239292 238777 237534 236572 236270 236267 236819 238954 243097 248348 253337 257244
51258B57244K776K171K376L051L336K939K667L338M564N364N765O846Q945J0628
$$ 257244 260020 262191 264567 267618 270954 273893 276560 279898 284462 289826 295591 302437 311382 322010
51244C22010J0158P644N017L888M131M698M989M874M031K260K16j198k205l993
$$ 322010 332168 339812 344829 348717 352848 357546 362535 367409 371440 373700 373916 372718 370513 366520
51230C66520o883r565j0577r914q642p644p221p290p361o802n747n255n921o890
$$ 366520 359637 350072 339495 329581 320939 313295 306074 298784 291423 284621 278874 273619 267698 260808
51216B60808o943o020m837l563k053r79j396k919l669k538n86L96p7j173k121
$$ 260808 253865 247845 243008 239445 237392 236413 235017 232098 228429 225891 225305 225701 225624 224451 222330
51201B22330k697k757k214j477j180j412j631j513j273j054m97O89K097K929K783
$$ 222330 219633 216876 214662 213185 212005 210593 208962 207449 206176 205122 204625 205314 207411 210340 213123
51186B13123J949J048O00O94Q73O00K5j91J0j57q68q42R21L059L065N55k112k727
$$ 213123 215072 216120 216720 217414 218287 218887 218912 218721 218731 218574 217706 216864 217785 220844 223909 224464 222352 219625
51168B19625j421K88J129K52k531n619o249l575pJ717J647J455J540J182O14P01
$$ 219625 218204 218492 219621 219873 217342 211723 205474 201899 201892 203609 205256 206711 208251 209433 210047 210748
51152B10748J079O53k92m01M15R14P97J142K314L210K963J905N68o85j044K9J308
$$ 210748 211827 212480 212188 211787 212202 213116 213913 215055 217369 220579 223542 225447 226015 225330 224286 224315 225623
51135B25623Q12j338k885k623j660j067m18N36P99j14j025q33J2P42J315J396
$$ 225623 226435 225097 222212 219589 217929 216862 216444 216980 217779 217665 216640 215807 215819 216561 217876 219272
51119B19272J01k172l459k941k188k357k246p22Q50Q17J58Q30K446L033K195J125
$$ 219272 219373 217201 213742 210801 208613 206256 204010 203288 204138 204955 205113 205943 208389 211422 213617 214742
51103B14742J98j061k044j588k41K55k16l6J246J989J016p15j722j827j723j824
$$ 214742 214940 213879 211835 210247 210006 210261 210045 210009 211255 213244 214260 213545 211823 209996 208273 206449
51087B06449k197k669k563j246P45J906J420q3j510k323k452k038j451r74l80
$$ 206449 204252 201583 199020 197774 198519 200425 201845 201762 200252 197929 195477 193439 191988 191014 190634
51072A90634N66J319J033o2o59J10J685K914L365L515L860M100L421J691P6j23
$$ 190634 191200 192519 193552 193490 192831 192941 194626 197540 200905 204420 208280 212380 215801 217492 217568 217445
51056B17445J012K431L709M964N312L346k54k489j703J96N43n87j414j506j703
$$ 217445 218457 220888 224597 229561 234873 238219 237965 235476 233773 233969 234512 233925 232511 231005 229302
51041B29302j956j555r62j196j781j310J64J265J668K200K602J511r38k501j679
$$ 229302 227346 225791 224829 223633 221852 220542 220706 221971 223639 225839 228441 229952 229014 226513 224834
51026B24834M10J724J510L06r67j319k87J163J407K00j043j318j215j555k002
$$ 224834 225244 226968 228478 228784 227817 226498 226211 227374 228781 228981 227938 226620 225405 223850 221848
51011B21848j683m21J241K573K951K259J199O25N33L63R7J31K94R3k15O6O85O16
$$ 221848 220165 219744 220985 223558 226509 228768 229967 230592 231125 231488 231585 231716 232010 232103 231888 231954 232639 233255
50993B33255l48j352j828j955j682n57J203K575K859K236J242N95J089K572L464
$$ 233255 232907 231555 229727 227772 226090 225533 226736 229311 232170 234406 235648 236243 237332 239904 243368
50978B43368K699J560J983L578M409M273M716N738N346L036J122J355K487K558
$$ 243368 246067 247627 249610 253188 257597 261870 266586 272324 277670 280706 281828 283183 285670 288228
50964B88228J694J094R72J001J351J942J898J087Q48J946L078K782J610J051J391
$$ 288228 289922 291016 291988 292989 294340 296282 298180 299267 300115 302061 305139 307921 309531 310582 311973
50949C11973J985K500K651J958J078J939M919P257O347L548K492M294O705P703
$$ 311973 313958 316458 319109 321067 322145 324084 329003 336260 342607 346155 348647 352941 359646 367349
50935C67349P611P526P749Q408R977J2379J4530J5449J5219J4620J4415J5036
$$ 367349 374960 382486 390235 398643 408620 420999 435529 450978 466197 480817 495232 510268
50923E10268J6429J8106J9701K1266K2707K3494K3578K4006K5869K9147L3229
$$ 510268 526697 544803 564504 585770 608477 631971 655549 679555 705424 734571 767800
50912G67800L7801M2351M5720M7483M9180N2686N7767O2693O6923P1407P6244
$$ 767800 805601 847952 893672 941155 990335 1043021 1100788 1163481 1230404 1301811 1378055
50901A378055Q0016Q2097Q3994Q7171R0710R2338R1310Q8954Q6392Q2828P6602
$$ 1378055 1458071 1540168 1624162 1711333 1802043 1894381 1985691 2074645 2161037 2243865 2320467
50890B320467O7393N6650M5854L5146K4013J2704J945q378j9063k9896l9369m6516
$$ 2320467 2387860 2444510 2490364 2525510 2549523 2562227 2564172 2555794 2536731 2506835 2467466 2420950
50878B420950n1974n6541n9794o1072o0898o0255n9158n7138n4617n2630n1463
$$ 2420950 2368976 2312435 2252641 2191569 2130671 2070416 2011258 1954120 1899503 1846873 1795410
50867A795410n0594m9726m8892m7843m6466m5485m5730m6824m7580m7551m7217
$$ 1795410 1744816 1695090 1646198 1598355 1551889 1506404 1460674 1413850 1366270 1318719 1271502
50856A271502m6817m6049m4868m3588m2099l9937l7118l4218l1601k9289k7282
$$ 1271502 1224685 1178636 1133768 1090180 1048081 1008144 971026 936808 905207 875918 848636
50845H48636k5252k2357j8431j4995j3711j4003j3623j1494q580n803k972k77
$$ 848636 823384 801027 782596 767601 753890 739887 726264 714770 706190 700387 697415 697138
50833F97138R24Rj425j194R92L694N647O657P115P640Q892J0883J2679J3411J3330
$$ 697138 698062 698071 696646 695452 696444 700138 705785 712442 719557 727197 736089 746972 759651 773062 786392
50818G86392J3325J3708J4130J4487J5273J6991J9577K2345K4320K4971K4986
$$ 786392 799717 813425 827555 842042 857315 874306 893883 916228 940548 965519 990505
50807I90505K5993K8982L3220L7064L9647M1339M2965M5211M8634N3464N9247
$$ 990505 1016498 1045480 1078700 1115764 1155411 1196750 1239715 1284926 1333560 1387024 1446271
50796A446271O5232P1224P7668Q4775R2175R9726J08055J17815J28712J39817
$$ 1446271 1511503 1582727 1660395 1745170 1837345 1937071 2045126 2162941 2291653 2431470
50786B431470J50676J61494J72198J82060J90482J97663K03952K08875K11198
$$ 2431470 2582146 2743640 2915838 3097898 3288380 3486043 3689995 3898870 4110068
50777D110068K09758K03819J92835J76509J55115J29419J00361O9170L7545P012
$$ 4110068 4319826 4523645 4716480 4892989 5048104 5177523 5277884 5347054 5384599 5391611
50767E391611k1945m9436p4977r7418j16030j30636j40576j44839j43914j40381
$$ 5391611 5369666 5320230 5245253 5147835 5031805 4901169 4760593 4615754 4471840 4331459
50757D331459j36496j31998j25434j17139j09557j04622j01984j00060r8028r6456
$$ 4331459 4194963 4062965 3937531 3820392 3710835 3606213 3504229 3404169 3306141 3209685
50747C209685r6487r8620j02040j05141j06918j07561j07471j06358j03937j00844
$$ 3209685 3113198 3014578 2912538 2807397 2700479 2592918 2485447 2379089 2275152 2174308
50737B174308r7914r4931r1069q6184q0648p4331o7082n9960n4507n0663m6882
$$ 2174308 2076394 1981463 1890394 1804210 1723562 1649231 1582149 1522189 1467682 1417019 1370137
50726A370137m2436l8042l3917k9162k3897k0045j8645j7950j5917j3199j1613
$$ 1370137 1327701 1289659 1255742 1226580 1202683 1182638 1163993 1146043 1130126 1116927 1105314
50715A105314j0767q817o158n497p637r727q996o306m224l124j401J165K539J346
$$ 1105314 1094547 1085730 1079572 1074075 1066438 1056711 1047715 1041409 1037185 1034061 1032660 1033825 1036364 1037710
50701A037710j060k122p06K402N659P713P975P198P211R277J2715J5814J7931
$$ 1037710 1036650 1034528 1033822 1036224 1041883 1049596 1057571 1064769 1071980 1081257 1093972 1109786 1127717
50688A127717J9939K2571K5185K6833K7949L0030L3712L7984M1703M5228M9764
$$ 1127717 1147656 1170227 1195412 1222245 1250194 1280224 1313936 1351920 1393623 1438851 1488615
50677A488615N5332O0388O3859O6849P1459P8303Q6016R3310J00245J07051J12748
$$ 1488615 1543947 1604335 1668194 1735043 1806502 1884805 1970821 2064131 2164376 2271427 2384175
50666B384175J16275J18374J20799J23455J23792J19897J12979J05547R7795Q7513
$$ 2384175 2500450 2618824 2739623 2863078 2986870 3106767 3219746 3325293 3423088 3510601
50656C510601P3455N7024L9883K1519P10k1420m1765n8650p3112q6156r6353j01499
$$ 3510601 3584056 3641080 3680963 3702482 3703192 3681772 3640007 3581357 3508245 3422089 3325736 3224237
50644C224237j01698r9147r5352r0161q3582p6945p1582o7523o4140o1143n8408
$$ 3224237 3122539 3023392 2928040 2837879 2754297 2677352 2605770 2538247 2474107 2412964 2354556
50633B354556n5868n4340n5338n9009o3067o5096o5232o5201o5237o3714n9852
$$ 2354556 2298688 2244348 2189010 2130001 2066934 2001838 1936606 1871405 1806168 1742454 1682602
50622A682602n5168n1572m9162m6554m2578l7121l1047k5838k2777k1751k1116
$$ 1682602 1627434 1575862 1526700 1480146 1437568 1400447 1369400 1343562 1320785 1299034 1277918
50611A277918j8984j4675r077l981p70R08K910O379J0098J2092J2585J3826J6846
$$ 1277918 1258934 1244259 1235182 1231201 1230431 1231339 1234249 1240628 1250726 1262818 1275403 1289229 1306075
50598A306075K0058K1799K2730K4542K7435L0118L1743L2684L3829L6082M0014
$$ 1306075 1326133 1347932 1370662 1395204 1422639 1452757 1484500 1517184 1551013 1587095 1627109
50587A627109M4993M9096N1032N1990N4545N9666O5867P1295P5707P9967Q4388
$$ 1627109 1672102 1721198 1772230 1824220 1878765 1938431 2004298 2075593 2151300 2231267 2315655
50576B315655Q8183R0373R0861R0617R0767R1350R1064Q8448Q3324P6771O9740
$$ 2315655 2403838 2494211 2585072 2675689 2766456 2857806 2948870 3037318 3120642 3197413 3267153
50565C267153O1996N2722M1979L1115K1360J2332K612p886j7108k3045k6123k8291
$$ 3267153 3329149 3381871 3423850 3454965 3476325 3488657 3491269 3483383 3466275 3443230 3417107 3388816
50553C388816l0011k9572k5670j9623j4285j1341j0106q651n867k611q00j176
$$ 3388816 3358805 3329233 3303563 3283940 3269655 3258314 3248208 3239557 3233690 3231079 3230279 3229103
50541C229103k470l406m829q674j5468k4336l5027m7754o0860p1029p6782q0044
$$ 3229103 3226633 3223227 3218398 3209724 3194256 3169920 3134893 3087139 3026279 2955250 2878468 2798424
50529B798424q3218q6300q7948q7690q5771q2292p8053p4956p3874p3090p0317
$$ 2798424 2715206 2628906 2540958 2453268 2367497 2285205 2207152 2132196 2058322 1985232 1914915
50518A914915o5350n9377n2943m6329m0877l7675l5378l1379k5126j8720j4188
$$ 1914915 1849565 1790188 1737245 1690916 1650039 1612364 1576986 1545607 1520481 1501761 1487573
50507A487573j1579r531o523j816L724P998R937J0910J2955J6412K0444K4685
$$ 1487573 1475994 1466463 1459940 1458124 1461848 1469846 1479783 1490693 1503648 1520060 1540504 1565189
50495A565189K8713L1116L1230L1031L2941L6293L8423L8926M0074M2967M5959
$$ 1565189 1593902 1625018 1656248 1687279 1720220 1756513 1794936 1833862 1873936 1916903 1962862
50484A962862M7514M8141M8655M8818M8632M8978N0045N0963N1941N4864O0565
$$ 1962862 2010376 2058517 2107172 2155990 2204622 2253600 2303645 2354608 2406549 2461413 2521978
50473B521978O7255P2898P7680Q2869Q8777R5269J03027J12769J23889J34998
$$ 2521978 2589233 2662131 2739811 2822680 2911457 3006726 3109753 3222522 3346411 3481409
50463C481409J45178J53892J60691J65831J70258J74164J76451J76326J74135
$$ 3481409 3626587 3780479 3941170 4107001 4277259 4451423 4627874 4804200 4978335
50454D978335J69712J61343J47778J30296J11295R1528O9956M5834J9643p516
$$ 4978335 5148047 5309390 5457168 5587464 5698759 5790287 5860243 5906077 5925720 5918204
50444E918204l4363n9486q1874j01264j17406j29540j37079j40174j39046j33528
$$ 5918204 5883841 5824355 5742481 5641217 5523811 5394271 5257192 5117018 4977972 4844444
50434D844444j23854j11166r6476q0062o2370m4606k7723j1829K593J4077K1504
$$ 4844444 4720590 4609424 4512948 4432886 4370516 4325910 4298187 4286358 4288951 4303028 4324532
50423D324532K4807K3384J5449M42j9247m0602o2653q5045j05368j20720j31224
$$ 4324532 4349339 4372723 4388172 4388614 4369367 4328765 4266112 4181067 4075699 3954979 3823755
50412C823755j39334j45764j48786j47779j44839j41858j38208j32561j25093
$$ 3823755 3684421 3538657 3389871 3242092 3097253 2955395 2817187 2684626 2559533
50403B559533j16687j07447r7535q8247q0675p3956o6298n7403m8717m1532l5878
$$ 2559533 2442846 2335399 2237864 2149617 2068942 1994986 1928688 1871285 1822568 1781036 1745158
50392A745158l1105k6552k1573j5754r403l377J753O058R839J3138J5793J7776
$$ 1745158 1714053 1687501 1665928 1650174 1640771 1637394 1639147 1645205 1655044 1668182 1683975 1701751
50380A701751J9339K0949K2912K5106K7243K9409L2027L4960L7157L7654L6868
$$ 1701751 1721090 1742039 1764951 1790057 1817300 1846709 1878736 1913696 1950853 1988507 2025375
50369B025375L6185L6206L5890L3944L0609K7476K5548K4236K2499K0375J8800
$$ 2025375 2061560 2097766 2133656 2167600 2198209 2225685 2251233 2275469 2297968 2318343 2337143
50358B337143J8225J8173J8045J7862J8068J9225K1853K6097L1276L6359M1076
$$ 2337143 2355368 2373541 2391586 2409448 2427516 2446741 2468594 2494691 2525967 2562326 2603402
50347B603402M6091N1869N7921O3366O7683P0490P1392P0662O9470O8547O6860
$$ 2603402 2649493 2701362 2759283 2822649 2890332 2960822 3032214 3102876 3172346 3240893 3307753
50336C307753O2530N4936M5160L4308K2432R330m487j8309l2177m6476o0758p3669
$$ 3307753 3370283 3425219 3470379 3504687 3527119 3536449 3531962 3513653 3481476 3435000 3374242 3300573
50324C300573q4169r2211r8012j01178j00972r7195r0335q1190p0848o0713n1628
$$ 3300573 3216404 3124193 3026181 2925003 2824031 2726836 2636501 2555311 2484463 2423750 2372122
50313B372122m2879l2952k1636j0599j515N475J0712J3467J2595Q269J790o006
$$ 2372122 2329243 2296291 2274655 2264056 2262541 2268016 2278728 2292195 2304790 2313059 2314849 2308843
50301B308843j5031k4780l4215m2788n0367n6158n9097n9677o0007o1330o2484
$$ 2308843 2293812 2269032 2234817 2192029 2141662 2085504 2026407 1966730 1906723 1845393 1782909
50290A782909o1475n7729n2343m7083m3605m2521m2425m0809l6701l1571k6992
$$ 1782909 1721434 1663705 1611362 1564279 1520674 1478153 1435728 1394919 1358218 1326647 1299655
50279A299655k2746j8342j5003j4284j5279j5174j2613q877n560k636M79L237
$$ 1299655 1276909 1258567 1243564 1229280 1214001 1198827 1186214 1177337 1171777 1169141 1169620 1172857
50267A172857M479M252M188N955R656J3705J6187J6484J5723J5711J7381K0126
$$ 1172857 1177336 1181588 1185776 1191731 1201387 1215092 1231279 1247763 1263486 1279197 1296578 1316704
50255A316704K2322K2540K0653J8036J6384J6075J5969J5005J3524J2648J2689
$$ 1316704 1339026 1361566 1382219 1400255 1416639 1432714 1448683 1463688 1477212 1489860 1502549
50244A502549J2731J1675R293O196L161O50j177k319l116m383o736r540j1279
$$ 1502549 1515280 1526955 1536248 1542444 1545605 1546255 1545078 1542759 1539643 1535260 1528524 1518984 1507705
50231A507705j1415j1206j1816j2570j2379j2100j3483j6042j7296j6572j6152
$$ 1507705 1496290 1485084 1473268 1460698 1448319 1436219 1422736 1406694 1389398 1372826 1356674
50220A356674j7569j9111j8669j7221j7159j8481j9095j8259j7306j7091j7017
$$ 1356674 1339105 1319994 1301325 1284104 1266945 1248464 1229369 1211110 1193804 1176713 1159696
50209A159696j6883j7600j9321k0537j9996j8325j6769j5342j3271j0770r180
$$ 1159696 1142813 1125213 1105892 1085355 1065359 1047034 1030265 1014923 1001652 990882 981702
50198I81702r273j0080r799p808n488m683n497o204n562m333l945m384m449l668
$$ 981702 972429 962349 952550 944742 939254 934571 929074 922870 917308 912975 909030 904646 900197 896529
50184H96529k868k837l369l721l349k133m95O80P23j95j508k961m397n203m870
$$ 896529 893661 890824 887455 883734 880385 878252 877757 878437 879160 878965 877457 874496 870099 864896 860026
50169H60026l989l768m527n327n231m330l385k964k987k842j971n97L51L33j80
$$ 860026 856037 852269 847742 842415 837184 832854 829469 826505 823518 820676 818705 818108 818459 818792 818612
50154H18612n11p02j064j333j024k20O31J362J824J591O40k15m65q78k218l664
$$ 818612 818101 817399 816335 815002 813978 813758 814389 815751 817575 819166 819806 819591 819126 818248 816030 812366
50138H12366l868l161l115m109m922m875m651m602l865j973qO90J04r10j700j772
$$ 812366 808498 805337 802222 798113 793191 788316 783665 779063 775198 773225 773217 773907 774011 773101 771401 769629
50122G69629o25J375K661J957k52k399l652m261m541m356l628k604j562o88l84
$$ 769629 769004 770379 773040 774997 774745 772346 768694 764433 759892 755536 751908 749304 747742 747054 746670
50107G46670j178k951m560m761l693l020m090o170p196o279m702m103m589n284
$$ 746670 745492 742541 737981 733220 729527 726507 722417 716247 709051 702772 698070 693967 689378 684094
50093F84094n917o814p768q024p424o630o173n854n261m316l348k870l084l287
$$ 684094 678177 671363 663595 655571 648147 641517 635344 629490 624229 619913 616565 613695 610611 607324
50079F07324k266R4K186K370Q64q02j588j289K23K763N135O106O010O169O827
$$ 607324 605058 605152 607338 609708 610572 609770 608182 606893 607116 609879 615014 621120 627130 633299 640126
50064F40126O923N987M912M638N219O491Q486J0793J2447J2913J2513J1786J1187
$$ 640126 647049 653036 657948 662586 667805 674296 682782 693575 706022 718935 731448 743234 754421
50051G54421J1374J2711J4446J5313J5019J4161J2964J1316R961R940J0646J0088
$$ 754421 765795 778506 792952 808265 823284 837445 850409 861725 871686 881626 892272 902360
50039I02360P655N080L995L966L647K632J342K76J12J344L010L102J212l96N13
$$ 902360 910015 915095 919090 923056 926703 929335 930677 930953 931065 932409 935419 938521 939733 939337 939850
50024I39850L331N675O308N812N112M627M529M785N191N968P797J0602J3122J4386
$$ 939850 943181 948856 955164 960976 966088 970715 975244 980029 985220 991188 998985 1009587 1022709 1037095
50010A037095J4924J5707J6775J7823J9224K1052K1878K0191J6846J4612J5067
$$ 1037095 1052019 1067726 1084501 1102324 1121548 1142600 1164478 1184669 1201515 1216127 1231194
49999A231194J7056J8444J8416J7595J6661J5482J3468J0540P529N391M104K845
$$ 1231194 1248250 1266694 1285110 1302705 1319366 1334848 1348316 1358856 1366385 1371776 1375880 1378725
49987A378725J328J80l24j065k867n144o593o954p290q641j1023j3739j6201j8300
$$ 1378725 1380053 1380233 1379909 1378844 1375977 1370833 1364240 1357286 1349996 1341355 1330332 1316593 1300392 1282092
49973A282092k0050k0944k0068j7464j5011j4784j6330j6908j4915j1980j0738
$$ 1282092 1262042 1241098 1221030 1203566 1188555 1173771 1157441 1140533 1125618 1113638 1102900
49962A102900j1480j2148j1071q715o863o767p956q658p630n665m482m222l315
$$ 1102900 1091420 1079272 1068201 1059486 1052623 1045856 1037900 1029242 1021612 1015947 1011465 1007243 1003928
49949A003928j223K32o64k971m271l613k040r41r37j805k473j736J55J335O96
$$ 1003928 1002705 1002937 1002273 999302 995031 991418 989378 988437 987500 985695 983222 981486 981641 982976 983672
49934I83672n71q55l88j89J79J821M228N790O246O557O513M672J028k272l597
$$ 983672 983101 982246 981858 981669 981848 983669 987897 993687 999933 1006490 1013003 1017675 1018703 1016431 1012834
49919A012834l610l618l604k792j159N82J861K459K275J355j85k384n161q050
$$ 1012834 1009224 1005606 1002002 999210 998051 998633 1000494 1002953 1005228 1006583 1006398 1004014 998853 990803
49905I90803j0726j3509j6579j9053j9950j9679j9392j9209j8505j7713j7987
$$ 990803 980077 966568 949989 930936 910986 891307 871915 852706 834201 816488 798501
49894G98501j9004j9096j7972j7234j7368j6366j2893r098q097r663j0633r229
$$ 798501 779497 760401 742429 725195 707827 691461 678568 669470 661373 651710 641077 631848
49882F31848o957n956o252o429n753m606l390k005m18R66J689J767J591J521J782
$$ 631848 624891 618935 612683 606254 600501 595895 592505 590500 590082 591048 592737 594504 596095 597616 599398
49867E99398K520L480L825L000J913K255M047M956L196K81o08J241L298L264J700
$$ 599398 601918 605398 609223 612223 614136 616391 620438 625394 628590 628871 628263 629504 632802 636066 637766
49852F37766O40R82K168L317L721K926J267j99q55j106j292r08L34J513J492M89
$$ 637766 638406 639388 641556 644873 648594 651520 652787 652588 651733 650627 649335 648427 648761 650274 651766 652255
49836F52255l16k11P69K415M098M487K881P43N81L054O129P585P428P354Q622
$$ 652255 651939 651728 652497 654912 659010 663497 666378 667121 667702 670756 676885 684470 691898 699252 707874
49821G07874J1103J3937J6268J7533J7706J7490J7820J8945K0107K0382J9711
$$ 707874 718977 732914 749182 766715 784421 801911 819731 838676 858783 879165 898876
49810H98876J8990J9156K0302K1656K2180K1174J8725J5841J3906J3521J4006
$$ 898876 917866 937022 957324 978980 1001160 1022334 1041059 1056900 1070806 1084327 1098333
49799A098333J4368J4625J5475J6818J7273J5544J1777P258L174q3k893o084j0246
$$ 1098333 1112701 1127326 1142801 1159619 1176892 1192436 1204213 1211471 1214645 1214562 1211669 1205585 1195339
$$ [...]
##END NTUPLES=NMR SPECTRUM
##END=
